##TITLE=Analysis number 323255
Compound Code cc 43396
Book Reference 483/62/1
Project Code adrs
Chemist Name mattw
+D2O
##JCAMPDX= 6.0         $$ Bruker NMR JCAMP-DX V2.0
##DATA TYPE= NMR SPECTRUM
##DATA CLASS= NTUPLES
##ORIGIN= Bruker BioSpin GmbH
##OWNER= nmr
$$ XWIN-NMR		Version 3.5
$$ Thu Oct 19 15:47:00 2006 GMT Daylight Time (UT+1h)  MAYBRIDGE\nmr@NMR_250MHZ
##.OBSERVE FREQUENCY= 250.131544655141
##.OBSERVE NUCLEUS= ^1H
##.ACQUISITION MODE= SIMULTANEOUS (DQD)
##.ACQUISITION SCHEME= undefined
##.AVERAGES= 16
##.DIGITISER RES= 18
##SPECTROMETER/DATA SYSTEM= dpx250
##.PULSE SEQUENCE= zg30
##.SOLVENT NAME= DMSO
##.SHIFT REFERENCE= (INTERNAL, DMSO, 0, 16.522)
##AUDIT TRAIL= $$ (NUMBER, WHEN, WHO, WHERE, WHAT)
$$ ##TITLE= Audit trail, XWIN-NMR		Version 3.5
$$ ##JCAMPDX= 5.01
$$ ##ORIGIN= Bruker BioSpin GmbH
$$ ##OWNER= nmr
$$ C:\u/data/dgb/nmr/ADRS/960/pdata/1/auditp.txt
$$ ##AUDIT TRAIL=  $$ (NUMBER, WHEN, WHO, WHERE, WHAT)
(   1,<2006-10-19 15:46:35.28 +100>,<MAYBRIDGE\nmr>,<NMR_250MHZ>,
      <created by zg, POWCHK disabled, PULCHK disabled
       configuration hash MD5:
       49 4B E0 1D 92 C2 6B 37 9F E6 65 BC 52 41 86 1D
       data hash MD5: 64K
       D6 44 13 48 92 41 0B 3B 04 63 4D F2 E4 10 23 69>)
(   2,<2006-10-19 15:46:50.42 +100>,<MAYBRIDGE\nmr>,<NMR_250MHZ>,
      <Start of raw data processing
       ef LB = 0.3 FT_mod = 6 PKNL = 1 SI = 32K 
       data hash MD5: 32K
       58 50 C3 81 8F A3 19 8A DA 85 D2 2E 10 44 84 6C>)
(   3,<2006-10-19 15:46:52.14 +100>,<MAYBRIDGE\nmr>,<NMR_250MHZ>,
      <apk 
       data hash MD5: 32K
       AD 4A 21 D5 A9 B0 E2 3B 65 A5 29 89 9A 7A 0D D0>)
(   4,<2006-10-19 15:46:52.89 +100>,<MAYBRIDGE\nmr>,<NMR_250MHZ>,
      <abs ABSG = 5 
       data hash MD5: 32K
       EC A0 A8 54 1B 08 FC A4 14 9E A6 FA 88 F9 E5 CD>)
$$ ##END=
$$ 
$$ hash MD5
$$ 1D 55 DD AB 69 33 1B E0 88 A1 13 F2 71 99 34 BE
##$RELAX= 
##$RELAX= 
##$RELAX= 
##$RELAX= 
##$RELAX= 
##$RELAX= 
##$RELAX= 
$$ Bruker specific parameters
$$ --------------------------
##$DU= <C:\u>
##$EXPNO= 960
##$NAME= <ADRS>
##$PROCNO= 1
##$TYPE= <nmr>
##$USER= <dgb>
##$AMP= (0..31)
100 100 100 100 100 100 100 100 100 100 100 100 100 100 100 100 100 100 
100 100 100 100 100 100 100 100 100 100 100 100 100 100 
##$AQSEQ= 0
##$AQ_mod= 3
##$AUNM= <au_zg>
##$AUTOPOS= <53 >
##$BF1= 250.13
##$BF2= 250.13
##$BF3= 250.13
##$BF4= 250.13
##$BF5= 500.13
##$BF6= 500.13
##$BF7= 500.13
##$BF8= 500.13
##$BYTORDA= 1
##$CFDGTYP= 0
##$CFRGTYP= 5
##$CHEMSTR= <none>
##$CNST= (0..31)
1 1 145 1 1 1 1 1 1 1 1 1 1 1 1 1 1 1 1 1 1 1 1 1 1 1 1 1 1 1 1 1 
##$CPDPRG= <>
##$CPDPRG1= <>
##$CPDPRG2= <>
##$CPDPRG3= <>
##$CPDPRG4= <mlev>
##$CPDPRG5= <mlev>
##$CPDPRG6= <mlev>
##$CPDPRG7= <mlev>
##$CPDPRG8= <mlev>
##$CPDPRGB= <>
##$CPDPRGT= <>
##$D= (0..31)
0 1 0 0 0 0 0 0 0 0.06 0 0 0 0 0 0 0.0002 0 0 0 0 0 0 0 0 0 0 0 0 0 0 
0 
##$DATE= 1161269194
##$DBL= (0..7)
120 120 120 120 120 120 120 120 
##$DBP= (0..7)
150 150 150 150 150 150 150 150 
##$DBP07= 0
##$DBPNAM0= <>
##$DBPNAM1= <>
$$ [...]
##$SUBNAM7= <"">
##$SUBNAM8= <"">
##$SUBNAM9= <"">
##$SW= 20.6930455092707
##$SWIBOX= (0..15)
0 0 3 0 0 0 0 0 0 0 0 0 0 0 0 0 
##$SW_h= 5175.983436853
##$TD= 65536
##$TD0= 1
##$TE= 683.16
##$TE2= 300
##$TE3= 300
##$TEG= 300
##$TL= (0..7)
0 120 120 120 120 120 120 120 
##$TP= (0..7)
150 150 150 150 150 150 150 150 
##$TP07= 0
##$TPNAME0= <>
##$TPNAME1= <>
##$TPNAME2= <>
##$TPNAME3= <>
##$TPNAME4= <>
##$TPNAME5= <>
##$TPNAME6= <>
##$TPNAME7= <>
##$TPOAL= (0..7)
0.5 0.5 0.5 0.5 0.5 0.5 0.5 0.5 
##$TPOFFS= (0..7)
0 0 0 0 0 0 0 0 
##$TUNHIN= 0
##$TUNHOUT= 0
##$TUNXOUT= 0
##$USERA1= <user>
##$USERA2= <user>
##$USERA3= <user>
##$USERA4= <user>
##$USERA5= <user>
##$V9= 5
##$VALIST= <valist>
##$VCLIST= <CCCCCCCCCCCCCCC>
##$VD= 0
##$VDLIST= <DDDDDDDDDDDDDDD>
##$VPLIST= <PPPPPPPPPPPPPPP>
##$VTLIST= <TTTTTTTTTTTTTTT>
##$WBST= 1024
##$WBSW= 4
##$XGAIN= (0..3)
0 0 0 0 
##$XL= 0
##$YL= 0
##$YMAX_a= 381718
##$YMIN_a= -323883
##$ZGOPTNS= <>
##$ZL1= 120
##$ZL2= 120
##$ZL3= 120
##$ZL4= 120
##$ABSF1= 16.522
##$ABSF2= -4.171173
##$ABSG= 5
##$ABSL= 3
##$ALPHA= 0
##$AQORDER= 0
##$ASSFAC= 0
##$ASSFACI= 0
##$ASSFACX= 0
##$ASSWID= 0
##$AUNMP= <proc_1d>
##$AZFE= 0.1
##$AZFW= 0.1
##$BCFW= 0
##$BC_mod= 0
##$BYTORDP= 0
##$COROFFS= 0
##$CY= 12.5
##$DATMOD= 1
##$DC= 0
##$DFILT= <>
##$DTYPP= 0
##$F1P= 14.0000005364418
##$F2P= -0.99999901652339
##$FCOR= 0.5
##$FTSIZE= 32768
##$FT_mod= 6
##$GAMMA= 0
##$GB= 0
##$INTBC= 1
##$INTSCL= 1
##$ISEN= 128
##$LB= 0.3
##$LEV0= 0
##$LPBIN= 0
##$MAXI= 10000
##$MC2= 0
##$MEAN= 0
##$ME_mod= 0
##$MI= 0
##$NCOEF= 0
##$NC_proc= -4
##$NLEV= 6
##$NOISF1= 0
##$NOISF2= 0
##$NSP= 0
##$NTH_PI= 0
##$NZP= 0
##$OFFSET= 16.522
##$PC= 1
##$PHC0= -53.77458
##$PHC1= 8.536536
##$PH_mod= 1
##$PKNL= yes
##$PPARMOD= 0
##$PSCAL= 4
##$PSIGN= 0
##$REVERSE= no
##$SF= 250.13
##$SI= 32768
##$SIGF1= 0
##$SIGF2= 0
##$SINO= 400
##$SIOLD= 32768
##$SREGLST= <1H.DMSO>
##$SSB= 0
##$STSI= 32768
##$STSR= 0
##$SW_p= 5175.98343685301
##$SYMM= 0
##$S_DEV= 0
##$TDeff= 65536
##$TDoff= 0
##$TI= <Analysis number 999999
Compound Code 99
Book Reference 9
Project Code 9>
##$TILT= no
##$TM1= 0
##$TM2= 0
##$TOPLEV= 0
##$USERP1= <user>
##$USERP2= <user>
##$USERP3= <user>
##$USERP4= <user>
##$USERP5= <user>
##$WDW= 1
##$XDIM= 32768
##$YMAX_p= 472559230
##$YMIN_p= -339181
$$ End of Bruker specific parameters
$$ ---------------------------------
##NTUPLES= NMR SPECTRUM
##VAR_NAME=  FREQUENCY,     SPECTRUM/REAL,   SPECTRUM/IMAG
##SYMBOL=    X,             R,               I
##VAR_TYPE=  INDEPENDENT,   DEPENDENT,       DEPENDENT
##VAR_FORM=  AFFN,          ASDF,            ASDF
##VAR_DIM=   32768,         32768,           32768
##UNITS=     HZ,            ARBITRARY UNITS, ARBITRARY UNITS
##FACTOR=    0.157963299565203, 1,           1
##FIRST=     4132.6476996994, 0,             0
##LAST=      -1043.33573715361, 0,           0
##MIN=       -1043.33573715361, -339181,     0
##MAX=       4132.6476996994, 472559230,     0
$$ Real data points
##PAGE= N=1
##DATA TABLE= (X++(R..R)), XYDATA
$$ [...]
18148A123011o7114n64J00728R4071k5476r1266k2058O8764n716k992k4252L6504
$$ 1123011 1055897 1055333 1156061 1250132 1224656 1133390 1111332 1180096 1174380 1171388 1147136 1183640
18136A183640Q0430o179o6008K8214Q970N5538L0963N8838N0519k1017p1457O3051
$$ 1183640 1264070 1257891 1191883 1220097 1229067 1284605 1315568 1374406 1424925 1403908 1332451 1395502
18124A395502J50911Q128L4627J37250L1430j2967N5988K5013r46K3968J51854
$$ 1395502 1546413 1554541 1589168 1726418 1757848 1744881 1800869 1825882 1824936 1848904 2000758
18113B000758O1739K0395M4927J19231J45427O4776Q3857O1490K14358P7275J12051
$$ 2000758 2062497 2082892 2127819 2247050 2392477 2457253 2541110 2602600 2816958 2894233 3006284
18102C006284J71641K11592K03389K86305L50195M28046N20658M11051N31116
$$ 3006284 3177925 3389517 3592906 3879211 4229406 4657452 5178110 5589161 6120277
18093F120277P85369R74515J139594J229569J639560K155573K388601K354611
$$ 6120277 6905646 7880161 9019755 10249324 11888884 14044457 16433058 18787669
18085A8787669K318932K388240K474892K573730K304725J804028J107482P95932
$$ 18787669 21106601 23494841 25969733 28543463 30848188 32652216 33759698 34555630
18077C4555630R69006J217591J315556J116896M07218n97906j504056k204049
$$ 34555630 35524636 36742227 38057783 39174679 39581897 38983991 37479935 35275886
18069C5275886k749422k722345k288148j635622j242689j267791j654435k534746
$$ 35275886 32526464 29804119 27515971 25880349 24637660 23369869 21715434 19180688
18061A9180688k908008k750497k268770j736231j407847j085826q09207n97316
$$ 19180688 16272680 13522183 11253413 9517182 8109335 7023509 6214302 5616986
18053E616986n02337m37947l45391k85678k65751k37267k49416k82226j75079
$$ 5616986 5114649 4676702 4331311 4045633 3779882 3542615 3293199 3010973 2835894
18044B835894j22406k26984j85953q1477j49096p2160j0318j38685r4039k6037
$$ 2835894 2713488 2486504 2300551 2219074 2069978 1997818 1987500 1848815 1754776 1728739
18034A728739j13090j29740k8706p2940o4333L2352O2691n4634l4635j179m3401
$$ 1728739 1615649 1485909 1457203 1384263 1319930 1352282 1414973 1360339 1325704 1324525 1281124
18023A281124K775J1643k9737O109k4371q3542k13006l4409p772m3414k2214j16915
$$ 1281124 1283899 1295542 1265805 1271914 1247543 1164001 950995 916586 908814 865400 843186 726271
18011G26271n0407J0672L3667j4664n9875j02530m2238Q5836J00919N6824j6980
$$ 726271 675864 686536 720203 705539 645664 543134 500896 586732 687651 744475 727495
18000G27495r8734p5658j7978J3543O3702K4874m6384P341N4416p5022k5966K2323
$$ 727495 628761 553103 535125 548668 612370 637244 590860 598201 652617 577595 551629 573952
17988E73952k6783n0126o4409j6745J612P3345k5186k8600r2767m4102j8293M1517
$$ 573952 547169 497043 432634 415889 417501 490846 465660 437060 344293 300191 281898 323415
17976C23415P1022k4450l8142m82K4798n7355N8500M5800j36349j5127K1712o9210
$$ 323415 394437 369987 331845 331363 356161 298806 357306 403106 266757 251630 273342 204132
17964B04132j5127J32429j3636N5213N0997p2948J4540j9005m8188N5223K0949
$$ 204132 189005 321434 307798 363011 414008 341060 355600 336595 288407 343630 364579
17953C64579k5332J2541K503P3216m3312p9423M7120L6419K0610j1117M534L4097
$$ 364579 339247 351788 354291 427507 384195 304772 351892 388311 408921 397804 402338 436435
17941D36435o1372J6529K874L6320m7510K399N0218m6602m618r7K5262j03469
$$ 436435 375063 391592 394466 430786 383276 385675 435893 389291 384673 384576 409838 306369
17929C06369o3929L4206K4362k9073L9573L7910L1199k9673r8966m6461K7925
$$ 306369 242440 276646 301008 271935 311508 349418 380617 350944 251978 205517 233442
17918B33442N7810j3424p585j8187N8186k7643k1535j9408n5846K3523J9290k329
$$ 233442 291252 277828 270243 252056 310242 282599 261064 241656 185810 209333 228623 226294
17906B26294m226K088j1835l9130M6173K481m1001M5622P7516P22K75m6290k1409
$$ 226294 222068 224156 212321 173191 219364 221845 180844 226466 303982 304704 304979 258689 237280
17893B37280L7078l608r7915k8500O9750M8357n9364l6628J01118r016m7031j28799
$$ 237280 274358 270750 172835 144335 214085 262442 203078 166450 267568 258552 211521 82722
17881H2722p6433O9111O5622k1415M077J24116k0830m3233j0527k0149k8929N0398
$$ 82722 6289 75400 141022 119607 123684 247800 226970 183737 173210 153061 124132 174530
17869A74530N0345L1062j53563j13351k2141O8620J08699Q8335N631o1528o3794
$$ 174530 224875 255937 102374 -10977 -33118 35502 144201 232536 238167 176639 112845
17858A12845J4808o009k2626N7776k9972o9522l1432P2518M7392K4248N7551j6155
$$ 112845 127653 121644 99018 156794 126822 57300 25868 98386 145778 170026 227577 211422
17846B11422n4317N0368K4030m1995j1969k6944J8197K4464J5802m1059j881j7263
$$ 211422 157105 207473 231503 189508 177539 150595 168792 193256 209058 167999 166118 148855
17834A48855J029l712q7862J1808L4685K2210J5935J04325L8362j9161K3427m0725
$$ 148855 149884 146172 58310 70118 104803 127013 142948 247273 285635 266474 289901 249176
17822B49176k1164J7891P446m5903l3311O9697R756l9219M479k3899j7977k0792
$$ 249176 228012 245903 253349 207446 174135 243832 253588 214369 218848 194949 176972 156180
17810A56180j1906N9771k62O265p4181M6964L7074M6302k7599p2848P8690K1628
$$ 156180 144274 204045 203783 210048 135867 182831 219905 266207 238608 165760 244450 266078
17798B66078j39591j7261L4001l5928J7259L4891m098m0492o211k8298N7510R4664
$$ 266078 126487 109226 143227 107299 124558 159449 155351 114859 108648 80350 137860 232524
17786B32524q737j4865O2785J50917n4781o8457J3797k1568M6603n9046j25376
$$ 232524 223787 208922 271707 422624 367843 299386 313183 291615 338218 279172 153796
17775A53796m221K3044P0763O4802N7142o8736j20839n0473q637L0303j10037
$$ 153796 149575 172619 243382 308184 365326 296590 175751 125278 116641 146944 36907
17764C6907N6384J40368l6355j0997m3183M8423j4526p0030O5347R8274l3211
$$ 36907 93291 233659 197304 186307 143124 191547 177021 106991 172338 270612 237401
17753B37401J4285l9688j3891O5374L0933j04l2320l2588N2354M1792j7832j3986
$$ 237401 251686 211998 198107 263481 294414 294310 261990 229402 281756 323548 305716 291730
17741B91730j3416q3521P7O2029l5496n6038K4237J6023n7118k3518q1737k9135
$$ 291730 278314 194793 194870 256899 221403 165365 189602 205625 148507 124989 43252 14117
17729A4117m2445M1889M7041L0611K333K6114m884l083J58236k9440q5263l3029
$$ 14117 -28328 13561 60602 91213 93546 119660 114776 111693 269929 240489 155226 122197
17717A22197l448l8872r7949k8696O8132l6823L9195m4832q7255m0702J0841Q2833
$$ 122197 118749 79877 -18072 -46768 21364 -15459 23736 -21096 -108351 -149053 -138212 -55379
17705e5379J33884J63226l5880j24467j0982J6693K2603p6564J4056M1571l1561
$$ -55379 78505 241731 205851 81384 70402 87095 109698 33134 47190 88761 57200
17694E7200o1566j6078K1710l8070j4969J2336k2775m542J14373P533m136p6556
$$ 57200 -4366 -20444 1266 -36804 -51773 -39437 -62212 -66754 47619 55152 51016 -25540
17682b5540q1589M7820j1163R9792M4384m3987k8994k6882m4119O8801Q3077J5388
$$ -25540 -107129 -59309 -70472 29320 73704 29717 723 -26159 -70278 -1477 81600 96988
17670I6988j4484L444N5825n3101Q643J7010k5296J3467k9925l859n888j3335
$$ 96988 82504 85948 141773 88672 97315 114325 89029 102496 72571 68712 62824 49489
17658D9489M2711Q5284J5476m3156Q19p9049j02247n5047L0814m4049j5742P2268
$$ 49489 92200 177484 192960 149804 150623 71574 -30673 -85720 -54906 -98955 -114697 -42429
17646d2429K2687M426k5646L0230K7371N5589k5443q2208r0196N742P0607N2889
$$ -42429 -19742 -15316 -40962 -10732 16639 72228 46785 -35423 -125619 -119877 -49270 3619
17634C619o4216K6376k7664M4484J1776q8221j4890O4049p4015l2701k5994N1630
$$ 3619 -60597 -34221 -61885 -17401 -5625 -93846 -108736 -44687 -118702 -151403 -177397 -125767
17622a25767J05173L4504n5806o8378R1105M8662n2343o4523q0168L5147m868
$$ -125767 -20594 13910 -41896 -110274 -19169 29493 -22850 -87373 -167541 -132394 -137262
17611a37262M1642M3681O113L3454J12491k9526J9668p6762o0924l3342J6523
$$ -137262 -95620 -51939 -45826 -12372 100119 70593 90261 13499 -47425 -80767 -64244
17600f4244J0892k3064l2847o6151q4311J5536Q0144N7884J2552Q6255J080l4342
$$ -64244 -53352 -76416 -109263 -175414 -259725 -244189 -164045 -106161 -93609 -7354 -6274 -40616
17588d0616k4374j4286m5379L6016P102p54k7672m6519N6519J5433M0464r057
$$ -40616 -64990 -79276 -124655 -88639 -81537 -82291 -109963 -156482 -99963 -84530 -44066 -53123
17576e3123L9674N7573n5201q1753O1178k685o2298j1740M5444M7354O8719J9519
$$ -53123 -13449 44124 -11077 -92830 -31652 -34337 -96635 -108375 -62931 -15577 53142 72661
17564G2661N982M7780N9733j21743j3678J9777l813K1254k5930j12727j0477k6733
$$ 72661 78643 126423 186156 64413 50735 70512 66699 87953 62023 -50704 -61181 -87914
17552h7914M66L3883P2965L6769l8754q249n7995L4852J0920N6043j00489r2800
$$ -87914 -87448 -53565 19400 56169 17415 9166 -48829 -13977 -3057 52986 -47503 -140303
17540a40303O3232Q9396N6919N770o9013j11603L0875j1911k7680J0213q7646
$$ -140303 -77071 12325 69244 75014 6001 -105602 -74727 -86638 -114318 -104105 -191751
17529a91751k9715P1730N8163m5014l334P014j2514k220q670m604K6505P7886
$$ -191751 -221466 -149736 -91573 -136587 -139921 -132907 -145421 -147641 -156311 -160915 -134410 -56524
17517e6524M355o5487J27501P5833k0159p4319l6335J47267n6922j36329k1786
$$ -56524 -52169 -117656 9845 85678 65519 -8800 -45135 102132 45210 -91119 -112905
17506a12905Q4182N5392n1013O333k0991m1212j3594n8257J9963J09907J8120
$$ -112905 -28723 26669 -24344 -18011 -39002 -80214 -93808 -152065 -132102 -22195 -4075
17495d075M184J1587L979n8005N905J3041o281q937p0407l0500R3465K4425o2103
$$ -4075 109 11696 15675 -42330 -36425 -23384 -29665 -38602 -109009 -139509 -46044 -21619 -83722
17482h3722L8431O9462L3910M2012k0979j20195p6918O4214N3989l7122O4410
$$ -83722 -45291 24171 58081 100093 79114 -41081 -117999 -53785 204 -36918 27492
17471B7492k714K6856j981m4108O7524q342O610L4719M5830j3154L2784k2225
$$ 27492 24778 51634 49653 5545 73069 64727 71337 106056 151886 138732 171516 149291
17459A49291j2019n595L6454L1855L6435J27796Q555n9129p0678j20041O134N2275
$$ 149291 137272 131677 168131 199986 236421 364217 372772 313643 242965 122924 129058 181333
17447A81333P101m2453r3473k5030J154l5573j5200l6622n624K3558O3486Q5077
$$ 181333 188434 145981 52508 27478 28632 -6941 -22141 -58763 -64387 -40829 22657 107734
17435A07734m9902l3843k9503j5718n3517K0345L3227l5177j0567N6200M304o3680
$$ 107734 57832 23989 -5514 -21232 -74749 -54404 -21177 -56354 -66921 -10721 -6417 -70097
17423g0097M6683j8480k6727l4673q652J38191k30j23129o459J5343K2647N2835
$$ -70097 -23414 -41894 -68621 -103294 -111946 26245 26015 -97114 -103573 -88230 -65583 -12748
17411a2748l3376K0256M5114K7451P347Q4168n6006p8523J6368J4568l0343o3807
$$ -12748 -46124 -25868 19246 46697 54044 138212 82206 3683 20051 34619 4276 -59531
17399e9531m7698l6178o2088R8461O8297l0626Q041r6842k6157J58322L6268q1372
$$ -59531 -107229 -143407 -205495 -107034 -38737 -69363 -61322 -158164 -184321 -25999 10269 -71103
17387g1103j4197J419M4424K7429O7989j2013L6080n6408j2084p9874j6748J6373
$$ -71103 -85300 -83881 -39457 -12028 55961 43948 80028 23620 11536 -68338 -85086 -68713
17375f8713L3381j0026P3830K5461o1588K9523O5340j2547p5703n7451j2247m2011
$$ -68713 -35332 -45358 28472 53933 -7655 21868 87208 74661 -1042 -58493 -70740 -112751
17363a12751J7942k8150J1524R3454P7777Q297k1143k0278M017j1022N492l6478
$$ -112751 -94809 -122959 -111435 -17981 59796 68093 46950 26672 30689 19667 25159 -11319
17351a1319N445J9029K1526L475j27199m1223J43949Q2345k1164R387q1324o8696
$$ -11319 -5874 13155 34681 38156 -89043 -130266 13683 96028 74864 84251 2927 -65769
17339f5769J3802Q345M3964J5045j05806j889M5545J7559M9067j2731L2192l9388
$$ -65769 -51967 -43622 342 15387 -90419 -92308 -46763 -29204 19863 7132 39324 -64
17327f4m1411q320q7007n6276R4568j3419n8377L4263Q3771L28K3268L3296n3501
$$ -64 -41475 -49795 -136802 -193078 -98510 -111929 -170306 -136043 -52272 -51944 -28676 4620 -48881
17314d8881p1473P6481N3857N428J430j9083l7439R5577k2022n3940R6883k5488
$$ -48881 -120354 -43873 9984 15412 16842 -2241 -39680 55897 33875 -20065 76818 51330
17302E1330n0011k3233M7375k3008n4705l1397k3411n4200n8452r900J19424J32693
$$ 51330 1319 -21914 25461 2453 -52252 -83649 -107060 -161260 -219712 -229612 -110188 22505
17290B2505j1648j8284k5888M3086j01667q7297P7534L0013n2932K3480k0936
$$ 22505 10857 -7427 -33315 9771 -91896 -179193 -101659 -71646 -124578 -101098 -122034
17279a22034R456L0046r843M2719M8207l6500k8117L066O5024M4267m1287n4896
$$ -122034 -112578 -82532 -92375 -49656 -1449 -37949 -66066 -63000 2024 46291 5004 -49892
17267d9892k3463O567L0041M2690P0143j5576q5921K6806l052n1597p019L9970
$$ -49892 -73355 -66788 -36747 5943 76086 60510 -25411 1395 -1657 -53254 -60273 -20303
17255b0303l8997k2185m740K9437Q112L9101N4542k7668n5257j07963L0179o5249
$$ -20303 -59300 -81485 -86225 -56788 -48676 -9575 44967 17299 -37958 -145921 -115742 -180991
17243a80991n7626Q7588J05817J6327L683k964j3233L7605j2388L9489l1622j03904
$$ -180991 -238617 -151029 -45212 -28885 -25202 -28166 -41399 -3794 -16182 23307 -8315 -112219
17231a12219l766L0226K5182P035J2491r511j7202l3610Q87q2157j7611J14503
$$ -112219 -115985 -85759 -60577 -53542 -41051 -50562 -67764 -101374 -100487 -182644 -200255 -85752
17219h5752J4187j1990M9978o6296L317J05545N2507K1515Q432p915n5011j30232
$$ -85752 -71565 -83555 -33577 -99873 -96556 8989 61496 83011 91443 83528 28517 -101715
17207a01715j3125O6698L3753m2757O7379n8820k5442N1767k2603p396J7968r800
$$ -101715 -114840 -48142 -14389 -57146 10233 -48587 -74029 -22262 -44865 -52261 -34293 -44093
17195d4093j2126k5746q3134K5930N1112J6224N5668N5108K7871l2474N90l2149
$$ -44093 -56219 -81965 -165099 -139169 -88057 -71833 -16165 38943 66814 34340 34930 2781
17183B781p0202K9774N5153Q9684o6401J4962l1236m1147K0292j6931p1004k3017
$$ 2781 -67421 -37647 17506 107190 40789 55751 24515 -16632 3660 -13271 -84275 -107292
17171a07292K0483k743k9817m4003M5820k3671n6540k0316j7673M478J2608O156
$$ -107292 -86809 -89552 -119369 -163372 -117552 -141223 -197763 -218079 -235752 -231274 -218666 -212510
17159b12510R9208R9341M7232R070j9299p2544l7576L1640m8938J1640K4025m1141
$$ -212510 -113302 -13961 33271 42341 23042 -49502 -87078 -55438 -104376 -92736 -68711 -109852
17147a09852O787O654l9826O39M3943L3198L5863o6738p439Q9809l767L589k0173
$$ -109852 -103065 -96411 -136237 -135598 -91655 -58457 -22594 -89332 -96771 -6962 -10729 -7140 -27313
17134b7313r9192K2772L6302K0844N37k9709Q6502j6233k8982R954k4409j4282
$$ -27313 -126505 -103733 -67431 -46587 -46050 -75759 10743 -5490 -34472 -24518 -48927 -63209
17122f3209O797L9050j5574k4053j218j2811j03571Q8713R1774l6558J624Q277
$$ -63209 -56412 -17362 -32936 -56989 -58207 -71018 -174589 -85876 5898 -30660 -29036 -20759
17110b0759l1244m5001Q8836R974j0575p238m811R786q313J3667p4153l4365Q0884
$$ -20759 -52003 -97004 -8168 1806 -8769 -16007 -20818 -11032 -19345 -5678 -79831 -114196 -33312
17097c3312O5123K6798k311M832q5167m8850m0675m5158M6412j254m6619l8941
$$ -33312 31811 58609 56298 61130 -24037 -72887 -113562 -158720 -112308 -113562 -160181 -199122
17085a99122J5645N4331P332q947k9219K8616L7039K477N3666j8075o9895R794
$$ -199122 -183477 -129146 -121814 -130761 -159980 -131364 -94325 -91848 -38182 -56257 -126152 -116358
17073a16358l015J05360Q5626J0864o0768q0798O70N6206Q6292J9483Q908r2567
$$ -116358 -119373 -14013 71613 82477 21709 -59089 -58419 -2213 84079 103562 112470 19903
17061A9903k0195J1328o9472l6976k4412k2797j9696k6052J3144R5503J28585
$$ 19903 -292 11036 -58436 -95412 -119824 -142621 -162317 -188369 -175225 -79722 48863
17050D8863L4622k0710l0133q9316j19487k5600N9676n8823L8946M2163M9492
$$ 48863 83485 62775 32642 -56674 -176161 -201761 -142085 -200908 -161962 -119799 -70307
17039g0307N5852k4514m9008L4944M7191K1209j2240K6285m3476p4287k7581N4497
$$ -70307 -14455 -38969 -87977 -53033 -5842 15367 3127 29412 -14064 -88351 -115932 -61435
17027f1435k8567o0578M2426K6885q9338J010R4620k144p9835P2255O760m139
$$ -61435 -90002 -150580 -108154 -81269 -170607 -169597 -74977 -77121 -156956 -84701 -77941 -82080
17015h2080m4115q5834j6115J09832J01350L6386o263m1592p1525m202l1417J3293
$$ -82080 -126195 -212029 -228144 -118312 -16962 19424 13161 -28431 -99956 -104158 -135575 -122282
17003a22282K1966P6134K5365o0456j04996R3026L614J33401R7229r0715p5192
$$ -122282 -100316 -24182 1183 -59273 -164269 -71243 -67629 65772 163001 72286 -2906
16992b906m1815p1236l2390M0283o5301l4218J5030M8240k8470K3914J40561n144
$$ -2906 -44721 -115957 -148347 -108064 -173365 -207583 -192553 -144313 -172783 -148869 -8308 -13452
16980a3452r3382M0876L9288l2915j2384k9725P1573J7233l4768m3964o4124l6496
$$ -13452 -106834 -65958 -26670 -59585 -71969 -101694 -30121 -12888 -47656 -91620 -155744 -192240
16968a92240j2417j654k910P0893K0842M3441Q2009K5394l7599k1779n7624k1409
$$ -192240 -204657 -206311 -209221 -138328 -117486 -74045 7964 33358 -4241 -26020 -83644 -105053
16956a05053m9265K8264O1697j840o9689K371m6701m5011R0144J6765J01340M4353
$$ -105053 -154318 -126054 -64357 -66197 -135886 -133515 -180216 -225227 -135083 -118318 -16978 27375
16944B7375m1871L7820O9482p0257j01052K3554J27419j9675K0428q2228j09477
$$ 27375 -14496 23324 92806 22549 -78503 -54949 72470 52795 73223 -9005 -118482
16933a18482l1985m4597k246Q484J9238p4061n451M8170L7381J12914j8023p8499
$$ -118482 -150467 -195064 -197310 -188826 -169588 -243649 -249100 -200930 -163549 -50635 -68658 -147157
16921a47157M6919O0665j6943k4850K374J8356O2038O0964l1839r9390n2781O1106
$$ -147157 -100238 -39573 -56516 -81366 -78992 -60636 1402 62366 30527 -68863 -121644 -60538
16909f0538O2245N3920l5721q5195k2197k0488Q1259Q170m6920J5984J4824r2980
$$ -60538 1707 55627 19906 -65289 -87486 -107974 -26715 -18545 -65465 -49481 -34657 -127637
16897a27637M8845N4119Q5087k0785K0035M7398k9569m6397j19989L5068L2191
$$ -127637 -78792 -24673 60414 39629 59664 107062 77493 31096 -88893 -53825 -21634
16886b1634l5529J0734L076J2672l4690m3710K801Q1316N2277K2289k2926p1936
$$ -21634 -57163 -46429 -43353 -30681 -65371 -109081 -106280 -24964 27313 49602 26676 -45260
16874d5260R2073N915j12007M443l0748K04r657k0159J8453j569Q5767n7100K4071
$$ -45260 46813 52728 -59279 -54836 -85584 -85380 -95037 -115196 -96743 -98312 -12545 -69645 -45574
16861d5574j5516o1743r4217Q160L1655P1460l128o7442K8425Q9437K3599p9517
$$ -45574 -61090 -122833 -217050 -208890 -177235 -105775 -108903 -176345 -147920 -58483 -34884 -114401
16849a14401J7358O5552L006k2043n2603o3292J4687K498K2515N4071N2673P4519
$$ -114401 -97043 -31491 -28485 -50528 -103131 -166423 -151736 -149238 -126723 -72652 -19979 54540
16837E4540o4414o9643M780m4684j144j6807K3957J01494k6994N5408j5333r4303
$$ 54540 -9874 -79517 -74737 -119421 -120565 -137372 -113415 -11921 -38915 16493 1160 -93143
16825i3143l0278l0207j6460K1666R5099j7811k5509J3512K1118q866n6299K1529
$$ -93143 -123421 -153628 -170088 -148422 -53323 -71134 -96643 -83131 -62013 -70879 -127178 -105649
16813a05649r756j1388J4643n0882J5090N4726O1420L6129q6327n1018K2282J504
$$ -105649 -115405 -126793 -112150 -163032 -147942 -93216 -31796 4333 -81994 -133012 -110730 -109226
16801a09226P603P8709J6037n4825p4609l6385j98L3583O0097j9850j7329K1011
$$ -109226 -101623 -22914 -6877 -61702 -136311 -172696 -172894 -139311 -79214 -99064 -116393 -95382
16789i5382K5855q428o346R810j5813L079M0899N0979l2437l8092j6675m0686
$$ -95382 -69527 -77955 -84301 -74491 -90304 -87225 -46326 4653 -27784 -65876 -82551 -123237
16777a23237L6094N7456m1086p5706M5574M2598J942R180J4798l7951J2602N5567
$$ -123237 -87143 -29687 -70773 -146479 -100905 -58307 -56365 -47185 -32387 -70338 -57736 -2169
16765b169J9094q9440p4241M6230k0346k7918j0287n2485L4011J16774J53245
$$ -2169 16925 -72515 -146756 -100526 -120872 -148790 -159077 -211562 -177551 -60777 92468
16754I2468q8841j44331k505P7311q036J8341L220O4068m7581n4487m7822r035
$$ 92468 3627 -140704 -143209 -65898 -73934 -55593 -52373 11695 -35886 -90373 -138195 -147230
16742a47230M3946K0452K6471M1550j09306p0635o705p155N3684J0805n8518N2215
$$ -147230 -103284 -82832 -56361 -14811 -124117 -194752 -201457 -208612 -154928 -144123 -202641 -150426
16730a50426N7939K0716L1985N1808j12685m1971m3131l2795P0042p635K8497
$$ -150426 -92487 -71771 -39786 12022 -100663 -142634 -185765 -218560 -148518 -156153 -127656
16719a27656L6027J6833n1962J9989l693j8903n8297J39024O2758N3439R0915
$$ -127656 -91629 -74796 -126758 -106769 -110462 -129365 -187662 -48638 14120 67559 158474
16708A58474l5681q4362O4758r1940j3145N1005q7209m8931n0491L3526M4555
$$ 158474 122793 38431 103189 11249 -1896 49109 -38100 -87031 -137522 -103996 -59441
16697e9441o9259p7130l7970K6539Q5020q76n0475r9111N3101Q2883J36352P2853
$$ -59441 -128700 -205830 -243800 -217261 -132241 -133117 -183592 -282703 -229602 -146719 -10367 62486
16685F2486j40478j80306M2072J02625K1886l8896J13546O6194L3621j4123k1450
$$ 62486 -77992 -258298 -216226 -113601 -91715 -130611 -17065 49129 82750 68627 47177
16674D7177p1524l8719p594l7249k8718N9902K9185m9614j8283K0420Q1360J01466
$$ 47177 -24347 -63066 -70660 -107909 -136627 -76725 -47540 -97154 -115437 -95017 -13657 87809
16662H7809R171l3238p0911J97m8257k5530Q1477O369m8459l1205J1898j9374
$$ 87809 96980 63742 -7169 -6972 -55229 -80759 718 7087 -41372 -72577 -60679 -80053
16650h0053p8906O0541K5691o9602J9829N1241n940O120R4280j3285o4711n3630
$$ -80053 -158959 -98418 -72727 -142329 -122500 -71259 -77199 -71079 23201 9916 -54795 -108425
16638a08425l0993J5667Q7192M0175J9685p9654k3006J6784j31454K5158J93895
$$ -108425 -139418 -123751 -36559 3616 23301 -56353 -79359 -62575 -194029 -168871 25024
16627B5024N0136l5861n2436n4191n183N80m966n807M0600J7951K8756j7363m2013
$$ 25024 75160 39299 -13137 -67328 -72511 -71931 -76897 -82704 -42104 -24153 4603 -12760 -54773
16614e4773l4460l5608J4872k341j2794M6454j4392l3065k8775Q950L5762L635
$$ -54773 -89233 -124841 -109969 -112310 -125104 -78650 -93042 -126107 -154882 -145932 -110170 -106535
16602a06535p189P65q2237l4935O9867J29320l3854J5324Q1645M3524l4660l2957
$$ -106535 -113724 -112959 -195196 -230131 -160264 -30944 -64798 -49474 32171 75695 41035 8078
16590H078q6070k7995J1267Q9688N2618P9261p915j05731n4549L1647j8118j0508
$$ 8078 -77992 -105987 -94720 -5032 47586 126847 118932 13201 -41348 -9701 -27819 -38327
16578c8327L958j8417m1153l686L1376Q6342K9537k7594q4799m1604k5601m2213
$$ -38327 -34369 -52786 -93939 -97625 -66249 20093 49630 22036 -62763 -104367 -129968 -172181
16566a72181o8205P8338Q7937m5728K2411O6934m9450j5779L6690j7619M388J366
$$ -172181 -240386 -162048 -74111 -119839 -97428 -30494 -79944 -95723 -59033 -76652 -72264 -70898
16554g0898k9451M0841L4469j3669n2417J6436J3163k9536j6234k6490M8803Q2840
$$ -70898 -100349 -59508 -25039 -38708 -91125 -74689 -61526 -91062 -107296 -133786 -84983 -2143
16542b143l9845m1570m1695j9480l924O970j3981R1828O4219K6385q5269o9106
$$ -2143 -41988 -83558 -125253 -144733 -148657 -141687 -155668 -63840 379 26764 -58505 -127611
16530a27611J2558l007J3914L9684P5872m6131R767N2721K3821k1049L8465j6717
$$ -127611 -115053 -118060 -104146 -64462 11410 -34721 -24954 27767 51588 30539 69004 52287
16518E2287p7653n8890k2413l6041O4252N4074k0984l2609l0441J21631R326p2583
$$ 52287 -25366 -84256 -106669 -142710 -78458 -24384 -45368 -77977 -108418 13213 22539 -50044
16506e0044j6385P0313k3523P2117m6065n2874O145o556P47k065O6971J20873
$$ -50044 -66429 3884 -19639 52478 6413 -46461 -40316 -46872 -46125 -48190 18781 139654
16494A39654j0753p4429r6870j7507J0542J8280j8279M225m5067J106O5118K9341
$$ 139654 128901 54472 -42398 -59905 -49363 -31083 -49362 -45137 -90204 -89098 -23980 5361
16482E361K8314o2278j39408K5456L4598R7219N7370J3105o1247n5879l2910m18
$$ 5361 33675 -28603 -168011 -142555 -107957 -10738 46632 59737 -1510 -57389 -90299 -90717
16470i0717K8444r733j7228n9987O1785q3L9769Q0321J4772l2860j4664o8622
$$ -90717 -62273 -72006 -89234 -149221 -87436 -87519 -47750 32571 47343 14483 -181 -68803
16458f8803k0171K2652Q950N8582N6928q8556N756N359J8036N7058j580r247J4518
$$ -68803 -88974 -66322 -57372 1210 58138 -30418 -24662 -19303 -1267 55791 54211 44964 59482
16445E9482l7579P821N8352l7384j28684l6688j2170j4924m5798l3979K9876N8308
$$ 59482 21903 29724 88076 50692 -77992 -114680 -126850 -141774 -187572 -221551 -191675 -133367
16433a33367L3439J7991M773R6125l385o4636K5712P7166N9724J5756q8514l4676
$$ -133367 -99928 -81937 -77164 18961 15576 -49060 -23348 53818 113542 129298 40784 6108
16421F108N4896l7667r6490J8685R655k0189N7945K5823l3425m0271M458J08193
$$ 6108 61004 23337 -73153 -54468 -44813 -65002 -7057 18766 -14659 -54930 -50472 57721
16409E7721k3911n9299p9160n9866j0552M1211O3611N828O9250J6586j04808n9878
$$ 57721 33810 -25489 -104649 -164515 -175067 -133856 -70245 -64417 4833 21419 -83389 -143267
16397a43267L7172q316l944K2339j1659k1324L1919o365o1010L5278J414J0096
$$ -143267 -106095 -114411 -118355 -96016 -107675 -128999 -97080 -103445 -164455 -129177 -127763 -117667
16385a17667K2108l5250K4648Q086K891J0173q759K1714J4674J09636O0325q2594
$$ -117667 -95559 -130809 -106161 -98075 -95184 -85011 -93770 -72056 -57382 52254 112579 29985
16373B9985m3057p9375k1409l4891J1577q550R3810r113p4973N3676m4043o4691
$$ 29985 -13072 -92447 -113856 -148747 -137170 -145720 -51910 -61023 -135996 -82320 -126363 -191054
16361a91054M0647L9695L1445J17723l5462m0956K2664j9659L2407n0641K6426
$$ -191054 -150407 -110712 -79267 38456 2994 -37962 -15298 -34957 -2550 -53191 -26765
16350b6765K5872L1283P11k8922k785J127J1310m2543j5651J8627o1573l6082
$$ -26765 -893 30390 31101 2179 -606 521 11831 -30712 -46363 -27736 -89309 -125391
16338a25391K5451M7223K2849O3070n2206k2361J7151M2820N4009m7986m2701
$$ -125391 -99940 -52717 -29868 33202 -19004 -41365 -24214 18606 72615 24629 -18072
16327a8072j2795L1755K535p5991q6954R3866L7830n3680j414J4775m7769j4486
$$ -18072 -30867 888 3423 -72568 -159522 -65656 -27826 -81506 -82920 -68145 -115914 -130400
16315a30400P6829M1302R982k3543M3107J6356M9066N2307l9673j1704k7537j41049
$$ -130400 -53571 -12269 -2287 -25830 17277 33633 82699 135006 95333 83629 56092 -84957
16303h4957k5471L600M2026l2504K2434l8040r568N6199J18471j8677r2705n5631
$$ -84957 -110428 -106828 -64802 -97306 -74872 -112912 -122480 -66281 52190 33513 -59192 -114823
16291a14823l627K0342Q3913J3389K3941k1465l6563m8597N490L4754O2023K3692
$$ -114823 -118450 -98108 -14195 -806 23135 1670 -34893 -83490 -78000 -43246 18777 42469
16279D2469l674q5078M9289k4022q5151j9629N940j7063Q5961m9356j08179J077
$$ 42469 38795 -46283 3006 -21016 -106167 -125796 -119856 -136919 -50958 -100314 -208493 -207416
16267b07416R9884M9940o5955m9834l7668R5300Q1711J2136o4811o0426l7807
$$ -207416 -107532 -57592 -123547 -173381 -211049 -115749 -34038 -21902 -86713 -147139 -184946
16256a84946K305J9230M1595L6612M1523O0488j8925k8773j8677m3816j2463n3336
$$ -184946 -182641 -163411 -121816 -85204 -43681 16807 -2118 -30891 -49568 -93384 -105847 -159183
16244a59183j76O9092k312K7487J6948p29k8484l592L0419L929p3322q9416M7631
$$ -159183 -159359 -90267 -92579 -65092 -48144 -48873 -77357 -80949 -50530 -46601 -119923 -209339 -161708
16231a61708J7715o9914J6734N8399k7223N1812O1990j4288l400P2182P2407l5518
$$ -161708 -143993 -213907 -197173 -138774 -165997 -114185 -52195 -66483 -69883 2299 74706 39188
16219C9188p0318m5256j4440n4776k9697j02925J1378J09978P5745L6728L9617
$$ 39188 -31130 -76386 -90826 -145602 -175299 -278224 -266846 -156868 -81123 -44395 -4778
16208d778M1646P2579M09M036j52322m1236Q7857J9715k8544o393M0536N990l27
$$ -4778 36868 109447 109856 113892 -38430 -79666 8191 27906 -638 -7031 33505 39495 39168
16195C9168p5466m3436p0366P9632J4531m3177m9515M6605Q8940K0590k8650n8535
$$ 39168 -36298 -79734 -150100 -70468 -55937 -99114 -148629 -102024 -13084 7506 -21144 -79679
16183g9679l7956N7033m3294N3671p878r458j7906l1699n3579n1773K1469O2005
$$ -79679 -117635 -60602 -103896 -50225 -58103 -67561 -85467 -117166 -170745 -222518 -201049 -139044
16171a39044R561l7900j9988q202l1154l4082M5156J09492J173j1887k9790R751
$$ -139044 -129483 -167383 -187371 -195573 -226727 -260809 -215653 -106161 -104988 -116875 -146665 -136914
16159a36914J3018O026N2857L3369n657P232K1839J7412L4236j56475q2612O702
$$ -136914 -123896 -117870 -65013 -31644 -37301 -30069 -8230 9182 43418 -113057 -195669 -188967
16147a88967k4583J4312K6643o916L2662L8064J9029P1325J665J1580l6094n9476
$$ -188967 -213550 -199238 -172595 -179511 -146849 -108785 -89756 -18431 -16766 -5186 -41280 -100756
16135a00756P7666o7287P02R7774K5942m7180j3059L9435l1621n9956k7286K424
$$ -100756 -23090 -90377 -89675 8099 34041 -13139 -26198 13237 -18384 -78340 -105626 -103202
16123a03202P8183j2109L2241L1643j4662p0091n7424o6258J1409J7770J6585
$$ -103202 -25019 -37128 -4887 26756 12094 -57997 -115421 -181679 -170270 -152500 -135915
16112a35915J3515p851l5007O3058Q0602M7628K586j0444m0762q463J9460l3111
$$ -135915 -122400 -130251 -165258 -102200 -21598 26030 28616 18172 -22590 -31053 -11593 -44704
16100d4704K1289N5973k9814r3321n8461n1556M3038J08773l1267O2666P5590
$$ -44704 -23415 32558 2744 -90577 -149038 -200594 -157556 -48783 -80050 -17384 58206
16089E8206l2331o5716N3345L0743o8946J4570p1283k9745R104Q797k1603q353
$$ 58206 25875 -39841 13504 44247 -24699 -10129 -81412 -111157 -102053 -93256 -114859 -123212
16077a23212M57N6713P9535M6313J4405K7929M2244j3819m9009k5893j7625l4798
$$ -123212 -122755 -66042 13493 59806 74211 102140 144384 130565 81556 55663 38038 3240
16065C240j9795J0240k8763M3607p8050p9999k8828o7902j7081J1769M7600M8278
$$ 3240 -16555 -6315 -35078 8529 -69521 -149520 -178348 -246250 -263331 -251562 -203962 -155684
16053a55684Q5557n0168K6241j2065K6780K2670Q56J2674r5401l9716N7591J7999
$$ -155684 -70127 -120295 -94054 -106119 -79339 -56669 -55813 -43139 -138540 -178256 -120665 -102666
16041a02666j3035N9401O3597l5776N617k5313m6334N9721K3916l2q6017J70J6285
$$ -102666 -115701 -56300 7297 -28479 -22862 -48175 -94509 -34788 -10872 -10904 -96921 -96751 -80466
16028h0466l3997k8977K5965P7243K3181K3110L4837J4184n292o4915l0151L1448
$$ -80466 -114463 -143440 -117475 -40232 -17051 6059 40896 55080 49788 -15127 -45278 -13830
16016a3830O81m3951N5472J6956M4357o057o3034l1686N6241m728N576p980j6603
$$ -13830 -13149 -57100 -1628 15328 59685 53628 -9406 -41092 15149 10421 15997 8017 -8586
16003h586o170m456M2535l4994q173L6130R113j40302q0912k4577p637J09721
$$ -8586 -14756 -19212 23323 -11671 -19844 16286 25399 -114903 -195815 -220392 -228029 -118308
15991a18308Q7544n9728k1874K9630O3551J6384j8060J9013K4169J2878J0140
$$ -118308 -30764 -90492 -112366 -82736 -19185 -2801 -20861 -1848 22321 35199 45339
15980D5339p1650N85j9828n2894R9908P3749r3956l9553L8039J7793q592Q475
$$ 45339 -26311 -25726 -45554 -98448 1460 75209 -18747 -58300 -20261 -2468 -11060 -2585
15968b585m9875m380j09451M1811Q6515L9646O0297K0244l4444l6748M224j05985
$$ -2585 -52460 -56840 -166291 -124480 -37965 1681 61978 82222 47778 11030 15254 -90731
15956i0731q65N616K4580J2353k5559m1487o7162P6554k0768J10072L027k1300
$$ -90731 -91596 -85980 -61400 -49047 -74606 -116093 -183255 -106701 -127469 -17397 -14370 -35670
15944c5670J225J6912l5686J9157j5758k3745J4915L0567O622j3677p1051k5053
$$ -35670 -34445 -17533 -53219 -34062 -49820 -73565 -58650 -28083 -21461 -35138 -106189 -131242
15932a31242N9717j2194p130k6322l4142q5062P4207N4653O646J0259l445m422
$$ -131242 -71525 -83719 -90849 -117171 -151313 -236375 -162168 -107515 -100869 -90610 -94055 -98477
15920i8477p4759M0479M2424M5711J1285L8450P1947O9976k4496L681k2321j16652
$$ -98477 -173236 -132757 -90333 -44622 -33337 5113 77060 147036 122540 126221 103900 -12752
15908a2752o833o9465l6640l7682m6613j2634L7010J28551L3944m5608l4665j0742
$$ -12752 -19585 -89050 -125690 -163372 -209985 -222619 -185609 -57058 -23114 -68722 -103387 -114129
15896a14129m803k4990J2315N6667M5134r2200N6781R3678J0214n4895m9344r6847
$$ -114129 -118932 -143922 -131607 -74940 -29806 -122006 -65225 28453 38667 -16228 -65572 -162419
15884a62419r4466k5425l3475N9802J07600N9066K5499k7775j0409l8233O7046
$$ -162419 -256885 -282310 -315785 -255983 -148383 -89317 -63818 -91593 -102002 -140235 -73189
15873g3189k1787p4960R0318O9697o849n2903o5659L1526Q4074R1675J1203n5224
$$ -73189 -94976 -169936 -79618 -9921 -16770 -69673 -135332 -103806 -19732 71943 83146 27922
15861B7922j03220l8437j0349L1058N1193O8705L7799m0984p2208q7801o7972
$$ 27922 -75298 -113735 -124084 -93026 -41833 26872 64671 23687 -48521 -136322 -204294
15850b04294J11598P7938o469J4394n1847j2443N3925O6901k8935q5284J623j7599
$$ -204294 -92696 -14758 -21227 -6833 -58680 -71123 -17198 49703 20768 -64516 -62893 -80492
15838h0492K7077M570P1573M4785L49k5347j4238q0684J3339j5246m2565K3835
$$ -80492 -53415 -48845 22728 67513 67862 42515 28277 -52407 -39068 -54314 -96879 -73044
15826g3044J05281M4819l0656j06166K0896N3997k8620q0852o609O0945q61r808
$$ -73044 32237 77056 46400 -59766 -38870 15127 -13493 -94345 -100954 -40009 -40870 -50678
15814e0678n755P443Q214J4603L0110k1366l4492l842N6676l4240r786J632M5416
$$ -50678 -56433 -48990 -40776 -26173 3937 -17429 -51921 -55763 913 -33327 -43113 -41481 3935
15801C935R227K5389O1671n4902m7984j2824m4982k1515j192Q408J6408o1338
$$ 3935 13162 38551 100222 45320 -2664 -15488 -60470 -81985 -83177 -74769 -58361 -119699
15789a19699P285j3497N063m8056P881P5631J26653L5920m1566L4242Q2462n2334
$$ -119699 -112414 -125911 -120848 -168904 -161023 -85392 41261 77181 35615 69857 152319 99985
15777I9985J618j14675j08646N8267R434M6840M7673J9090n8144o341L1506J6528
$$ 99985 101603 -13072 -121718 -63451 -54017 -7177 40496 59586 1442 -4899 26607 43135
15765D3135k4818p8519n2657Q0921O4600k2674l703k516K0732M7524r6564J5796
$$ 43135 18317 -60202 -112859 -31938 32662 9988 6285 3769 24501 72025 -24539 -8743
15753h743L077p2290m5102O2089N2956k0095p1307M5915j7483N100J02264M687
$$ -8743 -5666 -77956 -123058 -60969 -8013 -28108 -99415 -53500 -70983 -65883 36381 41068
15741D1068n9474p0432L3410Q9015J00031k3860j66423n3707Q076k7682j2865
$$ 41068 -18406 -88838 -55428 33587 133618 109758 -56665 -110372 -102296 -129978 -142843
15730a42843M6267K1677M702j2844K7615P8128k1533K0022M3505L6775p2218k3819
$$ -142843 -96576 -74899 -70197 -83041 -55426 22702 1169 21191 64696 101471 29253 5434
15718E434o3408n9973n7076n9378p478R9449O1637O2126K8769q8776o856K8225
$$ 5434 -57974 -117947 -175023 -234401 -241879 -142430 -80793 -18667 10102 -78674 -85530 -57305
15706e7305N794r4833j8281M2562R9512Q9134J265r762N6993J4306l6785j4385
$$ -57305 -51511 -146344 -164625 -122063 -22551 66583 67848 58086 115079 129385 92600 78215
15694G8215Q250m1431j30336k6596J5318O8388R8826J9997l6363K1923Q4307k9629
$$ 78215 86465 45034 -85302 -111898 -96580 -28192 70634 90631 54268 76191 160498 130869
15682A30869l3350m5166p1250m3878j0185Q1513J5711R217n5245k2135r712o17
$$ 130869 97519 52353 -18897 -62775 -72960 8553 24264 33481 -21764 -43899 -53611 -54228
15670e4228L4337K1983l8286J8856k652K9765p400l9101n5304m6156N4643O716
$$ -54228 -19891 2092 -36194 -17338 -19990 9775 2375 -36726 -92030 -138186 -83543 -76827
15658g6827l3324p1387K2939J0976r99N6388N7411N6024k6213k5819Q084M7965
$$ -76827 -110151 -181538 -158599 -147623 -148622 -92234 -34823 21201 -5012 -30831 -22747 25218
15646B5218m3737n5244N3335k1111p3795m6376K1640M3468n5878j1196Q1193O5846
$$ 25218 -18519 -73763 -20428 -41539 -115334 -161710 -140070 -96602 -152480 -163676 -82483 -16637
15634a6637L4797p515L5581k704q4201m7427N7338k2373Q902Q521l7632j1769
$$ -16637 18160 10645 46226 43522 -40679 -88106 -30768 -53141 -44239 -35718 -73350 -85119
15622h5119Q1507J01865l6794j7435k1700R9052L1025m8089j72937o2046L6201
$$ -85119 -3612 98253 61459 44024 22324 121376 152401 104312 -68625 -130671 -94470
15611i4470J2465M8080L5350k100k0289m1682M0577l561l1782k319O5644j3003
$$ -94470 -82005 -33925 1425 -675 -20964 -62646 -22069 -25630 -57412 -59731 5913 -7090
15599g090P939J2955m8912n7902M6579N1490p7056M0528o221j9128n5279K5173
$$ -7090 849 13804 -35108 -93010 -46431 5059 -71997 -31469 -37690 -56818 -112097 -86924
15587h6924m8659r1099M681Q7241K0242l0965N5670J6272L3997q125j06688j9623
$$ -86924 -135583 -226682 -222001 -134760 -114518 -145483 -89813 -73541 -39544 -47669 -154357 -173980
15575a73980J1736M3240Q2625L207o3624p1418J37915P2541Q531l7030l3371J3428
$$ -173980 -162244 -119004 -36379 -33172 -96796 -168214 -30299 42242 50773 13743 -19628 -6200
15563f200P4835P8725K672m6352k6376m7435j31560K7286L7844n7727j7241N0060
$$ -6200 68635 147360 150032 103680 77304 29869 -101691 -74405 -36561 -94288 -111529 -61469
15551f1469j0897k8975O409L7195Q56j4555Q116q8357L0396K0261L8339j4539
$$ -61469 -72366 -101341 -94932 -57737 -56881 -71436 -63320 -151677 -121281 -101020 -62681 -77220
15539g7220K4321L7626j7567p6643J8796J01769K7959L9090j08299p3891k5254
$$ -77220 -52899 -15273 -32840 -109483 -90687 11082 39041 78131 -30168 -104059 -129313
15528a29313J09544M1793o4371L4667M5191M6884J2339p056Q8453m088K7632l6382
$$ -129313 -19769 22024 -42347 -7680 37511 84395 96734 89678 178131 174043 201675 165293
15516A65293k1519J8785q8851l0578k9742n8997P7786P4038Q4237m6207m7921
$$ 165293 143774 162559 73708 43130 13388 -45609 32177 106215 190452 144245 96324
15505I6324m5587P3355K6827j9177m5385N5119n3772l836Q0448N6227J0592O3157
$$ 96324 50737 124092 150919 131742 86357 141476 87704 83868 164316 220543 231135 294292
15493B94292P3640Q634j32840j37671K1223L363L6919N5092r960R0767J0220J5868
$$ 294292 367932 376566 243726 106055 127278 130641 167560 222652 212692 303459 313679 329547
15481C29547K9599P9274k3716m0963K5282l30j78978o5980k7614K8090N1862K0387
$$ 329547 359146 438420 414704 373741 399023 398693 219715 153735 126121 154211 206073 226460
15469B26460o6690p8516J8252L9216p608N7019q7741j7995P952n812l163O4341
$$ 226460 159770 81254 99506 138722 131114 188133 100392 82397 90349 84537 81374 145715
15457A45715k9246m6773L0303J6323P589n5065R957o297N4854J8068Q397l6930
$$ 145715 116469 69696 99999 116322 123911 68846 78803 72506 127360 145428 153825 116895
15445A16895Q316O001l1200j17399k7180M3536l4276L8463Q5945J3959O049J723
$$ 116895 125211 131212 100012 -17387 -44567 -1031 -35307 3156 89101 103060 109109 110832
15433A10832J3303n3330q2329N8932J4332m1125q3722j7556R4546J28858m6733
$$ 110832 124135 70805 -11524 47408 61740 20615 -63107 -80663 13883 142741 96008
15422I6008l9395l2151J2199L9109k1996j718j7816l0959m7635j5312M0509J7597
$$ 96008 56613 24462 36661 75770 53774 52056 34240 3281 -44354 -59666 -19157 -1560
15410a560J0300O0040P0983O4733o1139k1333L2179k597o6751o6040O8647k7970
$$ -1560 8740 68780 139763 204496 143357 122024 154203 151606 84855 18815 87462 59492
15398E9492Q911K2059n6668k7336k0639O3413k3633j8800L8642M7277Q5678q4942
$$ 59492 68403 90462 33794 6458 -14181 49232 25599 6799 45441 92718 178396 93454
15386I3454p3324k5652o963k968L2299l8934R5703l4861m1282M4831n2618q689
$$ 93454 20130 -5522 -12485 -15453 16846 -22088 73615 38754 -2528 42303 -10315 -19004
15374a9004L309j5116L1577M2747J4902j5534O5516P262j1415l5981j8259n7831
$$ -19004 -15695 -30811 766 43513 58415 42881 108397 115659 104244 68263 50004 -7827
15362g827R296n2430L8884j1920R7751N0848j026r8535P025o3557J8621Q3865
$$ -7827 1469 -50961 -12077 -23997 73754 124602 123576 25041 32066 -31491 -12870 70995
15350G0995o0609n2439K2443K5205r039L838P2728J8159l5857K8102j3503r213
$$ 70995 10386 -42053 -19610 5595 -3444 394 73122 91281 55424 83526 70023 60810
15338F0810j328L6064k8363p562r723j4793k6513q8316j6313M367L8674L1933
$$ 60810 59482 95546 67183 59621 49898 35105 8592 -79724 -96037 -91670 -52996 -21063
15326b1063O8322Q1535Q1382j7744K0582K7218m9051p009r079n4207n3476N9968
$$ -21063 47259 128794 210176 192432 213014 240232 191181 184172 175093 120886 67410 127378
15314A27378P1509R2773j8242j14005N874j3338o2355k9165p6090o7217P2723
$$ 127378 198887 291660 273418 159413 165287 151949 89594 60429 -15661 -82878 -10155
15303a0155J55478P9353r103p6741n6756K8952K1852K8550M7050M345j3381k0466
$$ -10155 145323 224676 215573 138832 82076 111028 132880 161430 208480 212825 199444 178978
15291A78978r012J1219J658j7232k2687k652l0276p2585l471j1618J7003q6494
$$ 178978 169966 181185 182843 165611 142924 140272 109996 37411 33940 22322 39325 -47169
15279d7169n557Q7223O0677P965k362l3937J2745Q4902j00207O3412Q9950m318
$$ -47169 -52726 34497 95174 103139 100777 66840 79585 164487 64280 127692 217642 213324
15267B13324R941L2767k2574k2556M9969q572N4871p740l8987k1676J1492l0187
$$ 213324 223265 256032 233458 210902 260871 252299 307170 299430 260443 238767 250259 220072
15255B20072M9800K7398p3312K6908j4938K4802j32669m9795N4199k2437M6619
$$ 220072 269872 297270 223958 250866 235928 260730 128061 78266 132465 110028 156647
15244A56647l9595k4613N4597l5197n1771P9142P5650K7436j5120k2431o1744
$$ 156647 117052 92439 147036 111839 60068 139210 214860 242296 227176 204745 143001
15233A43001j7215P3659M8181k565K8714q2874n4534L8578K23K4845L131R178
$$ 143001 125786 199445 247626 245061 273775 190901 136367 174945 175168 200013 203144 212322
15221B12322o2632k4185Q467j1895N3332N8256l283q682m861n1957j5935m2613
$$ 212322 149690 125505 133972 122077 175409 233665 230382 221700 216839 164882 148947 106334
15209A06334L7016R6815N5542P0237J1594m2643r4363r0339K7393N1944N7684
$$ 106334 143350 240165 295707 365944 377538 334895 240532 150193 177586 229530 287214
15198B87214O7586p403m2889j8173k5229K2620j68716q290Q9446O5332M2431N5613
$$ 287214 354800 347397 304508 286335 261106 283726 115010 106720 196166 261498 303929 359542
15186C59542Q6163Q9305j3221m4697k6424k3781q043o694m3534O479N0570j4505
$$ 359542 445705 535010 521789 477092 450668 426887 418844 412150 368616 375095 425665 411160
15174D11160L4032P0733J2671n1347n6961o8325R0935K9125O1482J9605Q244N5003
$$ 411160 445192 515925 528596 477249 420288 351963 442898 472023 533505 553110 561354 616357
15162F16357Q302j39655k7587K1396o4829j5091J06132K6631M2970Q5613p0685
$$ 616357 624659 485004 457417 478813 413984 398893 505025 531656 574626 660239 589554
15151E89554j5007M2660L3424P3766j7938J1564L0971n739k7446k2443L1405N2283
$$ 589554 574547 617207 650631 724397 706459 718023 748994 743255 715809 693366 724771 777054
15139G77054o7928j6757k9877M3653R7936n9032K8201J17702N4347j7232K2863
$$ 777054 709126 692369 662492 706145 804081 745049 773250 890952 945299 928067 950930
15128I50930k2462K021j3120M349P820M1946r879N5085J9133R1430K6005Q165
$$ 950930 928468 930489 917369 921718 929538 971484 961605 1016690 1035823 1127253 1153258 1161423
15116A161423Q4074R5024R9747o3387q0214K0551J38424Q0646M3087J1944Q8422
$$ 1161423 1245497 1340521 1440268 1376881 1296667 1317218 1455642 1536288 1579375 1591319 1679741
15105A679741J09353M1209j5450J4246P4752M8815J5406L3315L4854K7349J18787
$$ 1679741 1789094 1830303 1814853 1829099 1903851 1952666 1968072 2001387 2036241 2063590 2182377
15094B182377J11983q973r3415L4411O7681J55240N5687J07142Q397l432N3478
$$ 2182377 2294360 2285387 2191972 2226383 2294064 2449304 2504991 2612133 2620530 2617098 2670576
15083B670576K5150N1993J16258O8653J03200J21789R1360K26476J52851R5138
$$ 2670576 2695726 2747719 2863977 2932630 3035830 3157619 3248979 3475455 3628306 3723444
15073C723444J54636J86294K41376K24334K04637K82532K72894L58888M23746
$$ 3723444 3878080 4064374 4305750 4530084 4734721 5017253 5290147 5649035 6072781
15064F072781L96264L86589L91614N04171N00696N22753M63139M98851M54981
$$ 6072781 6469045 6855634 7247248 7751419 8252115 8774868 9238007 9736858 10191839
15055A0191839M87639N14657P03379P07754P82035R54393J179100J289571J461902
$$ 10191839 10679478 11194135 11897514 12605268 13387303 14341696 15520796 16810367 18272269
15046A8272269J785267K033330K405654K743533L286859L768654M218326M706891
$$ 18272269 20057536 22090866 24496520 27240053 30526912 34295566 38513892 43220783
15038D3220783N126870N468320N605045N394069M936574M213847L164105J878535
$$ 43220783 48347653 53815973 59421018 64815087 69751661 73965508 77129613 79008148
15030G9008148M22050j105174k495101l897743m866459n606671n977216n824306
$$ 79008148 79430198 78325024 75829923 71932180 67065721 61459050 55481834 49657528
15022D9657528n528899n069766m576835m004450l406522k930183k532137k157578
$$ 49657528 44128629 39058863 34482028 30477578 27071056 24140873 21608736 19451158
15014A9451158j872192j549089j351718j283694j130302j030011q52217p64818
$$ 19451158 17578966 16029877 14678159 13394465 12264163 11234152 10381935 9617117
15006I617117o77380o17765n08114n58237m72452l66320l48273l33758l77859
$$ 9617117 8939737 8321972 7813858 7255621 6783169 6416849 6068576 5734818 5356959
14997E356959k52647k17639j98569k12975k32912k02841k43512j93953q8889o6448
$$ 5356959 5104312 4886673 4688104 4475129 4242217 4039376 3795864 3601911 3513022 3446574
14987C446574j35176k14559j49820j93442j26745j31618j10906q0416m4546j34583
$$ 3446574 3311398 3096839 2947019 2753577 2626832 2495214 2384308 2303892 2259346 2124763
14977B124763r7787M987k9053j11542p4908l2383M6304l3962n7442m7391r008
$$ 2124763 2026976 2031963 2002910 1891368 1816460 1784077 1830381 1796419 1738977 1691586 1682578
14966A682578j05475j27637m9260K5876j19489l0242k0193L8730p611m2106m2344
$$ 1682578 1577103 1449466 1400206 1426082 1306593 1276351 1256158 1294888 1287277 1245171 1202827
14955A202827m0319K9371j9287J0102L8522j9199q915j17067q532M1836k6195
$$ 1202827 1162508 1191879 1172592 1182694 1221216 1202017 1193102 1076035 1067503 1109339 1083144
14944A083144N304p5248l8069J2485R0676j9226o0207q8624q8463l2492l5407
$$ 1083144 1088448 1013200 975131 987616 1078292 1059066 998859 910235 821772 789280 753873
14933G53873m7418j8802p9418o6027M1003N6531l4652n9455o718J9144K0436O7941
$$ 753873 706455 687653 608235 542208 583211 639742 605090 545635 538917 558061 578497 646438
14921F46438J640M8295J0419j2656j44179j03716m6616J839R8114M5845k5309
$$ 646438 648078 696373 706792 694136 549957 446241 399625 401464 499578 545423 520114
14910E20114p7095K2361q5899N0876P1071P9819Q7974M0955o1149p5573r6551
$$ 520114 443019 465380 379481 430357 501428 581247 669221 710176 649027 573454 476903
14899D76903n5778k0885j081K7940L0799L25N6662J5912p9371k1806o2359r4902
$$ 476903 421125 400240 399159 427099 457898 458223 514885 530797 451426 429620 367261 272359
14887B72359J18766k2562M7445q921K1092K6200m4180j03653k3724m6208P6862
$$ 272359 391125 368563 416008 407087 428179 454379 410199 306546 282822 236614 313476
14876C13476M2498k4545j7336m4616m3173M3367J01922K5126p823m3471K726k3574
$$ 313476 355974 331429 314093 269477 226304 269671 371593 396719 388896 345425 348151 324577
14864C24577M4149J06085n8306j03380m1635k3156J43108M8219q362J0199k8917
$$ 324577 368726 474811 416505 313125 271490 248334 391442 439661 431299 441498 412581
14853D12581J7646Q7654q1800j70420k8072N7175Q79O5941l2792o0444R156n8690
$$ 412581 430227 517881 436081 265661 237589 294764 295643 361584 328792 268348 277504 218814
14841B18814K5064R5878M4874m0270o760o9082o8580K087P8023o5217r7004o4196
$$ 218814 243878 339756 384630 344360 337600 268518 199938 202025 280048 214831 117827 53631
14829E3631M4283l572N5952J6384O8114o3791m5109o029j6440n7775M0193j9302
$$ 53631 97914 94342 150294 166678 234792 171001 125892 119863 103423 45648 85841 66539
14817F6539Q1436J7082j227R949k529J2925Q519q3963m5616k7360M3724O4166
$$ 66539 147975 165057 163830 173779 171250 184175 192694 108731 63115 35755 79479 143645
14805A43645j5769j50549O827P6496M5399o1999P2767L6966r0174K2650J56870
$$ 143645 127876 -22673 -15846 60650 106049 44050 116817 153783 63609 86259 243129
14794B43129j2452K642q1245p804K8218l3009r0219k7619M2659p3818n6964J03267
$$ 243129 230677 233319 152074 144270 172488 139479 49260 21641 64300 -9518 -66482 36785
14782C6785J9739o9856J00125K3562q2470l7998K4902j6339r528k4467J28593
$$ 36785 56524 -13332 86793 110355 27885 -10113 14789 -1550 -11078 -35545 93048
14771I3048O7788j9382N5648j09833M4426L6478L398J7449j11874j10226j6465
$$ 93048 160836 141454 197102 87269 131695 168173 171571 189020 77146 -33080 -49545
14760d9545P8306J16519j7904j00251N547l1264M0370J9264J11849M3905q2933
$$ -49545 28761 145280 127376 27125 32672 1408 41778 61042 172891 216796 133863
14749A33863o5851K7719k3178m0573o2891l338o2055m7356O2990M243o4119j5909
$$ 133863 68012 95731 72553 31980 -30911 -34249 -96304 -143660 -80670 -76427 -140546 -156455
14737a56455L2817L4889N489P6624P4761M3506L2980j3773n7824l4368P6391M5433
$$ -156455 -123638 -88749 -83260 -6636 68125 111631 144611 130838 73014 38646 115037 160470
14725A60470j02638N2560P0275k1645K1908J7542k4053m6891q6742n1694L9869
$$ 160470 57832 110392 180667 159022 180930 198472 174419 127528 40786 -10908 28961
14714B8961P6219m186n3540n2999k2684P8611N0406j5709o2529M9629K6210K9236
$$ 28961 105180 100994 47454 -5545 -28229 50382 100788 85079 22550 72179 98389 127625
14702A27625p015r3646N0686J751n3192q2829Q656m7357N2046L2089P4802K8566
$$ 127625 120610 26964 77650 79401 26209 -56620 -47964 -95321 -43275 -11186 63616 92182
14690I2182O898J2757O3236q3997o4397k6135J1477L5862j0839m8738l8476L0301
$$ 92182 99080 111837 175073 91076 26679 544 12021 47883 37044 -11694 -50170 -19869
14678a9869l1890J2233M7339K8210J0752m3222o3156M1730L047q9099k7940M8113
$$ -19869 -51759 -39526 7813 36023 46775 3553 -59603 -17873 -14826 -103925 -131865 -83752
14666h3752K8393L4533O6220K9521n5374l9291J596n4568j8979R2362N4690j0171
$$ -83752 -55359 -20826 45394 74915 19541 -19750 -18154 -72722 -91701 661 55351 45180
14654D5180O4405N5485j22091m5721j2222L8783k3073K3030J27952j5641q9792
$$ 45180 109585 165070 42979 -2742 -14964 23819 746 23776 151728 136087 46295
14643D6295o4249L0000K0344J4706j8678k2061k3915p7488k6312L0552K9250N2276
$$ 46295 -17954 12046 32390 47096 28418 6357 -17558 -95046 -121358 -90806 -61556 -9280
14631i280j1913o2l1556O872R437k1229P0262L8457o6746n8993O8402L4218M2803
$$ -9280 -21193 -21255 -52811 -45939 -36502 -57731 12531 50988 -15758 -74751 -6349 27869 70672
14618G0672q2793p1044n96k966M1876J8167P953P784O7066L3063k5246l7688J0529
$$ 70672 -12121 -83165 -83761 -86727 -44851 -26684 -18731 -10947 56119 89182 63936 26248 36777
14605C6777j3929n8269K6460o666K2281L9382P6459J00394M7531l8250o2117q4815
$$ 36777 22848 -35421 -8961 -15627 6654 46036 122495 222889 270420 232170 170053 85238
14593H5238k4085J7946J8608k9823J327K2477L3703M2224N2879p090j8508N3078
$$ 85238 61153 79099 97707 67884 69211 91688 125391 167615 220494 213404 194896 247974
14581B47974k2827k2314K2489N5934q8601M5011N3943o722O376j25197o7278n148
$$ 247974 225147 202833 225322 281256 192655 237666 291609 284887 291263 166066 98788 93640
14569I3640P5294K8088n4824O4060O4308R291p8012q4307R335O880J2069l0615
$$ 93640 168934 197022 142198 206258 270566 279857 201845 117538 126873 133753 145822 115207
14557A15207P387m7998L5380L2965m6802l6090j4099m0200l952M4003K3164k8394
$$ 115207 122594 74596 109976 142941 96139 60049 45950 5750 1798 45801 68965 40571
14545D0571k0716O7837M703K7916m4186r6950m4194L8420J7327j6632m1544P473
$$ 40571 19855 87692 92395 120311 76125 -20825 -65019 -26599 -9272 -25904 -67448 -59975
14533e9975J8060J9817m4512K7101J1054O2647k2146J110N2359j8156l1495J7084
$$ -59975 -41915 -22098 -66610 -39509 -28455 34192 12046 13156 65515 47359 15864 32948
14521C2948K8405n1405n0546O1776J11989J3793m4251k6400j6416j2740K0781
$$ 32948 61353 9948 -40598 21178 133167 146960 102709 76309 59893 47153 67934
14510F7934J7102m8886l2804K6423P2333q8774l8278P4207n8362l8863J29756
$$ 67934 85036 36150 3346 29769 102102 13328 -24950 49257 -9105 -47968 81788
14499H1788j5858k1741o4599m3439J28465P7742k3504j29509q8740M7429L3813
$$ 81788 65930 44189 -20410 -63849 64616 142358 118854 -10655 -99395 -51966 -18153
14488a8153P8738j2675o952K958K7170L6907l2265q7476j07822p5776N2593N8704
$$ -18153 60585 47910 40958 43916 71086 107993 75728 -11748 -119570 -195346 -142753 -84049
14476h4049N9975j3280j66O9290O1957k8835K4111k8110q4353N6292K0862q1924
$$ -84049 -24074 -37354 -37520 31770 93727 64892 89003 60893 -23460 32832 53694 -28230
14464b8230K3023N9313k3300p4672K1980J03103K4662j8272j20863j00252K3622
$$ -28230 -5207 54106 30806 -43866 -21886 81217 105879 87607 -33256 -133508 -109886
14453a09886M3867L9358P235M3588j7600M8615j01430j8956Q1247O907J8663J4315
$$ -109886 -66019 -26661 -19426 24162 6562 55177 -46253 -65209 16038 22945 41608 55923
14441E5923j08151m0900R567M6637j8155J3076O930l7384l8792K628M4505m3101
$$ 55923 -52228 -93128 -83561 -36924 -55079 -42003 -35073 -72457 -111249 -108621 -64116 -107217
14429a07217M0953P9855R004o7027J6988J05740r8050j24789k4158J01045K5337
$$ -107217 -66264 13591 22595 -44432 -27444 78296 -19754 -144543 -168701 -67656 -42319
14418d2319r9124M5158M7401l4828Q4533K5810m4724k5131l062l8629j3560p8482
$$ -42319 -141443 -96285 -48884 -83712 821 26631 -18093 -43224 -46286 -84915 -98475 -176957
14406a76957K6835L7558J9935J6579k4973J189K144r36K3800N1623L784L917q097
$$ -176957 -150122 -112564 -92629 -76050 -101023 -99834 -97690 -98626 -74826 -23203 -19419 -15502 -23599
14393b3599M6597O1417q3147m0904n003N061l9117K0867K6118J0052n3995j6664
$$ -23599 22998 84415 1268 -39636 -44639 -39578 -78695 -57828 -31710 -21658 -75653 -92317
14381i2317l0567N5174O4732K1462o551J06633n1519o9978Q0162k1591R89J2143
$$ -92317 -122884 -67710 -2978 18484 11933 118566 67047 -2931 77231 55640 56629 68772
14369F8772l4468k8212p524k4502L4858K8338J35534J7072r1351p1438O0863L7166
$$ 68772 34304 6092 -1432 -25934 8924 37262 172796 189868 98517 27079 87942 125108
14357A25108L4209o1216j00580l3897j494l453m0452K999K4185J6558o3422m452
$$ 125108 159317 98101 -2479 -36376 -37870 -41323 -81775 -78776 -54591 -38033 -101455 -105907
14345a05907L7469n7002j9893k2260O9152p6397J04353O5200l0571j0205n5381
$$ -105907 -68438 -125440 -145333 -167593 -98441 -174838 -70485 -5285 -35856 -46061 -101442
14334a01442O0634K1052L2508L260q3025K4802L2150P2522j7528K0067j2601J3905
$$ -101442 -40808 -19756 12752 16012 -67013 -42211 -10061 62461 44933 65000 52399 66304
14322F6304O4195O452N208r2408o135J3832N1394M8590Q7j17854n0020K2821l288
$$ 66304 130499 136951 142159 49751 43616 57448 108842 157432 157519 39665 -10355 12466 9178
14309I178k1786l8952j7589L3018k8217J2465N7448J2934K1144j1739q084N728
$$ 9178 -12608 -51560 -69149 -36131 -64348 -51883 5565 18499 39643 27904 19820 25548
14297B5548j9496K0324l4546l8547M3582N1794M314j057J4890K9362M6320l0653
$$ 25548 6052 26376 -8170 -46717 -3135 48659 52973 51916 66806 96168 142488 111835
14285A11835j4851l905L230N0298k2628j06059j6862n1487K5202k0333k648Q095
$$ 111835 96984 93079 96309 146607 123979 17920 1058 -50429 -25227 -45560 -48208 -40113
14273d0113J3063L2628L9933m4961m8881l6323m7596M1093K9456k043j4920N2864
$$ -40113 -27050 5578 45511 550 -48331 -84654 -132250 -91157 -61701 -63744 -78664 -25800
14261b5800M2114L7995p307K179m2861k928j8923M7130M0860o7050j2912N2050
$$ -25800 16314 54309 47002 49181 6320 3392 -15531 31599 72459 5409 -7503 44547
14249D4547L0388Q282n8814o1466p0280l0056J6888L7244K6830J55527R661l1880
$$ 44547 74935 83217 24403 -37063 -107343 -137399 -120511 -83267 -56437 99090 108751 76871
14237G6871Q3908o783p3403q4671p4155J3227j6611L7100O1300J7006l3970j8337
$$ 76871 160779 153996 80593 -4078 -78233 -65006 -81617 -44517 16783 33789 -181 -18518
14225a8518J6117Q509J4613M4242L5817n2463q1687q6679L2168O8060m1939o6073
$$ -18518 -2401 6108 20721 64963 100780 48317 -33370 -120049 -87881 -19821 -61760 -127833
14213a27833n894M8709M4556N9295j2559q865L9776q5489Q4455k9543o556R7658
$$ -127833 -133727 -85018 -40462 18833 6274 -2591 37185 -48304 36151 6608 52 97710
14201I7710L5566j58m1854m5136p3867l8040J7007L9447J4679J3948K4967M498
$$ 97710 133276 133118 91264 46128 -27739 -65779 -48772 -9325 5354 19302 44269 48767
14189D8767J0156k7204o2783k1204j6932k3171j9699J05809N5469m2501N258M3790
$$ 48767 58923 31719 -31064 -52268 -69200 -92371 -112070 -6261 49208 6707 11965 55755
14177E5755j4657M22k5138J1658m1531J7672l1677j5862L0026L0639q686n4864
$$ 55755 41098 41520 16382 28040 -13491 4181 -27496 -43358 -13332 17307 8621 -46243
14165d6243J0583L1273r094J4078J5557L9006O58j08942Q085N0943j7236m3972
$$ -46243 -35660 -4387 -13481 597 16154 55160 55818 -53124 -45039 5904 -11332 -55304
14153e5304N5382L0876L8456p6783m832l1155L0749J8450k9117O582J05751N2247
$$ -55304 78 30954 69410 -7373 -12205 -43360 -12611 5839 -23278 -16696 89055 141302
14141A41302J0636K1145n2449m6415k7835K1921l9361K6369Q560P4146P6676k0789
$$ 141302 151938 173083 120634 74219 46384 68305 28944 55313 63873 138019 214695 193906
14129A93906q4069M3093K1769o5776o4955J0570M199o0754K367k0312o0304J1861
$$ 193906 109837 152930 174699 108923 43968 54538 58737 -2017 350 -19962 -80266 -68405
14117f8405P0548O1106o195o6512m3157k3929k1135K1160N3476j3408l9625M5026
$$ -68405 2143 63249 57054 -9458 -52615 -76544 -97679 -76519 -23043 -36451 -76076 -31050
14105c1050M1839j5174Q556l2485l5272p9351L016J4383J6803R1752N6044m194
$$ -31050 10789 -4385 4171 -28314 -63586 -142937 -139921 -125538 -108735 -16983 39061 34867
14093C4867R609N546l0212j4355k2111o6063j121M718J5839j9163p8797q722O6453
$$ 34867 44476 50022 19810 5455 -16656 -82719 -83840 -79122 -63283 -82446 -161243 -169965 -103512
14080a03512M6355O5640j121j9188O0018L6352l0522k3647o8964j1818O1511p1999
$$ -103512 -57157 8483 7362 -11826 48192 84544 54022 30375 -38589 -50407 11104 -60895
14068f0895n2775J9494M5497N1703O9740L2369p327m1897q2853P6071j0790q6789
$$ -60895 -113670 -94176 -48679 3024 72764 105133 97806 55909 -26944 49127 38337 -48452
14056d8452m9282L5507Q0494N354m964m9687k9281M5945L0778k7869j8669P5912
$$ -48452 -97734 -62227 18267 23621 18657 -31030 -60311 -14366 16412 -11457 -30126 45786
14044D5786L193l9562k6212M1787K3501j17830j7191P0214K5788n5575O1147q925
$$ 45786 48979 9417 -16795 24992 48493 -69337 -86528 -16314 9474 -46101 15046 6121
14032F121K9705J124n1683j05187J8038M4510K3422L2281L2342M7548m4849L5841
$$ 6121 35826 36950 -14733 -119920 -101882 -57372 -33950 -1669 30673 78221 33372 69213
14020F9213j1449p805r4253K7033P9416Q289K773n1246j43822L4945J04332Q810
$$ 69213 57764 49959 -44294 -17261 62155 70444 73217 21971 -121851 -86906 17426 26236
14008B6236J7714m2389m7567R470J09158J0510l3101K6729n8507p7894m2637J15077
$$ 26236 43950 1561 -46006 -36536 72622 83132 50031 76760 18253 -59641 -102278 12799
13996A2799L7939m4061m3647K3704m5775n40M3986R5862p4816m2953M5108L7346
$$ 12799 50738 6677 -36970 -13266 -59041 -59581 -15595 80267 5451 -37502 7606 44952
13984D4952K3222o8174k0309P5197J7260j2342n330O1338n0884m9817q1698K6044
$$ 44952 68174 0 -20309 54888 72148 59806 54476 115814 64930 15113 -66585 -40541
13972d0541P7769j8578l6145K8934L4544k5773O633l3272l8879N018P0663Q0904
$$ -40541 37228 18650 -17495 11439 45983 20210 26843 -6429 -45308 -40290 30373 111277
13960A11277M600M1896p6311l8210q060l500P7086P4273j03304j44964L2742J2051
$$ 111277 115877 157773 81462 43252 35192 31692 108778 183051 79747 -65217 -32475 -20424
13948b0424p409K7846k4343o4435n7407J7446J1437P5917Q0446o68j04018q5950
$$ -20424 -27833 13 -24330 -88765 -146172 -128726 -117289 -41372 39074 38406 -65612 -151562
13936a51562P624Q860O3426k6189J5290K9061O0141M4256l0055k9258j8359n2731
$$ -151562 -143938 -135078 -71652 -97841 -82551 -53490 6651 50907 20852 -8406 -26765 -79496
13924g9496r5738M7668J66991N8433q8735m3204M2655K9273l994o2982n8590M5777
$$ -79496 -175234 -127566 39425 97858 9123 -34081 8574 37847 33853 -29129 -87719 -41942
13912d1942r604J1269N3668J9497n7983J4553P0820J13657n6071r5431l2857l9330
$$ -41942 -51546 -40277 13391 32888 -25095 -10542 60278 173935 117864 22433 -10424 -49754
13900d9754o9069L9421J06041P5094J4069k2211j08165o196L8684M0093j7953
$$ -49754 -118823 -79402 26639 101733 115802 93591 -14574 -20770 17914 58007 40054
13889D0054j7720k1856m1295L7571M2409m336n7751L5176J7697r4506m9009L6939
$$ 40054 22334 478 -40817 -3246 39163 34827 -22924 12252 29949 -64557 -113566 -76627
13877g6627J1640J2882n1273p7682M6826M5915L4215P8333k2207l6169l7434l3184
$$ -76627 -64987 -52105 -103378 -181060 -134234 -88319 -54104 24229 2022 -34147 -71581 -104765
13865a04765n894m2106j3391O3856N0110N2288J25837L4733q1885J8847K4973
$$ -104765 -110659 -152765 -166156 -102300 -52190 98 125935 160668 78783 97630 122603
13854A22603N2549r7068k5662K4874k5267R2308J0302k8841j2025J5207J1576
$$ 122603 175152 78084 52422 77296 52029 144337 154639 125798 113773 128980 140556
13843A40556p9633J4105q168m079p9393j04320M252J15922R0835J7301M5757K3534
$$ 140556 60923 75028 66860 62781 -16612 -120932 -116680 -758 90077 107378 153135 176669
13831A76669L042k02556r6469N0375L2982O3492r367m0385j18979M9092P5004
$$ 176669 179711 -22845 -119314 -68939 -35957 27535 18168 -22217 -141196 -92104 -17100
13820a7100J6894K5871R6069j5738k6745J17473n1508j14850j0375j1194n0865
$$ -17100 -206 25665 121734 105996 79251 196724 145216 30366 19991 8797 -42068
13809d2068j2293l789Q397K2373o249k7142j129O2265M0206j224k7573P50J3550
$$ -42068 -54361 -58150 -49753 -27380 -33629 -60771 -61900 365 40571 39347 11774 12524 26074
13796B6074J344J4868j3529j2415L5888m914J6649m2853m7225m7194K5441o8309
$$ 26074 27418 42286 28757 16342 52230 47316 63965 21112 -26113 -73307 -47866 -116175
13784a16175K9969K0769J3633L3214m490K5341P182L1199j0877j8956J02570M33
$$ -116175 -86206 -65437 -51804 -18590 -23080 2261 9443 40642 29765 10809 113379 113812
13772A13812k1284m5871J888M2230K4655o0735J9044j0759k5486K6835K40L5578
$$ 113812 92528 46657 48545 90775 115430 54695 73739 62980 37494 64329 64569 100147
13760A00147m2343l3898n4403j987K8682P048R7490O0637m7103J134k6715m9480
$$ 100147 57804 23906 -30497 -32484 -3802 3246 100736 161373 114270 115404 88689 39209
13748C9209j0477P8535k3539n2446O758M3081P739R348N2163j11607n4518O7947
$$ 39209 28732 107267 83728 31282 38040 81121 88860 98208 150371 38764 -15754 52193
13736E2193N0745J4398r677N6757p0016j1878O7190O5310K6140q4071l8916m687
$$ 52193 102938 117336 107659 164416 94400 82522 149712 215022 241162 157091 118175 113488
13724A13488m4099j00975r9908P0978O7964J1000L8354L2742r940j34971q7079
$$ 113488 69389 -31586 -131494 -60516 7448 18448 56802 89544 79604 -55367 -142446
13713a42446O7024l5560M3564K5086M2866R935l775j3903m4084m2961P2977n010
$$ -142446 -75422 -110982 -67418 -42332 534 10469 6694 -7209 -51293 -94254 -21277 -26287
13701b6287L0747O000l1716O703P4021N2045P5791M548j6607K3479J05794N0681
$$ -26287 4460 10460 -21256 -14553 59468 111513 187304 191852 175245 198724 304518 355199
13689C55199K2139J02538k2775p0191j03911j78193r593P1542M9161L3108r6796
$$ 355199 377338 479876 457101 386910 282999 104806 95213 166755 215916 249024 152228
13678A52228n2406q5965n1549m2626K6519O4021J21637M8296j00267j2500K6777
$$ 152228 99822 13857 -37692 -80318 -53799 10222 131859 180155 79888 67388 94165
13667I4165k3428L8637N8318j6313J1119q9145l3548J4581j2322O9705L6959l2089
$$ 94165 70737 109374 167692 151379 162498 73353 39805 54386 42064 111769 148728 116639
13655A16639k7226l7212o3378n0072N1058J08868k0858K391L730J0136L0258j2401
$$ 116639 89413 52201 -11177 -61249 -10191 98677 77819 80210 83940 94076 124334 111933
13643A11933j3832K2514n510k8093N643k3887P1048l4964q542l7988M3452K2793
$$ 111933 98101 120615 115105 87012 92655 68768 139816 104852 96310 58322 101774 124567
13631A24567l0370j2397k4326r1004L7435q971M3558N2744P4709k2607j0984j6121
$$ 124567 94197 81800 57474 -33530 3905 -5066 38492 91236 165945 143338 132354 116233
13619A16233p5869l4426N2726O6331j297R243m6336n8409O8978j9519o0500L9127
$$ 116233 40364 5938 58664 124995 123698 132941 86605 28196 97174 77655 17155 56282
13607E6282N1114m9395k6751j7053k291k8463P1321K0835K5350K2932Q053J4108
$$ 56282 107396 58001 31250 14197 11906 -16557 54764 75599 100949 123881 131934 146042
13595A46042m8934m2258m0306K9363o227k86N9502N501l1954L5646q8186j12329
$$ 146042 97108 54850 14544 43907 37680 37394 96896 102397 70443 106089 17903 -94426
13583i4426j7973J09848J32729O7383p4107j0054J6843r839J9907N1953J8206
$$ -94426 -112399 -2551 130178 197561 123454 113400 130243 120404 140311 192264 210470
13572B10470j0807m7821q6193j3618L613l3319N4681l3767L8422P5145J3297K2117
$$ 210470 199663 151842 65649 52031 55644 22325 77006 43239 81661 156806 170103 192220
13560A92220m2018k6739L4950j741q0706N48J06423Q4521M685l5333k5045J3203
$$ 192220 150202 123463 158413 156672 75966 76514 182937 267458 272143 236810 211765 224968
13548B24968K0844m78m7096p1130n3949m1840J39541J21883m2017o4950N7448
$$ 224968 245812 245334 198238 127108 73159 31319 170860 292743 250726 185776 243224
13537B43224O2651O5331L0405N32M9577j09823K7915M4344j04099o6122O570K7984
$$ 243224 305875 371206 401611 402143 451720 341897 369812 414156 310057 243935 250505 278489
13525B78489J2030P3950N0609O8472l4168p0200l3222p7562K1093K8119j53248
$$ 278489 290519 364469 415078 483550 449382 379182 345960 268398 289491 317610 164362
13514A64362p306J0065r94K8287J58605J4006p8182J082l5370n0765n2964o5420
$$ 164362 157056 167121 166127 194414 353019 367025 288843 289925 254555 203790 150826 85406
13502H5406J9935M0785K279k5464L1141m684R301Q5067L8530L7433n3506k4793
$$ 85406 105341 146126 148405 122941 154082 149398 158699 243766 282296 319729 266223 241430
13490B41430n0365j5458K5353M5733J2202J623p4020j04383o7481L5530K9101
$$ 241430 191065 175607 200960 246693 258895 260518 186498 82115 14634 50164 79265
13479G9265K1804O1710p2787N4785L3014N5638p042m2328k1006K5073L253k2707
$$ 79265 101069 162779 89992 144777 177791 233429 226387 184059 163053 188126 191379 168672
13467A68672o2909q561K6831J7539l056O1786p793n5823l7309Q431j4038R9135
$$ 168672 105763 97202 124033 141572 138516 200302 192509 136686 99377 107808 93770 192905
13455A92905l3127r4731L6157J8206q8855k5116L3218M9839J614P0919J286o351
$$ 192905 159778 65047 101204 119410 30555 5439 38657 88496 90110 161029 162315 155964
13443A55964J1761m3251r9139k4287P4560L7567K6566K1199J3534j9620L6034
$$ 155964 167725 124474 25335 1048 75608 113175 139741 160940 174474 154854 190888
13432A90888k4982m3761l7712O6511O3533P8658K2201K826n0892n1480K584o9917
$$ 190888 165906 122145 84433 150944 214477 293135 315336 318162 267270 215790 218374 148457
13420A48457L398l5210L811L5596l470j5594q8319r474m4434K9422M3157M7357
$$ 148457 151855 116645 120456 156052 152582 136988 48669 39195 -5239 24183 67340 114697
13408A14697N8006l1199N5982K4475K2755Q6573k9639q7748o8138k1581k4132
$$ 114697 172703 141504 197486 221961 244716 331289 301650 213902 145764 124183 100051
13397A00051K0619J6340J0442J1736N7891P1636N7921l4113o0296l9274q3753
$$ 100051 120670 137010 147452 159188 217079 288715 346636 312523 252227 212953 129200
13386A29200M7757J17215M4706j2760r1718J8232L704j3617j0786J8462L1056
$$ 129200 176957 294172 338878 326118 234400 252632 256336 242719 231933 250395 281451
13375B81451j6725J0195L0763L8276J2133l1649J3003R0770M4509J1996n6566
$$ 281451 264726 274921 305684 343960 356093 324444 337447 428217 472726 484722 428156
13364D28156j0409j2230k4387q1267q2204N0725Q8749k3068m938J7822K4639j41179
$$ 428156 417747 405517 381130 299863 217659 268384 357133 334065 329127 346949 371588 230409
13352B30409N0943J4264M0211O6724R0132R0308p2867j16749q2657O5122M7583
$$ 230409 281352 295616 335827 402551 492683 582991 510124 393375 310718 375840 423423
13341D23423K1714L6841j5200R3719P7619r8213l9259k8730M0685j1297L289O3588
$$ 423423 445137 481978 466778 560497 638116 539903 500644 471914 512599 501302 504591 568179
13329E68179Q5628R8334M4358J07205R9435Q0137R6804J55591J06103O7401P5316
$$ 568179 653807 752141 796499 903704 1003139 1083276 1180080 1335671 1441774 1509175 1584491
13318A584491J39497J65282J67477K21593J36411P4423J15M5785O6296l2306l6389
$$ 1584491 1723988 1889270 2056747 2278340 2414751 2489174 2489289 2535074 2601370 2569064 2532675
13307B532675j30136j06926j48503j71078q8208n4152j09306j33730j05241j95058
$$ 2532675 2402539 2295613 2147110 1976032 1887824 1833672 1724366 1590636 1485395 1290337
13297A290337j77114j31319k2420J3787q3099m738q255p6658l7422n791J8967
$$ 1290337 1113223 981904 959484 973271 890172 885434 877179 800521 763099 757308 776275
13286G76275l248k9992q0622j4830L2049o8273l1403M291q0891l3948L369K920
$$ 776275 773027 743035 662413 647583 679632 611359 579956 584247 503356 469408 472777 475697
13274D75697l7995K6841l0513j1791Q8373M6385q2208o2073L4903R9201K4465
$$ 475697 437702 464543 434030 422239 510612 556997 474789 412716 447619 546820 571285
13263E71285j0000N3038m0132l7772L4280Q178J7151m0718N2045L4m9526r4123
$$ 571285 561285 614323 574191 536419 570699 578877 596028 555310 607355 607389 557863 463740
13251D63740j529J9387m158J0124K8400J51438J13285O921q9393q7152k2650l0477
$$ 463740 462211 481598 477440 487564 515964 667402 780687 787608 698215 611063 588413 557936
13239E57936m6848J416l464R438O9728m9033Q3840L5246j01824J3099M6301O3177
$$ 557936 511088 512504 509040 518478 588206 539173 623013 658259 556435 569534 615835 679012
13227F79012j9518k2558n139k6052J27j7403Q951P8294P0471L7179l0331L977
$$ 679012 659494 636936 631797 605745 605872 588469 597420 675714 746185 783364 753033 757010
13215G57010j8162m498K454L3103r738n5582m5315J4598K9986N3040M7398J07486
$$ 757010 738848 734350 736804 769907 760169 704587 659272 673870 703856 756896 804294 911780
13203I11780J41115o9822p0882p6672j3003K5452K8717J7518K3381K4759n6511
$$ 911780 1052895 983073 912191 835519 822516 847968 876685 894203 917584 942343 885832
13192H85832m9140j5981J281K0118P8910N7439J8318k3421k1002k7103M5465N0506
$$ 885832 836692 820711 821992 842110 921020 978459 996777 973356 952354 925251 970716 1021222
13180A021222Q009O957L458L9521J13450N5463l2931J2763J658L3637L1172o5728
$$ 1021222 1029231 1036188 1039646 1079167 1192617 1248080 1215149 1227912 1229570 1263207 1294379 1228651
13168A228651P6868J26377O3846q3108n752R6985J34600Q7778l5751o6220J256
$$ 1228651 1305519 1431896 1495742 1412634 1406882 1503867 1638467 1726245 1690494 1624274 1625530
13157A625530P3868M7838N8293N7872J02440K8343q1059l0164l99Q8241N4163
$$ 1625530 1699398 1747236 1805529 1863401 1965841 1994184 1913125 1882961 1882562 1970803 2024966
13146B024966m2831k0838P3492P1171R9164R2924q741N0642O9138p914q787P1981
$$ 2024966 1982135 1961297 2034789 2105960 2205124 2298048 2289307 2339949 2409087 2401173 2392386 2464367
13134B464367R0646K364P8629J34283O7502M6681N8824O8221O0465M9988Q5258
$$ 2464367 2555013 2557377 2636006 2770289 2837791 2884472 2943296 3011517 3071982 3121970 3207228
13123C207228J93310K00402J20169M2988J57457J06654K07167J69458J58735K72478
$$ 3207228 3400538 3600940 3721109 3764097 3921554 4028208 4235375 4404833 4563568 4836046
13113D836046K48613K99087K80437K94574L42663L13967M94412N66294M62125
$$ 4836046 5084659 5383746 5664183 5958757 6301420 6615387 7109799 7676093 8138218
13104H138218M74341O32546P61428R08919R58352J032867J265536J346230J556435
$$ 8138218 8612559 9245105 10006533 10915452 11873804 12906671 14172207 15518437 17074872
13095A7074872J726807K056175K320773K624971L042370L501496M150230M725336
$$ 17074872 18801679 20857854 23178627 25803598 28845968 32347464 36497694 41223030
13087D1223030N292255N657210N954101O030775N787018N199675M145641K771978
$$ 41223030 46515285 52172495 58126596 64157371 69944389 75144064 79289705 82061683
13079H2061683J104633p54489k546659m248213n555176o254515o597476o486506
$$ 82061683 83166316 82411827 79865168 75616955 70061779 63807264 57209788 50723282
13071E0723282n937981n349589m731165l997188l500299k965277k499836k112003
$$ 50723282 44785301 39435712 34704547 30707359 27207060 24241783 21741947 19629944
13063A9629944j921081j563175j338536j200804j009517r74256r55013q26195
$$ 19629944 17708863 16145688 14807152 13606348 12596831 11622575 10667562 9841367
13055I841367o31262o06063o26417n71131m95895l22140l06343l84658m11488
$$ 9841367 9210105 8604042 7977625 7406494 6910599 6588459 6282116 5897458 5485970
13046E485970l00412k57635k39373j59006j41437j39330j48065j77650j79323
$$ 5485970 5185558 4927923 4688550 4529544 4388107 4248777 4100712 3923062 3743739
13037C743739r9487j39559j97294j17779k7369j25755r2667p6987j08749j20924
$$ 3743739 3644252 3504693 3307399 3189620 3162251 3036496 2943829 2866842 2758093 2637169
13027B637169n2162j9022p1207j07086j14414M3054l7200l6781L6547n3272j03572
$$ 2637169 2585007 2565985 2494778 2387692 2273278 2316332 2279132 2242351 2278898 2225626 2122054
13016B122054n3979p9999l1823J3359l6493m4986m2840o5529O974K1888l3308
$$ 2122054 2068075 1988076 1956253 1969612 1933119 1888133 1845293 1779764 1786738 1808626 1775318
13005A775318j6179L5333l9731L4131M8316J2707K7309O3608k360q2859m9496
$$ 1775318 1759139 1794472 1754741 1788872 1837188 1849895 1877204 1940812 1938452 1855593 1806097
12994A806097p5371o6857j7054K0287m6524L8717R168j234k3285m2505k8051P9828
$$ 1806097 1730726 1663869 1646815 1667102 1620578 1659295 1668463 1667229 1643944 1601439 1573388 1653216
12982A653216M5858j39975m6157O073j2974R757L1454k0190p5250n0445N5115
$$ 1653216 1699074 1559099 1512942 1519015 1506041 1515798 1547252 1527062 1451812 1401367 1456482
12971A456482k5629j9360L085r78K7810N7317k629P3488O4625m8097p6336L1028
$$ 1456482 1430853 1411493 1414578 1413600 1441410 1498727 1496098 1569586 1634211 1586114 1509778 1540806
12959A540806M8332p1007m1024K9528M2817K2220q7833m8801l6731K9704J22589
$$ 1540806 1589138 1518131 1477107 1506635 1549452 1571672 1483839 1435038 1398307 1428011 1550600
12948A550600J9461q9053k8823L6018j9936m0467j4300O566j2949J4461o380j7015
$$ 1550600 1570061 1481008 1452185 1488203 1468267 1427800 1413500 1420066 1407117 1421578 1415198 1398183
12936A398183J4283l7125O652O8833K6797k331n6933r93J12424j13j03601L717
$$ 1398183 1412466 1375341 1381993 1450826 1477623 1475292 1418359 1417366 1529790 1529677 1426076 1429793
12924A429793L5755k4651O3862R160O3789R0198M7937j2687j14415n0093M5510
$$ 1429793 1465548 1440897 1504759 1513919 1577708 1667906 1715843 1703156 1588741 1538648 1584158
12913A584158O822l4247K0349j0577m7676J2271J09905J9055J8986j2116N2659
$$ 1584158 1590980 1556733 1577082 1566505 1518829 1531100 1641005 1660060 1679046 1666930 1719589
12902A719589K9765R0150L376M0631q4561J6413M3996L7696l9882o2875K0308
$$ 1719589 1749354 1839504 1842880 1883511 1798950 1815363 1859359 1897055 1857173 1794298 1814606
12891A814606M659K4739O0480j8879L6615K0743q0481K165L229O465J0260O0608
$$ 1814606 1819265 1844004 1904484 1885605 1922220 1942963 1862482 1864647 1867876 1874341 1884601 1945209
12879A945209m967k1736m2430m4987K7103M4911O2016P5274q1795n5225K6709
$$ 1945209 1940242 1918506 1876076 1831089 1858192 1903103 1965119 2040393 1958598 1903373 1930082
12868A930082N3474K7317Q2949o6117m477J8916J6956j6614q4977k0981N3286
$$ 1930082 1983556 2010873 2093822 2027705 2023228 2042144 2059100 2042486 1957509 1936528 1989814
12857A989814K3853J03914J4050p5252j9897q0770N6508M3748J8414K4656K0689
$$ 1989814 2013667 2117581 2131631 2056379 2036482 1955712 2012220 2055968 2074382 2099038 2119727
12846B119727R8073J58431R3283J01823J08031N5951J36021O0262N3954Q111Q9658
$$ 2119727 2217800 2376231 2469514 2571337 2679368 2735319 2871340 2931602 2985556 2993667 3083325
12835C083325J07259M8021J7302O903N7101L9273R474K6060l2492o589j5717l8239
$$ 3083325 3190584 3238605 3255907 3262810 3319911 3359184 3368658 3394718 3362226 3355637 3339920 3301681
12823C301681n031k8225K5434P1600O4561J3759Q8883N5076M5901K9142J03321
$$ 3301681 3296650 3268425 3293859 3365459 3430020 3443779 3532662 3587738 3633639 3662781 3766102
12812C766102R7051o0359l7174j8398P1646Q4261M3493J56489J46361Q4812J70630
$$ 3766102 3863153 3802794 3765620 3747222 3818868 3903129 3946622 4103111 4249472 4334284 4504914
12801D504914Q4012J15459j5499L2425O9052M6003K5915Q4620N1645P7388R5337
$$ 4504914 4588926 4704385 4688886 4721311 4790363 4836366 4862281 4946901 4998546 5075934 5171271
12790E171271J27659J59978J72443J25879J07361J06648J63554J09990J09893
$$ 5171271 5298930 5458908 5631351 5757230 5864591 5971239 6134793 6244783 6354676
12781F354676J48326K25438J36707J15124J59698J82877K63586K59348K46589
$$ 6354676 6503002 6728440 6865147 6980271 7139969 7322846 7586432 7845780 8092369
12772H092369L00082J88616J73966K31044K71347K94391J78960J52642K51360
$$ 8092369 8392451 8581067 8755033 8986077 9257424 9551815 9730775 9883417 10134777
12763A0134777J51050J17954J04273K02614J72470K06757K19264K42457J90952
$$ 10134777 10285827 10403781 10508054 10710668 10883138 11089895 11309159 11551616 11742568
12754A1742568J33169K65784L27018L27825L75964L54277K88503L14165L39316
$$ 11742568 11875737 12141521 12468539 12796364 13172328 13526605 13815108 14129273 14468589
12745A4468589L33291L70225M91094M24053M93928N40039O35631O54279N97811
$$ 14468589 14801880 15172105 15663199 16087252 16581180 17121219 17756850 18411129 19008940
12736A9008940O27332P57733Q51304Q76451Q97249R61760J073591J053205J149526
$$ 19008940 19636272 20394005 21245309 22121760 23019009 23980769 25054360 26107565 27257091
12727B7257091J313203J329968J442712J694112J865190J983775K217803K430483
$$ 27257091 28570294 29900262 31342974 33037086 34902276 36886051 39103854 41534337
12719D1534337K726635L081562L490860L976999M537910N099654N829277O607160
$$ 41534337 44260972 47342534 50833394 54810393 59348303 64447957 70277234 76884394
12711G6884394P527982Q529311R899030J1327303J3009157J5153689J7579719
$$ 76884394 84412376 92941687 102840717 114168020 127177177 142330866 159910585
12704A59910585K0202023K3370422K6864753L0288326L3359112L5514086L5769759
$$ 159910585 180112608 203483030 230347783 260636109 293995221 329509307 365279066
12697C65279066L3742554K9503470K3422452J5384741N226947o741114j9216148
$$ 365279066 399021620 428525090 451947542 467332283 472559230 465818116 446601968
12690D46601968k9972629l7088224l9876832l9092384l6107902l2074119k7905557
$$ 446601968 416629339 379541115 339664283 300571899 264463997 232389878 204484321
12683B04484321k3968058k0500299j7606331j5020893j2891142j1059638r563788
$$ 204484321 180516263 160015964 142409633 127388740 114497598 103437960 93874172
12676I3874172q166049p167810o401585n750562n049129m403376m007270l571593
$$ 93874172 85708123 78540313 72138728 66388166 61339037 56935661 52928391 49356798
12668D9356798l191176k997982k780148k580093k269764k001223j754086j671354
$$ 49356798 46165622 43167640 40387492 37807399 35537635 33536412 31782326 30110972
12660C0110972j538487j411997j407160j219577j081897j022874r48353r11185
$$ 30110972 28572485 27160488 25753328 24533751 23451854 22428980 21480627 20569442
12652B0569442q54127q49405p09793p05594o65298o00715n99915m74190m03904
$$ 20569442 19715315 18865910 18156117 17450523 16785225 16184510 15584595 15110405 14706501
12643A4706501l94286m43969m37689m62695m15943m23139l74160l57935k94164
$$ 14706501 14312215 13868246 13430557 12967862 12551919 12128780 11754620 11396685 11102521
12634A1102521k84727k69486j78736k10532k24721k52713k66204k33689j50319
$$ 11102521 10817794 10548308 10369572 10159040 9934319 9681606 9415402 9181713 9031394
12625I031394j93099j66667j67151k09167j55025j78470n6949n3925k51021j99487
$$ 9031394 8838295 8671628 8504477 8295310 8140285 7961815 7904866 7850941 7599920 7400433
12615G400433j22598j84442j05826j38261k19310k56464k60961j92552j73253
$$ 7400433 7277835 7093393 6987567 6849306 6629996 6373532 6112571 5920019 5746766
12606E746766o4494m7410j77510j83111j25121j39805o7276j97116j84835q7814
$$ 5746766 5682272 5634862 5457352 5274241 5149120 5009315 4942039 4744923 4560088 4472274
12596D472274j744q9177j25124r7324m7824j24947j83289j34618n5030o0829K5719
$$ 4472274 4470530 4381353 4256229 4158905 4111081 3986134 3802845 3668227 3613197 3552368 3578087
12585C578087n3108r3177P3871J7760j10487j17544p2567p4630p7358p2363o5085
$$ 3578087 3524979 3431802 3505673 3523433 3412946 3295402 3222835 3148205 3070847 2998484 2933399
12574B933399J4782m4203l6879K1100O180l0146q0902j07528q3059N030m6746
$$ 2933399 2948181 2903978 2867099 2888199 2894379 2864233 2783331 2675803 2592744 2597774 2551028
12563B551028j46571j8823L7947j8745m3419p7085j34496K8972o736j01159l8448
$$ 2551028 2404457 2385634 2423581 2404836 2361417 2284332 2149836 2178808 2172072 2070913 2032465
12552B032465k7824L9411n8298K3851q3280k4610K5135n8487n2731R19L1602J9969
$$ 2032465 2004641 2044052 1985754 2009605 1926325 1901715 1926850 1868363 1815632 1816551 1848153 1868122
12540A868122L2366l9727P7872O6917m9285l5694R8012M5283n667j3780r2570
$$ 1868122 1900488 1860761 1938633 2005550 1956265 1920571 2018583 2063866 2058199 2044419 1951849
12529A951849p9676m8837p0663k6990m046k6437q2444m9476m500p5771j09779
$$ 1951849 1872173 1823336 1752673 1725683 1721637 1695200 1612756 1563280 1558780 1483009 1373230
12518A373230j0996Q873J0219l762m4736L7571K2899M4553l4653n3996n510o0831
$$ 1373230 1362234 1371107 1381326 1377564 1332828 1370399 1393298 1437851 1403198 1349202 1343692 1282861
12506A282861j7208k1439m7386j7336n4817o4333o561j9497M6906N7890o6504
$$ 1282861 1265653 1244214 1196828 1179492 1124675 1060342 1053781 1034284 1081190 1139080 1072576
12495A072576j4966J5356N9255k9171j14814J3118j09123r5613J0284N1424L2497
$$ 1072576 1057610 1072966 1132221 1103050 988236 1001354 892231 796618 806902 858326 890823
12484H90823l9659N1598M8921n5220l0256q0965K0521N4696k3227k3652l7827
$$ 890823 851164 902762 951683 896463 866207 785242 805763 860459 837232 813580 775753
12473G75753O8150J4005m1766q1082n5150J335j60l7562N6515K44l8728O832L583
$$ 775753 843903 857908 816142 735060 679910 681245 681085 643523 700038 700282 661554 668386 671969
12460F71969k6673n4211r4733P0544j5787M2942Q5175m3087m1158p3089k4076
$$ 671969 645296 591085 496352 566896 551109 594051 679226 636139 594981 521892 497816
12449D97816J4522K4282m9974M6588P3200m767j05208n2426N8204Q8697L2497
$$ 497816 512338 536620 486646 533234 606434 601667 496459 444033 502237 590934 623431
12438F23431l631N9195j5283J1176j02419o3344K5751L4641l3224n6628q8514
$$ 623431 619800 678995 663712 674888 572469 509125 534876 569517 536293 479665 391151
12427C91151l3102J066P8537J07837N3821L4615j0349p9371n4053M2620J335m5486
$$ 391151 358049 359115 437652 545489 599310 633925 623576 544205 490152 532772 534107 488621
12415D88621o1051O451K3738N1508m5804n8578O3020K9479j6576p487j2610J6003
$$ 488621 427570 434021 457759 509267 463463 404885 467905 497384 480808 473321 460711 476714
12403D76714l6091k789j8221L6832P1380L8894j34220o9529k5005R1142J10133
$$ 476714 440623 437834 419613 456445 527825 566719 432499 362970 337965 429107 539240
12392E39240J6705m4731k1303N399j7120O0274J12361K7653k846j1108j24M9390
$$ 539240 555945 511214 489911 495310 478190 538464 650825 678478 675632 664524 664400 713790
12380G13790K1349j6905o1252m3182K0326l3264L6527P4390o4351o7759p2533
$$ 713790 735139 718234 656982 613800 634126 600862 637389 711779 647428 579669 507136
12369E07136l7479K8886P3746n1376m2769l3269j7770k694j2697O7582K4673r0171
$$ 507136 469657 498543 572289 520913 478144 444875 427105 424411 411714 479296 503969 413798
12357D13798K739J3761q6053P503k031L2258R1697L836l4730o9240j27129q6351
$$ 413798 416537 430298 344245 351748 349717 381975 473672 477508 442778 373538 246409 160058
12345A60058L4486R7370J14792o2301o1204L4805J4122Q3565l0892N6546K3105
$$ 160058 194544 291914 406706 344405 283201 318006 332128 415693 384801 441347 464452
12334D64452L221K6356M5950o0605k7183J6276m9845p4955k5582J25812k8506
$$ 464452 467673 494029 539979 479374 452191 468467 418622 343667 318085 443897 415391
12323D15391r7591k1539R2485O20j07269p972L3906L4901m5545l1845J309L7198
$$ 415391 317800 296261 388746 389366 282097 274125 308031 342932 297387 265542 266851 304049
12311C04049o498p9654k1178Q7763J03777L9292l6535k6225r4491r599P3474p1024
$$ 304049 297551 217897 196719 284482 388259 427551 391016 364791 270300 260701 334175 263151
12299B63151o7072O012J25913J42511j0930n7635m1078r9700j02757l6769j8408
$$ 263151 196079 202091 328004 470515 459585 401950 360872 261172 158415 121646 103238
12288A03238R6166R1876K2000L0745k4446J3707M1450j9600j9818P3759J0632
$$ 103238 199404 291280 313280 344025 319579 333286 374736 355136 335318 409077 419709
12277D19709L1557m860j09595r4943k0770J1922m8187O5302N2992j3249L4167
$$ 419709 451266 446406 336811 241868 221098 233020 184833 250135 303127 289878 324045
12266C24045K9702m4881q15j8965k9479m1479O031N8809J4361j8543R127K0052
$$ 324045 353747 308866 308051 289086 259607 218128 224159 282968 297329 278786 287913 307965
12254C07965n1415J6506k7540q0642N2918O9032j5019K0119K4936n7778K228J2499
$$ 307965 256550 273056 245516 164874 217792 286824 271805 291924 316860 259082 261310 273809
12242B73809L9040O1366j7930j0324j2766n941k2970p7084J7114j6584J3229Q1074
$$ 273809 312849 374215 356285 345961 333195 327254 304284 227200 244314 227730 240959 322033
12230C22033p7376k5431k4018j18405J9351o814n7405P5948P5188J5638K6819
$$ 322033 244657 219226 195208 76803 96154 89340 31935 107883 183071 198709 225528
12219B25528L5368q942j49265p5840R7371N4938M6253O0353K1831n7190j16086
$$ 225528 260896 251954 102689 26849 124220 179158 225411 285764 307595 250405 134319
12208A34319l735o1451M7560k6367L9461M4192K2075o6352M8988M4891R799J1715
$$ 134319 130584 69133 116693 90326 129787 173979 196054 129702 178690 223581 233380 245095
12196B45095k0244p7333n4709j500K6249K7738Q715O17O1213M2289p5623l3063
$$ 245095 224851 147518 92809 91309 117558 145296 154011 154628 215841 258130 182507 149444
12184A49444Q5209N362l9691n5626j259L8458J1382K7609N706o0931P2942P3409
$$ 149444 234653 240015 200324 144698 143439 181897 193279 220888 226594 165663 238605 312014
12172C12014l6929r4000j4798K3519j7161o1357o340l7664N1612l1644l7943m1727
$$ 312014 275085 181085 166287 189806 172645 111288 104948 67284 118896 87252 49309 7582
12160G582J8199J54898P9839m6445M01K9126L346J3585L196m2752k2569q9823
$$ 7582 25781 180679 260518 214073 214474 243600 246946 260531 263727 220975 198406 108583
12148A08583l5503M1014K7684M316K387N1788Q7537K4257o4229l2147J8778k9066
$$ 108583 73080 114094 141778 146094 148481 200269 287806 312063 247834 215687 234465 205399
12136B05399J1629J6072j00692j9950J18474n047n1713N7168L4169J5608L683
$$ 205399 217028 233100 132408 112458 230932 225885 174172 231340 265509 281117 284800
12125B84800M8520K638k5574L7420K1319L8867N2375l859Q5864J00592J76N0698
$$ 284800 333320 335958 310384 347804 369123 407990 460365 456506 542370 642962 643138 693836
12113F93836j6952j01739j01480r8931K2676l7755q3137j45993K2070j3685k3155
$$ 693836 676884 575145 473665 374734 397410 359655 276518 130525 152595 138910 115755
12102A15755k6900M1060O8849k2067m4482Q7193P2218j2750l310o6272l0011R4703
$$ 115755 88855 129915 198764 176697 132215 219408 291626 278876 275566 209294 179283 273986
12090B73986L4215o2792j0580l531L4332J24315P5746M7703q2430k3324N6064
$$ 273986 308201 245409 234829 231298 265630 389945 465691 513394 430964 407640 463704
12079D63704J11192J50713J24695O8035J43315M1586J65198J11456Q0740j2503
$$ 463704 574896 725609 850304 918339 1061654 1103240 1268438 1379894 1460634 1448131
12069A448131p1135k50881j89146j45280j30739j24821j37960p9134n6743o9339
$$ 1448131 1376996 1126115 936969 791689 660950 536129 398169 319035 262292 192953
12059A92953r118k9925L4679o893K4827L6367m250j01138k4095m846J05040J6795
$$ 192953 183835 153910 188589 181696 206523 242890 238640 137502 113407 108561 213601 230396
12047B30396j5418o150P3163J9624J8543j0469p7851o4026N8437J4835L3281R1545
$$ 230396 214978 208828 281991 301615 320158 309689 231838 167812 226249 241084 274365 365910
12035C65910J05916P8674J4764J23639J86790J42591L5735J00151J91769R4497
$$ 365910 471826 550500 565264 688903 875693 1018284 1054019 1154170 1345939 1440436
12025A440436k9785j57572k94079l34822j81077r6438k6153k2036l6884j3703
$$ 1440436 1410651 1253079 959000 624178 443101 346663 320510 298474 261590 247887
12015B47887n9820j29744m982J05831P6040j5099m2638K5948M664N2628M1355
$$ 247887 188067 58323 53341 159172 235212 220113 177475 203423 208087 260715 302070
12004C02070m6828l127J0281j04462j48961o5362J00917J21079L044J5213O107
$$ 302070 255242 252115 262396 157934 8973 -56389 44528 165607 168651 183864 189971
11993A89971N0594j9107K7745M0763J02015M0337N7654n830k6965P0343O4965
$$ 189971 240565 221458 249203 289966 391981 432318 489972 484142 457177 527520 592485
11982E92485M8793m5558r6972r2620m1151j8141l4741k0091j29811j22674P0862
$$ 592485 641278 595720 498748 406128 364977 346836 312095 292004 162193 39519 110381
11971A10381K5152o3517l4908J4566P2775k2448n3146j1539M1542J15129n7839
$$ 110381 135533 72016 37108 51674 124449 102001 48855 37316 78858 193987 136148
11960A36148j8798K167l9047p8964M7629N321J1155M5755N9920Q7108k6342j7722
$$ 136148 117350 119517 80470 1506 49135 54456 65611 111366 171286 258394 232052 214330
11948B14330k9682l5269k3424L2143o4060p3576Q7191j8004l8849N1345j7101
$$ 214330 184648 149379 125955 158098 94038 20462 107653 89649 50800 102145 85044
11937H5044l5860m0425j7405P0521M0028K0573M0910q3522O0027O1339l7812j0837
$$ 85044 49184 8759 -8646 61875 101903 122476 163386 79864 139891 201230 163418 152581
11925A52581l8693p388M7307m9782p9234o9723N7970M5769M3996R7688N6457q3594
$$ 152581 113888 106500 153807 104025 24791 -44932 13038 58807 102803 200491 256948 173354
11913A73354j19625L1269P5118N0808J5289q2317j18290p3182K3103J15509J01638
$$ 173354 53729 84998 160116 210924 226213 143896 25606 -47576 -24473 91036 192674
11902A92674j9189l7783j1070K3876k8060K483O4314j9228q9409J6911O8182M4130
$$ 192674 173485 135702 124632 148508 120448 122931 187245 168017 78608 95519 163701 207831
11890B07831k1749J3410j0924j21548j31492K431J29465P036P5564J8835p8045
$$ 207831 186082 199492 188568 67020 -64472 -62041 67424 74460 150024 168859 90814
11879I0814l6934Q1969N9853j0198q4598n1431K1294k8942n199N5074J18723j8427
$$ 90814 53880 135849 195702 185504 100906 49475 70769 41827 36628 91702 210425 191998
11867A91998l9643Q5156N5853r662j4357l5927m8068l6803L7272J471j1181k4084
$$ 191998 152355 237511 293364 283702 269345 233418 185350 148547 185819 187290 176109 152025
11855A52025j4326j6655N017j1038J9124k5212o0228N3019n3480p0346M628L2332
$$ 152025 137699 121044 126061 115023 134147 108935 48707 101726 48246 -22100 -17472 14860
11843A4860l252l7722l2928O840m0131j5390N8287k7637L1176J19161j23k3905
$$ 14860 11608 -26114 -59042 -52202 -92333 -107723 -49436 -77073 -45897 73264 73141 49236
11831D9236N7141Q155q3244k5430L8686l8304M6616j9665m9439j5969k4525J9293
$$ 49236 106377 114532 31288 5858 44544 6240 52856 33191 -16248 -32217 -56742 -37449
11819c7449N0967K4077j144Q0682P2845p0944l6458l1338r2129L921M2283L3377
$$ -37449 13518 37595 36451 117133 189978 119034 82576 51238 -40891 -36970 5313 38690
11807C8690n287k2783K8253m6034m3568O9502R7828j9552r4760k5202k0191k768
$$ 38690 33403 10620 38873 -7161 -50729 18773 116601 97049 2289 -22913 -43104 -45872
11795d5872k948O3876L8190L399j9390p4487N0042L8899o3048k8398M2824K4498
$$ -45872 -48820 15056 53246 56645 37255 -37232 12810 51709 -11339 -39737 3087 27585
11783B7585M7874J9840q1602o380j0262M3460M9504J3662n2346m6815M3834O5982
$$ 27585 75459 95299 13697 7317 -2945 40515 90019 103681 51335 4520 48354 114336
11771A14336K9099l2177r5558L5390N6220K1672J3181N2910l020m4985j1444K3952
$$ 114336 143435 111258 15700 51090 107310 128982 142163 195073 192053 147068 135624 159576
11759A59576k2126j01726r5174n3573L8168Q3187K4188R570m3254n301L2116r7094
$$ 159576 137450 35724 -59450 -113023 -74855 8332 32520 42090 -1164 -6465 25651 -71443
11747g1443l4041J27188J19311N7050J1514m9736p840l4004M8107m8634r3527
$$ -71443 -105484 21704 141015 198065 209579 159843 152003 117999 166106 117472 23945
11736B3945p4811n5759M1768M9269L3088o885L8721K5189o5727k2504l4294l1109
$$ 23945 -50866 -106625 -64857 -15588 17500 10615 49336 74525 8798 -13706 -48000 -79109
11724g9109J379J6841N6289N5178j1543J69M2047L5538n0179k1265n2473k3761
$$ -79109 -77730 -60889 -4600 50578 39035 39204 81251 116789 66610 45345 -7128 -30889
11712c0889J06492J4683j39830l0476M6739O168l1891M4010P4464m1787K0446
$$ -30889 75603 90286 -49544 -80020 -33281 -27113 -59004 -14994 59470 17683 38129
11701C8129J1892M642P7676M1540j5571L6709l9824j00560p7443j09489p9679
$$ 38129 50021 54663 132339 173879 158308 195017 155193 54633 -22810 -132299 -211978
11690b11978J5013O6577J42573L0578N15J7801J5737q4347J2335Q0637m964l9446
$$ -211978 -196965 -130388 12185 42763 43278 61079 76816 -7531 4804 85441 80477 41031
11678D1031j6313K5315j3570N2610K8968p8103m7983N3529k1606j5003N332L298
$$ 41031 24718 50033 36463 89073 118041 39938 -8045 45484 23878 8875 14207 17505
11666A7505J4529O9440K2460l4417L348K2128p034n7164r2157r517O6808k1781
$$ 17505 32034 101474 123934 89517 92865 114993 107959 50795 -41362 -50879 15929 -5852
11654e852K0695L7307N278O1204J1139n4412j11268L5255J66792J14426K6751
$$ -5852 14843 52150 57428 118632 129771 75359 -35909 -654 166138 280564 307315
11643C07315m5369k2797o7103l3169N832P877N5709q2562q1853M8400k2203J6983
$$ 307315 261946 239149 172046 138877 144709 152586 208295 125733 43880 92280 70077 87060
11631H7060N6452l5771l3158k2001L0016N1489n9330M3804P4709R9970Q8283R2484
$$ 87060 143512 107741 74583 52582 82598 134087 74757 118561 193270 293240 381523 474007
11619D74007O1598P1610P7467Q6262J70852J07884J09242J15383R0898M4877j38315
$$ 474007 535605 607215 684682 770944 941796 1049680 1158922 1274305 1365203 1410080 1271765
11608A271765l01882j99674r2089j02632j16266j13370m3359o233l9823o9866
$$ 1271765 969883 770209 678120 575488 459222 345852 302493 296260 256437 186571
11598A86571o7683N560L1648o1826j8480J0718J4416j8196O6617K2405K893J6465
$$ 186571 118888 124448 156096 94270 75790 86508 100924 82728 149345 171750 174643 191108
11586A91108n0509j7103L2824L0129r2384j01159n7176N2170R7093J8253l3531
$$ 191108 140599 123496 156320 186449 94065 -7094 -64270 -12100 84993 103246 69715
11575F9715K2113n030k0746j7237O913K7325O8833J7700J3875j04613j06618N8674
$$ 69715 91828 86798 66052 48815 55728 83053 151886 169586 183461 78848 -27770 30904
11563C0904M0896N2291m622l1869n7640l2555J9793J816O457l0581k4945K9992
$$ 30904 71800 124091 119469 87600 29960 -2595 17198 19014 25471 -5110 -30055 -63
11551f3J6967M2973l7627M9365M642p4340O0947L6271J6037l1935r1610N2752
$$ -63 16904 59877 22250 71615 76257 1917 62864 99135 115172 83237 -8373 44379
11539D4379J32843r941o4220K8321k0053p7650k12K7623k9801q3745j05661Q5253
$$ 44379 177222 167281 103061 131382 111329 33679 33467 61090 31289 -52456 -158117 -72864
11527g2864M7660K4360L6875j04358L7773J0089O4499n2867l0201J5936m3297
$$ -72864 -25204 -844 36031 -68327 -30554 -20465 44034 -8833 -39034 -23098 -66395
11516f6395k1317l5717M6840R6283N4813M2795l9706P2066J6890L928O9922r4122
$$ -66395 -87712 -123429 -76589 19694 74507 117302 77596 149662 166552 170480 240402 146280
11504A46280j33702j5296Q4034L48m3821l7333M9880N1468M1390o5590J5075j44
$$ 146280 12578 -2718 81316 81664 37843 510 50390 101858 143248 77658 92733 92589
11492I2589j115j04644k6240N6303O671p5750K0220p846l4807r348O6775O5993
$$ 92589 91474 -13170 -39410 16893 23564 -52186 -31966 -39812 -74619 -83967 -17192 48801
11480D8801N383l9529r4252n3683J10343m8338k6980O1472P9747J07292R168j7026
$$ 48801 54184 14655 -79597 -133280 -22937 -71275 -98255 -36783 42964 150256 159424 142398
11468A42398n7682k9250O5195m9522m6264l2124l8386j2214Q8231J3196M1670
$$ 142398 84716 55466 120661 71139 24875 -7249 -45635 -57849 30382 43578 85248
11457H5248O2447k5922m0978k7715O3825P115j07145k933j2775N6420n509m4767
$$ 85248 147695 121773 80795 53080 116905 124020 16875 13942 1167 57587 52078 7311
11445G311j6648L3728R0057L5955j8943l1542m2131l6625J8658P5676k8579p6309
$$ 7311 -9337 24391 114448 150403 131460 99918 57787 21162 39820 115496 86917 10608
11433A0608O2215K2766K6790q626j33108j19575O128M6662J8165j0490N0691n5559
$$ 10608 72823 95589 122379 113753 -19355 -138930 -132802 -86140 -67975 -78465 -27774 -83333
11421h3333P8999j4375k3724J8805N2755J8473n1233K4454Q133K6530M8172o566
$$ -83333 -4334 -18709 -42433 -23628 29127 47600 -3633 20821 28954 55484 103656 97090
11409I7090j15908m9691O3483k2060J2348J0605k1703K3620L0176K8824j16337
$$ 97090 -18818 -68509 -5026 -27086 -14738 -4133 -25836 -2216 27960 56784 -59553
11398e9553L609J15479o257o1629O859p375K0448j2792J8131N0395J9888n815
$$ -59553 -55944 59535 53278 -8351 -1492 -8867 11581 -1211 16920 67315 87203 81388
11386H1388n026K4754o2377n0328L9700m7578J39827J19167j9733o4235o4603
$$ 81388 76362 101116 38739 -11589 28111 -19467 120360 239527 219794 155559 90956
11375I0956P6180P105p6746n6815n3284K0509R6443j1428n677R545o5299m3527
$$ 90956 167136 174241 97495 40680 -12604 7905 104348 92920 87243 96788 31489 -12038
11363a2038N3609P4330M7273m6636J6101q7042m1226K4853j7513N6776R954m9907
$$ -12038 41571 115901 163174 116538 132639 45597 4371 29224 11711 68487 78441 28534
11351B8534J2981n8536q9781j05O0795p205N0854p6767p360j2104J3109J17219
$$ 28534 41515 -17021 -106802 -106907 -46112 -53317 -2463 -79230 -86590 -98694 -85585 31634
11339C1634N4374o8148J8567N3275n8953L6456o0205K367k901J7133J03470j4507
$$ 31634 86008 17860 36427 89702 30749 67205 7000 9367 6466 23599 127069 112562
11327A12562j268m7256q1897J6962M6586k4570K2747O2047k9098l6323J9081L7095
$$ 112562 111294 64038 -17859 -897 45689 21119 43866 105913 76815 40492 59573 96668
11315I6668J9492k7871l2521j1296Q1204j8841m5954o882J5126l4867n4732J5181
$$ 96668 116160 88289 55768 44472 125676 106835 60881 53999 69125 34258 -20474 -5293
11303e293M7591J4105J3966k6625j6994L3550n1569L5810J9681M0510K2737o330
$$ -5293 42298 56403 70369 43744 26750 60300 8731 44541 64222 104732 127469 121139
11291A21139N3168J1244o3754P2236n8205p4633K8512l0127n2353N8395Q7380
$$ 121139 174307 185551 121797 194033 135828 61195 89707 59580 7227 65622 153002
11280A53002q317M7703O7467j1462n5333r4990k7583J3930O29l7666R4023o7o5935
$$ 153002 144685 192388 259855 248393 193060 98070 70487 84417 85046 47380 141403 141336 75401
11267G5401p9349Q1735J16605Q0225O4820n5189o2431o971M402J2314o7775j07088
$$ 75401 -3948 77787 194392 274617 339437 284248 221817 214846 219248 231562 163787 56699
11255E6699N1447M417q6682o3036L619O465m4652J07311Q8656O6751k7677m8182
$$ 56699 108146 112563 25881 -37155 -33536 -27071 -71723 35588 124244 190995 163318 115136
11243A15136r0179o937L9470N8477M830K40j00254k8152Q8735o0902j9802M504
$$ 115136 24957 18020 57490 115967 120797 121037 20783 -7369 81366 20464 662 5166
11231E166k278P0033K8824J8975m2562o0355l4157M7903M6856M0072m2526k1657
$$ 5166 2888 72921 101745 120720 78158 17803 -16354 31549 78405 118477 75951 54294
11219E4294P0568J29032n1600j03304K2242L0085p3596J5931j7215J690N3940
$$ 54294 124862 253894 202294 98990 121232 151317 77721 93652 76437 78127 132067
11208A32067j13102O982J24208M9478q2248l2647m341L2979o1272O8458n0220
$$ 132067 18965 25947 150155 199633 117385 84738 80397 113376 52104 120562 70342
11197G0342K1529J50882N5845p8269j28996l1050O7954L8650J6490J00253L9299
$$ 70342 91871 242753 298598 220329 91333 60283 128237 166887 183377 283630 322929
11186C22929M9480j3560q3210Q1990j5758O640j2474P0254J6528n0242j03872
$$ 322929 372409 358849 275639 357629 341871 348511 336037 406291 422819 372577 268705
11175B68705o9506J1130Q422j9937M3956Q2812j10030k3187l6184j4234L4919
$$ 268705 199199 210329 218751 198814 242770 325582 215552 192365 156181 141947 176866
11164A76866M2552R3994l3660J7314l876r6041j05673q8235M6691R3180j0619
$$ 176866 219418 313412 279752 297066 293190 197149 91476 3241 49932 143112 132493
11153A32493m4544q692M1988N2647o7442o2670J8868K6661L2560j0852K7240M7111
$$ 132493 87949 79257 121245 173892 106450 43780 62648 89309 121869 111017 138257 185368
11141A85368O0727k6747o3591k0676j0528l6451o0302J07844n000r624m2709l2682
$$ 185368 246095 219348 155757 135081 124553 88102 27800 135644 130644 121020 78311 45629
11129D5629R9158N3596j2120L0706j9151j53205j04356M7038L5403L4295k3059
$$ 45629 144787 198383 186263 216969 197818 44613 -59743 -12705 22698 56993 33934
11118C3934J6181M2703L080K5065l833o6830J4275J9023P7316M6453o6889K8266
$$ 33934 50115 92818 95898 120963 117130 50300 64575 83598 160914 207367 140478 168744
11106A68744O0866N3782L6964J0682N5992O1321l5832j6408N0731N235m8032J4414
$$ 168744 229610 283392 320356 331038 387030 448351 412519 396111 446842 452077 404045 418459
11094D18459J1629Q0042P8032P2777J08507j1408L3300N2113L5087q0540j42631
$$ 418459 430088 510130 588162 660939 769446 758038 791338 843451 878538 797998 655367
11083F55367o3524j05177K8641K76J553p3253r8851j12177L6015O9907J4334L4370
$$ 655367 591843 486666 515307 515583 517136 443883 345032 232855 268870 338777 353111 387481
11071C87481J4948n211l7198q6406j1827n0636j0718L010L6135J5813k0458p7241
$$ 387481 402429 397218 360020 273614 261787 211151 200433 203443 239578 255391 234933 157692
11059A57692K2236P2601K4459K1864L7508p192O091L0952k4254q5478J02083r994
$$ 157692 179928 252529 276988 298852 336360 329168 335259 366211 341957 256479 358562 348568
11047C48568j37280M5372O8181N9131Q5120O733l9198k5751k7630R333K0455N4461
$$ 348568 211288 256660 324841 383972 469092 475825 436627 410876 383246 392579 413034 467495
11035D67495j5772o3193K2294j7627k5966J22813M5891n5168N3195P9917o1579
$$ 467495 451723 388530 410824 393197 367231 490044 535935 480767 533962 613879 552300
11024E52300j45843o4132J17478j2696n3207k9922Q3643O1735j6124o6537k2048
$$ 552300 406457 342325 459803 447107 393900 363978 447621 509356 493232 426695 404647
11013D04647K8764J8977l4828J4045l59M213L1062m61p2877j13323n2460J7984
$$ 404647 433411 452388 417560 431605 431246 435459 466521 466060 393183 279860 227400 245384
11001B45384n4339k0113J2080q68q3286k4662J54200P9959j2532j6436j5136k0367
$$ 245384 191045 170932 183012 182144 98858 74196 228396 308355 295823 279387 264251 243884
10989B43884P2398r206k0163l1287m582k7895N6625l6068L8983o4539j9705J3985
$$ 243884 316282 307076 286913 255626 251044 223149 279774 243706 282689 218150 198445 212430
10977B12430k4454O4247K0508j0385q298K2221J5057p0795q445Q6209M6998p0190
$$ 212430 187976 252223 272731 262346 254048 276269 291326 220531 212086 298295 345293 275103
10965B75103p7086m9040k3156P8194J1019l8852K6026J4698K2907m2618K094R302
$$ 275103 198017 148977 125821 204015 215034 176182 202208 216906 239813 197195 199289 208591
10953B08591q4373m178O7536L9171P0989M7694K5456l4152m0524n3031L916n8780
$$ 208591 124218 120040 187576 226747 297736 345430 370886 336734 296210 243179 247095 188315
10941A88315P7100Q4438P5448P1127J0848K9359l417q1128N7078J04590J00887
$$ 188315 265415 349853 425301 496428 507276 536635 533218 452090 509168 613758 714645
10930G14645j5020o8678l7231j1246J1579R937J0072l3000k3171M1839M2310p4779
$$ 714645 699625 630947 593716 582470 594049 603986 614058 581058 557887 599726 642036 567257
10918E67257J6425j0714M0195J7600P20l4502q572M067l4384J9345K2042L3377
$$ 567257 583682 572968 613163 630763 631483 596981 588409 592476 558092 577437 599479 632856
10906F32856N0912l7614l5635O3988P0643J06160K2409j0952Q8454J7739Q5582
$$ 632856 683768 646154 610519 674507 745150 851310 873719 862767 951221 968960 1054542
10895A054542J48555l1867J2179O2969J40079N0107J51430K01736K42490K29860
$$ 1054542 1203097 1171230 1183409 1246378 1386457 1436564 1587994 1789730 2032220 2262080
10885B262080K24561K87782K74210L50209M81910N26530N97735P10490P90533
$$ 2262080 2486641 2774423 3048633 3398842 3880752 4407282 5005017 5715507 6506040
10876F506040P39462O90324N94744L32231J34636j29693l85552o26347q46082
$$ 6506040 7245502 7935826 8530570 8862801 8997437 8867744 8482192 7855845 7009763
10867G009763r70342q40362o22488n10480n35708n18822l24157k05734j33021
$$ 7009763 6039421 5199059 4576571 4066091 3530383 3011561 2687404 2481670 2348649
10858B348649j85256j94853j79670j04734j28251j34698n3761j4906l4392j44846
$$ 2348649 2163393 1968540 1788870 1684136 1555885 1421187 1367426 1352520 1318128 1173282
10848A173282r7968l7521j0521k1964j6726L84m318L9074j1364l038j1373k1221
$$ 1173282 1075314 1037793 1027272 1005308 988582 988966 984648 1023722 1012358 1009320 997947 976726
10836I76726j3190P2452M3924j0061j01297k6737l6701o6455m3203j5804k6436
$$ 976726 963536 1035988 1079912 1069851 968554 941817 905116 838661 795458 779654 753218
10825G53218L9208k4021j8704O6901O0229j1921j0339j8471l0048j9216k0433
$$ 753218 792426 768405 749701 816602 876831 864910 854571 836100 806052 786836 766403
10814G66403M7300l5969q51O5181P3284k5217p4295j7100r738N4845N5021o7913
$$ 766403 813703 777734 776883 842064 915348 890131 815836 798736 788998 843843 898864 830951
10802H30951L2036J8348r351l9564n5683k5735m5386o2021P110R4118J11270L9239
$$ 830951 862987 881335 871984 832420 776737 751002 705616 643595 650705 744823 856093 895332
10790H95332o5152l8600N6564P0431Q519L2741N4470j014O0737R711l7861M7978
$$ 895332 830180 791580 848144 918575 927094 959835 1014305 1013291 1074028 1083739 1045878 1093856
10778A093856l0269L9073k4751j4096Q928r385O8060R5031l8822j20144r9712
$$ 1093856 1063587 1102660 1077909 1063813 1072741 1063356 1131416 1226447 1187625 1067481 967769
10767I67769j5886K5973L0966K6112N5662Q0737K6535o5145k2513q262O6040M8140
$$ 967769 951883 977856 1008822 1034934 1090596 1171333 1197868 1132723 1110210 1101948 1167988 1216128
10755A216128q7530K0343M5273j7384m2759o475J5024L3160O1641J05304N665
$$ 1216128 1128598 1148941 1194214 1176830 1134071 1127596 1142620 1175780 1237421 1342725 1348390
10744A348390n88K5730M324o709J24318J22984N5231O3991j0117M6424r493j3657
$$ 1348390 1347802 1373532 1377856 1371147 1495465 1618449 1673680 1737671 1727554 1773978 1764485 1750828
10732A750828M4857m1348q478L7869P9440M2434O6560J09523N5896L1252Q6690
$$ 1750828 1795685 1754337 1745859 1783728 1863168 1905602 1972162 2081685 2137581 2168833 2255523
10721B255523K0075j7141R0483P2747Q2539J6293N4897L7566O100J21530P2578
$$ 2255523 2275598 2258457 2348940 2421687 2504226 2520519 2575416 2612982 2619082 2740612 2813190
10710B813190R1931O3339M7282R687R827K7988n276L7271P1909K4429j1466L9367
$$ 2813190 2905121 2968460 3015742 3025429 3035256 3063244 3057968 3095239 3167148 3191577 3180111 3219478
10698C219478J32278J47368J44154L6399K8585J62093J40486J9324l9440N7814
$$ 3219478 3351756 3499124 3643278 3679677 3708262 3870355 4010841 4030165 3990725 4048539
10688D048539Q7061J83143K27619K41626J42329R6609R0873J50936J80461K44931
$$ 4048539 4135600 4318743 4546362 4787988 4930317 5026926 5117799 5268735 5449196 5694127
10678E694127K38372L20918L05754J75969K59524L51575L11640L81649M14351
$$ 5694127 5932499 6253417 6559171 6735140 6994664 7346239 7657879 8039528 8453879
10669H453879L91594L79722M19082M94439N35109P59714Q42684J069695J125629
$$ 8453879 8845473 9225195 9644277 10138716 10673825 11433539 12276223 13345918 14471547
10660A4471547J192397J378571J750974K039231K206817K489152K991562L541618
$$ 14471547 15663944 17042515 18793489 20832720 23039537 25528689 28520251 32061869
10652C2061869M182359M925826N938367P336118Q929408J0813638J2899711J4812258
$$ 32061869 36244228 41170054 47108421 54444539 63373947 74187585 87087296 101899554
10644A01899554J5547285J4286301J2109532R799350P252807L440059k914953
$$ 101899554 117446839 131733140 143842672 153642022 160894829 164334888 161419935
10637A61419935j1115788j7693221j9650211j7784052j4634798j1580474q987104
$$ 161419935 150304147 132610926 112960715 95176663 80541865 68961391 59974287
10630E9974287p115125n582443m288261l202942k317463j550907q95830l00171
$$ 59974287 52859162 47276719 42988458 39785516 37468053 35917146 35021316 34721145
10622C4721145J04070L10818N12359O71806P24459O14247M49822M12758N44404
$$ 34721145 34825215 35136033 35648392 36320198 37044657 37658904 38108726 38521484 39065888
10613C9065888R17488J428048J900098K216424K355667K248050K124270J823355
$$ 39065888 39983376 41411424 43311522 45527946 47883613 50131663 52255933 54079288
10605E4079288J166048L35446k70785j83018K88874J144953J724421K027331J951870
$$ 54079288 55245336 55580782 55309997 55126979 55415853 56560806 58285227 60312558 62264428
10596F2264428J721619J361234P06711m49316j822797k937347l142554k669384
$$ 62264428 63986047 65347281 66053992 65604676 63781879 60844532 57701978 55032594
10588E5032594j920059j092376o65953n31515l22090n86968j065766j798568k611694
$$ 55032594 53112535 52020159 51354206 50822691 50500601 49913633 48847867 47049299 44437605
10579D4437605l271137l389494l030936k400347j883809j501849j140964j147653
$$ 44437605 41166468 37776974 34746038 32345691 30461882 28960033 27819069 26671416
10571B6671416j251202j377939j671621j891129k054278k052541j876557j591824
$$ 26671416 25420214 24042275 22370654 20479525 18425247 16372706 14496149 12904325
10563A2904325j376321j135562r48903q15854p71581n81548l81937n17171l63557
$$ 12904325 11528004 10392442 9443539 8627685 7856104 7274556 6892619 6375448 6011891
10554F011891l92733l49999k93686j54675j83918k39191k78171k38057j03890
$$ 6011891 5619158 5269159 4975473 4820798 4636880 4397689 4119518 3881461 3777571
10545C777571j39050k49681j74547j7401J0296j18002j45645j53543k0874l0895
$$ 3777571 3638521 3388840 3214293 3196892 3207188 3089186 2943541 2789998 2769124 2738229
10535B738229n4694j61847j31984j1636j2753m1933j9267J3573p5061p6136o9563
$$ 2738229 2683535 2521688 2389704 2378068 2365315 2323382 2304115 2317688 2242627 2166491 2096928
10524B096928l1724J1922j18198p5390n1642K7806l6186j13725M1411N2638k8284
$$ 2096928 2065204 2077126 1958928 1883538 1831896 1859702 1823516 1709791 1751202 1803840 1775556
10513A775556K0546p2057j59980j74953l9854M387k6520K4398L9667q4688o165
$$ 1775556 1796102 1724045 1564065 1389112 1349258 1353645 1327125 1351523 1391190 1306502 1300337
10502A300337M8728j49014l7530m7219P897J02350q640q0882m4217P0625Q662
$$ 1300337 1349065 1200051 1162521 1115302 1123199 1225549 1216909 1136027 1091810 1162435 1171097
10491A171097j19030q4303J1091j592n3156j7093j7265O6437L365l3963j8606
$$ 1171097 1052067 967764 978855 977263 924107 907014 889749 956186 959551 925588 906982
10480I06982K6232j6299n9922p018n928K628m7207m4469m3807m1056O8879L0417
$$ 906982 933214 916915 856993 849975 844047 846675 799468 754999 711192 670136 739015 769432
10468G69432m0652p2342r6778L7582J9915m9977O3807K2803J1405J008n04L2947
$$ 769432 728780 656438 559660 597242 617157 567180 630987 653790 665195 666203 665699 698646
10456F98646l8347l6690k0222J3176l8809m901L3435l1395p821j01311p7044R184
$$ 698646 660299 623609 603387 616563 577754 572853 606288 574893 567072 465761 388717 397901
10444C97901K7153K0349n9954J425Q7920O0068k8590j13794k2552L7799j3409
$$ 397901 425054 445403 385449 386874 474794 534862 506272 392478 369926 407725 394316
10433C94316N8908O7359p6479k1597m8478k0239L7855m1242N8057N928L3895J9424
$$ 394316 453224 520583 444104 422507 374029 353790 391645 350403 408460 414388 448283 467707
10421D67707l0548o0900r1218L947J31205N4918M3893j7973n0937k9034Q7101
$$ 467707 437159 376259 285041 288988 420193 475111 519004 501031 450094 421060 508161
10410E08161O9008j5551J366n7693l7012r3955K9666L0438l8961J6659J6452J0355
$$ 508161 577169 561618 562984 505291 468279 374324 403990 434428 395467 412126 428578 438933
10398D38933L5542K3676O4012l4854J1355K2830n5455p9477k2136N3344M9598
$$ 438933 474475 498151 562163 527309 538664 561494 506039 426562 404426 457770 507368
10387E07368j9272r8271o7222M4723l455m9516N8844k1523k9597k3411K0219J2849
$$ 507368 488096 389825 322603 367326 363871 314355 373199 351676 322079 298668 318887 331736
10375C31736J7346K3899L4989L8286m6971p5573K6159P6114J7827k0416n0077
$$ 331736 349082 372981 407970 446256 399285 323712 349871 425985 443812 423396 373319
10364C73319K0090o3282l6942J72774J57237r2945j37199l0168p433Q0153O5729
$$ 373319 393409 330127 293185 465959 623196 530251 393052 362884 355451 435604 501333
10353E01333r7261l8254k009q1838k3916M7849l0035n2250j10233j3708N6556
$$ 501333 404072 365818 363809 281971 258055 305904 275869 223619 113386 99678 156234
10342A56234L4718k9340j3285K5119k707N6772L8470K6702Q035l235o2144k5719
$$ 156234 190952 161612 148327 173446 170739 227511 265981 292683 300718 297483 235339 209620
10330B09620P5370L1556N9298k4680J1243k7584J519J4963k4072j8152r3446j21314
$$ 209620 284990 316546 375844 351164 362407 334823 336342 351305 327233 309081 215635 94321
10318I4321N9326J43552J4510j58348l1979K0231j1393J9807K0788K0902q7735
$$ 94321 153647 297199 311709 153361 121382 141613 130220 150027 170815 191717 103982
10307A03982k059J9271j5751L435J5958l4335m9371J19689L1815L046r8925m6851
$$ 103982 101923 121194 105443 108878 124836 90501 41130 160819 192634 195680 96755 49904
10295D9904O8579N0781j7459J7868L1748L4974j0704o3272n0267k5329M338p523
$$ 49904 118483 169264 151805 169673 201421 236395 225691 162419 112152 86823 91161 83638
10283H3638K7332Q3095L0529M643k7122N0678J3361j07334j5276o6161O763l1328
$$ 83638 110970 194065 224594 229237 202115 252793 266154 158820 143544 77383 84146 52818
10271E2818q2459R9055O569K0081n4620Q5582R8256J3037m5132q7353l0700O3217
$$ 52818 -29641 69414 75983 96064 41444 127026 225282 238319 193187 105834 75134 138351
10259A38351R02K1864l6543O654J22262P2670J2685K6386l3508j24918p5008N5258
$$ 138351 139253 161117 124574 131228 253490 326160 338845 365231 331723 206805 131797 187055
10247A87055Q7416L9008p9940j28571J0161M4697N6302k6967j00408k1588J2985
$$ 187055 274471 313479 233539 104968 115129 159826 216128 189161 88753 67165 80150
10236H0150N0159K3468J8550k1249q3783K0780j0760N804P0126J5665J10268Q3473
$$ 80150 130309 153777 172327 151078 67295 88075 77315 83119 153245 168910 279178 362651
10224C62651l6625p9738k7443j2902l1907k8868l6093J00890p49o2822l5172k9973
$$ 362651 326026 246288 218845 205943 174036 145168 109075 209965 209216 146394 111222 81249
10212H1249M7734J6374q0751P0007J02968j1661L4336M2423K4911l9299n2868
$$ 81249 128983 145357 64606 134613 237581 225920 260256 302679 327590 288291 235423
10201B35423N1962O2182R9118N8167n2330j28782q8962N1583O1930J44234P2735
$$ 235423 287385 349567 448685 506852 454522 325740 236778 288361 350291 494525 567260
10190E67260J05063O0129R8902P8711N4105n06J7658j53581r3505r1718l8793
$$ 567260 672323 732452 831354 910065 964170 963664 981322 827741 734236 642518 603725
10179F03725p985j43219l3559Q9772L7247l3709K9713o4646m9572M4936M256o0024
$$ 603725 595740 452521 418962 508734 545981 512272 541985 477339 427767 472703 476959 416935
10167D16935k2577M9773p214j2500j6196M1447M8226p3146j23351L4245Q2883
$$ 416935 394358 444131 436917 424417 408221 449668 497894 424748 301397 335642 418525
10156D18525J5918P591l5088n3157m2000O1654K2630J6567k567k1270l3227O0540
$$ 418525 434443 442034 406946 353789 311789 373443 396073 412640 410073 388803 355576 416116
10144D16116L7502r0059n4472K3704p2070p2882q5458P319O5426Q7350R4415M8101
$$ 416116 453618 363559 309087 332791 260721 187839 102381 109700 175126 262476 356891 404992
10132D04992l5388p7725l2063q4263j07948K1015K7641J5298J3297Q5172R548
$$ 404992 369604 291879 259816 175553 67605 88620 116261 131559 144856 230028 239576
10121B39576j33332n227M9198o3156M6228N6969j9890m8537j0513K646J8226o2358
$$ 239576 106244 101017 150215 87059 133287 190256 170366 121829 111316 113962 132188 69830
10109F9830q909M3831Q1248l0745j05743l2974J1020k4419N0803K0600M6862K1713
$$ 69830 60921 104752 186000 155255 49512 16538 27558 3139 53942 74542 121404 143117
10097A43117o6104L7652O8492j4073o4725q7534N7173K973l1274j1098p0279m8282
$$ 143117 77013 114665 183157 169084 104359 16825 73998 76971 45697 34599 -35680 -83962
10085h3962J055M7722Q4348J45386J3746J2902J0290j4717J3295Q4046n4978j14498
$$ -83962 -82907 -35185 49163 194549 208295 221197 231487 216770 230065 314111 259133 144635
10073A44635r6990j1370J8672K6604O9123N0974j3223o0627K950J9153J3180L1171
$$ 144635 47645 36275 54947 81551 150674 201648 188425 127798 130748 149901 163081 194252
10061A94252K7524K1716P247L3267J6733N7738O6659l1146O9253r645m2488J6796
$$ 194252 221776 243492 250739 284006 300739 358477 425136 393990 463243 453598 411110 427906
10049D27906L5796J6118P1106r501N2831N4886m8942l4719r7734J8684k34p0940
$$ 427906 463702 479820 550926 541425 594256 649142 600200 565481 467747 486431 486197 415257
10037D15257o4511n6927J7021k9123m3565k3432l9226L2709K9389K0322k7669
$$ 415257 350746 293819 310840 281717 238152 214720 175494 208203 237592 257914 230245
10026B30245r3176K0047j1235k321O7320l3025m8480l4002L3192j6562P710Q958
$$ 230245 137069 157116 145881 143560 210880 177855 129375 95373 128565 112003 119713 128671
10014A28671Q8225K5698j2560l7242q7187J4139L0354j5093k7471L5203o2548
$$ 128671 216896 242594 230034 192792 105605 119744 150098 135005 107534 142737 80189
10003H0189q3538n1558k0206r78R2475k9927L3986K6253N7816J1790p2206k3341
$$ 80189 -3349 -54907 -75113 -76091 16384 -13543 20443 46696 104512 116302 44096 20755
9991B0755M2155j8561k4701L3918J00445j7681p8029P6954L8489q8411p8460N2412
$$ 20755 62910 44349 19648 53566 154011 136330 58301 135255 173744 85333 6873 59285
9979E9285j6499m2860J6647l1914M5661m4679k0800O1109J1351P1512L0966m1636
$$ 59285 42786 -74 16573 -15341 30320 -14359 -35159 25950 37301 108813 139779 98143
9967I8143r0342l0288L8125J0831K6340n7008R4898l8793n7848k992R5294r665
$$ 98143 7801 -22487 15638 26469 52809 -4199 90699 51906 -5942 -8934 86360 76695
9955G6695l8806j7828J4387K6823j0737r183K190L0358M6373N1312m4124j17223
$$ 76695 37889 20061 34448 61271 50534 41351 43541 73899 120272 171584 127460 10237
9943A0237k4225K4463j2707O4384L613l6033O507o866N1719j44888r703j1049
$$ 10237 -13988 10475 -2232 62152 65765 29732 36239 29373 81092 -63796 -73499 -84548
9931h4548Q812K2495N8912O2338k0074r9954R388M5245K9123O7131k0804j02990
$$ -84548 -75736 -53241 5671 68009 47935 -52019 -42631 2614 31737 98868 78064 -24926
9919b4926n7677O0263m3171j3125N6394P6369L9441k5006J842k7135o1771o360
$$ -24926 -82603 -22340 -65511 -78636 -22242 54127 93568 68562 70404 43269 -18502 -24862
9907b4862M9213O3918k5604o0949J7965P6652M2425J8917q0754o8458P473k5176
$$ -24862 24351 88269 62665 1716 19681 96333 138758 157675 76921 8463 15936 -9240
9895i240r2999M8290l4160l7544J01260L4339j1817j8978l158j7957R803P1777
$$ -9240 -102239 -53949 -88109 -125653 -24393 9946 -1871 -20849 -24007 -41964 -32161 39616
9883C9616l110o4685N5840m1540j886J42634J6339k4111k0708p7353L9032J25047
$$ 39616 36506 -28179 27661 -13879 -15765 126869 143208 119097 98389 21036 60068 185115
9871A85115L6502n3367l7430j88o4250M5644n0491l7552P5003l2330m7988k2460
$$ 185115 221617 168250 130820 130632 66382 112026 61535 23983 98986 66656 18668 -3792
9859c792k308r2009n9069R2941N8805K8970J7245K4447K0634o2891O903L9454
$$ -3792 -6100 -98109 -157178 -64237 -5432 23538 40783 65230 85864 22973 29876 69330
9847F9330Q7755J8471K7059l7392q7399j7071P2879k508r8740Q226J24225K8018
$$ 69330 157085 175556 202615 165223 77824 60753 133632 131124 32384 40610 164835 192853
9835A92853m1170j07332J9274k7675P843m1269j9614j2887J2471N7116l6384P164
$$ 192853 151683 44351 63625 35950 43793 2524 -17090 -29977 -17506 39610 3226 10390
9823A0390O5772M8973k9641j9554p2885N4652l1928P6912J12185r6224k1529L7250
$$ 10390 76162 125135 95494 75940 3055 57707 25779 102691 214876 118652 97123 134373
9811A34373M0255o4393n7995l4886M5341j0730j07581n5667j0245M9624P3528
$$ 134373 174628 110235 52240 17354 62695 51965 -55616 -111283 -121528 -71904 1624
9800A624N0627o7469o6831K757N4682l5449J5184O3220M336o3456n3662J5437
$$ 1624 52251 -15218 -82049 -79292 -24610 -60059 -44875 18345 22681 -40775 -94437 -79000
9788g9000J14667K4959k4218L6151o0402k5481K3235r934n659l1178N6861L8196
$$ -79000 35667 60626 36408 72559 12157 -13324 9911 -23 -5682 -36860 20001 58197
9776E8197L5860j5260k855q5859K3564M3541k5240m0296N3505L5440o0336m9417
$$ 58197 94057 78797 75942 -9917 13647 57188 31948 -8348 45157 80597 20261 -29156
9764b9156J1099O3937M3241p203O9815l4913n2603J6453q1161r5560j1236L8889
$$ -29156 -18057 45880 89121 81918 151733 116820 64217 80670 -491 -96051 -107287 -68398
9752f8398J23488O0886m6128m8864j0265K5291N5630K7397k2585l3667p5253l6609
$$ -68398 55090 115976 69848 20984 10719 36010 91640 119037 96452 62785 -12468 -49077
9740d9077K6686k1122k2744M6760K9699k3017p440o138J0367P0705N8124o1733
$$ -49077 -22391 -43513 -66257 -19497 10202 -12815 -20255 -26393 -16026 54679 112803 51070
9728E1070p8176p4K9000N5666l5527J6826M4948M7399k4000m0726Q725m9003m3281
$$ 51070 -27106 -27180 1820 57486 21959 38785 83733 131132 107132 66406 75131 26128 -17153
9715a7153l5352K2370K2315M7083p7363k7143P2820k8398n0886k660r19m9362
$$ -17153 -52505 -30135 -7820 39263 -38100 -65243 7577 -20821 -71707 -74367 -75286 -124648
9703a24648J152J26715j01768R685N8862K9622K4052N583J6732J6308M931K6520
$$ -124648 -123496 3219 -98549 -88864 -30002 -380 23672 29255 45987 62295 67226 93746
9691I3746m900l4091K3943M276k1675k4996j4303L016L9702Q5379J4625j1814
$$ 93746 88846 54755 78698 82974 61299 36303 22000 25016 64718 150097 164722 152908
9679A52908m1909r651q7091l5104j9543m747K9763M4454J3385j1979L9124p1186
$$ 152908 110999 101348 14257 -20847 -40390 -45137 -15374 29080 42465 30486 69610 -1576
9667a576n6725q9809M635M9801k9046N5465R7340K2162Q903l2899j7990j6569
$$ -1576 -58301 -148110 -143475 -93674 -122720 -67255 30085 52247 61150 28251 10261 -6308
9655f308m378l8690J338O8105P8798J15470j3194L9401j0276m8679k9027m413
$$ -6308 -10686 -49376 -48038 20067 98865 214335 201141 240542 230266 181587 152560 148147
9643A48147M3886L4807K3895j4680o2746r5356k5804k0456O2204n931p3542P4383
$$ 148147 192033 226840 250735 236055 173309 77953 52149 31693 93897 87966 14424 88807
9631H8807M2563p5199J7362k1698j8372p1672l8825Q2155J04103q2362j28265
$$ 88807 131370 56171 73533 51835 33463 -38209 -77034 5121 109224 26862 -101403
9620a01403m371P7245O5792J1056r5990N565J0744m9280k4456K9047N2984P9401
$$ -101403 -105774 -28529 37263 48319 -47671 -42106 -31362 -80642 -105098 -76051 -23067 56334
9608E6334r519m6704o0636N1865o4482j9541O5049l3793M2835K5879l1095O5700
$$ 56334 46815 111 -60525 -8660 -73142 -92683 -27634 -61427 -18592 7287 -23808 41892
9596D1892L1325k0816K3372p403m320j4082j0444j1484o6476n8713K030Q4595
$$ 41892 73217 52401 75773 68370 64050 49968 39524 28040 -38436 -97149 -95119 -10524
9584a0524K9014j9980O305l1304K4426j972O3335J26812p8149j24363l4220P151
$$ -10524 18490 -1490 4815 -26489 -2063 -4035 59300 186112 107963 -16400 -50620 -43469
9572d3469J0737J5421m1053k3562n2492L5384K3212J23416N7449o5061N3560j4074
$$ -43469 -32732 -17311 -58364 -81926 -134418 -99034 -75822 47594 105043 39982 93542 79468
9560G9468n6363M2742L2236M8893o2989K38K8452K4272o8102o0065o1803k0879
$$ 79468 23105 65847 98083 146976 83987 84225 112677 136949 68847 8782 -53021 -73900
9548g3900o524K5518J00213K4160n733o1218k6366k2808m8505m90p3762M5967
$$ -73900 -80424 -54906 45307 69467 63734 2516 -23850 -46658 -95163 -95653 -169415 -123448
9536a23448J12515L4251n8020n0701q007m5699O053Q2919r177J259L5727q5211
$$ -123448 -10933 23318 -34702 -85403 -93410 -139109 -133056 -50137 -59314 -58055 -22328 -107539
9524a07539Q6464N7925j2555M234l1493K6409k3940j3086M5776j9585R920r3455
$$ -107539 -21075 36850 24295 28529 -2964 23445 -495 -13581 32195 12610 22530 -70925
9512g0925j0657K7077J18611N7679r0232j15317o6241R2425R1443J4472m1059
$$ -70925 -81582 -54505 64106 121785 31553 -83764 -150005 -57580 33863 48335 7276
9501G276k5148l7856L5267J06724o46Q049J3919r9869J327L5504o1599k1059K3546
$$ 7276 -17872 -55728 -20461 86263 85617 93666 107585 7716 9043 44547 -17052 -38111 -14565
9488a4565k9994J01664K5569p2873N0211j6849M6615k0011J8190P497o2415M4382
$$ -14565 -44559 57105 82674 9801 60012 43163 89778 69767 87957 95454 33039 77421
9476G7421m8940R440r5041n6791j5067j3862l723J25459L3466J9885o86m0557
$$ 77421 28481 37921 -57120 -113911 -128978 -142840 -146563 -21104 12362 32247 31561 -8996
9464h996o0426Q448L652P991N5206o5316n0676j732P1465N9582M7970L1046j5515
$$ -8996 -69422 -60974 -57322 -49331 5875 -59441 -110117 -111849 -40384 19198 67168 98214 82699
9451H2699p2950l208p8307j29220N159J00738M8694q819j544m4098P8894M7943
$$ 82699 9749 6541 -71766 -200986 -195827 -95089 -46395 -55214 -56758 -100856 -21962 25981
9439B5981j5332m0862Q4002R5083l4917j3490m009k2897q5941j54935O5562M7120
$$ 25981 10649 -30213 53789 148872 113955 100465 96456 73559 -12382 -167317 -101755 -54635
9427e4635J5419O1916N0872P8880r2631p8167m702L1342j1525n1612p1571J1680
$$ -54635 -39216 22700 73572 152452 59821 -18346 -23048 8294 -3231 -54843 -126414 -114734
9415a14734L9125M9960K4612M9304M3525M2833r1768K6452k8964m8059l6623l3043
$$ -114734 -75609 -25649 -1037 48267 91792 134625 42857 69309 40345 -7714 -44337 -77380
9403g7380Q8593L4409l5730r1142o3469Q4075J0224m930j6803P4044N3310R9565
$$ -77380 11213 45622 9892 -81250 -144719 -60644 -50420 -55350 -72153 1891 55201 154766
9391A54766m856k4077n2005j20653p7936K5366R4865l2486j5506J0874L1982n3605
$$ 154766 149910 125833 73828 -46825 -124761 -99395 -4530 -37016 -52522 -41648 -9666 -63271
9379f3271P884O052O1397M4284p6379k2800j6422L2658o855m4735J00655P8829
$$ -63271 -55387 -49335 12062 56346 -20033 -42833 -59255 -26597 -33452 -78187 22468 101297
9367A01297m6254L9129L6601m3192j25399n9205R4642o7306l1269j270O9883K7395
$$ 101297 55043 94172 130773 87581 -37818 -97023 -2381 -69687 -100956 -102226 -32343 -4948
9355d948l0675o5844o2525J12669J8322j479k9028j0123J11835k0414L4738J07991
$$ -4948 -35623 -101467 -163992 -51323 -33001 -34480 -63508 -73631 38204 17790 52528 160519
9343A60519l5203o2846M5387k0019o2905p621K5637P0258k254p7886p1104R204
$$ 160519 125316 62470 107857 87838 24933 17312 42949 113207 110953 33067 -38037 -28833
9331b8833N2099L4644n6651Q72j7970k9332L7838J9872k857J0685J13126O3646
$$ -28833 23266 57910 1259 2131 -15839 -45171 -7333 12539 9682 20367 133493 197139
9319A97139j1488o7694j48456j9800j412q662J6112n1576K4338P1398K2036l9570
$$ 197139 185651 117957 -30499 -50299 -51711 -60373 -44261 -95837 -71499 -101 21935 -17635
9307a7635l2914L1627j104K7615K4755k6919n7487l8271j1170R0691P9668m5239
$$ -17635 -50549 -18922 -20026 7589 32344 5425 -52062 -90333 -101503 -10812 68856 23617
9295B3617m0882M7619L3260J4772M2889m0716o8821N270j27478j7495P5478J06367
$$ 23617 -17265 30354 63614 78386 121275 80559 11738 17008 -110470 -127965 -52487 53880
9283E3880L5013n9263N6779J2869j5551q5624r8959q6945l0088O7896K6674P8066
$$ 53880 88893 29630 86409 99278 83727 -1897 -100856 -187801 -217889 -149993 -123319 -45253
9271d5253N4694o4774l3225R9315J2179J1399k8782l6860Q0306l8158j0135m4739
$$ -45253 9441 -55333 -88558 10757 22936 34335 5553 -31307 48999 10841 706 -44033
9259d4033J4927M0606N1139L0938l8411r5432M9783l0362o6999P5073Q1019j792
$$ -44033 -29106 11500 62639 93577 55166 -40266 9517 -20845 -87844 -12771 68248 66456
9247F6456j1695m7786l3827K4569r2405m5529j2023J9379q929K4326R1057M3293
$$ 66456 54761 6975 -26852 -2283 -94688 -140217 -152240 -132861 -141790 -117464 -26407 16886
9235A6886j0065M437N0384p684m5486r5736J9746Q4591j8998o2390L3501N066
$$ 16886 6821 11258 61642 53958 8472 -87264 -67518 17073 -1925 -64315 -30814 -25748
9223b5748L3981K3377m3860J9299m1798J795q2740p8358K740J3548l4086P4555
$$ -25748 8233 31610 -12250 7049 -34749 -32954 -115694 -194052 -191312 -177764 -211850 -137295
9211a37295K01663R9445p3991l6917N8006k6852q212M6007o1515j10039n8901
$$ -137295 64368 163813 89822 52905 110911 84059 75847 121854 60339 -49700 -108601
9200a08601Q4140O1886q8584o0326j7100n0978m4225L6606J28367j514j7504l20
$$ -108601 -24461 37425 -51159 -111485 -128585 -179563 -223788 -187182 -58815 -60329 -77833 -78153
9188g8153N5290N1908k2176l1885o922l5700K4969L1753M6371P163k022R576r2659
$$ -78153 -22863 29045 6869 -25016 -31938 -67638 -42669 -10916 35455 42618 40596 50172 -42487
9175d2487j02029J10448J9453L174l2484m6819k468L6904L9674L5684o7046n1720
$$ -42487 -144516 -34068 -14615 -11441 -43925 -90744 -93212 -56308 -16634 19050 -47996 -99716
9163i9716k1040N9986O3078n7822N0695R803l5981n3914j6087k6155M9853m0661
$$ -99716 -120756 -60770 2308 -55514 -4819 4984 -30997 -84911 -100998 -127153 -77300 -117961
9151a17961J2145M9520p9879P0019N7454O4421q1525o4081o727P8500L8550j1721
$$ -117961 -105816 -56296 -136175 -66156 -8702 55719 -25806 -89887 -96614 -18114 20436 8715
9139H715k1550K4733N753o1037L5017J04390J1287j3781n9648p0326q5706L7176
$$ 8715 -12835 11898 17651 -43386 -8369 96021 107308 93527 33879 -36447 -122153 -84977
9127h4977j0487l3332k9770J50572k702j7012K8031j7967m8984L6078N4759j6733
$$ -84977 -95464 -128796 -158566 -7994 -10696 -27708 323 -17644 -66628 -30550 24209 7476
9115G476R1322m4387l6066j3196N5263J6893K4090o9473l4553Q4931O2124l9284
$$ 7476 98798 54411 18345 5149 60412 77305 101395 31922 -2631 82300 144424 105140
9103A05140k0604J7999o1681j3963J2954j2837L8510j9233q1071n0284J5195L9901
$$ 105140 84536 102535 40854 26891 39845 27008 65518 46285 -34786 -85070 -69875 -29974
9091b9974J44111N276j08917j5373N3942n9497l2945J00785M1928k8948n5101
$$ -29974 114137 119413 10496 -4877 49065 -10432 -43377 57408 99336 70388 15287
9080A5287l8316J906L0999L4885p2093L2068j3078n6182O3000N387l0661k6439
$$ 15287 -23029 -21123 9876 44761 -27332 4736 -8342 -64524 -1524 3863 -26798 -53237
9068e3237j8439R076M3804N8902q357r6997K1898l453K3297k9661M136n595n758
$$ -53237 -71676 -62600 -18796 40106 31749 -65248 -43350 -46803 -23506 -53167 -49031 -54626 -60384
9055f0384M988K1535P3759L4051K2466k2115n6535o6324L1442K019J6984L6229
$$ -60384 -55396 -33861 39898 73949 96415 74300 17765 -48559 -17117 -15098 1886 38115
9043C8115j7795j07569r943j200J1177j9702o4884M2028J27217l7645k7713J21520
$$ 38115 20320 -87249 -97192 -98392 -87215 -106917 -171801 -129773 -2556 -40201 -67914 53606
9031E3606L4782m2628r3034l6608P94j643o929N4046l1497J13796j4865k4930
$$ 53606 88388 45760 -47274 -83882 -83088 -84731 -91660 -37614 -69111 44685 29820 4890
9019D890o2692M2816L1151o9223j7941k2190r6K1907J01224j0169j16756o427
$$ 4890 -57802 -14986 16165 -53058 -70999 -93189 -93285 -71378 29846 19677 -97079 -103506
9007a03506N3584m62P436M8836r0280p1291Q4543L1579j3610J3645L6133k3672
$$ -103506 -49922 -50384 -42948 5888 -84392 -155683 -71140 -39561 -53171 -39526 -3393 -27065
8995b7065q5609O8111K6165p1431n5034M3808M9819j2825L6460R3221L2027N1430
$$ -27065 -112674 -44563 -18398 -89829 -144863 -101055 -51236 -64061 -27601 65620 97647 149077
8983A49077l418o2104j3948M559L6166r611j8777n63q477N763m3182m1934J2319
$$ 149077 145659 83555 69607 74166 110332 100721 81944 81381 72904 78667 35485 -6449 5870
8970E870q288j01783L8419m0084o437J10766L9913m3833q09M0737j5998l9963
$$ 5870 -2418 -104201 -65782 -105866 -112303 -1537 38376 -5457 -6266 34471 18473 -21490
8958b1490n0375p587n4817P001K9262Q2110Q2352J24489n8484j48214j099P285
$$ -21490 -71865 -79452 -134269 -127268 -98006 -15896 66456 190945 132461 -15753 -16852 -9567
8946i567j9360k717r7400n4432K5149n098K6291J2509n5472L2333J30485J41274
$$ -9567 -28927 -31644 -129044 -183476 -158327 -163425 -137134 -124625 -180097 -147764 -17279 123995
8934A23995M2492q3774q966m2924j01139n7614P5242N1946K604l3746l4321l4036
$$ 123995 166487 82713 73747 30823 -70316 -127930 -52688 -742 1862 -31884 -66205 -100241
8922a00241m9672P0535M3063O3019l6482j3799k6410k657J8419l0791l8698M6726
$$ -100241 -149913 -79378 -36315 26704 -9778 -23577 -49987 -52644 -34225 -65016 -103714 -56988
8910e6988L6768k095p2235j21039J2762R654L6381J29098J6481o300J7281j10114
$$ -56988 -20220 -22315 -94550 -215589 -202827 -193173 -156792 -27694 -11213 -17513 -232 -110346
8898a10346j1635n336p6310J11467J28647l2406J5979K8730m8058j1414k2446
$$ -110346 -121981 -127317 -203627 -92160 36487 4081 20060 48790 732 -10682 -33128
8887c3128l965k023J7785l353j9438j05806j6989J37124J9063N4026J3113r8173
$$ -33128 -37093 -39116 -21331 -24684 -44122 -149928 -166917 -29793 -10730 43296 56409 -41764
8875d1764q2337k3940O5991J0228m8260N4733P35P1720k3878l707K5157l9715
$$ -41764 -124101 -148041 -82050 -71822 -120082 -65349 -64614 7106 -16772 -20479 4678 -35037
8863c5037l4507j1376J2904J3410L4014K3741k4733K2035N4706L03K8403L3907
$$ -35037 -69544 -80920 -68016 -54606 -20592 3149 -21584 451 55157 55460 83863 117770
8851A17770J9809j26510j21757l1155M0964L2842k628l7474L2029O8522O83o0335
$$ 117770 137579 11069 -110688 -141843 -100879 -68037 -70665 -108139 -76110 -7588 -6905 -67240
8839f7240O5463k7902k9549M4767k2687l7637O4222k5015k9235M5002n9829k8782
$$ -67240 -1777 -29679 -59228 -14461 -37148 -74785 -10563 -35578 -64813 -19811 -79640 -108422
8827a08422q8584j1364N4283N6751N1379N4880n3258l4368p7249N8897J5234j1612
$$ -108422 -197006 -208370 -154087 -97336 -45957 8923 -44335 -78703 -155952 -97055 -81821 -93433
8815i3433J344M7322K0895k4418l5521M7256M9528q4199n7275K2789M4836O7831
$$ -93433 -92089 -44767 -23872 -48290 -83811 -36555 12973 -71226 -128501 -105712 -60876 6955
8803F955K7604j8009j2975k2292j1904M829L3831K3379J5912K0497q1822J4548
$$ 6955 34559 16550 3575 -18717 -30621 -25792 8039 31418 47330 67827 -13995 553
8791E53j0638o483l1600J33819K1647q0903j18246m3458Q2014J22556K5521k0389
$$ 553 -10085 -16568 -48168 85651 107298 26395 -91851 -135309 -53295 69261 94782 74393
8779G4393o6345q247J18098p1665P8684M9099q3324j30035k7802j0175Q588n417
$$ 74393 8048 -199 117899 46234 124918 174017 90693 -39342 -67144 -77319 -68731 -74148
8767g4148l8446L302K9980l6364j343Q5727K6626m2175l9731K9801O4760K898
$$ -74148 -112594 -109292 -79312 -115676 -117019 -31292 -4666 -46841 -86572 -56771 7989 10887
8755A0887j03032m2895J09700N6148J3708p8568m987J16973M0603j04978J5952
$$ 10887 -92145 -135040 -25340 30808 44516 -34052 -39039 77934 118537 13559 29511
8744B9511j9543N4095r4767k6937L6086M5983O2585J9750j09034q7539L9791L6152
$$ 29511 9968 64063 -30704 -57641 -21555 24428 87013 106763 -2271 -89810 -50019 -13867
8732a3867k371K9463k0704J4989J9274Q1163K3690l3342j03183q7728k0761K9719
$$ -13867 -16238 13225 -7479 7510 26784 107947 131637 98295 -4888 -92616 -113377 -83658
8720h3658L243M6626M2995k6744j2315n6528l6767j33K1968Q6269M5143j6578
$$ -83658 -80415 -33789 9206 -17538 -29853 -86381 -123148 -123281 -101313 -15044 30099 13521
8708A3521j4945R390j2517L8508M6129m6225q092J4123k0427M2526n8669o6385
$$ 13521 -1424 7966 -4551 33957 80086 33861 25769 39892 19465 61991 3322 -63063
8696f3063K3761K8438o080q3037N8355J02089L9311j06289k6478N8819j0031k7377
$$ -63063 -39302 -10864 -16944 -99981 -41626 60463 99774 -6515 -32993 25826 15795 -11582
8684a1582L243j0303K5043n2623k2355j429O2699J789O3575L7926r970l551m4238
$$ -11582 -8339 -18642 6401 -46222 -68577 -70006 -7307 -5518 58057 95983 86013 82462 38224
8671C8224L1397J8023k1228j02072j4729J06593k2642p6892k1019l1174j0079
$$ 38224 69621 87644 66416 -35656 -50385 56208 33566 -43326 -64345 -95519 -105598
8660a05598l7447k0924l1259P059P5435R5229L8338l6187J289M8760Q2757k6976
$$ -105598 -143045 -163969 -195228 -188169 -112734 -17505 20833 -15354 -14065 34695 117452 90476
8648I0476K5510P0688j4177l276k7138k4664N8431k0363j05765o4027o805M62
$$ 90476 115986 186674 172497 169221 142083 117419 175850 155487 49722 -14305 -21110 -20648
8636b0648j075K2576J6080k379j3496Q9622M857q8308l8610r882N9103l5165n8689
$$ -20648 -21723 853 16933 14554 1058 90680 95537 7229 -31381 -41263 17840 -17325 -76014
8623g6014L4551j6330J4106M0578M4162N750M0226m547l0321p6320p3919p4605
$$ -76014 -41463 -57793 -43687 -3109 41053 46803 87029 82482 52161 -24159 -98078 -172683
8611a72683l6950J4980R8428N895O216N7679K786P50l8440L9572k1543j7018P9241
$$ -172683 -209633 -194653 -96225 -90330 -84114 -26435 -23649 -22899 -61339 -21767 -43310 -60328 18913
8598A8913K3616j7295L3546n755m4852k921o5801J2617R9016L3699p367q133m3852
$$ 18913 42529 25234 58780 53025 8173 5252 -60549 -47932 51084 84783 77416 69283 25431
8585B5431n4914J0352N4497q2223r9187L2810O7827J34116j5227j21351o2928
$$ 25431 -29483 -19131 35366 -46857 -146044 -113234 -45407 88709 73482 -47869 -110797
8574a10797j8376N2445k0309p640L6983J2371l0486k2681J03201J1528q4525J2780
$$ -110797 -129173 -76728 -97037 -104677 -67694 -55323 -85809 -108490 -5289 6239 -78286 -65506
8562f5506o7196j5529L3948o718J7274K023M3436M4275L1889l7722n8666r1714
$$ -65506 -132702 -148231 -114283 -121001 -103727 -101704 -58268 -13993 17896 -19826 -78492 -170206
8550a70206K8081Q9015O1606L0410o6083m8102R0942R0657P1616j5410q8208o2634
$$ -170206 -142125 -53110 8496 38906 -27177 -75279 15663 106320 177936 162526 74318 11684
8538A1684m9741j2166P8884L9665n7371P1319R6171r7303m3478N4936M472j317
$$ 11684 -38057 -50223 28661 68326 10955 82274 178445 81142 37664 92600 97072 95755
8526I5755o1505m3746k3178m497O8648J46641J6357p2537n550O019K6727k8228
$$ 95755 34250 -9496 -32674 -37171 31477 178118 194475 121938 116388 122407 149134 120906
8514A20906m5724p269K4672K0199n002k0139K1617J1235o2059L0234O3049j2646
$$ 120906 75182 67913 92585 112784 107782 87643 109260 120495 58436 88670 151719 139073
8502A39073o3492r0535n0682L7047n630l9822L0921J30985N1874k9189o9000j20538
$$ 139073 75581 -14954 -65636 -28589 -34219 -74041 -43120 87865 139739 110550 41550 -78988
8490g8988L1732R4011K1637k0745J6238n2634K154M7171M2252o1650n2450N104
$$ -78988 -47256 46755 68392 47647 63885 11251 13405 60576 102828 41178 -11272 -6168
8478f168M9137r0292l5945L4040L3236J572N6764K8618q3332k2697Q818N3734
$$ -6168 42969 -47323 -83268 -49228 -15992 -14420 42344 70962 -12370 -35067 -26249 27485
8466B7485M988m6995K3197K0087l5887q57q289J27412m1119r0557o1745Q589K9553
$$ 27485 32473 -14522 8675 28762 -7125 -7982 -16271 111141 70022 -20535 -82280 -73691 -44138
8453d4138O3472J7447l9788l568J937m013L8473l9889k9947k2642l3974R880j3545
$$ -44138 19334 36781 -3007 -6575 -4638 -8651 29822 -10067 -40014 -62656 -96630 -86750 -100295
8440a00295M9871J28739K2317n2688k8770J08211K6059l1566o9324l3012l205
$$ -100295 -50424 78315 100632 47944 19174 127385 153444 121878 52554 19542 16337
8429A6337J9523n7285l0148R9313K9829J1343j7900k0781K9370m913R979N457
$$ 16337 35860 -21425 -51573 47740 77569 88912 71012 50231 79601 74688 84667 90124
8417I0124n949m8200P4684M1406o1837k1438k947p8471o013M5309M5315m0544
$$ 90124 84175 35975 110659 152065 90228 68790 65843 -12628 -18641 26668 71983 31439
8405C1439L9240M040p559k0879n8952k724J1464J03094l7822P123R647p9762Q945
$$ 31439 70679 74719 67160 46281 -12671 -15395 -3931 99163 61341 68464 78111 -1651 7294
8392G294R5576J2746o0147m4744J2458N7255o8833j60302j6319j1201L4613M8021
$$ 7294 102870 115616 55469 10725 23183 80438 11605 -148697 -165016 -176217 -141604 -93583
8380i3583R7497L9128N6726m2337p1707k6123j6523p0715M9873J12556O2585q4154
$$ -93583 3914 43042 99768 57431 -14276 -40399 -56922 -127637 -77764 34792 97377 13223
8368A3223n4316k7889O390j9282j8200N597K7863P6407k9089P3641N1686m1769
$$ 13223 -41093 -68982 -62592 -81874 -100074 -94477 -66614 9793 -19296 54345 106031 64262
8356F4262M6342J6817m6367l4435M7625K1868j2744m3025m7629K0576M4349j2213
$$ 64262 110604 127421 81054 46619 94244 116112 103368 60343 12714 33290 77639 65426
8344F5426M3775K0356J6697r3386k1577N9596M3461l534n8818l7285j382q2588
$$ 65426 109201 129557 146254 52868 31291 90887 134348 130814 71996 34711 33329 -49259
8332d9259L0986N4120O4610L6943J29898J24552J51071J71944K10558J42075Q104
$$ -49259 -18273 35847 100457 137400 267298 391850 542921 714865 925423 1067498 1075602
8321A075602l911M2365J27155P6826q4527k33678l03971k75266j58569K092J2324
$$ 1075602 1071691 1114056 1241211 1318037 1233510 999832 695861 420595 262026 264118 276442
8310B76442l2373l1498l894m0024j7080L4079k0188N3383N0189j0886m5953p5956
$$ 276442 244069 212571 208677 168653 151573 185652 165464 218847 269036 258150 212197 136241
8298A36241o8911Q8225J4172j8139o784p9865k0563R6949R0585Q1092m3668o721
$$ 136241 67330 155555 169727 151588 144804 64939 44376 141325 231910 313002 269334 262613
8286B62613P9027P3900J27656J53911K61347K23994K49882K28375J47926K04931
$$ 262613 341640 415540 543196 697107 958454 1182448 1432330 1660705 1808631 2013562
8276B013562K60145K22729Q6912q6477m11100m91548l90080j98672j76528k08332
$$ 2013562 2273707 2496436 2583348 2496871 2085771 1594223 1204143 1005471 828943 620611
8266F20611j12091m678J8458j08053J2103R920k0410r889k9372o1431j5832N7501
$$ 620611 508520 503842 522300 414247 426350 436270 415860 405971 376599 315168 299336 356837
8254C56837M7542n6050o7615n274p0586j45824L5872N6394Q2340J7248J4751L0230
$$ 356837 404379 348329 280714 275440 204854 59030 94902 151296 233636 250884 265635 295865
8242B95865l1396M126N9538P2159O2889O9882J931J76075J64615Q7000P6946J00140
$$ 295865 264469 268595 328133 400292 463181 533063 534994 711069 875684 962684 1039630 1139770
8230A139770R9897L1274j58886k80769j59298k10471j68898p4865J6502O073o2301
$$ 1139770 1239667 1270941 1112055 831286 671988 461517 292619 217754 234256 240329 178028
8219A78028k0468J9794K9468m6866p3972p206k5753o9784p4638J6677J9479R4540
$$ 178028 157560 177354 206822 159956 85984 78778 53025 -16759 -91397 -74720 -55241 39299
8207C9299o1740p3839P9496M9389J2529O164n0014j0941R3160M6179j09243j6107
$$ 39299 -22441 -96280 -16784 32605 45134 51298 1284 -9657 83503 129682 20439 4332
8195D332O3479m0536l6056l2678N4204O2997J0760o1982r6923k5887M2030j7990
$$ 4332 67811 27275 -8781 -41459 12745 75742 86502 24520 -72403 -98290 -56260 -74250
8183g4250m4534L1235O3299m43q9663J19158P7763m1401n3411p562m1397K6774
$$ -74250 -118784 -87549 -24250 -24693 -114356 4802 82565 41164 -12247 -19809 -61206 -34432
8171c4432k3424M545l9230J3273P5553K7844J323m8698M4283J9197J3745k6865
$$ -34432 -57856 -53311 -92541 -79268 -3715 24129 25452 -23246 21037 40234 53979 27114
8159B7114j7918L5535P089p7875p0823k9475k2009O0292o429J8562M1607n387
$$ 27114 9196 44731 51820 -26055 -96878 -126353 -148362 -88070 -94499 -75937 -34330 -39717
8147c9717j4841p912O0827K7815O0845l679j24052r178k5758p2393l9644m66P156
$$ -39717 -54558 -62470 -1643 26172 87017 83338 -40714 -49892 -75650 -148043 -187687 -188153 -180997
8134a80997O8439J02997j9034n8752M601N0449O2516P6001q3633j02035O3600
$$ -180997 -112558 -9561 -28595 -87347 -82746 -32297 30219 106220 22587 -79448 -15848
8123a5848Q152q4445l3108Q5708r439l4117m8335N4494K1984L013M0996m0658
$$ -15848 -7696 -92141 -125249 -39541 -48980 -83097 -131432 -76938 -54954 -51941 -10945 -51603
8111e1603L7663J33914J28256j2732j17156r108m5019l2873m0670j4330n9469
$$ -51603 -13940 119974 248230 235498 118342 109234 64215 31342 -9328 -23658 -83127
8100h3127p6971N6289K8057m7636l873L3215R636K2922N2037J4061K4444j0934
$$ -83127 -160098 -103809 -75752 -123388 -127261 -94046 -84410 -61488 -9451 4610 29054 18120
8088A8120j0079n3954O9319J6705q0559n1208n5060Q0638R2937j6249L0365L2513
$$ 18120 8041 -45913 23406 40111 -40448 -91656 -146716 -66078 26859 10610 40975 73488
8076G3488M4656q973q5046j08323L351N5482O832N5223l9924l9063o9483K4449
$$ 73488 118144 109171 24125 -84198 -80847 -25365 -18533 36690 -3234 -42297 -111780 -87331
8064h7331J8506O9374L1579r0920l6780O1948R5968k0584n2826p600j1162j18563
$$ -87331 -68825 549 32128 -58792 -95572 -33624 62344 41760 -11066 -18666 -29828 -148391
8052a48391r4304M8406J21963R8526r374L8608j6514l2030O7242q527o0159N118
$$ -148391 -242695 -194289 -72326 26200 16826 55434 38920 6890 74132 65605 5446 10564
8040A0564j0680n717q4644p1469Q1548J1767M8398J8058R089J5583J0933J1188
$$ 10564 -116 -5833 -90477 -161946 -80398 -68631 -20233 -2175 6914 22497 33430 44618
8028D4618j1577m7902q2659j4166P3949O1587N8463J8082L1973o008l6643n2392
$$ 44618 33041 -14861 -97520 -111686 -37737 23850 82313 100395 132368 126360 89717 37325
8016C7325l3011J1293k2864J7598n0941j2278k8044P9458M925m6523K2026r198
$$ 37325 4314 15607 -7257 10341 -40600 -52878 -80922 -1464 3461 -43062 -21036 -30234
8004c0234N125M8571N8810L7566O677M50o3812q0044l7153K8922Q9542J5534q5714
$$ -30234 -25109 23462 82272 119838 126515 126965 63153 -16891 -54044 -25122 64420 79954 -5760
7991e760j4430O8774K744n4014K6665j5155j3580Q8006R2706k0643m7587j2542
$$ -5760 -20190 48584 51328 -2686 23979 8824 -4756 83250 175956 155313 107726 95184
7979I5184l3526j5189K1595N0036m4819o7909k6897O988N7442K6105K0717o7426
$$ 95184 61658 46469 68064 118100 73281 5372 -21525 -14537 42905 69010 89727 22301
7967B2301k2776O9061p942o9670R1343o830l7541m2989n7879m0954J15124j8822
$$ 22301 -475 68586 60644 -9026 82317 75487 37946 -5043 -62922 -103876 11248 -7574
7955g574k1864o159n4802m0746j724N0893J12313P2644J9106j636k7547n3442
$$ -7574 -29438 -35597 -90399 -131145 -132869 -81976 30337 102981 122087 120451 92904 39462
7943C9462N4714J07135j637l9334k6216o1430q7800k799L8326M2302Q0912J1286
$$ 39462 94176 201311 199674 160340 134124 72694 -15106 -17905 20421 62723 143635 154921
7931A54921l6580J7606m968q0354R524n4724j6264M6507q6455O711J7754p518
$$ 154921 118341 135947 130979 50625 60149 5425 -10839 35668 -50787 -44076 -26322 -33840
7919c3840L1568q595M7850k4538j23878J6266J18170J7907N450k2644k8875l9743
$$ -33840 -2272 -10867 36983 12445 -111433 -95167 23003 40910 46360 23716 -5159 -44902
7907d4902l477o0434J5244J27814N3460R934o2610k7448j6049m6233k8714K7439
$$ -44902 -48379 -108813 -93569 34245 87705 97639 35029 7581 -8468 -54701 -83415 -55976
7895e5976M0335M2268P876M472L685M5432p827J3218k7664o8412m6490q5296R3111
$$ -55976 -15641 26627 34503 38975 42660 88092 80265 93483 65819 -2593 -49083 -134379 -41268
7882d1268M9955l2072Q778L9036L2017j9686K860l8768n4262J89J8471n584l6375
$$ -41268 8687 -23385 -14607 24429 56446 36760 39620 852 -53410 -53221 -34750 -40334 -76709
7869g6709k537K2579p77j4049L9618k3707J3731L4703j6223L975J321J8230K9142
$$ -76709 -79246 -56667 -57444 -71493 -31875 -55582 -41851 -7148 -23371 -19396 -18075 155 29297
7856B9297j7115j3025M9225k7987m6166P5794l451m6196L6702n7622o7012M49
$$ 29297 12182 -843 48382 20395 -25771 50023 46572 376 37078 -20544 -87556 -87107
7844h7107L5835O5665M034r4242o0282M8071Q9354k2172m7706N512n7947l9895
$$ -87107 -51272 14393 18427 -75815 -136097 -88026 1328 -20844 -68550 -63038 -120985 -160880
7832a60880K2499Q2201l2669n1594l1661M344M8882L0333p596O754P9609N4823
$$ -160880 -138381 -56180 -88849 -140443 -172104 -167760 -118878 -88545 -96141 -89387 -9778 45045
7820D5045N0930o3054n8687n1270n4744P5514J14176K8491k1855n0904j09856
$$ 45045 95975 32921 -25766 -77036 -131780 -56266 57910 86401 64546 13642 -96214
7809i6214l0028Q4027P6754n0494m8195m0703M8335n9608J1350K1828j4667M3466
$$ -96214 -126242 -42215 34539 -15955 -64150 -104853 -56518 -116126 -104776 -82948 -97615 -54149
7797e4149L3458k4590q80j5976L3891K8214m0218k2439l4630L3530L6867k3877
$$ -54149 -20691 -45281 -46161 -62137 -28246 -32 -40250 -62689 -97319 -63789 -26922 -50799
7785e0799O5868n41L0457k019o0320o2930q3597l1138M6382J2442Q6291O5033
$$ -50799 15069 14528 44985 42966 -17354 -80284 -163881 -195019 -148637 -136195 -49904 15129
7773A5129j429m6382r421L8542M3869K5518l3325j2392O6332M3693r875k5414
$$ 15129 13700 -32682 -42103 -3561 40308 65826 32501 20109 86441 130134 120259 94845
7761I4845r12R142q5811m4702K0966P1084l4055m3396p648L521j9282N2787M6658
$$ 94845 93933 103075 17264 -27438 -6472 64612 30557 -12839 -20487 -16966 -36248 16539 63197
7748F3197n3248k691L8471M3676p7314p7069K6748O5874K2018k9589J2657j3581
$$ 63197 9949 7258 45729 89405 12091 -64978 -38230 27644 49662 20073 32730 19149
7736A9149O4144m9156r0570l3687N3585O6808M5003j23782j28965j7491O581J14205
$$ 19149 83293 34137 -56433 -90120 -36535 30273 75276 -48506 -177471 -194962 -188381 -74176
7724g4176J32656O1988l5262l6282m9682q9738l3471O4607l1404n38n109j0562
$$ -74176 58480 120468 85206 48924 -758 -90496 -123967 -59360 -90764 -91302 -96411 -106973
7712a06973L2160Q356K8420l5965J6646M5225N186L1849k109n4906q9055M8157
$$ -106973 -74813 -66457 -38037 -74002 -57356 -12131 -6945 24904 22795 -32111 -121166 -73009
7700g3009m2396O0982l0081m2102K1887j1366k1790J3085P8198L0051K8007K4803
$$ -73009 -115405 -54423 -84504 -126606 -104719 -116085 -137875 -124790 -46592 -16541 11466 36269
7688C6269l5017k8737K0579O9159Q452n0829r7469M8981P6704J9519o2255L2828
$$ 36269 1252 -27485 -6906 62253 70705 19876 -77593 -28612 48092 67611 5356 38184
7676C8184O2105P0587L0905r8668r1963q5889L7565N2811k0639k4778O728N8078
$$ 38184 100289 170876 201781 103113 11150 -74739 -37174 15637 -5002 -29780 -23052 35026
7664C5026l1040o3438l311j0209J4620o4236K6245j33518M1912R7232N7698n2459
$$ 35026 3986 -59452 -62763 -72972 -58352 -122588 -96343 -229861 -187949 -90717 -33019 -85478
7652h5478K4579J03842j5061J5135l1283l7263j907N605m3634L109k0400k7291
$$ -85478 -60899 42943 27882 43017 11734 -25529 -27436 -21831 -65465 -62356 -82756 -110047
7640a10047L799L2610K8451Q8026L2351K637j5900J6362m2771p0193l2347r930
$$ -110047 -106248 -73638 -45187 42839 75190 77827 61927 78289 35518 -34675 -67022 -76952
7628g6952L3792L7355l1327j7817j0232l7074j8507K0703N851L6717q563K5524
$$ -76952 -43160 -5805 -37132 -54949 -65181 -102255 -120762 -100059 -94208 -57491 -66054 -40530
7616d0530J0556j3269O9471L7809k655j6168K3623K3047o996q6126K034M6929
$$ -40530 -29974 -43243 26228 64037 61382 45214 68837 91884 84888 -1238 796 47725
7604D7725Q283r7769K6599J00002M5754p313L5468j4509j47848m3027j2476o673
$$ 47725 56008 -41761 -15162 84840 130594 123281 158749 144240 -3608 -46635 -59111 -65784
7592f5784L7096j3223K4149l601o8560l5153k4655K9563k33Q9408P2742M5106
$$ -65784 -28688 -41911 -17762 -21363 -89923 -125076 -149731 -120168 -120401 -30993 41749 86855
7580H6855j71836j5914O4027J10786K5319l4855o296K7744m9063P819K9536n8181
$$ 86855 -84981 -100895 -36868 73918 99237 64382 58086 85830 36767 44586 74122 15941
7568A5941o8065M0845O286r8295p4736M6593L6978O636J2603M9388L656p9012
$$ 15941 -52124 -11279 -4993 -103288 -178024 -131431 -94453 -87817 -75214 -25826 -22170 -101182
7556a01182n6517R5277J2208J3932Q1021L9509o7769m2439p2284L8862P4515L44
$$ -101182 -157699 -62422 -50214 -36282 44739 84248 16479 -25960 -98244 -59382 15133 15477
7544A5477n5896j11789r975K2674n4925j8040J04547O4839J5340k1151K4892L0590
$$ 15477 -40419 -152208 -162183 -139509 -194434 -212474 -107927 -43088 -27748 -48899 -24007 6583
7532F583m407o4598n179l4266M2225n9947l7595P0205L4945R0230l7810l8911
$$ 6583 2176 -62422 -67601 -101867 -59642 -119589 -157184 -86979 -52034 38196 386 -38525
7520c8525O135P3162M5586J1504m7215m9772q0006n746K7893N8810J23809R8270
$$ -38525 -32390 40772 86358 97862 50647 875 -79131 -84877 -56984 1826 125635 223905
7508B23905n0975k3867r2895p4891J5408k2177j43175j59P3724M9300q949L4130
$$ 223905 172930 149063 56168 -18723 -3315 -25492 -168667 -168826 -95102 -45802 -54751 -20621
7496b0621o2344q3267J5554J01487Q2847j2996p9056o9614M702J1162O9498L0291
$$ -20621 -82965 -166232 -150678 -49191 33656 20660 -58396 -128010 -123308 -112146 -42648 -12357
7484a2357K7936n5854q630O1503P8853K7741k4988j20416q4375l350m565L1840
$$ -12357 15579 -40275 -48905 12598 91451 119192 94204 -26212 -110587 -113937 -118502 -86662
7472h6662O4622r399M2858j02838J2149N6955P7958O8316l4768J2955j5330p3656
$$ -86662 -22040 -31439 11419 -91419 -79270 -22315 55643 123959 89191 102146 86816 13160
7460A3160K9047N5634k0578l218N1106n4427j2311q2762m5871L5688N5905q704
$$ 13160 42207 97841 77263 74045 125151 70724 58413 -24349 -70220 -34532 21373 12669
7448A2669O4891J4212j5562J7766p4099n7822j21185q3893k6502k1587Q4242R3033
$$ 12669 77560 91772 76210 93976 19877 -37945 -159130 -243023 -269525 -291112 -206870 -113837
7436a13837K6750l2868r4403Q2850M2798M8577J5106j5654K8043J02346R5256
$$ -113837 -87087 -119955 -214358 -131508 -88710 -40133 -25027 -40681 -12638 89708 184964
7425A84964J0811q945n0076j04668J5549L0942k4757o6446m4980j0205o3972j9740
$$ 184964 195775 186830 136754 32086 47635 78577 53820 -12626 -57606 -67811 -131783 -151523
7413a51523O1461Q4574L1178l0608l935j2419N638N0928l7195o1906o967R591
$$ -151523 -90062 -5488 25690 -4918 -8853 -21272 -15634 35294 -1901 -63807 -70774 -61183
7401f1183j6007j19043p0686N7731P4408O6048R873o126M8845K9676N6344K9727
$$ -61183 -77190 -196233 -266919 -209188 -134780 -68732 -58859 -64985 -16140 13536 69880 99607
7389I9607k9407j5707P110n340p2681j3236M6900j2467l4854j9933j5570P357
$$ 99607 70200 54493 61603 56263 -16418 -29654 17246 4779 -30075 -50008 -65578 -58221
7377e8221J7484L2883l581o8658J1358k8213k5715Q1079R0697p4248M6227M3692
$$ -58221 -40737 -7854 -11435 -80093 -68735 -96948 -122663 -41584 49113 -25135 21092 64784
7365F4784Q718k2467j26843m3992J5891o3843K3679N6628q748N3249J6578K2971
$$ 64784 73502 51035 -75808 -119800 -103909 -167752 -144073 -87445 -96193 -42944 -26366 -3395
7353c395J11204k7676Q787j0876p818l0397q0845n7845M0961K381n6132L0551
$$ -3395 107809 80133 88920 78044 70226 39829 -41016 -98861 -57900 -55519 -111651 -81100
7341h1100K1919L950K3518M6025m671j8967r8911k4421o7196m445L706K3582J25710
$$ -81100 -59181 -55231 -31713 14312 9641 -9326 -108237 -132658 -199854 -204299 -200593 -177011 -51301
7328e1301J7389n3055l2032N8117m3711l2526J7176J6194q3087k8660M1160L0377
$$ -51301 -33912 -86967 -118999 -60882 -104593 -137119 -119943 -103749 -186836 -215496 -174336 -143959
7316a43959L30L0627R7730j0978r1006K7129n7040J1194R7995l0134K9649q5808
$$ -143959 -143629 -113002 -15272 -26250 -117256 -90127 -147167 -135973 -37978 -68112 -38463 -124271
7304a24271l7152R5546J05908L412J2506O289j350k2800o7385j3723O2466Q570
$$ -124271 -161423 -65877 40031 43443 55949 62238 60888 38088 -29297 -43020 19446 28016
7292B8016M9382N3899L1165o7421m8418j7549j5197l3303O123K0850l340J8768
$$ 28016 77398 131297 162462 95041 46623 29074 13877 -19426 -13303 7547 4207 22975
7280B2975P068O724m8673n2843m9090N2482O5139l7381q4457k5518O2913N8777
$$ 22975 30043 36767 -11906 -64749 -113839 -61357 3782 -33599 -118056 -143574 -80661 -21884
7268b1884j8372p4391K2811K8545j08282q4535p6505J02002J64971j0731o510
$$ -21884 -40256 -114647 -91836 -63291 -171573 -256108 -332613 -230611 -65640 -76371 -82881
7257h2881j370K6311P7115M4543l167M9594j0001j9086j3606p2169R244j0792
$$ -82881 -84251 -57940 19175 63718 60551 110145 100144 81058 67452 -4717 4527 -6265
7245f265J3062L9817j0543j2024M4550Q1261o3517j4335N0820l3116j0540o6887
$$ -6265 6797 46614 36071 24047 68597 149858 86341 72006 122826 89710 79170 12283
7233A2283n7176L3725Q43L3246O5729J5957m1185K2K6663O3003k4857p8457l1653
$$ 12283 -44893 -11168 -10325 22921 88650 104607 63422 63444 90107 153110 128253 49796 18143
7220A8143o6486m7622K4427Q0929N3675J391m5653q60L5243k0449q13O4934J3488
$$ 18143 -48343 -95965 -71538 9391 63066 64457 18804 17944 53187 32738 31925 96859 110347
7207A10347m4109j04755r28Q447K6207q593o4209m3891K8751L703N361N5788O8346
$$ 110347 66238 -38517 -39445 -30998 -4791 -13384 -77593 -121484 -92733 -89030 -83669 -27881 40465
7194D0465j5004k7882Q7515N0281N8261r4707j36699P592j3566j8251R7543J68015
$$ 40465 25461 -2421 85094 135375 193636 98929 -37770 -30178 -43744 -61995 35548 203563
$$ [...]
##END NTUPLES=NMR SPECTRUM
##END=
