##TITLE=Analysis number 323142
Compound Code cc 47501
Book Reference 508/8
Project Code adrs
Chemist Name antons
##JCAMPDX= 6.0         $$ Bruker NMR JCAMP-DX V2.0
##DATA TYPE= NMR SPECTRUM
##DATA CLASS= NTUPLES
##ORIGIN= Bruker BioSpin GmbH
##OWNER= nmr
$$ XWIN-NMR		Version 3.5
$$ Tue Oct 17 16:57:32 2006 GMT Daylight Time (UT+1h)  MAYBRIDGE\nmr@NMR_250MHZ
##.OBSERVE FREQUENCY= 250.131544655141
##.OBSERVE NUCLEUS= ^1H
##.ACQUISITION MODE= SIMULTANEOUS (DQD)
##.ACQUISITION SCHEME= undefined
##.AVERAGES= 16
##.DIGITISER RES= 18
##SPECTROMETER/DATA SYSTEM= dpx250
##.PULSE SEQUENCE= zg30
##.SOLVENT NAME= DMSO
##.SHIFT REFERENCE= (INTERNAL, DMSO, 0, 16.522)
##AUDIT TRAIL= $$ (NUMBER, WHEN, WHO, WHERE, WHAT)
$$ ##TITLE= Audit trail, XWIN-NMR		Version 3.5
$$ ##JCAMPDX= 5.01
$$ ##ORIGIN= Bruker BioSpin GmbH
$$ ##OWNER= nmr
$$ C:\u/data/dgb/nmr/ADRS/740/pdata/1/auditp.txt
$$ ##AUDIT TRAIL=  $$ (NUMBER, WHEN, WHO, WHERE, WHAT)
(   1,<2006-10-17 16:57:10.06 +100>,<MAYBRIDGE\nmr>,<NMR_250MHZ>,
      <created by zg, POWCHK disabled, PULCHK disabled
       configuration hash MD5:
       49 4B E0 1D 92 C2 6B 37 9F E6 65 BC 52 41 86 1D
       data hash MD5: 64K
       CE 11 07 78 E3 D5 ED 4F 83 37 4E F8 AE 31 C2 AE>)
(   2,<2006-10-17 16:57:23.39 +100>,<MAYBRIDGE\nmr>,<NMR_250MHZ>,
      <Start of raw data processing
       ef LB = 0.3 FT_mod = 6 PKNL = 1 SI = 32K 
       data hash MD5: 32K
       F0 90 CA 25 84 38 0B DC 34 EA 12 31 BB 8A 16 01>)
(   3,<2006-10-17 16:57:25.14 +100>,<MAYBRIDGE\nmr>,<NMR_250MHZ>,
      <apk 
       data hash MD5: 32K
       05 FC 36 F9 43 B4 94 0E D5 13 E2 4E D1 AA 87 C3>)
(   4,<2006-10-17 16:57:25.97 +100>,<MAYBRIDGE\nmr>,<NMR_250MHZ>,
      <abs ABSG = 5 
       data hash MD5: 32K
       CD CD 09 7E 1E 30 2D 39 EC 2F AB 21 EC 66 2B F2>)
$$ ##END=
$$ 
$$ hash MD5
$$ F1 F0 2E 38 D7 83 6D 90 8F DE D5 3D 9E 69 52 23
##$RELAX= 
##$RELAX= 
##$RELAX= 
##$RELAX= 
##$RELAX= 
##$RELAX= 
##$RELAX= 
$$ Bruker specific parameters
$$ --------------------------
##$DU= <C:\u>
##$EXPNO= 740
##$NAME= <ADRS>
##$PROCNO= 1
##$TYPE= <nmr>
##$USER= <dgb>
##$AMP= (0..31)
100 100 100 100 100 100 100 100 100 100 100 100 100 100 100 100 100 100 
100 100 100 100 100 100 100 100 100 100 100 100 100 100 
##$AQSEQ= 0
##$AQ_mod= 3
##$AUNM= <au_zg>
##$AUTOPOS= <9 >
##$BF1= 250.13
##$BF2= 250.13
##$BF3= 250.13
##$BF4= 250.13
##$BF5= 500.13
##$BF6= 500.13
##$BF7= 500.13
##$BF8= 500.13
##$BYTORDA= 1
##$CFDGTYP= 0
##$CFRGTYP= 5
##$CHEMSTR= <none>
##$CNST= (0..31)
1 1 145 1 1 1 1 1 1 1 1 1 1 1 1 1 1 1 1 1 1 1 1 1 1 1 1 1 1 1 1 1 
##$CPDPRG= <>
##$CPDPRG1= <>
##$CPDPRG2= <>
##$CPDPRG3= <>
##$CPDPRG4= <mlev>
##$CPDPRG5= <mlev>
##$CPDPRG6= <mlev>
##$CPDPRG7= <mlev>
##$CPDPRG8= <mlev>
##$CPDPRGB= <>
##$CPDPRGT= <>
##$D= (0..31)
0 1 0 0 0 0 0 0 0 0.06 0 0 0 0 0 0 0.0002 0 0 0 0 0 0 0 0 0 0 0 0 0 0 
0 
##$DATE= 1161100629
##$DBL= (0..7)
120 120 120 120 120 120 120 120 
##$DBP= (0..7)
150 150 150 150 150 150 150 150 
##$DBP07= 0
##$DBPNAM0= <>
##$DBPNAM1= <>
$$ [...]
##$SUBNAM7= <"">
##$SUBNAM8= <"">
##$SUBNAM9= <"">
##$SW= 20.6930455092707
##$SWIBOX= (0..15)
0 0 3 0 0 0 0 0 0 0 0 0 0 0 0 0 
##$SW_h= 5175.983436853
##$TD= 65536
##$TD0= 1
##$TE= 683.16
##$TE2= 300
##$TE3= 300
##$TEG= 300
##$TL= (0..7)
0 120 120 120 120 120 120 120 
##$TP= (0..7)
150 150 150 150 150 150 150 150 
##$TP07= 0
##$TPNAME0= <>
##$TPNAME1= <>
##$TPNAME2= <>
##$TPNAME3= <>
##$TPNAME4= <>
##$TPNAME5= <>
##$TPNAME6= <>
##$TPNAME7= <>
##$TPOAL= (0..7)
0.5 0.5 0.5 0.5 0.5 0.5 0.5 0.5 
##$TPOFFS= (0..7)
0 0 0 0 0 0 0 0 
##$TUNHIN= 0
##$TUNHOUT= 0
##$TUNXOUT= 0
##$USERA1= <user>
##$USERA2= <user>
##$USERA3= <user>
##$USERA4= <user>
##$USERA5= <user>
##$V9= 5
##$VALIST= <valist>
##$VCLIST= <CCCCCCCCCCCCCCC>
##$VD= 0
##$VDLIST= <DDDDDDDDDDDDDDD>
##$VPLIST= <PPPPPPPPPPPPPPP>
##$VTLIST= <TTTTTTTTTTTTTTT>
##$WBST= 1024
##$WBSW= 4
##$XGAIN= (0..3)
0 0 0 0 
##$XL= 0
##$YL= 0
##$YMAX_a= 578185
##$YMIN_a= -309871
##$ZGOPTNS= <>
##$ZL1= 120
##$ZL2= 120
##$ZL3= 120
##$ZL4= 120
##$ABSF1= 16.522
##$ABSF2= -4.171173
##$ABSG= 5
##$ABSL= 3
##$ALPHA= 0
##$AQORDER= 0
##$ASSFAC= 0
##$ASSFACI= 0
##$ASSFACX= 0
##$ASSWID= 0
##$AUNMP= <proc_1d>
##$AZFE= 0.1
##$AZFW= 0.1
##$BCFW= 0
##$BC_mod= 0
##$BYTORDP= 0
##$COROFFS= 0
##$CY= 12.5
##$DATMOD= 1
##$DC= 0
##$DFILT= <>
##$DTYPP= 0
##$F1P= 14.0000005364418
##$F2P= -0.99999901652339
##$FCOR= 0.5
##$FTSIZE= 32768
##$FT_mod= 6
##$GAMMA= 0
##$GB= 0
##$INTBC= 1
##$INTSCL= 1
##$ISEN= 128
##$LB= 0.3
##$LEV0= 0
##$LPBIN= 0
##$MAXI= 10000
##$MC2= 0
##$MEAN= 0
##$ME_mod= 0
##$MI= 0
##$NCOEF= 0
##$NC_proc= -4
##$NLEV= 6
##$NOISF1= 0
##$NOISF2= 0
##$NSP= 0
##$NTH_PI= 0
##$NZP= 0
##$OFFSET= 16.522
##$PC= 1
##$PHC0= -61.41286
##$PHC1= 11.57122
##$PH_mod= 1
##$PKNL= yes
##$PPARMOD= 0
##$PSCAL= 4
##$PSIGN= 0
##$REVERSE= no
##$SF= 250.13
##$SI= 32768
##$SIGF1= 0
##$SIGF2= 0
##$SINO= 400
##$SIOLD= 32768
##$SREGLST= <1H.DMSO>
##$SSB= 0
##$STSI= 32768
##$STSR= 0
##$SW_p= 5175.98343685301
##$SYMM= 0
##$S_DEV= 0
##$TDeff= 65536
##$TDoff= 0
##$TI= <Analysis number 999999
Compound Code 99
Book Reference 9
Project Code 9>
##$TILT= no
##$TM1= 0
##$TM2= 0
##$TOPLEV= 0
##$USERP1= <user>
##$USERP2= <user>
##$USERP3= <user>
##$USERP4= <user>
##$USERP5= <user>
##$WDW= 1
##$XDIM= 32768
##$YMAX_p= 432566148
##$YMIN_p= -245514
$$ End of Bruker specific parameters
$$ ---------------------------------
##NTUPLES= NMR SPECTRUM
##VAR_NAME=  FREQUENCY,     SPECTRUM/REAL,   SPECTRUM/IMAG
##SYMBOL=    X,             R,               I
##VAR_TYPE=  INDEPENDENT,   DEPENDENT,       DEPENDENT
##VAR_FORM=  AFFN,          ASDF,            ASDF
##VAR_DIM=   32768,         32768,           32768
##UNITS=     HZ,            ARBITRARY UNITS, ARBITRARY UNITS
##FACTOR=    0.157963299565203, 1,           1
##FIRST=     4132.6476996994, 0,             0
##LAST=      -1043.33573715361, 0,           0
##MIN=       -1043.33573715361, -245514,     0
##MAX=       4132.6476996994, 432566148,     0
$$ Real data points
##PAGE= N=1
##DATA TABLE= (X++(R..R)), XYDATA
$$ [...]
$$ plain form
21132 -29007 23893 44219 39323 92089 115633 78534 25581 -30628 36266 41813 29587 30674
21120 30674 784 35814 34868 -2393 -7727 1761 -21926 -38252 25580 60351 59682 46804 9937
21107 9937 -18504 -49949 -7900 24088 7017 26875 31383 15747 -45217 -49315 -8494 27791
21095 27791 62863 84784 85656 35766 5072 -646 8112 -10014 13149 15751 -14856 -13369 35289
21082 35289 20792 -18218 -12936 -29948 -52420 -39201 -29045 -70654 -60148 -60305 -50495 -24024
21070 -24024 -452 -16066 -35832 -59051 -33653 -75100 -57798 -23482 30241 56749 -9638 -7516
21058 -7516 -38746 -33557 -29355 -49791 -42140 -60213 -119025 -99708 -40771 -6312 17658 -2348
21046 -2348 12878 17216 63553 82582 44301 45539 41348 7944 31486 86946 92488 117370 131494
$$ packed form
21132b9007N2900K0326m896N2766K3544l7099n2953n6209O6894N547j2226J087
21120C0674k9890L5030r46l7261n334R488k3687j6326O3832L4771o69j2878l6867
21107I937k8441l1445M2049L1988j7071J9858M508j5636o0964m098M0821L6285
21095B7791L5072K1921Q72m9890l0694n718Q758j8126K3163K602l0607J487M8658
21082C5289j4497l9010N282j7012k2472J3219J0156m1609J0506j57R810K6471
21070b4024K3572j5614j9766k3219K5398m1447J7302L4316N3723K6508o6387K122
21058g516l1230N189M202k0436P651j8073n8812J9317N8937L4459K3970k0006
21046b348J5226M338M6337J9029l8281J238m191l3404K3542N5460N542K4882J4124
$$ plain form
21033 131494 99934 47105 57081 69679 23501 52050 34396 26776 14822 -8337 -11218 20436
21021 20436 1259 20196 387 -2647 12600 20162 -28875 9017 43174 3531 -1929 -16606
21009 -16606 -13364 -359 21761 49615 36359 12424 -22094 -16949 -14621 -16461 27741 29450 79248
20996 79248 90737 81116 38799 8933 61371 111424 139062 115353 54802 82485 118903 134890
20984 134890 125804 103560 86153 84118 115328 121355 81543 8896 25538 32222 6074 45307
20972 45307 36704 93 30234 52473 55710 73372 11467 -16807 -39270 -78101 -77233 -11878
20960 -11878 -61962 -90499 -99128 -65973 -105316 -80211 -69118 -53204 -20197 -16682 -52359 -40744
20948 -40744 -35145 -57936 -56107 -47393 -50886 -65494 -6162 45563 55777 98378 124704 103019
$$ packed form
21033A31494l1560n2829R976J2598m6178K8549j7654p620j1954k3159k881L1654
21021B0436j9177J8937j9809l034J5247P562m9037L7892L4157l9643n460j4677
21009a6606L242J3005K2120K7854j3256k3935l4518N145K328j840M4202J709M9798
20996G9248J1489r621m2317k9866N2438N0053K7638k3709o0551K7683L6418J5987
20984A34890r086k2244j7407k035L1210O027l9812p2647J6642O684k6148L9233
20972D5307q603l6611L0141K2239L237J7662o1905k8274k2463l8831Q68O5355
20960a1878n0084k8537q629L3155l9343K5105J1093J5914L3007L515l5677J1615
20948d0744N599k2791J829Q714l493j4608N9332N1725J0214M2601K6326k1685
$$ plain form
20936 103019 107900 101512 50483 -9988 26491 44907 69740 64494 12916 57204 93814 77677
20924 77677 47887 76413 117513 128902 121439 96033 122215 139485 82522 12181 -16357 -25693
20912 -25693 49492 51132 66083 66422 76405 98848 95920 115515 154769 103385 107755 58675 54599
20899 54599 88228 146929 217735 248900 254248 267065 324609 427102 576933 730010 871422
20888 871422 1039811 1220639 1406176 1527298 1527343 1444182 1248732 1077266 866666 654888
20878 654888 519593 374806 266766 229394 219683 250529 229449 175220 155014 139048 111677
20867 111677 119465 85407 35498 25471 67446 93070 75288 57370 67429 92509 86059 46527
20855 46527 84165 51817 -16527 5952 95259 82072 8277 53277 93064 23430 -8190 58082
$$ packed form
20936A03019M881o388n1029o0471L6479J8416K4833n246n1578M4288L6610j6137
20924G7677k9790K8526M1100J1389p463k5406K6182J7270n6963p0341k8538r336
20912b5693P5185J640J4951L39R983K2443k928J9595L9254n1384M370m9080m076
20899E4599L3629N8701P0806L1165N348J2817N7544J02493J49831J53077J41412
20888H71422J68389J80828J85537J21122M5q3161j95450j71466k10600k11778
20878F54888j35295j44787j08040l7372r711L0846k1080n4229k0206j5966k7371
20867A11677P788l4058m9909j0027M1975K5624j7782j7918J0059K5080o450l9532
20855D6527L7638l2348o8344K2479Q9307j3187p3795M5000L9787o9634l1620O6272
$$ plain form
20843 58082 79828 48328 25261 46392 32789 58429 39270 60712 60563 38886 17809 -18096
20831 -18096 48006 65868 32154 -1055 25387 64740 34760 45050 13145 73787 89829 63440
20819 63440 20575 39431 79407 81930 89987 91101 51128 28109 18532 -7263 37013 31273 33887
20806 33887 81736 98029 107743 86872 45324 368 23531 43716 52179 3952 18869 48071
20794 48071 52338 57190 33199 10320 -22987 -71078 -119044 -58163 -6310 13467 6267 -42428
20782 -42428 -4031 32993 -24384 -31013 13661 4958 15893 -41198 -33371 15194 9403 22028
20770 22028 33456 41729 40986 36257 46415 27892 23644 27319 25893 39970 68954 23242 -27167
20757 -27167 -4177 38117 52988 32714 22486 28678 -2484 -14994 -40284 -21943 -2340 14133
$$ packed form
20843E8082K1746l1500k3067K1131j3603K5640j9159K1442j49k1677k1077l5905
20831a8096O6102J7862l3714l3209K6442L9353k9980J0290l1905O0642J6042k6389
20819F3440m2865J8856L9976K523Q057J114l9973k3019r577k5795M4276n740K614
20806C3887M7849J6293R714k0871m1548m4956K3163K0185Q463m8227J4917K9202
20794D8071M267M852k3991k2879l3307m8091m7966O0881N1853J9777p200m8695
20782d2428L8397L7024n7377o629M4674q703J0935n7091P827M8565n791J2625
20770B2028J1428Q273p43m729J0158j8523m248L675j426J4077K8984m5712n0409
20757b7167K2990M2294J4871k0274j0228O192l1162j2510k5290J8341J9603J6473
$$ plain form
20745 14133 49579 51755 28298 15546 60300 119593 125372 74523 56035 12661 12232 100765
20733 100765 82518 56443 61219 65468 70750 66195 65005 45959 10660 28130 110084 129500
20721 129500 55336 62282 71946 101600 44993 -39066 -35903 -20642 -24098 9571 -4008 38759
20709 38759 71868 7523 -16375 -2173 14570 -38592 -27220 -8793 10890 -16746 -824 26668
20697 26668 81691 73098 46473 32773 31303 89253 154276 107110 51747 57225 59146 58793 64368
20684 64368 73629 91280 83073 67932 22398 -26689 -39357 18545 113018 138196 97942 16735
20672 16735 -25812 765 38304 25849 62250 94695 143662 156702 154795 148685 95718 106597
20660 106597 105943 49644 51540 93832 99599 121221 136369 111415 93486 86117 117910 119812 188214
$$ packed form
20745A4133L5446K176k3457j2752M4754N9293N779n0849j8488m3374m29Q8533
20733A00765j8247k6075M776M249N282m555j190j9046l5299J7470Q1954J9416
20721A29500p4164O946R664K9654n6607q4059L163J5261l456L3669j3579M2767
20709C8759L3109o4345k3898J4202J6743n3162J1372J8427J9683k7636J5922K7492
20697B6668N5023q593k6625j3700j470N7950O5023m7166n5363N478J921l53N575
20684F4368R261J7651q207j5141m5534m9087j2668N7902R4473K5178m0254q1207
20672A6735m2547K6577L7539j2455L6401L2445M8967J3040j907o110n2967J0879
20660A06597o54n6299J896M2292N767K1622J5148k4954j7929p369L1793J902O8402
$$ plain form
20647 188214 279235 355036 431294 417305 399750 405062 330238 240934 209438 171244 143260 110141
20635 110141 65119 51003 805 -14814 57356 85942 77045 56919 39011 75561 99077 75964
20623 75964 70395 34425 4408 -19448 -31580 317 61715 88930 84978 80944 49064 87044
20611 87044 118275 78370 15997 14301 36463 32061 44375 13534 -8786 40101 57436 94155
20599 94155 98062 101537 67681 78992 39034 5003 55547 149958 116402 95719 94555 118652
20587 118652 114027 116252 96750 90427 93825 97984 57219 99258 110062 91824 55924 58387 22565
20574 22565 54521 79228 38808 63310 93857 69671 28533 42507 89912 109244 78377 41721
20562 41721 44270 76629 24071 41059 98002 148366 136599 92529 93883 59768 -12796 -64849
$$ packed form
20647A88214R1021P5801P6258j3989j7555N312p4824q9304l1496l8194k7984l3119
20635A10141m5022j4116n0198j5619P2170K8586q897k0126j7908L6550K3516k3113
20623G5964n569l5970l0017k3856j2132L1897O1398K7215l952m034l1880L7980
20611H7044L1231l9905o2373j696K2162m402J2314l0841k2320M8887J7335L6719
20599I4155L907L475l3856J1311l9958l4031N0544R4411l3556k0683j164K4097
20587A18652m625K225j9502o323L398M159m0765M2039J0804j8238l5900K463l5822
20574B2565L1956K4707m0420K4502L0547k4186m1138J3974M7405J9332l0867l6656
20562D1721K549L2359n2558J6988N6943N0364j1767m4070J354l4115p2564n2053
$$ plain form
20550 -64849 -23230 55274 8764 -17578 -2916 13453 77842 16958 -13961 -53506 -27828 -6373
20538 -6373 -23744 6271 28897 54087 71956 84931 74291 61566 78615 114911 100897 161086
20526 161086 175297 152597 149401 169405 137457 98360 75947 57348 87691 101959 117561 129546
20514 129546 155367 135903 60811 38111 37115 25108 18460 6256 25770 105008 120873 67965
20502 67965 57726 50430 57787 46175 53856 97493 66936 84417 107861 128259 166131 177312
20490 177312 109645 86443 97452 73427 13977 72555 116452 138664 232218 263007 263590 257721
20478 257721 233480 250575 294775 246682 290266 349668 427409 493773 454991 370244 359677
20467 359677 332755 305872 293513 272089 218643 167069 178896 203990 228537 253265 250096 196640
$$ packed form
20550f4849M1619P8504m6510k6342J4662J6369O4389o0884l0919l9545K5678K1455
20538f373j7371L0015K2626K5190J7869J2975j0640j2725J7049L6296j4014O0189
20526A61086J4211k2700l196K0004l1948l9097k2413j8599L0343J4268J5602J1985
20514A29546K5821j9464p5092k2700r96j2007o648j2204J9514P9238J5865n2908
20502F7965j0239p296P357j1612P681M3637l0557J7481K3444K0398L7872J1181
20490A77312o7667k3202J1009k4025n9450N8578M3897K2212R3554L0789N83n869
20478B57721k4241J7095M4200m8093M3584N9402P7741O6364l8782q4747j0567
20467C59677k6922k6883j2359k1424n3446n1574J1827K5094K4547K4728l169n3456
$$ plain form
20455 196640 220661 202394 138879 164300 134587 135443 167793 114779 113584 193971 222846 182725
20443 182725 142543 127682 118440 129615 141375 134370 140839 203408 186652 183567 181271 153164
20431 153164 170704 127430 138264 125664 131324 200917 196732 158371 164879 174847 184319 172798
20419 172798 209124 265760 238403 171247 175985 204849 259301 278034 275533 288096 273010 278064
20407 278064 336816 400409 418445 413924 393876 325684 281051 276492 325599 339962 297847 273989
20395 273989 263763 226336 256916 250090 248036 269849 246943 261661 276614 311580 359133 371225
20383 371225 360854 367015 376393 355424 329542 364583 368093 369009 326429 290973 242553 279488
20371 279488 310503 296223 258493 277294 299435 276822 290165 300307 263115 271692 338609 362293
$$ packed form
20455A96640K4021j8267o3515K5421k9713Q56L2350n3014j195Q0387K8875m0121
20443A82725m0182j4861r242J1175J1760p005O469O2569j6756l085k296k8107
20431A53164J7540m3274J0834j2600N660O9593m185l8361O508R968R472j1521
20419A72798L6326N6636k7357o7156M738K8864N4452J8733k501J2563j5086N054
20407B78064N8752O3593J8036m521k0048o8192m4633m559M9107J4363m2115k3858
20395B73989j0226l7427L0580o826k054K1813k2906J4718J4953L4966M7553J2092
20383C71225j0371O161R378k0969k5882L5041L510R16m2580l5456m8420L6935
20371B79488L1015j4280l7730J8801K2141k2613J3343J0142l7192Q577O6917K3684
$$ plain form
20359 362293 309598 278822 318994 276790 249502 270247 329994 336826 319781 356422 440535 490144
20347 490144 490912 517706 600589 599452 550898 556515 584537 618695 622015 542291 496424 485441
20335 485441 494433 475151 432381 399961 382843 393214 389881 416770 426293 421219 448303 509244
20323 509244 508772 501918 520981 526250 549740 464431 428818 418665 442153 428640 491087 520705
20311 520705 520629 514741 581409 689113 733511 707192 690950 699019 658069 643061 633324 657975
20299 657975 733613 762897 734858 723061 725935 712696 754813 801395 854441 866938 865680 862981
20287 862981 916688 975245 942906 878725 887747 911082 950312 973959 1000059 1033436 1116691 1220315
20275 1220315 1306408 1380273 1417621 1471700 1483487 1559903 1601584 1635618 1701564 1771380 1897740
$$ packed form
20359C62293n2695l0776M0172m2204k7288K0745N9747O832j7045L6641Q4113M9609
20347D90144P68K6794Q2883j137m8554N617K8022L4158L320p9724m5867j0983
20335D85441Q992j9282m2770l2420j7118J0371l333K6889R523n074K7084O0941
20323E09244m72o854J9063N269K3490q5309l5613j0153K3488j3513O2447K9618
20311E20705p6n888O6668J07704M4398k6319j6242Q069m0950j5008r737K4651
20299F57975P5638K9284k8039j1797K874j3239M2117M6582N3046J2497j258k699
20287H62981N3707N8557l2339o4181R022K3335L9230K3647K6100L3377Q3255J03624
20275A220315Q6093P3865L7348N4079J1787P6416M1681L4034O5946O9816J26360
$$ plain form
20264 1897740 2066483 2267466 2420488 2609036 2849765 3095349 3441342 3892767 4311305
20255 4311305 4643106 4812438 4914016 4905374 4840080 4735752 4706564 4841454 5035029 5259685
20245 5259685 5426846 5667081 5985802 6278600 6598242 6893355 7330572 7890483 8500980
20236 8500980 9237676 10116716 11239851 12683486 14340627 16408127 19034108 22281996
20228 22281996 26617364 32528059 40786865 52509553 69193321 92357221 123174556
20221 123174556 161481054 204065327 245466933 279415125 298368791 297039554 275916665
20214 275916665 240660753 197205228 153851025 117042651 88426312 67411463 52622428
20207 52622428 42283894 34970391 29606073 25550337 22424214 19987220 18065158 16401378
$$ packed form
20264A897740J68743K00983J53022J88548K40729K45584L45993M51425M18538
20255D311305L31801J69332J01578q642o5294j04328k9188J34890J93575K24656
20245E259685J67161K40235L18721K92798L19642K95113M37217N59911O10497
20236H500980P36696Q79040J123135J443635J657141K067500K625981L247888
20228B2281996M335368N910695Q258806J1722688J6683768K3163900L0817335
20221A23174556L8306498M2584273M1401606L3948192J8953666j329237k1122889
20214B75916665l5255912m3455525m3354203l6808374k8616339k1014849j4789035
20207E2622428j0338534p313503n364318m055736l126123k436994j922062j663780
$$ plain form
20199 16401378 15012556 13800179 12721673 11831095 11068782 10437573 9834509 9315146 8916558
20190 8916558 8611130 8363949 8064666 7786572 7542978 7278530 7059417 6925201 6924936 6982395
20180 6982395 6969090 6916688 6746861 6421579 6034859 5700751 5302154 4885260 4523625 4256345
20170 4256345 4028611 3849429 3735647 3565667 3418007 3293479 3172906 3021591 2886056
20161 2886056 2798426 2678034 2601433 2528446 2480532 2452870 2382019 2335158 2261485 2133442 2059939
20150 2059939 2022749 2000582 1944968 1847539 1780173 1744392 1727961 1628963 1562261 1580651 1537203
20139 1537203 1449011 1363024 1298808 1223929 1156698 1135261 1181062 1149737 1080310 1040069 1047064
20128 1047064 1015553 972612 906708 904556 921519 922144 932812 962798 917475 927419 929129 951801
$$ packed form
20199A6401378j388822j212377j078506q90578p62313o31209o03064n19363l98588
20190H916558l05428k47181k99283k78094k43594k64448k19113j34216k65N7459
20180F982395j3305n2402j69827l25282l86720l34108l98597m16894l61635k67280
20170D256345k27734j79182j13782j69980j47660j24528j20573j51315j35535
20161B886056q7630j20392p6601p2987m7914k7662p0851m6861p3673j28043p3503
20150B059939l7190k2167n5614r7429o7366l5781j6431r8998o6702J8390m3448
20139A537203q8192q5987o4216p4879o7231k1437M5801l1325o9427m0241O995
20128A047064l1511m2941o5904k152J6963O25J0668K9986m5323R944J710K2672
$$ plain form
20116 951801 939436 907031 852877 813724 761143 717636 693738 647608 625585 579802 543776
20105 543776 573771 566768 593864 604334 650100 673758 657645 646386 664350 714720 680530 684909
20093 684909 683284 639875 626826 626450 621635 617933 550871 524346 505873 486962 452768 437343
20081 437343 424451 384347 362857 410767 440270 408871 322036 238699 238730 258064 280001 291528
20069 291528 249377 256026 264349 264463 297354 281232 282418 293578 264129 250592 268577 267710 205231
20056 205231 131676 137983 92815 42227 26603 69267 87240 129452 171463 168311 153194 123120
20044 123120 116691 125056 174688 202457 163177 139401 123822 120849 98047 37494 59913 113833
20032 113833 57519 -25731 -103735 -87839 -58073 -38425 -28592 -7452 26336 62828 16056 57652
$$ packed form
20116I51801j2365l2405n4154l9153n2581m3507k3898m6130k2023m5783l6026
20105E43776K9995p003K7096J0470M5766K3658j6113j1259J7964N0370l4190M379
20093F84909j625m3409j3049l76m815l702o7062k6525j8473j8911l4194j5425
20081D37343j2892m0104k1490M7910K9503l1399q6835q3337L1J9334K1937J1527
20069B91528m2151O649Q323J14L2891j6122J186J1160k9449j3537J7985q67o2479
20056B05231p3555O307m5168n0588j5624M2664J7973M2212M2011l152j5117l0074
20044A23120o429Q365M9632K7769l9280k3776j5579k973k2802o0553K2419N3920
20032A13833n6314q3250p8004J5896K9766J9648R833K1140L3788L6492m6772M1596
$$ plain form
20020 57652 91876 98015 134402 91220 110699 64110 70748 98815 96585 91873 55435 44788
20008 44788 86492 120326 193202 189837 187208 179247 173427 98675 116062 177305 148639 92672
19996 92672 109106 95196 134927 148954 99090 84872 42937 10709 30956 103663 93759 90647
19984 90647 108054 117452 109967 134931 137178 135797 155031 203003 261605 209955 176858 206748
19972 206748 216174 250129 231152 230666 240819 301060 402041 536576 662029 844450 1082078
19961 1082078 1329277 1490857 1582134 1596529 1531253 1419095 1224129 943702 723795 581685
19951 581685 480455 389058 290059 245420 206256 199849 159559 145529 56780 20241 90257
19940 90257 155721 138120 135406 185588 198514 127136 119880 127503 155870 171011 164171 163629 154048
$$ packed form
20020E7652L4224O139L6387m3182J9479m6589O638K8067k230m712l6438j0647
20008D4788M1704L3834P2876l365k629p961n820p4752J7387O1243k8666n5967
19996I2672J6434j3910L9731J4027m9864j4218m1935l2228K0247P2707r904l112
19984I0647J7407R398p485K4964K247j381J9234M7972N8602n1650l3097K9890
19972B06748R426L3955j8977m86J0153O0241J00981J34535J25453J82421K37628
19961A082078K47199J61580R1277J4395o5276j12158j94966k80427k19907j42110
19951E81685j01230r1397r8999m4639l9164o407m0290j4030q8749l6539P0016
19940I0257O5464j7601k714N0182J2926p1378p256P623K8367J5141o840n42r581
$$ plain form
19927 154048 81455 13536 35469 46423 3240 -25096 12008 16786 45918 78961 90674 56140
19915 56140 92988 146656 118854 94928 82405 95257 74024 40762 6566 45654 97350 89833
19903 89833 99133 100968 62646 72148 116483 137245 145520 97701 70419 74024 66318 61604 110483
19890 110483 127880 110913 101360 99104 130883 180358 211940 160172 75720 26019 81161 96755
19878 96755 86772 75463 8220 7948 37000 85798 100450 69841 54785 52942 90579 105587
19866 105587 116133 107790 74229 72403 51759 37084 18686 40724 120269 136609 164396 160125
19854 160125 189582 154612 96044 53150 43435 61536 59330 49515 26764 11284 -3462 11741
19842 11741 23024 12257 42370 19007 14046 -5960 -41682 -35327 39719 34532 24134 19318
$$ packed form
19927A54048p2593o7919K1933J0954m3183k8336L7104M778K9132L3043J1713l4534
19915E6140L6848N3668k7802k3926j2523J2852k1233l3262l4196L9088N1696p517
19903H9833R300J835l8322R502M4335K0762Q275m7819k7282L605p706m714M8879
19890A10483J7397j6967r553k256L1779M9475L1582n1768q4452m9701N5142J5594
19878I6755r983j1309o7243k72K9052M8798J4652l0609j5056j843L7637J5008
19866A05587J0546q343l3561j826k0644j4675j8398K2038P9545J6340K7787m271
19854A60125K9457l4970n8568m2894r715J8101k206r815k2751j5480j4746J5203
19842A1741J1283j0767L0113k3363m961k0006l5722O355P5046n187j0398m816
$$ plain form
19830 19318 -7026 15791 95279 119295 113450 97895 100901 108068 82752 86178 95193 128332 168594
19817 168594 148477 101704 127301 138559 141148 156043 165747 114253 80615 52194 21276 -12272
19805 -12272 -963 44838 30426 -9071 14495 25860 44233 54732 113121 162698 192406 164532
19793 164532 110118 117652 118813 134453 116343 83799 63964 87662 75166 62635 52962 32002
19781 32002 24325 42113 45706 172 -32473 -9513 41355 62620 33291 -3264 1523 53769
19769 53769 118031 119678 140069 217597 222660 179791 194439 212260 236314 223598 205036 200606
19757 200606 195088 233049 277992 324329 364567 354825 421576 434850 376577 406691 457899 467930
19745 467930 495335 440072 482882 526750 519572 513772 506473 505027 465341 393148 323189 292740
$$ packed form
19830A9318k6344K2817P9488K4016n845j5555L006P167k5316L426R015L3139M0262
19817A68594k0117m6773K5597J1258K589J4895R704n1494l3638k8421l0918l3548
19805a2272J1309M5801j4412l9497K3566J1365J8373J0499N8389M9577K9708k7874
19793A64532n4414P534J161J5640j8110l2544j9835K3698j2496j2531r673k0960
19781C2002p677J7788L593m5534l2645K2960N0868K1265k9329l6555M787N2246
19769E3769O4262J647K0391P7528N063m2869J4648J7821K4054j2716j8562m430
19757B00606n518L7961M4943M6337M0238r742O6751J3274n8273L0114N1208J0031
19745D67930K7405n5263M2810M3868p178n800p299j446l9686p2193o9959l0449
$$ plain form
19733 292740 292257 276884 185123 140752 150036 168607 204807 195774 183977 156900 172141 141501
19721 141501 134544 122044 151489 204632 181361 177057 178880 175281 208154 234768 280887 310554
19709 310554 329443 352427 395662 396100 423614 468287 526260 533407 520149 489790 506781 586065
19697 586065 629693 688014 770263 750664 752317 798267 785760 698573 616226 511291 425963
19686 425963 379852 315352 262085 293019 318638 316639 266921 262420 247353 194735 165016 183113
19674 183113 206268 234815 236238 278249 231339 158974 170220 221968 210105 216301 230863 245934
19662 245934 221139 184136 156156 182085 185732 231263 209852 182961 199087 144787 154733 163227
19650 163227 149775 169583 182140 121451 98663 87634 101013 127368 139144 122766 135589
$$ packed form
19733B92740m83j5373r1761m4371R284J8571L6200r033j1797k7077J5241l0640
19721A41501o957j2500K9445N3143k3271m304J823l599L2873K6614M6119K9667
19709C10554J8889K2984M3235M38K7514M4673N7973P147j3258l0359J6991P9284
19697E86065M3628N8321Q2249j9599J653M5950j2507q7187q2347j04935q5328
19686D25963m6111o4500n3267L0934K5619j999m9718m501j5067n2618k9719J8097
19674A83113K3155K8547J423M2011m6910p2365J1246N1748j1863O196J4562J5071
19662B45934k4795l7003k7980K5929L647M5531k1411k6891J6126n4300R946Q494
19650A63227j3452J9808J2557o0689k2788j1029J3379K6355J1776j6378J2823
$$ plain form
19639 135589 175486 187084 120365 70696 119039 131832 165065 128255 136752 158352 154008 154619
19627 154619 178916 227784 211385 165766 180694 251938 300411 271162 264773 287007 238307 214378
19615 214378 227221 247751 254394 235747 222285 240822 310208 315009 311604 299944 273713 257616
19603 257616 263955 246537 166035 121570 110545 120202 143618 159326 178080 182377 154812 124751
19591 124751 153958 169276 204332 227777 206701 184085 189007 184836 208078 236102 227658 219706
19579 219706 208999 208435 185641 208178 246213 297431 327503 257240 242918 263749 278621 344072
19567 344072 447145 517289 609703 672318 667382 621084 503757 431338 417992 410442 427132
19556 427132 437130 422156 410461 451638 450346 460386 498674 554515 650814 719459 836825 994098
$$ packed form
19639A35589L9897J1598o6719m9669M8343J2793L3233l6810Q497K1600m344O11
19627A54619K4297M8868j6399m5619J4928P1244M8473k9249o389K2234m8700k3929
19615B14378J2843K0530O643j8647j3462J8537O9386M801l405j1660k6231j6097
19603B57616O339j7418q0502m4465j1025R657K3416J5708J8754M297k7565l0061
19591A24751K9207J5318L5056K3445k1076k2616M922m171K3242K8024q444p952
19579B19706j0707n64k2794K2537L8035N1218L0072p0263j4322K0831J4872O5451
19567C44072J03073P0144R2414O2615m936m6298j17327p2419j3346p550J6690
19556D27132R998j4974j1695M1177j292J0040L8288N5841R6299O8645J17366J57273
$$ plain form
19544 994098 1141031 1327122 1512078 1633949 1663064 1589386 1492135 1337167 1148140 895693
19534 895693 735346 670883 577359 540091 554571 529880 481361 422517 366641 362984 335475
19523 335475 297024 295395 307290 317378 382634 400474 387490 356868 283038 273152 313122 314435
19511 314435 314388 353196 311854 299043 303252 270598 234995 305554 374671 393095 399193 382339
19499 382339 391420 399375 442096 472737 511493 553346 557584 490042 458117 450349 409466 455046
19487 455046 488247 491863 481660 423385 331503 334663 346605 408380 414562 379488 395355 414582
19475 414582 409464 427121 414002 425720 466180 464106 436815 410315 367766 395645 445075 418124
19463 418124 383508 419550 458836 433594 409197 429519 427836 416955 453226 450765 419880 423513
$$ packed form
19544I94098J46933J86091J84956J21871K9115p3678r7251j54968j89027k52447
19534H95693j60347o4463r3524l7268J4480k4691m8519n8844n5876l657k7509
19523C35475l8451j629J1895J0088O5256J7840j2984l0622p3830r886L9970J313
19511C14435m7L8808m1342j2811M209l2654l5603P0559O9117J8424O098j6854
19499C82339R081P955M2721L0641L8756M1853M238o7542l1925p768m0883M5580
19487D55046L3201L616j0203n8275r1882L160J1942O1775O182l5074J5867J9227
19475D14582n118J7657j3119J1718M0460k074k7291k6500m2549K7879M9430k6951
19463D18124l4616L6042L9286k5242k4397K0322j683j0881L6271k461l0885L633
$$ plain form
19451 423513 441992 458659 475332 457458 498542 494643 509640 531507 545321 546259 587274 615353
19439 615353 620010 620693 689967 734055 750604 708115 670129 699492 739643 730830 692335 669150
19427 669150 630463 575129 490634 488657 541904 532923 490892 520811 589144 627744 638662 674863
19415 674863 680978 698815 729603 714986 697187 716627 717395 685720 697517 720636 764777 792521
19403 792521 801529 793233 795373 808382 829419 857300 832864 804472 819047 879022 909812 919004
19391 919004 933394 971385 977849 985341 1045499 1027069 1045426 1032691 1060806 1087329 1125612 1130098
19379 1130098 1138237 1167782 1199083 1235417 1285985 1317972 1359650 1396324 1361375 1382163 1394022
19368 1394022 1488233 1546083 1593074 1705684 1846499 1876211 1893531 1979169 2101693 2246715
$$ packed form
19451D23513J8479J6667J6673j7874M1084l899J4997K1867J3814R38M1015K8079
19439F15353M657O83O9274M4088J6549m2489l7986K9363M0151q813l8495k3185
19427F69150l8687n5334q4495j977N3247q981m2031K9919O8333L8600J0918L6201
19415F74863O115J7837L0788j4617j7799J9440P68l1675J1797K3119M4141K7744
19403G92521R008q296K140J3009K1037K7881k4436k8392J4575N9975L0790R192
19391I19004J4390L7991O464P492O0158j8430J8357j2735K8115K6523L8283M486
19379A130098Q139K9545L1301L6334N0568L1987M1678L6674l4949K0788J1859
19368A394022R4211N7850M6991J12610J40815K9712J7320Q5638J22524J45022
$$ plain form
19358 2246715 2432207 2620010 2761694 2823691 2847962 2916000 2994274 3132256 3304609 3408622
19348 3408622 3476208 3501578 3558557 3663979 3812831 3912232 4051655 4286430 4526886 4806928
19338 4806928 5182549 5676768 6240393 6823500 7435780 8028580 8586018 9062031 9546836
19329 9546836 10080374 10711789 11430501 12351467 13558854 15049070 16928685 19338542 22478848
19320 22478848 26627495 32265731 40258265 51826387 68678376 93142412 127133606
19313 127133606 170348062 218674755 265209125 300478559 314702084 303032409 268989706
19306 268989706 221350757 170294361 126103122 93051436 70150812 54621860 44007559
19299 44007559 36483289 30977633 26970827 23867526 21487546 19584854 18054763 16769033
$$ packed form
19358B246715J85492J87803J41684O1997K4271O8038P8274J37982J72353J04013
19348C408622O7586K5370N6979J05422J48852R9401J39423K34775K40456K80042
19338D806928L75621M94219N63625N83107O12280N92800N57438M76013M84805
19329I546836N33538O31415P18712R20966J207387J490216J879615K409857L140306
19320B2478848M148647N638236P992534J1568122J6851989K4464036L3991194
19313A27133606M3214456M8326693M6534370L5269434J4223525j1669675l4042703
19306B68989706m7638949n1056396m4191239l3051686k2900624j5528952j0614301
19299D4007559p524270n505656m006806l103301k379980j902692j530091j285730
$$ plain form
19291 16769033 15740939 14871133 14179707 13544028 12895917 12264002 11647934 11053979 10443512
19282 10443512 9837992 9281659 8812188 8399132 8064817 7774285 7479696 7215945 7102306
19273 7102306 7008942 6992014 7008855 7027146 7027006 7027651 7013796 7002558 6996553 6973207 7039149 7175159
19261 7175159 7310448 7463136 7646418 7753039 7850642 7993115 8173205 8432527 8734813 9185316
19251 9185316 9748871 10487011 11428145 12700986 14482090 16958925 20552907 25743924 32906274
19242 32906274 42086696 52611454 63397961 73006699 79493022 81611692 79767237 75590657
19234 75590657 70775445 67697997 68106697 71792914 77347163 82780352 85526002 83806872
19226 83806872 77979812 69512367 59124393 47715084 37417202 29437219 23740854 19782045
$$ packed form
19291A6769033j028094q69806o91426o35679o48111o31915o16068n93955o10467
19282A0443512o05520n56333m69471m13056l34315k90532k94589k63751j13639
19273G102306r3364j6928J6841J8291j40O45j3855j1238o005k3346O5942J36010
19261G175159J35289J52688J83282J06621R7603J42473J80090K59322L02286M50503
19251I185316N63555P38140R41134J272841J781104K476835L593982N191017P162350
19242C2906274R180422J0524758J0786507R608738O486323K118670j844455m176580
19234G5590657m815212l077448M08700L686217N554249N433189K745650j719130
19226H3806872n827060q467445j0387974j1409309j0297882p979983n696365l958809
$$ plain form
19218 19782045 17112891 15329332 14109465 13158243 12507589 12082956 11743681 11472084 11267276
19209 11267276 11184542 11124012 11096599 11173301 11382548 11683110 12083214 12600215 13273975 14306316
19199 14306316 15706203 17776199 20964297 25634722 32387726 41784572 53675586 67035695
19191 67035695 80325628 91046077 96803133 96586920 91580846 84228363 77514469 74690613
19183 74690613 76621820 82004220 88697110 93946441 95017302 90598819 81815782 70116233
19175 70116233 56986437 44489778 34394022 27050490 21938968 18377387 15873597 14001432
19167 14001432 12495733 11369324 10439735 9737308 9096189 8551865 8061976 7552890 7209063
19158 7209063 6758346 6335893 5984222 5660205 5275417 4923955 4677845 4442370 4212579
$$ packed form
19218A9782045k669154j783559j219867r51222o50654m24633l39275k71597k04808
19209A1267276q2734o0530k7413P6702K09247L00562M00104N17001O73760J032341
19199A4306316J399887K069996L188098M670425O753004R396846J1891014J3360109
19191F7035695J3289933J0720449N757056k16213n006074p352483o713894k823856
19183G4690613J931207N382400O692890N249331J070861m418483q783037j1699549
19175G0116233j3129796j2496659j0095756p343532n111522l561581k503790j872165
19167A4001432j505699j126409r29589p02427o41119n44324m89889n09086l43827
19158G209063m50717m22453l51671l24017l84788l51462k46110k35475k29791
$$ plain form
19149 4212579 4019806 3814571 3638657 3510391 3400947 3286885 3151965 3089298 3069827 3026310
19139 3026310 2885867 2771380 2715268 2640678 2596453 2503898 2386780 2299709 2186717 2152120
19129 2152120 2153566 2103562 2011983 1929853 1820252 1710956 1658021 1533087 1464196 1450794 1402402
19118 1402402 1417191 1359901 1310664 1299232 1305700 1285764 1315399 1332480 1346956 1293396 1234498
19107 1234498 1251999 1271614 1253163 1251048 1250402 1218584 1185109 1174007 1222838 1236639 1238796 1228446
19095 1228446 1180726 1196429 1167264 1195224 1247248 1227493 1182183 1157758 1160287 1144159 1120540
19084 1120540 1113037 1060267 1027859 991673 955471 957324 921355 815792 737310 670884 714726
19073 714726 737332 725784 652261 667785 723357 767667 732659 733661 719166 694145 698181 689190
$$ packed form
19149D212579j92773k05235j75914j28266j09444j14062j34920o2667j9471m3517
19139C026310j40443j14487n6112p4590m4225r2555j17118q7071j12992l4597
19129B152120J446n0004r1579q2130j09601j09296n2935j24934o8891j3402m8392
19118A402402J4789n7290m9237j1432O468j9936K9635J7081J4476n3560n8898
19107A234498J7501J9615j8451k115o46l1818l3475j1102M8831J3801K157j0350
19095A228446m7720J5703k9165K7960N2024j9755m5310k4425K529j6128k3619
19084A120540p503n2770l2408l6186l6202J853l5969j05563p8482o6426M3842
19073G14726K2606j1548p3523J5524N5572M4310l5008J002j4495k5021M036q991
$$ plain form
19061 689190 700199 707120 726682 744568 804286 799242 766740 771673 703244 684913 717121 716494
19049 716494 687191 660551 708063 632225 556443 567846 564883 572824 565017 539534 534410 532512
19037 532512 564028 578232 601767 587385 553389 540993 509413 488447 503610 525035 502609
19026 502609 483888 496272 465876 421928 404671 375956 317741 295128 293187 249879 237451 242558
19014 242558 283020 312253 328186 348088 372512 297710 262985 274135 237337 205813 260648
19003 260648 220874 163915 146136 166419 163367 149812 184694 201814 192080 184186 165547 157975
18991 157975 171514 240267 266888 261429 270391 293815 334482 364018 429388 463374 518172 525005
18979 525005 504426 527601 508651 494381 438070 423270 396767 422639 436931 461645 450298
$$ packed form
19061F89190J1009O921J9562J7886N9718n044l2502M933o8429j8331L2208o27
19049G16494k9303k6640M7512p5838p5782J1403k963P941p807k5483n124j898
19037E32512L1516J4204K3535j4382l3996j2396l1580k0966J5163K1425k2426
19026E02609j8721J2384l0396m3948j7257k8715n8215k2613j941m3308j2428N107
19014B42558M0462K9233J5933J9902K4424p4802l4725J1150l6798l1524N4835
19003B60648l9774n6959j7779K0283l052j3555L4882J7120r734p894j8639p572
18991A57975J3539O8753K6621n459Q962K3424M0667K9536O5370L3986N4798O833
18979E25005k0579K3175j8950j4270n6311j4800k6503K5872J4292K4714j1347
$$ plain form
18968 450298 407950 326867 296504 310367 313244 298957 267070 229799 231643 293064 315583 305495
18956 305495 328995 336018 310434 258468 247317 272463 259953 243072 275539 293006 269913 255739
18944 255739 275141 269855 271692 287378 254776 261200 322576 409871 431813 393026 409502 522600
18932 522600 612307 639735 639749 656751 639180 622209 620971 650265 653899 633486 592041 608953
18920 608953 603940 544663 457147 362467 352712 310757 264644 272124 351689 361973 368398 359596
18908 359596 354308 349778 319978 271168 293973 285361 263591 226417 255562 276826 271318 287601
18896 287601 288166 258784 268950 248543 216757 231644 241751 313120 399838 412136 437928 489316
18884 489316 502028 428274 404563 407483 457237 471241 458296 475763 493591 533841 503093 483782
$$ packed form
18968D50298m2348q1083l0363J3863K877j4287l1887l7271J844O1421K2519j0088
18956C05495K3500P023k5584n1966j1151K5146j2510j6881L2467J7467k3093j4174
18944B55739J9402n286J837J5686l2602O424O1376Q7295K1942l8787J6476J13098
18932E22600Q9707K7428J4J7002j7571j6971j238K9294L634k0413m1445J6912
18920F08953n013n9277q7516r4680r755m1955m6113P480P9565J0284O425q802
18908C59596n288m530k9800m8810K2805q612k1770l7174K9145K1264n508J6283
18896B87601N65k9382J0166k0407l1786J4887J0107P1369Q6718J2298K5792N1388
18884D89316J2712p3754k3711K920M9754J4004j2945J7467J7828M0250l0748j9311
$$ plain form
18872 483782 476225 450221 376487 320977 267542 270067 232086 240992 255627 259136 283578 341989
18860 341989 324932 353972 415001 374686 358629 302093 244035 252037 268309 323060 310628 269447
18848 269447 273618 249778 234508 269304 290919 298723 296954 373739 412291 422175 414441 420293 393013
18835 393013 322954 356224 417143 398792 420641 438210 435424 413791 409584 396966 381609 368167
18823 368167 399418 419057 359954 304219 318427 382437 420940 426566 428836 390460 398911 412448
18811 412448 388017 318347 297621 317835 321475 288070 259682 247283 274157 292468 253276 253667
18799 253667 271409 296956 317661 301665 382364 422093 424461 410524 384021 403305 416738 419018
18787 419018 414409 371218 373770 342367 328185 335061 369981 369215 371923 374312 421666 463004 469947
$$ packed form
18872D83782p557k6004p3734n5510n3435K525l7981Q906J4635L509K4442N8411
18860C41989j7057K9040O1029m0315j6057n6536n8058Q002J6272N4751j2432m1181
18848B69447M171k3840j5270L4796K1615P804j769P6785L8552R884p734N852k7280
18835C93013p0059L3270O0919j8351K1849J7569k786k1633m207j2618j5357j3442
18823C68167L1251J9639n9103n5735J4208O4010L8503N626K270l8376Q451J3537
18811D12448k4431o9670k0726K0214L640l3405k8388j2399K6874J8311l9192L91
18799B53667J7742K5547K0705j5996Q0699L9729K368j3937k6503J9284J3433K280
18787D19018m609m3191K552l1403j4182O876L4920p66K708K389M7354M1338O943
$$ plain form
18774 469947 451944 444210 472695 477959 465821 407739 414569 407054 416912 434445 417196 417735 408756
18761 408756 408397 409842 408552 380073 364179 310030 324837 366671 419813 467039 434509 430695
18749 430695 440938 438789 462368 434051 408216 418733 443736 464200 429113 402088 368531 412590
18737 412590 471510 477775 489108 456229 425266 450051 465006 474228 498136 537635 566903 551937
18725 551937 600517 611530 661928 728184 741443 830272 834658 837926 848921 876260 912120 922389
18713 922389 933313 921648 890923 873834 874601 923081 881772 839986 805782 814550 796248 776637
18701 776637 776683 748975 767970 791754 803334 821992 799433 816631 811004 781869 781220 760988 694978
18688 694978 690849 746252 792956 844136 864479 822223 800793 808965 834667 909083 985379 1041952
$$ packed form
18774D69947j8003p734K8485N264j2138n8082O830p515R858J7533j7249N39q979
18761D08756l59J445j290k8479j5894n4149J4807M1834N3142M7226l2530l814
18749D30695J0243k149K3579k8317k5835J0517K5003K0464l5087k7025l3557M4059
18737D12590N8920O265J1333l2879l0963K4785J4955R222K3908L9499K9268j4966
18725E51937M8580J1013N0398O6256J3259Q8829M386L268J0995K7339L5860J0269
18713I22389J0924j1665l0725j7089P67M8480m1309m1786l4204Q768j8302j9611
18701G76637M6k7708J8995K3784J1580J8658k2559J7198n627k9135o49k0232o6010
18688F94978m129N5403M6704N1180K0343m2256k1430Q172K5702P4416P6296N6573
$$ plain form
18676 1041952 1081934 1117955 1187676 1317960 1358925 1369048 1405581 1435665 1442686 1523071 1616997
18665 1616997 1702012 1770751 1859108 1957103 2026337 2094758 2149213 2276701 2409523 2606625 2837573
18654 2837573 3062602 3288771 3525152 3721301 3855328 3945778 4000548 3972867 3968296 4019825
18644 4019825 4167897 4438252 4860877 5593397 6671347 8079246 10169265 13151867 17019222
18635 17019222 21555328 26052985 29757355 31901643 31960947 30075158 27274458 25139901
18627 25139901 24659955 26012575 28776038 32022296 34544326 35393215 33896828 29990771
18619 29990771 24750647 19729084 15674399 12739530 10736177 9381970 8479189 7900845
18611 7900845 7557746 7334505 7229189 7100506 7024112 6936091 6920373 6954213 7145949 7460611
$$ packed form
18676A041952L9982L6021O9721J30284M0965J0123L6533L0084P021Q0385R3926
18665A616997Q5015O8739Q8357R7995O9234O8421N4455J27488J32822J97102K30948
18654B837573K25029K26169K36381J96149J34027R0450N4770k7681m571N1529
18644D019825J48072K70355M22625P32520J077950J407899K090019K982602L867355
18635A7019222M536106M497657L704370K144288N9304j885789k800700k134557
18627B5139901m79946J352620K763463L246258K522030Q48889j496387l906057
18619B9990771n240124n021563m054685k934869k003353j354207r02781n78344
18611G900845l43099k23241j05316j28683p6394q8021j5718L3840J91736L14662
$$ plain form
18601 7460611 7792789 8175888 8648885 9259109 10019782 11043600 12320003 14059460 16555310
18592 16555310 20188006 25341391 32570804 42150304 53693569 65987302 77034156 84675501
18584 84675501 87053948 83689768 76397896 68821492 64154402 63850173 67613838 73847083
18576 73847083 80379176 84609952 84466342 79007559 69081596 56831237 45021812 35342405
18568 35342405 28203972 23208359 19682271 17119311 15305583 14017264 13022220 12251533
18560 12251533 11574035 10941877 10386040 10035968 9785615 9619467 9595619 9686258 9859815 10070060
18550 10070060 10361048 10715251 11262274 12027086 13286439 15172584 17894747 21914436 27680448
18541 27680448 35323199 44539663 54223021 62437233 67499050 67999824 63773263 56616652
$$ packed form
18601G460611L32178L83099M72997O10224P60673J023818J276403J739457K495850
18592A6555310L632696N153385P229413R579500J1543265J2293733J1046854P641345
18584H4675501K378447l364180p291872p576404m667090l04229L763665O233245
18576G3847083O532093M230776j43610n458783r925963j2250359j1809425r679407
18568C5342405p138433m995613l526088k562960j813728j288319r95044p70687
18560A2251533o77498o32158n55837l50072k50353j66148k3848R0639J73557K10245
18550A0070060K90988L54203N47023P64812J259353J886145K722163M019689N766012
18541B7680448P642751R216464R683358Q214212N061817N00774m226561p156611
$$ plain form
18533 56616652 49820908 45807214 45419569 48268901 53111571 58054298 61277898 61197413
18525 61197413 56920840 48943892 39589660 31105213 24380458 19522724 16101633 13704323
18517 13704323 12007794 10758942 9751026 8913903 8251888 7694908 7173529 6688187 6249027
18508 6249027 5967300 5729345 5512072 5445702 5321507 5145918 4984590 4873485 4737756 4579147
18498 4579147 4443703 4342331 4229923 4163817 4156556 4201704 4242765 4349043 4461314 4555983
18488 4555983 4655572 4692290 4746025 4823744 4876329 5010534 5210881 5486403 5853277 6189038
18478 6189038 6591306 7073602 7607711 8315963 9217612 10388439 12031064 14386417 17747271
18469 17747271 22246374 28000087 34898976 42489170 49698334 55417648 59054111 60220116
$$ packed form
18533E6616652o795744m013694l87645K849332M842670M942727L223600q0485
18525F1197413m276573p976948r354232q484447o724755m857734l421091k397310
18517A3704323j696529j248852j007916q37123o62015n56980n21379m85342m39160
18508F249027k81727k37955k17273o6370j24195j75589j61328j11105j35729j58609
18498D579147j35444j01372j12408o6106p261M5148M1061J06278J12271R4669
18488D555983R9589L6718N3735P7719N2585J34205K00347K75522L66874L35761
18478F189038M02268M82296N34109P08252R01649J170827J642625K355353L360854
18469A7747271M499103N753713O898889P590194P209164N719314L636463J166005
$$ plain form
18461 60220116 59026254 56915642 55851694 56559801 59077201 62374067 64955076 65557560
18453 65557560 63255321 57545166 49333231 40679024 32874944 26368527 21429364 17874377
18445 17874377 15415757 13737902 12459938 11542356 10872531 10408854 10039800 9727813 9498927
18436 9498927 9382804 9303352 9296739 9340733 9563635 9854043 10286291 10742830 11323277 12180600
18426 12180600 13393353 15111567 17537676 20954006 25773163 32241476 40425023 50108883
18418 50108883 60450941 70223480 78050878 82905195 84285347 82835699 80222460 78392224
18410 78392224 78612239 81010521 84178007 86334702 85892603 81677584 73535653 62566359
18402 62566359 51253779 41167652 32729360 26257118 21597982 18308835 15923007 14136823
$$ packed form
18461F0220116j193862k110612j063948P08107K517400L296866K581009O02484
18453F5557560k302239n710155q211935q654207p804080o506417m939163l554987
18445A7874377k458620j677855j277964r17582o69825m63677l69054l11987k28886
18436I498927j16123p9452o613M3994K22902K90408M32248M56539N80447Q57323
18426A2180600J212753J718214K426109L416330M819157O468313Q183547R683860
18418E0108883J0342058R772539P827398M854317J380152j449648k613239j830236
18410G8392224K20015K398282L167486K156695m42099m215019q141931j0969294
18402F2566359j1312580j0086127q438292o472242m659136l289147k385828j786184
$$ plain form
18394 14136823 12868004 11921710 11082537 10374948 9833654 9355353 8904552 8551029 8335612
18385 8335612 8147431 7956398 7830142 7726666 7688670 7806729 7943127 8225011 8737631 9577608
18375 9577608 10882076 12800846 15341898 18569682 22490536 26743824 30661070 33603368
18367 33603368 35174954 35258876 33874084 32183535 31204387 31163024 31797563 32499155 32730382
18358 32730382 31902602 29523832 25699580 21409891 17409996 13993785 11320854 9350242
18350 9350242 7897692 6865935 6132965 5613982 5124814 4755150 4466600 4154087 3915709
18341 3915709 3682108 3507164 3351000 3200434 3126458 3063559 2992639 2876356 2770749 2609531
18331 2609531 2460238 2396127 2316414 2227961 2162953 2055871 1961220 1856145 1783128 1738370 1663342
$$ packed form
18394A4136823j268819r46294q39173p07589n41294m78301m50801l53523k15417
18385H335612j88181j91033j26256j03476l7996J18059J36398K81884N12620Q39977
18375I577608J304468J918770K541052L227784L920854M253288L917246K942298
18367C3603368J571586Q3922j384792j690549r79148m1363O34539P01592K31227
18358C2730382q27780k378770l824252m289689l999895l416211k672931j970612
18350I350242j452550j031757p32970n18983m89168l69664k88550l12513k38378
18341C915709k33601j74944j56164j50566p3976o2899p0920j16283j05607j61218
18331B609531j49293o4111p9713q8453o5008j07082r4651j05075p3017m4758p5028
$$ plain form
18320 1663342 1573695 1518521 1479107 1449323 1462875 1461294 1407055 1367246 1296216 1260619 1213104
18309 1213104 1123645 1070523 1062793 1077980 1119912 1040064 972199 916939 981216 1053950 1049524 1062140
18297 1062140 1091576 1047501 1012603 1034305 960590 880613 852725 817711 814346 808142 770330 737911
18285 737911 712303 709486 711321 705466 749481 718848 668132 658223 698370 709013 676770 587098
18273 587098 550940 540396 568707 579190 497897 424655 412097 389641 392596 460138 481365 467940
18261 467940 466029 431089 414806 406186 395474 396632 367364 354087 354973 396233 432617 426236 413982
18248 413982 390393 405405 364725 397300 370367 366790 404381 401158 392620 332830 282873 336698
18236 336698 354157 377542 351454 337976 317443 306529 256524 218674 175621 182507 236356 246104
$$ packed form
18320A663342q9647n5174l9414k9784J3552j581n4239l9809p1030l5597m7515
18309A213104q9459n3122p730J5187M1932p9848o7865n5260O4277P2734m426J2616
18297A062140K9436m4075l4898K1702p3715p9977k7888l5014l365o204l7812l2419
18285G37911k5608k817J835n855M4015l0633n0716r909M0147J0643l2243q9672
18273E87098l6158j0544K8311J0483q1293p3242j2558k2456K955O7542K1227j3425
18261D67940j911l4940j6283q620j0712J158k9268j3277Q86M1260L6384o381j2254
18248D13982k3589J5012m0680L2575k6933l577L7591l223q538n9790m9957N3825
18236C36698J7459K3385k6088j3478k0533j0914n0005l7850m3053O886N3849R748
$$ plain form
18224 246104 281508 260161 235834 226656 267988 241525 145692 178611 223714 225403 266313 248721
18212 248721 161952 162845 207808 246696 270874 283097 295280 230264 226559 251468 271265 251630
18200 251630 254303 240317 237391 259472 259608 213528 191186 210433 198866 231407 253241 301084
18188 301084 306800 301804 260791 227742 224950 205735 200001 188381 213597 207433 202382 209464 225795
18175 225795 279906 305217 312271 300000 311964 317236 390581 421048 489529 510970 517611 568785
18163 568785 569880 613736 626092 614753 574356 557534 545804 554998 533290 553372 566790 591761
18151 591761 581757 526899 486031 436397 411917 370792 336128 362630 330869 303901 255091
18140 255091 210787 212756 184754 166516 199710 195314 171340 194421 176418 179674 252366 320649
$$ packed form
18224B46104L5404k1347k4327r178M1332k6463r5833L2919M5103J689M0910j7592
18212B48721q6769Q93M4963L8888K4178J2223J2183o5016l705K4909J9797j9635
18200B51630K673j3986k926K2081J36m6080k2342J9247j1567L2541K1834M7843
18188C01084N716m996m1013l3049k792j9215n734j1620K5216o164n051P082J6331
18175B25795N4111K5311P054j2271J1964N272P3345L0467O8481K1441O641N1174
18163E68785J095M3856J2356j1339m0397j6822j1730R194k1708K0082J3418K4971
18151E91761j0004n4858m0868m9634k4480m1125l4664K6502l1761k6968m8810
18140B55091m4304J969k8002j8238L3194m396k3974K3081j8003L256P2692O8283
$$ plain form
18128 320649 384318 392121 382816 373107 378819 410468 390325 423431 468672 509004 566524 596917
18116 596917 610383 641633 698864 702941 691252 686624 654448 668362 661611 660105 627720 602956
18104 602956 590261 579825 533080 474297 354752 280960 249102 257871 223109 212390 208870 197285
18092 197285 158421 122060 148210 197756 215526 195731 211687 177913 147870 187557 200368
18081 200368 225803 207708 138564 127104 109226 121378 146096 189971 187424 191676 230312 280259
18069 280259 273618 342008 390686 456029 532934 577630 563488 548389 589565 576211 534308 485901
18057 485901 468415 463783 391875 384728 384880 336498 271990 270580 261326 237814 212510 169387 194961
18044 194961 213119 215369 220741 187164 181251 219371 250157 269602 228262 181619 156901 107089
$$ packed form
18128C20649O3669P803r305r709N712L1649k0143L3106M5241M0332N7520L0393
18116E96917J3466L1250N7231M077j1689m628l2176J3914o751j506l2385k4764
18104F02956j2695j0436m6745n8783j19545p3792l1858Q769l4762j0719l520j1585
18092A97285l8864l6361K6150M9546J7770j9795J5956l3774l0043L9687J2811
18081B00368K5435j8095o9144j1460j7878J2152K4718M3875k547M252L8636M9947
18069B80259o641O8390M8678O5343P6905M4696j4142j5099M1176j3354m1903m8407
18057D85901j7486m632p1908p147J52m8382o4508j410r254k3512k5304m3123K5574
18044A94961J8158K250N372l3577n913L8120L0786J9445m1340m6643k4718m9812
$$ plain form
18032 107089 99515 87020 92039 151640 175314 181008 129366 107217 146811 199150 226860 246147
18020 246147 204757 171554 214598 240939 249738 279251 277521 228859 196995 203952 203246 242021
18008 242021 263464 297639 266900 252857 289572 291284 233178 187089 182979 152050 194310 236063
17996 236063 199076 135884 86737 118979 168036 147638 84065 99658 137620 159606 162527 173132
17984 173132 110583 49117 73239 117502 105907 68194 66272 46983 24925 -13634 -73351 -60879
17972 -60879 -9781 70633 39717 52608 102646 165747 185088 151691 137185 112338 50812 85884
17960 85884 100011 101368 148673 164212 137379 122947 106190 138563 179681 190728 201326 254408
17948 254408 310538 342794 358118 363401 424145 433006 414806 345012 310293 305692 311097 279229
$$ packed form
18032A07089p574j2495N019N9601K3674N694n1642k2149L9594N2339K7710J9287
18020B46147m1390l3203M3044K6341Q799K9513j730m8662l1864O957p06L8775
18008B42021K1443L4175l0739j4043L6715J712n8106m6089m110l0929M2260M1753
17996B36063l6987o3192m9147L2242M9057k0398o3573J5593L7962K1986K921J0605
17984A73132o2549o1466K4122M4263j1595l7713j922j9289k2058l8559n9717J2472
17972f0879N1098Q0414l0916J2891N0038O3101J9341l3397j4506k4847o1526L5072
17960H5884J4127J357M7305J5539k6833j4432j6757L2373M1118J1047J0598N3082
17948B54408N6130L2256J5324N283O0744Q861j8200o9794l4719m601N405l1868
$$ plain form
17936 279229 242599 250372 255005 216075 189205 184288 189286 181101 132234 105304 129916 131419 135144
17923 135144 122012 108626 116272 150919 165010 153524 142165 150925 190923 220971 246550 249223
17911 249223 274469 307518 317063 300225 260366 236021 266092 294146 323259 391589 471124 475096
17899 475096 505378 517621 510771 501840 545704 594904 597203 591711 558353 524419 484677 476871
17887 476871 438262 437117 412756 345062 257745 231505 223909 256764 273410 253044 226647 172625
17875 172625 179405 212244 195182 178882 161208 139493 197670 215542 194759 198968 187307 231193
17863 231193 302186 321249 341738 367834 400545 391096 377591 387743 368133 386716 409301 452063
17851 452063 532353 525211 539106 473207 441582 403720 435707 437432 447250 417569 469926 514103
$$ packed form
17936B79229l6630P773M633l8930k6870m917M998q185m8867k6930K4612J503L725
17923A35144j3132j3386P646L4647J4091j1486j1359Q760L9998L0048K5579K673
17911B49223K5246L3049R545j6838l9859k4345L0071K8054K9113O8330P9535L972
17899D75096L0282J2243o850q931M3864M9200K299n492l3358l3934l9742p806
17887D76871l8609j145k4361o7694q7317k6240p596L2855J6646k0366k6397n4022
17875A72625O780L2839j7062j6300j7674k1715N8177J7872k0783M209j1661M3886
17863B31193P0993J9063K0489K6096L2711r449j3505J0152j9610J8583K2585M2762
17851D52063Q0290p142J3895o5899l1625l7862L1987J725R818k9681N2357M4177
$$ plain form
17839 514103 470978 422503 392329 336387 251645 251244 224850 154535 166927 195345 213303 207894
17827 207894 188371 232522 221970 190802 136267 157014 175121 183957 163545 163702 196948 195321
17815 195321 179584 149759 112845 181037 238441 220637 271368 267214 228565 213298 198758 186240
17803 186240 159497 136976 176002 229921 248585 244155 179645 158462 156140 151483 162657 208784
17791 208784 305087 312518 299901 327780 319014 325090 390988 437404 422031 420644 446065 420761
17779 420761 392685 394226 353837 320291 307770 320008 263210 170424 238144 277571 218004 201093
17767 201093 229912 253869 256752 227717 245582 252614 245057 284554 278747 263136 308580 319535
17755 319535 310304 289150 301428 243774 244004 282221 311971 348795 359183 328750 339219 381461
$$ packed form
17839E14103m3125m8475l0174n5942q4742m01k6394p0315J2392K8418J7958n409
17827B07894j9523M4151j0552l1168n4535K0747J8107Q836k0412J57L3246j627
17815A95321j5737k9825l6914O8192N7404j7804N0731m154l8649j5267j4540j2518
17803A86240k6743k2521L9026N3919J8664m430o4510k1183k322m657J1174M6127
17791B08784R6303P431j2617K7879q766O076O5898M6416j5373j387K5421k5304
17779D20761k8076J541m0389l3546j2521J2238n6798r2786O7720L9427n9567j6911
17767B01093K8819K3957K883k9035J7865P032p557L9497n807j5611M5444J0955
17755C19535r231k1154J2278n7654K30L8217K9750L6824J0388l0433J0469M2242
$$ plain form
17743 381461 425321 418734 358770 375853 390941 370648 357411 363810 374264 375591 395105 434187
17731 434187 388043 363514 393344 397618 423669 432908 399310 386532 439167 452837 453080 487570
17719 487570 508663 543466 576861 572750 596900 651265 753546 790684 799348 761507 795220 826708
17707 826708 843761 866201 869230 908937 934179 1013751 1068189 1127389 1180685 1248427 1344204 1404301
17695 1404301 1481721 1573517 1683344 1814121 1946992 2084893 2291213 2442780 2565651 2812883
17685 2812883 3103688 3350519 3610127 3945585 4273397 4608652 4962339 5398999 5915482
17676 5915482 6455855 7129586 7980990 9113872 10555933 12447423 14989168 18321690 22655488
17667 22655488 28024171 34493807 42031232 50234073 58667462 66929546 74325185 80119832
$$ packed form
17743C81461M3860o587n9964J7083J5088k0293j3237O399J0454J327J9514L9082
17731D34187m6144k4529K9830M274K6051R239l3598j2778N2635J3670K43L4490
17719D87570K1093L4803L3395m111K4150N4365J02281L7138Q664l7841L3713L1488
17707H26708J7053K2440L029L9707K5242P9572N4438N9200N3296O7742R5777O0097
17695A404301P7420R1796J09827J30777J32871J37901K06320J51567J22871K47232
17685B812883K90805K46831K59608L35458L27812L35255L53687M36660N16483
17676E915482N40373O73731Q51404J132882J442061J891490K541745L332522M333798
17667B2655488N368683O469636P537425Q202841Q433389Q262084P395639N794647
$$ plain form
17659 80119832 84012625 86600023 88335421 89046782 89177339 89320512 89352265 88602412 86209328
17650 86209328 81514814 74855279 67078390 58410806 49672748 41657237 34775436 29013514
17642 29013514 24269302 20558301 17821541 15938012 14547950 13492382 12683269 12116214
17634 12116214 11700926 11368569 11148495 11013312 10930007 10915473 10998007 11248210 11655202 12215966
17624 12215966 13104530 14457920 16308163 18850428 22291798 26730397 32103625 38514153
17616 38514153 45642578 52962899 60336714 67392928 73240705 77037708 79518317 81491983
17608 81491983 82447595 81971944 81144668 80617351 79969456 78183939 74456627 69085851 62961645
17599 62961645 56004672 48305441 40669846 33950670 28235576 23391828 19508439 16462486
$$ packed form
17659H0119832L892793K587398J735398P11361J30557J43173L1753p49853k393084
17650H6209328m694514o659535p776889q667584q738058q015511o881801n761922
17642B9013514m744212l711001k736760j883529j390062j055568q09113n67055
17634A2116214m15288l32357k20074j35183q3305j4534Q2534K50203M06992N60764
17624A2215966Q88564J353390J850243K542265L441370M438599N373228O410528
17616C8514153P128425P320321P373815P056214N847777L797003K480609J973666
17608H1491983R55612m75651q27276n27317o47895j785517l727312n370776o124206
17599F2961645o956973p699231p635595o719176n715094m843748l883389l045953
$$ plain form
17591 16462486 14160529 12457913 11126865 10057611 9211620 8589764 8049723 7508991 7040271
17582 7040271 6612278 6180531 5817197 5490097 5186768 4935324 4687080 4414278 4191559
17573 4191559 3940262 3724832 3578196 3420411 3292962 3131528 2983095 2834133 2730205
17564 2730205 2638022 2542881 2483152 2376211 2314021 2294828 2210624 2127305 2070570 1987463 1918350
17553 1918350 1843212 1755398 1693335 1709405 1712833 1665545 1647111 1591474 1522397 1433270 1379590
17542 1379590 1302599 1240155 1256116 1265117 1271631 1237942 1133271 1148791 1188570 1149689 1073825
17531 1073825 1063326 1045250 1017615 1018205 999041 907617 894283 914729 901183 868736 847929 837992
17519 837992 797302 716302 717109 671702 654048 655344 647503 641034 649300 609744 589296 606767 626332
$$ packed form
17591A6462486k301957j702616j331048j069254q45991o21856n40041n40732m68720
17582G040271m27993m31747l63334l27100l03329k51444k48244k72802k22719
17573D191559k51297k15430j46636j57785j27449j61434j48433j48962j03928
17564B730205r2183r5141n9729j06941o2190j9193q4204q3319n6735q3107o9113
17553A918350p5138q7814o2063J6070L428m7288j8434n5637o9077q9127n3680
17542A379590p6991o2444J5961R001O514l3689j04671J5520L9779l8881p5864
17531A073825j0499j8076k7635N90j9164r1424j3334K0446j3546l2447k0807r937
17519H37992m0690q1000Q07m5407j7654J296p841o469Q266l9556k0448J7471J9565
$$ plain form
17506 626332 605749 610197 526411 429634 434635 393671 345243 375517 428875 417202 405519 384284
17494 384284 350888 301462 281226 299040 350861 288124 239710 304855 296873 275545 338224 343055
17482 343055 365213 407726 386540 346762 280003 218771 229950 250742 216630 185573 136721
17471 136721 137074 103538 45900 77280 85109 91919 105279 71357 92666 82452 46344 103311
17459 103311 114767 152748 175782 136782 61472 8528 51012 130716 119241 100728 141248
17448 141248 139805 167008 209716 213782 171302 165127 157838 101849 51714 34767 19103 9233
17436 9233 -1582 -14508 -8079 22142 71110 117227 81921 31737 8054 55717 68396 74561
17424 74561 50845 50742 82119 126535 150188 95810 66356 55484 38567 -5415 -28610 -14720
$$ packed form
17506F26332k0583M448q3786r6777N001m0964m8428L0274N3358j1673j1683k1235
17494C84284l3396m9426k0236J7814N1821o2737m8414O5145p982k1328O2679M831
17482C43055K2158M2513k1186l9778o6759o1232J1179K0792l4112l1057m8852
17471A36721L53l3536n7638L1380P829O810J3360l3922K1309j0214l6108N6967
17459A03311J1456L7981K3034l9000p5310n2944M2484P9704j1475j8513M0520
17448A41248j443K7203M2708M066m2480o175p289n5989n0135j6947j5664r870
17436I233j0815j2926O429L0221M8968M6117l5306n0184k3683M7663J2679O165
17424G4561k3716j03L1377M4416K3653n4378k9454j0872j6917m3982k3195J3890
$$ plain form
17412 -14720 22132 58313 58936 32416 27805 2217 -9810 -23365 -47560 -18175 318 5617
17400 5617 19261 55782 65335 54233 92484 113204 65652 43158 40466 51499 62272 45924
17388 45924 54419 120796 144662 128924 21533 -26982 42611 25674 -19473 -52981 -58021 -39916
17376 -39916 -3934 14456 -24013 -11606 -25514 -4656 21385 26147 31443 -12866 -31229 -21822
17364 -21822 34964 817 -32476 -15695 -26635 -1037 22096 28711 40780 52629 25945 -2388
17352 -2388 7673 73273 55590 14513 26498 22057 44361 -9083 17210 30036 4703 35179
17340 35179 41380 73210 77922 39524 -51920 -90574 -93192 -59195 -35777 -37946 -85433 -66717
17328 -66717 -41381 -10565 -50700 -66267 -35526 4138 -6754 -34386 15584 -15088 -88536 -115617
$$ packed form
17412a4720L6852L6181O23k6520m611k5588j2027j3555k4195K9385J8493N299
17400E617J3644L6521R553j1102L8251K0720m7552k2494k692J1033J0773j6348
17388D5924Q495O6377K3866j5738j07391m8515O9593j6937m5147l3508n040J8105
17376c9916L5982J8390l8469J2407j3908K0858K6041M762N296m4309j8363R407
17364b1822N6786l4147l3293J6781j0940K5598K3133O615J2069J1849k6684k8333
17352b388J0061O5600j7683m1077J1985m441K2304n3444K6293J2826k5333L0476
17340C5179O201L1830M712l8398r1444l8654k618L3997K3418k169m7487J8716
17328f6717K5336L0816m0135j5567L0741L9664j0892k7632M9970l0672p3448k7081
$$ plain form
17316 -115617 -51025 7701 8491 -46841 -106764 -135091 -103006 -95919 -72837 -142639 -112436 -35040
17304 -35040 19805 21630 18884 20404 -20965 -43333 -35918 -4299 -23474 -5785 -75925 -109599
17292 -109599 -110293 -65733 -65954 -49382 -3425 10156 -20891 -76828 -65909 -50619 -64423 -34456
17280 -34456 3717 -17808 -25977 -26175 -21921 -31715 -55461 -98233 -134161 -112504 -75213 -41373 -56740
17267 -56740 -42343 -45572 14410 76020 66569 49735 14431 19639 2208 -41929 13876 58588
17255 58588 27310 27660 61603 14086 -27745 -43605 -32794 -52760 -20299 35518 85954 22576
17243 22576 2130 -22866 -60746 -62049 -51476 -98317 -153427 -122570 -84086 -41850 -46484 -91728
17231 -91728 -104232 -89254 -57222 -42607 7966 6391 -40508 15896 12470 -45279 -45384 -26031
$$ packed form
17316a15617O4592N8726P90n5332n9923k8327L2085P087K3082o9802L0203P7396
17304c5040N4845J825k746J520m1369k2368P415L1619j9175J7689p0140l3674
17292a09599o94M4560k21J6572M5957J3581l1047n5937J0919J5290j3804K9967
17280c4456L8173k1525q169j98M254r794k3746m2772l5928K1657L7291L3840j5367
17267e6740J4397l229N9982O1610r451j6834l5304N208j7431m4137N5805M4712
17255E8588l1278L50L3943m7517m1831j5860J0811j9966L2461N5817N0436o3378
17243B2576k0446k4996l7880j303J0573m6841n5110L0857L8484M2236m634m5244
17231i1728j2504J4978L2032J4615N0573j575m6899N6404l426n7749j05J9353
$$ plain form
17219 -26031 -31561 -3122 -12762 -67092 -70151 -60648 -27576 -7324 -29850 -45401 -41536 9286 8556
17206 8556 -29702 -27740 -3320 -41299 -32612 -28037 13289 47263 8561 -19341 -58606 -84561
17194 -84561 -34710 1031 -21450 -13332 6062 63132 100763 105689 100893 33056 11479 -12489
17182 -12489 -49659 -21910 8037 -13919 -16944 9520 20598 -1523 -11780 -14811 -45067 -3258
17170 -3258 46705 96331 92010 76425 35075 23032 14150 -9215 -43559 -27319 -16572 -3053
17158 -3053 27400 70567 99765 136484 177766 204370 223369 266708 303722 319920 356431 389458
17146 389458 380125 345344 373309 401712 414146 399421 328609 302870 259022 264787 240879 190706
17134 190706 213228 206842 151330 165252 88774 69653 48648 4267 71326 127049 111449 53829
$$ packed form
17219b6031n530K8439r640n4330l059R503L3072K0252k2526j5551L865N0822p30
17206H556l8258J962K4420l7979Q687M575M1326L3974l8702k7902l9265k5955
17194h4561M9851L5741k2481Q118J9394N7070L7631M926m796o7837k1577k3968
17182a2489l7170K7749K9947k1956l025K6464J1078k2121j0257l031l0256M1809
17170c258M9963M9626m321j5585m1350j2043q882k3365l4344J6240J0747J3519
17158c053L0453M3167K9198L6719M1282K6604J8999M3339L7014J6198L6511L3027
17146C89458r333l4781K7965K8403J2434j4725p0812k5739m3848N765k3908n0173
17134A90706K2522o386n5512J3922p6478j9121k1005m4381O7059N5723j5600n7620
$$ plain form
17122 53829 -13599 4216 -24623 7343 30938 25675 13750 13668 30465 60849 104732 74049
17110 74049 57686 125783 192445 183670 240626 291312 310836 313668 346440 383043 361875 415624
17098 415624 403009 352699 345462 333195 333469 341650 344851 280092 273945 252964 187820 158141 166395
17085 166395 129248 64156 -5084 7478 20412 80404 92893 8267 -39476 -26332 -6041
17074 -6041 13715 26475 20590 -60 -19188 -41789 -58975 -73029 -32089 -25562 -67162 -79952
17062 -79952 -65313 -68825 -81764 -76736 -46875 -91323 -99737 -62205 -6179 31415 43487 26629
17050 26629 69098 95886 20448 -34596 -92275 -70846 -32104 -30757 -39733 -76594 -93663 -136377
17038 -136377 -76879 -79435 -75907 -125182 -111349 -99753 -116492 -106009 -95497 -4764 1459 -14072
$$ packed form
17122E3829o7428J7815k8839L1966K3595n263j1925q2J6797L0384M3883l0683
17110G4049j6363O8097O6662q775N6956N0686J9524K832L2772L6603k1168N3749
17098D15624j2615n0310p237j2267K74Q181L201o4759o147k0981o5144k9679Q254
17085A66395l7147o5092o9240J2562J2934N9992J2489q4626m7743J3144K0291
17074f041J9756J2760n885k0650j9128k2601j7186j4054M0940O527m1600j2790
17062g9952J4639l512j2939N028K9861m4448q414L7532N6026L7594J2072j6858
17050B6629M2469K6788p5438n5044n7679K1429L8742J347q976l6861j7069m2714
17038a36377N9498k556L528m9275J3833J1596j6739J0483J0512R0733O223j5531
$$ plain form
17026 -14072 -32690 -44191 -38404 -37724 -60525 -58135 -45904 -29326 -25730 -14976 -20722 -12832 14846
17013 14846 -21382 -86154 -91049 -113669 -160814 -160952 -103856 -140295 -151886 -119538 -140077 -130070
17001 -130070 -141046 -122681 -32389 13623 2664 -46602 -45714 -12952 -10643 -5798 -23136 -51009
16989 -51009 -110674 -111257 -69439 -26049 -44684 -28685 9253 3551 -47883 -31933 -62380 -80874
16977 -80874 -94189 -112546 -93068 -9683 -10411 -50757 -28430 -53552 -50457 -30616 -20845 -47327
16965 -47327 -6283 1526 410 -8476 18380 189 -14268 -16758 -31715 -11788 1418 -34210
16953 -34210 -3943 31948 17726 -17617 -12754 -35662 -65271 -68635 -25630 -30594 -45469 -69985
16941 -69985 -103862 -161550 -176998 -136039 -94233 -115208 -77029 -44543 -46545 25502 72076 53692
$$ packed form
17026a4072j8618j1501N787O80k2801K390J2231J6578L596J0754n746P890K7678
17013A4846l6228o4772m895k2620m7145j38N7096l6439j1591L2348k0539J0007
17001a30070j0976J8365R0292M6012j0959m9266Q88L2762K309M845j7338k7873
16989e1009n9665n83M1818M3390j8635J5999L7938n702n1434J5950l0447j8494
16977h0874j3315j8357J9478Q3385p28m0346K2327k5122L095J9841R771k6482
16965d7327M1044P809j116q886K6856j8191j4457k490j4957J9927J3206l5628
16953c4210L0267L5891j4222l5343M863k2908k9609l364M3005m964j4875k4516
16941f9985l3877n7688j5448M0959M1806k0975L8179L2486k002P2047M6574j8384
$$ plain form
16929 53692 31447 37663 12717 -15988 -3587 -14164 27640 -32713 -64273 -55596 -71582 -92055
16917 -92055 -96955 -74489 -36554 -43748 -41858 -42879 -38010 -46332 -2977 -29493 -51387 -52174 -102032
16904 -102032 -156382 -155654 -166930 -168727 -144594 -78903 -84172 -77597 -46557 -13523 21654 -4549
16892 -4549 -37171 -49890 -97639 -111767 -78717 -68565 -56661 -28179 -52628 -65887 -44547 -96703
16880 -96703 -64086 -35087 5891 66142 64263 26129 -23876 -19661 -10796 -8817 -9446 -6152 7462
16867 7462 19724 12779 31549 -7830 -49324 -68403 -39074 -3223 3430 35139 33769 -19160
16855 -19160 -38114 -66410 -51717 -2375 15473 1651 -34903 -51547 -11151 34640 37094 -9220
16843 -9220 -42116 -15292 30585 -9534 -62321 -63665 -30065 17956 62362 101425 55831 -874
$$ packed form
16929E3692k2245O216k4946k8705J2401j0577M1804o0353l1560Q677j5986k0473
16917i2055m900K2466L7935p194J890j021M869q322M3355k6516k1894p87m9858
16904a02032n4350P28j1276j797K4133O5691n269O575L1040L3034L5177k6203
16892d549l2622j2719m7749j4128L3050J0152J1904K8482k4449j3259K1340n2156
16880i6703L2617K8999M0978O0251j879l8134n0005M215Q865J979o29L294J3614
16867G462J2262o945J8770l9379m1494j9079K9329L5851O653L1709j370n2929
16855a9160j8954k8296J4693M9342J7848j3822l6554j6644M0396M5791K454m6314
16843i220l2896K6824M5877m0119n2787j344L3600M8021M4406L9063m5594n6705
$$ plain form
16831 -874 -1193 17150 6697 16627 -23228 -67671 -37819 -43190 -36396 -51813 -56427 -82576 -30205
16818 -30205 -3209 7926 10684 -28315 -28534 -62010 -24382 2380 -19160 -43436 -43246 -28193 -30732
16805 -30732 -23261 -21456 -41404 -92199 -99902 -45681 497 -7775 -29814 -16327 -36485 -52129
16793 -52129 -9244 40170 57111 64188 54175 25407 -46183 -21138 -21274 -71235 -49240 -16590
16781 -16590 -7160 -931 23111 -42998 -55048 -45815 -71438 -112818 -104698 -81770 -92812 -110321
16769 -110321 -149257 -162286 -127096 -139951 -72787 -10302 12472 -56813 -105590 -135018 -86080
16758 -86080 -36738 -19254 3242 6925 45570 55240 64962 11561 -2655 -28006 -55890 -32985
16746 -32985 -22548 -65062 -63706 -29902 -42481 -45718 -48958 -93951 -81127 -64886 42776 96428
$$ packed form
16831h74l19J8343j0453R930l9855m4443K9852n371O794j5417m614k6149N2371
16818c0205K6996J1135K758l8999k19l3476L7628K6762k1540k4276J90J5053k539
16805c0732P471J805j9948n0795p703N4221M6178q272k2039J3487k0158j5644
16793e2129M2885M9414J6941P077j0013k8768p1590K5045j36m9961K1995L2650
16781a6590R430O229K4042o6109j2050R233k5623m1380Q120K2928j1042j7509
16769a10321l8936j3029L5190j2855O7164O2485K2774o9285m8777k9428M8938
16758h6080M9342J7484K2496L683L8645R670R722n3401j4216k5351k7884K2905
16746c2985J0437m2514J356L3804j2579l237l240m4993J2824J6241J07662N3652
$$ plain form
16734 96428 59771 -21505 -69616 -29876 -23932 -28983 -50899 -70329 -86868 -131111 -157515 -173576
16722 -173576 -138720 -116086 -115846 -65991 -73225 -96818 -51914 39601 132694 156533 97510 69456
16710 69456 17869 3593 854 16026 8576 -38014 -70031 -57877 -48991 -77296 -93537 -119753
16698 -119753 -112509 -98488 -120626 -115841 -50656 -52961 -59642 -53665 -66553 -94465 -90413 -55576 -23601
16685 -23601 -45459 -77618 -24287 -5078 22592 70706 22942 -27011 -4675 -2561 4694 -16636
16673 -16636 -88504 -61154 -43538 -37537 -44685 -65420 -39221 18938 -2470 -34593 -40374 -53588
16661 -53588 -124984 -141602 -86856 -67367 -44932 -15073 -25492 -49701 -70572 -51220 -83914 -95448
16649 -95448 -88747 -109687 -98984 -90667 -74335 -81828 -43573 -3727 -20524 -43794 -32878 -9567
$$ packed form
16734I6428l6657q1276m8111L9740N944n051k1916j9430j6539m4243k6404j6061
16722a73576L4856K2634K40M9855p234k3593M4904R1515R3093K3839n9023k8054
16710F9456n1587j4276k739J5172p450m6590l2017J2154Q886k8305j6241k6216
16698a19753P244J4021k2138M785O5185k305o681N977j2888k7912M052L4837L1975
16685b3601k1858l2159N3331J9209K7670M8114m7764m9953K2336K114P255k1330
16673a6636p1868K7350J7616O001p148k0735K6199N8159k1408l2123n781j3214
16661e3588p1396j6618N4746J9489K2435K9859j0419k4209k0871J9352l2694j1534
16649i5448O701k0940J0703Q317J6332p493L8255L9846j6797k3270J0916K3311
$$ plain form
16637 -9567 -1096 -49583 -42578 -94480 -109833 -79364 -114850 -124911 -54672 -19044 -43241 -61220
16625 -61220 -95609 -98513 -62941 -45098 10233 24834 64526 43469 -23200 -51127 -71137 -73064
16613 -73064 -67868 -74306 -84730 -57766 -26229 -15833 -20265 19513 -5495 -48999 -48610 -56028 -14887
16600 -14887 -36068 -79588 -41945 7222 8322 24327 -10365 -29179 -62668 -106502 -58188 -34419
16588 -34419 -20773 -353 -5187 -39697 -46612 -4710 40667 8564 -59519 -64952 -67075 -51853
16576 -51853 -65840 -42937 -35592 35746 118675 70907 45686 69005 67606 723 -38342 -40236
16564 -40236 -61081 -31418 -45050 -94963 -112769 -105223 -84187 -94971 -52568 -38916 -47361 -64241
16552 -64241 -102738 -80209 -65865 -35444 -1636 6253 -15729 -46726 -72567 -57953 -31599 -22106
$$ packed form
16637i567Q471m8487P005n1902j5353L0469l5486j0061P0239L5628k4197j7979
16625f1220l4389k904L5572J7843N5331J4601L9692k1057o6669k7927k0010j927
16613g3064N196o438j0424K6964L1537J0396m432L9778k5008m3504L89p418M1141
16600a4887k1181m3520L7643M9167J100J6005l4692j8814l3489m3834M8314K3769
16588c4419J3646K0420m834l4510o915M1902M5377l2103o8083n433k123J5222
16576e1853j3987K2903P345P1338Q2929m7768k5221K3319j399o6883l9065j894
16564d0236k0845K9663j3632m9913j7806P546K1036j0784M2403J3652q445j6880
16552f4241l8497K2529J4344L0421L3808P889k1982l0997k5841J4614K6354R493
$$ plain form
16540 -22106 -2910 -9223 -44653 -107822 -77709 -39731 -27230 -72114 -90967 -96171 -123919 -106844
16528 -106844 -46289 -31437 -51519 -73374 -74692 -67860 -33710 -65453 -128932 -131083 -67399 -37593
16516 -37593 -53607 -104966 -95442 -101849 -117927 -102852 -90369 -71671 -50101 -15108 -44558 -55679
16504 -55679 -47569 -23291 -40220 -53177 -30437 -36506 -45047 -61715 -56030 28606 70593 38838
16492 38838 -43289 -62419 -33099 8826 8792 -16077 -7795 -10621 20139 17610 -4210 -3826 -35064
16479 -35064 -23371 14882 -31557 -76629 -71289 -32393 -25278 -24873 -81769 -91010 -56917 -43636 -68331
16466 -68331 -43749 -5060 21443 -74 25005 -38994 -51562 -78341 -39648 61557 93406
16455 93406 33503 -1294 -3388 -10115 -45498 -95739 -75648 -80508 -74714 -33891 -33088 -27188 -37535
$$ packed form
16540b2106J9196o313l5430o3169L0113L7978J2501m4884j8853n204k7748J7075
16528a06844O0555J4852k0082k1855j318O832L4150l1743o3479k151O3684K9806
16516c7593j6014n1359R524o407j6078J5075J2483J8698K1570L4993k9450j1121
16504e5679Q110K4278j6929j2957K2740o069q541j6668N685Q4636M1987l1755
16492C8838q2127j9130K9320M1925l4k4869Q282k826L0760k529k1820L84l1238
16479c5064J1693L8253m6439m5072N340L8896P115M05n6896r241L4093J3281k4695
16466f8331K4582L8689K6503k1517K5079o3999j2568k6779L8693J01205L1849
16455I3406n9903l4797k094o727l5383n0241K0091m860N794M0823Q03N900j0347
$$ plain form
16442 -37535 -36085 -53204 -70766 -74097 -18927 -12797 -60421 -90507 -95108 -61340 -38333 -56203
16430 -56203 -27975 1790 -38239 -62203 -22773 21630 5610 -14304 -19750 -29376 -74293 -52667
16418 -52667 -67158 -27599 7670 4555 -22077 7687 45095 36349 -11764 -35983 -42577 -45085
16406 -45085 15647 31914 31423 44693 88784 61989 38743 -55440 -93150 -51152 -36577 4558
16394 4558 18548 3150 1563 -3181 -2115 -24996 -59869 -71910 -103769 -155856 -145822 -94085
16382 -94085 -71412 -1140 6242 -28391 -30392 22287 19622 -832 17232 19423 139 -6736 -13478
16369 -13478 1583 -34309 -60665 -63730 -33818 -60833 -48967 -27638 8254 1870 6360 11858
16357 11858 -24165 -63255 -30157 -42934 -71566 -93547 -60761 -42365 -41113 -76839 -70680 -69631
$$ packed form
16442c7535J450j7119j7562l331N5170O130m7624l0086m601L3768K3007j7870
16430e6203K8228K9765m0029k3964L9430M4403j6020j9914n446r626m4917K1626
16418e2667j4491L9559L5269l115k6632K9764L7408q746m8113k4219o594k508
16406d5085O0732J6267m91J3270M4091k6795k3246r4183l7710M1998J4575M1135
16394D558J3990j5398j587m744J066k2881l4873j2041l1859n2087J0034N1737
16382i4085K2673P0272P382l4633k001N2679k665k0454J8064K191j9284o875o742
16369a3478J5061l5892k6356l065K9912k7015J1866K1329L5892o384M490N498
16357A1858l6023l9090L3098j2777k8632k1981L2786J8396J252l5726O159J049
$$ plain form
16345 -69631 -83855 -34089 -26083 -45225 -12811 1111 7705 -25935 -42471 -73787 -67087 -98824
16333 -98824 -109277 -25673 -29674 -27934 -44612 -15702 52862 117342 70901 28371 32981 71603
16321 71603 103505 42501 5659 9636 27173 40121 37169 -18543 -64007 -39444 54549 106413
16309 106413 49625 29398 -9591 -43904 -66687 -95085 -61851 -12892 77542 50936 -2159
16298 -2159 11630 20345 29910 72133 86890 29369 24414 38056 -17152 -28336 -51335 -31396
16286 -31396 9438 40791 47519 37969 -2800 17616 55992 131737 169468 147539 152589 181549
16274 181549 173089 195358 198122 213595 242678 259254 320156 385802 503742 572993 701917
16263 701917 897559 1096005 1300619 1504522 1712685 1871653 1923138 1930633 1988529 2026044
$$ packed form
16345f9631j4224M9766Q006j9142L2414J3922O594l3640j6536l1316O700l1737
16333i8824j0453Q3604m001J740j6678K8910O8564O4480m6441m2530M610L8622
16321G1603L1902o1004l6842L977J7537J2948k952n5712m5464K4563R3993N1864
16309A06413n6788k0227l8989l4313k2783k8398L3234M8959R0434k6606n3095
16298b159J3789Q715R565M2223J4757n7521m955J3642n5208j1184k2999J9939
16286c1396M0834L1353O728r550m0769K0416L8376P5745L7731k1929N050K8960
16274A81549q460K2269K764J5473K9083J6576O0902O5646J17940O9251J28924
16263G01917J95642J98446K04614K03903K08163J58968N1485P495N7896L7515
$$ plain form
16253 2026044 1943016 1857995 1715282 1511879 1302874 1090779 927705 836299 742165 640772
16243 640772 544882 465027 426524 372511 328488 280506 224980 162818 141043 112246 139529
16232 139529 140343 118316 138183 87236 100810 105994 118563 166799 154157 133298 148706 66080
16220 66080 17576 52464 60582 94377 110463 106478 39242 -9453 21615 103779 92307 75887
16208 75887 66525 36099 -28149 -20222 -5181 -80995 -77806 -9029 6053 18841 2423 -3395
16196 -3395 20986 40916 69116 40935 34811 28392 47997 34335 38623 26327 27636 54417 43829
16183 43829 19664 -17555 -66243 1651 73691 105734 80974 51661 56787 14866 8840 2454
16171 2454 14074 2492 -38023 -25547 9628 -10657 -17628 5805 -373 -46620 -23153 -5574
$$ packed form
16253B026044q3028q5021j42713k03403k09005k12095j63074r1406r4134j01393
16243F40772r5890p9855l8503n4013m4023m7982n5526o2162k1775k8797K7283
16232A39529Q14k2027J9867n0947J3574N184J2569M8236j2642k0859J5408q2626
16220F6080m8504L4888Q118L3795J6086l985o7236m8695L1068Q2164j1472j6420
16208G5887r362l0426o4248P927J5041p5814L189O8777J5082J2788j6418n818
16196c395K4381J9930K8200k8181o124o419J9605j3662M288j2296J309K6781j0588
16183D3829k4165l7219m8688O7894P2040L2043k4760k9313N126m1921o026o386
16171B454J1620j1582m0515J2476L5175k0285o971K3433o178m6247K3467J7579
$$ plain form
16159 -5574 -18154 -33314 -56786 -181 42847 -12087 -32182 -48342 -44611 -41755 -71807 -16514
16147 -16514 50588 80010 93458 61819 -37256 -80448 -2546 41971 49599 80256 78185 84640
16135 84640 50001 -13741 20603 72987 72947 82721 111354 107686 81872 48840 11573 -116 883
16122 883 -31315 -78683 -12310 3418 67328 106673 86498 44429 26875 64932 90978 73400
16110 73400 60732 81426 90844 57173 37311 111438 121997 147154 112784 73013 67040 47536
16098 47536 -1269 -7511 -9337 6101 10178 13543 26682 7706 57176 108276 106636 115515 94302
16085 94302 50067 31612 43600 41066 33668 14278 55867 75149 106961 130266 139475 136861
16073 136861 133185 109473 95663 70286 60067 133770 218611 237925 197585 171777 169067 218271
$$ packed form
16159e574j2580j5160k3472N6605M3028n4934k0095j6160L731K856l0052N5293
16147a6514O7102K9422J3448l1639r9075m3192P7902M4517P628L0657k071O455
16135H4640l4639o3742L4344N2384m0R774K8633l668k5814l3032l7267j1689R99
16122H83l2198m7368O6373J5728O3910L9345k0175m2069j7554L8057K6046j7578
16110G3400j2668K0694R418l3671j9862P4127J0559K5157l4370l9771n973j9504
16098D7536m8805o242j826J5438M077L365J3139j8976M9470N1100j640Q879k1213
16085I4302m4235j8455J1988k534p398j9390M1589J9282L1812K3305R209k614
16073A36861l676k3712j3810k5377j0219P3703Q4841J9314m0340k5808k710M9204
$$ plain form
16061 218271 294029 383862 411979 371442 342245 395698 422063 420112 417242 426182 358190 342113
16049 342113 347413 309113 313611 244504 219317 216677 186067 142181 141509 193951 201960 161337 199870
16036 199870 250030 270263 300798 275856 270530 265144 277918 289921 256509 266943 260177 273141
16024 273141 301733 274268 225413 234260 252021 220441 193797 215347 232275 231071 241986 178881
16012 178881 211698 195498 183797 189605 208395 229695 205733 213815 241355 268088 235267 245759
16000 245759 243795 264883 298455 338661 326068 378225 442409 438192 398096 423503 452661 476364
15988 476364 503744 481036 455226 434057 406439 359193 347668 338136 254693 240997 222870 220261
15976 220261 283574 336061 354131 333030 329563 308498 303228 323832 317824 372352 394762 380280
$$ packed form
16061B18271P5758Q9833K8117m0537k9197N3453K6365j951k870Q940o7992j6077
16049C42113N300l8300M498o9107k5187k640l0610m3886o72N2442Q009m0623L8533
16036A99870N0160K0233L0535k4942n326n386J2774J2003l3412J0434o766J2964
16024B73141K8592k7465m8855Q847J7761l1580k6644K1550J6928j204J0915o3105
16012A78881L2817j6200j1701N808J8790K1300k3962Q082K7540K6733l2821J0492
16000B45759j964K1088L3572M0206j2593N2157O4184m217m0096K5407K9158K3703
15988D76364K7380k2708k5810k1169k7618m7246j1525r532q3443j3696j8127k609
15976B20261O3313N2487J8070k1101l467k1065n270K0604o008N4528K2410j4482
$$ plain form
15964 380280 312245 336490 411479 418149 371674 392921 362341 360238 371328 373691 378110 382586
15952 382586 421304 449714 449053 437270 521287 563585 576962 597198 580736 520804 498208 548560
15940 548560 620620 677961 653870 661134 636868 651437 681861 713246 707408 704677 749882 790521
15928 790521 845882 880659 828620 826650 851796 834165 786194 773521 769143 723828 650899 597747
15916 597747 580157 595962 641304 671101 686953 727181 739291 753390 732624 678748 740075
15905 740075 789772 830463 843736 837242 809775 803940 806678 876304 904858 913739 907225 885104
15893 885104 950697 1012351 1082629 1100047 1110681 1094273 1140125 1215945 1217588 1275134 1348492 1367207
15881 1367207 1395325 1440378 1482690 1547814 1555422 1587351 1604072 1689304 1732760 1773519 1813817
$$ packed form
15964C80280o8035K4245P4989O670m6475K1247l0580k103J1090K363M419M476
15952C82586L8718K8410o61j1783Q4017M2298J3377K0236j6462n9932k2596N0352
15940E48560P2060N7341k4091P264k4266J4569L0424L1385n838k731M5205M0639
15928G90521N5361L4777n2039j970K5146j7631m7971j2673m378m5315p2929n3152
15916E97747j7590J5805M5342K9797J5852M0228J2110J4099k0766n3876O1327
15905G40075M9697M0691J3273o494k7467n835K738O9626K8554Q881o514k2121
15893H85104O5593O1654P0278J7418J0634j6408M5852P5820J643N7546P3358J8715
15881A367207K8118M5053M2312O5124P608L1929J6721Q5232M3456M0759M0298
$$ plain form
15870 1813817 1884230 1958902 2035901 2121235 2237576 2341664 2384177 2451277 2498334 2567254 2691462
15859 2691462 2769354 2835764 2888801 2917573 3037932 3130210 3223414 3418384 3591031 3720578
15849 3720578 3826175 3989385 4194354 4386956 4608470 4851572 5085125 5273421 5490294
15840 5490294 5835427 6195102 6610334 7058802 7506337 8019824 8595724 9234621 9964050
15831 9964050 10690127 11516661 12444480 13538106 14754759 16176034 17833777 19768394 21990701
15822 21990701 24551798 27539310 30955596 35002086 39882326 45661070 52767249 61707889
15814 61707889 73187968 88012210 107215310 131721486 162185154 198590342 240020209
15807 240020209 284351739 328543383 368956404 401728020 423658106 432566148 427594112
$$ packed form
15870A813817P0413P4672P6999Q5334J16341J04088M2513O7100M7057O8920J24208
15859B691462P7892O6410N3037K8772J20359R2278R3204J94970J72647J29547
15849C720578J05597J63210K04969J92602K21514K43102K33553J88296K16873
15840E490294L45133L59675M15232M48468M47535N13487N75900O38897P29429
15831I964050P26077Q26534R27819J093626J216653J421275J657743J934617K222307
15822B1990701K561097K987512L416286M046490M880240N778744P106179Q940640
15814F1707889J1480079J4824242J9203100K4506176L0463668L6405188M1429867
15807B40020209M4331530M4191644M0413021L2771616K1930086Q908042m972036
$$ plain form
15800 427594112 409407663 380049222 342615290 300561387 257539036 216664220 180042546
15793 180042546 148950820 123647023 103671153 88198317 76140729 66638009 59053057
15786 59053057 52845907 47672963 43279259 39476968 36101850 33061997 30318546 27923949
15778 27923949 25840443 24039809 22436054 21062643 19870377 18711178 17706439 16872743
15770 16872743 16086944 15335547 14627799 13968614 13401787 12876110 12386372 11929764 11441601
15761 11441601 10970575 10520087 10147985 9833546 9498738 9167596 8881509 8571370 8299451
15752 8299451 8034536 7789598 7572232 7381861 7138450 6840793 6543522 6367049 6173592
15743 6173592 6036568 5903542 5797270 5670619 5487972 5281689 5105027 4976690 4820272
$$ packed form
15800D27594112j8186449k9358441l7433932m2053903m3022351m0874816l6621674
15793A80042546l1091726k5303797j9975870j5472836j2057588r502720p584952
15786E9053057o207150n172944m393704l802291l375118l039853k743451k394597
15778B7923949k083506j800634j603755j373411j192266j159199j004739q33696
15770A6872743p85799p51397p07748o59185n66827n25677m89738m56608m88163
15761A1441601m71026m50488l72102l14439l34808l31142k86087l10139k71919
15752H299451k64915k44938k17366j90371k43411k97657k97271j76473j93457
15743F173592j37024j33026j06272j26651j82647k06283j76662j28337j56418
$$ plain form
15734 4820272 4681099 4535665 4346572 4231478 4152757 4092367 3984534 3854793 3684670 3575936
15724 3575936 3506578 3427128 3295661 3206789 3129798 3030818 2919217 2834522 2816198 2718088 2689050
15713 2689050 2658338 2560497 2503229 2447738 2444293 2411555 2367853 2313566 2280709 2183191 2077249
15702 2077249 2000067 1975304 1945569 1879960 1849406 1838896 1771586 1713236 1713424 1644412 1604096 1567050
15690 1567050 1562199 1586679 1596066 1538385 1480588 1482150 1453716 1456098 1479537 1511713 1513761 1526034
15678 1526034 1542729 1553817 1570586 1572048 1573169 1512711 1458213 1411330 1312322 1198513 1119268
15667 1119268 1086435 1040601 947161 880016 877127 858104 812098 831186 806834 810656 852273 802940
15655 802940 727571 772011 779068 713581 708689 706213 687612 680465 720978 708687 658020 605784
$$ packed form
15734D820272j39173j45434j89093j15094p8721o0390j07833j29741j70123j08734
15724C575936o9358p9450j31467q8872p6991r8980j11601q4695j8324r8110k9038
15713B689050l0712r7841n7268n5491l445l2738m3702n4287l2857r7518j05942
15702B077249p7182k4763k9735o5609l0554j0510o7310n8350J88o9012m0316l7046
15690A567050m851K4480R387n7681n7797J562k8434K382K3439L2176K048J2273
15678A526034J6695J1088J6769J462J121o0458n4498m6883r9008j13809p9245
15667A119268l2833m5834r3440o7145k889j9023m6006J9088k4352L822M1617m9333
15655H02940p5369M4440P057o5487m892k476j8601p147M0513j2291n0667n2236
$$ plain form
15643 605784 585510 533985 537795 594826 587601 527362 498110 497032 489475 502594 463440 446049
15631 446049 516290 580314 573510 479133 445386 455295 441327 376150 297330 270402 267022 270268
15619 270268 230415 179068 166830 123605 68177 46414 21606 40099 37019 19546 51252 87291
15607 87291 127768 177524 277537 318602 311091 290368 259682 239423 245249 292788 286731 287297
15595 287297 263927 280654 344706 391938 325217 304146 348323 377482 308323 272603 202028
15584 202028 145448 181829 208269 201106 191908 191187 202631 234112 250189 238772 234818 243989 262668
15571 262668 244939 211969 177605 197806 250372 217034 193377 203433 189670 193587 175807 182860
15559 182860 152637 138938 194993 203478 200422 221846 214254 210859 267370 238920 169411 160310
$$ packed form
15643F05784k0274n1525L810N7031p225o0239k9252j078p557J3119l9154j7391
15631D46049P0241O4024o804r4377l3747R909j3968o5177p8820k6928l380L246
15619B70268l9853n1347j2238m3225n5428k1763k4808J8493l080j7473L1706L6039
15607H7291M0477M9756J00013M1065p511k0723l0686k0259N826M7539o057N66
15595B87297k3370J6727O4052M7232o6721k1071M4177K9159o9159l5720p0575
15584B02028n6580L6381K6440p163r198p21J1444L1481J6077j1417l954R171J8679
15571B62668j7729l2970l4364K0201N2566l3338k3657J0056j3763L917j7780P053
15559A82860l0223j3699N6055Q485l056K1424p592l395N6511k8450o9509r101
$$ plain form
15547 160310 171048 199559 220013 301696 333007 294115 240620 216404 180259 153371 206390
15536 206390 245910 222179 227072 231228 235724 191565 187782 211274 140025 123273 125802 179323
15524 179323 200159 199499 161424 193680 226478 251749 250405 216786 204928 149911 104496 71951
15512 71951 53660 91909 81680 42364 6648 36935 95174 113919 153493 127502 61216 -9533
15500 -9533 -33151 5376 61855 64962 50981 104864 123480 101193 88258 46536 9805 56228
15488 56228 101207 87269 96129 57047 60960 52594 56108 83926 108243 111222 113391 104501 63478
15475 63478 32101 58508 82517 48191 20738 15838 32700 22141 9100 41005 37830 50455
15463 50455 11871 -37439 -34086 30668 72730 112773 109268 66480 79426 88652 68359 55910
$$ packed form
15547A60310J0738K8511K0454Q1683L1311l8892n3495k4216l6145k6888N3019
15536B06390L9520k3731M893M156M496m4159l783K3492p1249j6752K529N3521
15524A79323K0836o60l8075L2256L2798K5271j344l3619j1858n5017m5415l2545
15512G1951j8291L8249j0229l9316l5716L0287N8239J8745L9574k5991o6286p0749
15500i533k3618L8527N6479L107j3981N3883J8616k2287j2935m1722l6731M6423
15488E6228M4979j3938Q860l9082L913q366L514K7818K4317K979K169q890m1023
15475F3478l1377K6407K4009l4326k7453m900J6862j0559j3041L1905l175J2625
15463E0455l8584m9310L353O4754M2062M0043l505m2788J2946R226k0293j2449
$$ plain form
15451 55910 74227 61026 71753 75867 97830 106486 82960 52227 82565 136351 159092 170258
15439 170258 148111 122972 108871 138908 131298 62926 55896 69292 41328 66582 64278 71692
15427 71692 69343 99480 121783 147201 127656 100500 87425 126255 128412 88788 77831 54585
15415 54585 62865 95159 126188 145958 102506 37038 -19311 8454 47813 66716 96942 124826
15403 124826 144017 177448 178490 165926 182650 140118 124918 74327 73040 96875 72908 85813
15391 85813 80196 85739 122016 96962 55852 73150 121888 95373 46433 11494 29356 13191
15379 13191 -40609 -52073 49589 70655 120541 174457 184099 173379 149891 137209 116707 138919
15367 138919 103671 80496 111574 146740 199969 262163 301163 320060 292599 284055 269724 294311
$$ packed form
15451E5910J8317j3201J0727M114K1963Q656k3526l0733L0338N3786K2741J1166
15439A70258k2147k5139j4101L0037p610o8372p030J3396k7964K5254k304P414
15427G1692k349L0137K2303K5418j9545k7156j3075L8830K157l9624j0957k3246
15415E4585Q280L2294L1029J9770m3452o5468n6349K7765L9359J8903L0226K7884
15403A24826J9191L3431J042j2564J6724m2532j5200n0591j287K3835k3967J2905
15391H5813n617N543L6277k5054m1110J7298M8738k6515m8940l4939J7862j6165
15379A3191n3800j1464J01662K1066M9886N3916R642j0720k3488j2682k0502K2212
15367A38919l5248k3175L1078L5166N3229O2194L9000J8897k7461q544j4331K4587
$$ plain form
15355 294311 373222 499483 552576 699705 827862 946582 1101938 1291293 1474113 1677523
15345 1677523 1824668 1881657 1954002 1977974 1980834 1925188 1748944 1589096 1428441 1234365
15335 1234365 1086497 954940 737330 579993 516818 432449 329599 309727 300494 285907
15325 285907 222287 231498 228009 220885 209108 195018 219091 221590 185080 162678 150211 100799
15313 100799 29904 31127 66514 70245 13756 -24735 -11960 -1094 3316 32859 36835 41328
15301 41328 -1435 -29204 -35936 -87390 -51352 -32339 -18672 8916 55748 35673 80562 89553
15289 89553 40436 29468 71689 90890 79271 35213 15861 51096 24390 20731 5583 -41738
15277 -41738 -36635 18233 79152 102049 59918 -6637 -54666 -71403 -29451 -47814 14625 45138
$$ packed form
15355B94311P8911J26261N3093J47129J28157J18720J55356J89355J82820K03410
15345A677523J47145N6989P2345K3972K860n5646j76244j59848j60655j94076
15335A234365j47868j31557k17610j57337o3175q4369j02850j9872r233j4587
15325B85907o3620R211l489p124j1777j4090K4073K499l6510k2402j2467m9412
15313A00799p0895J223L5387L731n6489l8491J2775J0866M410K9543L976M493
15301D1328m2763k7769o732n1454L6038J9013J3667K7588M6832k0075M4889Q991
15289H9553m9117j0968M2221J9201j1619m4058j9352L5235k6706l659j5148m7321
15277d1738N103N4868O0919K2897m2131o6555m8029j6737M1952j8363O2439L0513
$$ plain form
15265 45138 19634 62346 85989 63148 44976 1790 -45764 -64372 -29885 -27150 -23570 -21400
15253 -21400 -50801 23452 72146 77680 31791 -50515 -66854 -130040 -115629 -83711 -91464 -66243
15241 -66243 -75936 -99992 -84173 -70898 23150 57464 32415 6157 6642 38152 19982 20816 20297
15228 20297 81491 87114 43139 21274 -3435 -5389 5712 -9041 45171 37547 -15235 -22353
15216 -22353 36049 70690 37275 25148 24918 36078 -7155 -16724 -33507 -57037 -27824 12392
15204 12392 33392 24514 -6058 -30243 -28618 30847 43953 12982 7955 55538 46287 12354
15192 12354 15517 68737 137142 159914 68331 -8104 11451 7235 12882 20632 -3712 -14895
15180 -14895 -6829 -40566 -9373 35439 1487 -20693 -71103 -80142 -56919 -26132 -19383 -14180
$$ packed form
15265D5138k5504M2712K3643k2841j8172m3186m7554j8608L4487K735L580K170
15253b1400k9401P4253M8694N534m5889q2306j6339o3186J4411L1918p753K5221
15241f6243r693k4056J5819J3275R4048L4314k5049k6258M85L1510j8170Q34n19
15228B0297O1194N623m3975k1865k4709j954J1101j4753N4212p624n2782p118
15216b2353N8402L4641l3415j2127k30J1160m3233r569j6783k3530K9213M0216
15204A2392K1000q878l0572k4185J625N9465J3106l0971n027M7583r251l3933
15192A2354L163N3220O8405K2772r1583p6435J9555m216N647P750k4344j1183
15180a4895Q066l3737L1193M4812l3952k2180n0410r039K3223L0787O749N203
$$ plain form
15168 -14180 49472 103337 49572 -8070 -20067 -15052 -24848 -39216 -33887 -20522 -27109 -67157
15156 -67157 -72428 -77452 -77855 -15202 24721 1358 3333 -55953 -81786 -52219 -38939 -70727 -37163
15143 -37163 -67269 -112625 -55576 -77529 -64153 -52489 -17010 -11486 -13860 -36577 -36501 778 29985
15130 29985 10083 7333 47563 27476 21744 30067 10777 -49113 -99994 -97556 -63608 -39786
15118 -39786 -17598 5126 16548 -21280 -85974 -137745 -108221 -67044 -27877 -17687 8499 -7933
15106 -7933 -22689 -269 -30282 4186 16703 26012 43570 7164 2396 11184 -16773 -57120
15094 -57120 -27769 -8874 -37630 -89321 -133638 -189064 -141226 -96188 -24303 54721 59275 58471
15082 58471 26715 -52407 -111831 -90955 -73008 -79944 -60347 -72576 -52798 22981 61016 89528
$$ packed form
15168a4180O3652N3865n3765n7642j1997N015r796j4368N329J3365o587m0048
15156f7157n271n024m03O2653L9923k3363J975n9286k5833K9567J3280l1788L3564
15143c7163l0106m5356N7049k1953J3376J1664L5479N524k374k2717P6L7279K9207
15130B9985j9902k750M0230k0087n732Q323j9290n9890n0881K438L3948K3822
15118c9786K2188K2724J1422l7828o4694n1771K9524M1177L9167J0190K6186j6432
15106g933j4756K2420l0013L4468J2517R309J7558l6406m768Q788k7957m0347
15094e7120K9351J8895k8756n1691m4317n5426M7838M5038P1885P9024M554q04
15082E8471l1756p9122n9424K0876J7947o936J9597j2229J9778P5779L8035K8512
$$ plain form
15070 89528 60717 54950 12462 1283 10922 10382 -43806 -100381 -104705 -53633 -44742 -19944 29440
15057 29440 48655 58273 90340 51390 413 23067 7779 17775 69923 29786 -11725 -30820
15045 -30820 -23178 38586 9669 -25183 43729 32618 -3317 -1304 1414 3284 -3446 10921 -13657
15032 -13657 -24751 10215 11715 -26127 -52667 -53154 -49895 -95636 -51581 -69880 -92643 -92341 -48802
15019 -48802 -39986 23101 48812 87084 122849 88673 91719 62520 21341 -25987 -46296 -9502
15007 -9502 -20072 -32722 -25029 -5977 -19893 -15668 13957 -9820 -45084 -58301 -48067 -58045
14995 -58045 -46881 6018 15825 -4854 -18891 -37049 -40959 12781 42885 27933 15131 -19790
14983 -19790 -28052 -28537 -56399 -52091 -45228 -70867 -34301 -881 -14846 -5621 -8456 -7969 4873
$$ packed form
15070H9528k8811n767m2488j1179R639n40n4188n6575m324N1072Q891K4798M9384
15057B9440J9215R618L2067l8950n0977K2654j5288R996N2148m0137m1511j9095
15045c0820P642O1764k8917l4852O8912j1111l5935K013K718J870o730J4367k4578
15032a3657j1094L4966J500l7842k6540m87L259m5741M4055j8299k2763L02M3539
15019d8802Q816O3087K5711L8272L5765l4176L046k9199m1179m7328k0309L6794
15007i502j0570j2650P693J9052j3916M225K9625k3777l5264j3217J0234r978
14995e8045J1164N2899R807k0679j4037j8158l910N3740L0104j4952j2802l4921
14983a9790q262m85k7862M308O863k5639L6566L3420j3965R225k835M87J2842
$$ plain form
14970 4873 -15556 -12739 8764 10679 7506 3928 70283 83384 50150 -9905 -7465 1838 1973
14957 1973 -11484 -21047 35824 42533 -32144 -80035 -86047 -21307 4304 -42529 -67746 -116657
14945 -116657 -115499 -24628 69955 107082 44365 7806 32724 31027 2357 -60395 -73837 -30834
14933 -30834 -14116 23890 4707 7369 8858 21005 33706 30315 27741 23769 21613 -2717 -15299
14920 -15299 27740 -3620 30288 47105 5287 34632 -3562 -64516 -31687 15455 23601 51096
14908 51096 55786 34679 4632 -96300 -138400 -108022 -39048 1970 -20313 -68616 -68954 -36828
14896 -36828 37440 64167 19702 -911 20071 12229 2582 -31743 -84964 -119415 -83247 -52360
14884 -52360 -21332 -12243 -8212 -20483 -52791 -58568 -68701 -53363 -26680 -74926 -48355 -42257
$$ packed form
14970D873k0429K817K1503J915l173l578O6355J3101l3234o0055K440R303J35
14957A973j3457r563N6871O709p4677m7891o012O4740K5611m6833k5217m8911
14945a16657J158R0871R4583L7127o2717l6559K4918j697k8670o2752j3442M3003
14933c0834J6718L8006j9183K662J489J2147J2701l391k574l972k156k4330j2582
14920a5299M3039l1360L3908J6817m1818K9345l8194o0954L2829M7142Q146K7495
14908E1096M690k1107l0047j00932m2100L0378O8974M1018k2283m8303l38L2126
14896c6828P4268K6727m4465k0613K0982p842r647l4325n3221l4451L6168L0887
14884e2360L1028R089M031j2271l2308n777j0133J5338K6683m8246K6571O098
$$ plain form
14872 -42257 -62477 -84595 -128615 -158394 -126988 -81409 -43975 -34652 -88176 -84278 -66208 -87347
14860 -87347 -110262 -71756 -28438 -21239 -19145 -70908 -98717 -142257 -199784 -234953 -245514 -197011
14848 -197011 -163938 -127217 -106371 -91598 -81431 -88321 -106197 -88285 -126606 -113923 -67441 -92523
14836 -92523 -131052 -116706 -101852 -112325 -103205 -78859 -77017 -113201 -115222 -71608 -72691 -85312
14824 -85312 -88231 -119259 -99709 -109424 -166786 -153518 -121740 -119885 -171828 -145685 -62444 -33080
14812 -33080 -40819 -65613 -88710 -80580 -44999 -18407 -31476 -39744 -48385 -75956 -63039 -40332
14800 -40332 -47742 -58475 -27293 -27924 -16503 -39142 -81041 -100743 -69619 -38950 -48697 -82313
14788 -82313 -89791 -38414 -21992 -46232 -35856 -13444 -29732 -22629 -28376 -7456 -2625 -7644 5182
$$ packed form
14872d2257k0220k2118m4020k9779L1406M5579L7434R323n3524L898J8070k1139
14860h7347k2915L8506M3318P199K094n1763k7809m3540n7527l5169j0561M8503
14848a97011L3073L6721K0846J4773J0167o890j7876J7912l8321J2683M6482k5082
14836i2523l8529J4346J4854j0473R120K4346J842l6184k021M3614j083j2621
14824h5312k919l1028J9550r715n7362J3268L1778J855n1943K6143Q3241K9364
14812c3080p739k4794k3097Q130L5581K6592j3069q268q641k7571J2917K2707
14800d0332p410j0733L1182o31J1421k2639m1899j9702L1124L0669r747l3616
14788h2313p478N1377J6422k4240J0376K2412j6288P103n747K0920M831n019J2826
$$ plain form
14775 5182 29073 9286 19987 7126 48898 106019 109013 48120 -18404 -34190 -835 29640
14763 29640 36725 30793 21991 3501 40263 56065 52747 61303 27430 33674 11213 -39287 -77978
14750 -77978 -80827 -57042 -46862 -73305 -68611 -85449 -67671 9148 71567 53291 4636 -24572
14738 -24572 -60921 -82879 -119131 -160113 -168715 -167335 -113948 -102651 -128183 -123306 -120185 -104811
14726 -104811 -59356 -55787 -78283 -112250 -72061 -33580 -42610 -48296 -29391 -95316 -145580 -112258
14714 -112258 -108590 -84834 -53188 -63135 -30939 -18483 -12656 -1654 1568 -46355 -65816 -95828
14702 -95828 -101146 -93680 -136720 -140045 -117085 -109463 -104525 -92720 -74387 -72759 -66741 -36986 -50372
14689 -50372 -103922 -114873 -108728 -145506 -122795 -101327 -91267 -82206 -74736 -55055 -32379 -34261
$$ packed form
14775E182K3891j9787J0701j2861M1772N7121K994o0893o6524j5786L3355L0475
14763B9640P085n932q802j8490L6762J5802l318Q556l3873O244k2461n0500l8691
14750g7978k849K3785J0180k6443M694j6838J7778P6819O2419j8276m8655k9208
14738b4572l6349k1958l6252m0982q602J380N3387J1297k5532M877L121J5374
14726a04811M5455L569k2496l3967M0189L8481r030n686J8905o5925n0264L3322
14714a12258L668K3756L1646r947L2196J2456N827J1002L222m7923j9461l0012
14702i5828n318P466m3040l325K2960P622M938J1805J8333J628O018K9755j3386
14689e0372n3550j0951O145l6778K2711K1468J0060R061P470J9681K2676j882
$$ plain form
14677 -34261 -88934 -108706 -41573 -39144 -71503 -113188 -155684 -156994 -78355 -29125 -77725 -148573
14665 -148573 -153983 -123603 -8978 36190 27498 6602 19294 18287 -23626 -44010 -110466 -133208
14653 -133208 -135251 -139077 -146742 -152522 -170175 -101743 -64944 -119843 -128204 -48018 -15512 -70765
14641 -70765 -99178 -33526 -47990 -74965 -5366 -2350 -35879 -108865 -124367 -77035 -36531 -38994
14629 -38994 -12892 -83387 -66131 -46912 -46092 -28749 -55921 -46983 -47218 -76851 -40738 16324 -1839
14616 -1839 -52096 -44706 -12471 20160 13071 -43733 -57463 -60377 -54808 -30042 -78080 -81004 -36843
14603 -36843 -74336 -84643 -52787 -65617 -73367 -78967 -102005 -116045 -57834 -11817 -45537 -47145
14591 -47145 -13202 -23688 -43093 -43933 -66335 -72960 -55981 -37919 -34269 -33016 -92896 -64513 -30127
$$ packed form
14677c4261n4673j9772O7133K429l2359m1685m2496j310P8639M9230m8600p0848
14665a48573n410L0380J14625M5168q692k0896J2692j007m1913k0384o6456k2742
14653a33208k043l826p665n780j7653O8432L6799n4899q361Q0186L2506n5253
14641g0765k8413O5652j4464k6975O9599L016l3529p2986j5502M7332M0504k463
14629c8994K6102p0495J7256J9219Q20J7343k7172Q938k35k9633L6113N7062j8163
14616a839n0257P390L2235L2631p089n6804j3730k914N569K4766m8038k924M4161
14603c6843l7493j0307L1856j2830p750n600k3038j4040N8211M6017l3720j608
14591d7145L3943j0486j9405q40k2402o625J6979J8062L650J253n9880K8383L4386
$$ plain form
14578 -30127 5358 -49401 -90784 -67643 -88331 -63215 -68750 -66790 -78924 -80323 -105466 -127343
14566 -127343 -124827 -111492 -111018 -106149 -109687 -110090 -73527 -54728 -95635 -106320 -82387 -61742 -54691
14553 -54691 -81600 -69953 -52944 -79103 -114919 -132107 -68979 1346 40687 37938 -9119 9064
14541 9064 -7229 -57600 -44686 -28498 -43577 -18539 26726 22516 9484 -47570 -34992 -44549
14529 -44549 -66851 -78097 -70301 -54851 -61455 9959 35036 -10537 -54272 -8118 1288 8559
14517 8559 -41800 -53258 -55080 -14840 -7294 -33178 -45994 -9153 -28578 -33181 47987 24337
14505 24337 8134 23641 21715 3634 -23957 -70198 -73904 -36941 38945 20464 -22371 -83011
14493 -83011 -135992 -89351 1410 -13318 -8503 -44417 -70647 -90360 -86031 -85418 -36404 -51088
$$ packed form
14578c0127L5485n4759m1383K3141k0688K5116n535J960j2134j399k5143k1877
14566a27343K516J3335M74M869l538m03L6563J8799m0907j0685K3933K0645P051
14553e4691k6909J1647J7009k6159l5816j7188O3128P0325L9341k749m7057J8183
14541I064j6293n0371J2914J6188j5079K5038M5265m210j3032n7054J2578r557
14529d4549k2302j1246P796J5450o604P1414K5077m5573m3735M6154R406P271
14517H559n0359j1458j822M0240P546k5884j2816L6841j9425m603Q1168k3650
14505B4337j6203J5507j926j8081k7591m6241l706L6963P5886j8481m2835o0640
14493h3011n2981M6641R0761j4728M815l5914k6230j9713M329O13M9014j4684
$$ plain form
14481 -51088 -43297 4695 -69071 -142511 -131263 -97655 -95858 -100986 -54357 -19976 25430 -8096
14469 -8096 -4803 57405 71842 37808 46447 61779 30081 -7866 -11557 -37173 -26416 -26347 -12866
14456 -12866 -13618 -41202 -27097 -48246 -5291 1691 -5371 36605 62442 41781 -18808 -36909
14444 -36909 -27091 -9390 -17661 -27039 -51337 -33282 -48797 -63335 -48529 -27658 -12195 -76029
14432 -76029 -98056 -13840 10808 -27851 -23093 -13497 -41427 -49820 -4878 -16714 3842 20901
14420 20901 -2208 -23490 -50553 -62099 -59425 -23800 2214 -10642 -36008 -127845 -148982 -96478
14408 -96478 -12058 -34416 -86384 -92411 -62364 -31015 -16474 -16580 19733 41398 3329 -32301
14396 -32301 -9416 14716 18988 -18266 -30013 -23327 -4924 6165 -29656 -41640 -76971 -76547
$$ packed form
14481e1088P791M7992p3766p3440J1248L3608J797n128M6629L4381M5406l3526
14469h096L293O2208J4437l4034Q639J5332l1698l7947l691k5616J0757O9J3481
14456a2866p52k7584J4105k1149M2955O982p062M1976K5837k0661o0589j8101
14444c6909R818J7701q271r378k4298J8055j5515j4538J4806K0871J5463o3834
14432g6029k2027Q4216K4648l8659M758R596k7930q393M4942j1836K0556J7059
14420B0901k3109k1282k7063j1546K674L5625K6014j2856k5366r1837k1137N2504
14408i6478Q4420k2358n1968o027L0047L1349J4541j06L6313K1665l8069l5630
14396c2301K2885K4132M272l7254j1747O686J8403J1089l5821j1984l5331M24
$$ plain form
14384 -76547 -88240 -82441 -57248 -51633 -81002 -95951 -115218 -145745 -103784 -45109 -39975 -61410
14372 -61410 -55613 9561 15439 43045 29576 2568 -29293 -72958 -54832 -65598 -30034 -33202
14360 -33202 -53155 -40441 12446 -4559 -28277 -25641 -72968 -114549 -79432 -12240 -48450 -96686
14348 -96686 -121440 -142403 -155804 -134576 -95973 -13018 -45048 -29601 -3091 -4409 -11969 -49098
14336 -49098 -46921 -65577 -60407 -51502 -40504 -66543 -36150 -1994 -25866 -24055 -54470 -49318 10268
14323 10268 -28546 -77492 -91757 -131802 -103195 -80342 -49936 -48055 -51324 3937 -4358 9074
14311 9074 24174 50485 32752 -15955 -75101 -88672 -57033 -3702 65982 57902 40143 42785
14299 42785 17406 -14678 -20260 -31577 10339 74929 51635 -19713 23165 66115 38050 5183
$$ packed form
14384g6547j1693N799K5193N615k9369j4949j9267l0527M1961N8675N134k1435
14372f1410N797O5174N878K7606j3469k7008l1861m3665J8126j0766L5564l168
14360c3202j9953J2714N2887j7005k3718K636m7327m1581L5117O7192l6210m8236
14348i6686k4754k0963j3401K1228L8603Q2955l2030J5447K6510j318p560l7129
14336d9098K177j8656N170Q905J0998k6039L0393L4156k3872J811l0415N152N9586
14323A0268l8814m8946j4265m0045K8607K2853L0406J881l269N5261q295J3432
14311I074J5100K6311j7733m8707n9146j3571L1639N3331O9684q080j7759K642
14299D2785k5379l2084n582j1317M1916O4590k3294p1348M2878M2950k8065l2867
$$ plain form
14287 5183 11774 28898 35953 12728 2430 12898 26847 47393 26793 24020 -26199 -57410
14275 -57410 -33786 -19279 -25733 -12452 -47255 -13009 255 -1125 -43952 -17362 -28221 -48655
14263 -48655 -50050 -64232 -30938 -12709 -1094 -15615 -2392 9524 6882 -41275 -88670 -92239
14251 -92239 -73534 -100015 -104594 -83827 -45541 -9100 51378 39617 51046 36558 -18056 13516
14239 13516 83240 76684 78344 61694 -3056 -8933 -6857 -7931 -18331 -33345 -10184 15765 -3145
14226 -3145 8526 -27620 -77048 -45092 38931 3207 -28916 -10216 8717 38330 30832 -25723
14214 -25723 2499 9798 -2666 -39156 -98246 -102106 -49643 -69845 -82240 -24438 33186 30555
14202 30555 -32205 -11147 -24700 -47404 -91197 -70694 -55808 -58654 -50858 -27384 5715 -11862
$$ packed form
14287E183O591J7124P055k3225j0298J0468J3949K0546k0600k773n0219l1211
14275e7410K3624J4507o454J3281l4803L4246J3264j380m2827K6590j0859k0434
14263d8655j395j4182L3294J8229J1615j4521J3223J1916k642m8157m7395l569
14251i2239J8705k6481m579K0767L8286L6441O0478j1761J1429j4488n4614L1572
14239A3516O9724o556J660j6650o4750n877K076j074j0400j5014K3161K5949j8910
14226c145J1671l6146m9428L1956Q4023l5724l2123J8700J8933K9613p498n6555
14214b5723K8222P299j2464l6490n9090l860N2463k0202j2395N7802N7624k631
14202C0555o2760K1058j3553k2704m3793K0503J4886k846P796K3474L3099j7577
$$ plain form
14190 -11862 -37055 -29313 -49873 -82647 -76721 -84715 -60713 -40626 -60694 -50003 -17443 -12311
14178 -12311 -42061 -40720 -61451 -60793 -65513 -45734 -67822 -79680 -46254 -43596 -34991 -51273 -71452
14165 -71452 -37041 -26032 12782 12180 4679 -57852 -103761 -85588 -30838 -13093 -42079 -59031
14153 -59031 -4939 -31846 -85120 -49987 -22076 -20028 -40592 -87739 -93187 -66905 -52703 -12455
14141 -12455 31919 55404 73750 74906 38877 7490 -9008 2653 -21175 -9562 24152 34094
14129 34094 20645 22603 41307 41120 51783 44139 43181 10389 -40685 -53761 -55654 -43601 -30496
14116 -30496 -65830 -88251 -109904 -67724 -20585 -44299 -97529 -34294 -17558 11588 -40296 -56767
14104 -56767 7908 10057 -39044 -26536 -26794 -26992 -26308 -34970 -70056 -45705 -24357 -13476 7736
$$ packed form
14190a1862k5193P742k0560l2774N926p994K4002K0087k0068J0691L2560N132
14178a2311k9750J341k0731O58m720J9779k2088j1858L3426K658Q605j6282k0179
14165g1452L4411J1009L8814o02p501o2531m5909J8173N4750J7745k8986j6952
14153e9031N4092k6907n3274L5133K7911K048k0564m7147n448K6282J4202M0248
14141a2455M4374K3485J8346J156l6029l1387j6498J1661k3828J1613L3714R942
14129C4094j3449J958J8704j87J0663p644r58l2792n1074j3076j893J2053J3105
14116c0496l5334k2421k1653M2180M7139k3714n3230O3235J6736K9146n1884j6471
14104e6767O4675K149m9101J2508k58j98O84q662l5086K4351K1348J0881K1212
$$ plain form
14091 7736 46622 -3248 -83435 -84519 -158766 -139224 -109719 -53450 -4629 25135 -3126 -2574
14079 -2574 -10305 -26774 -60776 -74034 -40657 -25606 -44125 -59617 -81863 -137022 -139416 -78649
14067 -78649 -38040 -31731 -32553 -99007 -108542 -74199 -41877 -83000 -89938 -35644 -23617 -61811 -89525
14054 -89525 -64656 -30228 -3026 -30398 -57945 -110735 -114005 -157893 -159476 -153391 -150770 -141766 -168254
14041 -168254 -113994 -105158 -117742 -86717 -60185 -104476 -152265 -144005 -104831 -86329 -45709 -76120
14029 -76120 -31464 14522 -8002 47758 53439 90489 62576 -18113 -7694 32367 41790 -3788
14017 -3788 -39037 -31860 -27253 -2348 24122 -1975 -37550 -23837 -1579 -18957 -10331 15765
14005 15765 11798 -29869 -48987 -37803 51717 87522 58519 -11118 3887 12034 11496 12732 -12111
$$ packed form
14091G736L8886m9870q0187j084p4247J9542K9505N6269M8821K9764k8261N52
14079b574p731j6469l4002j3258L3377J5051j8519j5492k2246n5159k394O0767
14067g8649M0609O309q22o6454r535L4343L2322m1123o938N4294J2027l8194k7714
14054h9525K4869L4428K7202k7372k7547n2790l270m3888j583O085K621R004k6488
14041a68254N4260Q836j2584L1025K6532m4291m7789Q260L9174J8502M0620l0411
14029g6120M4656M5986k2524N5760N681L7050k7913q0689J0419M0061R423m5578
14017c788l5249P177M607K4905K6470k6097l5575J3713K2258j7378Q626K6096
14005A5765l967m1667j9118J1184Q9520L5805k9003o9637J5005Q147n38J236k4843
$$ plain form
13992 -12111 -19993 -23637 -42226 -75599 -76753 -51071 -81908 -69107 -26283 -33597 -39290 -76618 -59511
13979 -59511 -67863 -79716 -112567 -108664 -55126 -19557 -44991 -49978 -27275 -11443 -10962 -7326 25071
13966 25071 34806 34791 32718 13335 -770 3321 40129 17260 -1694 -56218 -56074 -25496 -34127
13953 -34127 -46891 -34661 -39767 -79168 -50737 -31700 31900 49350 40606 13764 10591 -1096
13941 -1096 -65252 -116242 -80140 -47952 -399 -57301 -126476 -107757 -38725 -21543 -86423 -136996
13929 -136996 -114605 -111477 -119975 -87993 -41596 28201 22526 -33783 -36355 -80014 -98796 -124274
13917 -124274 -130771 -116763 -105710 -96426 -95623 -144636 -162538 -145465 -104588 -100452 -73364 -40151
13905 -40151 -92867 -89757 -21863 35169 60940 50932 15421 49724 47341 50264 21796 -71471
$$ packed form
13992a2111p882l644j8589l3373j154K5682l0837J2801M2824p314n693l7328J7107
13979e9511q352j1853l2851L903N3538L5569k5434m987K2703J5832M81L636L2397
13966B5071R735j5k073j9383j4105M091L6808k2869j8954n4524J44L0578q631
13953c4127j2764J2230n106l9401K8431J9037O3600J7450q744k6842l173j1687
13941a096o4156n0990L6102L2188M7553n6902o9175J8719O9032J7182o4880n0573
13929a36996K2391L128q498L1982M6397O9797n675n6309k572m3659j8782k5478
13917a24274o497J4008J1053R284Q03m9013j7902J7073M0877M136K7088L3213
13905d0151n2716L110O7894N7032K5771j0008l5511L4303k383K923k8468r3267
$$ plain form
13893 -71471 -87213 -38323 -33216 -46908 -89374 -54399 -20937 -26572 -7418 -17059 -62464 -86307
13881 -86307 -64353 -61610 -7740 -17275 -57542 -65017 -80674 -90222 -14019 17444 -53998 -121283
13869 -121283 -83466 -66437 -76661 -106818 -75926 -4095 28847 7680 -23169 -31431 -45655 -42690
13857 -42690 -51086 -27546 -30422 -55462 -86680 -78135 -55587 -97617 -79233 -47754 5491 -16151
13845 -16151 -90190 -100579 -63217 -58080 -52356 -35019 3240 3364 -3068 -81367 -89577 -91514 -120814
13832 -120814 -134826 -140228 -101358 -56814 14199 1261 -71225 -113343 -113977 -48177 11007 -95
13820 -95 -36254 -52172 -57092 -13020 36327 -31601 -76713 -44060 9420 -32310 -51240 -14369
13808 -14369 -30296 -79449 -67980 -36858 -64191 -108316 -117336 -97681 -79290 -95195 -113665 -139247
$$ packed form
13893g1471j5742M8890N107j3692m2466L4975L3462n635J9154r641m5405k3843
13881h6307K1954K743N3870r535m0267p475j5657r548P6203L1463p1442o7285
13869a21283L7817J7029j0224l0157L0892P1831L2942k1167l0849q262j4224K965
13857d2690q396K3540k876k5040l1218Q545K2548m2030J8384L1479N3245k1642
13845a6151p4039j0389L7362N137N724J7337L8259J24o432p8299q210j937k9300
13832a20814j4012n402L8870M4544P1013j2938p2486m2118o34O5800N9184j1102
13820i5l6159j5918m920M4072M9347o7928m5112L2653N3480m1730j8930L6871
13808a4369j5927m9153J1469L1122k7333m4125r020J9655J8391j5905j8470k5582
$$ plain form
13796 -139247 -137039 -78756 -50334 -76425 -101451 -69455 7063 19728 -39428 -42453 -56230 -48358
13784 -48358 -61267 -26836 28060 46597 9761 1516 18716 88425 74575 5808 -28364 -9895
13772 -9895 -38855 -24499 -40842 -70980 -81137 -78413 -67245 -72245 -56924 -53117 -51507 -68647 -60562
13759 -60562 -69181 -88491 -31020 -8400 20281 33635 -19150 -34945 -72243 -70784 -21684 -42753
13747 -42753 -74250 -92040 -132330 -87509 -29932 39450 60057 23227 -13207 11071 24788 45115
13735 45115 84288 52479 30584 -47727 -46326 23552 -8664 -23159 -51794 -69490 -26692 -3260
13723 -3260 -39083 -26186 -9480 -35543 -44934 -10889 11728 12206 12442 20107 45171 22676 25303
13710 25303 13353 -39745 -35161 361 9681 11280 5370 -41460 -45936 -17974 52206 47442 -11061
$$ packed form
13796a39247K208N8283K8422k6091k5026L1996P6518J2665n9156l025j3777P872
13784d8358j2909L4431N4896J8537l6836q245J7200O9709j3850o8767l4172J8469
13772i895k8960J4356j6343l0138j0157K724J1168n000J5321L807J610j7140Q085
13759f0562q619j9310N7471K2620K8681J3354n2785j5795l7298J459M9100k1069
13747d2753l1497j7790m0290M4821N7577O9382K0607l6830l6434K4278J3717K0327
13735D5115L9173l1809k1895p8311J401O9878l2216j4495k8635j7696M2798K3432
13723c260l5823J2897J6706k6063r391L4045K2617M78K36P665K5064k2495K627
13710B5303j1950n3098M584L5522R320J599n910m6830m476K7962P0180m764n8503
$$ plain form
13697 -11061 -64128 -42622 -11190 4438 3084 6584 -86380 -117562 -88230 -52171 -41022 -51896
13685 -51896 -26785 7479 25517 -826 -10570 33017 45412 17165 6089 -15050 -4417 21108
13673 21108 29440 39733 35203 -7757 -21133 -16139 -30536 -41342 19791 74077 153359 167425
13661 167425 166185 112245 102259 71462 41924 67190 72435 73700 63850 26908 15994 24060 23361
13648 23361 4966 -16410 76 -30956 -24478 198 -19875 9531 -1267 5743 83767 75048
13636 75048 33297 7781 -30073 -19500 11189 86913 93259 9556 9494 22972 38148 27553
13624 27553 25108 9398 29151 44701 44506 38710 41344 46178 9491 -5474 11686 29606 16155
13611 16155 30136 61635 81854 59082 42590 36525 37988 47901 54010 11994 10204 20620 62902
$$ packed form
13697a1061n3067K1506L1432J5628j354L500r2964l1182K9332L6059J1149j0874
13685e1896K5111L4264J8038k6343r744M3587J2395k8247j1076k1139J0633K5525
13673B1108Q332J0293m530m2960j3376M994j4397j0806O1133N4286P9282J4066
13661A67425j240n3940r986l0797k9538K5266N245J265r850l6942j0914Q066o99
13648B3361j8395k1376J6486l1032O478K4676k0073K9406j0798P010P8024q719
13636G5048m1751k5516l7854J0573L0689P5724O346q3703o2J3478J5176j0595
13624B7553k445j5710J9753J5550j95n796K634M834l6687j4965J7160J7920j3451
13611A6155J3981L1499K0219k2772j6492o065J463R913O109m2016j790J0416M2282
$$ plain form
13598 62902 126740 101870 57681 34979 34528 46887 57710 41572 15186 6258 25762 18406
13586 18406 42222 96974 131862 102931 93202 83483 96565 59142 59358 77147 85698 92590 88591
13573 88591 98050 76885 86435 87573 74379 106071 77035 93069 138261 145233 124463 148034
13561 148034 141304 129139 127004 112727 141733 184446 186032 94422 33993 39794 67782 74232
13549 74232 106478 116637 112482 126268 139952 161840 172987 114918 119684 100226 54340 90184
13537 90184 121470 127726 90346 24475 44942 70937 23773 -13331 14952 50171 54480 125853
13525 125853 148381 169887 166880 186600 168659 185043 196838 187828 160010 189723 185931 137638
13513 137638 113446 129662 160209 142992 144574 106372 96920 80315 71334 78009 95473 138337
$$ packed form
13598F2902O3838k4870m4189k2702m51J2359J0823j6138k6386q928J9504p356
13586A8406K3816N4752L4888k8931r729r719J3082l7423K16J7789Q551O892l999
13573H8591R459k1165R550J138j3194L1692k9036J6034M5192O972k0770K3571
13561A48034o730j2165k135j4277K9006M2713J586r1610o0429N801K7988O450
13549G4232L2246J0159m155J3786J3684K1888J1147n8069M766j9458m5886L5844
13537I0184L1286O256l7380o5871K0467K5995m7164l7104K8283L5219M309P1373
13525A25853K2528K1506l007J9720j7941J6384J1795r010k7818K9713l792m8293
13513A37638k4192J6216L0547j7217J582l8202r452j6605q981O675J7464M2864
$$ plain form
13501 138337 181176 187496 168849 136027 93747 58171 61261 75005 102236 124182 158093 161965
13489 161965 116689 122435 161090 163754 198812 229086 234051 143674 51073 60063 84381 97243
13477 97243 75908 92661 112328 84072 107370 124858 124815 116037 81276 119375 143641 138279 153857
13464 153857 170532 150985 150768 138306 120685 153119 153298 130865 106833 84668 129051 144038
13452 144038 133759 148843 241099 231769 129511 88341 90933 98655 105072 81210 88834 104825
13440 104825 90761 56191 84724 167870 170666 126511 78502 80002 110215 94013 122751 137092
13428 137092 123430 161906 142640 124139 113157 110313 106378 92756 68132 75092 46701 41243
13416 41243 46271 1193 25732 49462 39052 21190 28782 37863 69754 88370 95101 57776
$$ packed form
13501A38337M2839O320j8647l2822m2280l5576L090J3744K7231K1946L3911L872
13489A61965m5276N746L8655K664L5058L0274M965r0377r2601Q990K4318J2862
13477I7243k1335J6753J9667k8256K3298J7488m3q778l4761L8099K4266n362J5578
13464A53857J6675j9547k17j2462j7621L2434J79k2433k4032k2165M4383J4987
13452A44038j0279J5084R2256r330j02258m1170K592P722O417k3862P624J5991
13440A04825j4064l4570K8533Q3146K796m4155m8009J500L0213j6202K8738J4341
13428A37092j3662L8476j9266j8501j0982k844l935j3622k4624O960k8391n458
13416D1243N028m5078K4539K3730j0410j7862P592R081L1891J8616O731l7325
$$ plain form
13404 57776 43602 108723 121976 35931 13168 37029 71955 78916 53324 48359 75181 100436
13392 100436 56224 39302 42531 55035 53603 87742 98546 64286 14373 41472 80510 70118
13380 70118 88959 117475 68636 -3711 35877 18557 -11595 -6558 55451 54838 71585 101603
13368 101603 74752 93889 112506 105323 89953 74796 79021 72975 61123 59113 71883 66883
13356 66883 51024 101754 109712 105270 86430 60250 77516 85998 51631 43856 82574 118683
13344 118683 143845 97363 48110 64331 67976 51704 37469 44879 60483 34677 32247 64771
13332 64771 84348 49441 19546 -1278 -34519 -63560 -91192 -39650 40547 42345 17891 -29610
13320 -29610 -28616 14083 36064 4754 -20577 -580 51247 98485 33100 -48649 -83750 -59267
$$ packed form
13404E7776j4174O5121J3253q6045k2763K3861L4926O961k5592m965K6822K5255
13392A00436m4212j6922L229J2504j432L4139J0804l4260m9913K7099L9038j0392
13380G0118J8841K8516m8839p2347L9588j7320l0152N037O2009o13J6747L0018
13368A01603k6851J9137J8617p183j5370j5157M225o046j1852k010J2770n000
13356F6883j5859N0730P958m442j8840k6180J7266Q482l4367p775L8718L6109
13344A18683K5162m6482m9253J6221L645j6272j4235P410J5604k5806k430L2524
13332F4771J9577l4907k9895k0824l3241k9041k7632N1542Q0197J798k4454m7501
13320b9610R94M2699K1981l1310k5331J9997N1827M7238o5385q1749l5101K4483
$$ plain form
13308 -59267 -47143 -12088 7661 16646 -6744 16018 90946 123019 78058 47597 23318 23812
13296 23812 -28520 22735 27941 35789 86557 174690 153737 90427 47224 -4383 -3837 29087
13284 29087 30936 -1543 4188 32160 24306 15174 -9515 -34353 -69318 -59120 -58394 -77973 -72216
13271 -72216 -18815 54869 29855 -14880 -21801 -41721 -44279 -31156 2786 46898 102855 77997
13259 77997 47003 66796 75413 19733 -52341 -34594 11543 -37216 -4665 44592 49081 61201
13247 61201 93501 45979 44857 73979 61862 84630 150936 115066 85746 39319 544 27198
13235 27198 37435 76115 35514 -41439 -63467 -9596 -24323 -33547 -51328 -68524 -97575 -77513
13223 -77513 -92190 -80479 -50145 -31734 5 37538 58189 54378 45222 32685 4781 46354
$$ packed form
13308e9267J2124L5055J9749Q985k3390K2762P4928L2073m4961l0461k4279M94
13296B3812n2332N1255N206P848N0768Q8133k0953o3310m3203n1607N46L2924
13284B9087J849l2479N731K7972p854r132k4689k4838l4965J0198P26j9579N757
13271g2216N3401P3684k5014m4735o921j9920k558J3123L3942M4112N5957k4858
13259G7997l0994J9793Q617n5680p2074J7747M6137m8759L2551M9257M489J2120
13247F1201L2300m7522j122K9122j2117K2768O6306l5870k9320m6427l8775K6654
13235B7198J0237L8680m0601p6953k2028N3871j4727r224j7781j7196k9051K0062
13223g7513j4677J1711L0334J8411L1739L7533K0651l811r156j2537k7904M1573
$$ plain form
13211 46354 68040 22555 -3224 -56754 -49141 16242 17163 -58225 -79278 -86683 -85390 -85863 -36228
13198 -36228 -11168 24789 48719 17464 25108 763 6137 32195 49401 61508 62775 62979 8321
13185 8321 -47345 -45613 -31751 16509 36646 24756 7109 8192 -17519 -61247 -46552 -18735
13173 -18735 -30686 -22380 -18333 -124672 -189348 -126141 -43348 11753 19526 -27154 -24340 7191
13161 7191 -55244 -66770 -51497 -31032 4052 -9933 4952 2551 -2138 6235 -37792 -107679
13149 -107679 -151926 -181088 -140912 -28727 -12392 -38401 10871 78453 126437 141283 123699
13138 123699 100627 102497 58886 66822 53597 51848 24111 10834 74518 150531 105523 83890
13126 83890 2887 5918 44806 8650 -3308 -3304 -252 57762 65255 38340 38559 38435 29695 30681
$$ packed form
13211D6354K1686m5485k5779n3530P613O5383R21p5388k1053p405J293m73M9635
13198c6228K5060L5957K3930l1255P644k4345N374K6058J7206J2107J267K04n4658
13185H321n5666J732J3862M8260K0137j1890j7647J083k5711m3728J4695K7817
13173a8735j1951Q306M047j06339o4676O3207Q2793N5101P773m6680K814L1531
13161G191o2435j1526J5273K0465L5084j3985J4885k401m689Q373m4027o9887
13149a07679m4247k9162M0176J12185J6335k6009M9272O7582M7984J4846j7584
13138A23699k3072J870m3611P936j3225j749k7737j3277O3684P6013m5008k1633
13126H3890q1003L031L8888l6156j1958ML052N8014P493k6915K19j24q740R86
$$ plain form
13112 30681 41171 -21865 -21607 -15896 -23803 -37022 -16329 26890 46272 43457 10438 -19221 -13460
13099 -13460 -19589 -25463 -27523 9496 37105 34418 -22447 8023 78923 94581 70859 41120
13087 41120 75390 79095 63169 7329 -62608 -33840 -14488 36207 39161 20794 -1171 11576
13075 11576 10508 7103 26866 38913 -43774 -32885 10089 46196 55869 66850 54705 7270
13063 7270 31972 24209 13507 22731 22075 61211 66266 64620 26929 34502 26293 -17139 24220
13050 24220 51195 41018 61768 94615 59361 18778 -11268 -5908 -26405 -25183 -1015 36090
13038 36090 16402 -11980 -36349 -51286 -23604 28874 61783 38958 60822 69412 64114 85192
13026 85192 71582 35905 32257 78508 42576 -1828 -17792 -43958 -91591 -71159 4600 22137
$$ packed form
13112C0681J0490o3036K58N711p907j3219K0693M3219J9382k815l3019k9659N761
13099a3460o129n874k060L7019K7609k687n6865L0470P0900J5658k3722k9739
13087D1120L4270L705j5926n5840o9937K8768J9352N0695K954j8367k1965J2747
13075A1576j068l405J9763J2047q2687J0889M2974L6107R673J0981j2145m7435
13063G270K4702p763j0702R224o56L9136N055j646l7691P573q209m3432M1359
13050B4220K6975j0177K0750L2847l5254m0583l0046N360k0497J222K4168L7105
13038C6090j9688k8382k4369j4937K7682N2478L2909k2825K1864Q590n298K1078
13026H5192j3610l5677l648M6251l5932m4404j5964k6166m7633K0432P5759J7537
$$ plain form
13014 22137 -32158 -23588 13270 34988 -2361 -51728 9819 89966 92279 67654 95455 81796
13002 81796 70158 64903 16763 -583 50543 88651 107061 51574 50213 67205 104576 67194
12990 67194 66755 76258 49732 -11707 -14065 33623 23635 -11622 4444 16821 -7445 -12826 5591
12977 5591 -12623 7803 12983 1728 56108 69339 51732 44030 18571 8185 20159 4806
12965 4806 73774 139843 115800 131629 111744 89198 122647 134094 110216 61950 35524 56418
12953 56418 33110 3185 23581 67004 65063 7796 22898 120221 168790 153300 137290 71569
12941 71569 27216 -1716 84679 140691 162251 133903 102217 58620 36167 23078 17590 31824
12929 31824 30663 49379 73769 117169 91282 37720 21136 44555 77568 122679 106969 102266
$$ packed form
13014B2137n4295Q570L6858K1718l7349m9367O1547Q0147K313k4625K7801j3659
13002H1796j1638n255m8140j7346N1126L8108J8410n5487j361J6992L7371l7382
12990F7194m39R503k6526o1439k358M7688r988l5257J6066J2377k4266n381J8417
12977E591j8214K0426N180j1255N4380J3231j7607p702k5459j0386J1974j5353
12965D806O8968O6069k4043J5829j9885k2546L3449J1447k3878m8266k6426K0894
12953E6418k3308k9925K0396M3423j941n7267J5102R7323M8569j5490j6010o5721
12941G1569m4353k8932Q6395N6012K1560k8348l1686m3597k2453j3089n488J4234
12929C1824j161J8716K4390M3400k5887n3562j6584K3419L3013M5111j5710m703
$$ plain form
12917 102266 119643 136994 124259 122389 124709 67582 80124 78106 103949 156468 122041 62920
12905 62920 102126 166825 109490 104682 113915 127670 126085 167245 193230 162778 175011 175210 157476
12892 157476 105220 107841 145293 160122 189987 206113 187930 155298 127813 135969 112372 130260
12880 130260 115094 86191 72990 82161 133805 105184 56035 101331 168681 123079 68243 55415
12868 55415 41642 51284 118527 114081 48456 26992 31917 32763 99745 152683 127928 91006 104589
12855 104589 133949 123420 121878 120352 106233 104145 159095 175680 181987 173028 138959 83554
12843 83554 51732 55270 46115 60024 62952 19825 7596 21952 68866 107536 124966 104146
12831 104146 60387 67239 38907 57788 53193 65202 74691 65142 96994 101430 99529 70661 76971
$$ packed form
12917A02266J7377J7351j2735j870K320n7127J2542k018K5843N2519l4427n9121
12905F2920L9206O4699n7335m808R233J3755j585M1160K5985l0452J2233J99j7734
12892A57476n2256K621L7452J4829K9865J6126j8183l2632k7485Q156k3597J7888
12880A30260j5166k8903j3201R171N1644k8621m9149M5296O7350m5602n4836j2828
12868E5415j3773R642O7243m446o5625k1464M925Q46O6982N2938k4755l6922J3583
12855A04589K9360j0529j542j526j4119k088N4950J6585O307q959l4069n5405
12843H3554l1822L538r155J3909K928m3127j2229J4356M6914L8670J7430k0820
12831A04146m3759O852k8332J8881m595J2009R489r549L1852M436j901k8868O310
$$ plain form
12818 76971 110494 150181 169228 138209 152470 223977 232292 186213 178145 181201 141658 132855
12806 132855 113070 85937 76612 87824 104897 115484 75009 24531 9569 76204 110566 118216
12794 118216 139008 121876 128286 117904 119329 170902 180633 175193 162270 143900 91864 27775
12782 27775 66601 90741 122718 100014 101992 82373 92679 117930 113096 103449 132438 140419
12770 140419 125818 136449 126815 100502 97089 119890 64543 35693 43684 40377 41999 71087
12758 71087 139299 146377 169568 130682 127268 140677 96306 55802 53534 76080 83333 172777
12746 172777 207048 169208 99857 52382 44271 56019 110042 128667 125851 162402 181705 180520
12734 180520 188315 178608 151291 140692 167703 181652 180472 216835 241080 202002 164019 115116
$$ packed form
12818G6971L3523L9687J9047l1019J4261P1507Q315m6079q068L056l9543q803
12806A32855j9785k7133r325J1212J7073J0587m0475n0478j4962O6635L4362P650
12794A18216K0792j7132O410j0382J425N1573R731n440j2923j8370n2036o4089
12782B7775L8826K4140L1977k2704J978j9619J0306K5251m834r647K8989P981
12770A40419j4601J0631r634k6313l413K2801n5347k8850P991l307J622K9088
12758G1087O8212P078K3191l8886l414J3409m4371m0504k268K2546P253Q9444
12746A72777L4271l7840o9351m7475q111J1748N4023J8625k816L6551J9303j185
12734A80520P795r707k7317j0599K7011J3949j180L6363K4245l9078l7983m8903
$$ plain form
12722 115116 114522 140298 165227 183345 176263 152980 157852 160568 159794 182558 183919 173232 152617
12709 152617 119907 139954 216479 175856 76997 66398 128827 188074 111585 61994 110029
12698 110029 121183 82634 35431 51745 85157 126482 137004 142287 87290 51742 73343 99791
12686 99791 141026 150777 122278 128735 184108 177011 131564 110642 116398 151362 165580 149926
12674 149926 155744 119056 162782 178021 146706 91617 122988 149313 113794 137451 188001 140472
12662 140472 111955 147000 105697 127319 132173 141651 133090 113228 123937 222692 232771 142513
12650 142513 70161 74273 109554 154308 169383 159902 145633 163512 176569 159368 149584 138863
12638 138863 146691 118100 103095 132210 183280 207940 231884 214252 218845 250919 180830 100990
$$ packed form
12722A15116n94K5776K4929J8118p082k3283M872K716p74K2764J361j0687k0615
12709A52617l2710K0047P6525m0623r8859j0599O2429N9247p6489m9591M8035
12698A10029J1154l8549m7203J6314L3412M1325J0522N283n4997l5548K1601K6448
12686I9791M1235R751k8499O457N5373p097m5447k0922N756L4964J4218j5654
12674A49926N818l6688M3726J5239l1315n5089L1371K6325l5519K3657N0550m7529
12662A40472k8517L5045m1303K1622M854R478q561j9862J0709R8755J0079r0258
12650A42513p2352M112L5281M4754J5075r481j4269J7879J3057j7201r784j0721
12638A38863P828k8591j5005K9115N1070K4660K3944j7632M593L2074p0089p9840
$$ plain form
12626 100990 87609 109420 147065 163990 157289 172445 153386 104175 150878 217126 226641 181868
12614 181868 170001 160588 178896 209990 238263 222360 221293 202827 151657 94042 71310 61191
12602 61191 113395 116518 105024 134866 180752 212373 254388 238018 173601 89168 49124 72462
12590 72462 119212 138165 166118 159528 172424 153817 146374 110383 120877 125994 104550 140392
12578 140392 184794 205739 191729 177988 197072 218899 176887 198185 208656 181691 159266
12567 159266 153146 164893 172789 200144 189769 178184 145765 146542 130815 133390 190405 228606
12555 228606 230825 271230 320634 335650 305184 341872 312853 339863 348814 287474 267213 280561
12543 280561 271239 247722 261297 261645 242440 252768 232261 246250 262818 253915 239036 251693
$$ packed form
12626A00990j3381K1811L7645J6925o701J5156j9059m9211M6703O6248R515m4773
12614A81868j1867r413J8308L1094K8273j5903j067j8466n1170n7615k2732j0119
12602F1191N2204L123j1494K9842M5886L1621M2015j6370o4417q4433m0044K3338
12590G2462M6750J8953K7953o590J2896j8607p443l5991J0494N117k1444L5842
12578A40392M4402K0945j4010j3741J9084K1827m2012K1298J0471k6965k2425
12567A59266o120J1747P896K7355j0375j1585l2419P77j5727K575N7015L8201
12555B28606K219M0405M9404J5016l0466L6688k9019K7010Q951o1340k0261J3348
12543B80561r322k3517J3575L48j9205J0328k0507J3989J6568q903j4879J2657
$$ plain form
12531 251693 237741 218889 304244 355587 364985 346177 317314 271027 295754 293238 269354 284790
12519 284790 325638 353690 367333 312473 289372 306359 288069 284299 301610 321564 355078 371917
12507 371917 394435 384518 342245 308194 305593 267074 254560 256577 208905 256557 316141 299969
12495 299969 217706 244487 326770 341127 288958 246436 288034 348942 367481 339376 283340
12484 283340 325389 367362 399919 392358 351417 329884 373811 420733 369703 316159 345456 385819
12472 385819 384752 359532 354490 377996 383419 364537 342134 375054 398912 415240 423295 445570
12460 445570 508182 463785 385521 374421 364812 357729 407238 424466 400517 397663 384847 382548
12448 382548 368321 423673 444963 430537 346342 342225 331166 318990 326205 368527 456252 458669
$$ packed form
12531B51693j3952j8852Q5355N1343R398j8808k8863m6287K4727k516k3884J5436
12519B84790M0848K8052J3643n4860k3101J6987j8290l770J7311J9954L3514J6839
12507C71917K2518r917m2273l4051k601l8519j2514K017m7672M7652N9584j6172
12495B99969q2263K6781Q2283J4357n2169m2522M1598O0908J8539k8105n6036
12484B83340M2049M1973L2557p561m0941k1533M3927M6922n1030n3544K9297M0363
12472C85819j067k5220n042K3506N423j8882k2403L2920K3858J6328Q055K2275
12460D45570O2612m4397p8264j1100r609p083M9509J7228k3949k854j2816k299
12448C82548j4227N5352K1290j4426q4195m117j1059j2176P215M2322Q7725K417
$$ plain form
12436 458669 464401 426033 429834 480293 520752 572766 528325 487402 511420 485075 444885 450026
12424 450026 439229 436947 449042 429901 450622 430838 425223 439283 459867 487556 511826 468155
12412 468155 451599 507029 529077 525128 542643 525453 549879 547434 563384 547359 544002 490113
12400 490113 454227 451848 500297 562181 553159 488926 504283 490982 497310 528801 522394 497252
12388 497252 519884 528824 491735 491514 496972 543227 522297 562251 558358 538830 535054 554845 561333
12375 561333 521400 499607 520507 500886 469980 494841 544725 596284 636777 631485 626253 597678
12363 597678 571072 554333 581886 600134 606245 594489 630512 691041 674025 619820 624652 654422
12351 654422 645722 624324 679519 673263 635797 667577 634268 613604 590670 596563 651063 624174
$$ packed form
12436D58669N732l8368L801N0459M0459N2014m4441m0923K4018k6345m0190N141
12424D50026j0797k282J2095j9141K0721j9784n615J4060K0584K7689K4270m3671
12412D68155j6556N5430K2048l949J7515j7190K4426k445J5950j6025l357n3889
12400D90113l5886k379M8449O1884r022o4233J5357j3301O328L1491o407k5142
12388D97252K2632Q940l7089k21N458M6255k0930L9954l893j9528l776J9791O488
12375E61333l9933k1793K0900j9621l0906K4861M9884N1559M0493n292n232k8575
12363E97678k6606j6739K7553J8248O111j1756L6023O0529j7016n4205M832K9770
12351F54422q700k1398N5195o256l7466L1780l3309k0664k2934N893N4500k6889
$$ plain form
12339 624174 650543 643791 654925 715676 735058 732134 721406 678138 633414 591183 630685 675995
12327 675995 715319 755543 784463 764631 743379 743504 776607 739061 724709 742420 753393 760666
12315 760666 764494 807829 763854 729734 708716 700997 734833 759198 811758 837322 862524 806281
12303 806281 807969 814010 815705 872351 908902 892765 889351 942596 924573 915662 884590 969671
12291 969671 994270 985568 993319 956224 938066 901721 860800 904223 918602 910931 933268 946700
12279 946700 943543 961653 942848 958298 972703 964323 997633 1032770 1071591 1056604 1020765 1002225
12267 1002225 967575 940544 931865 977182 1024592 1048939 1051905 1079074 1097273 1133995 1120646 1102476
12255 1102476 1082554 1054631 1076992 1120192 1149337 1141212 1104234 1141103 1181078 1205943 1197388 1193770
$$ packed form
12339F24174K6369o752J1134O0751J9382k924j0728m3268m4724m2231L9502M5310
12327F75995L9324M0224K8920j9832k1252J25L3103l7546j4352J7711J0973P273
12315G60666L828M3335m3975l4120k1018p719L3836K4365N2560K5564K5202n6243
12303H06281J688O041J695N6646L6551j6137l414N3245j8023q911l1072Q5081
12291I69671K4599q702P751l7095j8158l6345m0921M3423J4379p671K2337J3432
12279I46700l157J8110j8805J5450J4405q380L3310L5137L8821j4987l5839j8540
12267A002225l4650k7031q679M5317M7410K4347K966K7169J8199L6722j3349j8170
12255A102476j9922k7923K2361M3200K9145q125l6978L6869L9975K4865q555l618
$$ plain form
12243 1193770 1188831 1222009 1199832 1219945 1280934 1274342 1245193 1253301 1277685 1274279 1278735 1238555
12231 1238555 1303086 1348591 1379829 1337110 1347727 1383075 1347270 1336108 1343002 1354013 1366196
12220 1366196 1375374 1369462 1367191 1392585 1403282 1403586 1459591 1480544 1441137 1460261 1507911 1493403
12208 1493403 1504484 1454471 1441557 1459358 1538440 1610348 1582452 1589432 1609562 1610597 1612312 1643641
12196 1643641 1656861 1666611 1690669 1708169 1712341 1796001 1754992 1706243 1674172 1651999 1664296 1703911
12184 1703911 1779787 1797754 1817672 1851175 1801590 1821027 1827318 1840582 1844545 1892692 1962402 1974271
12172 1974271 1934014 1902214 1981892 2009563 2025786 2025555 2066715 2060984 2091186 2089613 2111276 2142790
12160 2142790 2114590 2086131 2116746 2158987 2202477 2240156 2275020 2304623 2311250 2331264 2352221
$$ packed form
12243A193770m939L3178k2177K0113O0989o592k9149Q108K4384l406M456m0180
12231A238555O4531M5505L1238m2719J0617L5348l5805j1162O894J1011J2183
12220A366196R178n912k271K5394J0697L04N6005K0953l9407J9124M7650j4508
12208A493403J1081n0013j2914J7801P9082P1908k7896O980K0130J035J715L1329
12196A643641J3220R750K4058J7500M172Q3660m1009m8749l2071k2173J2297L9615
12184A703911P5876J7967J9918L3503m9585J9437O291J3264L963M8147O9710J1869
12172A974271m0257l1800P9678K7671J6223k31M1160n731L0202j573K1663L1514
12160B142790k8200k8459L0615M2241M3490L7679L4864K9603O627K0014K0957
$$ plain form
12149 2352221 2350140 2319486 2317118 2341934 2412007 2487057 2538963 2534458 2492959 2482041 2537552 2600880
12137 2600880 2629075 2705810 2704657 2661015 2624054 2669129 2674236 2656654 2749763 2830571 2840344 2816125
12125 2816125 2857738 2921117 2976086 3007891 3061340 3095482 3089091 3082094 3062351 3130271 3162622 3151828
12113 3151828 3168022 3219649 3240837 3239463 3304594 3355453 3370657 3435471 3486728 3519229 3566993
12102 3566993 3623207 3617183 3660741 3703384 3704693 3735181 3763254 3820504 3921530 3943933 3987093
12091 3987093 4040501 4058797 4072174 4108627 4144147 4211247 4203669 4202256 4275652 4315573 4340712 4340443
12079 4340443 4328287 4380898 4465705 4545846 4542842 4586587 4639185 4737558 4765130 4820700 4850558
12068 4850558 4926949 4980827 5007795 5038044 5109440 5189799 5276201 5293321 5309083 5351596 5427100
$$ packed form
12149B352221k081l0654k368K4816P0073P5050N1906m505m1499j0918N5511O3328
12137B600880K8195P6735j153m3642l6961M5075N107j7582R3109Q0808R773k4219
12125B816125M1613O3379N4969L1805N3449L4142o391o997j9743O7920L2351j0794
12113C151828J6194N1627K1188j374O5131N0859J5204O4814N1257L2501M7764
12102C566993N6214o024M3558M2643J309L0488K8073N7250J01026K2403M3160
12091C987093N3408J8296J3377L6453L5520O7100p578j413P3396L9921K5139k69
12079D340443j2156N2611Q4807Q0141l004M3745N2598R8373K7572N5570K9858
12068D850558P6391N3878K6968L0249P1396Q0359Q6402J7120J5762M2513P5504
$$ plain form
12057 5427100 5507492 5548317 5623093 5668422 5739574 5789454 5828563 5912077 6064265 6156039 6189058
12046 6189058 6203544 6232564 6274332 6378764 6512702 6628410 6728273 6837204 6923446 6987280
12036 6987280 7056216 7143225 7250826 7326347 7466481 7631405 7791437 7976247 8162744 8302865
12026 8302865 8407252 8460825 8508392 8565842 8532060 8493635 8488892 8469759 8494933 8507765 8563697
12015 8563697 8667516 8696021 8676660 8651814 8682209 8675723 8760163 8835373 8937777 9022596 9135711
12004 9135711 9206060 9296667 9448288 9574296 9658829 9786093 9911056 10043919 10198583 10394125
11994 10394125 10613959 10806737 11049171 11268864 11520503 11832101 12034226 12117493 12168351 12159037
11984 12159037 12016734 11852488 11707288 11560435 11413776 11298856 11122825 11008964 10957503
$$ packed form
12057E427100Q0392M0825P4776M5329P1152M9880L9109Q3514J52188R1774L3019
12046F189058J4486K9020M1768J04432J33938J15708R9863J08931Q6242O3834
12036F987280O8936Q7009J07601P5521J40134J64924J60032J84810J86497J40121
12026H302865J04387N3573M7567N7450l3782l8425m743j9133K5174J2832N5932
12015H563697J03819K8505j9361k4846L0395o486Q4440P5210J02404Q4819J13115
12004I135711P0349R0607J51621J26008Q4533J27264J24963J32863J54664J95542
11994A0394125K19834J92778K42434K19693K51639L11598K02125Q3267N0858r314
11984A2159037j42303j64246j45200j46853j46659j14920j76031j13861n1461
$$ plain form
11975 10957503 10994543 11005821 10934994 10877104 10801746 10818346 10835472 10821163 10883975 10897298 10936356
11964 10936356 10983095 10952856 10981349 11000384 10996268 11073280 11166743 11232697 11262822 11280397 11275776
11953 11275776 11311798 11425264 11538186 11614422 11673589 11735792 11823334 11891505 11833899 11728478
11943 11728478 11637806 11495455 11282500 11058448 10955710 10851666 10763276 10660010 10593962 10537676
11933 10537676 10438453 10335297 10280566 10207170 10183637 10168660 10132953 10059369 9944000 9808127
11923 9808127 9779445 9723092 9657964 9589418 9549246 9524095 9461714 9410080 9397232 9381259 9325741
11912 9325741 9247391 9144796 9073005 9015638 8943266 8854456 8735092 8655082 8572280 8514757 8456535
11901 8456535 8417991 8341195 8232613 8182040 8137475 8072461 8007109 8002816 7920756 7818076 7744181
$$ packed form
11975A0957503L7040J1278p0827n7890p5358J6600J7126j4309O2812J3323L9058
11964A0936356M6739l0239K8493J9035m116P7012R3463O5954L0125J7575m621
11953A1275776L6022J13466J12922P6236N9167O2203Q7542O8171n7606j05421
11943A1728478r0672j42351k12955k24052j02738j04044q8390j03266o6048n6286
11933A0537676r9223j03156n4731p3396k3533j4977l5707p3584j15369j35873
11923I808127k8682n6353o5128o8546m0172k5151o2381n1634j2848j5973n5518
11912I325741p8350j02595p1791n7367p2372q8810j19364q0010q2802n7523n8222
11901H456535l8544p6796j08582n0573m4565o5014o5352m293q2060j02680p3895
$$ plain form
11890 7744181 7652791 7591796 7550320 7512077 7495302 7449316 7370522 7244352 7162901 7036188 6987591
11879 6987591 6963783 6939388 6922229 6823462 6707328 6581697 6539288 6510373 6436392 6418814 6381122
11868 6381122 6280791 6243434 6177550 6109108 6129275 6092554 6006390 5938683 5892708 5838342 5773795
11857 5773795 5751426 5696870 5671549 5606660 5508122 5409352 5387892 5363923 5290004 5203127 5144658
11846 5144658 5080818 5029410 4975118 4931492 4896915 4869752 4785428 4776915 4795441 4774112 4693857
11835 4693857 4649048 4632426 4561350 4464886 4470839 4482744 4444115 4367847 4260470 4177206 4141384
11824 4141384 4042022 4004195 3980705 3979813 4001481 3951295 3849431 3793425 3747382 3698437 3611788
11813 3611788 3636495 3662974 3663169 3664036 3626114 3599661 3575845 3549028 3517674 3419323 3366023 3380442
$$ packed form
11890G744181r1390o0995m1476l8243j6775m5986p8794j26170q1451j26713m8597
11879F987591k3808k4395j7159r8767j16134j25631m2409k8915p3981j7578l7692
11868F381122j00331l7357o5884o8442K0167l6721q6164o7707m5975n4366o4547
11857E773795k2369n4556k5321o4889r8538r8770k1460k3969p3919q6877n8469
11846E144658o3840n1408n4292m3626l4577k7163q4324q513J8526k1329q0255
11835D693857m4809j6622p1076r6464N953J1905l8629p6268j07377q3264l5822
11824D141384r9362l7827k3490q92K1668n0186j01864n6006m6043m8945q6649
11813C611788K4707K6479J95Q67l7922k6453k3816k6817l1354r8351n3300J4419
$$ plain form
11801 3380442 3405128 3387731 3338147 3307906 3249873 3239370 3242395 3242760 3187920 3119297 3074361 3020404
11789 3020404 2988464 3019872 3013286 2994446 2940733 2936806 2918141 2895946 2881073 2908009 2846842 2808097
11777 2808097 2762800 2694076 2606535 2511750 2514073 2569297 2569737 2550300 2507824 2516234 2469053 2409217
11765 2409217 2367543 2386719 2427712 2419775 2401441 2381888 2354584 2329285 2314678 2275424 2262612
11754 2262612 2244885 2251515 2241361 2211727 2222852 2185234 2112478 2054654 2031390 2070943 2071026 2030753
11742 2030753 2018613 2074445 2066576 2038223 2018308 2022284 1970176 1940962 1908994 1804887 1782866
11731 1782866 1794042 1827647 1866942 1906760 1906622 1882812 1859320 1841658 1780138 1716285 1698373 1751687
11719 1751687 1738255 1667667 1698981 1709504 1725045 1745672 1751670 1738662 1715803 1633606 1583112
$$ packed form
11801C380442K4686j7397m9584l0241n8033j0503L025L65n4840o8623m4936n3957
11789C020404l1940L1408o586j8840n3713l927j8665k2195j4873K6936o1167l8745
11777B808097m5297o8724q7541r4785K323N5224M40j9437m2476Q410m7181n9836
11765B409217m1674J9176M0993p937j8334j9553k7304k5299j4607l9254j2812
11754B262612j7727O630j0154k9634J1125l7618p2756n7824k3264L9553Q3m0273
11742B030753j2140N5832p869k8353j9915L976n2108k9214l1968j04107k2021
11731A782866J1176L3605L9295L9818j38k3810k3492j7662o1520o3853j7912N3314
11719A751687j3432p0588L1314J0523J5541K0627N998j3008k2859q2197n0494
$$ plain form
11708 1583112 1578566 1585830 1611736 1571205 1534624 1485547 1469037 1435200 1448104 1467968 1495110 1448971
11696 1448971 1403820 1421900 1460053 1420753 1382842 1390617 1387047 1388855 1359628 1330825 1321757 1352230
11684 1352230 1366812 1345534 1307528 1271989 1221028 1226748 1194588 1204029 1268785 1271759 1255682 1263931
11672 1263931 1240690 1194726 1153764 1086131 1087985 1146193 1094557 1094792 1129150 1193932 1190169 1184319
11660 1184319 1175729 1178676 1151466 1129273 1178227 1234471 1218158 1177501 1127062 1125415 1132412 1103581
11648 1103581 1051540 1033441 1037808 1029261 1019794 1005201 999592 972449 957939 995165 1039504 1015614
11636 1015614 1003070 943444 925531 947566 971965 979493 959640 917429 920144 931575 888089 900977
11624 900977 964079 938065 919003 915816 904973 895042 889321 857160 891299 857642 847322 848213
$$ packed form
11708A583112m546P264K5906m0531l6581m9077j6510l3837J2904J9864K7142m6139
11696A448971m5151J8080L8153l9300l7911P775l570J808k9227k8803r068L0473
11684A352230J4582k1278l8006l5539n0961N720l2160R441O4756K974j6077Q249
11672A263931k3241m5964m0962o7633J854N8208n1636K35L4358O4782l763n850
11660A184319q590K947k7210k2193M8954N6244j6313m0657n0439j647O997k8831
11648A103581n2041j8099M367q547r467j4593n609k7143j4510L7226M4339k3890
11636A015614j2544n9626j7913K2035K4399P528j9853m2211K715J1431m3486J2888
11624I00977O3102k6014j9062l187j0843r931n721l2161L4139l3657j0320Q91
$$ plain form
11612 848213 908669 875098 875436 856893 834632 781968 790795 769679 760318 769365 755432 804007
11600 804007 827276 829532 824929 782283 787304 797124 790289 805287 823889 790752 816093 848786
11588 848786 830515 855200 837728 816748 811165 753601 709899 691482 679853 718190 750156 723134
11576 723134 686659 676522 662304 632544 602007 612063 588614 553891 586721 636393 661104
11565 661104 641387 598063 581528 581656 600905 624950 632038 659945 720922 692107 704890 687699
11553 687699 609421 574624 546805 563704 530588 528229 561373 565063 585521 619810 620468 607478
11541 607478 553282 547987 631001 663279 614576 563001 604222 568732 516699 608760 609436 563871
11529 563871 581681 561702 515435 495850 517770 535420 489910 495258 519158 511789 476812 438075
$$ packed form
11612H48213O0456l3571L38j8543k2261n2664Q827k1116r361R047j3933M8575
11600H04007K3269K256m603m2646N021R820o835J4998J8602l3137K5341L2693
11588H48786j8271K4685j7472k0980n583n7564m3702j8417j1629L8337L1966k7022
11576G23134l6475j0137j4218k9760l0537J0056k3449l4723L2830M9672K4711
11565F61104j9717m3324j6535J28J9249K4045P088K7907O0977k8815J2783j7191
11553F87699p8278l4797k7819J6899l3116k359L3144L690K0458L4289O58j2990
11541F07478n4196n295Q3014L2278m8703n1575M1221l5490n2033R2061O76m5565
11529E63871J7810j9979m6267j9585K1920J7650m5510N348K3900p369l4977l8737
$$ plain form
11517 438075 440997 466329 478297 544843 639311 652446 578240 546098 576731 584905 555999 525441
11505 525441 489825 481725 517058 506786 523152 543050 513550 442226 447124 473127 470708 473681
11493 473681 488209 489216 496631 497776 491265 460189 440567 514014 490483 494248 518648 468532
11481 468532 436965 426462 379372 296463 317311 355716 357899 341415 330941 287370 261228 253424
11469 253424 264028 286595 337748 371739 392053 378451 367319 314568 326560 401922 401026 400718
11457 400718 349167 318350 280338 312003 303347 301480 319844 352997 407677 449653 387247 346411
11445 346411 349618 326720 287897 273817 271244 322766 331027 351395 301248 276710 282364 294908
11433 294908 264506 315223 376849 388085 342691 305489 286054 289224 370393 401624 359694 328768
$$ packed form
11517D38075K922K5332J1968O6546R4468J3135p4206l2142L0633Q174k8906l0558
11505E25441l5616q100L5333j0272J6366J9898k9500p1324M898K6003k419K973
11493D73681J4528J007P415J145o511l1076j9622P3447k3531L765K4400n0116
11481D68532l1567j0503m7090q2909K0848L8405K183j6484j0474m3571k6142p804
11469B53424J0604K2567N1153L3991K0314j3602j1132n2751J1992P5362q96l08
11457D00718n1551l0817l8012L1665q656j867J8364L3153N4680M1976o2406m0836
11445C46411L207k2898l8823j4080k573N1522Q261K0368n0147k4538N654J2544
11433B94908l0402N0717O1626J1236m5394l7202j9435L170Q1169L1231m1930l0926
$$ plain form
11421 328768 277891 303374 306720 319015 329511 343475 327626 311954 290444 248476 266651 283141
11409 283141 314362 349034 345387 328717 319092 309801 276379 286991 277710 218930 262402 312456
11397 312456 329959 318673 260146 265444 307614 346243 321744 321440 338194 328932 324229 307670
11385 307670 299113 318769 358622 341122 303596 290858 248374 176851 167993 205454 220000 201282
11373 201282 214026 244631 247792 239714 218958 198599 211613 228945 230208 225447 250496 254944
11361 254944 297941 321182 256114 223809 293870 267863 298764 342320 289599 196409 160492
11350 160492 131923 90091 117102 182611 213051 216404 239818 223724 229735 215429 211444 175345
11338 175345 187535 182233 213665 240347 205613 192824 220230 254362 257841 282401 289743 243150
$$ packed form
11421C28768n0877K5483L346J2295J0496J3964j5849j5672k1510m1968J8175J6490
11409B83141L1221L4672l647j6670r625r291l3422J0612r281n8780M3472N0054
11397C12456J7503j1286n8527N298M2170L8629k4499l04J6754r262m703j6559
11385C07670q557J9656L9853j7500l7526j2738m2484p1523q858L7461J4546j8718
11373B01282J2744L0605L161q078k0756k0359J3014J7332J263m761K5049M448
11361B54944M2997K3241o5068l2305P0061k6007L0901M3556n2721r3190l5917
11350A60492k8569m1832K7011O5509L0440L353K3414j6094O011j4306l985l6099
11338A75345J2190n302L1432K6682l4734j2789K7406L4132L479K4560P342m6593
$$ plain form
11326 243150 180212 179388 226712 257204 217487 176744 183136 162081 169689 148416 118870 177916
11314 177916 202160 169982 159305 144469 150502 123504 121329 141887 168798 178451 193505 226500
11302 226500 237047 228981 194165 171035 209262 209940 174968 137254 130625 156537 130764 124050
11290 124050 172605 206227 254011 229531 236720 236784 230378 200203 210819 220757 172818 132942 117345
11277 117345 66679 93399 106176 132711 131685 181591 173265 144284 134727 159177 164269 143687
11265 143687 101610 102693 87115 121062 109011 72846 93992 100581 86151 104850 148132 154078
11253 154078 133272 173208 189987 165996 177959 155304 109046 95712 89134 94792 126163 141712
11241 141712 153682 87018 59327 95115 95771 76118 88577 82867 96764 150456 133622 119751
$$ packed form
11326B43150o2938q24M7324L0492l9717m0743O392k1055P608k1273k9546N9046
11314A77916K4244l2178j0677j4836O033k6998k175K0558K6911R653J5054L2995
11302B26500J0547q066l4816k3130L8227O78l4972l7714o629K5912k5773o714
11290A24050M8555L3622M7784k4480P189O4o406l0175J0616R938m7939l9876j5597
11277A17345n0666K6720J2777K6535j026M9906q326k8981r557K4450N092k0582
11265A43687m2077J083j5578L3947j2051l6165K1146O589j4430J8699M3282N946
11253A54078k0806L9936J6779k3991J1963k2655m6258j3334o578N658L1371J5549
11241A41712J1970o6664k7691L5788O56j9653J2459n710J3897N3692j6834j3871
$$ plain form
11229 119751 130606 155762 107625 62186 74981 102136 138520 126977 51785 35948 43638 52631
11217 52631 101204 131201 115446 74370 76118 87575 103517 84636 44392 99856 103255 108037
11205 108037 107163 85396 76156 56583 77024 110829 90183 64224 82282 104073 95718 86085
11193 86085 85691 83513 48803 28315 42363 83287 88892 222 -6197 -10443 32033 94014 95971
11180 95971 103749 96917 121013 121254 54741 57405 43580 70332 104598 85882 87051 121584 96857
11167 96857 25580 52234 114571 134204 175061 191024 147217 163744 180006 136203 75132 89199
11155 89199 139460 172476 131969 140559 96237 52875 64619 33768 79442 105227 77147 131680
11143 131680 128067 111722 133491 135778 149584 152354 145266 127764 132483 105283 99608 77395 65911
$$ packed form
11229A19751J0855K5156m8137m5439J2795K7155L6384j1543p5192j5837P690Q993
11217E2631M8573K9997j5755m1076J748J1457J5942j8881m0244N5464L399M782
11205A08037q74k1767r240j9573K0441L3805k0646k5959J8058K1791q355r633
11193H6085l94k178l4710k0488J4048M0924N605q8670o419m246M2476O1981J957
11180I5971P778o832K4096K41o6513K664j3825K6752L4266j8716J169L4533k4727
11167I6857p1277K6654O2337J9633M0857J5963m3807J6527J6262m3803o1071J4067
11155H9199N0261L3016m0507Q590m4322m3362J1744l0851M5674K5785k8080N4533
11143A31680l613j6345K1769K287J3806K770p088j7502M719k7200n675k2213j1484
$$ plain form
11130 65911 57328 59960 36026 43207 52848 66167 33419 66432 104171 100496 92479 131161 149973
11117 149973 117219 122286 108655 121094 165421 137736 120922 115451 143350 129708 80235 54599
11105 54599 38352 41889 74870 73081 40864 23435 27426 47871 78055 120695 102138 36443
11093 36443 21375 48651 123548 148246 75624 88070 153209 153979 109841 85965 103098 111671
11081 111671 153245 201475 79025 19871 41453 6414 -37933 13204 70714 77147 57435
11070 57435 37157 22570 29820 28058 -5366 -41196 -25390 52430 91460 91047 36060 52010
11058 52010 61091 63944 88798 86890 103205 96902 109241 131390 171775 194386 173618 167670 168819
11045 168819 155225 147961 153677 183486 160929 168764 193266 205004 291877 341533 385642 339484
$$ packed form
11130F5911q583K632k3934P181R641J3319l2748L3013L7739l675q017L8682J8812
11117A49973l2754N067j3631J2439M4327k7685j6814n471K7899j3642m9473k5636
11105E4599j6247L537L2981j789l2217j7429L991K0445L0184M2640j8557o5695
11093C6443j5068K7276P4897K4698p2622J2446O5139P70m4138k3876J7133Q573
11081A11671M1574M8230j22450n9154K1582l5039m4347N1137N7510O433j9712
11070E7435k0278j4587P250j762l3424l5830J5806P7820L9030m13n4987J5950
11058E2010R081K853K4854j908J6315o303J2339K2149M0385K2611k0768n948J149
11045A68819j3594p264N716K9809k2557P835K4502J1738Q6873M9656M4109m6158
$$ plain form
11033 339484 305516 287991 275372 245309 208203 174493 283012 299536 306068 394473 404959
11022 404959 333721 350493 345879 260499 268060 257701 227164 255336 248872 232256 242594 281111
11010 281111 285497 237923 194993 177539 97854 115475 117538 118188 143493 137283 91591 79531
10998 79531 129905 116235 104449 98610 97652 103078 68794 52957 67750 109086 98620 73459
10986 73459 76005 58663 9464 44988 -21269 -31709 -8582 29078 39823 57537 88861 84861
10974 84861 95457 62423 -16327 -37154 -16438 32005 78067 108409 137186 125243 160147 172552
10962 172552 147202 126688 113716 103337 87259 74258 75004 79032 50012 1842 15405 10523
10950 10523 45933 64077 32922 -8442 18615 80103 95837 84223 20736 -7459 52924 63775
$$ packed form
11033C39484l3968j7525j2619l0063l7106l3710J08519J6524O532Q8405J0486
11022D04959p1238J6772m614q5380P561j0359l0537K8172o464j6616J0338L8517
11010B81111M386m7574m2930j7454p9685J7621K063O50K5305o210m5692j2060
10998G9531N0374j3670j1786n839r58N426l4284j5837J4793M1336j0466k5161
10986G3459K546j7342m9199L5524o6257j0440K3127L7660J0745J7714L1324m000
10974H4861J0596l3034p8750k0827K0716M8443M6062L0342K8777j1943L4904J2405
10962A72552k5350k0514j2972j0379j6078j3001P46M028k9020m8170J3563m882
10950A0523L5410J8144l1155m1364K7057O1488J5734j1614o3487k8195O0383J0851
$$ plain form
10938 63775 57806 36571 14007 4767 18263 79089 119520 136202 159672 117334 106312 117979
10926 117979 90219 100031 101608 58566 49972 92938 84842 67228 72528 103769 95044 108018 63856
10913 63856 59272 76831 85953 67587 21311 22249 35448 47681 19510 -8765 23481 16371 55085
10900 55085 30201 3308 -35204 -43563 8423 4239 -15679 17702 31869 37157 20272 -1596
10888 -1596 -6980 -63717 -148470 -88941 -5555 -25808 -32873 -70180 -84556 -33673 39428 66239
10876 66239 104241 136002 164179 161630 178352 134318 97424 107919 158338 208070 210604 238390
10864 238390 212303 125870 60626 68019 96681 73301 46380 44017 46846 68458 81905 84675
10852 84675 92062 56379 38950 33263 17269 21367 67046 106320 85196 48367 61683 42129
$$ packed form
10938F3775n969k1235k2564r240J3496O0826M0431J6682K3470m2338j1022J1667
10926A17979k7760R812J577m3042q594M2966q096j7614N300L1241q725J2974m4162
10913F3856m584J7559R122j8366m6276R38J3199J2233k8171k8275L2246p110L8714
10900E5085k4884k6893l8512q359N1986m184j9918L3381J4167N288j6885k1868
10888a596n384n6737q4753N9529Q3386k0253p065l7307j4376N0883P3101K6811
10876F6239L8002L1761K8177k549J6722m4034l6894J0495N0419M9732K534K7786
10864B38390k6087q6433o5244P393K8662k3380k6921k363K829K1612J3447K770
10852H4675P387l5683j7429n687j5994M098M5679L9274k1124l6829J3316j9554
$$ plain form
10840 42129 24838 133898 195452 140867 89485 103322 150132 180354 140136 102579 81079
10829 81079 64962 84222 53991 30492 62325 60040 74875 122848 127074 145902 88466 75910
10817 75910 47176 85566 134126 132728 126336 112989 41433 -18343 -1191 34172 56270 106942
10805 106942 68457 882 -6131 25835 39409 39786 -17253 -41523 -35634 4237 42618 64722
10793 64722 40642 5850 -8880 12713 30564 14757 -7771 -22380 3446 42316 -5456 8481
10781 8481 34874 35489 51706 12261 37176 43157 -7688 53259 79728 110465 49359 -13949
10769 -13949 -24679 37697 30641 26927 14741 29657 47301 46371 40945 31925 40399 91387 61831
10756 61831 34582 17121 -20730 -15112 -4542 17785 -6642 -36438 40124 94863 44387 -13754
$$ packed form
10840D2129j7291J09060O1554n4585n1382J3837M6810L0222m0218l7557k1500
10829H1079j6117J9260l0231k3499L1833k285J4835M7973M226J8828n7436j2556
10817G5910k8734L8390M8560j398o392j3347p1556n9776J7152L5363K2098N0672
10805A06942l8485o7575p013L1966J3574L77n7039k4270N889L9871L8381K2104
10793F4722k4080l4792j4730K1593J7851j5807k2528j4609K5826L8870m7772J3937
10781H481K6393O15J6217l9445K4915N981n0845O0947K6469L0737o1106o3308
10769a3949j0730O2376p056l714j2186J4916J7644r30n426r020Q474N0988k9556
10756F1831k7249j7461l7851N618J0570K2327k4427k9796P6562N4739n0476n8141
$$ plain form
10744 -13754 -12802 -12000 -39796 -38479 -24584 -36515 -449 -7942 16510 59 8079 109568 146804
10731 146804 131053 83380 30697 1076 38459 96748 77640 68924 93690 101049 62101 62365
10719 62365 71141 605 8065 64892 52319 20774 12881 82187 117228 65133 12861 -38585
10707 -38585 15698 104030 113015 91774 68727 47182 65582 78410 26892 93475 95361 52476
10695 52476 2303 23027 12079 -35296 -62903 -44938 -2702 26292 34677 16832 18596 5455
10683 5455 -14032 73121 108142 134361 111805 109835 160370 152362 91502 3832 14576 38021
10671 38021 69407 50076 23091 59231 68109 68311 137467 190747 188164 230557 311199 417081
10659 417081 507866 667911 825558 1010437 1136351 1070133 887482 653586 488172 466609
$$ packed form
10744a3754R52Q02k7796J317J3895j1931L6066p493K4452j6451Q020J01489L7236
10731A46804j5751m7673n2683k9621L7383N8289j9108q716K4766P359l8948K64
10719F2365Q776p0536P460N6827j2573l1545p893O9306L5041n2095n2272n1446
10707c8585N4283Q8332Q985k1241k3047k1545J8400J2828n1518O6583J886m2885
10695E2476n0173K0724j0948m7375k7607J7965M2236K8994Q385j7845J764j3141
10683E455j9487Q7153L5021K6219k2556j970N0535q008o0860q7670J0744K3445
10671C8021L1386j9331k6985L6140Q878K02O9156N3280k583M2393Q0642J05882
10659D17081R0785J60045J57647J84879J25914o6218j82651k33896j65414k1563
$$ plain form
10649 466609 450346 434084 399317 392037 449859 545270 620805 599798 647708 728459 824611 882681
10637 882681 901425 1003276 1144975 1243020 1370004 1594565 1758756 1931010 2191426 2489083
10627 2489083 2878463 3330548 3996554 4917302 6181386 7874852 9996241 12503566 15241633
10618 15241633 17683546 19604278 20709262 20889066 20538090 20122259 20165833 21210188 23453999
10609 23453999 27005574 31527355 36424859 40746652 43608604 44352712 42896017 40077466
10601 40077466 37356622 35930502 36314903 38748101 43091236 48647702 54475680 59205036
10593 59205036 61507398 60514747 56243678 50074276 44176217 39882934 37615087 37378725
10585 37378725 38815619 41304767 43955480 45740233 45787801 43607507 39422860 34258953
$$ packed form
10649D66609j6263j6262l4767p280N7822R5411P5535k1007M7910Q0751R6152N8070
10637H82681J8744J01851J41699R8045J26984K24561J64191J72254K60416K97657
10627B489083L89380M52085O66006R20748J264084J693466K121389K507325K738067
10618A5241633K441913J920732J104984J79804l50976m15831M3574J044355K243811
10609B3453999L551575M521781M897504M321793K861952P44108j456695k818551
10601D0077466k720844j426120L84401K433198M343135N556466N827978M729356
10593E9205036K302362r92651m271069o169402n898059m293283k267847k36362
10585C7378725J436894K489148K650713J784753M7568k180294m184647n163907
$$ plain form
10577 34258953 29462526 25899568 23659117 22631392 22434159 22759103 23158965 23091694 22303916
10568 22303916 20592794 18145671 15434619 12862848 10719631 9024538 7726059 6740380
10560 6740380 6002016 5419498 4994657 4652499 4321427 4104819 3845146 3613412 3455713
10551 3455713 3280688 3072247 2975032 2879892 2706297 2624211 2513356 2384882 2275178 2241498
10541 2241498 2175764 2043452 1989281 1966697 1923521 1874802 1819638 1730660 1656954 1616261 1598175
10530 1598175 1576863 1463142 1407619 1386564 1358776 1295677 1256576 1226742 1202755 1146785 1099901
10519 1099901 1063227 1100331 1107081 1104493 1067398 1035699 965434 962836 944362 945009 929695 901827
10507 901827 853463 855335 851830 809795 786602 751105 738851 737821 719435 681858 650659 610234
$$ packed form
10577C4258953m796427l562958k240451j027725j97233L24944L99862o7271p87778
10568B2303916j711122k447123k711052k571771k143217j695093j298479r85679
10560F740380p38364n82518m24841l42158l31072k16608k59673k31734j57699
10551C455713j75025k08441r7215r5140j73595q2086j10855j28474j09704l3680
10541B241498o5734j32312n4171k2584m3176m8719n5164q8978p3706m0693j8086
10530A598175k1312j13721n5523k1055k7788o3099l9101k9834k3987n5970m6884
10519A099901l6674L7104O750k588l7095l1699p0265k598j8474O47j5314k7868
10507I01827m8364J872l505m2035k3193l5497j2254j030j8386l7577l1199m0425
$$ plain form
10495 610234 653199 659158 646075 609981 598610 627161 647300 645993 578270 535046 520374 436492
10483 436492 421281 463133 491105 458709 463996 548969 526474 420382 416126 420608 363829 310053
10471 310053 308475 419546 458706 440200 469312 448993 409669 367916 354717 392999 405634
10460 405634 429383 488393 432147 354535 377505 422954 397186 369485 331381 299414 314385
10449 314385 296962 267842 258949 269092 225904 230057 272206 343174 277731 237452 293099 260012
10437 260012 261229 264979 235652 233121 193721 124980 96712 146875 195981 145176 105559 129373
10425 129373 164235 199864 195967 185483 191092 151779 156815 138782 113760 140772 198690 195030
10413 195030 155253 171214 170116 124503 84148 105639 145528 127820 40212 93015 137516 137771
$$ packed form
10495F10234M2965N959j3083l6094j1371K8551K0139j307o7723m3224j4672q3882
10483D36492j5211M1852K7972l2396N287Q4973k2495j06092m256M482n6779n3776
10471C10053j578J11071L9160j8506K9112k0319l9324m1753j3199L8282J2635
10460D05634K3749N9010n6246p7612K2970M5449k5768k7701l8104l1967J4971
10449C14385j7423k9120q893J0143m3188M153M2149P0968o5443m0279N5647l3087
10437B60012J217L750k9327k531l9400o8741k8268N0163M9106n0805l9617K3814
10425A29373L4862L5629l897j0484N609l9313N036j8033k5022K7012N7918l660
10413A95030l9777J5961j098m5613m0355K1491L9889j7708q7608N2803M4501K55
$$ plain form
10401 137771 185125 150891 217067 263670 216712 156681 116189 166321 193505 232121 118815
10390 118815 19855 45796 91914 144699 168543 158042 180769 127429 62838 56919 73261 85222
10378 85222 87885 51631 18044 36519 132475 128752 99359 78414 140279 89973 46779 35765
10366 35765 70409 113783 161322 136981 124367 113895 61197 59341 87811 88616 110937 138934
10354 138934 163267 126175 131070 168107 161342 111874 129008 131556 142787 131962 50382 57809
10342 57809 68175 55671 47512 40420 39037 96472 145161 206198 208946 97078 -6883 -36962
10330 -36962 5225 72935 105392 60587 67759 72820 114444 107303 154035 178712 186435 190412 150205
10317 150205 151287 177817 193949 187482 77951 41816 95576 174227 225237 200923 168099 136351
$$ packed form
10401A37771M7354l4234O6176M6603m6958o0031m0492N0132K7184L8616j13306
10390A18815r8960K5941M6118N2785K3844j0501K2727n3340o4591n919J6342J1961
10378H5222K663l6254l3587J8475R5956l723k9393k0945O1865n0306m3194j1014
10366C5765L4644M3374M7539k4341j2614j0472n2698j856K8470Q05K2321K7997
10354A38934K4333l7092M895L7037o765m9468J7134K548J1231j0825q1580P427
10342E7809J0366j2504q159p092j383N7435M8689O1037K748j11868j03961l0079
10330c6962M2187O7710L2457m4805P172N061M1624p141M6732K4677P723L977m0207
10317A50205J082K6530J6132o467j09531l6135N3760P8651N1010k4314l2824l1748
$$ plain form
10305 136351 123775 137140 167007 212938 193103 222505 176254 143863 130422 87351 118114
10294 118114 126481 134555 143155 95762 -3235 -13436 38828 73664 90677 75370 49607 86841
10282 86841 110870 117170 62250 40498 59763 58753 29485 34042 66921 63290 50598 57593 64364
10269 64364 48083 -24681 -17248 35498 52387 61479 56982 -667 -24098 15355 59341 79394
10257 79394 41610 -8535 -13502 63725 63184 22737 76224 96847 67598 30002 -8335 -1133
10245 -1133 8608 -6184 32809 12656 -7992 48788 106559 78361 71864 23218 -473 56166
10233 56166 -3117 -3159 34792 47839 26973 -8012 47587 78146 47420 18380 28151 41914
10221 41914 37556 4368 -26294 -33496 -32168 -26703 9112 18385 37582 35370 21180 76133 104717
$$ packed form
10305A36351j2576J3365K9867M5931j9835K9402m6251l2391j3441m3071L0763
10294A18114Q367Q074Q600m7393r8997j0201N2264L4836J7013j5307k5763L7234
10282H6841K4029O300n4920k1752J9265j010k9268M557L2879l631j2692O995O771
10269F4364j6281p2764P433N2746J6889R092m497n7649k3431L9453M3986K0053
10257G9394l7784n0145m967P7227n41m0447N3487K0623k9249l7596l8337P202
10245a133R741j4792L8993k0153k0648N6780N7771k8198o497m8646k3691N6639
10233E6166n9283m2L7951J3047k0866l4985N5599L0559l0726k9040R771J3763
10221D1914m358l3188l0662p202J328N465L5815R273J9197k212j4190N4953K8584
$$ plain form
10208 104717 56420 -4514 10733 23469 65245 79499 70932 -9877 -48599 983 -10067 1453
10196 1453 -56316 -46323 8337 28819 5197 -23782 -24651 -9707 18882 29072 51910 117820
$$ packed form
10208A04717m8297o0934J5247J2736M1776J4254q567q0809l8722M9582j1050J1520
10196A453n7769R993N4660K0482k3622k8979q69J4944K8589J0190K2838O5910
$$ [...]
##END NTUPLES=NMR SPECTRUM
##END=
