##TITLE=Analysis number 323254
Compound Code cc 47509
Book Reference 508/12/2
Project Code adrs
Chemist Name antons
##JCAMPDX= 6.0         $$ Bruker NMR JCAMP-DX V2.0
##DATA TYPE= NMR SPECTRUM
##DATA CLASS= NTUPLES
##ORIGIN= Bruker BioSpin GmbH
##OWNER= nmr
$$ XWIN-NMR		Version 3.5
$$ Thu Oct 19 14:12:50 2006 GMT Daylight Time (UT+1h)  MAYBRIDGE\nmr@NMR_250MHZ
##.OBSERVE FREQUENCY= 250.131544655141
##.OBSERVE NUCLEUS= ^1H
##.ACQUISITION MODE= SIMULTANEOUS (DQD)
##.ACQUISITION SCHEME= undefined
##.AVERAGES= 16
##.DIGITISER RES= 18
##SPECTROMETER/DATA SYSTEM= dpx250
##.PULSE SEQUENCE= zg30
##.SOLVENT NAME= CDCl3
##.SHIFT REFERENCE= (INTERNAL, CDCl3, 0, 16.4507)
##AUDIT TRAIL= $$ (NUMBER, WHEN, WHO, WHERE, WHAT)
$$ ##TITLE= Audit trail, XWIN-NMR		Version 3.5
$$ ##JCAMPDX= 5.01
$$ ##ORIGIN= Bruker BioSpin GmbH
$$ ##OWNER= nmr
$$ C:\u/data/dgb/nmr/ADRS/940/pdata/1/auditp.txt
$$ ##AUDIT TRAIL=  $$ (NUMBER, WHEN, WHO, WHERE, WHAT)
(   1,<2006-10-19 14:12:31.36 +100>,<MAYBRIDGE\nmr>,<NMR_250MHZ>,
      <created by zg, POWCHK disabled, PULCHK disabled
       configuration hash MD5:
       49 4B E0 1D 92 C2 6B 37 9F E6 65 BC 52 41 86 1D
       data hash MD5: 64K
       7A FE B9 5F 34 FA 58 1B AC 47 3E 1E 88 96 6F ED>)
(   2,<2006-10-19 14:12:42.78 +100>,<MAYBRIDGE\nmr>,<NMR_250MHZ>,
      <Start of raw data processing
       ef LB = 0.3 FT_mod = 6 PKNL = 1 SI = 32K 
       data hash MD5: 32K
       98 BC 70 03 3D 0F B2 55 9E 61 F0 6A 76 73 56 75>)
(   3,<2006-10-19 14:12:44.61 +100>,<MAYBRIDGE\nmr>,<NMR_250MHZ>,
      <apk 
       data hash MD5: 32K
       F8 94 16 1C D6 3E 92 82 36 AD 26 C5 2B A6 DB DA>)
(   4,<2006-10-19 14:12:45.31 +100>,<MAYBRIDGE\nmr>,<NMR_250MHZ>,
      <abs ABSG = 5 
       data hash MD5: 32K
       78 F2 DC 3A D2 52 34 A5 87 6C C8 7A D3 CB 09 CF>)
$$ ##END=
$$ 
$$ hash MD5
$$ 55 70 73 38 E1 A8 80 94 63 1B 72 1D A1 CB 71 C7
##$RELAX= 
##$RELAX= 
##$RELAX= 
##$RELAX= 
##$RELAX= 
##$RELAX= 
##$RELAX= 
$$ Bruker specific parameters
$$ --------------------------
##$DU= <C:\u>
##$EXPNO= 940
##$NAME= <ADRS>
##$PROCNO= 1
##$TYPE= <nmr>
##$USER= <dgb>
##$AMP= (0..31)
100 100 100 100 100 100 100 100 100 100 100 100 100 100 100 100 100 100 
100 100 100 100 100 100 100 100 100 100 100 100 100 100 
##$AQSEQ= 0
##$AQ_mod= 3
##$AUNM= <au_zg>
##$AUTOPOS= <41 >
##$BF1= 250.13
##$BF2= 250.13
##$BF3= 250.13
##$BF4= 250.13
##$BF5= 500.13
##$BF6= 500.13
##$BF7= 500.13
##$BF8= 500.13
##$BYTORDA= 1
##$CFDGTYP= 0
##$CFRGTYP= 5
##$CHEMSTR= <none>
##$CNST= (0..31)
1 1 145 1 1 1 1 1 1 1 1 1 1 1 1 1 1 1 1 1 1 1 1 1 1 1 1 1 1 1 1 1 
##$CPDPRG= <>
##$CPDPRG1= <>
##$CPDPRG2= <>
##$CPDPRG3= <>
##$CPDPRG4= <mlev>
##$CPDPRG5= <mlev>
##$CPDPRG6= <mlev>
##$CPDPRG7= <mlev>
##$CPDPRG8= <mlev>
##$CPDPRGB= <>
##$CPDPRGT= <>
##$D= (0..31)
0 1 0 0 0 0 0 0 0 0.06 0 0 0 0 0 0 0.0002 0 0 0 0 0 0 0 0 0 0 0 0 0 0 
0 
##$DATE= 1161263550
##$DBL= (0..7)
120 120 120 120 120 120 120 120 
##$DBP= (0..7)
150 150 150 150 150 150 150 150 
##$DBP07= 0
##$DBPNAM0= <>
##$DBPNAM1= <>
$$ [...]
##$SUBNAM7= <"">
##$SUBNAM8= <"">
##$SUBNAM9= <"">
##$SW= 20.6930455092707
##$SWIBOX= (0..15)
0 0 3 0 0 0 0 0 0 0 0 0 0 0 0 0 
##$SW_h= 5175.983436853
##$TD= 65536
##$TD0= 1
##$TE= 683.16
##$TE2= 300
##$TE3= 300
##$TEG= 300
##$TL= (0..7)
0 120 120 120 120 120 120 120 
##$TP= (0..7)
150 150 150 150 150 150 150 150 
##$TP07= 0
##$TPNAME0= <>
##$TPNAME1= <>
##$TPNAME2= <>
##$TPNAME3= <>
##$TPNAME4= <>
##$TPNAME5= <>
##$TPNAME6= <>
##$TPNAME7= <>
##$TPOAL= (0..7)
0.5 0.5 0.5 0.5 0.5 0.5 0.5 0.5 
##$TPOFFS= (0..7)
0 0 0 0 0 0 0 0 
##$TUNHIN= 0
##$TUNHOUT= 0
##$TUNXOUT= 0
##$USERA1= <user>
##$USERA2= <user>
##$USERA3= <user>
##$USERA4= <user>
##$USERA5= <user>
##$V9= 5
##$VALIST= <valist>
##$VCLIST= <CCCCCCCCCCCCCCC>
##$VD= 0
##$VDLIST= <DDDDDDDDDDDDDDD>
##$VPLIST= <PPPPPPPPPPPPPPP>
##$VTLIST= <TTTTTTTTTTTTTTT>
##$WBST= 1024
##$WBSW= 4
##$XGAIN= (0..3)
0 0 0 0 
##$XL= 0
##$YL= 0
##$YMAX_a= 474810
##$YMIN_a= -304427
##$ZGOPTNS= <>
##$ZL1= 120
##$ZL2= 120
##$ZL3= 120
##$ZL4= 120
##$ABSF1= 16.4507
##$ABSF2= -4.242472
##$ABSG= 5
##$ABSL= 3
##$ALPHA= 0
##$AQORDER= 0
##$ASSFAC= 0
##$ASSFACI= 0
##$ASSFACX= 0
##$ASSWID= 0
##$AUNMP= <proc_1d>
##$AZFE= 0.1
##$AZFW= 0.1
##$BCFW= 0
##$BC_mod= 0
##$BYTORDP= 0
##$COROFFS= 0
##$CY= 12.5
##$DATMOD= 1
##$DC= 0
##$DFILT= <>
##$DTYPP= 0
##$F1P= 14.0000005364418
##$F2P= -0.99999901652339
##$FCOR= 0.5
##$FTSIZE= 32768
##$FT_mod= 6
##$GAMMA= 0
##$GB= 0
##$INTBC= 1
##$INTSCL= 1
##$ISEN= 128
##$LB= 0.3
##$LEV0= 0
##$LPBIN= 0
##$MAXI= 10000
##$MC2= 0
##$MEAN= 0
##$ME_mod= 0
##$MI= 0
##$NCOEF= 0
##$NC_proc= -4
##$NLEV= 6
##$NOISF1= 0
##$NOISF2= 0
##$NSP= 0
##$NTH_PI= 0
##$NZP= 0
##$OFFSET= 16.4507
##$PC= 1
##$PHC0= -44.95755
##$PHC1= 5.217565
##$PH_mod= 1
##$PKNL= yes
##$PPARMOD= 0
##$PSCAL= 4
##$PSIGN= 0
##$REVERSE= no
##$SF= 250.130017833306
##$SI= 32768
##$SIGF1= 0
##$SIGF2= 0
##$SINO= 400
##$SIOLD= 32768
##$SREGLST= <1H.CDCl3>
##$SSB= 0
##$STSI= 32768
##$STSR= 0
##$SW_p= 5175.98343685301
##$SYMM= 0
##$S_DEV= 0
##$TDeff= 65536
##$TDoff= 0
##$TI= <Analysis number 999999
Compound Code 99
Book Reference 9
Project Code 9>
##$TILT= no
##$TM1= 0
##$TM2= 0
##$TOPLEV= 0
##$USERP1= <user>
##$USERP2= <user>
##$USERP3= <user>
##$USERP4= <user>
##$USERP5= <user>
##$WDW= 1
##$XDIM= 32768
##$YMAX_p= 331003199
##$YMIN_p= -609767
$$ End of Bruker specific parameters
$$ ---------------------------------
##NTUPLES= NMR SPECTRUM
##VAR_NAME=  FREQUENCY,     SPECTRUM/REAL,   SPECTRUM/IMAG
##SYMBOL=    X,             R,               I
##VAR_TYPE=  INDEPENDENT,   DEPENDENT,       DEPENDENT
##VAR_FORM=  AFFN,          ASDF,            ASDF
##VAR_DIM=   32768,         32768,           32768
##UNITS=     HZ,            ARBITRARY UNITS, ARBITRARY UNITS
##FACTOR=    0.157963299565203, 1,           1
##FIRST=     4114.81407444109, 0,            0
##LAST=      -1061.16936241192, 0,           0
##MIN=       -1061.16936241192, -609767,     0
##MAX=       4114.81407444109, 331003199,    0
$$ Real data points
##PAGE= N=1
##DATA TABLE= (X++(R..R)), XYDATA
$$ [...]
$$ plain form
20344 -201563 -144412 -98814 -160152 -220220 -264413 -272327 -326091 -272359 -152662 -182321 -124587
20333 -124587 -7880 -3763 2629 -2252 24098 135619 272976 171711 5148 -66753 -4060
20322 -4060 101157 108560 -46538 -90054 -84233 -282216 -307538 -342201 -275917 -147149 -147189 -87370
20310 -87370 52722 -4858 -94835 -178556 -72059 68310 145220 33213 19285 1704 106868
20299 106868 96058 40410 -81867 -225360 -142312 -136492 -92571 -106360 -113804 -210376 -316904
20288 -316904 -263194 -344201 -411342 -287624 -226968 -196421 -272360 -167265 -50204 76895 17045
20277 17045 -25138 -98444 -180939 -108637 3559 -139583 -29968 -10231 -6683 84001 256916
20266 256916 181822 50074 78685 790 -6836 67929 -37607 27028 150957 228148 196033
$$ packed form
20344b01563N7151M5598o1338o0068m4193p914n3764N3732J19697k9659N7734
20333a24587J16707M117O392m881K6350J11521J37357j01265j66563p1901O2693
20322d060J05217P403j55098m3516N821j97983k5322l4663O6284J28768m0N9819
20310h7370J40092n7580q9977q3721J06497J40369P6910j12007j3928j7581J05164
20299A06868j0810n5648j22277j43493Q3048N820M3921j3789p444r6572j06528
20288c16904N3710q1007o7141J23718O0656L0547p5939J05095J17061J27099n9850
20277A7045m2183p3306q2495P2302J12196j43142J09615J9737L548R0684J72915
20266B56916p5094j31748K8611p7895p626P4765j05536O4635J23929P7191l2115
$$ plain form
20255 196033 41985 26661 -160082 -8671 -112985 -182242 -108966 -160388 -136032 -198706 -203595
20244 -203595 -143887 -144556 -119399 -72397 49929 65105 -217027 -260208 -162619 9875 117021
20233 117021 268884 122584 85569 -111518 -209109 -117426 -183034 -139806 -18368 -193933
20223 -193933 -259553 -180119 -67470 -71587 -27634 54020 -23899 -133683 -35757 37489 13933
20212 13933 -127564 -189814 -260282 -193714 -90858 17769 -44932 -206201 -233810 -251606 -321426
20201 -321426 -343335 -232364 -163088 -122364 -183111 -269638 -223184 -90971 -110515 -264334 -333684
20190 -333684 -287397 -190881 -304446 -328686 -131199 -2776 113747 302849 113084 -81838
20180 -81838 98928 326840 279105 68482 -76443 -69774 4474 -5477 -16800 60479 182872
$$ packed form
20255A96033j54048j5324j86743J51411j04314o9257P3276n1422K4356o2674m889
20244b03595N9708o69K5157M7002J22326J5176k82132m3181R7589J72494J07146
20233A17021J51863j46300l7015j97087r7591R1683o5608M3228J21438j75565
20223a93933o5620P9434J12649m117M3953Q1654p7919j09784R7926P3246k3556
20212A3933j41497o2250p0468O6568J02856J08627o2701j61269k7609j7796o9820
20201c21426k1909J10971O9276M0724o0747q6527M6454J32213j9544j53819o9350
20190c33684M6287R6516j13565k4240J97487J28423J16523J89102j89765j94922
20180h1838J80766K27912m7735k10623j44925O669P4248r951j1323P7279J22393
$$ plain form
20169 182872 233513 281011 526338 655421 621154 469907 554214 614010 690821 809271 692269
20158 692269 399792 339390 230217 363723 474189 317865 210919 92716 -104213 -86413
20148 -86413 -68180 -138627 -247606 -131509 -41439 -93768 -36847 33414 -31904 83061 63633
20137 63633 -41271 -190848 -270281 -381341 -546093 -481778 -162712 -71026 -95474 -107830 -30142
20126 -30142 26673 8542 68114 58973 62265 63524 -21953 -2414 -77852 -122792 -177069 -248429
20114 -248429 -326952 -297771 -160362 -103313 44 -27004 -107398 -218860 -263902 -138602 -6077
20103 -6077 26028 -39354 -172312 -111366 -51606 215892 313697 82853 -85235 -76618 12594
20092 12594 160017 175421 123666 119795 17585 47754 77215 4730 -56852 -14439 164557
$$ packed form
20169A82872N0641M7498K45327J29083l4267j51247Q4307N9796P6811J18450j17002
20158F92269k92477o0402j09173J33506J10466j56324j06946j18203j96929J7800
20148h6413J8233p0447j08979J16097R0070n2329N6921P0261o5318J14965j9428
20137F3633j04904j49577p9433j11060j64752O4315L19066R1686k4448j2356P7688
20126c0142N6815j8131N9572r141L292J259q5477J9539p5438m4940n4277p1360
20114b48429p8523K9181J37409N7049J03357k7048q0394j11462m5042J25300J32525
20103f077L2105o5382j32958O0946N9760K67498R7805k30844j68088Q617Q9212
20092A2594J47423J5404n1755l871j02210L0169K9461p2485o1582M2413J78996
$$ plain form
20081 164557 182228 124471 281472 229355 92702 89392 66454 -26085 -15321 -208986 -341529
20070 -341529 -189921 -49687 -135221 -117990 -149756 -116000 -74694 -19233 -53224 -44739 -102103
20059 -102103 -97735 -99026 7861 19372 -66788 -176149 -179218 -142868 -48412 4999 62473 129952
20047 129952 140028 53431 3531 46666 144748 11228 -44192 -75509 -119763 -97075 -31606
20036 -31606 10993 -38903 62903 102844 174596 190028 148841 8650 -169974 -292976 -239034
20025 -239034 -169462 -168343 28984 14147 -14218 -32714 -84637 -70181 6738 -144166 -236645
20014 -236645 -260156 -231915 -209427 -277128 -336315 -255138 -200557 -34285 -38056 -193894 -51141
20003 -51141 -67135 -94875 -29398 61352 -70373 -68717 130841 207879 129303 215759 200997
$$ packed form
20081A64557J7671n7757J57001n2117j36653l310k2938r2539J0764j93665j32543
20070c41529J51608J40234q5534J7231l1766L3756M1306N5461l3991Q485n7364
20059a02103M368j291J06887J1511q6160j09361l069L6350R4456N3411N7474O7479
20047A29952J0076q6597m9900M3135R8082j33520n5420l1317m4254K2688O5469
20036c1606M2599m9896J01806L9941P1752J5432m1187j40191j78624j23002N3942
20025b39034O9572J119J97327j4837k8365j8496n1923J4456P6919j50904r2479
20014b36645k3511K8241K2488o7701n9187Q1177N4581J66272l771j55838J42753
20003e1141j5994k7740O5477R0750j31725J656J99558P7038p8576Q6456j4762
$$ plain form
19992 200997 207800 77893 -96269 -163486 -78398 37259 111581 139522 101705 132040 100841
19981 100841 29000 -31093 -48862 -179394 -204786 -59077 146017 131923 84812 4885 19235
19970 19235 -10515 -128046 -212361 -108696 -88513 -73190 -100022 -103135 -112615 -85921 29171
19959 29171 -26834 -101937 -156655 -80787 186521 359041 287344 73039 -88905 -146806 -88285
19948 -88285 181762 138987 -81753 -260217 -186410 -104879 -204358 -271800 -260149 15086 -16042
19937 -16042 34215 19875 38052 9188 52913 -42419 -21549 21989 19745 -49710 -101758 -125882
19925 -125882 -158607 -253553 -155373 39203 252661 91831 30268 48001 -35325 -28965 40638
19914 40638 -216493 -262778 -175961 -143359 -170545 -134557 -243372 -189293 -241678 -221954 -60743
$$ packed form
19992B00997O803j29907j74162o7217Q5088J15657P4322K7941l7817L0335l1199
19981A00841p1841o0093j7769j30532k5392J45709K05094j4094m7111p9927J4350
19970A9235k9750j17531q4315J03665K0183J5323k6832l113r480K6694J15092
19959B9171n6005p5103n4718P5868K67308J72520p1697k14305j61944n7901N8521
19948h8285K70047m2775k20740j78464P3807Q1531r9479o7442J1651K75235l1128
19937a6042N0257j4340J8177k8864M3725r5332K0870M3538k244o9455n2048k4124
19925a25882l2725r4946R8180J94576K13458j60830o1563J7733q3326O360O9603
19914D0638k57131m6285Q6817L2602k7186L5988j08815N4079n2385J9724J61211
$$ plain form
19903 -60743 -17643 -75572 -140790 -184418 -292515 -154666 -62709 -104548 -3603 21285 46163
19892 46163 242858 284208 120385 46668 112265 116228 -8859 -64994 -49617 38219 130671
19881 130671 113514 124270 82076 58475 69283 10332 -31649 36642 60080 2894 53904
19870 53904 52857 50614 63033 48473 -65038 -179157 -267610 -238649 -272425 -209579 -198844 -282904
19858 -282904 -41113 81370 35125 55296 21576 -35306 -294242 -445974 -416457 -327948 -262520
19847 -262520 -291720 -346456 -410026 -213832 71275 -13757 -8773 90276 218955 166652 -105817
19836 -105817 -133905 -150190 75681 377029 274632 15989 65145 201616 326262 190455
19826 190455 228502 325729 366242 484286 624728 738415 909366 1022442 967912 839611
$$ packed form
19903f0743M3100n7929o5218m3628j08097J37849R1957m1839J00945K4888K4878
19892D6163J96695M1350j63823p3717O5597L963j25087n6135J5377Q7836R2452
19881A30671j7157J0756m2194k3601J0808n8951m1981O8291K3438n7186N1010
19870E3904j047k243J2419j4560j13511j14119q8453K8961l3776O2846J0735q4060
19858b82904K41791J22483m6245K0171l3720n6882k58936j51732K9517Q8509O5428
19847b62520k9200n4736o3570J96194K85107q5032M984R9049J28679n2303k72469
19836a05817k8088j6285K25871L01348j02397k58643M9156J36471J24646j35807
19826A90455L8047R7227M0513J18044J40442J13687J70951J13076n4530j28301
$$ plain form
19816 839611 696013 589541 337379 266860 82773 -22760 12083 -146890 -184596 -100637
19806 -100637 -62016 -233785 -299228 -170396 -133889 -102186 217162 245574 195722 151770 -59267
19795 -59267 -138035 -189982 -265756 -216121 -16916 44093 -2400 -14964 -20945 -27988 -36557 -55338
19783 -55338 40300 181610 119198 79160 -180397 -293077 -231053 -127106 -209857 -68200 72148
19772 72148 23787 -88347 -121265 -84430 40317 9714 -27335 -118571 -3959 125509 199602
19761 199602 80761 -52204 169780 434802 513431 381567 212758 205035 150422 122963
19751 122963 22960 -122521 20629 195948 377232 375844 398529 205705 192943 66530
19741 66530 5863 -51662 -181546 -101491 193608 267470 248786 219605 118764 52485 109948
$$ packed form
19816H39611j43598j06472k52162p0519j84087j05533L4843j58973l7706Q3959
19806a00637L8621j71769o5443J28832L6507L1703L19348K8412m9852m3952k11037
19795e9267p8768n1947p5774M9635J99205O1009m6493j2564n981p043q569j8781
19783e5338R5638J41310o2412m0038k59557j12680O2024J03947q2751J41657J40348
19772G2148m8361j12134l2918L6835J24747l0603l7049r1236J14612J29468P4093
19761A99602j18841j32965K21984K65022P8629j31864j68809p723n4613k7459
19751A22963j00003j45481J43150J75319J81284j388K2685j92824j2762j26413
19741F6530o0667n7525j29884Q0055K95099P3862j8684k9181j00841o6279N7463
$$ plain form
19730 109948 181344 267043 432020 581803 751029 838942 1028871 1224510 1435072 1505585
19720 1505585 1542887 1479691 1360304 1196052 1131795 1169576 1048229 936789 705784 359242
19710 359242 258796 313557 445992 266680 204418 -1375 -107224 -32606 44845 -55196
19700 -55196 30329 31810 -19564 -61576 47084 -26708 -91730 70685 269647 266400 35586
19689 35586 44953 232552 238045 162516 35847 -67636 -105256 -177650 -203856 -51453 87490
19678 87490 120149 -14454 -225425 -297883 -288767 -276856 -66279 -99028 -274520 -292437 -243476
19667 -243476 -155820 -5084 43493 -25155 -70954 -82792 -60004 2442 135411 108015 -12905
19656 -12905 -131191 -298298 -167593 7586 63122 200368 400544 271797 142087 139430
$$ packed form
19730A09948P1396Q5699J64977J49783J69226Q7913J89929J95639K10562P0513
19720A505585L7302o3196j19387j64252o4257L7781j21347j11440k31005l46542
19710C59242j00446N4761J32435j79312o2262k05793j05849P4618P7451j00041
19700e5196Q5525J481n1374m2012J08660p3792o5022J62415J98962l247k30814
19689C5586R367J87599N493p5529j26669j03483l7620p2394k6206J52403J38943
19678H7490L2659j34603k10971p2458R116J1911K10577l2749j75492j7917M8961
19667b43476Q7656J50736M8577o8648m5799j1838K2788O2446J32969k7396j20920
19656a2905j18286j67107J30705J75179N5536J37246K00176j28747j29710k657
$$ plain form
19646 139430 35834 122169 189969 229234 132976 102984 122056 422282 511859 491602 352277
19635 352277 269937 307854 263815 379195 418640 463979 535770 529080 528687 509453 360491 261552
19623 261552 350340 290562 431480 450251 312255 189902 242904 354295 433552 343980 247933
19612 247933 179646 283461 387432 285989 230658 50835 60725 109733 78744 23489 108038
19601 108038 203927 340142 352626 210342 102918 82217 149943 274647 424113 351604
19591 351604 240569 115355 219873 292929 321053 121946 161340 242301 231744 335467
19581 335467 386930 547796 572171 410060 367426 384956 520281 639264 656808 571676 812971
19570 812971 831420 693966 640884 702229 577022 451771 502082 614589 438820 464984
$$ packed form
19646A39430j03596Q6335O7800L9265r6258k9992J9072L00226Q9577k0257j39325
19635C52277q2340L7917m4039J15380L9445M5339P1791o690l93j9234j48962r8939
19623B61552Q8788n9778J40918J8771j37996j22353N3002J11391P9257q9572r6047
19612B47933o8287J03815J03971j01443n5331j79823R890M9008l0989n5255Q4549
19601A08038R5889J36215J2484j42284j07424k0701O7726J24704J49466p2509
19591C51604j11035j25214J04518P3056K8124j99107L9394Q0961j0557J03723
19581C35467N1463J60866K4375j62111m2634J7530J35325J18983J7544q5132K41295
19570H12971J8449j37454n3082O1345j25207j25251N0311J12507j75769K6164
$$ plain form
19560 464984 679779 803473 797150 804047 866068 971175 1235174 1241910 1009956 1003872 1272016
19549 1272016 1461259 1621238 1804283 1742430 1557796 1515484 1761174 1955577 2239461 2574060
19539 2574060 2751268 2758687 2639009 2596238 2672017 2857591 2945825 3042625 3154778 3216773 3303756
19528 3303756 3563023 3872119 4293251 4649282 5224074 5687889 6262508 7029015 7900214
19519 7900214 8847355 10111620 11563337 13463048 15746489 18533371 22224342 27063621
19511 27063621 33041722 40765403 50899738 63123138 77374662 93166066 109123152
19504 109123152 123437043 134265934 139634022 138451168 131138329 118951500 103408097
19497 103408097 86976488 71417213 57699241 46584051 37936725 31325942 26332518
$$ packed form
19560D64984K14795J23694o323O897O2021J05107K63999O736k31954o084K68144
19549A272016J89243J59979J83045o1853j84634m2312K45690J94403K83884L34599
19539B574060J77208P419j19678m2771P5779J85574Q8234R6800J12153O1995Q6983
19528C303756K59267L09096M21132L56031N74792M63815N74619P66507Q71199
19519G900214R47141J264265J451717J899711K283441K786882L690971M839279
19511B7063621N978101P723681J0134335J2223400J4251524J5791404J5957086
19504A09123152J4313891J0828891N368088j182854p312839j2186829j5543403
19497A03408097j6431609j5559275j3717972j1115190q647326o610783m993424
$$ plain form
19490 26332518 22508609 19420544 16901142 14905584 13250383 11959141 10866921 9999407
19482 9999407 9094819 8336376 7706888 7115916 6676031 6253939 5850216 5688297 5509210
19473 5509210 5089740 4887856 4728391 4602331 4449386 4312391 4250545 4153364 3951298 3597704
19463 3597704 3344253 3254622 3255680 3032804 2691065 2451250 2210186 2108115 1991681 1911908
19453 1911908 1874646 1802610 1710197 1651912 1739191 1596512 1416877 1406476 1336481 1156151 1020789
19442 1020789 926186 862238 887768 918749 881760 924551 1028590 1081259 1011000 862232 856987
19431 856987 643005 667068 713559 739200 808409 858403 888935 760625 591961 585645 630626
19420 630626 732411 798624 625294 568254 573720 582893 633373 620743 728534 767169 631149
$$ packed form
19490B6332518l823909l088065k519402j995558j655201j291242j092220q67514
19482I999407r04588p58443o29488n90972m39885m22092m03723j61919j79087
19473E509210m19470k01884j59465j26060j52945j36995o1846r7181k02066l53594
19463C597704k53451q9631J058k22876l41739k39815k41064j02071j16434p9773
19453A911908l7262p2036r2413n8285Q7279j42679j79635j0401o9995j80330j35362
19442A020789r4603o3948K5530L0981l6989M2791J04039N2669p0259j48768n245
19431H56987k13982K4063M6491K5641O9209M9994L0532j28310j68664o316M4981
19420F30626J01785O6213j73330n7040N466R173N0480j2630J07791L8635j36020
$$ plain form
19409 631149 576207 557548 568611 794969 896281 832571 814215 554744 587969 653602 792397
19398 792397 789663 620591 559452 715876 729873 591036 651862 671205 667600 488480 385316
19387 385316 473781 502302 504106 574403 575483 696058 734593 640414 686642 701181 578524
19376 578524 524814 733572 810144 744816 608713 478862 534619 472150 453411 466411 408401
19365 408401 507002 456408 340524 397946 462800 468667 457311 417164 397503 522698 572141
19354 572141 682196 683648 667187 730786 721872 560469 582103 664180 522960 328918 255349
19343 255349 176401 157992 101461 20704 276361 548571 446156 278476 232922 234166 319767
19332 319767 226789 174325 238192 339570 209387 114806 319910 375890 372111 247845 223611
$$ packed form
19409F31149n4942j8659J1063K26358J01312o3710j8356k59471L3225O5633J38795
19398G92397k734j69072o1139J56424J3997j38837O0826J9343l605j79120j03164
19387C85316Q8465K8521J804P0297J080J20575L8535r4179M6228J4539j22657
19376E78524n3710K08758P6572o5328j36103j29851N5757o2469j8739J3000n8010
19365D08401R8601n0594j15884N7422O4854N867j1356m0147j9661J25195M9443
19354E72141J10055J452j6461O3599q914j61403K1634Q2077j41220j94042p3569
19343B55349p8948j8409n6531q0757K55657K72210j02415j67680m5554J244Q5601
19332C19767r2978n2464O3867J01378j30183r4581K05104N5980l779j24266k4234
$$ plain form
19321 223611 252388 274029 322978 305422 279028 243633 257111 427106 481739 375449 234928
19310 234928 265434 306920 96086 87820 183748 187743 140850 -1258 -12757 56868 163428
19299 163428 175263 147533 62333 -44456 160601 361899 289380 196866 118490 219205 354470
19288 354470 198056 88233 -56660 45913 171415 171207 151666 230231 154939 260079 419677
19277 419677 737592 801984 734536 608838 225335 141353 192435 180701 249794 252002 441204
19266 441204 252279 -630 352 153431 255579 232915 186825 214671 316176 351652 458642
19255 458642 450845 276193 219658 323153 344512 476693 406145 422589 541004 730815 698925
19244 698925 580985 502814 565047 720984 764884 608557 484555 615938 681088 733549
$$ packed form
19321B23611K8777K1641M8949j7556k6394l5395J3478J69995N4633j06290j40521
19310B34928L0506M1486k10834q266R5928L995m6893j42108j1499O9625J06560
19299A63428J1835k7730q5200j06789K05057K01298p2519r2514p8376J00715J35265
19288C54470j56414j09823j44893J02573J25502k08j9541P8565p5292J05140J59598
19277D19677L17915O4392o7448j25698l83503q3982N1082j1734O9093K208J89202
19266D41204j88925k52909R82J53079J02148k2664m6090K7846J01505L5476J06990
19255D58642p797j74652n6535J03495K1359J32181p0548J6444J18415J89811l1890
19244F98925j17940p8171O2233J55937M3900j56327j24002J31383O5150N2461
$$ plain form
19234 733549 906953 835596 672388 562614 644271 654901 723681 677064 516283 639446
19224 639446 923039 1032509 1009130 1131305 1115347 983977 1115181 1364559 1375150 1410825
19214 1410825 1527426 1809702 1939076 2154880 2363401 2677529 2942935 3179836 3133395 3296018
19204 3296018 3320224 3183599 3208505 3211022 3130093 3189202 3193516 3097036 3027234 3013093 3155841
19193 3155841 3554250 4142202 4416959 4589791 5033078 5556761 6057602 6551101 7058756
19184 7058756 7702956 8658993 9872198 11284601 12782637 14470921 16589272 19410870
19176 19410870 23087312 27573416 33346653 41095059 51001590 63310403 78516421 95817681
19168 95817681 113451891 129225996 140539142 145127403 141572862 130630128 114262311
$$ packed form
19234G33549J73404p1357j63208j09774Q1657J0630O8780m6617j60781J23163
19224F39446K83593J09470k3379J22175j5958j31370J31204K49378J0591L5675
19214A410825J16601K82276J29374K15804K08521L14128K65406K36901m6441J62623
19204C296018K4206j36625K4906K517q0929N9109M314r6480o9802j4141J42748
19193C155841L98409N87952K74757J72832M43287N23683N00841M93499N07655
19184G058756O44200R56037J213205J412403J498036J688284K118351K821598
19176A9410870L676442M486104N773237P748406R906531J2308813J5206018J7301260
19168I5817681J7634210J5774105J1313146M588261l554541j0942734j6367817
$$ plain form
19161 114262311 95753189 77987804 62522428 50311509 41045030 33850310 28276628
19154 28276628 24123357 20988138 18505313 16453674 14875096 13439212 12134262 11084944
19146 11084944 10199069 9677150 9120571 8377137 8009049 7660262 7212035 6816851 6390273
19137 6390273 5909845 5549351 5200823 4943959 4757278 4607311 4655511 4469775 4369116 4285926
19127 4285926 4020656 3775136 3652405 3330553 2912621 2650644 2520837 2411531 2372679 2308449
19117 2308449 2408588 2330284 2144864 2076314 1948883 1797419 1776560 1776187 1728899 1807778 1938256
19106 1938256 1697190 1471483 1242502 1120142 1267300 1226909 1332893 1248927 1134291 1147284
19096 1147284 1291979 1401389 1219237 1243513 1448521 1504348 1317389 1139997 860445 791128
$$ packed form
19161A14262311j8509122j7765385j5465376j2210919r266479p194720n573682
19154B8276628m153271l135219k482825k051639j578578j435884j304950j049318
19146A1084944q85875n21919n56579p43434l68088l48787m48227l95184m26578
19137F390273m80428l60494l48528k56864j86681j49967M8200j85736j00659q3190
19127D285926k65270k45520j22731l21852m17932k61977j29807j09306l8852o4230
19117B308449J00139p8304j85420o8550j27431j51464k0859l73m7288P8879J30478
19106A938256k41066k25707k28981j22360J47158m0391J05984q3966j14636J2993
19096A147284J44695J09410j82152K4276K05008N5827j86959j77392k79552o9317
$$ plain form
19086 791128 790509 999668 1094850 1184866 1222926 1022230 783816 606521 598266 493944 568479
19075 568479 667478 555232 669005 683906 656501 870162 989709 801916 747943 758666
19065 758666 751341 632739 663524 753178 741519 592217 521383 490081 514510 542297 481931
19054 481931 478174 507395 480915 370667 361452 565460 717899 542340 562232 523523 479807
19043 479807 475551 487332 481752 329205 483436 522872 622838 770100 737937 844624 974042
19032 974042 908491 828692 701971 604076 502446 438625 199032 -32797 14871 75622 235141
19021 235141 417980 456278 449135 528631 444154 274442 169046 54050 38300 18931 87196
19010 87196 56658 166107 255780 365679 481242 340738 381943 495599 513688 326395
$$ packed form
19086G91128o19K09159R5182R0016L8060k00696k38414j77295q255j04322P4535
19075E68479R8999j12246J13773J4901k7405K13661J19547j87793n3973J0723
19065G58666p325j18602L0785Q9654j1659j49302p0834l1302K4429K7787o0366
19054D81931l757K9221k6480j10248r215K04008J52439j75559J9892l8709m3716
19043D79807m256J1781n580j52547J54231L9436R9966J47262l2163J06687J29418
19032I74042o5551p9799j26721r7895j01630o3821k39593k31829M7668O0751J59519
19021B35141J82839L8298p143P9496q4477j69712j05396j14996j5750j9369O8265
19010H7196l0538J09449Q9673J09899J15563j40504M1205J13656J8089j87293
$$ plain form
19000 326395 207398 196335 199366 309251 347391 257558 311320 364510 332445 297052 204745
18989 204745 135620 177110 179836 162183 151729 167736 273675 284246 104671 73352 59743
18978 59743 42637 -73409 -55665 -82469 45684 89916 -142753 -74367 55157 111564 118667
18967 118667 203729 316734 351931 240921 5634 -154142 -10985 249948 229580 65783
18957 65783 -77525 -115142 35323 86989 180862 200591 156275 -83606 -169179 -38208 180153
18946 180153 186594 15591 80887 131272 25433 206553 355039 526297 400633 374520
18936 374520 367583 282149 296185 236888 312702 272033 294569 310258 264949 185301 -55416
18925 -55416 -198028 -39578 261349 252680 158355 206807 127989 88097 168601 240495 318769
$$ packed form
19000C26395j18997j1063L031J09885L8140q9833N3762N3190l2065l5393r2307
18989B04745o9125M1490K726j7653j0454J6007J05939J0571j79575l1319j3609
18978E9743j7106j16046J7744k6804J28153M4232k32669O8386J29524N6407P103
18967A18667Q5062J13005L5197j11010k35287j59776J43157K60933k0368j63797
18957F5783j43308l7617J50465N1666R3873J9729m4316k39881q5573J30971K18361
18946A80153O441j71003O5296N0385j05839J81120J48486J71258j25664k6113
18936C74520o937q5434J4036n9297P5814m0669K2536J5689m5309p9648k40717
18925e5416j42612J58450L00927q669r4325M8452p8818l9892Q0504P1894P8274
$$ plain form
18914 318769 209627 192811 293101 333370 245973 203215 393476 392574 398243 436789 512956
18903 512956 547128 441402 291151 153936 6321 30014 191213 334248 187373 -87816
18893 -87816 -61339 56241 59115 155017 38141 75541 124234 92153 119829 249588 363713
18882 363713 401137 461779 550239 357071 268719 225869 280676 283326 196592 217349 46306
18871 46306 74795 149152 300251 392285 507300 409198 487820 566185 467079 402330 276975
18860 276975 101979 116310 144614 115250 151789 296680 262975 361324 334785 269602 346040
18849 346040 241026 251792 330804 314348 433937 430034 342449 313268 607868 652954 539148
18838 539148 617434 738895 911488 1098651 1206895 1263642 1212014 1103745 1007321 977611
$$ packed form
18914C18769j09142j6816J00290M0269q7397m2758J90261r02N669L8546P6167
18903E12956L4172j05726j50251j37215j47615K3693J61199J43035j46875k75189
18893h7816K6477J17580K874R5902j16876L7400M8693l2081K7676J29759J14125
18882C63713L7424O0642Q8460j93168q8352m2850N4807K650q6734K0757j71043
18871D6306K8489P4357J51099R2034J15015r8102P8622P8365r9106o4749j25355
18860B76975j74996J4331K8304k9364L6539J44891l3705R8349k6539o5183P6438
18849C46040j05014J0766P9012j6456J19589l903q7585k9181K94600M5086j13806
18838E39148P8286J21461J72593J87163J08244N6747n1628j08269r6424k9710
$$ plain form
18828 977611 797935 552822 418913 403713 452632 340509 253550 271510 189221 132512 89302
18817 89302 99355 36484 28171 -39349 124945 212990 178172 28406 -47696 23751 116327
18806 116327 3696 52243 119102 212905 -21803 103579 266745 341296 338451 295145 261575
18795 261575 277284 413866 559784 608746 609988 421010 363616 311590 254048 302389 315392
18784 315392 262582 268722 346510 545127 421147 249523 136071 332444 489915 557437
18774 557437 594296 524527 674645 903957 1045173 1377292 1368259 1374103 1278382 1152358 870941
18763 870941 403570 95749 -16723 -94022 -4808 22688 -189023 -101035 -24009 -35574 -135867
18752 -135867 348 169470 324352 332391 371049 309933 185197 210719 309115 417100 591438
$$ packed form
18828I77611j79676k45113j33909j5200M8919j12123q6959J7960q2289n6709m3210
18817H9302J0053o2871q313o7520J64294Q8045l4818j49766p6102P1447R2576
18806A16327j12631M8547O6859R3803k34708J25382J63166P4551k845m3306l3570
18795B61575J5709J36582J45918M8962J242j88978n7394n2026n7542M8341J3003
18784C15392n2810O140P7788J98617j23980j71624j13452J96373J57471O7522
18774E57437L6859o9769J50118K29312J41216L32119r033N844r5721j26024k81417
18763H70941m67371l07821j12472p7299Q9214K7496k11711Q7988P7026j1565j00293
18752a35867J36215J69122J54882Q039L8658o1116j24736K5522R8396J07985J74338
$$ plain form
18741 591438 571555 515986 574152 377750 267516 320039 464777 657238 660456 550442 297708
18730 297708 266514 377512 321929 260868 229137 341605 519076 578178 484955 387932 250082
18719 250082 257699 335174 540641 566019 461748 366988 239033 278052 235870 181209 179186
18708 179186 257818 283564 246594 140059 79412 153135 216776 200012 99478 23345 105731
18697 105731 228494 345205 333182 200601 85883 125572 73954 171685 349203 487600
18687 487600 760750 868437 918267 977184 750219 559841 374171 466944 583380 664568
18677 664568 762626 887032 814624 766346 749273 672815 683543 796852 843155 912368 689283
18666 689283 672450 551893 365800 423866 308578 304819 263148 559870 677873 550483
$$ packed form
18741E91438j9883n5569N8166j96402j10234N2523J44738J92461L218j10014k52734
18730B97708l1194J10998n5583o1061l1731J12468J77471N9102r3223r7023j37850
18719B50082P617P7475K05467K5378j04271r4760j27955L9019m2182n4661k023
18708A79186P8632K5746l6970j06535o0647P3723O3641j6764j00534p6133Q2386
18697A05731J22763J16711j2023j32581j14718L9689n1618R7731J77518J38397
18687D87600K73150J07687M9830N8917k26965j90378j85670R2773J16436Q1188
18677F64568R8058J24406p2408m8278j7073p6458J0728J13309M6303O9213k23085
18666F89283j6833j20557j86093N8066j15288l759m1671K96722J18003j27390
$$ plain form
18656 550483 582362 637100 602578 622163 810975 995518 1251119 1182841 939814 890315 885676
18645 885676 861043 568258 506867 557424 558613 375627 364496 331596 298788 473742 702777
18634 702777 666845 658391 769486 747185 759451 832481 958665 923657 903234 853012 639699
18623 639699 365928 206629 454909 586990 484701 481389 536646 608855 621281 482327
18613 482327 288555 359231 505446 614554 510958 492186 338750 177685 279726 324036
18603 324036 321432 334073 398018 373672 303311 225309 128039 315312 544679 558343 596293
18592 596293 520868 345484 266091 255948 134974 226847 474692 604659 568487 401017
18582 401017 287645 158005 122743 299182 231080 192631 141671 127712 231962 388893
$$ packed form
18656E50483L1879N4738l4522J9585J88812J84543K55601o8278k43027m9499m639
18645H85676k4633k92785o1391N0557J189j82986j1131l2900l2808J74954K29035
18634G02777l5932q454J11095k2301J2266P3030J26184l5008k0423n0222k13313
18623F39699k73771j59299K48280J32081j02289l312N5257P2209J2426j38954
18613D82327j93772P0676J46215J09108j03596j8772j53436j61065J02041M4310
18603C24036k604J2641O3945k4346p0361p8002r7270J87273K29367J3664L7950
18592E96293p5425j75384p9393j0143j20974R1873K47845J29967l6172j67470
18582D01017j13372j29640l5262J76439o8102l8449n0960j3959J04250J56931
$$ plain form
18572 388893 356369 312878 381401 384422 453312 537904 472593 285443 267730 373458 415302
18561 415302 371620 338702 325712 311793 220282 307814 433759 481121 572224 503307 489534
18550 489534 490375 444253 392713 483766 621515 527691 373251 428585 321880 419596 511087
18539 511087 403039 414781 351877 157205 40450 -195354 -147086 26957 276465 385517
18529 385517 388927 381540 445634 578000 687023 768122 721347 496999 384776 448963 543580
18518 543580 518094 398666 521191 441393 410396 336628 249362 349870 396386 372828 376798
18507 376798 481567 739584 807773 1035820 1075479 1109179 1085929 960563 844613 710358
18497 710358 589938 497891 305393 273187 344421 342296 244506 190640 155647 309436 408582
$$ packed form
18572C88893l2524m3491O8523L021O8890Q4592o5311j87150j7713J05728M1844
18561D15302m3682l2918j2990j3919r1511Q7532J25945M7362R1103o8917j3773
18550D89534Q41m6122n1540R1053J37749r3824j54440N5334j06705R7716R1491
18539E11087j08048J1742o2904j94672j16755k35804M8268J74043K49508J09052
18529C85517L410p387O4094J32366J09023Q1099m6775k24348j12223O4187R4617
18518E43580k5486j19428J22525p9798l0997p3768q7266J00508M6516k3558L970
18507C76798J04769K58017O8189K28047L9659L3700k3250j25366j15950j34255
18497G10358j20420r2047j92498l2206P1234k125r7790n3866l4993J53789R9146
$$ plain form
18486 408582 418714 339894 376183 415778 538077 426535 483453 510094 555475 460082 288532
18475 288532 199666 243845 282001 361402 357556 440670 322367 270177 240730 322694 301497
18464 301497 368702 457683 347608 272898 349577 413944 565949 568450 527658 590981 611854
18453 611854 676183 738021 559144 455091 474891 467823 539167 428869 388618 293986 315111
18442 315111 294763 450787 499904 616456 619053 611936 825652 1052608 1065928 1078023 1087556
18431 1087556 1220041 1274400 1239139 1229923 1188156 1282528 1417456 1440524 1320712 1343023 1463263
18420 1463263 1407868 1516129 1634469 1785391 2053706 2289581 2752958 3031406 3388640 4026944
18410 4026944 4848329 6199168 7893324 9828523 12144259 14673466 16847074 18543467
$$ packed form
18486D08582J0132p8820L6289L9595J22299j11542N6918K6641M5381r5393j71550
18475B88532q8866M4179L8156P9401l846Q3114j18303n2190k9447Q1964k1197
18464C01497O7205Q8981j10075p4710P6679O4367J52005K501m0792O3323K0873
18453F11854O4329O1838j78877j04053J9800p068P1344j10298m0251r4632K1125
18442C15111k0348J56024M9117J16552K597p117K13716K26956J3320J2095R533
18431A087556J32485N4359l5261r216m1767R4372J34928K3068j19812K2311J20240
18420A463263n5395J08261J18340J50922K68315K35875M63377K78448L57234O38304
18410D026944Q21385J350839J694156J935199K315736K529207K173608J696393
$$ plain form
18402 18543467 19771647 20059835 19541852 18615949 17146154 15474720 14012572 12731458
18394 12731458 12263580 12694683 14292718 16624035 19858559 23486512 26862077 29371764
18386 29371764 30529189 29589135 26811240 22724697 18526931 14775225 11901949 10000965
18378 10000965 8719266 8146121 7851247 7532084 7637415 8396307 9306044 10244450 11629675
18369 11629675 13484124 15957282 18714812 21750838 24919497 27906061 30352865 32384129
18361 32384129 33954745 35021580 36069294 37404725 39065941 40708612 42055082 43029048
18353 43029048 43372933 43065257 42782701 43198592 45025386 48380414 53179594 58627292 63991344
18344 63991344 67998379 69839140 69016545 65661646 60392896 53867959 47173659 41117845
$$ packed form
18402A8543467J228180K88188n17983r25903j469795j671434j462148j281114
18394A2731458m67878M31103J598035K331317L234524L627953L375565K509687
18386B9371764J157425r40054k777895m086543m197766l751706k873276j900984
18378A0000965j281699n73145k94874l19163J05331P58892R09737R38406J385225
18369A1629675J854449K473158K757530L036026L168659K986564K446804K031264
18361C2384129J570616J066835J047714J335431J661216J642671J346470R73966
18353D3029048L43885l07676k82556M15891J826794L355028M799180N447698N364052
18344F3991344M007035J840761q22595l354899n268750o524937o694300o055814
$$ plain form
18336 41117845 36296043 33268919 32094332 32060758 32196764 31803919 30150406 27206113 23984988
18327 23984988 21650270 20700853 21221451 23034953 25823883 28944324 31848491 33834452
18319 33834452 33935353 31983273 28339925 23939203 19725526 16201269 13726121 11831582
18311 11831582 10389759 9348560 8675202 8127546 7749976 7267348 6898466 6948600 7130670
18302 7130670 7423190 7764468 7911255 8424043 9140591 10093397 11243219 12780424 15021097
18293 15021097 18131522 22762691 29118566 37047036 45261915 52465274 57431890 59080893
18285 59080893 56446036 50547995 43657843 38350649 35969023 36693269 40379144 46045375
18277 46045375 52510378 58050630 61470327 61388227 57538858 50753034 43090659 36677908
$$ packed form
18336D1117845m821802l027124j174587l3574J36006l92845j653513k944293l221125
18327B3984988k334718r49417N20598J813502K788930L120441K904167J985961
18319C3834452J00901j952080l643348m400722m213677l524257k475148j894539
18311A1831582j441823j041199o73358n47656l77570m82628l68882N0134J82070
18302G130670K92520L41278J46787N12788P16548R52806J149822J537205K240673
18293A5021097L110425M631169O355875P928470Q214879P203359M966616J649003
18285E9080893k634857n898041o890152n307194k381626P24246L685875N666231
18277D6045375O465003N540252L419697q2100l849369o785824p662375o412751
$$ plain form
18269 36677908 32602699 31504711 33102995 36460438 40446476 43866521 45572538 44915442
18261 44915442 41369149 35683312 29261457 23953848 20489255 18177221 17105372 17066239
18253 17066239 17801300 19498766 22596599 27425586 34498453 43563965 52069887 57766537
18245 57766537 60900344 59545895 51151090 39876983 30957449 24876161 21134146 18949621
18237 18949621 18136723 18366304 19666963 22141006 25778211 30117454 34685202 38311943
18229 38311943 40270922 40269031 38164637 34612783 31516797 30449408 31772993 35475780
18221 35475780 41010439 47482407 53494262 57749566 59050328 56521728 50920510 43688383
18213 43688383 36830199 31847816 29279547 29073663 31193505 35156451 40146357 44948482
$$ packed form
18269C6677908m075209j097988J598284L357443L986038L420045J706017o57096
18261D4915442l546293n685837o421855n307609l464593k312034j071849l9133
18253A7066239P35061J697466L097833M828987P072867R065512Q505922N696650
18245E7766537L133807j354449q394805j1274107q919534o081288l742015k184525
18237A8949621q12898K29581J300659K474043L637205M339243M567748L626741
18229C8311943J958979j891k104394l551854l095986j067389J323585L702787
18221C5475780N534659O471968O011855M255304J300762k528600n601218p232127
18213D3688383o858184m982383k568269k05884K119842L962946M989906M802125
$$ plain form
18205 44948482 48532680 49635246 47471527 41977756 34725964 27602979 21787518 17600492
18197 17600492 14603799 12360515 10892213 10039688 9051711 8075392 7570206 7232729 7037275
18188 7037275 6834038 6675492 6590687 6706820 6881645 7206093 7623019 7891788 8408190 9284108
18178 9284108 10747774 13081904 15949455 18900645 21695426 23635558 24484532 23762543
18170 23762543 21372307 18224018 15542408 13600542 12553520 12400290 13175631 14656832
18162 14656832 16557419 18357641 19535488 19735844 18837528 16576902 13701970 10961189
18154 10961189 9002859 7651129 6761923 6153450 5751019 5545826 5343907 5232143 4963003
18145 4963003 4735517 4815277 4946875 5147807 5371501 5669197 5801418 5892655 6194623 6649583
$$ packed form
18205D4948482L584198J102566k163719n493771p251792p122985n815461m187026
18197A7600492k996693k243284j468302q52525r87977r76319n05186l37477j95454
18188G037275k03237j58546q4805J16133J74825L24448M16926K68769N16402Q75918
18178I284108J463666K334130K867551K951190K794781J940132Q48974p21989
18170B3762543k390236l148289k681610j941866j047022j53230P75341J481201
18162A4656832J900587J800222J177847K00356q98316k260626k874932k740781
18154A0961189j958330j351730q89206o08473m02431k05193k01919j11764k69140
18145D963003k27486P9760J31598K00932K23694K97696J32221R1237L01968M54960
$$ plain form
18135 6649583 7143241 7463247 7684206 8017047 8522104 8983955 9307865 9645379 9961318
18126 9961318 10320912 11089511 12044167 13426298 15057904 16950997 19588214 23321014 28439370
18117 28439370 35153557 44448441 58159660 78674477 109562881 152882772 199683881
18110 199683881 232018221 253770381 267667602 241874854 187940411 147379257 120656785
18103 120656785 102018612 88591891 78453706 70349055 64356780 60029803 56745635
18096 56745635 54195294 52142892 50174663 47996146 45710852 43632475 41633350 40063257
18088 40063257 38333511 36150773 33923181 31320159 28107934 25111455 22199854 19480841
18080 19480841 17105340 15343371 14015137 12746155 12025247 11699629 11463940 11263465 11317888
$$ packed form
18135F649583M93658L20006K20959L32841N05057M61851L23910L37514L15939
18126I961318L59594P68599R54656J382131J631606J893093K637217L732800N118356
18117B8439370O714187R294884J3711219K0514817L0888404M3319891M6801109
18110A99683881L2334340K1752160J3897221k5792748n3934443m0561154k6722472
18103A20656785j8638173j3426721j0138185q104651n992275m326977l284168
18096E6745635k550341k052402j968229k178517k285294k078377j999125j570093
18088D0063257j729746k182738k227592k603022l212225k996479k911601k719013
18080A9480841k375501j761969j328234j268982p20908l25618k35689k00475N4423
$$ plain form
18071 11317888 11816077 12948583 14388293 16731523 19861090 23907262 28307223 32696558
18063 32696558 36054718 37868137 37607286 35306601 31518864 27339272 23690917 21359587
18055 21359587 20492583 20717322 21924047 23662255 25509360 27433357 28873003 29407723
18047 29407723 28770253 27006260 24706444 21993250 18696555 15366674 12475963 10145539
18039 10145539 8428720 7183103 6303807 5617427 5119043 4562121 4275474 4084833 3932296
18030 3932296 3876999 3763341 3705956 3596634 3350418 3230312 3079471 2920511 2827758 2831165
18020 2831165 2848228 2862949 2910997 2611821 2559422 2632207 2373523 2089351 1826035 1718682
18010 1718682 1714304 1815376 1804395 1498312 1346599 1259106 1221405 1297958 1253518 1275724 1454010
$$ packed form
18071A1317888M98189J132506J439710K343230L129567M046172M399961M389335
18063C2696558L358160J813419k60851k300685l787737m179592l648355k331330
18055B1359587q67004K24739J206725J738208J847105J923997J439646N34720
18047B9407723o37470j763993k299816k713194l296695l329881k890711k330424
18039A0145539j716819j245617q79296o86380m98384n56922k86647j90641j52537
18030C932296n5297j13658n7385j09322k46216j20106j50841j58960r2753L407
18020B831165J7063J4721M8048k99176n2399P2785k58684k84172k63316j07353
18010A718682m378J01072j0981l06083j51713q7493l7701P6553m4440K2206J78286
$$ plain form
17999 1454010 1561170 1641502 1540915 1306317 1118348 1083637 1281148 1522357 1549659 1200228
17989 1200228 985581 948463 978685 947932 1136119 1194606 1064660 1018818 1144548 1182458
17979 1182458 1123031 1173731 1094603 1037099 1020233 1199121 1204892 1150063 983729 770112 798429
17968 798429 775538 777842 859572 866669 864059 760979 743570 647127 633829 643895 668537 628294
17956 628294 546065 452553 622811 615774 569764 669570 756027 784233 694503 423122 417937
17945 417937 543739 585393 524675 571449 647307 505746 359834 412041 570867 466573
17935 466573 425253 389731 434279 376269 406780 362631 276202 156577 102342 216839 264789
17924 264789 287846 350591 528013 577867 565514 548724 494700 367125 55573 41115 121103
$$ packed form
17999A454010J07160Q0332j00587k34598j87969l4711J97511K41209K7302l49431
17989A200228k14647l7118L0222l0753J88187N8487j29946m5842J25730L7910
17979A182458n9427N0700p9128n7504j6866J78888N771n4829j66334k13617K8317
17968G98429k2891K304Q1730P097k610j03080j7409r6443j3298J0066K4642m0243
17956F28294q2229r3512J70258p037m6010R9806Q6457K8206q9730k71381n185
17945D17937J25802M1654o0718M6774P5858j41561j45912N2207J58826j04294
17935D66573m1320l5522M4548n8010L0511m4149q6429j19625n4235J14497M7950
17924B64789K3057O2745J77422M9854j2353j6790n4024j27575l11552j4458P9988
$$ plain form
17913 121103 169733 239278 159152 186176 235660 255119 269355 314165 181058 337585 454946
17902 454946 395606 321254 271412 243517 328297 405839 233053 156524 130549 153641 373666
17891 373666 608672 789556 737779 735380 711786 756748 574413 378462 422961 481514 612387
17880 612387 555766 412480 444202 505885 426865 424384 550630 674934 738446 656530 624284
17869 624284 625584 569135 596964 582932 565144 563125 383733 167526 -58428 -1866 98167
17858 98167 202498 292890 316461 334812 274329 115940 38204 47064 135133 191643 179632
17847 179632 155752 303671 353443 309542 572862 653651 503149 411996 318611 250751 429705
17836 429705 650068 847185 694925 491550 326139 292499 446487 541626 519888 421290
$$ packed form
17913A21103M8630O9545q0126K7024M9484J9459J4236M4810j33107J56527J17361
17902D54946n9340p4352m9842k7895Q4780P7542j72786p6529k5975K3092K20025
17891C73666K35006J80884n1777k399k3594M4962j82335j95951M4499N8553J30873
17880F12387n6621j43286L1722O1683p9020k481J26246J24304O3512q1916l2246
17869F24284J300n6449K7829j4032j7788k019j79392k16207k25954N6562J00033
17858I8167J04331R0392K3571J8351o0483j58389p7736Q860Q8069N6510j2011
17847A79632k3880J47919M9772m3901K63320Q0789j50502r1153r3385o7860J78954
17836D29705K20363J97117j52260k03375j65411l3640J53988R5139k1738r8598
$$ plain form
17826 421290 440118 422625 174547 29822 34028 200738 326056 398356 336045 290609 352484
17815 352484 379623 407664 275272 325354 380429 335243 310088 279134 402318 260935 248572
17804 248572 355412 372020 178630 54640 96046 81536 242051 517887 549393 540624 409036
17793 409036 274205 252964 348381 269212 110819 55093 68199 67544 9015 113660 208469
17782 208469 247156 405852 372575 459645 574356 528273 398873 625654 847986 650256
17772 650256 372741 393247 528602 611009 448094 319539 479032 513663 503359 506582 536156
17761 536156 539111 335222 263462 171642 173953 166108 89418 39870 159492 153380 185294 164475
17749 164475 167179 117396 242121 149983 137581 90731 170000 84266 242666 445136 415544
$$ packed form
17826D21290J8828j7493k48078j44725M206J66710J25318P2300o2311m5436O1875
17815C52484K7139K8041j32392N0082N5075m5186k5155l0954J23184j41383j2363
17804B48572J06840J6608j93390j23990M1406j4510J60515K75836L1506q769j31588
17793D09036j34831k1241R5417p9169j58393n5726J3106o55n8529J04645R4809
17782B08469L8687J58696l3277Q7070J14711m6083j29400K26781K22332j97730
17772F50256k77515K0506J35355Q2407j62915j28555J59493L4631j0304L223K9574
17761E36156K955k03889p1760r1820K311p845p6690m9548J19622o112L1914k0819
17749A64475K704m9783J24725r2138j2402m6850P9269q5734J58400K02470k9592
$$ plain form
17738 415544 275654 150392 -73599 13939 186847 324817 207857 76734 17313 19032
17728 19032 84810 177712 169428 68613 12374 -19746 95796 289711 281068 130823 113596
17717 113596 159048 237737 160036 197237 397139 393101 392339 364982 291999 303502 384549 387679
17705 387679 306038 310093 323324 422720 461771 241875 152457 43744 114177 86623 241901
17694 241901 318791 232548 246170 166495 58424 4919 113780 46558 68202 161132 407372
17683 407372 350433 149165 154953 53116 17009 103602 75838 -41264 -63282 -118889 -80692
17672 -80692 32745 76094 50638 47427 -105015 -159556 -140875 -226026 -345344 -268228 72483
17661 72483 142560 165878 184878 295945 195530 69035 -112459 -256974 -188152 30286
$$ packed form
17738D15544j39890j25262k23991Q7538J72908J37970j16960j31123n9421J719
17728A9032O5778R2902q284j00815n6239l2120J15542J93915q643j50245j7227
17717A13596M5452P8689p7701L7201J99902m038p62k7357p2983J1503Q1047L130
17705C87679q1641M055J3231R9396L9051k19896q9418j08713P0433k7554J55278
17694B41901P6890q6243J3622p9675j08071n3505J08861o7222K1644R2930K46240
17683D07372n6939k01268N788j01837l6107Q6593k7764j17102k2018n5607L8197
17672h0692J13437M3349k5456l211j52442n4541J8681q5151j19318P7116L40711
17661G2483P0077K3318J9000J11067j00415j26495j81494j44515O8822K18438
$$ plain form
17651 30286 196585 11757 -11492 108219 124232 122710 111919 -30252 -2969 165795 153200
17640 153200 91802 119854 87909 60130 132538 270691 324043 158537 95651 191412 224412
17629 224412 242981 243610 48810 -5023 86929 48812 28784 45836 -92824 -215119 -197334
17618 -197334 -271179 -409254 -444241 -169992 -34631 58208 155264 9997 21208 -67048 -73004
17607 -73004 16389 23956 116332 121088 31903 130475 272810 294954 447394 316740 210431
17596 210431 78658 10289 -84108 -112228 72120 211441 88418 170195 183272 111575 -43604
17585 -43604 -101828 -88525 156603 163371 117022 10083 89972 69634 -2403 43155 66326
17574 66326 10415 -39152 32624 92466 119214 52693 65080 276618 457208 567081 598344
$$ packed form
17651C0286J66299j84828k3249J19711J6013j522j0791j42171K7283J68764j2595
17640A53200o1398K8052l1945k7779P2408J38153N3352j65506o2886R5761L3000
17629B24412J8569O29j94800n3833R1952l8117k0028J7052j38660j22295J7785
17618a97334p3845j38075l4987K74249J35361R2839R7056j45267J1211q8256n956
17607g3004Q9393P567R2376M756q9185R8572J42335K2144J52440j30654j06309
17596B10431j31773o8369r4397k8120J84348J39321j23023Q1777J3077p1697j55179
17585d3604n8224J3303K45128O768m6349j06939P9889k0338p2037M5558K3171
17574F6326n5911m9567P1776N9842K6748o6521J2387K11538J80590J09873L1263
$$ plain form
17563 598344 544172 372067 136894 100653 129543 354525 469979 422046 360680 623541
17553 623541 794829 689756 533436 447286 275023 280534 400916 261252 198589 152330
17543 152330 380737 479696 568267 452861 257274 78542 -11186 62696 -23631 -70055 -101592
17532 -101592 -286936 -178865 -7144 69299 175034 271025 279580 125507 -81845 -77796 5809
17521 5809 17831 -15980 -37470 -164521 -283720 -222084 -203623 -235354 -66771 -100908 -283757
17510 -283757 -415657 -177107 69388 -159542 -259386 -136131 -177713 -208998 -146873 -204301
17500 -204301 -286572 -532280 -508151 -477353 -474180 -300321 -68027 -44843 -122250 -139634 -122902
17489 -122902 -82811 -32416 63705 118810 189665 125695 60381 52182 -79761 -60836 -94340
$$ packed form
17563E98344n4172j72105k35173l6241K8890K24982J15454m7933o1366K62861
17553F23541J71288j05073j56320q6150j72263N511J20382j39664o2663m6259
17543A52330K28407R8959Q8571j15406j95587j78732q9728P3882q6327m6424l1537
17532a01592j85344J08071J71721P6443J05735R5991Q555j54073k07352M049Q3605
17521E809J2022l3811k1490j27051j19199O1636J8461l1731J68583l4137j82849
17510b83757j31900K38550K46495k28930r9844J23255m1582l1285O2125n7428
17500b04301q2271k45708K4129L0798L173J73859K32294K3184p7407j7384J6732
17489a22902M0091N0395R6121N5105P0855o3970o5314q199j31943J8925l3504
$$ plain form
17478 -94340 -104275 37469 61956 49751 9030 64628 88942 -37330 -40906 41646 -102751
17467 -102751 -103616 -61578 30768 -20639 -78435 -126747 -188411 -165916 -94412 125648 209203 177759
17455 177759 63602 3252 -158889 -70579 185610 94596 70857 138803 336487 594238
17445 594238 759834 855638 956965 1058360 1090231 883334 589711 388542 327040 265534
17435 265534 214710 115415 23729 -98423 -155453 13065 3965 -141048 -93587 -69748 -91911
17424 -91911 -144653 -151343 -70614 127705 159196 -12295 -264655 -230802 -120387 -17618 -86695
17413 -86695 -38340 -23803 146808 -5864 -68905 83733 72138 188201 287665 227719 138924
17402 138924 97505 -70508 -249857 27647 308116 219576 138451 197647 127021 20254
$$ packed form
17478i4340r935J41744K4487j2205m0721N5598K4314j26272l576Q2552j44397
17467a02751q65M2038R2346n1407n7796m8312o1664K2495P1504K20060Q3555l1444
17455A77759j14157o0350j62141Q8310K56189r1014k3739O7946J97684K57751
17445E94238J65596R5804J01327J01395L1871k06897k93623k01169o1502o1506
17435B65534n0824r9295r1686j22152n7030J68518r100j45013M7461K3839k2163
17424i1911n2742o690Q0729J98319L1491j71491k52360L3853J10415J02769o9077
17413h6695M8355J4537J70611j52672o3041J52638j1595J16063R9464n9946q8795
17402A38924m1419j68013j79349K77504K80469q8540q1125N9196p0626j06767
$$ plain form
17392 20254 -77482 -127475 43382 101684 87034 -104255 -274081 -164989 42789 185295
17382 185295 141394 65234 -176857 -304893 -248016 -84879 100661 119849 17905 50382
17372 50382 53339 -99867 -253900 -208063 -185790 -157124 -221314 -262384 -200170 -181275 -161014
17361 -161014 -240903 -224933 -151603 -129662 -248038 -132400 39034 -6948 -33699 -48395 -67031
17350 -67031 -157701 -234181 -343245 -156542 -52441 64614 73788 -57606 44365 -2425 -129075
17339 -129075 -187795 -317057 -109907 36648 82900 -140164 -266879 -266491 -349671 -206965 51429
17328 51429 184326 94815 126012 173574 159142 27458 17092 14067 -93856 -257886 -352022
17317 -352022 -354347 -298517 -177069 -256395 -273051 -119157 -2370 -8578 53965 -112214 -181385
$$ packed form
17392B0254r7736m9993J70857N8302j4650j91289j69826J09092K07778J42506
17382A85295m3901p6160k42091j28036N6877J63137J85540J9188j01944L2477
17372E0382K957j53206j54033M5837K2273K8666o4190m1070O2214J8895K0261
17361a61014p9889J5970P3330K1941j18376J15638J71434m5982k6751j4696j8636
17350f7031r0670p6480j09064J86703J04101J17055R174j31394J01971m6790j26650
17339a29075n8720j29262K07150J46555M6252k23064j26715L88q3180J42706K58394
17328E1429J32897q9511L1197M7562j4432j31684j0366l025j07923j64030r4136
17317c52022k325N5830J21448p9326j6656J53894J16787o208O2543j66179o9171
$$ plain form
17306 -181385 -36418 17423 -113633 -246038 -214202 -185726 -154203 -218160 -178517 -130499 -112152
17295 -112152 2208 30424 68825 60743 61717 20309 -147054 71130 -21232 -149264 -317798
17284 -317798 -293351 -108743 -104786 -194158 -106301 67117 71166 55071 -28997 -63083 104976
17273 104976 240192 308540 205269 -13125 -96935 -82816 -178426 -112722 -163351 -218643 -122782
17262 -122782 -61527 -26675 -52166 -86321 -51302 -47468 1067 106818 134628 -31410 42916
17251 42916 80815 12463 -201177 -175138 7771 55112 162702 213329 271466 165496 50732
17240 50732 148908 161428 -63795 -15222 46687 85856 49138 80094 107624 22486 -26598
17229 -26598 -107746 -65767 -11323 169529 132750 63992 -46472 -11335 -152272 -322950 -270735
$$ packed form
17306a81385J44967N3841j31056j32405L1836K8476L1523o3957L9643M8018J8347
17295a12152J14360K8216L8401q082R74m1408j67363K18184r2362j28032j68534
17284c17798K4447J84608L957q9372Q7857J73418M049j6095q4068l4086J68059
17273A04976J35216O8348j03271k18394q3810J4119r5610O5704n0629n5292R5861
17262a22782O1255L4852k5491l4155L5019L834M8535J05751K7810j66038P4326
17251D2916L7899o8352k13640K6039J82909M7341J07590N0627N8137j05970j14764
17240E0732R8176J2520k25223M8573O1909L9169l6718L0956K7530q5138m9084
17229b6598q1148M1979N4444J80852l6779o8758j10464L5137j40937j70678N2215
$$ plain form
17218 -270735 -284031 -408484 -505046 -468146 -433393 -276355 -292258 -491927 -523945 -255969 -147052
17207 -147052 -156164 -207839 -147114 -88458 52392 13289 42599 -168384 -463088 -445118 -327253
17196 -327253 -191975 -11990 21258 -72229 -326249 -202838 28620 20221 43379 10488 -5463
17185 -5463 -18207 133090 46570 145361 370767 286783 156024 18080 23656 92769 6699
17174 6699 42815 107481 -39062 1224 -10117 62017 59499 -122866 -121240 -100674 7609 22704
17162 22704 -172940 -78161 150033 269344 281658 177852 17989 46992 101997 80371 -109
17151 -109 -7158 -131031 -214220 -94609 18321 -63566 30282 174460 163054 59325 59137 -69431
17139 -69431 -207924 -219842 -77950 57671 79040 -79993 -202771 -125884 -164784 -221052 -235037
$$ packed form
17218b70735j3296j24453r6562L6900L4753J57038j5903j99669l2018K67976J08917
17207a47052r112n1675O0725N8656J40850l9103K9310k10983k94704J7970J17865
17196c27253J35278J79985L3248r3487k54020J23411K31458q399K3158l2891j5951
17185e463j2744J51297q6520R8791K25406q3984j30759j37944N576O9113q6070
17174F699L6116O4666j46543M0286j1341P2134k518j82365J626K0566J08283J5095
17162B2704j95644R4779K28194J19311J2314j03806j59863K9003N5005k1626q0480
17151a09p049j23873q3189J19611J12930q1887R3848J44178j1406j03729j88j28568
17139f9431j38493j1918J41892J35621K1369j59033j22778P6887l8900n6268j3985
$$ plain form
17128 -235037 -305113 -249843 -255804 -196275 -288478 -488822 -222016 -104299 80223 82606 -10159
17117 -10159 181354 323687 62444 -196183 -125188 -89563 226709 430224 358406 295609
17107 295609 63772 49677 101297 59535 -25648 -29814 54987 -156775 -154616 -54175 -95073
17096 -95073 -17136 -49717 -140815 -87112 -180294 -317303 -306749 -239814 -232261 -161679 -203535 -158863
17084 -158863 23675 -23424 -201221 -239621 -230114 -131890 -66875 -18731 69986 51960 -123
17073 -123 -133720 665 57010 137178 338832 297561 218065 167518 53557 -47327 -34754
17062 -34754 -35007 -38383 1747 23954 98031 110385 247411 214554 105251 5331 -81924 -151145
17050 -151145 -124760 -96346 84929 2055 -70138 -118407 -114424 -155127 -167858 -307344 -492197
$$ packed form
17128b35037p0076N5270n961N9529r2203k00344K66806J17717J84522K383r2765
17117a0159J91513J42333k61243k58627P0995L5625L16272K03515p1818o2797
17107B95609k31837j4095N1620m1762q5183m166Q4801k11762K159J00441m0898
17096i5073P7937l2581r1098N3703r3182j37009J0554O6935P553P0582m1856M4672
17084a58863J82538m7099j77797l8400R507R8224O5015M8144Q8717j8026n2083
17073a23j33597J34385N6345Q0168K01654m1271p9496n0547j13961j00884J2573
17062c4754k53l376M0130K2207P4077J2354J37026l2857j09303r9920q7255o9221
17050a51145K6385K8414J81275q2874p2193m8269L983m0703j2731j39486j84853
$$ plain form
17039 -492197 -525898 -420758 -314647 -260326 -332691 -160144 105471 25383 -41532 -43713 2035
17028 2035 40352 -147812 -271958 -126412 -58627 -76131 -28866 62415 35643 -64410 -150014
17017 -150014 -169883 34190 103213 111961 82122 -39134 -137035 -164638 -272067 -256213 -110617
17006 -110617 -162436 -148265 -86903 -17917 -3663 -125772 -130334 -326609 -384193 -326423 -47869
16995 -47869 139905 109099 -21647 -93702 -70485 -2445 18704 -55252 -241741 -294610 -284036
16984 -284036 -194654 -244421 -292520 -243857 -101772 -19231 -31916 81542 22204 -119006 -186593
16973 -186593 -149195 56879 -79752 37135 189919 -16289 780 45407 -55815 -188604
16963 -188604 -130381 -33817 35782 -62837 -260227 -183512 -201290 -144003 32715 -57856 5563
$$ packed form
17039d92197l3701J05140J06111N4321p2365J72547K65615q0088o6915k181M5748
17028B035L8317j88164j24146J45546O7785j7504M7265R1281k6772j00053q5604
17017a50014j9869K04073O9023Q748k9839j21256r7901k7603j07429J5854J45596
17006a10617n1819J4171O1362O8986J4254j22109m562j96275n7584N7770K78554
16995d7869J87774l0806j30746p2055K3217O8040K1149p3956j86489n2869J0574
16984b84036Q9382m9767m8099M8663J42085Q2541j2685J13458n9338j41210o7587
16973a86593L7398K06074j36631J16887J52784k06208J7069M4627j01222j32789
16963a88604N8223R6564O9599r8619j97390P6715j7778N7287J76718r0571O3419
$$ plain form
16952 5563 -117026 -218946 -182016 -250518 -302596 -53476 118323 95573 47387 33900 -119900
16941 -119900 -96727 -23988 -217483 -138542 -146807 -86159 -127613 -111242 -132099 -253398 -308664
16930 -308664 -523380 -561832 -367479 -248205 -398663 -396349 -341746 -331923 -402946 -486526 -372896
16919 -372896 -347737 -192608 26703 70062 41117 -32904 -157017 -204749 -250075 -374548 -244669
16908 -244669 -151425 -85244 -16259 -128803 -298919 -184911 -92481 -162706 -182594 -241654 -297809
16897 -297809 -271325 -200814 -344780 -206420 -258254 -106999 -18218 -62418 -193166 -166375 -269371
16886 -269371 -188179 -63603 -65418 -58076 -35410 -156910 -286754 -227107 -311945 -210224 -147717
16875 -147717 -232106 -433771 -309466 -174097 -239208 -270449 -265427 -318777 -292126 -220966 -96411
$$ packed form
16952E563j22589j01920L6930o8502n2078K49120J71799k2750m8186j3487j53800
16941a19900K3173P2739j93495P8941q265O0648m1454J6371k0857j21299n5266
16930c08664k14716l8452J94353J19274j50458K314N4603R823p1023q3580J13630
16919c72896K5159J55129K19311M3359k8945p4021j24113m7732m5326j24473J29879
16908b44669R3244O6181O8985j12544j70116J14008R2430p0225j9888n9060n6155
16897b97809K6484P0511j43966J38360n1834J51255Q8781m4200j30748K6791j02996
16886b69371Q1192J24576j815P342K2666j21500j29844N9647q4838J01721O2507
16875a47717q4389k01665J24305J35369o5111l1241N022n3350K6651P1160J24555
$$ plain form
16864 -96411 12116 12199 -121073 -179961 -79196 14648 99055 -5887 150404 202661 94982
16853 94982 -29291 -99164 -243487 -194889 -74753 -79675 -24300 -5470 -12856 -8343 22985 -63403
16841 -63403 -34524 -105949 -37441 115019 63223 -162124 -342366 -148701 -157967 -69447 -101516
16830 -101516 -239964 -326343 -208768 -72459 -193938 -110714 -10763 141394 189319 145775
16820 145775 71887 -51747 -39571 -173180 -336735 -205558 -117560 -145293 -173805 -297026
16810 -297026 -242191 -99034 -53999 -62776 -219080 -398128 -365417 -199391 -119420 148005 248215
16799 248215 99631 6680 -130890 -274263 -337497 -117528 -33786 -179923 -165800 16266
16789 16266 -10536 -11421 -79887 -256244 -257477 -249435 -229132 -244367 -80730 -69279 -33765 -16990
$$ packed form
16864i6411J08527Q3j33272n8888J00765R3844Q4407j04942J56291N2257j07679
16853I4982j24273o9873j44323M8598J20136m922N5375J8830p386M513L1328q6388
16841f3403K8879p1425O8508J52460n1796k25347j80242J93665r266Q8520l2069
16830a01516j38448q6379J17575J36309j21479Q3224R9951J52157M7925m3544
16820A45775p3888j23634J2176j33609j63555J31177Q7998k7733k8512j23221
16810b97026N4835J43157M5035q777j56304j79048L2711J66026P9971K67425J00210
16799B48215j48584r2951j37570j43373o3234K19969Q3742j46137J4123J82066
16789A6266k6802q85o8466j76357j233Q042K0303j5235J63637J1451L5514J6775
$$ plain form
16777 -16990 -28345 84757 321341 251555 67066 -22272 -60639 -108462 -162161 -252429 -313783
16766 -313783 -144647 -36756 -32075 35272 -103050 -270529 -254000 -285490 -307427 -248767 -93001
16755 -93001 -41178 -304941 -260779 -98486 -32607 26832 -19 -57190 -57491 -7105 30247 -81323
16743 -81323 -169000 -41761 -21295 -96034 -150030 -123494 -131626 -200842 -138884 -199074 -197777 50882
16731 50882 -12727 -239377 -159973 -91159 -206423 -283232 -86776 -56705 -18095 -44239 -269639
16720 -269639 -349550 -342324 -255865 -165258 -209243 -155615 -152731 -77189 26714 -58183 -151914 -67864
16708 -67864 -103419 -281543 -270293 -174888 -173019 -230884 -389661 -420486 -362246 -464717 -289513
16697 -289513 -319373 -447717 -455190 -518144 -529025 -436569 -341885 -133329 -184807 -315378 -439153
$$ packed form
16777a6990j1355J13102K36584o9786j84489q9338l8367m7823n3699r0268o1354
16766c13783J69136J07891M681O7347j38322j67479J6529l1490k1937N8660J55766
16755i3001N1823k63763M4162J62293O5879N9439k6851n7171l01N0386L7352j11570
16743h1323q7677J27239K0466p4739n3996K6536q132o9216O1958o0190J297K48659
16731E0882o3609k26650P9404O8814j15264p6809J96456L0071L8610k6144k25400
16720b69639p9911P226Q6459R0607m3985N3628K884P5542J03903q4897r3731Q4050
16708f7864l5555j78124J1250R5405J869n7865j58777l0825N8240j02471J75204
16697b89513k9860j28344p473o2954j0881R2456R4684K08556n1478j30571j23775
$$ plain form
16686 -439153 -478929 -379333 -289199 -251227 -309480 -219623 -89683 -107853 -184081 -122443 26767
16675 26767 51561 200993 214206 115857 16452 140050 154512 114725 193882 327572 190884
16664 190884 219485 126859 14564 -69366 -133290 -140224 -152230 -127441 95333 129453 172552
16653 172552 165906 78794 -69113 -275250 -208849 -142032 -201063 -89350 -83506 -239148 -210004
16642 -210004 -103153 -132869 46597 -21638 -46573 18924 58278 -192690 -308415 -72851
16632 -72851 73521 -53436 -43334 -77136 -104688 -140207 -277791 -86012 -32733 -96149 -165761
16621 -165761 -237501 -244243 -279391 -60618 40054 -46910 -239423 -141626 20105 -38598 -234054
16610 -234054 -392106 -304902 -84009 164963 -1746 -228589 -398916 -389230 -188739 -195083
$$ packed form
16686d39153l9776R9596R0134L7972n8253Q9857J29940j8170p6228O1638J49210
16675B6767K4794J49432J3213r8349r9405J23598J4462l9787P9157J33690j36688
16664A90884K8601r2626j12295q3930o3924o934j2006K4789K22774L4120M3099
16653A72552o646q7112j47907k06137O6401O6817n9031J11713N844j55642K9144
16642b10004J06851k9716J79466o8235k4935O5497L9354k50968j15725K35564
16632g2851J46372j26957J0102l3802k7552l5519j37584J91779N3279o3416o9612
16621a65761p1740o742l5148K18773J00672q6964j92513R7797J61731n8703j95456
16610b34054j58052Q7204K20893K48972j66709k26843j70327R686K00491o344
$$ plain form
16600 -195083 -154077 -82062 -91645 -106882 -173078 -233465 -165504 -181283 -67191 -6932 -80067
16589 -80067 50988 53282 -83970 22071 154564 221024 263094 173717 147671 145001 157060
16578 157060 184769 143413 122935 26881 -39960 -143346 -163964 -267331 -394038 -419909 -306124
16567 -306124 -40362 18127 -169977 -242007 -357734 -277041 -80398 -7943 -54668 -179211
16557 -179211 -103973 -100317 -290955 -341426 -233619 -99821 43422 130390 160842 160158 173856
16546 173856 123528 -18751 -111647 -125081 -150247 -16350 58763 18400 -82403 -73097 87905
16535 87905 90796 -114403 -231046 -220097 -83417 -246162 -418052 -319508 -127421 -103157 -73745
16524 -73745 -218267 -125951 -141967 -114783 50978 70113 -46756 8223 71198 103896 119792
$$ packed form
16600a95083M1006P2015r583j5237o6196o0387O7961j5779J14092O0259p3135
16589h0067J31055K294j37252J06041J32493O6460M2070q9377k6046k670J2059
16578A57060K7709m1356k0478r6054o6841j03386k0618j03367j26707k5871J13785
16567c06124K65762N8489j88104p2030j15727Q0693J96643P2455m6725j24543
16557a79211P5238L656j90638n0471J07807J33798J43243Q6968L0452o84J3698
16546A73856n0328j42279r2896j3434k5166J33897P5113m0363j00803R306J61002
16535H7905K891k05199j16643J0949J36680j62745j71890R8544J92087K4264K9412
16524g3745j44522R2316j6016K7184J65761J9135j16869N4979O2975L2698J5896
$$ plain form
16513 119792 84291 110851 11401 -80847 -95444 -99235 -81756 -130149 -79911 -103507 -165784 -7595
16501 -7595 -75073 -226370 -275741 -268320 -100334 102204 10717 -123580 -190648 -21403 -87924
16490 -87924 51075 258697 34595 -75703 -147536 -319332 -281493 -323243 -393392 -333357 -290452
16479 -290452 -242209 -330338 -358827 -204620 -55091 14298 76791 -13411 -143305 -127716 -117579
16468 -117579 -217917 -108934 37903 217587 159777 -15809 5415 -107798 -304319 -395212
16458 -395212 -418156 -314813 -149426 -79588 -86505 -114528 -85835 -55344 103978 42305 -155303
16447 -155303 -303728 -246899 -310051 -394835 -381752 -242078 -110581 -151119 -121503 25756 -22640
16436 -22640 -202134 -508992 -609767 -555255 -419025 -284322 -140609 -5727 104877 -75293
$$ packed form
16513A19792l5501K6560r9450r2248j4597l791J7479m8393N0238k3596o2277J58189
16501g595o7478j51297m9371P421J67986K02538r1487j34297o7068J69245o6521
16490h7924J38999K07622k24102j10298p1833j71796L7839m1750p0149O0035M2905
16479b90452M8243q8129k8489J54207J49529O9389O2493r0202j29894J5589J0137
16468a17579j00338J08983J46837J79684n7810j75586K1224j13213j96521r0893
16458c95212k2944J03343J65387O9838o917k8023K8693L0491J59322o1673j97608
16447a55303j48425N6829o3152q4784J3083J39674J31497m0538K9616J47259m8396
16436b2640j79494l06858j00775N4512J36230J34703J43713J34882J10604j80170
$$ plain form
16426 -75293 -315137 -424236 -255687 -278693 -256877 -192912 -68045 -99550 -127452 -131797 -125437
16415 -125437 -186843 -153596 -70559 42321 52922 -13762 33842 -70021 -361258 -229897 -80388
16404 -80388 83313 26421 -14770 -121496 -296998 -376018 -378530 -129325 70848 216263 284872
16393 284872 202124 103671 100886 -18003 -101716 -131098 -114537 -144384 149291 183116 63323
16382 63323 -97276 33963 19152 106414 128572 70112 1409 -83669 -253230 -260520 -275380
16371 -275380 -136849 -288869 -293424 -390446 -408458 -338179 -308112 -249792 -393825 -371304 -346785
16360 -346785 -175580 -291937 -533249 -585375 -537481 -381138 -340004 -227486 -78953 -152438
16350 -152438 -247764 -230435 -171414 -134767 -42806 53769 -11729 193891 135274 37442 20759
$$ packed form
16426g5293k39844j09099J68549k3006K1816O3965J24867l1505k7902m345O360
16415a25437o1406L3247Q3037J12880J0601o6684M7604j03863k91237J31361J49509
16404h0388J63701n6892m1191j06726j75502p9020k512K49205K00173J45415O8609
16393B84872q2748r8453k785j18889q3713k9382J6561k9847K93675L3825j19793
16382F3323j60599J31239j4811Q7262K2158n8460o8703q5078j69561p290j4860
16371b75380J38531j52020m555r7022j8012P0279L0067N8320j44033K2521K4519
16360c46785J71205j16357k41312n2126M7894J56343M1134J12518J48533p3485
16350a52438r5326J7329N9021L6647R1961R6575o5498K05620n8617r7832j6683
$$ plain form
16339 20759 -230290 -170179 -200726 -18513 35637 -113402 -394750 -305615 -237098 -292258 -403926
16328 -403926 -193192 34739 71477 8991 -375 18491 140766 174366 108616 44848 52808
16317 52808 40449 54092 -49743 -189532 -115816 -22710 63572 43429 -97201 -316105 -244873
16306 -244873 -150589 -74576 -171014 -189609 -33811 -15073 -7823 12473 18397 -111073 -37861
16295 -37861 33886 -102092 -271445 -263572 -141297 -34633 -178357 -168447 -32551 71689 101901
16284 101901 -102170 -31779 103291 51391 -11072 101413 104271 -49288 -125748 4606 -143234
16273 -143234 -178296 -133156 -137848 -92185 -126393 -142443 -51209 -601 -102950 -71029 -123307
16262 -123307 -331199 -418674 -403539 -329714 -157462 61537 84745 -4723 120912 9300
$$ packed form
16339B0759k51049O0111l0547J82213N4150j49039k81348Q9135O8517n5160j11668
16328d03926K10734K27931L6738o2486r366J8866J22275L3600o5750o3768P960
16317E2808j2359J3643j03835j39789P3716R3106Q6282k0143j40630k18904P1232
16306b44873R4284P6013r6438j8595J55798J8738P250K0296N924j29470P3212
16295c7861P1747j35978j69353P873J22275J06664j43724R910J35896J04240L0212
16284A01901k04071P0391J35070n1900o2463J12485K858j53559p6460J30354j47840
16273a43234l5062M5140m692M5663l4208j6050R1234N0608j02349L1921n2278
16262a23307k07892q7475J5135P3825J72252K18999K3208q9468J25635j11612
$$ plain form
16252 9300 -42873 -56770 -20677 146758 183801 211836 69460 -17878 -109509 -141208 -61985
16241 -61985 -81925 -222774 -196208 -320507 -165925 7114 -71436 -320749 -279476 -177067
16231 -177067 -216769 -146288 33788 86918 64417 -93451 -249644 -193297 -53683 -181297
16221 -181297 -85817 -85237 -177529 -411800 -484848 -293739 -90317 106892 -94666 -149431 193597
16210 193597 481971 269747 40274 -146179 -155594 -186145 -189893 -23595 -22403 117169 37224
16199 37224 -51454 -63635 -111469 -79431 -130193 -35920 -144747 -21448 65155 -96539 -167388
16188 -167388 -93921 -168192 -142400 -84637 -189668 -321443 -313460 -301881 -458739 -357628 -274133
16177 -274133 -257352 -252964 -69623 -113646 -177402 -87474 -29504 -65991 -984 -10958 -94773 -182018
$$ packed form
16252I300n2173j3897L6093J67435L7043K8035j42376q7338r1631l1699P9223
16241f1985j9940j40849K6566j24299J54582J73039p8550k49313M1273J02409
16231a77067l9702P0481J80076N3130k2501j57868j56193N6347J39614j27614
16221a81297R5480N80r2292k34271p3048J91109K03422J97209k01558n4765L43028
16210A93597K88374k12224k29473j86453r415l0551l748J66298J192J39572p9945
16199C7224q8678j2181m7834L2038n0762R4273j08827J23299Q6603j61694p0849
16188a67388P3467p4271K5792N7763j05031j31775P983J1579j56858J01111Q3495
16177b74133J6781M388J83341m4023o3756Q9928N7970l6487O5007r974q3815q7245
$$ plain form
16165 -182018 -97528 -183192 -388747 -496394 -410598 -307401 -167958 -107248 -204964 -196508 -38476
16154 -38476 24250 202778 260701 33762 10786 -66307 -92120 -164983 -198898 -323978 -185745
16143 -185745 40749 62819 -153766 -249208 -236717 -279845 -369122 -267929 -102792 -150093 -207653
16132 -207653 -95617 -99365 -137340 -93150 -171981 -12295 119763 -58684 -123615 195806 135630
16121 135630 -5460 -39280 80671 42864 -37479 -176733 -162085 -52006 -92386 -286148
16111 -286148 -201117 -122658 -97217 -117712 -290793 -285194 45127 108053 119220 180657 53414
16100 53414 12698 -23144 -215763 -402910 -387081 -420440 -371657 -265237 -333777 -354240 -244211
16089 -244211 -232313 -211067 -7179 104692 -31438 -81559 -56579 76698 47184 -71011
$$ packed form
16165a82018Q4490q5664k05555j07647Q5796J03197J39443O0710r7716Q456J58032
16154c8476O2726J78528N7923k26939k2976p7093k5813p2863l3915j25080J38233
16143a85745K26494K2070k16585r5442J2491m3128q9277J01193J65137m7301n7560
16132b07653J12036l748l7975M4190p8831J59686J32058j78447o4931L19421o0176
16121A35630j41090l3820J19951l7807q0343j39254J4648J10079m0380j93762
16111b86148Q5031P8459K5441k0495j73081N599L30321O2926J1167O1437j27243
16100E3414m0716l5842j92619j87147J5829l3359M8783J06420o8540k0463J10029
16089b44211J1898K1246K03888J11871j36130n0121K4980J33277k9514j18195
$$ plain form
16079 -71011 -105605 -130530 -190292 -190855 -129506 -69257 -36944 1432 31000 60664 57689 -44732
16067 -44732 -333222 -370109 -290543 -266639 -303236 -107456 -38705 -43156 -10089 7075 -206287
16056 -206287 -242856 -146304 -201386 -238996 -179211 -162909 -88924 -9072 50054 -13320 44081
16045 44081 86300 -39256 -90896 -67175 -140454 -102903 -63120 -152381 -197646 -61449 -132866
16034 -132866 -90111 -63368 11083 -5385 25926 -60268 6250 -65305 -346103 -406467 -332440
16023 -332440 -249469 -166669 -142510 -116190 100603 125424 136869 102395 -59943 -217171 -347520
16012 -347520 -330939 -290681 -209920 15484 -107535 -97157 34551 7559 47228 53271 69665
16001 69665 13508 -152925 -274952 -354313 -316255 -119838 6166 30822 105527 151413 90670
$$ packed form
16079g1011l4594k4925n9762n63O1349O0249L2313L8376K9568K9664k975j02421
16067d4732k88490l6887P9566K3904l6597J95780O8751m451L3067J7164k13362
16056b06287l6569R6552n5082l7610N9785J6302P3985P9852N9126o3374N7401
16045D4081M2219j25556n1640K3721p3279L7551L9783q9261m5265J36197p1417
16034a32866M2755K6743P4451j6468L1311q6194O6518p1555k80798o0364P4027
16023c32440Q2971Q2800K4159K6320K16793K4821J1445l4474j62338j57228j30349
16012c47520J6581M0258Q0761K25404j23019J0378J31708k6992L9669O043J6394
16001F9665n6157j66433j22027p9361L8058J96417J26004K4656P4705M5886o0743
$$ plain form
15990 90670 291939 300695 121249 -22408 -122654 -95672 -147873 -30225 -28352 -233772 -180964
15979 -180964 -180181 -216669 -131358 -157270 -230900 -230946 -167437 -116026 -116850 -82141 5516 1691 135591
15966 135591 148993 147041 64993 34003 145378 105532 -134629 -115263 -137356 -158644 -110560
15955 -110560 -94595 -116341 -182335 -185099 -20924 -207373 -304967 -221291 -263551 -235998 -174278
15944 -174278 -255893 -176964 -118274 -186989 -155472 -40375 -51021 -110190 -30888 19333 -9547
15933 -9547 -193299 -309624 -195881 72540 83054 -108732 -248970 -182830 -206685 -102695
15923 -102695 -80006 -73424 -36792 5330 -12435 39317 49561 20484 -40460 47724 -20232 -152171
15911 -152171 -197802 -182622 -122975 -34984 -48518 -159967 -14445 180963 80086 -13787 -191753
$$ packed form
15990I0670K01269Q756j79446j43657j00246K6982n2201J17648J873k05420N2808
15979a80964P83l6488Q5311k5912p3630m6O3509N1411q24L4709Q7657l825J33900
15966A35591J3402j952q2048l0990J11375l9846k40161J9366k2093k1288M8084
15955a10560J5965k1746o5994k764J64175j86449r7594Q3676m2260K7553O1720
15944a74278q1615P8929N8690o8715L1517J15097j0646n9169P9302N0221k8880
15933i547j83752j16325J13743K68421J0514j91786j40238O6140k3855J03990
15923a02695K2689O582L6632M2122j7765N1752J0244k9077o0944Q8184o7956j31939
15911a52171m5631J5180N9647Q7991j3534j11449J45522J95408j00877r3873j77966
$$ plain form
15900 -191753 -324122 -57846 115476 191471 313720 427055 215381 -80357 -160985 -4445
15890 -4445 -83506 -219840 -212914 -341722 -275752 -142663 -4940 12180 129252 68250 202301
15879 202301 214667 -173999 -220886 -65197 -143122 -210655 -147962 -80293 -38279 -29106 -51476
15868 -51476 -141846 -81452 122453 160756 215566 7744 -193329 -109469 -1281 -111782 -160000
15857 -160000 -52645 125591 94386 26965 -121092 -125529 79132 252546 374772 347476
15847 347476 300152 287247 363078 412712 684261 878225 962145 1204652 1524612 2001408
15837 2001408 2202758 2373325 2600720 2561562 2551792 2545014 2395596 1948676 1571002 1139471
15827 1139471 711091 641444 634016 535553 440404 417450 352135 276154 249958 213600 138006
$$ packed form
15900a91753j32369K66276J73322P5995J22249J13335k11674k95738q0628J56540
15890d445p9061j36334O926j28808O5970J33089J37723J7120J17072o1002J34051
15879B02301J2366l88666m6887J55689p7925o7533O2693O7669M2014R173k2370
15868e1476r0370O0394K03905L8303N4810k07822k01073Q3860J08188j10501m8218
15857a60000J07355J78236l1205o7421j48057m437K04661J73414J22226k7296
15847C47476m7324j2905P5831M9634K71549J93964Q3920K42507L19960M76796
15837B001408K01350J70567K27395l9158r770o778j49418m46920l77674m31531
15827A139471m28380o9647p428r8463r5149k2954o5315p5981k6196l6358p5594
$$ plain form
15816 138006 48643 -7541 52569 129445 215498 177763 33502 -34995 -99279 -5721 95655
15805 95655 51036 77623 86762 116291 77837 -88311 -265179 -189345 -148007 -148612 -95820 -93251
15793 -93251 -67272 -155395 -182311 -80930 -74332 -53813 -136958 -344083 -292964 -159602 -171796
15782 -171796 -437798 -403752 -324868 -223846 -134610 -158750 -222064 -142073 -138993 -340526 -398802
15771 -398802 -289331 -238766 -301510 -398687 -358096 -188582 -363809 -432657 -183159 -112623 9979
15760 9979 85097 111695 178328 234407 195862 141377 211489 190518 21713 37792 -32794 -135743
15748 -135743 -173657 -22711 -86612 -234162 -254521 -87762 116767 326164 360508 292116
15738 292116 126008 54979 115764 148164 217261 176646 7410 -63019 -107335 188585 416035
$$ packed form
15816A38006q9363n6184O0110P6876Q6053l7735j44261o8497o4284R3558J01376
15805I5655m4619K6587R139K9529l8454j66148j76868P5834M1338o05N2792K569
15793i3251K5979q8123k6916J01381O598K0519q3145k07125N1119J33362j2194
15782a71796k66002L4046P8884J01022Q9236k4140o3314P9991L080k01533n8276
15771c98802J09471N0565o2744r7177M0591J69514j75227o8848K49498P0536J22602
15760I979P5118K6598O6633N6079l8545n4485P0112k0971j68805J6079p0586j02949
15748a35743l7914J50946o3901j47550k0359J66759K04529K09397L4344o8392
15738B92116j66108p1029O0785L2400O9097m0615j69236p0429m4316K95920K27450
$$ plain form
15727 416035 651468 529251 359371 259448 407931 600422 794423 1048507 1323536 1503705
15717 1503705 1585068 1676490 1824024 1856786 1736676 1561465 1369270 1047484 922298 801081
15707 801081 656993 566597 539702 549749 407063 319597 132690 66554 115061 101627 166342
15696 166342 270138 205875 29819 8137 91600 145426 -3512 -59740 -18584 -21356 -95567
15685 -95567 36348 149710 34489 5485 40325 34673 192384 181106 123951 -99734 -309542
15674 -309542 -92936 73005 76251 -66826 -226648 -153277 -44169 -49198 -123146 -161276 -216097
15663 -216097 -319189 -298118 -141363 -124921 -176095 -147642 -89428 146231 214744 120850 157933
15652 157933 349188 292588 94126 125110 240348 273183 87617 -152954 -137266 -196948
$$ packed form
15727D16035K35433j22217j69880r9923J48483J92491J94001K54084K75029J80169
15717A503705Q1363R1422J47534L2762j20110j75211j92195l21786j25186j21217
15707H01081j44088r0396k6895J0047j42686q7466j86907o6136M8507j3434O4715
15696A66342J03796o4263j76056k1682Q3463N3826j48938n6228M1156k772p4211
15685i5567J31915J13362j15221k9004L4840n652J57711j1278n7155k23685k09808
15674c09542K16606J65941L246j43077j59822P3371J09108n029p3948l8130n4821
15663b16097j03092K1071J56755J6442n1174K8453N8214K35659O8513r3894L7083
15652A57933J91255n6600j98462L0984J15238L2835j85566k40571J5688n9682
$$ plain form
15642 -196948 -242095 -128424 -115226 -42300 78870 112364 26699 -41623 -43181 -105669 -62636
15631 -62636 41234 145617 -104660 -126759 40439 156472 203897 195841 151940 146075 98483
15620 98483 -37970 -93766 -111443 -81043 -94410 -54884 18629 47722 -10610 -187984 -243886
15609 -243886 -195466 -65023 -34904 47061 61797 -43160 -163325 -379387 -404546 -162040
15599 -162040 -109451 -151131 60980 175287 175745 153772 109870 82830 136420 283847 36426
15588 36426 -145223 -48946 59419 107773 69662 266578 503184 541507 343099 279894 102147
15577 102147 55361 -161382 -297360 -278340 -174553 -66468 7632 58629 248561 422661
15567 422661 268566 170393 395482 319941 252452 278026 325297 292824 318820 205918 222746
$$ packed form
15642a96948m5147J13671J3198P2926J21170L3494q5665o8322j558o2488M3033
15631f2636J03870J04383k50277k2099J67198J16033M7425q056m3901n865m7592
15620I8483j36453n5796j7677L0400j3367L9526P3513K9093n8332j77374n5902
15609b43886M8420J30443L0119Q1965J4736j04957j20165k16062k5159K42506
15599a62040N2589m1680K12111J14307M58k1973m3902k7040N3590J47427k47421
15588C6426j81649R6277J08365M8354l8111J96916K36606L8323j98408o3205j77747
15577A02147m6786k16743j35978J9020J03787J08085P4100N0997J89932J74100
15567D22661j54095r8173K25089p5541o7489K5574M7271l2473K5996j12902J6828
$$ plain form
15556 222746 231119 122692 61060 -29447 -132661 -131666 -172837 -226529 -169405 -92560 -52035 -75020
15544 -75020 -151314 -307779 -334813 -388021 -255344 -2566 128142 161938 76202 83795 -58042
15533 -58042 91768 245216 195608 249484 302060 422525 373727 249981 199172 100749 39730
15522 39730 182906 297690 257027 227425 344199 258095 -115963 -124626 190427 434074 488666
15511 488666 484927 190443 -22715 124467 153817 70318 23552 123462 238392 221373 206774
15500 206774 333225 354260 347005 247137 220264 214808 166181 313665 331196 87875 59452
15489 59452 130881 249462 345053 135682 20759 -48772 189822 356178 238260 128837
15479 128837 23012 63813 77889 -34702 36674 123139 -68730 -41898 222259 357052
$$ packed form
15556B22746Q373j08427o1632r0507j03214R95m1171n3692N7124P6845M0525k2985
15544g5020p6294j56465k7034n3208J32677K52778J30708L3796q5736P593j41837
15533e8042J49810J53448m9608N3876N2576J20465m8798j23746n0809r8423o1019
15522C9730J43176J14784m0663k9602J16774q6104l74058q663L15053K43647N4592
15511D88666l739k94484k13158J47182K9350q3499m6766R9910J14930j7019j4599
15500B06774J26451K1035p255r9868k6873n456m8627J47484J7531k43321k8423
15489E9452P1429J18581R5591k09371j14923o9531K38594J66356j17918j09423
15479A28837j05825M0801J4076j12591P1376Q6465j91869K6832K64157J34793
$$ plain form
15469 357052 307880 335038 311601 161693 40653 -16113 -70218 100558 168561 226881 166919
15458 166919 -21082 -72604 -66826 -104281 -7881 -46827 -47549 -61717 44843 83541 28166 -88460
15446 -88460 -258280 -357769 -243923 -164460 -61545 -50333 -29900 -96850 -126397 -222521 -99875
15435 -99875 21582 51021 -71840 -88400 -173416 -17050 213581 290782 230040 66546 126736
15424 126736 330349 179898 160065 306848 113248 25974 245947 348050 219680 82389
15414 82389 169470 261024 333255 444592 396579 322731 225983 147482 -6425 16401 -1892
15403 -1892 -40626 17007 191493 303751 415432 377241 369300 369707 425416 524062 547506 559322
15391 559322 654228 540474 319816 257901 395226 536555 359695 116684 224856 345017
$$ packed form
15469C57052m9172K7158k3437j49908j21040n6766n4105J70776O8003N8320n9962
15458A66919j88001n1522N778l7455R6400l8946p22j4168J06560L8698n5375j16626
15446h8460j69820r9489J13846P9463J02915J1212K0433o6950k9547r6124J22646
15435i9875J21457K9439j22861j6560q5016J56366K30631P7201o0742j63494O0190
15424A26736K03613j50451j9833J46783j93600q7274K19973J02103j28370j37291
15414H2389Q7081R1554P2231J11337m8013p3848r6748p8501j53907K2826j8293
15403a892l8734N7633J74486J12258J11681l8191p941M07N5709R8646K3444J1816
15391E59322R4906j13754k20658o1915J37325J41329j76860k43011J08172J20161
$$ plain form
15381 345017 305615 276304 278997 296570 334523 435775 419193 323814 180704 232009 488212
15370 488212 538538 502140 548684 652498 601565 580413 593429 615621 679962 419761 381737
15359 381737 545453 398476 290392 287659 347117 485530 550197 708875 622243 557185 693047
15348 693047 758646 750896 799622 702639 783064 780319 829414 847722 959849 1068999 1005138
15337 1005138 1101632 1304914 1339080 1283971 1377723 1559870 1691929 1640865 1420509 1343798
15327 1343798 1231887 1156670 1197509 1231760 1303786 1445980 1556341 1404936 1516573 1813404
15317 1813404 1860299 1860135 1856765 2003471 2133348 2249275 2275231 2436994 2630944 2685727 2851394
15306 2851394 3059712 3364992 3514518 3612058 3747514 3963571 4182144 4437752 4983176 5958157
$$ packed form
15381C45017l9402k9311K693J7573L7953J01252j6582r5379j43110N1305K56203
15370D88212N0326l6398M6544J03814n0933k1152J3016K2192O4341k60201l8024
15359C81737J63716j46977j08084k733N9458J38413O4667J58678q6632o5058J35862
15348F93047O5599p750M8726r6983Q0425k745M9095J8308J12127J09150o3861
15337A005138R6494K03282L4166n5109R3752J82147J32059n1064k20356p6711
15327A343798j11911p5217M0839L4251P2026J42194J10361j51405J11637K96831
15317A813404M6895j64l370J46706J29877J15927K5956J61763J93950N4783J65667
15306B851394K08318L05280J49526R7540J35456K16057K18573K55608N45424R74981
$$ plain form
15296 5958157 6833723 7683258 8731835 9904747 11369250 13279169 15332858 17634345
15288 17634345 20384485 23603994 27299953 31887670 37341766 44462740 53907938 66811782
15280 66811782 84577944 108247862 138376275 174798724 215731391 257140515 293742759
15273 293742759 319912230 331003199 324686541 301417690 265281230 222342388 178939677
15266 178939677 139705884 107574942 83665348 66943578 55521133 47212498 41030454
15259 41030454 36269632 32456717 29123595 26096570 23464344 21271916 19221717 17393043
15251 17393043 15721117 14245926 12784290 11608052 10689333 9861007 9226235 8759069 8225416
15242 8225416 7637001 7152726 6723893 6363820 6135474 5867778 5524268 5211662 4880887
$$ packed form
15296E958157Q75566Q49535J048577J172912J464503J909919K053689K301487
15288A7634345K750140L219509L695959M587717N454096P120974R445198J2903844
15280F6811782J7766162K3669918L0128413L6422449M0932667M1409124L6602244
15273B93742759K6169471J1090969o316658k3268851l6136460m2938842m3402711
15266A78939677l9233793l2130942k3909594j6721770j1422445q308635o182044
15259D1030454m760822l812915l333122l027025k632226k192428k050199j828674
15251A7393043j671926j475191j461636j176238r18719q28326o34772m67166n33653
15242H225416n88415m84275m28833l60073k28346k67696l43510l12606l30775
$$ plain form
15233 4880887 4676738 4443648 4100728 3846609 3581129 3464681 3349177 3166040 3169554 3112084
15223 3112084 2875070 2652011 2569181 2536425 2384240 2243811 2059750 1876894 1878634 2020508
15213 2020508 2083949 2029259 1916175 1859619 1878527 1870651 1678179 1590306 1569550 1565779 1447665
15202 1447665 1216842 971917 825490 766557 613339 745865 851140 890193 849209 951716
15192 951716 950924 781541 771891 859776 760687 709869 719634 611046 440841 386604 399639 425586
15180 425586 489911 583192 621228 654470 661362 748908 843140 893500 998211 810315 840040
15169 840040 851035 879598 757149 624573 603615 528252 565752 570572 415126 265085 159546
15158 159546 378547 528252 536422 569924 638595 702566 698022 703844 538732 358797 315802
$$ packed form
15233D880887k04149k33090l42920k54119k65480j16448j15504j83137L514n7470
15223C112084k37014k23059q2830l2756j52185j40429j84061j82856J740J41874
15213B020508O3441n4690j13084n6556J8908p876j92472q7873k0756l771j18114
15202A447665k30823k44925j46427n8933j53218J32526J05275L9053m0984J02507
15192I51716p92j69383r650Q7885r9089n0818R765j08588j70205n4237J3035K5947
15180D25586O4325R3281L8036L3242O892Q7546R4232N0360J04711j87896K9725
15169H40040J0995K8563j22449j32576k0958p5363L7500M820j55446j50041j05539
15158A59546K19001J49705Q170L3502O8671O3971m544N822j65112j79935m2995
$$ plain form
15147 315802 427303 674987 922680 984248 857374 749386 708217 610557 423586 474159
15137 474159 655655 666303 441843 344050 266087 397222 413448 350526 173172 232782 151474
15126 151474 66439 -49285 24636 150411 389725 679759 567164 248145 215852 279531
15116 279531 275848 294317 306575 157335 39335 -2542 236019 334330 510974 503501 452905
15105 452905 472843 319402 371803 549232 661976 661193 468650 399427 314457 354439 216152
15094 216152 194304 291129 374821 168999 -66237 71182 117075 -57849 63026 136027
15084 136027 46485 120655 103835 72422 -135745 -153538 -122999 -222649 -232067 -56624 40321
15073 40321 162261 203114 197807 14500 -22292 -37696 -83576 -42973 7422 56870 -111249
$$ packed form
15147C15802J11501K47684K47693O1568j26874j07988m1169r7660j86971N0573
15137D74159J81496J0648k24460r7793p7963J31135J6226o2922j77354N9610q1308
15126A51474q5035j15724P3921J25775K39314K90034j12595l19019l2293O3679
15116B79531l683J8469J2258j49240j18000m1877K38561R8311J76644p473n0596
15105D52905J9938j53441N2401J77429J12744p83j92543o9223q4970L9982j38287
15094B16152k1848R6825Q3692k05822k35236J37419M5893j74924J20875P3001
15084A36027q9542P4170j6820l1413k08167j7793L0539r9650r418J75443R6945
15073D0321J21940M0853n307j83307l6792j5404m5880M0603N0395M9448j68119
$$ plain form
15062 -111249 -228084 -282122 -168898 -14136 191231 141412 24019 -114092 -85237 103949
15052 103949 30436 -254980 -168668 -116603 -79021 53327 85496 632 7535 16006 176504
15041 176504 292030 202714 35855 49301 51218 -38354 -199058 -147632 -38191 -48971 18305
15030 18305 82852 270769 152353 -59844 -144377 -112416 41029 133361 248982 92113
15020 92113 42594 133175 67770 113076 35281 112527 166099 134314 -46365 -162053 -73469
15009 -73469 -18710 -32064 -121241 -12440 68995 131486 169058 224851 325644 361133 343818
14998 343818 277136 234108 245064 224842 114212 13554 52475 57582 -83880 47253 255187
14987 255187 273456 155674 36582 107257 76850 98079 275798 349585 245819 137620
$$ packed form
15062a11249j16835n4038J13224J54762K05367m9819j17393j38111K8855J89186
15052A03949p3513k85416Q6312N2065L7582J32348L2169q4864O903Q471J60498
15041A76504J15526q9316j66859J3446J917q9572j60704N1426J09441j0780O7276
15030A8305O4547J87917j18416k12197q4533L1961J53445R2332J15621j56869
15020I2113m9519R0581o5405M5306p7795P7246N3572l1785j80679j15688Q8584
15009g3469N4759j3354q9177J08801Q1435O2491L7572N5793J00793L5489j7315
14998C43818o6682m3028J0956k0222j10630j00658L8921N107j41462J31133K07934
14987B55187J8269j17782j19092P0675l0407K1229J77719P3787j03766j08199
$$ plain form
14977 137620 48961 38841 83423 52891 49373 -13592 -73995 -154469 -110088 -130035 -131055 -181546
14965 -181546 -103934 -63511 -126521 -246291 -265057 -186667 -189686 -308832 -255370 -4723 -30920
14954 -30920 -59694 -112410 -60956 66608 35619 -163666 -208855 -87385 -26089 -53559 -87609
14943 -87609 -1961 24543 -22587 -108057 -106208 77980 80792 39459 69348 202336 141700 40820
14931 40820 -14802 63894 149817 5937 -47379 -190760 -269283 -170867 -11656 63437 11675
14920 11675 -151717 -158929 -223222 -417438 -484619 -390660 -295219 -75241 5668 -149177 -138378
14909 -138378 -269300 -265563 -250786 -108036 -63446 -169089 -197547 -268914 -289933 -181700 -141411
14898 -141411 -104288 -61676 -50743 -3366 37136 -31898 -69694 -136408 -366847 -345116 -195855
$$ packed form
14977A37620q8659j0120M4582l0532l518o2965o0403q0474M4381j9947j020n0491
14965a81546P7612M0423o3010j19770j8766P8390l019j19146N3462K50647k6197
14954c0920k8774n2716N1454J27564l0989j99285m5189J21470O1296k7470l4050
14943h7609Q5648K6504m7130q5470J849J84188K812m1333K9889J32988o0636j00880
14931D0820n5622P8696Q5923j43880n3316j43381p8523R8416J59211P5093n1762
14920A1675j63392p212o4293j94216o7181R3959R5441K19978Q0909j54845J0799
14909a38378j30922L737J4777J42750M4590j05643k8458p1367k1019J08233M0289
14898a41411L7123M2612J0933M7377M0502o9034l7796o6714k30439K1731J49261
$$ plain form
14887 -195855 11993 75815 -131826 -176650 -81349 -166437 -245394 -284021 -128420 -70204 -153175
14876 -153175 -129678 -13618 -114034 -22953 52381 205641 275161 232927 235966 259356 85180
14865 85180 -24905 -42707 43488 235949 320352 375056 288432 208961 55316 -63900 -52142
14854 -52142 121457 148662 7893 -115109 -162246 102077 100101 6393 -39705 -96025 -155452
14843 -155452 -235225 48391 237060 178078 123782 2033 58803 -23310 -127481 -24080
14833 -24080 -39918 -96706 -73108 122488 513757 635206 751046 938809 1187884 1404997
14823 1404997 1608482 1657197 1520919 1339209 1110557 958321 736963 433612 183858 22303
14813 22303 80264 81454 191614 172048 179948 63969 134174 357204 173790 -224343 -356127
$$ packed form
14887a95855K07848O3822k07641m4824R5301q5088p8957l8627J55601N8216q2971
14876a53175K3497J16060j00416R1081P5334J53260O9520m2234L039K3390j74176
14865H5180j10085j7802Q6195J92461Q4403N4704q6624p9471j53645j19216J1758
14854e2142J73599K7205j40769j23002m7137K64323j976r3708m6098n6320n9427
14843a55452p9773K83616J88669n8982n4296j21749N6770q2113j04171J03401
14833b4080j5838n6788K3598J95596L91269J21449J15840J87763K49075K17113
14823A404997K03485M8715j36278j81710k28652j52236k21358l03351k49754j61555
14813B2303N7961J190J10160j9566P900j15979P0205K23030j83414l98133j31784
$$ plain form
14802 -356127 -462468 -294415 -63428 -13441 35079 15499 26298 196277 225594 227487 211640
14791 211640 46218 -101934 -158195 -45466 -16410 -126681 -107318 -14520 -101 -126701
14781 -126701 -92045 -94911 13299 -63953 -173554 -122487 -58014 110016 138582 26409 -32749
14770 -32749 -62761 -244890 -190512 -85104 -7816 -10930 -59325 -75103 31211 206295 226996
14759 226996 18779 -245513 -330145 -200201 -266265 -319862 -181323 -23550 50674 46009 18276
14748 18276 -52364 -83461 -110229 -144322 -90552 -113703 -182559 -61288 -97765 92331 16115
14737 16115 -28804 -192116 -115007 32805 138572 -12349 61606 105368 -31274 -39062 -61350
14726 -61350 -31899 -90177 -65460 -29430 -46455 80585 19892 43259 81565 71761 168678 46786
$$ packed form
14802c56127j06341J68053K30987M9987M8520j9580J0799J69979K9317J893j5847
14791B11640j65422j48152n6261J12729K9056j10271J9363R2798J4419j26600
14781a26701L4656k866J08210p7252j09601N1067O4473J68030K8566j12173n9158
14770c2749l0012j82129N4378J05408P7288l114m8395j5778J06314J75084K0701
14759B26996k08217k64292q4632J29944o6064n3597J38539J57773P4224m665k7733
14748A8276p0640l1097k6768l4093N3770k3151o8856J21271l6477J90096p6216
14737A6115m4919j63312P7109J47812J05767j50921P3955M3762j36642p788k2288
14726f1350K9451n8278K4717L6030j7025J27040o0693K3367L8306r804R6917j21892
$$ plain form
14714 46786 -177700 -223761 -302995 -109048 18761 269320 269112 -17260 -278692 -347846 -374994
14703 -374994 -172397 19942 3950 34574 153664 93180 -160697 -110894 -38080 -132072 -149162
14692 -149162 -2339 3476 -45602 99816 150179 -6511 12226 22482 -18571 1421 69680
14681 69680 38159 118437 117691 93202 44626 -29852 -71495 -83685 -76004 -10254 91948 135745
14669 135745 126993 20154 -33241 17861 -33635 -31706 15082 51976 11071 55319 227958
14658 227958 242810 208394 97249 -145586 -177222 99307 184894 157839 204928 327096 220679
14647 220679 179773 259941 248331 312636 390736 303136 250737 234415 216144 146498 62961
14636 62961 -43985 -121302 33891 227084 271233 216901 167735 168975 178163 392600 582505
$$ packed form
14714D6786k24486m6061p9234J93947J27809K50559k08k86372k61432o9154k7148
14703c74994K02597J92339j5992L0624J19090o0484k53877M9803P2814r3992j7090
14692a49162J46823N815m9078J45418N0363j56690J8737J0256m1053J9992O8259
14681F9680l1521Q0278p46k4489m8576p4478m1643j2190P681O5750J02202M3797
14669A35745q752j06839n3395N1102n1496J929M6788L6894m0905M4248J72639
14658B27958J4852l4416j11145k42835l1636K76529Q5587k7055M7089J22168j06417
14647B20679m0906Q0168j1610O4305P8100q7600n2399j6322j8271o9646q3537
14636F2961j06946p7317J55193J93193M4149n4332m9166J240R188K14437J89905
$$ plain form
14625 582505 464838 485365 688306 878587 880786 1006544 1348887 1363591 1222524 1116901
14615 1116901 985140 776326 677010 553804 333569 182888 277855 399444 245822 120004
14605 120004 186061 267865 110676 110865 152295 151843 306798 349773 243981 94789 56157
14594 56157 176733 171686 230477 93467 -52191 55070 203751 334982 426654 352494 257780
14583 257780 33237 -211279 -282972 -101977 78733 -131270 -207618 -175668 -254432 -233422
14573 -233422 -122174 -148295 -101137 50054 66229 -69682 -144751 -95236 -133079 -132379 -32595
14562 -32595 21751 -102745 -158540 -37124 51546 139631 278565 132239 120976 19350 44846
14551 44846 162644 159213 152932 -27554 -143220 -240284 -143660 -82600 -38852 -4085 -66421
$$ packed form
14625E82505j17667K0527K02941J90281K199J25758L42343J4704j41067j05623
14615A116901j31761k08814r9316j23206k20235j50681R4967J21589j53622j25818
14605A20004O6057Q1804j57189J89M1430m52J54955M2975j05792j49192l8632
14594E6157J20576n047N8791j37010j45658J07261J48681J31231R1672p4160r4714
14583B57780k24543k44516p1693J80995J80710k10003p6348L1950p8764K1010
14573b33422J11248k6121M7158J51191J6175j35911p5069M9515l7843P00R9784
14562c2595N4346j24496n5795J21416Q8670Q8085J38934j46326j1263j01626K5496
14551D4846J17798l431o281j80486j15666r7064R6624O1060M3748L4767o2336
$$ plain form
14540 -66421 -114069 46705 18135 -252966 -411914 -172912 -27394 3776 -1122 95499 22149
14529 22149 -126112 31099 105973 101545 137113 114625 1417 -39315 53691 -5749 -59550
14518 -59550 149351 233467 333285 182148 -3040 19488 40575 -102858 -137587 -202429 -328908
14507 -328908 -294930 -317302 -203498 -50323 33656 -194026 -181948 -12904 -118131 -120745 -29565
14496 -29565 84855 139201 319072 316953 212442 79348 11483 -3926 19008 -100003 -83590
14485 -83590 -64762 98229 160518 206690 361155 183652 -24977 -152072 -84184 -20759 74434
14474 74434 29795 -135555 -293533 -193002 56661 182726 155502 91825 159169 185710 -51117
14463 -51117 -112784 -66750 -7077 -134376 -169546 -295971 -361071 -339519 -397082 -284533 -222494
$$ packed form
14540f6421m7648J60774k8570k71101j58948K39002J45518L1170m898R6621p3350
14529B2149j48261J57211P4874m428L5568k2488j13208m0732R3006n9440n3801
14518e9550K08901Q4116R9818j51137j85188K2528K1087j43433l4729o4842j26479
14507c28908L3978k2372J13804J53175Q3979k27682J2078J69044j05227k614R1180
14496b9565J14420N4346J79871k119j04511j33094o7865j5409K2934j19011J6413
14485h3590J8828J62991O2289M6172J54465j77503k08629j27095O7888O3425R5193
14474G4434m4639j65350j57978J00531K49663J26065k7224o3677O7344K6541k36827
14463e1117o1667M6034N9673j27299l5170j26425o5100K1552n7563J12549O2039
$$ plain form
14452 -222494 -156890 5738 131290 103195 103432 -50376 -76213 -246959 -189946 -16528 21159
14441 21159 84586 166974 325780 357224 155370 -33787 -147453 46527 221039 297618
14431 297618 363267 410757 476732 312353 260123 285756 268940 262988 187629 1565 149585
14420 149585 302718 314442 428295 507410 622114 446556 337011 248774 48965 -4839
14410 -4839 -7212 -28152 -2012 -307039 -438731 -306266 -74198 37845 -41830 -28974 -86202
14399 -86202 -268477 -301586 -286549 -218754 -64879 -130414 -81642 -50690 -23734 -44759 55917
14388 55917 82969 14948 -66249 -181097 -22569 179058 171750 73333 84262 -88233 -47027
14377 -47027 -9701 -5532 187630 285811 157073 -32349 -213636 -110975 57101 157233
$$ packed form
14452b22494O5604J62628J25552k8095K37j53808k5837j70746N7013J73418L7687
14441B1159O3427Q2388J58806L1444k01854j89157j13666J93980J74512P6579
14431B97618O5649M7490O5975j64379n2230K5633j6816n952p5359j86064J48020
14420A49585J53133J1724J13853P9115J14704j75558j09545q8237j99809n3804
14410d839k373k0940K6140l05027j31692J32465K32068J12043p9675J2856n7228
14399h6202j82275l3109J5037O7795J53875o5535M8772L0952K6956k1025J00676
14388E5917K7052o8021q1197j14848J58528K01627p308r8417J0929j72495M1206
14377d7027L7326M169J93162R8181j28738j89422j81287J02661J68076J00132
$$ plain form
14367 157233 135052 -88618 -156105 -68236 -37042 33992 -46726 -104828 -45506 38284 310492
14356 310492 368070 314108 306463 225916 278255 148951 177248 204653 86738 115623 94596
14345 94596 6733 116708 149298 186712 356096 472752 433009 232481 18322 70812 135011
14334 135011 182193 107727 33996 -52332 -16890 161368 191726 83535 71545 68986 -62175
14323 -62175 -77312 -179824 -134571 -71325 40945 -90246 -265212 -187114 16778 148074
14313 148074 46886 76128 237600 284846 266550 436365 494811 372560 305535 181008
14303 181008 49328 157907 400137 165058 188035 410843 446942 349100 450685 514939
14293 514939 522246 553010 387817 283829 351494 467598 479308 421086 411433 349618 320025
$$ packed form
14367A57233k2181k23670o7487Q7869L1194P1034q0718n8102N9322Q3790K72208
14356C10492N7578n3962p645q0547N2339j29304K8297K7405j17915K8885k1027
14345I4596q7863J09975L2590L7414J69384J16656l9743k00528k14159N2490O4199
14334A35011M7182p4466p3731q6328L5442J78258L0358j08191j1990k559j31161
14323f2175j5137j02512M5253O3246J12270j31191j74966P8098K03892J31296
14313A48074j01188K9242J61472M7246j8296J69815N8446j22251o7025j24527
14303A81008j31680J08579K42230k35079K2977K22808L6099r7842J01585O4254
14293E14939P307L0764j65193j03988O7665J16104J1710n8222r653o1815k9593
$$ plain form
14282 320025 328109 438973 507664 499330 438755 490131 624738 664136 635379 549891 596097
14271 596097 766980 652099 627614 676818 648156 590694 680677 724047 745390 756493 691469
14260 691469 720366 776141 830934 755545 646492 646188 677863 701785 717748 678921 619116 524007
14248 524007 597442 860051 958319 1005147 959949 927348 1155554 1236025 1292519 1387843 1245303
14237 1245303 1306748 1386968 1374830 1397283 1568428 1680923 1527137 1399587 1479180 1692062
14227 1692062 1841850 2102098 2182116 2125259 2253919 2406941 2596087 2711793 2693970 2680183
14217 2680183 2788333 2918970 3038833 3233316 3288022 3442604 3913036 4235526 4484791 4702047
14207 4702047 4866298 5013650 5283122 5663666 5914033 6230738 6664766 7252338 7965895
$$ packed form
14282C20025Q084J10864O8691q334o0575N1376J34607L9398k8757q5488M6206
14271E96097J70883j14881k4485M9204k8662n7462Q9983M3370K1343J1103o5024
14260F91469K8897N5775N4793p5389j09053l04L1675K3922J5963l8827n9805r5109
14248E24007P3435K62609R8268M6828m5198l2601K28206Q0471N6494R5324j42540
14237A245303O1445Q0220j2138K2453J71145J12495j53786j27550P9593K12882
14227A692062J49788K60248Q0018n6857J28660J53022J89146J15706j7823j3787
14217B680183J08150J30637J19863J94483N4706J54582M70432L22490K49265K17256
14207D702047J64251J47352K69472L80544K50367L16705M34028N87572P13557
$$ plain form
14198 7965895 8737857 9697106 10621705 11567189 12678290 13982249 15752252 17715546 19809502
14189 19809502 22406389 25484980 28848492 32535134 37041638 42576058 49201485 57459610
14181 57459610 67744372 80294885 96010717 115569650 139079503 165922493 194291840
14174 194291840 222051741 245279872 260406635 264582103 257133955 239506628 214460766
14167 214460766 185770508 157261292 131644609 109718863 91869457 77819880 66919263
14160 66919263 58375364 51429689 45745238 40874918 36675482 33258460 30139124 27508394
14152 27508394 25205056 23028347 21089687 19489887 17984346 16457609 15065225 14020430
14144 14020430 13159616 12284535 11472158 10941161 10151694 9389373 8857542 8574334 8096217
$$ packed form
14198G965895P71962R59249R24599R45484J111101J303959J770003J963294K093956
14189A9809502K596887L078591L363512L686642M506504N534420O625427Q258125
14181E7459610J0284762J2550513J5715832J9558933K3509853K6842990K8369347
14174A94291840K7759901K3228131J5126763M175468p448148j7627327k5045862
14167B14460766k8690258k8509216k5616683k1925746j7849406j4049577j0900617
14160F6919263q543899o945675n684451m870320m199436l417022l119336k630730
14152B7508394k303338k176709j938660j599800j505541j526737j392384j044795
14144A4020430q60814q75081q12377n30997p89467p62321n31831k83208m78117
$$ plain form
14135 8096217 7697243 7260967 6799822 6403206 6144364 5812318 5496526 5127315 4762237
14126 4762237 4546428 4416427 4178338 4155559 4043683 3923922 3714357 3520989 3439385 3418530
14116 3418530 3398635 3189962 3127908 3001816 2865505 2734747 2821588 2595357 2428151 2405804
14106 2405804 2326716 2153115 2019924 1952887 2029624 1913344 1800619 1690601 1579224 1590431
14096 1590431 1607387 1491153 1305601 1260567 1125972 1180212 1216037 1212231 1332598 1335564 1317575
14085 1317575 1241271 1151534 1008750 948852 1100084 1158462 1140368 997836 993112 1081433 1139561
14074 1139561 1042552 1006023 1124148 1168938 1173175 1028778 977356 901284 843373 828679 783436
14063 783436 920328 889650 625021 639999 732952 732877 658946 684146 980462 1042933 1021624
$$ packed form
14135H096217l98974m36276m61145l96616k58842l32046l15792l69211l65078
14126D762237k15809j30001k38089k2779j11876j19761k09565j93368q1604k0855
14116C418530j9895k08673o2054j26092j36311j30758Q6841k26231j67206k2347
14106B405804p9088j73601j33191o7037P6737j16280j12725j10018j11377J1207
14096A590431J6956j16234j85552m5034j34595N4240L5825l806J20367K966j7989
14085A317575p6304q9737j42784n9898J51232N8378j8094j42532m724Q8321N8128
14074A139561r7009l6529J18125M4790M237j44397n1422p6072n7911j4694m5243
14063G83436J36892l0678k64629J4978R2953p5p3931K5200K96316O2471k1309
$$ plain form
14052 1021624 1074052 1018647 1015255 936406 869196 875029 1052623 1137236 1447466 1619159 1636637
14041 1636637 1641633 1503055 1402043 1322403 1166991 1064535 906593 724042 746669 582787
14031 582787 464269 450501 404257 467783 492925 546007 539951 521114 339228 345271 467090
14020 467090 519918 547862 609942 618955 762283 661935 674153 528445 402587 404754 555432
14009 555432 883646 733475 470282 560763 485251 414299 285822 302896 249745 34448
13999 34448 2232 57749 112825 315431 414494 423496 186698 79046 91775 100188 98573 189063
13987 189063 241688 322625 293233 187262 168652 256204 163848 131439 178952 244649 235404
13976 235404 320662 392610 408453 313271 364924 368168 275071 47632 -96212 -105478 -98396 -50396
$$ packed form
14052A021624N2428n5405l392p8849o7210N833J77594Q4613L10230J71693J7478
14041A636637M996j38578j01012p9640j55412j02456j57942j82551K2627j63882
14031E82787j18518j3768m6244O3526K5142N3082o056j8837j81886O043J21819
14020D67090N2828K7944O2080R013J43328j00348J2218j45708j25858K167J50678
14009E55432L28214j50171k63193R0481p5512p0952j28477J7074n3151k15297
13999C4448l2216N5517N5076K02606R9063R002k36798j07652J2729Q413j615R0490
13987A89063N2625Q0937k9392j05971j8610Q7552r2356l2409M7513O5697r245
13976B35404Q5258P1948J5843r5182N1653L244r3097k27439j43844r266P082M8000
$$ plain form
13964 -50396 -49014 -21326 -25200 31242 46925 123698 -48623 -96556 -19259 -74799 -129831 -60477
13952 -60477 -53987 -96396 -84709 99326 241280 184531 141636 138505 180453 187337 146401 167201
13940 167201 145999 109012 38419 26944 190775 362339 334830 124212 -39314 74977
13930 74977 219897 179695 44674 -31765 74335 116118 128087 41549 129956 231600 315408
13919 315408 169811 177959 218341 108288 84611 69856 7889 -15573 -162754 -83123 52557
13908 52557 12976 -463 33854 46698 -6192 12909 56956 131188 99110 -84716 -132121
13897 -132121 -120826 -23117 16244 -13972 -7447 135214 252963 317546 328642 387721 462422
13886 462422 412413 245522 210869 220627 143069 8593 109021 194755 225651 204266 95396
$$ packed form
13964e0396J382K7688l874N6442J5683P6773j72321m7933P7297n5540n5032O9354
13952f0477O490m2409J1687J84035J41954n6749m2895l131M1948O884m0936K0800
13940A67201k1202l6987p0593j1475J63831J71564k7509k10618j63526J14291
13930G4977J44920m0202j35021p6439J06100M1783J1969q6538Q8407J01644Q3808
13919C15408j45597Q148M0382j10053k3677j4755o1967k3462j47181P9631J35680
13908E2557l9581j3439L4317J2844n2890J9101M4047P4232l2078j83826m7405
13897a32121J1295R7709L9361l0216O525J42661J17749O4583J1096N9079P4701
13886D62422n0009j66891l4653R758p7558j34476J00428Q5734L0896k1385j08870
$$ plain form
13875 95396 37111 -33952 -7973 11058 18414 107711 167365 286261 363042 461335 556307 471426
13863 471426 324121 218460 61713 -125079 -222743 -172002 -203440 -100607 12034 44538
13853 44538 47533 129006 112525 -41885 88718 119060 80060 110329 135782 220227 129727
13842 129727 -113282 -133526 -169505 54585 229187 222756 226086 133698 144528 247408 189305
13831 189305 116095 47835 -115396 -284281 -176914 -13775 73227 65541 243767 328815 140084
13820 140084 -63317 -397441 -359959 -146506 -194221 -271107 -235364 -77144 60847 74746
13810 74746 -21414 -85387 -158885 -314457 -275132 -242552 -373773 -472933 -495273 -288704 -116868
13799 -116868 26291 176782 71854 50936 126891 253623 237799 159279 98867 101959 132428
$$ packed form
13875I5396n8285p1063K5979J9031P356Q9297N9654J18896P6781R8293R4972q4881
13863D71426j47305j05661j56747j86792r7664N0741l1438J02833J12641L2504
13853D4538K995Q1473j6481j54410J30603L0342l9000L0269K5453Q4445r0500
13842A29727k43009k0244l5979K24090J74602o431L330r2388J0830J02880n8103
13831A89305p3210o8260j63231j68885J07367J63139Q7002p686J78226Q5048j88731
13820A40084k03401l34124L7482K13453m7715p6886L5743J58220J37991J3899
13810G4746r6160o3973p3498j55572L9325L2580j31221r9160k2340K06569J71836
13799a16868J43159J50491j04928k0918P5955J26732j5824p8520o0412L092L0469
$$ plain form
13788 132428 251675 12306 -231186 -301342 -415688 -344846 -287817 -153702 -86166 -69976
13778 -69976 10185 61716 133492 -43216 14762 94291 -13022 -115192 -71388 52074 -87
13767 -87 -157258 -222762 -179664 -104805 -216315 -256538 -288191 -178354 -9547 -115422 -146224
13756 -146224 15307 153964 126639 44318 -148755 -63898 35985 -19592 -48609 4667 -8338
13745 -8338 28218 106459 67699 140412 271821 303175 121425 -122353 -231677 -83182 -25504
13734 -25504 -226839 -145134 95016 164561 84023 300803 535613 534979 546216 659322 807011
13723 807011 866642 919933 928698 947471 1166019 1356785 1523730 1542625 1517590 1313681 952255
13712 952255 670821 554837 470566 433203 570889 531497 496359 741703 791527 469285
$$ packed form
13788A32428J19247k39369k43492p0156j14346P0842N7029J34115O7536J6190
13778f9976Q0161N1531P1776j76708N7978P9529j07313j02170M3804J23462n2161
13767h7j57171o5504M3098P4859j11510m0223l1653J09837J68807j05875l0802
13756a46224J61531J38657k7325q2321j93073Q4857R9883n5577k9017N3276j3005
13745h338L6556P8241l8760P2713J31409L1354j81750k43778j09324J48495N7678
13734b5504k01335Q1705K40150O9545q0538K16780K34810o34J1237J13106J47689
13723H07011N9631N3291Q765J8773K18548J90766J66945J8895k5035k03909l61426
13712I52255k81434j15984q4271l7363J37686l9392l5138K45344M9824l22242
$$ plain form
13702 469285 282569 109798 80681 226290 285109 237564 37357 -56165 -10203 101335
13692 101335 101188 94044 66555 -34436 -43436 52897 4916 -205874 -305891 -135299 89684
13681 89684 147160 202582 130703 -40312 13248 145153 52482 13280 43969 18061 -63679
13670 -63679 -123622 -180735 -240944 -77344 -49683 -93125 -17110 -89327 -154438 -239444 -232626 -169110
13658 -169110 -195539 -410321 -541219 -319027 -60606 -49413 -181056 -178326 -88910 -180727 -170767
13647 -170767 -222528 -48656 -127599 -164006 -101822 -83205 -130576 42095 155403 -37511 -151037
13636 -151037 -280950 -334889 -408957 -426025 -320155 -199808 -137410 -31764 -57339 -23494 139372
13625 139372 327316 413090 250225 142788 -21613 56754 259728 256960 189731 134000 13112
$$ packed form
13702D69285j86716j72771k9117J45609N8819m7545k00207r3522M5962J11538
13692A01335j47p144k7489j00991r000R6333m7981k10790j00017J70592K24983
13681H9684N7476N5422p1879j71015N3560J31905r2671l9202L0689k5908q1740
13670f3679n9943n7113o0209J63600K7661m3442P6015p2217o5111q5006O818O3516
13658a69110k6429k14782j30898K22192K58421J1193j31643K730Q9416r1817R960
13647a70767n1761J73872p8943l6407O2184J8617m7371J72671J13308j92914j13526
13636a51037j29913n3939p4068j7068J05870J20347O2398J05646k5575L3845J62866
13625A39372J87944Q5774j62865j07437j64401P8367K02974k768o7229n5731j20888
$$ plain form
13614 13112 -112461 -184512 -392679 -426185 -215253 -113709 -266241 -461300 -352150 -218039
13604 -218039 -173888 -320933 -244789 -7288 -4435 -98657 -27050 117961 151803 48613 38961
13593 38961 127154 128431 -16549 -203082 -291023 -238998 -207658 -357640 -347280 -247783 -47571
13582 -47571 -157294 -188471 -367622 -426708 -377650 -409746 -410926 -335397 -185900 -4277 -66421
13571 -66421 -110444 -239831 -127735 -201437 -180602 -25835 -83588 -302184 -376317 -320769 -199848
13560 -199848 -173356 -214263 -277458 -344163 -148106 -52777 -157719 -119994 -79686 8117 1273
13549 1273 35171 -90416 -110565 -31861 -52150 -60916 25496 126567 94475 106759 -33365
13538 -33365 -7349 83241 17206 24435 62683 45331 31232 112819 61559 -65772 -113781 18708
$$ packed form
13614A3112j25573p2051k08167l3506K10932J01544j52532j95059J09150J34111
13604b18039M4151j47045P6144K37501K853r4222P1607J45011L3842j03190r652
13593C8961Q8193J277j44980j86533q7941N2025L1340j49982J0360R9497K00212
13582d7571j09723l1177j79151n9086M9058l2096j180P5529J49497J81623o2144
13571f6421m4023j29387J12096p3702K0835J54767n7753k18596p4133N5548J20921
13560a99848K6492m0907o3195o6705J96057R5329j04942L7725M0308Q7803o844
13549A273L3898j25587k0149P8704k0289q766Q6412J01071l2092J2284j40124
13538c3365K6016R0590o6035P229L8248j7352j4099Q1587n1260j27331m8009J32489
$$ plain form
13526 18708 -14684 25161 100360 127124 180405 92592 -14986 19786 9567 -90135 -101969
13515 -101969 25763 -15806 -158203 -85417 -72672 -68945 -141679 -103660 132727 284592 261732
13504 261732 275033 165938 132995 259112 387865 426130 322115 305377 242804 45652
13494 45652 -66301 49066 246891 118583 119054 -17362 -42164 -114610 -294859 -258099 -181413
13483 -181413 -137486 -125717 -133271 5251 136824 -13560 -101742 -35318 -19806 3243 86057
13472 86057 290982 214215 187794 17866 -112407 -39202 -6636 998 43091 17623 90082
13461 90082 59701 -222277 -282582 -222762 -150242 -27604 -74639 -84010 13456 131992 -24814
13450 -24814 13595 97448 156097 217974 96000 -79714 -107634 -59962 -12779 132900 87881
$$ packed form
13526A8708l3392L9845P5199K6764N3281q7813j07578L4772j0219r9702j1834
13515a01969J27732m1569j42397P2786J2745L727p2734L8019K36387J51865k2860
13504B61732J3301j09095l2943J26117J28753L8265j04015j6738o2573j97152
13494D5652j11953J15367J97825j28308M71j36416k4802p2446j80249L6760P6686
13483a81413M3927J1769p554J38522J31573j50384q8182O6424J5512K3049Q2814
13472H6057K04925p6767k6421j69928j30273P3205L2566P634M2093k5468P2459
13461I0082l0381k81978o0305N9820P2520J22638m7035r371R7466J18536j56806
13450b4814L8409Q3853N8649O1877j21974j75714k7920M7672M7183J45679m5019
$$ plain form
13439 87881 62082 252939 168362 59715 129124 61653 127390 40806 -85454 -109355 64113
13428 64113 144105 243038 192710 153907 210640 155347 -24294 -150660 -40188 -48504 59927
13417 59927 40769 60108 -86390 -110722 -112763 -169192 -55427 20741 -121665 -108210 -111036
13406 -111036 -222070 -342641 -276936 -313237 -194391 -151436 -4013 140148 39442 35579
13396 35579 42538 -112450 -176595 -89861 30022 17545 -72617 -269349 -352353 -260940 -128894
13385 -128894 -250936 -270399 101495 243674 68817 -99398 15238 -9170 -57537 76818
13375 76818 171972 -25805 -147321 -14715 153962 29112 61952 21897 130242 118650
13365 118650 -28518 -25592 155572 163483 97131 89569 -12298 -152388 -10655 134699 80644
$$ packed form
13439H7881k5799J90857q4577j08647O9409o7471O5737q6584j26260k3901J73468
13428F4113P9992R8933n0328l8803N6733n5293j79641j26366J10472q316J08431
13417E9927j9158J9339j46498k4332k041n6429J13765P6168j42406J3455k826
13406a11036j11034j20571O5705l6301J18846M2955J47423J44161j00706l863
13396C5579O959j54988o4145Q6734J19883j2477r0162j96732q3004R1413J32046
13385a28894j22042j9463L71894J42179j74857j68215J14636k4408m8367J34355
13375G6818R5154j97777j21516J32606J68677j24850L2840m0055J08345j1592
13365A18650j47168K926J81164P911o6352p562j01867j40090J41733J45354n4055
$$ plain form
13354 80644 -42099 -76035 108681 123344 -33092 -58761 -5051 -51436 3107 139550 56595
13343 56595 -79349 -189441 -83683 12434 -89149 -80029 -100261 -93060 -96299 -16510 97987
13332 97987 147985 -24807 114365 335130 548084 627926 683703 609804 518137 546596 582297
13321 582297 502965 336689 296459 255360 313374 379476 366230 161982 311808 337552 151245
13310 151245 73363 -99433 -78254 -160933 -302759 -206305 -63356 60575 -59591 -112793
13300 -112793 95093 222547 49915 -77218 -112457 -354216 -330764 -224854 -156920 44116
13290 44116 38184 164218 158778 99056 79801 40949 21783 2176 -42458 -193404 -187595 -112158
13278 -112158 -113829 -26795 -60362 6883 54422 43519 150802 109136 31502 11033 -91501
$$ packed form
13354H0644j22743l3936J84716J4663j56436k5669N3710m6385N4543J36443q2955
13343E6595j35944j10092J05758R6117j01583R120k0232P201l239P9789J14497
13332I7987M9998j72792J39172K20765K12954P9842N5777p3899r1667K8459L5701
13321E82297p9332j66276m0230m1099N8014O6102j3246k04248J49826K5744j86307
13310A51245p7882j72796K1179q2679j41826R6454J42949J23931j20166n3202
13300a12793K07886J27454j72632j27133l5239k41759K3452J05910O7934K01036
13290D4116n932J26034n440n9722j9255l8852j9166j9607m4634j50946N809P5437
13278a12158j671Q7034l3567O7245M7539j0903J07283m1666p7634k0469j02534
$$ plain form
13267 -91501 -188661 8052 135083 194169 -55377 -298693 -202175 -166280 -228092 -62251 31681
13256 31681 -50815 -26676 180345 192187 83886 -150427 -217182 -146169 -24957 35171 93265
13245 93265 52739 129834 27310 -90772 -154672 -109586 -26324 33624 117361 190931 298779
13234 298779 318014 322795 222665 176350 229583 269848 418213 476461 338553 442582 445097
13223 445097 316190 295555 227036 211256 346494 383028 426936 352607 267637 172314 126071
13212 126071 94694 29875 48308 209182 313752 480199 463412 183807 259730 436086
13202 436086 544396 529409 456645 372681 338178 259528 272569 257132 200582 54550 75237
13191 75237 48259 57293 33325 -111028 -21341 247115 160890 80329 45230 -41849 -6765
$$ packed form
13267i1501r7160J96713J27031N9086k49546k43316R6518L5895o1812J65841R3932
13256C1681q2496K4139K07021J1842j08301k34313o6755P1013J21212O0128N8094
13245I3265m0526P7095j02524j18082o3900M5086Q3262N9948Q3737P3570J07848
13234B98779J9235M781j00130m6315N3233M0265J48365N8248j37908J04029K515
13223D45097j28907k0635o8519j5780J35238L6534M3908p4329q4970r5323m6243
13212A26071l1377o4819J8433J60874J04570J66447j6787k79605P5923J76356
13202D36086J08310j4987p2764q3964l4503p8650J3041j5437n6550j46032K0687
13191G5237k6978R034k3968j44353Q9687K68456q6225q0561l5099q7079L5084
$$ plain form
13180 -6765 20868 105365 41727 -68771 -1004 65332 50929 -15386 -165733 -258312 -258048 -208911
13168 -208911 -131961 39518 236677 297629 347020 431354 398834 467333 805286 1243857 1452370
13157 1452370 1607210 1734307 1712590 1425735 992518 708519 518341 270933 144819 32286
13147 32286 -82194 -46915 -67650 -92440 35065 86679 115407 35625 12700 56188 -2806
13136 -2806 -91432 -48847 57734 134080 274795 209900 116951 66721 4465 66877 101870
13125 101870 101486 193355 199779 107159 79437 95449 114405 86469 217143 459777 694026
13114 694026 743141 852462 1239415 1435435 1351509 1203647 833484 381242 168862 261311
13104 261311 324403 420987 428086 298648 357074 323146 1582 10835 108118 231560 206372
$$ packed form
13180f765K7633Q4497o3638j10498O7767O6336j4403o6315j50347r2579K64M9137
13168b08911P6950J71479J97159O0952M9391Q4334l2520O8499L37953M38571K08513
13157A452370J54840J27097k1717k86855m33217k83999j90178k47408j26114j12533
13147C2286j14480L5279k0735k4790J27505N1614K8728p9782k2925M3488n8994
13136b806q8626M2585J06581P6346J40715o4895r2949n0230o2256O2412L4993
13125A01870l84R1869O424r2620k7722J6012J8956k7936J30674K42634K34249
13114F94026M9115J09321L86953J96020q3926j47862l70163m52242k12380R2449
13104B61311O3092R6584P099j29438N8426l3928l21564R253R7283J23442k5188
$$ plain form
13093 206372 -38434 -107608 74881 114945 121568 167734 64335 81149 39880 -104266 -137917
13082 -137917 -27988 -72559 -12701 99508 104331 146649 92443 -18924 -184468 -81566 109690
13071 109690 166004 283664 471694 422509 332367 428808 487709 360746 61797 -19870 -9484
13060 -9484 73669 -141896 -179137 -79756 -4748 -58205 34567 43493 152274 216854 98082
13049 98082 55293 90415 46189 -116520 -45934 -23571 30523 117198 215177 142805 -3413
13038 -3413 -105494 51756 132132 328903 257185 -412 -317986 -67500 154497 53814
13028 53814 69592 318219 166510 10051 -63716 17046 -44064 -209437 -219247 -228476 -94867
13017 -94867 48035 -25779 -141710 48754 -9677 -5845 117950 -9074 -78516 -17262 -12278
$$ packed form
13093B06372k44806o9174J82489M0064O623M6166j03399J6814m1269j44146l3651
13082a37917J09929m4571N9858J12209M823M2318n4206j11367j65544J02902J91256
13071A09690N6314J17660J88030m9185r0142R6441N8901j26963k98949q1667J0386
13060i484Q3153k15565l7241R9381P5008n3457R2772Q926J08781O4580j18772
13049I8082m2789L5122m4226j62709P0586K2363N4094Q6675R7979p2372j46218
13038c413j02081J57250Q0376J96771p1718k57597l17574K50486K21997j00683
13028E3814J5778K48627j51709j56459p3767Q0762o1110j65373r810r229J33609
13017i4867J42902p3814j15931J90464n8431L832J23795j27024o9442O1254M984
$$ plain form
13006 -12278 21735 13910 54721 26144 44484 92524 -20912 -273228 -199342 -208340 -364225
12995 -364225 -365288 -238797 -91780 -99101 -83920 -24453 83406 187432 136640 79556 53159
12984 53159 -61143 -123877 -83932 -27271 95960 377958 229055 172633 204037 134899 -31186
12973 -31186 -148093 -42803 -18836 -77699 -23010 32207 123751 21859 -114612 -138933 872
12962 872 137784 233255 151306 84547 129275 197433 155191 34770 -164198 -229747 -60705
12951 -60705 -35899 -53140 -189129 -150848 56483 62104 -21714 87906 82527 241785 199652
12940 199652 64920 13218 -71426 -33950 -113079 -119348 59767 142541 155240 106186 -37
12929 -37 77101 258829 279735 378962 494821 386946 178735 31791 -141633 -81205 -61997
$$ packed form
13006a2278L4013p825M0811k8577J8340M8040j13436k52316P3886q998j55885
12995c64225j063J26491J47017p321J5181N9467J07859J04026n0792n7084k6397
12984E3159j14302o2734L9945N6661J23231K81998j48903n6422L1404o9138j66085
12973c1186j16907J05290K3967n8863N4689N5217R1544j01892j36471k4321J39805
12962H72J36912R5471q1949o6759M4728O8158m2242j20421j98968o5549J69042
12951f0705K4806j7241j35989L8281K07331N621q3818J09620n379J59258m2133
12940A99652j34732n1702q4644L7476p9129o269J79115Q2774J2699m9054j06223
12929c7P7138J81728K0906R9227J15859j07875k08211j46944j73424O0428J9208
$$ plain form
12918 -61997 -118841 -15201 14387 -87926 -53015 -153004 -173135 -135999 38644 30707 -56238
12907 -56238 -136731 -140985 -39482 -23980 -9605 -90264 -24217 87834 69218 49262 106047
12896 106047 73548 -60947 -76489 -178467 -259451 -246810 -164418 -250271 36593 -10181 -72086
12885 -72086 -100376 -85615 -166521 -81409 -159272 -138828 -60424 42846 -75943 -88865 15662
12874 15662 71278 -82761 20133 218322 229892 234430 105284 7723 157284 176430 186082
12863 186082 38289 31973 48203 88135 109041 38362 23139 -89140 6521 107091 36683
12852 36683 -82135 -196445 -225542 -143309 -179063 -360608 -406061 -198445 -115499 -181850 -142741
12841 -142741 -23427 80903 131774 51443 103421 164908 141022 126885 251016 235354 66861
$$ packed form
12918f1997n6844J03640K9588j02313L4911r9989k0131L7136J74643p937q6945
12907e6238q0493m254J01503J5502J4375q0659O6047J12051j8616j9956N6785
12896A06047l2499j34495j5542j01978q0984J2641Q2392q5853K86864m6774o1905
12885g2086k8290J4761q0906Q5112p7863K0444P8404J03270j18789j2922J04527
12874A5662N5616j54039J02894J98189J1570M538j29146r7561J49561J9146R652
12863A86082j47793o316J6230L9932K0906p0679j5223j12279R5661J00570p0408
12852C6683j18818j14310k9097Q2233l5754j81545m5453K07616Q2946o6351L9109
12841a42741J19314J04330N0871q0331N1978O1487k3886j4137J24131j5662j68493
$$ plain form
12830 66861 107069 206193 140970 101529 104483 -41133 -65747 156300 266365 104827 -55849
12819 -55849 -140345 -193534 -378577 -422564 -231644 -153531 -264034 -190666 118143 295236 164176
12808 164176 -97256 -82324 63396 36270 30900 84187 260835 210289 158654 185720 222212
12797 222212 62063 157913 158144 137171 41846 166179 131446 189029 158789 165362 230191 170220
12785 170220 -16170 -14023 42875 -132280 -14708 128801 33304 -6583 -80840 -139063 -134311
12774 -134311 -145345 -74652 -33080 -71306 36776 211619 275728 145019 -64833 -254207
12764 -254207 -296115 -181276 -30855 88963 -13631 41802 194263 292245 221385 144765
12754 144765 112033 -34704 -130754 107291 269292 207841 108510 358393 511664 506883 516821
$$ packed form
12830F6861M0208R9124o5223l9441K954j45616k4614K22047J10065j61538j60676
12819e5849q4496n3189j85043m3987J90920P8113j10503P3368L08809J77093j31060
12808A64176k61432J4932J45720k7126n370N3287J76648n0546n1635K7066L6492
12797B22212j60149R5850K31k0973r5325J24333l4733N7583l0240O573O4829n9971
12785A70220j86390K147N6898j75155J17572J43509r5497l9887p4257n8223M752
12774a34311j1034P0693M1572l8226J08082J74843O4109j30709k09852j89374
12764b54207m1908J14839J50421J19818j02594N5433J52461R7982p0860p6620
12754A44765l2732j46737r6050K38045J62001o1451r9331K49883J53271m781R938
$$ plain form
12743 516821 417623 252739 251575 131402 88159 144589 127837 161444 54613 99166 85399
12732 85399 -40427 96694 206310 95439 91150 155162 369624 317780 213819 261796 421295
12721 421295 304155 160678 214074 443378 462728 190693 -42370 110269 266230 296858
12711 296858 302933 335818 257484 67353 -12964 59956 177711 93633 -29326 -54179 -46941
12700 -46941 -9822 120281 40085 -3512 21654 88977 126101 149604 244467 331793 340110 267293
12688 267293 219339 171677 130215 139795 169853 140808 145864 138513 85294 211491 294102 131743
12676 131743 123948 88146 100701 250508 244762 104553 47006 7492 -117957 -19550 28181
12665 28181 83547 22520 183684 140226 143625 46007 79965 74212 6118 115404 95250 52996
$$ packed form
12743E16821r9198j64884j164j20173m3243N6430j6752L3607j06831M4553j3767
12732H5399j25826J37121J09616j10871m289O4012K14462n1844j03961M7977J59499
12721D21295j17140j43477N3396K29304J9350k72035k33063J52639J55961L0628
12711B96858O075L2885p8334j90131q0317P2920J17755q4078j22959k4853P238
12700d6941L7119J30103q0196m3597K5166O7323L7124K3503R4863Q7326Q317p2817
12688B67293m7954m7662m1462R580L0058k9045N056p351n3219J26197Q2611j62359
12676A31743p795l5802J2555J49807n746j40209n7547l9514j25449R8407M7731
12665B8181N5366o1027J61164m3458L399r7618L3958n753o8094J09286k0154m2254
$$ plain form
12653 52996 29474 209666 182387 118181 178517 138236 127510 54394 45700 -90102 -37692
12642 -37692 74252 -18291 -49786 99798 185775 179700 39982 -59034 -67386 -66026 -75620 -193759
12630 -193759 -186135 12235 69252 179366 244203 200496 161137 145957 295939 274787 235099
12619 235099 117518 136147 227087 257168 248881 300500 281740 205429 164072 313693 429743
12608 429743 298429 107461 106614 145344 146939 152489 167423 193292 216093 246486 323144 335655
12596 335655 303328 296322 154371 2674 18216 -19008 -173586 -58399 93799 247130
12586 247130 306976 361492 324428 334016 425368 527870 708479 801292 669226 780363 662443
12575 662443 480641 419558 236948 187348 288288 364161 307578 145327 45626 29145 118956
$$ packed form
12653E2996k3522J80192k7279o4206O0336m0281j0726p3116q694j35802N2410
12642c7692J11944r2543l1495J49584Q5977o075j39718r9016q352J360r594j18139
12630a93759P624J98370N7017J10114O4837m3707l9359j5180J49982k1152l9688
12619B35099j17581J8629R0940L0081q287N1619j8760p6311m1357J49621J16050
12608D29743j31314j90968q47L8730J595N550J4934K5869K2801L0393P6658J2511
12596C35655l2327p006j41951j51697J5542l7224j54578J15187J52198J53331
12586B47130N9846N4516l7064R588R1352J02502J80609R2813j32066J11137j17920
12575F62443j81802o1083j82610m9600J00940P5873n6583j62251r9701j6481Q9811
$$ plain form
12564 118956 115053 184285 341715 309412 375092 432900 328497 276845 217835 400687 533940
12553 533940 556650 620636 756069 556958 264065 262627 525400 760012 745883 689881 541811
12542 541811 317957 350716 484477 438235 414200 399806 527231 239363 174018 163213 126312
12531 126312 205438 303024 263892 301477 325503 415578 370952 431398 515000 532759 611094
12520 611094 614030 573796 371432 337632 169076 152559 111983 252238 148273 204726 353739
12509 353739 435528 328764 285046 409955 423275 361886 587314 474817 548702 668278
12499 668278 697791 660015 660319 618200 543085 662711 684915 642598 554220 618496 843057
12488 843057 834865 873140 822624 807419 740896 597434 496797 565464 606287 443076 335346
$$ packed form
12564A18956l903O9232J57430l2303O5680N7808j04403n1652n9010J82852J33253
12553E33940K2710O3986J35433j99111k92893j438K62773K34612j4129n6002j48070
12542E41811k23854L2759J33761m6242k4035j4394J27425k87868o5345j0805l6901
12531A26312P9126R7586l9132L7585K4026R0075m4626O0446Q3602J7759P8335
12520F11094K936m0234k02364l3800j68556j6517m0576J40255j03965N6453J49013
12509C53739Q1789j06764m3718J24909J3320o1389K25428j12497P3885J19576
12499F68278K9513l7776L04m2119p5115J19626K2204m2317q8378O4276K24561
12488H43057q192L8275n0516j5205o6523j43462j00637O8667M0823j63211j07730
$$ plain form
12477 335346 614452 737437 766300 673905 725936 926158 1008118 930595 739297 555659
12467 555659 654751 724703 643002 731248 926173 901521 905844 973449 914516 908683 899887 847449
12455 847449 848633 879490 853063 880037 783596 742097 807454 806235 715734 667506 713950 760945
12443 760945 709421 823111 794705 720117 742770 861713 917763 873931 834170 822440 781698
12432 781698 723289 795736 967523 1016759 859105 850074 1026320 1100198 1073164 1005223 906704
12421 906704 975655 1117747 1119336 1087039 1081636 1051177 950995 908216 898421 733228 791697
12410 791697 922112 997984 898419 826885 788409 835738 850808 949084 1048506 946779 955673
12399 955673 1139026 1154410 1186184 1207338 1188069 1156725 1267593 1384184 1353867 1254657 1287448
$$ packed form
12477C35346K79106J22985K8863r2395N2031K00222Q1960p7523j91298j83638
12467E55659R9092O9952q1701Q8246J94925k4652M323O7605n8933n833q796n2438
12455H47449J184L0857k6427K6974r6441m1499O5357j219r0501m8228M6444M6995
12443G60945n1524J13690k8406p4588K2653J18943N6050m3832l9761j1730m0742
12432G81698n8409P2447J71787M9236j57654r031J76246P3878k7034o7941r8519
12421I06704O8951J42092J589l2297n403l0459j00182m2779r795j65193N8469
12410G91697J30415P5872r9565p1534l8476M7329J5070R8276R9422j01727Q894
12399I55673J83353J5384L1774K1154j9269l1344J10868J16591l0317r9210L2791
$$ plain form
12388 1287448 1458452 1376488 1361416 1214643 1127043 1292394 1235599 1264603 1278613 1290130 1497287
12377 1497287 1538443 1663668 1693940 1541263 1508315 1403303 1401026 1453439 1408027 1290438 1287166
12366 1287166 1234254 1387727 1477647 1398277 1404251 1374399 1559703 1702064 1610923 1464640 1458353
12355 1458353 1470072 1516814 1587342 1665734 1672941 1580244 1624620 1640642 1730278 1758450 1743981
12344 1743981 1820475 1721231 1684845 1839790 1885624 1949416 2009845 1802511 1853998 2009501 2016115
12333 2016115 2032682 1880182 1770890 1830533 1918909 2067004 2136631 2090949 2216612 2384934
12323 2384934 2454906 2430503 2271486 2247921 2348229 2323693 2361369 2162759 2009642 2039581
12313 2039581 2178400 2356173 2544920 2613865 2611482 2667136 2614379 2458178 2605561 2761998
$$ packed form
12388A287448J71004q1964j5072j46773q7600J65351n6795K9004J4010J1517K07157
12377A497287M1156J25225L0272j52677l2948j05012k277N2413m5412j17589l272
12366A287166n2912J53473Q9920p9370N974k9852J85304J42361r1141j46283o287
12355A458353J1719M6742P0528P8392P207r2697M4376J6022Q9636K8172j4469
12344A743981P6494r9244l6386J54945M5834O3792O0429k07334N1487J55503O614
12333B016115J6567j52500j09292N9643Q8376J48095O9627m5682J25663J68322
12323B384934O9972k4403j59017k3565J00308k4536L7676j98610j53117K9939
12313B039581J38819J77773J88747O8945k383N5654n2757j56201J47383J56437
$$ plain form
12303 2761998 2757646 2777087 2712182 2867655 2824338 2936315 2903735 2796242 2918208 3234557
12293 3234557 3293197 3411496 3449329 3493344 3448127 3256215 3210190 3151792 3325232 3399019 3347945
12282 3347945 3361105 3344607 3391292 3444933 3488328 3449634 3414465 3529510 3655821 3719837 3790382
12271 3790382 3681387 3762274 3977680 3983597 4084148 4232356 4398786 4360395 4234697 4134150
12261 4134150 4238289 4291596 4397308 4506286 4720741 4825695 4827759 4785508 4621526 4530430
12251 4530430 4498121 4612808 4707925 4903367 5081545 5188603 5263564 5372330 5407227 5486590
12241 5486590 5586770 5554018 5535715 5513807 5708086 5875904 5923564 6005712 6105789 6075683
12231 6075683 6188116 6275244 6204424 6173213 6288340 6221438 6136287 6348053 6496537 6456226
$$ packed form
12303B761998m352J9441o4905J55473m3317J11977l2580j07493J21966L16349
12293C234557N8640J18299L7833M4015m5217j91912m6025n8398J73440P3787n1074
12282C347945J3160j6498M6685N3641M3395l8694l5169J15045J26311O4016P0545
12271C790382j08995Q0887K15406N917J00551J48208J66430l8391j25698j00547
12261D134150J04139N3307J05712J08978K14455J04954K064m2251j63982r1096
12251D530430l2309J14687R5117J95442J78178J07058P4961J08766L4897P9363
12241E486590J00180l2752j8303k1908J94279J67818M7660Q2148J00077l0106
12231F075683J12433Q7128p0820l1211J15127o6902q5151K11766J48484m0311
$$ plain form
12221 6456226 6462039 6631839 6653207 6717722 6793587 6753961 6782780 6900226 6994363 7049911 6973471
12210 6973471 7035108 7040611 6949869 7118422 7317403 7313177 7370879 7444262 7420990 7280894 7319594
12199 7319594 7357987 7489087 7632598 7785036 7831871 7693175 7647500 7661353 7699718 7720707
12189 7720707 7654589 7627759 7726358 7872011 7977346 8269396 8372000 8189220 8107072 8094999
12179 8094999 8185607 8203268 8177035 8095278 8059066 8105190 8259422 8187653 7980704 7921032 7840210
12168 7840210 7799935 7840296 7856517 7849827 7873928 7950052 8086000 7946475 7788985 7585265 7582997
12157 7582997 7675693 7706248 7760680 7779760 7702176 7657645 7599134 7423536 7310643 7540023 7521466
12146 7521466 7381373 7354139 7184406 7014099 7123973 7226111 7216696 7189744 7265916 7202677
$$ packed form
12221F456226N813J69800K1368O4515P5865l9626K8819J17446R4137N5548p6440
12210F973471O1637N503r0742J68553J98981m226N7702P3383k3272j40096L8700
12199G319594L8393J31100J43511J52438M6835j38696m5675J3853L8365K0989
12189G720707o6118k6830R8599J45653J05335K92050J02604j82780q2148j2073
12179H094999R0608J7661k6233q1757l6212M6124J54232p1769k06949n9672q0822
12168G840210m0275M0361J6221o690K4101P6124J35948j39525j57490k03720k268
12157G582997R2696L0555N4432J9080p7584m4531n8511j75598j12893K29380j8557
12146G521466j40093k7234j69733j70307J09874J02138r415k6952P6172o3239
$$ plain form
12136 7202677 7024664 6934084 6895505 6849993 6871520 6849248 6737071 6447592 6293021 6149758
12126 6149758 6132511 6171100 6233466 6192689 6118434 6121767 6145210 6033563 5935831 5867579 5869655
12115 5869655 5764413 5753607 5848044 5765741 5711008 5681448 5638588 5632151 5400684 5284198 5257528
12104 5257528 5312618 5362796 5102512 4821331 4718708 4600942 4593074 4725468 4988563 4922926
12094 4922926 4925511 4884065 4819602 4562463 4534135 4621538 4770559 4645620 4575506 4497241 4471267
12083 4471267 4580090 4639389 4354674 4261171 4180820 3975364 3904876 3975563 3895079 3768777
12073 3768777 3803111 3738728 3648364 3657130 3746921 3880581 3760128 3577792 3580127 3424785 3385617
12062 3385617 3466763 3584096 3547223 3577845 3536257 3448926 3364059 3234704 3065943 3098503 3221832
$$ packed form
12136G202677j78013r0580l8579m5512K1527k2272j12177k89479j54571j43263
12126F149758j7247L8589O2366m0777p4255L333K3443j11647r7732o8252K076
12115E869655j05242j0806R4437q2303n4733k9560m2860o437k31467j16486k6670
12104E257528N5090N0178k60284k81181j02623j17766p868J32394K63095o5637
12094D922926K585m1446o4463k57139k8328Q7403J49021j24939p0114p8265k5974
12083D471267J08823N9299k84715r3503q0351k05456p0488P0687q0484j26302
12073C768777L4334o4383r0364Q766Q9791J33660j20453j82336K335j55342l9168
12062C385617Q1146J17333l6873L0622m1588q7331q4867j29355j68761L2560J23329
$$ plain form
12051 3221832 3118359 3157835 3126293 3191790 3149890 3115329 3073173 2986362 2922984 2791207 2755826
12040 2755826 2897718 2913059 2786516 2697638 2724535 2720235 2571340 2501903 2528007 2565677 2544187
12029 2544187 2484743 2529924 2626234 2657969 2764354 2677931 2424293 2478035 2545796 2506780 2369474
12018 2369474 2169843 2176882 2159058 2148011 2322979 2292494 2072915 1883318 2046259 2191384
12008 2191384 2188878 2266735 2161949 1902625 1859251 1762224 1792566 1824802 1756740 1833720 1693336
11997 1693336 1618114 1787119 1922443 1799291 1787434 1750234 1717248 1655197 1491311 1579598
11987 1579598 1742336 1933552 1915973 1659453 1616612 1784288 1793752 1767775 1784936 1747375 1640539
11976 1640539 1609194 1657529 1587947 1498967 1390786 1346535 1381683 1330478 1351122 1388030 1366050
$$ packed form
12051C221832j03473L9476l1542O5497m1900l4561m2156q6811o3378j31777l5381
12040B755826J41892J5341j26543q8878K6897m300j48895o9437K6104L7670k1490
12029B544187n9444M5181R6310L1735J06385q6423k53638N3742O7761l9016j37306
12018B369474j99631P039j7824j1047J74968l0485k19579j89597J62941J45125
12008B191384k506P7857j04786k59324m3374r7027L0342L2236o8062P6980j40384
11997A693336p5222J69005J35324j23152j1857l7200l2986o2051j63886Q8287
11987A579598J62738J91216j7579k56520m2841J67676R464k5977J7161l7561j06836
11976A640539l1345M8335o9582q8980j08181m4251L5148n1205K0644L6908k1980
$$ plain form
11965 1366050 1475440 1615029 1734568 1660894 1596445 1643458 1691424 1696779 1570703 1566431 1460636
11954 1460636 1166476 1238714 1303017 1223389 1130613 1039528 1001919 1074597 1089945 1172934 1117054
11943 1117054 1084657 1111002 951965 950180 1222444 1186702 1223274 1456506 1393741 1212853 1120803
11932 1120803 1150179 1126810 922331 959681 1025745 1287544 1315681 1150305 898817 985524
11922 985524 1144715 1113389 1062127 858334 793736 875863 982348 1033879 1132094 1143329 1021092
11911 1021092 928930 967968 932738 912747 926085 935476 888721 838614 977439 1023980 773256
11900 773256 666417 637145 572230 541008 597848 588329 654420 778558 805530 822124 890004
11889 890004 829106 760924 792623 757025 672502 640989 742316 936341 857487 772027 666990
$$ packed form
11965A366050J09390J39589J19539p3674o4449M7013M7966N355j26076m272j05795
11954A460636k94160P2238O4303p9628r2776r1085l7609P2678J5348Q2989n5880
11943A117054l2397K6345j59037j785K72264l5742L6572K33232o2765j80888r2050
11932A120803K9376k3369k04479L7350O6064K61799K8137j65376k51488Q6707
11922I85524J59191l1326n1262k03793o4598Q2127J06485N1531R8215J1235j22237
11911A021092r2162L9038l5230j9991J3338R391m6755n0107J38825M6541k50724
11900G73256j06839k9272o4915l1222N6840r519O6091J24138K6972J6594O7880
11889H90004o0898o8182L1699l5598q4523l1513J01327J94025p8854q5460j05037
$$ plain form
11878 666990 592284 629830 602368 744700 749211 724495 718752 721848 755060 759444 804192 831253
11866 831253 859883 764335 611982 765129 729209 659499 595921 590550 647435 724036 878049
11855 878049 776437 460069 198052 379781 524640 495667 532305 420815 259784 294963
11845 294963 387259 370048 524858 800187 932335 742940 518038 512091 415754 425503 529654
11834 529654 445821 341935 365543 532308 577378 554657 450468 518763 577874 409154 301045
11823 301045 284287 381359 349089 564761 617334 336790 98897 100401 131167 336440 400558
11812 400558 533339 750570 661906 658491 560242 351511 336230 314355 226043 214709 422517
11801 422517 543244 423935 461741 653348 506860 148863 203940 323804 332875 384757
$$ packed form
11878F66990p4706L7546k7462J42332M511k4716n743L096L3212M384M4748K7061
11866H31253K8630r5548j52353J53147l5920o9710o3578n371N6885P6601J54013
11855H78049j01612l16368k62017J81729J44859k8973L6638j11490j61031L5179
11845B94963R2296j7211J54810K75329J32148j89395k24902n947r6337R749J04151
11834E29654q3833j03886K3608J66765M5070k2721j04189O8295N9111j68720j08109
11823C01045j6758R7072l2270K15672N2573k80544k37893J504L0766K05273O4118
11812D00558J32781K17231q8664l415r8249k08731j5281k1875q8312j1334K07808
11801D22517J20727j19309L7806J91607j46488l57997N5077J19864R071N1882
$$ plain form
11791 384757 289483 199575 285964 354335 287291 318806 410650 519250 528783 364808 359348
11780 359348 379602 417052 462322 501909 635234 663839 749664 751746 587486 503008 671329
11769 671329 548330 296358 210439 157793 143123 47637 -4314 141017 93920 -91674 61388
11758 61388 144369 133410 141008 190984 341589 419127 353084 240815 255136 201750 131955
11747 131955 125768 159060 307114 277568 336996 432649 499268 343861 194405 219798 132049
11736 132049 125252 182355 147814 248347 290360 370606 465283 388771 258479 186765 180191
11725 180191 86851 119101 97808 204836 138183 74942 63972 168632 330962 430920 337831
11714 337831 209887 255622 250339 281757 333227 344355 283038 347430 386612 451562 498403
$$ packed form
11791C84757r5274q9908Q6389O8371o7044L1515R1844J08600R533j63975n460
11780C59348K0254L7450M5270L9587J33325K8605Q5825K082j64260q4478J68321
11769F71329j22999k51972q5919n2646j4670r5486n1951J45331m7097j85594J53062
11758F1388Q2981j0959P598M9976J50605P7538o6043j12269J4321n3386o9795
11747A31955o187L3292J48054k9546N9428R5653O6619j55407j49456K5393q7749
11736A32049o797N7103l4541J00533M2013Q0246R4677p6512j30292p1714o574
11725A80191r3340L2250k1293J07028o6653o3241j0970J04660J62330R9958r3089
11714C37831j27944M5735n283L1418N1470J1128o1317O4392L9182O4950M6841
$$ plain form
11703 498403 344959 206256 269166 388825 185100 -9718 -174092 -96097 123608 207762
11693 207762 102909 239595 304972 318270 428230 453052 424613 232466 66501 72737 240705
11682 240705 166684 105341 292060 226855 191682 253884 187489 109920 158261 301200 88625
11671 88625 -30345 79997 77698 188732 333754 289900 185055 184405 220355 224618 257456
11660 257456 278881 325532 225326 275178 259016 81954 66364 294046 370139 370457 494803
11649 494803 384274 406419 366261 220698 275333 279362 219905 163102 -24318 -48677 97522
11638 97522 233430 227412 166784 187576 185571 194843 145248 192777 230573 325086 329591 267714
11626 267714 126965 215313 297493 338547 129438 93484 140155 273528 314280 274548 191103
$$ packed form
11703D98403j53444j38703O2910J19659k03725j94818j64374P7995K19705Q4154
11693B07762j04853J36686O5377J3298J09960K4822k8439j92147j65965O236J67968
11682B40705p4021o1343J86719o5205l5173O2202o6395p7569M8341J42939k12575
11671H8625j18970J10342k299J11034J45022m3854j04845o50L5950M263L2838
11660B57456K1425M6651j00206M9852j6162j77062j5590K27682P6093L18J24346
11649D94803j10529K2145m0158j45563N4635M029n9457n6803j87420k4359J46199
11638I7522J35908o018o0628K0792k005R272m9595M7529L7796R4513M505o1877
11626B67714j40749Q8348Q2180M1054k09109l5954M6671J33373M0752l9732q3445
$$ plain form
11615 191103 268595 314724 372998 440023 375280 131247 20181 47483 -93974 -79025 28341
11604 28341 54755 195417 158658 279060 420336 490101 331487 187421 124203 21908
11594 21908 52065 148601 220499 96916 8369 77819 98400 342870 458459 358231 104961
11583 104961 166414 309614 378702 238921 161327 49213 5441 45508 305304 405230 338865
11572 338865 128065 106599 185559 201638 40041 30636 40888 35671 80615 17231 -70972
11561 -70972 -58829 124961 193415 206414 213524 62549 -15430 174439 192233 218821 333307
11550 333307 406122 465722 353314 232020 380091 329330 171069 207875 155867 87590 -26102
11539 -26102 -29199 43655 48225 65400 84765 109395 119059 150823 181194 67820 5914 -34761
$$ packed form
11615A91103P7492M6129N8274O7025o4743k44033j11066K7302j41457J4949J07366
11604B8341K6414J40662l6759J20402J41276O9765j58614j44066o3218j02295
11594B1908L0157R6536P1898j23583q8547O9450K0581K44470J15589j00228k53270
11583A04961O1453J43200O9088j39781p7594j12114m3772M0067K59796R9926o6365
11572C38865k10800k1466P8960J6079j61597r405J0252n217M4944o3384q8203
11561g0972J2143J83790O8454J2999P110j50975p7979J89869J7794K6588J14486
11550C33307P2815N9600j12408j21294J48071n0761j58261L6806n2008o8277j13692
11539b6102l097P2854M570J7175J9365K4630R664L1764L0371j13374o1906m0675
$$ plain form
11527 -34761 121117 30144 -193938 -150634 70793 104775 127078 144207 228791 246709 402786
11516 402786 373790 350965 266450 215765 330711 241923 60440 102790 253727 180143 77620
11505 77620 115795 141009 131890 200957 213316 223407 223479 106114 -12086 21571 -9422 109055
11493 109055 222675 273644 243837 19244 -10307 -10621 59133 82904 190567 174908 73905
11482 73905 90301 29763 87389 131476 91418 109437 203532 148597 61718 -59805 179044
11471 179044 409779 306644 301244 123082 184191 447688 371703 204216 99595 163006
11461 163006 246626 285911 201157 256504 124535 13704 -168355 -195841 -164009 -107504 75468
11450 75468 108241 94069 -125477 -148179 -16695 99186 198697 137465 38875 -141026 -121397
$$ packed form
11527c4761J55878r0973k24082M3304K21427L3982K2303J7129Q4584J7918J56077
11516D02786k8996k2825q4515n0685J14946q8788j81483M2350J50937p3584j02523
11505G7620L8175K5214r119O9067J2359J0091P2j17365j18200L3657l0993J18477
11493A09055J13620N0969k9807k24593k9551l14O9754K3771J07663j5659j01003
11482G3905J6396o0538N7626M4087m0058J8019R4095n4935q6879j21523K38849
11471A79044K30735j03135n400j78162O1109K63497p5985j67487j04621O3411
11461A63006Q3620L9285q4754N5347j31969j10831j82059k7486L1832N6505J82972
11450G5468L2773j4172k19546k2702J31484J15881R9511o1232r8590j79901J9629
$$ plain form
11439 -121397 39528 54582 64700 102833 165489 226969 306239 394448 328867 205144 69317
11428 69317 -194725 -320917 -313089 -197016 24872 69932 115768 309000 395668 184328 -34446
11417 -34446 -30057 39598 -44425 3447 81438 341888 315912 389538 284889 162639 172761
11406 172761 49462 7400 -138 125850 272677 234996 327942 225654 130059 110645 206684
11395 206684 268270 323478 307851 221805 277730 416189 439967 333740 211011 124606 117623
11384 117623 61210 -31435 -33492 -151212 -294643 -194772 2089 70869 120018 129830 328106
11373 328106 368093 269510 177157 2867 13337 13470 62391 186232 184923 209635 132499 38430
11361 38430 -13283 -29081 -30137 -128941 -170050 -188619 -28855 183152 170539 208452 208959 264376
$$ packed form
11439a21397J60925J5054J0118L8133O2656O1480P9270Q8209o5581j23723j35827
11428F9317k64042j26192P828J16073K21888M5060M5836J93232Q6668k11340k18774
11417c4446M389O9655q4023M7872P7991K60450k5976P3626j04649j22250J0122
11406A72761j23299m2062p538J25988J46827l7681R2946j02288r5595j9414R6039
11395B06684O1586N5208j5627q6046N5925J38459K3778j06227j22729q6405o983
11384A17623n6413r2645k057j17720j43431R9871J96861O8780M9149R812J98276
11373C28106L9987r8583r2353j74290J0470J33M8921J23841j309K4712p7136r4069
11361C8430n1713j5798j056r8804m1109j8569J59764K12007j2613L7913N07N5417
$$ plain form
11349 264376 182814 119050 97378 72070 36236 18763 70672 165773 173211 131894 170830 135915
11337 135915 -71093 -21963 201473 295829 436169 411367 276206 -32777 6854 136091
11327 136091 28090 -49741 -228469 -330042 -269335 -150979 14743 -23223 -106519 -160821
11317 -160821 -18460 37440 -100047 -91595 -66939 -63961 -6063 59261 112839 182776 69378
11306 69378 97802 -30214 -5942 89866 195826 90545 -121970 -41606 144464 329367
11296 329367 207178 110314 93294 87605 74542 -45450 -144006 -179225 -178220 37338 79886
11285 79886 -51625 -37990 -112474 112224 291818 207503 23719 -92686 -148555 -107467 -116442
11274 -116442 -217649 -298208 -155956 -45683 128458 217434 221701 251492 162535 87170 123832
$$ packed form
11349B64376q1562o3764k1672k5308l5834j7473N1909R5101P438m1317L8936l4915
11337A35915k07008M9130K23436R4356J40340k4802j35161l08983L9631J29237
11327A36091j08001p7831j78728j01573O0707J18356J65722l7966q3296n4302
11317a60821J42361N5900j37487Q452K4656K978N7898O5324N3578O9937j13398
11306F9378K8424j28016K4272R5808J05960j05281k12515Q0364J86070J84903
11296C29367j22189r6864j7020n689j3063j19992r8556l5219J005K15558M2548
11285G9886j31511J3635p4484K24698J79594q4315j83784j16405n5869M1088q975
11274a16442j01207q0559J42252J10273J74141Q8976M267K9791q8957p5365L6662
$$ plain form
11263 123832 81258 210518 230782 157783 49775 -6724 177644 77144 -87395 -164805
11253 -164805 -67071 110010 70686 5095 146552 138290 108035 271304 224543 201649 277717
11242 277717 280573 284092 320000 330778 347854 426810 159154 -17319 116039 -29710 -41477
11231 -41477 66943 190970 202152 413684 339234 190671 216734 188721 169211 88046 103824
11220 103824 148951 52372 -23528 70438 130953 -6956 -31790 -53820 -51474 -18468 -133255
11209 -133255 -191353 -205397 -201482 -103758 -1846 37201 73170 131577 111878 282748 166060
11198 166060 48439 -56830 -3874 -90447 -174966 -168595 -108126 -101133 8235 82783 141314
11187 141314 85253 127270 179260 218128 97955 -49270 -94864 -119769 -99277 -20632 32803
$$ packed form
11263A23832m2574J29260K0264p2999j08008n6499J84368j00500j64539p7410
11253a64805R7734J77081l9324o5591J41457q262l0255J63269m6761k2894P6068
11242B77717K856L519L5908J0778J7076P8956k67656j76473J33358j45749j1767
11231d1477J08420J24027J1182K11532p4450j48563K6063k8013j9510q1165J5778
11220A03824M5127r6579p5900R3966O0515j37909k4834k2030K346L3006j14787
11209a33255n8098j4044L915R7724J01912L9047L5969N8407j9699J70870j16688
11198A66060j17621j05269N2956q6573q4519O371O0469O993J09368P4548N8531
11187A41314n6061M2017N1990L8868j20173j47225m5594k4905K0492P8645N3435
$$ plain form
11176 32803 102858 -20875 -77608 -76074 -129034 -207360 -134939 -60438 -81856 -198732 -156789
11165 -156789 -387 266540 449296 303105 187534 61272 -23250 -274512 -382679 -225806
11155 -225806 -181629 34769 -31482 -134293 -50898 127117 250451 236523 174083 43108
11145 43108 55391 -56669 -65281 76750 -22678 -37325 18633 102868 273734 225821 -44502
11134 -44502 -84375 -67566 -62493 8039 28866 -180250 -309550 -243634 -277200 -223399 -136115
11123 -136115 -166697 -108009 -65068 -45097 -229754 -318742 -176633 -144691 -181122 -171210 -259570
11112 -259570 -174773 65991 109333 -126486 -148877 -98181 79365 -10984 23071 35131 85049
11101 85049 219578 281734 320801 277764 77260 -1251 -103454 -89357 -40287 -233208 -402343
$$ packed form
11176C2803P0055j23733n6733J534n2960p8326P2421P4501k1418j16876M1943
11165a56789J56402K66927J82756j46191j15571j26262q4522k51262j08167J56873
11155b25806M4177K16398o6251j02811Q3395J78015J23334j3928o2440j30975
11145D3108J2283j12060q612J42031r9428j4647N5958Q4235J70866m7913k70323
11134d4502l9873J6809N073P0532K0827k09116j29300O5916l3566N3801Q7284
11123a36115l0582N8688M2941J9971j84657q8988J42109L1942l6431R912q8360
11112b59570Q4797K40764M3342k35819k2391N0696J77546r0349L4055J2060M9918
11101H5049J34529O2156L9067m3037k00504p8511j02203J4097M9070j92921j69135
$$ plain form
11090 -402343 -584809 -242015 182636 266631 11390 -58734 -9324 -131745 -328978 -303471
11080 -303471 -177789 28345 88942 -53060 -117633 -145672 49465 81339 -7789 -223079
11070 -223079 -142493 -83671 -172741 -171456 -99514 -187304 -280341 -304548 -251880 -160843 -206686 -59654
11058 -59654 -146574 -392334 -280912 722 63175 -54739 -91018 -79740 48373 80432 -86805
11047 -86805 19959 232102 88363 -112043 -66710 18309 -68918 -95122 -127005 -130761 -96483
11036 -96483 112947 14785 -230960 -232426 -98918 -141443 -82457 -78317 -87724 -26489 147108
11025 147108 202428 6481 -23531 -187953 -169527 -72132 9751 -73897 447 14423 61112
11014 61112 144961 -20602 -101192 -30051 -200611 -273887 -262066 -225766 -186105 -253372 -281415
$$ packed form
11090d02343j82466L42794M24651Q3995k55241p0124M9410j22421j97233K5507
11080c03471J25682K06134O0597j42002o4573k8039J95137L1874q9128k15290
11070b23079Q0586N8822q9070J285P1942q7790r3037k4207N2668R1037m5843J47032
11058e9654q6920k45760J11422K81634O2453j17914l6279J1278J28113L2059j67237
11047h6805J06764K12143j43739k00406M5333Q5019q7227k6204l1883l756L4278
11036i6483K09430r8162k45745j466J33508m2525N8986M140r407O1235J73597
11025A47108N5320j95947l0012j64422J8426R7395Q1883q3648P4344J3976M6689
11014F1112Q3849j65563q0590P1141j70560p3276J1821L6300L9661o7267k8043
$$ plain form
11003 -281415 -319552 -296361 -333409 -223536 -119368 -109119 -61256 -99982 -155946 82272 186502
10992 186502 90829 143469 14505 38662 87749 -18558 -3404 -10832 -43065 30366 94278
10981 94278 168940 228136 192028 221937 125355 35648 -69174 -164519 -75957 -21901 -12058 181654
10969 181654 138057 -44210 -70796 108880 117003 70398 167389 168352 258259 84956 -50673
10958 -50673 -150441 -76186 5880 -111686 -259424 -302706 -120461 169920 328164 269567 127412
10947 127412 -5579 92819 69824 -112934 -104529 -42108 -5005 31772 19058 -79316 -60214
10936 -60214 -6108 38123 45928 -81010 -76350 94442 23637 -4702 56353 -66862 -75675 -70335
10924 -70335 1677 67931 13198 43289 14155 -62426 -130543 -33594 75238 132511 170408
$$ packed form
11003b81415l8137K3191l7048J09873J04168J0249M7863l8726n5964K38218J04230
10992A86502r5673N2640j28964K4157M9087j06307J5154p428l2233P3431O3912
10981I4278P4662N9196l6108K9909r6582q9707j04822r5345Q8562N4056R843J93712
10969A81654m3597j82267k6586J79676Q123m6605R6991R63Q9907j73303j35629
10958e0673r9768P4255Q2066j17566j47738m3282J82245K90381J58244n8597j42155
10947A27412j32991R8398k2995j82758Q405O2421L7103L6777j2714r8374J9102
10936f0214N4106M4231P805j26938M660J70792p0805k8339O1055j23215q813N340
10924g0335P2012O6254n4733L0091k9134p6581o8117R6949J08832N7273L7897
$$ plain form
10913 170408 12505 -6530 37284 -19281 -114982 -59460 40426 4116 -46453 -213437 -122511
10902 -122511 88658 -90528 -122305 -15312 -31183 -151507 -155111 7752 130096 184403
10892 184403 95051 -125983 98041 167192 -113862 -332085 -383665 -189724 -142901 -232888
10882 -232888 -357757 -266135 -122270 -29215 -46792 65170 158206 81047 25047 -766 -166079
10871 -166079 -107568 -195998 -342425 -269879 -226536 -126908 -150011 -288563 -343526 -316133 -135178
10860 -135178 -66192 -80178 -41853 110401 83495 -110286 -6467 -109599 -252548 -162032
10850 -162032 -98007 -97449 -66680 52112 359569 435151 308669 165636 123958 33577 -55929
10839 -55929 40069 52048 29652 -153591 -285204 -283184 -305383 -243099 -64979 147238 174269
$$ packed form
10913A70408j57903j9035M3814n6565r5701N5522R9886l6310n0569j66984R0926
10902a22511K11169j79186l1777J06993j5871j20324l604J62863J22344N4307
10892A84403q9352k21034K24024O9151k81054k18223n1580J93941M6823q9987
10882b32888j24869R1622J43865R3055j7577J11962R3036p7159n6000k5813j65313
10871a66079N8511q8430j46427P2546M3343R9628k3103j38552n4963K7393J80955
10860a35178O8986j3986L8325J52254k6906j93781J03819j03132j42949R0516
10850a62032O4025N58L0769J18792L07457P5582j26482j43033m1678r0381q9506
10839e5929R5998J1979k2396j83243j31613K020k2199O2284J78120K12217K7031
$$ plain form
10828 174269 100734 -107957 -191830 -26553 137509 102917 78283 -8704 93013 139744 143621
10817 143621 54715 37608 -73424 -125531 -79199 -53210 9019 -18889 -274251 -467124 -474690
10806 -474690 -279996 35539 20909 -63383 -3979 148449 87981 117827 -72936 -67388 41451
10795 41451 34866 76498 145899 151391 156709 190450 157766 210284 368852 410687 248741 25570
10783 25570 -72533 -1912 64924 189960 269004 227021 215546 -14702 -121737 93158 116339
10772 116339 75777 -20442 -93341 -32084 62440 60405 7244 -185049 -271858 -243102 -257964
10761 -257964 -229339 -30894 -82796 -128942 -280641 -231871 -182231 -123595 -211657 -98044 74214
10750 74214 142454 264956 390212 246744 116012 -6822 -111746 -254431 -240078 -205790
$$ packed form
10828A74269p3535k08691q3873J65277J64062l4592k4634q6987J01717M6731L877
10817A43621q8906j7107j11032n2107M6332K5989O2229k7908k55362j92873p566
10806d74690J94694L15535j4630q4292N9404J52428o0468K9846j90763N548J08839
10795D1451o585M1632O9401N492N318L3741l2684N2518J58568M1835j61946k23171
10783B5570r8103P0621O6836J25036P9044m1983j1475k30248j07035K14895K3181
10772A16339m0562r6219p2899O1257R4524k035n3161j92293q6809K8756j4862
10761b57964K8625J98445n1902m6146j51699M8770M9640N8636q8062J13613J72258
10750G4214O8240J22502J25256j43468j30732j22834j04924j42685J4353L4288
$$ plain form
10740 -205790 -218224 -378730 -449581 -275608 -147202 -35413 9310 -727 -124806 -169631
10730 -169631 -234110 -399700 -252456 -275155 -146056 27360 58775 3545 -201603 -245667
10720 -245667 -200809 -236590 -332810 -161475 -21472 47670 242811 262240 161984 82432 26942
10709 26942 -141655 -40418 40142 99743 38462 43702 -22052 -56541 -97673 -49919 -13881
10698 -13881 72056 108465 20729 -183306 -230229 -176335 -16282 -96641 -112880 -204178 -175603
10687 -175603 -24384 -36794 21185 -5580 60853 -12678 -109506 -77158 88983 183318 53034
10676 53034 23929 51658 74411 108792 33267 -100505 -267539 -165991 76453 67900 125783
10665 125783 116007 33401 -54545 -152453 -203426 -54480 794 29030 63342 -54577 -48136
$$ packed form
10740b05790j2434j60506p0851J73973J28406J11789M4723j0037j24079m4825
10730a69631o4479j65590J47244k2699J29099J73416L1415n5230k05148m4064
10720b45667M4858l5781r6220J71335J40003O9142J95141J9429j00256p9552n5490
10709B6942j68597J01237Q0560N9601o1281N240o5754l4489m1132M7754L6038
10698a3881Q5937L6409q7736k04035m6923N3894J60053q0359j6239r1298K8575
10687a75603J51219j2410N7979k6765O6433p3531r6828L2348J66141R4335j30284
10676E3034k9105K7729K2753L4381p5525j33772j67034J01548K42444q553N7883
10665A25783r776q2606q7946r7908n0973J48946N5274K8236L4312j17919O441
$$ plain form
10654 -48136 46911 167721 36506 -208455 -293888 -232619 -285290 -271527 20800 131616 -58452
10643 -58452 -230430 -183456 -84928 -158193 -199362 -49290 119999 34902 -105643 -119038 -71566
10632 -71566 9325 -3058 -47966 -98948 -143821 -281375 -155684 68319 39397 25004 36124
10621 36124 53589 48548 117609 54603 104491 119908 -13169 -108105 -82816 117618 161122
10610 161122 -11323 -37301 -62885 -87722 -115521 -257288 -364437 -270036 -110220 -64152 12674
10599 12674 -88882 -156294 -149906 -256182 -355563 -228576 -149637 -197196 -163211 -160593 -197806
10588 -197806 -349424 -327490 -425568 -360518 -298535 -186936 -152168 -107348 -31639 -120622 -309644
10577 -309644 -331141 -398307 -142542 12173 5072 -167412 -221119 -239913 -147974 -143826 -110796
$$ packed form
10654d8136R5047J20810j31215k44961q5433O1269n2671J3763K92327J10816j90068
10643e8452j71978M6974R8528p3265m1169J50072J69289q5097j40545j3395M7472
10632g1566Q0891j2383m4908n0982m4873j37554J25691K24003k8922j4393J1120
10621C6124J7465n041O9061o3006M9888J5417j33077r4936K5289K00434M3504
10610A61122j72445k5978k5584k4837k7799j41767j07149R4401J59816M6068P6826
10599A2674j01556o7412O388j06276r9381J26987P8939m7559L3985K618l7213
10588a97806j51618K1934r8078O5050O1983J11599L4768M4820P5709q8983j89022
10577c09644k1497o7166K55765J54715p101j72484n3707j8794R1939M148L3030
$$ plain form
10566 -110796 -100662 -126181 -131471 -194811 -72782 -39587 28308 159615 100467 109699 45951
10555 45951 18615 29873 -27617 -67850 58255 107297 177047 98701 94846 117360 -56413
10544 -56413 -279645 -148729 3406 36908 89055 73203 -331831 -366892 -49361 -8303 89108
10533 89108 69457 45693 119844 12922 -90711 -57115 -42493 99159 98762 71518 127449
10522 127449 9100 -78967 -123764 -252803 -213823 -49191 135584 138103 -8575 7573 158488
10511 158488 43299 -49697 46839 40754 55793 38747 -35306 91912 137310 77115 138584
10500 138584 208334 307463 305172 228217 282863 238233 75644 -52483 -62227 33295 27513 27567
10488 27567 -170249 -106603 -17654 10915 48692 135955 86630 -318275 -403718 -363998 -268582
$$ packed form
10566a10796J0134k5519n290o3340J22029L3195O7895J31307n9148R232o3748
10555D5951k7336J1258n7490m0233J26105M9042O9750p8346l855K2514j73773
10544e6413k23232J30916J52135L3502N2147j5852m05034l5061L17531M1058R7411
10533H9108j9651k3764P4151j06922j03633L3596J4622J41652l97k7244N5931
10522A27449j18349q8067m4797j29039L8980J64632J84775K519j46678J6148J50915
10511A58488j15189r2996R6536o085J5039j7046p4053J27218M5398o0195O1469
10500A38584O9750R9129k291p6955N4646m4630j62589j28127r744R5522n782N4
10488B7567j97816O3646Q8949K8569L7777Q7263m9325m04905q5443L9720R5416
$$ plain form
10477 -268582 -298794 -340895 -353262 -400119 -300775 -282109 -101757 -7467 52741 142243 -21654
10466 -21654 -68706 34704 84216 -113699 -22254 76654 61005 -83684 -172237 -76355 50586
10455 50586 -36143 -210785 -364646 -341562 -257860 -185599 -2826 133420 157235 100507 -44644
10444 -44644 -57546 -140299 -184231 -224142 -399520 -412596 -294991 -180919 -209946 -211007 -171865
10433 -171865 -151485 -92761 -93665 42620 152815 108008 174156 166393 244173 42902 -98165
10422 -98165 -57121 28656 -71276 -63615 -79925 -87573 -10410 -104711 -143491 -211280 -60987 -64414
10410 -64414 -205836 -218866 -122309 -151934 -20605 45666 249532 195586 227149 118474 66125
10399 66125 156357 252917 208837 -5462 50119 32886 49006 -64203 -29921 -71425 -178467
$$ packed form
10477b68582l0212m2101j2367m6857R9344J8666J80352R4290O0208Q9502j63897
10466b1654m7052J03410M9512j97915R1445R8908j5649j44689q8553R5882J26941
10455E0586q6729j74642j53861K3084Q3702P2261J82773J36246K3815n6728j45151
10444d4644j2902q2753m3932l9911j75378j3076J17605J14072k9027j061L9142
10433a71865K0380N8724r04J36285J10195m4807O6148p763P7780k01271j41067
10422i8165M1044Q5777r9932P661j6310p648P7163r4301l8780o7789J50293l427
10410f4414j41422j3030R6557k9625J31329O6271K03866n3946L1563j08675n2349
10399F6125R0232R6560m4080k14299N5581j7233J6120j13209L4282m1504j07042
$$ plain form
10388 -178467 -44709 75392 113045 69132 -9625 -118880 36093 16369 -138409 -30224
10378 -30224 -100982 -200911 -160421 -54257 -9358 122152 166619 128908 110419 158852 380155
10367 380155 359253 195411 -80655 -168342 -84076 -72715 -85803 -79324 -34397 -61854 -150649
10356 -150649 -93467 -137215 -148974 -78252 -138544 -256839 -113539 -63890 -62269 -24925 -156856
10345 -156856 -126409 35995 -52406 -205363 -118035 -14009 79197 84750 142684 123615 195501
10334 195501 355714 183565 94271 -120624 -212343 -9707 -127567 -188854 -104804 -13839
10324 -13839 -60263 79126 248533 326091 146372 -76226 -103208 -104926 -164668 -91385 -56013
10313 -56013 81646 259507 245460 221896 308836 189074 -43412 -51609 101647 215665 89771
$$ packed form
10388a78467J33758J20101L7653m3913p8757j09255J54973j9724j54778J08185
10378c0224p0758r9929M0490J06164M4899J31510M4467l7711j8489M8433K21303
10367C80155k0902j63842k76066q7687Q4266J1361j3088O479M4927k7457q8795
10356a50649N7182m3748j1759P0722o0292j18295J43300M9649J621L7344j31931
10345a56856L0447J62404q8401j52957Q7328J04026R3206N553N7934j9069P1886
10334A95501J60213j72149q9294k14895r1719K02636j17860o1287Q4050R0965
10324a3839m6424J39389J69407P7558j79719k22598k6982j718n9742P3283L5372
10313e6013J37659J77861j4047k3564Q6940j19762k32486q197J53256J14018j25894
$$ plain form
10302 89771 -194622 -305868 -255707 -72541 -78552 -83941 -50700 -87009 -374631 -464696 -245271
10291 -245271 -217824 -161981 -10957 -151569 -190941 -66180 -40441 62077 10789 -79089 -100117
10280 -100117 -79856 13187 9542 -84711 -33426 56840 -61165 -215009 -36464 161678 193627
10269 193627 -36779 -62662 7226 42276 -60557 119853 381059 401980 221645 1646
10259 1646 1501 422839 373556 123308 71655 134553 -53387 114715 144880 -63153 -58485
10248 -58485 18959 63083 -4178 44881 147389 70495 -131211 -228842 -203199 -198756 -171561
10237 -171561 -145626 -75553 -74703 -36942 141580 65210 -34356 55022 -69189 -44361 16839
10226 16839 -22477 139450 6278 -60567 -48715 28724 -64573 -1563 247535 175713 60763
$$ packed form
10302H9771k84393j11246N0161J83166o011n389L3241l6309k87622r0065K19425
10291b45271K7447N5843J51024j40612l9372J24761K5739J02518n1288q9878k1028
10280a00117K0261R3043l645r4253N1285R0266j18005j53844J78545J98142L1949
10269A93627k30406k5883O9888L5050j02833J80410K61206K0921j80335k19999
10259A646j45M21338m9283k50248n1653O2898j87940J68102L0165k08033M668
10248e8485P7444M4124o7261M9059J02508p6894k01706r7631K5643M443K7195
10237a71561K5935P0073Q50L7761J78522p6370r9566Q9378j24211K4828O1200
10226A6839l9316J61927j33172o6845J1852P7439r3297O3010K49098p1822j14950
$$ plain form
10215 60763 114138 385995 521881 504155 351198 246947 93914 127433 143236 27327
10205 27327 15147 -41642 -193183 -150125 -67149 53995 84915 48149 125149 61457 -205624
10194 -205624 -181802 -163196 -153553 112189 254866 450400 316334 150370 112954 179725 51742
10183 51742 -143173 -263486 -161521 -79398 -105295 -44846 66347 210049 253155 169632 87836
10172 87836 141297 126352 281288 43429 -154872 -122340 -176221 -143435 -88181 -254067 -209991
10161 -209991 -130733 -138033 25236 35429 81673 25633 47601 51810 60811 50860 139582 333683
10149 333683 286497 208010 208679 236104 196140 151480 169015 -86629 49314 166030 305190
10138 305190 281222 131730 65532 74730 165773 285455 377668 327667 -871 -137760 64202
$$ packed form
10215F0763N3375K71857J35886j7726j52957j04251j53033L3519J5803j15909
10205B7327j2180n6789j51541M3058Q2976J21144L0920l6766P7000o3692k67081
10194b05624K3822J8606R643K65742J42677J95534j34066j65964l7416O6771j27983
10183E1742j94915j20313J01965Q2123k5897O0449J11193J43702M3106q3523q1796
10172H7836N3461j4945J54936k37859j98301L2532n3881L2786N5254j65886M4076
10161b09991P9258p300J63269J0193M6244n6040K1968M209R001r951Q8722J94101
10149C33683m7186p8487O69K7425l9964m4660J7535k55644J35943J16716J39160
10138C05190k3968j49492o6198R198R1043J19682R2213n0001l28538j36889K01962
$$ plain form
10127 64202 109424 -11437 60983 189995 112304 -24358 -98666 -182235 -190198 -225023 27092
10116 27092 69876 54125 99898 259867 346826 219619 135348 267117 106228 -107593 -198072
10105 -198072 -155445 -77735 -81666 -8558 143760 78216 41942 200371 192276 269199 344318
10094 344318 338672 129118 37194 114220 4837 -132284 -243596 -143153 -81726 -47999 16326
10083 16326 -41184 -9658 -7188 3030 94378 39890 -106472 -154397 -53678 154905 211683
10072 211683 190374 -58978 -74316 -48532 -73020 -56164 -35171 -55223 -29777 18653 -3958
10061 -3958 -12483 -156829 -143130 -4601 2423 201035 315260 299576 436766 693940 1055696
$$ packed form
10127F4202M5222j20861P2420J29012p7691j36662p4308q3569p963l4825K52115
10116B7092M2784j5751M5773J59969Q6959j27207q4271J31769j60889k13821r0479
10105a98072M2627P7710l931P3108J52318o5544l6274J58429q095P6923P5119
10094C44318n646k09554r1924P7026j09383j37121j11312J00443O1427L3727O4325
10083A6326n7510L1526K470J0218R1348n4488j46362m7925J00719K08583N6778
10072B11683k1309k49352j5338K5784k4488J6856K0993k0052K5446M8430k2611
10061c958q525j44346J3699J38529P024J98612J14225j5684J37190K57174L61756
$$ [...]
##END NTUPLES=NMR SPECTRUM
##END=
