##TITLE=Analysis number 322679
Compound Code cc 47514
Book Reference 508/4
Project Code adrs
Chemist Name antons
##JCAMPDX= 6.0         $$ Bruker NMR JCAMP-DX V2.0
##DATA TYPE= NMR SPECTRUM
##DATA CLASS= NTUPLES
##ORIGIN= Bruker BioSpin GmbH
##OWNER= nmr
$$ XWIN-NMR		Version 3.5
$$ Fri Oct 13 11:02:29 2006 GMT Daylight Time (UT+1h)  MAYBRIDGE\nmr@NMR_250MHZ
##.OBSERVE FREQUENCY= 250.131544655141
##.OBSERVE NUCLEUS= ^1H
##.ACQUISITION MODE= SIMULTANEOUS (DQD)
##.ACQUISITION SCHEME= undefined
##.AVERAGES= 16
##.DIGITISER RES= 18
##SPECTROMETER/DATA SYSTEM= dpx250
##.PULSE SEQUENCE= zg30
##.SOLVENT NAME= CDCl3
##.SHIFT REFERENCE= (INTERNAL, CDCl3, 0, 16.522)
##AUDIT TRAIL= $$ (NUMBER, WHEN, WHO, WHERE, WHAT)
$$ ##TITLE= Audit trail, XWIN-NMR		Version 3.5
$$ ##JCAMPDX= 5.01
$$ ##ORIGIN= Bruker BioSpin GmbH
$$ ##OWNER= nmr
$$ C:\u/data/dgb/nmr/ADRS/190/pdata/1/auditp.txt
$$ ##AUDIT TRAIL=  $$ (NUMBER, WHEN, WHO, WHERE, WHAT)
(   1,<2006-10-13 11:02:07.71 +100>,<MAYBRIDGE\nmr>,<NMR_250MHZ>,
      <created by zg, POWCHK disabled, PULCHK disabled
       configuration hash MD5:
       49 4B E0 1D 92 C2 6B 37 9F E6 65 BC 52 41 86 1D
       data hash MD5: 64K
       D0 B0 5D 7C 4D 65 5E 82 50 9E 74 22 EA 89 82 80>)
(   2,<2006-10-13 11:02:21.04 +100>,<MAYBRIDGE\nmr>,<NMR_250MHZ>,
      <Start of raw data processing
       ef LB = 0.3 FT_mod = 6 PKNL = 1 SI = 32K 
       data hash MD5: 32K
       58 16 11 89 8D 10 A2 E4 C3 95 5B ED 11 5C 7E 71>)
(   3,<2006-10-13 11:02:22.68 +100>,<MAYBRIDGE\nmr>,<NMR_250MHZ>,
      <apk 
       data hash MD5: 32K
       68 1A 9A A1 B6 33 B3 47 54 D4 0D B0 9F 1C 71 66>)
(   4,<2006-10-13 11:02:23.43 +100>,<MAYBRIDGE\nmr>,<NMR_250MHZ>,
      <abs ABSG = 5 
       data hash MD5: 32K
       93 BE 25 68 17 A3 95 C1 57 CD 31 62 51 15 97 20>)
$$ ##END=
$$ 
$$ hash MD5
$$ 83 62 54 2B EB 3F D7 F8 36 18 22 AF 3F 29 86 74
##$RELAX= 
##$RELAX= 
##$RELAX= 
##$RELAX= 
##$RELAX= 
##$RELAX= 
##$RELAX= 
$$ Bruker specific parameters
$$ --------------------------
##$DU= <C:\u>
##$EXPNO= 190
##$NAME= <ADRS>
##$PROCNO= 1
##$TYPE= <nmr>
##$USER= <dgb>
##$AMP= (0..31)
100 100 100 100 100 100 100 100 100 100 100 100 100 100 100 100 100 100 
100 100 100 100 100 100 100 100 100 100 100 100 100 100 
##$AQSEQ= 0
##$AQ_mod= 3
##$AUNM= <au_zg>
##$AUTOPOS= <21 >
##$BF1= 250.13
##$BF2= 250.13
##$BF3= 250.13
##$BF4= 250.13
##$BF5= 500.13
##$BF6= 500.13
##$BF7= 500.13
##$BF8= 500.13
##$BYTORDA= 1
##$CFDGTYP= 0
##$CFRGTYP= 5
##$CHEMSTR= <none>
##$CNST= (0..31)
1 1 145 1 1 1 1 1 1 1 1 1 1 1 1 1 1 1 1 1 1 1 1 1 1 1 1 1 1 1 1 1 
##$CPDPRG= <>
##$CPDPRG1= <>
##$CPDPRG2= <>
##$CPDPRG3= <>
##$CPDPRG4= <mlev>
##$CPDPRG5= <mlev>
##$CPDPRG6= <mlev>
##$CPDPRG7= <mlev>
##$CPDPRG8= <mlev>
##$CPDPRGB= <>
##$CPDPRGT= <>
##$D= (0..31)
0 1 0 0 0 0 0 0 0 0.06 0 0 0 0 0 0 0.0002 0 0 0 0 0 0 0 0 0 0 0 0 0 0 
0 
##$DATE= 1160733726
##$DBL= (0..7)
120 120 120 120 120 120 120 120 
##$DBP= (0..7)
150 150 150 150 150 150 150 150 
##$DBP07= 0
##$DBPNAM0= <>
##$DBPNAM1= <>
$$ [...]
##$SUBNAM7= <"">
##$SUBNAM8= <"">
##$SUBNAM9= <"">
##$SW= 20.6930455092707
##$SWIBOX= (0..15)
0 0 3 0 0 0 0 0 0 0 0 0 0 0 0 0 
##$SW_h= 5175.983436853
##$TD= 65536
##$TD0= 1
##$TE= 683.16
##$TE2= 300
##$TE3= 300
##$TEG= 300
##$TL= (0..7)
0 120 120 120 120 120 120 120 
##$TP= (0..7)
150 150 150 150 150 150 150 150 
##$TP07= 0
##$TPNAME0= <>
##$TPNAME1= <>
##$TPNAME2= <>
##$TPNAME3= <>
##$TPNAME4= <>
##$TPNAME5= <>
##$TPNAME6= <>
##$TPNAME7= <>
##$TPOAL= (0..7)
0.5 0.5 0.5 0.5 0.5 0.5 0.5 0.5 
##$TPOFFS= (0..7)
0 0 0 0 0 0 0 0 
##$TUNHIN= 0
##$TUNHOUT= 0
##$TUNXOUT= 0
##$USERA1= <user>
##$USERA2= <user>
##$USERA3= <user>
##$USERA4= <user>
##$USERA5= <user>
##$V9= 5
##$VALIST= <valist>
##$VCLIST= <CCCCCCCCCCCCCCC>
##$VD= 0
##$VDLIST= <DDDDDDDDDDDDDDD>
##$VPLIST= <PPPPPPPPPPPPPPP>
##$VTLIST= <TTTTTTTTTTTTTTT>
##$WBST= 1024
##$WBSW= 4
##$XGAIN= (0..3)
0 0 0 0 
##$XL= 0
##$YL= 0
##$YMAX_a= 551647
##$YMIN_a= -295985
##$ZGOPTNS= <>
##$ZL1= 120
##$ZL2= 120
##$ZL3= 120
##$ZL4= 120
##$ABSF1= 16.522
##$ABSF2= -4.171173
##$ABSG= 5
##$ABSL= 3
##$ALPHA= 0
##$AQORDER= 0
##$ASSFAC= 0
##$ASSFACI= 0
##$ASSFACX= 0
##$ASSWID= 0
##$AUNMP= <proc_1d>
##$AZFE= 0.1
##$AZFW= 0.1
##$BCFW= 0
##$BC_mod= 0
##$BYTORDP= 0
##$COROFFS= 0
##$CY= 12.5
##$DATMOD= 1
##$DC= 0
##$DFILT= <>
##$DTYPP= 0
##$F1P= 14.0000005364418
##$F2P= -0.99999901652339
##$FCOR= 0.5
##$FTSIZE= 32768
##$FT_mod= 6
##$GAMMA= 0
##$GB= 0
##$INTBC= 1
##$INTSCL= 1
##$ISEN= 128
##$LB= 0.3
##$LEV0= 0
##$LPBIN= 0
##$MAXI= 10000
##$MC2= 0
##$MEAN= 0
##$ME_mod= 0
##$MI= 0
##$NCOEF= 0
##$NC_proc= -4
##$NLEV= 6
##$NOISF1= 0
##$NOISF2= 0
##$NSP= 0
##$NTH_PI= 0
##$NZP= 0
##$OFFSET= 16.522
##$PC= 1
##$PHC0= -47.54403
##$PHC1= 10.82802
##$PH_mod= 1
##$PKNL= yes
##$PPARMOD= 0
##$PSCAL= 4
##$PSIGN= 0
##$REVERSE= no
##$SF= 250.13
##$SI= 32768
##$SIGF1= 0
##$SIGF2= 0
##$SINO= 400
##$SIOLD= 32768
##$SREGLST= <1H.CDCl3>
##$SSB= 0
##$STSI= 32768
##$STSR= 0
##$SW_p= 5175.98343685301
##$SYMM= 0
##$S_DEV= 0
##$TDeff= 65536
##$TDoff= 0
##$TI= <Analysis number 999999
Compound Code 99
Book Reference 9
Project Code 9>
##$TILT= no
##$TM1= 0
##$TM2= 0
##$TOPLEV= 0
##$USERP1= <user>
##$USERP2= <user>
##$USERP3= <user>
##$USERP4= <user>
##$USERP5= <user>
##$WDW= 1
##$XDIM= 32768
##$YMAX_p= 350247849
##$YMIN_p= -406896
$$ End of Bruker specific parameters
$$ ---------------------------------
##NTUPLES= NMR SPECTRUM
##VAR_NAME=  FREQUENCY,     SPECTRUM/REAL,   SPECTRUM/IMAG
##SYMBOL=    X,             R,               I
##VAR_TYPE=  INDEPENDENT,   DEPENDENT,       DEPENDENT
##VAR_FORM=  AFFN,          ASDF,            ASDF
##VAR_DIM=   32768,         32768,           32768
##UNITS=     HZ,            ARBITRARY UNITS, ARBITRARY UNITS
##FACTOR=    0.157963299565203, 1,           1
##FIRST=     4132.6476996994, 0,             0
##LAST=      -1043.33573715361, 0,           0
##MIN=       -1043.33573715361, -406896,     0
##MAX=       4132.6476996994, 350247849,     0
$$ Real data points
##PAGE= N=1
##DATA TABLE= (X++(R..R)), XYDATA
$$ [...]
$$ plain form
20211 80450 49102 22738 83051 119278 163868 110673 -381 -43925 -12744 5979 32807
20200 32807 13020 -658 68639 72946 51063 70393 107328 67800 -16718 10342 60187 102803
20188 102803 114627 77075 45317 13516 -35651 -56670 -56637 -9835 -22774 -15790 -22474 -65712
20176 -65712 -71791 -47933 -64708 -69601 -1901 60461 -8518 -72501 -30105 -71256 -126481 -152973
20164 -152973 -139710 -117489 -8685 1094 4362 5479 -153 -49636 -58590 -64785 -100326 -84096
20152 -84096 -20518 -36425 -24174 35299 -67 -48373 -57698 -64000 -26780 14282 84326 105317
20140 105317 127388 179097 174568 117740 102622 73166 37831 134149 147750 93751 27242 -83158
20128 -83158 -44935 70778 110725 95701 32051 -53851 -59480 -56346 -37928 4453 147512 148697
$$ packed form
20211H0450l1348k6364O0313L6227M4590n3195j11054m3544L1181J8723K6828
20200C2807j9787j3678O9297M307k1883J9330L6935l9528q4518K7060M9845M2616
20188A02803J1824l7552l1758l1801m9167k1019L3M6802j2939O984o684m3238
20176f5712o079K3858j6775m893O7700O2362o8979o3983M2396m1151n5225k6492
20164a52973J3263K2221J08804R779L268J117n632m9483q954o195l5541J6230
20152h4096O3578j5907J2251N9473l5366m8306r325o302L7220M1062P0044K0991
20140A05317K2071N1709m529n6828j5118k9456l5335R6318J3601n3999o6509j10400
20128h3158L8223J15713L9947j5024o3650q5902n629L134J8418M2381J43059J185
$$ plain form
20116 148697 127218 212939 164654 71770 43641 133402 197979 162626 90478 57583 72098
20105 72098 11916 -1140 21574 45755 5840 -55866 -130195 -161142 -274964 -264168 -166659
20094 -166659 -99814 -39646 58588 73740 47062 78451 95544 45962 15832 76162 128710
20083 128710 139877 83974 49902 136798 205107 148230 135019 197858 167497 103860 136950
20072 136950 111357 125957 110403 122117 215301 278137 279818 311698 270150 209319 167934 106697
20060 106697 136037 157429 194839 236543 171247 217242 259005 270929 244482 226076 244591
20049 244591 345080 346511 294416 250830 275245 329925 398230 438480 513916 504698 551197 665984
20037 665984 781429 774893 801961 724309 705426 721187 707871 696893 684932 611416 465798
$$ packed form
20116A48697k1479Q5721m8285r2884k8129Q9761O4577l5353p2148l2895J4515
20105G2098o0182j3056K2714K4181l9915o1706p4329l0947j13822J0796R7509
20094a66659O6845O0168R8234J5152k6678L1389J7093m9582l0130O0330N2548
20083A28710J1167n5903l4072Q6896O8309n6877j3211O2839l0361o3637L3090
20072A36950k5593J4600j5554J1714R3184O2836J681L1880m1548o0831m1385o1237
20060A06697K9340K1392L7410M1704o5296M5995M1763J1924k6447j8406J8515
20049B44591J00489J431n2095m3586K4415N4680O8305M0250P5436r218M6499J14787
20037F65984J15445o536K7068p7652j8883J5761j3316j0978j1961p3516j45618
$$ plain form
20026 465798 345093 294370 276724 244218 278805 284282 183207 133379 113587 135847 114205
20015 114205 85619 5171 10099 42518 15525 -49445 47848 99541 45883 12485 22518 49043
20003 49043 138029 182420 143107 83880 1365 -47991 -64810 -71999 -45199 56665 78773 -7330
19991 -7330 -31568 29097 -4328 -13140 49992 111377 148394 125943 98783 23206 63016 -22736
19979 -22736 -83288 -32235 42958 102268 44815 65325 90860 102452 133380 139802 118254 7167
19967 7167 -34660 4528 74268 121240 90155 11879 -37762 -80268 -93847 -96384 -112960 -55914
19955 -55914 75428 142197 143214 61688 77470 105690 101992 32053 -2224 -24316 1152 62374
19943 62374 173594 202091 134495 156285 149341 132687 108332 65678 3817 100436 165891 144363
$$ packed form
20026D65798j20705n0723j7646l2506L4587N477j01075m9828j9792K2260k1642
20015A14205k8586q0448M928L2419k6993o4970R7293N1693n3658l3398J0033K6525
20003D9043Q8986M4391l9313n9227q2515m9356j6819p189K6800J01864K2108q6103
19991g330k4238O0665l3425q812O3132O1385L7017k2451k7160p5577L9810q5752
19979b2736o0552N1053P5193N9310n7453K0510K5535J1592L0928O422k1548j11087
19967G167m1827L9188O9740M6972l1085p8276m9641m2506j3579k537j6576N7046
19955e5914J31342O6769J017q1526J5782K8220l698o9939l4277k2092K5468O1222
19943F2374J11220K8497o7596K1790o944j6654k4355m2654o1861R6619O5455k1528
$$ plain form
19931 144363 73255 -13662 -24658 6119 48589 65405 124855 170522 139589 37244 -34433
19920 -34433 -26973 -20363 6838 -5790 -7349 69642 127739 145769 65466 -26957 -56373 -120765
19908 -120765 -69184 41561 192718 252426 172363 159768 145256 194730 190292 137958 99179
19897 99179 90742 171739 244583 126149 -9888 -92845 -24141 43848 53986 52223 51611 -18432
19885 -18432 -48187 55735 76131 115419 69536 69897 103555 64470 -12312 -5348 5116 -69824
19873 -69824 -5283 -7316 5243 92037 92355 196759 177618 145257 187427 250508 326182 325390
19861 325390 176511 82096 93202 110594 122409 100324 75670 37740 -133 103434 161767
19850 161767 195433 224902 202967 200170 217603 229813 185929 266453 326126 309967 361060 400131
$$ packed form
19931A44363p1108q6917j0996L0777M2470J6816N9450M5667l0933j02345p1677
19920c4433P460O610K7201j2628j559P6991N8097J8030q0303r2423k9416o4392
19908a20765N1581J10745J51157N9708q0063j2595j4512M9474m438n2334l8779
19897I9179q437Q0997P2844j18434j36037q2957O8704O7989J0138j763o12p0043
19885a8432k9755J03922K0396L9288m5883L61L3658l9085p6782O964J0464p4940
19873f9824O4541k033J2559Q6794L18J04404j9141l2361M2170O3081P5674p92
19861C25390j48879r4415J1106J7392J1815k2085k4654l7930l7873J03567N8333
19850A61767L3666K9469k1935k797J7433J2210m3884Q0524N9673j6159N1093L9071
$$ plain form
19838 400131 446179 510294 543524 547345 558858 688432 735244 805666 742827 723470 814325
19827 814325 768498 684807 673323 589502 545964 524962 443434 374881 368169 338719 312445 249340
19815 249340 244888 274816 255259 273693 235894 132709 116787 69488 39130 120863 160425
19804 160425 78366 70583 90480 105034 72840 63173 68256 48436 67159 128797 109680 22190
19792 22190 50362 55435 64823 72555 109009 94584 147471 150551 168886 214190 210225 159315 96657
19779 96657 105719 128030 28077 114593 158210 22145 -77718 -78309 -31162 1671 21560 41977
19767 41977 117240 142907 169743 174827 174541 139051 152040 160660 222701 198890 115934 68290
19755 68290 50088 84355 196464 198569 149099 110154 81716 55354 -12381 23004 136202
$$ packed form
19838D00131M6048O4115L3230L821J1513J29574M6812P0422o2839j9357R0855
19827H14325m5827q3691j1484q3821m3538k1002q1528o8553o712k9450k6274o3105
19815B49340m452K9928j9557J8434l7799j03185j5922m7299l0358Q1733L9562
19804A60425q2059p783J9897J4554l2194r667N083j9820J8723O1638j9117q7490
19792B2190K8172N073R388P732L6454j4425N2887L080J8335M5304l965n0910o2658
19779I6657R062K2311r9953Q6516M3617j36065r9863n91M7147L2833J9889K0417
19767D1977P5263K5667K6836N084k86l5490J2989Q620O2041k3811q2956m7644
19755F8290j8202L4267J12109K105m9470l8945k8438k6362o7735L5385J13198
$$ plain form
19744 136202 108825 88867 39016 -17856 -82453 -20362 56676 73637 43462 56144 98252
19733 98252 29998 55142 93992 43544 71173 112735 112444 60834 125099 218058 238113 181793
19721 181793 125363 124148 103933 170949 214067 140050 61748 76975 141806 144711 100487 57314
19709 57314 9757 68563 -16702 -69678 14191 86982 27735 -178 32125 13296 -10558 -42279
19697 -42279 69168 124451 65431 22291 -7396 8093 31285 86389 133622 124872 27400 37287
19685 37287 151111 164876 147290 148251 183456 208067 289037 387383 387638 399678 366929 337352
19673 337352 342346 245515 158166 230013 283829 259682 295913 325943 319805 344757 299062 282182
19661 282182 309706 358270 363893 376217 379159 195478 131029 172235 186368 169016 209041 164228
$$ packed form
19744A36202k7377j9958m9851n6872o4597O2091P7038J6961l0175J2682M2108
19733I8252o8254K5144L8850n0448K7629M1562k91n1610O4265R2959K0055n6320
19721A81793n6430j215k0215O7016M3118p4017p8302J5227O4831K905m4224m3173
19709E7314m7557N8806q5265n2976Q3869P2791n9247k7913L2303j8829k3854l1721
19697d2279J11447N5283n9020m3140k9687J5489K3192N5104M7233q750r7472R887
19685C7287J13824J3765j7586R61L5205K4611Q0970R8346K55J2040l2749k9577
19673C37352M994r6831q7349P1847N3816k4147L6231L0030o138K4952m5695j6880
19661B82182K7524M8564N623J2324K942j83681o4449M1206J4133j7352M0025m4813
$$ plain form
19649 164228 218414 327225 393066 355093 298099 315521 331534 431894 418660 364449 439606
19638 439606 345565 361235 423416 418880 418055 379395 428086 408050 404195 456640 540675 412207
19626 412207 380510 403861 398288 355774 206737 229491 327870 378955 320547 232020 226616 289538
19614 289538 308036 238558 197107 150044 132690 111557 89477 133215 135500 94366 96940 149773
19602 149773 236846 334348 301303 178998 201848 198254 165849 175532 243886 266054 276289 228414
19590 228414 180165 199561 252734 324136 328580 279077 235795 222624 223246 243031 213076 205493
19578 205493 180543 279439 291255 269208 290895 331815 371140 376426 377902 427301 367527 253719
19566 253719 185237 253960 279327 278084 257871 291594 428145 469861 429155 393468 361465
$$ packed form
19649A64228N4186J08811O5841l7973n6994J7422J6013J00360j3234n4211P5157
19638D39606r4041J5670O2181m536q25l8660M8691k0036l855N2445Q4035j28468
19626D12207l1697K3351n573m2514j49037K2754R8379N1085n8408q8527n404O2922
19614B89538J8498o9478m1451m7063j7354k1133k2080M3738K285m1134K574N2833
19602A49773Q7073R7502l3045j22305K2850l594l2405R683O8354K2168J0235m7875
19590B28414m8249J9396N3173P1402M444m9503m3282j3171O22J9785k9955p583
19578B05493k4950R8896J1816k2047K1687M0920L9325N286J476M9399n9774j13808
19566B53719o8482O8723K5367j243k0213L3723J36551M1716m0706l5687l2003
$$ plain form
19555 361465 287571 296600 315025 318791 360687 409407 460509 510349 604512 598097 498193 440026
19543 440026 341007 373116 447153 447021 420417 314427 310819 351240 325680 248854 277151 401401
19531 401401 468880 450671 483351 512915 563801 524509 456869 400797 399525 461410 596840
19520 596840 586082 504682 475754 474165 541626 649639 772468 727727 616708 634359 615431
19509 615431 657410 592021 558987 540436 483972 505367 494526 555769 656908 702461 630470
19498 630470 630832 777890 833161 809972 824780 723327 722771 687855 645466 593905 566686 603902
19486 603902 680092 735515 733035 776709 902047 944304 914829 962457 1018661 969055 999134
19475 999134 1062935 1109178 1159716 1204116 1234611 1227466 1208130 1247785 1173091 1184812 1181286 1196369
$$ packed form
19555C61465p3894R029J8425L766M1896M8720N1102M9840R4163o415r9904n8167
19543D40026r9019L2109P4037j32k6604j05990l608M0421k5560p6826K8297J24250
19531D01401O7479j8209L2680K9564N0886l9292o7640n6072j272O1885J35430
19520E96840j0758q1400k8928j589O7461J08013J22829m4741j11019J7651j8928
19509F15431M1979o5389l3034j8551n6464K1395j0841O1243J01139M5553p1991
19498F30470L62J47058N5271k3189J4808j01453n56l4916m2389n1561k7219L7216
19486F03902P6190N5423k480M3674J25338M2257k9475M7628N6204m9606L0079
19475I99134O3801M6243N0538M4400L0495p145j9336L9655p4694J1721l526J5083
$$ plain form
19463 1196369 1162436 1204498 1183023 1175617 1279581 1368514 1425212 1421343 1495101 1508017 1436452
19452 1436452 1454786 1458119 1457149 1466693 1508709 1558877 1610290 1698016 1838830 1908542 1963728 1945850
19440 1945850 1901754 1970187 1971981 1982881 2140808 2294284 2331661 2433982 2578641 2668380 2701266
19429 2701266 2861234 3020927 3146186 3272535 3392309 3541460 3667049 3833156 3991606
19420 3991606 4228904 4441191 4716037 4954151 5233239 5458871 5760324 6215382 6564983
19411 6564983 6769352 6993611 7371087 7803740 8056385 8452001 8986551 9563209 10246568
19402 10246568 10873781 11535560 12392058 13469696 14700634 15934274 17404622 19188959
19394 19188959 21173532 23469632 26023221 29077106 32581379 36568052 41070214 46055304
$$ packed form
19463A196369l3933M2062k1475p406J03964Q8933N6698l869P3758J2916p1565
19452A436452J8334L333r70R544M2016N0168N1413Q7726J40814O9712N5186j7878
19440A945850m4096O8433J794J0900J57927J53476L7377J02321J44659Q9739L2886
19429B701266J59968J59693J25259J26349J19774J49151J25589J66107J58450
19420C991606K37298K12287K74846K38114K79088K25632L01453M55058L49601
19411F564983K04369K24259L77476M32653K52645L95616N34550N76658O83359
19402A0246568O27213O61779Q56498J077638J230938J233640J470348J784337
19394A9188959J984573K296100K553589L053885L504273L986673M502162M985090
$$ plain form
19386 46055304 51526140 57594371 64269836 71512754 79507335 88145823 97425081 107043112
19378 107043112 116431222 125010265 132226017 137247412 139492422 138407800 133714712 125551386
19370 125551386 114267337 100908605 86790027 73127511 60826516 50469747 42023883
19363 42023883 35370200 30176267 26159882 22966809 20364641 18227374 16496859 15101378
19355 15101378 13815594 12730406 11823438 11026813 10327364 9708881 9188872 8790332 8390887
19346 8390887 8018426 7721685 7446932 7285466 7086521 6796039 6576946 6430684 6183772
19337 6183772 5940376 5693351 5397824 5124415 4957579 4838554 4619318 4395835 4134068
19328 4134068 3921179 3778470 3632530 3549880 3381849 3301412 3242357 3159531 2937681 2747690
$$ packed form
19386D6055304N470836O068231O675465P242918P994581Q638488R279258R618031
19378A07043112R388110Q579043P215752N021395K245010j084622m693088q163326
19370A25551386j1284049j3358732j4118578j3662516j2300995j0356769q445864
19363D2023883o653683n193933m016385l193073k602168k137267j730515j395481
19355A5101378j285784j085188r06968p96625o99449o18483n20009l98540l99445
19346H390887l72461k96741k74753j61466j98945k90482k19093j46262k46912
19337F183772k43396k47025k95527k73409j66836j19025k19236k23483k61767
19328D134068k12889j42709j45940q2650j68031q0437n9055q2826k21850j89991
$$ plain form
19318 2747690 2667113 2571920 2540278 2514661 2475983 2420076 2397086 2198976 2111591 2055591 2093336
19307 2093336 2066341 2023793 1977727 2019821 1998443 1891965 1878069 1799817 1765001 1793441 1843917
19296 1843917 1816065 1787341 1736168 1662158 1591904 1522950 1541943 1518130 1486518 1521779 1613689
19285 1613689 1679542 1649729 1644068 1571780 1448356 1484363 1479807 1435130 1550952 1605743 1614192
19274 1614192 1580642 1514322 1505071 1517974 1456342 1475926 1576154 1607628 1551202 1573356 1658221
19263 1658221 1762027 1728725 1680853 1613510 1577157 1603412 1584576 1550287 1561135 1684316 1721315
19252 1721315 1702042 1818087 1858045 1854761 1825814 1830984 1804846 1872997 1991732 2048414 2051246
19241 2051246 2077636 2141234 2215903 2275795 2350231 2424420 2423023 2421766 2519309 2618585 2768406
$$ packed form
19318B747690q0577r5193l1642k5617l8678n5907k2990j98110q7385n6000L7745
19307B093336k6995m2548m6066M2094k1378j06478j3896p8252l4816K8440N0476
19296A843917k7852k8724n1173p4010p0254o8954J8993k3813l1612L5261R1910
19285A613689O5853k9813n661p2288j23424L6007m556m4677J15822N4791Q449
19274A614192l3550o6320r251J2903o1632J9584J00228L1474n6426K2154Q4865
19263A658221J03806l3302m7872o7343l6353K6255j8836l4289J0848J23181L6999
19252A721315j9273J16045L9958l284k8947N170k6138O8151J18735N6682K832
19241B051246K6390O3598P4669N9892P4436P4189j397j257R7543R9276J49821
$$ plain form
19230 2768406 2857700 2937064 3116310 3323011 3539537 3711014 3864608 4015115 4249015 4406751
19220 4406751 4540391 4758864 4990193 5224371 5459657 5743277 6000814 6262673 6518876
19211 6518876 6792629 7137431 7617944 8119135 8587696 9189601 9882666 10635874 11467224
19202 11467224 12355856 13431637 14614801 15930322 17382238 18951862 20888605 23046269
19194 23046269 25497636 28291176 31652337 35535913 39979404 44882175 50187224 55976388
19186 55976388 62246805 69109208 76724898 85424014 95099567 105565743 116292963 126312216
19178 126312216 134815983 141193273 145022325 145645068 141975326 133419044 120304324 104079899
19170 104079899 87082536 71369280 58149899 47708165 39745262 33739711 29102504
$$ packed form
19230B768406Q9294P9364J79246K06701K16526J71477J53594J50507K33900J57736
19220D406751J33640K18473K31329K34178K35286K83620K57537K61859K56203
19211F518876K73753L44802M80513N01191M68561O01905O93065P53208Q31350
19202A1467224Q88632J075781J183164J315521J451916J569624J936743K157664
19194B3046269K451367K793540L361161L883576M443491M902771N305049N789164
19186E5976388O270417O862403P615690Q699116R675553J0466176J0727220J0019253
19178A26312216Q503767O377290L829052O22743l669742q556282j3114720j6224425
19170A04079899j6997363j5713256j3219381j0441734p962903o005551m637207
$$ plain form
19163 29102504 25400284 22350600 19936233 18029664 16485640 15013180 13838992 12852562
19155 12852562 11945161 11210099 10627382 10002485 9332869 8741058 8212264 7728035 7232332
19146 7232332 6814923 6481155 6167294 5839289 5595360 5278737 5028964 4823975 4611774
19137 4611774 4497178 4345931 4193748 4055895 3923416 3716670 3560497 3415482 3252565
19128 3252565 3142149 2968381 2918175 2910361 2814225 2712741 2555165 2452072 2341657 2176298
19118 2176298 2062028 1929902 1800811 1702930 1660395 1608826 1539940 1555699 1558891 1514927 1434784
19107 1434784 1400020 1335991 1236847 1164639 1039588 1022077 1068718 1095032 1047665 923120 861969
19096 861969 832394 807051 734114 768427 841671 788288 770229 781064 753779 683103 602797
$$ packed form
19163B9102504l702220l049684k414367j906569j544024j472460j174188r86430
19155A2852562r07401p35062n82717o24897o69616n91811n28794m84229m95703
19146G232332m17409l33768l13861l28005k43929l16623k49773k04989k12201
19137D611774j14596j51247j52183j37853j32479k06746j56173j45015j62917
19128C252565j10416j73768n0206p814r6136j01484j57576j03093j10415j65359
19118B176298j14270j32126j29091r7881m2535n1569o8886J5759L192m3964q0143
19107A434784l4764o4029r9144p2208j25051j7511M6641K6314m7367j24545o1151
19096H61969k9575k5343p2937L4313P3244n3383j8059J0835k7285p0676q0306
$$ plain form
19085 602797 573908 576309 559545 561376 523571 544165 492010 487821 507189 463867 376852 317832
19073 317832 249466 264116 423836 494051 476504 478306 462998 454913 450541 426665 517430 498896
19061 498896 499831 545620 512477 452601 474151 487837 451802 438297 457422 501904 487478 466480
19049 466480 434717 340255 249358 320610 464280 466231 324236 281595 321865 268576 235831
19038 235831 187513 218273 267923 303149 333293 273012 203805 198448 177164 194012 170274 134291
19026 134291 167198 127353 154495 249856 289533 269787 195436 241740 284963 270822 240161
19015 240161 280889 240955 203106 142578 77405 143987 209898 213298 217797 166340 118978 7030
19003 7030 69984 83150 70756 94752 71513 78582 140338 148179 97023 61269 117876 149418
$$ packed form
19085F02797k8889K401j6764J831l7805K0594n2155m189J9368m3322q7015n9020
19073C17832o8366J4650J59720P0215j7547J802j5308q085m372k3876R0765j8534
19061D98896R35M5789l3143n9876K1550J3686l6035j3505J9125M4482j4426k0998
19049D66480l1763r4462r0897P1252J43670J951j41995m2641M0270n3289l2745
19038B35831m8318L0760M9650L5226L0144o0281o9207n357k1284J6848k3738l5983
19026A34291L2907l9845K7142R5361L9677j9746p4351M6304M3223j4141l0661
19015B40161M0728l9934l7849o0528o5173O6582O5911L400M499n1457m7362j11948
19003G030O2954J3166j2394K3996k3239P069O1756P841n1156l5754N6607L1542
$$ plain form
18991 149418 169562 198232 137721 192795 206093 107122 143848 235775 256412 251252 184286 179578
18979 179578 182510 154023 187625 240624 217487 137857 114383 176862 160021 115471 56288 -15220
18967 -15220 -103312 -1153 38902 -7629 -1888 -8585 11045 52055 148424 230734 194827 66011
18955 66011 -2292 -39967 -94428 -151151 -166588 -41496 25434 46340 8855 7099 4586 54473
18943 54473 15784 34158 83173 85262 105143 101355 66506 89104 161369 103409 73951 122645
18931 122645 128466 90836 39912 70949 121880 87437 59182 82011 116920 4591 -17076
18920 -17076 -24410 35438 -19672 -44100 -17495 26760 -30127 -63097 -20123 26248 -112679 -120257
18908 -120257 -64287 -27493 -399 -29602 -40574 -140952 -142433 -97894 -26065 -9357 -21838
$$ packed form
18991A49418K0144K8670o0511N5074J3298r8971L6726R1927K0637n160o6966m708
18979A79578K932k8487L3602N2999k3137p9630k3474O2479j6841m4550n9183p1508
18967a5220q8092J02159M0055m6531N741o697J9630M1010R6369Q2310l5907j28816
18955F6011o8303l7675n4461n6723j5437J25092O6930K0906l7485j756k513M9887
18943E4473l8689J8374M9015K089J9881l788l4849K2598P2265n7960k9458M8694
18931A22645N821l7630n0924L1037N0931l4443k8255K2829L4909j12329k1667
18920a7076p334N9848n5110k4428K6605M4255n6887l2970M2974M6371j38927p578
18908a20257N5970L6794K7094k9203j0972j00378j481M4539P1829J6708j2481
$$ plain form
18897 -21838 -105383 -71199 58610 75654 17645 59939 49044 73657 116963 112575 80582 18315
18885 18315 -23029 -68620 -65337 -40923 -4944 -6956 19361 103550 137801 117023 147626 227520
18873 227520 232828 152842 135667 87209 128138 150508 182513 251486 238385 242825 282599 290528
18861 290528 218402 124689 76526 88889 106556 175418 188334 206518 132525 104519 18851
18850 18851 -16320 29435 86557 110094 72076 126795 204603 203288 174353 215539 227460 272419
18838 272419 197917 168248 142704 139556 154354 170679 127797 137265 135100 143268 155390 170490
18826 170490 232244 278416 281368 204658 119129 34007 811 20914 51480 111407 102348 125841
18814 125841 188498 159399 71698 86302 111083 105974 92070 134216 177717 89657 85683 49844
$$ packed form
18897b1838q3545L4184J29809J7044n8009M2294j0895K4613M3306m388l1993o2267
18885A8315m1344m5591L283K4414L5979k012K6317Q4189L4251k0778L0603P9894
18873B27520N308p9986j7175m8458M0929K2370L2005O8973j3101M440L9774P929
18861B90528p2126r3713m8163J2363J7667O8862J2916J8184p3993k8006q5668
18850A8851l5171M5755N7122K3537l8018N4719P7808j315k8935M1186J1921M4959
18838B72419p4502k9669k5544l148J4798J6325m2882R468k165Q168J2122J5100
18826A70490O1754M6172K952p6710q5529q5122l3196K0103L0566N9927r059K3493
18814A25841O2657k9099q7701J4604K4781n109j3904M2146M3501q8060l974l5839
$$ plain form
18802 49844 21886 67878 133131 135060 103146 157767 156894 98715 125068 98338 103730 145122
18790 145122 122462 -21311 -72224 -48330 15466 26247 46440 26270 76894 101805 56517
18779 56517 64543 85149 46283 39396 70794 229003 366963 285286 253058 254268 230958 276944
18767 276944 366051 450080 475135 423913 382395 264189 164324 81058 83926 71152 97616
18756 97616 171763 156825 102756 107675 105076 77289 17595 48666 53466 75058 209661 209350
18744 209350 196422 249734 198336 154419 168293 158342 164096 165039 75965 -566 50390 150828
18732 150828 238877 230357 184749 205498 208431 191134 189276 212019 176650 145151 207807 241400
18720 241400 305281 435242 437355 427044 512498 554685 551375 573191 606260 696585 699692 760055
$$ packed form
18802D9844k7958M5992O5253J929l1914N4621q73n8179K6353k6730N392M1392
18790A45122k2660j43773n0913K3894O3796J0781K0193k0170N0624K4911m5288
18779E6517Q026K0606l8866o887L1398J58209J37960q1677l2228J210k3310M5986
18767B76944Q9107Q4029K5055n1222m1518j18206r9865q3266K868j2774K6464
18756I7616P4147j4938n4069M919k599k7787n9694L1071M800K1592J34603l11
18744B09350j2928N3312n1398m3917J3874r951N754R43q9074p6531N0956J00438
18732A50828Q8049q520m5608K0749K933j7297j858K2743l5369l1499O2656L3593
18720B41400O3881J29961K113j0311Q5454M2187l310K1816L3069R0325L107O0363
$$ plain form
18708 760055 749458 788091 811950 774822 714578 688768 606871 509846 470542 385761 374266
18697 374266 405830 318563 228059 239461 233741 191344 173094 173003 127112 126268 213295 199273 133551
18684 133551 94985 104355 104022 205453 296095 193781 111047 96619 102563 88871 87324 118071
18672 118071 156608 85715 19340 17752 -39613 -9471 -20974 16233 42891 31530 109004 175231
18660 175231 162316 117869 66277 -55312 -142703 -183187 -52499 1638 41572 53590 17118
18649 17118 40768 55397 32839 64999 100481 193490 188171 89407 78040 68940 86120 111016
18637 111016 100783 60195 56531 86573 59557 65117 66219 -7956 39736 32445 40337 -11519
18625 -11519 24536 70873 63625 30175 24396 24486 34748 29231 72870 23195 -41758 729 8680
$$ packed form
18708G60055j0597L8633K3859l7128o0244k5810q1897r7025l9304q4781j1495
18697C74266L1564q7267r0504J1402n720m2397j8250r1m5891q44Q7027j4022o5722
18684A33551l8566R370l33J01431R0642j02314q2734j4428N944j3692j547L0747
18672A18071L8537p0893o6375j588n7365L0142j1503L7207K6658j1361P7474O6227
18660A75231j2915m4447n1592j21589q7391m0484J30688N4137L9934J2018l6472
18649A7118K3650J4629k2558L2160L5482R3009n319r8764j1367r100J7180K4896
18637A11016j0233m0588l664L0042k7016N560J102p4175M7692p291P892n1856
18625a1519L6055M6337p248l3450n779R0J0262n517M3639m9675o4953M2487P951
$$ plain form
18612 8680 40881 127955 67347 90335 150925 234032 248960 197277 149981 93265 53495 121920
18600 121920 144545 143535 116060 88022 46453 13951 21227 65164 88563 33885 7491 -35330
18588 -35330 9553 -9953 -67147 -38291 79939 154615 152929 91753 74231 73170 69622 30533
18576 30533 76035 114095 92991 117582 183058 283887 334749 272474 250097 213735 246318
18565 246318 188955 121650 121993 113588 219661 299287 335235 249659 169900 250360 330551 262190
18553 262190 175850 224403 233266 244197 247762 201757 191603 216852 220826 247595 329941 412256
18541 412256 395851 301318 191423 159778 199568 216322 262729 292263 360544 398488 368644
18530 368644 387852 511578 637388 664171 519998 545172 736844 817166 913600 932378 797375
$$ packed form
18612H680L2201Q7074o0608K2988O0590Q3107J4928n1683m7296n6716l9770O8425
18600A21920K2625j010k7475k8038m1569l2502P276M3937K3399n4678k6394m2821
18588c5330M4883j9506n7194K8856J18230P4676j686o1176j7522j061l548l9089
18576C0533M5502L8060k1104K4591O5476J00829N0862o2275k2377l6362L2583
18565B46318n7363o7305L43q405J06073P9626L5948q5576p9759Q0460Q0191o8361
18553B62190q6340M8553Q863J0931L565m6005j0154K5249L974K6769Q2346Q2315
18541D12256j6405r4533j09895l1645L9790J6754M6407K9534O8281L7944k9844
18530C68644J9208J23726J25810K6783j44173K5174J91672Q0322R6434J8778j35003
$$ plain form
18519 797375 839839 983858 1058660 1089594 1148433 1169127 1194068 1162613 1055464 1018271 969451
18508 969451 837314 707874 689772 705776 734801 688232 670049 616283 558395 515434 500797
18497 500797 541745 511812 470712 522983 528082 462478 489054 564986 567579 578596 609398 679696
18485 679696 670293 670574 750946 803730 759305 757219 668451 611563 608279 689966 765788 808729
18473 808729 774686 638421 554519 558847 534718 473812 474104 529627 492932 411905 317630 422160
18461 422160 426134 370102 317616 229711 284366 310654 285070 278492 259943 302988 282453 312148
18449 312148 271417 306159 334467 365650 328464 372407 382195 325419 313015 316384 463077 495924
18437 495924 511408 497220 521757 491156 511024 469812 414926 390635 527266 646660 667870
$$ packed form
18519G97375M2464J44019P4802L0934N8839K0694K4941l1455j07149l7193m8820
18508I69451j32137j29440j8102J6004K9025m6569j8183n3766n7888m2961j4637
18497E00797M0948k9933m1100N2271N099o5604K6576P5932K593J1017L0802P0298
18485F79696r403K81Q0372N2784m4425k086q8768n6888l284Q1687P5822M2941
18473H08729l4043j36265q3902M328k4129o0906K92N5523l6695q1027r4275J04530
18461D22160L974n6032n2486q7905N4655K6288k5584o578j8549M3045k0535K9695
18449C12148m0731L4742K8308L1183l7186M3943R788n6776j2404L369J46693L2847
18437D95924J5484j4188K4537l0601J9868m1212n4886k4291J36631J19394K1210
$$ plain form
18426 667870 583757 574864 608628 617386 578331 572212 531784 444877 321407 280597 265055 234599
18414 234599 251742 291972 245318 264548 257724 238007 249370 206833 214101 229495 74921 -18617
18402 -18617 24487 112288 177822 151020 90944 111963 164199 196383 223396 256977 290557 277417
18390 277417 291084 257568 308965 291869 235826 119224 190231 343999 403970 413331 416759
18379 416759 398195 363117 308529 237467 198499 275686 189417 132274 185423 145122 106891
18368 106891 136849 158995 208543 241001 211175 161048 82349 97246 203275 147931 219770
18357 219770 255778 242926 155880 31418 -36902 24096 52428 180118 222577 213839 207798
18346 207798 175753 140306 90992 162953 192700 263897 279416 233545 197453 235174 216177
$$ packed form
18426F67870q4113q893L3764Q758l9055o119m0428q6907j23470m0810j5542l0456
18414B34599J7143M0230m6654J9230o824j9717J1363m2537P268J5394j54574r3538
18402a8617M3104Q7801O5534k6802o0076K1019N2236L2184K7013L3581L3580j3140
18390B77417J3667l3516N1397j7096n6043j16602P1007J53768N9971R361L428
18379D16759j8564l5078n4588p1062l8968P7187q6269n7143N3149m0301l8231
18368A06891K9958K2146M9548L2458k9826n0127p8699J4897J06029n5344P1839
18357B19770L6008j2852q7046j24462o8320O0998K8332J27690M2459q738o041
18346B07798l2045l5447m9314P1961K9747P1197J5519m5871l6092L7721j8997
$$ plain form
18335 216177 198515 158521 96822 146868 227012 318184 360559 337989 300734 229318 235815 215815
18323 215815 146624 168196 183360 206886 261865 203019 127918 111430 122013 122504 91744 82885
18311 82885 93970 90847 6142 19125 59732 80642 117281 75143 111414 124622 54429 30711
18299 30711 97360 129978 131736 143091 138859 150837 212582 175914 172789 178014 248232 283590
18287 283590 246150 250039 236452 284959 322099 338976 326125 268154 384477 448354 422518
18276 422518 386938 365624 352239 313043 280508 317781 360234 301415 198235 193707 188597 157597
18264 157597 258559 254038 281830 309249 361399 360068 309845 265659 255494 252800 191275 255672
18252 255672 308816 268706 243431 271802 297325 299572 289672 274658 316271 390758 463139 504330
$$ packed form
18335B16177j7662l9994o1699N0046Q0144R1172M2375k2570l7255p1416O497k0000
18323B15815o9191K1572J5164K3526N4979n8846p5101j6488J0583M91l0760q859
18311H2885J1085l123q4705J2983M0607K0910L6639m2138L6271J3208p0193k3718
18299C0711O6649L2618J758J1355m232J1978O1745l6668l125N225P0218L5358
18287B83590l7440L889j3587M8507L7140J6877j2851n7971J16323O3877k5836
18276D22518l5580k1314j3385l9196l2535L7273M2453n8819j03180m528n110l1000
18264A57597J00962m521K7792K7419N2150j331n0223m4186j0165k694o1525O4397
18252B55672N3144m0110k5275K8371K5523K247r900j5014M1613P4487P2381M1191
$$ plain form
18240 504330 583893 678447 636480 658212 672243 700123 582405 557387 634386 655925 562598
18229 562598 541257 553306 645103 613227 569236 577218 554683 576434 550019 526078 441495 369735
18217 369735 317146 359075 333782 360634 361268 338878 401072 408295 394746 380938 444427 404325
18205 404325 427226 382481 348966 368638 411762 490127 493650 474035 445307 432439 488696 563279
18193 563279 588307 630496 638352 601123 621261 651967 631289 671902 679372 667694 715517 672181
18181 672181 611597 588601 640691 624893 660364 693995 600287 520880 489923 532500 576862
18170 576862 589750 603739 661727 707487 612118 540951 528809 570940 673757 704521 840362
18159 840362 928316 978421 1007255 1025584 1090420 1105275 1132285 1156984 1095823 1076934 1127385
$$ packed form
18240E04330P9563R4554m1967K1732J4031K7880j17718k5018P6999K1539r3327
18229E62598k1341J2049R1797l1876m3991P982k2535K1751k6415k3941q4583p1760
18217C69735n2589M1929k5293K6852O34k2390O2194P223j3549j3808O3489m0102
18205D04325K2901m4745l3515J9672M3124P8365L523j9615k8728j2868N6257P4583
18193E63279K5028M2189P856l7229K0138L0706k0678M0613P470j1678M7823m3336
18181F72181o0584k2996N2090j5798L5471L3631r3708p9407l0957M2577M4362
18170E76862J2888J3989N7988M5760r5369p1167j2142M2131J02817L0764J35841
18159H40362Q7954N0105K8834J8329O4836J4855K7010K4699o1161j8889N0451
$$ plain form
18148 1127385 1159052 1039946 1104168 1261223 1436457 1582290 1691442 1717015 1774976 1865538
18138 1865538 1985418 2191477 2476125 2625433 2853522 3095148 3333270 3573849 3871911
18129 3871911 4363668 4994002 5558886 6131609 6822500 7769941 9055744 10860524 13298760
18120 13298760 15685708 17266999 18927841 20848527 23295762 26005422 30855905 38835379
18112 38835379 47834885 53213127 54128549 54785283 57925888 64271880 70410808 59154374
18104 59154374 34959875 20251259 13346973 9795518 7688617 6431436 5577084 4966505
18096 4966505 4556354 4225435 3886129 3591974 3428179 3285546 3014660 2816909 2721013 2704012
18086 2704012 2682354 2569714 2480630 2393634 2404196 2484539 2471924 2473716 2418107 2407175 2375104
$$ packed form
18148A127385L1667j19106O4222J57055J75234J45833J09152K5573N7961R0562
18138A865538J19880K06059K84648J49308K28089K41626K38122K40579K98062
18129C871911M91757O30334N64884N72723O90891R47441J285803J804780K438236
18120A3298760K386948J581291J660842J920686K447235K709660M850483P979474
18112C8835379Q999506N378242R15422O56734L140605O345992O138928j1256434
18104E9154374k4194499j4708616o904286l551455k106901j257181q54352o10579
18096D966505m10151l30919l39306k94155j63795j42633k70886j97751r5896j7001
18086B704012k1658j12640q9084q6996J0562Q0343j2615J792n5609j0932l2071
$$ plain form
18075 2375104 2307270 2314605 2349251 2330025 2300473 2296119 2292308 2316442 2365197 2470351 2592056
18064 2592056 2664666 2730255 2829295 2918436 3055494 3197367 3231153 3334610 3493597 3683471
18054 3683471 3883050 4145144 4486016 4757967 5055555 5549462 6179073 6838596 7505529
18045 7505529 8328756 9088943 9944953 10976346 12398138 14142708 16263902 18758600 21188058
18036 21188058 23247745 24958352 26635074 28337081 29439048 29411760 28382829 27564437
18028 27564437 27594426 28156313 28725996 29170522 29837273 30643344 30515194 28418023 24240708
18019 24240708 19474476 15636314 13198752 11850317 11046220 10705713 10669559 10814241 11127234
18010 11127234 11672028 12293052 13147590 14151521 15243066 16590199 18216763 20055960
$$ packed form
18075B375104o7834P335L4646j9226k9552m354l811K4134M8755J05154J21705
18064B592056P2610O5589R9040Q9141J37058J41873L3786J03457J58987J89874
18054C683471J99579K62094L40872K71951K97588M93907O29611O59523O66933
18045G505529Q23227P60187Q56010J031393J421792J744570K121194K494698K429458
18036B1188058K059687J710607J676722J702007J101967k7288j028931q18392
18028B7564437K9989N61887N69683M44526O66751Q06071j28150k097171m177315
18019B4240708m766232l838162k437562j348435q04097l40507l6154J44682L12993
18010A1127234N44794O21024Q54538J003931J091545J347133J626564J839197
$$ plain form
18002 20055960 22087704 24371861 27044426 30201733 33789929 38001034 43031613 49091054
17994 49091054 56025242 63609708 71461194 79088607 85977762 92066680 98424705 105020757
17986 105020757 111278173 117708841 123248869 127415702 131409947 136016902 139710697 139659211
17978 139659211 135444199 124863098 108588558 91306269 73749102 57203683 44252710
17971 44252710 35472743 29813557 26062980 23375311 21248552 19637702 18534015 17891691
17963 17891691 17612656 17517923 17719463 18084577 18697363 19494039 20529831 21687820 23156159
17954 23156159 24971334 26981404 29193165 31895988 35313906 39549530 44485568 50165748
17946 50165748 56363034 62659820 68703892 74604841 80259306 85736830 91738535 97475865
$$ packed form
18002B0055960K031744K284157K672565L157307L588196M211105N030579O059441
17994D9091054O934188P584466P851486P627413O889155O088918O358025O596052
17986A05020757O257416O430668N540028M166833L994245M606955L693795n1486
17978A39659211m215012j0581101j6274540j7282289j7557167j6545419j2950973
17971D4252710q779967n659186l750577k687669k126759j610850j103687o42324
17963A7891691k79035r4733K01540L65114O12786P96676J035792J157989J468339
17954B3156159J815175K010070K211761K702823L417918M235624M936038N680180
17946E0165748O197286O296786O044072N900949N654465N477524O001705N737330
$$ plain form
17938 97475865 102943187 109140777 115052693 119881246 123361158 125039712 124408914 119122646
17930 119122646 108522147 93380446 74527922 56898322 42657005 32198841 25268199
17923 25268199 20835214 17791659 15637691 13943463 12551779 11301773 10260270 9367038
17915 9367038 8675586 8054863 7473118 6971661 6677687 6351872 6059873 5790268 5463037
17906 5463037 5213551 4998161 4705471 4488333 4275193 4052933 3874128 3715986 3534902
17897 3534902 3385461 3142920 2927566 2797976 2679003 2578118 2559002 2533095 2479157 2440569
17887 2440569 2399006 2304385 2237208 2222818 2135686 2079294 2050114 1908126 1822698 1797158 1842007
17876 1842007 1824861 1769680 1663635 1593988 1594684 1530401 1343947 1218251 1156047 1043180 904142
$$ packed form
17938I7475865N467322O197590N911916M828553L479912J678554o30798n286268
17930A19122646j0600499j5141701j8852524j7629600j4241317j0458164o930642
17923B5268199m432985l043555k153968j694228j391684j250006j041503q93232
17915I367038o91452o20723n81745n01457k93974l25815k91999k69605l27231
17906E463037k49486k15390k92690k17138k13140k22260j78805j58142j81084
17897C534902j49441k42541k15354j29590j18973j00885j9116k5907n3938l8588
17887B440569m1563r4621o7177j4390q7132n6392k9180j41988q5428k5540M4849
17876A842007j7146n5181j06045o9647O96o4283j86454j25696o2204j12867j39038
$$ plain form
17865 904142 929212 1032766 1138081 1126586 1073049 1012751 941090 879587 872834 895264 766875
17854 766875 675304 619339 654368 695253 685217 693855 793734 761185 744030 707191 709335 684399
17842 684399 710973 731486 760842 812898 840868 800836 740069 731241 669493 582133 601859 618298
17830 618298 600108 521242 455488 329500 272900 274452 285238 254856 235888 319253 392690
17819 392690 413528 412853 308955 264585 319473 274143 167488 165498 212525 281278 200267 200254
17807 200254 159831 179002 170412 233573 254036 337819 337428 357006 483531 484698 508715 504719
17795 504719 480842 418749 421825 473098 564150 557265 456429 481646 500049 508503 430140 483522
17783 483522 553580 579301 545857 541869 532495 434604 461691 437943 391057 464798 507199 557130
$$ packed form
17865I04142K5070J03554J05315j1495n3537o0298p1661o1503o753K2430j28389
17854G66875r1571n5965L5029M0885j0036Q638R9879l2549j7155l6839K144k4936
17842F84399K6574K0513K9356N2056K7970m0032o0767q828o1748q7360J9726J6439
17830F18298j8190p8866o5754j25988n6600J552J0786l0382j8968Q3365P3437
17819C92690K0838o75j03898m4370N4888m5330j06655j990M7027O8753q1011j3
17807B00254m0423J9171q590O3161K0463Q3783l91J9578J26525J167K4017l996
17795E04719k3877o2093L076N1273R1052o885j00836K5217J8403Q454p8363N3382
17783D83522P0058K5721l3444l988r374r7891K7087k3748m6886P3741M2401M9931
$$ plain form
17771 557130 495953 271127 193871 168095 188406 247670 281251 315034 211259 43412 -44396
17760 -44396 3898 6265 34069 55681 66218 68889 134318 90364 107979 190334 191134 180195
17748 180195 148923 154236 174716 187240 202645 200876 119159 144255 176591 238948 250120 126037
17736 126037 132242 119779 154317 231014 286060 307606 302330 338341 384194 371665 310866 254924
17724 254924 187364 160607 219700 233299 175207 144800 107774 54337 55650 -451 -39392 -62701
17712 -62701 -111363 -120257 -116086 -149274 -179917 -131523 -52432 -15678 -55834 -73980 -67040 -179890
17700 -179890 -203196 -152090 -85098 -118667 -125025 -106248 -91806 -74050 -73719 -82272 -182523 -223331
17688 -223331 -186056 -51583 -2621 -52792 -147813 -85771 -15280 -34304 -87959 -125581 -155110
$$ packed form
17771E57130o1177k24826p7256k5776K0311N9264L3581L3783j03775j67847q7808
17760d4396M8294K367K7804K1612J0537K671O5429m3954J7615Q2355Q00j0939
17748A80195l1272N313K0480J2524J5405j769q1717K5096L2336O2357J1172j24083
17736A26037O205j2463L4538P6697N5046K1546n276L6011M5853j2529o0799n5942
17724B54924o7560k6757N9093J3599n8092l0407l7026n3437J313n6101l8941k3309
17712f2701m8662q894M171l3188l0643M8394P9091L6754m0156j8146O940j12850
17700a79890k3306N1106O6992l3569o358J8777J4442J7756L31q553j00251m0808
17688b23331L7275J34473M8962n0171r5021O2042P0491j9024n3655l7622k9529
$$ plain form
17677 -155110 -71975 -1261 13053 78611 -44792 -19509 15422 7473 110868 199687 144810
17666 144810 104379 120528 110324 110201 119778 105352 108536 60199 -9641 -125075 -174866 -59023
17654 -59023 -7725 -63376 -58235 14277 74940 68438 2489 -28923 -118938 -126366 -132621 -127349 -45278
17641 -45278 18909 -31357 -61735 -70660 -107181 -92834 -106236 -116407 7691 158828 220196
17630 220196 234507 153455 103452 211771 267432 256082 245486 251451 235262 257052 293509
17619 293509 215249 121088 2562 16697 4592 -18075 47603 93468 34652 -19000 33245
17608 33245 110398 118034 103718 120998 82710 61452 81173 117539 110014 103620 63611 42196
17596 42196 144957 196137 185866 183402 180575 191051 284004 318836 341488 297759 259114 305713
$$ packed form
17677a55110Q3135P0714J4314O5558j23403K5283L4931p949J03395Q8819n4877
17666A44810m0431J6149j0204j23R577j4426L184m8337o9840j15434m9791J15843
17654e9023N1298n5651N141P2512O0663o502o5949l1412r0015p428o255N272Q2071
17641d5278O4187n0266l0378q925l6521J4347j3402j0171J24098J51137O1368
17630B20196J4311q1052n0003J08319N5661j1350j0596N965j6189K1790L6457
17619B93509p8260r4161j18526J4135j2105k2667O5678M5865n8816n3652N2245
17608C3245P7153P636j4316J7280l8288k1258J9721L6366p525o394m0009k1415
17596D2196J02761N1180j0271k464k827J0476R2953L4832K2652m3729l8645M6599
$$ plain form
17584 305713 367812 393177 388717 312423 256843 301454 278665 313301 287192 329345 387366 366874
17572 366874 300433 213668 146425 121633 104387 145622 198800 204937 198929 236435 242771 224465
17560 224465 144650 91228 38579 13652 77076 109971 98524 164263 147953 136184 93164
17549 93164 111491 140829 169098 184364 239881 261916 287350 310455 317217 314244 283445 306972
17537 306972 309699 281657 307524 363593 380018 379633 310569 362487 424400 388774 347997 287460
17525 287460 272407 310847 319637 234708 151037 207756 264036 304429 387667 391362 408470 436328
17513 436328 460112 300134 193512 235656 287175 362419 312139 302128 263777 227968 298187
17502 298187 365572 322233 381997 443975 453537 516637 562562 587485 649422 641452 668793 775298
$$ packed form
17584C05713O2099K5365m460p6294n5580M4611k2789L4636k6109M2153N8021k0492
17572C66874o6441q6765o7243k4792j7246M1235N3178O137o008L7506O336j8306
17560B24465p9815n3422n2649k4927O3424L2895j1447O5739j6310j1769m3020
17549I3164J8327K9338K8269J5266N5517K2035K5434K3105O762k973l0799K3527
17537C06972K727k8042K5867N6069J6425l85o9064N1918O1913l5626m0777o0537
17525B87460j5053L8440Q790q4929q3671N6719N6280M0393Q3238L695J7108K7858
17513D36328K3784j59978j06622M2144N1519P5244n0280j0011l8351l5809P0219
17502B98187O7385m3339N9764O1978R562O3100M5925K4923O1937p970K7341J06505
$$ plain form
17490 775298 859018 789676 717660 679241 759248 818256 805090 840878 808753 746548 748828 718223
17478 718223 722965 742368 694241 690334 703194 703648 719562 700428 750748 746675 748025 687336 636379
17465 636379 587941 573296 637235 696681 702160 730108 763823 686427 755413 824993 834499 848994
17453 848994 967887 1041289 1093644 1175883 1162752 1156961 1100247 1173398 1313466 1385729 1460946
17442 1460946 1573222 1605462 1665573 1704591 1523693 1389700 1365913 1436898 1496083 1436103 1398622
17431 1398622 1361890 1275873 1250993 1269658 1273709 1329671 1385289 1404561 1430830 1443994 1448250 1438211
17419 1438211 1434337 1427794 1502032 1523374 1587234 1754359 1856342 1963726 2094450 2267301 2440744
17408 2440744 2557881 2770224 3153283 3491739 3672821 3846455 4070725 4331969 4718900
$$ packed form
17490G75298Q3720o9342p2016l8419Q0007N9008j3166L5788l2125o2205K280l0605
17478G18223M742J9403m8127l907J2860M54J5914j9134N0320m073J350o0689n0957
17465F36379m8438j4645O3939N9446N479K7948L3715p7396O8986O9580R506J4495
17453H48994J18893P3402N2355Q2239j3131n791n6714P3151J40068P2263P5217
17442A460946J12276L2240O0111L9018j80898j33993k3787P0985N9185n9980l7481
17431A398622l6732q6017k4880J8665M051N5962N5618J9272K6269J3164M256j0039
17419A438211l874o543P4238K1342O3860J67125J01983J07384J30724J72851J73443
17408B440744J17137K12343L83059L38456J81082J73634K24270K61244L86931
$$ plain form
17399 4718900 5207857 5773739 6528405 7453860 8444065 9487846 10560805 11669027 13031945
17390 13031945 14654621 16790136 19603424 23104662 26903188 30489267 33361820 35750281
17382 35750281 38270821 41251579 44241681 45816630 44784039 42078669 39391721 37702986
17374 37702986 37200739 37306070 36328144 32400355 25852817 19321356 14553899 11703799
17366 11703799 9928368 8944138 8436748 8131665 7973924 7938078 7894184 7884723 8065371 8206142
17356 8206142 8509028 8808281 9223586 9858044 10645374 11535363 12510172 13784575 15332566
17347 15332566 17051462 18916143 20976006 23235464 25885887 29448319 34002705 39512589
17339 39512589 45562498 51451677 56426425 60764426 65439420 70886607 75641825 77252236
$$ packed form
17399D718900M88957N65882P54666R25455R90205J043781J072959J108222J362918
17390A3031945J622676K135515K813288L501238L798526L586079K872553K388461
17382C5750281K520540K980758K990102J574949j032591k705370k686948j688735
17374C7702986n02247J05331r77926l927789o547538o531461m767457k850100
17366A1703799j775431r84230n07390l05083j57741l5846m3894r461J80648J40771
17356H206142L02886K99253M15305O34458P87330Q89989R74809J274403J547991
17347A5332566J718896J864681K059863K259458K650423L562432M554386N509884
17339C9512589O049909N889179M974748M338001M674994N447187M755218J610411
$$ plain form
17331 77252236 74930863 70685040 67162551 65202921 63712807 61185757 56630516 50743885
17323 50743885 43915088 36058173 28208284 21963199 17970285 15618486 14161580 13470506
17315 13470506 13087513 12918711 12939274 13032386 13263628 13628834 14192044 14952959 16037019
17306 16037019 17401182 19039221 21010818 23321631 25965621 28768824 31879139 35453381
17298 35453381 39778697 45081677 51489917 58740631 66544438 74477236 82194871 89852419
17290 89852419 96812801 102200396 105760612 105976471 103867712 100772803 96081866 91033925
17282 91033925 86197409 81037532 75725000 69629971 62925901 55093685 46316389 38245604
17274 38245604 31958477 27685777 24830276 22619375 20713915 18632024 16627494 15031943
$$ packed form
17331G7252236k321373m245823l522489j959630j490114k527050m555241n886631
17323E0743885o828797p856915p849889o245085l992914k351799j456906o91074
17315A3470506l82993j68802K0563R3112K31242L65206N63210P60915J084060
17306A6037019J364163J638039J971597K310813K643990K803203L110315L574242
17298C5453381M325316N302980O408240P250714P803807P932798P717635P657548
17290H9852419O960382N387595L560216K15859k108759l094909m690937n047941
17282I1033925m836516n159877n312532o095029o704070p832216q777296q070785
17274C8245604o287127m272700k855501k210901j905460k081891k004530j595551
$$ plain form
17266 15031943 13738675 12722328 12082814 11806071 11640040 11585410 11839312 12240369 12745193
17257 12745193 13321609 14002973 14913206 16082718 17589501 19600374 21985621 24571676
17249 24571676 27026979 29345760 31822262 34893586 38705775 42663417 46300078 49651089
17241 49651089 53169763 56846579 60245109 63235576 65469889 65938001 64697739 60901869
17233 60901869 54957734 49236055 44549757 41611811 39993886 38465183 36406614 32894579
17225 32894579 28148026 22662627 17361441 13171951 10321067 8540457 7357575 6558275
17217 6558275 5864529 5351557 5020815 4677346 4398986 4146820 3870712 3576665 3335022
17208 3335022 3136421 3009770 2784098 2612152 2498489 2342152 2322665 2247566 2058807 1961631
$$ packed form
17266A5031943j293268j016347o39514k76743j66031n4630K53902M01057N04824
17257A2745193N76416O81364R10233J169512J506783K010873K385247K586055
17249B4571676K455303K318781K476502L071324L812189L957642L636661L351011
17241D9651089L518674L676816L398530K990467K234313M68112j240262l795870
17233F0901869n944135n721679m686298k937946j617925j528703k058569l512035
17225C2894579m746553n485399n301186m189490k850884j780610j182882p99300
17217F558275o93746n12972l30742l43469k78360k52166k76108k94047k41643
17208C335022j98601j26651k25672j71946j13663j56337j9487p5099j88759r7176
$$ plain form
17198 1961631 1838080 1733779 1620939 1569941 1518042 1601591 1627227 1594054 1534722 1437359 1359864
17187 1359864 1337231 1329019 1274081 1280394 1222379 1077793 906407 908828 945194 1009277 946263
17176 946263 845999 755719 751478 750252 816210 753236 724990 713396 678967 627638 632372 701677
17164 701677 667263 595336 609526 612659 471105 371999 360802 352755 365565 358993 373127 354605
17152 354605 375534 412520 335172 391251 331516 279941 314251 346329 344121 367295 380430 366058
17140 366058 354061 303511 293646 210708 184610 189948 124719 55186 88458 183586 260172 211177
17128 211177 164545 161758 68076 99720 158715 107358 -14665 -261 97911 155732 56699
17117 56699 -55458 -56401 16274 6191 -13409 -4744 48673 96138 46554 41517 33773 54743
$$ packed form
17198A961631j23551j04301j12840n0998n1899Q3549K5636l3173n9332r7363p7495
17187A359864k2633q212n4938O313n8015j44586j71386K421L6366O4083o3014
17176I46263j00264r0280m241j226O5958o2974k8246j1594l4429n1329M734O9305
17164G01677l4414p1927J4190L133j41554r9106j1197q047J2810o572J4134j8522
17152C54605K0929L6986p7348N6079n9735n1575L4310L2078k208K3174J3135j4372
17140C66058j1997n0550r865q2938k6098N338o5229o9533L3272R5128P6586m8995
17128B11177m6632k787r3682L1644N8995n1357j22023J4404R8172N7821r9033
17117E6699j12157r43P2675j0083j9600Q665N3417M7465m9584n037p744K0970
$$ plain form
17105 54743 35925 19498 121884 104411 50610 88247 62699 53744 122079 121191 116412 133336
17093 133336 114702 34653 35072 3816 -46980 -91012 -105635 -104612 -72622 59196 52860 69285
17081 69285 8287 -82289 -35611 -18885 -26579 -12702 -33662 -5811 -58125 -1601 35817 18425
17069 18425 1063 -20691 -2125 16997 -40179 -57109 -57958 -21588 -47520 -35689 41439 68105
17057 68105 -34970 -54513 -84128 -103056 -87910 -40796 -62039 -13977 -4232 -85192 -79392 -87361
17045 -87361 -180080 -172725 -100727 -108218 -110869 -132457 -133890 -121639 -88124 -65211 -83467 -79258 -74209
17032 -74209 -95578 -93094 -188768 -148038 -56892 -167436 -143549 -166665 -95208 -29665 -70732 -68901
17020 -68901 -66602 -51646 -135063 -123578 -118548 -78812 1721 108291 83138 22652 -100210 -99423
$$ packed form
17105E4743j8818j6427J02386j7473n3801L7637k5548q955O8335q88m779J6924
17093A33336j8634q0049M19l1256n0796m4032j4623J023L1990J31818o336J6425
17081F9285o0998r0576M6678J6726p694J3877k0960K7851n2314N6524L7418j7392
17069A8425j7362k1754J8566J9122n7176j6930q49L6370k5932J1831P7128K6666
17057F8105j03075j9543k9615j8928J5146M7114k1243M8062R745q0960N800p969
17045h7361r2719P355P1998p491k651k1588j433J2251L3515K2913j8256M209N049
17032g4209k1369K484r5674M0730R1146j10544K3887k3116P1457O5543m1067J831
17020f8901K299J4956q3417J1485N030L9736Q0533J06570k5153o0486j22862P87
$$ plain form
17008 -99423 -64724 -52292 -2433 37328 93773 -13832 -96290 -135167 -129052 -117918 -138019 -88808
16996 -88808 -59052 -29149 5159 -317 21689 31396 -44894 -88027 -123639 -158345 -120885 -153565
16984 -153565 -132202 -82451 -64290 -81828 -99032 -62150 -40703 -39388 -31881 12826 21110 49453
16972 49453 56795 16942 -21436 -44839 -25612 -81786 -129134 -148690 -94878 -125337 -107948 -62772
16960 -62772 -41079 -116200 -200092 -111218 -86733 -85272 -65735 -17923 -41607 -63174 -18338 24328
16948 24328 6118 -13586 -12879 13783 -26170 -72068 -79591 -120660 -99118 -146130 -130457 -26942
16936 -26942 20914 -49686 -134936 -111575 -134405 -103696 -65639 -58843 -77340 -67843 -114462 -33875
16924 -33875 -17509 23808 -17915 12474 78148 1245 20432 120055 98135 50752 13168 57081
$$ packed form
17008i9423L4699J2432M9859L9761N6445j07605q2458l8877O115J1134k0101M9211
16996h8808K9756K9903L4308n476K2006R707p6290m3133l5612l4706L7460l2680
16984a53565K1363M9751J8161j7538j7204L6882K1447J315P507M4707Q284K8343
16972D9453P342l9853l8378k3403J9227n6174m7348j9556N3812l0459J7389M5176
16960f2772K1693p5121q3892Q8874K4485J461J9537M7812k3684k1567M4836M2666
16948B4328j8210j9704P07K6662l9953m5898p523m1069K1542m7012J5673J03515
16936b6942M7856p0600q5250K3361k2830L0709L8057O796j8497R497m6619Q0587
16924c3875J6366M1317m1723L0389O5674p6903J9187R9623k1920m7383l7584M3913
$$ plain form
16912 57081 50314 29437 55532 20606 14547 59118 81199 27791 -19060 -3583 31403 -13123
16900 -13123 38945 44958 83079 -17897 -96014 -66903 5676 -1230 -76110 -65374 -33001 20011
16888 20011 24307 -10781 -87578 -130698 -107249 92977 152634 104466 -25486 -67406 -37120
16877 -37120 -13161 15202 30153 24857 -61229 -62042 21379 16744 -44719 -59720 -62990 -31973 42830
16864 42830 103199 75120 77876 70117 25450 22683 59992 111812 121368 113801 64088 29421 26886
16851 26886 54799 96044 -12109 -137797 -124699 -119388 -194836 -153606 -124629 -103658 -6251
16840 -6251 36702 -2408 -22618 -65147 -73874 -15419 9843 38560 3701 -19378 -2226 48188
16828 48188 76083 70047 -6250 -93044 -91337 50110 198924 341097 305588 295351 285019
$$ packed form
16912E7081o767k0877K6095l4926o059M4571K2081n3408m6851J5477L4986m4526
16900a3123N2068O013L8121j00976p8117K9111P2579o906p4880J0736L2373N3012
16888B0011M296l5088p6797m3120K3449K00226N9657m8168j29952m1920L0286
16877c7120K3959K8363J4951n296q6086q13Q3421m635o1463j5001l270L1017P4803
16864D2830O0369k8079K756p759m4667k767L7309N1820R556p567m9713l4667k535
16851B6886K7913M1245j08153j25688J3098N311p5448M1230K8977K0971R7407
16840f251M2953l9110k0210m2529q727N8455K5262K8717l4859k3079J7152N0414
16828D8188K7895o036p6297q6794J707J41447J48814J42173l5509j0237j0332
$$ plain form
16817 285019 346464 359045 450731 404188 354804 303743 222539 263226 366463 337104 240079
16806 240079 152950 115834 174058 164689 134396 145916 147056 88094 82594 169194 300009 387064
16794 387064 354500 319926 222646 280882 335388 326911 281282 254362 269776 224477 275301 277583
16782 277583 223496 287809 270979 238073 131945 53197 109592 190902 255740 251716 238676
16771 238676 314331 330892 300075 275706 269413 174085 125926 206638 239932 211594 208631 206289
16759 206289 165141 121684 90137 149708 83239 23237 105177 128951 117909 194214 266118
16748 266118 235857 178763 184528 223889 246493 161689 164274 258935 266629 256338 229515 226582
16736 226582 212044 186738 154917 117092 115759 128682 165404 145487 96714 51585 14295 -35031
$$ packed form
16817B85019O1445J2581R1686m6543m9384n1061q1204M0687J03237k9359r7025
16806B40079q7129l7116N8224r369l0293J1520J140n8962n500Q6600J30815Q7055
16794C87064l2564l4574r7280N8236N4506q477m5629k6920J5414m5299N0824K282
16782B77583n4087O4313j6830l2906j06128p8748N6395Q1310O4838m024j3040
16771B38676P5655J6561l0817k4369o293r5328m8159Q0712L3294k8338k963k342
16759B06289m1148m3457l1547N9571o6469o0002Q1940K3774j1042P6305P1904
16748B66118l0261n7094N765L9361K2604q4804K585R4661P694j0291k6823k933
16736B26582j4538k5306l1821l7825j333J2923L6722j9917m8773m5129l7290m9326
$$ plain form
16724 -35031 -120728 -138723 -61994 -1677 35168 57257 8665 -4144 -43764 -85667 -50601 -20503
16712 -20503 -29961 -34960 -41896 -120302 -67245 -24814 19987 37175 27389 -53657 -89889 -98243 -43019
16699 -43019 -23966 38560 88485 29836 -29868 -37848 -22699 3832 11574 55998 70747 147496
16687 147496 144716 133502 148831 141370 78823 -2498 -45158 16371 -27373 -41001 -26143 -67578
16675 -67578 -116783 -83877 -118885 -49183 -19493 -26521 -109876 -147751 -102041 -4166 -29098 -36428
16663 -36428 -94175 -152309 -113327 -78532 -100451 -103627 -129818 -216869 -188452 -90301 -154087 -197977
16651 -197977 -88633 -23197 -110370 -162684 -141891 -234020 -227316 -191322 -207517 -225560 -216040 -190620
16639 -190620 -89965 -24896 -40620 -91070 -143809 -137269 -99528 -159544 -161027 -17285 24692
$$ packed form
16724c5031q5697j7995P6729O0317L6845K2089m8592j2809l9620m1903L5066L0098
16712b0503r458m999o936p8406N3057M2431M4801J7188r786q1046l6232q354N5224
16699d3019J9053O2526M9925n8649n9704p980J5149K6531P742M4424J4749P6749
16687A47496k780j1214J5329p461o2547q1321m2660O1529m3744j3628J4858m1435
16675f7578m9205L2906l5008O9702K9690p028q3355l7875M5710R7875k4932p330
16663c6428n7747n8134L8982L4795k1919l176k6191q7051K8417R8151o3786m3890
16651a97977J09344O5436q7173n2314K0793r2129O704L5994j6195j8043R520K5420
16639a90620J00655O5069j5724n0450n2739O540L7741o0016j483J43742M1977
$$ plain form
16628 24692 64866 110601 73617 28461 -54776 -215420 -231688 -107689 33455 87025 49247
16617 49247 28309 -11879 -61020 -101224 -120219 -133467 -73107 -55435 -116508 -131755 -169124 -58053
16605 -58053 12694 -97275 -166601 -155110 -146657 -117446 -126890 -159669 -205857 -174035 -140500 -116825
16593 -116825 -146860 -176290 -131041 -70067 -122358 -140110 -76081 -45294 -36841 -76144 -99313 -1493
16581 -1493 -53856 -36508 90962 57713 -94790 -94252 -92817 -89059 -112949 -224141 -190986 -84105
16569 -84105 -20226 24442 58216 76761 3184 -58577 -49045 -4994 -93727 -131866 -150527 -168934
16557 -168934 -147996 -121179 -158194 -231164 -250668 -188373 -138613 -110639 -74091 -67553 -85032 -142364
16545 -142364 -81685 -14193 -40293 -17956 841 -10862 -67807 -39930 -16245 15991 51362
$$ packed form
16628B4692M0174M5735l6984m5156q3237j60644j6268J23999J41144N3570l7778
16617D9247k0938m0188m9141m0204j8995j3248O0360J7672o1073j5247l7369J11071
16605e8053P0747j09969o9326J1491Q453K9211r444l2779m6188L1822L3535K3675
16593a16825l0035k9430M5249O0974n2291j7752O4029L0787Q453l9303k3169R7820
16581a493n2363J7348J27470l3249j52503N38J435L758k3890j11192L3155J06881
16569h4105O3879M4668L3774J8545p3577o1761R532M4051q8733l8139j8661j8407
16557a68934K0938K6817l7015p2970j9504O2295M9760K7974L6548O538j7479n7332
16545a42364O0679O7492k6100K2337J8797j1703n6945K7877K3685L2236L5371
$$ plain form
16534 51362 -2553 -29740 17774 -33353 -132007 -228642 -277570 -178424 -93556 12112 18594 -61357
16522 -61357 -52547 -27236 -37788 11600 -2286 -81576 -173424 -118505 -51978 7757 -79956 -128137
16510 -128137 -114364 -116454 -150599 -140816 -59614 -50418 -74226 -25364 -29556 3266 -44486 -69059
16498 -69059 -140156 -238360 -192278 -184363 -146210 -131399 -82961 -99983 -53919 -93066 -103258 -6805
16486 -6805 46069 -18722 -70483 -61656 -97167 -139112 -133017 -98589 -57259 -86333 -89568 -96082 -237837
16473 -237837 -204950 -137876 -81176 3509 56838 99280 136278 139613 175877 109431 31431 -2699
16461 -2699 2634 -28892 2605 77289 59664 -10450 -16180 23439 -23838 -119649 -158837 -82940
16449 -82940 -7799 -28682 -103841 -73588 -46737 -126096 -110026 -9562 -43294 -33268 -11147
$$ packed form
16534E1362n3915k7187M7514n1127r8654r6635m8928R9146Q4868J05668O482p9951
16522f1357Q810K5311j0552M9388j3886p9290r1848N4919O6527N9735q7713m8181
16510a28137J3773k090l4145R783Q1202R196k3808M8862m192L2822m7752k4573
16498f9059p1097r8204M6082P915L8153J4811M8438j7022M6064l9147j0192R6453
16486f805N2874o4791n1761Q827l5511m1945O095L4428M1330k9074l235o514j41755
16473b37837L2887O7074N6700Q4685N3329M2442L6998L335L6264o6446p8000l4130
16461b699N333l1526L1497P4684j7625p0114n730L9619m7277r5811l9188P5897
16449h2940P5141k0883p5159L0253K6851p9359J6070J00464l3732J0026K2121
$$ plain form
16438 -11147 7456 -2279 -87405 -34916 46971 29099 -46369 -112284 -85930 -60353 -35678 -140507
16426 -140507 -205003 -185976 -95414 -55636 -84215 -9627 11858 62482 -7326 -52428 -49198 -25355
16414 -25355 -1164 27639 32827 52351 57748 29519 10575 86082 90861 64794 -20906 -82511
16402 -82511 -176290 -235165 -172251 -55379 -101305 -156880 -129285 -68781 -61098 -41679 -48138 -39029
16390 -39029 -48274 -24704 -31890 -111118 -192851 -198491 -93861 -111285 -91876 -141301 -229548 -220437
16378 -220437 -152789 -83476 -101556 -118274 -107053 -107511 -157775 -117575 -129700 -52187 31714 60741
16366 60741 76002 49577 3643 -2595 -69398 -74167 -71793 -76005 -95456 -156123 -195625 -202868 -181090
16353 -181090 -228573 -259797 -185270 -87986 -80238 -68152 -94364 -52238 -46558 -51056 -103838 -169308
$$ packed form
16438a1147J8603r735q5126N2489Q1887j7872p5468o5915K6354K5577K4675j04829
16426a40507o4496J9027R0562L9778k8579P4588K1485N0624o9808m5102L230K3843
16414b5355K4191K8803N188J9524N397k8229j8944P5507M779k6067q5700o1605
16402h2511r3779n8875O2914J16872m5926n5575K7595O0504P683J9419o459R109
16390c9029r245K3570p186p9228q1733n640J04630j7424J9409m9425q8247R111
16378b20437O7648O9313j8080j6718J1221m58n0264M0200j2125P7513Q3901K9027
16366F0741J5261k6425m5934o238o6803m769K374m212j9451o0667l9502p243K1778
16353a81090m7483l1224P4527R7284P748J2086k6212M2126N680m498n2782o5470
$$ plain form
16341 -169308 -152254 -94150 -143858 -182457 -170355 -132983 -90251 -136169 -222453 -192156 -102752
16330 -102752 -36346 65716 -3559 -125282 -103199 -90519 -46921 75122 25130 -90814 -49615
16319 -49615 30436 -32556 -27145 39656 8806 -9262 36154 91468 113962 9334 -96526
16308 -96526 -85961 -5057 -4437 -85979 -79960 -108110 -69042 3606 -8073 -34965 62627 -18486
16296 -18486 -112732 -96333 -91717 -161132 -90480 17942 -23020 37504 62466 -19666 -94806 -158395
16284 -158395 -140659 -66246 -50288 -84031 -105929 -75730 -39240 -92074 -93403 -29468 -79740 -110480
16272 -110480 -71408 -53881 9578 82297 43832 9852 -34263 -28035 42252 80188 65976 50868
16260 50868 91279 82129 45785 91285 72582 25013 44043 -46537 -123800 -184202 -29541 56200
$$ packed form
16341a69308J7054N8104m9708l8599J2102L7372M2732m5918q6284L0297Q9404
16330a02752O6406J02062o9275j21723K2083J2680M3598J22043m9992j15944M1199
16319d9615Q0051o2992N411O6801l0850j8068M5416N5314K2494j04628j05860
16308i6526J0565Q0904O20q1542O019k8150L9068P2648j1679k6892R7592q1113
16296a8486r4246J6399M616o9415P0652J08422m0962O0524K4962q2132p5140o3589
16284a58395J7736P4413J5958l3743k1898L0199L6490n2834j329O3935n0272l0740
16272a10480L9072J7527O3459P2719l8465l3980m4115O228P0287L7936j4212j5108
16260E0868M0411r150l6344M5500j8703m7569J9030r0580p7263o0402J54661Q5741
$$ plain form
16248 56200 8462 -34990 -162987 -245759 -177988 -43575 31351 -16375 -77124 -111398 -174002
16237 -174002 -164332 -83955 -76018 -54893 -88647 -162508 -145789 -150870 -134820 -121976 -172705 -197975
16225 -197975 -194016 -181029 -144225 -128991 -150494 -143784 -123179 -110654 -89819 -38067 19978 27192
16213 27192 -23921 -52227 -3736 -92015 -141065 -75901 -21990 17442 33194 -22857 -66809 -14616
16201 -14616 -6022 -78357 -119897 -90439 -31989 -44334 29311 36774 15176 37399 56326 43957
16189 43957 5704 40132 -17877 -108947 -144973 -93840 -62349 -88410 -50265 -51097 -58238 12959
16177 12959 -6567 2516 54544 87678 53207 41633 21106 -38563 -79374 -90842 -25005 -8658
16165 -8658 -20870 -71501 -84902 -59949 -55112 -127510 -95513 -53371 -14821 -27192 18205 -7692
$$ packed form
16248E6200m7738m3452j27997q2772O7771J34413P4926m7726o0749l4274o2604
16237a74002R670Q0377P937K1125l3754p3861J6719n081J6050J2844n0729k5270
16225a97975L959J2987L6804J5234k1503O710K0605J2525K0835N1752N8045P214
16213B7192n1113k8306M8491q8279m9050O5164N3911L9432J5752n6051m3952N2193
16201a4616Q594p2335m1540K9458N8450j2345P3645P463k1598K2223J8927j2369
16189D3957l8253L4428n8009r1070l6026N1133L1491k6061L8145q32p141P1197
16177A2959j9526R083N2028L3134l4471j1574k0527n9669m0811j1468O5837J6347
16165h658j2212n0631j3401K4953M837p2398L1997M2142L8550j2371M5397k5897
$$ plain form
16153 -7692 -75359 -89077 -104348 -112426 -17145 26399 253 -1228 12992 -39187 -73150 -62472
16141 -62472 -182068 -240518 -115418 -43926 -84123 -61643 -33700 -29360 32568 42886 5263
16130 5263 -40577 -39808 -18037 -58603 -10275 32227 43445 -4670 -64379 -116631 -34202 -49016
16118 -49016 -92123 -94088 -151129 -197434 -203373 -251171 -177739 -134210 -116641 -102495 -174392 -137938
16106 -137938 -274 -15714 -52798 -64603 -3396 -5526 -115476 -167675 -166361 -151625 -31882
16095 -31882 -701 -79987 -187113 -195635 -155635 -77998 -18663 -57595 -61803 -114589 -90020 57500
16083 57500 103588 79460 -31991 -149331 -153114 7591 106153 118572 130398 70335 -13218
16072 -13218 -96125 -50842 17541 21512 86292 96722 66228 26878 -49742 -22344 48818 99727
$$ packed form
16153g692o7667j3718j5271q078R5281M3544k6146j481J4220n2179l3963J0678
16141f2472j19596n8450J25100P1492m0197K2480K7943M340O1928J0318l7623
16130E263m5840P69K1771m0566M8328M2502J1218m8115n9709n2252Q2429j4814
16118d9016m3107j965n7041m6305n939m7798P3432M3529J7569J4146p1897L6454
16106a37938J37664j5440l7084j1805O1207k130j09950n2199J314J4736J19743
16095c1882L1181p9286j07126q522M0000P7637N9335l8932m208n2786K4569J47520
16083E7500M6088k4128j11451j17340l783J60705R8562J2419J1826o0063q3553
16072a3218q2907M5283O8383L971O4780J0430l0494l9350p6620K7398P1162N0909
$$ plain form
16060 99727 107328 83649 99439 56993 -34852 -34554 -81965 -143075 -100485 -58679 -78247 -86488
16048 -86488 -90810 -57846 -17850 50737 100378 39092 67636 75386 62877 141625 209295 258657
16036 258657 252773 191213 106434 154273 137155 58062 138055 200854 215018 278242 330677 287023
16024 287023 276921 249924 158620 104490 100123 78103 14650 -72150 19867 97186 123852 83396
16012 83396 112326 74237 21632 24643 48568 -33195 -53285 -26410 -30193 -25641 -91568 -62678
16000 -62678 -51500 -86776 -50485 -44466 -136974 -109482 -61381 -67974 -104587 -97096 -77887 -86110
15988 -86110 -63457 -26905 18575 62418 52103 62003 105619 60835 17722 23877 38340 51972
15976 51972 8526 -77361 2178 7171 -2630 -12305 -56261 -64894 -43369 -6629 26497 99940
$$ packed form
16060I9727P601k3679J5790m2446r1845K98m7411o1110M2590M1806j9568q241
16048h6488m322L2964L9996O8587M9641o1286K8544P750j2509P8748O7670M9362
16036B58657n884o1560q4779M7839j7118p9093P9993O2799J4164O3224N2435m3654
16024B87023j0102k6997r1304n4130m367k2020o3453q6800R2017P7319K6666m0456
16012H3396K8930l8089n2605L011K3925q1763k0090K6875l783M552o5927K8890
16000f2678J1178l5276L6291O019r2508K7492M8101o593l6613P491J9209q223
15988h6110K2653L6552M5480M3843j0315R900M3616m4784m3113O155J4463J3632
15976E1972m3446q5887P9539M993r801r675m3956q633K1525L6740L3126P3443
$$ plain form
15964 99940 111085 63306 73914 107013 157235 50315 -74318 -70304 -129777 -185765 -164262
15953 -164262 -102764 -88583 -43896 -31441 -44300 -2084 -18222 -60453 -112830 -157189 -117676
15942 -117676 -62333 -55947 18474 19461 -81561 -160267 -140318 -121237 -167228 -254971 -262861 -187582
15930 -187582 -139370 -78665 -64559 -65179 -48986 -31130 -47043 -79910 -160045 -144924 -138438 -130835
15918 -130835 -87516 -103057 -22658 41766 110347 46694 41217 13382 67829 83289 -11058 -57424
15906 -57424 -132804 -137047 -26429 17653 39668 36548 21778 -60011 -8472 5499 -13428 -2694
15894 -2694 20570 -5762 -73807 -87562 -17444 81888 30067 -12907 -13622 -33995 -16133 90123
15882 90123 -3677 -113684 -181018 -173029 -217956 -161805 -124260 -206141 -318563 -333236 -185295
$$ packed form
15964I9940J1145m7779J0608L3099N0222j06920j24633M014n9473n5988K1503
15953a64262O1498J4181M4687J2455j2859M2216j6138m2231n2377m4359L9513
15942a17676N5343O386P4421R87j01022p8706J9949J9081m5991q7743p890P5279
15930a87582M8212O0705J4106o20J6193J7856j5913l2867q0135J5121O486P603
15918a30835M3319j5541Q0399O4424O8581o3653n477k7835N4447J5460r4347m6366
15906e7424p5380m243J10618M4082K2015l120j4770q1789N1539J3971j8927J0734
15894b694K3264k6332o8045j3755P0118R9332n1821m2974p15k0373J7862J06256
15882I0123r3800j10007o7334P989m4927N6151L7545q1881j12422j4673J47941
$$ plain form
15871 -185295 -33779 31923 23696 -39906 -29435 45377 1691 -12612 15706 -18392 -44006
15860 -44006 -66750 -173301 -156054 -200897 -205816 -123071 -7303 25254 -14826 -148129 -187450
15849 -187450 -142484 -69703 -9760 -19250 2164 24675 796 -23554 20775 39617 43904 -7442
15837 -7442 -17759 -40724 -102966 -201299 -254673 -183079 -67772 -60334 -115274 -128474 -112471 -153446
15825 -153446 -228169 -268500 -196610 -128841 -120284 -72041 -78326 -9903 67386 72983 -45843 -91919
15813 -91919 -97953 -106340 -63887 -57551 -48906 -57171 -74601 -36981 -36692 3910 60915 87106 187171
15800 187171 117042 -28849 -122974 -162062 -46499 69118 87298 6814 -42919 -4190 -74279
15789 -74279 -101696 -111350 -101182 -66178 -84541 -96553 -133297 -108043 -44599 2210 -4005 -79515
$$ packed form
15871a85295J51516O5702q227o3602J0471P4812m3686j4303K8318l4098k5614
15860d4006k2744j06551J7247m4843m919Q2745J15768L2557m0080j33303l9321
15849a87450M4966P2781N9943r490K1414K2511k3879k4350M4329J8842M287n1346
15837g442j0317k2965o2242r8333n3374P1594J15307P438n4940j3200J6003m0975
15825a53446p4723m0331P1890O7769Q557M8243o285O8423P7289N597j18826m6076
15813i1919o034q387M2453O336Q645q265j7430L7620K89M0602N7005K6191J00065
15800A87171p0129j45891r4125l9088J15563J15617J8180q0484m9733L8729p0089
15789g4279k7417r654J0168L5004j8363j2012l6744K5254O3444M6809o215p5510
$$ plain form
15777 -79515 -68301 -28880 31959 14113 -9265 26124 13548 -79929 -123679 -144898 -177453 -159618
15765 -159618 -139863 -124345 -103229 -52767 -65547 -88650 -63391 -8733 20825 37329 -21473
15754 -21473 -60445 -77573 -93802 -147996 -121327 -152344 -132749 -83186 -136140 -206144 -165295 -92807
15742 -92807 -57643 -79560 5192 61374 30589 11251 -25785 -64280 -54277 48812 66022
15731 66022 17394 60774 90471 30989 36308 34997 -9641 -31295 37855 168481 237770 222399
15719 222399 161951 34857 -63642 -7107 49210 20982 42745 34526 11903 -87524 -62702
15708 -62702 19560 50514 119 -28782 -15791 -18495 -89366 -129256 -104275 23502 119477 106779
15696 106779 88110 32810 -4953 9745 79977 54244 69781 1523 -37703 -10980 77601
$$ packed form
15777g9515J1214L9421O0839j7846k3378L5389j2576r3477m3750k1219l2555J7835
15765a59618J9755J5518K1116N0462j2780k3103K5259N4658K9558J6504n8802
15754b1473l8972j7128j6229n4194K6669l1017J9595M9563n2954p0004M0849P2488
15742i2807L5164k1917Q4752N6182l0785j9338l7036l8495J0003J03089J7210
15731F6022m8628M3380K9697n9482N319j311m4638k1654O9150J30626O9289j5371
15719B22399o0448j27094r8499N6535N6317k8228K1763q219k2623r9427K4822
15708f2702Q2262L0954n0395k8901J2991k704p0871l9890K4981J27777R5975j2698
15696A06779j8669n5300l7763J4698P0232k5733J5537o8258l9226K6723Q8581
$$ plain form
15685 77601 87974 85896 51218 7586 -9035 13617 26954 76977 52650 46306 38090 -724
15673 -724 -62597 -53512 -46389 -29664 27090 39338 -33293 -101941 -131792 -156045 -93351 2831
15661 2831 -16902 -37866 -33349 -23434 -32713 -122033 -100915 -76681 24884 104659 46216 -24287
15649 -24287 65626 83121 -117321 -180322 -138381 -7505 -54613 -78343 -141150 -174422 -126383
15638 -126383 -62190 -35707 109903 167615 111289 85951 44985 13447 12191 39451 -2184
15627 -2184 28404 29101 8422 -453 -43622 -40172 -75093 -45026 8356 16059 27572 -828 -50809
15614 -50809 10752 8809 -8043 19431 -43852 -90767 -101053 -74710 -28077 23725 65041 38500
15602 38500 13975 52927 94379 41005 -41188 -50696 -114647 -85053 -112154 -180943 -137167 -78049
$$ packed form
15685G7601J0373k078l4678m3632j6621K2652J3337N0023k4327o344q216l8814
15673g24o1873R085P123J6725N6754J2248p2631o8648k9851k4253O2694R6182
15661B831j9733k0964M517R915r279q9320K1118K4234J01565P9775n8443p0503
15649b4287Q9913J7495k00442o3001M1941J30876m7108k3730o2807l3272M8039
15638a26383O4193K6483J45610N7712n6326k5338m0966l1538j256K7260m1635
15627b184L0588O97k0679q875m3169L450l4921L0067N3382P703J1513k8400m9981
15614e0809O1561j943j6852K7474o3283m6915j0286K6343M6633N1802M1316k6541
15602C8500k4525L8952M1452n3374q2193r508o3951K9594k7101o8789M3776N9118
$$ plain form
15590 -78049 -25719 56055 109966 122152 78436 -25943 -48998 2795 6636 6816 -22586 -45702
15578 -45702 13092 15283 -5717 -6019 -92173 -101704 -53351 -36587 7934 28319 29485 75093 -1881
15565 -1881 -69690 -39604 67033 94268 42367 53107 143629 122457 93560 32172 -23802 -78443
15553 -78443 -39000 -95787 -99351 -98500 -111157 -6176 36212 24655 -19188 -6254 16009 28913
15541 28913 48671 -9002 -53141 -5275 157187 241464 103971 73149 76774 76867 8484 -2876
15529 -2876 -112731 -138161 -119835 -143895 -108347 -109878 -90680 -22414 -12276 -2197 133032 212832
15517 212832 162586 28571 -34053 8814 50059 92876 100318 71450 143225 175731 167883 171239
15505 171239 251057 299963 417172 527106 503702 462707 510850 527249 440210 380866 389237
$$ packed form
15590g8049N2330Q1774N3911J2186m3716j04379k3055N1793L841J80k9402k3116
15578d5702N8794K191k1000l02q6154r531M8353J6764M4521K0385J166M5608p6974
15565a881o7809L0086J06637K7235n1901J0740R0522k1172k8897o1388n5974n4641
15553g8443L9443n6787l564Q51j2657J04981M2388j1557m3843J2934K2263J2904
15541B8913J9758n7673m4139M7866J62462Q4277j37493l0822L625R3o8383j1360
15529b876j09855k5430J8326k4060L5548j531J9198O8266J0138J0079J35229P9800
15517B12832n0246j34015o2624M2867M1245M2817P442k8868P1775L2506p848L356
15505A71239P9818M8906J17209J09934k3404m0995M8143J6399q7039n9344Q371
$$ plain form
15494 389237 349436 300702 219961 108514 104726 116878 101680 21706 -47989 -126023 -110403
15483 -110403 -121165 -111603 -74175 -6309 18534 8449 3573 -47202 -14504 14986 -18540 -103939
15471 -103939 -110215 -86149 -102523 -68439 10944 -40639 -121244 -127332 -82951 -128862 -105864 -118972
15459 -118972 -76312 -69017 -6876 32232 27180 9475 -6132 28623 73161 34422 44521 34911
15447 34911 17205 40484 52571 38348 54515 64347 34581 91936 111658 141068 190524 200751
15435 200751 96575 -2512 56658 201257 171224 78202 25000 -21249 -62466 -40095 -19537
15424 -19537 -4410 11473 24119 -95455 -113158 -50517 61354 26469 94845 192654 175796
15413 175796 136093 126005 257909 213263 84674 31237 120883 234751 231780 184668 161150
$$ packed form
15494C89237l9801m8734q0741j11447l788J2152j5198p9974o9695p8034J5620
15483a10403j0762R562L7428O7866K4843j0085m876n0775L2698K9490l3526q5399
15471a03939o276K4066j6374L4084P9383n1583q0605o088M4381m5911K2998j3108
15459a18972M2660P295O2141L9108n052j7705j5607L4755M4538l8739J0099r610
15447C4911j7706K3279J2087j4223J6167R832k9766N7355J9722K9410M9456J0227
15435B00751j04176r9087N9170J44599l0033r3022n3202m6249m1217K2371K0558
15424a9537J5127J5883J2646j19574j7703O2641J11871l4885O8376R7809j6858
15413A75796l9703j0088J31904m4646j28589n3437Q9646J13868k971m7112k3518
$$ plain form
15402 161150 105448 48616 -6794 -55125 98894 56749 57308 60813 87200 137624 240685 307482
15390 307482 343530 424921 457970 460168 552685 593746 649098 761686 912514 980844 1110926
15379 1110926 1348169 1513707 1648355 1662603 1661067 1612305 1545849 1456889 1249277 971497
15369 971497 721952 532543 410425 344148 337947 347804 285992 285630 347552 350723 382652 428422
15357 428422 334434 216019 98468 12246 -24835 33847 16385 -18980 -79043 -39026 34208
15346 34208 29416 22260 40576 71780 81807 66564 37751 9328 13196 56694 45996 19146
15334 19146 9513 85898 153883 90977 11168 72496 148544 119872 94366 90302 107715 171112
15322 171112 133050 139819 174609 274320 281431 222041 154606 84412 105628 159792 187389 225621
$$ packed form
15402A61150n5702n6832n5410m8331J54019m2145N59L505K6387N0424J03061O6797
15390C07482L6048Q1391L3049K198R2517M1061N5352J12588J50828O8330J30082
15379A110926K37243J65538J34648J4248j536m8762o6456q8960k07612k77780
15369I71497k49545j89409j22118o6277o201R857o1812l62O1922L171L1929M5770
15357D28422r3988j18415j17551q6222l7081N8682j7462l5365o0063M0017P3234
15346C4208m792p156J8316L1204J0027j5243k8813k8423L868M3498j0698k6850
15334A9146r633P6385O7985o2906p9809O1328P6048k8672k5506m064J7413O3397
15322A71112l8062O769L4790R9711P111n9390o7435p0194K1216N4164K7597L8232
$$ plain form
15310 225621 233897 220631 213139 221731 234427 237998 248392 332664 447017 457479 417622 376418
15298 376418 399113 368954 326857 250865 244433 170055 110229 110179 160620 106448 67420 51871
15286 51871 62481 33418 -8665 55390 74682 -17579 -60288 -118478 -63806 -35742 -76112 -109686
15274 -109686 -38875 -4743 -35599 -57948 -46600 -91425 -107821 -46501 2558 -13981 -107939
15263 -107939 -145226 -154983 -202885 -205679 -192381 -175460 -202836 -261170 -245281 -261171 -406896 -398641
15251 -398641 -250021 -176414 -75442 -6366 -61684 -156815 -171424 -178505 -216901 -178487 -129743
15240 -129743 1681 192511 261911 285256 328315 383698 388103 360923 353014 319350 285720
15229 285720 177101 168952 134244 46110 126044 157724 199570 222409 223534 278854 258948 301191
$$ packed form
15310B25621Q276j3266p492Q592J2696L571J0394Q4272J14353J0462l9857m1204
15298C76418K2695l0159m2097p5992o432p4378n9826n0N0441n4172l9028j5549
15286E1871J0610k9063m2083O4055J9292r2261m2709n8190N4672K8064m0370l3574
15274a09686P0811L4132l0856k2349J1348m4825j6396O1320M9059j6539r3958
15263a07939l7287r757m7902k794J3298J6921k7376n8334J5889j5890j45725Q255
15251c98641J48620P3607J00972O9076n5318r5131j4609p081l8396L8414M8744
15240a29743J31424J90830O9400K3345M3059N5383M405k7180p909l3664l3630
15229B85720j08619q149l4708q8134P9934L1680M1846K2839J125N5320j9906M2243
$$ plain form
15217 301191 261214 229234 243161 219593 279675 302162 315127 315916 220356 157636 161426 219015
15205 219015 244194 220410 153995 185393 185694 149151 170552 253997 336903 363854 407927 458076
15193 458076 463044 491276 536882 549223 543138 445899 352784 270984 427443 504526 523064 491762
15181 491762 389407 357406 367763 258199 236477 177729 130733 103721 33036 68582 93428
15170 93428 98927 76727 62916 33324 34755 15437 -24655 61572 129888 179879 147560 213012
15158 213012 176541 142972 127893 116563 119042 170796 234361 217723 190162 191145 205246 224011
15146 224011 206216 132593 62841 93451 125194 94675 82476 75662 41534 33859 -27507 -82797
15134 -82797 -34572 39104 65568 63521 29962 -56149 -58139 -104731 -104190 -53437 -68950 -31885
$$ packed form
15217C01191l9977l1980J3927k3568O0082K2487J2965P89r5560o2720L790N7589
15205B19015K5179k3784o6415L1398L01l6543K1401Q3445Q2906K6951M4073N0149
15193D58076M968K8232M5606J2341o085r7239r3115q1800J56459P7083J8538l1302
15181D91762j02355l2001J0357j09564k1722n8748m6996k7012p0685L5546K4846
15170I3428N499k2200j3811k9592J431j9318m0092Q6227O8316M9991l2319O5452
15158B13012l6471l3569j5079j1330K479N1754O3565j6638k7561R83J4101J8765
15146B24011j7795p3623o9752L0610L1743l0519j2199o814l4128p675o1366n5290
15134h2797M8225P3676K6464k047l3559q6111j990m6592N41N0753j5513L7065
$$ plain form
15122 -31885 -33794 12595 73058 97289 69471 -643 104815 178530 185219 255775 317089 345487
15110 345487 411876 418215 463339 443049 387327 358443 219717 107048 99015 99132 121984 167856
15098 167856 247483 260055 278261 277000 245639 338434 346171 333933 429957 489465 530751 568254
15086 568254 569278 627437 697556 712054 654723 662301 537434 494134 407869 448897 581979
15075 581979 678591 671923 639137 690998 737310 728862 673030 597043 519278 504686 458845 452762
15063 452762 492622 506595 474783 509568 556811 586296 570561 505508 546914 582747 634843
15052 634843 682267 685212 657981 670477 649132 623599 616433 616886 599708 611294 724692 723379
15040 723379 647455 624803 637579 682920 758752 780786 702361 708371 810304 758575 759492 881880
$$ packed form
15122c1885j909M6389O0463K4231k7818p0114J05458P3715O689P0556O1314K8398
15110C45487O6389O339M5124k0290n5722k8884j38726j12669q033J17K2852M5872
15098A67856P9627J2572J8206j261l1361R2795P737j2238R6024N9508M1286L7503
15086E68254J024N8159P0119J4498n7331P578j24867m3300q6265M1028J33082
15075E81979R6612o668l2786N1861M6312q448n5832p5987p7765j4592m5841o083
15063D52762L9860J3973l1812L4785M7243K9485j5735o5053M1406L5833N2096
15052F34843M7424K945k7231J2496k1345k5533p166M53j7178J1586J13398j313
15040G23379p5924k2652J2776M5341P5832K2034p8425O010J01933n1729R17J22388
$$ plain form
15028 881880 957985 915937 912567 964912 954976 920451 964989 1020049 983418 961937 1077221 1207972
15016 1207972 1289669 1257795 1309159 1271475 1213382 1317510 1420986 1452497 1454360 1477290 1564660
15005 1564660 1585589 1568597 1608650 1616782 1705341 1729547 1734282 1848502 1985436 2054283 2070477
14994 2070477 2106983 2171414 2232031 2294655 2369174 2600665 2704921 2784860 2860107 3028238 3231123
14983 3231123 3448963 3620112 3852525 4041262 4215641 4456308 4676266 4820233 5184153
14974 5184153 5596320 5939565 6236099 6599589 6978644 7512340 8036491 8636130 9328539
14965 9328539 10025200 10839442 11879927 13070198 14382223 15853924 17609749 19640047
14957 19640047 21843399 24512561 27644299 31240922 35438333 40245619 45880643 52583223
$$ packed form
15028H81880P6105m2048l370N2345r936l4525M4538N5060l6631k1481J15284J30751
15016A207972Q1697l1874N1364l7684n8093J04128J03476L1511J863K2930Q7370
15005A564660K0929j6992M0053Q132Q8559K4206M735J14220J36934O8847J6194
14994B070477L6506O4431O0617O2624P4519K31491J04256P9939P5247J68131K02885
14983C231123K17840J71149K32413J88737J74379K40667K19958J43967L63920
14974E184153M12167L43245K96534L63490L79055N33696N24151N99639O92409
14965I328539O96661Q14242J040485J190271J312025J471701J755825K030298
14957A9640047K203352K669162L131738L596623M197411M807286N635024O702580
$$ plain form
14949 52583223 60353676 69276553 79376614 90650554 102803614 116189680 131190689
14942 131190689 148377624 168240520 191283557 217180605 245124375 273726643 300878344
14935 300878344 324436200 341766187 350247849 347726969 332620027 305236900 267937549
14928 267937549 224730768 180706846 140625337 107576969 82610615 65095911 53236975
14921 53236975 45136110 39477127 35333368 31904289 28872598 26246727 23967114 21679910
14913 21679910 19553511 17706262 16072498 14602315 13435350 12377097 11543732 10837117
14905 10837117 10224739 9742182 9288246 8790541 8343043 7954555 7612915 7286566 7040084
14896 7040084 6743190 6443060 6131104 5872384 5611325 5272908 5037870 4852253 4729859
$$ packed form
14949E2583223P770453Q922877J0100061J1273940J2153060J3386066J5001009
14942A31190689J7186935J9862896K3043037K5897048K7943770K8602268K7151701
14935C00878344K3557856J7329987Q481662k520880j5106942k7383127l7299351
14928B67937549m3206781m4023922m0081509l3048368k4966354j7514704j1858936
14921E3236975q100865n658983m143759l429079l031691k625871k279613k287204
14913B1679910k126399j847249j633764j470183j166965j058253q33365p06615
14905A0837117o12378m82557m53936m97705m47498l88488l41640l26349k46482
14896G040084k96894l00130l11956k58720k61059l38417k35038j85617j22394
$$ plain form
14887 4729859 4531921 4378271 4278438 4200448 4063444 3935660 3858704 3842070 3641303 3455860
14877 3455860 3270924 3122438 3029642 2917317 2783826 2722642 2621276 2468650 2460925 2381128
14867 2381128 2170320 2054506 2037532 1993773 1862616 1873174 1911065 1889069 1811367 1705352
14857 1705352 1657729 1559742 1410364 1365598 1397188 1285083 1276348 1416075 1420523 1257393 1166408
14846 1166408 1231039 1264612 1239793 1259846 1289844 1272992 1259372 1163961 1102127 1146529 1107922
14835 1107922 1128022 1151254 1094490 1127449 1097390 1081441 1031213 990538 971960 894384 796895
14824 796895 770184 815039 856251 792683 768692 754153 757707 694708 729774 772337 755256 672626
14812 672626 593550 479846 456656 391311 377153 432315 341407 309950 268994 304382 418229
$$ packed form
14887D729859j97938j53650r9833p7990j37004j27784p6956j6634k00767j85443
14877C455860j84936j48486r2796j12325j33491o1184j01366j52626p725p9797
14867B381128k10808j15814j6974m3759j31157J0558L7891k1996p7702j06015
14857A705352m7623r7987j49378m4766L1590j12105q735J39727M448j63130r0985
14846A166408O4631L3573k4819K0053K9998j6852j3620r5411o1834M4402l8607
14835A107922K0100K3232n6764L2959l0059j5949n0228m0675j8578p7576r7489
14824G96895k6711M4855M1212o3568k3991j4539L554o2999L5066M2563j7081q2630
14812F72626p9076j13704k3190o5345j4158N5162r0908l1457m0956L5388J13847
$$ plain form
14801 418229 490750 468976 438922 419107 340410 318506 319338 309388 270095 215494 197778 230005
14789 230005 247377 289695 162369 18354 60108 68765 107757 136204 115873 140850 150199
14778 150199 194781 310238 322703 363709 407720 350154 296152 308440 230159 228199 223051 204205
14766 204205 150528 89908 73886 21879 -9063 13296 29158 26952 88421 63511 104839 94256
14754 94256 127093 169207 199752 134976 150098 196794 246219 274472 343672 448274 516998
14743 516998 463687 443002 410287 352078 385540 418367 335328 222155 189339 108802 24634
14732 24634 46146 86756 74916 80496 34909 125749 81755 27290 64732 107383 26466 36212
14720 36212 156914 209192 156412 192092 199105 191986 168491 111126 11083 39131 119209 45319
$$ packed form
14801D18229P2521k1774l0054j9815p8697k1904Q32r950l9293n4601j7716L2227
14789B30005J7372M2318j27326j44015M1754Q657L8992K8447k0331K4977R349
14778A50199M4582J15457J2465M1006M4011n7566n4002J2288p8281j960n148j8846
14766B04205n3677o0620j6022n2007l0942K2359J5862k206O1469k4910M1328j0583
14754I4256L2837M2114L0545o4776J5122M6696M9425K8253O9200J04602O8724
14743E16998n3311k0685l2715n8209L3462L2827q3039j13173l2816q0537q4168
14732B4634K1512M0610j1840N580m5587R0840m3994n4465L7442M2651q0917R746
14720C6212J20702N2278n2780L5680P013p119k3495n7365j00043K8048Q0078p3890
$$ plain form
14708 45319 49797 92502 56602 67061 48238 17153 586 50137 92538 83953 142522 149768
14696 149768 144785 117000 85413 111496 158824 60063 7127 -96459 -128273 -49514 37250
14685 37250 61645 20823 43570 -5462 -14372 -56390 -123010 -115610 -96589 -49135 -18680 55569
14673 55569 39076 -27969 -72313 -31062 -6489 77890 122791 64597 -31619 -63173 -72231 -74752
14661 -74752 -94090 -75880 -118851 -248275 -266912 -175750 -137549 -164394 -104271 -79863 -48532
14650 -48532 -57681 -47285 -88817 -164968 -259716 -292302 -225094 -217240 -165005 -138798 -138527 -135253 -101299
14637 -101299 -91190 -110756 -179057 -142123 -121158 -156728 -192507 -97554 13993 -68286 -94836
14626 -94836 -38435 33804 80357 177214 340734 342255 338198 384991 354070 342960 334306 436732
$$ packed form
14708D5319M478M2705l5900J0459j8823l1085j6567M9551M2401q585N8569P246
14696A49768m983k7785l1587K6083M7328r8761n2936j03586l1814P8759Q6764
14685C7250K4395m0822K2747m9032q910m2018o6620P400J9021M7454L0455P4249
14673E5569j6493o7045m4344M1251K4573Q4379M4901n8194r6216l1554r058k521
14661g4752j9338J8210m2971j29424j8637R1162L8201k6845O0123K4408L1331
14650d8532r149J0396m1532p6151r4748l2586O7208P854N2235K6207K71L274L3954
14637a01299J0109j9566o8301L6934K0965l5570l5779R4953J11547q2279k6550
14626i4836N6401P2239M6553R6857J63520J521m057M6793l0921j1110q654J02426
$$ plain form
14614 436732 310317 217920 164855 160151 124597 98580 132860 137453 119886 141204 94584 31686
14602 31686 7322 26980 551 68661 142115 174073 223396 176040 154729 105700 65852 38638
14590 38638 39993 9791 81370 148714 161555 133588 85206 77687 54485 125611 75035 28313
14578 28313 2169 89003 61736 22426 42893 71552 58682 33580 47341 6556 -50740 -76497
14566 -76497 53593 117117 80737 2034 -19806 91937 83445 60147 83539 148257 79893
14555 79893 52270 81776 78282 -16072 -71782 -53602 -61272 -87314 -56515 -71410 -98985 -86021
14543 -86021 -102904 -33097 4973 -25260 -15908 -24150 21390 -17570 22235 67533 106188 155116
14531 155116 141313 174657 97565 -50355 -21523 59238 42910 56176 3645 3693 -32446 -89080
$$ packed form
14614D36732j26415r2397n3065m704l5554k6017L4280M593j7567K1318m6620o2898
14602C1686k4364J9658k6429O8110P3454L1958M9323m7356k1311m9029l9848k7214
14590C8638J355l0202P1579O7344J2841k7967m8382p519k3202P1126n0576m6722
14578B8313k6144Q6834k7267l9310K0467K8659j2870k5102J3761m0785n7296k5757
14566g6497J30090O3524l6380p8703k1840J11743q492k3298K3392O4718o8364
14555G9893k7623K9506l494r4354n5710J8180p670k6042L0799j4895k7575J2964
14543h6021j6883O9807L8070l0233R352q242M5540l8960L9805M5298L8655M8928
14531A55116j3803L3344p7092j47920K8832Q0761j6328J3266n2531M8l6139n6634
$$ plain form
14519 -89080 24430 104037 77215 96365 2430 -16603 -38382 -16267 6816 35526 117255
14508 117255 174843 213209 280624 220535 279433 366517 329299 341488 430666 440354 417005 483114
14496 483114 559025 729572 842461 902612 1080036 1243017 1377133 1487203 1572992 1663481
14486 1663481 1696000 1724925 1770840 1796382 1705623 1481775 1286685 1124031 925563 702224
14476 702224 524587 311612 222228 238847 261655 258401 168439 19013 80316 215674 233361
14465 233361 209439 127117 167737 246122 245269 236704 220476 207938 153549 82445 93800 65004
14453 65004 51539 73235 18851 -41609 35551 96266 79381 94471 91095 115132 85838 112210
14441 112210 126528 87538 27019 36367 34620 -5329 -17511 -34508 -57177 -10802 -76615 -115591
$$ packed form
14519h9080J13510P9607k6822J9150r3935j9033k1779K2115K3083K8710Q1729
14508A17255N7588L8366O7415o0089N8898Q7084l7218J2189Q9178R688k3349O6109
14496D83114P5911J70547J12889O0151J77424J62981J34116J10070Q5789R0489
14486A663481L2519K8925M5915K5542r0759k23848j95090j62654j98468k23339
14476G02224j77637k12975q9384J6619K2808l254q9962j49426O1303J35358J7687
14465B33361k3922q2322M0620P8385q53q565j6228j2538n4389p1104J1355k8796
14453F5004j3465K1696n4384o0460P7160O0715j6885J5090l376K4037k9294K6372
14441A12210J4318l8990o0519R348j747l9949j2182j6997k2669M6375o5813l8976
$$ plain form
14429 -115591 34791 154705 138374 110586 105276 129511 74115 57675 52143 105946 148890
14418 148890 134684 121501 95802 72336 21582 68444 70317 8141 14479 32297 72198 64447
14406 64447 118490 81777 48655 100518 42681 75570 65187 56757 128911 230941 221542 182523
14394 182523 110089 24399 3884 27324 5215 21465 83150 97604 73667 104643 142165
14383 142165 122242 53455 51465 -39334 -62966 -2737 139329 118590 90555 138813 200132
14372 200132 171703 120426 112929 91620 143461 75237 -7156 25374 43573 1578 55412 56791
14360 56791 8401 42077 48963 12614 30462 83600 168918 120851 136548 144851 60138 13153
14348 13153 68757 95856 2525 -61005 -88516 -45176 -67846 -20798 -50660 -138466 -57832 6568
$$ packed form
14429a15591J50382J19914j6331k7788n310K4235n5396j6440n532N3803M2944
14418A48890j4206j3183k5699k3466n0754M6862J873o2176O338J7818L9901p751
14406F4447N4043l6713l3122N1863n7837L2889j0383q430P2154J02030r399l9019
14394A82523p2434q5690k0515K3440k2109J6250O1685J4454k3937L0976L7522
14383A42165j9923o8787j990r0799k3632O0229J42066k0739k8035M8258O1319
14372B00132k8429n1277p497k1309N1841o8224q2393L2530J8199m1995N3834J379
14360E6791m8390L3676O886l6349J7848N3138Q5318m8067J5697Q303q4713m6985
14348A3153N5604K7099r3331o3530k7511M3340k2670M7048k9862q7806Q0634O4400
$$ plain form
14336 6568 47188 40561 83149 4963 2675 60867 48479 20967 34580 35039 839 44802 72131
14323 72131 -50732 -49550 -70275 -109890 -18199 -27192 -16656 84932 134626 115778 141388 118900
14311 118900 91414 26727 34037 87200 71750 74505 49923 100025 117125 122916 93479 27248
14299 27248 -535 -70810 -63133 -35449 31666 67670 77666 126185 109932 84942 44022 92437
14287 92437 106182 68092 100184 84805 143300 105052 22065 -26510 79424 90691 76561
14276 76561 70762 4660 -66199 -77381 -22452 13901 16232 -31126 -48050 -24455 -30947 -4875
14264 -4875 -1915 10734 21079 6874 56702 145443 148492 127179 148906 132786 151085 93747
14252 93747 93851 64584 24450 39434 29074 30595 2658 114333 179442 103986 154555 177976
$$ packed form
14336F568M0620o627M2588p8186k288N8192j2388k7512J3613M59l4200M3963K7329
14323G2131j22863J182k0725l9615R1691q993J0536J01588M9694j8848K5610k2488
14311A18900k7486o4687P310N3163j5450K755k4582N0102J7100N791k9437o6231
14299B7248k7783p0275P677K7684O7115L6004R996M8519j6253k4990m0920M8415
14287I2437J3745l8090L2092j5379N8495l8248q2987m8575J05934J1267j4130
14276G6561n799o6102p0859j1182N4929L6353K331m7358j6924K3595o492K6072
14264d875K960J2649J0345j4205M9828Q8741L049k1313K1727j6120J8299n7338
14252I3747J04k9267m0134J4984j0360J521k7937J11675O5109p5456N0569K3421
$$ plain form
14240 177976 191168 194251 157447 143781 93968 107135 75621 4859 21090 72792 116459 35497
14228 35497 -25886 40918 123073 146007 75727 -30514 -90065 14741 46015 45006 85823
14217 85823 81736 102864 83642 117089 164283 175620 132246 105193 44162 52873 56080 24582
14205 24582 90807 58049 29510 68049 127931 144793 124139 167664 135852 78756 84383 106071
14193 106071 187849 182259 110078 109440 80430 47871 10306 45164 59102 75229 73927 110361
14181 110361 169008 109508 87607 144488 114410 139656 183069 160999 108764 134798 178223
14170 178223 159257 80448 10311 64869 50154 121603 84949 101636 179287 250664 258134 158934
14158 158934 162520 46930 -44922 -80705 -58257 -31177 -4372 25417 82646 79555 49693 82662
$$ packed form
14240A77976J3192L083l6804j3666m9813J3167l1514p0762J6231N1702M3667q0962
14228C5497o1383O6804Q2155K2934p0280j06241n9551J04806L1274j009M0817
14217H5823m087K1128j9222L3447M7194J1337m3374k7053o1031Q711L207l1498
14205B4582O6225l2758k8539L8539N9882J6862k0654M3525l1812n7096N627K1688
14193A06071Q1778n590p2181o38k9010l2559l7565L4858J3938J6127j302L6434
14181A10361N8647n9500k1901N6881l0078K5246M3413k2070n2235K6034M3425
14170A78223j8966p8809p0137N4558j4715P1449l6654J6687P7651P1377P470r9200
14158A58934L586j15590r1852l5783K2448K7080K6805K9789N7229l091k9862L2969
$$ plain form
14146 82662 108706 65773 138261 176436 129676 38043 -56712 -64816 -5424 6230 21738 42944
14134 42944 78423 51165 83195 110233 96684 123028 158463 186672 197455 194043 214909 232251
14122 232251 193066 136480 171502 134293 90712 80375 54468 128294 167519 176415 80175 36999
14110 36999 74724 77975 38582 51411 35840 57084 113302 192426 193625 179857 190503 262735
14098 262735 217479 174691 123113 100427 121618 130652 85643 -22887 -63166 -40766 32649
14087 32649 94068 122622 116318 76428 89858 127730 196512 142152 21929 80500 202840
14076 202840 178088 81442 87395 105965 138681 54623 -19725 21557 110990 88580 51878 -53308
14064 -53308 2962 67318 143070 184224 116478 60835 14338 29350 202363 97431 14734
$$ packed form
14146H2662K6044m2933P2488L8175m6760r1633r4755q104N9392J1654J5508K1206
14134D2944L5479k7258L2030K7038j3549K6344L5435K8209J0783l412K0866J7342
14122B32251l9185n6586L5022l7209m3581j0337k5907P3826L9225Q896r6240m3176
14110C6999L7725L251l9393J2829j5571K1244N6218P9124J199j3768J0646P2232
14098B62735m5256m2788n1578k2686K1191R034m5009j08530m0279K2400P3415
14087C2649O1419K8554o304l9890J3430L7872O8782n4360j20223N8571J22340
14076B02840k4752r6646N953J8570L2716q4058p4348M1282Q9433k2410l6702j05186
14064e3308N6270O4356P5752M1154o7746n5643m6497J5012J73013j04932q2697
$$ plain form
14053 14734 -21506 77371 144038 127145 58721 110038 159375 26245 -14768 9737 33266
14042 33266 93975 215966 245713 223518 190734 118855 190275 171802 63532 34916 87480
14031 87480 97152 88087 43552 129327 171123 180139 156126 185680 200433 196872 187039 94223 108568
14018 108568 116291 120461 107586 109035 89856 152119 139949 73184 15368 26551 129004 163194
14006 163194 232301 268030 177170 118036 55323 102552 150073 144860 164383 180108 231224 206125
13994 206125 216788 248234 256556 338225 356747 318664 282428 202824 170790 186432 202735 164983
13982 164983 198979 276042 271150 210358 174826 104535 58956 155855 154032 153409 146346 127529
13970 127529 127708 146125 58929 42550 64361 71004 18474 24341 66099 136713 132387 177423
$$ packed form
14053A4734l6240R8877O6667j6893o8424N1317M9337j33130m1013K4505K3529
14042C3266O0709J21991K9747k2195l2784p1879P1420j8473j08270k8616N2564
14031H7480R672r065m4535Q5775M1796R016k4013K9554J4753l561r833r2816J4345
14018A08568P723M170j2875J449j9179O2263j2170o6765n7816J1183J02453L4190
14006A63194O9107L5729r0860n9134o2713M7229M7521n213J9523J5725N1116k5099
13994B06125J0663L1446Q322Q1669J8522l8083l6236p9604l2034J5642J6303l7752
13982A64983L3996P7063m892o0792l5532p0291m5579R6899j823o23p063j8817
13970A27529J79J8417q7196j6379K1811O643n2530N867M1758P0614m326M5036
$$ plain form
13958 177423 175273 193307 172623 79870 159427 271590 300473 334848 312627 251534 189731
13947 189731 170124 119066 213845 200074 181896 234530 242775 238482 172046 132114 135854 203690
13935 203690 217127 244708 211522 157408 154170 244202 244908 201049 200422 253083 274594 292560
13923 292560 300942 298503 271547 239683 233565 209311 223450 261990 310728 347505 270532 211521
13911 211521 82284 113878 139217 195764 293809 277937 264673 257127 265416 250164 179114 136557
13899 136557 321686 383822 266928 267489 319919 360993 327118 284464 221061 228999 251414 326031
13887 326031 323104 295412 277945 317765 297133 248863 300564 312533 251964 164038 179240 296876
13875 296876 280060 224370 190323 143390 149483 149056 141943 188814 233693 370666 420748 363798
$$ packed form
13958A77423k150J8034k0684r2753P9557J12163K8883L4375k2221o1093o1803
13947A89731j9607n1058R4779j3771j8178N2634Q245m293o6436l9932L740O7836
13935B03690J3437K7581l3186n4114l238R0032P06m3859o27N2661K1511J7966
13923B92560Q382k439k6956l1864o118k4254J4139L8540M8738L6777p6973n9011
13911B11521j29237L1594K5339N6547R8045j5872j3264p546Q289j5252p1050m2557
13899A36557J85129O2136j16894N61N2430M1074l3875m2654o3403P938K2415P4617
13887C26031k927k7692j7467L9820k0632m8270N1701J1969o0569q7926J5202J17636
13875B96876j6816n5690l4047m6933O093m27p113M6871M4879J36973N0082n6950
$$ plain form
13863 363798 392792 477512 478533 456909 413123 348628 327543 285819 270665 327090 321882 366817
13851 366817 424157 445711 485695 469240 419278 432596 398421 364658 335521 339532 292741 296494
13839 296494 389502 377061 326143 301587 319032 298233 279474 264435 254592 229606 222105 221627
13827 221627 224432 230245 219654 267414 259324 322316 360689 356798 329499 331796 337631 308480 358494
13814 358494 415229 456960 488585 521779 495457 395852 360511 361717 442750 428288 392225 335184
13802 335184 344793 408470 430532 483801 575356 552276 546997 583580 584630 521161 456044 421507
13790 421507 368647 392414 413336 398378 428010 442166 474169 498433 399824 415657 480461
13779 480461 392354 407396 436927 553624 592222 595871 591263 496103 580759 568718 556143 565200
$$ packed form
13863C63798K8994Q4720J021k1624m3786o4495k1085m1724j5154N6425n208M4935
13851C66817N7340K1554L9984j6455m9962J3318l4175l3763k9137M011m6791L753
13839B96494R3008j2441n0918k4556J7445k0799j8759j5039r843k4986p501m78
13827B21627K805N813j0591M7760q090O2992L8373l891k7299K297N835k9151N0014
13814C58494N6735M1731L1625L3194k6322r9605l5341J206Q1033j4462l6063n7041
13802C35184R609O3677K2062N3269R1555k3080n279L6583J050o3469o5117l4537
13790D21507n2860K3767K0922j4958K9632J4156L2003K4264r8609J5833O4804
13779D80461q8107J5042K9531J16697L8598L649m608r5160Q4656j2041j2575R057
$$ plain form
13767 565200 656551 626947 544590 482055 484891 482244 444698 434661 485693 518064 505966 597796
13755 597796 653643 667387 604475 587418 631154 681411 734332 770196 830247 784732 739118
13744 739118 715935 743049 739144 762465 795982 788768 781950 768279 765811 747238 761310 714512
13732 714512 781034 820804 775399 766286 737424 706476 703828 774221 830719 847043 809049 896706
13720 896706 965306 875476 861418 903281 961383 971271 916284 958849 1015851 1033797 908662
13709 908662 803883 763888 831261 847912 844823 802543 932800 1053053 1042180 1024023 1066911
13698 1066911 1135556 1039743 1024805 1041679 1103508 1211264 1210633 1151113 1161512 1272485 1259423
13687 1259423 1280377 1277209 1275041 1333459 1382548 1368232 1375503 1317006 1356144 1352594 1332867 1405819
$$ packed form
13767E65200R1351k9604q2357o2535K836k647l7546j0037N1032L2371j2098R1830
13755E97796N5847J3744o2912j7057M3736N0257N2921L5864O0051m5515m5614
13744G39118k3183K7114l905K3321L3517p214o818j3671k468j8573J4072m6798
13732G14512O6522L9770m5405r113k8862l0948k648P0393N6498J6324l7994Q7657
13720H96706O8600q9830j4058M1863N8102R888n4987M2565N7002J7946j25135
13709I08662j04779l9995O7373J6651l089m2280J30257J20253j0873j8157M2888
13698A066911O8645r5813j4938J6874O1829J07756o31n9520J0399J10973j3062
13687A259423K0954l168k168N8418M9089j4316P271n8497L9138l550j9727P2952
$$ plain form
13675 1405819 1488503 1467984 1534439 1540995 1501269 1465115 1451566 1453568 1454459 1403582 1384914 1443567
13663 1443567 1520014 1482224 1466924 1472940 1464277 1502655 1532772 1564070 1543356 1549493 1566281 1557466
13651 1557466 1562531 1603752 1566888 1490654 1511946 1528714 1559888 1538439 1567626 1625641 1540614
13640 1540614 1519402 1567070 1609318 1604496 1653596 1613500 1621514 1626858 1724341 1770067 1770051 1803181
13628 1803181 1695470 1708143 1786264 1821111 1792041 1716189 1743898 1771147 1839472 1813263 1855647
13617 1855647 1943733 2005511 2011278 1952454 2069390 2146604 2125769 2144515 2237291 2337259 2323396
13606 2323396 2227762 2164426 2202988 2297385 2332115 2416955 2454934 2439919 2442915 2469781 2483186
13595 2483186 2490312 2588974 2612249 2686639 2609587 2547299 2632519 2724302 2692972 2742389 2756799
$$ packed form
13675A405819Q2684k0519O6455O556l9726l6154j3549K002Q91n0877j8668N8653
13663A443567P6447l7790j5300O016q663L8378L0117L1298k0714O137J6788q815
13651A557466N065M1221l6864p6234K1292J6768L1174k1449K9187N8015q5027
13640A540614k1212M7668M2248m822M9100m0096Q014N344R7483M5726j6L3130
13628A803181j07711J2673P8121L4847k9070p5852K7709K7249O8325k6209M2384
13617A855647Q8086O1778N767n8824J16936P7214k0835J8746R2776R9968j3863
13606B323396r5634o3336L8562R4397L4730Q4840L7979j5015K996K6866J3405
13595B483186P126R8662K3275P4390p7052o2288Q5220R1783l1330M9417J4410
$$ plain form
13584 2756799 2851610 2902905 2931318 3001569 3077071 3108120 3082170 3089643 3139610 3136507 3201753 3332211
13572 3332211 3388144 3346153 3439089 3556522 3579804 3588177 3649105 3676040 3751849 3769108 3802264
13561 3802264 3913007 3878458 3887522 3930577 3996374 4110180 4206877 4315369 4372795 4452377 4520201
13550 4520201 4435090 4472022 4569312 4651548 4784399 4888676 5008677 5047646 4997309 5048178 5203184
13539 5203184 5323619 5373564 5547384 5663595 5697276 5739743 5923973 6051665 6086760 6121077
13529 6121077 6221822 6333988 6451526 6558335 6665774 6839463 6992334 7012890 7039610 7200255
13519 7200255 7376734 7465395 7601282 7792984 8037180 8135861 8338884 8568850 8769325 8922866
13509 8922866 9118774 9299709 9383786 9538965 9779330 9911891 10059904 10333229 10581802 10803083
$$ packed form
13584B756799R4811N1295K8413P0251P5502L1049k5950P473M9967l103O5246J30458
13572C332211N5933m1991R2936J17433K3282Q373O0928K6935P5809J7259L3156
13561C802264J10743l4549R064M3055O5797J13806R6697J08492N7426P9582O7824
13550D520201q5111L6932R7290Q2236J32851J04277J20001L8969n0337N0869J55006
13539E203184J20435M9945J73820J16211L3681M2467J84230J27692L5095L4317
13529F121077J00745J12166J17538J06809J07439J73689J52871K0556K6720J60645
13519G200255J76479Q8661J35887J91702K44196R8681K03023K29966K00475J53541
13509H922866J95908J80935Q4077J55179K40365J32561J48013K73325K48573K21281
$$ plain form
13499 10803083 11079134 11329533 11500157 11789622 11987207 12200144 12540940 12908352 13264535
13490 13264535 13522176 13835810 14139092 14327460 14589908 14978452 15450765 15846594 16242121
13481 16242121 16648305 17164944 17671756 18126015 18543389 19032405 19542865 20086872 20605899
13472 20605899 21180617 21752228 22203889 22757648 23349982 23980002 24715445 25383742 26078568
13463 26078568 26751542 27448898 28120487 28892280 29544095 30331139 31256428 32129524 33020846
13454 33020846 33929112 34735815 35564565 36529123 37473678 38494333 39538757 40555769 41555161
13445 41555161 42588143 43577425 44550853 45489854 46470984 47492293 48432345 49283343 50119806
13436 50119806 50910713 51769258 52584368 53322110 54010700 54599728 55150707 55608790 56063726
$$ packed form
13499A0803083K76051K50399J70624K89465J97585K12937L40796L67412L56183
13490A3264535K57641L13634L03282J88368K62448L88544M72313L95829L95527
13481A6242121M06184N16639N06812M54259M17374M89016N10460N44007N19027
13472B0605899N74718N71611M51661N53759N92334O30020P35443O68297O94826
13463B6078568O72974O97356O71589P71793O51815P87044R25289Q73096Q91322
13454C3020846R08266Q06703Q28750R64558R44555J020655J044424J017012R99392
13445D1555161J032982R89282R73428R39001R81130J021309R40052Q50998Q36463
13436E0119806P90907Q58545Q15110P37742O88590N89028N50979M58083M54936
$$ plain form
13427 56063726 56499372 56892066 57079453 57093322 57177312 57227802 57089720 56840305 56583814 56328176
13417 56328176 55934005 55445461 54924639 54297731 53700219 53107801 52422822 51713970 50855522
13408 50855522 49983055 49051437 48083669 47110153 46182328 45250891 44310066 43236081 42126801
13399 42126801 41115886 40193049 39291953 38377033 37371082 36397140 35557801 34709752 33868829
13390 33868829 32979782 32132132 31326076 30564994 29773571 29002690 28198509 27460714 26738569
13381 26738569 26133271 25451470 24818531 24146991 23579220 22990720 22404136 21751038 21152034
13372 21152034 20561324 19990308 19500307 19050972 18609171 18149471 17812870 17388119 17046744
13363 17046744 16693260 16375629 15949573 15521480 15184733 14841498 14439263 14105119 13778666
$$ packed form
13427E6063726M35646L92694J87387J3869Q3990N0490j38082k49415k56491k55638
13417E6328176l94171m88544n20822o26908n97512n92418o84979p08852q58448
13408E0855522q72467r31618r67768r73516r27825r31437r40825j073985j109280
13399D2126801j010915r22837r01096r14920j005951r73942q39339q48049q40923
13390C3868829q89047q47650q06056p61082p91423p70881q04181p37795p22145
13381B6738569o05298o81801o32939o71540n67771n88500n86584o53098n99004
13372B1152034n90710n71016m90001m49335m41801m59700l36601m24751l41375
13363A7046744l53484l17631m26056m28093l36747l43235m02235l34144l26453
$$ plain form
13354 13778666 13508946 13279673 12981244 12697289 12384977 12166425 11921469 11641787 11424469
13345 11424469 11282114 11038694 10764369 10538394 10332532 10059181 9899968 9667491 9451071
13336 9451071 9299230 9154867 8966454 8811934 8691147 8533682 8353029 8193825 7987587
13327 7987587 7772387 7623551 7515217 7387200 7190122 7068876 7027262 6926421 6874618 6748132
13317 6748132 6555954 6388153 6222149 6093204 6033560 5900993 5846497 5773316 5756247 5710797
13307 5710797 5543644 5448079 5451874 5432010 5318598 5207630 5072812 5001474 4892031 4727414
13297 4727414 4673040 4544749 4498998 4496307 4452026 4372112 4321498 4285696 4245122 4233830 4187847
13286 4187847 4135966 4104606 4013854 3955774 3926728 3869159 3794012 3712899 3672583 3576233 3599376
$$ packed form
13354A3778666k69720k29273k98429k83955l12312k18552k44956k79682k17318
13345A1424469j42355k43420k74325k25975k05862k73351j59213k32477k16420
13336I451071j51841j44363j88413j54520j20787j57465j80653j59204k06238
13327G987587k15200j48836j08334j28017j97078j21246m1614j00841n1803j26486
13317F748132j92178j67801j66004j28945n9644j32567n4496p3181j7069m5450
13307E710797j67153r5565L795j9864j13412j10968j34818p1338j09443j64617
13297D727414n4374j28291m5751k691m4281p9914n0614l5802m0574j1292m5983
13286D187847n1881l1360r0752n8080k9046n7569p5147q1113m0316r6350K3143
$$ plain form
13275 3599376 3651144 3603317 3519038 3412709 3383504 3296721 3265299 3188185 3052580 3024534 3046070
13264 3046070 3043698 3027668 3000128 2939281 2814398 2769044 2779123 2793262 2781878 2808955 2754687
13253 2754687 2672386 2592421 2608063 2677603 2609133 2626717 2593087 2517678 2425090 2451120 2400702
13242 2400702 2332105 2303594 2331648 2250092 2235834 2193558 2214540 2269253 2291359 2231325 2200207
13231 2200207 2141107 2045145 1949987 2056003 2135058 2125764 2003985 1977343 2009565 1974341 1979708
13220 1979708 1941207 1928307 1964471 1961519 1881156 1830576 1804093 1779868 1750940 1784739 1682786
13209 1682786 1696152 1698436 1666569 1631690 1652664 1672383 1651837 1591898 1617725 1665898 1665368 1623894
13197 1623894 1602426 1632950 1576345 1660823 1720046 1637661 1641495 1560078 1539786 1484573 1528025
$$ packed form
13275C599376N1768m7827q4279j06329k9205q6783l1422p7114j35605k8046K1536
13264C046070k372j6030k7540o0847j24883m5354J0079J4139j1384K7077n4268
13253B754687q2301p9965J5642O9540o8470J7584l3630p5409r2588K6030n0418
13242B400702o8597k8511K8054q1556j4258m2276K0982N4713K2106o0034l1118
13231B200207n9100r5962r5158J06016P9055r294j21779k6642L2222l5224N367
13220A979708l8501j2900L6164k952q0363n0580k6483k4225k8928L3799j01953
13209A682786J3366K284l1867l4879K0974J9719k0546n9939K5827M8173n30m1474
13197A623894k1468L0524n6605Q4478N9223q2385L834q1417k0292n5213M3452
$$ plain form
13186 1528025 1488908 1458331 1424185 1377628 1409090 1413233 1471863 1536660 1489602 1445759 1401392
13175 1401392 1405189 1371955 1336156 1294938 1309277 1299732 1352470 1397344 1324893 1269665 1275449 1255945
13163 1255945 1215119 1255358 1251642 1226610 1219957 1280841 1199047 1084147 1056811 1069196 1069441 1185374
13151 1185374 1213562 1153241 1117399 1164329 1117932 1062736 1044725 1013143 938627 866256 856268
13140 856268 914998 909796 985172 979406 1018696 1062424 972997 887702 831836 827420 897808 913305
13128 913305 875592 860576 765492 778416 796282 797600 770508 712851 704988 698665 685768 713135
13116 713135 768638 770713 720772 791649 905089 882668 819499 845157 835687 874557 807088 763239
13104 763239 849956 825654 778211 776446 765428 735001 711490 658665 692732 650331 632152 711755
$$ packed form
13186A528025l9117l0577l4146m6557L1462M143N8630O4797m7058m3843m4367
13175A401392L797l3234l5799m1218J4339r545N2738M4874p2451n5228N784j9504
13163A255945m0826M0239l716k5032o653O0884q1794j14900k7336J2385K45J15933
13151A185374K8188o0321l5842M6930m6397n5196j8011l1582p4516p2371r988
13140H56268N8730n202P5376n766L9290M3728q9427q5295n5866m416P0388J5497
13128I13305l7713j5016r5084J2924J7866J318k7092n7657p863o323j2897K7367
13116G13135N5503K075m9941P0877J13440k2421o3169K5658r470L8870o7469m3849
13104G63239Q6717k4302m7443j765j1018l0427k3511n2825L4067m2401j8179P9603
$$ plain form
13092 711755 706505 752569 783257 805449 801382 830206 773257 684470 675850 699357 661226 588569
13080 588569 625776 618908 594998 667877 601704 660653 723875 688898 610293 580097 530926 527089
13068 527089 546993 568934 541070 542015 562128 540969 561498 609075 617562 562500 547320 533153
13056 533153 534957 539041 458635 469635 556248 646047 547238 560300 660854 711773 686553 632088
13044 632088 613767 593179 585195 526583 575688 599584 556709 489348 481935 465496 490674 481236
13032 481236 516833 578488 628019 543482 491478 493177 493091 504153 512745 508316 472361 469301 577105
13019 577105 578287 576449 474313 402603 428473 472379 412512 339986 255384 263025 277036 300572
13007 300572 350708 325534 349628 343717 280230 279433 245569 265554 252145 306680 332028 352315
$$ packed form
13092G11755n250M6064L0688K2192m067K8824n6949q8787q620K3507l8131p2657
13080E88569L7207o868k3910P2879o6173N8949O3222l4977p8605l0196m9171l837
13068E27089J9904K1941k7864R45K0113k1159K0529M7577Q487n5062j5180j4167
13056E33153J804M084q0406J1000Q6613Q9799r8809J3062J00554N0919k5220n4465
13044F32088j8321k0588p984n8612M9105K3896m2875o7361p413j6439K5178r438
13032D81236L5597O1655M9531q4537n2004J699q6J1062Q592m429l5955l060J07804
13019E77105J182j838j02136p1710K5870M3906n9867p2526q4602P641J4011K3536
13007C00572N0136k5174K4094n911o3487p97l3864J9985j3409N4535K5348K0287
$$ plain form
12995 352315 402908 438270 428970 359702 321764 376252 432372 466217 451556 455332 428341 371248
12983 371248 331051 243789 260022 279812 325830 357403 380105 370885 389492 361050 361703 346587
12971 346587 306704 293057 283906 385623 467691 517396 464672 451338 428427 361547 343594
12960 343594 398479 381347 371143 320269 250664 238959 184394 164055 227365 218457 163154 138990
12948 138990 103728 171910 292430 397497 329624 257226 288796 299756 259111 223556 241176
12937 241176 317476 321958 333679 246273 163672 128053 134635 137799 113601 199436 362625 376658
12925 376658 342474 241622 190858 186752 192762 207983 255669 316968 296903 348134 405526 405976
12913 405976 394192 316627 267618 272700 272451 268899 244222 235600 271380 268009 266013 209371 221001
$$ packed form
12995C52315N0593L5362r300o9268l7938N4488N6120L3845j4661L776k6991n7093
12983C71248m0197q7262J6233J9790M6018L1573K2702r220J8607k8442O53j5116
12971C46587l9883j3647r151J01717Q2068M9705n2724j3334k2911o6880j7953
12960C43594N4885j7132j0204n0874o9605j1705n4565k0339O3310q908n5303k4164
12948A38990l5262O8182J20520J05067o7873p2398L1570J0960m0645l5555J7620
12937B41176P6300M482J1721q7406q2601l5619O582L164k4198Q5835J63189J4033
12925C76658l4184j00852n0764m106O010J5221M7686O1299k0065N1231N7392M50
12913D05976j1784p7565m9009N082k49l552k4677q622L5780l371j996n6642J1630
$$ plain form
12900 221001 279251 264836 261939 218478 99471 2423 86318 147241 133161 108980 152213
12889 152213 200147 226405 302721 327101 387025 367218 300366 305951 292573 313089 255217 226350
12877 226350 257888 279715 213954 164353 161336 125330 132653 154994 202486 157519 128309 194154
12865 194154 226882 275932 245273 202609 201457 181038 148807 99883 158526 185992 162960 137130
12853 137130 181440 236586 177338 204907 220873 226012 222181 161117 205775 232809 203680 183336
12841 183336 175574 169460 192249 286353 352150 258382 154502 207669 203190 210337 170569 193942
12829 193942 148291 95735 -9156 67743 77926 57717 24130 10796 83444 117133 131293
12818 131293 186514 240012 205581 167791 189654 209962 245434 308402 261061 205900 159402
$$ packed form
12900B21001N8250j4415k897m3461j19007r7048Q3895O0923j4080k4181M3233
12889A52213M7934K6258P6316K4380N9924j9807o6852N585j3378K0516n7872k8867
12877B26350L1538K1827o5761m9601l017l6006P323K2341M7492m4967k9210O5845
12865A94154L2728M9050l0659m2664j152k0419l2231m8924N8643K7466k3032k5830
12853A37130M4310N5146n9248K7569J5966N139l831o1064M4658K7034k9129k0344
12841A83336p762o114K2789R4104O5797r3768j03880N3167m479P147l9768K3373
12829A93942m5651n2556j04891P6899J0183k0209l3587j3334P2648L3689J4160
12818A31293N5221N3498l4431l7790K1863K0308L5472O2968m7341n5161m6498
$$ plain form
12807 159402 174050 158180 177807 214016 231208 250434 214265 154200 157768 151479 156136 213694
12795 213694 208813 197195 286734 292945 241254 197273 192000 266581 297250 298569 244914 154688
12783 154688 72447 87731 96719 129416 143128 164113 171141 189537 172363 122569 145480 91574
12771 91574 135466 212473 233621 276499 269501 243374 166597 229996 224242 189614 172446 127269
12759 127269 74422 119524 118818 95163 122580 150875 192040 217380 258061 304777 242270 258436
12747 258436 354908 288355 91741 94168 136616 69275 34714 57359 76056 129463 191291
12736 191291 136324 69961 133228 126441 57806 75785 121482 179991 158471 60323 55897 -24955
12724 -24955 15707 23087 48440 114630 60310 19908 18510 34894 99135 155813 184037 128915
$$ packed form
12807A59402J4648j5870J9627L6209J7192J9226l6169o0065L568o289M657N7558
12795B13694m881j1618Q9539O211n1691m3981n273P4581L0669J319n3655r0226
12783A54688q2241J5284Q988L2697J3712K0985P028J8396j7174m9794K2911n3906
12771I1574M3892P7007K1148M2878o998k6127p6777O3399n754l4628j7168m5177
12759A27269n2847M5102p06k3655K7417K8295M1165K5340M0681M6716o2507J6166
12747B58436R6472o6553j96614K427M2448o7341l4561K2645J8697N3407O1828
12736A91291n4967o6363O3267o787o8635J7979M5697N8509k1520r8148m426q0852
12724b4955M0662P380K5353O6190n4320m0402j398J6384O4241N6678K8224n5122
$$ plain form
12712 128915 166801 231159 217539 208197 137784 162404 183680 134641 119953 159824 170011 236752
12700 236752 162762 122273 92146 89181 50231 54125 114270 110269 97692 117795 129535 114526
12688 114526 71552 106591 94561 160920 218934 233386 153171 34617 47456 101592 33973
12677 33973 57049 136283 148769 146253 115859 127298 128854 43453 58705 117594 142125 93922
12665 93922 119433 188233 163818 108856 123171 147242 166170 48302 94047 192123 200022 134905
12653 134905 13486 -47351 6868 35308 -6604 67215 75429 145965 148916 116160 106864 135385
12641 135385 126067 78085 94658 97401 81386 102085 115190 147045 203812 229008 162262 142786
12629 142786 163661 138521 6612 -30047 1462 70489 38599 63813 154364 84117 -301
$$ packed form
12712A28915L7886O4358j3620r342p0413K4620K1276m9039j4688L9871J0187O6741
12700B36752p3990m0489l0127k965l8950L894O0145m001j2577K0103J1740j5009
12688A14526m2974L5039j2030O6359N8014J4452q0215j18554J2839N4136o7619
12677C3973K3076P9234J2486k516l0394J1439J556q5401J5252N8889K4531m8203
12665I3922K5511O8800k4415n4962J4315K4071J8928j17868M5745R8076P899o5117
12653A34905j21419o0837N4219K8440m1912P3819Q214P0536K951l2756r296K8521
12641A35385r318m7982J6573K743j6015K0699J3105L1855N6767K5196o6746j9476
12629A42786K0875k5140j31909l6659L1509O9027l1890K5214R0551p0247q4418
$$ plain form
12618 -301 19036 50420 13075 -3236 66267 118425 66956 53049 86316 85902 135178 136755 107207
12605 107207 43406 21125 39013 -1599 -6704 96012 183979 177938 140465 164897 217245 156775
12593 156775 49393 34649 30332 -1035 11069 28693 54492 71773 102790 90144 17414
12582 17414 -106820 -142602 -160542 -161164 -107061 -45934 2262 -33311 -59366 37023 80860 55842
12570 55842 66409 73864 52892 12674 -15366 65530 99037 44382 90160 125165 92469 49435
12558 49435 16811 -55410 -9278 75221 80224 59054 54386 -24113 -16322 -49694 -79923 -88098
12546 -88098 -83481 32337 84301 73092 47486 -21387 -14639 67358 125367 132473 130035 173229
12534 173229 97717 17578 -15613 12260 -70880 -84148 -34904 -7247 -34843 6968 34474
$$ packed form
12618c01J9337L1384l7345j6311O9503N2158n1469j3907L3267m14M9276J577k9548
12605A07207o3801k2281J7888m0612n105J02716Q7967o041l7473K4432N2348o0470
12593A56775j07382j4744m317l1367J2104J7624K5799J7281L1017j2646p2730
12582A7414j24234l5782j7940o22N4103O1127M8196l5573k6055R6389M3837k5018
12570E5842J0567P455k0972m0218k8040Q0896L3507n4655M5778L5005l2696m3034
12558D9435l2624p2221M6132Q4499N003k1170m668p8499P791l3372l0229q175
12546h8098M617J15818N1964j1209k5606o8873O748Q1997N8009P106k438M3194
12534A73229p5512q0139l3191K7873q3140j3268M9244K7657k7596M1811K7506
$$ plain form
12523 34474 -10312 14594 146247 97680 -42375 -9858 14681 19561 35405 80238 80108 15092
12511 15092 24720 48302 28999 30692 8999 23112 31616 385 -73787 -121335 -30720 -8105
12499 -8105 -63583 -28877 -842 65261 33752 -73988 -53025 -2483 65171 91347 134329 172247
12487 172247 70533 -39055 -107302 -117404 -37610 -42260 -29935 -65433 -28961 38881 15273
12476 15273 -43924 6587 -48131 -76187 -49673 -75881 -63542 -72894 13832 -27035 -43331 24543
12464 24543 -14059 -47773 -41901 -6635 -2889 -56209 -96432 -79533 -124346 -92891 -104233 -44795
12452 -44795 85725 135345 114561 90746 113014 73140 51839 71094 50155 82169 108827
12441 108827 152285 102815 120129 -14474 -74373 65135 127177 120238 86933 -13356 -7946
$$ packed form
12523C4474m4786K4906J31653m8567j40055L2517K4539M880J5844M4833j30o5016
12511A5092R628K3582j9303J693k1693J4113Q504l1231p4172m7548R0615K2615
12499h105n5478L4706K8035O6103l1509j07740K0963N0542O7654K6176M2982L7918
12487A72247j01714j09588o8247j0102P9794m650J2325l5498L6472O7842k3608
12476A5273n9197N0511n4718k8056K6514k6208J2339r352Q6726m0867j6296O7874
12464B4543l8602l3714N872L5266L746n3320m0223J6899m4813L1455j1342N9438
12452d4795J30520M9620k0784k3815K2268l9874k1301J9255k0939L2014K6658
12441A08827M3458m9470J7314j34603n9899J39508O2042o939l3305j00289N410
$$ plain form
12430 -7946 -59629 -81474 -28489 -31874 -30419 -22250 57200 65344 -14091 39106 125367 88352 67568
12417 67568 41727 71798 64991 14066 9971 43539 76481 51886 115497 99289 28331 53222
12405 53222 54779 51044 16403 33208 3720 17855 -26170 -23305 -43088 -16524 -53619 17835
12393 17835 15168 -15516 25046 28498 -15707 57944 59981 11671 -35672 -7174 -13613 -21490 33952
12380 33952 82001 66016 101873 56150 33453 16719 90929 105631 34308 20831 67231 -23726
12368 -23726 -75021 25896 94590 51996 -22543 -9886 48687 -2839 -55856 20165 22420 -1451
12356 -1451 93419 69032 -82082 -95980 -34491 -38174 -46711 -30696 7068 9087 9110 71517 108971
12343 108971 78441 14713 27352 54165 -22829 -130279 -123317 -42242 -3038 86443 113867
$$ packed form
12430g946n1683k1845N2985l385J455Q169P9450Q144p9435N3197Q6261l7015k0784
12417F7568k5841L0071o807n0925m095L3568L2942k4595O3611j6208p0958K4891
12405E3222J557l735l4641J6805k9488J4135m4025K865j9783K6564l7095P1454
12393A7835k667l0684M0562L452m4205P3651K037m8310m7343K8498o439p877N5442
12380C3952M8049j5985L5857m5723k2697j6734P4210J4702p1323j3477M6400r0957
12368b3726n1295J00917O8694m2594p4539J2657N8573n1526n3017P6021K255k3871
12356a451R4870k4387j51114j3898O1489l683q537J6015L7764K019K3O2407L7454
12343A08971l0530o3728J2639K6813p6994j07450O962Q1075L9204Q9481K7424
$$ plain form
12332 113867 82768 21540 21711 78719 146070 74826 53291 11605 7270 81885 195092 185046
12320 185046 172094 88361 -1276 -48016 -84952 -104082 -59192 -21991 42568 41105 -2243 -31845
12308 -31845 -46423 -37668 4077 13934 -12880 11546 32885 53243 50528 -19709 -50064 4122
12296 4122 6679 26201 54361 64402 -30235 -102075 2441 -37700 -36360 10481 -12896 -27250
12284 -27250 440 86263 41519 36477 61994 135267 143326 30000 38391 123204 124506 127312
12272 127312 145756 113406 86128 81531 27825 -26248 -3522 56276 54578 -75980 -131023 -127704
12260 -127704 -99410 -1282 -13034 -52535 -97040 -124559 -71232 -11480 17689 -23422 -14427 -41419
12248 -41419 -81683 17241 77240 45592 45027 82097 113799 77670 128992 123024 19962 20690
$$ packed form
12332A13867l1099o1228J71N7008O7351p1244k1535m1686m335P4615J13207j0046
12320A85046j2952q3733q9637m6740l6936j9130M4890L7201O4559j463m3348k9602
12308c1845j4578Q755M1745R857k6814K4426K1339K0358k715p0237l0355N4186
12296D122K557J9522K8160J0041r4637p1840J04516m0141J340M6841k3377j4354
12284b7250K7690Q5823m4744n042K5517P3273Q059j13326Q391Q4813J302K806
12272A27312J8444l2350k7278m597n3706n4073K2726N9798j698j30558n5043L319
12260a27704K8294R8128j1752l9501m4505k7519N3327N9752K9169m1111Q995k6992
12248d1419m0264R8924N9999l1648n65L7070L1702l6129N1322n968j03062P28
$$ plain form
12236 20690 72508 -8926 -54923 -34615 14973 26484 62383 47894 17738 53762 108131 97220
12224 97220 145029 132136 36123 -16534 -77553 -56026 47387 140448 105091 75818 55977
12213 55977 12866 -38530 -41315 28277 35268 -23798 -58611 -59618 -139905 -198324 -138314 -121350
12201 -121350 -143423 -125571 -102505 -157150 -100155 -33789 -5382 35274 9326 29738 31566 -7272
12189 -7272 47506 80899 21053 7219 48746 -1961 24587 41761 17942 67849 94950 51693
12177 51693 77570 56402 -67544 -89343 -108668 -14477 56847 39070 4204 -30414 -35197 27587
12165 27587 130425 137979 85008 66613 -12682 -34260 -46782 7200 -22380 -26300 -4463 24757
12153 24757 18575 115721 137051 100265 45152 78044 117271 120064 144475 57849 94775 70718
$$ packed form
12236B0690N1818q1434m5997K0308M9588J1511L5899j4489l0156L6024N4369j0911
12224I7220M7809j2893r6013n2657o1019K1527J03413R3061l5357k9273j9841
12213E5977m3111n1396k785O9592O991n9066l4813j007q0287n8419O0010J6964
12201a21350k2073J7852K3066n4645N6995O6366K8407M0656k5948K0412J828l8838
12189g272N4778L3393n9846j3834M1527n0707K6548J7174k3819M9907K7101m3257
12177E1693K5877k1168j23946k1799j9325R4191P1324j7777l4866l4618m783O2784
12165B7587J02838P554n2971j8395p9295k1578j2522N3982k9580l920K1837K9220
12153B4757o182R7146K1330l6786n5113L2892L9227K793K4411q6626L6926k4057
$$ plain form
12141 70718 63076 99326 84413 49268 -36944 -56294 -100612 -88768 -85940 -80609 -67647 -5076
12129 -5076 29981 41250 19050 -23330 -22440 -32967 -14475 56517 49056 38220 41125 -28249 23982
12116 23982 51803 15986 51059 65477 31889 33275 38232 90553 18942 -74623 -90509 -40520
12104 -40520 33908 89769 143541 134867 148532 172667 250605 255551 131922 -14585 -45788 -65159
12092 -65159 5020 143108 129870 73189 96111 2210 18116 63289 -2185 51915 53717 2820
12080 2820 12182 64729 63489 11290 29007 73077 14536 41730 29041 -37491 -71529 -95470
12068 -95470 -138886 -122497 -79181 -62603 -138442 -120937 -54659 -8602 43453 134215 86763 89376
12056 89376 62781 9690 61023 44241 28009 -32389 -89517 -63810 5533 41364 15192 -22442
$$ packed form
12141G0718p642L6250j4913l5145q6212j9350m4318J1844K828N331J2962O2571
12129e076L5057J1269k2200m2380Q90j0527J8492P0992p461j0836K905o9374N2231
12116B3982K7821l5817L5073J4418l3588J386M957N2321p1611r3565j5886M9989
12104d0520P4428N5861N3772q674J3665K4135P7938M946j23629j46507l1203j9371
12092f5159P0179J38088j3238n6681K2922r3901J5906M5173o5474N4100J802n0897
12080B820R362N2547j240n2199J7717M4070n8541K7194j2689o6532l4038k3941
12068i5470m3416J6389M3316J6578p5839J7505O6278M6057N2055R0762m7452K613
12056H9376k6595n3091N1333j6782j6232o0398n7128K5707O9343L5831k6172l7634
$$ plain form
12044 -22442 -21948 -17407 29947 127423 94952 27285 -4014 -21664 -27725 72925 57186 -11474
12032 -11474 -50278 -58371 -19380 22332 56023 40075 61329 55410 71861 105069 104921 50074
12020 50074 -14484 -24266 -50738 -70010 35896 51812 -17700 17971 9934 15461 22498 -9224
12008 -9224 2003 140377 123192 47916 -30959 -36883 -63921 -83621 -49648 -27917 -46517 -55289
11996 -55289 17265 102884 130100 142900 90793 21436 -22184 -40423 -124775 -89799 -34593 -36000
11984 -36000 -63130 -108136 -60846 -8481 -47515 -34979 25488 52197 36268 24246 -58980 -31015
11972 -31015 96429 87410 36008 41483 -60607 -45101 27873 61615 63178 61408 61017 -1287
11960 -1287 -40112 -47162 -40342 467 6130 46267 87588 94646 57290 43844 32913 51922 41759
$$ packed form
12044b2442M94M541M7354R7476l2471o7667l1299j7650o061J00650j5739o8660
12032a1474l8804q093L8991M1712L3691j5948K1254n919J6451L3208j48n4847
12020E0074o4558r782k6472j9272J05906J5916o9512L5671q037N527P037l1722
12008i224J1227J38374j7185p5276p8875n924k7038j9700L3973K1731j8600q772
11996e5289P2554Q5619K7216J2800n2107o9357m3620j8239q4352L4976N5206j407
11984c6000k7130m5006M7290N2365l9034J2536O0467K6709j5929j2022q3226K7965
11972c1015J27444r019n1402N475j02090J5506P2974L3742J563j770l91o2304
11960a287l8825p050O820M0809N663M0137M1321P058l7356j3446j0931J9009j0163
$$ plain form
11947 41759 47175 60923 -39941 -32762 15721 65444 30718 50058 30986 133915 81530 279
11935 279 66700 119722 120357 18216 -26740 -98837 -69063 90680 128099 62554 -6570 36117
11923 36117 25811 33586 -43071 -31129 19076 83917 73278 18998 68590 129096 74172 44805
11911 44805 26429 -67878 -97607 -92651 -102201 -114774 -58442 19813 89120 20618 5843 29395
11899 29395 -66770 -122315 -122232 -102429 -3951 77341 70560 50217 85630 56179 107819 30280
11887 30280 45290 57185 31380 57229 31100 42504 93870 136589 79885 -39333 -69984
11876 -69984 -27252 -24963 66274 35056 -1928 5239 -37893 -72347 -67230 7019 -2106 42990
11864 42990 91921 91237 -23078 -8290 -3923 -40227 -103998 -38466 13252 -238 23482 96274
$$ packed form
11947D1759N416J3748j00864P179M8483M9723l4726J9340j9072J02929n2385q1251
11935B79O6421N3022O35j02141m4956p2097K9774J59743L7419o5545o9124M2687
11923C6117j0306P775p6657J1942N0205O4841j0639n4280M9592O0506n4924k9367
11911D4805j8376r4307k9729M956r550j2573N6332P8255O9307o8502j4775K3552
11899B9395r6165n5545Q3J9803R8478Q1292o781k0343L5413k9451N1640p7539
11887C0280J5010J1895k5805K5849k6129J1404N1366M2719n6704j19218l0651
11876f9984M2732K289R1237l1218l6984P167m3132l4454N117P4249r125M5096
11864D2990M8931o84j14315J4788M367l6304o3771O5532N1718j3490K3720P2792
$$ plain form
11852 96274 134131 102435 60741 -30088 -29851 -63718 -61818 -50312 71 -11388 -90425 -82934
11840 -82934 -22690 18788 -4342 -1364 -16148 -17712 60450 46619 55376 57438 64280 -42336
11828 -42336 -19979 -18784 43067 -11869 -7335 127679 164549 54165 116337 156333 88681 -30193
11816 -30193 -12669 10739 40832 18751 -52625 1440 -52052 -101306 -41203 -40471 -3635 9663
11804 9663 36884 7111 -40680 -22552 -54914 -89955 -175479 -108396 -20829 17069 -2750 13192
11792 13192 22775 -60278 -115449 -157478 -116295 -87442 -133631 -83516 -71759 -90972 -37743 17415
11780 17415 32232 -3489 -54773 -53897 -96850 -157398 -198377 -239094 -147347 -48494 -42159 -81595
11768 -81595 -154406 -168246 -76912 -90287 -42796 -83780 -121100 -41106 44330 33166 -58940 -32994
$$ packed form
11852I6274L7857l1696m1694r0829K37l3867J900J1506N0383j1459p9037P491
11840h2934O0244M1478k3130K978j4784j564P8162j3831Q757K062O842j06616
11828d2336K2357J195O1851n4936M534J35014L6870j10384O2172L9996o7652j18874
11816c0193J7524K3408L0093k2081p1376N4065n3492m9254O0103P32L6836J3298
11804I663K7221k9773m7791J8128l2362l5041q5524O7083Q7567L7898j9819J5942
11792A3192R583q3053n5171m2029M1183K8853m6189N0115J1757j9213N3229N5158
11780A7415J4817l5721n1284Q76m2953o0548m0979m0717R1747R8853O335l9436
11768h1595p2811j3840R1334j3375M7491m0984l7320P9994Q5436j1164r2106K5946
$$ plain form
11756 -32994 -20819 -65917 -141237 -104684 -69967 -27330 -65325 -87253 -33819 36303 40388 33277
11744 33277 18140 135694 138551 37450 -56252 -103761 -76965 -108536 -152441 -183263 -150242
11733 -150242 -86119 -77541 -24880 16257 62267 30400 -25762 -99056 -66106 48878 13888
11722 13888 -39028 -19408 -1048 43846 68415 -43422 -64592 21354 82481 -44899 -126771
11711 -126771 -61132 -46532 -148549 -207236 -160360 -154166 -191262 -117486 -80398 -12536 -59983
11700 -59983 -48740 1848 -84174 -159029 -173349 -130635 -93715 -11509 77469 106495 45627 -72030
11688 -72030 -119388 -50824 4529 -11301 -14001 35554 31129 -14086 -56243 -36273 -30833 8314
11676 8314 19237 16184 39904 47142 19380 -17254 7552 13498 -27828 26699 31172 14078 53278
$$ packed form
11756c2994J2175m5098p5320L6553L4717M2637l7995k1928N3434P0122M085p111
11744C3277j5137J17554K857j01101r3702m7509K6796l1571m3905l0822L3021
11733a50242O4123Q578N2661M1137M6010l1867n6162p3294L2950J14984l4990
11722A3888n2916J9620J8360M4894K4569j11837k1170Q5946O1127j27380q1872
11711a26771O5639J4600j02017n8687M6876O194l7096P3776L7088O7862m7447
11700e9983J1243N0588q6022p4855j4320M2714L6920Q2206Q8978K9026o0868j17657
11688g2030m7358O8564N5353j5830k700M9555m425m5215m2157J9970N440L9147
11676H314J0923l053K3720P238k7762l6634K4806N946m1326N4527M473j7094L9200
$$ plain form
11663 53278 33698 -32396 16795 6992 -44683 12613 56688 -28388 -123659 -162111 -144758 -56900
11651 -56900 -95165 -172783 -201292 -159092 -83935 -9453 -51170 -46477 -70322 -122677 -179232 -111259
11639 -111259 -9598 -39156 -773 37419 31544 -9169 -14938 1733 -33579 -49054 -129678 -130856
11627 -130856 -131052 -101603 -77189 -67203 -43050 -18381 -85317 -80555 -17375 18235 33439 28693
11615 28693 72399 48401 -22357 -117047 -107479 -81354 -45512 -111317 -133966 -93966 -85815 -103759
11603 -103759 -85256 -70964 -101520 -40979 50076 22235 -13776 -96320 -94973 -29292 -1775 -56932
11591 -56932 -99703 -67494 -66546 -62147 -24076 26007 27657 18794 63881 48607 -9983 -59109 -24478
11578 -24478 13165 -10600 -122209 -90471 3497 29571 -83759 -189516 -285950 -178754 -115389
$$ packed form
11663E3278j9580o6094M9191r803n1675N7296M4075q5076r5271l8452J7353Q7858
11651e6900l8265p7618k8509M2200P5157P4482m1717M693k3845n2355n6555O7973
11639a11259J01661k9558L8383L8192n875m0713n769J6671l5312j5475q0624j178
11627a30856j96K9449K4414R986K4153K4669o6936M762O3180L5610J5204m746
11615B8693M3706k3998p0758r4690R568K6125L5842o5805k2649M0000Q151j7944
11603a03759J8503J4292l0556O0541R1055k7841l6011q2544J347O5681K7517n5157
11591e6932m2771L2209R48M399L8071N0083J650q863M5087j5274n8590m9126L4631
11578b4478L7643k3765j11609L1738R3968K6074j13330j05757r6434J07196O3365
$$ plain form
11567 -115389 -106426 -133619 -114045 -30896 49189 82363 116230 60716 61790 89418 30712 -30732
11555 -30732 -44230 9736 -50004 -4419 -31269 -20377 -16118 -111770 -260391 -214669 -115621 -220906
11543 -220906 -235793 -172442 -164561 -151347 -66956 20571 41815 66066 -16643 -70750 -45567 69920
11531 69920 65201 68145 47711 -36340 -60830 -116483 -105205 -77064 -58281 -64794 -123960 -97918
11519 -97918 -157834 -168704 -120202 -118451 -28233 40715 -36964 -76220 50122 98915 84971 53220
11507 53220 20339 -7174 28420 158799 173309 96414 59447 89346 69438 26849 -28167
11496 -28167 -78272 -93478 -72518 -70530 -49576 10695 38847 36958 -49820 -40122 10668 -47686
11484 -47686 5107 -2191 -55200 -63452 -65700 -6482 18566 43040 100003 87104 44322 12041
$$ packed form
11567a15389Q963k7193J9574Q3149Q0085L3174L3867n5514J074K7628n8706o1444
11555c0732j3498N3966n9740M5585k6850J0892M259r5652j48621M5722R9048j05285
11543b20906j4887O3351P881J3214Q4391Q7527K1244K4251q2709n4107K5183J15487
11531F9920m719K944k0434q4051k4490n5653J1278K8141J8783o513n9166K6042
11519i7918n9916j0870M8502J751R0218O8948p7679l9256J26342M8793j3944l1751
11507E3220l2881k7513L5594J30379J4510p6895l6967K9899j9908m2589n5016
11496b8167n0105j5206K0960J988K0954O0271K8152j889q6778R698N0790n8354
11484d7686N2793p298n3009q252k248N9218K5048K4474N6963j2899m2782l2281
$$ plain form
11472 12041 -60461 -129641 -228923 -181390 -121569 -74736 -148190 -201466 -144309 -106765 -158354 -152604
11460 -152604 -223484 -259261 -159119 -127958 -147229 -122155 -78423 1592 46509 -8726 -5264
11449 -5264 -12984 -78595 -96645 -81799 -88689 -93558 -108821 -137516 -140001 -98330 -81276 -176435 -190892
11436 -190892 -126440 -99462 -91015 -49021 -18711 -24552 -18077 -66338 -50557 -43082 -40771 -31224 -6614
11423 -6614 9832 53286 54847 -34088 7652 20338 61397 65977 48752 21356 63863 69256
11411 69256 -27947 -25673 38251 31014 -1403 -75415 -19814 38568 83231 123164 70963 34001
11399 34001 2318 -59221 -31608 49707 80459 49825 68591 51102 -2577 -24370 -80291 -91485
11387 -91485 -24359 101356 43119 -17595 32490 91894 -67 2738 -82617 -172804 -185107 -274672
$$ packed form
11472A2041p2502o9180r9282M7533N9821M6833p3454n3276N7157L7544n1589N750
11460a52604p0880l5777J00142L1161j9271K5074M3732Q0015M4917n5235L462
11449e264p720o5611j8050J4846o890m869j5263k8695k485M1671J7054r5159j4457
11436a90892O4452K6978Q447M1994L0310n841O475m8261J5781P475K311R547K4610
11423f614J6446M3454J561q8935M1740J2686M1059M580j7225k7396M2507N393
11411F9256r7203K274O3924p237l2417p4012N5601N8382M4663L9933n2201l6962
11399C4001l1683o1539K7613Q1315L0752l0634J8766j7489n3679k1793n5921j1194
11387i1485O7126J25715n8237o0714N0085N9404r1961K805q5355r0187j2303q9565
$$ plain form
11375 -274672 -244876 -116951 -24065 -28429 -52796 -115759 -145868 -114362 -118315 -88790 -47319 -69728
11363 -69728 -54201 -56747 -78111 -166674 -167102 -107936 30187 57722 -11914 -88948 -161957 -124575
11351 -124575 -17485 -41206 -117295 -112413 -3237 103562 117849 48653 -36143 -97108 -84063
11340 -84063 -30270 47919 7543 -21275 -79037 -91408 -36054 8758 -91559 -125006 -159165
11329 -159165 -179262 -98799 49777 6785 -65882 -46144 -27981 -64842 -151871 -81567 -95083
11318 -95083 -154517 -126119 -73743 -22533 -6676 -22413 -7910 12127 47183 39238 527 -38303
11306 -38303 -52416 -47408 -8395 37836 21554 18747 13217 -34553 -5199 -88736 -181280 -143153
11294 -143153 -131704 -121962 -103192 21676 64356 -32883 -101480 -132688 -112903 -68846 -39797
$$ packed form
11375b74672K9796J27925R2886m364k4367o2963l0109L1506l953K9525M1471k2409
11363f9728J5527k546k1364q8563m28N9166J38123K7535o9636p7034p3009L7382
11351a24575J07090k3721p6089M882J09176J06799J4287o9196q4796o0965J3045
11340h4063N3793P8189m0376k8818n7762j2371N5354M4812j00317l3447l4159
11329a59165k0097Q0463J48576m2992p2667J9738J8163l6861q7029P0304j3516
11318i5083n9434K8398N2376N1210J5857j5737J4503K0037L5056p945l8711l8830
11306c8303j4113N008L9013M6231j6282k807n530m7770K9354q3537r2544L8127
11294a43153J1449R742J8770J24868M2680r7239o8597l1208J9785M4057K9049
$$ plain form
11283 -39797 -39159 -61744 -49313 -43009 -159635 -143780 -170852 -114283 -98102 -91273 -88194 -107874
11271 -107874 -91898 -107546 -6494 -6067 -2438 90886 74720 29086 24726 23345 44061 -12023
11259 -12023 -38078 -51767 -107019 -167061 -59920 -19425 -47555 -3479 73663 57772 -68475
11248 -68475 -184920 -180733 -154431 -78382 -20124 49192 81848 7699 1123 26080 -64547 -133878
11236 -133878 -86733 -72163 -83874 -6273 -21997 26939 32307 40511 24359 -18269 -34407 -73004
11224 -73004 -61818 -58298 -18651 -19621 -10449 -15321 -27023 -93435 -119047 -79131 9002 125904
11212 125904 266143 187672 60402 60260 113178 56558 -74575 -51444 -78936 -105991 -47988
11201 -47988 -54243 -22226 -19995 -99542 -125695 -59022 -29161 -80121 -113361 -124823 -39027 -48746
$$ packed form
11283c9797O38k2585J2431O304j16626J5855k7072N6569J6181O829L079j9680
11271a07874J5976j5648J01052M27L629R3324j6166m5634m360j381K0716n6084
11259a2023k6055j3689n5252o0042J07141M0495k8130M4076P7142j5891j26247
11248f8475j16445M187K6302P6049N8258O9316L2656p4149o576K4957r0627o9331
11236a33878M7145J4570j1711P7601j5724M8936N368Q204j6152m2628j6138l8597
11224g3004J1186L520L9647r70R172m872j1702o6412k5612L9916Q8133J16902
11212A25904J40239p8471j27270j42N2918n6620j31133K3131k7492k7055N8003
11201d7988o255L2017K231p9547k6153O6673K9861n0960l3240j1462Q5796r719
$$ plain form
11189 -48746 -63955 -45415 -76027 -66722 -72773 -59199 -82984 -163040 -194514 -119435 -109557 -107344
11177 -107344 -101011 -40990 2051 68032 113458 121109 68352 2770 -30835 -55360 -85729 -138644
11165 -138644 -157107 -62420 6775 4517 4278 70991 106993 66942 96240 81085 1966 66752
11153 66752 -2820 -71692 -71301 2907 26139 -58801 -239934 -253012 -140927 -85052 -41423 10765
11141 10765 6229 43166 -29042 -115358 -150229 -63065 -28939 -40053 -4326 25250 -18675 -121365
11129 -121365 -90164 -113373 -107322 -146843 -120290 -62003 -113082 -120209 -39073 6994 51160 81156
11117 81156 133724 102808 -25614 -13004 1075 38726 64578 94885 40031 -58668 -80308
11106 -80308 -32527 -24774 -79348 -65303 -15455 -85225 -97362 -48048 -30524 -31030 -72047 -21270
$$ packed form
11189d8746j5209J8540l0612R305o051J3574k3785q0056l1474P5079R878K213
11177a07344O333O0021M3041O5981M5426P651n2757o5582l3605k4525l0369n2915
11165a38644j8463R4687O9195k258k39O6713L6002m0051K9298j5155p9119O4786
11153F6752o9572o8872L91P4208K3232q4940j81133j3078J12085N5875M3629N2188
11141A0765m536L6937p2208q6316l4871Q7164L4126j1114L5727K9576m3925j02690
11129a21365L1201k3209O051l9521K6553N8287n1079p127Q1136M6067M4166K9996
11117H1156N2568l0916j28422J2610J4079L7651K5852L0307n4854r8699k1640
11106h0308M7781P753n4574J4045M9848o9770j2137M9314J7524n06m1017N0777
$$ plain form
11094 -21270 44326 -20641 -14444 44572 12700 -7218 -23680 54633 105569 71000 29564 -26660
11082 -26660 -69557 -65986 12022 10871 -31896 -1882 38896 28020 45845 122028 138148 46117
11070 46117 -44269 -118844 -88318 31283 -38342 -55695 -42539 -18506 -109160 -178940 -121739
11059 -121739 -51697 -164836 -183531 -98030 14198 75249 73599 92594 39516 -37889 -127613
11048 -127613 -101509 -76964 -52047 7206 6039 -107811 -180579 -161004 -121741 -96430 -100978 -49159
11036 -49159 6693 96111 150514 99912 24137 66140 49654 24043 -94 16461 1991 56973
11024 56973 145634 153787 81891 -24057 -95613 -113098 -91352 -101974 -135507 -174055 -142906 -155947
11012 -155947 -53691 -13883 -43174 -38432 -75778 -88170 -37703 -87851 -225963 -203467 -230238
$$ packed form
11094b1270O5596o4967O197N9016l1872j9918j6462P8313N0936l4569m1436n6224
11082b6660m2897L571P8008j151m2767L0014M0778j0876J7825P6183J6120r2031
11070D6117r0386p4575L0526J19601o9625j7353J3156K4033r0654o9780N7201
11059a21739P0042j13139j8695Q5501J12228O1051j650J8995n3078p7405q9724
11048a27613K6104K4545K4917N9253j167j13850p2768J9575L9263K5311m548N1819
11036d9159N5852Q9418N4403n0602p5775M2003j6486k5611k4137J6555j4470N4982
11024E6973Q8661Q153p1896j05948p1556j7485K1746j0622l3533l8548L1149j3041
11012a55947J02256L9808k9291M742l7346j2392N0467n0148j38112K2496k6771
$$ plain form
11001 -230238 -172239 -62034 47191 67172 19625 -7038 -11175 -13183 -36401 -77501 -92889
10990 -92889 -68215 -91527 -66069 9572 46294 39189 -68813 -173766 -149444 -79079 20917
10979 20917 30465 -13417 -60384 -20124 -44387 -78090 -121199 -119400 -9444 33926 50155 32320
10967 32320 -11133 -52690 10626 87827 43591 43751 90488 116153 49854 -61896 -170261 -175498
10955 -175498 -95139 -66741 -8403 -24228 -106716 -98005 -55427 -64409 -81645 -61358 -94657 -111091
10943 -111091 -132774 -108842 -77877 -116405 -60433 22775 47640 48912 145465 143588 55602 -80867
10931 -80867 -111795 -89336 -66775 -100188 -75898 -2464 -13262 -57021 -86596 -32145 -18114 -2933
10919 -2933 70676 38264 -38841 -122075 -160373 -130818 -96803 -98911 -98991 -83551 -141891 -106497 -30648
$$ packed form
11001b30238N7999J10205J09225J9981m7547k6663m137k008k3218m1100j5388
10990i2889K4674k3312K5458P5641L6722p105j08002j04953K4322P0365R9996
10979B0917R548m3882m6967M0260k4263l3703m3109J799J09956M3370J6229j7835
10967C2320m3453m1557O3316P7201m4236J60M6737K5665o6299j11750j08365n237
10955a75498Q0359K8398N8338j5825q2488Q711M2578q982j7236K0287l3299j6434
10943a11091k1683K3932L0965l8528N5972Q3208K4865J272R6553j877q7986j36469
10931h0867l0928K2459K2561l3413K4290P3434j0798m3759k9575N4451J4031J5181
10919b933P3609l2412p7105q3234l8298K9555L4015k108q0J5440n8340L5394P5849
$$ plain form
10906 -30648 13812 -52928 -171493 -195791 -162146 -157226 -151873 -151433 -62698 52400 43351 -24775
10894 -24775 -62470 -52390 28930 20600 -5916 -131757 -140944 -86729 -84650 10436 -26548 -96449
10882 -96449 -28606 1496 -58938 -103450 -117160 -61440 -96437 -70891 -1445 -108064 -187305
10871 -187305 -160546 -97476 -99704 -151152 -122121 -64384 -83503 -53036 -68412 -99694 -94044 -36502
10859 -36502 -67855 -101658 -59398 15965 22267 -47612 -113526 -109818 33187 39827 39129 32127 -27393
10846 -27393 -77378 -121838 -78354 -55397 -4365 15081 -14422 -14648 1361 -44706 -74266 -83873
10834 -83873 -64566 2045 -42001 -75550 -46036 -16753 -48196 -42556 -9910 -14879 6744 -79476
10822 -79476 -147361 -100512 -54778 -42532 9309 46106 81874 67066 60747 23407 97319 108436
$$ packed form
10906c0648M4460o6740j18565k4298L3645M920N353M40Q8735J15098r049o8126
10894b4775l7695J0080Q1320q330k6516j25841r187N4215K079R5086l6984o9901
10882i6449O7843L0102o0434m4512j3710N5720l4997K5546O9446j06619p9241
10871a87305K6759O3070k228n1448K9031N7737j9119L0467j5376l1282N650N7542
10859c6502l1353l3803M2260P5363O302o9879o5914L708J43005O640o98p002n9520
10846b7393m9985m4460M3484K2957N1032J9446k9503k26J6009m6067k9560r607
10834h3873J9307O6611m4046l3549K9514K9283l1443N640L2646m969K1623q6220
10822g9476o7885M6849M5734J2246N1841L6797L5768j4808o319l7340P3912J1117
$$ plain form
10810 108436 115528 86873 44834 27236 29937 -43372 -83740 -93340 -13876 4057 18820 27103
10798 27103 44254 79614 89706 63916 -30252 52933 108085 85219 31737 44786 -63435
10787 -63435 -186598 -222150 -149576 -52686 -43707 -68139 -45200 -23366 -22852 -41771 -80716 -132442
10775 -132442 -106254 -91032 -75502 -58128 -50640 -38618 -36625 -7017 -34869 -69191 -92164 -38075
10763 -38075 -28250 -84701 -55884 14786 -24699 -1970 -32474 -140959 -176018 -51692 81445
10752 81445 125368 88177 46001 -16782 20449 -32789 -71497 -53525 -56968 -42836 -32772 -53355
10740 -53355 -34341 -72473 -72800 -58269 -96240 -111474 -87992 -113267 -103926 -9077 -10407 -117815
10728 -117815 -117334 -2120 655 -15521 -49610 -48489 -154573 -210991 -137939 -91962 -197110 -201596
$$ packed form
10810A08436P092k8655m2039j7598K701p3309m0368r600P9464J7933J4763Q283
10798B7103J7151L5360J0092k5790r4168Q3185N5152k2866n3482J3049j08221
10787f3435j23163l5552P2574R6890Q979k4432K2939K1834N14j8919l8945n1726
10775a32442K6188J5222J5530J7374P488J2022J993K9608k7852l4322k2973N4089
10763c8075R825n6451K8817P0670l9485K2729l0504j08485l5059J24326J33137
10752H1445M3923l7191m2176o2783L7231n3238l8708J7972l443J4132J0064k0583
10740e3355J9014l8132l27J4531l7971j5234K3482k5275R341R4849j330j07408
10728a17815M81J15214K775j6176l4089J121j06084n6418P3052M5977j05148m486
$$ plain form
10716 -201596 -119451 -24754 -6923 -57939 -79475 -14378 -5177 -60803 -59338 -38960 -84699 -100704
10704 -100704 -81209 -120829 -121496 -193270 -176983 -96477 -3177 58683 76568 -108138 -217079
10693 -217079 -168377 -135488 -46857 -36330 -76063 -84345 -79418 -168013 -195974 -154637 -194430 -182425
10681 -182425 -174199 -146369 -91824 -52689 49486 20831 -58003 -77917 -64336 20931 65526
10670 65526 -23063 -7925 6243 39354 53780 -25813 7703 4919 -54448 -91721 -18931 65014
10658 65014 46181 38500 10814 29903 -8613 68851 147391 112400 28554 -59212 -77152 -8534
10646 -8534 67189 73526 1979 -5087 116217 133960 -776 -63358 -63750 208 -62745 -87794
10634 -87794 -47494 2265 86930 91024 77146 63297 42473 60072 98767 127825 93650 86513
$$ packed form
10716b01596Q2145R4697J7831n1016k1536O5097R201n5626J465K0378m5739j6005
10704a00704J9495l9620o67p1774J6287Q0506R3300O1860J7885j84706j08941
10693b17079M8702L2889Q8631J0527l9733q282M927q8595k7961M1337l9793J2005
10681a82425Q226K7830N4545L9135J02175k8655p8834j9914J3581Q5267M4595
10670F5526q8589J5138J4168L3111J4426p9593L3516k784n9367l7273P2790Q3945
10658F5014j8833p681k7686J9089l8516P7464P8540l4991q3846q7766j7940O8618
10646h534P5723O337p1547p066J21304J7743j34736o2582l92O3958o2953k5049
10634h7794M0300M9759Q4665M094j3878j3849k0824J7599L8695K9058l4175p137
$$ plain form
10622 86513 58447 28316 -1715 -26733 -20667 47571 74295 30809 44405 4746 -85229 -107593
10610 -107593 -130810 -123352 -47963 -18450 11389 22259 66453 128164 128538 76486 20018 12102
10598 12102 7757 -1373 91443 99351 81118 46424 -16065 -42813 -46557 -71585 -81914 -100152
10586 -100152 -102979 -40977 -53950 -89866 -64530 -113665 -103547 -72724 -53272 48632 96655
10575 96655 129815 140074 125297 66350 -56183 -180361 -199544 -106402 -97337 -78598 -134972
10564 -134972 -146315 -139238 -56777 44061 -65349 -181108 -224464 -245760 -187609 -97252 -85497
10553 -85497 -83541 -79782 -55188 -138174 -141680 -86871 5541 -27984 -50934 -48430 -36200 -125621
10541 -125621 -147546 -62800 -34479 19834 28807 80117 -4660 40404 24819 -14574 -46847 -22082
$$ packed form
10622H6513k8066l0131l0031k5018O066O8238K6724m3486J3596l9659q9975k2364
10610a07593k3217P458P5389K9513K9839J0870M4194O1711L74n2052n6468p916
10598A2102m345r130R2816P908j8233l4694o2489k6748l744k5028j0329j8238
10586a00152k827O2002j2973l5916K5336m9135J0118L0823J9452J01904M8023
10575I6655L3160J0259j4777n8947j22533j24178j9183R3142R065J8739n6374
10564a34972j1343P077Q2461J00838j09410j15759m3356k1296N8151R0357J1755
10553h5497J956L759K4594q2986l506N4809R2412l3525k2950K504J2230q9421
10541a25621k1925Q4746K8321N4313Q973N1310q4777M5064j5585l9393l2273K4765
$$ plain form
10529 -22082 -18999 -23038 -9768 -144635 -149461 -124568 -107728 -122438 -83963 -85610 -26545 36755
10517 36755 1016 25135 -1931 -90970 -216659 -201330 -216666 -137950 -43843 102939 129630
10506 129630 -22810 -148140 -33583 96885 150737 26557 24215 67916 100320 48932 32399
10495 32399 -1116 -22308 43130 31843 11558 26690 -75592 -97107 -114307 -83503 -68658
10484 -68658 -38085 -61117 -122155 -204548 -223798 -198970 -48769 -46203 -132569 -132092 -51485 -174325
10472 -174325 -231001 -137136 -52737 23539 52598 42959 29823 85378 21472 73619 86869 23205
10460 23205 31557 -3070 -25021 -22814 -31528 -13442 -73990 -57941 -20739 -43434 -92836 -194447
10448 -194447 -244555 -168034 -134255 -40290 57954 7048 -85579 -149424 -130590 -124123 -145735 -133678
$$ packed form
10529b2082L083m039J3270j34867m826K4893J6840j4710L8475j647N9065O3300
10517C6755l5739K4119k7066q9039j25689J5329j5336P8716R4107J46782K6691
10506A29630j52440j25330J14557J30468N3852j24180k342M3701L2404n1388j6533
10495C2399l3515k1192O5438j1287k0285J5132j02282k1515j7200L0804J4845
10484f8658L0573k3032o1038q2393j9250K4828J50201K566q6366M77Q0607j22840
10472a74325n6676R3865Q4399P6276K9059r639j3136N5555o3906N2147J3250o3664
10460B3205Q352l4627k1951K207q714J8086o0548J6049L7202k2695m9402j01611
10448a94447n0108P6521L3779R3965R8244n0906r2627o3845J8834O467k1612J2057
$$ plain form
10436 -133678 -42626 53587 166575 113995 35212 12792 -48754 -105507 -158678 -169047 -154627
10425 -154627 -203553 -137698 -109757 -104128 17642 42511 40003 66008 83341 97775 177499 184814
10413 184814 97272 -33664 -50603 22085 24386 39029 48334 47794 19477 35591 59556 28847
10401 28847 -80670 -156608 -139788 -101903 -120752 -142726 -121824 -3935 26099 -33699 -40181
10390 -40181 -35703 -93136 -101675 -69324 -56589 -34458 8868 -2995 -45124 -25012 -51530 -5746
10378 -5746 53709 -1878 -28335 13029 25726 32116 6840 -27005 -10509 -3044 87256 91892
10366 91892 73967 27029 4057 17399 19083 -13286 -55271 -31697 71725 44940 80991 110140
10354 110140 94920 42690 -9535 -43985 -3142 -68418 -146204 -178764 -170641 -152888 -30801
$$ packed form
10436a33678R1052R6213J12988n2580p8783k2420o1546n6753n3171j0369J4420
10425a54627m8926O5855K7941N629J21770K4869k508K6005J7333J4434P9724P315
10413A84814q7542j30936j6939P2688K301J4643R305n40k8317J6114K3965l0709
10401B8847j09517p5938J6820L7885j8849k1974K0902J17889L0034n9798o482
10390d0181M478n7433q539L2351J2735K2131M3326j1863m2129K0112k6518M5784
10378e746N9455n5587k6457M1364J2697O390k5276l3845J6496P465R0300M636
10366I1892j7925m6938k2972J3342J684l2369m1985K3574J03422k6785L6051K9149
10354A10140j5220n2230n2225l4450M0843o5276p7786l2560Q123J7753J22087
$$ plain form
10343 -30801 24429 -87909 -122979 -141351 -126537 -145176 -148772 -94320 -78100 -97557 -133586 -206533
10331 -206533 -161623 -50858 49074 63612 78727 1968 -44689 65830 145468 150398 46757
10320 46757 61087 104224 34333 -42552 -84077 -74984 -85070 -87048 -133880 -148292 -25426 -36446
10308 -36446 -83171 -27374 -79641 -111443 -103217 -106346 -151075 -93086 -65447 -133055 -132354 -43443
10296 -43443 65155 68146 13125 -66919 -135468 -148563 -146892 -166487 -114509 -46303 -24887 -25528
10284 -25528 9756 56621 96659 149358 197891 143552 36947 -52317 -59927 -26012 1652 68341
10272 68341 46340 37810 56517 120794 97289 63491 79214 28218 -99704 -44197 73883
10261 73883 35422 43617 40197 57828 -6315 -9195 -90065 -128285 -128543 -88458 -117479 -99383 -20780
$$ packed form
10343c0801N5230j12338l5070j8372J4814j8639l596N4452J6220j9457l6029p2947
10331b06533M4910J10765R9932J4538J5115p6759m6657J10519P9638M930j03641
10320D6757J4330M3137o9891p6885m1525R093j0086j978m6832j4412J22866j1020
10308c6446m6725N5797n2267l1802Q226l129m4729N7989K7639o7608P01Q8911
10296d3443J08598K991n5021q0044o8549j3095J671j9595N1978O8206K1416o41
10284b5528L5284M6865M0038N2699M8533n4339j06605q9264p610L3915K7664O6689
10272F8341k2001q530J8707O4277k3505l3798J5723n0996j27922N5507J18080
10261G3883l8461Q195l420J7631o4143k880q0870l8220k58M0085k9021J8096P8603
$$ plain form
10248 -20780 -70715 -168526 -140054 -107273 -66808 -20195 -70195 -94777 -96835 -95051 -46546 -31265
10236 -31265 -35396 -10253 -10600 -80703 -69975 -81311 -93135 -112450 -86086 -105297 -69184 12273
10224 12273 22154 -35977 -58964 -18092 23803 57164 17778 -121287 -209653 -204778 -116414 12098
10212 12098 22592 -1312 18209 -30058 -41889 92651 56514 52124 19576 4190 -26527 -79289
10200 -79289 -133836 -118295 -19863 8705 -37536 -37325 -15685 -35971 -54390 -102477 -37013 -28288
10188 -28288 -53384 -30189 -34998 -131089 -162860 -104235 -80485 -47217 -66702 -76395 -28271 -95239
10176 -95239 -141016 -90348 -59881 -120611 -44474 -73853 -52845 -128432 -230954 -235611 -132538
10165 -132538 -74501 -96542 -41775 -34496 -142287 -210574 -139133 -138279 -114252 -48539 -21741 -26362
$$ packed form
10248b0780m9935r7811K8472L2781M0465M6613n0000k4582k058J784M8505J5281
10236c1265m131K5143l47p0103J0728j1336j1824j9315K6364j9211L6113Q1457
10224A2273R881n8131k2987M0872M1895L3361l9386j39065q8366M875Q8364J28512
10212A2098J0494k3904J9521m8267j1831J34540l6137m390l2548j5386l0717n2762
10200g9289n4547J5541R8432K8568m6241K11K1640k0286j8419m8087O5464Q725
10188b8288k5096K3195m809r6091l1771N8625K3750L3268j9485r693M8124o6968
10176i5239m5777N0668L0467o0730P6137k9379K1008p5587j02522m657J03073
10165a32538N8037k2041N4767P279j07791o8287P1441Q54K4027O5713K6798m621
$$ plain form
10153 -26362 -39643 -7076 70575 -23616 -72010 -65784 -21019 13033 -976 27472 38093 106927
10141 106927 116745 57166 -26467 -38658 -59910 -110768 -188761 -254553 -166682 -16683 24239
10130 24239 25583 5796 2769 -50871 -86501 -80684 -75319 -42318 -52443 -14407 -10042 19898 14851
10117 14851 -76123 -99624 -86206 -57031 -21762 -65839 -128753 -188507 -86077 29537 72005
10106 72005 -35612 -99859 -95111 -17637 -1981 -52289 -96773 -30233 25043 20078 -22941 -52038
10094 -52038 -24902 25534 36642 61836 -17953 -95915 -82138 -47224 -35183 -18180 -58735 -83542
10082 -83542 -38236 25675 52530 50879 9168 -50415 -35407 26785 12572 11458 30425 172920
10070 172920 201869 144217 3292 -33852 -72215 -121753 -121376 -92676 -8207 -3941 -21160 -8504
$$ packed form
10153b6362j3281L2567P7651r4191m8394O226M4765L4052j4009K8448J0621O8834
10141A06927R818n9579q3633j2191k1252n0858p7993o5792Q7871J49999M0922
10130B4239J344j9787l027n3640l5630N817N365L3001j0125L8036M365K9940n047
10117A4851r0974k3501J3418K9175L5269m4077o2914n9754J02430J15614M2468
10106G2005j07617o4247M748P7474J5656n0308m4484O6540N5276m965m3019k9097
10094e2038K7136N0436J1108K5194p9789p7962J3777L4914J2041J7003m0555k4807
10082h3542M5306O3911K6855j651m1711n9583J5008O2192j4213j114J8967J42495
10070A72920K8949n7652j40925l7144l8363m9538L77K8700Q4469M266j7219J2656
$$ plain form
10058 -8504 -32192 -36123 -761 -15339 -16917 30531 41167 51602 41261 61871 45461 -34916
10046 -34916 -30400 -3737 68818 126580 79107 -63152 -111771 -89046 -37571 -15334 -7886 12071
10034 12071 38891 38386 96454 89987 32357 31573 -32024 -108186 -62725 6900 35737 -58387 -58898
10021 -58898 -55141 -38076 -10311 2258 82633 81901 30109 18802 8994 -87498 -39755 51461
10009 51461 81434 -30262 -78548 -50026 -66193 -51989 43742 129551 31393 -53991 -16394
9998 -16394 -10472 26888 50284 -12187 -12234 32950 -39159 -55049 -48106 -324 79699 77197 -32276
9985 -32276 -118789 -140392 -96569 -15278 27072 58349 15643 -36408 47208 107450 111967 65000
9973 65000 -20612 -73972 20170 51692 -67992 -88465 -58247 2111 13770 579 -10394 -11530
$$ packed form
10058h504k3688l931L5362j4578j578M7448J0636J0435j0341K0610j6410q0377
10046c4916M516K6663P2555N7762m7473j42259m8619K2725N1475K2237P448J9957
10034A2071K6820n05N8068o467n7630p84o3597p6162M5461O9625K8837r4124n11
10021e8898L757J7065K7765J2569Q0375p32n1792j1307r808r6492M7743R1216
10009E1461K9973j11696m8286K8522j6167J4204R5731Q5809r8158q5384L7597
9998a6394N922L7360K3396o2471m7M5184p2109j5890O943M7782Q0023k502j09473
9985c2276q6513k1603M3823Q1291M2350L1277m2706n2051Q3616O0242M517m6967
9973F5000q5612n3360R4142L1522j19684k0473L0218O0358J1659j3191j0973j136
$$ plain form
9961 -11530 29816 113359 63677 29864 75278 81511 41710 -19257 -50420 -28447 74969 81404
9949 81404 35388 -25041 -80731 -22390 42554 23368 -48632 -97144 -116391 -78200 46125 18723
9937 18723 -37454 -72064 -36621 4065 59835 19105 -2485 -34713 14849 12606 -50085 -57014
9925 -57014 -44940 -9337 128073 58337 -4311 3394 37996 21977 107014 111566 70573 18918
9913 18918 -78280 -41255 -32248 -28201 -3631 -10745 -15730 -20106 -16255 -16867 43838 75792 86182
9900 86182 104534 70061 52850 31309 28599 47530 41206 39648 42581 -4823 1675 35925 130465
9887 130465 183821 96141 92650 107028 1717 -71310 -74182 -4185 -22251 -30607 47467 147321
9875 147321 110501 24939 35728 82412 77278 61475 32330 38416 104655 101502 12999 50338
$$ packed form
9961a1530M1346Q3543m9682l3813M5414O233l9801o0967l1163K1973J03416O435
9949H1404m6016o0429n5690N8341O4944j9186p2000m8512j9247L8191J24325k7402
9937A8723n6177l4610L5443M0686N5770m0730k1590l2228M9562k243o2691o929
9925e7014J2074L5603J37410o9736o2648P705L4602j6019Q5037M552m0993n1655
9913A8918r7198L7025R007M047K4570p114m985m376L851o12O0705L1954J0390
9900H6182J8352l4473j7211k1541k710J8931o324j558K933m7404O498L4250R4540
9887A30465N3356q7680l491J4378j05311p3027k872O9997j8066q356P8074R9854
9875A47321l6820q5562J0789M6684n134j5803k9145O086O6239l153q8503L7339
$$ plain form
9863 50338 100317 106373 62391 92559 120651 110906 78464 110149 51881 61357 81048 171761
9851 171761 212951 194442 224751 232451 200756 158833 161668 207668 231961 144427 44871 30770
9839 30770 99116 71376 -32685 -5277 23249 90500 111821 65464 -6222 8900 6939 -63617
9827 -63617 -135564 -58090 -40546 -11683 -112859 -131966 -56800 -21019 33159 121181 92200 -49077
9815 -49077 -61994 16468 90600 92592 79323 50986 18286 -18491 -47651 -19631 36628 1994
9803 1994 -48219 -81337 -55431 -57717 -62638 -126450 -108174 -42943 -35592 -44746 -56525 -67554 16195
9790 16195 12430 -40335 17111 51788 58538 8671 20114 59326 47073 40101 -18106 4152
9778 4152 61773 102511 131280 157661 97813 111735 155286 154458 109391 65559 27227 31008 -23488
$$ packed form
9863E0338M9979O056m3982L0168K8092r745l2442L1685n8268R476J9691R0713
9851A71761M1190j8509L0309P700l1695m1923K835M6000K4293q7534r9556j4101
9839C0770O8346k7740j04061K7408K8526O7251K1321m6357p1686J5122j961p0556
9827f3617p1947P7474J7544K8863j01176j9107P5166L5781N4178Q8022k8981j41277
9815d9077j2917P8462P4132J992j3269k8337l2700l6777k9160K8020N6259l4634
9803A994n0213l3118K5906k286m921o3812J8276O5231P351r154j1779j1029Q3749
9790A6195l765n2765N7446L4677O750m9867J1443L9212j2253o972n8207K2258
9778D152N7621M0738K8769K6381n9848J3922M3551q28m5067m3832l8332L781n4496
$$ plain form
9765 -23488 -575 -71923 -100361 -47774 -46153 7182 6754 27449 23957 60292 61505 5017 -31660
9752 -31660 -67329 -139744 -77126 17187 40407 15089 20581 69582 15898 -19058 50154 71708
9740 71708 -38471 -46102 -24556 -19125 -26894 55490 67555 65257 47336 23062 13902 80312 161731
9727 161731 118380 56153 61341 89298 109235 173044 124484 48759 38600 63506 79137 43351
9715 43351 25781 13978 -67549 -169727 -99626 -95252 -93026 -75389 13095 105949 105290 104111 72318
9702 72318 120508 88932 -61952 -172384 -137081 -86583 28827 53215 5327 -90447 -157958
9691 -157958 -115575 -160267 -136968 -64012 -25475 -48914 -75092 -49104 12913 73851 80535 70205
9679 70205 -35252 -30457 -31375 27089 91395 43238 77238 169520 175391 86862 109194 100255 113177
$$ packed form
9765b3488K2913p1348k8438N2587J621N3335m28K0695l492L6335J213n6488l6677
9752c1660l5669p2415O2618R4313K3220k5318N492M9001n3684l4956O9212K1554
9740G1708j10179p631K1546N431p769Q2384J2065k298j7921k4274r160O6410Q1419
9727A61731m3351o2227N188K7957J9937O3809m8560p5725j0159K4906J5631l5786
9715D3351j7570j1803q1527j02178P0101M374K226J7637Q8484R2854o59j179l1793
9702G2318M8190l1576j50884j10432L5303N0498J15410K4388m7888r5774o7511
9691a57958M2383m4692K3299P2956L8537k3439k6178K5988O2017O0938O684j0330
9679G0205j05457M795r18N8464O4306m8157L4000R2282N871q8529K2332q939J2922
$$ plain form
9666 113177 184127 169404 178726 116505 73148 59354 153846 185736 96254 61675 93893 103707
9654 103707 143290 179814 202400 166949 135658 84686 67599 130360 141108 188290 242093 193958
9642 193958 138545 90287 174107 250590 229691 177613 99951 71984 66292 97236 128142 65083
9630 65083 96631 185489 183330 178179 158831 162487 238393 269375 279968 335053 348485 226253
9618 226253 163241 96451 133678 215568 182662 155452 168499 129194 128598 91743 72996 62747
9606 62747 -71981 -12832 20881 65303 60480 4188 79864 198681 211188 188134 156295 162069
9594 162069 206678 217733 222053 188811 238185 186152 102130 56557 115990 227242 314645 298821
9582 298821 314078 301701 206986 111726 82469 62779 87892 110354 148538 218388 216353 187371
$$ packed form
9666A13177P0950j4723R322o2221m3357j3794R4492L1890q9482l4579L2218R814
9654A03707L9583L6524K2586l5451l1291n0972j7087O2761J0748M7182N3803m8135
9642A93958n5413m8258Q3820P6483k0899n2078p7662k7967n692L0944L0906o3059
9630F5083L1548Q8858k159n151j9348L656P5906L0982J0593N5085J3432j22232
9618B26253o3012o6790L7227Q1890l2906k7210J3047l9305n96l6855j8747j0249
9606F2747j34728N9149L3713M4422m823n6292P5676J18817J2507k3054l1839N774
9594A62069M4609J1055M320l3242M9374n2033q4022m5573N9433J11252Q7403j5824
9582B98821J5257j2377r4715r5260k9257j9690K5113K2462L8184O9850k035k8982
$$ plain form
9570 187371 220379 241951 245491 224900 160135 164957 153920 140568 143167 176073 114124 84394
9558 84394 13336 34992 155636 243675 244750 315022 365795 301911 349388 323300 308151 382290
9546 382290 449659 398435 357881 368706 295397 282691 252375 320921 311297 323144 418271 439847
9534 439847 419933 431386 416668 386802 380475 332889 337474 301287 318773 358291 371681 345494
9522 345494 355283 335700 344689 354811 338667 408578 498873 496152 542777 624662 567649 503643
9510 503643 546478 586935 621018 612460 627375 715765 751274 699979 610530 618145 555098 591324
9498 591324 656752 631483 644180 653486 648978 597303 612059 629277 669907 708945 667529 526858
9486 526858 598380 685210 770813 834280 886793 891661 878275 872114 956190 946023 909601 891430
$$ packed form
9570A87371L3008K1572L540k0591o4765M822j1037j3352K599L2906o1949k9730
9558H4394p1058K1656J20644Q8039J075P0272N0773o3884M7477k6088j5149P4139
9546C82290O7369n1224m0554J0825p3309j2706l0316O8546r624J1847R5127K1576
9534D39847j9914J1453j4718k9866o327m7586M585l6187J7486L9518J3390k6187
9522C45494R789j9583Q989J0122j6144O9911R0295k721M6625Q1885n7013o4006
9510E03643M2835M0457L4083q558J4915Q8390L5509n1295q9449P615o3047L6226
9498E91324O5428k5269J2697R306m508n1675J4756J7218M0630L9038m1416j40671
9486E26858P1522Q6830Q5603O3467N2513M868j3386o161Q4076j0167l6422j8171
$$ plain form
9474 891430 921856 934034 1050552 1149778 1174934 1207707 1152311 1147019 1147566 1150054 1225111 1271772
9462 1271772 1249991 1262174 1281009 1355510 1431155 1450510 1481556 1407301 1394436 1427022 1447171
9451 1447171 1512602 1549427 1572591 1583341 1602116 1799258 1881884 1867167 1937834 2095379 2198965
9440 2198965 2231350 2291980 2422128 2507985 2548218 2638667 2646568 2650209 2727924 2865234 3049121
9429 3049121 3248781 3354050 3434255 3471864 3633611 3811022 3958841 4096838 4252938 4427095
9419 4427095 4678495 4944957 5232829 5486969 5711151 5972468 6207525 6510713 6909919 7401119
$$ packed form
9474H91430L0426J2178J16518R9226K5156L2773n5396n292N47K488P5057M6661
9462A271772k1781J2183J8835P4501P5645J9355L1046p4255j2865L2586K0149
9451A447171O5431L6825K3164J0750J8775J97142Q2626j4717P0667J57545J03586
9440B198965L2385O0630J30148Q5857M0233R0449P901L641P7715J37310J83887
9429C049121J99660J05269Q0205L7609J61747J77411J47819J37997J56100J74157
9419D427095K51400K66462K87872K54140K24182K61317K35057L03188L99206M91200
$$ [...]
##END NTUPLES=NMR SPECTRUM
##END=
