##TITLE=Analysis number 322680
Compound Code cc 47516
Book Reference 438/194
Project Code adrs
Chemist Name antons
##JCAMPDX= 6.0         $$ Bruker NMR JCAMP-DX V2.0
##DATA TYPE= NMR SPECTRUM
##DATA CLASS= NTUPLES
##ORIGIN= Bruker BioSpin GmbH
##OWNER= nmr
$$ XWIN-NMR		Version 3.5
$$ Fri Oct 13 11:17:06 2006 GMT Daylight Time (UT+1h)  MAYBRIDGE\nmr@NMR_250MHZ
##.OBSERVE FREQUENCY= 250.131544655141
##.OBSERVE NUCLEUS= ^1H
##.ACQUISITION MODE= SIMULTANEOUS (DQD)
##.ACQUISITION SCHEME= undefined
##.AVERAGES= 16
##.DIGITISER RES= 18
##SPECTROMETER/DATA SYSTEM= dpx250
##.PULSE SEQUENCE= zg30
##.SOLVENT NAME= CDCl3
##.SHIFT REFERENCE= (INTERNAL, CDCl3, 0, 16.4609)
##AUDIT TRAIL= $$ (NUMBER, WHEN, WHO, WHERE, WHAT)
$$ ##TITLE= Audit trail, XWIN-NMR		Version 3.5
$$ ##JCAMPDX= 5.01
$$ ##ORIGIN= Bruker BioSpin GmbH
$$ ##OWNER= nmr
$$ C:\u/data/dgb/nmr/ADRS/200/pdata/1/auditp.txt
$$ ##AUDIT TRAIL=  $$ (NUMBER, WHEN, WHO, WHERE, WHAT)
(   1,<2006-10-13 11:16:37.31 +100>,<MAYBRIDGE\nmr>,<NMR_250MHZ>,
      <created by zg, POWCHK disabled, PULCHK disabled
       configuration hash MD5:
       49 4B E0 1D 92 C2 6B 37 9F E6 65 BC 52 41 86 1D
       data hash MD5: 64K
       C4 69 D3 8A B3 33 E3 3A 32 E6 A5 CB 0C 9E 04 28>)
(   2,<2006-10-13 11:16:54.76 +100>,<MAYBRIDGE\nmr>,<NMR_250MHZ>,
      <Start of raw data processing
       ef LB = 0.3 FT_mod = 6 PKNL = 1 SI = 32K 
       data hash MD5: 32K
       6F 5F 65 47 E4 4E 5F C2 ED 89 92 CB 9F 5A 04 02>)
(   3,<2006-10-13 11:16:56.66 +100>,<MAYBRIDGE\nmr>,<NMR_250MHZ>,
      <apk 
       data hash MD5: 32K
       C2 3F 2E 2F A8 83 05 B3 4A 35 2F 23 D8 F4 55 6E>)
(   4,<2006-10-13 11:16:57.40 +100>,<MAYBRIDGE\nmr>,<NMR_250MHZ>,
      <abs ABSG = 5 
       data hash MD5: 32K
       72 99 CA 2C 8F 30 9A B2 C6 C3 F4 A0 70 2B 2F 64>)
$$ ##END=
$$ 
$$ hash MD5
$$ 29 55 3D C2 58 8E BF 3C B4 8E D1 DF 0D 74 92 34
##$RELAX= 
##$RELAX= 
##$RELAX= 
##$RELAX= 
##$RELAX= 
##$RELAX= 
##$RELAX= 
$$ Bruker specific parameters
$$ --------------------------
##$DU= <C:\u>
##$EXPNO= 200
##$NAME= <ADRS>
##$PROCNO= 1
##$TYPE= <nmr>
##$USER= <dgb>
##$AMP= (0..31)
100 100 100 100 100 100 100 100 100 100 100 100 100 100 100 100 100 100 
100 100 100 100 100 100 100 100 100 100 100 100 100 100 
##$AQSEQ= 0
##$AQ_mod= 3
##$AUNM= <au_zg>
##$AUTOPOS= <22 >
##$BF1= 250.13
##$BF2= 250.13
##$BF3= 250.13
##$BF4= 250.13
##$BF5= 500.13
##$BF6= 500.13
##$BF7= 500.13
##$BF8= 500.13
##$BYTORDA= 1
##$CFDGTYP= 0
##$CFRGTYP= 5
##$CHEMSTR= <none>
##$CNST= (0..31)
1 1 145 1 1 1 1 1 1 1 1 1 1 1 1 1 1 1 1 1 1 1 1 1 1 1 1 1 1 1 1 1 
##$CPDPRG= <>
##$CPDPRG1= <>
##$CPDPRG2= <>
##$CPDPRG3= <>
##$CPDPRG4= <mlev>
##$CPDPRG5= <mlev>
##$CPDPRG6= <mlev>
##$CPDPRG7= <mlev>
##$CPDPRG8= <mlev>
##$CPDPRGB= <>
##$CPDPRGT= <>
##$D= (0..31)
0 1 0 0 0 0 0 0 0 0.06 0 0 0 0 0 0 0.0002 0 0 0 0 0 0 0 0 0 0 0 0 0 0 
0 
##$DATE= 1160734595
##$DBL= (0..7)
120 120 120 120 120 120 120 120 
##$DBP= (0..7)
150 150 150 150 150 150 150 150 
##$DBP07= 0
##$DBPNAM0= <>
##$DBPNAM1= <>
$$ [...]
##$SUBNAM7= <"">
##$SUBNAM8= <"">
##$SUBNAM9= <"">
##$SW= 20.6930455092707
##$SWIBOX= (0..15)
0 0 3 0 0 0 0 0 0 0 0 0 0 0 0 0 
##$SW_h= 5175.983436853
##$TD= 65536
##$TD0= 1
##$TE= 683.16
##$TE2= 300
##$TE3= 300
##$TEG= 300
##$TL= (0..7)
0 120 120 120 120 120 120 120 
##$TP= (0..7)
150 150 150 150 150 150 150 150 
##$TP07= 0
##$TPNAME0= <>
##$TPNAME1= <>
##$TPNAME2= <>
##$TPNAME3= <>
##$TPNAME4= <>
##$TPNAME5= <>
##$TPNAME6= <>
##$TPNAME7= <>
##$TPOAL= (0..7)
0.5 0.5 0.5 0.5 0.5 0.5 0.5 0.5 
##$TPOFFS= (0..7)
0 0 0 0 0 0 0 0 
##$TUNHIN= 0
##$TUNHOUT= 0
##$TUNXOUT= 0
##$USERA1= <user>
##$USERA2= <user>
##$USERA3= <user>
##$USERA4= <user>
##$USERA5= <user>
##$V9= 5
##$VALIST= <valist>
##$VCLIST= <CCCCCCCCCCCCCCC>
##$VD= 0
##$VDLIST= <DDDDDDDDDDDDDDD>
##$VPLIST= <PPPPPPPPPPPPPPP>
##$VTLIST= <TTTTTTTTTTTTTTT>
##$WBST= 1024
##$WBSW= 4
##$XGAIN= (0..3)
0 0 0 0 
##$XL= 0
##$YL= 0
##$YMAX_a= 587507
##$YMIN_a= -348207
##$ZGOPTNS= <>
##$ZL1= 120
##$ZL2= 120
##$ZL3= 120
##$ZL4= 120
##$ABSF1= 16.4609
##$ABSF2= -4.232273
##$ABSG= 5
##$ABSL= 3
##$ALPHA= 0
##$AQORDER= 0
##$ASSFAC= 0
##$ASSFACI= 0
##$ASSFACX= 0
##$ASSWID= 0
##$AUNMP= <proc_1d>
##$AZFE= 0.1
##$AZFW= 0.1
##$BCFW= 0
##$BC_mod= 0
##$BYTORDP= 0
##$COROFFS= 0
##$CY= 12.5
##$DATMOD= 1
##$DC= 0
##$DFILT= <>
##$DTYPP= 0
##$F1P= 14.0000005364418
##$F2P= -0.99999901652339
##$FCOR= 0.5
##$FTSIZE= 32768
##$FT_mod= 6
##$GAMMA= 0
##$GB= 0
##$INTBC= 1
##$INTSCL= 1
##$ISEN= 128
##$LB= 0.3
##$LEV0= 0
##$LPBIN= 0
##$MAXI= 10000
##$MC2= 0
##$MEAN= 0
##$ME_mod= 0
##$MI= 0
##$NCOEF= 0
##$NC_proc= -3
##$NLEV= 6
##$NOISF1= 0
##$NOISF2= 0
##$NSP= 0
##$NTH_PI= 0
##$NZP= 0
##$OFFSET= 16.4609
##$PC= 1
##$PHC0= -50.78093
##$PHC1= 9.402528
##$PH_mod= 1
##$PKNL= yes
##$PPARMOD= 0
##$PSCAL= 4
##$PSIGN= 0
##$REVERSE= no
##$SF= 250.130015282215
##$SI= 32768
##$SIGF1= 0
##$SIGF2= 0
##$SINO= 400
##$SIOLD= 32768
##$SREGLST= <1H.CDCl3>
##$SSB= 0
##$STSI= 32768
##$STSR= 0
##$SW_p= 5175.98343685301
##$SYMM= 0
##$S_DEV= 0
##$TDeff= 65536
##$TDoff= 0
##$TI= <Analysis number 999999
Compound Code 99
Book Reference 9
Project Code 9>
##$TILT= no
##$TM1= 0
##$TM2= 0
##$TOPLEV= 0
##$USERP1= <user>
##$USERP2= <user>
##$USERP3= <user>
##$USERP4= <user>
##$USERP5= <user>
##$WDW= 1
##$XDIM= 32768
##$YMAX_p= 304956990
##$YMIN_p= -123371
$$ End of Bruker specific parameters
$$ ---------------------------------
##NTUPLES= NMR SPECTRUM
##VAR_NAME=  FREQUENCY,     SPECTRUM/REAL,   SPECTRUM/IMAG
##SYMBOL=    X,             R,               I
##VAR_TYPE=  INDEPENDENT,   DEPENDENT,       DEPENDENT
##VAR_FORM=  AFFN,          ASDF,            ASDF
##VAR_DIM=   32768,         32768,           32768
##UNITS=     HZ,            ARBITRARY UNITS, ARBITRARY UNITS
##FACTOR=    0.157963299565203, 1,           1
##FIRST=     4117.36500673173, 0,            0
##LAST=      -1058.61843012128, 0,           0
##MIN=       -1058.61843012128, -123371,     0
##MAX=       4117.36500673173, 304956990,    0
$$ Real data points
##PAGE= N=1
##DATA TABLE= (X++(R..R)), XYDATA
$$ [...]
21073F608l18P414L079L054k4852j2832J235j1730o198K0684J9579K1327j3631
$$ 6608 6290 13704 16783 19837 -5015 -17847 -16612 -28342 -34540 -13856 5723 27050 13419
21060A3419j6204k7979p797K292J6515R228J26J0260l3868k6816M1276L1921j4969
$$ 13419 -2785 -30764 -38561 -36269 -19754 -10526 -10400 -140 -34008 -60824 -19548 12373 -2596
21047b596Q595O544K3493K4800j7525o704Q039j671l3496j1461J21M68k546L7962
$$ -2596 5999 12543 36036 60836 43311 36607 44646 42975 9479 -1982 -1861 -1393 -3939 34023
21033C4023J0637j2620k4344q915n927J1224m311j2348J336R406j4720j0448o771
$$ 34023 44660 32040 7696 -1219 -7146 4078 -233 -12581 -11245 -1839 -16559 -27007 -33778
21020c3778N241n33k144M227P552J1043N38O274J8317J0N107N016k0419k0721
$$ -33778 -28537 -29070 -31214 -26987 -19435 -8392 -7854 -1580 16737 16747 21854 26870 6451 -14270
21006a4270J806K67K35l1893k0946O34j678M9631K8115K701j3838Q330P76l8268
$$ -14270 -12464 -12197 -11962 -43855 -64801 -64167 -65845 -16214 11901 14602 764 9094 9870 -28398
20992b8398k3745k1463N537L2820K9331o423l1025N783K0576p636Q114K1330J8825
$$ -28398 -52143 -73606 -68069 -35249 -5918 -12341 -43366 -37583 -17007 -24643 -16529 4801 23626
20979B3626J1857o752j0219j603R980L3893J6626m1208l2817j70r213N156J374
$$ 23626 35483 28731 18512 16909 26889 60782 77408 36200 3383 3213 -6000 -844 530
20966E30q475k7822m388K2671K462p466M028n440K5707K827j1709k1805Q677K9475
$$ 530 -7945 -35767 -40155 -17484 -15022 -22488 -18460 -23900 1807 4634 -7075 -28880 -20203 9272
20952I272L0088J014l8482k567R427k9164j3554j2078k136L0554p439m239J5439
$$ 9272 39360 40374 1892 -675 8752 -20412 -33966 -46044 -48180 -17626 -25065 -29304 -13865
20939a3865J1340Q450j1790L2229M400l2093j1526J086j7372K195J2933N208K7877
$$ -13865 -2525 5925 -5865 26364 30764 -1329 -12855 -11769 -29141 -26946 -14013 -8805 19072
20926A9072J9494j6490k8471J406p290j922q679L386K5773K382J5950j1477j5080
$$ 19072 38566 22076 -6395 -4989 -12279 -14201 -22880 -19494 6279 8661 24611 13134 -1946
20913a946J0367J7745J0414l6180k012M1472j4655r137j6310n516Q662j851j5358
$$ -1946 8421 26166 36580 400 -1612 39860 25205 16068 -242 -5758 2904 1053 -14305
20900a4305M124K389M4515J6898l7525j8924j5869K487J1956J004n1798R439J0402
$$ -14305 -10181 -7792 36723 53621 16096 -2828 -18697 -16210 -4254 -3250 -55048 -45609 -35207
20887c5207R132K6932J7628P489j4614K103m006N706k8416m537J5086N93K1328
$$ -35207 -26075 857 18485 25974 11360 13463 9457 15163 -13253 -17790 -2704 -2111 19217
20874A9217k6357j6545R008k735L430j1548J2330J8053j1798P512J7910M745m604
$$ 19217 -7140 -23685 -14677 -17412 -13982 -25530 -13200 4853 -6945 567 18477 23222 18618
20861A8618k2533N305J9320J0421J8179k3047N995j3973p803R037j1097p550K1386
$$ 18618 -3915 1390 20710 31131 49310 26263 32258 18285 10482 19519 8422 872 22258
20848B2258R352l1992j0292n27k8396j5569J3854K6478J9799M000l126j5678J909
$$ 22258 31610 -382 -10674 -11201 -39597 -55166 -41312 -14834 4965 8965 5839 -9839 -7930
20835g930k7441L466l789n550J241K4548O345K2928Q180K008j2762K3489L6381
$$ -7930 -35371 -31905 -35694 -41244 -40003 -15455 -9110 13818 21998 24006 11244 34733 71114
20822G1114q744m5551j5023K2772J9667k1996k6719j6237q618r846m188J4462
$$ 71114 62370 16819 1796 24568 44235 22239 -4480 -20717 -29335 -39181 -43369 -28907
20810b8907L4275O635o673k3121J1600J0706j4146K736R472k5329k1954P400O966
$$ -28907 5368 12003 5330 -17791 -6191 4515 -9631 -6895 2577 -22752 -44706 -37306 -30340
20797c0340J5145J3220R838M50j6060J7326J5057J0015k6938J8405O71n74n537
$$ -30340 -15195 -1975 7863 8313 -7747 9579 24636 34651 7713 26118 26789 26215 20678
20784B0678k7020l1674J3300K2728J1637l358Q168k928k0435R376K1212j7763
$$ 20678 -6342 -38016 -24716 -1988 9649 6291 14459 11531 -8904 472 21684 3921
20772C921o434J6656O973o110l0172j6154K5191j1143L077m893J8615k0080n874
$$ 3921 -2513 14143 21116 15006 -15166 -31320 -6129 -17272 -14195 -19088 -473 -20553 -26427
20759b6427K0618J8495J949q815K1448O823R55k0077k7020j6060L2423K0973J5338
$$ -26427 -5809 12686 14635 5820 27268 34091 35046 14969 -12051 -28111 4312 25285 40623
20746D0623J966P523k1956j4841m07o545k604j2192k555L162j7076L666K0542
$$ 40623 42589 50112 28156 13315 12908 6363 3759 -8433 -10988 -7826 -24902 -21236 -694
20733f94N832R460r73m9098J397J7455J3294K2948m92l733J7225q989l774J1794
$$ -694 5138 14598 13625 -35473 -34076 -16621 -3327 19621 19129 15396 32621 23632 19858 31652
20719C1652j8825q468J1385Q538j9985J5120J5716p858j486J2443j5220m3217
$$ 31652 12827 4359 15744 24282 4297 19417 35133 27275 25789 38232 23012 -20205
20707b0205L3411K2447p715k4625r072J4315j9930j0995O93O628J6819n088j2784
$$ -20205 13206 35653 27938 3313 -5759 8556 -11374 -22369 -21676 -15048 1771 -3317 -16101
20694a6101l464j3087J3462K6062M446k1326n984K0100L88K1443Q044O958K530
$$ -16101 -19565 -32652 -19190 6872 11318 -10008 -15992 4108 4496 25939 33983 40941 43471
20681D3471L240J780l0936r271O344j5009l286j0255J0869J8471n395r028k1895
$$ 43471 46711 48491 17555 8284 14628 -381 -3667 -13922 -3053 15418 10023 995 -20900
20668b0900Q920J2114J4923k810Q517K3350o094m1787k7153p951P620K2074J8901
$$ -20900 -11980 134 15057 12247 20764 44114 38020 -3767 -30920 -38871 -31251 -9177 9724
20655I724J3424k697J7876K3998j4595q762m531k2254j132J531m403m880J0522
$$ 9724 23148 20451 38327 62325 47730 38968 34437 12183 11051 12582 8179 3299 13821
20642A3821J5407n0011l565K2693J5289J3584o787l2764O13J4033K1203J8017
$$ 13821 29228 -20783 -24348 -1655 13634 27218 20431 -12333 -11720 2313 23516 41533
20630D1533L213j0139k33P547j0273p182j6890Q309N059O202J2604L0728q386
$$ 41533 44746 34607 34374 41921 31648 24466 7576 15885 20944 27146 39750 70478 62092
20617F2092k2020R085J1903K1939J1307n059N4j4225J0867k5609k6355k5556k48
$$ 62092 40072 49157 61060 82999 94306 89247 89301 75076 85943 60334 33979 8423 8175
20604H175J454N938k4212L634R446l338K0745O676J7531l086j1386p827O860k982
$$ 8175 9629 15567 -8645 -5011 4435 1097 21842 28518 46049 42963 31577 23750 30610 27628
20590B7628J6579L79N719L216k3906j1196K608k2191l3393n768j9168M430K4851
$$ 27628 44207 44586 50305 53521 29615 18419 21027 -1164 -34557 -40325 -59493 -55063 -30212
20577c0212K7639k2438n097K322K8806N191j3064j8806j6167K7375L2393J5091
$$ -30212 -2573 -25011 -30108 -27786 1020 6211 -6853 -25659 -41826 -14451 17942 33033
20565C3033j4623K441j234K298J1740K3483n829Q201P814q742n071J6240L4538
$$ 33033 18410 20851 19617 21915 33655 57138 51309 59510 67324 58582 53511 69751 104289
20552A04289o700o725j5415k4992j0284j5208l6574k6176K761K1964N1514M3288
$$ 104289 97589 90864 75449 50457 40173 24965 -11609 -37785 -35024 -13060 38454 81742
20540H1742j2658k4829j3319l2673j8287J7867J1133k125j5499J8867N617j2535
$$ 81742 69084 44255 30936 -1737 -20024 -2157 8976 6851 -8648 10219 15836 3301
20528C301K6099N526n986J5087M976j0088n57p929O975J0946k3940n298k141j0470
$$ 3301 29400 34926 28940 44027 49003 38915 38358 30429 37404 48350 24410 19112 16971 6501
20514F501J2764j336O851J1375K1239k1742k6398k3700k126J5583k0250n700j5762
$$ 6501 19265 17929 24780 36155 57394 35652 9254 -14446 -16572 -989 -21239 -26939 -42701
20501d2701j093J3886J918K867J5123K9950r647k7387J677k4258j117K1877J2926
$$ -42701 -43794 -29908 -27990 -25123 -10000 19950 10303 -17084 -15407 -39665 -40782 -18905 -5979
20488e979K8614L419j5246o415j2451P587J0031p758J2678J4240J3085k2882r787
$$ -5979 22635 26054 10808 4393 -8058 -471 9560 1802 14480 28720 41805 18923 9136
20475I136J2859J1069K441K0919j5881n3823K86Q633L665L437P494J1830j1379
$$ 9136 21995 33064 35505 56424 40543 -13280 -12994 -4361 -696 2741 10235 22065 10686
20462A0686o609k9645P614K9823Q444L874m983j8389K7398p695q388L432J35k632
$$ 10686 4077 -25568 -17954 11869 20313 24187 19204 815 28213 20518 12130 15562 15697 13065
20448A3065J1056K2385n624m654j1407J7732m5463R33K7695N564K3942J0547k3266
$$ 13065 24121 46506 40882 36228 24821 42553 -2910 -1977 25718 31282 55224 65771 42505
20435D2505j5346K6517j3432j7968j1665r8m122J5518j0471m418J7115M574j1010
$$ 42505 27159 53676 40244 22276 10611 10513 6391 21909 11438 7020 24135 28709 17699
20422A7699p197M3707L687j079j6169O015j9356k2892p052l618L770J8191K47
$$ 17699 10502 54209 57896 56817 40648 46663 27307 4415 -2637 -6255 -2485 15706 15953
20409A5953Q65K129k358j2839K8530K6386J941r295n2p651p758l692R784j6160
$$ 15953 16818 18947 16589 3750 32280 58666 60607 51312 51260 43609 35851 32159 41943 25783
20395B5783K0117k157l1342L1206L3019l633j6990j3561N8584L4439j386q566
$$ 25783 45900 43743 12401 43607 76626 72993 56003 42442 101026 135465 134079 125513
20383A25513L2567K2952N5582P0433P2909J03861R5963J07163P4120M8518K9705
$$ 125513 158080 181032 236614 307047 379956 483817 579780 686943 761063 809581 839286
20372H39286n7816j12472r9105r7059j09219p4981l4966n2029k4933l7470j7425
$$ 839286 781470 668998 569893 472834 363615 288634 253668 201639 176706 139236 121811
20361A21811k7993K0087p61j4725m0248L41J8621p126j4477k1034k1136k4033
$$ 121811 93818 113905 113144 98419 58171 58512 77133 70007 55530 34496 13360 -10673
20349a0673M3534J9792p393J1363K8603R279l0138k1274l4780O256M1934q756
$$ -10673 32861 52653 45260 56623 85226 94505 64367 43093 8313 14569 56503 47747
20337D7747Q653J8012r282l2675j4567J7321l016j3257j0996J1858p793j0648
$$ 47747 56400 74412 65130 32455 17888 35209 32193 18936 7940 19798 12005 1357
20325A357J0164J0639O917J1179q358j8800j0040N580P699J7088n487j9547j5014
$$ 1357 11521 22160 29077 40256 31898 13098 3058 8638 16337 33425 27938 8391 -6623
20312f623l846o775K5682J7845j1267J735K5078K0110K898l844J2462K7233n995
$$ -6623 -10469 -17244 8438 26283 15016 16751 41829 61939 64837 60993 73455 100688 94693
20299I4693k3688k3257j6103l784L983J6820l030k1149j2994k1184m374j6363
$$ 94693 71005 47748 31645 27861 31844 48664 45634 24485 11491 -9693 -14067 -30430
20287c0430J6045j3821J6750K9412N747j7556J3809J1007L036K0978K0924j4024
$$ -30430 -14385 -28206 -11456 17956 23703 6147 19956 30963 33999 54977 75901 61877
20275F1877p007k2248Q63j621J2653K830p248q465j772p319R348L5487K126j8631
$$ 61877 54870 32622 33485 31864 44517 47347 40099 31634 29862 22543 31891 67378 69504 50873
20261E0873m21k1479J0607Q711n020m795N987J3584j6222l257J5825R570p085
$$ 50873 50452 28973 39580 48291 43271 38476 44463 58047 41825 38568 54393 63963 56878
20248E6878m5031k382L5980K7819o900q011l315j0029K29j5568j2393O499k5376
$$ 56878 11847 9465 45445 73264 66364 58353 55038 45009 45238 29670 17277 23776 -1600
20235a600K3715l325J9045O957j2111j7285q825j4261j1173Q852K0687P525J6539
$$ -1600 22115 18790 37835 44792 32681 15396 6571 -7690 -18863 -10011 10676 18201 34740
20222C4740J2040m834K984J8183L0999L1631r468l2618j0996J818k3163J4855
$$ 34740 46780 41946 44930 63113 94112 125743 116275 83657 72661 74479 51316 66171
20210F6171J9718j3126l0702k1792K0652J8996Q463L7527j4282k7848k302j1351
$$ 66171 85889 72763 42061 20269 40921 59917 68380 105907 91625 63777 61475 50124
20198E0124P532J2945j2087K692K6485K5853l2707l7228k1553N433j1933L094
$$ 50124 57656 70601 58514 61206 87691 113544 80837 43609 22056 27489 15556 18650
20186A8650K3729K1460O828l0043k5125J1579R670K9080O746o339m655j6332k995
$$ 18650 42379 63839 70667 40624 15499 27078 36748 65828 72574 66235 61580 45248 42253
20173D2253J5266J390j5452q769O197K1013J704j2584j9260j173R926l412R574
$$ 42253 57519 58909 43457 34688 40885 61898 63602 51018 31758 30585 40511 37099 46673
20160D6673k1388R866L9049j0933k5183J3188M373n310K941j6437q994K630j0876
$$ 46673 25285 35151 74200 63267 38084 51272 55645 50335 53276 36839 27845 30475 19599
20147A9599L761Q995n810n407J1004N115n494j2892J1494Q337l0581l192L7869
$$ 19599 23360 32355 26545 21138 32142 37257 31763 18871 30365 38702 8121 4929 42798
20134D2798k6505l1372L0694L3221l327r676J1330p132j1663j7070j5573o701
$$ 42798 16293 -15079 15615 48836 45509 35833 47163 40031 28368 11298 -4275 -10976
20122a0976L9195L1354j1897L678J5752K5781J3085m5234k4300K3312R658q891
$$ -10976 28219 59573 47676 51354 67106 92887 105972 60738 36438 59750 69408 60517
20110F0517j289K0200K687n026j7184q612j2431K5656N494N42J0506P214p25r572
$$ 60517 59228 79428 82115 77089 59905 51293 38862 64518 70012 70554 81060 88274 87549 77977
20096G7977j0987l5049J3603k057L3214N428k0958J5017J4795J0106K0442p637
$$ 77977 66990 31941 45544 43487 76701 82129 61171 76188 90983 101089 121531 113894
20084A13894q138m058k8739k2195J5104L8358Q008m2012l0129J1465K2470k2329
$$ 113894 105756 101698 72959 50764 65868 104226 112234 70222 40093 51558 74028 51699
20072E1699P206M2362j5146j2461K332j2667j1041J1738O849k650R946J6973k949
$$ 51699 58905 101267 86121 73660 75992 63325 52284 64022 70871 68221 78167 95140 92191
20059I2191K2115R273K984j4393j5835N642k4348K3894J5920l7396l1059p106
$$ 92191 114306 123579 126563 112170 96335 101977 77629 101523 117443 80047 48988 41882
20047D1882L7138L1741q228P126K0564Q266l0654k086Q400l1130k9055k5792j0441
$$ 41882 79020 110761 102533 109659 130223 138489 107835 105749 114149 83019 53964 28172 17731
20034A7731K3474N764J3314M4449J6955J2083p571k0841R351j4343J0606N3550
$$ 17731 41205 46969 60283 104732 121687 133770 126199 105358 114709 100366 110972 164522
20022A64522K0461J4925j3292n5420l6454l6755J5061K2060N6l7568j5039j1956
$$ 164522 184983 199908 186616 131196 94742 57987 73048 95108 95164 57596 42557 30601
20010C0601k0311Q720K3247J5999l0540l977J3232J7161Q920N209k5610m3277
$$ 30601 10290 19010 42257 58256 27716 23739 36971 54132 63052 68261 42651 -626
19998f26j2731M302O798M2041K8579K4834Q594k048m3012l1038p474J4429K0808
$$ -626 -13357 -9055 -2257 39784 68363 93197 101791 99743 56731 25693 18219 32648 53456
19985E3456K6514J6574n110P459o098J064j2222r238l4970k1618K5542P6815K1617
$$ 53456 79970 96544 91434 98893 92795 93859 81637 72399 37429 15811 41353 118168 139785
19972A39785k1023J3501K2889q144J8212J2262M2682M602n786J3149j6854l5113
$$ 139785 118762 132263 155152 147008 165220 177482 220164 224766 218980 232129 215275 180162
19960A80162l1386j9960j1861R66J599j8452j7439N46P527M0325j3682L735k500
$$ 180162 148776 128816 116955 117921 119520 101068 83629 84175 91702 132027 118345 122080 119580
19947A19580J0673k8002P051M289l2766k925j3140L5026K8705j4078k9014n906
$$ 119580 130253 102251 109302 113591 80825 77900 64760 99786 128491 114413 85399 79493
19935G9493j6889R542J1434j8544r713L9900K4886j1263j0368l743r714K7627
$$ 79493 62604 72146 83580 65036 55323 95223 120109 108846 98478 94735 85021 112648
19923A12648k9312j9759Q907M8856R231j9428j6578J9111L307j2485J2939k2410
$$ 112648 83336 63577 72484 121340 130571 111143 94565 113676 116983 104498 117437 95027
19911I5027J4771N4234K6770L4298j416k8280j243j4598k6582K6751L4634K722
$$ 95027 109798 164032 190802 225100 223684 195404 194161 179563 152981 179732 214366 217088
19899B17088L875K8635O3226M6897M3548Q1234J15161J20114J21318L9481J1422
$$ 217088 220963 249598 312824 359721 403269 484503 599664 719778 841096 880577 891999
19888H91999m0297q7344r8414j29135q0712o5804o2593l4979l2543r851J7116
$$ 891999 851702 764358 665944 536809 456097 390293 327700 292721 260178 250327 267443
19877B67443K185m6059k5768l7413R262L0838L4936k0560R247L2740J0791k8116
$$ 267443 269628 223569 197801 160388 169650 200488 235424 214864 224111 256851 267642 239526
19865B39526O924j1596k9686J4628O83k2088j1558O167j7196q312P885K4642K022
$$ 239526 246450 234854 205168 219796 220479 198391 186833 193000 175804 167492 175377 200019 202041
19852B02041l6616l382M192O870Q59J5547Q228J3873J1457J0166o93K7125L8218
$$ 202041 165425 162043 166235 173105 173964 189511 197739 211612 223069 233235 232542 259667 297885
19839B97885J0977J8229Q230l1594n819k2064j8025m609j0573m2058k4657k226
$$ 297885 308862 327091 335321 303727 297908 275844 257819 253210 242637 200579 175922 173696
19827A73696q792n280J7358k003L312J8805L5591o949k5853k3144J197K8165J7236
$$ 173696 164904 159624 176982 174979 178291 197096 232687 225738 199885 176741 177938 206103 223339
19814B23339J6975j0536K5429K3575o122O066l014J6937l0152K1955N416N827
$$ 223339 240314 229778 255207 278782 272660 278726 275712 292649 262497 284452 289868 295695
19802B95695J7949K2327k0129M423J9711K9147K9142J7481j6865m6903n380j2559
$$ 295695 313644 335971 315842 320265 339976 369123 398265 415746 398881 351978 346598 334039
19790C34039L060K9408M4033L6501r539r058j2295o657k254K845J5573O3732N0819
$$ 334039 337099 366507 410540 447041 437502 428444 416149 409492 407238 410083 425656 489388 540207
19777E40207j718P282K534k628K2895N4720P065J8525L8624M0669M3056M7564
$$ 540207 538489 545771 548305 545677 568572 623292 630357 648882 687506 728175 771231 818795
19765H18795M7856L2965L1864K6136N2448M9885P0665O9060M8060P8502J25810
$$ 818795 866651 899616 931480 957616 1010064 1059949 1130614 1199674 1247734 1326236 1452046
19754A452046J64647J95016K38518K04938J42055J05008O9217O4149K7864J6856
$$ 1452046 1616693 1811709 2050227 2255165 2397220 2502228 2571445 2635594 2663458 2680314
19744B680314O22N9715R4228J51363J54097J49401J55986J47128J36995J89248
$$ 2680314 2680936 2740651 2834879 2986242 3140339 3289740 3445726 3592854 3729849 3919097
19734C919097K59663L16476L72469M41021N92741O75499Q07612J010839J245410
$$ 3919097 4178760 4495236 4867705 5308726 5901467 6576966 7384578 8395417 9640827
19725I640827J535357J924913K437079L233497M363176N985971Q376228J1401977
$$ 9640827 11176184 13101097 15538176 18771673 23134849 29120820 37497048 48899025
19717D8899025J4800747J7914430J9643227J8816831J5087843Q576404R316q296736
$$ 48899025 63699772 81614202 101257429 120074260 135162103 143738507 143747823 135451087
19709A35451087j4720651j8528183j8993576j7192807j4278068j1022509q166443
$$ 135451087 120730436 102202253 83208677 66015870 51737802 40715293 32548850
19702C2548850n971972m378804l266734k512442j948463j540787j232971j000768
$$ 32548850 26576878 22198074 18931340 16418898 14470435 12929648 11696677 10695909
19694A0695909q87075p55992o65333n70133n00508m62248m39986l89244l25041
$$ 10695909 9808834 9052842 8387509 7817376 7316868 6854620 6414634 6025390 5700349
19685E700349k52201k03851j93726j54910j54417j46412j02924n1840m8251l5506
$$ 5700349 5448148 5244297 5050571 4895661 4741244 4594832 4491908 4440068 4391817 4356311
19675D356311J092q7938j57481j60847j95549k34148k37987k61323k31693j70529
$$ 4356311 4357403 4269465 4111984 3951137 3755588 3521440 3283453 3022130 2790437 2619908
19665B619908j28819j08017j27847r6427q1368p2614j01245q0130o0975m5699
$$ 2619908 2491089 2383072 2255225 2158798 2077430 2004816 1903571 1823441 1762466 1716767
19655A716767m0295l2079n0645k8861k8781o0808l6828n7080l9887l4148m0850
$$ 1716767 1676472 1644393 1593748 1564887 1536106 1475298 1438470 1381390 1341503 1307355 1266505
19644A266505m0456k4726l0714k0155j6417n4687j9625L923m0937l6886L230l5968
$$ 1266505 1226049 1201323 1170609 1150454 1134037 1079350 1059725 1063648 1022711 985825 989055 953087
19632I53087m6108o3844k0006J9304J5167j9730j8899l9571j8950l4747O304j4296
$$ 953087 906979 843135 823129 842433 857600 837870 818971 779400 760450 725703 732007 717711
19620G17711l2469J4164m859m7966m2223N210l679p86k7069k2198J3493m529j2806
$$ 717711 685242 699406 694547 646581 604358 609568 605889 605103 578034 555836 569329 564800 551994
19607E51994k1922l2507m8332k3063J2559K496Q8R338k8950j8572n863O722K3121
$$ 551994 530072 497565 449233 426170 438729 441225 441313 450651 421701 403129 397266 403988 427109
19594D27109J737n209J5070J2355J2553J0279k6422m1097j2863Q667J9741n913
$$ 427109 428846 423637 438707 451062 463615 473894 447472 406375 393512 402179 421920 416007
19582D16007J983J5141L3801k8164o9825k0720j298j5749m98l4195O999R806r467
$$ 416007 417990 433131 466932 438768 368943 348223 346925 331176 330678 296483 303482 313288 303821
19569C03821J1410J2541l924j2262r400J90n278J3684M583j5429k8631j5918r400
$$ 303821 315231 327772 323848 311586 302186 302376 297098 310782 315365 299936 271305 255387 245987
19556B45987k0462l835m15Q188M769J2012M6534j6892j9266K767n846O016J4732
$$ 245987 225525 221690 221275 229463 234232 246244 292778 275886 256620 259387 253541 259557 274289
19543B74289j6748l0865j8307k2747m3638m0296J278L1842J5527L712L5504L8985
$$ 274289 257541 226676 208369 185622 141984 101688 102966 134808 150335 154047 189551 228536
19531B28536J8779L7989K1625L001m4296k9570J167K1655k0022m0169j9991n621
$$ 228536 247315 285304 306929 309930 265634 236064 237231 258886 238864 198695 178704 173083
19519A73083r987M975j8062J5235n087O111M0885m411j7875j4574r418o610n830
$$ 173083 163096 168071 150009 165244 160157 166268 207153 202742 184867 170293 160875 154265 148435
19506A48435l147k2586J8338L2583K9788n653l6646P728q785L3467K7740j3922
$$ 148435 145288 122702 141040 173623 203411 197758 161112 168840 160055 193522 221262 207340
19494B07340j0906K0947J1472L6546M6497j5049j8059j500l2888k8997R716k1795
$$ 207340 196434 217381 228853 265399 311896 296847 278788 277288 244400 215403 225119 203324
19482B03324o059n530k7066k0225j464j4035K1113j0583J1170J1310j6602j0711
$$ 203324 197265 191735 164669 144444 142980 128945 150058 139475 150645 161955 145353 134642
19470A34642l418K9168n280l6278K56J1822O5J5192j8907o039K7940O149q618
$$ 134642 131224 160392 155112 118834 119090 130912 130977 146169 127262 121223 149163 155312 146694
19457A46694k2571j901K0400q667o713K0655j969J4991K0275k3923k0372J2757
$$ 146694 124123 122222 142622 133955 127242 147897 145928 160919 181194 157271 136899 149656
19445A49656N570q729l182J9783L106l513k0347l1395N027J6088K8949K8182p140
$$ 149656 155226 146497 143315 163098 166204 162691 142344 110949 115976 132064 161013 189195 182055
19432A82055K293j5971j5538K0549q338k7549l846j476L726K3065j4363O754K1684
$$ 182055 184348 168377 152839 173388 165050 137501 133655 132179 135905 158970 144607 151361 173045
19419A73045L2513N4743J3076j5541k0452j2193m729j5011o105j4723k6601r08
$$ 173045 205558 260301 273377 257836 237384 225191 220462 205451 199346 184623 158022 157114
19407A57114k877O520m270k3794k210j668j9726J241J9957q842J1719K1328N778
$$ 157114 154237 160757 156487 132693 130483 128815 109089 110330 130287 121445 133164 154492 160270
19394A60270Q562N812J2568k403K938K2237K911K4988n551k3762L1370J2400j4703
$$ 160270 168832 174644 187212 184809 187747 209984 212895 237883 232332 208570 239940 252340 237637
19381B37637j2375J0294j6367J7038Q246K3743Q068R200R334q300K3149O6787
$$ 237637 225262 235556 219189 236227 244473 268216 276284 285484 294818 286518 309667 376454
19369C76454O5557J5675Q749J8302K198J6065Q726K6012J0713n905P88k955R275
$$ 376454 442011 457686 466435 484737 486935 503000 511726 537738 548451 542546 543334 540379 549654
19356E49654j6073m6092m6253n9235j7650j4671j6493l0024k1713L1077K8519
$$ 549654 533581 487489 441236 382001 364351 349680 333187 303163 281450 312527 341046
19345C41046K0040J072R499J1320j2558j7728k512J880j0456M677r37J4328J8907
$$ 341046 361086 362158 371657 382977 370419 352691 350179 352059 341603 346280 345343 359671 378578
19332C78578L3755m1265O371N090M187P580N818j288M57J6330N2863K5654M1494
$$ 378578 412333 371068 377439 382529 386716 394296 400114 398826 399283 415613 468476 494130 535624
19319E35624O5183O0711L3220o7O14l2808K2235J0244M505J6770J8627J9996K2827
$$ 535624 600807 661518 694738 694671 695285 662477 684712 694956 699461 716231 734858 754854 777681
19306G77681p089J1811K399n4955n3725l2615J9851L1280Q545n118M0769L0269
$$ 777681 770592 782403 784802 729847 676122 643507 663358 694638 703183 698065 738834 769103
19294G69103L0803L0677N3327L8216L0960N2692L2385K2698O6973Q4654R2172
$$ 769103 799906 830583 883910 922126 953086 1005778 1038163 1060861 1127834 1212488 1304660
19283A304660P6029L5512L6581O0317K6367O0265Q5342J07465P5530M0941M9148
$$ 1304660 1380689 1416201 1452782 1513099 1539466 1599731 1685073 1792538 1868068 1909009 1958157
19272A958157L0375M5720Q6872Q5105J13319J49096J78020K29968K41668K83054
$$ 1958157 1988532 2034252 2121124 2206229 2319548 2468644 2646664 2876632 3118300 3401354
19262C401354L33772L20907K92584L25157K99754L04030L07567L94943N28652
$$ 3401354 3735126 4056033 4348617 4673774 4973528 5277558 5585125 5980068 6508720
19253F508720O29492P18187Q91328J160721J397807J738632K215126K854713L772125
$$ 6508720 7138212 7856399 8747727 9908448 11306255 13044887 15260013 18114726 21886851
19244B1886851N016537O801687R350217J2627986J6144405J8984013J9820328
$$ 21886851 26903388 33705075 43055292 55683278 71827683 90811696 110632024
19237A10632024J7508456J1748999L248788o077542j3854299j8384310j9272845
$$ 110632024 128140480 139889479 143138267 137060725 123206426 104822116 85549271
19230H5549271j7378229j4234260j0970981q198879o068073m537717l457125k661320
$$ 85549271 68171042 53936782 42965801 34766922 28698849 24161132 20704007 18042687
19222A8042687k046837j664442j373854j052937r19654p54624o16086n46421m90553
$$ 18042687 15995850 14331408 12957554 11904617 10984963 10230339 9614253 9067832 8577279
19213H577279m53133m35522m27689m37154m38064m18673l74492l48997l03898
$$ 8577279 8124146 7688624 7260935 6823781 6385717 5967044 5592552 5243555 4939657
19204D939657k78551k36536k00952j53795j26437r9806j10060j04037j25426j28210
$$ 4939657 4661106 4424570 4223618 4069823 3943386 3843580 3733520 3629483 3504057 3375847
19194C375847j11081j28677j38699j24618o0029p6699o3027l7841j158j6379n2334
$$ 3375847 3264766 3136089 2997390 2872772 2812743 2736044 2673017 2635176 2634018 2617639 2565305
19183B565305j19271j30723j42556r6846p8113n3664n0208K455J551j1595o1907
$$ 2565305 2446034 2315311 2172755 2075909 1997796 1944132 1893924 1896379 1897930 1886335 1824428
19172A824428p9105r1301p8634o8777q0750o9803n9756n5394k5812l4656m4743
$$ 1824428 1745323 1654022 1575388 1506611 1425861 1356058 1296302 1240908 1215096 1180440 1135697
19161A135697m0053L59j878o1862m2113j3075l357j0606P350l1465o12k0593m3504
$$ 1135697 1095644 1096003 1094125 1032263 990150 977075 973718 963112 970462 938997 938385 917792 874288
19148H74288k1026m7958j6410j7638k2544l4410l9629k3528J2675K5582J8562
$$ 874288 853262 805304 788894 771256 748712 714302 674673 651145 663820 689402 707964
19137G07964L875L0298J9241K1286J473l9957m6047M525l0944N566J1568r077
$$ 707964 711839 742137 761378 782664 784137 744180 698133 702658 671714 677280 688848 679771
19125F79771j5373L75j8358k8899m4432l0296k885l5659q812K14q076K6639J3406
$$ 679771 664398 664773 646415 617516 573084 542788 539903 504244 495432 495646 487570 514209 527615
19112E27615n254J0047J2725o091j8115j8167l0491J0867j0808l1975K003j3097
$$ 527615 522361 532408 545133 539042 520927 502760 472269 483136 472328 440353 442356 429259
19100D29259k7934k290j3096j8651l682j5372o879l279m818k267k575J9501r596
$$ 429259 401325 399035 385939 367288 363606 348234 341355 338076 333258 330991 328416 347917 338321
19087C38321Q104p382q278j9865l6682n2985l0207k922r929L730L9675J1309j7048
$$ 338321 346425 339043 330765 310900 274218 221233 191026 188104 178175 181905 221580 232889 215841
19074B15841J405J5015J50k0081R422j719j4187k9259l8091R564M6596J224j2786
$$ 215841 217246 232261 232411 212330 221752 220033 205846 176587 138496 148060 194656 195880 183094
19061A83094K2474J6348K0967O466l193J8805M8925K4899L6011L3659O7303Q6393
$$ 183094 205568 221916 242883 249349 246156 264961 313886 338785 374796 408455 475758 562151
19049E62151P8243N6680M0794N4385O4920O5052O0436P7957K4424n2826q2708
$$ 562151 640394 697074 737868 792253 857173 922225 982661 1060618 1085042 1032216 949508
19038I49508q8108r0350r5865r5862q5214n0586j7506l5025l6017q457k0563l8101
$$ 949508 861400 771050 675185 579323 494109 443523 426017 390992 354975 346518 325955 287854
19026B87854l0956P604r185j2153k8591k8754n587O229P937O732j776J5836K4663
$$ 287854 256898 264502 255317 243164 214573 185819 180232 186461 194398 201130 199354 215190 239853
19013B39853L1129O36k9134o531J0374K9387J9505K7664l030m014K1777o328k5630
$$ 239853 270982 271618 242484 235953 246327 275714 295219 322883 319853 315839 337616 331288 305658
19000C05658N018r368k8506n1208j4655K8472J8953J4094J5629k3717k51L079
$$ 305658 310676 301308 272802 221594 206939 235411 254364 268458 284087 260370 260119 263198
18988B63198J1960l705r380K777K1954K1476J8871P394l8104n956j8889j0921
$$ 263198 275158 271453 262073 264850 286804 308280 327151 334545 296441 290485 271596 260675
18976B60675j0535R037N697J7603L307J2627J8461L1165R79j8262M6567M7408
$$ 260675 250140 259177 264874 282477 285784 298411 316872 348037 349016 330754 377321 424729
18964D24729N1946M5588O333J916r314O106j3589R698k64j286j7635k6431l8781
$$ 424729 476675 522263 528596 530512 521198 527304 513715 523413 523149 521863 504228 477797 439016
18951D39016r289j3986l0221R68l3299l2583J5664l287J899J8567J9438P01j2360
$$ 439016 429727 415741 385520 386488 353189 320606 336270 332983 334882 353449 372887 373588 361228
18938C61228j6532j3426j0847K6109J7521j3285k1444l343r189J4356k4005m9954
$$ 361228 344696 331270 320423 346532 364053 350768 329324 325981 316792 331148 307143 257189
18926B57189j2571O260O619J5894L201r970N6022L3568L6994O9320L3127K6221
$$ 257189 244618 250878 257497 273391 276592 266622 322644 356212 393206 462526 495653 521874
18914E21874j3523j2542J0040O753k2179j7501j4751k5162l7941n8125m0191l398
$$ 521874 508351 495809 505849 512602 490423 472922 458171 433009 395068 336943 296752 293354
18902B93354J8699k1285m040K1078K178L5817P628K0327j3480jj406p62N0782
$$ 293354 312053 290768 286728 307806 309984 345801 353429 373756 360276 360275 358869 358107 408889
18889D08889M2386j6950J8824K4349n023K0317R043p903J2952N760J3105K9955
$$ 408889 451275 434325 453149 477498 472475 492792 501835 493932 506884 512644 525749 555704
18877E55704P6J1947M8570Q1314J02255N2229O3472R2376R3689Q8697J03939J13400
$$ 555704 555780 567727 616297 697611 799866 852095 915567 1007943 1101632 1190329 1294268 1407668
18865A407668J17246R2104O8758R8674J29321J16029J27848J74583K49534L08911
$$ 1407668 1524914 1617018 1685776 1784450 1913771 2029800 2157648 2332231 2581765 2890676
18855B890676L59661M95381P05734J097052J829921K923354M317149N607963O290941
$$ 2890676 3250337 3745718 4451452 5548504 7378425 10301779 14618928 20226891 26517832
18846B6517832O106371N049674L077410P46736o65591j157715j214494k90837
$$ 26517832 32624203 37673877 40751287 41498023 40832432 39674717 38460223 38169386
18838C8169386J339500K507382K609334J360207j089305k828678m345797n688874
$$ 38169386 39508886 42016268 44625602 45985809 44896504 42067826 37722029 32033155
18830C2033155o836338o196086m748756l143948k024993j332249q84540n99913
$$ 32033155 25196817 19000731 14251975 11108027 9083034 7750785 6866245 6266332
18822F266332l93712k62688j56961r9386n0119l3826n0804l5961n3285m4269j5333
$$ 6266332 5872620 5609932 5452971 5353585 5303466 5269640 5218836 5182875 5129590 5085321 5069988
18811E069988N057J7227J01323K29006L06236M30898O49257J018506J700438K869220
$$ 5069988 5075045 5092272 5193595 5422601 5728837 6159735 6808992 7827498 9527936 12397156
18801A2397156M537077O340286P664253Q024441P249764N336054K094462m08459
$$ 12397156 16934233 23274519 30938772 38963213 46212977 51549031 53643493 53235034
18793E3235034j620422j841183j058421J218791L258060M043824L131268J26270
$$ 53235034 51614612 49773429 48715008 49933799 53191859 57235683 60366951 60493221
18785F0493221l032849n336325p120253q864027q735042p071736m874527l173706
$$ 60493221 57460372 52124047 45003794 36139767 27404725 20332989 15458462 12284756
18777A2284756k065624j421242r99061p15837n20398l89929l24251k27553j72449
$$ 12284756 10219132 8797890 7798829 7082992 6562594 6172665 5848414 5620861 5448412
18768E448412k33106k43068k51207k91226l10945k47239k57819k43518k08513
$$ 5448412 5215306 4972238 4721031 4429805 4118860 3871621 3613802 3370284 3161771
18759C161771j57496j54036j54785j41162j25082q4286q1053o7323n2406k6330
$$ 3161771 3004275 2850239 2695454 2554292 2429210 2344924 2263871 2196548 2144142 2117812
18749B117812J9816L3272k475n913k6662m4872o1347l5418J9802J3856L1791L8124
$$ 2117812 2137628 2170900 2168425 2162512 2135850 2090978 2029631 1994213 2014015 2027871 2059662 2097786
18737B097786M4542M0671J6234K8306L6148O0925J43735K00383L10337M80055
$$ 2097786 2142328 2182999 2199233 2227539 2263687 2324612 2468347 2668730 2979067 3459122
18727C459122Q40887J382285K155409L010677L569417L487371K383623Q32838
$$ 3459122 4300009 5682294 7837703 10848380 14417797 17905168 20288791 21121629
18719B1121629r06450k405471k126393j090555M65864J797179K393505J728926
$$ 21121629 20215179 17809708 15683315 14592760 15058624 16855803 19249308 20978234
18711B0978234L04447j264375l131597l486183l182420k467155j603872j055597
$$ 20978234 21282681 20018306 16886709 13400526 10218106 7750951 6147079 5091482
18703E091482p15308m28017k63819j24882k4131k9j1889p5453r2990q1717p5612
$$ 5091482 4376174 3948157 3684338 3559456 3535325 3535296 3523407 3447954 3354964 3273247 3197635
18692C197635k9871O4782J27785J41085J39338J18599J36917J42569J74184L08710
$$ 3197635 3167764 3232546 3360331 3501416 3640754 3759353 3896270 4038839 4213023 4521733
18682D521733M86452O87904J066298J719193K814183M590443O811406Q934949
$$ 4521733 5008185 5696089 6762387 8481580 11295763 15886206 22697612 31632561
18674C1632561J0073551Q904103N199756O84325m350771o978790n843801k623432
$$ 31632561 41706112 50610215 55809971 56494296 52143525 45164735 39320934 36697502
18666C6697502J562214M709819N587950L652049J27807m199748q062938q894218
$$ 36697502 38259716 42969535 48557485 52209534 52337341 48137593 40074655 31180437
18658C1180437p880623n952823l981184k638048j798774j185615p92419n58026
$$ 31180437 23299814 17346991 13365807 10727759 8928985 7743370 6950951 6392925
18650F392925l66542k95324k47405k67047k66318k20563k03901j06579k8135j4812
$$ 6392925 6026383 5731059 5483654 5216607 4950289 4729726 4525825 4419246 4391111 4376299
18640D376299K3180O5587N0040O4013K2811N1091J63250K84579M96397Q45275
$$ 4376299 4399479 4465066 4515106 4579119 4601930 4653021 4816271 5100850 5597247 6442522
18630F442522J311871K184589L620072N411261O946768P493563O125953K986939
$$ 6442522 7754393 9938982 13559054 18970315 25917083 33410646 39536599 42523538
18622D2523538l69985m295557n536502m241551j577586J471370L475298L811610
$$ 42523538 42153553 37857996 32321494 28079943 26502357 27973727 31449025 35260635
18614C5260635K031488n05647l568333o131021o161906n382985l861332k575564
$$ 35260635 37292123 36786476 33218143 27087122 20925216 15542231 11680899 9105335
18606I105335j702234j155474q10057n84394m03283k89794k23499j98223k10585
$$ 9105335 7403101 6247627 5437570 4853176 4449893 4160099 3936600 3738377 3527792
18597C527792k07584k08910j54908q5702p2689j02687p9806m3987l5831p2516
$$ 3527792 3320208 3111298 2956390 2870688 2797999 2695312 2615506 2571519 2535688 2463172
18587B463172j15798j15373r1955p8501p2248m046Q323K7129J2410j2073K3685
$$ 2463172 2347374 2232001 2140046 2061545 1989297 1985251 1993574 2020703 2033113 2021040 2044725
18576B044725n937K8786Q2998P2025N6880K0217k4082r1051j24311j68795j39181
$$ 2044725 2038788 2067574 2150572 2222597 2279477 2299694 2275612 2184561 2060250 1891455 1752274
18565A752274p2116p5996q9393o1868o6522n1754m7262n6564m5473l7068m1646
$$ 1752274 1680158 1604162 1514769 1452901 1386379 1334625 1287363 1230799 1185326 1148258 1106612
18554A106612k0323k5641k4010k1773m3567l1119l4166j2046k9862o640K0247
$$ 1106612 1086289 1060648 1036638 1014865 971298 940179 906013 893967 864105 857465 877712
18543H77712N652M757K894r414l3407j9225n96k4335q854L3715J613k2008k8361
$$ 877712 883364 888121 891015 881601 848194 828969 828373 804038 795184 828899 830512 808504 780143
18530G80143K1255J5352n3626l5351j8808k4649p708M7895K8515r111j7648J8046
$$ 780143 801398 816750 763124 727773 708965 684316 676608 724503 753018 743907 726259 744305
18518G44305K3475K7192N3589P7806P4763N9644N6513N8383N7109O0446M4954
$$ 744305 767780 794972 848561 926367 1001130 1060774 1117287 1175670 1232779 1293225 1338179
18507A338179L3480N2361L3707L1626N5885O1819M6089P8967J26405J47239J50645
$$ 1338179 1371659 1424020 1457727 1489353 1545238 1607057 1653146 1732113 1858518 2005757 2156402
18496B156402J59927K25805K97105M26038O28018R41228J430073K303153L420283
$$ 2156402 2316329 2542134 2839239 3265277 3893295 4834523 6264596 8567749 11988032
18487A1988032M573581N556481N955357M586065K512998R95242j536680j675141
$$ 11988032 16561613 22118094 28073451 32659516 35172514 36167756 34631076 32955935
18479C2955935j05069J373835L062404L028493R61145r75063m291092o673963
$$ 32955935 32850866 34224701 37287105 40315598 41276743 40301680 36010588 29336625
18471B9336625o274503n831860m481516k965650j929204j235009q18700n18608
$$ 29336625 23062122 17230262 12748746 9783096 7853892 6618883 5800183 5281575
18463E281575l50327k65407k33924j55526j01253o4555o4262n4728j7034j2750
$$ 5281575 4931248 4665841 4431917 4276391 4175138 4110583 4046321 3991593 3974559 3961809
18453C961809j9846j6488J8666O3567J01206J61585K12417L13832N02084P23254
$$ 3961809 3941963 3925475 3944141 4007708 4108914 4270499 4482916 4796748 5298832 6022086
18443F022086J072502J642026K684117M221973N946459P474096Q565505P778202
$$ 6022086 7094588 8736614 11420731 15642704 21589163 29063259 37628764 45406966
18435D5406966M615982K363340q56951l207166j377092N48849K914436M131952
$$ 45406966 50022948 52386288 51529337 48322171 46945079 47493928 50408364 54540316
18427E4540316J916388o49710m171199q667549q808811q189922o900110m733916
$$ 54540316 56456704 55806994 51635795 42968246 34159435 25969513 19069403 14335487
18419A4335487l087531k063410j393433r59236o81747m33188l49423l07213k58752
$$ 14335487 11247956 9184546 7791113 6831877 6150130 5716942 5367519 5060306 4801554
18410D801554j86709j36910j28720j35723j14674r5054j12873j39083j13257n2352
$$ 4801554 4614845 4477935 4349215 4213492 4098818 4003764 3890891 3751808 3638551 3586199
18400C586199l1868J6783N9005R9524J52262J92013M34307P79351J304825J961602
$$ 3586199 3554331 3571114 3630119 3729643 3881905 4073918 4508225 5287576 6592401 8554003
18390H554003K601920L136432L273386K369173J205908L00292j242439j122657
$$ 8554003 11155923 14292355 17565741 19934914 21140822 21441114 20198675 19076018
18382A9076018l89542L47706J177670Q72182l1162r38209k703818l308004l013417
$$ 19076018 18686476 19034182 20211852 21084034 21052872 20114663 17410845 14102841 11089424
18373A1089424k747630j990125j311249q64003n61992l48316k74624j97537j77274
$$ 11089424 8341794 6351669 5040420 4176417 3614425 3266109 2991485 2793948 2616674
18364B616674j39024j11869o7932o7192q5978n0246m2423m3984m6529m4767n3327
$$ 2616674 2477650 2365781 2297849 2230657 2144679 2094433 2052010 2008026 1961497 1916730 1863403
18353A863403o0735m6247m5897o5504o0548n5499n0249j9121n5550m3845K6046
$$ 1863403 1802668 1756421 1710524 1645020 1584472 1528973 1478724 1459603 1404053 1360208 1386254
18342A386254J9476r071J7090K9610N0470L2646Q1682P5144P1858P8221Q7948
$$ 1386254 1405730 1396659 1413749 1443359 1493829 1526475 1608157 1683301 1755159 1833380 1921328
18331A921328Q8672J12835O3498O8448J40729J19602J01848J11235J79111J98581
$$ 1921328 2010000 2122835 2186333 2254781 2395510 2515112 2616960 2728195 2907306 3105887
18321C105887K08176K83489L51810M18846N93662Q90481J372292K149887L076755
$$ 3105887 3314063 3597552 3949362 4368208 4961870 5852351 7224643 9374530 12451285
18312A2451285L883294M756459O064254O624747N809631N610838O030142L750443
$$ 12451285 16334579 21091038 27155292 33780039 39589670 45200508 51230650 54981093
18304E4981093J293659J730901K137667k69336j699275j045566l72487k265884
$$ 54981093 56274752 58005653 60143320 59873984 58174709 57129143 56756656 54490772
18296E4490772m869536m539005l954296n896572o656134n188087m174671l901126
$$ 54490772 49621236 45082231 41127935 35231363 28575229 23387142 19212471 15311345
18288A5311345l110216k102604j385836r33755o38278m61308l49357k72178k32571
$$ 15311345 12201129 10098525 8712689 7778934 7140656 6679348 6329991 6057813 5825242
18279E825242j82496j59483j30403r2765q5272j2247k313m3735J9247J13326J78483
$$ 5825242 5642746 5483263 5352860 5260095 5174823 5162576 5160263 5116528 5135775 5249101 5427584
18268E427584K58781M88022Q84224J481526K188098K746978L323071M324609M956144
$$ 5427584 5686365 6174387 7058611 8540137 10728235 13475213 16798284 21122893 26079037
18259B6079037M363150M090922M727112L435375J156641J260695K079194M59658
$$ 26079037 30442187 34533109 39260221 42695596 43852237 45112932 47192126 47651784
18251D7651784j388780r79457q4181j316503l733443l657531k949816m223741
$$ 47651784 46263004 45283547 45199366 43882863 40149420 36491889 33542073 29318332
18243B9318332n414217m450631l453060l170628k701785j894005j283272q84374
$$ 29318332 23904115 19453484 16000424 12829796 10128011 8234006 6950734 6066360
18235F066360o19291m61174l20458k82910k47564k20254k09075k10102k02724
$$ 6066360 5447069 4985895 4665437 4382527 4134963 3914709 3705634 3495532 3292808
18226C292808j33214j14727j37630j63250j53095j17817j56800j63517r4567q7917
$$ 3292808 3159594 3044867 2907237 2743987 2590892 2473075 2316275 2152758 2058191 1970274
18216A970274r8957j12067o8712o3700n5880l2564o0351p5877m6476o6579m3435
$$ 1970274 1871317 1759250 1690538 1626838 1570958 1538394 1478043 1402166 1355690 1289111 1245676
18205A245676j2837k8813k7251m9490m897o2812o7942j4236K0055R005P047K4417
$$ 1245676 1232839 1204026 1176775 1127285 1122388 1059576 991634 977398 997453 1006458 1013505 1037922
18193A037922k0407J9310L2355k0996O916P874j1601n7854m2011j5050l748J6257
$$ 1037922 1017515 1036825 1069180 1048184 1055100 1062974 1051373 993519 951508 936458 932710 948967
18181I48967R810K8295m502l019n2132p0966l3620l9206l8486m2207j9174l4310
$$ 948967 958777 987072 982570 979551 927419 856453 822833 783627 745141 702934 683760 649450
18169F49450l3221J1246k4966n8758Q112J6318k5352k2848m009J0891l2096m5909
$$ 649450 616229 627475 602509 543751 551863 568181 542829 519981 515972 526863 494767 448858
18157D48858k5731J1293J6233j849n826N584J322Q881j8655j1271J3853J0803
$$ 448858 423127 434420 450653 448804 442978 448562 449884 458765 440110 428839 442692 453495
18145D53495L9435L9261M4293M2682N6283K1882m00J9344m294j3657J3473L4304
$$ 453495 492930 532191 576484 619166 675449 697331 696931 716275 711981 698324 711797 746101
18133G46101K3907J2363k331m755j015m6027O66P042N3528Q4953J04190J05395
$$ 746101 770008 782371 780040 775285 774270 728243 728909 735951 789479 874432 978622 1084017
18121A084017J52439J78567K25878K61689M01168O30947J059943K037197M124463
$$ 1084017 1236456 1415023 1640901 1902590 2303758 2934705 3994648 6031845 10156308
18112A0156308P406314R318696O618143L425449O82151r451709j0917216o292005
$$ 10156308 17562622 26881318 33499461 36924910 37607061 28155352 17238136 10946131
18104A0946131l544148k098122j266913q62344n98515l85467k40767j68332j54612
$$ 10946131 7401983 5303861 4036948 3174604 2576089 2190622 1949855 1781523 1626911
18095A626911j47126q8379q0630n5872p3744o9218m7293r1540o3654o4780k4097
$$ 1626911 1479785 1391406 1310776 1254904 1181160 1111942 1064649 973109 909455 844675 820578
18084H20578k2266l1426n4387k8456o0896n487j745m354j2621q920k1061l4769
$$ 820578 798312 766886 712499 684043 623147 617660 615915 611561 598940 590020 568959 534190
18072E34190k5045l1095m1288j0770j6290M626r405j1573l239J5514r587l6874
$$ 534190 509145 478050 436762 425992 409702 414328 404923 393350 390111 405625 396038 359164
18060C59164j8157k0675n33J2358K4873M581m1514k4848J3511l622p724J2047
$$ 359164 341007 320332 319799 332157 357030 361611 320097 295249 308760 305138 297414 309461
18048C09461k8519p82L331k4878k6867k8921k4859m967j3818m821O728J164R922
$$ 309461 280942 280160 283491 258613 231746 202825 177966 172999 159181 154360 161088 162252 172174
18035A72174m26k749K0045k5453k2958n352N465P500J3481J4866K55K1955J3588
$$ 172174 171748 168999 189044 163591 140633 135281 140746 148246 161727 176593 176848 198803 212391
18022B12391p689j330K9272j1258m4801m9074N611J9762m766J3313O633M781J0602
$$ 212391 204702 203372 232644 221386 176585 127511 133122 152884 148118 161431 168064 172845 183447
18009A83447k7481n397j9948J073R47m204j9203p459K715J0986j812P747j6588
$$ 183447 155966 150569 130621 131694 132641 128437 109234 101775 104490 115476 113664 121411 104823
17996A04823l665R053l0257l6006k0889J025p412l8808K0229K2072K6776K9250
$$ 104823 101158 110211 79954 43948 23059 24084 16672 -22136 -1907 20165 46941 76191
17984G6191K01J092J1333k6461j1689K7251j1542j0832j3046j9750M016p332R219
$$ 76191 76392 77484 88817 62356 50667 77918 66376 55544 42498 22748 26764 19432 28651
17971B8651K7514J3637K3104J5384K4373M702k5620J0366K7551M6233K8689J3253
$$ 28651 56165 69802 92906 108290 132663 137365 111745 122111 149662 195895 224584 237837
17959B37837k567j4900r721o060J393n746K4064m607k3476j7863j2587k4675j8821
$$ 237837 235270 220370 210649 204589 205982 200236 224300 219693 196217 178354 165767 141092 122271
17946A22271m4031k9344Q053K7142l803j1516r954k2237j481J4818m123N544l1314
$$ 122271 78240 48896 56949 84091 80288 68772 58818 36581 35100 49918 45795 51339 20025
17933B0025m240N052o593O173K9452j0452r16j7524J664J4323J7901L3449n726
$$ 20025 15785 20837 14244 20417 49869 39417 38501 20977 22641 36964 54865 88314 82588
17920H2588j5983J3173L0840K8651K2581K8685L8058K4215M6489K5667k8736j7479
$$ 82588 66605 79778 110618 139269 161850 190535 228593 252808 299297 324964 296228 278749
17908B78749j4172N113L5779K7072J1707N883l6877n5056k7945m9266j1100J536
$$ 278749 264577 269690 305469 332541 344248 350131 313254 258198 230253 180987 169887 171423
17896A71423k7924l1123P525j1758j5736K7893M52k9244l3457q804p135M8556
$$ 171423 143499 112376 119901 108143 92407 120300 120752 91508 58051 49247 42112 90668
17884I0668K5169m0389p816k1708K447j0015J1635L3005K2549j5366m869q065
$$ 90668 115837 75448 67632 45924 48371 38356 49991 82996 105545 90179 85310 77245
17872G7245j2088r341J2088r051j8351M992M9922M7228L1936k294n142M848j0579
$$ 77245 65157 55816 67904 58853 40502 45494 95416 142644 174580 172286 167144 171992 161413
17859A61413o901L8024j6188m0722K1967j8494k0063j4726j5318j6364m449N271
$$ 161413 154512 192536 176348 135626 157593 139099 119036 104310 88992 72628 68179 73450
17847G3450j596n7833r125J1685J747L9653L6420l3471j1903J1250J6947j9340
$$ 73450 71854 14021 4896 16581 18328 57981 94401 60930 49027 60277 77224 57884
17835E7884k528q29k8274j6503j0904O027K4989Q212M694M471l2401M075j2965
$$ 57884 55356 54527 26253 9750 -1154 4873 29862 38074 42768 47239 14838 18913 5948
17822E948n16K0620J039J4560p322R687M937O364J4370j0804j5857j0913K2697
$$ 5948 5432 26052 27091 41651 34329 44016 48953 55317 69687 58883 43026 32113 54810
17809E4810K9887j4828j5097M647K4023j6275l5403q007j4805J3131L970K8944
$$ 54810 84697 69869 54772 59419 83442 67167 31764 23757 8952 22083 26053 54997
17797E4997J9496K5525P786J0749L4419N4659O5906J0450q936j834K6169M9265
$$ 54997 74493 100018 107804 118553 152972 207631 273537 283987 275051 273217 299386 348651
17785C48651K729j7057j2506J5020j053m2357j1301l760j7465k3185n2892l7752
$$ 348651 351380 334323 321817 336837 335784 293427 282126 278366 260901 237716 184824 147072
17773A47072k4142p340m5017j0120J4885k978m9693k6478k0169N3099J3541j7259
$$ 147072 122930 115590 70573 60453 75338 72360 22667 -3811 -23980 29119 42660 25401
17761B5401j8069R19J6585J3189l425k917J9870J6310Q801M971j3732m7241o216
$$ 25401 7332 8251 24836 38025 34600 31683 51553 67863 76664 81635 67903 20662 14446
17748A4446K5406N862Q21J4240N0736Q5213M2672k1125K2166L7862J9503K3363
$$ 14446 39852 45714 46535 60775 111511 196724 239396 218271 240437 278299 297802 321165
17736C21165J4174k4045n053j520j3418m0684j8742K8872J4816p070n3633n0008
$$ 321165 335339 311294 306241 304721 291303 250619 231877 260749 275565 268495 214862 164854
17724A64854k9298l1459j9790n4898l7262L0334M6109q747l6319l8200K1197J01
$$ 164854 135556 104097 84307 29409 -7853 22481 68590 59843 23524 -14676 6521 6622
17712F622K3274K7465J3213M222j6468k8595l4506K2051O541j6436q896J7070
$$ 6622 29896 57361 70574 74796 58328 29733 -4773 17278 23819 7383 -1513 15557
17700A5557J0701L50M5106J115r249j5580l3494k4420q441L020J8651J2073l590
$$ 15557 26258 26608 71714 72829 63580 48000 14506 -9914 -18355 -15335 3316 15389 11799
17687A1799k0609L2681N711m865J7676l011l145j5021K0497Q693k3146k5169q121
$$ 11799 -8810 23871 29582 24717 42393 39382 36237 21216 41713 50406 27260 2091 -6030
17674f030Q586j3072j449K6026M206L566k068Q897L954Q194J992L353K880J5558
$$ -6030 2556 -10516 -11965 14061 18267 21833 19765 28662 32616 40810 42802 46155 49035 64593
17660F4593j5265o958J7376j3704l3707n468P331J6588J5009m3111m16L4119O131
$$ 64593 49328 42370 59746 46042 12335 6867 14198 30786 45795 2684 2268 36387 42518
17647D2518J341M1482k4294j2621j2434j4334l5906l4847K3179J4218m691J1422
$$ 42518 43859 85341 61047 48426 35992 21658 -14248 -49095 -25916 -11698 -16389 -4967
17635d967L605L611Q09K0248J2183Q918j4945k6076j4017J5027R571j0053J8584
$$ -4967 -1362 2249 3058 23306 35489 44407 29462 3386 -10631 4396 13967 3914 22498
17622B2498J4212k594q856j6893j1539j8538j722k7259K0736L8047n935L09k1221
$$ 22498 36710 34116 25260 8367 -3172 -21710 -23432 -50691 -29955 8092 2157 2466 -18755
17609a8755J212J4763o927k1212K408O726O941J9068K2263O58j2183M10J3791
$$ -18755 -17543 -2780 -9707 -30919 -28511 -21785 -14844 4224 26487 27145 14962 15372 29163
17596B9163o779j7088j1531R310j342J4117J9270O15m262L231J6146j3612l394
$$ 29163 22384 5296 -6235 3075 1733 15850 35120 35735 31473 34704 50850 37238 33844
17583C3844J0882J2829l4277n424R533J256m0033M696L1549j843j1352j5694q479
$$ 33844 44726 57555 23278 17854 27387 28643 -11390 -6694 24855 23012 11660 -4034 -12513
17570a2513K1624K4002j4552j1470l081k0242r432J3577K7517M031k8932J9314
$$ -12513 9111 33113 18561 7091 4010 -16232 -25664 -12087 15430 19461 -9471 9843
17558I843K4030k1300j5907q241p321N347p097m683O560K3861J3040k8529R234
$$ 9843 33873 12573 -3334 -11575 -18896 -13549 -20646 -25329 -18769 5092 18132 -10397 -1163
17545a163n94J0649K828j1061O249J4966K1803L200M652k1078j1252q098n322
$$ -1163 -1757 8892 11720 659 6908 21874 43677 46877 51529 30451 19199 11101 5779
17532E779J3207q719J3845n294J966J2521j3083J5048Q115N906J8924J825j8716
$$ 5779 18986 10267 24112 18818 20784 33305 20222 35270 43385 49291 68215 70040 51324
17519E1324j0526K1862j0516k073j9653R381K1693j5427k1795j2849j7498P063
$$ 51324 40798 62660 52144 50071 30418 39799 61492 46065 24270 11421 -6077 986
17507I86j4155K3045p150J717o900Q305O936J7581j4526j3815l1523m554J3270
$$ 986 -13169 9876 2726 4443 -2457 5848 12784 30365 15839 2024 -29499 -34053 -20783
17494b0783J367j4354N189j0191J574p404J456J3154J9063n724l816J5406o965
$$ -20783 -19416 -33770 -28581 -38772 -37198 -44602 -43146 -29992 -10929 -16653 -20469 -5063 -12028
17481a2028n029O282m429K2658j095o618J1444J1233j5646O033Q588k9079p787
$$ -12028 -17057 -10775 -15204 7454 6359 -259 11185 22418 6772 12805 21393 -7686 -15473
17468a5473J1796J7366j0089R892j5813o124K98K6330L8668R042l865k4508q974
$$ -15473 -3677 13689 3600 13492 -2321 -8445 -8147 18183 56851 65893 62028 37520 28546
17455B8546j3242j2368J2166K2477O444l0600J0328j6385K16L9919N4199N1072
$$ 28546 15304 2936 15102 37579 44023 13423 23751 7366 7582 47501 101700 152772
17443A52772L5467q427k2845m8679j5205l6280j9684P54q814j6451j4444j093
$$ 152772 188239 179812 156967 108288 93083 56803 37119 37873 29059 12608 -1836 -2929
17431b929o993k8009j5453M4317N417j1293J9338J49J5302Q897j4467l9869j4235
$$ -2929 -9922 -37931 -53384 -9067 -3650 -14943 4395 4544 19846 28743 14276 -25593 -39828
17418c9828M1836K6339L0905k4389j2454K0547O46l7256Q87k3347J501J3853n725
$$ -39828 2008 28347 59252 34863 22409 42956 43602 6346 7233 -16114 -14613 -760 -6485
17405f485l2858J934L3961J1174m765j6720J4973o212l5408j1171j4343L2583
$$ -6485 -39343 -37409 -3448 7726 2961 -13759 1214 -4998 -40406 -51577 -65920 -33337
17393c3337M2616n859K959L58k7j7739m240J8294j5995j7765J5954L1901n532
$$ -33337 9279 3420 6379 6737 6710 -11029 -15269 3025 -12970 -30735 -14781 17120 11588
17380A1588j015o34l2166L483M7433m5642j8981P333J201R362L097K3161q170
$$ 11588 10573 9939 -22227 -18744 28689 -16953 -35934 -28601 -27400 -18038 -14941 8220 50
17367E0l2506J1960P82K2941P133L710j4m211M992L9468p719m2216j5207j0321
$$ 50 -32456 -20496 -19714 3227 10360 14070 14056 9845 14837 54305 46586 4370 -10837 -21158
17353b1158R734l885j1458O713O113l907k4865j5115K6734K6175j3206P873P876
$$ -21158 -11424 -15309 -26767 -20054 -13941 -17848 -42713 -57828 -31094 -4919 -18125 -10252 -2376
17340b376j4343J6791K2309j1387j0788j6327N073n367J9697j1339l5692j8769
$$ -2376 -16719 72 22381 10994 206 -16121 -11048 -16415 3282 -8057 -43749 -62518
17328f2518j728O904l222k093J9568K9823J3817K8857j9322j2367k6164m6390
$$ -62518 -64246 -57342 -60564 -62657 -43089 -13266 551 29408 10086 -2281 -28445 -74835
17316g4835J6629L9175J341M381J3631O724k328l0253M87J2444K933K3473k710
$$ -74835 -58206 -19031 -17690 -13309 322 7046 4718 -25535 -25048 -12604 -9671 13802 11092
17303A1092j1213k1325L049K7531L0631L299l0533k2595j5649J4862m776q01j3326
$$ 11092 -121 -21446 -18397 9134 39765 43064 12531 -10064 -25713 -10851 -15627 -16428 -29754
17290b9754l884K3008J6999M759r093j3320N619K7582j9240L803K340j9402j7122
$$ -29754 -33638 -10630 6369 11128 2035 -11285 -5666 21916 2676 6479 8819 -10583 -27705
17277b7705n285j805K0345L7606J2483m1901K4309R846j2111j1966j6607J0833
$$ -27705 -32990 -34795 -14450 23156 35639 -6262 18047 27893 15782 3816 -12791 -1958
17265a958j1349r722K7619m522j2868j0098J3852M0729J0387k0652m7776r727
$$ -1958 -13307 -23029 4590 68 -12800 -22898 -9046 31683 42070 21418 -26358 -36085
17253c6085R450j3881p7M1715k815l8298j3964o401R643N615L555J5849J5401
$$ -36085 -26635 -40516 -40593 1122 -1693 -39991 -53955 -60356 -50713 -45098 -41543 -25694 -10293
17240a0293J863j1780j0382P792M1528J3707O02n949j022j7423l8814j4759K4483
$$ -10293 -8430 -20210 -30592 -22800 18728 32435 33037 27088 26066 8643 -30171 -44930 -20447
17227b0447j3077j705J1315k1606n024O096J6297R26K3359J9726K4933L859l3307
$$ -20447 -33524 -35229 -23914 -45520 -50544 -44448 -28151 -27225 -3866 15860 40793 44652 11345
17214A1345k0394p285m118o156j5873O81k0941L5953J7193J0253j2415j2401k5735
$$ 11345 -9049 -16334 -20452 -26608 -42481 -41800 -62741 -26788 -9595 658 -11757 -24158 -49893
17201d9893K3526J961J1889K2074J803k0602j2297k5810J0609K437O967K5826
$$ -49893 -26367 -24406 -12517 9557 11360 -9242 -21539 -47349 -36740 -34303 -27336 -1510
17189a510P099q656L291J845j1767R707J6037K516J6888j4271r305k7080j0098
$$ -1510 5589 -3067 224 2069 -9698 9 16046 18562 35450 21179 11874 -15206 -25304
17176b5304j800K1320J7013q988r137J6842j0068k7153N272L6995L3385K4588
$$ -25304 -27104 -5784 11229 2241 -6896 9946 -122 -27275 -22003 14992 48377 72965
17164G2965l500n10k5966p3189p129K5414L4003K6154n458m877l1240L17j0034
$$ 72965 69465 68955 42989 -30200 -37329 -11915 22088 48242 42784 37907 6667 6984 -3050
17151c050l0922K1771M7384N868L552j5422j9803k1257O138J842J2995N625k3582
$$ -3050 -33972 -12201 35183 41051 44603 29181 9378 -11879 -5741 -3899 9096 14721 -8861
17138h861j3027R686k0350m826K0247K4739p61J2850k3671l8291N477K0301q929
$$ -8861 -21888 -12202 -32552 -37378 -17131 7608 6847 19697 -3974 -42265 -36788 -16487 -25416
17125b5416j2412L2462K6312J3490K0736j4941p786K520R964N209o427l2601j5007
$$ -25416 -37828 -5366 20946 34436 55172 40231 32445 34965 44929 50138 43711 11110 -3897
17112c897J7642K4760j0204k4410j2402P950J29j5767R224J1531N412O287R128
$$ -3897 13745 38505 28301 3891 -8511 -561 -432 -16199 -6975 4556 9968 16255 25383
17099B5383j1415m611k9270l5518J3289L8576L0331L6528k6288o130J423r761
$$ 25383 13968 9357 -19913 -55431 -42142 -3566 26765 63293 37005 30875 32298 22537
17087B2537O395k6127o34j1037k5610k5398R494N269j0554J458j1843J0083J4130
$$ 22537 28932 2805 2171 -8866 -34476 -59874 -50380 -45111 -55665 -54207 -66050 -55967 -41837
17074d1837N62L3091L143k6672Q129p958J2186K2355K2747j4576j5901J2975J5906
$$ -41837 -41275 -8184 -5041 -31713 -23584 -31542 -19356 2999 25746 11170 -4731 8244 24150
17061B4150j5795n519k82O444J419q368l9J7024K2653j4276k1611L4010l648m3585
$$ 24150 8355 2836 2554 8998 10417 2049 2010 19034 41687 27411 5800 39810 36162 -7423
17047g423j1165N7824K6200q712k7037l601J8763j7679j2161l642J0453j5011
$$ -7423 -18588 39236 65436 56724 29687 26086 44849 27170 15009 11367 21820 6809
17035F809K8747K1900l9674k1308j2549J3124J4671k2511r086k640J5756J8739
$$ 6809 35556 57456 17782 -3526 -16075 -2951 11720 -10791 -19877 -22517 -6761 11978
17023A1978J2248O22K6556k1018j5316O101M832K654k9505l9771K540M0562J7894
$$ 11978 24226 24848 51404 30386 15070 21171 26003 28657 -848 -40619 -38079 2483 20377
17010B0377N083J5568n662k0790j7629J820J7626R380j6095J951L1766k855J611
$$ 20377 25460 41028 35366 14576 -3053 -1233 16393 25773 9678 11629 43395 40540 42151
16997D2151M9448J6221O797j3333l7120k2413j274M576J8198q133q976L561J6489
$$ 42151 91599 107820 114617 101284 64164 41751 40477 45053 63251 55118 46142 49703 66192
16984F6192J9614K0472m079l1119l4816k2195J183J6035J1822l230J1177L772
$$ 66192 85806 106278 102199 71080 36264 14069 15252 31287 43109 39879 51056 54828
16972E4828M937m378j37j3258k3266k2082k4390K2744K6824O673O050l5O426j0081
$$ 54828 59765 55387 55250 41992 18726 -3356 -27746 -5002 21822 28495 34545 34510 40936 30855
16958C0855q429r281q985J7750j5566j1110n484l851K7094J4981K342m521j8290
$$ 30855 22426 13145 4160 21910 6344 -4766 -10250 -14101 12993 27974 30316 25795 7505
16945G505k7740l0843J0711L3489O4077J3369l9000k0148j8043j0509p875p734
$$ 7505 -20235 -51078 -40367 -6878 57199 70568 31568 11420 -6623 -17132 -25007 -32741
16933c2741n283M392J9191l839K1810K1593O689l229M426l2939j6826j3139k184
$$ -32741 -38024 -33632 -14441 -18280 3530 25123 31812 28583 33009 70 -16756 -29895 -32079
16920c2079p164L406J7485J5155L796j044j2446j2918R322k974K005l823k8325
$$ -32079 -39243 -35837 -18352 -3197 599 -445 -12891 -25809 -16487 -19461 -17456 -21279 -49604
16907d9604J8563j73L5553M4120N436k5460K36K625J2068m826l0552l688l4652
$$ -49604 -31041 -31214 4339 48459 53895 28435 28671 31296 43364 38538 7986 4298 -30354
16894c0354K5719K0364J920k1525M089J9678J8465K2870Q846j4442j172j5904
$$ -30354 -4635 15729 17649 -3876 213 19891 38356 61226 70072 55630 54458 38554
16882C8554k6236j9440J2275Q035j789R196K2007K1711K3193P290k1461J1230
$$ 38554 12318 -7122 5153 13188 11399 20595 42602 64313 87506 94796 73335 84565
16870H4565j3817l8224n157J001j5988j3464O498p326J3777K0990j4404j1854
$$ 84565 70748 32524 27367 28368 12380 -1084 5414 -1912 11865 32855 18451 6597
16858F597J4543j5418j3222K7140L7563j64k726o467K114J2305j4375k2669k4204
$$ 6597 21140 5722 -7500 19640 57203 57039 54313 47846 49960 62265 47890 25221 1017
16845A017p600J9058L6539o316k0296K022r473n382J8337j3437J3538J8339J1662
$$ 1017 -6583 12475 49014 42698 22402 24424 14951 9569 27906 14469 28007 46346 58008
16832E8008j7933j7918j1943J0873k3759J439J768l917R654k2048k635J8182K291
$$ 58008 40075 22157 10214 21087 -2672 -1233 535 -3382 6272 -15776 -18411 -229 2062
16819B062k311J8087K7301K973L5150J2330k6548k2300j4364n5086l4264K8226
$$ 2062 -249 17838 45139 48112 83262 95592 69044 46744 32380 -22706 -56970 -28744
16807b8744J5916j2210J552J1232J560r066J7817J3352J2753L659J689r891j5022
$$ -28744 -12828 -25038 -23486 -12254 -10694 -19760 -1943 11409 24162 27821 29510 19619 4597
16794D597m243K4115J1096k162j4730p459j1612o118J7475R915j4795R50k0714
$$ 4597 354 24469 35565 33403 18673 11214 -398 -6516 10959 20874 6079 7029 -13685
16781a3685n1504J7718O55P882J2875m318K5226L5355m113k5601J4327J6943l818
$$ -13685 -65189 -47471 -46816 -38934 -26059 -30377 -5151 30204 26091 490 14817 31760 27942
16768B7942L881k1649J2116R498j2694l6003Q901J9436M287N989J7616R864j6158
$$ 27942 31823 10174 22290 31788 19094 -16909 -8008 11428 15715 21704 39320 49184 33026
16755C3026j1150L04J4634j2879J064J0636k2927p308K1756m867j2979r984J3535
$$ 33026 21876 22180 36814 23935 24999 35635 12708 5400 27156 22289 9310 -674 12861
16742A2861R826n02j6724k1380l300J4066M140l332R431K894o549J1547r997K4819
$$ 12861 22687 22185 5461 -15919 -19219 -5153 -1013 -4345 5086 7980 1431 12978 2981 27800
16728B7800o518l0980k158K4134L3710R609q174j3773n901P167J4743l8880q114
$$ 27800 21282 -9698 -11856 12278 45988 55597 47423 33650 27749 34916 49659 10779 2665
16715B665J8404J2459R497J308r122J4399J46l2897N03J8758m11j6136m1335M656
$$ 2665 21069 33528 43025 44333 35211 49610 49756 16859 17362 36120 35709 19573 -21762 -17106
16701a7106K904o407J7009P56n168P624r516K2857J9070j4955O009P767k1402
$$ -17106 -14202 -20609 -3600 -2844 -8012 -388 -9904 12953 32023 17068 23077 30844 9442
16688I442j6689q248k2642K9020K7397o609q429P891N818K876K1167r221J2324
$$ 9442 -7247 -15495 -38137 -9117 18280 11671 3242 11133 16951 19827 40994 31773 44097
16675D4097j1587k685m5477j0891j6732N4323J9100j8970j623L425j3808j5226
$$ 44097 32510 29825 -15652 -26543 -43275 11048 30148 11178 9555 12980 -828 -16054
16663a6054J5024J8035O041n274j522J1558O826J5564l120J9832j6681k6309j1985
$$ -16054 -1030 17005 23046 17772 16250 27808 34634 50198 47078 66910 50229 23920 11935
16650A1935J3051J9326N298L131r042k1971J18m09L3146k3352P527j4649k6853
$$ 11935 24986 44312 49610 52741 43699 21728 21846 21437 54583 31231 38758 24109 -2744
16637b744k4226N006J0082K402k6001o023J1534J1758j2646n280m292J3766L0696
$$ -2744 -26970 -21964 -11882 -9480 -35481 -41504 -29970 -18212 -30858 -36138 -40430 -26664 4032
16624D032J0038J2202p075O61l5k0182r840N736K9568j5990j9105J3120k5965
$$ 4032 14070 26272 19197 19858 19823 -359 -10199 -4463 25105 9115 -9990 3130 -22835
16611b2835k3866M5825K635J6760k1112j3350j0396j0710K0903J0401q245J5061
$$ -22835 -46701 -876 1759 18519 -2593 -15943 -26339 -37049 -16146 -5745 -13990 1071
16599A071r071L695J859m64j0898J5444J149M273R070J0195k2171o700k1346r710
$$ 1071 -8000 -4305 -2446 -2910 -13808 1636 2785 7058 16128 26323 4152 -2548 -23894 -33604
16585c3604J5571k724k4326K510R495K6282L069K33L5851M025j1965l4000R344
$$ -33604 -18033 -20757 -45083 -42573 -33078 -6796 -3727 -3494 32357 36382 24417 -9583 -239
16572b39J4896j7631m2883M21n416r866J4106J1190M121O782K4531K472n554K374
$$ -239 14657 -2974 -45857 -45436 -50852 -60718 -46612 -35422 -31301 -24519 12 2484 -3070 -696
16558f96p527L698K3485J5659J1835J6008K869N310K784j792j2378l8608n5413
$$ -696 -8223 -4525 18960 34619 46454 62462 65331 70641 73425 71633 59255 20647 -34766
16545c4766K832J6192J3790M455l1732K905J7912L0710k025j6246j0126o815J6144
$$ -34766 -31934 -15742 -1952 2503 -29229 -26324 -8412 22298 20273 4027 -6099 -12914 3230
16532C230J4011j4092k935J0056j9882n1149Q261J6980K0529k268k362j9879p233
$$ 3230 17241 3149 214 10270 -9612 -60761 -52500 -35520 -14991 -17259 -19621 -39500 -46733
16519d6733J5439L1888J9834j2353J0787q903j6846k5333J3105K7144k1463K1434
$$ -46733 -31294 594 20428 8075 18862 9959 -6887 -32220 -19115 8029 -13434 8000
16507H000L9512N228K207j9124r311j5206k0909J2044K7800n813K3930K6673k7519
$$ 8000 47512 52740 54947 35823 26512 11306 -9603 2441 30241 24428 48358 75031 47512
16494D7512j9647R623p847P35j813l790J5145j9664L376J0549Q545k1130l3493
$$ 47512 27865 37488 29641 30376 28563 24773 39918 20254 23630 34179 42724 21594 -11899
16481a1899k609n840L1477j862j2716J1266K3257J511q962m0442O981j4326k1139
$$ -11899 -14508 -20348 11129 9267 -3449 7817 31074 32585 23623 -16819 -9838 -24164 -45303
16468d5303Q059J2979j39M917J7438J3421J2688l249o485Q01r0m85k434M080Q090
$$ -45303 -37244 -24265 -24404 -19487 -2049 11372 24060 20811 14326 15127 15037 14552 12118 16198 24288
16453B4288J4710k5260m7142j968N4743L8107m0998m3959k5004M035N270j2979
$$ 24288 38998 13738 -33404 -35372 19371 57478 16480 -27479 -52483 -48448 -43178 -56157
16441e6157K2491K2647l9862N972N2489J2254k4782J5928l920o876R183n684l0584
$$ -56157 -33666 -11019 -50881 -44909 7580 19834 -4948 10980 7060 184 9367 3683 -26901
16428b6901m320j6022J5413K6532L611p458k7014l976J4539j2885J6359M1204
$$ -26901 -31221 -47243 -31830 -5298 -1687 -9145 -36159 -40135 -25596 -38481 -22122 19082
16416A9082l1621j7K3461K2488k0808j1618j9008j7217k208m410L040J2107J9026
$$ 19082 -12539 -12556 10905 33393 12585 967 -18041 -35258 -37466 -41876 -38836 -26729 -7703
16403g703P633K198J861P113j4135K9154K3042J5382O63l3618l1787k6177J823
$$ -7703 -70 2128 3989 11102 -3033 26121 49163 64545 65208 31590 -197 -26374 -24551
16390b4551M4794K4823k4211l9735o760P423j2994K640j0956J9832R444q986j0201
$$ -24551 20243 45066 20855 -18880 -25640 -18217 -31211 -28571 -39527 -19695 -10251 -19237 -29438
16377b9438J4790k2489q663J2351J0102J2084m313l820l405O109p277m806L4091
$$ -29438 -14648 -37137 -45800 -33449 -23347 -11263 -15576 -19396 -22801 -16692 -23969 -28775 5316
16364E316K1615J8360j1648m25j0718k4310l854J0404l096j1000q537l944J8752
$$ 5316 26931 45291 33643 33218 22500 -1810 -5664 4740 1644 -9356 -17893 -21837 -3085
16351c085J394j3697j5973k742L1320l857J44j098L733m806m331j5736j2553J4350
$$ -3085 -1691 -15388 -31361 -34103 -2783 -6640 -6496 -7594 -3861 -8667 -12998 -28734 -41287 -26937
16337b6937K9870r411K23N590J794k2409j0074M4893J9872r488M363N751j7034
$$ -26937 2933 -6478 -6255 -665 1129 -21280 -31354 13539 33411 23923 28286 34037 17003
16324A7003O206L0316Q80j8574j0905j0723m1326l7711q259L0589L0444K9860
$$ 17003 23209 53525 54405 35831 24926 14203 -27123 -64834 -73093 -42504 -12060 17800
16312A7800J8998M892l230l9459k5244K612J6310m677O262J0989L7055J6252r443
$$ 17800 36798 41690 38460 -999 -26243 -23631 -7321 -11998 -5736 5253 42308 58560 49117
16299D9117j0994l0662n722K7744j0738N1079L7502m2615o4060k3968J4575m222
$$ 49117 38123 7461 1739 29483 18745 69824 107326 64711 651 -23317 -8742 -12964
16287a2964k2451k3662O029M4724K0013K2701L4415J3815p955n451Q138j8619
$$ -12964 -35415 -59077 -53048 -8324 11689 34390 68805 82620 74665 69214 77352 58733
16275E8733k7421K737k561K1323Q9k5195R5o545j6912K232M9970J5264k0660k2498
$$ 58733 31312 34049 31488 52811 52900 27705 27800 21255 4343 6575 56545 71809 51149 28651
16261B8651j865j101l108J439J6796P439j6421k8925l91K0249J1484q315m119
$$ 28651 26786 25685 22577 24016 40812 48251 31830 2905 2514 22763 34247 25932 21813
16248B1813L0773j7191J3395j0807j4999j3275l0023R729j612k0100j397J0882
$$ 21813 52586 35395 48790 37983 22984 9709 -20314 -10585 -12197 -32297 -33694 -22812
16236b2812j2713j5178L5526P379O57J1926N523J720p756K6371K8965j0557j3041
$$ -22812 -35525 -50703 -15177 -7798 -7141 4785 10308 12028 4272 30643 59608 49051 36010
16223C6010P397J7241J1029K1151r464n3418r279j3238J3795m32j1808j3556j6214
$$ 36010 43407 60648 71677 92828 83364 29946 20667 7429 21224 20792 8984 -4572 -20786
16210b0786K361K6570N1442q280l6901q116l124J2713j7844k3805l069k062J1906
$$ -20786 -18425 8145 59587 51307 14406 6290 3166 15879 -1965 -25770 -28839 -30901 -18995
16197a8995J6268j8955n51Q189l584N717L874J9238o930J4968K9925J6346k9180
$$ -18995 -2727 -21682 -22233 -14044 -17628 -11911 -8037 11201 4271 19239 49164 65510 36330
16184C6330l5670o588j3046J4264M2512K2477l7536j6196j721K9655j1180M000
$$ 36330 660 -5928 -18974 -4710 37802 60279 22743 6547 4826 34481 23301 27301
16172B7301p927Q978j797m035k5454K583J5910k1419J366J9946J2032o877q785
$$ 27301 19374 28352 26555 22520 -2934 -351 15559 -5860 -4494 15452 27484 20607 11822
16159A1822j4176l2959Q569J7398J5021J0425R607Q390o796k6270j9052J195J7760
$$ 11822 -2354 -35313 -26744 -9346 5675 16100 25707 34097 27301 1031 -18021 -16826 934
16146I34M977R871K0991L63J4822l297l0568j2650n943j0452R344M538N983l987
$$ 934 5911 15782 36773 37136 51958 48661 18093 5443 -500 -10952 -1608 2930 8913 4926
16132D926Q626m433Q078M033j1526j5075J1985K0539r958l823k4645j3386L7621
$$ 4926 13552 9119 17197 21230 9704 -5371 6614 27153 17195 13372 -11273 -24659 12962
16119A2962l2268N622M6273n535K6761o120j9531R005k4828k7347K4384J9682
$$ 12962 -19306 -13684 32589 27054 53815 47695 28164 37169 12341 -15006 9378 29060
16107B9060L113j1150N511j962k1910l1144J4396K1483n904Q609Q848J2502j0546
$$ 29060 32173 21023 26534 24572 2662 -28482 -14086 7397 1493 10102 18950 31452 20906
16094B0906O307j5124n627l285r491r996J4089k805j1197L3582j4543k3662Q496
$$ 20906 27213 12089 6462 3177 -6314 -16310 -2221 -5026 -16223 17359 2816 -20846 -12350
16081a2350K1846M2098r984N328n639P509K674k1138N502J6015j2429L477p741
$$ -12350 9496 51594 41610 46938 41299 48808 51482 30344 35846 51861 39432 42909 35168
16068C5168k5002n901J2595L5036Q801j8596K7407k0272k6073J5295p496J605
$$ 35168 10166 4265 16860 51896 60697 42101 69508 49236 23163 38458 30962 32567
16056C2567K754K347N548k64k2455K9964J3996j6451K380k6765j1995j8841K3711
$$ 32567 35321 37668 43216 42952 20497 50461 64457 48006 50386 23621 11626 -7215 16496
16043A6496j8373k2618J3764J3524N203P946K548J3349j8415k6753l750Q631L2495
$$ 16496 -1877 -24495 -10731 2793 7996 15942 18490 31839 13424 -13329 -17079 -8448 24047
16030B4047k1489l6052j3072L017J3508q31L4221K6762P34L175K6467J3858j7623
$$ 24047 2558 -33494 -46566 -43549 -30041 -30872 3349 30111 30845 34020 60487 74345 56722
16017E6722r58j4650l5388J5296o088j7024K3387p462j0307J0207k944r95K5279
$$ 56722 55764 41114 5726 21022 14934 -2090 21297 13835 3528 13735 10791 9796 35075
16004C5075R689J0023l0991o543R101K7811Q073j8593K5050l554l6300j6203Q271
$$ 35075 44764 54787 23796 17253 26354 54165 62238 43645 68695 65141 28841 12638 20909
15991B0909p6q8l4833p445q49K1442K0049L293j0009r901M426N156N826n5841
$$ 20909 20833 20745 -14088 -21533 -22382 -940 19109 22402 12393 2492 6918 12074 17900 -37941
15977c7941J4451L3576J5415k5693k674J3302j4843J0392J7898o168P32O218j7903
$$ -37941 -23490 10086 25501 -192 -2866 10436 -4407 5985 23883 17715 18447 24665 6762
15964F762K852J3096P202j5400J1476k8323r010j4318k8060J8694J6600L766J2585
$$ 6762 9614 22710 29912 14512 25988 -2335 -11345 -25663 -53723 -35029 -18429 -14663 -2078
15951b078M191L091M2963J0869r787j5353k5599Q469J5222j1078J7817P310J525
$$ -2078 2113 5204 48167 59036 49249 33896 8297 16766 31988 20910 38727 46037 47562
15938D7562J2976o860k6300r38n662j3247n314j2347j2258J8988L7130O13J6737
$$ 47562 60538 53678 27378 26440 20778 7531 2217 -10130 -22388 -3400 33730 34343 51080
15925E1080j9849j2805k57M693J5546n58M898j5478K1497l151l1071m4149k7276
$$ 51080 31231 18426 18169 22862 38408 37850 42748 27270 48767 45616 14545 -29604 -56880
15912e6880K4692L5820n357k4184n604J0158K8471J8721j3326j7866p230l158
$$ -56880 -32188 3632 -1725 -25909 -31513 -21355 7116 25837 12511 -5355 -12585 -15743
15900a5743K1163J5986N781j2769l641k5231L3224J2788l585m359k490J0625J5508
$$ -15743 5420 21406 27187 14418 10777 -14454 18770 31558 27973 23614 21124 31749 47257
15887D7257J2002Q911m922j3917M444r702r701l993N089J1835J6594Q730J788
$$ 47257 59259 68170 63248 49331 53775 44073 34372 30379 35468 47303 63897 72627 74415
15874G4415k0053m2517j1497N0695J336P668K1367O4618O4078O3802Q1426Q3297
$$ 74415 54362 11845 348 51043 52379 60047 81414 146032 210110 273912 355338 438635
15862D38635J37927J80757K14161K17645J88879J36042P6212j8465q4657j33780
$$ 438635 576562 757319 971480 1189125 1378004 1514046 1590258 1571793 1487136 1353356
15852A353356j74378j71256j96629j33013j09646j34826j21229n8199n2247n5760
$$ 1353356 1178978 1007722 811093 678080 568434 433608 312379 254180 201933 146173
15842A46173k1862j0695j2851K739J4543m807K859K31R213L1829j5390l577k7569
$$ 146173 124311 113616 100765 103504 118047 113240 116099 116330 125543 157372 141982 138405 110836
15829A10836J2135N486k7909k2041j2325j6535j5170O058j6753J0791K1654J0935
$$ 110836 122971 128457 100548 78507 66182 49647 34477 40535 23782 34573 56227 67162
15817F7162l1875l5056l307J1160K7115N3500M300l0620l004j7249R974J9988
$$ 67162 35287 231 -3076 8084 35199 88699 92999 62379 59375 42126 52100 72088
15805G2088j8908k4619N714J2490q563l136R751J4321L2632q171j7243k7133J483
$$ 72088 53180 28561 34275 46765 38202 35066 44817 59138 91770 83599 66356 39223 40706
15792D0706L8061K4466j9624r651j5955j5425K2593K302J0037J3822k3237k9803
$$ 40706 78767 103233 83609 73958 58003 42578 65171 67473 77510 91332 68095 38292
15780C8292L022j1409M931j5504j815K7240k4883O071K7293K9597l4942m3858
$$ 38292 41314 29905 34836 19332 17517 44757 19874 25945 53238 82835 47893 4035
15768D035j5482K163K200J2878l8048l929J1020K3437J8177j1326j1337L983L9850
$$ 4035 -11447 -9284 -7084 5794 -32254 -36183 -25163 -1726 16451 5125 -6212 -2229 37621
15755C7621J7766p71Q111j9488k9824Q952N740K3451K287k4440o393K663J2260
$$ 37621 55387 54616 62727 43239 13415 22367 28107 51558 53845 29405 23012 25675 37935
15742C7935N743j1512J3261L6526L0061O937r923q784n852J1003r238J1360O226
$$ 37935 43678 32166 45427 81953 112014 118951 109028 100244 94392 105395 96157 107517 113743
15729A13743p666J7537L0715K4939J4825K3840q347k700J1409k7240m3669m6249
$$ 113743 106077 123614 154329 179268 194093 217933 209586 206886 218295 191055 147386 101137
15717A01137l1023r101m143n0782m1594n7778k3309Q036J77J5250j1024r10J7837
$$ 101137 70114 61013 56870 6088 -35506 -93284 -116593 -108557 -108380 -93130 -104154 -105064 -87227
15704h7227O878n983K600j0353J4539J3748L6888L1667k6966j0120j6669j0332
$$ -87227 -80349 -86332 -83732 -94085 -79546 -65798 -28910 2757 -24209 -34329 -50998 -61330
15692f1330K9300K2963J4634k252J1j2337q417r643q346K9556N9049M4713j2704
$$ -61330 -32030 -9067 5567 3315 3326 -9011 -17428 -27071 -35417 -5861 53188 97901 85197
15679H5197k3965L9190j5613l7592K7260j2410P231K1241J2614J7379M3272N4886
$$ 85197 61232 100422 84809 47217 74477 62067 69298 90539 103153 120532 163804 218690
15667B18690L6522K9463N1979K7857J8245r349l4681l6829l4726m4934m2141o0514
$$ 218690 255212 284675 336654 364511 382756 373407 338726 301897 267171 222237 180096 119582
15655A19582l5301r430j6769J1059p407j4944k768L914k0891J1151J0432K1107
$$ 119582 84281 74851 58082 69141 61734 46790 44022 47936 27045 38196 48628 69735
15643F9735r84l922K2939j1436k7603j29j6283k452N1834K3091l6653l0966J3238
$$ 69735 68751 64829 87768 76332 48729 48600 32317 29865 81699 104790 68137 37171 50409
15630E0409J1473r24N185J485j9188n431j6192j7798k4866L2859k732L270k0543
$$ 50409 61882 60958 66143 67628 48440 43009 26817 9019 -15847 17012 14280 17550 -2993
15617b993k008j6313j0530P665J0144J6199M320J6900J3990K4176L4244K3507
$$ -2993 -5001 -21314 -31844 -24179 -14035 2164 6484 23384 37374 61550 95794 119301
15605A19301m380k4104k7498j3602m0640j5930l675j2865M206J3796K0131m1357
$$ 119301 114921 90817 63319 49717 9077 -6853 -10528 -23393 -19187 -5391 14740 -26617
15593b6617j4089J8642P069M8149K7995K3879r801j5704K2771P558J9548J3695
$$ -26617 -40706 -22064 -14995 33154 61149 85028 75227 59523 82294 89852 109400 123095
15581A23095l710j8834j9794R74k957M988K229N509J2246K0419K8015K1333J100
$$ 123095 119385 100551 80757 81731 78774 83762 85991 91500 103746 124165 152180 173513 174613
15568A74613P756K4608M7673q975l7480j8174j1677m4918j2275p490K1195k0203
$$ 174613 182369 206977 254650 245675 208195 190021 178344 133426 121151 113661 134856 114653
15556A14653r710J4184P203J2296J675j9471j1293L3620K2803K7477Q606K2765
$$ 114653 104943 119127 126330 138626 140301 120830 109537 143157 165960 193437 202043 224808
15544B24808M0563P912L508K631K926n641L1204J8757k263j6937k747L617l1891
$$ 224808 265371 273283 276791 279422 282348 276707 307911 326668 324405 307468 304721 308338 276447
15531B76447l3398l1138k5075J6871k7559k3674o468M371J53M753r726n252J6972
$$ 276447 243049 211911 186836 203707 176148 152474 146006 150377 150530 155283 145557 140305 157277
15518A57277J8971M29m3016j5720J5311K7901L591K743K0764J4944M4129O676
$$ 157277 176248 176677 133661 117941 133252 161153 164744 167487 188251 203195 247324 254000
15506B54000m5946j9172o880J345J0222j287J2359J1462K0814K5550L3991N6636
$$ 254000 208054 188882 182002 183347 193569 192282 204641 216103 236917 262467 296458 353094
15494C53094L5242L189j6008N58K1060k3848l9223J563j995M7654r550j7504O463
$$ 353094 388336 391525 375517 376075 397135 373287 334064 335627 333632 381286 371736 354232 360695
15481C60695J206r899K2480N986m067J6176Q016n261L1271M8370M9399J2949K9027
$$ 360695 361901 352002 374482 380468 376401 392577 400593 395332 426603 474973 524372 537321 566348
15468E66348K6101N2523N8260K8532L3083L8281K6747N3578O4640K121J113L0996
$$ 566348 592449 644972 703232 731764 764847 803128 829875 883453 948093 950214 951327 982323
15456I82323K8854K5148M7141O6870O2967O6762R0673R2024O8049Q5471R9747
$$ 982323 1011177 1036325 1083466 1150336 1213303 1280065 1370738 1462762 1530811 1616282 1716029
15445A716029J29310J08411J37981J96764J99258K24303K26959K91674K95441
$$ 1716029 1845339 1953750 2091731 2288495 2487753 2712056 2939015 3230689 3526130
15436C526130L01140L59355M57983N66955P20800Q89070J179515J422623J637203
$$ 3526130 3827270 4186625 4644608 5211563 5932363 6821433 8000948 9423571 11060774
15427A1060774J873424K013629K196019K526872L017583L869182N429230Q093498
$$ 11060774 12934198 14947827 17143846 19670718 22688301 26557483 31986713 40080211
15419D0080211J2182613J7725308K4464153L1359556L7109100L9937496L8534938
$$ 40080211 52262824 69988132 94452285 125811841 162920941 202858437 241393375
15412B41393375L2644333K2075342Q843940n775734j9256307l0017749l6309455
$$ 241393375 274037708 296113050 304956990 299181256 279924949 249907200 213597745
15405B13597745l8424609l6148924l1133478k4810358j8309511j2940053q830426
$$ 213597745 175173136 139024212 107890734 83080376 64770865 51830812 43000386
15398D3000386o043678m339439l298267k650902k301855k081078j960332j821521
$$ 43000386 36956708 32617269 29319002 26668100 24366245 22285167 20324835 18503314
15390A8503314j686227j526073j344206j165262j029784q76638p39091o46162
$$ 18503314 16817087 15291014 13946808 12781546 11751762 10875124 10136033 9489871
15382I489871n61511m50676l96992l57966l60972l26224l05454l08842k88266
$$ 9489871 8928360 8477684 8080692 7722726 7361754 7035530 6730076 6421234 6132968
15373F132968k72766k16291k02721j90473j81282j97852k10665k03580j54203
$$ 6132968 5860202 5643911 5441190 5250717 5069435 4871583 4660918 4457338 4303135
15364D303135j46853j41513j62657j25654j38744j61792j01585j16988j14074
$$ 4303135 4156282 4014769 3852112 3726458 3587714 3425922 3324337 3207349 3093275
15355C093275p1457m9056n9643o6315k8101l9551o8504r9607q1406o6656m3913
$$ 3093275 3021818 2972762 2913119 2846804 2818703 2779152 2710648 2611041 2529635 2462979 2419066
15344B419066q6499o8583n2931p1091r0093n4122m6757p0335p3247l3556m9295
$$ 2419066 2332567 2263984 2211053 2139962 2049869 1995747 1948990 1878655 1805408 1771852 1722557
15333A722557n9833p4347o7342m6409k2977j6878n6852l1984k4819k9328k2619
$$ 1722557 1662724 1588377 1521035 1474626 1451649 1434771 1377919 1345935 1321116 1291788 1269169
15322A269169j0788j1210l5062m1387k4239k5695q686k8850m3884l640k0336n2069
$$ 1269169 1258381 1247171 1212109 1170722 1146483 1120788 1112102 1083252 1039368 1035728 1015392 963323
15310I63323j3768k0145l4992l1674k2007N286R322q894r235k2325j957k5711
$$ 963323 949555 929410 894418 862744 840737 846023 855345 846451 837216 814891 812934 787223
15298G87223M864l800l7013n2930k8503K6950M4353M729j7823j0326N2574L2512
$$ 787223 792087 788287 751274 698344 669841 696791 741144 745873 728050 717724 770298 802810
15286H02810J160J0463L1686J6357n6528o0414p014n5386o7714k3597m2932n1694
$$ 802810 803970 814433 846119 862476 805948 745534 738520 683134 615420 591823 548891 497197
15274D97197l2829j9696m3010j1257M6165Q22j2205l3563l3808J0887j8021q919
$$ 497197 464368 444672 401662 390405 436570 437392 425187 391624 357816 368703 350682 341763
15262C41763j3299j3784m2520Q633n430l9426m9159l8267l0964j9847p40K6393
$$ 341763 328464 314680 272160 280793 275363 235937 186778 148511 117547 97700 96960 123353
15250A23353K5648M190K1180K3373M1678J0633k7710q058J490j2970M4245N219
$$ 123353 149001 153191 174371 197744 239422 250055 222345 214287 215777 202807 247052 252271
15238B52271j5507K3498m2413k9164J3175k114j2253K8615M0595K029P259L108
$$ 252271 236764 260262 217849 188685 201860 199746 187493 216108 256703 258732 265991 269099
15226B69099j1264l2989M392K6266J6951n3560K654k3548k4880J923j3166k0239
$$ 269099 257835 224846 229238 255504 272455 218895 221549 198001 173121 175044 161878 141639
15214A41639J9870J6352k133k445K2499R532L612K677k5893j9023N698J30k8065
$$ 141639 161509 177861 175728 173283 195782 205314 208926 211603 185710 166687 172385 172515 144450
15201A44450J8666K1728j2661j0809j3005l468J1272o414k4984p663k497L946
$$ 144450 163116 184844 172183 161374 148369 144901 156173 149759 124775 117112 114615 118561
15189A18561q127J387o763J012j597j0359K1057J2866R303K3537J0042k2729J667
$$ 118561 110434 111821 105058 106070 104473 94114 115171 128037 137340 160877 170919 148190 149857
15176A49857j1214M096j7060N310j577k188K0714J1640j7144j9033K694k441N70
$$ 149857 138643 142739 125679 130989 129412 127224 147938 159578 142434 123401 126095 123654 124224
15163A24224J1362K740k0516o323j3028J4695n027k10k286n005j5858k2616J0905
$$ 124224 135586 138326 117810 111487 98459 113154 108127 107917 105631 100626 84768 62152 73057
15150G3057j0645k2618r961K0691M8613K5151M462k0949k2298l0898n507L9623
$$ 73057 62412 39794 29833 50524 99137 124288 128750 107801 85503 54605 49098 88721
15138H8721p7m348j0675M36J8110J7799K440L11J2166k876k4044j1252J1882K1757
$$ 88721 88644 84296 73621 74057 92167 109966 112406 112717 124883 122007 97963 86711 98593 120350
15124A20350j5083k3033p520J0722J5035J2404j1310J713J6883K7171J1930O824
$$ 120350 105267 82234 74714 85436 100471 112875 101565 103278 120161 147332 159262 166086
15112A66086l0438k0391L8898k4236k3890K572k3127k9106o7741o0102l5387n478
$$ 166086 135648 115257 154155 129919 106029 108601 85474 56368 -11373 -71475 -106862 -112340
15100a12340J8214k1404j084J2306P295K6894K027R903K1241q223k6672P93j3561
$$ -112340 -94126 -115530 -116614 -104308 -97013 -70119 -68092 -58189 -36948 -45171 -71843 -71050 -84611
15087h4611m648L8238R686k2488l142k762Q296j759q572k70k667J8944J5800l1885
$$ -84611 -89259 -51021 -41335 -63823 -66965 -69727 -61431 -63190 -71762 -72032 -74699 -55755 -39955 -71840
15073g1840j7230J326J6482L2781R154J3298M153J5457J0908m664P558L521M160
$$ -71840 -89070 -87744 -71262 -38481 -29327 -16029 -11876 3581 14489 9825 17383 20904 25064
15060B5064j2778j2689n926J4453L5566L0620k6427l1946J4538j0135k6245K2211
$$ 25064 12286 -403 -6329 8124 43690 74310 47883 15937 30475 20340 -5905 16306
15048A6306M1320J87j3728j8810r343j7344K354N586J8593M086l1233k1830m4268
$$ 16306 57626 57813 44085 25275 15932 -1412 942 6528 25121 29207 -2026 -23856 -68124
15035f8124r160J6518Q781L2721K3860k3575k5519Q017Q555j4693Q140K3171N73
$$ -68124 -77284 -60766 -51985 -19264 4596 -18979 -44498 -36481 -27926 -42619 -34479 -11308 -10735
15022a0735k7577J6828M459l1405K4899J2011R137j900l3464K0706K5187P101
$$ -10735 -38312 -21484 -17025 -48430 -23531 -11520 -2383 -4283 -37747 -17041 8146 15247
15010A5247J94L29n312k4807n236J0514K3891k229n390K1918O093J6576O732m271
$$ 15247 15441 15770 10458 -14349 -19585 -9071 14820 12591 7201 29119 35212 51788 58520 54249
14996E4249Q59o92j6838l7204j59j9227j714L2410K4263j029k0556P751J244p653
$$ 54249 55108 54416 37578 374 215 -19012 -20726 11684 35947 34918 14362 22113 23357 15704
14982A5704J4026r806K9188L1571j9710q992J1462j3427L3271L0086J0033R718
$$ 15704 29730 19924 49112 80683 60973 51981 63443 50016 83287 113373 123406 133124
14970A33124J3150M1418M1674R2615J05670J15720J59820K02459J88749J62940
$$ 133124 146274 187692 229366 321981 427651 543371 703191 905650 1094399 1257339
14960A257339J73553J32196K8279m3148q8420j39819j30653j74238k04455j64605
$$ 1257339 1430892 1563088 1591367 1548219 1459799 1319980 1189327 1015089 810634 646029
14950F46029j21099j18160q4704n7064m0674j1871k0322m4437m8548p555M743
$$ 646029 524930 406770 322066 265002 224328 212457 192135 147698 99150 91595 96338
14939I6338j6900O934k3936j8273Q560q761K5796j764j9834r426K404j8415k0678
$$ 96338 79438 86372 62436 44163 52723 43962 69758 67994 48160 38734 41138 22723 2045
14926B045j6814K1792J8211M309K914L8793K760k933l4117m6173r470k584J7185
$$ 2045 -14769 7023 25234 29543 32457 71250 74010 71077 36960 -9213 -18683 -21267 -4082
14913d082J6664k6952j0285k519J08n478K5422K5388k8221J5910K2865P400j9776
$$ -4082 12582 -14370 -24655 -27174 -27066 -32544 -7122 18266 -9955 5955 28820 36220 16444
14900A6444j4244K7354j1980k299K0884j3544N595J0844J5964j9036k1145j7590
$$ 16444 2200 29554 17574 15275 36159 22615 28210 39054 55018 35982 14837 -2753
14888b753j9581K125M200J706j4163J3251L8836L0349n669K302j1829l2556L3712
$$ -2753 -22334 -20209 -16009 -14303 -28466 -15215 23621 53970 48301 50603 38774 6218 39930
14875C9930P036l4691J3706M7156R12l2308k4130o178j8073P237J7821j3903Q122
$$ 39930 46966 12275 25981 73137 74049 41741 17611 11433 -6640 597 18418 4515 12637
14862A2637K610P896j7061j4063J5908j2621R937K7784j3320j4676P567j176j7336
$$ 12637 15247 23143 6082 -7981 7927 -4694 5243 33027 19707 5031 12598 11422 -5914
14849e914q481j0983j377K2546r962m5913J2484J6942K143j3604N680n67J3969
$$ -5914 -14395 -25378 -26755 -4209 -14171 -60084 -47600 -30658 -28515 -42119 -36439 -37006 -23037
14836b3037j7219N101K3478n355k8831k560K2309L3501J7207o288J0923J39L7195
$$ -23037 -40256 -35155 -11677 -17032 -45863 -48423 -26114 7387 24594 18306 29229 29368 66563
14823F6563N910j8698L3010m770O146J0536L464J4621M344j329k4409j8676j5733
$$ 66563 72473 53775 86785 82015 88161 98697 102161 116782 121126 119797 95388 76712 60979
14810F0979m7353j3579J0841k2618n18L673J2392J7268R647q913l1244p563R256
$$ 60979 13626 47 10888 -11730 -12248 -8575 3817 21085 30732 21819 -9425 -16988 -7732
14797g732R269o444O451o303k392O085j131M584k2563J6740J0997K1245L1607
$$ -7732 1537 -4907 1544 -4759 -7151 -1066 -2197 2387 -20176 -3436 7561 28806 60413
14784F0413J0311k4383k3925M297J6108k7697j0541K5671J4616O981j7647j9893
$$ 60413 70724 46341 22416 26713 42821 15124 4583 30254 44870 51851 34204 14311
14772A4311j1921l417K4399L264j5709R521Q09r861k8405K297L0375o877q008
$$ 14311 2390 -1027 23372 26636 10927 20448 21257 11396 -17009 -14712 15663 8786 778
14759G78L0586j641j7469j305q614k9016R562J3471N135l121K0194Q228o688j5494
$$ 778 31364 29723 12254 10949 2335 -26681 -17119 -3648 1487 -1634 18560 26788 20100 4606
14745D606p734J7473L4081j4483m0909J0938K2507k680k9351J591J8259K637n794
$$ 4606 -3128 14345 48426 33943 -6966 3972 26479 23799 -5552 -3961 14298 16935 11141
14732A1141k9276p413o491J6852j1102m645J0744K572k687j9109j6557O864J8345
$$ 11141 -18135 -25548 -32039 -15187 -26289 -30934 -20190 -17618 -20305 -39414 -55971 -49107 -30762
14719c0762O943j0905k5655O681M1650J1622K299K5202N916k6190O450j761n228
$$ -30762 -23819 -34724 -60379 -53698 -12048 -426 1873 27075 32991 6801 13251 11490 6262
14706F262m900k374J8021K3030j173k5967k9962J053J7287M570J2589J0312k8732
$$ 6262 1362 -1012 17009 40039 38866 12899 -17063 -16010 1277 5847 18436 28748 16
14693A6j7300K18n38m787j2409K7506J406R365K1368Q986k5992j5846j2262j9473
$$ 16 -17284 -17066 -17604 -22391 -34800 -7294 -5888 3477 24845 33831 7839 -8007 -20269 -39742
14679c9742J42L8339J9176J5746K357r891k524j782K633j4483k834K0349P590
$$ -39742 -39600 -1261 17915 33661 36018 26127 23603 21821 24454 9971 7137 27486 35076
14666C5076P231K1984J296k4162K415M269j0099J6585j58l4373k2421l429K6149
$$ 35076 42307 64291 65587 41425 43840 48109 38010 54595 54437 20064 -2357 -5786 20363
14653B0363n926J7284j2989K147L29K302j5356k2044l240K947j1004P760P335
$$ 20363 14437 31721 18732 20879 21208 23510 8154 -13890 -17130 -14183 -25187 -17427 -10092
14640a0092k6911j130J3293k0445L268J8550L74p635N412N3J6669K1627J3440
$$ -10092 -37003 -38133 -24840 -45285 -42017 -23467 -23093 -30728 -25316 -25263 -8594 13033 26473
14627B6473K5097j2317j9002L5k7638l3519m506M3141K2200j56M48N112J524K3096
$$ 26473 51570 39253 20251 20286 -7352 -40871 -45377 -2236 19964 19808 20256 25368 26892 49988
14613D9988L023k990l2121m966J0370j8290j6921M393K3581K00Q673K6923o107
$$ 49988 53011 50021 17900 12934 23304 5014 -11907 -7514 16067 16267 24940 51863 45756
14600D5756m782Q976n710J9J6512j0600K0782L10P505J7738K2025L4763J8589
$$ 45756 40974 49950 44240 44259 60771 50171 70953 71263 78768 96506 118531 153294 171883
14587A71883j7748l2121k3741j8865p261j5923N892r632o1831j1522p898j744
$$ 171883 154135 122014 98273 79408 72147 56224 62116 52484 -9347 -20869 -28767 -30511
14575c0511M4381J7962Q031L777J4702n308k2731O184j5789R388j2731n566o94
$$ -30511 13870 31832 39863 43640 58342 53034 30303 36487 20698 30086 17355 11789 11095
14562A1095k1850K7569K6883K9883p703r977j6336j8962J7495k1828k5391M3387
$$ 11095 -10755 16814 43697 73580 65877 55900 39564 20602 38097 16269 -9122 34265
14550C4265K1575k4005k0502j4397K673J4437R749K568j4177R610k1693p037l136
$$ 34265 55840 31835 11333 -3064 -391 14046 23795 26363 12186 21796 103 -6934 -10070
14537a0070m281M526p894r395n1397r846M9684K302K217O409l9293J8002P452
$$ -10070 -14351 -9825 -17719 -27114 -78511 -88357 -38673 -36371 -34154 -27745 -67038 -49036 -41584
14524d1584J8922O616J2953J6712J5550J241P287k483k3388r376o564j7669p93
$$ -41584 -22662 -16046 -3093 13619 29169 30410 37697 35214 11826 2450 -4114 -21783 -22576
14511b2576M429L4331q828k1549p544L3930Q156n134j0459J844L975j3620j4038
$$ -22576 -18147 16184 7356 -14193 -21737 12193 20349 15215 4756 6600 10575 -3045 -17083
14498a7083J9919M057k878j7765K2755j0034r848J1144k1111q319j0738J4273
$$ -17083 2836 6893 4015 -13750 9005 -1029 -10877 267 -20844 -29163 -39901 -25628
14486b5628L0961K4122J6349k8829j8591O210k655o936K0523p277K6320K0300
$$ -25628 5333 29455 45804 16975 -1616 4594 1939 -4997 15526 8249 34569 54869
14474E4869R469j4334j6157j1303m395J368q18j0343J864l889q018J1403J235
$$ 54869 64338 50004 33847 22544 18149 19517 18699 8356 10220 6331 -1687 9716 10951
14461A0951j5401J2044N736k40L3375j0698L889j4915M458O240J3290J605j3831
$$ 10951 -4450 7594 13330 13090 46465 35767 39656 24741 29199 35439 48729 50334 36503
14448C6503P152J5595k322n2195l6129J1363q244K2708P698R024j9624q181K3168
$$ 36503 43655 59250 56928 4733 -31396 -20033 -28277 -5569 2129 11153 -8471 -16652 6516
14435F516N2574J2870j0886K3236j3718J590q442n781k3165j9712j5949K522K3942
$$ 6516 59090 71960 61074 84310 70592 72182 63740 57959 34794 15082 -867 1655 25597
14422B5597j1462m338k3833j4360n079L1455Q729J6934J4994l0727j6021J8742
$$ 25597 14135 9797 -14036 -28396 -33475 -2020 6709 23643 38637 7910 -8111 10631
14410A0631j1015n5468K0487O9143M287j5154q066k9341j045J0950J4948R250
$$ 10631 -384 -55852 -35365 33778 38065 22911 14845 -14496 -15541 -4591 10357 19607
14398A9607k392j9502j3767K3213L635L809j2978l2621J0730r069j8652N123L7512
$$ 19607 17215 -2287 -16054 7159 10794 14603 1625 -30996 -20266 -29335 -47987 -42864 -5352
14385e352j308L646L5697R488j7241J531K27k6803M12o740R765K0235K8793J1452
$$ -5352 -6660 -3014 32683 42171 24930 26461 26688 -115 297 -6443 3322 23557 52350 63802
14371F3802k7829l164L411K963R756m203p224p699k8716j9131P027l111J0267
$$ 63802 35973 32809 36220 39183 48939 44736 37512 29813 1097 -18034 -11007 -14118 -3851
14358c851K4959nQ05j3347M536j6517o378o360j506M233O042J733m868J856Q761
$$ -3851 21108 21103 21908 8561 13097 -3420 -9798 -16158 -17664 -13431 -7389 -5656 -10524 -8668 93
14343I3l0015q549K9450P360j0902j0010K2068r85l166o543J7870O824J8517O121
$$ 93 -29922 -38471 -9021 -1661 -12563 -22573 -505 -1490 -4656 -11199 6671 13495 32012 38133
14329C8133j6298k1228o640J3075j0683J8501O050q146K4837j1385j9323k3658
$$ 38133 21835 607 -6033 7042 -3641 14860 20910 12764 37601 26216 6893 -16765
14317a6765r587K5067J7794k3904K688J0191K6160j719k4103q580l8397k558o877
$$ -16765 -26352 -1285 16509 -7395 -4707 5484 31644 29925 5822 -2758 -41155 -43713 -50590
14304e0590J8391J3187P887K6046R304M260j2158j1885r047N529K998r817l2495
$$ -50590 -32199 -19012 -11125 14921 24225 28485 16327 4442 -4605 924 3922 -5895 -38390
14291c8390j131K8505Q451j7260r650J4489M0l502m484J5481J591K3794j688j3432
$$ -38390 -39521 -11016 -2565 -19825 -29475 -14986 -14946 -18448 -22932 -7451 -5860 17934 16246 2814
14277B814Q184K4680O639j8904q071P529J7831K1485J1342Q879K2338j5737k7234
$$ 2814 10998 35678 42317 23413 15342 22871 40702 62187 73529 82408 104746 89009 61775
14264F1775n042j6355l766k6915Q364K4188J8536l8764k4465K4627J2802O154
$$ 61775 56733 40378 36612 9697 18061 42249 60785 22021 -2444 22183 34985 41139
14252D1139K852L3574J173j8850j1377j4399l0259J4746J3736l0320j2566M773
$$ 41139 43991 77565 78738 59888 48511 34112 3853 18599 32335 2015 -10551 -5778
14240e778K6158L3640N938K873j9228J4031M181M025o015J736r01j7747q409L5636
$$ -5778 20380 54020 59958 62831 43603 57634 61815 65840 59825 61561 60660 42913 34504 70140
14226G0140L4137o036k1286k0530j6502K2857K3098l0841q072K1712J6270J9658
$$ 70140 104277 98241 76955 56425 39923 62780 85878 55037 46965 68677 84947 104605
14214A04605K7246n236j7901j4278j4625J1993M1704L3582l4488j1965k5848k6089
$$ 104605 131851 126615 108714 94436 79811 91804 133508 167090 132602 120637 94789 68700
14202F8700J5306k1827k390J2957P816Q684J4020j0271j0364k7282m089J5960
$$ 68700 84006 62179 59789 72746 80562 89246 103266 92995 82631 55349 51260 67220
14190F7220l5859k277J1296L8595k361k9608j5334J2126K553n874O937j2326l2072
$$ 67220 31361 29084 40380 78975 76614 47006 31672 43798 46351 40477 47414 35088 3016
14177C016J2862O368n709J585j0305j226Q672o675r653K0329K2351Q449r956J3649
$$ 3016 15878 22246 16537 18122 7817 6591 15263 8588 -1065 19264 41615 50064 40108 53757
14163E3757R482r827j4493k7198K8044L4326Q358k1444l6661l472j5248k4068
$$ 53757 63239 53412 38919 11721 39765 74091 82449 61005 24344 20872 5624 -18444
14151a8444J3374O031K4561k5413j1539M30K4500J6300j8955k4156l2566j3189
$$ -18444 -5070 961 25522 109 -11430 -11000 13500 29800 10845 -13311 -45877 -59066
14139e9066L7330N2539K1189j3497j6988J7771L8419P801n3425j4602J6816n291
$$ -59066 -21736 30803 51992 38495 21507 39278 77697 85498 32073 17471 34287 28996
14127B8996j0219J5127J2473p364j0734K756m6871k1509J595R174J6108K4334
$$ 28996 18777 33904 46377 39013 28279 31035 -15836 -37345 -35750 -26576 -10468 13866
14115A3866k1859k9147L463P260k2207Q526J1308P857k075l07L5381R286j8915
$$ 13866 -7993 -37140 -33677 -26417 -48624 -40098 -28790 -20933 -23008 -23315 12066 21352 2437
14102B437k558R949m233j6286J0537L87j742N663Q18r829R37J1381n479m72J3337
$$ 2437 -121 9828 5595 -10691 -154 233 -1509 4154 4972 -4857 -3920 7461 1982 1510 14847
14087A4847j3403j0704j9557j9918L3704J5289J5774O670M740J077l4932k1281
$$ 14847 1444 -9260 -28817 -48735 -15031 258 16032 22702 27442 28519 -6413 -27694
14075b7694N1j3115J6994Q052J581J243k0084n163J3554o503l189J1264j0230
$$ -27694 -27643 -40758 -23764 -15712 -14131 -12888 -32972 -38135 -24581 -31084 -34273 -23009 -33239
14062c3239o876K3171j1323n32L0269k328j4435j2101L2630L4339l3001k4329
$$ -33239 -40115 -16944 -28267 -28799 1470 -858 -15293 -27394 5236 39575 6574 -17755
14050a7755j3186J6909L4248q971m3617l2674M856R770J6415K5451J5162J7268
$$ -17755 -30941 -14032 20216 11245 -32372 -65046 -60190 -50420 -34005 -8554 6608 23876
14038B3876P645k4491k9048J4768Q205l144J6619K6042j0175M811N880n920k549
$$ 23876 31521 7030 -22018 -7250 955 -2189 14430 40472 30297 35108 40988 35068 32519
14025C2519k3423k1270K9378K2550N356m2899k3018L0725J061j375N427L916P3536
$$ 32519 9096 -12174 17204 39754 45110 2211 -20807 9918 10979 9604 15031 18947 92483
14012I2483K3600M0034O9139O5426N9579M2156L6083q282k1490j2019l8477m6821
$$ 92483 116083 156117 225256 290682 350261 392417 428500 420218 398728 386709 348232 301411
14000C01411m9867o5396p6277m1420K473j2236n635j1350j9921J4767K2983K6171
$$ 301411 251544 186148 109871 68451 70924 58688 53053 41703 21782 36549 59532 85703
13988H5703n368l7892l603M256K702J287J337K511r545l556j1574l808P396L8096
$$ 85703 80335 42443 38840 43096 45798 47085 48422 50933 41388 37832 26258 22450 29846 67942
13974F7942M1292L895L3110M0955O1583P9622Q2081N8875N985J3288k4284l7466
$$ 67942 109234 113129 146239 187194 248777 328399 410480 469355 475340 488628 464344 426878
13962D26878n1662n6343l9607l9799l8747o9292N050J3847n0953l0623j6615j0334
$$ 426878 375216 318873 279266 239467 200720 131428 136478 150325 99372 68749 52134 41800
13950D1800r48j3021r012J827J5763J3870k8123k9875k5162k2391J2222J6216
$$ 41800 40852 27831 18819 20646 36409 50279 22156 -7719 -32881 -55272 -43050 -26834
13938b6834K2411K6818k2941p419J4150N679o029K1583L4925k7882k0425M003
$$ -26834 -4423 22395 -546 -7965 6185 11864 5835 27418 62343 34461 14036 18039
13926A8039K272M5568J4651q555j3950Q566k8441l9235j1518J113L5479L6122
$$ 18039 20311 65879 80530 71975 58025 66591 38150 -1085 -12603 -11490 23989 60111
13914F0111r670J2192K3665j111k9993k2502l605j2949J1572K8232J5152n3532
$$ 60111 50441 62633 86298 85187 55194 32692 29087 16138 27710 55942 71094 17562
13902A7562m9080l7933J4280L1664L0647k013M669j5909J3331J7266J842j0912
$$ 17562 -31518 -69451 -55171 -23507 7140 5127 9796 -6113 7218 24484 26326 15414
13890A5414J22q725l6759K607K3542j7755l715J5937Q483q698J9685m220k2528
$$ 15414 15536 6811 -29948 -27341 -3799 -21554 -25269 -9332 -849 -9547 10138 5918 -16610
13877a6610j5438L437K3893L9200k0539k5799j4643J0061L1541j3118k0649l9
$$ -16610 -32048 -28611 -4718 34482 13943 -11856 -26499 -16438 15103 1985 -18664 -18703
13865a8703K8330m45K4362m594m7748o801P788P032L673j3849Q090K2766K3041
$$ -18703 9627 9182 33544 28950 -18798 -25599 -17811 -10779 -7106 -20955 -12865 9901 32942
13852C2942K082n96k4514k8893k4044J3637K8377O997p543K459P050K5942P259
$$ 32942 35024 34428 9914 -18979 -43023 -29386 -1009 5988 -1555 904 7954 33896 41155
13839D1155j2666O88j2225k5349K784K6461O839k1071k2122P391j9850k8366K1367
$$ 41155 28489 29177 16952 -8397 -5613 20848 27687 6616 -15506 -8115 -27965 -56331 -34964
13826c4964Q056Q363J4411K505K7680o969l5491O720l028L2961K2069k6889Q347
$$ -34964 -26908 -18545 -4134 -1629 26051 19082 -16409 -9689 -12717 20244 42313 15424 23771
13813B3771j6585k7070r267k0243J6853K4332K4883k276j840l0834l2644n196
$$ 23771 7186 -19884 -29151 -49394 -32541 -8209 16674 14398 12558 -18276 -50920 -56116
13801e6116O5787J9688k1093j3360j4104j1615o184N3810Q626j4973j6429m671
$$ -56116 9671 29359 8266 -5094 -19198 -30813 -36997 16813 25439 10466 -5963 -10634
13789a0634j6748l1J6038J5411J2839J2977r407L034j7350j3107j6979J0191Q525
$$ -10634 -27382 -27413 -11375 4036 16875 29852 20445 23479 6129 -6978 -23957 -13766 -5241
13776e241J7424k7033j7237j3567j4983K1439j4000J3751J2353k5694q273K7698
$$ -5241 12183 -14850 -32087 -45654 -60637 -39198 -53198 -39447 -27094 -52788 -61061 -33363
13764c3363J8851k2412p5P192K1471j249K7500L4927j6347k5996J0101l520j7405
$$ -33363 -14512 -36924 -36999 -29807 -8336 -9585 17915 52842 36495 10499 20600 17080 -325
13751c25r02R321m742J6157k1194R137O548J1204j080J3243j0873k914j7917l43
$$ -325 -1227 8094 3352 19509 -1685 7452 14000 25204 24124 37367 26494 23580 5663 5320
13737E320J2694J4487k2100o847J8069J8856P942j2838L978P485J8799q978k36
$$ 5320 18014 32501 10401 3554 21623 40479 48421 35583 39561 47046 65845 56867 56631
13724E6631k4768m3955j1903K0022L256k239j4978o967j5585q311k5776O644L2560
$$ 56631 31863 -12092 -23995 -3973 -717 -2956 -17934 -24901 -40486 -48797 -74573 -67929 -35369
13711c5369Q105J3473L2815K7156J6032k285n7743k6126m01J1089K1254L3840
$$ -35369 -27264 -13791 19024 46180 62212 59927 2184 -23942 -24343 -13254 8000 41840
13699D1840R516l0128l624L25l5549m6421n622J3235L8054L4053J5585j9327j5985
$$ 41840 51356 21228 17604 17929 -17620 -64041 -69663 -56428 -18374 15679 31264 11937 -4048
13686d048M974r030L1812J9888L1968J3552k2967j4537q523p103k0740l670p807
$$ -4048 926 -8104 23708 43596 75564 89116 66149 51612 43089 35986 15246 11576 3769
13673C769q250k61L2870l108l6005q014J2568J4873K550J078j411K04K0242j0708
$$ 3769 -4481 -4742 28128 25020 -10985 -18999 -6431 8442 10992 12070 10659 10863 31105 20397
13659B0397k3744j2238J2405j0145j0779K1701J8676K754J992J0993o676k0872
$$ 20397 -3347 -15585 -3180 -13325 -24104 -2403 16273 19027 21019 32012 25336 4464
13647D464M913R946P308L183K950J6508M150J4841k5207j5600l9615l115j5460
$$ 4464 9377 19323 26631 29814 32764 49272 53422 68263 43056 27456 -12159 -15274 -30734
13634c0734j0422K8208p635J9650o236j9133j3310k400J5897J0575J420N798k0228
$$ -30734 -41156 -12948 -20583 -933 -7169 -26302 -39612 -42012 -26115 -15540 -14120 -8322 -28550
13621b8550k6760M119L017K5287N223K1289J4900k7346l2178l1353j4002J820
$$ -28550 -55310 -51191 -48174 -22887 -17664 3625 18525 -8821 -40999 -72352 -86354 -84534
13609h4534L0295K9964q775R609Q688j3360p712O947l672j2629J4606j2581M297
$$ -84534 -54239 -24275 -33050 -23441 -14753 -28113 -35825 -28878 -32550 -45179 -30573 -43154 -38857
13596c8857K1371k1811n572J6532K1379J5504k1427l886L8957R538n2147J22O282
$$ -38857 -17486 -39297 -44869 -28337 -6958 8546 -12881 -16767 22190 31728 -20419 -20297 -14015
13583a4015k4721k606j366J8764J0790R339j0137P237J6581R519j0805J5909k2703
$$ -14015 -38736 -41342 -42708 -23944 -13154 -3815 -13952 -6715 9866 19385 8580 24489 1786
13570A786l9144k1175R0o09J3523J9643R993l565J7654q910j7569j7847K2915
$$ 1786 -37358 -58533 -58443 -59052 -45529 -25886 -15893 -19458 -1804 -10714 -28283 -46130 -23215
13557b3215L9431N233k2361j7271J3577K2227j1789k0022l556P651O838j9895
$$ -23215 16216 21449 -912 -18183 -4606 17621 5832 -14190 -17746 -10095 -3257 -23152
13545b3152J424q071J7666J7931k9305l2058j2054J4053K7893J5025L5079j9646
$$ -23152 -21728 -29799 -12133 5798 -23507 -55565 -67619 -53566 -25673 -10648 24431 4785
13533D785l9589j3533K23J4300J6154K0744n213L11M450m623p449L3922K4191
$$ 4785 -34804 -48337 -48114 -33814 -17660 3084 -2129 -1818 2632 -1991 -9440 24482 48673
13520D8673j2971k3973N622o095k2157o168J2725K828J5584M60k6969q192p091
$$ 48673 35702 11729 17351 11256 -10901 -17069 -4344 -1516 14068 14528 -12441 -20633 -27724
13507b7724K2317j1398j5053O707J9015O204k1615J4103J7770k5814k6515o554
$$ -27724 -5407 -16805 -31858 -25151 -6136 68 -21547 -7444 10326 -15488 -42003 -48557
13495d8557J1211k461K43p242J6884L5913M587j3492k2335m515j6786j2547L3455
$$ -48557 -37346 -39807 -39564 -46806 -29922 5991 10578 -2914 -25249 -29764 -46550 -59097 -25642
13482b5642J8253N526J188j81n778M839M187n531L275J0541J5299q39k0695j1083
$$ -25642 -7389 -1863 -675 -856 -6634 -1795 2392 -3139 136 10677 25976 25137 4442 -6641
13468f641O509J4482j1300Q324M968m1420k7075r497o394L1999Q189Q922L2140
$$ -6641 -132 14350 3050 11374 16342 -25078 -52153 -61650 -68044 -36045 -27856 -18934 13206
13455A3206n476J4553Q32j0844j3545l9073j6277L067j0620K7746L5791J0765
$$ 13206 7730 22283 23115 12271 -1274 -40347 -56624 -53557 -64177 -36431 -640 10125
13443A0125Q541Q604l751k4134J2989O889k3176p334J2285K4148J2081p54k9283
$$ 10125 18666 27270 23519 -615 12374 19263 -3913 -11247 1038 25186 37267 36513 7230
13430G230k2336l687p025N330j5962j5148L0553K7841l489n886j6196l085J2636
$$ 7230 -15106 -18793 -25818 -20488 -36450 -51598 -21045 6796 3307 -2579 -18775 -21860 -9224
13417i224K3020P375J0222Q333j4909j4183k7013l0614r305J9255J9961K203Q887
$$ -9224 13796 21171 31393 39726 24817 10634 -16379 -46993 -56298 -37043 -17082 -14879 -5992
13404e992j0857M936j6460k4007j4359p49j739L5390K4780K4337Q358Q427r508
$$ -5992 -16849 -11913 -28373 -52380 -66739 -67488 -69227 -33837 -9057 15280 23638 32065 22557
13391B2557l3145J0585K4237m604k3702j750k3377R255j3264j2563N6923K4364
$$ 22557 -10588 -3 24234 19630 -4072 -5822 -29199 -19944 -33208 -45771 11152 35516
13379C5516K070R796k7767l7037k1260k0678L6551K7932p897K4471M9139j6184
$$ 35516 37586 47382 19615 -17422 -38682 -59360 -22809 5123 -2774 21697 70836 54652
13367E4652k2065l9019p008j19l0423l263p447L4509r741m601k412J8363K1275
$$ 54652 32587 -6432 -13440 -13559 -43982 -47245 -54692 -20183 -29924 -34525 -36937 -18574 2701
13354B701J4106J3156k79j5574o188j4921N001M2853R486j1403j4429l0781L065
$$ 2701 16807 29963 29684 14110 7922 -6999 -1998 40855 50341 38938 24509 -6272 -3207
13341c207l0905r711K2769J7799L323j9193j1289j8499L0871J9262r717l772n876
$$ -3207 -34112 -43823 -21054 -3255 68 -19125 -30414 -48913 -18042 1220 -8497 -12269 -18145
13328a8145q52K9154K8493K5419j2235j2153j6894O152K6703l520j3585Q130k3939
$$ -18145 -18997 10157 38650 64069 51834 39681 22787 28939 55642 52122 38537 46667 22728
13315B2728k5815Q256l582J5988L0340N185m908k2786j5070k2519j2792r821Q862
$$ 22728 -3087 5169 1587 17575 47915 53100 48192 25406 10336 -12183 -24975 -34796 -25934
13302b5934L8775r003R434P025K1357J3248q111k727r53j07l89J762k0428j3245
$$ -25934 12841 3838 13272 20297 41654 54902 46791 44064 43111 43004 42615 44377 23949 10704
13288A0704p929k980k4013r272J2167k8716J1533J5855L1808J052Q489n095l0673
$$ 10704 2775 -205 -24218 -33490 -21323 -50039 -38506 -22651 9157 10209 18698 13603 -17070
13275a7070J4535K98K022K0675j4171k4521J4703J0460m5705j2426K2628J4516
$$ -17070 -2535 -2237 -215 20460 6289 -18232 -3529 6931 -38774 -51200 -28572 -14056
13263a4056J6523K3349J873j3472p037j169o189j2165j0826L0644N520j3184k6072
$$ -14056 2467 25816 27689 14217 7180 6011 -178 -12343 -23169 7475 12995 -189 -26261
13250b6261q544J8935j3347J1813J5630l504k3868l4784J8332K7066m185q125
$$ -26261 -34805 -15870 -29217 -17404 -1774 -5278 -29146 -63930 -45598 -18532 -22717 -30842
13238c0842M133L562M609j6887j7113M640k1972K462J794K0417K8065J3335j4438
$$ -30842 -26709 -23147 -18538 -35425 -52538 -47898 -69870 -67408 -65614 -45197 -17132 -3797 -18235
13225a8235J1736L4339J2077k0226j9358J3419K0583J24k8368j8433K8155J9910
$$ -18235 -6499 27840 39917 19691 333 13752 34335 34459 6091 -12342 15813 35723
13213C5723j4265K7651J6836j5257j5663j9222j8295j6236K805m398j4007j1518
$$ 35723 21458 49109 65945 50688 35025 15803 -2492 -18728 -15923 -20321 -34328 -45846
13201d5846M392K2917J2933m0044p197P971n582J995K4732R79l472J4674J1850
$$ -45846 -41454 -18537 -5604 -45648 -52845 -44874 -50456 -48461 -23729 -22750 -26222 -11548 302
13188C02j2947j1158N964K530m27L7750r162m956J7000J6824J6402J4946j3788
$$ 302 -12645 -23803 -17839 -15309 -15736 22014 12852 7896 24896 41720 58122 73068 59280
13175E9280l0487n3223j7442L0270p891j76K9113p81l487j220p974Q982k953o421
$$ 59280 28793 -24430 -41872 -11602 -19493 -19669 9444 8663 5176 3956 -4018 4964 2011 -4410
13161d410j7935l574J9338K3556P628J7293j5831q205j4496j6870K450L2855K1990
$$ -4410 -22345 -25919 -6581 16975 24603 41896 26065 17860 3364 -13506 -11056 21799 43789
13148D3789j1106j9353O432J8524J4498j6696k8514J7901J6586j0522N769j608
$$ 43789 32683 13330 19762 38286 52784 36088 7574 25475 42061 31539 37308 35700
13136C5700L0464M0544L2798J5827M711l9061l2693j3553j9956m0118K8291N540
$$ 35700 66164 106708 139506 155333 160044 120983 88290 74737 54781 14663 42954 48494
13124D8494K2623j6958j8916j5657K6316M8573K0535n724k4323r536l8375l0289
$$ 48494 71117 54159 35243 19586 45902 94475 115010 109286 84963 75427 37052 6763
13112F763m014k3531O893Q578J4662J2094k8885k8413l1520M146J8316J7238J1051
$$ 6763 2749 -20782 -13889 -5311 9351 21445 -7440 -35853 -67373 -63227 -44911 -27673 -16622
13099a6622J5558J3355L960k6738q969K2507K9729K8453L5479N0533M5655L8263
$$ -16622 -1064 12291 16251 -10487 -19456 3051 32780 61233 96712 147245 192900 231163
13087B31163l653l1038l7144o5981p6071j6491P118j5504l059l268j2394J2455
$$ 231163 227510 196472 159328 93347 17276 785 7903 -7601 -10660 -13928 -26322 -13867
13075a3867R79K1243J299J0597L5661J3222M000j4270l5826k3999J0187L8115
$$ -13867 -12888 8355 9654 20251 55912 69134 73134 58864 23038 -961 9226 47341
13063D7341N5543J9058k0614m5981j2938L906j7482J351J9874j2788k3500k2405
$$ 47341 102884 121942 101328 55347 42409 46315 28833 30184 50058 37270 13770 -8635
13051h635j8088j1861J4692J9103r876J9145M1983N0435j6849Q667l6545m739
$$ -8635 -26723 -38584 -23892 -4789 -14665 4480 46463 96898 80049 88716 52171 47432
13039D7432j1665k0346J5874J6890j0515q232j6430q916j1239L170p218L779K2483
$$ 47432 35767 15421 31295 48185 37670 29438 13008 4092 -7147 -3977 -11195 -7416 15067
13026A5067N596n960j1243J4642R64j0981j3890P789R216k2386L9021K3666r048
$$ 15067 20663 14703 3460 18102 19066 8085 -5805 1984 11200 -11186 27835 51501 42453
13013D2453k0836l4993j2104J0344K0636J4770r268k5002M712N349J6208k4820
$$ 42453 21617 -13376 -25480 -15136 5500 20270 11002 -14000 -9288 -3939 12269 -12551
13001a2551k6310K248r21K856m322K5637K9321j7389k2741l095m7K8221J3206
$$ -12551 -38861 -36613 -37534 -34678 -39000 -13363 15958 -1431 -24172 -27267 -27314 907 14113
12988A4113j7779J4754q615j4041k4978q146M113L953N317K9892L614k7999r757
$$ 14113 -3666 11088 2473 -11568 -36546 -44692 -40579 -36626 -31309 -1417 2197 -25802 -35559
12975c5559P950J6842Q940l397R85j9022n602L9082Q814k4832L501O269k944j176
$$ -35559 -27609 -10767 -1827 -5224 -4239 -23261 -28863 10219 19033 -5799 -2298 3971 1027 -149
12961a49l2298L005J6850K2558j6756j165n375q710j6274K855k254J0947J3057
$$ -149 -32447 -29442 -12592 9966 -6790 -7955 -13330 -22040 -38314 -35459 -37713 -26766 -13709
12948a3709L6372K5342m4903q353o357J9026O573j2012j5151J0738P965q494Q55
$$ -13709 22663 48005 3102 -5251 -11608 7418 13991 1979 -13172 -2434 5531 -2963 -2108
12935b108k8966m808K8205K3402k0796q07j2259p470J5433J6907q351j2010K4282
$$ -2108 -31074 -35882 -7677 15725 -5071 -5878 -18137 -25607 -10174 6733 -1618 -13628 10654
12922A0654M26M387o75n975j6392j1577k3953l1215J5571K4279j6871M759K7691
$$ 10654 11080 15467 14792 8817 -7575 -19152 -43105 -74320 -58749 -34470 -51341 -46582 -18891
12909a8891M783L735o423j4650L999J2362j5338m222l26J6807P660m397O107P472
$$ -18891 -14108 -10373 -16796 -31446 -27447 -15085 -30423 -34645 -34971 -18164 -10504 -14901 -8794 -1322
12895a322j3477o448j1082l6045o002L4413j200j7442l815J8484M4776L1831k1349
$$ -1322 -14799 -21247 -32329 -68374 -74376 -39963 -41163 -58605 -62420 -43936 840 32671 11322
12882A1322j8460m406K6446J7779J4474j4676n104Q03j9431m0731j4807R175M3368
$$ 11322 -7138 -11544 14902 32681 47155 32479 27375 28178 8747 -31984 -46791 -37616 5752
12869E752L8414p967k1974o290J187k5272j4846k720k3130l3956J6621R363J4444
$$ 5752 44166 36199 14225 7935 9122 -16150 -30996 -33716 -56846 -90802 -74181 -64818 -50374
12856e0374n380j4543K2608K7637M107j625J082J2575n5k8695Q914P573p003R661
$$ -50374 -55754 -70297 -47689 -20052 -15945 -17570 -16488 -3913 -3968 -32663 -23749 -16176 -23179 -13518
12842a3518k2017j6765Q77r169K5632p442j9523R823L652J2933K2002j0571N254
$$ -13518 -35535 -52300 -51423 -60592 -34960 -42402 -61925 -52102 -48450 -35517 -13515 -24086 -18832
12829a8832M663N811j7096k4841J6167j8496O333J1327m367j4108o681J0306J7463
$$ -18832 -14169 -8358 -25454 -50295 -34128 -52624 -46291 -34964 -39331 -53439 -60120 -49814 -32351
12816c2351j8063K406J3457J0133K3199L0283k180P520j2526n1538p285M2996
$$ -32351 -50414 -48008 -34551 -24418 -1219 29064 26884 34404 21878 -29660 -36945 6051
12804F051L3883Q794l4218k8865R83K120j3221R955j8862k1383J2185O25J8311
$$ 6051 39934 48728 14510 -14355 -13372 -11252 -24473 -14518 -33380 -54763 -42578 -41953 -23642
12791b3642K5547K166j549k4735R564j805o895K820j9736l1424k131J0341K5797
$$ -23642 1905 4071 2522 -22213 -12649 -14454 -21349 -18529 -38265 -69689 -71820 -61479 -35682
12778c5682L2393l092n157J6990j3126j0041l218N273J4202R558k9275j0356j1367
$$ -35682 -3289 -6381 -11538 5452 -7674 -17715 -20933 -15660 -1458 8100 -21175 -31531 -42898
12765d2898K4843J7244k7394o269J5453M456j0268K1098L9854k3391k1158j6497
$$ -42898 -18055 -811 -28205 -34474 -19021 -14565 -24833 -3735 36119 12728 -8430 -24927
12753b4927j4206M373L3973L9941k9128j1493K7854j4215l2937l697K324R791
$$ -24927 -39133 -34760 -787 39154 10026 -1467 26387 12172 -20765 -24462 -22138 -12347
12741a2347J2666J2061K042N408n916j1824Q540J3085j049j5990j7219J0571k3206
$$ -12347 319 12380 14422 19830 13914 2090 10630 23715 22666 6676 -10543 28 -23178
12728b3178M678m388k8169l0166q936J1536J7630J7390L7338n302j0035o160r164
$$ -23178 -18500 -22888 -51057 -81223 -90159 -78623 -60993 -43603 -6265 -11567 -21602 -27762 -36926
12715c6926N656R950J1778K5170K1484j6743j6171M692j7214p144j00N246r496
$$ -36926 -31270 -21320 -9542 15628 37112 20369 4198 8890 -8324 -15468 -15568 -10322 -19818
12702a9818M042J2598O270Q4j1116l2856K0409K0147r636k089n997j3472N378
$$ -19818 -15776 -3178 3092 3176 -7940 -40796 -20387 -240 -9876 -11965 -17962 -31434 -26056
12689b6056n296K861R999L938J0914l814l0252P099K3062L1215J2975o681k2604
$$ -26056 -31352 -28491 -18492 -14554 -3640 -7454 -37706 -30607 -7545 23670 36645 29964 7360
12676G360j1355j7766j6844J1204Q407k3163K0425L6591J3453k5925k2888j5201
$$ 7360 -3995 -21761 -38605 -27401 -18994 -42157 -21732 14859 28312 2387 -20501 -35702
12664c5702K7697J5132j9038l2120J4874L0408k2085n169K7507k6378j1910L603
$$ -35702 -8005 7127 -11911 -44031 -29157 1251 -20834 -26003 1504 -24874 -36784 -33181
12652c3181J3094K0645m781k5257k8782R468l972o567O579J3234K4355J1972N893
$$ -33181 -20087 558 -4223 -29480 -58262 -48794 -52766 -59333 -52754 -39520 -15165 -3193 2700
12639B700k1559l4452J3965R252r120m0749J242J9594O712K3018j0624J2872k0592
$$ 2700 -18859 -53311 -39346 -30094 -39214 -79963 -78721 -59127 -52415 -29397 -40021 -27149 -47741
12626d7741j3583J6613L6139N951M575j492J1072k193j1852K564l25J2443R437
$$ -47741 -61324 -44711 -8572 -2621 1954 462 11534 9341 -2511 53 -272 12171 21608
12613B1608j1727J1615k1747k8837jN635R578J177k6621m742K1375J0717j6151
$$ 21608 9881 21496 -251 -29088 -29089 -23454 -13876 -12699 -39320 -44062 -22687 -11970 -28121
12600b8121j8296J0197P669N967P219J5316J3687K4709j8181j415j5393J7120
$$ -28121 -46417 -36220 -28551 -22584 -15365 -49 13638 38347 20166 18751 3358 20478
12588B0478k112j6675r099r915j2509L322M5887n150k5701j3407L435K6202M6031
$$ 20478 18366 1691 -7408 -17323 -29832 -26510 19377 14227 -11474 -24881 -21446 4756 50787
12575E0787M1903k6433m7605J658r705m3718k50Q32n85O45P373J4235n230j0803
$$ 50787 92690 66257 18652 20310 10605 -33113 -33363 -32531 -33116 -32471 -25098 -10863 -16093 -26896
12561b6896p767K0929N0580J5747o022k4940p382L544j3843K280P945l038L0317
$$ -26896 -34663 -13734 36846 52593 46571 21631 14249 17793 3950 6230 14175 11137 41454
12548D1454K4014j7235k4631j5127J5264P459j0072K2800m414j5037m6783j2319
$$ 41454 65468 48233 23602 8475 23739 31198 21126 43926 39512 24475 -22308 -34627
12536c4627m595o476j698L1442n493l4242k0000J74K3551N5486K049l824K0381
$$ -34627 -39222 -45698 -47396 -15954 -21447 -55689 -75689 -75515 -51964 3522 5571 1747 22128
12523B2128l3895l6427J7965L4716J5443o436M034l745j6082l1269q164K6855
$$ 22128 -11767 -48194 -30229 4487 19930 13494 17528 13783 -2299 -33568 -41732 -14877
12511a4877K2850J8845L125M456j1397l5882j6006r201q025P072J018k2230r659
$$ -14877 7973 26818 29943 34399 23002 -12880 -28886 -38087 -46112 -39040 -38022 -60252 -69911
12498f9911J693j6085J9342O635k99J0355K7457Q49q529K063J517o489R210J1985
$$ -69911 -68218 -84303 -64961 -58326 -58625 -48270 -20813 -19964 -28493 -26430 -24913 -31402 -22192 -10207
12484a0207j8791p260Q133L5166k0370O114O303K2753j6407k0909n441j3326O845
$$ -10207 -28998 -36258 -28125 7041 -13329 -7215 -912 21841 5434 -15475 -20916 -34242 -27397
12471b7397J9763l260L984J5017J7858m1682J8195K7933j2178q638l1197J9695
$$ -27397 -7634 -10894 -6910 8107 25965 -15717 2478 30411 18233 9595 -21602 -1907
12459a907J8408j1337l531k6801j7807j2647K7109K7373l421l2821k8684J4164
$$ -1907 16501 5164 1633 -25168 -42975 -55622 -28513 -1140 -4561 -37382 -66066 -51902
12447e1902L378n040m0310o99L2593R924r325J4185k678j925R922K0796K7080
$$ -51902 -48524 -53564 -93874 -94573 -61980 -52056 -61381 -47196 -49874 -51799 -41877 -21081 5999
12434E999k6818J1029Q752k1753j387K0048J7678j0836Q890j0733O196n513M135
$$ 5999 -20819 -9790 -1038 -22791 -24178 -4130 13548 2712 11602 869 7065 1552 5687
12421E687p177L044K1022n237O6j1033q201k6647k8698q773J6649J0981q430j8793
$$ 5687 -1490 1554 22576 17339 17405 6372 -1829 -28476 -57174 -65947 -49298 -38317 -46747 -65540
12407f5540k9890P222k19L1925L0764M909k1156m0119o655K9794n411J3890J1378
$$ -65540 -95430 -88208 -88427 -56502 -25738 -20829 -41985 -82104 -88759 -58965 -64376 -50486 -39108
12394c9108J2446J2552K0614J2124P676J4851j9L732J197Q539j0895n384L653
$$ -39108 -26662 -14110 6504 18628 26304 41155 41136 44868 46065 54604 43709 38325 41978
12381D1978l5830j7438K051M2762j6097k3657O137k9456j3183J0536l365J3997
$$ 41978 6148 -11290 -9239 33523 17426 -6231 -94 -29550 -42733 -32197 -35562 -21565
12369b1565l30R027K1107k1775n0333K871K1360M190k537R007k1886n279M0024
$$ -21565 -21895 -12868 8239 -13536 -63869 -60998 -39638 -35448 -37985 -28978 -50864 -56143 -16119
12356a6119K0458j4296J0884r761l7227P597J8314L5311O982O836M037j5999k5967
$$ -16119 4339 -9957 927 -8834 -46061 -38464 -20150 15161 22143 28979 33016 17017 -8950
12343h950p269J02P276l6164J5780P556k2339j2871L2448r634L2864k867j7154
$$ -8950 -16219 -16117 -8841 -45005 -29225 -21669 -44008 -56879 -24431 -34065 -1201 -4068 -21222
12330b1222L023j8233J5364R320j5113r71J7473r815l329J0810K2449K1518q945
$$ -21222 -18199 -36432 -21068 -11748 -26861 -27832 -10359 -20174 -23503 -12693 9756 31274 22329
12317B2329k6724j9652J3970J4198J9364j1682l680p167J1415P389k0674j3046
$$ 22329 -4395 -24047 -10077 4121 23485 11803 8123 956 12371 19760 -914 -13960
12305a3960J6678M795j145l0731l2096n733M362K7639k1226Q217J1361K5075K2813
$$ -13960 2718 7513 6368 -24363 -56459 -62192 -57830 -30191 -51417 -43200 -31839 -6764 16049
12292A6049M763l7765l3636K1567K5491J0566J851Q337l9068N455J3411J1735
$$ 16049 20812 -16953 -50589 -29022 -3531 7035 8886 17223 -21845 -16390 -2979 8756
12280H756k2119j7219p259o655j800j0135j5521K2496J8743K8798K7661k829j9598
$$ 8756 -13363 -30582 -37841 -44496 -46296 -56431 -71952 -49456 -30713 -1915 25746 22917 3319
12267C319J3373K0095m043M489q240l5300J9865K0150J61k0226J1161J4238k0870
$$ 3319 16692 36787 32744 37233 28993 -6307 13558 33708 33869 13643 24804 39042 18172
12254A8172r563n000k011J922j7045j5494O071K658m994K5048J4482L986k9340
$$ 18172 8609 3609 1598 3520 -13525 -29019 -22948 -20290 -25284 -236 14246 18232 -11108
12241a1108q681J1535J7696J3137n991l0180l8797r216J9028k51L9778L5245K5407
$$ -11108 -19789 -8254 9442 22579 16588 -13592 -52389 -61605 -42577 -42828 -3050 32195 57602
12228E7602q324p260R101k9272n7738p15K5466q925q698Q554j3272J3451J1833
$$ 57602 49278 42018 51119 21847 -35891 -36606 -11140 -20065 -28763 -20209 -33481 -20030 -8197
12215h197O574j0384j392k542l972J0495j978J1382j3706q256p705O051K2059
$$ -8197 -1623 -12007 -13399 -15941 -19913 -9418 -11396 -14 -13720 -21976 -29681 -23630 -1571
12202a571l631n755O221J6362J3860j1931J7169J4528j6909K4074m529j3175j3574
$$ -1571 -5202 -10957 -4736 11626 25486 13555 30724 45252 28343 52417 47888 34713 21139
12189B1139o782p082p369j8861Q602P667j267N139J8595j7178m3816j9117K0363
$$ 21139 14357 7275 -94 -18955 -10353 -2686 -3953 1186 19781 2603 -41213 -60330 -39967
12176c9967R804l1109J6436K831J3387P093J0710k3129k4437J5908J5312J0784
$$ -39967 -30163 -61272 -44836 -42005 -28618 -21525 -10815 -33944 -58381 -42473 -27161 -16377
12164a6377q895P168J1169K1273M6261q825l6175L158j1379k2883k956k1889M765
$$ -16377 -25272 -18104 -6935 14338 60599 51774 15599 18757 7378 -15505 -18461 -40350 -35585
12151c5585R36L3138P337R665M502k6554l1122L834n503K1005K7907n963k9446
$$ -35585 -34649 -1511 5826 15491 19993 -6561 -37683 -33849 -39352 -18347 9560 3597 -25849
12138b5849j1044k6735R425J5583P597P339J8716J299j6091l156K036J3892n545
$$ -25849 -36893 -63628 -54203 -38620 -31023 -23684 -4968 -3669 -19760 -22916 -20880 -6988 -12533
12125a2533l3174J3525O049j2813j4182K540j4839L0495K3403l382o822K902k4168
$$ -12533 -45707 -32182 -26133 -38946 -53128 -50588 -65427 -34932 -11529 -14911 -21733 -18831 -42999
12112d2999k5373J1928K9855p009M532K5571j5709J1424J6344k0219J2533K270
$$ -42999 -68372 -56444 -26589 -33598 -29066 -3495 -19204 -7780 8564 -11655 878 3148
12100C148k0816l0812J4677N812K9275J009J2903j0723j7723J4356k724p305J9227
$$ 3148 -17668 -48480 -33803 -27991 1284 2293 15196 4473 -13250 1106 -1618 -8923 10304
12087A0304l382j2026k2072o831K4913q250L7907L6922j5968l4786J5765L298
$$ 10304 6922 -5104 -27176 -34007 -9094 -17344 20563 57485 41517 6731 22496 25794
12075B5794k8547k7672K3214M7477P145l521K781J5830O422m079j0964k6667j6334
$$ 25794 -2753 -30425 -7211 40266 47411 43890 46671 62501 68923 64844 53880 27213 10879
12062A0879J2898k5346j3731J4846J8339J4493L3850J0677l613l7069l3530r805
$$ 10879 23777 -1569 -15300 -454 17885 32378 66228 76905 73292 36223 2693 -7112
12050g112l1891P213K2692J2851n894k2100j5438j414n766j805O743j1263k1203
$$ -7112 -39003 -31790 -9098 3753 -2141 -24241 -39679 -41093 -46859 -48664 -41921 -53184 -74387
12037g4387J4303L7795m692L0175J8044J041o108K5274K0145K106j2182j6578
$$ -74387 -60084 -22289 -26981 3194 21238 22279 16171 41445 61590 63696 51514 34936
12025C4936l2765l8665J9871K2948r31L765j6622j137J8647q470l4908j7627L1693
$$ 34936 2171 -36494 -16623 6325 5394 9159 -7463 -8600 10047 1577 -33331 -50958 -19265
12012a9265Q859J0095j1123J480j414m769M308j4935k394J5766j5591k4644j0362
$$ -19265 -10406 -311 -11434 -9954 -11368 -16137 -11829 -26764 -29158 -13392 -28983 -53627 -63989
11999f3989m334K9695J9906J7816J2172k9044j1381Q271R444R513r62r698J3248
$$ -63989 -68323 -38628 -18722 -906 11266 -17778 -29159 -20888 -11444 -1931 -2893 -12591 657
11986F57r2R991Q025k3814J7424Q059j4357R163R460n53k4698l1770L0389L3862
$$ 657 565 10556 18581 -5233 12191 20250 5893 15056 24516 23963 -735 -32505 -2116 31746
11972C1746L043j1269l757l3402p418K1854J7324j4899o53K312m5585k337n320
$$ 31746 34789 23520 19763 -13639 -21057 797 18121 3222 2569 4881 -40704 -43041 -48361
11959d8361K8340K7240J8748Q793j1900O688J1461J052M12k5161j9725L686R515
$$ -48361 -20021 7219 25967 34760 22860 29548 41009 42061 42473 17312 -2413 1273 10788
11946A0788J4386P427K5728n059m1236r758j1512m087J2256q627j4263n192K4213
$$ 10788 25174 32601 58329 53270 12034 2276 -9236 -13323 -1067 -9694 -23957 -29149 -4936
11933d936J9650k934k7251J8783K4520j7052q93L2451j7313j4661j511m805k2984
$$ -4936 14714 11780 -15471 3312 27832 10780 9887 42338 25025 10364 8853 4048 -18936
11920a8936K7933K851K4059L1200o844p940R237j2019k445n989p016n0681l4416
$$ -18936 8997 11848 35907 67107 60263 52323 61560 49541 47096 41107 34091 -16590 -51006
11907e1006L4459M4045M0050r915j5995J9526J050j6622j5500n1144k362M2928
$$ -51006 -16547 27498 67548 57633 41638 61164 62214 45592 30092 -21052 -23414 19514
11895A9514J7930m868R692j9348j0653k132p428k5878K014L9923Q433M167r85
$$ 19514 37444 32576 42268 22920 12267 10135 2707 -23171 -21157 18766 27199 31366 30381
11882C0381R56L52l5221K6490L7431p043k0248L0789J1466k1145j0490J9465j4965
$$ 30381 31337 31689 -3532 22958 60389 53346 33098 63887 75353 54208 43718 63183 48218
11869D8218k0950j8460N588j4134j5732P30K3528J4137r57o737j9371j7497j5565
$$ 48218 27268 8808 14396 262 -15470 -14740 8788 22925 21968 15231 -4140 -21637 -37202
11856c7202j5475O291k1394K6609K1449P887j4232J2044N377p597J4437L295l3164
$$ -37202 -52677 -46386 -67780 -41171 -19722 -11835 -26067 -14023 -8646 -16243 -1806 1489 -31675
11843c1675o642k643R666r715L3901K5535j2131o806J3826j3435j3887L610J1059
$$ -31675 -38317 -40960 -31294 -41009 -7108 18427 6296 -510 13316 -119 -14006 -10396 663
11830F63j1675r529N426M388p672l5928j2492R406j5970Q441K0253L8850J8262
$$ 663 -11012 -20541 -15115 -10727 -18399 -54327 -66819 -57413 -73383 -64942 -44689 -5839 12423
11817A2423m634K8070j4394j4531k7933K984J9292J5231k283m8198l9264K4428
$$ 12423 7789 35859 21465 6934 -20999 -18015 1277 16508 14225 -33973 -73237 -48809
11805d8809L4297J8922p110j2186R590j1394J4938j666j5269j4848L3532K0018
$$ -48809 -14512 4410 -2700 -14886 -5296 -16690 -1752 -3418 -18687 -33535 -3 20015
11793B0015k219N632j4086R078m229k109r358p984J2370R079o276j7212j9513
$$ 20015 17796 23428 9342 18420 14191 12082 2724 -5260 7110 16189 9913 -7299 -26812
11780b6812N550n717J7294K7746l059k2770o234j3168k255L2868j2637p433j0180
$$ -26812 -21262 -26979 -9685 18061 15002 -7768 -14002 -27170 -29425 3443 -9194 -16627 -26807
11767b6807o600K2733q88l9636R910J6143J8251k6614k7758k1145L870K9768N951
$$ -26807 -33407 -10674 -11562 -51198 -41288 -25145 -6894 -33508 -61266 -82411 -78541 -48773 -42822
11754d2822k7234K6058O9976p222j2708N480p82J2340K1151k5657k3918m982l3253
$$ -42822 -70056 -43998 25978 18756 6048 11528 10746 23086 44237 18580 -5338 -10320 -43573
11741d3573k2434P10K7981k543Q577K8102P79m2055J0566Q863Q341Q392j5516
$$ -43573 -66007 -65297 -37316 -39859 -31282 -3180 -2401 -44456 -33890 -25027 -16686 -8294 -23810
11728b3810R054q845j2191Q535J8496o212k085K1538j1576m483L4980j0393p800
$$ -23810 -14756 -23601 -35792 -27257 -8761 -14973 -17058 4480 -7096 -11579 23401 13008 5208
11715E208j1170j735l560J7962n386J530K7174J4134j8961j8768k0318q580J9466
$$ 5208 -5962 -7697 -11257 6705 1319 2849 30023 44157 25196 6428 -13890 -22470 -3004
11702c004Q408k084k9277N355J9643M212j0438L231K2627j7228k1294J2669J8879
$$ -3004 5404 3320 -25957 -20602 -959 3253 -7185 -3954 18673 1445 -19849 -7180 11699
11689A1699j4207k9817r351j583m940j3768J5614L2883R361k3301p783M25J233
$$ 11699 -2508 -32325 -41676 -43259 -48199 -61967 -46353 -13470 -4109 -27410 -35193 -34768 -33535
11676c3535J3281K38o036j7702M845J8658K052J3084J5270L1645l603k9992J57
$$ -33535 -20254 -20016 -26052 -43754 -38909 -20251 -18199 -5115 10155 41800 38197 8205 8362
11663H362L677m575J7365k1568p307o0r370k034p914k594p936l5112j0279K6899
$$ 8362 12039 7464 24829 3261 -4046 -4106 -13476 -15510 -23424 -26018 -33954 -69066 -79345 -52446
11649e2446J9348J4726P891P556j3682n258o775J1486J5187J2729l4549l1320
$$ -52446 -33098 -18372 -10481 -2925 -16607 -21865 -28640 -17154 -1967 10762 -23787 -55107
11637e5107j9056K3189J273o476J652J6949P316K0600R667K2830j1779k899q274
$$ -55107 -74163 -50974 -49701 -56177 -54525 -37576 -30260 -9660 7 22837 11058 8159 -115
11624a15r899n968N363J436O169q415Q462J0070k2107l5201j015J5171L114K06
$$ -115 -10014 -15982 -10619 -9183 -3014 -11429 -2967 7103 -15004 -50205 -51220 -36049 -32935 -32729
11610c2729K5276M593J846j6368r824j0874M189j474J8604R293k9280r963K5982
$$ -32729 -7453 -2860 -1014 -17382 -27206 -38080 -33891 -35365 -16761 -7468 -36748 -46711 -20729
11597b0729K615J0534Q77J7609o323j0178J7163N877K5762l68j0262k5518n704
$$ -20729 -18114 -7580 -6703 10906 4583 -5595 11568 17445 43207 42839 32577 7059 1355
11584A355L1811R900Q59k7787k0975l4054l0199J8517M6825L4273L890k4525M494
$$ 1355 33166 43066 43925 16138 -4837 -38891 -69090 -50573 -3748 30525 34415 9890 14384
11571A4384L0658l0873l3981o156l947j3031M655P008q401L86j5844j089L9905
$$ 14384 45042 14169 -19812 -25968 -29915 -42946 -38291 -31283 -39684 -39298 -55142 -56231 -16326
11558a6326J5780R676r500n932k8533k0123L3205K4053n212J890k656j5523O372
$$ -16326 -546 9130 -370 -6302 -34835 -54958 -21753 2300 -2912 -1022 -3678 -19201 -12829
11545a2829Q923j0151J2670J3142j833k852q728j2562r953J7464J0036k1537L126
$$ -12829 -3906 -14057 -1387 11755 9922 7070 -1658 -14220 -24173 -6709 3327 -18210 -15084
11532a5084J5201l6764k3383K7290L5985j9848k3393k278K1491K502k198K0712
$$ -15084 117 -36647 -60030 -32740 3245 -16603 -39996 -42274 -20783 -18281 -20479 233
11520B33J9800j6533q624P806L837k2361N054K8822L51k8064p252O385j5410k0796
$$ 233 20033 3500 -5124 2682 6519 -15842 -10788 18034 18385 -9679 -16931 -10546 -25956 -46752
11506d6752R820P643K6981K6932q231J519n799q240P227M337J6018K2657J6160
$$ -46752 -36932 -29289 -2308 24624 16393 17912 12113 3873 11100 15437 31455 54112 70272
11493G0272l9459k5577m3077N966K3099K2565J942L3723L19k3163j7008j3604
$$ 70272 30813 5236 -37841 -31875 -8776 13789 15731 49454 49773 26610 9602 -4002
11481d002j9970r273J9351K1737k3033j6138k3399J803n14J8531k967o99K0636
$$ -4002 -23972 -33245 -13894 7843 -15190 -31328 -54727 -52924 -53438 -34907 -37874 -38573 -17937
11468a7937L793J8738j7023m426n285m93j0556J7785K5972j7409k9575n425L6540
$$ -17937 -14144 4594 -12429 -16855 -22140 -22633 -33189 -15404 10568 -6841 -36416 -41841 -5301
11455e301K6678j0639L095l384j6000J8840L7659k3693n3092m8859N937j4778
$$ -5301 21377 10738 13833 10449 -5551 13289 50948 27255 -25837 -74696 -68759 -83537
11443h3537J3348K5771M751J1816q201K812J3010m546n96K6194K0670j3209l153
$$ -83537 -70189 -44418 -39667 -27851 -36052 -33240 -20230 -24776 -25372 822 21492 8283 5130
11430E130k324J4439O668k3799m351R696n8664n331m015k2437l534N365j5861
$$ 5130 2806 17245 23913 114 -4237 5459 -53205 -58536 -62551 -84988 -88522 -83157 -99018
11417i9018J4532M3086M240l5394Q504J0545J5996L4460k157k9776n23K6046p953
$$ -99018 -84486 -41400 -37160 -72554 -64050 -53505 -37509 -3049 -5206 -34982 -35505 -9459 -17412
11404a7412j2111j1144k2239m439n340m931J8721K1640L4970j4088k7465j4889
$$ -17412 -29523 -40667 -62906 -67345 -72685 -77616 -58895 -37255 -2285 -16373 -43838 -58727
11392e8727R018K1479K870j51J544J7412P396k643R369J0842o791j3948j0067
$$ -58727 -49709 -28230 -25360 -25511 -23967 -6555 841 -1802 7567 18409 11618 -2330 -12397
11379a2397j9637J8361K2507k2811K936J5574J4588K974j672n884j1680k161N361
$$ -12397 -32034 -13673 8834 -13977 -11041 4533 19121 22095 20423 14539 2859 698 6059
11366F059K993j3672r872j2853J5232J8493J8323k1022K1880K1804k0396j3889
$$ 6059 9052 -4620 -14492 -27345 -12113 6380 24703 3681 25561 47365 26969 13080
11354A3080j0560n113l6275R944L2995K8188K503j7594j8265J150P360J0840j2666
$$ 13080 2520 -2593 -38868 -28924 4071 32259 34762 17168 -1097 53 7413 18253 5587
11341E587j9162o284j821K5566J1338j4109l6048r201J0426J63j656J0156l4241
$$ 5587 -13575 -19859 -21680 3886 15224 1115 -34933 -44134 -33708 -33545 -35201 -25045 -59286
11328e9286K803J6657J7844k624L4296p532j147l908J3328o505k1732J3156K91
$$ -59286 -56483 -39826 -21982 -24606 9690 2158 1011 -2897 10431 3926 -17806 -4650 -4359
11315d359l008J604L5718R146M092j1145k7534r414j9015J7722N353j4767j3075
$$ -4359 -7367 -5763 29955 39101 43193 32048 4514 -4900 -23915 -6193 -840 -15607 -28682
11302b8682k5606j9761K1026N062L1244k705J2086j0596N214m615m362O414q081
$$ -28682 -54288 -74049 -53023 -47961 -16717 -19422 -7336 -17932 -12718 -17333 -21695 -15281 -23362
11289b3362N631k6041p918J3128K1069J1542N13L196n325J3298M9369J2794l2648
$$ -23362 -17731 -43772 -51690 -38562 -17493 -5951 -5438 -2242 -7567 5731 55100 67894 35246
11276C5246j7965k7966o550j331k9610R243J2958M754k9202J6293L7653k28n962
$$ 35246 17281 -10685 -17235 -18566 -48176 -38933 -25975 -21221 -50423 -34130 3523 3295 -2667
11263b667J5036m352j7144M139k0075N094J3572q822L8149J0091M744N42q934
$$ -2667 12369 8017 -9127 -4988 -25063 -19969 -6397 -15219 22930 33021 37765 38307 29373
11250B9373l8718p070L3706J6643k5339k3605K653K6878K1721k7144k8533j658
$$ 29373 -9345 -16415 17291 33934 8595 -15010 -12357 14521 36242 9098 -19435 -21093
11238b1093o57J8080j502K866J2373M733Q353K1791J1970j8876n4469l6553L589
$$ -21093 -21750 -3670 -5172 -2306 10067 14800 23153 44944 56914 38038 -16431 -52984 -49395
11225d9395L1781p889j6964l403M421K0528K981N44m616L589k124o71J3684J937
$$ -49395 -17614 -25503 -42467 -45870 -41449 -20921 -17940 -17396 -22012 -18423 -20547 -21218 -7534 -5597
11211e597j2301K0220J2606P446J406j4768K992l6680R217L221k5717K2323J1600
$$ -5597 -17898 2322 14928 22374 23780 9012 12004 -24676 -15459 -12238 -37955 -15632 -4032
11198d032l124l1031J3480K0800q86K0062L983K2722o21k6652j5466j8898O120
$$ -4032 -7156 -38187 -24707 -3907 -4793 15269 19252 41974 41353 14701 -765 -19663 -13543
11185a3543J8568m529l2094J7112L0106K0901O915l814N172K3521l119l5389j1711
$$ -13543 5025 496 -31598 -14486 15620 36521 43436 39622 44794 68315 65196 29807 18096
11172A8096p142n1027j1229M0536P190K568k3684j5771L492K1519J6976J1270
$$ 18096 10954 -40073 -51302 -10766 -3576 -1008 -24692 -40463 -36971 -15452 1524 12794
11160A2794J2296o133j7514m1302j4198J6133q571K3267J57J4615L2016P863k1397
$$ 12794 25090 18957 1443 -39859 -54057 -37924 -46495 -23228 -23071 -8456 23560 31423 10026
11147A0026r786l2712M3374L2174r130r696j4456k4361j9296j4K7574l1684l1760
$$ 10026 240 -32472 10902 43076 33946 24250 9794 -14567 -33863 -33877 -6303 -37987 -69747
11134f9747l147J8881L0414K063N507J5648r631K575J1919k478P333M535J1131
$$ -69747 -72894 -54013 -23599 -21536 -16029 -381 -10012 -7437 4482 2004 9337 13872 25003
11121B5003k8011l7623l0635k952O039K5743Q884m984j8700J2254N8639L6634
$$ 25003 -3008 -40631 -71266 -74218 -68179 -42436 -33552 -38536 -57236 -44982 13657 50291
11109E0291K3218k0114k2997m0400k2382k5375J2565M013K3283L3150J6876P835
$$ 50291 73509 53395 30398 -10002 -32384 -57759 -45194 -41181 -17898 15252 32128 39963
11097C9963r657j2061K417j588J6128L8871J7448j6276J5119K5644K3276l0351
$$ 39963 30306 18245 20662 19074 35202 74073 91521 75245 90364 116008 139284 108933
11085A08933n0710l4550M227M1298j3125j7533j4245k0843n2191J3472L8619J8125
$$ 108933 58223 23673 27900 69198 56073 38540 24295 3452 -48739 -35267 3352 21477
11073B1477j0418n938j9749j8323K0785K1609r355m412R971L994o974k2822J0180
$$ 21477 11059 5121 -14628 -32951 -12166 9443 88 -4324 5647 9641 2667 -20155 -9975
11060i975K8200l5290l585K1516K1688J2477L32J3799k0435m2517M622j2512j2203
$$ -9975 18225 -17065 -20650 866 22554 35031 35363 49162 28727 -13790 -9168 -21680 -33883
11047c3883n003m095K6548J6491O037j4783J0033l93m7461k599K6116Q889J7101
$$ -33883 -38886 -42981 -16433 58 6095 -8688 1345 952 -46509 -49108 -22992 -14103 2998
11034B998J4759p337l6967K6110K0928J5468J4974m74k3443L7K5428l6238k6441
$$ 2998 17757 10420 -26547 -437 20491 35959 50933 50459 27016 27053 52481 16243 -10198
11021a0198l0056n1650k1075K5018O2536N2255r132k8063l1741j1460j0606j0601
$$ -10198 -40254 -91904 -112979 -87961 -25425 26830 17698 -10365 -42106 -53566 -64172 -74773
11009g4773J6981K6617K6996O058L4639J5979N379K99n907p668L965m4058J0923
$$ -74773 -57792 -31175 -4179 1879 36518 52497 57876 58175 52268 44600 48565 4507 15430
10996A5430j4128k141J3504l0932M744K8612n427m947k2737J5836J9540j7859
$$ 15430 1302 -839 12665 -18267 -13523 15089 9662 4715 -18022 -2186 17354 -505
10984e05j732J1202J6546J7647k6668j1881M168j017j8604J5193K3804j80L152
$$ -505 -2237 8965 25511 43158 16490 4609 8777 7760 -10844 4349 28153 27973 31125
10971C1125o17n817l5532q484J0335K0811l312m2588k0908m277J4502l141j3430
$$ 31125 30508 24691 -10841 -19325 -8990 11821 8509 -34079 -54987 -59264 -44762 -47903 -61333
10958f1333P05K8608K5513J6813J756k1033N215j1064k2118J0823L5410J1848
$$ -61333 -60628 -32020 -6507 10306 12062 -8971 -3756 -14820 -36938 -26115 9295 21143
10946B1143l3548r943J9130k5619k0615J0428J201O322K4455j5659p243j949J5472
$$ 21143 -12405 -22348 -3218 -28837 -49452 -39024 -37823 -31501 -7046 -22705 -29948 -31897 -16425
10933a6425n380k99M4013l0313j7921O3588M1635j324m5370m0376m501K9379J324
$$ -16425 -21805 -22104 21909 -8404 -26325 37263 78898 77574 32204 -8172 -12673 16706 18030
10920A8030O20l3337l0848m554K0183M3706P100j4822o194j0469K1526J0480j5616
$$ 18030 18650 -14687 -45535 -50089 -29906 13800 20900 6078 -116 -10585 10941 21421 5805
10907E805j4924J0143l219M562k800p92J9785k0565l712n002l159N1014J152m2923
$$ 5805 -9119 1024 -2195 2367 -433 -1225 18560 -2005 -5717 -10719 -13878 37136 38288 -4635
10893d635l9871r772J7157j0610J1173L1124j9131k722M406j6787m035K7927J4675
$$ -4635 -44506 -54278 -37121 -47731 -36558 -5434 -24565 -27287 -22881 -39668 -43703 -15776 -1101
10880a101n750q44K4649r454j0246J8438J8533K2232J024j0826j3829j3440j6229
$$ -1101 -6851 -7695 16954 7500 -2746 15692 34225 56457 57481 46655 32826 19386 3157
10867C157m8760o997P894J0242J748r01N447K0306Q352l883n712k2600M861J1198
$$ 3157 -45603 -52600 -44706 -34464 -32716 -33617 -28170 -7864 488 -3395 -9107 -31707 -26846 -15648
10853a5648K401o438p036k2646Q407K2442N707o077j11J4553J6966K0338L577
$$ -15648 -13247 -19685 -26721 -49367 -40960 -18518 -12811 -18888 -18999 -4446 12520 32858 36435
10840C6435l361p485k1531o061K0557m053o892J5641j529k9050K775j9689o277
$$ 36435 33074 25589 4058 -2003 18554 14501 7609 23250 21721 -7329 -4554 -24243 -30520
10827c0520R772k1618L799K6040O209j059L709P706J9927M488p865m271K8756
$$ -30520 -20748 -42366 -38567 -12527 -6318 -7377 -3668 4038 23965 28453 20588 16317 45073
10814D5073J9860j2031m6848k4892K261P936o959o264J4062R904P02O067J3088
$$ 45073 64933 52902 6054 -18838 -16577 -8641 -15600 -21864 -7802 2102 2804 8871 21959
10801B1959p865O330M61k0149l9838J9969j1493k7498k298n116J8997K1973P152
$$ 21959 14094 20424 20885 736 -39102 -19133 -30626 -58124 -60422 -65538 -46541 -24568 -17416
10788a7416j0800L851L743J6534r031o422L6570R812k0818j4890j3871J3397K1913
$$ -17416 -28216 -24365 -20622 -4088 -13119 -19541 17029 26841 6023 -8867 -22738 -9341 12572
10775A2572j1077r133j3901K0403O931n930k3025l6632K9109K0738k7283K2707
$$ 12572 1495 -7638 -21539 -1136 5795 -135 -23160 -59792 -30683 -9945 -37228 -14521
10763a4521L3175K2676n8427k5225K9986R584k3061K403J5878j7844R37l756L4771
$$ -14521 18654 41330 -17097 -42322 -12336 -2752 -25813 -23410 -7532 -25376 -24439 -28195 6576
10750F576J2724J442K542J3003k2455j2043j7855N405J5042o241L46j1304j5470
$$ 6576 19300 20742 23284 36287 13832 1789 -16066 -10661 4381 -1860 -1514 -12818 -28288
10737b8288p849J6780M288o292m77K1464l8652q066J5060J0455q806o178j266
$$ -28288 -36137 -19357 -15069 -21361 -21838 -374 -39026 -47092 -32032 -21577 -30383 -36561 -37827
10724c7827Q779Q653k4476J5707J3077Q727K5027j2117l3981k474K5319K4392
$$ -37827 -29048 -20395 -44871 -29164 -16087 -7360 17667 5550 -28431 -30905 -5586 18806
10712A8806R887l7857j2798K789O798J6114j4507k2724k2213J3925Q007L814J4345
$$ 18806 28693 -9164 -21962 -19173 -12375 3739 -10768 -33492 -55705 -41780 -33773 -29959 -15614
10699a5614m390K4560J4342k9981m9530P526J5572K2859K4101J4269J0003K1406
$$ -15614 -20004 4556 18898 -11083 -60613 -53087 -37515 -14656 9445 23714 33717 55123
10687E5123q899k6580j0783J1460k9389l1343o863J9250K6803J319k8877K3101
$$ 55123 46224 19644 8861 20321 -9068 -40411 -47274 -28024 -1221 98 -28779 -5678
10675e678L936k1857k8809N89P082J4275Q882j7369j3376m817K7758K2973M479
$$ -5678 -1742 -23599 -52408 -51819 -44737 -30462 -21580 -38949 -52325 -57142 -29384 -6411 -1932
10662a932j7677q01l8724p584J7148M8446N453r013m040k017j3553O482J4190
$$ -1932 -19609 -20410 -59134 -66718 -49570 -1124 4329 -4684 -8724 -10741 -24294 -17812 -3622
10649c622n1010q534k9921k671L331K5186J7138J5956J0983j1063j6597Q605K667
$$ -3622 -54632 -63166 -93087 -95758 -92427 -67241 -50103 -34147 -23164 -34227 -50824 -42219 -39552
10636c9552j2320j3210K928q943J6750l605J3172L7847j4437n702L1676N381J2709
$$ -39552 -51872 -65082 -62154 -71097 -54347 -57952 -44780 -6933 -21370 -27072 4604 9985 22694
10623B2694j366j3898j2003j8305K2523K2153K7008l2424O677M042j2807j1280
$$ 22694 21328 7430 -4573 -22878 -355 21798 48806 16382 23059 27101 14294 3014
10611C014l465L8070n830m799J2169o963p860O271K158k0616j3948k135j5936
$$ 3014 -451 37619 31789 26990 39159 32196 24336 30607 32765 12149 -1799 -3934 -19870
10598a9870k1441N063J2028r708L2909k0902k9429k641J7586J0882r522k090K9075
$$ -19870 -41311 -36248 -24220 -33928 -1019 -21921 -51350 -53991 -36405 -25523 -35045 -37135 -8060
10585h060r333l0981J6828L2024J3637J1467k4069k5722R956p35O759j4427L249
$$ -8060 -17393 -48374 -31546 478 14115 25582 1513 -24209 -14253 -14988 -8229 -22656 -19407
10572a9407k244j7970j2882J1237J2613K5748J0584k1507j9029j3432J2308L768
$$ -19407 -21651 -39621 -52503 -41266 -28653 -2905 7679 -13828 -32857 -46289 -33981 -30213
10560c0213M374r265J1527J8546K031j0861J6424j4608o882j300j6036J294q457
$$ -30213 -25839 -35104 -23577 -5031 -3000 -13861 2563 -12045 -18927 -20227 -36263 -34969 -43426
10547d3426K2895N1333J6435l3387l5029j5048k457o602J632J1302J9374k822
$$ -43426 -20531 30802 47237 13850 -21179 -36227 -38684 -45286 -43654 -32352 -12978 -15800
10535a5800k4703M213q365J5561K8048j2623k2165J6550j1672P720L6541l497
$$ -15800 -40503 -36290 -44655 -29094 -1046 -13669 -35834 -19284 -30956 -23236 13305 9808
10523I808j2025j7123J1687j1850l4660j2911J6402K8266P352J1792j5751J5589
$$ 9808 -2217 -19340 -7653 -19503 -54163 -67074 -50672 -22406 -15054 -3262 -19013 -3424
10511c424M9847k060l3918r863m275j0398L1035l251r922L2706k0366j3600j768
$$ -3424 46423 44363 10445 582 -3693 -14091 16944 13693 3771 36477 16111 2511 743
10498G43j0063o209l909m157J5923J0976M473j1988k6072k1728k1229j1731M0945
$$ 743 -9320 -15529 -19438 -23595 -7672 3304 7777 -4211 -30283 -52011 -73240 -84971 -44026
10485d4026J4211k9920J7714L7681L37j2927K9904J9123p099l777J7358m834K973
$$ -44026 -29815 -59735 -42021 -4340 -4003 -16930 12974 32097 24998 21221 38579 33745 36718
10472C6718P7k568m8024k4911q275M6241J7617k637o484k1113Q93J3692l764N69
$$ 36718 36795 34227 -13797 -38708 -46983 -742 16875 14238 7754 -13359 -12466 1226 -2538 -1969
10458a969K9475J1205l5037j105J7099K6034J3796k3522q923J1236r776j6974
$$ -1969 27506 38711 3674 2569 19668 45702 59498 35976 27053 38289 28513 11539
10446A1539j4479j8338M2376K2156P229k8348R567L9215j8712k3574m723K2691
$$ 11539 -2940 -21278 21098 43254 50483 22135 31702 70917 52205 28631 23908 46599
10434D6599l9179j8800n379j7098L2744J9960l3175p360M4321K1693k0962j6626
$$ 46599 7420 -11380 -16759 -33857 -1113 18847 -14328 -21688 22633 44326 23364 6738
10422F738j557j2305K496M218Q685l746j271j4432J6711p59m1687o049J8040l151
$$ 6738 5181 -7124 -4628 -410 8275 4529 3258 -11174 5537 4778 -36909 -42958 -24918 -28069
10408b8069L1763k5J7014J6586l8912k6484J0123j830P078M006j776J3977j6989
$$ -28069 3694 3669 20683 37269 -1643 -28127 -18004 -19834 -12756 -8750 -10526 3451 -13538
10395a3538k904J3595K1847o524j2456r939J1461l1410j8941J7121L2894L0018
$$ -13538 -16442 -2847 19000 12476 20 -9919 1542 -29868 -48809 -31688 1206 31224
10383C1224j850j2353j2778k2197k1418N024K8910L899M576M737J5381p121l0155
$$ 31224 29374 17021 4243 -17954 -39372 -34348 -5438 -1539 3037 7774 23155 16034 -14121
10370a4121J4026K348j4376K485L6532J5898j3961l7775j5281L466j9015j6644
$$ -14121 -95 2253 -12123 -9638 26894 42792 28831 -8944 -24225 -20759 -39774 -56418
10358e6418j9754k0954L3850J7761L7132R383p781k4983k9308K8977L9754P844
$$ -56418 -76172 -97126 -63276 -45515 -8383 1000 -6781 -31764 -61072 -32095 7659 15503
10346A5503l816N616J5880m475j0931k2243j3829J467K8783k5230l6683J4791
$$ 15503 11687 17303 33183 28708 17777 -4466 -18295 -16828 11955 -13275 -49958 -35167
10334c5167K9887L125J3871k3993l3014m441O333K3248k604l388J4530J63n365
$$ -35167 -5280 -2155 11716 -12277 -45291 -49732 -43399 -20151 -22755 -26143 -11613 -11450 -16815
10321a6815J6329j6872k5290k0755m279J9790N0766L5168k9513r302N593J2495
$$ -16815 -486 -17358 -42648 -63403 -67682 -47892 2874 38042 8529 -773 4820 17315
10309A7315L845M597p879K4544j1248l2176j2123J1076M951L4084J6780q322q952
$$ 17315 21160 25757 17878 42422 31174 -1002 -13125 -2049 2902 36986 53766 45444 36492
10296C6492r238m675j6202j6446k0230J1476M3746L1514m2037k4351J0326n82
$$ 36492 27254 22579 6377 -10069 -30299 -18823 24923 56437 14400 -9951 375 -207
10284b07l66j5452P945l6266R86J8541K281L3839j95j7653r823J4632L524K786
$$ -207 -573 -16025 -8080 -44346 -43360 -24819 -22538 11301 11106 -6547 -16370 -1738 1786 4572
10270D572N835j7242k7276j507J4723k0927M914K3788K4139n025m270N536l6928
$$ 4572 10407 -6835 -34111 -35618 -20895 -41822 -36908 -13120 11019 5994 1724 7260 -29668
10257b9668o84J2078R342L5174J9820r544j1339j5116j0576j1490L199m46n586
$$ -29668 -30352 -18274 -8932 26242 46062 36518 25179 10063 -513 -12003 -8804 -9250 -14836
10244a4836L217J0356q161k7437j7926j3104N6647K7503j3880j3918j7890J3886
$$ -14836 -11619 -1263 -9424 -36861 -54787 -67891 -11244 16259 2379 -11539 -29429 -15543
10232a5543M1286k2237r375M332j9206L1795M7187o291o841l599q218J0235J0445
$$ -15543 25743 3506 -5869 -1537 -20743 11052 58239 51948 45107 41508 33290 43525 53970
10219E3970r119m8730K0314l273k558k5125k9809K760J9242k344R545J8816L6383
$$ 53970 44851 -3879 16435 13162 10604 -14521 -44330 -41570 -22328 -24672 -15127 3689 40072
10206D0072j7875m2499L940m146j653r167p776L1430q802J990J4614L1912L703
$$ 40072 22197 -20302 -16362 -20508 -22161 -31328 -39104 -7674 -16476 -14486 128 32040 35743
10193C5743m6419j8975Q797J9467J9921J0461J4280k4899N165j7774J580j5174
$$ 35743 -10676 -29651 -20854 -1387 18534 28995 43275 18376 23541 5767 7347 -7827
10181g827l030K0023N500k6967p779k188J345j5485q137J6242K1923k3869j4880
$$ -7827 -10857 9166 14666 -12301 -20080 -22268 -20923 -36408 -44545 -28303 -6380 -30249 -45129
10168d5129Q079K223j1835j0589P615J6306J9332j3095j6285L8072K0451L405
$$ -45129 -37050 -34827 -46662 -57251 -49636 -33330 -13998 -27093 -43378 -5306 15145 18550
10156A8550j8934j837j2364K1246J155J2143J2329j9947j8302k0018p837j2738
$$ 18550 -384 -2221 -14585 6661 7816 19959 32288 12341 -5961 -25979 -33816 -46554
10144d6554m467p127q810K0305K4720Q727j4642q955N646k060K0827J7781J2156
$$ -46554 -51021 -58148 -66958 -46653 -21933 -13206 -27848 -36803 -31157 -33217 -12390 5391 17547
10131A7547k6704l3104P925J3383o702J0096j1802M90n851Q442M9814M0871m865
$$ 17547 -9157 -42261 -34336 -20953 -27655 -17559 -29361 -28871 -34722 -26280 23534 64405 59540
10118E9540l2824l578q29n373p955o123n856p969L4605J2445J7873j3017k8456
$$ 59540 26716 23138 22309 16936 8981 2858 -2998 -10967 23638 36083 53956 40939 12483
10105A2483l111J7567P455n16J0571p392J2096j6041m3886J1328k403k3948Q151
$$ 12483 9372 26939 34394 33878 44449 37057 49153 33112 -10774 554 -1849 -25797 -17646
10092a7646J978k082J4171j625k2523p982L873q369J0699K8766j2951j4677j771
$$ -17646 -15668 -17750 -3579 -5204 -27727 -35709 -31836 -40205 -29506 -740 -13691 -28368 -30139
10079c0139q282N39J4411R587J7141J1004j6804j4181Q916J7476L731m5689j5985
$$ -30139 -38421 -37882 -23471 -13884 3257 14261 -2543 -16724 -7808 9668 13399 -32290 -48275
10066d8275J1465J2775J0523J7469P100R120R812j0901J841N693j3135r162k4307
$$ -48275 -36810 -24035 -13512 3957 11057 20177 29989 19088 20929 26622 13487 4325 -19982
10053a9982Q101J6572K6326J546q383J0796k8582J909K7537J5325l6471l5332
$$ -19982 -11881 4691 31017 32563 24180 34976 6394 8303 35840 51165 14694 -20638
10041b0638N162M9978Q005k9002J442J759L983j6132k0576Q320K0710L397k3329
$$ -20638 -15476 34502 42507 13505 14947 16706 20689 4557 -16019 -7699 13011 16408 -6921
10028f921K416L0761K0370K5899k1380r057m572K3079j8075j9276j8840k3143
$$ -6921 -4505 26256 46626 72525 51145 42088 37516 60595 42520 23244 4404 -18739
10016a8739q916J8435J7946j2554q277k9447k8090m11m233K6540L034R2j4291
$$ -18739 -27655 -9220 8726 -3828 -12105 -41552 -69642 -70053 -74286 -47746 -44712 -44620 -58911
10003e8911K6468L0488j0714p665K1541J401j6346K387j0377j7014K723K907P847
$$ -58911 -32443 -1955 -12669 -20334 1207 2608 -13738 -11351 -21728 -38742 -36019 -33112 -25265
9990b5265K1212q565m295j5093r636l276J9312M4952j5218k4774Q034K1826L169
$$ -25265 -4053 -12618 -16913 -32006 -41642 -44918 -25606 19346 4128 -20646 -12612 9214 12383
9977A2383j6572N811Q685j4554m1948K75M325J1693L767j7924K1943J7969l0990
$$ 12383 -4189 1622 10307 -4247 -46195 -45920 -41595 -29902 -26135 -44059 -22116 -4147 -35137
9964c5137n40J5882p252k1474j1066R491K2818K6275P320j6121K4218J2326k4660
$$ -35137 -35677 -19795 -27047 -48521 -59587 -50096 -27278 -1003 6317 -9804 14414 26740 2080
9951B080j7329p523O426L825m638p365J2881L8787l783N866J1604l5220j3279
$$ 2080 -15249 -22772 -16346 -12521 -17159 -24524 -11643 27144 23361 29227 40831 5611 -7668
9938g668N301j86q759j532J5411J6977K5756K8777j8297k5329J1136L6l195j2170
$$ -7668 -2367 -2553 -11312 -12844 2567 19544 45300 74077 55780 30451 41587 41623 38428 26258
9924B6258K810r647j9979l3112J1271N664j0218L560Q883M690j935j5266l6522
$$ 26258 29068 19421 -558 -33670 -22399 -16735 -26953 -23393 -14510 -9820 -11755 -27021 -63543
9911f3543j1162J6161L5780K6538l722k290j9484k8964q090J5689J2947K3876
$$ -63543 -74705 -58544 -22764 3774 52 -2238 -21722 -50686 -58776 -43087 -30140 -6264
9899f264J5167K012j4053l1150k2702N259K955k8l129K2674R81J7988K6005l5234
$$ -6264 8903 10915 -3138 -34288 -56990 -51731 -48776 -48804 -51933 -29259 -28278 -10290 15715 -19519
9885a9519J3996J7391j035j4472j1731j4958K4721J8082m646j1164M912J0016
$$ -19519 -5523 11868 10833 -3639 -15370 -30328 -5607 12475 7829 -3335 1577 11593
9873A1593l0685m49j2815L0995J5059j1219Q979K8328K8133n06k2463l7259o015
$$ 11593 -19092 -19541 -32356 -1361 13698 2479 11458 39786 67919 67413 44950 7691 1676
9860A676j7068l5294k1775K0765J7822J280L0521J041l525J3929N048J9402J9841
$$ 1676 -15392 -50686 -72461 -51696 -33874 -32594 -2073 -1032 -4557 9372 14420 33822 53663
9847E3663k2624J0242K9269k3371k1465j7179Q123K0687K8970M5879M009j1560
$$ 53663 31039 41281 70550 47179 25714 8535 16658 37345 66315 112194 116203 104643
9835A04643j0394P523J9225j8908K929N6746P0415J76624K30830J83760J28868
$$ 104643 94249 101772 120997 102089 105018 161764 232179 408803 639633 823393 952261
9824I52261J2261j13589k03938k30575j24219q5378j8412j564k6172m1427m1088
$$ 952261 964522 850933 646995 416420 292201 206823 188411 186847 160675 119248 78160
9813G8160n45j5246J7815K8l44P783l829m7006k0375M576J3168k473k672J710
$$ 78160 77615 62369 80184 80212 79868 87651 83822 36816 16441 21017 34185 31712 29040 30750
9799C0750k0814j6327k744j5452k2079R512L9296K9330L6210R565L2202j356l2019
$$ 30750 9936 -6391 -9135 -24587 -46666 -37154 2142 31472 67682 77247 109449 108093 76074
9786G6074K0826J4794j0483m3435j3323k072j357k1319J841j6742J5827L2127
$$ 76074 96900 111694 101211 57776 44453 42381 41024 19705 21546 4804 20631 52758
9774E2758L4460r240k7951l4581P547J1302j304J4159N26o366M450l2184l7018
$$ 52758 87218 77978 50027 15446 22993 34295 32991 47150 47676 41310 45760 13576 -23442
9761b3442j658j3293L9040m616k6973J2744P786J1009K8473J5326J7755p462k8393
$$ -23442 -25100 -38393 647 -3969 -30942 -18198 -10412 597 29070 44396 62151 54689 26296
9748B6296K924j4057k0234J774p453J6170K2354J7001k384l6348j1242J6836k32
$$ 26296 29220 15163 -5071 -3297 -10750 5420 27774 44775 42391 6043 -5199 11637 11405
9735A1405L01j1542J5640P809R761q343K1682r810J8847k2045k6891l4045k5560
$$ 11405 11706 164 15804 23613 33374 25031 46713 36903 55750 33705 6814 -27231 -52791
9722e2791J8005L2125K2807K0453q264k3648P615J8296o281j0611P978k210K298
$$ -52791 -34786 -2661 20146 40599 32335 8687 16302 34598 28317 17706 25684 23474 25772
9709B5772j7114J7970L8342j2817k4512j9136K2540J5963k1095k2425l2413K5593
$$ 25772 8658 26628 64970 52153 27641 8505 31045 47008 25913 3488 -28925 -3332
9697c332L5142K5768J6110j792q830l3973J7455j970k8256j3433P545j3216L543
$$ -3332 31810 57578 73688 71896 63066 29093 46548 44578 16322 2889 10434 -2782 761
9684G61J8151q598L77P665M429n197L256j6434J2906R855q295j9219J591K817
$$ 761 18912 10314 10691 18356 22785 17588 20844 4410 17316 27171 18876 -343 1248 4065
9670D065j2503N357K6046J6265o152K575n975J5313k3321N363J423j4013j1996
$$ 4065 -8438 -3081 22965 39230 33078 35653 29678 44991 21670 27033 28456 14443 2447
9657B447M085K3856J0482K836k7332m001R298R925P567j0969n36M069k552Q677
$$ 2447 6532 30388 40870 43706 16374 12373 21671 31596 39163 28194 27658 31727 29175 37852
9643C7852l793j6930k2356j1934Q20L819Q29P720K884l7790k5362L7123J8247
$$ 37852 34059 17129 -5227 -17161 -16341 -12522 -11693 -3973 -1089 -38879 -64241 -27118 -8871
9630h871J0364J8784j112J470m4214j9820n357J8323J7630J7562r624k1515M7198
$$ -8871 1493 20277 19165 20635 -23579 -43399 -48756 -30433 -12803 4759 -4865 -26380 20818
9617B0818Q186n864l175K910n022J0544r613j1998Q84K1516K8271l5296J302J1718
$$ 20818 29004 23140 19965 22875 17853 28397 18784 6786 7670 29186 57457 22161 23463 35181
9603C5181M238j6294k145J1580o29j8734m2923k478J5838P476L6434J2843k353
$$ 35181 39419 23125 20980 32560 31931 13197 -29726 -32204 -16366 -8890 27544 40387 38034
9590C8034m514k52K7668K1272j5141j801j5621l555J8405R934J7297K4946K4426
$$ 38034 33520 33268 60936 82208 67067 65266 49645 46090 64495 74429 91726 116672 141098
9577A41098q469k9422n644K0990K9512r897J5190L6109J868J0830L6760K4922
$$ 141098 132629 103207 97563 118553 148065 138168 153358 189467 191335 202165 238925 263847
9565B63847m0K5723J0381R024J750L7239L8627M3587M3313P0194P0927O4237J04139
$$ 263847 263807 289530 299911 308935 310685 347924 386551 430138 473451 543645 614572 678809 782948
9552G82948J22108J39898J80301K32857K81683L55923M84114O54074R35529J344364
$$ 782948 905056 1044954 1225255 1458112 1739795 2095718 2579832 3233906 4169435 5513799
9542E513799J849374K376508K689590K312160J317118k2825j485543k470293k527179
$$ 5513799 7363173 9739681 12429271 14741431 16058549 16035724 14550181 12079888 9552709
9533I552709k122080j608414j173772q82256o65372m81171l93273l03359j97079
$$ 9552709 7430629 5822215 4648443 3766187 3100815 2619644 2226371 1923012 1725933
9524A725933j50457j77256j42293j17233q3426p1963n4485o9315m7554q4703o4120
$$ 1725933 1575476 1398220 1255927 1138694 1055268 983305 928820 859505 811951 727248 663128
9513F63128m2295j2669k0218k2833n7437K639M3226j1151n7184k0559l6109n1623
$$ 663128 620833 608164 587946 565113 507676 510315 553541 542390 485206 464647 428538 376915
9501C76915J0223j4296k7181j7915l4697q38k176l8292o271L3318o789m917k3518
$$ 376915 387138 372842 345661 327746 293049 292211 290035 251743 245472 278790 272001 267084 243566
9488B43566k2619o584K0968r537j2171l4469k7748j3631j8686j1093K2899j813
$$ 243566 220947 214363 235331 225794 213623 179154 151406 137775 119089 107996 130895 129082
9476A29082j295k2842J4446K6923J3598K4460j6486j4605J5551q329p763P080
$$ 129082 127787 104945 119391 146314 159912 184372 167886 153281 168832 160503 152740 159820
9464A59820K957m216l4545l1030R340K3977j5807j3176L686l2165k9R042J2986
$$ 159820 162777 158561 124016 92986 102326 126303 110496 97320 101006 68841 68812 77854 90840
9451I0840J8808r657j9973N567j9359j630k417n84l740J4645j3774K6051M336
$$ 90840 109648 99991 80018 85585 66226 64596 62179 61595 57855 72500 58726 84777 89113
9438H9113j7702o437k3759k4219p551J1084N25K3352K638j8949K946J586q573
$$ 89113 71411 64974 41215 16996 9445 20529 21054 44406 47044 28095 31041 32627 24054
9425B4054K9704K3395k474l2383J5401j0184K244n624J9115l180M145J7384Q2
$$ 24054 53758 77153 74679 42296 57697 47513 49757 44133 63248 60068 64213 81597 81679
9412H1679l3293r692J8129L7826M515j7675l0958j2099J7538j9565J0995o047
$$ 81679 48386 38694 56823 94649 99164 81489 50531 38432 55970 36405 47400 41353
9400D1353j9932m385J8910o084q073r285j0486L837P009K5866J1316l0987j8507
$$ 41353 21421 17036 35946 29862 21789 12504 2018 5855 12864 38730 50046 19059 552
9387E52J1876j4998o750K1191P256j8659p97O077j334o412P193l767j3106k1336
$$ 552 12428 -2570 -9320 11871 19127 468 -329 5748 4414 -1998 5195 1428 -11678 -33014
$$ [...]
##END NTUPLES=NMR SPECTRUM
##END=
