##TITLE=Analysis number 322614
Compound Code cc 48301
Book Reference 439/187/38
Project Code adrs
Chemist Name ronp
##JCAMPDX= 6.0         $$ Bruker NMR JCAMP-DX V2.0
##DATA TYPE= NMR SPECTRUM
##DATA CLASS= NTUPLES
##ORIGIN= Bruker BioSpin GmbH
##OWNER= nmr
$$ XWIN-NMR		Version 3.5
$$ Fri Oct 13 08:10:28 2006 GMT Daylight Time (UT+1h)  MAYBRIDGE\nmr@NMR_250MHZ
##.OBSERVE FREQUENCY= 250.131544655141
##.OBSERVE NUCLEUS= ^1H
##.ACQUISITION MODE= SIMULTANEOUS (DQD)
##.ACQUISITION SCHEME= undefined
##.AVERAGES= 16
##.DIGITISER RES= 18
##SPECTROMETER/DATA SYSTEM= dpx250
##.PULSE SEQUENCE= zg30
##.SOLVENT NAME= DMSO
##.SHIFT REFERENCE= (INTERNAL, DMSO, 0, 16.522)
##AUDIT TRAIL= $$ (NUMBER, WHEN, WHO, WHERE, WHAT)
$$ ##TITLE= Audit trail, XWIN-NMR		Version 3.5
$$ ##JCAMPDX= 5.01
$$ ##ORIGIN= Bruker BioSpin GmbH
$$ ##OWNER= nmr
$$ C:\u/data/dgb/nmr/ADRS/70/pdata/1/auditp.txt
$$ ##AUDIT TRAIL=  $$ (NUMBER, WHEN, WHO, WHERE, WHAT)
(   1,<2006-10-13 08:10:01.04 +100>,<MAYBRIDGE\nmr>,<NMR_250MHZ>,
      <created by zg, POWCHK disabled, PULCHK disabled
       configuration hash MD5:
       49 4B E0 1D 92 C2 6B 37 9F E6 65 BC 52 41 86 1D
       data hash MD5: 64K
       23 6E 4F EA 46 9A 60 9E 2C 9E 42 2F BA 7F 5C BE>)
(   2,<2006-10-13 08:10:16.29 +100>,<MAYBRIDGE\nmr>,<NMR_250MHZ>,
      <Start of raw data processing
       ef LB = 0.3 FT_mod = 6 PKNL = 1 SI = 32K 
       data hash MD5: 32K
       F6 04 7E 50 BE E0 FF A9 F2 00 8A E7 1A A7 45 C5>)
(   3,<2006-10-13 08:10:18.71 +100>,<MAYBRIDGE\nmr>,<NMR_250MHZ>,
      <apk 
       data hash MD5: 32K
       6A 42 EC B9 C7 B8 68 C5 AB AE AA FA 9F 69 F1 95>)
(   4,<2006-10-13 08:10:19.48 +100>,<MAYBRIDGE\nmr>,<NMR_250MHZ>,
      <abs ABSG = 5 
       data hash MD5: 32K
       70 1E 77 2B FA 26 DB 09 62 D5 8D A1 90 F0 C5 35>)
$$ ##END=
$$ 
$$ hash MD5
$$ 36 F1 26 57 EB BA 88 F9 96 1F 8D 8F FA D8 31 96
##$RELAX= 
##$RELAX= 
##$RELAX= 
##$RELAX= 
##$RELAX= 
##$RELAX= 
##$RELAX= 
$$ Bruker specific parameters
$$ --------------------------
##$DU= <C:\u>
##$EXPNO= 70
##$NAME= <ADRS>
##$PROCNO= 1
##$TYPE= <nmr>
##$USER= <dgb>
##$AMP= (0..31)
100 100 100 100 100 100 100 100 100 100 100 100 100 100 100 100 100 100 
100 100 100 100 100 100 100 100 100 100 100 100 100 100 
##$AQSEQ= 0
##$AQ_mod= 3
##$AUNM= <au_zg>
##$AUTOPOS= <2 >
##$BF1= 250.13
##$BF2= 250.13
##$BF3= 250.13
##$BF4= 250.13
##$BF5= 500.13
##$BF6= 500.13
##$BF7= 500.13
##$BF8= 500.13
##$BYTORDA= 1
##$CFDGTYP= 0
##$CFRGTYP= 5
##$CHEMSTR= <none>
##$CNST= (0..31)
1 1 145 1 1 1 1 1 1 1 1 1 1 1 1 1 1 1 1 1 1 1 1 1 1 1 1 1 1 1 1 1 
##$CPDPRG= <>
##$CPDPRG1= <>
##$CPDPRG2= <>
##$CPDPRG3= <>
##$CPDPRG4= <mlev>
##$CPDPRG5= <mlev>
##$CPDPRG6= <mlev>
##$CPDPRG7= <mlev>
##$CPDPRG8= <mlev>
##$CPDPRGB= <>
##$CPDPRGT= <>
##$D= (0..31)
0 1 0 0 0 0 0 0 0 0.06 0 0 0 0 0 0 0.0002 0 0 0 0 0 0 0 0 0 0 0 0 0 0 
0 
##$DATE= 1160723400
##$DBL= (0..7)
120 120 120 120 120 120 120 120 
##$DBP= (0..7)
150 150 150 150 150 150 150 150 
##$DBP07= 0
##$DBPNAM0= <>
##$DBPNAM1= <>
$$ [...]
##$SUBNAM7= <"">
##$SUBNAM8= <"">
##$SUBNAM9= <"">
##$SW= 20.6930455092707
##$SWIBOX= (0..15)
0 0 3 0 0 0 0 0 0 0 0 0 0 0 0 0 
##$SW_h= 5175.983436853
##$TD= 65536
##$TD0= 1
##$TE= 683.16
##$TE2= 300
##$TE3= 300
##$TEG= 300
##$TL= (0..7)
0 120 120 120 120 120 120 120 
##$TP= (0..7)
150 150 150 150 150 150 150 150 
##$TP07= 0
##$TPNAME0= <>
##$TPNAME1= <>
##$TPNAME2= <>
##$TPNAME3= <>
##$TPNAME4= <>
##$TPNAME5= <>
##$TPNAME6= <>
##$TPNAME7= <>
##$TPOAL= (0..7)
0.5 0.5 0.5 0.5 0.5 0.5 0.5 0.5 
##$TPOFFS= (0..7)
0 0 0 0 0 0 0 0 
##$TUNHIN= 0
##$TUNHOUT= 0
##$TUNXOUT= 0
##$USERA1= <user>
##$USERA2= <user>
##$USERA3= <user>
##$USERA4= <user>
##$USERA5= <user>
##$V9= 5
##$VALIST= <valist>
##$VCLIST= <CCCCCCCCCCCCCCC>
##$VD= 0
##$VDLIST= <DDDDDDDDDDDDDDD>
##$VPLIST= <PPPPPPPPPPPPPPP>
##$VTLIST= <TTTTTTTTTTTTTTT>
##$WBST= 1024
##$WBSW= 4
##$XGAIN= (0..3)
0 0 0 0 
##$XL= 0
##$YL= 0
##$YMAX_a= 402645
##$YMIN_a= -425939
##$ZGOPTNS= <>
##$ZL1= 120
##$ZL2= 120
##$ZL3= 120
##$ZL4= 120
##$ABSF1= 16.522
##$ABSF2= -4.171173
##$ABSG= 5
##$ABSL= 3
##$ALPHA= 0
##$AQORDER= 0
##$ASSFAC= 0
##$ASSFACI= 0
##$ASSFACX= 0
##$ASSWID= 0
##$AUNMP= <proc_1d>
##$AZFE= 0.1
##$AZFW= 0.1
##$BCFW= 0
##$BC_mod= 0
##$BYTORDP= 0
##$COROFFS= 0
##$CY= 12.5
##$DATMOD= 1
##$DC= 0
##$DFILT= <>
##$DTYPP= 0
##$F1P= 14.0000005364418
##$F2P= -0.99999901652339
##$FCOR= 0.5
##$FTSIZE= 32768
##$FT_mod= 6
##$GAMMA= 0
##$GB= 0
##$INTBC= 1
##$INTSCL= 1
##$ISEN= 128
##$LB= 0.3
##$LEV0= 0
##$LPBIN= 0
##$MAXI= 10000
##$MC2= 0
##$MEAN= 0
##$ME_mod= 0
##$MI= 0
##$NCOEF= 0
##$NC_proc= -2
##$NLEV= 6
##$NOISF1= 0
##$NOISF2= 0
##$NSP= 0
##$NTH_PI= 0
##$NZP= 0
##$OFFSET= 16.522
##$PC= 1
##$PHC0= -57.74045
##$PHC1= 6.708463
##$PH_mod= 1
##$PKNL= yes
##$PPARMOD= 0
##$PSCAL= 4
##$PSIGN= 0
##$REVERSE= no
##$SF= 250.13
##$SI= 32768
##$SIGF1= 0
##$SIGF2= 0
##$SINO= 400
##$SIOLD= 32768
##$SREGLST= <1H.DMSO>
##$SSB= 0
##$STSI= 32768
##$STSR= 0
##$SW_p= 5175.98343685301
##$SYMM= 0
##$S_DEV= 0
##$TDeff= 65536
##$TDoff= 0
##$TI= <Analysis number 999999
Compound Code 99
Book Reference 9
Project Code 9>
##$TILT= no
##$TM1= 0
##$TM2= 0
##$TOPLEV= 0
##$USERP1= <user>
##$USERP2= <user>
##$USERP3= <user>
##$USERP4= <user>
##$USERP5= <user>
##$WDW= 1
##$XDIM= 32768
##$YMAX_p= 360329225
##$YMIN_p= -37356
$$ End of Bruker specific parameters
$$ ---------------------------------
##NTUPLES= NMR SPECTRUM
##VAR_NAME=  FREQUENCY,     SPECTRUM/REAL,   SPECTRUM/IMAG
##SYMBOL=    X,             R,               I
##VAR_TYPE=  INDEPENDENT,   DEPENDENT,       DEPENDENT
##VAR_FORM=  AFFN,          ASDF,            ASDF
##VAR_DIM=   32768,         32768,           32768
##UNITS=     HZ,            ARBITRARY UNITS, ARBITRARY UNITS
##FACTOR=    0.157963299565203, 1,           1
##FIRST=     4132.6476996994, 0,             0
##LAST=      -1043.33573715361, 0,           0
##MIN=       -1043.33573715361, -37356,      0
##MAX=       4132.6476996994, 360329225,     0
$$ Real data points
##PAGE= N=1
##DATA TABLE= (X++(R..R)), XYDATA
$$ [...]
24021 10030 4153 1798 -481 4458 -3818 -15073 -17897 -18331 -10667 -2179 8634 760 163 -657 354
24006 354 8194 8542 1351 -9751 -8279 -8858 -3336 102 -582 -1292 4796 9176 5461 2464 2441 -3560
23990 -3560 -4671 -540 1610 4124 4591 4230 -4520 -3761 -717 1327 45 -1161 4648 2828 -10879
23975 -10879 -4185 7484 7183 2224 -1378 -2336 131 6069 4659 4825 1421 3209 5524 4476 2541
23960 2541 9040 20091 18191 18705 21956 21647 16936 8698 638 3997 3191 -2459 -1717 -9311 -17317
23945 -17317 -16354 -12189 -7731 -777 6676 6700 -9196 -21228 -15503 -8374 -6199 4951 9875 4096
23931 4096 1662 3654 2519 -343 -10160 6172 4370 -5893 -3188 -2499 -3003 -6081 -6530 -6609 -7468 -17383
23915 -17383 -20746 -20071 -17641 -17866 -18742 -21425 -20348 -19164 -18165 -4104 -336 -4724 313 6790 15288
23900 15288 20674 15933 8251 1590 8622 12984 13869 4382 -6365 -6479 7334 10766 4008 3125 3602
23885 3602 4610 -1124 1290 9422 7925 5745 -9209 -15106 -10678 -5138 -11309 -9973 -2344 -975
23871 -975 -2225 3049 6004 -315 -2333 -3124 -4757 -4226 -4057 -3050 -3267 4069 236 -6349 -9108 -20252
23855 -20252 -20384 -2947 8796 -390 -7795 -2756 11261 18230 14442 6476 -1928 4385 4938 -912
23841 -912 -4490 -5945 -9889 -11003 -10327 2051 244 -1658 -4664 -6840 -7417 -13613 -17761 -19202 -13521
23826 -13521 -13512 -9387 -5233 -5020 -7090 -6371 -1663 -5062 -5608 -8033 -2186 5920 7514 2200 813 -4219
23810 -4219 -13251 -5107 3655 1877 -1285 -1288 -478 1726 3748 2857 -2034 -9965 -10964 -3408 7297 4536
23794 4536 -132 -2453 2090 4430 9442 8188 -9588 -18496 -9952 6554 7249 9274 15298 16443
23780 16443 10858 2778 7739 9556 6395 5276 -5741 -8895 -4281 -5871 -5660 -12960 -15775 987
23766 987 2650 3034 518 1130 4466 -1833 -2412 -3875 -853 -676 -4418 -1317 4911 9367 1696 3153
23750 3153 -584 705 -368 -6222 -5380 -4907 -3509 -12965 -19873 -20531 -5403 14076 19411 14885 12813
23735 12813 10164 10481 13747 5366 -3951 -6706 1855 2180 -763 -1049 -3307 -5000 -1042 11227 15262
23720 15262 9660 1856 -6604 -7171 -8958 -12105 -10447 -2387 2276 4107 7945 8291 1512 -2812 2070
23705 2070 3371 2871 6287 1767 1161 -4290 -8594 3878 8622 7617 4120 -3174 -12717 -14295 -7436
23690 -7436 -1494 6256 4074 -947 -3811 -9337 -17702 -17549 -11255 -7173 -6311 3261 3719 -1029 76
23675 76 -1304 -2922 4503 -4682 -10630 -4909 -399 5312 1219 -12004 -10773 -12012 -15544 -11606 -15529
23660 -15529 -15558 -13559 -17270 -14454 -3125 -5614 -7293 -10039 -3083 -3666 -10933 -9960 -2254 -386 -9474
23645 -9474 -13768 -14946 -16040 -5689 2356 3514 1142 -8194 -12284 -9873 -6641 5093 4131 7489
23631 7489 -197 -5242 -7006 2278 12292 3560 4846 3354 5272 11525 6235 14 4227 14063
23617 14063 13093 10821 4884 844 2057 -747 -6972 -2077 -1372 -9579 -12791 -2802 6587 -1084 -3141
23602 -3141 -2411 -9216 -12052 -3943 706 4311 -3533 -12836 -11216 -8991 -8973 -3469 -10397 -8172 -5638
23587 -5638 -4470 -2356 2762 3606 5581 8922 -314 -2420 -2493 602 12874 16107 11753 10701 8258
23572 8258 1821 5916 3919 3205 -5015 1028 4072 5204 5486 1986 2242 -2032 -4380 4088 5355
23557 5355 2011 -805 -4159 -1408 4658 3669 -4239 -9961 -18735 -22030 -25986 -23501 -15852 -17229 -9175
23542 -9175 -8389 -11788 -14404 -17255 -17023 -16488 -7054 -360 -4935 -4183 1800 12045 11336 13121 3295 4451
23526 4451 7234 11288 -2264 -3630 2430 1699 -587 -6281 -11173 -8849 -8685 1171 5523 7717 5413
23511 5413 2608 3958 5682 9769 5991 4447 -3103 3290 11839 12316 14777 11413 1652 -1320 -6240
23496 -6240 -11511 -5742 -2501 -4969 -10601 -13391 -9399 639 2798 3513 377 3479 -3074 -7723 -5399
23481 -5399 -11739 -10867 -16089 -19637 -18824 -13212 -12963 -2223 1827 -6250 -1746 5825 10985 11355 10708 8563
23465 8563 -5058 -6170 264 775 8433 15811 15864 11210 10401 15357 11525 10172 9964 1382 -13170
23450 -13170 -9200 -6086 -10958 -6826 -8217 -15213 -21085 -11515 -3162 -3753 -10373 -10746 1628 12490
23436 12490 8920 -1991 -5471 -856 2665 -3400 416 9873 8874 4406 2617 -1034 -14793 -25559
23422 -25559 -27786 -17478 -5310 -4980 -2179 -286 -218 1295 6612 2456 3303 9577 12392 8115 7227
23407 7227 2225 3156 4851 994 -4613 -4536 -7286 -12848 -13766 -12802 -14919 -9791 -3517 -416 -3019 -14822
23391 -14822 -14100 -15406 -17191 -15414 -10878 -10639 -9361 -14166 -13972 -13044 -19234 -26103 -20629 -22270 -22819 -12101
23375 -12101 -6054 -6921 -1798 4452 -13770 -18758 -17770 -11282 -5360 -7734 399 3324 -637 765 1173
23360 1173 -2235 -7157 -10745 -15036 -17405 -19277 -12805 -16799 -18700 -14234 -7393 -1887 380 -1627 -1507
23345 -1507 -6055 -7536 -12134 -15261 -16840 -11616 -11438 -7949 -8192 -14937 -20932 -23440 -15156 -14706 -13494
23330 -13494 -10609 -17118 -12185 -11238 -19638 -17811 -22029 -15644 -7092 -8804 -12063 -9995 -9629 -3765 4471
23315 4471 9188 13249 10849 5736 -767 -4453 -2693 -5568 -4253 -3661 308 -1835 -2854 -1691 -2297
23300 -2297 4572 9217 11531 3178 -3499 1601 1190 1098 1456 -2196 -1503 -66 286 -10533 -13925 -10348
23284 -10348 -6205 -4844 -4915 -6509 -4360 -4434 -4031 -9411 -8300 1748 13061 17916 12304 10292 9208
23269 9208 7771 7742 1963 -2937 -2445 2741 -982 -7421 -756 -2399 -11566 -23585 -23058 -20656 -10220
23254 -10220 -6062 -12692 -17577 -16392 -16768 -19060 -20366 -22337 -18635 -13450 -14544 -17133 -14031 -11994 4116
23239 4116 14886 8167 2348 1051 4871 3897 -3959 -7270 -9354 -9778 -4772 -3907 452 8208 4970
23224 4970 -125 9532 12517 3359 -1531 2411 5293 1179 -5406 948 4582 1470 -1050 131 3682
23209 3682 6441 2899 4379 171 -3627 -12185 -9100 -1136 676 6397 15287 7152 5811 15025 13533
23194 13533 16803 24584 16681 14456 7742 5310 947 -445 -1650 -2350 1725 8776 10450 14362 15544
23179 15544 9103 2421 -4005 -10554 -7616 933 2228 -2509 -3604 -5187 2154 4161 -2768 -1775 1405
23164 1405 -5804 -5871 -8877 -14945 -6995 -5307 -11457 -5361 -5890 -15303 -17909 -21547 -21491 -11550 -4110 -7983
23148 -7983 -1221 5418 2402 -1592 561 135 -3635 423 -927 -5685 -8737 -12095 -14938 -15842 -9925
23133 -9925 -2425 -2775 -2513 -1278 1573 -1921 -1403 1901 9974 5793 -336 -6475 -6863 -3848 -4722 -5053
23117 -5053 -4627 -6564 -7423 -10607 -12661 -21981 -20253 -5750 4703 10181 8841 5385 -2460 -3981 4839
23102 4839 13500 13997 3836 253 9086 1972 2876 6766 5068 6602 7372 6305 -231 1031 7393
23087 7393 4762 -4803 3946 8552 -669 -6742 -809 -1996 -4552 -2209 -8535 1424 1551 -2872 -5467
23072 -5467 -8296 -4143 7245 7083 5413 8066 4770 3075 -3986 -13456 -19390 -13984 -2998 4832
23058 4832 2676 2918 -9725 -14238 124 6601 -2482 -18415 -15177 -13769 -16492 -15705 -10798 -3537
23044 -3537 41 -2383 -4460 -6341 -12625 -7212 -6915 -2314 149 -7485 -11615 200 3941 -2784 -9956
23029 -9956 -3114 812 -651 2609 -6350 -7025 -3460 -9832 -5342 3453 1665 3496 3186 -445 2396
23014 2396 -2173 607 -2215 -7089 1507 -3524 -7917 -3114 -1484 -668 -2576 -303 -8312 -9431 -10754
22999 -10754 718 1996 -3234 2939 6284 7316 -3119 -4474 5770 4354 568 857 -4795 -8497
22985 -8497 -8261 -9762 -14273 -5560 -3535 -2012 961 -3905 1500 6047 893 323 5699 5505 7212
22970 7212 1995 -6912 -17580 -25693 -11605 -8260 -3262 5584 10833 6490 -403 5142 12383 3490
22956 3490 1834 3290 -1186 -8725 -9158 -7522 -7096 -10344 -9847 -4557 -633 309 -12178 -14127 -2181
22941 -2181 -4753 -3603 -3077 -10466 -17159 -15736 -12766 -17110 -14390 -7397 -2155 -896 4832 6501 -15287
22926 -15287 -24086 -21695 -17641 -15566 1260 6691 2598 -777 -5212 -15032 -11997 -5472 -6777 -3032
22912 -3032 -9075 -14818 -6173 3338 2116 -8138 -19181 -17625 -2320 171 -930 -4055 -6355 2135
22898 2135 -218 -7402 -7021 -4000 -2407 3362 4801 2238 -1914 -514 -10658 -6837 -1857 -2907 -3998
22883 -3998 7428 13819 11105 7521 4666 7807 3414 -1814 -1248 657 7322 13701 2045 -13104
22869 -13104 -18591 -13494 -14992 -13707 -11541 -3701 2541 13533 16656 1673 -8695 -9067 -12535 -8143
22855 -8143 -15448 -20585 -21596 -15983 -13603 -16042 -28526 -27195 -18874 -8239 -1967 -574 1575 -605
22841 -605 -4359 -3680 -8805 -9975 -11813 -11204 -17360 -11579 -869 2458 5525 6692 3990 -6984 -13020
22826 -13020 -17125 -23780 -22038 -13793 -12345 -7594 -1197 834 -1182 -12310 -4919 5739 13788 11037
22812 11037 4061 -846 -10915 -8528 -7237 -4330 -8354 -17216 -7768 3403 551 -8511 -12464 -10827
22798 -10827 -20066 -14104 -5255 673 2039 3526 9249 8425 -108 -7639 -10862 -4645 -8857 -14146 -6281
22783 -6281 -6035 -9956 -9834 -11336 -8144 -8268 -7784 -1249 1319 -5613 -15805 -22511 -13887 -11804 -12850
22768 -12850 -18750 -22063 -14990 -16274 -12534 -10478 -2016 -659 -7016 -3389 285 -3799 -212 5051
22754 5051 15388 18034 12894 13263 9562 9067 5298 12048 11526 5178 -6425 -7653 -7345 -5287 5528
22739 5528 7335 -2668 -12813 -14937 -18703 -19424 -27493 -26402 -18582 -14277 -10551 -6522 -4827 -6442
22725 -6442 -6650 -4149 1026 2875 4826 721 -6308 -9820 -16473 -24032 -18393 -7571 -10370 -2491 -4803
22710 -4803 -7599 -8940 -7611 -1867 -5504 -4052 -8964 -13117 -14942 -18937 -14458 -4026 -183 1952
22696 1952 3393 5464 221 -7088 -8819 -5977 -10679 -18120 -13985 -14817 -15332 -10991 -11067 -23498 -14597
22681 -14597 4962 8472 1595 1769 -3866 -683 2899 5405 1912 -4382 -15829 -28300 -26420 -24670
22667 -24670 -21091 -10997 -11499 -8062 -5715 330 -3239 -189 -5352 -13931 -14674 -15518 -17300 -11904 -13667
22652 -13667 -16834 -12263 -7141 -949 190 -18575 -19804 -6588 -171 -754 -6314 -2857 8631 4781
22638 4781 225 -3324 6777 9045 9430 10722 4909 -2138 -5919 -603 3031 9730 5043 4652 4796
22623 4796 -788 -6444 -5197 -8322 -5606 -2092 -5098 -20332 -28881 -27744 -19750 -10287 -14432 -17558
22609 -17558 -18513 -8550 3095 2409 -1375 -6339 -5184 -2724 -7766 -11160 -11334 -9471 -11052 -13821 -10522
22594 -10522 -10930 -9901 -8967 -4490 -17857 -17275 -4542 -4561 -10087 -7851 -3667 -7909 -8062 -5408 -3361
22579 -3361 2822 2231 2040 2243 3214 2352 458 -3555 -3540 -9490 -15009 -19553 -23306 -26071 -25955 -29481 -28841
22562 -28841 -19468 -17383 -19571 -16090 -6962 -5138 -2264 2630 4829 12442 15412 7269 -4563 -16313
22548 -16313 -14334 -13867 -16105 -18531 -21280 -16101 -16971 -15388 -9475 -3709 7471 7921 -2081 -4555 490
22533 490 -1628 -9822 -9584 -7560 -4589 -1831 -6693 -9667 -3658 -2965 -3026 -8715 -12418 -7019 -4241 -754
22517 -754 -10038 -14515 -15154 -13906 -12937 -14135 -17602 -8360 -1642 6 -6899 -10670 -13984 -14906 -12438 -13163
22501 -13163 -16733 -17359 -22941 -21530 -8702 -7497 -15485 -19706 -15794 -9128 -13806 -4244 -7888 -16961
22487 -16961 -11209 -2455 -7217 -11614 -12621 -6301 -2767 3587 827 1415 10061 12034 -1435 -4117
22473 -4117 -6114 -14793 -13043 -6611 -3617 362 -6240 2818 19651 21539 12529 -2112 -14545 -9781
22459 -9781 -2611 1215 435 2181 439 6459 6273 288 175 -273 -7004 -8230 -7470 3226 3933 -1003
22443 -1003 -7120 -3977 -6191 -921 9014 14999 9958 8015 11419 7943 -3598 -15993 -20859 -19181
22429 -19181 -16018 -11677 -12747 -18999 -15681 -5009 -2924 -628 -10075 -20894 -16639 -14958 -12124 -11302
22415 -11302 -10005 -6128 -9385 -17609 -20906 -15619 -11426 -6694 2148 3644 -6807 -6027 -12389 -10902
22401 -10902 -13643 -11066 -7600 -7851 -4522 -3720 3688 -10168 -19755 -21100 -25098 -22885 -10418 -7504
22387 -7504 -14254 -16342 -18139 -17458 -13357 -16418 -13268 -3877 -8416 -16373 -12581 -12638 -10693 -5315 -7748
22372 -7748 -4652 -3818 -6398 -12346 -21252 -34514 -29445 -9143 -554 212 -3954 -9101 -3386 -2663 -7542
22357 -7542 -14463 -17894 -15755 -11293 -8753 -12303 -9256 -9150 -19186 -15893 -3765 1999 -2169 -2672 -8088
22342 -8088 -18256 -16692 -19715 -13717 -17669 -26029 -19116 -4012 -1943 -6013 -11160 -10783 -7570 -10591
22328 -10591 5726 9138 12489 5326 12381 17384 10136 6782 3124 2024 -13542 -17160 -14535 -15923
22314 -15923 -10782 -14288 -12267 -5958 -3793 -4024 -16933 -16664 -17650 -9334 -6006 -4661 -2012 -6008 -9288
22299 -9288 -9296 -5026 -1920 4086 8407 -3448 -1754 -347 -6236 -13315 -13023 -9598 -11413 -9371 487
22284 487 -7269 -9485 -16155 -17311 -14070 -9830 -4043 -11263 -6353 -753 -1118 2784 -3387 -6845 -5042
22269 -5042 -4061 -2699 2152 6391 8309 2802 -4874 -6576 -6237 -7677 -2251 -3867 -9674 -10594 -5804
22254 -5804 -6193 -18727 -17509 -6721 6960 2770 -4891 -7887 -11416 -20914 -24670 -24113 -11216 -3490
22240 -3490 10012 14293 14479 12731 4922 995 -3839 -13677 -24047 -17814 -17029 -12073 -5020 -9183 -6774
22225 -6774 -7374 -5800 128 4018 3875 -1579 679 -3312 -8243 -2933 -10926 -24892 -19110 -13846 -9310
22210 -9310 -12058 -13079 -16059 -9151 -55 -1110 -4138 -3276 4221 2214 -5467 -5604 -6788 -14972 -18533
22195 -18533 -12179 -2319 -2435 -5371 -1724 -8214 -13981 -13496 -13645 -15953 -14158 -16087 -17221 -23820 -24891
22180 -24891 -21700 -18301 -16466 -13575 -21124 -25245 -22277 -19609 -10837 -5009 -1314 -319 -2127 -7300 -7147
22165 -7147 -9763 -7543 -795 2507 -4195 -7318 -1668 -1121 -3983 -14838 -19912 -9776 -11047 -3959
22151 -3959 -3628 2636 -4829 -9885 -4101 5427 4117 -5967 -16036 -19747 -20793 -22262 -16120 -6147
22137 -6147 -4969 3770 2817 1627 4709 4541 -6682 -12207 -2157 -3867 -14591 -18446 -11669 -9120
22123 -9120 -11269 -6101 2277 9883 10252 7645 2791 -12231 -19893 -13441 -4799 -5297 -2793 -3978 -5600
22108 -5600 -5061 -7870 -13189 -17727 -13731 -17059 -15728 -14171 -8762 -7267 2512 2359 -2790 -9711 -8191
22093 -8191 -11816 -15714 -9194 -6958 -4587 -1219 1322 -1910 -2014 -6870 -8007 1348 7452 -895 -3911
22078 -3911 -1117 -1273 -2735 -5540 -672 465 -1361 -2449 -8271 -16426 -14354 -8014 -5623 -18762 -31509
22063 -31509 -29323 -17033 -3077 -275 -3463 -4730 -8077 -9732 -14438 -14272 -13319 -9452 -13632 -17725
22049 -17725 -24532 -19611 -16785 -17778 -19895 -7491 10496 3098 -11431 -14749 -20375 -17003 -16351 -11444
22035 -11444 -7231 -7891 -6962 -2448 -10162 -26582 -22171 -7787 -286 -3768 -7374 -5566 -2389 -5496
22021 -5496 3901 7242 6162 1373 -4286 -13935 -15108 -17942 -21204 -19102 -13316 -9046 1362 10341
22007 10341 18912 9156 -53 1449 -6581 -7562 1157 4069 936 -1955 -701 -3102 -6730 -9547 -8623
21992 -8623 -7635 1730 -360 -1184 989 998 -10126 -18289 -20046 -16402 -15794 -12451 -13109 -13255 -10206 -11115 -5330
21975 -5330 -8471 -16241 -13946 -5570 -6326 -16258 -23353 -15797 -8155 -7782 -15498 -19836 -19027 -15278 -18789
21960 -18789 -15773 -6212 -4246 1558 -961 -3814 -7055 -11904 -13167 -8180 -3136 -7742 -9350 -9441 380
21945 380 7112 -932 -3555 -5543 -9844 -15514 -15140 -8101 -7582 -11475 -13833 -12665 -14369 -14118 -10400 -2722
21929 -2722 -5986 -16603 -13133 -16238 -18496 -15191 -11959 -16001 -18995 -13930 -12333 -15024 -18373 -17052
21915 -17052 -11813 -15285 -18631 -10220 -14368 -21226 -14579 -4558 -1486 6977 12083 11426 677 -3284
21901 -3284 -5320 -5386 -521 -3386 -3526 -3555 -5230 1812 1667 -6726 -1574 -2713 -5031 -8007 -5188 -3224
21885 -3224 2952 -3029 -13848 -10112 -10078 -3469 2031 3221 -10860 -15452 -14953 -9945 -2027 -2905 4518
21870 4518 4812 4266 -6131 -18411 -7240 -932 -3051 -3492 399 2723 6071 2600 2313 2726 4845
21855 4845 873 -6244 -11074 -11826 -20760 -21537 -18324 -19824 -16738 -11783 -14035 -9738 -5549 -5241 -862
21840 -862 -5664 -9573 -6079 -11872 -7835 -8653 -13688 -17751 -15314 -15898 -16114 -5704 -8480 -9141 -15081 -15309
21824 -15309 -12807 -8454 -17599 -25031 -20515 -16467 -19773 -20978 -20911 -7086 337 -1067 -1664 -2067 -5991
21809 -5991 -16511 -19665 -12720 -15587 -8918 -8871 -19687 -18256 -16379 -12772 -16789 -3835 -8222 -23907
21795 -23907 -21432 -26438 -27640 -18457 -17059 -15995 -16133 -10847 -15774 -16185 -17536 -18341 -21921 -22598 -13135
21780 -13135 -3999 6911 8640 -817 -8655 -8033 -11380 -13876 -3278 6602 1089 7767 10347 5465
21766 5465 -1072 -9808 -13352 -15271 -17827 -21416 -14005 -13638 -7228 5537 2433 -6082 -4116 -7049 -11864
21751 -11864 -18377 -12854 -17721 -15649 -15846 -15921 -16122 -2546 -333 387 -2469 -2587 -1656 1040 -1570 -1951
21735 -1951 -185 6651 1819 -6815 -15412 -16808 -23630 -13815 -4426 -10213 -9290 -4061 -922 -5126 -7776
21720 -7776 -6622 -2895 7284 2076 -7843 -12362 -10580 -7251 -14631 -19011 -4270 352 -4208 -13703
21706 -13703 -15602 -13857 -186 5148 5872 1420 -11942 -14550 -13448 -13413 -4887 -7110 -15943 -22518 -21454
21691 -21454 -23300 -21422 -11614 -1065 6372 3720 2289 668 -4074 -11510 -20367 -21644 -11816 -11556
21677 -11556 -11961 -2897 -7999 -10922 -15039 -27789 -29253 -16722 -2436 112 11295 12247 12288 14991
21663 14991 11019 2514 -4708 -11590 -18449 -9868 1103 -7995 -18907 -18398 -9488 -9811 -14234 -13782 -18407
21648 -18407 -18331 -15763 -15799 -18247 -19481 -3741 -6095 -11500 -16833 -16203 -11530 -702 -3210 -3208 1863 1923
21632 1923 -4940 -10484 -14586 -11871 -6023 -3947 -8709 2660 6349 1924 -6826 -1393 8736 5265
21618 5265 2035 -1682 -2728 -5938 -16050 -17179 -8440 -6888 -533 3925 -6490 -6498 -838 -6059 -10249
21603 -10249 2404 13889 3636 -8420 -16679 -8245 -166 -5323 -3228 -4842 -6204 -6661 -10061 -11040
21589 -11040 -4855 7087 -5325 -15123 -15116 -13415 -10926 -11390 -3129 3874 -343 -768 2018 19 -1172
21574 -1172 -897 -4217 -14796 -15503 -20296 -17197 -11418 -10184 -3343 -3720 -10517 -20411 -27848 -29163 -26065
21559 -26065 -17155 -12358 -7162 -12182 -12439 -1209 -705 -1981 -1541 -1458 -10346 -11023 -3338 -6555 -6055 3479
21543 3479 670 -11318 -16536 -18992 -23060 -14814 -5054 -9262 -1486 823 -8864 -13909 -10483 -1412
21529 -1412 5249 6800 10261 13333 16401 15676 15445 15582 12000 8132 2496 -5967 -4583 -6532 4099
21514 4099 14246 15151 3342 -8839 -14066 -23123 -20779 -19780 -11028 -6231 2134 8166 5636 7760
21500 7760 8737 339 -6257 -10175 -2386 -2155 -2386 480 2700 496 -2812 3986 -82 -5743 -6013 -11564
21484 -11564 -11248 -9316 -9010 -9312 -972 1380 -4008 190 8192 7194 320 1080 2783 -5070 -8251 -4323
21468 -4323 -1506 -7978 -6626 1259 -8237 -13819 -19501 -19350 -10006 -13564 -18610 -13331 -13076 -10834 -17833
21453 -17833 -18911 -16145 -23439 -17524 2665 10191 11602 13824 4057 -7731 -4049 -1956 -6708 -1028
21439 -1028 6676 8031 -982 -6720 -10981 -14618 -5723 117 -3161 -1820 -7255 -15942 -19323 -19759 -18864
21424 -18864 -14487 -4479 -3092 -7029 -3517 4421 -5803 -10615 -4985 -7267 -6104 -4349 -3620 -6508
21410 -6508 -16743 -20249 -15719 -14173 -6018 -5771 -5939 -5224 -5420 -6015 -8827 -12694 -15956 -13573 -7987 -9606
21394 -9606 -8888 -9203 -19823 -25223 -21136 -17880 -8147 918 6062 -2717 -5453 -8099 -15726 -11972 -8946
21379 -8946 -2447 5937 6914 438 -5835 -6472 -9407 -19222 -23619 -23423 -8061 5743 1355 -12830 -19537
21364 -19537 -20114 -14514 -9276 -7134 -6176 -8704 -3808 -10687 -9194 -3268 -7796 -15094 -25890 -24987 -19905
21349 -19905 -14994 -14250 -16361 -11809 -13558 -12761 2721 4129 -4512 -7529 -7411 -7432 -6142 -10901 -15208
21334 -15208 -11621 -2156 10971 8388 12731 10190 2103 2662 -3685 -4694 6178 6407 -1692 -2736
21320 -2736 -5007 -4292 -1427 5403 7706 5223 -5393 -11672 -7886 4761 12376 9030 -2030 -74
21306 -74 599 -1383 -11436 -10883 -3826 -8428 -16415 -18075 -9697 -9253 -10354 -8439 -2174 1854 1145 4328
21290 4328 1158 3755 2890 1506 1430 -2661 -4839 -1407 8715 12247 -94 884 853 -11475 -8814
21275 -8814 -3841 679 -4937 -6459 -391 666 1404 -140 -3289 -10775 -15592 -16051 -6391 -5023 -9661
21260 -9661 -20085 -23209 -11348 1212 447 -5054 -7305 -6292 -5491 2365 3483 5790 4443 -12118
21246 -12118 -17798 -9753 -5712 -9581 -4844 -2033 -3841 3092 1390 -338 -3671 -14955 -17247 -9791
21232 -9791 -10478 -17393 -11973 -9841 -9444 -4104 4429 6282 -2788 -11595 -9192 -11232 -19340 -17637 -18199
21217 -18199 -18157 -21183 -12655 -11549 -9923 -1738 -3719 -7459 -4497 -6522 -1373 1380 -6338 -10467 -12564
21202 -12564 -3469 4258 1748 -7316 -10930 -14895 -7861 -832 -445 -2208 -5948 -6587 -13010 -23931 -20729
21187 -20729 -12163 -11153 -10345 -2791 -3393 -8100 -13967 -11990 -2451 -17479 -20595 -15953 -13883 -8768 -16980
21172 -16980 -22591 -21086 -21431 -13938 -791 4929 2979 -2567 -3078 6506 7806 2678 455 -169 -6461
21157 -6461 -8235 -13758 -20387 -16479 -15447 -8564 -5648 -2784 -1895 -2380 -7341 -14781 -12251 -10059 -18626
21142 -18626 -18020 -11788 -10222 -10751 -15154 -8814 -3615 -7757 -16712 -19662 -16186 -5753 -6921 -15944 -18003
21127 -18003 -15870 -7460 -18391 -21254 -13107 -11853 -13618 -13693 -13475 -16771 -9159 -10005 -3800 -2556 -3423
21112 -3423 -2040 1264 4264 12995 8728 4228 2485 -2920 -8741 -20372 -24063 -29417 -28373 -27224
21098 -27224 -26084 -20320 -17500 -8291 -7482 -8917 -12001 -12146 -5348 -2543 -7110 -8556 -12523 -7831 -6103
21083 -6103 -16084 -21086 -21940 -15597 -3684 -4049 -10790 -17603 -15567 -7480 -10224 -8229 -2642 -6187 -9498
21068 -9498 -6315 -7815 -14075 -13793 -9965 -3462 318 -24 9789 15830 6530 -8046 -5601 -4006 -876
21053 -876 -884 -3442 -2133 -940 -4683 -4125 -6618 -17321 -20059 -16634 -8622 -8509 -2238 6980 10689 15497
21037 15497 14017 -9116 -13182 -6541 4815 1416 718 8678 12693 5180 3497 -26 363 -4682
21023 -4682 -5758 -4494 -10109 -18951 -22534 -20240 -22170 -19134 -18382 -19771 -18750 -13942 -11873 -11506 -14238
21008 -14238 834 11365 2119 -7982 -11170 -16908 -11768 -13678 -15805 -21791 -12326 -2745 1734 -2843
20994 -2843 -9012 -13805 -10131 -10046 -5960 850 3553 5274 184 10568 10203 -3782 -14553 -20201 -13810
20979 -13810 -10527 -10655 -6327 3584 9261 3227 5787 2899 -3104 1126 11337 9492 -1139 -12729
20965 -12729 -11537 -14898 -16696 -13617 -6177 -7385 -11078 -11863 -17776 -22125 -18573 -17727 -13316 -9732 -7742
20950 -7742 -3968 -3455 -9366 -13360 -14454 -5130 -3491 4 3083 9320 14134 2600 -4704 -9658 -6595
20935 -6595 2860 4576 2016 949 -2241 -7818 -8430 -9377 -2228 -1250 -6048 -3710 -503 1544 -6320
20920 -6320 -5709 -4059 -4049 -6516 -16741 -25016 -27914 -19373 -14254 -23041 -25873 -16656 -14170 -18598 -17891
20905 -17891 -11644 -2655 -3412 -4409 646 -3359 -7672 -8597 -16739 -11644 -5672 -11255 -21458 -14997 -3689
20890 -3689 6224 4828 -4335 -3005 1631 644 -3477 -1088 -597 -4266 -2450 -5343 -3499 -5078 -12749
20875 -12749 -10504 -156 5627 -7852 -11371 -7832 -7828 2715 8629 -2153 -11390 -7588 -7225 -3986
20861 -3986 5669 13161 15717 11215 3726 -8367 -6591 -4827 -12708 -15746 -12253 -13408 -7155 -2491
20847 -2491 -6938 -9071 -1978 5945 505 -11675 -13629 -10334 -6350 -5533 -12654 -18414 -14343 -2807
20833 -2807 9497 4866 2942 -2565 -6242 -12674 -7974 -9156 -967 3108 4736 5977 2714 -5877
20819 -5877 -7616 -11960 -14694 -14444 -16142 -8187 -7989 -7958 -12669 -19487 -17674 -20525 -13328 -11394 -7702 360
20803 360 -4280 -12896 -18415 -7929 -7979 -12239 -12342 -15619 -8410 -3836 -7661 -2433 8345 17297 5219
20788 5219 -3469 -8859 -15653 -9373 -6559 -6542 -13445 -24033 -18760 -15241 -18349 -17119 -14155 -8743 -5691
20773 -5691 -6196 -10093 -10857 -14750 -9516 -609 -2359 -4385 -1716 -1901 -3021 -5415 -6686 -11271 -9348
20758 -9348 -15894 -22390 -16923 -12069 -15405 -15995 -18413 -11757 -8427 -3633 -3502 -2491 -2842 -11932 -11358 -17792
20742 -17792 -18666 -7641 6825 -1058 -3806 -326 4596 -1458 -10962 -16542 -16930 -4804 -7651 -16228
20728 -16228 -20296 -16114 -12937 -6333 -4211 1255 5110 3880 -2846 -12081 -17820 -18246 -15367 -13345 -11608
20713 -11608 -13542 -17232 -12036 -11119 -15055 -14841 -7066 -10916 -9252 -549 4643 868 -1503 -4780 -9886
20698 -9886 -12276 -16123 -18358 -14270 -15568 -23291 -31321 -34137 -25832 -28680 -23150 -15338 -15563 -24910 -33484
20683 -33484 -23156 -12780 -5480 -39 -4509 -4051 -1661 -2071 -507 -9595 -17394 -14540 -6850 -11153
20669 -11153 -14334 -14457 -12770 -15497 -15764 -4523 8026 6022 632 614 -1865 -1970 -4384 3179 -1388
20654 -1388 -5320 -11978 -13351 -9113 -1167 -8308 -4303 -809 -3601 2118 -1136 -9181 -4550 -2004 -4897
20639 -4897 -2794 1602 -730 706 -396 -9438 -11896 -6590 -7552 -11315 -2165 1050 -6691 -7303 -10403
20624 -10403 -16802 -9167 -5277 -2935 -4156 -1733 7879 4785 -7173 -10073 -5216 1023 5114 -3994
20610 -3994 -9409 -11541 -10064 -8601 7492 7473 -10144 -11407 4882 6815 1945 5441 3538 -2565
20596 -2565 -247 -737 -5660 -7399 -9367 -3865 334 -11752 -16950 -17686 -9083 -4495 -12573 -10156 -2992
20581 -2992 -4878 -15917 -21292 -22374 -13442 -11131 -11779 -17967 -20865 -8459 -3260 -3958 -9443 -11063 -12067
20566 -12067 -18595 -24199 -23275 -15869 -18217 -14208 -8815 -11157 -17171 -14021 -10621 -2692 5201 2511 -1207
20551 -1207 -10407 -15626 -20370 -23070 -20154 -21074 -19667 -13883 -11286 -7265 -8725 -6395 3571 -295 -5179
20536 -5179 -11414 -9690 -13523 -15038 -12942 -14258 -17383 -14816 -11148 -4350 -289 943 -8098 -15616 -10577
20521 -10577 -1687 -3190 -2394 -3837 -8587 -15138 -21307 -8862 -7157 630 -3913 -18378 -22350 -17160
20507 -17160 -9833 -6073 4520 2405 3899 2233 -4367 -9440 -13927 -8363 -5719 -8961 -9930 -3128
20493 -3128 -4742 -11601 -9334 -6009 -11230 -13574 -1498 9594 10833 2056 -3780 -14249 -8211 736
20479 736 -3759 -2581 443 3346 1740 802 -7358 -3984 -5524 -6374 -8333 -14255 -11832 -9460 -4728
20464 -4728 -10934 -11364 -17452 -18469 -14099 -21465 -21707 -18906 -16109 -15902 -15439 -13708 -577 4427 4615 1776
20448 1776 -9485 -17463 -12786 -9824 -14404 -18465 -11019 -13459 -14472 -21123 -18341 -13921 -5995 -909
20434 -909 2226 -407 -4301 1227 71 -9253 -11209 -12170 -13376 -9209 -13707 -21347 -14577 -6195 -8774
20419 -8774 -9728 -11249 -14492 -20366 -19386 -11620 -7711 -8747 -14922 -22356 -28018 -26746 -22602 -18528 -16109
20404 -16109 -13676 -5211 961 2559 3712 -5840 -4313 3648 1761 -3984 3179 6518 2112 -6589
20390 -6589 -16584 -25043 -34396 -24311 -19499 -16438 -14952 -19481 -29167 -28719 -20801 -15502 -13049 -9060 -3425
20375 -3425 578 9034 16477 8486 -9523 -13874 -17732 -20869 -17383 -20139 -25526 -22090 -14165 -4340
20361 -4340 -7962 -9663 -11246 -13305 -19404 -17936 -13168 -8087 -2217 -3203 -4231 -857 5563 3283 -1758
20346 -1758 -1045 -8124 -9597 -4878 -7738 -2993 5103 2087 -7729 -22837 -24835 -15936 -12848 -12778 -9911
20331 -9911 -7198 -12259 -9577 -5784 -86 39 -3340 -7300 -500 3132 1764 -621 -8120 -15091 -26288
20316 -26288 -31115 -24124 -17715 -18549 -14331 -4437 -6166 -7150 -7142 -6589 -5542 -7818 -356 -7124 -6973 -13852
20300 -13852 -9976 -6859 2227 2661 -3972 -3118 -14326 -15867 -9355 -9392 -10452 -13995 -14874 -11248 -1693
20285 -1693 252 4962 602 5581 13844 14158 8270 7525 3105 3870 4014 -3029 -13638 -22935 -29174
20270 -29174 -20318 -6615 -11783 -18558 -16110 -4631 2337 -369 -4267 -8304 -9184 -12582 -9205 -7654
20256 -7654 -715 -1949 246 2751 -1068 -12014 -15086 -9296 -11577 -15807 -17272 -14277 -6115 -8097
20242 -8097 -12717 -8380 -2042 -2356 -7694 -13170 -13235 -10721 -9204 -5167 -6025 1525 2204 2967 -602 -9343
20226 -9343 -18950 -12229 -4156 -4263 -705 -12596 -16473 -12292 -10572 -12580 -19408 -14759 -12185 -8816 -6522
20211 -6522 -9330 -13528 -16557 -15261 -18400 -18094 -12440 -10777 -14607 -19674 -20842 -19667 -17401 -22091 -22031
20196 -22031 -16927 -18839 -10530 -415 -4249 -12155 -14964 -23448 -24902 -12330 -7778 664 -1219 -8346
20182 -8346 -11287 -11409 -9796 -4921 -6828 -17699 -15927 -10676 -8927 -4301 2438 -5587 -12918 -10057 -6541
20167 -6541 -2414 -1209 1362 -402 -4116 -2150 -3386 -3953 -4066 -1196 -2288 -11323 -14140 -19273 -11977
20152 -11977 -14244 -14800 -17242 -20230 -16362 -3646 -4343 -3690 -4233 -8686 -3246 4481 8853 7322 3043
20137 3043 -1519 -12441 -17328 -7462 5505 10104 9239 -59 -4328 1625 1438 3 -7456 -4992 -5920
20122 -5920 -5838 -7295 -4778 -1448 -6791 -15239 -15215 -10306 -12230 -25019 -28676 -24566 -18927 -17070 -30710
20107 -30710 -28711 -15477 -4371 -5179 -8192 -7654 -1769 -8117 -8833 -7178 3619 747 -6003 -3553
20093 -3553 -6787 -13832 -15594 -10517 -439 1797 2200 5611 7961 5712 716 -8027 -16011 -9851 -11347
20078 -11347 -11413 -7662 -5650 3106 8286 8078 4178 -1865 1475 2918 -4331 1033 2497 -2468 -10475
20063 -10475 -7206 -136 -1056 -11354 -15245 -16888 -9269 -5466 -11045 -19400 -12652 -5693 -3141 -4184
20049 -4184 2506 1736 -5546 1224 -3215 -10891 -9334 -13263 -12833 718 8393 -2238 -13992 -16053
20035 -16053 -12799 -6937 -11881 -10951 13 3733 2561 -5311 -8641 -5608 -10920 -10277 -14834 -13500 -13320
20020 -13320 -8595 -5970 -5902 -18970 -21946 -21579 -22215 -18876 -1541 2541 -6601 -21995 -28815 -26448 -17144
20005 -17144 -6398 -4082 -9346 -9414 -10670 -9670 -14478 -9301 -14158 -9739 -3155 1669 -3523 1420 4618
19990 4618 -2057 -11396 -8839 -2126 1894 1152 -1662 -3314 -5708 -8972 -13013 -10480 -4528 -5611 -1034
19975 -1034 -1599 -15487 -21401 -12487 193 -150 -2602 -3846 -8571 -7894 -2829 164 -8056 -12029 661
19960 661 13710 20803 6434 -6297 -2534 -2361 -7353 -14658 -20104 -15576 -12328 -9806 133 5967
19946 5967 2117 -2246 3782 -1276 -526 1681 1310 4631 -970 1961 2747 8404 13095 6940 10899
19931 10899 8693 12369 5139 -12778 -19251 -18548 -11066 -7105 3092 4558 6641 -2993 -9148 -11071
19917 -11071 -9522 -4543 -7848 -7830 -2010 -7448 -12726 -10932 -15241 -19183 -23854 -31930 -36452 -22643 -13206
19902 -13206 -5333 -9317 -11095 -9761 -9714 -14610 -24207 -28459 -24605 -21628 -23000 -27710 -22525 -15143 -8559
19887 -8559 -3107 -15241 -19089 -6199 -308 -9890 -18276 -10758 963 808 -2551 636 8403 5584
19873 5584 8639 4817 -12394 -21153 -21750 -18914 -3669 -797 -3397 -1192 3938 -4158 -8104 -9766
19859 -9766 -9372 -12622 -14789 -17509 -20628 -27241 -17112 -16406 -21806 -22571 -20199 -9157 -15468 -22836 -18921
19844 -18921 -15730 -7244 -4104 -10174 -2492 4233 3670 -1763 -3754 -7569 -6957 -1479 1128 13133 13323
19829 13323 2245 2408 5917 10619 880 -2568 -4546 -4197 -7789 -7808 -15560 -13937 -12046 -3269 -8090
19814 -8090 -8831 -10334 -15244 -8076 -8744 -2301 4293 5068 1303 -5565 -18120 -15309 -12266 -9137 -3265
19799 -3265 -9746 -12526 -16150 -21632 -36016 -35695 -27750 -24472 -18898 -7730 -9041 -17115 -4348 -598
19785 -598 -15172 -15415 -17608 -20689 -8717 -731 -4450 -12599 -23103 -27002 -13153 -13469 -19421 -5262
19771 -5262 -2826 -3952 -6861 -5861 -10978 -15305 -2187 4081 2253 2725 2293 202 -6899 -6861 -375
19756 -375 6988 24 -5594 -5800 -3673 -2033 -5978 -11905 -9211 -7367 -59 -1322 -15177 -15335 -13093
19741 -13093 -15506 -12456 -9633 -9340 -17598 -7219 -1237 265 44 -533 -8702 -9125 4668 8613 4416
19726 4416 -1784 -8591 -4683 -3130 -7347 -6823 2622 -332 2015 3681 3285 -4834 -10060 -13376 -13737
19711 -13737 -12201 -5599 -1429 -4258 -3881 -1474 266 1795 -1609 2214 8131 -2423 -5969 6903
19697 6903 11832 6931 5191 -4423 -16037 -19232 -10337 -4677 3401 13112 12488 4530 -7456 -10276
19683 -10276 -8121 -1635 6348 3111 8740 8990 7410 3868 1692 1004 -813 -7947 -9141 -5526 -12230
19668 -12230 -11491 -6087 -8840 -6242 -5889 -3308 -7171 -6066 -2333 12085 13194 7888 10931 11
19654 11 -3308 -2456 -4558 -9957 -8162 -12907 -9728 416 501 1221 -868 2500 1137 4446 6208 -5477
19638 -5477 -9965 -4698 -3224 -858 3186 3899 5822 3226 3514 1719 1430 761 -523 -6320 -9309 -6323
19622 -6323 -6681 -6902 -6665 -5967 -3518 -1473 3495 -6562 -8026 -3753 2934 -2876 -4718 -7633 -9885
19607 -9885 -8198 -4910 -156 -2642 -11094 -10760 4985 2776 -4511 3269 9857 12682 15419 19250 17565
19592 17565 9347 3334 5839 5183 3929 -6930 1221 6747 9163 6761 2659 1652 2105 -349 -3941
19577 -3941 2493 6497 -5485 -17430 -18366 -13038 -16572 -6331 -5713 334 4615 9883 14168 16098
19563 16098 11923 6583 9817 21099 36829 47456 51595 49901 51181 64505 86882 111853 145611
19550 145611 178732 206485 227350 242891 246153 235470 219824 189632 153950 121941 107807 110142
19538 110142 120332 147342 182569 217928 255876 273931 286732 272826 246704 209711 164839
19527 164839 124597 101726 84311 66221 54620 50263 41104 30956 28199 42203 42820 38118 41833
19514 41833 42976 35091 34488 26259 19432 23208 14348 5852 1283 505 5224 12838 17417 4747 3741
19499 3741 7323 13756 18748 13342 13557 20135 15628 13252 13511 11546 10908 10027 6848 8854 22067
19484 22067 30963 33260 31618 24895 22109 10534 615 -5204 -5753 4348 7214 -4116 -9759 -16001
19470 -16001 -17899 -4687 5210 8820 11815 14579 1243 -14028 -16714 -16225 -11314 -9599 -12911 -12359
19456 -12359 1473 13772 11083 2531 -4721 -942 2006 5490 8357 3416 4188 1238 -6158 -5455
19442 -5455 -4863 -3248 -10782 -7318 -614 -2496 -4262 -3743 -5083 -2543 -1281 4497 4608 -4391 -8345
19427 -8345 -4789 -7346 -1748 -3564 -5664 -15200 -14581 -2569 8287 9481 5559 -7217 -9773 -9746 -15767
19412 -15767 -15767 -10837 -7109 -5082 -2846 6600 7936 1246 -7624 -17169 -27244 -31262 -21892 -11766 -4361
19397 -4361 -4246 -2690 -2560 -3997 -5865 -4474 -5214 1169 -1696 -11698 -15746 -19680 -19722 -15471 -19071 -16183
19381 -16183 -8727 -7226 -7085 -9450 -10700 230 3987 1798 390 1064 -3664 -1285 5123 10741 15134
19366 15134 15476 11647 6560 -2567 -3629 4609 11244 1748 -1491 628 -7449 -4560 7148 -804
19352 -804 -7527 -7101 -1804 -2232 -1969 4909 4378 -5518 -7247 -3693 3188 1012 -2353 -7082 -1313 1180
19336 1180 3588 -3351 -6944 -4132 6645 9525 10746 8467 4309 -822 3065 1530 -3267 -2970 236
19321 236 2337 3837 -1436 -1271 162 261 -270 447 -1139 5058 7013 4431 -1912 -2644 847 -9051
19305 -9051 -4617 542 -290 -6792 -4225 1663 7949 10538 10116 3670 -5297 -7183 -4755 -3328 -3119
19290 -3119 -1019 4892 9555 1060 3723 1522 1367 6941 14423 10449 5904 4950 1741 4968 7033
19275 7033 4118 -1422 1870 13174 16988 14395 8057 3312 5731 13243 18638 8090 8478 16751
19261 16751 13803 13350 10478 10520 16627 23496 22698 14144 4716 6069 4645 -2809 -11576 -2431 4765
19246 4765 11236 22393 16552 18019 26005 27225 31416 21883 8815 9784 11514 9652 10503 3051 -4910
19231 -4910 -19822 -21394 -1434 11519 12335 4453 -2953 724 3121 5312 6397 3218 9657 20840
19217 20840 7924 -177 7782 8821 5657 6132 5108 5221 18126 30876 38857 41373 46468 52618
19203 52618 60238 68360 61847 52820 51888 40061 33840 30606 32577 27212 30217 40611 49783 55641
19189 55641 63860 60718 58117 59052 46673 40605 26926 12518 9221 10529 18015 15387 15294 15065 19340
19174 19340 25184 14174 9733 17286 21894 11124 12709 16384 15739 17769 17126 14692 11887 13727
19160 13727 25428 28621 23130 25684 22205 18697 16747 15230 14199 11736 11642 9375 6224 10298 11206
19145 11206 15935 14910 10172 5932 12698 13643 6558 14644 22907 15201 12333 16755 8987 9967 11144
19130 11144 11474 19689 18700 26433 29393 27222 25320 22678 25322 23480 19059 19338 26230 31937 28571
19115 28571 37165 49897 44774 38614 40639 42993 36420 27293 27349 23937 27670 42756 49903 47079
19101 47079 42063 43422 53830 56520 45925 33826 28067 21005 17066 15974 17482 20823 21398 19118
19087 19118 22956 25886 33718 45552 45524 41706 44008 39187 31823 36149 42607 51871 68646 77875
19073 77875 80885 88912 87558 84361 87308 78491 69397 65753 72737 80723 84554 82115 74872 72242
19059 72242 63118 68374 73808 66087 65884 65165 64367 63271 59515 63502 70593 71653 69666 66305 64025
19044 64025 60478 64830 63265 66588 76557 80897 81398 79244 90524 94687 96306 95519 98101 100979 104218
19029 104218 106098 110841 119102 122923 118879 119652 125800 135893 140969 132719 131485 142481 142357 148209
19015 148209 151785 143757 143814 148316 150777 152651 155237 165837 169018 175247 189595 197571 200254 201327
19001 201327 207122 205958 219499 230598 240485 257572 274391 280645 296373 310589 326122 336104
18989 336104 353892 379059 408610 439373 457294 483191 533068 606305 699136 799735 914681
18978 914681 1049863 1185627 1292429 1367491 1409268 1407180 1383688 1365932 1374960 1438442 1537737
18967 1537737 1684649 1913440 2199186 2524013 2895012 3313283 3782593 4336345 5060263
18958 5060263 6136185 7828644 10540083 14708974 20601699 28137636 36881381 46264989
18950 46264989 54702952 60526218 61552023 56778739 49166301 38513420 29296486 23219125
18942 23219125 20488868 20923771 24158564 29784603 37204093 45777493 54391173 60968326
18934 60968326 63978527 60557552 53226280 42721793 31289650 22367471 16144711 12170848
18926 12170848 9689636 8103601 7051789 6309243 5745603 5288299 4910505 4567462 4254790
18917 4254790 3977201 3747888 3579731 3477548 3460159 3545919 3738692 4024382 4362246 4710412
18907 4710412 5002862 5178113 5139755 4786587 4211479 3627973 3187592 2906250 2762697 2751592
18897 2751592 2862712 3072989 3358670 3658044 3919390 4080737 4036616 3688653 3127813 2576343
18887 2576343 2151040 1852024 1644193 1494257 1369576 1267241 1177417 1107079 1048093 995356
18877 995356 956014 918270 878805 847929 813787 789480 763184 730424 706361 690717 671773
18866 671773 654230 641289 615513 594465 578465 563531 547218 531138 505689 487924 471060
18855 471060 459342 442685 438626 428476 422625 417858 398534 382420 373312 357041 352305 347582 343261
18842 343261 344659 332921 323034 320261 319272 311514 305188 299004 290328 288903 282680 272285 265725 258930
18828 258930 263363 265433 264796 258581 256862 251289 255516 258510 262941 247391 229844 213347 212832 204201
18814 204201 186379 184046 190871 192561 193438 194246 207920 208673 199227 195443 181637 164719 151184 140042
18800 140042 135940 130824 121208 116484 121969 118110 125336 120696 118245 109779 102365 96601 94508 91836
18786 91836 87399 92264 91510 79862 70818 69993 67509 63892 63628 62506 74604 69033 61102 52525 45126
18771 45126 45932 41310 39425 38888 42674 35257 36135 44516 54284 49330 48838 56965 43993 37898 45776
18756 45776 40914 45260 39023 39009 37911 28025 24286 26239 28068 28343 29172 33407 34792 34354 41093 37771
18740 37771 42410 42403 26458 24596 35559 39807 35840 39914 46206 49150 38418 31295 25371 26727
18726 26727 27687 33482 38397 26937 18862 19878 23721 21974 9111 9024 14658 24199 33557 38897 35952
18711 35952 20314 14384 13035 15418 22255 20895 17089 15232 19213 27120 24740 22924 25187 21071
18697 21071 23828 15258 11260 14252 13893 20169 21657 22316 17809 20818 24580 25286 31428 27859 23059
18682 23059 24067 18438 21992 23824 15076 -1229 -4282 6620 13136 13556 4802 3313 4123 -3846
18668 -3846 -7930 -12174 -13734 -7845 -6406 -10922 -11444 -9990 -9867 -4322 4446 9010 10551 6366 7557
18653 7557 4155 6813 8906 9670 4582 -1639 -12334 -6668 -7262 -21156 -10920 3447 615 -9489
18639 -9489 -13203 -13859 -8025 -8898 -12241 -10246 -14510 -3987 6882 -9 -3813 -62 3300 8099 4694
18624 4694 -1667 -3984 -4962 5 7999 7416 -1019 -506 1857 -6766 -7682 -2186 140 10917 10769 10680
18608 10680 9429 8112 4004 -10180 -4024 -3788 -5212 53 3420 12423 20693 16803 7998 2515
18594 2515 4401 15261 13119 6832 10550 6191 7125 7034 -10673 -18455 -14702 -13382 -11634 479 13139
18579 13139 9755 2790 1906 -2175 -628 -2988 -6293 -3682 513 3155 2719 1136 7163 3405 4342
18564 4342 5441 -2716 -10422 -9928 -6287 -5829 -11757 -14026 -18512 -16893 -3781 -5205 -14493 -12397 -7725
18549 -7725 -7689 -2882 4115 13001 10005 8 -4517 495 8828 11505 6578 8954 11642 6585 7558
18534 7558 13201 9899 1008 -2090 -6880 196 5186 3564 -5059 -9592 -8034 -4081 -9886 -14045 -13044
18519 -13044 -4229 -3332 -7165 7415 15580 15559 6775 -1020 -3528 -248 1558 9736 12453 7080 9103
18504 9103 7188 15911 14545 10799 9316 9290 9706 12858 23042 14156 -2619 -3086 -369 -3782 -5700
18489 -5700 -4832 5223 10684 7361 1629 2102 11333 11520 9180 9981 29015 20356 9635 7931 7253
18474 7253 -950 2095 7743 5565 5705 7256 8687 4471 3077 -4458 -5929 2931 8766 6987 11048
18459 11048 15086 4117 -3949 -4826 -6946 1552 16582 21350 19336 10808 2842 2679 1702 6611 14952
18444 14952 10385 3830 -111 -5775 -9513 -4686 -6974 -7977 -5071 -12319 -12274 -14890 -14098 -14457 -1726
18429 -1726 5881 14800 12799 6927 -1285 -4594 -892 3840 6038 8268 11097 11156 6909 7144 -6604
18414 -6604 -11190 -11364 -2236 -3946 -5987 -3577 530 -2831 -8578 -17839 -19833 -17705 -13765 -8013 7266
18399 7266 6040 1944 -1062 583 4165 5237 -380 -6538 -3494 -6797 -9899 -4534 -2628 -2254 59
18384 59 -1282 -3610 -4247 2285 2847 1934 3814 10923 5021 -1260 5552 9566 11056 16268 17395 9825
18368 9825 4794 7835 7312 1411 5262 14929 18703 17254 21972 23806 16153 12270 4612 19804 33863
18353 33863 35072 36910 52461 68360 87881 108495 143018 181718 222549 250901 257773 256468
18341 256468 248631 224373 190195 165716 147313 128106 126850 136259 160673 195918 232308 252994
18329 252994 271071 269193 257120 232759 199716 155240 126231 100954 79667 63517 47935 43939
18317 43939 39713 39925 36853 31089 34063 35860 34878 31795 27249 31190 34268 26026 24318 30616 26991
18302 26991 26032 21947 14499 18687 18316 10985 7138 3486 6812 11561 14521 12403 -1063 -6413 3523
18287 3523 3108 -6779 -2245 -4373 411 -4890 -10004 -15249 -9629 -13941 -17503 -11013 -3741 -3662 -10457
18272 -10457 -15430 -6804 3317 9122 11842 5372 5145 -6598 -7325 -1045 4819 15627 2204 -3103
18258 -3103 3536 5091 5508 -2503 -19420 -18643 -9960 -3393 510 131 -2609 3989 4616 -639 -4946
18243 -4946 -8558 -12046 -8597 -15516 -17610 -19264 -9045 -1820 -11433 -5736 3688 -6160 -8252 -4536
18229 -4536 3177 -152 4471 -764 -2933 -4878 -9407 -9114 -10485 -3526 -429 -4156 -3222 -5062 -8624
18214 -8624 -11900 -4430 1691 -3463 -7800 -5673 2876 3519 5366 1927 1061 5096 13069 12357 3526
18199 3526 -7136 -6727 2020 3462 5562 -6294 -7272 784 6307 4354 7244 4485 4112 5271 5294
18184 5294 12811 6164 -83 -695 5236 8568 9550 12440 16615 18557 11045 6624 6435 1461 -1204
18169 -1204 -4034 -10509 -11989 -3857 1681 7604 9046 779 56 3010 -2370 -2633 -176 -3196 -8144
18154 -8144 -16684 -14359 -10157 -5799 -8284 -9799 -8474 -10360 -7189 900 -389 -1484 -317 7882 12753
18139 12753 10328 -242 -3648 4630 5619 6234 2170 -3256 -7654 -7717 2329 884 -3470 6028 12055
18124 12055 4019 -2770 -2939 -5904 -10906 -6294 1320 6468 8195 8589 6489 452 3264 3092 1814
18109 1814 1316 -2763 -9345 -10877 -9820 -3764 -2035 -4157 -9102 -12990 -352 7794 11836 4958 -3818
18094 -3818 -8003 -5314 -5231 -5305 -11763 -8733 4719 -6758 -8199 -1424 146 -1458 -4388 -3602 3467
18079 3467 -221 -2641 -2330 -3503 -2994 -1808 -3130 1358 6582 170 -7819 -3799 6669 17022 7357
18064 7357 7148 5869 8047 16438 9249 -3109 -12586 -12674 -8461 -7698 570 14404 16449 8593 10998
18049 10998 15773 8302 3063 -3222 -4487 -6970 -8470 -9392 -5829 918 3140 3239 5387 4293 5434
18034 5434 8164 8432 1528 7081 6667 5220 3855 -4111 -16376 -16152 -1521 2810 -9074 -16971 -7608
18019 -7608 -8366 -8963 -1646 4796 14052 15275 2928 -2420 4591 -532 -5419 -1871 3440 7151 5035
18004 5035 -1629 -14880 -19955 -12933 -17381 -15764 -10772 -8154 -5899 -8743 -6524 -19900 -19544 -17291
17990 -17291 -24409 -19140 -4747 775 9197 7817 1316 -15858 -22298 -11591 -7702 -9490 -12114 -9028
17976 -9028 -9995 -8395 -13874 -10662 -5563 2465 6290 6877 3825 -1150 -4776 -3467 -1219 866 -6382
17961 -6382 -11402 -10677 4267 6297 1065 -2545 -5772 -1381 2411 -4115 3124 6516 7445 13973 16087
17946 16087 11666 9704 118 -3124 -1754 -1663 -5486 -10878 -17171 -20656 -10705 -2764 -2789 -4691 -9777
17931 -9777 -7950 -1633 -404 862 -3924 -9658 -10331 -6486 3415 5249 4684 584 30 -8517 -15148
17916 -15148 -24617 -21483 -21002 -20400 -28561 -21039 -12153 -3269 -4153 -3067 -817 2802 11955 15051 5837
17901 5837 7809 7945 2031 -10633 -14057 6611 12937 9744 10911 6108 6219 6885 -2163 -6091 -6437
17886 -6437 4956 11249 -838 -5059 625 9350 9895 8883 -1036 -5463 -3936 -12229 -4943 5196
17872 5196 13478 16738 13448 6956 6430 19153 11461 8063 9409 3689 6472 8278 3138 3756 343
17857 343 -7067 -3914 -1548 914 2550 3298 3520 5097 13261 -3990 -20163 -12883 -6446 -8355 -2154
17842 -2154 2179 -70 10497 19040 18045 11627 9191 5599 8511 2585 -3994 -5175 -2 7447 5581
17827 5581 3888 1043 4749 191 4573 1979 370 1213 7412 8747 15727 22292 20118 5167 773
17812 773 2405 1248 4086 4417 -1092 -8271 -2206 -4221 -7943 -7695 -9477 -8895 -7796 -4702 -6474 -4322
17796 -4322 715 -2433 -4745 -13754 -9206 -2276 3570 2584 -7157 -4403 10267 11322 12788 6343 -5576
17781 -5576 -3203 7187 7981 7899 14685 17955 27109 42929 40081 37282 49462 59069 89781 136520
17767 136520 187524 241958 303443 346991 363805 335354 264134 189557 143352 123632 111880
17756 111880 104879 122682 156154 207484 252937 293435 322239 336760 320035 278860 216394 147654
17744 147654 104901 73361 41882 20750 13160 12622 15589 22317 15956 8527 11939 12356 14392 19878
17730 19878 26597 22299 17318 14811 14830 13561 20858 20427 20507 17151 8801 6201 2542 -4862 -7968 -5921
17714 -5921 1444 1918 9395 11650 11358 9246 6406 -646 -11407 -9741 -12123 -7627 -13160 -3076 3335
17699 3335 4649 5316 5484 12231 14030 9776 4771 8112 2934 -9533 -9623 -13341 -9217 904 1468
17684 1468 3305 6392 11612 -4009 -14381 -13778 -10014 -12752 -14059 -12058 -12328 -12003 -12207 -14267 -13322
17669 -13322 -217 9762 10440 7744 5821 -954 -4164 4229 6349 -48 755 -3992 -446 2008 5798
17654 5798 14282 12003 13268 6084 -8080 -17694 -17252 1938 10249 4740 -2343 -2173 4392 3420 4583
17639 4583 11984 13727 5996 -424 1719 369 -2495 -2519 -577 1719 -8898 -15295 -10606 -16908 -14386
17624 -14386 -3573 -4347 -6785 177 7424 10082 9389 6948 19738 17565 17408 1400 -14507 -14130
17610 -14130 -9143 -4484 2617 2789 4824 7441 10862 13293 7216 4945 -4 -5536 -3778 4002 4302
17595 4302 4518 -2155 -1601 -3513 -1521 -3691 -2869 -2025 -2793 2804 3184 -320 1933 4807 7903 18213
17579 18213 23639 18765 19584 14814 13755 1788 785 -1660 -685 1850 1559 3287 3267 2178 1083
17564 1083 -735 -8238 -15566 -12388 -7292 2304 14280 15912 8674 1167 -7346 -5430 -490 -5729
17550 -5729 -10831 -12630 -391 -909 -552 -30 180 1371 -2158 -3622 6380 7009 4683 3550 -2809
17535 -2809 -981 1327 3375 -66 -869 -2093 -5668 -4319 684 6435 3743 2594 9930 12078 21963
17520 21963 20119 18818 17781 13447 7628 7579 5978 605 6564 9779 19270 27386 28292 21234 16397
17505 16397 3884 -8094 -6858 -10013 -6987 -2647 -10775 -13275 -8460 695 2177 -2285 -1341 7821
17491 7821 13407 19290 7254 -253 463 -2350 -3928 -6052 2076 6450 5580 10428 4966 4911 2529
17476 2529 8265 14213 15683 17407 15098 14284 14761 19162 32770 33774 26273 17202 9745 10259 1490
17461 1490 1109 3544 6871 21047 32621 42846 49952 60104 73158 75806 67762 59111 57176 46238
17447 46238 36018 32269 35006 32646 43457 60723 71277 72266 73778 74759 72421 69680 65315 55389
17433 55389 35136 17283 7828 13659 16452 13644 1168 -1675 4980 10367 14077 20220 22357 20030
17419 20030 22062 22369 17491 10785 12400 8762 12196 21808 23487 21779 24577 27317 36627 32943 19580
17404 19580 16111 10206 18487 16199 6990 1885 12163 15495 333 -2384 -3880 3604 16488 17179
17390 17179 17742 12995 15996 15562 10850 17890 10463 14842 14272 15499 8949 4534 12496 20231 25252
17375 25252 29021 30584 25231 21836 15408 21737 34651 33593 42147 47440 46975 39998 42696 50966
17361 50966 45862 40255 36476 42369 43817 39658 33967 32540 36184 36400 42245 46184 47576 51423 43803
17346 43803 34077 42016 52426 48935 45586 47891 55810 55236 46520 45157 52393 58427 53463 44730
17332 44730 48298 51033 51402 51735 43003 50263 59091 69407 74128 74330 80661 82927 79576 73167 75267
17317 75267 78489 83617 85687 74508 73914 83208 86800 87967 92911 97621 100394 89720 85045 85131 91336
17302 91336 100258 91970 95207 97664 106214 116612 132695 139301 130936 133003 136107 152586 172813
17289 172813 184130 206668 218135 237359 257552 286574 321916 365349 434854 547354 724655
17278 724655 1020122 1486415 2071187 2664933 3243457 3722310 3976527 3609777 2548032
17269 2548032 1728059 1303155 1111990 1066002 1150411 1384798 1791015 2316588 2870015 3407892
17259 3407892 3825029 3996378 3477649 2376354 1584594 1147221 898891 746340 655442
17250 655442 595322 541801 506679 496489 497110 485506 478891 481102 484675 488843 496575 506836 515060
17237 515060 516822 531395 555052 581199 612831 659264 714793 782698 858233 933941 1002963 1074273
17225 1074273 1139498 1170348 1198985 1236769 1280945 1362717 1466089 1599994 1741246 1939391
17215 1939391 2204987 2519100 2875235 3273869 3719884 4188425 4745665 5601436 7012999
17206 7012999 9397464 13528615 20285258 29796616 40933892 52344470 63070388 71120187
17198 71120187 72500798 61363869 42937527 28876354 21085562 17410502 16395709 17728528
17190 17728528 21874159 29164980 38873837 49427897 59795721 68547646 72877518 66966013
17182 66966013 49575308 32242685 21289658 15119943 11530458 9281524 7769376 6705510
17174 6705510 5947406 5406965 5008774 4700274 4449687 4225436 3972034 3666408 3365920
17165 3365920 3119544 2916008 2736255 2560348 2405928 2294340 2200455 2128720 2077208 2019655
17155 2019655 1970605 1919646 1848322 1753047 1649845 1557831 1480067 1407011 1340859 1282334 1233199
17144 1233199 1181361 1143361 1103210 1068314 1038091 1001530 965961 931073 891551 869231 846362
17133 846362 825262 795046 763140 730800 711448 690907 681096 668430 646319 620139 598955 578314
17121 578314 568432 562912 551350 534520 521053 502593 481711 463449 456816 449586 434805 429014
17109 429014 418747 409443 394817 380118 369208 361674 368014 365123 363640 356170 328770 313696 309972
17096 309972 306006 304304 299140 292791 282712 276126 277766 272286 260676 258523 251781 250610 242075 238406
17082 238406 227605 221589 226092 229610 228773 238220 241937 241561 240229 249137 251180 248938 245717 221690
17068 221690 207087 196122 184916 174572 176256 179259 185516 187791 189362 192474 205423 202778 193348
17055 193348 171985 166216 148330 141847 125840 123002 123647 124205 107566 88015 82425 82287 86573 85033
17041 85033 88780 94799 98160 94047 85553 78316 71717 65183 63654 62165 57295 49438 53698 57593
17027 57593 64176 61801 61885 50337 49909 49025 47198 41870 42486 39517 36182 40294 46838 40717 44256
17012 44256 56356 57630 40039 33127 39884 44673 51266 55478 63562 65003 55443 46100 39415 30738
16998 30738 31585 37924 39306 26228 23289 30735 35805 30817 37776 41578 32148 32392 36465 40766 37919
16983 37919 35725 37155 36805 37965 30204 27747 25709 25589 29837 43773 46863 36680 23991 21119
16969 21119 26802 29632 28091 36209 37216 26639 26493 31910 31879 38518 42612 39755 34605 28852 21189
16954 21189 19785 29703 34316 38571 42465 43790 33619 32944 34586 35299 27169 31396 31560 28754 20310
16939 20310 12689 25033 36870 29070 30380 26576 21032 27357 36601 36023 27485 23167 30310 28529
16925 28529 20554 21337 23368 26430 21428 16164 19061 16874 11134 12808 19545 14808 5814 4622 8992
16910 8992 12382 11793 15138 12067 17021 24065 19430 22495 19590 8218 6616 8997 6080 11778 20277
16895 20277 9542 -1524 -6818 -8962 -6509 -13130 -17613 -8236 1176 6065 9665 10420 10449 7614 9562
16880 9562 5763 2302 -3040 -11702 -17085 -22684 -19424 -18741 -7366 -4451 -14688 -14578 -5075 712 8997
16865 8997 10583 14482 15998 10672 5465 -3400 -7820 -7086 -5169 10465 4882 -2527 4456 8103 6949
16850 6949 5572 8070 9608 4937 3211 4973 14345 11026 3455 82 6067 8657 1609 3892 -2996
16835 -2996 -2261 -578 -1937 -9358 -3956 -603 233 4916 -2337 -187 5927 7580 1208 2542 1758
16820 1758 8474 11223 12864 12204 12040 13179 8491 5177 5733 -2792 1936 2274 702 2188 613 -1988
16804 -1988 -4522 -9439 -10966 -1288 7576 7413 4710 7610 2644 3129 3778 2314 5732 10701 18205
16789 18205 10544 1166 -11238 -7676 -2788 -1358 -468 -7078 -5491 -4129 -3479 -8588 -4159 -10296 -7175
16774 -7175 -11122 -4620 3741 3169 3307 5913 -268 -3085 1187 1319 3834 -3603 5145 5533 4928 880
16758 880 1384 1349 3429 9728 6020 -1445 -1441 -718 2888 3205 -1163 1866 -1556 -1235 -1036 -7161 -3131
16741 -3131 -3147 -13412 -4451 -3079 -3814 -3306 1902 -1023 -10104 -20323 -17956 -10487 -12697 -10863 -11072
16726 -11072 -13201 -11147 -3364 -1320 5119 1749 -9452 -16269 -22839 -17442 -14391 -5524 7308 8234
16712 8234 11203 12575 13490 10930 11493 16943 19047 16539 23205 19666 8527 7407 10176 14699 2864
16697 2864 4648 3360 3385 13037 9510 12461 14581 19996 24422 17066 16167 18689 21999 17585 10959
16682 10959 7626 273 4106 9426 8032 2262 -5692 -8346 -8496 -6248 -4657 -996 1691 -4275 -13642
16667 -13642 -10543 -4230 -3327 -4210 -9919 -6082 -8385 -6409 -13504 -11603 -5353 7004 13165 11937 7938
16652 7938 10300 16276 11558 17901 23574 16925 11063 17375 18775 21311 31634 38612 38552 40279 39437
16637 39437 35052 56347 73054 97076 127169 172432 223910 269521 311803 339299 338295 306917
16625 306917 234959 167482 129348 115441 118153 115730 133137 169048 224554 280617 323062 345682
16613 345682 353298 329573 261938 189825 133398 95880 69930 57254 52077 44289 41966 35842
16601 35842 28970 22691 16621 16113 13674 15067 10049 8794 -143 -4913 -7222 -132 5691 9884 18620
16586 18620 17164 8620 3760 16100 16329 8586 -1290 -7539 -9697 -2133 1163 -3784 -5307 3813
16572 3813 6514 -1915 -5705 -3233 -6602 -2885 6384 10292 4817 -316 2418 9126 7014 1415 2250
16557 2250 -1224 -2616 3058 4053 10661 5271 -3006 -1918 -287 -6669 972 8518 12509 14807 17426
16542 17426 19671 6668 -858 -9425 -23999 -28416 -15474 -7582 -3533 542 8228 2792 -259 1131
16528 1131 -1364 -1909 -9710 -11262 -6771 -3437 -9055 -9579 6574 13031 3011 -4525 -8208 -6934 -4267
16513 -4267 -7734 -11934 -5834 1824 -6848 -11238 -9084 -11800 -15476 -16239 -4619 -1754 3307 4589 2784
16498 2784 -1249 -6724 -13857 -9929 -12480 -18283 -22981 -15207 -7798 123 8055 7254 3616 -3816 -14139
16483 -14139 -12384 -12668 -6479 -15065 -14491 -14565 -21760 -13277 -15081 -13039 -12057 -10204 -9305 -6006 -923 676
16467 676 -3926 -5341 -2324 -7133 -41 -3616 -5273 -2302 28 99 -2869 -5235 2105 582 -622
16452 -622 114 3311 7910 4460 8141 6676 5162 1477 -640 386 -9145 -22094 -23858 -13295 -6933
16437 -6933 -6287 -13389 -8062 -8046 -7089 -78 10566 11461 5135 5652 6443 -986 -6127 12251 10900 1791
16421 1791 -102 -1254 1419 12805 19256 21414 13424 12716 13608 15931 9525 2755 -1752 -1515 -584
16406 -584 -3214 -7724 -4797 -3238 -9288 -6837 -10 1408 -2515 -9272 -17020 -15015 -8623 -7017 -7563
16391 -7563 -15347 -16813 -12859 -5530 1282 6781 4312 2460 -1553 -10992 -11507 -10770 -3651 -1702 2848
16376 2848 8201 4574 -2515 -3145 5350 -1118 1779 7809 7507 8481 8046 6485 -1268 -5316 -5265 1343
16360 1343 -3246 -8701 -10785 -7663 -10692 -15677 -21678 -19925 -13571 -3345 3809 7115 2701 9267
16346 9267 9863 324 590 -2224 -5601 -10764 -13351 -8178 -7262 -3433 -294 -850 -5803 -10429 -3440 3186
16330 3186 1661 740 -2381 860 5774 1394 -1094 -7291 -12670 -10954 -5774 -3107 -2112 3766 9353
16315 9353 9627 6728 5626 8507 13281 15958 9950 -6192 -2396 516 -2670 -7821 -119 -5643 -16581
16300 -16581 -11725 -4846 -8719 -4204 379 -2059 -3253 -1974 -2415 -3731 -11206 -8896 -5807 -6976 -6361
16285 -6361 2155 2638 -1204 -6214 -10979 -11463 -6932 -6022 -2507 -4905 1960 4092 679 -3413 8254
16270 8254 10180 7606 4455 8957 11093 -5761 -7689 -6180 -15415 -10326 -617 -5858 -13662 -9782
16256 -9782 -7291 -6279 -731 -3988 -3322 2259 1407 3758 6932 1965 10348 18665 14396 3368 -3347
16241 -3347 1089 -518 -3693 300 10842 16731 9930 4082 5652 6844 3035 9721 17422 18181 10872
16226 10872 5010 11278 21051 16950 16699 20962 17260 5398 8493 16480 12647 2706 -5785 -9353
16212 -9353 -3560 623 -3427 -6803 3359 4788 -14602 -18549 -8980 3265 1002 -6177 -1710 -5301
16198 -5301 -13550 -23889 -30558 -27528 -18690 -5435 -5485 -401 -1778 -2589 -2546 -8421 -11489 634 4013
16183 4013 7587 6616 3024 2053 2291 1039 -2008 -4172 -1043 -2239 -5042 -1392 -2062 -8990 -14617 -12858
16167 -12858 -10743 -5940 -5809 -6177 2385 13253 9320 11615 5565 -1248 -8723 -12038 -2008 -5676
16153 -5676 -8048 -1769 -2246 1649 8881 19996 20624 16856 6600 1951 -4324 -4059 -2081 5510 11419
16138 11419 16187 13117 1595 -1947 -1850 -3141 -3526 -8359 -10880 -16847 -18757 -17620 -12946 -12187 -4988
16123 -4988 -13602 -23972 -22414 -13073 -9658 -2775 4675 -1649 2757 -1544 -10361 -10134 -253 -4078 -2517
16108 -2517 3916 -1595 76 7684 12050 7850 7722 9690 8649 -1167 -2861 -2577 -7943 -14177 -4567
16093 -4567 5142 -6514 -11936 -8713 -7743 -13197 -12873 -4965 -5637 -8463 -5403 5992 11148 3702 -1041
16078 -1041 9180 9156 -4534 -13564 -14206 -11735 -6589 2195 10395 12191 9962 7772 9024 250 -10053
16063 -10053 -6601 -4668 -13779 -6053 -1688 -3500 331 -6469 -6875 -2397 1247 -1219 1997 7645 5748
16048 5748 11236 24066 12850 3946 -1791 271 -6141 -5160 -774 -3948 -12837 -7400 -2089 -2172 -5517
16033 -5517 1828 7717 1687 -8435 -2525 9584 1652 -2308 -7100 7425 12397 3805 -761 621
16019 621 -2922 -4476 -4574 1079 -3373 -9815 -14978 -8925 -8320 -10791 -2099 -3758 -5991 -6545 -16082 -17870
16003 -17870 -23130 -18439 -9136 1665 6286 1595 5595 17163 8063 -3470 299 -2676 -9092 -14159
15989 -14159 -9586 -5667 -17029 -19758 -18255 -16733 -5260 2393 2210 5160 12797 901 -4296 -1797
15975 -1797 -3071 4069 4601 3063 5503 1069 2563 4230 -3332 -6067 -14763 -13361 -12781 -7728 -9659
15960 -9659 -10792 -12434 -12696 -5097 -8458 -10131 -9511 -4623 2531 78 7946 12079 8340 12543 17693
15945 17693 13977 -7343 -8711 -348 6928 9057 7642 7082 1054 -6383 -13537 -4347 -490 -3063
15931 -3063 -6114 -1697 2286 7515 7251 8731 -1298 -10249 -15685 -12051 -11899 -12342 -4279 -565 -9370
15916 -9370 -15764 -6428 1718 -7610 -10410 -9797 -8444 -4719 -5625 -9062 -3194 6595 3708 2297 -4290
15901 -4290 -15361 -15479 -14433 -8783 -7384 -10364 -11778 -6607 -9357 -14488 -9279 203 -3395 -9850 -9888
15886 -9888 -4583 8882 12248 18178 13692 -25 -9733 -13271 -16037 -17836 -15446 -11190 -13606 -17559
15872 -17559 -11644 -5130 -4334 -9298 -5646 -15924 -21392 -18469 -9594 -6188 1016 1448 839 6629 12990
15857 12990 16232 14426 14213 2390 -4593 -8440 -4728 -8137 -9018 -10175 -13511 -11719 -7529 -3611 -5115
15842 -5115 -10004 -3648 -2456 197 1701 17288 28816 24108 15797 13484 8905 7408 2720 -3656
15828 -3656 -10229 -12422 -6367 -7671 -8066 -11134 -5131 4052 2012 -6772 -9720 -10853 -4594 4632 15082
15813 15082 13548 18335 18197 7931 1119 1662 -3786 -9663 -1365 3407 6477 6401 -647 1738 -2447
15798 -2447 -2672 -1840 3565 1303 -5009 -20811 -20949 -17005 -16944 -22136 -18813 -6675 2566 365 -5423
15783 -5423 -7371 -4226 -11635 -4607 -4036 -2121 256 -4849 -8705 -3179 5130 3150 6870 -644 -3558
15768 -3558 -1543 -2755 1786 -554 7967 6751 11786 16010 14007 12817 15636 8375 6084 -4896
15754 -4896 -8899 -7909 -9084 -7202 188 8943 14484 5290 2527 1659 -799 2838 -2264 -11484 -20123
15739 -20123 -15900 -9857 3657 1532 -7913 -17111 -12354 -10417 -11533 -17520 -17361 -16201 -7287 -4550
15725 -4550 -396 9239 8322 1734 -12830 -9084 -15203 -17869 -2589 5814 3879 3462 -4001 -10547 -8572
15710 -8572 -1988 473 1661 2819 3728 1184 756 1252 3036 149 2098 1480 4578 3396 -3308 -6540
15694 -6540 1466 4451 4670 3636 5463 6368 -610 3981 11326 11833 10915 9459 2283 -8095 2151
15679 2151 2965 -503 3341 2728 8361 9737 9213 9757 954 -9725 -18530 -17517 -13762 -7036 -8208
15664 -8208 -10658 -14228 -18723 -23756 -18249 -13843 -11647 -3210 6172 7204 9000 9011 2905 -1570 -14414
15649 -14414 -13486 -15063 -19240 -16060 -9516 -6764 -2148 -5719 -6477 675 1295 -687 -3436 -8162 -16039
15634 -16039 -11936 -9628 -5144 804 4766 5543 -79 -6515 -15452 -24213 -14840 -12708 -3697 2016 -169
15619 -169 5049 4184 7353 9536 12617 11608 6852 375 -10103 -2013 5360 11945 19740 21564 18437
15604 18437 12760 11413 1818 5201 12205 4234 -10406 -1279 -2375 -2142 -45 6360 10263 7028
15590 7028 996 7745 12613 6864 -7462 -12512 -7310 -13419 -19988 -15530 -1977 -5644 -8770 -12649
15576 -12649 -9936 -8258 -8965 2604 1924 -8281 -14025 -13134 -10919 -3602 2288 -3708 3494 6356 3740
15561 3740 -5066 -2453 -7385 -3348 1160 7116 7887 11332 8027 2852 153 916 -4616 -13438 -2526
15546 -2526 -3479 -15357 -19682 -15257 -6608 -7951 -19462 -19837 -14180 -8467 502 6980 7472 -4006 -1868
15531 -1868 -5566 -5537 -3806 -5023 -8094 -6991 -6724 -1370 11475 11572 5336 6800 11127 18310 19864 19409
15515 19409 10285 -1201 -1348 -1660 -2469 -14255 -16279 -10642 -9043 -2329 3779 12350 2065 650
15501 650 6244 9632 6773 -1864 4029 5782 5512 13077 16682 4423 1636 4485 4483 -9961 -9574 -7908
15485 -7908 -4131 1995 1541 -5322 -3510 15 -3405 -8420 -1744 6677 4484 -3273 -8653 -12785 -11895
15470 -11895 -5747 130 -8677 -12299 -8087 -3280 -3943 -10441 -14563 -5860 1815 -5938 -14846 -18020 -14846
15455 -14846 -6218 -7207 1204 19224 30197 17860 13333 19216 16171 5832 -4491 -12699 -22040
15442 -22040 -11192 -5249 -10376 -10219 -21017 -18006 -7059 -471 3381 2999 96 -9154 -12171 -13623
15428 -13623 -7265 -3092 -3989 -6925 -8920 -3064 6498 11967 9035 10547 5325 1406 -9973 -21215
15414 -21215 -16855 -4381 3669 506 -4278 -4683 -11399 -2866 -6120 -7000 8893 2702 -6557 -5784 -4502
15399 -4502 -4581 -2658 8423 15563 13929 13552 10802 10782 2532 7790 13746 11106 9590 6745 7703 -167
15383 -167 4245 7811 2291 -4199 1977 -197 3462 779 2536 6002 9324 8399 6033 14463 11109
15368 11109 11190 8172 3998 -769 -3181 1612 4902 9164 2182 -7064 -22491 -22740 -7856 2268
15354 2268 2642 1193 -4784 -108 3768 11446 16310 16543 2274 6964 3805 3738 -2053 -5341 -3634
15339 -3634 -6614 -10239 -8008 -2572 -12856 -9451 1136 3988 3092 4718 3174 4051 8183 -1417 -7429
15324 -7429 -10034 -605 9895 3349 -12625 -13913 -13906 -18327 -20599 -18226 -15084 -14372 -16013 -20918 -9723
15309 -9723 -10083 -12857 -7163 -2600 4759 707 1029 1725 2000 882 10862 10846 2928 -5781 -7206 -5393
15293 -5393 -699 -257 3960 63 -3300 2821 7363 -2411 -11123 -10253 -7031 -1304 2916 17361 20813
15278 20813 24987 24070 11994 6264 13167 12991 7315 4617 -4590 -10751 -12103 -16180 -10848 -11471 -9573
15263 -9573 -6614 -2401 -9326 -6136 -1482 3527 8348 9751 12871 7754 5033 4246 -3633 -6232 -2626
15248 -2626 2993 4277 4215 3995 -203 -6611 -5656 4026 8713 6605 -2018 -12688 -9086 -1442 5274
15233 5274 7147 2269 456 5533 -168 3682 7060 5696 6725 11894 8887 7997 4122 -7972 -10812
15218 -10812 146 19096 24070 11651 2988 3120 1968 -2251 -605 601 -1850 -1379 -2154 -1999 -1844
15203 -1844 9925 9045 -1381 -1905 -12239 -16268 -18066 -11781 -2169 -1840 2595 11961 6662 1376 1347
15188 1347 5553 -6703 -11201 -13044 -23496 -18110 -5332 -4811 -9897 -12875 -1956 9537 5165 4991
15174 4991 4815 -3616 -4548 -12924 -13921 -5992 -1257 8634 10972 5797 531 -6659 -8419 -4242 -3568 -6250
15158 -6250 -6541 -3164 -3021 -619 -16264 -20265 -5435 3975 5810 -576 -10012 -21003 -28237 -26363
15144 -26363 -17687 -13387 -19173 -27899 -27415 -20084 -6320 -960 -11004 -12318 -11440 -4118 -3743 -5967 -3976
15129 -3976 4207 13848 21867 15951 3750 -6633 -11319 -3164 10603 3603 -511 -2326 -882 8946
15115 8946 18840 23261 16522 11848 8961 -3684 -5353 1259 5186 288 -3552 8308 8268 1203 -11305
15100 -11305 -13228 -7406 -1432 1752 7495 5458 3353 6518 8737 6461 13585 9016 6173 4523
15086 4523 7487 14421 7095 183 -3834 1052 5923 5901 2531 -5621 -18086 -16374 -6096 -6161 -7702
15071 -7702 -6484 -8397 -4824 -3171 5824 8120 1658 -1436 -86 -1403 -806 11256 10022 4678 10421
15056 10421 4356 7192 9762 3318 485 -6538 -1148 -1978 -1302 753 -5737 1264 -703 -4308 -11706
15041 -11706 -4194 -2056 -11868 -13821 -1926 2185 -11646 -17449 -15889 -9105 -2985 -2815 -5914 2920
15027 2920 5170 17190 24675 22867 13797 4077 5307 1755 2487 8693 1557 -1638 -1828 -3429 -1887
15012 -1887 -400 1397 -1808 85 3338 6456 3125 3299 3128 6360 12939 4719 -10977 -5198 3853
14997 3853 4728 -4009 -3650 -15163 -20108 -10551 -7026 -17249 -14191 -9183 -11101 -16711 -11893 -5612 10239
14982 10239 12976 11016 16911 19559 12098 3091 5425 200 -3176 -5504 -8916 -17847 -15136 853
14968 853 2912 -83 772 9157 7052 8786 4093 -1723 -5584 -2574 2693 2061 4309 5823 2759
14953 2759 -78 -2484 -4433 -13137 -15382 -12244 -5084 1347 14 -5065 -6474 -681 280 8681 5798
14938 5798 4396 2419 -6713 -12641 -3584 5600 7543 5699 2010 -370 -11770 -8700 -3892 -6597
14924 -6597 -7835 -16024 -8975 -5640 -91 4143 -2429 -7891 -10268 -9155 -6810 -9911 -10821 -2932 -3443
14909 -3443 -3107 -1741 6538 3420 -5648 -1027 -4348 -3137 3003 13651 9108 -2693 -7834 -4086
14895 -4086 -5300 -4179 -6390 -9233 -4680 7013 6911 5841 94 -6621 -3124 10187 17901 11815
14881 11815 11858 8266 11739 1069 -2741 815 259 -569 -603 639 8406 835 -5136 -959 1794 7731
14865 7731 2684 -318 7893 6493 6745 9285 12816 8945 2209 1256 7960 18268 8735 -6802 -12451
14850 -12451 -2102 1412 10678 10244 13040 5786 6428 8932 10329 4635 -6498 -8028 -2535 -214
14836 -214 3924 17282 16982 9480 11156 5863 3215 7576 13831 6037 -1325 925 -146 11778 13010
14821 13010 6642 2662 6505 4578 3459 10106 19790 10117 1675 -1120 -7773 -6807 -1833 2028 -1803
14806 -1803 -4285 7075 12120 8946 12273 14723 15558 10161 1611 3055 9869 1490 -1736 -1131 -2150
14791 -2150 -450 -2524 -11188 -7512 -10491 -10877 -2279 5006 3919 7291 5602 7039 2511 -2555 4583
14776 4583 11018 7685 -875 -4564 -3397 -7043 -7838 -1347 -2374 -10473 -14471 -14693 -17667 -12343 -268
14761 -268 1929 1035 696 -3589 -2600 -2958 5682 9588 5162 2972 -2985 -5613 -9668 -6507 -648 2351
14745 2351 -2637 -12278 -14014 -2415 5954 3724 2483 13716 23905 19647 12880 15763 13970 11368
14731 11368 20123 17158 13787 17711 10176 1289 741 -3165 -3352 -5713 3126 12758 11742 -4046 -7650
14716 -7650 -3986 1422 10277 17774 20489 12302 1920 2368 9221 801 -7841 -1695 7305 3457 6099
14701 6099 7804 1871 1401 7761 13204 11946 8120 6601 4497 -2316 -4757 -4823 3880 9812 18901
14686 18901 18035 10105 5347 -1126 10151 20277 11540 569 1637 1462 -5446 -13182 -5123 6204
14672 6204 -2706 -13081 -10699 -5792 4381 7390 2614 2507 -639 -209 5102 7999 8438 8322 4301
14657 4301 5658 9927 8830 3775 -6367 -5939 -6107 -3536 -6840 -2835 -557 1819 -1942 -5613 -8949
14642 -8949 -9410 -2171 2750 2559 3084 9836 4597 -80 7396 8195 107 6674 7772 305 5616 12269
14626 12269 15885 14677 11099 10449 5745 12230 11402 10945 1775 5384 11628 5870 -1866 -6980 -2664
14611 -2664 5175 1626 -3078 917 10321 -1136 -13532 -8881 -7003 -13471 -22956 -20083 -18093 -13693
14597 -13693 -12716 -10101 -4368 -10846 -7072 -4787 -3207 -3872 -13650 -8287 -8845 -11140 -35 -2744 -831
14582 -831 -6262 -543 2303 -8270 -9778 -3329 1878 7206 12841 11776 7399 4749 -1813 -4337 -941
14567 -941 -9294 -22980 -24551 -21091 -8766 -4346 -5461 -2173 1409 64 -6574 -7597 6491 2599
14553 2599 5078 15166 21195 16907 11894 10346 8785 13160 8102 -3839 -17541 -23790 -13230 -11606
14539 -11606 -6782 10216 10751 4105 3547 5450 692 2723 -2589 -5895 10728 10576 9051 10204 18825
14524 18825 18937 14865 12672 12547 13941 7169 -3033 -5691 -306 -864 3886 15356 18830 5480
14510 5480 -633 -1248 -500 -6338 -6756 -3743 -1529 1916 6276 9474 13821 19093 14145 11486 9184
14495 9184 5823 8798 7275 272 -1895 488 4564 919 -5030 -6110 3721 11886 11059 12616 11912
14480 11912 12296 5470 5670 15411 11613 599 -2220 -3117 -7565 -2774 10893 7274 8999 15572 17208
14465 17208 6582 -172 3449 4285 6151 10147 11016 2090 2763 -97 -6438 -1316 9314 555 -5261
14450 -5261 1095 -490 -1507 -9450 -10670 4717 14626 14870 6887 3004 -2825 -6761 -12691 -12747 -7960
14435 -7960 -6001 -8004 -2193 -549 9701 7062 5898 11378 16212 16200 8296 4860 687 8124 -2665
14420 -2665 -20383 -19848 -13694 -9655 -8878 351 2557 2410 8155 12769 5758 -2782 -7918 -16408 -3048
14405 -3048 2788 5749 6611 7569 5338 4994 -915 -6602 1163 6207 6697 -3065 -9570 1455 9626
14390 9626 16697 12488 2426 -10178 -21879 -17662 -9513 -2394 1657 -5319 -6807 -12385 -9068 -4430
14376 -4430 -3957 739 12967 21722 18729 11177 6810 -3809 -4429 -9874 -4846 6456 15063 20306
14362 20306 15076 4489 1148 -12549 -8800 -7903 -4005 10031 10744 8926 14701 23980 18113 12788
14348 12788 13639 11591 12013 7321 10665 11643 11329 10167 3486 -1231 -9500 -1345 4009 3130 -2367 -1800
14332 -1800 -3350 890 2076 183 4512 293 -289 -1609 845 5683 1169 5605 9642 19110 17684
14317 17684 12458 10836 10352 7969 4234 3812 5740 18242 19006 11411 10961 10164 5852 4647 -2439
14302 -2439 3929 16561 25083 29700 28921 22181 13922 6387 5879 1318 1518 5824 3799 4320 10096
14287 10096 2329 -1987 -2928 -2257 -5174 -8494 -9051 -12170 -2007 -2148 -819 5054 2567 -3069 -1784
14272 -1784 7864 7638 674 -7455 -4069 -7569 -4208 -4545 -3915 3776 14114 18188 17692 9347 10420
14257 10420 11826 8094 -1095 -1101 677 -4842 -604 7257 1368 -4725 551 -1285 -6157 -8666 -5411
14242 -5411 2010 -6575 -3793 2321 255 661 2839 6775 5515 -180 668 -523 -7452 -2060 -3039
14227 -3039 -6654 2916 9340 4276 -4329 6333 21439 22122 17530 17394 11859 10213 -3149 4121
14213 4121 12169 12620 7701 3307 13374 15533 19183 10926 2098 -5631 -8799 -5904 -12229 -15897 -3539
14198 -3539 501 -494 1690 3113 -3675 -8323 -9188 -12386 -7670 -2620 -1199 -867 -1176 933 1874 -6579
14182 -6579 -3532 6707 9769 10622 1021 -4396 8952 17277 19417 11651 6168 6550 4149 791 -459
14167 -459 -701 7149 6706 5479 8893 10229 12552 11969 7977 12091 12656 9686 20 -7977 -6911 14413
14151 14413 20374 17059 12350 4360 775 7982 14077 19513 15908 12494 6053 1593 -866 -3730
14137 -3730 6355 7731 4911 9021 10941 11201 6733 10192 14540 11941 11668 19677 14840 9302 11753
14122 11753 13030 5154 6627 7017 8472 11328 11052 16773 3641 -7393 -3129 4146 3656 154 4405
14107 4405 7437 -3102 -5974 3542 6010 4660 -7817 -13757 -5390 4959 7677 10014 4088 -468
14093 -468 -3921 781 768 14158 24838 24456 27272 34553 37176 33649 35239 34383 26699 14346 7782
14078 7782 14692 14191 6559 2544 220 -5487 -6061 3601 14085 14571 9684 14162 12564 14608 17315
14063 17315 19774 10286 -1470 -491 11904 10922 2954 -3995 -5136 975 12689 12797 16368 20733
14049 20733 7439 -5904 1221 9215 9672 2781 -653 -7118 -3024 30 2566 2572 1 4346 3624
14034 3624 717 6782 24767 15133 2044 -924 8878 12988 12945 8479 5915 5106 8455 8452 4674 7321
14018 7321 11754 11181 5657 10649 9061 1377 -2143 1560 -2747 -2039 4009 3476 6162 5817 12168 19990
14002 19990 10790 1404 394 6150 7253 8683 8882 10168 10641 15796 16307 9045 9230 8194 8222 14613
13986 14613 17927 16734 7416 8413 10665 11083 6837 9288 8919 10417 12227 11872 12313 7596 11132 1576
13970 1576 -6769 -6886 -4096 -564 639 -8171 -13319 -4158 10198 17468 19262 21335 25362 18317 11402
13955 11402 16099 10306 1441 2512 7010 6197 8319 7338 8363 7902 5852 8650 14091 18303 16840
13940 16840 5368 2670 11960 11307 12794 9362 4389 468 -3681 1207 10945 17755 17648 16036 13417
13925 13417 17350 21029 12996 -908 700 -337 4456 3283 -2194 -3582 -1664 5287 13227 8426
13911 8426 3825 922 3022 4925 12101 8781 10458 15371 9910 9786 11000 14079 16967 21774 17167
13896 17167 3979 942 -7743 -12989 -6592 -16 -5217 -3189 -520 -8477 -3850 3728 9707 17872
13882 17872 20950 21441 19968 16254 13082 9585 13511 17983 7351 2060 11295 13749 18131 15901
13868 15901 6705 1971 -450 -7118 -12951 -4547 -1817 8238 14505 17828 20711 14473 12169 12298
13854 12298 17372 17984 13297 6974 6647 9843 8746 7845 6228 14228 19635 10329 -3485 8645 12757
13839 12757 8381 5057 491 4365 13168 16878 21177 27690 25251 17465 6192 2101 1267 2212 6314
13824 6314 6406 5600 6702 5747 172 4522 8388 8660 9891 6393 -892 5164 20626 21378 17952 16456
13808 16456 11268 8479 16160 23516 18689 17435 15883 12527 11513 -4244 -3511 12671 22275 12646
13794 12646 2154 9100 10761 9777 21004 26040 26458 26925 24041 19436 27771 21653 20478 15748 2210
13779 2210 6965 14227 18808 12271 6668 5116 11798 28204 29169 29210 34292 28040 23130 11048 2555
13764 2555 8776 3530 8000 16241 19503 16797 20979 25032 24832 15635 13830 18828 18611 6897 3132
13749 3132 15159 30005 22901 13827 8279 13714 15791 19148 14125 9652 14826 16681 19577 20176
13735 20176 26241 21402 8524 10850 8689 3878 6022 2790 690 1602 6529 12598 20266 23468
13721 23468 25639 20292 20856 20293 11652 12616 16072 13880 13822 15370 21858 29655 32801 32365 31279 24747
13705 24747 22858 18794 17124 15782 10896 17852 15763 15662 7937 6916 7424 14483 23981 30946 30620
13690 30620 23436 15180 16065 14456 2754 3631 6641 15068 12151 5983 4819 11825 13187 12101 14812
13675 14812 12214 13906 11664 13032 23755 24445 19087 15322 17533 24209 21655 17579 18973 15114
13661 15114 13858 19408 24873 21870 16580 14050 20046 10462 4953 8042 20548 20459 8791 5242
13647 5242 7409 -588 -4142 17110 32412 36347 35509 31480 27406 23887 24097 26638 19148 24927 22364
13632 22364 19910 30977 36737 37635 34948 26071 32437 34681 27360 17649 17355 16884 12045 10726 20972
13617 20972 27439 22938 14931 13676 13403 5801 1182 3022 12224 20431 17755 13192 16586 23468 22867
13602 22867 21488 24219 24530 16226 16485 12835 4649 17631 30168 32250 35412 39798 32779 34793
13588 34793 30697 27926 25690 23549 20682 17787 21155 17500 13233 12275 11602 12726 11272 12625 10915
13573 10915 17980 25559 25560 27502 25371 26032 30775 31173 31418 45681 46216 42484 37240 21056 25867 28099
13557 28099 19067 23398 29176 24747 27401 26033 32310 33815 33609 16839 15443 26557 24592 21830
13543 21830 27591 29797 30758 30521 33157 36197 30900 28869 23338 22522 25486 37372 41778 44097 48054
13528 48054 42044 29538 16363 16138 21321 17882 24202 25610 28578 26943 32290 33685 39223 40306
13514 40306 40440 47635 40604 30155 29209 23183 26625 33240 36436 37376 33733 28861 23589 12483 23874
13499 23874 28417 29872 27183 31017 31680 28545 18445 23006 29275 23417 33928 45152 41502 40600
13485 40600 36879 29967 30636 27233 19306 23214 34817 30658 30972 28177 27367 36361 27203 21465 30323
13470 30323 27478 18299 22686 39062 36689 35851 39796 49255 52471 45017 37590 37439 36743 29105 19886
13455 19886 13673 19673 13927 17160 27651 43683 47765 40657 33149 33610 31886 34878 40308 40730
13441 40730 35710 27737 21098 24112 24466 29699 33599 35907 39755 35992 37802 36922 41226 49311 40621
13426 40621 26386 16460 20419 25630 24369 29270 38467 35835 43343 47272 44758 35474 25316 27162
13412 27162 39039 47810 40772 32522 34858 29219 21226 29140 25937 30793 33776 36861 30235 29422
13398 29422 25138 24474 23338 27951 34788 38397 41359 38558 33551 31135 18957 12600 17214 20589
13384 20589 25478 21023 19838 19905 23392 32301 40008 32876 30259 38978 30122 16233 15160 17690 21915
13369 21915 34409 39284 34254 34463 32375 29800 28440 29781 24276 29359 41669 41159 34357 34954 44386
13354 44386 44548 40076 39251 28397 21154 24431 26397 32752 37766 38900 39723 39606 31645 32232 38700
13339 38700 43324 37665 43689 52127 63360 74656 66238 55593 50305 48510 50184 38180 39929
13326 39929 49249 55655 49530 49353 43560 35429 35442 36156 36898 27146 27809 35373 38140 38524 38392 46906
13310 46906 59896 57742 49131 44678 56380 54784 48473 51111 60180 54737 46864 52337 43790 37023
13296 37023 44220 44552 40916 41446 39977 37758 30244 26467 25940 30812 36597 37666 37378 32439 28530
13281 28530 31806 35248 39129 36186 35293 37145 38249 45956 49355 49991 57977 63751 59779 67341 55491
13266 55491 49613 63538 70826 81938 93119 102630 117050 128858 139014 151821 164643 182540
13254 182540 205285 235110 283827 352899 465606 611347 821142 1084259 1375284 1647737
13244 1647737 1862530 1939134 1800213 1518204 1155311 839207 617470 478666 393678 321042
13234 321042 271542 243445 216063 201960 181795 166411 160629 137302 118164 116379 117860 112588
13222 112588 116247 117157 109099 98491 88545 88238 95675 92368 93045 98382 88346 84911 85694 80943 86387
13207 86387 87909 80543 72046 74471 83098 84091 78575 73464 66921 63782 69413 64129 66371 67469 74490
13192 74490 76638 70888 62115 70477 84132 90764 89970 91490 86714 84815 94165 89610 84576 88873
13178 88873 91554 98721 101763 96724 93712 93484 89673 88202 85811 78767 76513 72509 69141 66510 70895
13163 70895 67751 69118 74047 67173 56694 69563 65569 60051 63955 66763 66288 66206 67692 65509 66281
13148 66281 74690 74917 77191 85046 84185 79864 69837 62327 66645 56044 53459 69470 84337 79537
13134 79537 79594 83078 78967 78672 77385 70717 65704 67594 79295 81263 70917 74099 83894 81107 79084
13119 79084 91069 102743 107239 120944 128657 140218 151944 167403 167687 166784 155618 128251 101885
13106 101885 86382 85630 79273 74268 77725 76272 78895 79273 75361 77435 84656 88878 86708 83164
13092 83164 93421 101600 108955 107100 103193 99529 93969 102603 100146 97706 99125 90970 79827 83787
13078 83787 86892 98388 111545 126509 142054 154633 175828 186439 168787 153376 140873 134076
13066 134076 144208 155330 175161 201122 220992 236541 258937 295898 334429 366786 389588
13055 389588 405136 396755 387120 356274 294661 238607 182609 151593 138783 128712 114851 105808
13043 105808 98643 97822 97506 105999 104106 101948 101760 98796 95506 100807 108294 110299 101548 95050 99540
13028 99540 107087 109443 101043 106048 111927 124766 142353 162913 187845 209495 224750 227416 217203
13015 217203 184915 154203 143456 147475 145435 144984 138612 137483 136431 135730 131380 129076 116591 110441
13001 110441 102348 90422 89336 104205 114818 118465 122987 136186 152249 158662 163448 168679 175496
12988 175496 186613 199858 205478 197126 201303 197161 187121 188673 190882 192182 203866 215038 229850
12975 229850 243393 261998 262373 261876 258909 240065 238972 252404 262200 264388 253927 232616 220557
12962 220557 214520 217622 220059 228692 224017 216445 209562 198420 191483 174037 155216 142105 139884
12949 139884 151331 167431 159998 151266 157957 164104 172761 182371 184824 193671 211904 226014 238066
12936 238066 255690 268636 276960 285844 299276 319877 342121 370119 395329 408394 408338 400981 370737
12923 370737 336438 311826 297613 276357 252150 236767 222007 216556 212019 204996 203126 210768
12911 210768 221336 231997 232326 242255 262680 290225 313956 331824 335438 331332 336874 345384 355679
12898 355679 350966 351268 358475 368538 364817 348526 351399 355494 365550 381645 385462 385508 392336 404100
12884 404100 415760 437524 457248 466733 484132 493079 498259 510367 534904 560081 585922 600340
12872 600340 608183 613215 622008 621189 624466 641826 667842 692550 719870 748447 763265 773003 793049
12859 793049 829055 863555 895787 919000 941611 957641 974107 992484 1030578 1076294 1139324
12848 1139324 1214723 1291399 1363838 1435817 1508266 1585857 1667749 1768368 1865286 1965265 2068095
12837 2068095 2181674 2320550 2478759 2645680 2834432 3029378 3232416 3459452 3709729
12828 3709729 3972641 4267537 4595101 4975478 5405609 5906044 6505352 7236849 8112928
12819 8112928 9156091 10412135 11946072 13823923 16170359 19196897 23188827 28582637
12811 28582637 36074413 47051421 63887587 89656391 126269911 172558570 225195912
12804 225195912 279601365 328153996 360329225 358157241 319332872 256358476 184172285
12797 184172285 127528017 91525583 69345977 55068570 45250257 38022583 32405071
12790 32405071 27940631 24388973 21537660 19251588 17407077 15907589 14673182 13628135
12782 13628135 12698659 11864770 11111040 10428304 9817577 9268345 8774252 8325053 7918388
12773 7918388 7552450 7211803 6902269 6617541 6353089 6115626 5905292 5706186 5523544
12764 5523544 5340354 5156349 4984607 4816132 4651821 4483267 4321259 4162217 4012807
12755 4012807 3888280 3784206 3671420 3557258 3442126 3321692 3193222 3073532 2979201 2893239
12745 2893239 2819629 2737385 2662971 2595755 2535663 2464755 2388637 2334840 2284416 2230642 2168362
12734 2168362 2102519 2042564 1980617 1923608 1874020 1833727 1797895 1760319 1727185 1688843 1645154
12723 1645154 1600234 1554488 1520822 1494333 1471862 1452717 1435835 1417638 1391001 1354143 1319588
12712 1319588 1284061 1257968 1236437 1214217 1184628 1156368 1123175 1095556 1072117 1053327 1036896
12701 1036896 1021007 1006543 994532 978021 967336 955636 946144 941568 928666 913747 898654 887683
12689 887683 882622 875215 861842 841759 826770 797886 791808 798425 812228 828729 842125 868485
12677 868485 897864 931778 960996 954118 917274 858553 786274 722679 677667 646546 631397 621572
12665 621572 611605 594725 583688 569946 566486 559403 550965 537162 531849 531026 525728 522068 515531
12652 515531 509619 493403 462758 435670 401228 392373 392811 376588 362285 353517 348561 350904 344096
12639 344096 326580 324267 328860 324010 322960 329502 345959 359247 365794 368870 367976 346252 326013
12626 326013 312544 300052 289982 287192 288651 285503 281410 277216 263879 256985 256471 256434 272800 275367
12612 275367 275080 276015 279510 291557 304888 317844 337902 346602 333854 334957 325606 314123 309450
12599 309450 310076 306514 296162 283178 273395 273134 274770 280872 278276 280608 282298 287177 291218 290178
12585 290178 292090 299763 300152 307169 300275 293394 289956 284648 279700 279261 276393 280953 276215 263691
12571 263691 256977 253074 262335 263156 265789 271245 277221 289850 277998 271220 261787 249862 248029 245015
12557 245015 244592 245272 247391 260187 273822 281267 277530 275633 273381 277353 274086 264769 246807 244647
12543 244647 251151 252626 252829 254521 255841 250784 243768 236395 239757 240213 232336 217736 211068 212393
12529 212393 206817 203905 206995 206554 221904 227880 224195 219290 229396 223272 213858 212582 212945 211600
12515 211600 210219 205813 194284 196481 202284 201021 208189 218853 222613 229953 235535 229050 222841 217846
12501 217846 222977 223433 220978 214895 200312 183553 167818 136090 114123 109986 115110 128290 158687
12488 158687 178199 181611 181935 186283 185300 193659 202415 203549 206359 205145 202143 209839 211590 209406
12474 209406 205593 207965 209509 203901 208019 207129 207573 207526 211165 218381 209028 189844 187353 192232 192951
12459 192951 201651 205611 207847 218880 215907 211846 213842 208157 203973 208323 209889 209631 209994 206944
12445 206944 203803 207666 212652 211118 212675 211037 213778 218680 224053 223383 213114 207733 218488 226553
12431 226553 227197 221792 217859 222953 226061 218781 215684 215678 213674 211814 209100 203711 205827 206476 206792 206519
12415 206519 208327 219855 233933 232570 231211 223024 217204 223895 224800 228648 222521 211831 213251 216441
12401 216441 211837 214375 227903 226603 231176 226334 216595 222174 225823 233887 240322 240385 238582 240135
12387 240135 238291 237971 241053 242782 246075 247887 249800 247479 246930 249466 253526 257781 266078 263303 263883
12372 263883 271282 289744 304125 303860 306820 315470 324097 345537 375781 422049 473154 541624 644035
12359 644035 796557 1001243 1248471 1534346 1809098 2045017 2151782 2064800 1813683 1462139
12349 1462139 1113333 857780 691847 580715 505089 468306 447285 430933 417016 399076
12339 399076 389899 375595 366467 374298 374068 362255 346127 339838 333419 334646 327220 328376 336727 336930
12325 336930 334363 333712 335857 344882 347170 347381 356930 368445 378201 368400 351118 344939 342735 335830
12311 335830 322575 315895 306662 301196 302828 309787 310165 309323 320316 323850 315917 311696 306383 298908
12297 298908 301357 305801 301781 288744 292128 297430 301409 302571 307037 313326 310226 315252 325603 319576
12283 319576 316315 305974 302612 313518 309351 301137 297319 301286 311026 312146 290810 274785 277377
12270 277377 276831 279192 271339 265960 271576 284254 286382 283108 280016 278127 273549 266972 263382 260979
12256 260979 271430 287816 291518 292267 286674 272430 270328 269546 263118 269571 283473 275248 281172 285833
12242 285833 284894 274634 274643 280345 278089 280803 280334 275125 273155 270477 270331 280214 283287 281856 282267 275986
12226 275986 283473 287975 288917 282655 279731 280565 285212 286600 288752 287322 289547 287427 285795 285646 283600
12211 283600 288973 287176 281588 268725 259045 268959 273502 278437 278427 278208 267724 267310 266368 272354 282235
12196 282235 280557 279780 280127 277576 279190 284710 292396 286583 282964 280753 282897 290844 291758 279769 271309
12181 271309 277198 284140 286240 277356 283544 296614 293762 299484 295279 286178 286206 295559 299984 300142 292922
12166 292922 299850 307735 299785 293692 299294 309753 303027 284231 276490 285591 290589 298616 302209 296025
12152 296025 295262 296430 297908 294578 293589 285692 285070 284931 291151 289706 286800 286613 292954 296879 293605
12137 293605 296586 301769 312949 315907 313678 309661 309910 302807 295364 289176 288235 289717 292875 295607
12123 295607 291861 285864 282682 285820 289450 292138 294304 300319 304018 307192 308283 305875 296974 293951
12109 293951 299012 302017 303678 305192 308921 305867 302261 299695 296870 308020 310986 310526 314618 308256
12095 308256 302473 302871 307938 319783 322843 314767 309673 306121 315659 317137 310321 303727 311578 322700
12081 322700 320601 315122 315943 320950 325429 324567 322189 322487 324254 318204 310297 309582 314016 305950 300154
12066 300154 300270 303672 315044 320911 315547 315376 314086 302905 303307 298828 301135 308563 305064 304770 306666
12051 306666 302775 303132 305627 310129 309951 306880 310208 310267 304467 305355 304479 313698 321655 315061 310733 314467
12035 314467 316275 327976 334076 320974 309323 307813 310362 307488 303843 299105 298998 293143 289145 299299
12021 299299 311577 314680 313320 308133 304522 296543 295635 302361 306390 310882 312305 309980 310757 314905
12007 314905 313939 314788 319574 314081 310679 304623 298902 299638 301746 305573 312922 308567 309305 318839 325545
11992 325545 333444 340015 340430 339033 333484 328076 322624 306580 297905 299243 307257 309378 303414 309309
11978 309309 304881 307213 313239 312745 311330 310913 313137 318656 320796 322181 322681 319653 317039 304220 304245
11963 304245 301866 299419 302200 310098 308561 309650 303173 309515 315875 323967 330522 328121 317542 322363
11949 322363 329303 330016 339469 345838 338489 338277 327239 308872 304197 295905 292776 286095 281487 286849
11935 286849 294679 306022 308300 312417 314677 307778 299782 303684 297855 293050 302112 309717 309821 308955
11921 308955 311559 323458 319628 313397 304090 298217 308560 313759 303734 305456 300643 294972 292597
11908 292597 289313 286362 287069 292328 295359 298647 291228 292248 297700 295538 292753 301928 297571 293950
11894 293950 293003 296240 292676 292201 291905 298350 299970 297252 291818 282671 281709 287348 291310 285422 287924
11879 287924 283111 276380 283152 287552 292204 296674 290735 284503 278414 274473 276837 284096 284572 285597
11865 285597 277971 272619 269845 262788 264833 275423 277802 275457 273249 275732 270593 273458 275350 275065
11851 275065 281704 281269 289956 293068 285767 289259 305053 302147 282055 273589 282914 292661 291557 283329
11837 283329 279122 278863 284636 279434 280695 277128 274416 279513 273650 276759 275538 275284 272878 281571 290881
11822 290881 279176 270103 271132 271715 265160 266426 268625 274187 275819 266305 266184 268784 262194 259964
11808 259964 260545 249718 253651 258579 256069 256015 266807 273644 271584 266437 262234 261867 264053 256779 255545
11793 255545 270123 263128 259241 264499 269920 265706 261313 257675 259341 256343 246319 256440 265062
11780 265062 256081 245124 252463 260276 252148 247670 246723 249622 246739 244143 247849 247720 244079 240893
11766 240893 243770 247163 238583 232057 241689 246500 242825 235953 235965 249007 253930 252304 255448 252992
11752 252992 248070 237896 238853 241092 238745 233902 229476 229027 231753 225770 232860 239920 236616 229184
11738 229184 225877 228257 237226 236946 242852 241054 239905 241871 240002 227836 219972 218117 216409 223046
11724 223046 226501 216974 204814 210462 223424 226924 223695 227353 225939 224343 223587 229179 231889 230491
11710 230491 225503 216290 220835 222529 210466 205993 206749 202690 208982 203518 201786 204960 216739 217846
11696 217846 206038 205246 219404 223733 223929 218677 213865 207577 210692 216633 216567 225285 222604 226156 227939
11681 227939 217140 210921 208571 212308 207438 208200 208687 204288 195623 186672 194087 195531 192323 195003
11667 195003 198525 198084 185289 196713 201806 201780 193786 194501 201107 196523 194766 192377 187350 191179 199739
11652 199739 199388 198839 202698 200670 201828 216481 209058 199980 196922 197074 196066 204416 203896 196037 194846
11637 194846 193330 187625 188610 182863 179061 178165 174656 175945 183723 186242 177546 167453 176954 180708
11623 180708 182153 182969 185866 182761 178579 174817 177843 180557 182664 181582 187615 189462 193622 186123
11609 186123 183907 178443 179620 186290 190835 189105 181030 175854 178736 175351 166630 177980 177983 179631 179404
11594 179404 181868 177575 178696 179192 179464 184083 175615 169804 168783 166042 164444 172981 175705 179966 177741
11579 177741 167710 147900 153259 151983 163993 182975 194250 193988 186748 183573 172239 173730 177441
11566 177441 184468 186708 179346 173059 173092 177386 172838 159126 162607 168864 169748 166095 160556 158576 158875
11551 158875 160723 160640 153764 148400 147223 152509 156418 148509 143024 136438 135104 137087 146681 151623 154406
11536 154406 156337 141565 141594 145689 142724 148253 151164 149264 143862 146769 148498 148903 154996 156974 150367
11521 150367 158211 158978 154546 149623 154905 162570 172783 161108 145957 137911 145617 146933 146134 139082
11507 139082 137458 145490 142843 139149 139319 126681 128854 134183 134841 134277 136562 130113 124566 130882 144481
11492 144481 146443 147537 155799 157717 154865 154281 145846 136775 136087 135590 136701 139235 135988 124068 115345
11477 115345 123994 136523 145202 144303 145849 147821 150055 151848 152006 145720 133777 124508 118064 122508
11463 122508 131918 135519 135279 137030 138400 141836 131404 123345 114432 112853 117435 120236 131491 122820
11449 122820 120469 122351 121738 132578 128963 129115 121176 123395 125900 132765 127186 120510 118805 116593
11435 116593 122418 123772 120627 116803 118861 117552 113309 112785 120246 111084 109333 105450 106396 116549
11421 116549 114412 114895 117929 123174 119581 122604 124999 117502 110203 116045 117663 121803 124191 129841
11407 129841 130072 129291 120769 106990 109955 115693 120337 125159 127909 123831 122164 122907 116873 121953 124068
11392 124068 112479 116866 119157 106849 103558 104737 110670 118080 114669 120814 123820 128643 128487 126483
11378 126483 122696 121234 117348 112799 111367 111525 116363 107401 105808 106202 111155 112933 125043 127810
11364 127810 117771 109899 112077 123404 124233 118837 112760 106069 107666 105677 96113 93449 96648 88772
11350 88772 89562 96845 99694 103156 101817 101238 105394 96568 92590 93462 99153 105613 104151 102215 112374
11335 112374 116654 111419 106702 105076 110434 114841 111088 101447 94364 94142 103012 101733 100941 86683
11321 86683 83036 85744 87090 91513 92763 94215 87072 88196 83387 85798 92994 95486 86678 89537
11307 89537 92120 91758 91264 92174 87510 80465 76661 83933 91813 90671 88869 84824 86331 90548 87881
11292 87881 86692 92218 97457 101538 88830 82365 94557 99266 93573 92170 90340 85507 86255 90496
11278 90496 89272 95758 94416 98900 103202 104933 105139 104445 94472 96725 103184 98663 91018 86254 84710
11263 84710 87154 84137 75387 74135 73671 68425 69640 74817 75412 76234 77658 85475 86036 82571 78785
11248 78785 73896 75428 77672 81078 86885 84947 81029 86209 88965 78927 79489 77655 71283 76996
11234 76996 83135 83926 87546 89105 92411 103818 103437 101510 89244 73379 66907 73955 81204 85897
11220 85897 79568 83488 86155 78619 72514 72355 76607 71795 61552 70702 71985 78077 82767 74732
11206 74732 74641 79280 82010 84129 77523 78965 85414 84119 79349 70356 63221 68660 75184 72457 74016
11191 74016 78274 73711 79149 87793 87184 93139 88454 83120 83122 87966 89760 79622 70772 69813 65779
11176 65779 70291 74125 78154 77105 78118 88528 94265 91237 90809 80844 66510 63517 70267 71100
11162 71100 71473 75561 78203 66309 72795 77160 78638 74937 68356 62955 68751 77044 72128 61597
11148 61597 66154 72395 71372 68747 67165 65748 60101 68374 73067 72479 64077 62477 52539 53484 56042
11133 56042 58064 57033 53915 55290 63641 68838 67356 63393 66365 68391 75595 80054 73107 72072
11119 72072 64407 59136 68781 74123 71890 65929 54742 60161 69492 67458 57989 50489 50713 51718
11105 51718 61567 63760 68953 67158 62879 57930 65879 63884 64071 62591 62555 65704 70899 66629 63717
11090 63717 64931 71659 77143 85945 89120 83589 77163 73661 75498 70310 65845 58884 55821 52424
11076 52424 54706 59600 61566 64357 65213 70909 71849 69289 64449 63454 70375 69129 68461 60898 54453
11061 54453 52801 60367 68977 76480 70672 63222 63764 57481 59855 59163 60600 66584 66903 68696 72102
11046 72102 76665 85983 88159 81762 70739 79237 91221 94624 107017 105719 101010 105788 105312 98890
11032 98890 91483 81590 78664 80133 92299 104871 105294 97189 105387 101868 88907 80721 82361 75089
11018 75089 70375 69119 77397 81844 87144 89093 92356 91701 93783 92518 93137 89465 79734 71943 65219
11003 65219 71069 65507 66836 66102 65267 70931 69225 63313 58823 59238 63910 58443 42360 48012 52756
10988 52756 51982 50484 55653 53539 48397 47635 55463 57800 46995 46938 52219 52082 43369 41666 48576
10973 48576 48631 48214 47326 47920 50017 50445 43719 42031 42269 46378 38926 32033 38594 48608 53422 58199
10957 58199 54827 54328 57785 60328 48986 45364 49143 38645 33189 35841 38422 47166 60557 65744
10943 65744 56052 49147 44065 50279 57267 56332 51289 50831 40571 41837 45757 53795 65750 64280
10929 64280 50143 51172 53410 47726 45325 53192 55838 48519 46752 55162 60197 51891 45458 40171
10915 40171 41647 48276 47605 54580 60153 54592 50289 40770 42882 47356 40698 43549 53148 54825 61392
10900 61392 64485 58133 55494 65898 66182 64994 72000 74059 77516 75536 65687 60022 70679 70550
10886 70550 68648 72967 70025 55076 55916 59713 54573 53926 51201 60113 51968 40853 43190 50307
10872 50307 48839 46127 46952 44172 45578 48251 49437 40905 41112 50299 60641 60169 53825 53471 38966
10857 38966 42711 45184 50382 54195 52590 41475 43598 46805 50191 54081 59635 60247 60809 49798
10843 49798 45970 47406 50982 43739 52368 50442 53965 56908 61131 55258 44708 38849 40244 42730
10829 42730 27372 23485 28177 35884 42882 48136 47234 35594 31626 39540 52656 42478 29685
10816 29685 25073 28281 32552 33685 33427 25923 36095 50604 54723 47398 42690 45183 46927 42978
10802 42978 42873 40366 38701 37354 39537 33388 21789 25412 41109 52022 59262 55531 40814 44305
10788 44305 48777 41693 44224 37917 38314 45278 57921 62700 62290 57019 51911 45098 32428 19746
10774 19746 25048 32521 30999 30172 37509 37775 38622 34250 34775 39304 43830 42593 51727 58474 48282
10759 48282 46925 47280 50922 43428 25661 33381 38965 40023 39752 36801 39297 40359 44789 47925 48498
10744 48498 49614 57944 58494 51033 53564 53849 47594 46170 41999 37942 32764 42670 45163 44775 45766
10729 45766 46593 43825 46012 37011 33558 34809 42431 47001 48424 51115 41161 38068 47531 45597 38120
10714 38120 32533 33031 29412 24865 32089 40724 35805 35011 33527 34404 46240 60351 61095 52264 45626
10699 45626 45571 44491 47227 52289 46549 45273 51741 56886 52855 47931 55454 67501 67233 52301 55261
10684 55261 52379 51988 49580 50772 52744 49974 51129 52333 54249 55424 55906 55552 49486 45624 50918
10669 50918 59080 65566 70947 74420 66591 66232 61487 65405 72056 77453 79227 77128 86495 77133 76944
10654 76944 95474 98325 99893 107537 103581 99415 108803 108662 108838 113214 118942 123633 131676 135912 144128
10639 144128 149213 160259 176422 193652 213323 234382 265866 286969 313006 355996 389261 432003
10627 432003 496022 581231 701014 869703 1095297 1391336 1758453 2169879 2593161 2994913
10617 2994913 3324541 3512894 3535897 3444829 3370986 3422146 3658722 4096427 4722317 5465380
10607 5465380 6244935 6971189 7497159 7666922 7394260 6852766 6363318 6142409 6286244
10598 6286244 6753268 7496606 8414028 9339659 10120701 10560528 10417188 9629090 8483739
10589 8483739 7417102 6694443 6363561 6370490 6625979 7025030 7447297 7745799 7778965 7414097
10579 7414097 6646992 5691176 4847126 4246391 3897222 3748696 3734130 3780491 3834838 3831649
10569 3831649 3706828 3415181 2976793 2482752 2034557 1666631 1389273 1184021 1041552
10560 1041552 935344 842691 775498 722405 671808 620599 585555 562845 538445 506300 483009
10549 483009 459512 433667 407097 391832 383930 374901 362543 348199 338985 322620 315095 308531
10537 308531 307372 301584 278958 267123 255816 243304 248593 251150 246885 246737 240848 227851 215977
10524 215977 210150 204027 192181 194684 185627 185871 183541 173619 167471 168745 173188 176894 163136 142541
10510 142541 138395 139411 136471 135425 136843 136434 137970 132855 122222 117606 116219 112501 110403 110020
10496 110020 105185 103853 107678 105603 105504 110953 116004 111066 103216 104415 103837 95518 88769 86537 95043
10481 95043 98170 95035 95064 96613 107187 107184 104507 94304 88274 92090 83347 71969 74473 84196 84641
10466 84641 84957 85123 86948 82790 72392 64859 67418 74613 77407 74445 84658 76552 67321 64421
10452 64421 60244 60488 47418 46190 47267 42850 35745 44634 52643 55924 45979 40172 43664 46750
10438 46750 49547 45575 42677 32249 28653 34301 42866 47136 45401 44025 39392 32993 38362 45740
10424 45740 41427 42157 43916 44549 42013 40843 37274 29739 38347 47403 42510 41995 34168 27661 22024
10409 22024 22102 21562 15710 22190 30789 25998 20611 21316 21779 24314 25014 24786 26294 28534 30734 28481
10393 28481 27753 29961 26059 30914 34016 31366 17427 18509 21348 15731 18248 17540 14173 10696 8111
10378 8111 21358 27109 27404 23070 13701 10651 2472 2397 15390 24841 34512 26223 25105 30928 33871
10363 33871 32622 39056 43469 38545 35151 28833 29066 22038 25143 32908 35023 34095 30192 28965 23022
10348 23022 30617 24338 22188 23918 31186 22439 19151 26241 36159 44903 37674 31897 25402 28278
10334 28278 29932 19877 17144 13911 15159 14102 20564 16528 16344 22765 23259 14934 19062 21892 25522
10319 25522 32463 33215 29920 23724 16718 15223 12328 7969 533 8900 18530 14179 21100 22600 25447
10304 25447 18929 18699 22564 23515 22748 28997 28899 32952 33741 25536 18259 14519 11689 13158 26310 26609
10288 26609 26612 36245 30192 23884 26004 20474 12486 13707 18241 23032 28060 20051 9229 14552 21530
10273 21530 21673 22371 28435 28635 20040 18755 26487 38895 39664 36639 34831 26722 26509 24402 18806
10258 18806 11439 8219 11361 7386 5154 10379 18055 21636 16684 4277 5383 4562 18812 25863
10244 25863 19527 11161 24158 32082 29033 28843 20838 28221 35782 35433 26825 25235 20782 20829 19015
10229 19015 24621 32491 28237 26546 24913 21622 28367 28731 23227 22080 17927 11761 4735 3203 4485
10214 4485 19078 31183 32975 23460 16805 24713 33486 38803 32888 25901 26902 29719 20617 18767
10200 18767 32846 44306 48392 39897 32238 29511 22104 19181 15896 17203 32793 34007 28556 25409
10186 25409 31260 32200 30947 26930 37081 42446 47175 50758 48950 45283 49075 50387 45536 44207
10172 44207 51677 52713 61681 69096 76621 69866 64835 61668 56915 48509 39107 41301 53146 62992
10158 62992 72139 79915 84892 71236 60660 60556 63879 65929 57199 49857 50060 48273 51457 65330
10144 65330 66974 52681 44431 48573 40647 41017 42812 44383 31681 25643 37456 41905 41468 39857
10130 39857 30913 33020 34746 27310 25068 32208 30937 18322 10700 16203 19030 24538 27432 21064
10116 21064 9998 10531 11507 11568 18884 22208 27418 27636 30720 28868 30593 21443 14380 8550 5049
10101 5049 7028 7652 14886 25501 27661 23239 31110 24820 34147 35619 33096 24386 21366 30566 26515
10086 26515 23413 19646 14749 15095 16029 22425 25916 32579 33645 30527 19296 20072 20221 15925 15476
10071 15476 15050 17415 21651 17025 26803 36570 37348 38386 37162 29836 30485 22283 21652 28139 23457
10056 23457 6267 12407 21063 21284 16969 7925 6188 1066 4088 9894 14627 19716 10709 2556
10042 2556 8537 12576 10919 22633 20759 20587 7918 6522 17956 29027 37003 33214 22437 24038
10028 24038 28827 30714 28818 18183 16435 22492 21899 20712 27078 34386 32761 28499 33584 32819 22108
10013 22108 20113 11865 2902 -328 7164 10390 10443 11227 13029 19322 23458 17863 17132 22224 22025 12733
9997 12733 7314 9088 10189 12275 7897 12687 7974 5865 6450 7532 8887 8015 18491 26867 26281
9982 26281 14243 6681 8645 19725 21509 17806 22582 32601 35949 32763 31083 23434 15930 24303
9968 24303 27472 33044 32880 20587 11796 12027 13754 18505 19622 16346 11671 16045 15333 11354 22614
9953 22614 26327 17145 15020 22844 30566 29306 31755 29737 26842 17471 14639 21966 26937 27719 24489
9938 24489 17500 17519 19155 16445 8236 9162 19050 20031 12878 16701 13364 3875 5570 13139 23313
9923 23313 30289 34429 30055 27197 26299 24736 14869 19625 24197 21664 18429 17982 16181 21750 29127
9908 29127 24919 21456 19492 13331 6195 11283 15584 14269 17146 17460 13987 7873 8722 11666 14718
9893 14718 17466 26587 31876 26631 25411 27397 29643 33144 24805 15734 13146 32926 29149 20732
9879 20732 23538 22092 20230 10053 14864 17658 14808 7403 6544 14918 25778 18911 9405 15090
9865 15090 11892 6966 6917 6790 3422 7427 19367 27392 25200 17612 16437 14219 14330 19806 23401
9850 23401 24312 21187 13009 11877 8188 7812 15426 10702 12311 8765 14863 23597 20665 18178 21075
9835 21075 18863 15063 4494 4079 1684 -2667 6220 19962 20943 19621 11606 6798 5982 13594 15035
9820 15035 21519 20494 18551 20484 21743 22546 26039 25170 25128 25370 23419 22547 12028 11600 19736 29113
9804 29113 29563 27082 25541 26543 15740 15140 14271 13784 10637 7971 16878 24261 23356 22743 28921 25457
9788 25457 21238 22682 20487 23562 30291 25328 26266 23842 31625 45663 54383 67005 81888 125536
9774 125536 190679 264484 348468 437435 509123 554283 526492 408917 272042 179405 121564
9763 121564 94172 69298 48973 50636 51152 49420 45996 43736 39599 40907 32311 29407 22160 16623
9749 16623 12045 6947 12649 17945 21080 22325 16567 24571 32052 30071 19434 24904 32920 27118
9735 27118 26158 27821 20815 15897 15098 19015 22186 28386 24827 19509 28334 35735 31579 27046 26665
9720 26665 22391 18870 18976 21075 21632 23152 29076 27587 30868 36150 35666 25582 16103 10810 15010
9705 15010 16798 21384 25918 32487 22204 8052 10462 11304 9358 9046 9075 14442 20687 26478 29280
9690 29280 22815 18619 19227 17117 14433 17529 22383 31825 32020 25517 14734 16819 22526 26590 32963
9675 32963 25734 21282 25723 35071 42151 40486 36267 30024 25075 25699 29871 44174 49637 48284 48254
9660 48254 48136 66241 90955 128627 176888 258097 365830 481571 594409 711247 790411
9649 790411 734384 490121 299326 209240 155227 124206 104723 91388 82574 75336 58378 60897
9637 60897 57524 53578 45287 39178 30573 27767 30531 39637 31811 30820 39199 35057 32782 30734 33176
9622 33176 28585 25480 23034 27839 25268 22173 20422 22322 30011 37112 31236 15039 6115 12969
9608 12969 14669 8356 12891 17460 23022 14555 10404 4005 -484 9881 19599 26987 28927 20424
9594 20424 20000 20475 22868 24112 24479 25749 29852 22433 25602 34322 37307 37904 37316 27889 28161 20568
9578 20568 18144 20604 26005 27056 27072 32516 24001 14560 18428 19813 11655 12283 21424 17796 12278
9563 12278 11997 13266 10912 15921 13053 3748 511 20 3586 10461 12336 4119 1751 1733 10074 10425
9547 10425 2190 7983 16849 20666 8312 -2608 -3085 2275 12433 10354 2553 6429 13477 16886
9533 16886 11804 8371 14079 10548 11831 13883 16046 17136 9423 14926 18888 20125 18467 26529 24650
9518 24650 40650 43698 34235 22301 23181 31396 25014 17276 11187 3004 2974 11418 12837 5259 -2231
9503 -2231 1955 7167 14072 16826 6576 9114 10122 19297 18475 8032 7126 9773 19194 15383 17501
9488 17501 28409 32220 29804 23788 22099 14694 16034 22168 25604 25177 24968 22529 11481 15132 9353
9473 9353 664 5426 6467 17991 22969 18428 13085 15617 782 -4501 617 4686 14051 13874 3017
9458 3017 3045 13072 18382 19310 11670 10784 12824 15409 22025 23073 18012 18786 19660 7468 5457 4752
9442 4752 3698 7834 32663 49274 52114 49233 36294 29560 24649 31315 32061 18094 16813 20731
9428 20731 22381 23696 26186 28708 30619 36106 37465 44039 45789 43838 52009 50283 49105 49669 46729
9413 46729 48913 48823 40815 38869 37826 43637 41729 41420 39479 35732 42328 52813 60501 71145 85430
9398 85430 94075 105318 113024 118839 109982 87736 67202 61944 55992 53099 43875 41515 41067 40176
9384 40176 42225 56078 60560 57685 50717 38016 36628 40601 41658 52029 55219 53928 52700 51847
9370 51847 44604 41936 36681 38946 33800 31098 32594 32101 31278 39378 46835 48110 54939 48254 40655
9355 40655 37110 33809 34786 40291 39970 27888 23653 27646 22205 11000 4039 6088 13223 11495 9766
9340 9766 9735 8491 13752 11559 9853 6168 13347 14169 7994 2088 -3230 7095 12376 8441 13867
9325 13867 12477 11077 13046 20110 16671 16374 7718 -8925 -12335 -6860 -6314 3041 6453 -697 -3490
9310 -3490 4256 6880 17695 25182 19457 19424 21672 22615 28109 32736 24923 24008 27135 27183 22978 19471
9294 19471 22049 21189 20362 21427 9451 9610 5179 15349 27683 31022 33668 34761 38898 35902 28899
9279 28899 15489 4618 4490 6955 6140 17626 22480 15571 22892 23673 22374 13690 12450 15762 11730
9264 11730 13991 13873 14400 14596 9477 3450 10480 18036 25262 29906 29170 18363 10248 8896 9038 3044
9248 3044 -5411 -497 3676 5575 5285 -2388 -983 7927 13286 17168 9955 5202 6804 6264 4258
9233 4258 2797 23 102 9787 11158 4444 8693 11650 5246 6763 4221 15360 12474 3524 4945
9218 4945 8735 9691 6516 7118 15978 18388 16248 17678 16953 18606 18104 7943 7069 -1702 9079 17156
9202 17156 20845 15637 10438 17394 20122 16560 1931 -2664 1872 11177 15556 16904 22450 20502
9188 20502 19248 19328 8972 2940 530 4991 9269 9363 6710 8069 22170 27258 17562 6313 -1542
9173 -1542 8230 18345 17863 12766 12986 11861 5406 8268 13724 15322 19409 10831 1719 3819 4712
9158 4712 5409 9503 12187 7702 11455 15443 7721 -533 -6858 3220 673 4780 6011 4444 4906
9143 4906 6119 7304 11476 13278 12022 13234 13943 15683 11029 2142 -4135 1721 -86 -1221 3559
9128 3559 5556 -3645 2 664 -3953 -7316 -3938 3597 -531 -2709 236 11199 11238 12079 11566 16585
9112 16585 23344 20436 18400 15906 8598 8530 10198 15913 13376 9526 24 -9027 -7875 -5006 -1968
9097 -1968 -88 -4995 -6154 -3530 4040 9884 2996 7631 13055 11456 833 2278 4545 -3893 448
9082 448 -1376 4842 10476 5105 3687 2929 9394 8966 7783 8966 17319 13914 12407 5994 9845 12517
9066 12517 6843 6530 4874 6787 8560 10823 3376 4848 404 -6219 -5223 -6518 3489 9220 7648
9051 7648 8581 9429 6127 -557 -2564 10311 10944 4750 -2694 1338 13363 15959 7261 32 1287
9036 1287 2418 -3276 -3428 4614 3870 4094 7602 6142 9103 13502 10109 1158 -262 -3745 -383 736
9020 736 4716 5775 6451 7942 11538 6804 8897 11016 9973 5922 2599 10203 12654 3242 3264 8781
9004 8781 19790 21541 14790 21255 12838 9096 7459 5485 8361 6175 4040 3489 3258 13159 8592
8989 8592 2611 -3943 -13714 -17359 -3985 -685 1252 -970 -5419 -5133 7199 5371 9281 11090 15613
8974 15613 6003 5522 5038 4903 -105 14584 14141 -1381 -7085 -6867 -6064 -12775 -7202 1131 3838 11482
8958 11482 7472 266 2227 7245 13450 11381 4123 4093 11774 12184 13997 11532 10717 2610 9568 9758
8942 9758 5608 1691 -968 2718 -5586 -6012 -5843 3892 2758 6033 6053 -1204 3101 8567 9604 7555
8926 7555 1777 -5452 5064 13896 13343 12299 5779 3345 12270 10069 5754 7709 2553 -4406 1854
8911 1854 4237 4407 4744 -5415 -4050 8509 2896 -484 4937 1390 -7209 2364 7566 9769 3124
8896 3124 -404 2035 869 -1312 747 10263 8769 6986 7464 -375 -589 11856 12641 9596 4168
8881 4168 6599 3100 4745 8112 5140 5147 4109 10921 7494 3284 4872 10933 15375 9696 11008 6314
8865 6314 1063 -1356 4379 31 231 5231 5427 6193 256 1991 6089 17428 12340 3909 97
8850 97 5831 -334 -8561 -2790 9899 3754 -6304 -1660 -5106 -12663 -5902 6278 14763 13443 6755
8835 6755 19402 21015 15046 8906 2029 7048 11247 2569 -2368 -750 2783 5280 9414 17186 23214
8820 23214 18574 11101 7979 6413 5180 3100 3182 -98 118 838 7904 11622 18686 11278 633
8805 633 -6704 10048 21882 19862 7127 -8462 -8983 -4073 711 6760 -1314 1127 5389 10616
8791 10616 4712 2914 10485 13356 23094 31946 24504 8710 4484 12167 18798 16462 17737 25336
8777 25336 28126 24333 16994 12883 17259 19763 29980 40775 50438 48737 44436 39748 33858 28554
8763 28554 26110 14700 14644 16594 14708 13144 22812 31206 28334 25272 31652 27992 9700 6621 13657
8748 13657 32154 29877 18002 4984 4792 4779 10769 14496 19671 18897 27723 28590 24292 11106 7161
8733 7161 6899 1957 -1764 -3789 -9638 1634 -150 2177 10790 14469 13193 -1343 2594 599 721
8718 721 5202 7762 8977 6667 8806 4642 4697 9467 1981 -8067 -7434 -7524 -3799 -7826 -1507 -989
8702 -989 -51 -2343 -1739 8422 3782 1279 5765 14736 24915 24582 13101 6170 7543 9499 11608
8687 11608 -850 -5024 4552 12402 24503 33204 24851 21443 7966 1857 7575 17042 24860 27151
8673 27151 13776 4971 3059 -5417 1396 10141 20959 24699 8907 169 -9051 -12876 -6799 2756
8659 2756 11750 14739 19174 20259 23892 29093 31912 26779 19691 14772 14805 18313 20127 20012 8154
8644 8154 383 934 2360 5025 5323 3394 10130 17638 16063 7917 4447 8595 10144 12877 3682
8629 3682 -3207 1900 11272 5285 559 2417 -894 13871 14708 9782 1552 8126 14160 20737 19657
8614 19657 16171 14934 12572 9577 7850 7217 6292 12519 13633 10844 12061 8804 12909 15010 12903
8599 12903 13733 11104 3750 12611 11380 9180 13600 17934 14293 15770 13828 11941 1085 1758 16407
8584 16407 27798 24897 23032 27558 18826 8567 14701 17715 13707 19685 24775 31844 23611 12455
8570 12455 20591 19023 15744 13751 10328 -2230 -2918 5911 14790 29857 27121 19744 16219 11597
8556 11597 18171 21929 21048 23183 15757 3988 9323 12609 15598 15076 11963 14344 6966 -5785 -7622
8541 -7622 -12039 -6139 5524 6501 7800 7059 -1474 -1905 7198 10217 11098 10365 11164 12201 23405 44431
8525 44431 52485 58911 69628 83884 108463 131765 156490 154970 112534 72031 50054 43051 39190
8512 39190 28237 17462 17330 5719 -236 3803 13837 17072 16391 15976 16985 11522 10708 16063 19246
8497 19246 16339 16009 18303 13425 3544 10606 15272 17025 17126 23436 26174 24239 21270 19067 23668
8482 23668 32468 41951 64603 107905 145472 177652 212784 251855 282901 277212 204852 128894
8470 128894 73517 51257 45726 47916 47736 31236 17736 8645 5548 11814 12696 13101 9916 8096
8456 8096 10768 13277 5588 857 3779 15480 9196 11317 21367 22347 16350 11444 14498 11894 11601
8441 11601 16566 16499 13431 13444 21614 24415 29735 49182 67776 73456 82915 109273 136394 139174 111722
8426 111722 68890 46401 42960 36357 34226 44082 46712 47674 34060 27028 11594 -2965 -4766
8413 -4766 -1221 11810 15192 17520 16341 16155 14517 18185 16524 11476 6859 4677 -3721 -7584 -3062
8398 -3062 -2186 1587 10841 11286 8456 12313 24642 27184 32514 38720 35497 42060 47970 49951 45083
8383 45083 39487 30621 32441 29786 27469 15774 20551 30152 25023 16365 14938 14154 10816 8061 8907
8368 8907 6294 751 9994 4681 2419 19751 26926 13250 2518 5178 17919 23396 24526 24807
8354 24807 7612 -1043 -3511 729 8612 9764 -993 11060 23752 42751 62388 68730 80017
8341 80017 95694 90202 68637 61453 51174 38658 30883 22692 12582 -3664 -6518 1386 6936
8328 6936 13879 13224 12631 14832 8599 6495 4971 -102 -91 -9140 -16825 -1169 4487 415 3841 13275
8312 13275 20368 20319 13639 7825 11240 14260 20021 16017 12340 21122 26730 40057 46164 56798 71920
8297 71920 72581 65264 59696 55517 36113 27730 18348 14569 -1820 -7415 -6519 -7093 -8640 -4045 -4610
8282 -4610 -4675 -7192 -3031 1069 2372 -5753 -14205 -13534 -8164 -3561 -4395 586 1450 2044 13020 17113
8266 17113 7009 3774 -2392 -5829 -7650 -4769 996 1945 -5203 -7399 -6668 4557 11206 7463 -990
8251 -990 10652 9437 -21 351 6822 6340 9814 513 -8911 -9575 -8282 -11380 -13946 -15245 -6088 8121
8235 8121 14795 19508 16847 12738 13723 19098 14443 12941 13441 1913 -2554 10366 8200 3470 -2061
8220 -2061 -3746 -3713 -1588 3550 4594 1438 -442 1388 12714 14936 7719 8531 18658 20915 20335
8205 20335 15061 19237 17094 2972 -5411 -999 2804 1939 9744 11470 6302 5195 4759 -2193 -8649
8190 -8649 -4993 -9256 -9660 -12274 -9991 4158 12950 13736 15325 17099 14679 7357 7236 13992 15720
8175 15720 11072 14799 13934 9426 9250 -2418 -15593 -14622 -4938 -3664 3776 10513 2014 -704 3427
8160 3427 918 385 4041 3551 10527 12351 2626 -3907 -3988 1244 1894 -2231 -190 4869 7192 15740
8144 15740 16886 9479 2056 -5474 -8146 -5076 -7023 -3674 5896 5285 1124 3447 4005 8897 11400
8129 11400 6858 2945 -1300 -104 57 -2107 -12259 -22404 -19637 -17142 -18277 -17146 -11397 -11090 -932
8114 -932 3800 3422 97 -6666 -7786 -10893 -12932 -12978 -13529 -9334 -6528 3481 9131 2811 -8152 -9536
8098 -9536 -5225 5227 5426 1573 15677 18570 18890 18133 14775 -921 -10021 -20763 -21490 -23270 -24965
8083 -24965 -16247 -14213 -9482 -8292 -9092 -4088 332 5553 12400 11480 -5828 -7945 -10875 -13967 -15404
8068 -15404 -13522 -9880 -5074 -8592 -1965 -6806 -4290 -3765 2807 584 3608 9990 13256 7182 3773
8053 3773 7091 2679 5962 7264 -1036 -2928 -3158 -6708 -9844 -4416 1772 3206 -7857 -4353 -8006
8038 -8006 -13537 -8472 97 4809 10448 12212 8182 8520 1689 7847 14540 11873 15325 14234 14807
8023 14807 9547 -157 -5296 -5183 377 6272 12956 15678 13046 7287 -4503 -6847 -5739 2025 997
8008 997 -3526 6788 16769 14820 6186 3339 4605 23983 31058 15462 7052 8989 4849 3436
7994 3436 6587 2395 -1905 -8361 -7797 -4234 -4282 -1258 -1905 52 -1551 -7107 1364 11499 8103 -1502
7978 -1502 -3987 -6892 3581 11822 4280 -2985 334 3220 1471 0 -3592 9956 21759 11670
7964 11670 -4556 -2102 2223 -9807 -16867 -13199 -5584 6400 12946 2196 -11071 -19929 -17478
7951 -17478 -4085 3103 8528 5914 -2553 -7457 -5718 -7023 69 -3637 -1072 4629 1292 -6120
7937 -6120 -7729 -10513 -6571 -17061 -13627 -3162 5190 6049 6444 -467 -7124 -1547 3988 1995 -8083
7922 -8083 -9103 -9881 -12783 -19766 -13892 -9696 -272 639 4170 -2076 -7323 -5112 -8831 -3887 8526
7907 8526 11921 11896 17492 16086 18122 9732 2074 -3921 -3163 -25 -7110 -8084 -2523 2668 -1165 533
7891 533 2351 -2088 -5028 -2825 9853 6206 1629 -6074 -19793 -13679 -5723 648 -5606 -10088 -1869
7876 -1869 -1967 -1883 794 -2645 -6196 -1251 7267 -1187 -7962 -9798 -5352 -2373 -1918 -3957 -3432 464
7860 464 2150 3604 3303 -4405 -6807 -7299 -9459 -8748 -7947 2825 14688 13446 -1496 -8972 -6582
7845 -6582 172 6547 6527 -1985 -4579 2431 8973 3894 4087 8038 -2890 -12950 -14309 -4280 -12867
7830 -12867 -14070 -6818 -2536 -5800 -5369 -1015 4611 5630 5981 15275 16811 10181 16 -13499 -14206
7815 -14206 -3960 2650 9137 8115 2753 -266 -108 -278 -2473 -3127 -2726 -11799 -6286 -5787 -9980 -12490
7799 -12490 -14866 -17298 -17854 -20580 -22771 -17321 -6658 -5184 -1188 -5232 -5661 394 3312 -697 -2337
7784 -2337 -7924 -9015 -10839 -5078 2344 3157 7301 6841 -2384 -18564 -20695 -7880 1933 454 -3486
7769 -3486 4606 2653 3224 6161 8424 5294 1417 -5239 159 1694 -1528 164 9828 10300 8811
7754 8811 8105 3021 -5019 -5530 -4558 -4722 -475 2291 11635 7488 11374 -1054 -10732 -9223 715 -9004
7738 -9004 -4467 7657 7999 2341 7970 -7598 -13981 -7194 -2033 -11196 -6331 -4388 -8811 -87 12562
7723 12562 2377 -7043 -4633 -2782 2728 -439 5217 4599 -37 -1504 -11427 -7659 -245 -8397 -10177
7708 -10177 -6685 -10472 -7972 -10566 -3447 -2921 -1748 -3074 -2061 496 -1775 -6809 -3150 -7545 -11316
7693 -11316 -11436 -22302 -15436 -12228 -4964 -12219 -18874 -18707 -8589 -128 601 1504 4918 7335 5201
7678 5201 -102 1160 6652 5713 -8161 -1258 2782 3243 2877 9678 11412 12825 13765 8131 4968 1431
7662 1431 4919 3489 -3613 -11451 -15529 -14968 -10095 1064 6618 10937 18655 9723 -6642 -9114 -3163
7647 -3163 -3792 -3099 -1965 -1312 1320 22 -5896 -7791 -262 9056 7544 -907 -2093 -5239 -7956 -9272
7631 -9272 -11073 -11659 -8523 -12521 -13759 -14106 -4554 561 -2070 -7805 -11969 -11482 -23548 -18949 -9202
7616 -9202 -7434 -6570 -1872 4856 3641 -6502 -17101 -24407 -20178 -12229 -3176 4433 10752 14300 11568
7601 11568 10739 10682 10441 10387 12188 10812 13683 10493 5295 5530 15381 14313 13436 11361 5593 2417 -14736
7584 -14736 -18542 -7013 5775 8185 4944 11596 15451 13609 13058 3714 7477 13886 2053 -1048
7570 -1048 347 4829 3239 1771 6679 5007 8904 7663 4809 -7349 -10269 -7726 -2256 -2495 -7996
7555 -7996 -9899 -17940 -13796 -6842 -9043 -6371 -4589 7814 12814 6481 264 -5673 -10000 -7160 -5780
7540 -5780 -4708 -599 3977 1405 -5779 -5814 -10590 -11025 -7581 -8120 -6621 -3749 -11635 -2847 -883 -671
7524 -671 5538 12432 886 -3281 -5984 -6648 -3987 -6905 -4832 -3015 -3930 -1208 134 2132 5369
7509 5369 5563 3256 3632 -4628 1624 6256 -2994 -1345 -2075 -10728 -9946 -6094 1770 -4602 -7804 -5780
7493 -5780 -8758 -5785 1755 -535 -4384 -3939 -378 12750 12098 10895 3037 -4136 -6467 -3996 59
7478 59 2873 -2231 -7052 -10650 -20089 -17949 -8016 -13605 -28530 -24725 -15116 -9591 -3670 -3401 -9897
7463 -9897 -16842 -9044 -8660 -8290 1357 1641 -3547 1037 7523 -1279 -2949 2422 2885 -1100 -6839 -8209
7447 -8209 -924 7424 1561 -6987 1902 3897 2015 12668 22514 9918 -2962 -6284 -579 1091
7433 1091 -4073 -8933 -7651 -11767 -18340 -20466 -13671 -9940 -11120 -5262 -379 1853 -4402 -1106 8998
7418 8998 5546 -7654 -4313 -70 5078 4039 5583 6304 -1389 -10232 -15162 -8104 -2108 -10369 -12024
7403 -12024 -5062 11470 13576 5294 -4623 -7519 -10073 -8246 -555 1228 451 2119 9 -11792
7389 -11792 -24097 -22215 -7867 -3617 -5303 -4736 2102 5880 4229 -6513 -11680 -16756 -9582 -9808
7375 -9808 -5422 -677 -8556 -11809 -3306 -5770 -6891 -632 1214 -6107 -7966 -2576 -13333 -12694 -3073
7360 -3073 -66 -4455 -5463 -4328 5539 -4268 -2847 -473 -4748 -7253 -7925 -7907 -3690 -5902 -10021 -19622
7344 -19622 -25229 -13463 -5640 -3546 -5249 -8629 -16828 -15739 -6625 -2808 -3342 1474 -1 -7052 -10416
7329 -10416 -8315 -4802 -2689 -2526 2788 -1458 -5014 -11701 -14432 -8044 -3817 -7867 -7287 -7809 -7406 -5243
7313 -5243 -7004 -4241 0 -2140 1204 -9403 -18184 -13332 -6373 -1961 -2710 -10042 -3610 -4119 -8590
7298 -8590 3420 7705 1695 1460 -6740 -13935 -13918 -13295 -9177 -5499 -10571 -17446 -9329 -755 -7290 -17158
7282 -17158 -18547 -12614 -86 -1111 -4790 -2307 3125 6192 4182 -560 -8214 -16172 -14795 -12213
7268 -12213 -20156 -17687 -5673 -2546 -11882 -12442 -11185 -3065 -2273 -6124 -10954 -10903 -19577 -26320 -34644
7253 -34644 -32564 -23724 -18442 -12440 -11150 -10281 -2461 9037 11951 12210 13741 3583 -4415 -3184 -2958
7238 -2958 -6534 -12873 -13541 -9534 2881 1694 -647 -6435 -9223 -9816 -9610 -12041 -15058 -7076 -7410 -9921
7222 -9921 -7547 -7085 -1043 3671 -796 -1142 968 -5935 -10457 -11302 -18269 -25023 -16124 -7254 -3612 -6101
7206 -6101 -7009 -9045 -17826 -8064 -3464 -10307 -8200 614 -272 -10672 -12531 -7819 -9766 -15740 -17525
7191 -17525 -5368 -6486 -2260 -881 -1220 -1047 8800 16517 18541 11720 -91 2784 7198 10376 4126
7176 4126 -992 -1561 -7739 -14722 -14430 -18021 -20060 -11340 -5472 -4724 4454 1001 -6903 -14180 -13593 -12041
7160 -12041 -11116 -11960 -1284 7536 -3832 -16569 -11075 -8421 -18975 -22870 -20168 -7959 167 -6362
7146 -6362 -11046 -1832 -3516 -7885 -11145 -15042 -17202 -9751 -3620 -3700 -4842 -4218 -1993 -6258 -11432 -9259
7130 -9259 -10775 -8436 -7726 -2800 -128 4297 4169 -5827 -19232 -18401 -17763 -25126 -27786 -24286 -17233 -8171
7114 -8171 -6648 -3055 249 2252 1284 -5886 -2043 2898 6129 10856 5817 -497 -9205 -15200 -11573
7099 -11573 -7432 -11642 -16439 -24513 -24947 -21271 -22161 -21164 -16178 -16915 -25579 -23934 -13105 -9367 -12751
7084 -12751 -17817 -15839 -17954 -4697 -2289 -2638 -6688 -13539 -15538 -2100 -625 -4585 -14399 -5764
7070 -5764 4509 -2113 -4461 -7323 -18387 -11719 8215 12762 651 3039 -4273 -16009 -18975 -24583
7056 -24583 -24217 -22434 -9834 -3304 -5186 -2658 -5241 -7889 -9261 -9512 -13715 -15908 -18778 -17610 -15373
7041 -15373 -14475 -10846 -8605 -17638 -12674 -13710 -12919 -7499 2037 -1183 -12010 -10461 -7453 1420 1697
7026 1697 -5015 -8790 -12460 -8830 -3263 -9278 -16918 -13090 -17440 -10562 -4235 4986 3094 6218 -4578
7011 -4578 -19788 -15055 -12774 -6426 -11381 -9302 -7931 -10389 -2828 4472 4238 3547 -12515 -12014 -12980
6996 -12980 -13597 -11683 -12431 -15693 -10622 -1154 -9269 -17241 -17580 -17096 -9897 5662 4861 8771 10105 -1367
6980 -1367 -11868 -2613 2548 -827 -1404 -4591 -8966 -13743 -20568 -19527 -11276 -13274 -15705 -15178 -14759
6965 -14759 -12267 -7152 -10255 -8669 -2919 -7140 -14611 -19707 -14515 -15814 -12843 -11617 -6348 -436 8242
6950 8242 2920 -1741 -9629 -13863 -12905 -17367 -12139 -13377 -6872 -1292 2911 10442 5665 3665 5484
6935 5484 1804 2551 -1525 -4495 -3825 -2418 -729 2125 2756 -3666 -8236 -6694 836 -6492 -6821 6753
6919 6753 -4152 -6798 -7400 -3396 -7299 -4411 -6861 2757 9409 3788 -1385 3106 7649 -1599 5783
6904 5783 2801 -1043 2410 8107 17806 25618 17290 10744 14473 7536 -1470 -5428 -2167 -1433 12
6889 12 1252 9362 8287 -615 -2807 -686 46 -2617 975 9851 13044 4920 -7142 -3211 5184
6874 5184 7593 6038 4486 3150 -3263 2908 2569 5559 915 324 8627 5108 8748 3774 -568
6859 -568 -5920 -13521 -19049 -17141 -13099 -12856 -14777 -13639 603 1747 3397 -1934 -10986 -10417 -12553
6844 -12553 -16448 -18882 -18594 -3092 -4065 -14468 -12299 -13694 -16897 -11500 -9978 -7611 -1998 5165 2529
6829 2529 3313 -6338 -18914 -22592 -20000 -6950 4340 -2676 -9238 -24852 -27557 -26231 -22470 -6682
6815 -6682 8264 11962 8506 -1321 -9325 -7127 -9493 -15668 -1967 166 -4178 -3931 -6690 -7845 -6771
6800 -6771 -1337 -3143 -6496 -11704 -18445 -7380 6787 13696 17708 15983 3918 -879 94 5854
6786 5854 4844 -4373 -12595 -13348 -17474 -12401 -8840 -16295 -21641 -22536 -11755 -7691 -2596 3498 2991
6771 2991 -3275 -6510 -8675 -8642 -6824 -10725 -18074 -20494 -18155 -7808 -1616 3401 -4215 -12680 -14684
6756 -14684 -10959 -4226 -7566 -14956 -15789 -5370 -771 7890 2963 -4037 -6108 -7847 -10922 -9796 -7495
6741 -7495 4697 2508 -1340 3357 -4937 -10332 -13382 -10059 -14305 -6837 -6527 -12933 -16623 -18080 -12560
6726 -12560 -15360 -5918 -1320 5274 8502 5170 -3796 -17406 -18075 -1158 5303 -834 -3403 -4116 2458
6711 2458 294 -1476 -2953 -5372 -9596 -23293 -26998 -19246 -20180 -20728 -14160 -2041 839 -1575 1524
6696 1524 12625 13831 4945 -2291 1547 4103 12445 10235 8019 5195 -6972 -7653 -5193 -5487 -12425
6681 -12425 -6096 -4257 -6438 -9098 -3176 3366 -924 -4213 6392 5260 9524 8774 11118 11776 13151
6666 13151 10792 10523 6246 3418 10393 12134 7756 10265 11751 15697 10432 6014 10683 8876 11327
6651 11327 17627 3991 -11645 -13064 -12626 -12295 -16722 -15576 -13298 -22003 -23136 -7835 1471 3558
6637 3558 9584 -5711 -3986 549 -5130 -9189 -17259 -18050 -18973 -15279 -12519 -12519 -14996 -21456 -17332 -17303
6621 -17303 -17566 -10282 -15113 -11810 -12826 -13850 -8165 -2163 1547 3638 11389 6429 -3638 -11931 -20190
6606 -20190 -23616 -30167 -25356 -22010 -12079 -5247 909 -2354 -2667 213 -2775 -9568 -14288 -1941 -1842
6591 -1842 -9243 -13297 -9654 -10306 -7475 -13874 -16576 -11320 -2811 -4689 -1380 -7275 -5204 -4355 -4032 -12163
6575 -12163 -5460 -4668 -12768 -9897 -7638 -7879 -14211 -16752 -13252 -6341 438 -4896 1015 10366 13088
6560 13088 -5069 -10942 -8269 -4110 -12030 -12088 -16365 -4728 6555 3197 3879 -4808 -8405 -1215 -5922
6545 -5922 -8422 -2297 -1716 -11294 -11577 -11047 -13521 -18386 -12984 -21803 -21896 -6607 -6511 -2479 -2396 -2956 3963
6528 3963 12915 6079 1612 -831 -8315 -5018 644 3990 4707 -4557 -16720 -21026 -12135 -16400 -22786
6513 -22786 -16823 -11578 -5802 3677 1454 -7539 -12011 -12461 -14296 -17350 -19715 -17263 -4860 3330 5873
6498 5873 5200 -4573 -4476 -11357 -690 3867 4252 -3524 -2230 3163 -2126 -9698 -14983 -12081 -4344 4172
6482 4172 3256 -3446 -2659 -10301 -16590 -10347 -11082 -17169 -18550 -17108 -12965 -17536 -17684 -16072 -19415 -14427
6466 -14427 -7092 -6785 -15536 -14721 -11297 -10307 -18571 -16086 -22156 -19624 -17592 -24465 -20555 -10922 -3852
6451 -3852 -3805 -397 3094 3717 6700 2124 -9927 -26443 -37356 -35444 -25745 -24243 -17777 -11011 -16724
6436 -16724 -20214 -15238 -10849 -15882 -18457 -12280 -1783 4828 3145 4261 463 6192 4419 -9310
6422 -9310 -9150 -12840 -4204 -4491 -18101 -23462 -24091 -23700 -19392 -22134 -21567 -16178 -13195 -2881 -2331 717
6406 717 3852 9055 15455 2063 -5917 -5846 -8903 -7308 1189 5765 -339 1029 -5732 -16436 -22463
6391 -22463 -17366 -14270 -231 1988 -5703 -3247 -2381 -9140 -4344 2264 -1519 -5497 -12841 -17537 -18375
6376 -18375 -20823 -14092 -11429 -13856 -11494 -6420 -3615 -492 -1767 -2370 -5350 -4218 -2261 -5199 -5031
6361 -5031 3452 -3501 -8409 -4096 -5407 -2284 -3216 -2441 -742 4409 3006 -890 -731 -1768 -6596 -13271
6345 -13271 -19217 -9975 -7152 -3389 -5128 -3688 -1796 -4716 1543 7667 -2272 -5436 542 5408 3229
6330 3229 -7945 -8569 690 5222 4455 4210 -228 -13142 -16853 -14173 -13128 -11596 -4063 -7972 -11160
6315 -11160 -8985 -8465 -14712 -9414 2274 3432 5179 907 4824 3562 -2554 -3948 -7242 -9032 -23859
6300 -23859 -22499 -19033 -22729 -23423 -16581 -4935 -860 -3159 -484 -825 -10512 -16531 -13518 -19065 -9081
6285 -9081 4736 -1255 -2274 2156 -4123 -6785 -7490 304 2831 1090 -2575 -2925 -5680 -11472 -13769
6270 -13769 -12980 -13786 -11674 -16180 -26213 -20173 -6776 -839 958 4694 3212 -3318 198 -1679 -111
6255 -111 -2207 266 -2430 -4328 -3038 -8278 -3562 833 -3663 19 -4626 -4896 -5812 -1725 1475 -9168
6239 -9168 -19377 -5671 346 -6483 -11777 -15407 -15442 -12615 -8050 -2952 -6255 -9830 2588 5676 -3019
6224 -3019 -6696 -4335 1713 15491 6011 -529 -6738 -8489 7194 14885 13844 386 -4224 -1846
6210 -1846 -6601 -14438 -11497 -9477 -10850 -13149 -13626 -10173 -4171 -8036 -3470 7869 8835 5381 2088
6195 2088 4270 3741 -14482 -22145 -5769 2144 4447 -3665 -5007 -12512 -14798 -845 9163 5805
6181 5805 -9275 -18675 -24553 -22163 -17515 -11510 -530 7481 528 4932 7292 700 5497 17236
6167 17236 15487 4376 5974 5016 -1734 -4164 3270 3932 7563 11811 7181 9244 12520 5199 2618
6152 2618 -2815 2457 4160 -2213 -10232 -7737 -3191 2056 4924 4915 -509 -9022 -7178 -2854 472 720
6136 720 6452 3015 -50 5653 7761 11369 6006 -2027 -2528 -2810 -840 1623 4573 12042 11402 3542
6120 3542 -9706 -17260 -15840 -14065 -22115 -21904 -17679 -14796 -10553 -5992 -13352 -17396 -20421 -33162 -28229
6105 -28229 -20837 -22043 -19925 -14668 -13791 -11313 -12723 -24530 -25908 -12331 -6805 -11541 -7944 -7092 -7275
6090 -7275 -2595 -377 -6862 -11960 -1484 535 3136 6722 6447 -663 -14451 -13049 -4455 938 -3702
6075 -3702 -12259 -13216 -10021 -5439 4845 8697 14202 11273 13616 4654 924 -2186 -1604 3017 -4379
6060 -4379 -6720 -4041 -3201 -6550 -20695 -21766 -22079 -20543 -20018 -7611 1295 -4227 -4792 2872 3742 5102
6044 5102 -5760 -11630 -12005 -10030 -7367 -12533 -23706 -26139 -12827 -6566 -8126 -8725 -7995 -2627 -2507
6029 -2507 -2246 -7688 -16540 -16591 -17658 -17031 -14560 -12555 -11276 767 6099 1135 -6605 -1854 1945 3714
6013 3714 1955 -4524 -8720 -8604 -4609 -9946 -17503 -11229 -7730 -13520 -8776 2776 -5639 -6892 -9403
5998 -9403 -9497 -12804 -6802 -454 2587 1258 -4426 -6146 -1815 -2711 -8797 -10254 -12689 -9812 -15321 -15722
5982 -15722 -12950 -9529 2804 1308 -833 -8837 -9165 -1603 -3650 -4548 -6319 2926 7208 1407 4029
5967 4029 6479 3468 -4293 -671 13356 18653 5200 -1869 -14493 -17372 -10979 -13761 -15226 -9983
5953 -9983 -7123 -5312 -7951 -7018 -4374 -4387 -13411 -21405 -26853 -28637 -21068 -12101 -2611 -6522 -11627 -5118
5937 -5118 -2816 911 9852 20471 18834 7896 -4567 -16021 -11952 -3401 -3445 -8129 -15828 -8499
5923 -8499 -2204 -4692 -5068 -7263 -14539 -8549 -13801 -9063 -8515 8802 10192 13225 7637 -3843 -8037
5908 -8037 -7876 -12287 -11924 -18711 -10966 -8927 -15106 -7308 -2523 -1378 10874 7045 -4123 -8296 -7001
5893 -7001 -6117 61 5100 -3551 -10103 -11444 -12589 -7823 -2190 1339 12099 13712 5346 1589 3127
5878 3127 850 -8512 -10428 -6593 -6217 -6683 -4090 -2030 -1167 -957 -6740 -2727 7054 11225 539 -11753
5862 -11753 -18163 -8362 1299 -5599 -8014 1764 7543 -1300 -7985 -5204 2841 8524 4617 -1711 -3241
5847 -3241 -5743 -6450 -11599 -19333 -30813 -27277 -20095 -19872 -20345 -9604 -6228 -3495 -5268 -12533 -18578
5832 -18578 -21311 -7868 -2355 -11949 -7756 -7162 -5059 -7885 -3085 -3088 -4199 -2308 -3395 -2233 -7138
5817 -7138 -20041 -10392 -1835 -178 -4081 -1713 -5741 -1832 4133 6024 -449 -13020 -16592 -16562 -11720
5802 -11720 -6710 3924 5249 3035 5707 3480 5966 4191 -2183 2600 -4517 -10674 -8355 -8257 -4988
5787 -4988 -7086 -4938 -2452 5197 5021 -4366 -2224 -5152 -3965 -677 370 -1458 -8272 -12409 -14895
5772 -14895 -18591 -23079 -15012 -18965 -21578 -12525 -5973 -1926 7093 2581 -3588 -3758 -1088 -997 666
5757 666 -2185 -11803 -16478 -23194 -18116 -5529 -6301 -3101 10763 4398 -487 -5689 -11138 323 242
5742 242 163 4128 9206 7390 12922 14092 9077 9575 1767 -7582 -13520 -14462 -7539 -11503 -24230 -19933
5726 -19933 -3379 665 -5958 -7494 -9158 -10542 -15993 -13168 -7299 -6506 -15452 -11460 -11234 -17888 -16302
5711 -16302 -7543 -9360 -9114 -5971 634 253 -10214 -21527 -29145 -26346 -18443 -8558 323 -8681 -5875
5696 -5875 3481 4410 13158 6763 -8376 -17021 -8484 -9185 -7857 -4404 708 4569 442 -982 200
5681 200 -349 -4046 -11802 -9419 -12783 -11848 -19633 -8412 6502 -908 -3211 -6700 -4280 -4509 1010
5666 1010 -1396 -8891 -12155 -8056 -6063 -6174 -13907 -14728 -4831 2340 6333 4410 3895 -8171 -13826
5651 -13826 -15817 -12182 -10845 -13709 -9895 -2847 -1709 -8609 -6079 -6091 -10982 -12448 -7605 5479 10219
5636 10219 4400 2265 1141 -7267 -8898 -2440 -2617 -4373 -9296 -4914 -3327 -15318 -19869 -6614
5622 -6614 -7365 -3631 -7901 -4463 -3755 -6929 -9437 -16775 -13711 -2407 3134 11032 11998 11367 7598 6907
5606 6907 6555 5778 9166 9885 16744 14704 6980 -8080 -9139 -12231 -20219 -21339 -22800 -14138 171
5591 171 287 -1344 449 279 -7226 -10559 -11219 -9981 -8365 -3859 -1872 -5388 -21957 -19591 -13489 -10129
5575 -10129 -8949 -13491 -14021 -10863 -2319 -3746 -2002 4362 10657 5309 -3666 -2905 -7035 -14916 -22276
5560 -22276 -14854 -10569 -8615 -2876 -8135 -11289 -9632 -4210 -13937 -16353 -12807 -19865 -18891 -16661 -27572
5545 -27572 -27604 -24709 -6349 13297 771 -7731 -10334 -23943 -24976 -26207 -11125 2500 -3522 -4431
5531 -4431 -12038 -8798 -12114 -15842 -16281 -15207 -16777 -11649 -9607 -10136 -9726 -6394 -5994 1344 -2003 -8537
5515 -8537 -7758 1786 6255 14612 19318 21481 26624 18515 7234 4490 3935 5214 5003 -392 2453
5500 2453 13801 9952 14646 20548 24216 13127 8432 6743 7929 9410 -11 3098 4373 1209
5486 1209 7062 5651 -3081 7067 10356 9845 13103 16974 13557 4022 3490 3912 -11067 -15036 -10866
5471 -10866 -166 -818 1181 4085 1708 3908 11277 4958 1266 8439 12713 3371 -9922 -26226
5457 -26226 -25621 -11072 -6224 434 5632 5802 3652 -1043 1405 -612 -1882 3564 10726 -529 -3295
5442 -3295 -1926 -4105 -6298 -6479 -6555 -6707 -7873 -13886 -12544 -11585 -9132 80 -4608 -5642 197 5603
5426 5603 8226 3566 -9993 -13035 -7659 -5055 -813 -3212 2096 -6615 -15177 -16616 -5972 4400
5412 4400 8936 7410 2281 -905 1525 -4042 -3942 -81 -4583 -2297 3927 -2764 -1328 524 2042
5397 2042 -2574 -6835 -9573 -7683 -8097 -12258 -10876 -14090 -14692 -10074 -10994 -8997 2496 1229 -3129
5382 -3129 -4685 -6690 2855 349 -15043 -23090 -20553 -5656 6472 5435 -2068 -5690 -9056 -12728
5368 -12728 -10974 -8465 -2513 -4324 -3874 -1968 -5366 -4 -1839 -4707 -5912 -9844 -8080 -11405 -17501
5353 -17501 -15734 -6936 -7338 -5239 1300 -10777 -23139 -20995 -3960 -3714 -8697 -9045 -15848 -22947 -23938
5338 -23938 -8305 1932 995 4344 281 -6932 -12149 -20192 -14863 -11472 -10619 -4598 5314 17686
5324 17686 17514 9844 -3435 -220 3248 6486 9616 4798 12796 13956 11942 8858 4564 2690 6131
5309 6131 8367 2667 -2293 642 1087 3143 6493 8892 6589 6639 378 3290 13382 10958 -959
5294 -959 -14048 -13199 -5755 -12000 -15186 -2241 91 -6214 -9066 -15713 -17488 -13566 -11466 -9468 -6325
5279 -6325 -3288 -3514 -4345 -503 8393 8608 -1142 985 -8490 -16043 -16849 -3572 -980 1162 -3026 -8151
5263 -8151 -11660 -10924 -7668 -9815 -8118 -7361 -6935 -12490 -17878 -6765 -6214 -9640 -8378 -10831 -8835 -8310
5247 -8310 -13526 -21922 -22944 -22319 -10835 -5959 -10827 -16460 -6717 -3876 1798 2562 7702 11628 10573
5232 10573 8141 10299 12187 17221 8619 2186 -2050 -11762 -12816 -13469 -11551 -14918 -13490 -5142 1436
5217 1436 -8608 -16642 -12122 -5911 4246 7581 6357 -4200 -13075 -7246 -6798 -10088 2436 4678
5203 4678 5965 -4830 -9538 -3283 5061 -4312 -13441 -15706 -20196 -19561 -12904 -7703 -7031 -5239 916
5188 916 9003 7154 5715 -3733 -8565 -13354 -11099 -10252 -11864 -3076 -5641 -13783 -15715 -15535 -14692 -12460
5172 -12460 -4950 5606 6133 535 2898 5574 3983 -10627 -23165 -21118 -7059 3533 4603 474
5158 474 -4604 -5101 -3685 -3488 -2258 -3443 -9138 -2373 5664 -258 -7469 -5210 1679 6850 14310 9599
5142 9599 381 -6687 -1609 12312 15547 7822 3704 -348 -2076 -2055 -4234 -2959 3104 1404 -2335
5127 -2335 -5162 -8597 -15023 -15080 -8381 -3173 107 789 1527 884 -8056 -6921 -10759 -16352 -15566 -10281
5111 -10281 -9674 -6930 -1702 -2 -8644 -15299 -10995 -5649 -11870 -15787 -14772 -13533 -12328 -8461 -2146
5096 -2146 -3937 499 -607 -5288 -12806 -8568 -8351 -14865 -11196 -8034 -9167 -6413 -5194 -1380 -6146
5081 -6146 -10634 -5552 -4941 -1593 -724 -1702 -5530 -15251 -20309 -13581 -9087 -5057 -2267 -1553 -4677 -2319
5065 -2319 -3201 4359 3000 -4190 -6029 4583 8220 4010 -14229 -17621 -16209 -16011 -26709 -25085 -9641
5050 -9641 -5485 -4852 -14520 -9969 -7698 2292 15846 12100 6014 6400 -3881 -10314 -9866 -14313 -12580
5035 -12580 -9961 -14994 -10421 -4689 -11456 -7535 -12764 -11803 -10743 -11118 1197 -1148 -7472 -2323 2110
5020 2110 4239 3720 3018 3390 1984 -3741 -9276 -1837 946 10970 14653 8890 5592 -5714 -8305
5005 -8305 -9251 -231 8010 -817 -7455 -6346 -5373 -9443 -14172 -15396 -10636 -828 2213 -5964 -6697 -16153
4989 -16153 -14767 -8460 -5423 -4517 -1589 -6105 -12366 -23446 -12219 867 3827 7346 7418 -7767
4975 -7767 -6301 -4396 -4859 9437 20440 21227 15506 3917 -13494 -17907 -19750 -16611 -8848 -6053
4961 -6053 -7573 -14295 -10248 -10642 -5015 -169 3009 -3471 -15115 -14687 -11479 -9058 -7024 122 287
4946 287 228 -3606 -7515 -15266 -12798 -2626 -3602 -4017 -7453 -15255 -15836 -9664 -9758 -11660 -10828 -7910 -6434
4929 -6434 -6031 -6216 -1537 10246 16201 11443 3611 -13931 -16915 -7285 -4941 -9497 -13630 -8528 -5528
4914 -5528 -8278 -153 6312 3065 3287 -1726 -8334 -6697 4915 3378 1739 -598 772 -3147 2170
4899 2170 -1180 2895 4097 -2471 -11879 -11426 81 2305 9008 9841 2124 -12231 -12506 836 257
4884 257 -5819 -6515 -9439 -10859 2118 7905 3410 -3321 -858 -3589 -7883 -1628 -8283 -9096 -4110
4869 -4110 -692 2475 5726 7175 4614 -1847 -3822 -6167 -9575 -11255 -4758 6043 7254 4105 3530
4854 3530 2224 -148 -5953 -17972 -13217 -8904 -13378 -306 4696 1848 9489 11136 1275 -3051
4840 -3051 -4601 272 94 -2279 -10404 -957 9539 15172 9362 779 -7493 -12830 -19072 -23521 -23523 -17778
4824 -17778 -16762 -21571 -13337 -1393 -9724 -14194 -12892 -3764 4525 -3087 -425 9493 10314 6822 3727
4809 3727 -555 -3755 -433 15816 11230 4607 7606 8764 2109 -965 -5784 -9779 -6439 -461 3833
4794 3833 4777 -457 -4678 -10104 -13210 -5472 -2440 -3864 -6143 -3054 -1408 -3658 1701 6897 43
4779 43 -12648 -2567 -2234 4785 3867 6078 10102 12354 6890 3185 1611 -3610 -4701 1623 7625
4764 7625 3271 2315 1995 6154 -2884 -1541 -1494 -4610 -2866 220 -3098 1813 4158 9983 -60 -1597
4748 -1597 -7991 -9747 -7569 -16120 -20019 -16102 -3591 135 2699 713 -239 1243 -3623 -4772 3999
4733 3999 4284 1891 436 -7805 -7428 -1752 -309 -2182 5686 9367 10853 15510 9787 -3044 -5568
4718 -5568 -3478 -179 -2430 -4293 2486 10559 13854 10083 10433 11331 14556 2519 -7831 -1829 6039
4703 6039 7363 3776 2689 3256 5228 -6023 -12066 -8348 3736 5660 4152 10024 3875 -1244 -4335
4688 -4335 -6878 -16297 -21209 -15157 -5315 12764 13829 4345 -1351 -11614 -8435 -8307 -7635 -13128 -2535
4673 -2535 1448 -5196 -4195 -9094 -15416 -13815 -10693 -20919 -26854 -12549 -1833 -1629 -353 5321
4659 5321 5129 13318 21716 18426 15761 11158 3129 -4585 -7965 -8342 -19086 -19463 -14304 -10014 -4869
4644 -4869 -352 726 6277 5726 4545 363 5132 10614 6914 9493 13513 9764 6670 7431 7019 8136
4628 8136 7070 3224 2704 -4437 -3445 8315 9162 6603 -1380 -6639 -7656 -3872 -5577 -6394 -3990 -7591
4612 -7591 -10364 -1941 -4125 2998 1843 5574 164 -11126 -12023 -5767 -1460 -6976 -14150 -13877 -10616
4597 -10616 -12684 -18628 -19865 -20306 -14086 -6301 -14020 -12923 -4151 -2175 -1827 1709 207 -6856 -7645
4582 -7645 -843 -2218 652 2902 5973 13226 16254 16780 10134 4763 2302 2213 -4818 -7085 -7704 -10468
4566 -10468 -3183 3063 1751 -223 779 2772 786 4856 12219 10556 17091 16789 17754 13150 136
4551 136 7500 13534 15164 13424 13963 1419 7801 17709 11421 3492 2201 1046 -13441 -13201 -1727
4536 -1727 6121 10378 6652 -3292 -145 10441 9354 9859 2965 -3856 -2346 -5150 -2428 -2272 -2754
4521 -2754 7863 18467 6118 -50 -1423 -10504 2382 4522 -2348 -6025 -12894 -7401 -6295 -5677
4507 -5677 -4341 -10757 -14590 -10798 -14813 -16528 -8110 -6456 -796 2706 1975 3645 4728 3614 -810
4492 -810 -4628 -597 -11829 -18509 -7619 3009 -8742 -18267 -13476 -6705 -9299 -8115 -5448 3727
4478 3727 10263 5904 -1598 -4561 -668 5861 -2331 -12948 -12633 -7472 -2511 -1054 1995 -468 -661
4463 -661 3614 418 3318 3881 5311 -5357 -15313 -12978 -9540 -7616 -1660 -6728 -13069 -11471 -1831
4448 -1831 258 -8891 -16678 -19335 -18064 -12990 -3279 4958 3810 -862 -4597 -4215 -3731 1450 -4395
4433 -4395 -17863 -15191 -12232 -7568 2600 1711 -3531 -758 577 1165 6736 5561 6920 12012 12162
4418 12162 -4698 -9145 -15087 -10958 -1843 5128 14411 13158 912 -6956 -5317 -4146 -9490 -4576
4404 -4576 -2234 -7874 -8107 705 5539 -242 -5457 -1851 -4556 -1682 -2605 -863 10205 11585 2974
4389 2974 -1854 -4376 -12133 -15030 -10772 -11288 -9973 -6826 -8627 -1733 1637 11100 9326 1447 741
4374 741 7036 10130 -1302 -18269 -21384 -8449 1815 -1612 -5349 -9004 -17299 -14399 -7967 1554
4360 1554 -6402 -4226 -6498 -14445 -6190 -2734 44 5475 14872 19651 16779 9817 1118 -11716 -6621
4345 -6621 8461 11396 -780 -12474 -7513 -564 -3063 -1905 3926 5518 -1142 -3421 -566 6046
4331 6046 6190 -5491 -9645 780 3916 1529 -6300 -7386 -6033 2119 7241 3770 6591 -111 -13624
4316 -13624 -20058 -20515 -15370 -15229 -11953 -14186 -16754 -8198 -5004 -9586 -15586 -11633 -12586 -11694 -9169 -4394
4300 -4394 -278 -3998 -8864 -11928 -20847 -22456 -12076 -2545 -6025 -13438 -14368 -9599 -8201 -4932 -9495
4285 -9495 -1894 1470 3804 12194 13144 -6432 -8997 -10371 -10408 -7105 4910 10137 4243 -3941 -6407
4270 -6407 -1950 -5430 -4359 -1776 -11384 -9632 -131 2313 518 -7928 -11469 -8391 -3391 -2258 -9996
4255 -9996 -16316 -21803 -11691 -7408 -10814 -11492 -18631 -17596 -7478 -7439 -17147 -19025 -15679 -10951 -10327
4240 -10327 -11358 -11147 -9214 -10553 -12380 -4982 719 6674 -1463 -7100 -5418 9380 10354 5965 -5114
4225 -5114 -796 2512 -6668 -16406 -21102 -16233 -6030 2038 7386 3707 -4016 -4182 834 -7705 -11842
4210 -11842 -11636 -9332 -9571 -13974 -10855 -6525 -7524 -9761 -11982 -7082 -4097 -6846 -6892 -11642 -12445 -10331
4194 -10331 -6659 -1375 4192 5560 6408 -3974 -7075 6703 9953 4638 2880 -89 -5220 -5642 -7252
4179 -7252 -7633 4232 1835 -4550 -5386 -11421 -8360 -9407 -5532 -993 2516 5074 5927 4722 200
4164 200 -1044 -811 213 -39 -13990 -14584 -8858 -18414 -10802 -1155 2340 -3216 -4393 3580 9019 7277
4148 7277 10161 -625 1415 -1809 -2076 -1341 2567 6186 8772 1404 -1099 4487 16298 15442 9401
4133 9401 2949 -357 1540 4575 3378 -2147 -589 -2811 -4248 1319 4669 254 -5390 -5330 2283
4118 2283 1031 -7923 -1872 -8623 -12505 -8372 -6746 -10138 -16419 -22485 -16779 -11888 -6539 -5855 -12809
4103 -12809 -19301 -16819 -15222 -17496 -11734 3602 6013 3563 5960 -6536 -11688 -9310 -4341 3775
4089 3775 9388 6601 23 -5584 -14442 -13275 -8800 1859 -700 -4287 -8381 -2796 -4535 -15801
4075 -15801 -20113 -20595 -19143 -15335 -6159 -5373 2925 -5044 -10294 -12467 -7569 -4865 -2275 1837 4230
4060 4230 2282 -1998 -8463 -3943 3896 10574 11764 4016 10749 9028 -3962 -12976 -5964 2156 9171
4045 9171 22 -10771 -12646 -14931 -20323 -24572 -20399 -14806 -5214 1316 2866 6596 10485 7042 -5319
4030 -5319 -12395 -9266 -6815 -3715 -5107 -9313 -11357 -13856 -9569 -6040 370 4646 8080 -4933 -7349
4015 -7349 -4296 -7514 -9273 -20269 -18555 -18871 -13027 -8670 -1892 87 -6085 -899 -3685 -1411 9111
4000 9111 2357 4165 7260 7769 5958 9305 8067 1943 -97 4351 8554 6809 14895 14314 17171
3985 17171 13038 -1369 -1886 -11497 -13960 -7040 -1843 7688 5070 967 -5148 -5069 -1185 9506 12512
3970 12512 13183 4358 -3141 -188 3568 7959 15294 10633 2547 2819 625 3438 955 635 435 -797
3954 -797 -3195 981 -2707 6144 12976 8932 10694 12193 2634 -1531 -10064 -13189 -6211 579 -3177
3939 -3177 -5472 -1697 9855 9694 -3662 -11009 -9076 -4526 -9845 -3209 3561 2285 -5378 1115 8192
3924 8192 -1407 -9674 -14146 -13270 -4384 11464 10952 7343 1206 -345 8976 7701 -4252 -12853 -12965
3909 -12965 -3795 -999 -3764 -8450 -2650 1443 -2784 -7263 -1467 -13463 -6970 1275 2052 7087 6664
3894 6664 9398 -128 -1484 -4812 -4444 -3972 -10455 -11990 -7933 -1385 3114 -7855 -21521 -15951 -16608
3879 -16608 -20824 -22412 -3642 4638 1486 6652 5012 -2007 -7261 -11070 -5846 -8530 -6962 -1640
3865 -1640 -300 -4091 -6555 -7607 -10600 -18110 -10567 -13488 -6973 928 -4254 -5047 -9319 -1513 5942
3850 5942 -1669 -3579 -4377 -8742 -6146 2275 8881 9525 9398 12937 14324 18226 8018 -572 -5144
3835 -5144 -5790 -2407 106 4115 -1414 -7768 -11509 -7396 -4866 -2705 2193 2578 1139 -303 -4143
3820 -4143 777 -1455 -7912 -1684 9639 18234 24279 19332 14604 13214 15457 11951 16836 11743 10471
3805 10471 12673 19156 19896 11518 -1511 -1115 -2678 4328 8350 2539 -1348 2748 8025 11482 23136
3790 23136 19217 14836 11315 10054 9302 1104 -1568 1666 5523 3835 5486 -2292 -745 -4934 -9759
3775 -9759 -10493 -8700 -5800 -6545 -7054 -7757 -7540 -299 3433 10495 10137 1090 -4844 -7299 -5778 -6739 5669
3758 5669 17490 15596 -4811 -13252 -15365 -22982 -16837 -7083 1019 5159 -9506 -10218 4102 9620
3744 9620 4155 725 -1305 -5374 1721 9933 9851 9551 10294 7503 5230 1872 -2580 -1422 1484 12441
3728 12441 13608 10152 6711 -5807 -13327 -19364 -13501 -11739 -8007 -7739 -9873 -3319 -1726 3202 5559
3713 5559 -7988 -7591 -4554 -1498 -1758 -10438 -19837 -7905 78 281 2155 255 5101 1894 1576
3698 1576 8459 18537 7869 2355 5524 5470 5537 2358 2129 -3451 -22102 -23278 -11803 -11867 -15146 -12011
3682 -12011 -4161 -4347 -4291 452 -487 471 -918 -8443 -13442 -15064 -18222 -24785 -24913 -11596 378 1990
3666 1990 8297 605 -10817 -9311 -7522 -3775 -2247 -4553 -269 3757 7060 11145 14671 14578 19027
3651 19027 17836 796 -12128 -5398 -2005 4339 2227 5479 -2893 -6032 1429 12336 11584 -752
3637 -752 -5803 -11034 -6456 2934 5320 3372 -3176 -11915 -14961 -8128 2547 5328 2772 -760 -10059
3622 -10059 -7757 9321 9924 -182 -11655 -15306 -10881 -4999 -2840 -10790 -13823 -13783 -5989 -7698 -7734
3607 -7734 983 11129 11924 15414 14829 19043 14015 13984 16413 6712 1794 1154 4074 -5625 -16827 -17418
3591 -17418 -14117 -8132 -2986 -9331 -6636 -1146 -2284 -7577 -10509 -14027 -15327 -15364 -13810 -10047 -4496
3576 -4496 -11568 -6540 7139 15075 16337 14633 9866 14052 6879 10869 10770 5367 -7636 -12627 -12363
3561 -12363 -13359 -11019 554 3297 -943 -4465 -9141 -13971 -7981 8906 10871 13031 8363 -2261
3547 -2261 -4485 -8710 -13218 -8293 -4478 2146 2719 3574 -2863 -8596 -6755 -2984 -2715 -8829 -8211 -14049
3531 -14049 -10736 -7927 1735 14527 21801 23023 10975 -1905 -10063 -9956 -10821 -10340 -6546 -802 6883
3516 6883 2760 -3532 -11648 -9105 -1790 -9399 -13860 -9054 -7013 2894 -106 602 8276 10860 6933
3501 6933 13507 15609 9158 -3022 -5290 -1232 -995 127 -6901 -3899 -2901 -10399 -2871 8130 7770
3486 7770 8388 7930 5319 10307 18382 16670 13509 7879 4878 3119 -9156 -21211 -11812 -4044 986
3471 986 6124 8687 6556 -2873 -2664 1227 114 -1455 4874 3670 -391 -4569 -5877 -9953 -7439
3456 -7439 -3364 -14015 -17241 -12400 -1692 -1694 -2531 6360 4233 -5299 -11459 -7489 143 9724 1654
3441 1654 6236 13214 8764 -8698 -19379 -17026 -4510 -693 -1062 4130 13357 5134 -11139 -11719
3427 -11719 -1315 3849 11365 15600 12090 15161 18867 19431 18663 14565 61 -12444 -9915 -4447
3413 -4447 -3032 -1834 2750 10117 9167 -3339 2927 11863 9985 6442 2714 -4720 -3003 41 -983
3398 -983 -115 -215 196 4618 5034 6687 2708 175 -5144 -7851 -3391 2860 9724 6621 3856 458
3382 458 6414 4684 -9349 -11640 -6634 -6870 -2938 9640 7943 389 -1533 -3204 -2810 -174 2943
3367 2943 -7081 5146 10462 5044 984 3846 2126 -7252 -3767 -3786 -6510 -4515 7812 11154 1500
3352 1500 -7053 -3303 -479 239 625 -2921 -4279 -2886 3243 -741 -13168 -20478 -26725 -18918 -12343
3337 -12343 -4733 2918 6002 9278 7219 4951 8198 10239 9336 107 -1920 -2377 3492 9666 9354
3322 9354 8791 9579 11297 10403 -78 -8903 -5519 -7937 -7530 -6269 -3032 3269 -6180 -6786 2687 5984
3306 5984 10482 5014 2998 -584 -10589 -10324 -3692 -8646 -8292 -1418 -4936 -10431 -10821 -9225 -16017
3291 -16017 -17528 -15979 -8142 -2923 191 9665 12937 7444 15030 14912 14716 11994 5293 2601 1556
3276 1556 -1112 -211 -9989 -19743 -19417 -12459 -5132 511 1377 -5207 -5741 1212 1846 1073 -5837 -14690
3260 -14690 -12528 -5085 -3820 -5450 1615 -267 -10482 -11091 -10462 456 13308 6170 3908 -3336
3246 -3336 -4118 1331 649 -2347 -2386 2483 16473 25123 24660 19134 1376 -838 -8826 -18228 -9265 -1388
3230 -1388 -6554 -13579 -15966 -15371 -10747 -11449 2894 -2351 -9209 -5635 664 2967 -3420 -6047 -8784
3215 -8784 -5486 -6732 -9495 -2211 -2727 -8064 -11238 -15957 -17120 -14887 -10725 -10721 -12605 -9642 -582 -1572
3199 -1572 -290 6359 7413 -4687 -6638 -11885 -7874 -1450 7752 3565 5550 16401 6171 -27
3185 -27 -4786 2470 -2773 -392 4153 2331 2793 5313 3363 -1757 592 7304 11268 8625 7667 2521
3169 2521 -2171 -2478 -10934 -12920 3406 3843 -3178 -4308 -3678 -7192 -3649 1527 -2717 -7095 -5196
3154 -5196 -4745 3631 9067 12635 8621 4965 13577 15527 19010 13105 35 -4102 -4236 -12487 -16114
3139 -16114 -13161 -12047 -13579 -14087 -19734 -8572 4835 -929 -10073 -3339 4850 7647 4405 -2628
3125 -2628 -4491 -9440 -3983 4525 10151 7096 -3561 -5454 -16489 -21442 -6928 7289 13563 14094
3111 14094 3399 -5101 -2235 1605 4552 4740 -2894 -1619 9635 999 -7425 -3978 -5287 255
3097 255 12507 1501 -5507 -2708 313 -2661 7638 12718 19090 10567 1682 2521 1698 1876 -2595
3082 -2595 8626 11452 17198 26763 24662 21034 19469 13483 8017 2492 10829 15352 19496 23667 9530
3067 9530 1129 -5174 -5647 -9470 -8097 -4374 -7891 -2426 -4476 -8188 -11197 -12644 -16138 -12497 -13087
3052 -13087 -21311 -15116 -6667 -3186 -8049 -5005 -7616 -13642 -14131 1686 5981 208 2356 8230 8678
3037 8678 12078 10781 14015 5144 -1071 -3164 -6605 -6439 -2791 7949 -994 -8112 -1523 11195 7555
3022 7555 7142 9428 261 -7946 -5977 -9732 -4810 -2689 -12800 -7264 -2566 4612 976 -6686 -8367
3007 -8367 4105 10436 9480 12450 18628 17411 861 -12982 -12926 -4178 -3990 -4695 -6166 -6592 -7980 -9323
2991 -9323 -1362 8785 8928 -1042 -6672 -6802 -7276 -2959 -7060 -1579 5309 15807 8433 -1357 -7801
2976 -7801 -10244 -4205 3249 -2350 -7692 -9914 -10227 -11585 -11448 -14001 -7290 -7138 -4243 -6622 1176 4444
2960 4444 10854 3421 -7825 -7440 5378 561 -4922 938 2180 2973 222 -8434 -2259 -1746 580
2945 580 621 6022 9258 3939 -1618 1711 15411 11512 -5302 -13439 -4003 4978 11298 11188 6383
2930 6383 10564 19611 17861 14352 5860 2581 6642 10474 8144 10672 9132 1599 -9755 -7088 6061
2915 6061 12473 1904 -9830 -14460 -10985 -7428 -9557 -12118 -8990 -8128 -8301 3050 8503 474 1629
2900 1629 -2855 699 1520 -465 6172 12920 3447 -2867 -3682 -2183 5892 8326 -2951 -3742 -3887 -5826
2884 -5826 -886 5273 2935 2360 6007 -1655 -1935 542 -1034 -2643 -9252 -7398 -1650 2366 -2094
2869 -2094 -12557 -15253 -2734 2482 4811 12891 20344 18358 17382 18449 14094 10760 4630 -13657
2855 -13657 -14475 -8122 -964 -4426 -6674 -8098 -1235 -1093 -6981 -5488 -2800 -7005 -4770 214 4035
2840 4035 -4996 64 8397 -1728 -3667 9850 10882 10059 14861 514 -2291 2137 2882 8382 9226
2825 9226 8693 8166 7446 13772 12394 8507 1004 4155 1724 -7345 -9320 -4407 -281 -1625 -6078 -15491
2809 -15491 -14322 -2087 4316 545 4863 3885 4401 1294 -288 3190 -288 -3035 -9134 -7915 -4000
2794 -4000 -2843 1329 3092 -947 5939 10374 9605 8292 10202 10282 10580 1352 -1128 -1495 3679 8009
2778 8009 24341 21926 8472 -2854 -8408 -13674 -2702 13348 7988 -1538 -2673 -2041 -2206 -9725
2764 -9725 -13485 -18292 -13092 -13868 -14286 -9246 -486 8340 4311 6526 7443 1495 -1347 4863 7999 13708
2748 13708 7710 718 7093 3886 2621 9442 -2000 -9072 -8376 -6597 -6714 -7080 -8646 -3536 -6470
2733 -6470 -11464 -14675 -4013 -2143 -7281 -8060 -6381 -6312 -4172 -6753 -9390 -13214 -10842 -3272 1561
2718 1561 4354 2215 -5814 -4896 -1408 -6980 -12322 -6011 -4609 1544 -1595 1082 -1472 3196 -4692
2703 -4692 -10180 -6512 -6462 -10733 -6627 5415 15004 15768 13088 4372 -2695 -8114 -1944 -4004 -7752
2688 -7752 -5126 -5750 38 -4617 -3708 -536 5520 8177 2358 -1009 -9606 -8701 -3144 -8414 -16712 -18040
2672 -18040 -8421 102 -11972 -19868 -21532 -13944 -6983 -13238 -13775 -14442 -15748 -11214 -10938 -3392 5490
2657 5490 10140 11854 10989 9330 8896 7064 7199 11331 100 -2466 1863 -7971 -4179 14459 22724
2642 22724 16696 2008 -8777 -11433 -5445 -2523 -4581 -5472 3533 10817 407 -4593 -3340 -4643
2628 -4643 -380 3951 3540 2494 8492 -1794 -9813 -9629 -1177 5514 -1923 -13808 -16211 -14808 -4738
2613 -4738 -2646 -133 8317 6041 4016 10960 10441 4750 -3057 -471 1793 5635 3289 -1183 -1280 4350
2597 4350 8584 6900 -991 6517 3947 409 1717 1211 5194 8199 9349 6580 9631 10054 10123 5273
2581 5273 -4822 -9777 -9630 -8338 -1119 -3451 -7351 -1065 -1462 7092 4062 2039 -1853 427 8797
2566 8797 3940 4732 8337 11841 11012 6911 -415 910 5903 -2846 2047 13448 8679 3578 266
2551 266 -612 -1755 251 -22 -1215 1918 13675 6445 2938 -7074 -7271 -1945 7115 12728 14628
2536 14628 10607 5141 -2500 -12120 -16506 -9513 -9478 -10173 -6221 -13783 -20746 -8384 2848 4554 5922
2521 5922 11857 9877 9004 -1433 -5690 -9668 -5460 7208 8002 -4405 -8953 -8093 3797 7947 14771
2506 14771 16130 17143 12563 -2270 -2864 3032 6555 5190 -884 -16004 -11155 780 3633 5770
2492 5770 9550 4636 -385 2194 584 21 2543 -3578 8064 11842 13933 8139 3592 -9604 -7351
2477 -7351 -756 8168 6346 4221 4780 5163 9008 4038 3657 -796 1161 12426 5337 2247 5231
2462 5231 5899 5220 5914 10299 9558 1649 -2433 -13053 -15304 -19205 -10854 -8656 -4203 -648 -308 -5228
2446 -5228 5992 4075 -6472 -22853 -16504 -17710 -19789 -20636 -17419 -10672 -9314 -2070 -7819 -13218
2432 -13218 -4921 -808 2484 6954 11850 9473 5193 2867 1090 -10558 -14705 -12630 -7821 -3724
2418 -3724 -6665 -8854 -4736 -1367 -130 4699 8166 15103 16377 13244 17354 12797 19041 15702 -4164
2403 -4164 -8311 -4176 3306 -279 -11483 -8922 -11558 -6963 -2397 -5093 -11468 -5846 -1641 5893 11954
2388 11954 7719 2588 3580 5560 10023 4427 -315 -1695 -11127 -8786 1845 -5594 614 6996 11000
2373 11000 2900 -4041 -957 8196 4095 -2755 4037 5588 -2107 2867 -4601 -5897 -4695 -9987 -1900
2358 -1900 3584 -6040 -8736 -57 -760 -4630 -11550 -16235 -10900 1589 -4921 -16538 -15804 -10691 -7978
2343 -7978 -6917 -13303 -6338 895 -2692 878 10078 19329 21498 11280 5798 -3323 -8577 -7093 -7039
2328 -7039 884 11500 12627 14293 6927 -2322 -5532 564 8475 5921 -1343 -6330 -7804 -4743 -3146
2313 -3146 -4862 -6863 -4497 -1233 1970 581 -1995 -2728 -2480 1610 511 -1553 -7366 -15664 -10937
2298 -10937 -7943 -7540 -11755 -11531 -4938 996 8884 9924 7704 3822 -297 3072 8373 6559 9080
2283 9080 18874 13398 4074 1057 -795 214 2663 4756 4047 -4583 -6243 -687 -1803 -5458 -2149
2268 -2149 -191 -6265 -2758 -3860 -8924 -6381 -9180 -4807 4144 -1946 -10548 -10681 -11316 -16956 -12572
2253 -12572 -4634 -5471 -2677 -7260 -17783 -17492 -8539 3089 2256 -5172 -781 1494 15380 8848 7766
2238 7766 8819 2287 4021 -1103 -652 4598 -2951 -4180 -8655 -5825 2345 8657 -3977 -7920 -9308
2223 -9308 -6915 1839 3878 3015 4562 9037 5347 -2255 1895 -3747 -10520 -10019 -4616 -9221 -18600
2208 -18600 -22522 -23515 -19958 -16390 -12264 -2583 6484 4687 7456 7764 2430 6769 5305 4020 5098
2193 5098 -71 2704 -4425 -12459 -9501 -3275 -4036 -13389 -16990 -9449 -3637 -4312 -1359 4435 4349 4097
2177 4097 990 -393 610 1015 -1169 -2836 -8827 -2714 2358 1501 2395 457 3340 6341 5662 -5096
2161 -5096 -7562 -3121 -1202 3689 5839 -2212 -8943 -8691 -5320 -1925 -15370 -18406 -10584 -4469 -8113
2146 -8113 -640 -8978 -12851 -7227 -2636 262 4863 6316 8591 534 -5850 -13477 -10967 -5361 -7938
2131 -7938 -5577 -1952 -1295 650 -8108 -6822 -6514 1853 11078 5023 7612 7415 411 4245 9625 1239
2115 1239 -6511 -14074 -12263 -11383 -4920 -754 4526 10090 14785 7744 5023 -1551 7252 7458 11938
2100 11938 7208 5152 9029 3644 2223 1425 1916 -5822 -9690 -6506 -1637 3424 7032 4198 6463
2085 6463 13269 8939 -5829 -8149 4725 -5108 -17214 -9262 3960 4100 -5695 -19645 -21712 -19102
2071 -19102 -9802 -1703 -6732 -4702 -9892 -9531 -9377 -4382 -7864 -6182 -2126 2403 2318 -2337 -1104 8760
2055 8760 11721 7780 6172 9631 4004 -4575 -5971 -5547 -2953 6888 9737 9799 15783 10774 5662 8012
2039 8012 6652 3927 -759 -3477 -1312 -2940 2415 -3911 -10325 1423 15440 16494 24742 17176
2025 17176 7803 7218 3175 3899 4126 5286 4519 1085 -671 6712 13136 10598 3761 10177 8217 5232
2009 5232 1208 -3301 -1468 4757 3142 10927 15985 8829 -3680 -742 4440 -5858 -16140 -14511
1995 -14511 -6450 715 2324 2749 14266 13234 7003 610 -4513 -12896 -12770 -13985 -7283 -8602 4393
1980 4393 10619 8942 5781 18685 15746 2705 7808 10333 5925 942 -3719 -4572 1380 2462 1378
1965 1378 7076 6951 2857 2185 -9758 -9255 -801 3678 -7398 -17583 -10081 -3588 260 -4993 -3778
1950 -3778 -1154 -180 -4188 1109 -842 8023 7764 3840 5268 12129 15971 11983 3184 2955 6344 7222
1934 7222 2727 2906 2393 5490 5749 1580 -8433 -8200 -3480 1896 9999 3098 -12539 -7945 -5137
1919 -5137 -5611 1837 4801 13340 7413 8296 14943 21194 21818 22926 20900 12813 11620 16104 20569 13838
1903 13838 12018 4151 819 -2023 -3034 -2926 -630 -3556 -352 9437 8101 2553 -1381 6042 11011
1888 11011 13732 13667 9589 10504 4344 971 1644 8461 10630 11752 5151 5742 10234 8700 8443 11600
1872 11600 14392 16265 18353 15682 25953 20236 11326 10022 10008 10397 14037 5298 593 -10287 -9554
1857 -9554 -881 -48 -2999 -3081 -7048 -8144 -6199 -3247 -1895 1753 -4176 -8064 999 713 -3789 -4572
1841 -4572 -8742 -11131 -6271 -226 10195 9208 -2172 -7425 -8264 -14191 -8012 203 572 -4714 -8193
1826 -8193 -11482 -8437 498 -1337 -9448 -7701 -18597 -16543 -14081 -6014 -335 -2220 -1098 1456 4114
1811 4114 -5556 -9820 -10330 -6579 -3760 6039 3176 60 6059 13243 10578 2775 -1939 -5894 -6824
1796 -6824 -871 -2461 -9516 -16459 -9962 -9918 -17036 -24475 -11725 1274 -4884 -10181 -4198 -105 -1494
1781 -1494 -4692 -4659 5696 12750 13362 5678 6708 967 -2857 104 3021 826 4673 9821 12762
1766 12762 16691 14569 11312 -576 4766 10083 6837 8203 6457 13348 13490 8419 8319 6009 15740
1751 15740 20478 11221 -5136 -7987 2856 4919 1120 3499 4431 4944 2144 11099 6800 -1735 6218
1736 6218 12669 10489 10574 7349 5439 11372 10219 1738 -1827 -2817 522 266 -6801 -8345 -8516 -1308
1720 -1308 1384 3558 10396 4797 6002 10169 8784 4123 4729 10395 8690 -1443 -4719 -8389 -13134
1705 -13134 -14537 -6562 209 3303 45 -1979 -3874 -7783 -4566 -10002 -15152 -10375 -4055 -1106 3746
1690 3746 9017 7947 12819 11092 10964 16784 12809 14475 12402 7076 3171 8889 7095 -1963 -5378
1675 -5378 -1991 815 -4599 4725 4465 3873 4694 2045 439 -3181 -4578 94 -24 -3475 -5114 -6693
1659 -6693 -12734 -13689 -10282 -14900 -22313 -24795 -18557 -10202 -9260 -8905 -7660 -2817 7592 11998 9691
1644 9691 10932 17777 15652 17618 12582 9377 6903 6596 178 2351 5807 13837 14230 9005 9107 -603
1628 -603 -3712 4548 5375 3344 5177 1667 2405 8237 19213 17242 9586 1167 -3847 2529 9745
1613 9745 15318 12777 -838 -1679 1797 4384 1194 -1575 -2577 -1626 1557 -3703 -2324 4517 7817
1598 7817 2040 -1521 7377 7745 9742 15127 15462 11504 6276 3476 5656 17574 22210 20039 11819
1583 11819 2388 1746 14525 18690 2984 -6610 -12295 -18654 -5156 3939 2464 3305 1150 4032
1569 4032 9034 12760 12552 15460 19209 12815 10282 15097 11004 8329 12763 22348 24207 16054 9132
1554 9132 7171 12927 15862 15238 11086 12130 11348 13058 11514 10568 15510 13968 16197 13069 9739 12500
1538 12500 4566 2699 4554 3701 7852 11744 4195 3475 4173 -1407 1371 4057 4142 7374 7170 15001
1522 15001 19335 11011 8822 6628 3057 794 -212 -10971 -11016 3086 1513 2940 9299 5745 2122
1507 2122 5610 20855 24429 21805 21191 17686 18784 15918 15305 11029 6876 4289 11567 10076 15696
1492 15696 17919 20835 22646 30574 28959 26657 15019 345 -2359 -5067 1140 7010 3450 1964
1478 1964 2461 4067 9019 12025 6641 3539 7768 6316 2290 4845 2425 -7241 -3258 8846 13107
1463 13107 8282 2712 -20 -10605 -10454 -5391 -1592 -2629 -62 4978 11715 19242 15468 7474 352
1448 352 -3126 -2022 -2793 1898 11151 13132 5855 1501 -3719 -5738 2887 17594 13682 3467 2387
1433 2387 6306 4838 -3842 -6532 -2917 397 -1927 2197 5153 12623 15352 13709 18721 20327 23858
1418 23858 22441 16638 16740 13300 13018 17796 18392 21199 14493 8012 7051 8571 7232 -2774 -12260
1403 -12260 1452 5206 5008 -1637 1870 4102 -3821 -4481 -6073 -5581 940 12971 15567 5985 1473
1388 1473 8914 11431 15370 18492 17931 17436 7161 2635 4023 -2275 -3357 7978 5940 11543 7301
1373 7301 5783 5049 1343 -7282 -8215 -3113 -1763 2472 9588 872 -4457 -1157 -1395 38 2293 -2193
1357 -2193 -7468 -3011 5067 12880 17531 6369 6702 6711 10760 15984 15011 17447 13782 -65 -4824 -4664
$$ [...]
##END NTUPLES=NMR SPECTRUM
##END=
