##TITLE=Analysis number 323010
Compound Code cc 49809
Book Reference 486/64
Project Code adrs
Chemist Name simons
##JCAMPDX= 6.0         $$ Bruker NMR JCAMP-DX V2.0
##DATA TYPE= NMR SPECTRUM
##DATA CLASS= NTUPLES
##ORIGIN= Bruker BioSpin GmbH
##OWNER= nmr
$$ XWIN-NMR		Version 3.5
$$ Mon Oct 16 20:22:59 2006 GMT Daylight Time (UT+1h)  MAYBRIDGE\nmr@NMR_250MHZ
##.OBSERVE FREQUENCY= 250.131544655141
##.OBSERVE NUCLEUS= ^1H
##.ACQUISITION MODE= SIMULTANEOUS (DQD)
##.ACQUISITION SCHEME= undefined
##.AVERAGES= 16
##.DIGITISER RES= 18
##SPECTROMETER/DATA SYSTEM= dpx250
##.PULSE SEQUENCE= zg30
##.SOLVENT NAME= CDCl3
##.SHIFT REFERENCE= (INTERNAL, CDCl3, 0, 16.522)
##AUDIT TRAIL= $$ (NUMBER, WHEN, WHO, WHERE, WHAT)
$$ ##TITLE= Audit trail, XWIN-NMR		Version 3.5
$$ ##JCAMPDX= 5.01
$$ ##ORIGIN= Bruker BioSpin GmbH
$$ ##OWNER= nmr
$$ C:\u/data/dgb/nmr/ADRS/630/pdata/1/auditp.txt
$$ ##AUDIT TRAIL=  $$ (NUMBER, WHEN, WHO, WHERE, WHAT)
(   1,<2006-10-16 20:22:40.00 +100>,<MAYBRIDGE\nmr>,<NMR_250MHZ>,
      <created by zg, POWCHK disabled, PULCHK disabled
       configuration hash MD5:
       49 4B E0 1D 92 C2 6B 37 9F E6 65 BC 52 41 86 1D
       data hash MD5: 64K
       54 05 02 7D 52 90 EF 21 B5 83 03 08 24 C1 98 12>)
(   2,<2006-10-16 20:22:51.13 +100>,<MAYBRIDGE\nmr>,<NMR_250MHZ>,
      <Start of raw data processing
       ef LB = 0.3 FT_mod = 6 PKNL = 1 SI = 32K 
       data hash MD5: 32K
       85 55 00 D7 1A B1 EF 4D B2 C1 12 BE 6A B3 B2 58>)
(   3,<2006-10-16 20:22:52.81 +100>,<MAYBRIDGE\nmr>,<NMR_250MHZ>,
      <apk 
       data hash MD5: 32K
       A6 B2 66 2C 5A 43 43 7B B3 83 5D 50 B7 B7 90 8B>)
(   4,<2006-10-16 20:22:53.60 +100>,<MAYBRIDGE\nmr>,<NMR_250MHZ>,
      <abs ABSG = 5 
       data hash MD5: 32K
       21 73 72 40 A3 42 E0 E3 B8 F0 16 7E 4C A1 52 25>)
$$ ##END=
$$ 
$$ hash MD5
$$ 6E 6A 87 D7 8E 74 11 92 BC 8B 86 C4 CB CE 54 DB
##$RELAX= 
##$RELAX= 
##$RELAX= 
##$RELAX= 
##$RELAX= 
##$RELAX= 
##$RELAX= 
$$ Bruker specific parameters
$$ --------------------------
##$DU= <C:\u>
##$EXPNO= 630
##$NAME= <ADRS>
##$PROCNO= 1
##$TYPE= <nmr>
##$USER= <dgb>
##$AMP= (0..31)
100 100 100 100 100 100 100 100 100 100 100 100 100 100 100 100 100 100 
100 100 100 100 100 100 100 100 100 100 100 100 100 100 
##$AQSEQ= 0
##$AQ_mod= 3
##$AUNM= <au_zg>
##$AUTOPOS= <47 >
##$BF1= 250.13
##$BF2= 250.13
##$BF3= 250.13
##$BF4= 250.13
##$BF5= 500.13
##$BF6= 500.13
##$BF7= 500.13
##$BF8= 500.13
##$BYTORDA= 1
##$CFDGTYP= 0
##$CFRGTYP= 5
##$CHEMSTR= <none>
##$CNST= (0..31)
1 1 145 1 1 1 1 1 1 1 1 1 1 1 1 1 1 1 1 1 1 1 1 1 1 1 1 1 1 1 1 1 
##$CPDPRG= <>
##$CPDPRG1= <>
##$CPDPRG2= <>
##$CPDPRG3= <>
##$CPDPRG4= <mlev>
##$CPDPRG5= <mlev>
##$CPDPRG6= <mlev>
##$CPDPRG7= <mlev>
##$CPDPRG8= <mlev>
##$CPDPRGB= <>
##$CPDPRGT= <>
##$D= (0..31)
0 1 0 0 0 0 0 0 0 0.06 0 0 0 0 0 0 0.0002 0 0 0 0 0 0 0 0 0 0 0 0 0 0 
0 
##$DATE= 1161026559
##$DBL= (0..7)
120 120 120 120 120 120 120 120 
##$DBP= (0..7)
150 150 150 150 150 150 150 150 
##$DBP07= 0
##$DBPNAM0= <>
##$DBPNAM1= <>
$$ [...]
##$SUBNAM7= <"">
##$SUBNAM8= <"">
##$SUBNAM9= <"">
##$SW= 20.6930455092707
##$SWIBOX= (0..15)
0 0 3 0 0 0 0 0 0 0 0 0 0 0 0 0 
##$SW_h= 5175.983436853
##$TD= 65536
##$TD0= 1
##$TE= 683.16
##$TE2= 300
##$TE3= 300
##$TEG= 300
##$TL= (0..7)
0 120 120 120 120 120 120 120 
##$TP= (0..7)
150 150 150 150 150 150 150 150 
##$TP07= 0
##$TPNAME0= <>
##$TPNAME1= <>
##$TPNAME2= <>
##$TPNAME3= <>
##$TPNAME4= <>
##$TPNAME5= <>
##$TPNAME6= <>
##$TPNAME7= <>
##$TPOAL= (0..7)
0.5 0.5 0.5 0.5 0.5 0.5 0.5 0.5 
##$TPOFFS= (0..7)
0 0 0 0 0 0 0 0 
##$TUNHIN= 0
##$TUNHOUT= 0
##$TUNXOUT= 0
##$USERA1= <user>
##$USERA2= <user>
##$USERA3= <user>
##$USERA4= <user>
##$USERA5= <user>
##$V9= 5
##$VALIST= <valist>
##$VCLIST= <CCCCCCCCCCCCCCC>
##$VD= 0
##$VDLIST= <DDDDDDDDDDDDDDD>
##$VPLIST= <PPPPPPPPPPPPPPP>
##$VTLIST= <TTTTTTTTTTTTTTT>
##$WBST= 1024
##$WBSW= 4
##$XGAIN= (0..3)
0 0 0 0 
##$XL= 0
##$YL= 0
##$YMAX_a= 452668
##$YMIN_a= -438948
##$ZGOPTNS= <>
##$ZL1= 120
##$ZL2= 120
##$ZL3= 120
##$ZL4= 120
##$ABSF1= 16.522
##$ABSF2= -4.171173
##$ABSG= 5
##$ABSL= 3
##$ALPHA= 0
##$AQORDER= 0
##$ASSFAC= 0
##$ASSFACI= 0
##$ASSFACX= 0
##$ASSWID= 0
##$AUNMP= <proc_1d>
##$AZFE= 0.1
##$AZFW= 0.1
##$BCFW= 0
##$BC_mod= 0
##$BYTORDP= 0
##$COROFFS= 0
##$CY= 12.5
##$DATMOD= 1
##$DC= 0
##$DFILT= <>
##$DTYPP= 0
##$F1P= 14.0000005364418
##$F2P= -0.99999901652339
##$FCOR= 0.5
##$FTSIZE= 32768
##$FT_mod= 6
##$GAMMA= 0
##$GB= 0
##$INTBC= 1
##$INTSCL= 1
##$ISEN= 128
##$LB= 0.3
##$LEV0= 0
##$LPBIN= 0
##$MAXI= 10000
##$MC2= 0
##$MEAN= 0
##$ME_mod= 0
##$MI= 0
##$NCOEF= 0
##$NC_proc= -4
##$NLEV= 6
##$NOISF1= 0
##$NOISF2= 0
##$NSP= 0
##$NTH_PI= 0
##$NZP= 0
##$OFFSET= 16.522
##$PC= 1
##$PHC0= -50.11562
##$PHC1= 5.765125
##$PH_mod= 1
##$PKNL= yes
##$PPARMOD= 0
##$PSCAL= 4
##$PSIGN= 0
##$REVERSE= no
##$SF= 250.13
##$SI= 32768
##$SIGF1= 0
##$SIGF2= 0
##$SINO= 400
##$SIOLD= 32768
##$SREGLST= <1H.CDCl3>
##$SSB= 0
##$STSI= 32768
##$STSR= 0
##$SW_p= 5175.98343685301
##$SYMM= 0
##$S_DEV= 0
##$TDeff= 65536
##$TDoff= 0
##$TI= <Analysis number 999999
Compound Code 99
Book Reference 9
Project Code 9>
##$TILT= no
##$TM1= 0
##$TM2= 0
##$TOPLEV= 0
##$USERP1= <user>
##$USERP2= <user>
##$USERP3= <user>
##$USERP4= <user>
##$USERP5= <user>
##$WDW= 1
##$XDIM= 32768
##$YMAX_p= 285893686
##$YMIN_p= -160194
$$ End of Bruker specific parameters
$$ ---------------------------------
##NTUPLES= NMR SPECTRUM
##VAR_NAME=  FREQUENCY,     SPECTRUM/REAL,   SPECTRUM/IMAG
##SYMBOL=    X,             R,               I
##VAR_TYPE=  INDEPENDENT,   DEPENDENT,       DEPENDENT
##VAR_FORM=  AFFN,          ASDF,            ASDF
##VAR_DIM=   32768,         32768,           32768
##UNITS=     HZ,            ARBITRARY UNITS, ARBITRARY UNITS
##FACTOR=    0.157963299565203, 1,           1
##FIRST=     4132.6476996994, 0,             0
##LAST=      -1043.33573715361, 0,           0
##MIN=       -1043.33573715361, -160194,     0
##MAX=       4132.6476996994, 285893686,     0
$$ Real data points
##PAGE= N=1
##DATA TABLE= (X++(R..R)), XYDATA
$$ [...]
19637c9987J900K6314L07k5128n930j3632R373l2578J6019J1321K0185J24K234
19624b9478K8741J3769j302k6649K1584l0635l3034l529l046L365j3491k186l590
19611g9481o204N335M1387N989j2495j9494J0108M5004R829k7507J0081L3768
19599A6320J6761l8073m0823l2094N1293K5548j568R590J3051P415N0247l93j7086
19586F0188q134L166o153P278l8151j3709l4821n7667K3865J1263p604K5884L5826
19573A231l2162k8914K1728K4261k1255j1443o346n551J9196K178l319K3027k7269
19560d4638m1685K2973Q977O168L7216K9853Q502p777j9818l2297q958J0653J6053
19547a4778L6626J9469l926m7701l1261k8096R987K2714j7991l2367j2201N7777
$$ plain form
19637 -39987 -38087 -11773 -11466 -36594 -42524 -56156 -46783 -79361 -63342 -52021 -31836 -31712 -29478
19624 -29478 -737 13032 11730 -14919 6665 -23970 -57004 -60533 -63579 -60214 -73705 -75891 -79481
19611 -79481 -85685 -80350 -38963 -32974 -45469 -64963 -54855 -9851 -22 -27529 -17448 16320
19599 16320 33081 -4992 -45815 -77909 -26616 -1068 -2636 6954 20005 27420 77667 77274 60188
19586 60188 52054 55220 49067 56345 18194 4485 -30336 -88003 -64138 -52875 -60479 -34595 1231
19573 1231 -30931 -59845 -38117 -13856 -35111 -46554 -52900 -58451 -39255 -37077 -40396 -17369 -44638
19560 -44638 -86323 -63350 -54373 -48205 -10989 18864 27366 19589 -229 -32526 -41484 -30831 -14778
19547 -14778 21848 41317 37391 -10310 -41571 -69667 -59680 -36966 -54957 -87324 -99525 -41748
19535d1748K6524N127J6390j8775l2050k7875K9279J9333p221K3238J8767K6337
19523C7326k7655l2193q354M3015K2791r723J2202j6335m1645J972J3573R513
19511D487j5260m4438j2480K9173K0033O451L1551O948l8761n5284j8815j6918
19499a03313p559K2270K1672M3090K38N789l2076R317j1166J0721K2041K9502
19487A0526k280K3810L2559L997l7995o1268j6908J6688K1448j1445k2703L4465
19475i106j3685l021j7892N110Q832J0325J8630k0994J0346Q12j8724J724l6832
19462f4475K9166J1526k0413L5397O857m653j554k0991L4467K9096m2039J0325
19450B709J2921J1441l7406m6974j2887L4719J1138j4347j6445l1339m6445L8944
$$ plain form
19535 -41748 -15224 -10097 6293 -12482 -44532 -72407 -43128 -23795 -31016 -7778 10989 37326
19523 37326 9671 -22522 -30876 12139 34930 25207 37409 21074 -20571 -18599 -5026 4487
19511 4487 -10773 -55211 -67691 -38518 -18485 -12034 19517 26465 -12296 -67580 -86395 -103313
19499 -103313 -110872 -88602 -66930 -23840 -23602 -17813 -49889 -40572 -51738 -41017 -18976 10526
19487 10526 8246 32056 64615 68612 30617 -30651 -47559 -30871 -9423 -20868 -43571 -9106
19475 -9106 -22791 -25812 -43704 -38594 -29762 -19437 -807 -21801 -11455 -10643 -29367 -27643 -64475
19462 -64475 -35309 -23783 -44196 -8799 -1942 -6595 -8149 -29140 5327 34423 -7616 2709
19450 2709 15630 27071 -10335 -57309 -70196 -35477 -24339 -38686 -55131 -86470 -132915 -93971
19438i3971O6904J7358L598j084Q328K5897K2807P239l5830n1699p543M0676j7256
19425a4576m6047o259L9113J6165J9375j0644J2932K8622P675m0859k2972Q440
19413i035l835k6324o170J2858J8057o069j4248k0111L1351L9808P327n387k3931
19400e709K422J7465m995J5069q635j8434j3696j432j7294j6955R858J9432q454
19387c1358K6445L5927k4095k6773L5640M852l2021J5813J8107j0270l4930N867
19375a6796L7887k1212j2597R705j7008j3183J6030R384K778J2819j035k2926
19363a6154n5238m552L0317L9719L6004j921j1333L500K21m9022P534N187R415
19350f323j7515m5534O63O3642j2105k4596M2829J7461k6960O772k2348k9693
$$ plain form
19438 -93971 -27067 -9709 -6111 -7195 1133 27030 49837 57076 21246 -30453 -37996 2680 -14576
19425 -14576 -60623 -66882 -27769 -11604 7771 -2873 10059 38681 46356 5497 -17475 -9035
19413 -9035 -12870 -39194 -45364 -32506 -14449 -20518 -34766 -54877 -23526 16282 23609 18222 -5709
19400 -5709 -3287 14178 9183 24252 15617 -2817 -16513 -17945 -35239 -52194 -42336 -22904 -31358
19387 -31358 -4913 31014 6919 -19854 15786 20638 -11383 4430 22537 12267 -22663 -16796
19375 -16796 21091 -121 -12718 -3013 -20021 -33204 -17174 -7790 -5012 7807 6772 -16154
19363 -16154 -71392 -75944 -45627 -5908 30096 28175 16842 20342 20563 -28459 -20925 -15738 -6323
19350 -6323 -23838 -69372 -68709 -5067 -17172 -41768 1061 18522 -8438 -1666 -24014 -53707
19338e3707K7364J5348O802k4588r854N26p481p272J2214K3191R347l0079r725
19325d7914K055k9860M1694J7985k4081J3621Qj3930m06m77K7127L2536q791o689
19311B878K6875N393J0279l1133l7423O306J8461J3367k7456j3968J2477K09L539
19298a0196N093j9508j0190J8482l5886q964P6927J6412j09j5312j9189j4078
19286a6518k658J7204P036j2322l2658J1165K4571K7521l7272J3123K3176J870
19274B4238j3285l9322n288L265j2878O1566j3446l6409k3984L0545L4465R577
19262A9044K9527k8590m7288P191P794J7196l80N054j8698l1903J0831N0510j2188
19249H100m0581J2343j0078l5710N5173N4534j9876l2191m718K1023Q388j1019
$$ plain form
19338 -53707 -26343 -10995 -4193 -28781 -38635 -38109 -45590 -52862 -40648 -17457 -8110 -38189 -47914
19325 -47914 -45859 -75719 -34025 -16040 -40121 -26500 -26492 -40422 -40828 -41305 -14178 18358 9567 2878
19311 2878 29753 35146 45425 14292 -23131 -16825 1636 15003 -12453 -26421 -13944 -13735 -10196
19298 -10196 -5103 -24611 -34801 -16319 -52205 -61169 15758 32170 32061 16749 -2440 -16518
19286 -16518 -19176 -1972 5064 -7258 -39916 -28751 -4180 23341 -13931 -808 22368 24238
19274 24238 10953 -28369 -33657 -30392 -43270 18296 4850 -31559 -55543 -24998 9467 19044
19262 19044 48571 19981 -27307 -20116 -12322 4874 4494 9548 -9150 -41053 -30222 20288 8100
19249 8100 -32481 -20138 -30216 -65926 -10753 43781 23905 -8286 -13004 8019 16407 5388
19237E388j4885M826l6l890J023k268k083l6646j3915J048J4344J0148J4338L1043
19223H435n0619j0714J8024K2676k034J8648n645j4804L1819L794M91l3440M213
19210i156P956r008L2159K788m523q098k7714l4720l0152n59J8451J6328P411
19197c8837L2888M782k6584J7941K3177K2268r85j8893m0212j5142K6211J4659
19185A273q908m1308j6771L5537j9170j2507L9219j2638j2864j4962J6463K7336
19173a9300J5649L119k3530j0916m6439J1418K6321J3624J3152M615j2299L3762
19161I176m1502l6639k23K7200K9637J6254J5235l0015N700R487m569Q146J0944
19148A8831m5979m992J3752N938P388j9940L7549L7902k8765l3283L8721J9624
$$ plain form
19237 5388 -9497 -4671 -4707 -8597 -7574 -9842 -11925 -48571 -62486 -61438 -47094 -36946 -22608 8435
19223 8435 -42184 -52898 -34874 -12198 -14232 4416 -1229 -16033 15786 19580 20071 -13369 -9156
19210 -9156 -1200 -10208 21951 24739 20216 12118 -15596 -50316 -80468 -81027 -62576 -46248 -38837
19197 -38837 -5949 -1167 -27751 -9810 13367 35635 34650 15757 -24455 -39597 -13386 1273
19185 1273 -7635 -48943 -65714 -30177 -49347 -61854 -22635 -35273 -48137 -63099 -46636 -19300
19173 -19300 -3651 -532 -24062 -34978 -81417 -69999 -43678 -30054 -16902 -12287 -24586 9176
19161 9176 -32326 -68965 -69188 -41988 -12351 3903 19138 -10877 -5177 4310 -259 7887 18831
19148 18831 -27148 -32140 -18388 -12450 -5062 -25002 12547 50449 21684 -11599 27122 46746
19136D6746k1752m2509l5759j9380J294M099K3895O733j3621K3426K2726J2168
19124H066j5806M434j7639k263N940J0032j8266l0610j1596k45J1102l872K5134
19111c5589m0232J1004L7470L439j9746L523K2731L0817K3818j5487l0495k6420
19099c5167l9051j9256k8684M0755r152j5880J4051J836K1457L4355J265k5454
19087e8925k546q396L4793K6707p300J3353j4805O987n949m982Q837L3819j3233
19074H360K547j5096m4907N098k5075K0057M346k2429j0013K1567r672J1844K7039
19061b6334J0023R19m984j4546k6603J8682J3384K5631j1217k7532k0569o9l767
19048f6982K631k7646J2225K4540J0051k304j1081M213M0373L9156r164l8011
$$ plain form
19136 46746 24994 -17515 -53274 -72654 -71360 -67261 -43366 -36633 -50254 -26828 -4102 8066
19124 8066 -7740 -3306 -20945 -23208 -17268 -7236 -25502 -56112 -67708 -67953 -56851 -60723 -35589
19111 -35589 -75821 -64817 -27347 -23908 -43654 -40131 -17400 13417 37235 21748 -8747 -35167
19099 -35167 -74218 -93474 -122158 -81403 -90555 -106435 -92384 -90548 -69091 -34736 -33471 -58925
19087 -58925 -61471 -69867 -35074 -8367 -15667 -2314 -17119 -10132 -16081 -21063 -12226 21593 8360
19074 8360 10907 -4189 -49096 -43998 -69073 -49016 -44670 -67099 -77112 -55545 -65217 -53373 -26334
19061 -26334 -16311 -15392 -20376 -34922 -61525 -42843 -29459 -3828 -15045 -42577 -63146 -63215 -66982
19048 -66982 -64351 -91997 -79772 -55232 -45181 -47485 -58566 -54353 -13980 25176 16012 -21999
19036b1999p740J4866K2437J2453M3146k8929o6084k2338L2744O698j0865q088
19024c3699M799Q068J6006O644o097M445L00L5763j1624k0425O736L8622L716
19011E3254n4937m144M776J931k0775j5259K2465M903k6363J9265K236J7677J0273
18998A5302J0566J3885n1602m7665N717M2008K524j4632m004K1113m039k5544
18986c6371r821J8295L0114l5058k3262l2820j8308L9665K3826J9235l1385r62
18974e6852M8501K1458J952l157j3674k2969N208J7833j2983k7188j6300J1596
18962d6575N012J8527n598m965P192J6966p905m3162j7263L867k173M930J2810
18949e8337M2305j5456q431Q456L8990M6299J8913o2138l0783r716l119K7483
$$ plain form
19036 -21999 -29739 -14873 7564 20017 63163 34234 -31850 -54188 -21444 -14746 -25611 -33699
19024 -33699 -28900 -20832 -4826 1818 -4279 166 466 36229 24605 4180 10916 49538 53254
19011 53254 -1683 -5827 -1051 880 -19895 -35154 -12689 -7786 -34149 -14884 -12648 5029 15302
18998 15302 25868 39753 -11849 -59514 -53797 -11789 -9265 -23897 -27901 -6788 -10827 -36371
18986 -36371 -46192 -27897 2217 -32841 -56103 -88923 -107231 -67566 -43740 -24505 -55890 -56852
18974 -56852 -8351 13107 15059 11902 -1772 -24741 -19533 -1700 -14683 -41871 -58171 -46575
18962 -46575 -41563 -23036 -28634 -33599 -26407 -9441 -17346 -60508 -77771 -73904 -76077 -71147 -58337
18949 -58337 -16032 -31488 -39919 -31463 7527 53826 72739 10601 -20182 -29898 -33017 -5534
18937e534O122k6296j2834j1096K6306j6257Q42L8682j0963m6704k4271J5090
18925f6913n854l220R021K7098L270K124j5361j3222J4499n712K584M2330J8278
18912H922j5917n9861L596o488j9297j5906M425K9905O4001K7013j205j1140j9626
18899a1578K6439k3896q768J757k513j0183J7605K1720j6101K1297J0156k0640
18887E295k6613k3016K3053n962k8966K0124M821l3505l4772K0365J2812K086
18875f4278L243K6188l402K6589L453k6820j8356P456j278n264L917L7525k9377
18862d0404J483R969R235o8305j5232N1681J1565r43L2660K9116k608k5976l0991
18849c8750r775J8178k747P758R174k9312j6796J7839N1580p227j5661j8260O69
$$ plain form
18937 -5534 588 -25708 -38542 -49638 -23332 -39589 -38747 -65 -11028 -57732 -82003 -66913
18925 -66913 -72767 -75987 -66966 -39868 -36598 -34474 -49835 -63057 -48558 -54270 -51686 -9356 8922
18912 8922 -6995 -66856 -63260 -69748 -89045 -104951 -100526 -70621 -6620 20393 19188 8048 -11578
18899 -11578 14861 -9035 -17803 -16046 -18559 -28742 -11137 10583 -5518 15779 25935 5295
18887 5295 -21318 -44334 -21281 -27243 -56209 -36085 -31264 -64769 -99541 -79176 -66364 -64278
18875 -64278 -61035 -34847 -38249 -11660 -8207 -35027 -53383 -45927 -47205 -52469 -48552 -11027 -40404
18862 -40404 -38921 -28952 -19717 -88022 -103254 -51573 -40008 -40951 -8291 20825 18217 -7759 -38750
18849 -38750 -48525 -30347 -33094 -25336 -16162 -45474 -62270 -44431 7149 -78 -15739 -33999 -33330
18836c3330j2233L8072M7626J0995j8203k1650k2622k1889N581L3579j1014k366
18824g454K1069l1893l977M1348l355j6578J9583J9506m0582J0178j8242j833
18812a2230k6252j0572L3234J7159k8447k2352n351J6589r376M891j6832J0000
18800d9539K0913M4423j3550k6348k2854K5571L9297r779K8242q285k6110o97
18788A284J0781q749J698l5555M117K619j1571J8834J4362N786j0384l629R947
18775d60J2815K9433M328K2273L9621J0922M2730P2440J8075L870l8891j06888
18763A10268m4965l1856k5634k2002o599j5361J4420L0630O142j4450j7968J8747
18751A372j4088j358k4558k8425L6397K6756p0733R492N4088J8386l6484k0503
$$ plain form
18836 -33330 -45563 -7491 40135 51130 32927 11277 -11345 -33234 -27653 5926 -5088 -7454
18824 -7454 13615 -18278 -22255 19093 15738 -840 18743 38249 -2333 7845 -10397 -12230
18812 -12230 -38482 -49054 -15820 1339 -27108 -49460 -54811 -38222 -47598 -42707 -59539 -49539
18800 -49539 -28626 15797 2247 -24101 -46955 -21384 17913 8134 36376 28091 1981 1284
18788 1284 12065 3316 5014 -30541 -26424 -23805 -35376 -16542 -2180 3606 -6778 -10407 -460
18775 -460 12355 41788 46116 68389 108010 118932 161662 234102 252177 256047 217156 110268
18763 110268 65303 33447 7813 -14189 -20788 -36149 -21729 8901 15043 593 -17375 1372
18751 1372 -12716 -14074 -38632 -67057 -30660 -3904 -74637 -65145 -11057 7329 -29155 -49658
18739d9658m20l151J4151M6621L6727m4755l0474J7096j1667M4087K3313l4338
18727G532m1445l8945K048N1501L3830K33J1320q485J3933j0790M3779r476k9489
18714B5546k341j752k0158L0048J4441j1904l6954J1077j7272k6503q944J8638
18702b6078J8488j3018j2250m25j3007J2048J3341k1427M0298K3085J5758j5997
18690B0816J1732k6202l087j1423J1637L3050k868L896k9560J542M497R889k8557
18677d638J684k0790K1688K640k5647K820j5964j4621J7931J3669j6602K2675
18665a5155m468K4456L1088j6325n2844R681k4786j5275n039m2274m979j2322
18653a28242K4130K7349K5905l7390j4711L0364K3401J1144k2854j245O703N0722
$$ plain form
18739 -49658 -50078 -53229 -39078 7543 44270 -485 -30959 -13863 -25530 18557 41870 7532
18727 7532 -33913 -72858 -70810 -19309 14521 14754 26074 17589 31522 20732 64511 55035 25546
18714 25546 23205 21453 1295 31343 45784 33880 -3074 8003 -9269 -35772 -44716 -26078
18702 -26078 -7590 -20608 -32858 -33283 -46290 -34242 -20901 -42328 -2030 21055 36813 20816
18690 20816 32548 6346 3259 -8164 3473 36523 33655 37551 7991 9533 14030 23919 -4638
18677 -4638 -2954 -23744 -2056 584 -25063 -22243 -38207 -52828 -34897 -21228 -37830 -15155
18665 -15155 -19623 4833 35921 19596 -33248 -23567 -48353 -63628 -68667 -110941 -115920 -128242
18653 -128242 -104112 -76763 -50858 -88248 -102959 -72595 -49194 -38050 -60904 -62149 -55446 -4724
18641d724J8123l24k2146k919J8504K8973L0158l575l472o4630n0466K2279R370
18628b4849k5425m88j2832j6364M1191K0023j9730n85j637R404J0859j8210m5810
18615h4453J64m200j5181M1910K6118Q68p941j3279J2004K7625j1563n343r709
18602d2980r119J3030J3023L4978J8126J1238m1007M555K0801K094o47n729k3599
18589e236l9388k2121K2573r993K1238K0692N265j6710j8665K8584N4712K1418
18577F2369q391l7880m5149J1097m813K6419m3536p944K4005J769j3460N562m432
18564c4384J6244p121j0327O458o0003J2575N9037J8294l0085k8835o2985L6354
18552h4778M2989j1548j1905O747K7533J4828k3120l6253K4367O2498K95j4545
$$ plain form
18641 -4724 13399 13075 -9071 -11990 6514 35487 65645 62070 58598 -6032 -56498 -34219 -24849
18628 -24849 -50274 -50762 -63594 -79958 -38767 -18744 -38474 -39059 -40696 -31292 -20433 -38643 -84453
18615 -84453 -84289 -88489 -103670 -61760 -35642 -34774 -42715 -55994 -43990 -16365 -27928 -33271 -42980
18602 -42980 -52099 -39069 -26046 8932 27058 38296 -2711 1844 22645 24739 24092 18363 -5236
18589 -5236 -44624 -66745 -44172 -54165 -32927 -12235 -6970 -23680 -42345 -13761 40951 62369
18577 62369 53978 16098 -29051 -17954 -22767 3652 -39884 -47828 -23823 -22054 -35514 -29952 -34384
18564 -34384 -18140 -25261 -35588 -29130 -89133 -76558 -17521 773 -29312 -58147 -121132 -84778
18552 -84778 -41789 -53337 -65242 -58495 -30962 -16134 -39254 -75507 -51140 11358 11653 -2892
18540b892N31j1121o510l852J9264J5076J0708l0590K0293J6164L767l0197k1141
18527b0500J4648p277l5261j2607K7009J5644j2177J1213j7152k4302M1623K2304
18515C165P781n352j0025O431R096j8602l8625j9323j4441j940J4798L0965L2275
18502c797J3612K0569N639k7474k4699K862L1562K0555k8620P95m125N900R553
18489B2332J6744R191l2831j4556P106J285q934j0228j0075J2206K5985L6898
18477E5123L6729p303j2405j3105Q443J7596K2352l1849j8624O384K303J968k2839
18464D4773r308p07L1468k2067k316J4580m2707Q911l206N676n653K470r523p591
18450D800J0339o199j8070P526n692q161J0598j2648K1769L2006m2693o951K6354
$$ plain form
18540 -2892 -2361 -13482 -19992 -23844 -4580 10496 21204 -9386 10907 27071 30838 641 -20500
18527 -20500 -5852 -13129 -48390 -60997 -33988 -18344 -30521 -19308 -36460 -60762 -19139 3165
18515 3165 10946 5594 -4431 2000 11096 -7506 -46131 -65454 -79895 -81835 -67037 -36072 -3797
18502 -3797 9815 30384 36023 8549 -16150 -13288 18274 38829 10209 11004 6879 12779 22332
18489 22332 39076 48267 15436 880 7986 9271 337 -9891 -19966 -7760 18225 55123
18477 55123 91852 84549 72144 59039 67482 85078 107430 75581 56957 63341 65644 67612 44773
18464 44773 35465 34758 66226 44159 41843 56423 13716 22627 19421 25097 19444 21914 12391 4800
18450 4800 15139 8940 -9130 -1604 -7296 -15457 -4859 -17507 4262 36268 -6425 -13376 12978
18437A2978p901M682j4765l264L1792J9529j3290m1169j5861r326K3516J1328
18425a751j7949M568J092M562N019J0069K4692R245j4145j2792R835k1567l2462
18412c1584l38L849o972K1379J037j4707J488l1947L1964j939o023J3166L4038
18399A3411M579P646O8j7429l0787J3960p867k6170m281K1648K3446j4276J2799
18386c253J5051k1311j0435K7994M061q732l2717k3034M1117J607J8466p030j4120
18373a2336j5876M227j516j2741M2471k3161J752J1154j9745j5197M374K0826
18361a5768L801m4227J0810p228n4751j9187N6087M0888m613K25K002q283j0797
18348e1041m1281j5095o856j922K0835K0161K6926R855J4044m066j6440j3377
$$ plain form
18437 12978 5077 9759 -5006 -8270 23522 43051 29761 -11408 -27269 -36595 -13079 -1751
18425 -1751 -19700 -15132 -14040 -9478 -4459 5610 30302 39547 25402 12610 22445 878 -31584
18412 -31584 -31922 -28073 -35045 -13666 -12629 -27336 -25848 -57795 -25831 -27770 -33793 -20627 13411
18399 13411 17990 25636 25704 8275 -22512 -8552 -16419 -42589 -46870 -25222 -1776 -16052 -3253
18386 -3253 11798 -9513 -19948 8046 12107 3375 -29342 -52376 -11259 -9652 8814 1784 -12336
18373 -12336 -28212 -23985 -25501 -38242 4229 -18932 -17180 -6026 -25771 -40968 -36594 -15768
18361 -15768 -11967 -56194 -45384 -52612 -107363 -126550 -70463 -29575 -34188 -33963 -31961 -40244 -51041
18348 -51041 -92322 -107417 -114273 -116195 -95360 -75199 -48273 -38418 -24374 -28440 -44880 -58257
18336e8257k2987L6638q958J3446j432j9677j9292K2588K4149L2770P669k2737
18324a6080o501j9130J8595N993K6125j0572r908L6086p277l6439L098K901J0731
18311b378J7328K2030k4775J4283q094m532j2040k0412M366p557n574k8856k1890
18298g8101K3091Q251k423J8058K0977K8776l054k2864j733r966L253k7507n968
18285d9210L6562L6523j7038j7556l070j9741J6008J0603J2249J1052m950j3972
18273b540l8277j6869J4207J2417j9340J5195K9886L1685j5011m273K27j853k1257
18260a5803m926p922l7898R542q114J2549K7607J6794j103K2277M3054j1526j7822
18247B6709j5936P454K0424j2204l1301L194J0722J4371O549j6817R644K1052
$$ plain form
18336 -58257 -81244 -44606 -53564 -40118 -41550 -61227 -80519 -57931 -33782 -1012 6657 -16080
18324 -16080 -22581 -41711 -23116 -17123 9002 -1570 -11478 24608 17331 -19108 -16010 -13109 -2378
18311 -2378 14950 36980 12205 26488 18394 13862 1822 -18590 -14224 -21781 -27355 -56211 -78101
18298 -78101 -55010 -46759 -49182 -31124 -10147 18629 15575 -7289 -9022 -18988 -15735 -43242 -49210
18285 -49210 -12648 23875 6837 -10719 -13789 -33530 -17522 -6919 5330 16382 11432 -2540
18273 -2540 -40817 -57686 -43479 -31062 -50402 -35207 -5321 26364 11353 7080 7307 5454 -15803
18260 -15803 -20729 -28651 -66549 -57007 -65121 -52572 -24965 -8171 -9274 13003 56057 44531 26709
18247 26709 10773 18227 38651 26447 -4854 -1660 9062 23433 29982 13165 22809 43861
18235D3861L2835o789k1692m5261J867j1863j2029O800J2262j3278M628J2773
18223D114J0534n4670O881L7277K4070k178O766j3771n114o486J5019Q263j1837
18210A8868O482j2158j8556J8532K958J0198L1678M0779j771k2770n2811P9R57
18197B2465J0229J2252j7118K1112J1521l2724j4388Q365K2505l3600o174r480
18185e035K228O299K8870j1919l2620J9524J9135J9196l7267l1502j6287r53L2560
18172g771K6582J3132R609j2488k7626J0944J7257J6470j2787K9923j2617L0365
18160H0993O955Q486J1585P005K7551J6021j1857Q562M378K471j7705k2280j443
18147A20722K2275N129J165k2938q459J7308J9935K1688N3114L8829j1072j2390
$$ plain form
18235 43861 76696 69907 48215 2954 4821 -7042 -19071 -12271 -9 -13287 -8659 4114
18223 4114 14648 -40022 -33141 4136 28206 26028 32794 19023 13909 7423 22442 30705 18868
18210 18868 25350 13192 -5364 13168 16126 26324 58002 98781 97010 74240 21429 21508 22465
18197 22465 32694 44946 27828 48940 60461 27737 13349 21714 44219 10619 4445 -5035
18185 -5035 -2807 3492 32362 20443 -12177 7347 26482 45678 8411 -23091 -39378 -40331 -7771
18172 -7771 18811 31943 41552 29064 1438 12382 29639 46109 33322 63245 50628 80993
18160 80993 87948 96434 108019 115024 142575 158596 146739 155301 159679 162150 144445 122165 120722
18147 120722 142997 148126 149291 126353 117894 135202 155137 176825 229939 268768 257696 245306
18135B45306k865r120K3690P3629Q0692K4549N3725L0530N9940R6719J10651J32786
18123I20232J38300J49875J73630K25450K95090M82243P88473J179989J853720
18114F207002L119422M907478P284042R529688Q360962L086736M36915l750401
18106C9181844j2335278j0696623n772076l082055j766334j100589q14273n82130
18098C032486m35859l81083k89693j99054j53342j50441j50308j38135m7244k6594
18088A060733j613o0691n0692q3654o4744m8145q3021o9996k5087m700M4258J339
18076F13987j1593l7017l5278k6452J0584l3783j5226j9483p2277k8163O772l567
18064C48504j577l2218j2185M114J9162j2084P044j4162p2011l7477J7965K8121
$$ plain form
18135 245306 242441 233321 257011 330640 411332 435881 489606 520136 580076 676795 787446 920232
18123 920232 1058532 1208407 1382037 1607487 1902577 2384820 3173293 4353282 6207002
18114 6207002 9326424 14233902 21517944 31047632 39408594 42495330 42932245 39181844
18106 39181844 26846566 16149943 10377867 7295812 5529478 4428889 3614616 3032486
18098 3032486 2596627 2215544 1925851 1726797 1573455 1423014 1272706 1134571 1087327 1060733
18088 1060733 1059120 998429 947737 864083 799339 751194 668173 598177 573090 568390 612648 613987
18076 613987 602394 565377 530099 503647 514231 480448 465222 445739 373462 345299 352071 348504
18064 348504 346927 314709 302524 306638 325800 313716 320760 306598 234587 197110 215075 243196
18052B43196j7628j5712j4554o09J9065l415l7097J0905J4146j0494l043j730
18040A83030j9756L592j145k1656l415K1846o466Q92k4452l1367k2561m0303l2517
18027E722N614L3354K2610N0863L7300m0201j3721l892j0197q816R133J0373J2334
18014A10476l0445j1752J6787J9614k0486m2885j3943j6319k7596q485L5628K8446
18002C9040R549J5830K0398P063l4544j6913J2065J5215j8462J9698K5584r116
17990H5407j6958j5953J1539j9359Q047J0803l236k2486k9549M445K4982K1322
17978E9004j5697l5932K7489J5548r2K2157J247o7323k1452J8942K0565J093l5366
17965i817j9602q867k5057K4664M5382K9739m7351l2346J1037K9640J7091k3861
$$ plain form
18052 243196 225568 209856 195302 194693 213758 210343 173246 184151 198297 187803 184760 183030
18040 183030 163274 166866 165721 144065 140650 162496 156030 156922 132470 101103 78542 38239 5722
18027 5722 11336 44690 67300 118163 155463 115262 101541 97649 87452 78636 87769 98142 110476
18014 110476 80031 68279 85066 104680 84194 41309 27366 11047 -16549 -25034 10594 39040
18002 39040 48589 64419 84817 91880 57336 40423 52488 67703 49241 68939 94523 85407
17990 85407 68449 52496 64035 44676 52723 63526 60290 37804 8255 12700 37682 59004
17978 59004 43307 7375 34864 50412 50320 72477 73724 6401 -15051 3891 24456 25549 -9817
17965 -9817 -29419 -38286 -63343 -38679 6703 36442 -10909 -43255 -32218 -2578 14513 -9348
17953i348k2595j8106J5518L2263J931M142J4089l8542m3215Q934j1064j5539
17941h1532Q315q728J6463K2698J3582M185k078O630P49J9287J1783j4140J8796
17928A6010K681j013k1342k6694N907N5427J8749M8645k6189K14m3975l2468l1079
17915c5127K1280J2224l726l1441R225J6604R795j0070n430n841K6319K4340n011
17902B3141J3334J3826l295N617k9406J191j5884j2024J8899k5606P763M901J4496
17889A6953N263M876j7359q018L886j0351m0531M336N468K2109O708K9240K7454
17876E0034L4512M1663L8580L3382q107j4178K5662K8961Q2239O6441N8688M0821
17864D78698O7612M0642N6922M3171K8577o185j4137k2344L9588P3616J9329K242
$$ plain form
17953 -9348 -31943 -50049 -34531 -2268 -337 3805 17894 -20648 -63863 -54929 -65993 -81532
17941 -81532 -73217 -81945 -65482 -42784 -29202 -25017 -27095 -20465 -19716 -429 11354 -2786 16010
17928 16010 18691 17678 -3664 -30358 -24451 30976 49725 98370 72181 72395 28420 -4048 -35127
17915 -35127 -13847 -1623 -5349 -36790 -27565 -10961 -1166 -11236 -16666 -22507 3812 28152 23141
17902 23141 36475 50301 47006 52623 23217 24408 8524 -3500 15399 -10207 -2444 2457 16953
17889 16953 22216 27092 9733 1715 5601 -4750 -45281 -40945 -35477 -13368 -6660 22580 50034
17876 50034 84546 126209 164789 198171 190064 175886 201548 230509 312748 379189 437877 478698
17864 478698 546310 586952 643874 687045 715622 709437 695300 672956 712544 786160 805489 807731
17852H07731j7762p6364l6593J331l7196J5261J9163j2756j9545Q757N6497P0595
17840G79119M4457q401k5911n8501j7074K0760p156L5121L659l7428o8364j08745
17828E51536j30460l0819L1816m5803k0684k3819n5272n0177j4463m3823l2036
17817A35996p2247m7039L0936O0844l0422l6534j1140R110J1482o43j1852n563
17805C2928Q216J6847J8589J2231p712l943K4807j3880k0437l4543j4997j8790
17793f84K5726K4071N5883K5693o7290l6850N73j6347R120k258R641J4756l8975
17780C059j8788K3779J1480Q559k8383m1419M6887M2377o029j4138r186n404J7871
17767C0665K6633q309j4877J4346m7591k6230k5052J6750M068o603R638J9758
$$ plain form
17852 807731 789969 713605 677012 678343 641147 656408 675571 662815 643270 652027 708524 779119
17840 779119 823576 815175 789264 730763 713689 734449 727293 762414 766073 728645 660281 551536
17828 551536 421076 390257 422073 376270 355586 331767 276495 226318 211855 168032 135996
17817 135996 63749 16710 47646 108490 78068 41534 30394 39504 50986 50343 38491 32928
17805 32928 41144 57991 76580 88811 81099 77156 101963 88083 67646 33103 18106 -684
17793 -684 25042 49113 104996 130689 63399 26549 27122 10775 19895 17637 27278 42034 3059
17780 3059 -15729 8050 19530 28089 -294 -41713 5174 47551 41522 27384 18198 12794 30665
17767 30665 57298 48989 34112 48458 867 -25363 -50415 -33665 -29597 -36200 -26562 -6804
17755f804K9961K0458K8565j1067l3648m2062q445J6930j4197k0436L881J2425
17743b4439j3475r145J0273Q279K3841N8071q848l7753k1413M5707K2513n0113
17731C498n3399J4693K9840q469N971l546J746j9932l167J8562J0325j474j6011
17718b1363l0019q657J8661l625J6395K0678K1387j0276j2228l2858q082j8354
17706f8341j2277K1648M588N6713L6738P6O481P325l2336j7571L6739j2150J3090
17693D0723J0918j0987j9747O70k314n5743k0236K1294j3355L7798J2988j7577
17681a5568L4340r6k3897J2090R318j9943J2108l2230J6100K8648n498J2938J3662
17668D1972k6324l2855J0573M5231O241O63k706K2122o889m951K0506K6433j0395
$$ plain form
17755 -6804 23157 43615 72180 61113 27465 -14597 -23042 -6112 -20309 -40745 -36864 -24439
17743 -24439 -37914 -47059 -36786 -28507 -4666 53405 44557 6804 -14609 31098 53611 3498
17731 3498 -49901 -35208 -5368 -13837 -7866 -11412 -9666 -29598 -32765 -14203 -3878 -5352 -21363
17718 -21363 -51382 -60039 -41378 -45003 -28608 -7930 13457 3181 -9047 -41905 -49987 -68341
17706 -68341 -80618 -58970 -54382 2331 39069 39145 45626 52951 20615 3044 39783 27633 40723
17693 40723 51641 40654 20907 21577 19263 -36480 -56716 -35422 -48777 -10979 2009 -15568
17681 -15568 18772 18676 -5221 6869 16187 -3756 8352 -23878 -7778 20870 15372 28310 41972
17668 41972 15648 -17207 -6634 38597 44838 45501 42795 64917 58028 53077 73583 100016 89621
17655H9621l5117j1791l0496l2282K8177m13n222J5399J1849m0630j2599r728
17643c3232r652j5936k9613K5218O680M385L892J9819p857K0605k8245j3425k0060
17630g7421J6735M0528L2576o1673k5296K0236L2003K9589K6849J7980J2927l086
17618F1947K6831J141l1700j7196N559j3330K203J3897l2928k0661J2184J8881
17606B6828N739L3380K9810J4539R058k6647l7383l3103k7119k7613J6400j2920
17594b9031K6120K9541K096L018J4206L0767j4603n56M39k6678m3365M408l808
17581g446L5225q795n534J2695q625J2303P397L5786j4078l5172J0959j1021k3741
17568d7Q18M0277P378m282j9833J7244N2088K5859J591l5272J1292K4987J6125
$$ plain form
17655 89621 54504 42713 12217 -20065 8112 7699 2477 17876 29725 -10905 -23504 -33232
17643 -33232 -42884 -58820 -88433 -63215 -56535 -52150 -48258 -28439 -36296 -15691 -43936 -57361 -77421
17630 -77421 -60686 -20158 12418 -49255 -74551 -54315 -22312 7277 34126 52106 65033 61947
17618 61947 88778 89919 58219 41023 46582 33252 35455 49352 16424 -4237 7947 26828
17606 26828 32567 65947 95757 110296 119354 92707 55324 22221 -4898 -32511 -16111 -29031
17594 -29031 -2911 26630 28726 31744 45950 76717 62114 61558 61997 35319 -8046 -3638 -7446
17581 -7446 27779 18984 13450 26145 17520 29823 37220 73006 58928 23756 34715 23694 -47
17568 -47 771 41048 48426 44144 24311 41555 93643 119502 121093 85821 97113 122100 138225
17555A38225j8459j8325R93L6720P625m278J4935K205m818q920J2419J5292m1221
17542A32393K0604L1818j753q098M1943L2143k1985j5121K2926J7675O852L0746
17530B90143L405l2878n2617k2066j5391m078P53J0406m29r475K4016J9517k6760
17517A84546r137J4254k6563m48K6924k0614k6655k5508l0322j0843L1639K5433
17505A32706k8996m3381j4460K0152R827m762k9948j9829k3375j2554M5548K6664
17493E7592P932k2175p393J0924n5499j2904K4357N257j2260m5868l2149K9350
17481e2836L791j9682k5563j9923M6973K8082o340M774R737l445J7717J0442J8536
17468A2263j8673k2339Q250Q805J6j1250K2274O590K2121M962j6688k4491p330
$$ plain form
17555 138225 119766 101441 102434 139154 146779 142501 157436 159641 154823 145903 158322 173614 132393
17542 132393 152997 184815 183062 174964 216907 249050 227065 211944 234870 252545 259397 290143
17530 290143 293548 260670 208053 185987 170596 166518 167271 177677 177248 167773 191789 211306 184546
17517 184546 175409 189663 163100 162652 189576 168962 142307 116799 86477 75634 107273 132706
17505 132706 103710 60329 45869 66021 75848 71086 41138 21309 -2066 -14620 30928 57592
17493 57592 65524 43349 35956 46880 -8619 -21523 2834 8091 -4169 -50037 -82186 -52836
17481 -52836 -49045 -68727 -94290 -114213 -67240 -39158 -45498 -40724 -30987 -34432 -16715 -6273 12263
17468 12263 -6410 -28749 -20499 -11694 -11678 -22928 -654 5936 28057 33019 16331 -8160 -15490
17455a5490K4996P673L940Q260Q292L1733K0394Q268L1678Q8636J00555O8193
17443C87128K8199J5641J9531o0621p9750k3881l526K7856k8069K896L3509M378
17431C23291M4630N4654l5235m1098k2385M6341M0897L4717L1738j3020P253J3306
17419D85089m889k1493q837q882J9157J8642J6544l532r795k7932k0569K0105
17407D53608L1723k8181J3838j2774l5079K4432K689R756m4864n1503o324J7976
17395C75297L1217K202J633Q85k3352p675q6J6426M8403K1418m7720m4788k6883
17382C46977j1826K6650K6783O75j0757R807K1266K289j5870k5167L278K9508
17370D03613p323K2313Q98K8289J6348K4466j1803J6416L7333J6390J1345k284
$$ plain form
17455 -15490 9506 17179 21119 29379 37671 69404 89798 98066 129744 218380 318935 387128
17443 387128 415327 430968 450499 389878 310128 286247 282721 310577 282508 285404 318913 323291
17431 323291 367921 422575 387340 346242 323857 370198 411095 445812 477550 464530 471783 485089
17419 485089 480200 458707 449870 440988 460145 478787 495331 491799 482004 454072 433503 453608
17407 453608 485331 457150 470988 458214 423135 447567 450256 460012 415148 363645 357321 375297
17395 375297 406514 408716 410349 411234 387882 380207 380121 396547 444950 466368 418648 373860 346977
17382 346977 335151 361801 388584 389259 378502 388309 409575 411864 395994 370827 374105 403613
17370 403613 396290 418603 419501 447790 464138 488604 476801 493217 530550 546940 558285 556001
17358E56001O420L5926L2217L9274N3744K1802K7591J1633J6777j054k1709J0880
17346G89502P6809L5423L4205Q7232O9317M7106O8286J01465J11421N2376J05136
17335A578278J48947J06964J38786J49088J49530J93132J90910K06887J96722
17326C059244K18806K98148L61421L74105L89836L61227L70775M18504N46527
17317F398593N96877P43717R25586J189716J558260K151525L022274M240849N572782
17308B6400179O698126P463209P646908O874833O378814O795125P627380J0081645
17300H5966219J2335802J3654862J2608909P642108L821137J00978l119241n30624
17292A32480150K209383M794215M984746J699757n76940m612901o804449m220914
$$ plain form
17358 556001 562421 598347 630564 669838 723582 745384 772975 784608 801385 800331 778622 789502
17346 789502 866311 901734 935939 1023171 1092488 1139594 1207880 1309345 1420766 1473142 1578278
17335 1578278 1727225 1834189 1972975 2122063 2271593 2464725 2655635 2862522 3059244
17326 3059244 3278050 3576198 3937619 4311724 4701560 5062787 5433562 5852066 6398593
17317 6398593 6995470 7739187 8664773 9854489 11412749 13564274 16586548 20827397 26400179
17308 26400179 33098305 40561514 48208422 55083255 61462069 68257194 75884574 85966219
17300 85966219 98302021 111956883 124565792 132207900 136029037 136130015 133010774 132480150
17292 132480150 134689533 139483748 144468494 146168251 145591311 140978410 134173961 129953047
17284A29953047k588411q06495R93923J703140K825345M420436O102895P655343
17276A50259223N390090J338664r60434n003319n007392j453999R26282K736831
17268A48225946j93593m732171r044818j4817712j4922184j2478596j0033052
17261H2003820p120561o233706o346324p286874q290281p673603o601034n224735
17253B7226702l736013k604484j868643j504267j210207j022559q29203p88764
17245A3662562p47637p26943p24690n90434n59745n09438m52953m18830l78130
17236H553762l71219l46953l65420k67182k46964k57454k61358k30702j94147
17227F012363j97394k03826k03836k06097k56832k27436j67376j48818j91716
$$ plain form
17284 129953047 127364636 126558141 127552064 129255204 132080549 136500985 142603880 150259223
17276 150259223 155649313 156987977 156027543 151024224 146016832 144562833 145489115 148225946
17268 148225946 148032353 143300182 134255364 119437652 104515468 92036872 82003820
17261 82003820 74883259 68649553 62303229 55016355 46726074 39052471 32451437 27226702
17253 27226702 23490689 20886205 19017562 17513295 16303088 15280529 14451326 13662562
17245 13662562 12914925 12187982 11463292 10872858 10313113 9803675 9350722 8931892 8553762
17236 8553762 8182543 7835590 7470170 7202988 6956024 6698570 6437212 6206510 6012363
17227 6012363 5814969 5611143 5407307 5201210 4944378 4716942 4549566 4400748 4209032
17218D209032j88975j70803j45672j35640j22295j28105j19362j14481p3482m7155
17208B963062o6373q7186p3961q7970o1586n1905o1829k9561n5992j00512q0845
17197B205342o6901n2216n6961p1666l5831m0509o1643o2359n3954l008n3162
17186A647132n8192o2959k6470N490m4666j6345l3804n1763m6094J0836j4117
17175A309048m4995k9742L717J7120K0768J7137n2329n8202q1198k9409k3990
17164A047925J1039l1603l9054J3727K452l5453l2038l3462k5174n6676J4966
17153H36649k8897m2695k6738K5088r772q566J6665J1908r898m2489l7842j3647
17141F69766P627J9824p179m3119n3994l4401n6849l4339l3547J0481j174o894
$$ plain form
17218 4209032 4020057 3849254 3703582 3567942 3445647 3317542 3198180 3083699 3010217 2963062
17208 2963062 2896689 2809503 2735542 2647572 2585986 2534081 2472252 2442691 2386699 2286187 2205342
17197 2205342 2138441 2086225 2029264 1957598 1921767 1881258 1819615 1757256 1703302 1700294 1647132
17186 1647132 1588940 1525981 1499511 1505001 1460335 1443990 1410186 1358423 1312329 1323165 1309048
17175 1309048 1264053 1234311 1238028 1255148 1275916 1293053 1240724 1182522 1101324 1071915 1047925
17164 1047925 1058964 1027361 988307 1002034 1004486 969033 936995 903533 878359 821683 836649
17153 836649 807752 765057 738319 763407 753635 745069 761734 773642 763744 721255 683413 669766
17141 669766 677393 697217 690038 646919 592925 558524 501675 467336 433789 444270 443096 436202
17129D36202n6717l3431R92q377P908j015j2048j4151K5342K215j1919J2114P153
17116C54268k7485J4352N9033J294K158L2934m3577n6431j8636J1904J9968j0836
17104C38946r455n224J0398K4887K9841K3494k0595p796m3495L8906M4688k9015
17092C95580m4799l5823J1218M1887k2842m0178k8048J426J6933l089O912R05
17080C00082L3975J2601p15J6129L2931m5097p4411n951r54p708j2538r910N339
17067B43773k7245m0593K6289J9652J2344j8247j0413j2831N064N7053j9645m5629
17055A89572m4566l6726O672K0704K1599K257N038j2775L295O0878P393n3471
17043A69870k3736r865Q882K9468j3908m4170O02J3852k603l528L1477j1293m820
$$ plain form
17129 436202 379485 346054 347046 338669 346577 345562 333514 319363 344705 346920 335001 347115 354268
17116 354268 326783 341135 400168 401462 403620 436554 392977 336546 317910 329814 349782 338946
17104 338946 329491 324267 334665 359552 389393 412887 392292 384496 341001 379907 424595 395580
17092 395580 350781 314958 326176 368063 345221 305043 276995 278421 295354 292265 299177 300082
17080 300082 334057 346658 345943 362072 395003 349906 275495 269544 268590 260882 248344 238434 243773
17067 243773 216528 175935 202224 221876 234220 215973 205560 192729 197793 254846 235201 189572
17055 189572 145006 108280 114952 135656 157255 159512 164550 151775 155070 215948 223341 169870
17043 169870 146134 136269 145151 174619 160711 116541 117143 130995 128392 124864 156341 145048 140228
17030A40228l6768j6709J7428M2094k7665k8968M299N6977L1459m0138n5356o99
17018H6182j226j4675M7245L47m6474K09K8396J0503J7812P99m2782m7549J9207
17005E7994K3595J9305J2020k0019k229p689J5887K8342r521j5313l6011o561
16993E9800J767J6603j9239j3815k220J0886J3657r442j2113J3887o133k0267
16981C3371o34J0448L5532O6780j8756m3296j363O717O232K821j625k6468l1782
16968C7977K2557J2420K9877M075j6507k5983J6343r78M2690M6494m0801j8043
16956A10121J6662R156M5010K6146L0664K0673j4585J6204L3516J9323J7836k5201
16944C05525j8947j9001J829k6602k0676k2403r763N1433J3214k0777j2042K0054
$$ plain form
17030 140228 103460 86751 104179 146273 118608 89640 93939 150916 182375 142237 86881 86182
17018 86182 84956 70281 117526 117873 71399 71608 100004 110507 128319 129118 86336 38787 57994
17005 57994 81589 100894 112914 92895 90666 82977 98864 127206 117685 102372 66361 59800
16993 59800 61567 78170 58931 45116 42896 53782 67439 57997 45884 59771 53638 33371
16981 33371 32737 43185 78717 145497 126741 83445 82082 88799 95031 97852 96227 69759 37977
16968 37977 60534 72954 102831 106906 90399 64416 80759 79781 122471 168965 128164 110121
16956 110121 126783 135939 180949 207095 237759 258432 243847 260051 293567 312890 330726 305525
16944 305525 286578 267577 269406 242804 222128 199725 189962 241395 254609 233832 221790 241844
16932B41844K1387J2096L93Q051k0417j6170L4354M1814k0750k2641k1516J0435
16920B68880L68n8634j4976J9291j1061J3643p212q423l7786o202r498J2910L3462
16907A94762N144j3393q302l248k1624J1090M2035K3868k1126l9169L083n427
16895A67693k9019q059L9m0816k7917K4590k5022k6253J5797j1555j5239K8470
16883E2709K9583J894j3125K6919l843l6597j6005Q724l365L3521L0781P665l7522
16870H1339l3122k7228J0539L9858J6326l3088n6250k647Q601o076k8200k1627
16858e1575K2065L4450L8097M7941M2630J7101K5048k5583j7264L23O812L6292
16846A76337J4408j7192K7488N6087M2738M016m7104L1320l3020p677K3308J6233
$$ plain form
16932 241844 263231 275327 275720 283771 263354 247184 281538 323352 302602 279961 258445 268880
16920 268880 269248 210614 195638 214929 203868 217511 210299 201876 164090 157888 148390 161300 194762
16907 194762 199906 186513 178211 174963 153339 164429 206464 230332 209206 170037 173120 167693
16895 167693 138674 130615 130654 89838 61921 86511 61489 35236 51033 39478 24239 52709
16883 52709 82292 84186 71061 97980 94137 57540 41535 50259 46894 80415 111196 118861 81339
16870 81339 48217 20989 31528 71386 87712 54624 -1626 -4273 4328 -1748 -29948 -51575
16858 -51575 -29510 4940 43037 90978 133608 150709 175757 150174 132910 133233 140045 176337
16846 176337 190745 173553 201041 257128 299866 303882 256778 288098 255078 247401 270709 286942
16834B86942P624q963M7540J8213k65M8562M052j1898k8946Q322K3653L3784L0173
16821D58793K5399m9931n2307k2299J7754M5618j131l3817N497P191m3816k072
16809C54879M3214J1827J2583P90q713J2817n036m993P243J0302j941k2757K1711
16796D31926J1501J6233K4868J0306k4624l7371m7284n45K8962j3727J2266p872
16784D04639j957r619J3678J3793O997k3855k6349L3802J7736M479j3173R609
16772D29780K6870M3109P8694K1645j9422N576M3886M3334R4334J16290P9498
16761I63594J8937N0241J03430P4065N3854O2679N2678R2495J17750O7777O3006
16750A720506N0068L7078P0629R9863O0349N3979P2063Q4660P4748J07554J10162
$$ plain form
16834 286942 294566 285603 333143 351356 351091 399653 403705 391807 362861 371183 394836 428620 458793
16821 458793 484192 434261 381954 359655 377409 423027 421896 388079 393576 400767 356951 354879
16809 354879 398093 409920 422503 423293 414580 427397 422361 417368 424611 434913 432972 410215 431926
16796 431926 443427 459660 484528 494834 470210 432839 385555 385010 413972 400245 412511 404639
16784 404639 402682 393063 406741 420534 427531 403676 377327 411129 428865 433344 420171 429780
16772 429780 456650 499759 578453 600098 580676 586252 630138 673472 767806 884096 963594
16761 963594 982531 1032772 1136202 1210267 1264121 1326800 1379478 1471973 1589723 1657500 1720506
16750 1720506 1770574 1807652 1878281 1978144 2038493 2092472 2164535 2249195 2323943 2431497 2541659
16739B541659R8667P4417L1465Q2492J07599J38218J51827J42981J63763K31105
16729C764193K36930K33845K57245K94381L42626L04951K60472K73295K68800
16720F236738K83962L07132L35935L31650L43952M44512N85445P62455R89028
16711A0620809J283281J778431K574005L567836M714770N852204P074507Q838586
16703D6304429J0995315J2740522J3702260J4204797J5144861J5575789J4054987
16696A42722960J1846419J0203675Q966292M817008j175953l898474m358700n262181
16688A63861046r554864j3833539j2288520q292291n936912o061447m623706k71598
16680A02998169M077373O604957P780813R455921J0286852R377945Q162768P321174
$$ plain form
16739 2541659 2640326 2714743 2746208 2828700 2936299 3074517 3226344 3369325 3533088 3764193
16729 3764193 4001123 4234968 4492213 4786594 5129220 5434171 5694643 5967938 6236738
16720 6236738 6520700 6827832 7163767 7495417 7839369 8283881 8869326 9631781 10620809
16711 10620809 11904090 13682521 16256526 19824362 24539132 30391336 37465843 46304429
16703 46304429 57299744 70040266 83742526 97947323 113092184 128667973 142722960
16696 142722960 154569379 164773054 173739346 178556354 177380401 173481927 169123227 163861046
16688 163861046 154306182 140472643 128184123 119891832 113954920 107893473 103269767 102998169
16680 102998169 107075542 113680499 121461312 130917233 141204085 150582030 158744798 166065972
16672A66065972N524766J69260m152733n462896n950008q358770j3816537j6180085
16664A17838969j4044210j1642360j1775022j3152191j2156594r339414o825102
16657C8904076n655374n147158m121106k986845k160973j647130j300388j090757
16649A4794345q99511p58465o72439o12890n73243m90994m50289m38218m00759
16640I497537l60976l61142l47937k86923l18037l41319k89090k84687l50256
16631F557170l04342k54160k52631k92347k50993k17211k07362j77599j75346
16622D425179j26365j06141j49184j86042j37852j08319q9757m4567r2465j28453
16612C256034j34413j27358j01331m3793m0196r0947n9835l2917q4425q8805o5993
$$ plain form
16672 166065972 171590738 171759998 167607265 162144369 156194361 147835591 134019054 117838969
16664 117838969 103794759 92152399 80377377 67225186 55068592 45729178 38904076
16657 38904076 33248702 28101544 23980438 20993593 18832620 17185490 15885102 14794345
16649 14794345 13894834 13136369 12463930 11851040 11277797 10786803 10336514 9898296 9497537
16640 9497537 9136561 8775419 8427482 8140559 7822522 7481203 7192113 6907426 6557170
16631 6557170 6252828 5998668 5746037 5453690 5202697 4985486 4778124 4600525 4425179
16622 4425179 4298814 4192673 4043489 3857447 3719595 3611276 3521519 3476952 3384487 3256034
16612 3256034 3121621 2994263 2892932 2849139 2808943 2717996 2658161 2625244 2540819 2452014 2386021
16601B386021p0554r3780m8165l1779q1476o9294r9441m1293k1206j1459q5230
16590A732344n6786l0881j0527J1709p0530m1287k7409m4393k2245R694l9105
16579A410584l7731l8819m8622l3548j0255j4320k9443j2133J8469j6127l3445
16568A154610j152j7306J6715J7969k4338q4926l7462l6385l4431p9038l9874
16557H34382m9175m6685J6643L0988j1646k8678L9274L0854k8232l7900m5463
16546G04362J8591K7820r093j6607m2142n1587Q341j0635k7942n5574m6556j4248
16534D84730j9532m0996k8286r301J0841l3863k4707N4365k1640j4783J1158N946
16522C73932n8767l1696k5753J5957o497J9942M1736j2019j9724j9872n385j2652
$$ plain form
16601 2386021 2315467 2221687 2173522 2141743 2060267 1990973 1891532 1850239 1829033 1817574 1732344
16590 1732344 1675558 1644677 1634150 1645859 1575329 1534042 1506633 1462240 1439995 1449689 1410584
16579 1410584 1372853 1334034 1285412 1251864 1241609 1227289 1197846 1185713 1204182 1188055 1154610
16568 1154610 1153458 1136152 1152867 1170836 1146498 1061572 1024110 987725 953294 874256 834382
16557 834382 785207 738522 755165 786153 774507 745829 785103 815957 787725 749825 704362
16546 704362 722953 750773 741680 725073 682931 631344 639685 629050 601108 545534 498978 484730
16534 484730 465198 424202 395916 386615 397456 363593 338886 393251 371611 356828 367986 373932
16522 373932 315165 283469 257716 273673 267176 287118 328854 316835 297111 277239 271854 259202
16510B59202j6247N5712O0009M0987L5442k7828J6919R873j3831l2007l226j7323
16498C67682p077j802m9666n2526j689J4193K1190j082M518K4990N0207K3186
16486C92124j4479R873Q388j711o617l0969l8946m522l178J3555K0712j2247p9734
16473B52249k6998L3795j3784l8962K69j8417K5744J8702R984j1968o854O055
16461B29815j178Q796P350l2297K796N19j0617j7029j235l4127p952m220L0585
16448A71206J0880j1012K5087M8014n451n8681n5658J5525K5225M3112j8404k1313
16436A68530K0249J6584l831r952j8307k9367k1449l240P356K5738j7095n0936
16424H4280n813J7578L6422J9914j4361n2065k4997K9730R263M8033j0744m0639
$$ plain form
16510 259202 242955 298667 358676 399663 435105 407277 424196 434069 420238 388231 385005 367682
16498 367682 360605 358803 309137 256611 254922 269115 290305 289223 293741 318731 368938 392124
16486 392124 377645 387518 395906 394195 387578 356609 317663 313141 309963 323518 344230 331983 252249
16473 252249 225251 259046 245262 206300 206569 188152 213896 232598 242582 230614 223760 229815
16461 229815 228637 237433 244783 212486 215282 215801 205184 188155 186920 152793 144841 140621 171206
16448 171206 182086 171074 196161 244175 238724 180043 124385 139910 165135 208247 189843 168530
16436 168530 188779 205363 201532 191580 173273 143906 122457 119217 126573 152311 135216 84280
16424 84280 78467 96045 132467 152381 138020 85955 60958 90688 99951 147984 137240 96601
16412I6601l7625J961K1688L8144k0267k3140p28L786J6937j1076j7531J8704
16400H7454j3886k7134j5838M545N4368J4571j5594L4062n955m8381m4740j8210
16388E262j8450L6464J7186J6894Q797j1765K4821j845j2126L25m0200j36K3816
16375D9043M167q020J738m713M55M687m5723M2094N7134J0462n6348n4508J5263
16362A5731M3711p389j6571K4544J3750j3974l9693R561K0027l687l5966P883
16350A7927M9311Q280k2329J0922j5836j1033N239N781o313M1868j6702n1635
16338A5480J7407J3248l5025m659J5853K824J6596K3447o364k1097j3270k2451
16326A989j6657J3994J8191j5916P384K2646o664j5975j009O528M13N527l9106
$$ plain form
16412 96601 58976 60937 82625 120769 100502 77362 76634 80420 97357 86281 68750 87454
16400 87454 73568 46434 30596 35141 89509 104080 88486 122548 116593 68212 23472 5262
16388 5262 -13188 23276 40462 57356 66153 54388 79209 77364 65238 65563 25363 25227 49043
16375 49043 53210 45190 46928 42215 42670 47357 1634 43728 100862 111324 54976 468 15731
16362 15731 59442 52053 35482 60026 73776 59802 20109 29670 49697 46010 10044 17927
16350 17927 67238 75518 53189 64111 48275 37242 42481 48262 41949 83817 67115 15480
16338 15480 32887 46135 11110 6451 22304 25128 41724 65171 58807 37710 24440 1989
16326 1989 -14668 -674 17517 1601 8985 31631 24967 8992 7983 14511 14924 20451 -18655
16313a8655l4584M368k93K2519P636m02J881j6089K1693N0357j6626k0093M9973
16300E1685k91j3597k4137j6008J521j6516J8116l55j4634L7805K8682J1956J9690
16287H3917l9306l3934J0377J9347J1106K179J4135l598J3465o911l6261J9540
16275E4056J5877k8093k708k1655K5988K1854j8016J2207K297k5582J3120O29
16263D9974J0062Q665j7662k3332O127K6148k2406j4728j1895k2153k473J3778
16251A05J0288m5342m1091L3561M6185J3966K2400L0911J1942k1615j1503k2474
16239B7333k7856O202K7524j5726J9421J3797Q637M753l3809J1805l58n231o164
16226C0328L411p52J5359K0409k4823j4374L038r502Q071j5678n2772N87J6469
$$ plain form
16313 -18655 -53239 -48871 -49164 -26645 -19009 -19411 -17530 -33619 -11926 38431 21805 1712 51685
16300 51685 51394 37797 13660 -2348 -827 -17343 773 418 -14216 23589 52271 64227 83917
16287 83917 44611 10677 21054 40401 51507 53686 67821 64223 77688 70777 34516 54056
16275 54056 69933 41840 39132 17477 43465 65319 47303 59510 61807 36225 49345 49974
16263 49974 60036 68701 51039 27707 33834 59982 37576 22848 10953 -11200 -13673 105
16251 105 10393 -34949 -76040 -42479 3706 17672 40072 70983 82925 61310 49807 27333
16239 27333 -523 5679 33203 17477 36898 50695 59332 64085 30276 42081 41723 36492 30328
16226 30328 33739 32987 48346 68755 43932 29558 32596 23094 31165 15487 -37285 -36698 -20229
16213b0229p660q118J4048K4419j6735r687K7548p016L4978K2586l1154n5456
16201c2476o595J9856L4945N8647N401j0971o405j6489J7150O916k5847K1147
16189F5279L7181k4006j9144k8361J0809L7825N317k6701k5080j849j1353j3533
16177F384k603N395L2470J7582l1829k0968n617K6752K2698J1454K2934k5284
16165E9368j8873J7649J9604j4310j0993r693K446j5229M273K4318o683l0972
16153B0905j3425L3372K9962K1563R953O787k5773j0081L49j5118K72M0152R023
16140A07941M7959P0094R2382M9280N5125N5083R5242J26516N7064L0937L2021
16129H19644O2269P4125q618r124j861k5740l3212m7781q3000l7130k9786m4315
$$ plain form
16213 -20229 -27889 -36007 -21959 2460 -14275 -23962 3586 -3430 31548 54134 22980 -32476
16201 -32476 -39071 -19215 15730 74377 79778 68807 62402 45913 63063 69979 44132 65279
16189 65279 102460 78454 59310 30949 41758 79583 84900 58199 33119 31270 19917 6384
16177 6384 3781 9176 41646 59228 27399 6431 814 27566 50264 61718 84652 59368
16165 59368 40495 58144 77748 63438 52445 42752 45198 29969 34242 58560 51877 20905
16153 20905 7480 40852 70814 92377 102330 109117 83344 73263 73612 58494 58766 98918 107941
16140 107941 155900 225994 318376 367656 422781 477864 573106 699622 756686 787623 819644
16129 819644 881913 956038 947420 938296 936435 910695 877483 829702 746702 709572 679786 635471
16117F35471l9903l6479m7040M2463K2375K5657P6329R0489Q0222L0848K2065
16106I02497k1177k7233o7569j5376J1724k4548l1874o3325l8959n6250j06638
16095D61272j00449q2030k9970j603k8130l6476k3881j7270j4583n847k4211j7203
16083G9619l3242K5797N026K7400o871l4681L1139R880K663n873k9297K358j673
16070G2245q990p739l7458n063m552Q922N746J1118J3886j6190J629l6669j3537
16057a6652l5137k3101K0912K2449n778L2821M5622j3540K695K9170J1214j2888
16045E7787k2277j6558L4953j065J1689j5926k8025M528L7390q834P038k0652
16033D0048K6949K623k3768k7644M843j5857R32J3133j1900O2J444J1565K9493
$$ plain form
16117 635471 595568 559089 512049 554512 576887 602544 678873 769362 849584 880432 902497
16106 902497 881320 854087 786518 771142 782866 758318 726444 663119 624160 567910 461272
16095 461272 360823 278793 248823 247220 219090 182614 158733 141463 126880 121033 96822 79619
16083 79619 46377 72174 77200 104600 97729 63048 94187 104067 106730 100857 71560 73918 72245
16070 72245 63255 55516 18058 12995 8443 17365 23111 34229 48115 31925 33554 -3115 -16652
16057 -16652 -51789 -74890 -53978 -31529 -37307 -4486 41136 27596 30291 59461 70675 57787
16045 57787 35510 18952 53905 52840 64529 48603 20578 25106 62496 53662 60700 40048
16033 40048 66997 69620 45852 18208 23051 7194 8126 21259 9359 9421 10865 22430 51923
16020E1923K0423K946M137P143k6720j1579L741o2950j2725l8072O457L8494K1521
16007D739k3405j2674J0219L7142j1942j9879j4398k2264J9592N2061j2773j301
15995E117M09M172j2359J8280l4000K3176K1841k900m4323J0305M3894j7724J7469
15982C3357k1185O194o28j9321o502L1003P231J7434n903J5775J6940k7248R186
15969E6333j1942j162j6860l1583m5666O101K6377K6500k723l2692k3813R211
15957d1919j7773r518L0004L6300j9768k1225k1009J7826J2790P128J8159J4113
15945E108J6566o304j9346P985K0767m141o556k941J214J6579J8467J0650m5246
15932A2802j8061J9138r215j1359J6935J3078j7722j1239K5835Q275K3736j3351
$$ plain form
16020 51923 72346 75292 79429 86572 59852 48273 52014 -10936 -23661 -61733 -55276 -16782 4739
16007 4739 -18666 -31340 -21121 16021 4079 -15800 -30198 -52462 -32870 19191 6418 5117
15995 5117 5526 9698 -2661 15619 -18381 4795 26636 23736 -20587 -10282 33612 15888 33357
15982 33357 12172 18366 17738 -1583 -8085 22918 30149 47583 41680 57455 74395 47147 56333
15969 56333 44391 43229 26369 -5214 -50880 -44779 -18402 8098 5375 -27317 -51130 -41919
15957 -41919 -59692 -69210 -39206 -2906 -22674 -43899 -64908 -47082 -34292 -27164 -9005 5108
15945 5108 21674 15370 -3976 4009 24776 20635 14079 11138 12352 28931 47398 58048 12802
15932 12802 -5259 13879 4664 -6695 10240 23318 5596 -5643 20192 28467 52203 38852
15920C8852k8923j2222k6992L4638K026K3306l856K9083m210k0817L5599j6875
15908D9609k2777n326J7375J3102l926l7482r737J6371l137l5111j6357L5202
15896b194L4044j6408j0681j7385J2119j0535J1673L9995L434k8874k7766l8683
15884e1261j5532K726k0403O102O6933K4944L907j6216j0492q339m290Q566l1282
15871d4637j6609L0963J8027L4803j5804j5032J5152Q848j6706j5079k5877j2595
15859e4546l934K8095n7776K2335M7924k325K2342K9561J7623j4098o0421J4J2245
15846a2961J3256j4715l0818m3718K9881J3359M7451L5685j9430m1148l700J6177
15834a0681M9685J2137j316K2777P678m6114n2011k33L1188R725p10k0345l7723
$$ plain form
15920 38852 9929 -2293 -29285 5353 7379 30685 26829 55912 51702 30885 66484 49609
15908 49609 26832 21506 38881 51983 48057 10575 838 17209 14072 -21039 -37396 -2194
15896 -2194 31850 15442 4761 -12624 -505 -11040 633 40628 44062 15188 -12578 -51261
15884 -51261 -66793 -64067 -84470 -78368 -11435 13509 17416 1200 -9292 -17631 -21921 -13355 -44637
15871 -44637 -61246 -30283 -12256 22547 6743 -8289 6863 15711 -995 -16074 -41951 -54546
15859 -54546 -58480 -30385 -88161 -65826 -17902 -20227 2115 31676 49299 35201 -25220 -25206 -12961
15846 -12961 295 -14420 -45238 -88956 -59075 -45716 1735 37420 17990 -23158 -26858 -10681
15834 -10681 39004 51141 49825 72602 80280 34166 -17845 -18078 13110 22835 22125 1780 -35943
15821c5943P542n402j493K1224L0231j9559l4268J9157K6604N826M149l708m7335
15808c2975P11j7588J0748p062J0559J45q617L162J222k1977J0214N4854O831
15795A0227k0362j0881m483j7881L5904P309m156j184J8719J2083K2894k0821
15783B7368m2973l692J0821L3958r274J2542J9657K2948l070o3098k9527M4912
15771B0572K54l8941k3472j1716l2703K1044P8680K5213l9197l1852K3420k6865
15759c5563j0193M8328P3864J4518m4944q2810o3952p646M2592M1598R962K3885
15747I639o788k7986r024k9745k619J6151J0425K4991J8360q510k7294J6376J6715
15734F91J7607l0309l850J3009K0168K7176L762m365K7534j9788M863R383L57
$$ plain form
15821 -35943 -28401 -33803 -35296 -14072 16159 -3400 -37668 -18511 8093 13919 18068 14360 -32975
15808 -32975 -32264 -49852 -39104 -46166 -35607 -35462 -44079 -40917 -39695 -61672 -51458 3396 10227
15795 10227 -10135 -21016 -25499 -43380 -7476 -167 -4323 -5507 13212 25295 48189 27368
15783 27368 -15605 -19297 -8476 25482 16208 28750 48407 71355 68285 5187 -24340 20572
15771 20572 20826 -18115 -41587 -53303 -86006 -64962 13718 38931 -266 -32118 -8698 -35563
15759 -35563 -45756 2572 76436 90954 46010 -36800 -100752 -108398 -65806 -24208 -14246 9639
15747 9639 2851 -25135 -34159 -63904 -66523 -50372 -39947 -14956 3404 -5106 -32400 -16024 691
15734 691 18298 -12011 -15861 -2852 17316 44492 48254 43889 71423 51635 56498 65881 66238
15721F6238l128l2590k9714l9433L7209J4875j4802J94K615j7700L0222K494k0108
15708c628J2564N069k1170k8821J0528j0465J1883q91J4075K5686j4950m252j6185
15695b0557J0334O616j4613J2183O7560L0686k0566j9786j3141L451j1517j9444
15683A1206n6676l4134N077o139M4543M2490J8562J3555l3792l4415k5840m8699
15671a04262j1118K638J9795k891L7175L8944J700J3296J313j2071r163k2532
15659d7176N4900L3499n8357L327N266o96J9164J8750o923j3120k71J1610p730
15646A2243l171O669K000j7775j6429m484m5210m2809K5411M7392K1790J8419
15634D046q040P06l7961l3304L9141J9428M834m745j8582k019J7375O889K515
$$ plain form
15721 66238 63110 30520 806 -38627 -1418 13457 -1345 -1151 1464 -16236 13986 16480 -3628
15708 -3628 8936 14005 -7165 -35986 -25458 -35923 -24040 -24931 -10856 14830 -120 -4372 -20557
15695 -20557 -10223 -3607 -18220 -6037 61523 92209 71643 51857 38716 42167 30650 11206
15683 11206 -45470 -79604 -74527 -80666 -36123 6367 24929 38484 4692 -29723 -55563 -104262
15671 -104262 -115380 -112742 -92947 -95838 -58663 -19719 -18019 -4723 -3410 -15481 -24644 -47176
15659 -47176 7724 41223 -17134 -13807 -8541 -9237 9927 28677 21754 8634 8363 19973 12243
15646 12243 9072 15741 17741 -34 -16463 -20947 -66157 -108966 -83555 -36163 -14373 4046
15634 4046 -3994 -3288 -41249 -74553 -35412 -15984 -11150 -15895 -34477 -36496 -19121 -12232 -9717
15621i717K2994K755k8141L875P022j1934p104K0568k1635J1487n768k9234K054
15608d2778l3602j5680L2150L3307K7535n059k135Q839J1354m2801o460N1042
15596A5712l979l6451K7352M2833n074l1115O657P849k6285L8517L5284m461n731
15583F1108k5462J7153j4921l3258k3579M5176j4198q556j704J1983J4863j5661
15571A2944L678J6390k9887k1770R056J5310j3837L079J0686L118k6698j2089
15559c0020L68L2467o244j0758k7342J7637R538N596k3576j0700j1580N849L9249
15546i516M198n257n9969K157M0236m716K579O621n279J9405l054m997J3638K1076
15532A7122j5292n3276j0883K5251J0340n264j0851K7376L3401k7204n4521j3304
$$ plain form
15621 -9717 13277 16032 -12109 -8234 -1212 -13146 -20250 318 -21317 -9830 -15598 -44832 -42778
15608 -42778 -76380 -92060 -59910 -26603 932 -4127 -6262 2577 13931 -28870 -35330 15712
15596 15712 11733 -24718 2634 45467 40393 9278 15935 23784 -2501 36016 71300 66839 61108
15583 61108 35646 52799 37878 4620 -18959 26217 12019 3463 1759 13742 28605 12944
15571 12944 16622 33012 3125 -18645 -9589 5721 -8116 -5037 5649 8767 -17931 -30020
15559 -30020 -29652 2815 -3429 -14187 -41529 -23892 -14354 -8758 -32334 -43034 -54614 -48765 -9516
15546 -9516 -5318 -10575 -70544 -68387 -28151 -32867 -30288 -23667 -28946 -9541 -12595 -17592 -3954 17122
15532 17122 1830 -51446 -62329 -37078 -26738 -32002 -42853 -15477 17924 -9280 -63801 -77105
15520g7105K3781M1819j3303Q047M0852J2364j9817k1417K0828k7663k7525l5761
15508g4900j0364N1561L0309J0750o297L6438r981r502j4844K1852Ok3851m8265
15495d7088J960L9218M364j8871l5739K4650r564j5954L5709J5094K0450j4012
15483B17L298j0622k2067J227J3405J2476K1192J1290J282m2768J4955n343j9003
15470b0461M7427K6232j4150j0183J475l6256k1784k3304L289L6579L7104O661
15458C2629j1892q544k579k3781n625L850o421L3817R374J2592l4769j6465R493
15445h321K19k2898l7229k5166K1132K0783r9k9546m9042n006L1568N5368N6006
15432G769J9139q967L0209K715m4059P530j2068l0606m2999r806O5150K426p802
$$ plain form
15520 -77105 -53324 -11505 -24808 -16761 24091 36455 16638 -4779 16049 -11614 -39139 -74900
15508 -74900 -85264 -33703 -3394 7356 1059 37497 27516 18014 3170 25022 25028 1177 -47088
15495 -47088 -45128 -5910 -1546 -20417 -56156 -31506 -41070 -57024 -21315 -6221 14229 217
15483 217 3515 -7107 -29174 -27947 -14542 -2066 19126 30416 31698 -11070 3885 -1458 -20461
15470 -20461 26966 53198 39048 28865 30340 -5916 -27700 -51004 -47715 -11136 25968 32629
15458 32629 20737 12193 9614 -14167 -19792 -15942 -22363 11454 20828 33420 -1349 -17814 -8321
15445 -8321 -8102 -31000 -68229 -93395 -72263 -51480 -51579 -81125 -130167 -135173 -103605 -48237 7769
15432 7769 26908 17941 48150 50865 6806 14336 2268 -28338 -71337 -81143 -15993 -13567 -21369
15419b1369J1693j5293r588K8838M572m346J3504M779k6462L151K82M928R685
15406D374K7652k8031R027j9718n825K6504L2449j2727k2730k6751J1850j7717
15394b1643J983L6229P871O28J7992K3731J1801k4646m9952m4637O990J0520N6468
15381C3335J7138j6898K008m722l3588k3549J3038L7166J6097k0046l1615k081
15369a3717J4031k3747K5491K4750k2564m4785j9455L1018N340l615K4876r93
15357c370l1012n823O618q479K9935N573l5050j1211P339M0465j2273q998J9264
15344g022k6379m9624k298K9362M2185k0216K3386P3366J0127n0548l573J9013
15332C7779J026P773Q216j5411L9280K6143k3945l8908r498Q755l1079k6860K1711
$$ plain form
15419 -21369 -9676 -24969 -34557 -5719 -1147 -5493 8011 12790 -13672 -10521 -10239 -5311 4374
15406 4374 32026 3995 13022 -6696 -12521 13983 46432 33705 10975 -15776 -3926 -21643
15394 -21643 -19660 16569 24440 25068 43060 66791 78592 53946 3994 -40643 -33653 -23133 33335
15381 33335 50473 33575 35583 30861 -2727 -26276 -13238 23928 40025 19979 -11636 -13717
15369 -13717 314 -23433 2058 26808 4244 -40541 -59996 -28978 -23638 -27253 -2377 -3370
15357 -3370 -34382 -40205 -33587 -42066 -12131 -6558 -41608 -52819 -45480 -5015 -17288 -26286 -7022
15344 -7022 -33401 -83025 -85323 -55961 -13776 -33992 -10606 62760 72887 22339 18766 37779
15332 37779 38805 46578 54794 39383 78663 104806 80861 41953 32455 41210 10131 -16729 4982
15319D982J9066j4586k890K235L2846k0985j0625m512j3584l5206k6566K0600
15307d9225Q4969q784r971M6580j6907k5661l5941k8523J2546L3961O384j727
15295G701k698Q934M310j5739j4473R004q321p085p557J9427K796k5028K779J7778
15281h172j369q321l5949J470K024J2122J3861N009l1529k6853J4269Q638J6482
15268c8318K1765p32j0726o779K7131N9952K958k1138K9513l8327k8929J0699
15256G069k7961k5295L0185K390l7720j4142m248k158K9978J7193j1300P808K2048
15243f153J7971m478k281k5206q359J6314q529L877M1728O767j6713j6744P570
15230E764M0m197l479p496j012O5428J7843J9432L773K4903M3218L9755L9324
$$ plain form
15319 4982 24048 9462 6572 8807 41653 20668 10043 5531 -8053 -43259 -69825 -49225
15307 -49225 35744 26960 16989 63569 46662 21001 -14940 -43463 -30917 3044 9428 7701
15295 7701 5003 13937 18247 2508 -11965 -2961 -11282 -18367 -25924 -6497 -3701 -28729 -25950 -8172
15281 -8172 -9541 -17862 -53811 -52341 -50317 -38195 -24334 -19325 -50854 -77707 -63438 -54800 -38318
15268 -38318 -16553 -17285 -28011 -34790 -7659 52293 55251 34113 63626 25299 -3630 7069
15256 7069 -20892 -46187 -16002 -13612 -51332 -65474 -69722 -71880 -41902 -24709 -36009 -28201 -6153
15243 -6153 11818 7340 5059 -20147 -28506 -12192 -20721 -16844 24884 31651 14938 -1806 5764
15230 5764 5804 1607 -1872 -9368 -10380 55048 72891 92323 96096 120999 164217 203972 243296
15217B43296j2712r614m869l3209R299L8630j2660m1160n262k3887j1734j798
15205A34320l3334l1004j8692n663J302k2847K1827j1184M1842j0624n2353m8104
15193c4514J2842L9668N394j6113l3055J5118J7496K1312r722k7295o798J2778
15181b889l0263j3515O791j4290k9390M921L2921R88L0435K2682o792l5820j9684
15168e3905J4326j8690M07J4931p793j3598R401K03j3313m2059M299O6593L2818
15155f380l993Q662k5156K199K8756K3158l4403k2528m473J5786J6722J5711j9809
15142e748m6209k957M771M223L175J5179l3305M0530M8686j2329k3879l6645k785
15129d7293j5764Q648L5068J6451k786k9850k4789P131O434M3135P346m4215j8419
$$ plain form
15217 243296 230584 220970 216101 182892 192191 230821 218161 177001 171739 147852 136118 134320
15205 134320 100986 69982 51290 45627 46929 24082 45909 34725 76567 65943 13590 -34514
15193 -34514 -21672 17996 23390 7277 -25778 -10660 6836 28148 18426 -8869 -15667 -2889
15181 -2889 -33152 -46667 -39876 -54166 -83556 -78635 -45714 -44726 -14291 8391 1599 -34221 -53905
15168 -53905 -39579 -58269 -57862 -42931 -50724 -64322 -54921 -54718 -68031 -110090 -105791 -39198 -6380
15155 -6380 -10373 -1711 -26867 -24668 4088 27246 -7157 -29685 -34158 -18372 -1650 14061 -5748
15142 -5748 -51957 -54914 -50143 -45920 -42745 -27566 -60871 -20341 28345 16016 -7863 -44508 -47293
15129 -47293 -63057 -54409 -19341 -2890 -5676 -35526 -60315 -53184 -46750 -3615 3731 -40484 -58903
15116e8903L6191N5621K1082o0212J011J7718j6523k1733J651R896K5941r457
15104B283k5426q823j4376Q062K0637k1362r963l8594l0502K6897N4242J3657
15092b3268L3372k6726Q736L4199L9662j5976l6015j2579l025Q875K2167K4605
15080E4027k0212m5011P635j6511M7739K8633j7493l802k4669k9434K0207L9001
15068D0110k5889j586m499o005J2447m1923j6400J6833j0227J7686M0002j6318
15056D231K261Q185k0132j9082J8545J8906l231k5560K8595L8600k0862j4666
15044A5790j5664p118L234m934P057K4881o9442n311j4525M8753K0706O395j6174
15031f352k775M2973J2907j737m0485j5538j73L10j804l7544j0485l500k3125
$$ plain form
15116 -58903 -22712 32909 53991 -6221 -5210 12508 -4015 -25748 -24097 -14201 11740 2283
15104 2283 -23143 -31966 -46342 -38280 -17643 -39005 -48968 -87562 -118064 -91167 -36925 -23268
15092 -23268 10104 -16622 -7886 26313 65975 49999 13984 1405 -1620 7255 29422 54027
15080 54027 33815 -11196 -3561 -20072 27667 56300 38807 35005 10336 -19098 1109 40110
15068 40110 14221 12635 8136 2131 14578 -27345 -43745 -26912 -37139 -19453 20549 4231
15056 4231 6492 14677 -5455 -24537 -5992 12914 9683 -15877 12718 51318 30456 15790
15044 15790 126 -6992 -3758 -8692 -1635 23246 -46196 -51507 -66032 -17279 3427 9822 -6352
15031 -6352 -9127 33846 46753 45016 4531 -11007 -11180 -10870 -12674 -50218 -60703 -64203 -87328
15018h7328K4863K8192m687q620L531J4172J3908q470J403r739J9435Q339o670
15005a1671k908J4407K9003j0069j2342n0825J5189L8055K4444q97j2414m0497
14993b0525k9114p942j9016J5354K9269N5799K2698O260o4579k4567j7549k3412
14981g7324q580J2378K1772J985K0562K6077J1204N884j6653K0264j6379l1246
14969c0056K1454K6407K4593k1751k2204j897J2126K5177J6655Q18n923j0809
14957C4590j0127k5503M199k3723l3560Q201M5785j6863j5753L1532k5556o731
14945c3509L59M0311r249k8480L1560m5750L0348O182k1243j8626N969q531J7479
14932c3180L846n598K4434L0159k9838m9147k9K0151J7094J5277J90q901j5892
$$ plain form
15018 -87328 -62465 -34273 -38960 -47580 -44049 -29877 -15969 -24439 -23036 -32775 -13340 -5001 -11671
15005 -11671 -14579 -172 28831 18762 6420 -44405 -29216 8839 33283 32386 19972 -20525
14993 -20525 -49639 -57581 -76597 -61243 -31974 23825 46523 52783 -11796 -36363 -53912 -77324
14981 -77324 -85904 -73526 -51754 -49769 -29207 -3130 8074 13958 -2695 17569 1190 -30056
14969 -30056 -8602 17805 42398 20647 -1557 -3454 8672 33849 50504 51322 45399 34590
14957 34590 24463 -1040 3159 -20564 -54124 -45923 -138 -17001 -32754 -1222 -26778 -33509
14945 -33509 -33150 7161 -2088 -30568 992 -44758 -14410 -8228 -29471 -48097 -42128 -50659 -33180
14932 -33180 -29334 -34932 -10498 19661 -10177 -59324 -59353 -39202 -22108 -6831 -6641 -15542 -31434
14919c1434K4538M8261k8001m1246J2418j5437m337L646J9406L177P31j1914k1940
14906d2132K9060M0200k3821n6460k4227J0973J3079K3089K8964R165p204j9781
14894a9095n589N94j2240k9996j6124j5786j1160K0452K5176J4034J0640K0931
14882a8163j773k3923K4490l327P448l3278j3450q272Q388K8778J5049J2488r081
14869a4626o219R466M285n756K4420J9154O2326m3840l0130K4488K7277K7498
14857I8343j8989l8452j8390j5692R776L7711l109j7522K075K2866j4318l2521
14845A1778J4454j9959l3459j5050k3227K1117L2707q495J7274K2881L5709o787
14833D8943l6117j7114k0226k5893K9795K7780J1940l587J7062j3875j6076J98
$$ plain form
14919 -31434 -6896 41365 13364 -27882 -15464 -30901 -35238 -31592 -12186 -9009 -8278 -20192 -42132
14906 -42132 -13072 27128 3307 -53153 -77380 -66407 -53328 -30239 -1275 7890 686 -19095
14894 -19095 -24684 -24090 -36330 -66326 -82450 -98236 -109396 -88944 -63768 -49734 -39094 -18163
14882 -18163 -19936 -43859 -19369 -22696 -15248 -48526 -61976 -70248 -61860 -33082 -18033 -5545 -14626
14869 -14626 -20845 -11379 -7094 -12850 11570 30724 93050 49210 19080 43568 70845 98343
14857 98343 79354 40902 22512 6820 16596 54307 51198 33676 35751 58617 44299 11778
14845 11778 26232 6273 -27186 -42236 -65463 -44346 -11639 -20134 -2860 20021 55730 48943
14833 48943 12826 -4288 -24514 -50407 -20612 7168 19108 15521 32583 18708 2632 2830
14821B830L5547K0105l5860n0223K1535L2354Q193N53k7126M130J141J3651k9741
14808b911J5849L863k0675N798k5226k142j5945o226n281K7421M2293j973J7694
14795C2539k658m4421m3428Q834j8067L542L6847k408J1594k3838r814J2906M9
14782c8323L6372k4578k2967M423J4420l858l2475J2550J7552p078k0697J5879
14770d8780K1546L905J4690J2098L5672J9921K473k3780J450L5978m94m8112l2240
14757e673Q323j3616n5446j5936K2366q300K5067J5709k6758Q29j3620J2909J4847
14744c9299J501K6304J2521L797O450q8j8835N231j6957m3636k7097K647J1144
14731g6317j0816K5319N314p678n345N1360K0795J4841J307k993K1320j1609o6278
$$ plain form
14821 2830 38377 58482 22622 -27601 -6066 26288 34481 35034 7908 12038 13179 26830 -2911
14808 -2911 12938 16801 -3874 1924 -23302 -25444 -41389 -47615 -52896 -25475 16818 14845 32539
14795 32539 29881 -14540 -57968 -49134 -67201 -63659 -26812 -29220 -17626 -41464 -51278 -38372 -38323
14782 -38323 -1951 -26529 -49496 -45073 -30653 -34511 -66986 -54436 -36884 -43962 -64659 -48780
14770 -48780 -27234 -23329 -8639 3459 39131 59052 61525 37745 39195 75173 74679 26567 -5673
14757 -5673 2650 -10966 -66412 -82348 -59982 -68282 -43215 -27506 -54264 -53435 -67055 -54146 -39299
14744 -39299 -37798 -11494 1027 4824 11274 11186 -7649 -2418 -19375 -63011 -90108 -87461 -76317
14731 -76317 -87133 -61814 -56500 -64178 -69523 -18163 2632 17473 18780 15787 37107 25498 -40780
14718d0780j3181K4336K391J6681N725l3281m2734J5992M2865l024J8299j7969
14706b4680j9935K967J2034N555J3212M7195J6074L221k6779k5971p210l9601
14694d3918l5624M8696M1937J4308k5391J8900J9124j1197j1778M603O163j9450
14682F373K3387J6725K156o1085M807l381l3075k825P0538K0985Q50K1819l5725
14669C1549q660K0937j0821m5762J196J3060J8709N877j2608j4132J5491K928
14657A7764m4321m5377J6178j0476K7920K0589N946J0817k661L8655k1427k6670
14645a3063J8580O318j8107J7763j0588m0478k8318q812M8335K7300l641j5372
14633b0083l5945l1825k8998L338L1856K5444M2642L204o597Q199M963J3097J791
$$ plain form
14718 -40780 -53961 -29625 -27234 -10553 -4828 -38109 -80843 -64851 -21986 -25010 -6711 -24680
14706 -24680 -44615 -41648 -29614 -24059 -10847 36348 52422 55643 28864 2893 -4317 -43918
14694 -43918 -79542 -30846 11091 25399 8 18908 38032 26835 15057 19660 25823 6373
14682 6373 29760 46485 48641 -12444 -7637 -11018 -44093 -46918 23620 44605 45455 67274 31549
14669 31549 22889 43826 33005 -12757 -11561 1499 20208 26085 13477 -655 14836 17764
14657 17764 -26557 -71934 -55756 -66232 -38312 -17723 -11777 -960 -3621 35034 13607 -13063
14645 -13063 5517 11835 -6272 11491 903 -39575 -67893 -76705 -28370 -1070 -4711 -20083
14633 -20083 -56028 -87853 -116851 -113513 -81657 -56213 -13571 -10367 -16964 -8765 -3802 9295 11086
14620A1086p587j1856J5147k8561K0487J4078j9310J4504K8976m7653k2674j1143
14608d4506P34L263K6020J9883K423l0467n745K6874n47l2075p474L8991k403
14595e029J5467K4785o023k3374l3397J138j3153k6824L4031P499l1376J5015
14583d1241N9227l948l3726R343J3321l828l5957j1650K90j734J1405M0711K7811
14570C0024K2570J0281j9749o449K475l4536l8990J7003M2662m420R127J2453
14558D2451J771j4304j7576k5145K4678J1421k036O103n7497j80K341K737J2821
14545a2415J1556j4517M0571o05L755N306Q641N782J7285j4350j6814K5621j4485
14532D5331m6226J5790J3237j2209l0284l2798J8881K1089K7777J5040R624J3900
$$ plain form
14620 11086 3499 -8357 6790 -21771 -1284 12794 -6516 7988 36964 -10689 -33363 -44506
14608 -44506 -43772 -40509 -14489 5394 7817 -22650 -28395 -1521 -2068 -34143 -41617 -2626 -5029
14595 -5029 10438 35223 29200 5826 -27571 -26433 -39586 -66410 -32379 -24880 -56256 -41241
14583 -41241 17986 14038 -19688 -10345 2976 -852 -36809 -48459 -48169 -49903 -38498 2213 30024
14570 30024 52594 62875 43126 36677 39152 4616 -34374 -17371 25291 20871 29998 42451
14558 42451 44222 29918 12342 -12803 11875 23296 21260 27363 -30134 -30314 -27973 -25236 -12415
14545 -12415 -859 -15376 25195 24590 28345 33651 42292 48074 65359 51009 34195 59816 45331
14532 45331 -895 14895 28132 15923 -14361 -47159 -28278 -7189 20588 35628 45252 59152
14520E9152j8273j5016M405J1597N294j8837o5111k3724L8592P065R603k210m1390
14507d8853L406K0723L0334k724K8891l632m383j363j5178k8715j1577L298j0283
14494d0056k21J7766M40L169k9028k3561k3182L7909J5740L2704J9512P98j5392
14481c402K6138k391R542j684J7476J8643j2325J2510k8329P768p118k3713m741
14468H374K3517M6163J9822L003l0726P18m905K6509K0177j411k7242j4855k4463
14455D4681Q642M1746K0291j4498m066N228l8188L3859J5752J2294J7157O490
14443A49388j3274P118K7652L3945L4163M9260L8161O4408P8309L9546M6899O8032
14431F23607J34852J52335J08708R3245J17107R6330N4077O0729L0440M6662J5422
$$ plain form
14520 59152 40879 25863 30268 41865 47159 28322 -36789 -60513 -21921 -14856 -5253 -7463 -48853
14507 -48853 -45447 -24724 5610 2886 31777 28145 23762 22399 7221 -21494 -33071 -29773 -40056
14494 -40056 -40277 -22511 -22071 -18902 -47930 -71491 -94673 -56764 -41024 -8320 11192 11990 -3402
14481 -3402 22736 20345 29887 28203 45679 64322 51997 64507 36178 43946 36828 13115 8374
14468 8374 31891 78054 97876 100879 70153 70871 65966 92475 112652 111241 83999 69144 44681
14455 44681 53323 95069 115360 100862 96796 102024 63836 97695 113447 125741 142898 149388
14443 149388 136114 143232 170884 204829 238992 288252 326413 390821 469130 508676 555575 623607
14431 623607 758459 910794 1019502 1112747 1229854 1326184 1380261 1440990 1471430 1518092 1533514
14420A533514k7883p6892j10328p0153m3475r2648j01400p9360l4848J0258n3223
14409H53562n8229j3095j9154k6455j7353k6283J5449o995O3153M9295k3873o396
14397G83626K8959N6722Q0007Q9696P8723J16648Q9108M6060L5355O8208N8416
14386A531528K5010L582j8439l8842q4559j08570j21216q5576j17446j31186p4455
14375G79831q7343j04996r0962n3208k7877n1555n479k5362j6046m5660k8225
14364B43118l1481j4789q578k0004k1822k851M945L869M40j0218Q987K364n9610
14351I4370n297M7271J2301k5278k9136K0740k202O125L8391O37k3309o990k0840
14338A06783j8784J2282j3059j6409k3767P666n832k5162R236M6043K4353j3928
$$ plain form
14420 1533514 1505631 1428739 1318411 1248258 1204783 1112135 1010735 931375 896527 906785 853562
14409 853562 795333 782238 763084 736629 719276 692993 708442 701447 764600 813895 790022 783626
14397 783626 812585 869307 949314 1039010 1117733 1234381 1323489 1369549 1404904 1473112 1531528
14386 1531528 1556538 1560120 1541681 1502839 1418280 1309710 1188494 1102918 985472 854286 779831
14375 779831 692488 587492 496530 443322 415445 363890 358411 333049 317003 271343 243118
14364 243118 211637 196848 188270 168266 146444 143593 148538 152407 152847 142629 151616 153980 94370
14351 94370 89073 136344 148645 123367 94231 114971 112769 118894 157285 157922 134613 127623 106783
14338 106783 87999 100281 87222 70813 47046 54712 48880 23718 32954 78997 103350 89422
14326H9422m1735l703J4503L2729R902j7063J1831l1341k5535K2081K2841j0318
14314G3614j9853L4588r890J5044K3909j5823m3248j0114R416R472K8303p898
14302H7520k701k0726l4568k383K6320M4526J8764j6834j7534j2048L6002R680
14290A16018j818K426k1835j0469R024K3259l700k9865p89j3375R485K9004J2893
14277A20258Q139k6995k7205j0028k0350m893K0523J9892N298J1146K430j2196
14265H6019k1495p774j0975l233J4143L4258R063J0496l3493m1413l307L6606
14253F8895K9830L2714m049j148q02j3896j9208J0131K5270M102J3237J0958k2494
14240A33540k7160k547N0354K2457P505N7284M2645K928Q191n193j1885j9118
$$ plain form
14326 89422 47687 43984 58487 91216 101118 84055 95886 64545 39010 61091 83932 73614
14314 73614 53761 88349 78459 93503 117412 101589 58341 48227 57643 67115 95418 87520
14302 87520 84819 64093 29525 27142 53462 97988 116752 99918 82384 70336 106338 116018
14290 116018 114200 116626 94791 84322 93346 116605 112905 83040 82251 68876 78361 107365 120258
14277 120258 128397 101402 74197 64169 43819 38926 59449 79341 84639 95785 98215 86019
14265 86019 64524 56750 45775 42542 56685 90943 100006 110502 77009 35596 32289 68895
14253 68895 98725 131439 127390 126242 125440 111544 92336 102467 127737 131839 145076 156034 133540
14240 133540 106380 103833 154187 176644 184149 241433 284078 287006 295197 290004 278119 259001
14228B59001n326M1194J02055L0852p400k740L2817L3827K1287J9290j6537R827
14216E18147J0038l1483m3577k4388j8786p558l9014k4731o971m4721m2643L1662
14204B75975M2560P957l4295l0112k0864j5607J9248K1281J1320q516J1310N0570
14192C30827L6865k059j2394l2365M6433M5234K9504J7541m2577j1431j3864l9799
14180C51915j2170l679r154l9356q301j7984k1783O03l5568m1430K652j486m7547
14167A16712k2961k5710K1661r009o6478k6007K8730j9272l8957k2156k9290M9837
14155d2900L1357K369L827L9437N409k6485K2716k68K0904K9000L4344k3397l9417
14142E6896K9245O3026K4559j2554n394P5592J1187n525P750j4137k6538J3435
$$ plain form
14228 259001 253675 294869 396924 427776 420376 417636 450453 484280 505567 524857 508320 518147
14216 518147 528185 496702 453125 428737 409951 402393 363379 338648 331677 286956 244313 275975
14204 275975 318535 326492 292197 262085 241221 225614 244862 266143 277463 268947 280257 330827
14192 330827 367692 365633 353239 320874 367307 412541 442045 459586 417009 405578 391714 351915
14180 351915 339745 336066 326912 287556 279255 261271 239488 240091 204523 163093 165745 164259 116712
14167 116712 93751 68041 89702 80693 14215 -11792 16938 -2334 -41291 -63447 -92737 -42900
14155 -42900 -11543 -9174 -5347 34090 39499 13014 35730 35462 56366 85366 119710 96313 56896
14142 56896 86141 149167 173726 161172 155778 231370 242557 237032 244782 230645 204107 217542
14130B17542k9073k7481m658J5887l6353p301J931k8623o707O448j2544J6330
14118A05398M1765J059m974M838L6981N8050Q1075J5478L8006K9587N518L6424
14106D49205L2042J7198N6824P2598M4257K9444j2800L107L5480R761K8226j9904
14094G45438r886J9827R924j5627J1265R694j4837N349K3237q934k4553n0764
14082G00133m0047q759m394n310M4744L6508O565O0129P697K2124Q591K8187l010
14069H53158J6425Q245K9884K2522Q924j4723K5059N8296L4847L1928K5442K0182
14057A120189J8766k6930j2125K009L024L4166K8112p77m1354l301K7167J0993
14045A159939L8978K6291j1787J8471K1381M5641Q5553J05672Q8490N6177P1909
$$ plain form
14130 217542 188469 160988 156330 172217 135864 128563 130494 101871 95164 101612 89068 105398
14118 105398 147163 148222 143248 148086 185067 243117 324192 339670 377676 407263 412781 449205
14106 449205 481247 498445 555269 627867 672124 701568 688768 691875 727355 737116 765342 745438
14094 745438 735552 755379 765303 749676 760941 770635 755798 761147 784384 775450 750897 700133
14082 700133 660086 651327 646933 641623 686367 722875 729440 789569 797266 819390 827981 856168 853158
14069 853158 869583 877828 907712 930234 939158 924435 949494 1007790 1042637 1074565 1100007 1120189
14057 1120189 1138955 1112025 1099900 1101909 1104933 1139099 1167211 1166434 1125080 1121779 1148946 1159939
14045 1159939 1198917 1225208 1213421 1231892 1253273 1298914 1384467 1490139 1578629 1634806 1706715
14034A706715J26861K07436M28890N62715P48965R20124Q86001N09778J25746
14025F223231l66124r54799r54084n61114k79886j14733j5488M7440M5325J01115
14015C170883J16954R7574J25936J09738J36576K39062K74991K38431K61811K71325
14005E043281K55668K87296L63784M40478M85559N45521N76617O19113P59629
13996I376946Q14733R25348J041659J240330J430611J617348J920557K250389
13988B0617921K691663L173428L783863M488556N411077O529734P811346R364803
13980F3872391J1141894J3116473J5142357J7110797J8844345K0122379K0859677
13973A80210313K0750006J9693794J7723678J4899791J1283456P085613K658776
$$ plain form
14034 1706715 1833576 2041012 2469902 3032617 3781582 4701706 5587707 6097485 6223231
14025 6223231 5857107 4902308 3948224 3387110 3107224 2992491 2977003 3024443 3069768 3170883
14015 3170883 3287837 3385411 3511347 3621085 3757661 3996723 4271714 4510145 4771956 5043281
14005 5043281 5298949 5586245 5950029 6390507 6876066 7421587 7998204 8617317 9376946
13996 9376946 10191679 11117027 12158686 13399016 14829627 16446975 18367532 20617921
13988 20617921 23309584 26483012 30266875 34755431 40166508 46696242 54507588 63872391
13980 63872391 75014285 88130758 103273115 120383912 139228257 159350636 180210313
13973 180210313 200960319 220654113 238377791 253277582 264561038 271646651 274305427
13966B74305427j677586n767726r290851j1986288j3860800j4897669j5151928
13959B01672579j4648796j3637699j2283433j0681705r076525p482461n956006
13952A27905954m523647l165324j918981o99590M92107J750368L071997M436681
13944A27349565N877482P446023R170423J0957645J2598622J4075036J5266356
13937B02741152J6016190J6049270J5255859J3594643J1025527P636584L574461
13930B85893686q20153n357821r714400j3581032j6765722j9045897k0366546
13923B00242115k0680477k0270279j9163651j7543830j5660510j3699804j1706177
13916H1517387r942824q402881p018054n937575n013923m248556l690866l197357
$$ plain form
13966 274305427 272627841 266860115 257569264 245582976 231722176 216824507 201672579
13959 201672579 187023783 173386084 161102651 150420946 141344421 133861960 127905954
13952 127905954 123382307 120216983 118298002 117598412 118090519 119840887 122912884 127349565
13944 127349565 133227047 140673070 149843493 160801138 173399760 187474796 202741152
13937 202741152 218757342 234806612 250062471 263657114 274682641 282319225 285893686
13930 285893686 285073533 279715712 270001312 256420280 239654558 220608661 200242115
13923 200242115 179561638 159291359 140127708 122583878 106923368 93223564 81517387
13916 81517387 71574563 63171682 56153628 50216053 45202130 40953574 37262708 34065351
13908C4065351k721775k357835k075381j775017j635166j477614j283814j120928
13900A9617821j025408r59614q94530q01297p26668o93569o38788n37716n24129
13891A2816102n19178n04754m26004m05231l91457l57662l94963l97042l45487
13882I074324l14606k91134k74843k76000k29569k14074k33712k20113k22283
13873F797990k36345j66580j98253j74075j89614j99578j29147j13497j27196
13864E263705j54386j59459j04432j09509j18468q9400q1125o8570j30902j41091
13854D106363j35791j13322p6393q1704p4666j18276p7496n3266p3420n6387m5393
13843C200249n7178p3312l4128l9332o383l7284l9168l775J6810Q5553P6672P0560
$$ plain form
13908 34065351 31343576 28985741 26910360 25135343 23500177 22022563 20738749 19617821
13900 19617821 18592413 17632799 16738269 15936972 15210304 14516735 13877947 13340231 12816102
13891 12816102 12296924 11792170 11366166 10960935 10569478 10211816 9816853 9419811 9074324
13882 9074324 8759718 8468584 8193741 7917741 7688172 7474098 7240386 7020273 6797990
13873 6797990 6561645 6395065 6196812 6022737 5833123 5633545 5504398 5390901 5263705
13864 5263705 5109319 4949860 4845428 4735919 4617451 4528051 4446926 4378356 4247454 4106363
13854 4106363 3970572 3857250 3780857 3699153 3624487 3506211 3428715 3375449 3302029 3245642 3200249
13843 3200249 3143071 3069759 3035631 2996299 2989916 2952632 2913464 2909689 2926499 3012052 3088724 3159284
13831C159284J40335J91239K66039K80203K63875J55383Q8973L6372j4560j33483
13821D433660k05540k81371k88544l07342l06256l32950k67170j94339j31255
13812B118893j40764j00004p9636r0010p6212j7183k2510o1601p0098K151p709
13801A455317j9046m552k4178p5692r0987p3942o5172l0923n4222l6798m0995
13790I38810j3266K1170L182k952k2250l3142L9796M4054L3300l52l8293m2537
13778I27520j9768J1916P982m3726m0180k4660j0353J1052k5060p673j6807l4338
13766G35905j9456k1576J4741m203k5963k4541j7876j4998J5766J7730L6405l0478
13754F61456l8268l0903j9479m668M5008Q2510K0642m5184j936o993J1938J0870
$$ plain form
13831 3159284 3299619 3490858 3756897 4037100 4300975 4456358 4545331 4581703 4567143 4433660
13821 4433660 4228120 3946749 3658205 3350863 3044607 2711657 2444487 2250148 2118893
13812 2118893 1978129 1878125 1798489 1708479 1632267 1615084 1592574 1530973 1460875 1463026 1455317
13801 1455317 1436271 1431719 1407541 1331849 1240862 1166920 1101748 1070825 1016603 979805 938810
13790 938810 925544 946714 949896 946944 924694 891552 931348 975402 1008702 1008350 970057 927520
13778 927520 907752 919668 927650 883924 843744 819084 808731 819783 794723 787050 770243 735905
13766 735905 716449 694873 709614 705411 679448 654907 637031 622033 637799 655529 691934 661456
13754 661456 623188 592285 572806 568138 613146 695656 716298 671114 669178 662185 674123 684993
13742F84993J4422J3107M762j7078J6457l0065j8828o6778j8909k3202k7539p397
13730E23945o8207o431J4502k3613l61k6958k5009K182J0297M2921l0577o2595
13718C50096k5277L1033J3234J7197j2633R04N187r387k4791k5152q687m345K927
13705C10306K0811k5879O770L556j6465L9264j5335p2976o520M044J4884K3545
13693B86005l812k3129l8047m2878p338n388N654M4251K3552k8729l83k2489j6691
13680A70578N5915J5461j7363K215l489L954K0825k63J3681j8165j6093l3984
13668A93272l0851N685J0005J2232j6875m956K9883j763k7550l0621m6681l321
13656H8459J8424J6681Q284k1247K1358J4126j4350j5766L7609J8665j0307o191
$$ plain form
13742 684993 699415 712522 717284 700206 716663 686598 667770 600992 582083 558881 531342 523945
13730 523945 455738 449307 463809 440196 439835 412877 387868 390050 400347 443268 412691 350096
13718 350096 324819 355852 369086 386283 373650 374554 379741 370354 345563 320411 311724 307379 310306
13705 310306 331117 305238 312008 315564 299099 338363 323028 250052 243532 247576 262460 286005
13693 286005 282193 259064 221017 178139 170801 165413 171067 215318 238870 210141 209758 187269 170578
13680 170578 226493 241954 224591 226806 223317 227271 248096 247833 261514 243349 227256 193272
13668 193272 162421 168106 178111 190343 173468 168512 198395 196632 169082 138461 91780 88459
13656 88459 106883 123564 131848 110601 131959 146085 131735 115969 153578 172243 161936 155745
13644A55745Q057J3026j045M078K0071M2732J6920j6516n419L0404K5177M774
13632B98004N068L7855L8995L9446O9256Q0132J21109J80585K02089L17438L42556
13621A732533L84256M41449N01005N03977L88949K43289J62287l67j98850k39821
13611C918707l56480m34418m48858m60277l94290l45194l32919k92019k02733
13602F51519n9091l0596p0887l8222k3732m0334j2280l2424r918m1514m8014l2981
13590B11526k9120J242M168L2901J2972k5695k5942j0689k3129q962J1994L3441
13578A84707K2285l1915m2755k6941j6072J0923K7817j8127k8660N9344J5636
13567A56242K839L1540n930k7648k8465k2925K507J7303j4354l666j4648j417
$$ plain form
13644 155745 163802 176828 175783 179861 199932 242664 259584 243068 237649 268053 293230 298004
13632 298004 303072 340927 379922 419368 488624 568756 689865 870450 1072539 1389977 1732533
13621 1732533 2116789 2558238 3059243 3563220 3952169 4195458 4357745 4357378 4158528 3918707
13611 3918707 3562227 3127809 2678951 2218674 1824384 1479190 1146271 854252 651519
13602 651519 592428 561832 490945 452723 428991 388657 376377 343953 334035 292521 244507 211526
13590 211526 182406 183648 187816 220717 233689 207994 182052 171363 148234 139272 151266 184707
13578 184707 206992 175077 132322 105381 89309 100232 128049 109922 81262 140606 156242
13567 156242 159081 190621 184691 157043 128578 105653 108160 125463 111109 107443 92795 91378
13555I1378J3657K974l1789J6710J7637k7233j7857r281j4618L1853K4158K4980
13543A22569k7938k456j4126N622N356N0138l1683l0107k0968J026K7782j3286
13531G1929K4937N0507J6739J2732N1518K3761O260l4001J2644P1087M6029L7238
13519C91380M3981N9403P4986P9779P2254J02619P6488R1863J07266R2909J10953
13508A303881J06957N3550M9951M7681k8953m9918l4298o5007o1796m3383q3277
13497A195388j02512j02507j00817n2893k838k5036m5306l7833k7667j4926k8005
13486F55048j5643K089M3911N5550l744L6723Q9738L2658N6449Q1352R0590R3547
13474A218268P2856O6094Q9850N6399M5745L7147P619l1798q4097o2187m8783
$$ plain form
13555 91378 105035 108009 76220 92930 110567 83334 65477 56196 41578 73431 97589 122569
13543 122569 94631 92175 78049 83671 89027 139165 107482 77375 56407 57433 85215 71929
13531 71929 96866 147373 164112 176844 228362 252123 258383 224382 237026 308113 354142 391380
13519 391380 435361 494764 569750 649529 721783 824402 900890 992753 1100019 1192928 1303881
13508 1303881 1410838 1464388 1514339 1562020 1533067 1483149 1448851 1383844 1322048 1278665 1195388
13497 1195388 1092876 990369 889552 836659 833821 808785 763479 725646 697979 683053 655048
13486 655048 639405 641494 685405 740955 737211 773934 863672 896330 952779 1034131 1124721 1218268
13474 1218268 1291124 1357218 1447068 1503467 1549212 1586359 1593978 1562180 1478083 1415896 1367113
13463A367113r1094j42689j02046p2874p3844o1409q5204r2605o9194k4203o5601
13452D86350p8871m9508m3845p015l3866n1050J2380J2280K399j0426m5620m3622
13440A49586K4979J1988m5306n888k3966j8010K3652r179o55K1402J5567M880
13428A49050J3241L2203l0339n0950J3996P147j2335n3581J0788J4013P162j6000
13416H4395J7990j2930K807L0298j5466l8176N747K995l249J7554J4972P591k9566
13403H4962j2258r693M622K5148J7813l6176r531m5460l219J5093M1833M3458
13391A16592J2495n2308k8092k9592j0548J8626K8885j7612q559L4058m642k4545
13379C4758k3097j517M907J8495J012k8750k6820k206J5011K009j8333O251L6283
$$ plain form
13463 1367113 1276019 1133330 1031284 958410 884566 823157 737953 645348 576154 551951 486350
13452 486350 407479 357971 314126 307111 273245 222195 234575 246855 249254 238828 193208 149586
13440 149586 174565 186553 141247 135359 111393 93383 117035 107856 107201 128603 144170 149050
13428 149050 162291 194494 164155 113205 127201 134348 122013 68432 79220 93233 100395 84395
13416 84395 102385 89455 92262 122560 107094 68918 74665 77660 74411 91965 106937 114528 84962
13403 84962 72704 63011 67633 92781 110594 74418 64887 19427 16208 31301 73134 116592
13391 116592 129087 76779 48687 19095 8547 27173 56058 38446 29887 63945 59303 34758
13379 34758 11661 10144 15051 33546 34558 5808 -21012 -23218 -8207 -6198 -24531 -18280 18003
13366A8003J0218K2762L1120r661m012M756J1503j5692p434k2297M0654J393k0404
13353F0909k4755n642j1279r731K1519K3318N949L163j0443K437j3454j7544M2254
13340F6701j6745k7853j5312O655J9832k1276N280L13L2424L6329J2155o027k275
13327I0201j210j4616J4535l3174N885J0452k9604k630j1140n135K2711l206q159
13314C4910k9340P167j8601m172L3778L5944L620L542l9664j9091P176K0987J1413
13301D7669K2212j1872k6582k706j094k7945m0381M884J3648K5712o690l8057
13289d1202m1647r544J066J7095L8866k223J3003K2467L199j898R392L0235P786
13276D6595q179P996K561O604J3183r907j3321k5274J0180J9736N397m7933J6944
$$ plain form
13366 18003 28221 50983 82103 72442 68430 73186 84689 68997 61563 39266 79920 81313 60909
13353 60909 36154 30512 19233 9502 31021 54339 60288 63451 53008 55445 41991 24447 66701
13340 66701 49956 22103 6791 13446 33278 12002 17282 17595 50019 86348 98503 92476 90201
13327 90201 88991 74375 88910 55736 61621 72073 42469 39839 28699 23564 46275 43069 34910
13314 34910 5570 12737 -5864 -10036 23742 59686 63306 66848 27184 8093 15269 36256 47669
13301 47669 69881 58009 31427 28721 27627 -318 -40699 -35815 -22167 3545 -3145 -41202
13289 -41202 -82849 -92393 -91327 -74232 -35366 -37589 -24586 -2119 1080 -818 8574 38809 46595
13276 46595 38416 46412 48973 55577 68760 58853 45532 20258 30438 50174 55571 7638 24582
13263B4582K0469R919j1935l5831q093J5879P171J1263J2022J6644j4439k7138
13251B0513k5616j9416L124K5998M900j2646P019J392K5574L4365J224J4636q586
13238G2481l5217O39l4184L3970L5871P704o2279l6181j9423j55K3543K8710J6022
13225C1501L9978k9639q249j1369R220N9940J4173l5745l7505J2126j2549P894
13213C9776L3922m666r821J0233k7467j1987j1230j5289J1424K5646M1104J6873
13201I8518j2975M858M875l6805K03J7812J4403J1J257m5552n4126m8117M316
13188e1322P5246K2672n316m5740j1208K4337k3886J0368J3523P099r253k0386
13176a3866K443O586J5294j1491J1255J215J2858K004j0911L0516L1139K360l3562
$$ plain form
13263 24582 45051 54970 43035 7204 -889 14990 22161 33424 45446 62090 47651 20513
13251 20513 -5103 -24519 -21395 4603 9503 -3143 3876 5268 30842 65207 66431 81067 72481
13238 72481 37264 37903 3719 37689 73560 81264 18985 -17196 -36619 -36774 -13231 15479 31501
13225 31501 71479 41840 33591 22222 31442 91382 105555 69810 32305 44431 31882 39776
13213 39776 73698 69032 59211 69444 41977 29990 18760 3471 14895 40541 81645 98518
13201 98518 85543 90401 95276 58471 58674 76486 90889 90900 92157 46605 -7521 -55638 -51322
13188 -51322 23924 46596 41280 -4460 -15668 8669 -15217 -4849 8674 15773 6520 -13866
13176 -13866 -11423 -4837 10457 -1034 10221 11436 24294 26298 15387 45903 77042 79402 45840
13163D5840k981k9361j8369R93j1626N52K1115L0596J9495l5004K778m0667J4439
13150b200J9673J8633J3623J7388N874L599k7182k4457J0774J7703j8818j3465
13138B1145l4169m8665J5621q883M240J4068K7932L0387P372j972R730Q133l110
13125D1829l0573l1090k2983j1664J6030O900j4457R190K0101R30J7484p475q036
13112a3814o5209K820L3446J7105P207J7566L7721K7256k8579k51J002o756J400
13099C0914k5660k946j872j3447M128k4078j4253J4258J4427K6834R487m164O341
13086A9969j9882J6634J2569l307j1882j1461J1181K4252l3028N129L4515R766
13074E4455Q38p377k2844j0095l277J4675J4126J7252j381n644n323O078k115
$$ plain form
13163 45840 42859 13498 -4871 -3878 -15504 -14952 6163 36759 56254 21250 24028 -16639 -2200
13150 -2200 17473 36106 49729 67117 72991 76590 49408 24951 35725 53428 34610 21145
13138 21145 -13024 -61689 -46068 -54951 -50711 -36643 -8711 21676 29048 27076 36806 44939 41829
13125 41829 11256 -19834 -42817 -54481 -38451 -31551 -46008 -36818 -16717 -15787 1697 -5778 -13814
13112 -13814 -79023 -76203 -42757 -25652 -18445 -879 36842 64098 35519 35268 36270 29514 30914
13099 30914 5254 2308 436 -13011 -8883 -32961 -47214 -32956 -18529 8305 17792 13628 19969
13086 19969 87 16721 29290 25983 14101 2640 13821 38073 5045 10174 44689 54455
13074 54455 55293 47916 25072 14977 11700 26375 40501 57753 56372 50728 45405 51483 49368
13061D9368l6060n2939J9006L9802q065k7596j9364m287r180P056l126J5205j3281
13048d3461l1602J4031N6065K6629J3137k2947q738k086j4082J4089j8969j6103
13036c4037p704P120k443m901L0013K6773K0016j471m0336k2768n873M0583K1720
13023B6692j9393j009q110k2838K2472L0278n516n009n809k7207L3446N3386l4355
13010C7028m6610k50J2714K2627J7816J3791k0887J2392l0523j5129l9781q706
12998d5518O374R5373J0595l3867j0273M6717J841k7894j3359K13j6298M824j9685
12985i57j2586K6143K9277L1180k0633k205j3707m5609O448K7434J9973Q54J7894
12972F3506Q120J081n4029o1287j961l816K5893J9187J4739K7503J034m8076l6599
$$ plain form
13061 49368 13308 -39631 -20625 19177 11112 -16484 -35848 -40135 -49315 -42259 -45385 -30180 -43461
13048 -43461 -75063 -61032 -4967 21662 34799 11852 3114 1028 -13054 1035 -17934 -34037
13036 -34037 -41741 -34621 -37064 -41965 -11952 14821 34837 33366 -6970 -29738 -35611 4972 26692
13023 26692 7299 6290 -1820 -24658 -2186 28092 22576 17567 11758 -15449 17997 71383 37028
13010 37028 -9582 -9832 2882 25509 43325 57116 36229 48621 18098 2969 -36812 -45518
12998 -45518 -39144 56229 66824 32957 22684 69401 71242 43348 29989 30202 13904 18728 -957
12985 -957 -13543 12600 41877 73057 52424 50219 36512 -9097 -2649 24785 44758 45612 63506
12972 63506 71626 72707 18678 -42609 -44570 -48386 -22493 -3306 11433 38936 39970 -8106 -44705
12959d4705j4260j8906O557K5815L3805K5964K7162m9965n4609J3431O405K7581
12947a5725M2726j8523j4927L3014J6361k2370L254j7178Q31K8016N951L4353
12935G5783N609m6978m158l1843J6994K0393r728J529j89Q541j1537M657m29K9603
12921E8247j9767M980j3895l490l2358L0398K9967J1099M504O265k6164j4775
12909C5011P174K2838q476k9903q478l9706l777K3996N2607N27R720K3070k0888
12896F3715m0871P135J9278k7117q686n550k325J1786J8472k585p244L908k5984
12883C932L6171p287l0234j3462m90j2188K7014m0388j7619K2615J1310l1572
12871e2198l1357J2906K3529o625K4855Q726Q352P086J5484J6080O889k6770l3981
$$ plain form
12959 -44705 -58965 -77871 -71314 -45499 -11694 14270 41432 -8533 -63142 -49711 -43306 -15725
12947 -15725 27001 8478 -6449 26565 42926 20556 23810 6632 7463 35479 41430 75783
12935 75783 81392 34414 30256 -1587 15407 35800 26072 27601 27412 35953 24416 29073 28644 58247
12921 58247 38480 43460 29565 26075 -6283 24115 54082 65181 69685 75950 49786 35011
12909 35011 42185 65023 56547 26644 18166 -21540 -25317 -1321 51286 51813 61533 84603 63715
12896 63715 22844 29979 49257 22140 13454 7904 5579 17365 35837 33252 26008 29916 3932
12883 3932 40103 32816 2582 -10880 -11370 -23558 3456 -36932 -54551 -31936 -20626 -52198
12871 -52198 -83555 -70649 -47120 -53745 -28890 -20164 -11812 -4726 10758 26838 33727 6957 -27024
12858b7024j1975K5049Q51L092K0119M819K2267l80n3442k1492k8737K3225N2771
12845I143K3458J613l0594k5307J4734n815r777q798j3409N687k1518K893J7438
12832d0252J8772J3223l6175K1596L5262O293M1216K2875j8532l8180m7931J5086
12820f747K4976l4015L4749L6126O235k976n000j8362j731l772p095N328J37k412
12806B5441l2144j3020Q769J0994R59J9194R819k6560k2401o953m795K7573O554
12793C430m1083k7275N169m961K3067L8027J7043L3527k1118m7389k9092J126
12781d9529N0449L3083k8423k2905k6186K1305L8777L9560l4088j6617J1601j717
12769A5310l2241k6909O694M1000k2831K5407M4885j1344j7055l394r848l2936
$$ plain form
12858 -27024 -38999 -13950 -13099 -10007 10112 14931 37198 36818 -16624 -38116 -66853 -43628 9143
12845 9143 32601 34214 3620 -21687 -6953 -12768 -22545 -31343 -44752 -39065 -60583 -57690 -40252
12832 -40252 -21480 -8257 -44432 -22836 12426 18719 59935 82810 64278 26098 -21833 -6747
12820 -6747 18229 -15786 18963 55089 61324 58348 53348 34986 33255 29483 22388 27716 27853 25441
12806 25441 -6703 -19723 -10954 40 999 20193 30012 3452 -18949 -25902 -30697 -3124 3430
12793 3430 -37653 -64928 -59759 -64720 -41653 -3626 13417 46944 25826 -21563 -50655 -49529
12781 -49529 920 34003 5580 -17325 -43511 -22206 16571 56131 22043 5426 17027 15310
12769 15310 -16931 -43840 -37146 3854 -18977 6430 51315 39971 22916 19522 9674 -23262
12757b3262j2043n891j7293K4775J7534L4436K2120J6227k0341k7792j3776n8
12745e364L4071k0067L184J4763k981L775P741J2994k4300k3955j8236Q03r235
12732b6807l0971p595j6401J5685J5587J0717J7K2626j4926K1968K861R606J102
12719C469j0460l5782n333N610p623r322N850N5610M7211r34m2368k1413j4090
12706b9575K0611M360R615J0157J4635l6137j7929j4268j1201M1572J2394j5258
12694a1024L7742J2589k8647j1182j8104K537K4636j5576r219k043L4746P635
12682B4090l9915n3662Q085L0595j5950J222N3K9046K9025j1324K0778Q001n629
12669B4415q357K422K8K5184j3160j3194K1684K7851j959k3355k3257O376K7178
$$ plain form
12757 -23262 -35305 -41196 -58489 -33714 -16180 18256 40376 56603 36262 8470 -5306 -5364
12745 -5364 28707 8640 11824 26587 23606 27381 35122 48116 23816 -139 -18375 -17572 -26807
12732 -26807 -57778 -65373 -81774 -66089 -50502 -39785 -39768 -17142 -32068 -10100 -7239 2367 3469
12719 3469 -6991 -42773 -48106 -42496 -50119 -59441 -53591 2019 49230 48296 5928 -15485 -29575
12706 -29575 -8964 -4604 5011 15168 29803 -6334 -24263 -38531 -49732 -8160 4234 -11024
12694 -11024 26718 39307 10660 -522 -18626 -16089 8547 -7029 -16248 -18291 16455 24090
12682 24090 -15825 -69487 -61402 -30807 -46757 -45535 -45482 -16436 12589 1265 22043 30044 24415
12669 24415 16058 18480 18508 43692 30532 17338 39022 66873 64914 41559 18302 24678 51856
12656E1856n883p052j1784j755p381j4181p761n843k853M3430J8535n0762l4249
12643c5683J3677J591J2203M748J6305J4558k9806l7367O788L057L8888J0279
12631A9238r533M915j6007j4510q146K371j697N492J3048R749J6632j2386l1273
12618b2107j3615j1003n282j7034L4671K6588k4660n919L8213J3864j0539K1227
12606B4404J428P05k5555P297l2768J78L1245K6899j7788n1264l4475l5937J9876
12593h5755O1906N1020K8083j3817k4842j0886K2814j2376l078K3184M385k0992
12581A9646m5011n026O0327K0048m4563l5550P408M8295j2191J0582K0235j6273
12569B7927k5024k0789L1827P299k3818N570K9208J2758J713Q963j5809j6088
$$ plain form
12656 51856 45973 38921 27137 25382 18001 3820 -3941 -9784 -12637 30793 49328 -1434 -35683
12643 -35683 -22006 -20415 -8212 -3464 12841 27399 -2407 -39774 -32986 -29929 8959 19238
12631 19238 9705 14620 -1387 -15897 -24043 -21672 -23369 -17877 -4829 4920 21552 9166 -22107
12618 -22107 -35722 -46725 -52007 -69041 -34370 -7782 -32442 -38361 -148 13716 3177 24404
12606 24404 25832 26537 982 8279 -24489 -24311 6934 33833 16045 -35219 -69694 -105631 -85755
12593 -85755 -23849 27171 55254 41437 16595 5709 28523 16147 13069 36253 40638 19646
12581 19646 -25365 -30391 29936 49984 5421 -30129 -22721 25574 13383 23965 44200 27927
12569 27927 2903 -17886 13941 21240 -2578 2992 32200 44958 46671 55634 39825 23737
12557B3737j6885r23N187K1204N432j0102J0857L933M881r62m1701j0941j1448
12544a7731k17P969L8071K1584l7752n784N308o06l3945j581J0180m2839M458
12531e2885m767J9055J2183K1167J471K952K4566K9339J1699k670K634o242L3359
12518I1861m4917k0929k3424K9185n115o918j4714J9955M1805n785n4366N981
12506A2619j5444j1167J6928K7784l2728Q589L1677j1367l3478m237Q11k5303
12494c5316J3970N3681L1752N346n4501l7304P375K8242R804l518k9142m273m8668
12481f2552k4069K605N909N3231K1607Q279K182J5690J4849q370k7243K1010m209
12468A8919m9039p585N7314J1685L147J389J3075m9294o9465j0405K9214k920
$$ plain form
12557 23737 6852 5929 11116 32320 37752 27650 38507 42440 47321 46359 4658 -6283 -17731
12544 -17731 -17948 -9979 28092 49676 11924 6140 11448 10842 -23103 -24684 -14504 -57343 -52885
12531 -52885 -57652 -38597 -26414 -5247 -3776 -824 23742 53081 64780 62110 64744 58502 91861
12518 91861 46944 26015 2591 31776 26661 19743 5029 24984 66789 61004 6638 12619
12506 12619 -2825 -13992 2936 30720 -2008 6581 38258 26891 -6587 -10824 -10013 -35316
12494 -35316 -21346 32335 64087 69433 14932 -22372 -14997 13245 23049 19531 -9611 -13884 -62552
12481 -62552 -86621 -84016 -78107 -24876 -3269 5010 7192 22882 37731 29361 2118 23128 18919
12468 18919 -30120 -37705 19609 31294 34441 35830 48905 -389 -69854 -80259 -51045 -53965
12456e3965k5455L8j0322k0675K3706K1602L0918K8904J5475j2189l9938j7805
12444e9706l0007J4995M2967L9494L6587M2138L6233j7715l3882m6697k9357J1612
12432F662K976R736k1265J622j8635K7203L8248r646l7650J6945j3419j1314k863
12419a1400L639M1308L3589K4506l4750m2776L04m177J3505K4729k4486l3204
12407i213J0253m241l7375j5004j541J9551J5748M26K550L4158j0390o613L2373
12394C0682j3072Q605r499k2754M6453K0747K4999p397m6145j3474P508k805P610
12381C1458j4K897K944k352r192J1226m425l1537j3770j94p386O519K7675J7177
12367C1026J5461J2959K1786N561o8699l0718L6404N5326J3162n0082k1807L385
$$ plain form
12456 -53965 -79420 -79382 -89704 -110379 -86673 -65071 -34153 -5249 10226 -1963 -41901 -59706
12444 -59706 -89713 -74718 -31751 7743 44330 86468 122701 104986 71104 24407 -4950 6662
12432 6662 9638 19374 -1891 -269 -18904 8299 46547 36901 -749 16196 2777 -8537 -11400
12419 -11400 -7761 33547 67136 91642 56892 14116 14420 10243 23748 48477 23991 -9213
12407 -9213 1040 -3201 -40576 -55580 -57121 -37570 -21822 -21396 -18846 15312 4922 -1691 30682
12394 30682 17610 26215 16716 -6038 40415 61162 86161 78764 32619 19145 26653 23848 31458
12381 31458 31444 34341 37285 34933 25741 36967 32542 1005 -12765 -12959 -20345 -13826 13849 31026
12367 31026 46487 59446 81232 86793 18094 -12624 23780 79106 92268 42186 20379 23764
12355B3764J5349j2298K44o190j7150K0934J6757J9912N250M169k7110j6494L3022
12342F0159k4966k9934k5834J4476k5190L963M3494J1657Q564j412j9584r300
12330F093j542j5337j5681J5897n43n665K5666Q719J2368Q805m176n2609k2607
12317d0612n934J7655l885m027m26K5869K5537Q099K154k4554L401o705K91l4360
12303c7497K0190j2586L7027J5369n0311M423L792N884J893K031J1214n1597k2169
12290g2337L3991M4288K0078l079j2881J7329J4046m0831k1184K2153Q342k3139
12278a3224j6218J9022N745J4591J6906k2796j2681J8236L2826Q871n964J367
12266D6681j357m7070J9624J7987j4654K067j1230j2977j2999l3838j4739k9259
$$ plain form
12355 23764 39113 26815 27059 20869 3719 24653 41410 61322 66572 70741 43631 27137 60159
12342 60159 35193 5259 -20575 -6099 -31289 -27326 16168 27825 36389 34977 15393 6093
12330 6093 4551 -10786 -26467 -10570 -11113 -16778 8888 17607 29975 38780 34604 -18005 -40612
12317 -40612 -46546 -28891 -32776 -36803 -37229 -11360 14177 22276 24430 -124 3277 -3428 -3137 -37497
12303 -37497 -17307 -29893 7134 22503 -27808 -23385 -19593 -13709 -11816 -9785 1429 -50168 -72337
12290 -72337 -38346 5942 26020 22941 10060 27389 41435 604 -20580 1573 9915 -13224
12278 -13224 -29442 -10420 -4675 9916 26822 4026 -8655 9581 42407 51278 45314 46681
12266 46681 45324 -1746 17878 35865 21211 23278 12048 -929 -13928 -47766 -62505 -91764
12254i1764J0158k446j6730J7848N7204K5260j2411Q566R493m062K4992l1073
12242d965k5361K1664j3090k5266K847j5040O406K5741K0793J3894K3499K762
12230C3884N5874M849m3895m0628O771j459J6491J4344M234l2271j5429J5823
12218A8588Q711J5268R711k9747l4492J1631J4041p58J4644k7579J8035K6561
12206D4614j5368J4439N256p02J163l9727n6021j5254Q956k3808k0035K7361O2247
12193f879R169m3309k2176k0727L5874j198J6623K2046P122r880n61K9795K2713
12180C8612k1588o1276m0845J1778L7014J0105R249L2660j341j3256J2007j6826
12168c707P534k0337l584L485n058Q525J8455j1973L3866L1466j4944m3289l1217
$$ plain form
12254 -91764 -81606 -84052 -100782 -82934 -25730 -470 -12881 -4315 5178 1116 26108 -4965
12242 -4965 -30326 -8662 -21752 -47018 -44171 -59211 -52805 -27064 -6271 7623 31122 33884
12230 33884 89758 94607 50712 10084 16855 15396 31887 46231 50465 18194 2765 18588
12218 18588 27299 42567 52278 22531 -11961 -330 13711 12953 27597 18 18053 44614
12206 44614 29246 43685 48941 48239 49402 9675 -46346 -61600 -52644 -76452 -96487 -69126 -6879
12193 -6879 2290 -41019 -63195 -83922 -48048 -49246 -32623 -10577 -3455 -13335 -13896 15899 38612
12180 38612 17024 -44252 -85097 -73319 -36305 -26200 -16951 15709 14368 1112 13119 -3707
12168 -3707 3827 -16510 -20094 -16609 -21667 -13142 5313 -6660 27206 58672 43728 439 -30778
12155c0778o613L6898L3329N104k8233K870l3380p436K3540N081J2162J2882p345
12142A8081L367N5677O9L136l0289j8645M3759j9843k7971l2521k0273L2758J8367
12129B5672k1870O731J7711q900r466j7150j8369j2633J2533J7796N790q92M4449
12116D1402L224N393M8445R7160R3840P3703P1476N4255Q846m7184p2616l4653
12104C43291j3093n6324n9323o6573k7163K289R333k1674k9187j6044q077J9779
12092G7234R247j8604J1676M673J0520o140J0352k0855O3866N5348R834K7044
12080B34195J3565L9742P5724O9535L1384N2282l295l9797j1856o3813n8573o4408
12068B74685n3321o5374n4324J4001J5152k5057p270j8173j6104l5955k3644L494
$$ plain form
12155 -30778 -37391 -493 32836 37940 9707 12577 -20803 -28239 -4699 382 12544 25426 18081
12142 18081 21448 77125 77194 80330 50041 31396 75155 55312 27341 -5180 -25453 7305 25672
12129 25672 3802 10533 28244 19344 9878 -7272 -25641 -38274 -25741 -7945 -2155 -3047 41402
12116 41402 44626 50019 98464 195624 289464 363167 434643 488898 497744 450560 377944 343291
12104 343291 330198 273874 214551 147978 120815 123104 132437 110763 81576 65532 57455 77234
12092 77234 86481 67877 79553 84226 94746 88606 98958 78103 141969 197317 207151 234195
12080 234195 247760 287502 363226 432761 464145 516427 513132 473335 461479 397666 339093 274685
12068 274685 221364 155990 101666 115667 130819 105762 98492 80319 64215 28260 4616 8110
12056H110L5032r529j0240J0524n754j8842R306J9965K3409M512l0239o788o982
12043B2484j5313L8553K2244r732P210j6556Q5K1258k1086m1400k5228K6098J7578
12030B6195L1951J4300j4139k9117r79L46j488r888P725J6390K2455N343J318
12017G0412J8416K9737k701j7542Q431L2242l348k5806j906j265m297J2505j3288
12004A01590J3196K1399N992q122J8262P2124P6078Q7495O5273N5193N6638M0434
11992F05552N5568J46603K08690L70687O06398Q71001J280466J780846J999390
11983G925201J573100J461293J507519M27888j19888l23661o98754j810404k944734
11974F997560k443770j435662q33030n26866k75938j89193k06719j18604p9984
$$ plain form
12056 8110 43142 33613 23373 33897 28143 9301 18607 38572 61981 66493 36254 29466 22484
12043 22484 7171 45724 67968 58236 65446 48890 48975 70233 49147 7747 -17481 8617 26195
12030 26195 58146 72446 58307 29190 28211 28557 27069 17181 24906 41296 63751 69094 70412
12017 70412 88828 118565 115864 98322 106753 138995 135647 109841 107935 106670 102373 114878 101590
12004 101590 114786 136185 142177 134055 152317 224441 300519 388014 453287 508480 565118 605552
11992 605552 661120 807723 1016413 1387100 1993498 2864499 4144965 5925811 7925201
11983 7925201 9498301 10959594 12467113 12895001 12775113 12451452 11752698 9942294 6997560
11974 6997560 4553790 3118128 2285098 1758232 1482294 1293101 1086382 967778 887794
11965H87794q4412p5209o4677n6793k8811j2298j7576m6594l4732l8058m4728
11954C83906j8868l2276l5829j0052J7285k292k2468L7362M99M2283P3382J02245
11942E35177J26780K26416L15789M70179N45157L38085R0361m3964m70272o99433
11932A434275m86837k94676j63503r6758o4457j1932k2358m393k1743k1647j0553
11921B35418K216m704j8746J2207j7028M356k4348o0502j0534P555o915J3029
11909A32004j5468J0841m2884q347J4292l878n2280J7010J5085R333J4925K1019
11897A11652L5688J6804k4686m8336P10j5167j1558r026j4408L61M1785J0763
11885I4582j6610M1859k710l2847k8137L3875Q612k5487L3018K4991M087p289
$$ plain form
11965 887794 803382 728173 663496 606703 577892 565594 548018 501424 466692 428634 383906
11954 383906 365038 332762 296933 286881 304166 301874 279406 316768 317267 359550 432932 535177
11942 535177 661957 888373 1204162 1674341 2219498 2557583 2647944 2603980 2133708 1434275
11932 1434275 947438 652762 489259 392501 328044 316112 293754 289361 267618 245971 235418
11921 235418 237634 232930 214184 226391 209363 213719 189371 128869 118335 125890 118975 132004
11909 132004 116536 127377 84493 76146 90438 86560 34280 51290 66375 75708 90633 111652
11897 111652 147340 164144 139458 91122 91832 76665 65107 56081 41673 42034 83819 94582
11885 94582 77972 119831 117121 84274 56137 90012 98624 73137 106155 131146 135233 127944
11873A27944J6347q226m3052k2583m0353j6929J8178L6864K5639M2804L7370J9429
11861A93432N0243N2715K3825n500j8950m4915j9298k1717M11k1m5106p4195k8632
11848F2292o918k7730j558K2983j3942j8487O586l165k4080O409L3346Q385j4168
11835B9953l3479J820P281K1707J7370k3840j3021J57j8720J6231m9750k0131
11823f4422L9779J3080j9210k216q257N9223J9144M0780J005K3030m5287n7011
11811c62j9294K4467N947J5755K5684J1560k9560j9220n1641J0020M8362K6607
11799D8325l5337P273J4386m7284l5108K8683J1678j3348k4962J340M9137M4278
11787D9061j4865l5082k6223k292J7037j086J2793J8520Q669L415k372l6708M4385
$$ plain form
11873 127944 144291 136065 93013 70430 30077 13148 31326 68190 93829 136633 174003 193432
11861 193432 243675 296390 320215 314715 295765 250850 231552 209835 210246 210225 165119 90924 62292
11848 62292 55374 27644 26086 49069 35127 16640 23226 20061 -4019 2390 35736 44121 29953
11835 29953 -3526 -1706 5575 27282 44652 20812 7791 7948 -10772 5459 -44291 -64422
11823 -64422 -24643 -11563 -30773 -32989 -41246 17977 37121 77901 78906 101936 56649 -362
11811 -362 -19656 4811 10758 26513 52197 63757 34197 14977 -36664 -26644 21718 48325
11799 48325 12988 20261 34647 -12637 -47745 -19062 -7384 -20732 -45694 -44354 4783 49061
11787 49061 34196 -886 -27109 -29401 -12364 -13450 -657 17863 26532 29947 27575 -9133 35252
11774C5252J6707o850K4265P080k2203l6195j5737m500L1999q024N309M8717j9752
11761E6068j7051M347l6509J4099L7995J2002k1646k7499l9985k8297q22L6682
11749a0616J0126j5311k0779L8374J9070j8521K3838P830o296k1890m509j5776
11737a4460N318j8008j3945L2487K1256K4697K0944j7780n4927j7840k0694K4423
11725b8529N4734q639n2243K4433L5281N4172J9601m3310l4098L587k0720l1829
11713b7560J187P57L0712L3676O9147N5718r422l9831n3683m7947k3711Q508k3303
11700b5752P638K8133j0202k6672N608l31J6076L6525Q358l4879l2903K4217j3140
11687a7324O109J5741L5778m584j3903l0164n759R50j4040J1189K0279P089K116
$$ plain form
11774 35252 51959 45109 69374 76454 54251 18056 2319 -2181 29818 21794 27103 75820 56068
11761 56068 39017 43364 6855 20954 58949 70951 49305 21806 -18179 -46476 -47298 -10616
11749 -10616 -490 -15801 -36580 1794 20864 2343 26181 34011 27715 5825 1316 -14460
11737 -14460 -9142 -27150 -41095 -8608 12648 37345 58289 40509 -14418 -32258 -52952 -28529
11725 -28529 26205 17566 -34677 -10244 25037 79209 98810 55500 21402 24989 4269 -27560
11713 -27560 -26373 -25616 5096 38772 107919 163637 154215 114384 60701 12754 -10957 -2449 -25752
11700 -25752 -18114 10019 -183 -26855 -21247 -21578 -5502 31023 39381 4502 -28401 -4184 -17324
11687 -17324 -11215 4526 40304 35720 21817 -8347 -14106 -13156 -27196 -16007 4272 11361 13477
11674A3477k2538m681j801J0135K1155k5513j2577J9575J7707j7404k0469J5977
11662f957Q852q647l4031J3896J5810J3348q657j3568K1725k2649m574J2924j4287
11649b6815J0333j0029P612k908J9666L9813m0953m3522J3170j0642L2447M2643
11637C0815m011l6030R285O344j3511M0952J5645M268P301l5870j7727o057J5505
11624A6909l404O790l865l4241J1724J40j9378L038M424j3381q016o401K8477
11611a7184K1422p943l833N352p168k7793k4250j6192K9219M9573J0472l1200
11599a9525k3085k5783L7804M879K1545M5965L6144J060l0706j735j5519k4816
11587F228j2316k8921j9190J1805K6408J869j8145N410J4351K1599r958K3777
$$ plain form
11674 13477 -9061 -13742 -15543 -5408 15747 -9766 -22343 -2768 14939 -2465 -22934 -6957
11662 -6957 1895 -6752 -40783 -26887 -11077 2271 -6386 -19954 1771 -20878 -25452 -12528 -26815
11649 -26815 -16482 -26511 -18899 -21807 -2141 37672 -3281 -46803 -33633 -44275 -11828 30815
11637 30815 26804 -9226 59 6403 -7108 33844 49489 53757 61058 25188 7461 1404 16909
11624 16909 13505 20295 16430 -17811 -6087 -5947 -25325 -22287 -17863 -31244 -39260 -45661 -17184
11611 -17184 4238 -3705 -7538 -2186 -9354 -37147 -61397 -77589 -48370 1203 11675 -19525
11599 -19525 -42610 -68393 -30589 -25710 -4165 41800 77944 79004 48298 46563 31044 6228
11587 6228 -6088 -35009 -54199 -42394 -15986 -14117 -32262 -26852 -12501 9098 -860 22917
11575B2917K6037m0376r197n604m939m050L0431L5507k8314m0931K8323L3256
11563D3060N379n2689r012k4661l4646J6197L1057M5143n22j8343k2105l9666
11551f0808j8469J0139J0270O077K1221J5930m641m0911K1825L5124L6124Q112
11539C9993k649K0593j140J8942l7659l7739K8033J3634j7431j635k562M5559
11527F5939n357q275J6676J9023l2338r120l578k3902j2426j0032k7125K2078
11515h437K5018k2781m0420J9308R860J5580o726k0577M4564J0090m3878R792
11503h607J2896r708O004j9253N605M137K0379j600k2242j8629O906P291Q034
11490h787K8858K6963k0179j318j0298r89J2855K2980n711k3794j8692l1191K3793
$$ plain form
11575 22917 48954 8578 -619 -6223 -11162 -15212 15219 50726 22412 -18519 9804 43060
11563 43060 48439 -4250 -13262 -37923 -72569 -56372 -25315 19828 19306 963 -21142 -60808
11551 -60808 -79277 -69138 -58868 -52791 -31570 -15640 -20281 -61192 -39367 -4243 31881 39993
11539 39993 37344 57937 56797 75739 38080 341 28374 42008 24577 22942 20380 65939
11527 65939 60582 52307 68983 88006 55668 46548 42970 19068 6642 -3390 -30515 -8437
11515 -8437 16581 -6200 -46620 -27312 -17452 -1872 -8598 -29175 15389 25479 -18399 -8607
11503 -8607 4289 -5419 585 -18668 -13063 -8926 11453 9853 -12389 -31018 -24112 -16821 -8787
11490 -8787 20071 47034 26855 25537 15239 14250 27105 50085 44374 20580 1888 -29303 -5510
11477e510Q650m06j689n2500N429M6357k643k0994m521M637J2812K1591O0721
11464G1934J5177m2167k0989j3946K3430q745l0163J4979j3278O864M8046k879
11452D8263k8872J499j2667K6190K7618k8754j1271O649J1030m9371n186O572
11440h300K4087K6118k9048m8056K2336M3038k5876L931J155Q807N267r59r69
11427B1531k8490o1417l9585K8199J3759J6940J4493J7884K1459Q248l5486j5031
11415c7496p767k5653N369l796J1393K8196j0977k4408j5984j3097M755M5225
11403d4240J4396l384N59k4758J3714M2598K371k7848l3961j7918O070o508m2887
11390a21796l0152J4446L3509N1979J9394p20r120L771K5429J0649L642L02J2716
$$ plain form
11477 -5510 3140 2734 1045 -51455 -46026 331 -2312 -23306 -27827 -23190 -10378 11213 71934
11464 71934 87111 44944 23955 10009 33439 24694 -5469 9510 -3768 3096 51142 48263
11452 48263 19391 20890 8223 34413 62031 33277 22006 28655 39685 -9686 -14872 -8300
11440 -8300 15787 41905 12857 -35199 -12863 30175 4299 8230 9385 18192 23459 22500 21531
11427 21531 -6959 -68376 -107961 -79762 -66003 -49063 -34570 -16686 4773 13021 -22465 -37496
11415 -37496 -45263 -70916 -65547 -69343 -57950 -29754 -40731 -65139 -81123 -94220 -89465 -44240
11403 -44240 -29844 -33228 -32669 -57427 -43713 -1115 1256 -26592 -60553 -78471 -72401 -78909 -121796
11390 -121796 -151948 -137502 -103993 -52014 -32620 -33340 -42460 -38689 -13260 -2611 1031 1333 14049
11377A4049r688k4173j4212n9322k7542O2699N4214R528L257Q913k0660l4150
11365c7087j2345K8850J1505r326P095p758k184O57q494l1430k3622K2705M4138
11352a7296j3868l0570N244M9578q37j2561p9n7059l2648L2236M7637R054n6622
11339g7791n595J660K0357O682l058L4870L6718l5313j4401o498M2914M684j8054
11326a2825M1663o164p451R631Q055P192R756l4694k544J2317k3038l8328m635
11313d1065K773P083q805K3823K2117J3673K4075j3714j3853k4037J4376j7106
11301a0660j4596j9930r747K1272j1806j3281J6665m899K8975J6037m477l7870
11289d4317J9735L0055k3243K9669K619m84J928j1277j4932M964M5952l5256l7075
$$ plain form
11377 14049 4361 -19812 -34024 -93346 -120888 -58189 -3975 5553 8810 17723 -2937 -37087
11365 -37087 -49432 -20582 -9077 -18403 -11308 -19066 -21250 -20593 -29087 -60517 -84139 -61434 -17296
11352 -17296 -31164 -61734 -56490 -6912 -7749 -20310 -20389 -77448 -110096 -77860 -30223 -21169 -77791
11339 -77791 -83386 -81726 -61369 -54687 -57745 -22875 13843 -21470 -35871 -42369 545 5229 -12825
11326 -12825 28838 22674 15223 24854 32909 40101 49857 15163 12619 24936 1898 -36430 -41065
11313 -41065 -38292 -31209 -40014 -16191 5926 19599 43674 29960 16107 -7930 6446 -10660
11301 -10660 -25256 -45186 -54933 -33661 -45467 -58748 -42083 -46982 -18007 -1970 -6447 -44317
11289 -44317 -24582 5473 -17770 11899 14518 14034 15962 4685 -10247 -5283 40669 5413 -31662
11276c1662m265j4101J4092K6463K5545L3091l0246n8676l5773L5809M4708J6011
11264B0996N941J6506j1632l1507k8964k0040L1676L8188j8998l3183j3420R805
11252c4632M6791K5916M385j2096j8345j1469j6254m558J5767K1422j9390l8981
11240d1444N4387K6561J157j4587L543m744J9964J304j5276k575l0023j4105P405
11227h433R070n66o90L2556o833k1978K6708M917o376N616L3886K2898l4215m9311
11213G249k4243J2105p56j2165J6513j6918M403L9342n787P913K3385k5483l1438
11200e880k561j7291K979N434j4447j6521j5456J6239L687O807K8276j691K147
11187h278k8746j9657j4227K6496K6683K211J7344L0581K011K3456M644j0746
$$ plain form
11276 -31662 -35927 -50028 -35936 -9473 16072 49163 18917 -39759 -75532 -39723 4985 20996
11264 20996 26937 43443 31811 304 -28660 -48700 -17024 21164 2166 -31017 -44437 -34632
11252 -34632 12159 38075 42460 30364 12019 550 -15704 -20262 -4495 16927 -2463 -41444
11240 -41444 12943 39504 40661 26074 29617 24873 44837 46141 30865 28290 -1733 -15838 -8433
11227 -8433 637 71 -619 31937 25104 3126 29834 34751 28375 33991 67877 90775 56560 7249
11213 7249 -16994 -4889 -5645 -17810 -1297 -18215 -13812 25530 19743 27656 51041 25558 -5880
11200 -5880 -8441 -25732 -22753 -17319 -31766 -48287 -63743 -47504 -43817 -37010 -8734 -10425 -8278
11187 -8278 -37024 -56681 -70908 -44412 -17729 -15518 1826 32407 34418 57874 62518 51772
11175E1772j3291l6688j3048J9142L13j4328M3387p938P107N868L409M218l9576
11162A0347l7960L452J3194k9789k2762J3789N219J624P544K6478l234k0547r606
11149d2251K0557K0514j4956J6284J2888o7627j4310O0280M734J93P558M957J4117
11136B2938l0480k9096j5346j3273O763J8084K4377k198k2663l9859n151N435
11124h0469N7756P3088j1226n4645o4866P718L3748Q392j6633k5341n788m351
11112h2617N993J7343K0219k653M925j4523m2347m664L8090l614O351m389J4701
11099d7185L5684o522j5458L2187Q732q652Q056M7817o9594l5831q602K0759Q089
11086c0520j4806o733J2311L0495L6734J245q938P034Q958l0680L604j4011k7599
$$ plain form
11175 51772 38481 1793 -11255 7887 8200 -6128 37259 29321 36428 42296 45705 49923 10347
11162 10347 -27613 -24161 -10967 -40756 -63518 -49729 -44510 -42886 -35342 -8864 -12098 -32645 -42251
11149 -42251 -21694 -1180 -16136 148 13036 -54591 -68901 -8621 -3887 -3694 3864 8821 22938
11136 22938 -7542 -36638 -51984 -65257 -58494 -40410 -16033 -18231 -40894 -80753 -85904 -80469
11124 -80469 -22713 50375 39149 -15496 -80362 -72644 -38896 -30504 -47137 -72478 -78266 -82617
11112 -82617 -76624 -59281 -39062 -41715 -36790 -51313 -93660 -98324 -60234 -63848 -57497 -61886 -47185
11099 -47185 -11501 -18023 -33481 -1294 7438 -1214 6842 54659 -14935 -50766 -59368 -38609 -30520
11086 -30520 -45326 -52059 -39748 -9253 27481 28726 19788 26822 35780 5100 8704 -5307 -32906
11073c2906m652L8393K7767j8386j8913m6687O032j9364l2591o592L5377K748
11061f9774q935M768j0824N786j0084K0745r144p469M0812n877k4125J456l228
11048g5893K2842K749l926j571M1707R456n4703l0976J3927M1372J775j1808J273
11035d3776J5808M9438Q604l431j5624q977L963J4077j6773J4720k1989l2626
11023c6586M951j5121k5972n533L1232J8606o202m1607L744L8882O2992K608l4548
11010b554q122j0510j9168R463k5790J4462M0129P400K2012j5419l9252n661J7276
10997a5734M7525r023l4036J584J1308n512k1780k4923K5068L9167j3278J1142
10985A1508N120L465m114k2234k2270K2303N4478K0306m0562m9325j5230L6160
$$ plain form
11073 -32906 -37558 835 28602 10216 -8697 -55384 -49352 -68716 -101307 -107899 -72522 -69774
11061 -69774 -78709 -73941 -84765 -78979 -89063 -68318 -77462 -84931 -44119 -49996 -74121 -72665 -75893
11048 -75893 -53051 -50302 -54228 -55799 -14092 -4636 -59339 -90315 -76388 -35016 -33241 -45049 -43776
11035 -43776 -27968 21470 30074 26643 11019 2042 6005 20082 3309 18029 -3960 -36586
11023 -36586 -31635 -46756 -72728 -78261 -47029 -28423 -34625 -76232 -72488 -33606 29386 31994 -2554
11010 -2554 -10676 -21186 -40354 -30891 -56681 -42219 -2090 5310 27322 11903 -27349 -33010 -15734
10997 -15734 31791 22768 -11268 -9684 1624 -3888 -25668 -50591 -25523 13644 366 11508
10985 11508 16628 20093 15979 -6255 -28525 -6222 48256 68562 28000 -21325 -36555 -395
10973c95j9063R432o376J948Q799M4386K2596j3375n5263k4781j4241L7193q025
10960a7165r083J9369L193K4173jk8819n532K2394K8802m064j5856k3509k0195
10947b6293K8967K0233j9759j2036N123o465R462j553K1001J135n1094l3571J683
10934f3167K6508L91l7178M146J4590l136L242J2673j7329J1943M2476L9461J9054
10921E3674K3652j0461q5035J6707L1072j7487k3505j2222K8272L0397M763j6457
10909B3370o005k8001j7113j6617J0412m95q562L497j384L838N5091o449j9565
10896g983J0547O653L3198k4469k7421n685L5571j6348m8911k7933M860J0970
10884e6951J3660J3254k841r805j4749J8497L7002J5242k89K1804k153j5078m2723
$$ plain form
10973 -395 -19458 -10026 -16402 -14454 -5655 38731 61327 47952 -7311 -32092 -46333 -9140 -17165
10960 -17165 -26248 -6879 -3686 20487 20486 -8333 -13865 8529 37331 33267 17411 -6098 -26293
10947 -26293 2674 22907 3148 -8888 -3765 -10230 -768 -2321 18680 19815 -31279 -64850 -63167
10934 -63167 -36659 -36268 -73446 -69300 -54710 -57846 -54604 -41931 -59260 -47317 -4841 34620 53674
10921 53674 77326 66865 -18170 -1463 29609 12122 -11383 -23605 4667 35064 39827 23370
10909 23370 17365 -10636 -27749 -44366 -33954 -34449 -43011 -39514 -40898 -37060 18031 11582 -7983
10896 -7983 2564 9217 42415 17946 -9475 -15160 20411 4063 -44848 -72781 -67921 -56951
10884 -56951 -43291 -30037 -32878 -42683 -57432 -38935 -1933 13309 13020 34824 32671 17593 -25130
10871b5130o185J8415k833m654j797j8414L2613L4377k7260J441R00k9218j9060
10858d6805j0391l896K6506k786J460Q688J3000o557j0786m12Q387k3523L3661
10845a3454M6101o246k3891j8312p832P541j8306N591l285R965q98k5057O38p498
10831e4943K317M8068k920m5910j2184n618K3370j6410j567J6742q445q010j6978
10818h2488j6439J5923N9635m631J3579J7049Q681J5146L347m775J5938J999j7565
10805B5399k7645m223l0178K5655R366K1641o52l7729r029k962O683J1908N712
10792f054m807K7201K4508m252l802j6867k1634J0595l15k449j2792j5551r978
10779c6197l0670j3580N1624Q449L0581k8570l1794L7829L4008J8495P406J4155
$$ plain form
10871 -25130 -31315 -12900 -15733 -20387 -22184 -40598 -7985 26392 -868 573 1473 -27745 -46805
10858 -46805 -57196 -61092 -34586 -37372 -35912 -27224 -14224 -20781 -31567 -31979 -23592 -47115 -13454
10845 -13454 32647 26401 2510 -15802 -23634 -16093 -34399 -28808 -32093 -22128 -23026 -48083 -47445 -54943
10831 -54943 -52626 -4558 -7478 -53388 -65572 -71190 -47820 -64230 -65797 -49055 -57500 -65510 -82488
10818 -82488 -98927 -83004 -23369 -28000 -14421 2628 11309 26455 29802 25027 40965 42964 25399
10805 25399 -2246 -6469 -36647 -10992 -1626 20015 19363 -18366 -27395 -30357 -23674 -11766 -6054
10792 -6054 -10861 16340 40848 36596 32794 15927 -5707 4888 4573 2124 -10668 -26219 -36197
10779 -36197 -66867 -80447 -28823 -20374 10207 -18363 -50157 -12328 21680 40175 47581 61736
10767F1736J609j2770j7216n9460p555J8711l47k2689k2206J0605J3984n186p737
10754d8521r962J6473R343P017M5489O397p184p404J005J8687k1060l3446k8722
10741e1888J2539L0145K2932K0737k0432l4761n034K3630J9421m3397R732L8169
10729B1793J4589O745j4175l8591j9988j0260j5695J8760J2106J3703K1682J692
10717A2361K747q205r03L1228m230j9041j7593m876k8474J5996M6620j0803m527
10704A0300J4204O113J712j9181j7895k2481j315J1274q640K94k1426j3891K4561
10691c6371L5980R747J714j3288k3820j7571J7631J9189j3944k1565K505k8411
10679f8204J7991M2388k3862k1296m41K0186K6718o077j3814m065p765N852M6049
$$ plain form
10767 61736 63345 50575 33359 -26101 -33656 -14945 -15292 -37981 -60187 -49582 -35598 -40784 -48521
10754 -48521 -58483 -42010 -32667 -25650 19839 26236 19052 11648 12653 31340 10280 -23166 -51888
10741 -51888 -39349 -9204 13728 34465 14033 -20728 -25762 -2132 17289 -26108 -16376 21793
10729 21793 36382 43127 28952 -9639 -29627 -39887 -55582 -36822 -24716 -11013 10669 12361
10717 12361 15108 6903 6000 37228 32998 13957 -3636 -8512 -36986 -20990 25630 14827 10300
10704 10300 24504 30617 32329 13148 -4747 -27228 -28543 -17269 -25909 -25615 -47041 -60932 -36371
10691 -36371 -391 9356 11070 -2218 -26038 -43609 -25978 -6789 -20733 -42298 -39793 -68204
10679 -68204 -50213 -7825 -31687 -52983 -53424 -33238 -6520 -12597 -26411 -30476 -38241 -32389 13660
10666A3660M3242l0490m5842P376L5973l739O907l636l2249j4917J0259J2250
10654a206N19P608J3941n073j5882n235j2135r259m379Q431q089R880Q336k609
10640a5152k6656j3528J4367M8297O1899M918l8418j2330Q117P409O508l4409
10628A1022m1755k8287R784N6357j2243k5498M9044K5361J9904m607l3217k8016
10616b151k0071N694P286L270K4554j8027m1888j027L6829J6740K9864j886o130
10603C3057N217j9741r983J9716j4949n154Q686M928o897m248j1663L830P037
10590I836N05L4418J4758j9897k4861l206J5560j1642K253k386k9400j9639k6371
10577f0072K3045N5505k5419L5989O11k3480j7031Q644J7176J1721j95k024j874
$$ plain form
10666 13660 56902 26412 -19430 -12054 23919 20180 27087 23451 -8798 -23715 -13456 -1206
10654 -1206 -687 6921 20862 15789 -93 -5328 -17463 -26722 -31101 -22670 -30759 -20879 -12543 -15152
10640 -15152 -41808 -55336 -40969 7328 69227 74145 35727 23397 31514 38923 45431 11022
10628 11022 -30733 -59020 -49236 7121 -5122 -30620 18424 43785 63689 59082 25865 -2151
10616 -2151 -22222 -16528 -9242 -5972 18582 555 -41333 -42360 -5531 11209 41073 39187 33057
10603 33057 38274 18533 8550 28266 13317 8163 16849 21777 14880 10632 -1031 2799 9836
10590 9836 10341 44759 59517 39620 14759 11553 27113 15471 17724 15338 -14062 -33701 -60072
10577 -60072 -37027 18478 -6941 29048 29659 6179 -10852 -2208 14968 26689 26494 24470 22596
10564B2596J1528K2173K7583n406k0567j7898j8869L9143M0455j6376j6503N465
10552G3324J0878K4055J413k9477j696k743m916j6710J8393K1426j7588q3487
10540g128j8146M6868O31j1707K184M3359K6602L0114n286l132l5788l4804K846
10527C6613L0449J2891m748m4254j8428M3745L0123K4859J2793k485j0927k4694
10515H5937l1491J9518M4014j2389j4791K768l628K6676J7208M7177L1232P822
10503B20053K1284l0467J2416K3436m303j2061j4803k2537j1075J2930k156k2707
10491A70010k9015J4731J5811j4350k5531j8603P411k0771l9186l501K2725J6035
10479I5766J571J8634l0434m029j180R90l6574n849N1310j9197J1241J1793m811
$$ plain form
10564 22596 34124 56297 83880 78474 57907 40009 21140 60283 100738 84362 67859 73324
10552 73324 84202 108257 109670 80193 78497 75754 70838 54128 72521 93947 76359 -7128
10540 -7128 -25274 21594 22225 10518 12702 56061 82663 112777 107491 104359 68571 33767 36613
10527 36613 67062 79953 75205 30951 12523 56268 86391 111250 124043 121558 110631 85937
10515 85937 54446 73964 117978 105589 90798 93566 89938 116614 133822 180999 212231 220053
10503 220053 241337 210870 223286 246722 242419 230358 215555 193018 181943 194873 192717 170010
10491 170010 140995 155726 171537 157187 131656 113053 120464 99693 60507 57006 79731 95766
10479 95766 97337 115971 85537 81508 80328 81318 44744 38895 90205 71008 82249 94042 89231
10466H9231J0715k9009q307M6N3766J9726J669J5437J4508j6188j4105M3898O151
10453A87538k7904M966j5785r287j3285k6430k2573L549m568p881J8200j4045
10441G2495n9355n5010M847L1595M4289O035l2432n4436k5203L3544M2060L5033
10429D3462Q546k1393O045J2911J4441Q911N9381O2200n246k4755j6547j1982
10417A35974L4490K6051P994j0163L017J9913K9214P311r51k5156O315M778J2380
10404B51167O623j3602k5683l1202l0820K181k539j7338L4091M2636j6200n409
10392A93905K5496J4641J2491L5969N721J9131J9412O335j8654J5842K6520N775
10380C62584J0338P391L2019L4045L08L4977O9362M1768K5129l607l6031l9651
$$ plain form
10466 89231 99946 70937 62630 62676 116442 136168 137837 153274 167782 151594 137489 181387 187538
10453 187538 159634 164600 148815 139528 126243 99813 77240 80789 76221 68340 86540 72495
10441 72495 13140 -41870 -37023 -5428 38861 44896 12464 -41972 -67175 -33631 8429 43462
10429 43462 52008 30615 36660 49571 64012 72923 132304 194504 189258 164503 147956 135974
10417 135974 170464 196515 204509 194346 197363 217276 246490 253801 252850 227694 234009 238787 251167
10404 251167 257790 244188 218505 187303 156483 158664 156125 138787 172878 215514 199314 193905
10392 193905 219401 234042 246533 282502 288223 307354 326766 333101 314447 330289 356809 362584
10380 362584 372922 380313 412332 446377 446685 481662 551024 592792 617921 614314 578283 538632
10368E38632n1122j7601r126m2198n0264k1826K8868O2183k660q826O3857L3101
10356E23018m756J3061K6332l386L369N3050N8849n444K3578M196O916K4639L8069
10343G61491J1007L1954K0953L9549K6922K5099K3003J2436P238O3491Q4127N6695
10331A163965J01123P8688L6696N7805M8842k454O9815K7531M2932Q9091J06490
10320A820524J03665Q8790J04092J58240J56751J81521K10655K11236K45332K31599
10310C512405K97283L22612L57807L78853M75559N24624N97704O43555Q02853
10301G913255Q97427J046227J247233J511738J759849K016286K406319K849813
10293B1648147L297229L871362M456785M991274N420329N653172N561269N086458
$$ plain form
10368 538632 487510 469909 460783 418585 368321 346495 375363 437546 434886 426060 489917 523018
10356 523018 518262 531323 557655 554269 557638 610688 669537 664093 687671 691867 698783 723422 761491
10343 761491 772498 804452 825405 864954 891876 916975 939978 952414 959652 1023143 1107270 1163965
10331 1163965 1265088 1343776 1380472 1438277 1487119 1484665 1554480 1582011 1624943 1714034 1820524
10320 1820524 1924189 2012979 2117071 2275311 2432062 2613583 2824238 3035474 3280806 3512405
10310 3512405 3809688 4132300 4490107 4868960 5344519 5869143 6466847 7110402 7913255
10301 7913255 8810682 9856909 11104142 12615880 14375729 16392015 18798334 21648147
10293 21648147 24945376 28816738 33273523 38264797 43685126 49338298 54899567 59986025
10285E9986025M166381K879507J352799k12337j617815k659406l327740l623592
10277E6943822l651494l473044l151449k735970k329597k025410j650629j343673
10269C6582556j026651p68261m63860j90547J40838M52626P58446J086958J476028
10260C8048133J934213K395473K992683L807259M699119N826744P128832Q767083
10252G5599539J0650706J2657635J4484294J5698071J5837532J4270788J0749051
10245A69947616N542254p49419o949403j1939348j4994459j5925777j5133615
10238A09797849j3446447j1432179r485768p878655o478990n303359m332791l576855
10230D7862805k900941k361394j900395j491274j099414p55145n12837k47416
$$ plain form
10285 59986025 64152406 67031913 68384712 68172375 66554560 63895154 60567414 56943822
10277 56943822 53292328 49819284 46667835 43931865 41602268 39576858 37926229 36582556
10269 36582556 35555905 34787644 34323784 34133237 34274075 34726701 35485147 36572105 38048133
10260 38048133 39982346 42377819 45370502 49177761 53876880 59703624 66832456 75599539
10252 75599539 86250245 98907880 113392174 129090245 144927777 159198565 169947616
10245 169947616 175489870 174740451 167791048 155851700 140857241 124931464 109797849
10238 109797849 96351402 84919223 75433455 67554800 61075810 55772451 51439660 47862805
10230 47862805 44961864 42600470 40700075 39208801 38109387 37354242 36841405 36593989
10222C6593989M7529L83284O62950R33500J241855J627268J989845K382510K759883
10213D8622613L133179L434324L565951L442589L078485K339916J235682j31733
10205F8721006j590617k985792m134563m922386n319744n248988m967477m540070
10197C5011369m007938l479907l002450k589023k221940j913261j641587j404018
10189A4751245j214998j099459r25910p96964p05799o67903o00369n43575m94076
10180G702192m49721l87956l26306k95262k82531k75034k40154k28565k07209
10171E009454k10045j95818k03937k07699j64771j50289j06071q4745j23116j39590
10161C423373j41328q7933o8751o5010o7179j17755q9970j05985j08334p4328
$$ plain form
10222 36593989 36641518 37024802 37687752 38621252 39863107 41490375 43480220 45862730 48622613
10213 48622613 51755792 55190116 58756067 62198656 65277141 67617057 68852739 68721006
10205 68721006 67130389 64144597 60010034 55087648 49767904 44518916 39551439 35011369
10197 35011369 31003431 27523524 24521074 21932051 19710111 17796850 16155263 14751245
10189 14751245 13536247 12436788 11510878 10713914 10008115 9340212 8739843 8196268 7702192
10180 7702192 7252471 6864515 6538209 6242947 5960416 5685382 5445228 5216663 5009454
10171 5009454 4799409 4603591 4399654 4191955 4027184 3876895 3770824 3686079 3562963 3423373
10161 3423373 3282045 3194112 3125361 3060351 2993172 2875417 2785447 2679462 2571128 2496800
10151B496800r3694o8580o6654q8346o4921l8043m2576o5267q3564o0829n1568
10140A772758k5239j6778m5225p5940k5087p09p884k4513p0039o2677o3934l8680
10128A316053l7097j7145o512n6213N728p444j5161j282K45k1120k5828l4031
10116A100193l1870o852k9420m6800n2717j9448k0828m8161l0282L658l6294o0294
10104G20885Q292J2420J5929R417j2098o107o3465m0027l218j02m1993L9817m9382
10091E90368l5378L2082K5974n485o1597j4322J937K4854o449j95l645q043R751
10078E49852j3523k9521O761l0723j7174J1617R752l2581j2273j7066n0209L097
10066C78009K7744L690j5251K8307j2213M171K3843L4777L6249L4596J0927l2929
$$ plain form
10151 2496800 2403106 2334526 2267872 2179526 2114605 2076562 2033986 1968719 1885155 1824326 1772758
10140 1772758 1747519 1730741 1685516 1609576 1584489 1583780 1575896 1551383 1481344 1418667 1354733 1316053
10128 1316053 1278956 1261811 1255299 1199086 1204814 1197370 1182209 1180927 1181172 1160052 1134224 1100193
10116 1100193 1068323 1061471 1032051 985251 932534 913086 892258 844097 813815 817473 781179 720885
10104 720885 729177 741597 757526 766943 754845 748738 685273 645246 642028 641926 599933 639750 590368
10091 590368 554990 587072 613046 607561 545964 531642 533579 558433 551984 551789 548144 540101 549852
10078 549852 536329 506808 513569 482846 465672 477289 487041 454460 442187 425121 374912 378009
10066 378009 405753 409443 394192 422499 410286 414457 438300 473077 509326 543922 554849 521920
10054E21920K6124K3393k3715K2559p557l5820l6540l5573P965J7688O4326O3248
10042F08018J29866K35847L76789N40750O89147N40911J62942K5327l17822r55846
10032B035929p09882l66169j78529j39548q0805m5524o6635J7072n6520l8918
10022C70471j4062k9112l8060k7116r657Q694L4275n519m5905l7585q016K5077
10010B23485K8158j7098K693k5180q782J6636J8880j8580K1708j9148q735j1569
9998B02468K29l869Q2j0888m105j5293k9327L5198J2249k4517j748k361J8710
9985A76828J2818l9996k4406p478j8498J2670R326l4669K6097J6522J6713j8542
9973A27385j9342j9861j2734K2731Q74k1380j0704k867k2801n443L8862j1086
$$ plain form
10054 521920 548044 571437 547722 570281 562724 526904 490364 454791 462756 480444 544770 608018
10042 608018 737884 973731 1350520 1891270 2580417 3121328 3284270 3309597 2991775 2035929
10032 2035929 1326047 959878 781349 641801 560996 515472 448837 465909 409389 370471
10022 370471 356409 327297 289237 262121 252464 261158 295433 289914 244009 206424 198408 223485
10010 223485 251643 234545 237238 212058 203276 219912 238792 220212 241920 222772 214037 202468
9998 202468 202697 198828 198910 188022 183917 168624 139297 174495 186744 162227 160479 158118 176828
9985 176828 189646 149650 125244 117766 99268 111938 121264 86595 112692 129214 145927 127385
9973 127385 108043 88182 75448 98179 99053 77673 66969 64102 41301 35858 74720 63634
9961F3634k3537N192J6117R029m661J9095J4232J8773j8542k1557j7014Q17l7491
9948B4087j7780R226K9955q672k3269M6711M6349k5445j9030J6956K4093m996
9936I8185J2694j6185m2383l7477N246M5358M4146j6635J0885l62J9189n305j4929
9923A02427j3623j6442L587K6541P404j1540k7662l5179L1144O294m5322q09J3795
9910D0615K8375K9429k5649O100j2688j1021j7093k9347K4088K1493l0064m784
9898A9454J3819k3223M852k2380P017r154j9350j1289R375O962j678J5318M6417
9885C6140k1626j3062J5104K5123K0024J2715l2851K11o418l537r001m294R055
9872B7583M9723j5155k7939O3182O2288m4885j6607K1730k3767n1046j8445j5859
$$ plain form
9961 63634 40097 45289 61406 70435 65774 84869 99101 117874 99332 77775 60761 61578 24087
9948 24087 6307 15533 45488 36816 13547 60258 106607 81162 62132 79088 103181 98185
9936 98185 110879 94694 52311 14834 20080 65438 109584 92949 103834 103472 122661 117356 102427
9923 102427 88804 72362 75949 102490 109894 98354 70692 35513 66657 72951 27629 26820 40615
9910 40615 68990 98419 72770 78870 66182 55161 38068 8721 32809 54302 24238 19454
9898 19454 33273 10050 14902 -7478 -461 -9615 -28965 -40254 -30879 -23917 -25595 -10277 36140
9885 36140 14514 1452 16556 41679 61703 74418 41567 41778 35360 31823 22822 18528 27583
9872 27583 77306 62151 34212 97394 159682 114797 98190 119920 96153 45107 26662 10803
9860A0803J2589l9782K4044r955k2274P246J9023k842O919K3887K8538P806J2895
9847G8897R946m0501m3367R107P028L6432P103N331q642j5104l2447J0126M4583
9834F8492M1888K508m1528m6053n672n724O37l052L7143J6968L46p890j5642p518
9820C4903j9274j1347n856R275l13P379J2536P36p737r807m0659j3925L2107J1820
9806a62N3188L4369n3341k1173n847K5821M972K3475N9088M888l9862j9861k7422
9793C8133m232m719j5819J0878J2681L176L0011o395m6678l2318L9991M8896j7383
9780E6222l7074j2730K478K2254n292j9267K1946l4917J6245N2315J8226O374
9768H6780l7561K1250K2870k258m0483J879k1741n2525l320L5128M9479K3216
$$ plain form
9860 10803 23392 -16390 7654 -2301 -24575 -17329 1694 -1148 5771 29658 58196 66002 78897
9847 78897 88843 48342 4975 14082 21110 57542 64645 69976 61334 46230 13783 23909 68492
9834 68492 110380 112888 71360 25307 19635 13911 14548 11496 48639 65607 65953 58063 42421 34903
9820 34903 15629 4282 -1574 7701 7388 14767 27303 28039 20302 10495 -30164 -44089 -11982 -162
9806 -162 53026 87395 34054 12881 7034 32855 37827 61302 120390 125278 85416 65555 38133
9793 38133 33901 29182 13363 24241 36922 40098 70109 63714 17036 -15282 24709 73605 56222
9780 56222 19148 6418 8896 31150 25858 6591 28537 -6380 9865 62180 80406 86780
9768 86780 49219 70469 93339 91081 50598 52477 30736 -21789 -25109 10019 59498 82714
9756H2714m3416j7461M2292k6123q300L8280K5030M1292k8175M791n987k1743
9744H3194r790j1811L742p505m0714k0171M641M623q482J9194J4372j9299k61
9731A1733K9435L2028J805n3560k2008J9218j8961Q641k8007L2258j9418K0690
9719A3854j5323J5337L1287J7035Q128J7566K370j5855N48k293J6091j4357J8776
9706I3164q625j4148O532J4997p998J4055l347J9446q536k1782n678m119N1729
9693A25690q739k3702n6256j933O403K1576n985j5020l0705j7076K4337P130k5388
9680C32k3908L1345L4707r559k2444K2887L6468o524K2405k2500k8003l4043k221
9667a058J8982l9281r092K7971p724M572K3556L3547l02l3349r844l043k5094
$$ plain form
9756 82714 39298 21837 64129 38006 29706 67986 93016 134308 106133 110924 104937 83194
9744 83194 73404 61593 65335 57830 17116 -3055 1586 6209 -2273 16921 31293 11994 11733
9731 11733 41168 73196 75001 21441 -567 18651 -310 8331 -19676 12582 -6836 13854
9719 13854 -1469 13868 45155 62190 70318 87884 90254 74399 74947 72654 88745 74388 93164
9706 93164 84539 70391 76923 91920 83922 97977 94630 114076 105540 83758 78080 73961 125690
9693 125690 116951 93249 36993 35060 41463 63039 57054 42034 11329 -5747 18590 25720 332
9680 332 -23576 7769 42476 32917 10473 33360 69828 63304 85709 63209 35206 1163 -1058
9667 -1058 17924 -21357 -30449 -2478 -10202 -5630 17926 51473 51171 17822 7978 4935 -20159
9654b0159Q079K241M850Q829O581M1887j7361m4331K11J1880J1945J7907L765
9641C6324r507j4193P731m4N556l3457p597K2916M883j9547K0522O130l5135p914
9627b3332P712J1564J1034L1095K32n6349L280N6673L351J3712r364O289l485
9614E2412p436K110j7533m818O291M2368J3215k4290j5388o8497k5541K1705L4039
9601H637K2527L4416J0013k5008Q317R712k0837J064l1157P760L0162N409K0081
9588H1096K1018L2787j7115o480j7700k6250l4301L5986j2763n390K0908K3713
9576I5509j1027M037n067K7412j3187n5652k2391J6739L6946O326j5242J6878
9564H1281k6030P472j730J5902j3032o698K5544K1195N955j1755J900r758k5997
$$ plain form
9654 -20159 -12080 -9839 -4989 3840 10421 52308 34947 -9384 -9173 2707 14652 32559 36324
9641 36324 26817 12624 20355 20311 25867 -7590 -15187 7729 12612 -6935 13587 19717 -15418 -23332
9627 -23332 -15620 -4056 6978 38073 38305 -18044 -14764 41909 45260 58972 49608 55897 52412
9614 52412 44976 47086 29553 24735 31026 73394 86609 62319 46931 -21566 -47107 -25402 8637
9601 8637 31164 65580 75593 50585 58902 68614 47777 48841 17684 25444 55606 61015 81096
9588 81096 102114 134901 117786 111306 93606 67356 33055 69041 56278 50888 71796 95509
9576 95509 84482 88519 83452 110864 97677 42025 19634 36373 73319 79645 64403 81281
9564 81281 55251 62723 60993 76895 63863 57165 82709 103904 109859 98104 100004 90246 64249
9551F4249L0265j5519k9231J7658k6670l2879L4598k018j2545K3741k688k383
9539D6578R883M3494K6423K1371j9346n6506o063L6928l3734m3470K3070K3409
9527G2037j1114Q1684K1765j9914l6324j6399N714J7366K7951k484q007k5441
9515A06834n389K5364M757L538J8250j2263J9401K3338O705o5505j4443L1176
9503A41763R611J860K356J8836J0233j2096j64L5026M9345k1484p500K9794Q109
9490B65689R349K7712q3r679M4075L1605L9391L587o300O1471N7642L6007L9452
9477E99918K9523O1012K9256n045J7263P1688J03510Q0994J31099J28170R6862
9466A344250J39050J94581K47985K68374K76936L60544M91878O56137Q20884J115613
$$ plain form
9551 64249 94514 78995 49764 67422 40752 7873 42471 40453 27908 51649 48961 46578
9539 46578 56461 99955 126378 147749 128403 71897 65834 102762 69028 25558 48628 72037
9527 72037 60923 142607 164372 144458 108134 91735 97449 114815 142766 140282 132275 106834
9515 106834 101445 126809 131566 135104 153354 141091 160492 183830 190535 125030 110587 141763
9503 141763 151374 153234 155590 174426 184659 172563 172399 207425 256770 235286 227786 257580 265689
9490 265689 275038 302750 302667 292988 337063 368668 408059 411646 405346 466817 524459 560466 599918
9477 599918 629441 690453 719709 714664 731927 803615 907125 988119 1119218 1247388 1344250
9466 1344250 1483300 1677881 1925866 2194240 2471176 2831720 3323598 3979735 4800619 5916232
9456E916232J507171K122956K930529L947046M895789N347943M799691L063844
9448C4531201O01137k073145m605662n767130n269541m026944k901641k042890
9440H445385j532607j129504q54729o79660n42483m39595l57299k73189k47719
9431B388600k34981j63127j27872j32925j35034q6599n6689j40389j13293n5530
9421A142161o7461k7511o3843l3220m2540l4709m5877m5683M602m8591r490l4318
9409F93520k0033j1950l2286j1991k8310m0020Q809P660l7667j9264k0056m0058
9397D48354J1640k6102j3839k3036j4337O635J498p085j6788m7814l0914J2242
9385C00454k0937J8524L2061J434j2750q991p89j0477m0761l3559Q590K4219j2020
$$ plain form
9456 5916232 7423403 9546359 12476888 16423934 21319723 26667666 31467357 34531201
9448 34531201 35132338 33059193 28453531 22686401 17416860 13389916 10488275 8445385
9440 8445385 6912778 5783274 4928545 4248885 3706402 3266807 2909508 2636319 2388600
9431 2388600 2153619 1990492 1862620 1729695 1594661 1508062 1451373 1310984 1197691 1142161
9421 1142161 1074700 1047189 983346 950126 907586 872877 827000 781317 785919 737328 727838 693520
9409 693520 673487 661537 629251 617260 588950 548930 557739 565399 527732 508468 488412 448354
9397 448354 459994 433892 420053 397017 382680 389315 390813 383728 366940 319126 288212 300454
9385 300454 279517 298041 330102 331536 318786 309795 309006 298529 257768 224209 232799 257018 244998
9372B44998n7547J8567l653l3867j1845J2484M079j5975J0880M3778k6618k9594
9360A55687L3152K1279k6291j2711j7750m565j663k941j6154J0174J363k9760
9348A09820l2077J830J0043K5778j9083r001J6402O704j7266k0716L543L3216
9336A09193N837m009j1405J3477L2331j0188m471m714K7457k6843k4580l3910
9324F8175l7079K503J285N417L6133J3450Q216l7629O824L3648j5630k4152l0994
9311C0167K436J3823J6586k1284J2728J3085m693j1148J592O612k3532l4693M882
9298F561K2750L4615L6797m186j2310k2371n827m5798j7096K5690K1591R268M0130
9285H9814R95q996j2410j5701k1674j0316J2476R732l6392r602J6738l7421j6977
$$ plain form
9372 244998 187451 206018 202365 168498 156653 169137 173216 157241 168121 211899 185281 155687
9360 155687 188839 210118 183827 171116 153366 148801 147138 144197 128043 138217 139580 109820
9348 109820 77743 79573 89616 115394 96311 87310 103712 110416 93150 72434 75977 109193
9336 109193 115030 111021 99616 113093 145424 135236 130765 126051 153508 126665 102085 68175
9324 68175 31096 33599 34884 40301 76434 89884 98100 60471 67295 100943 85313 61161 30167
9311 30167 32603 46426 63012 41728 54456 67541 62848 51700 53292 59904 36372 1679 6561
9298 6561 29311 63926 100723 96537 84227 61856 56029 10231 -6865 18825 40416 49684 89814
9285 89814 90809 81813 69403 53702 32028 21712 34188 43920 7528 -2074 14664 -22757 -39734
9272c9734K9393R886k4809k8271J6557R586M6935L8229K9787o741k6293r462k0031
9259B5032K5046K0141l1732l0926J8571p30l5766o15K2647k2297j5476K2094J3933
9246I922L5594Q743l7286J4179j485j8604m5608O748M8734p718j4914o907p2909
9233h1511k8065J9855L9809R7j8183K2375L5666M155K132n725k8427k8169L0274
9220c5717P051O139L3728K0631j8420j4166J360J0048k7420l221J17L390q83R254
9206h109J1722N4m0878j1936J8880J6290J0851j384p641M4642J9899m2568l808
9193F014k764j8323j0853P231j1050p564J1269n717k9651L2766N904K0122M604
9180A988N795k7444J8828J3851M464Q305M1199J0867l5990o2018m2448J2742L5249
$$ plain form
9272 -39734 -10341 -455 -25264 -53535 -36978 -27392 19543 57772 87559 80818 54525 45063 25032
9259 25032 50078 70219 38487 7561 26132 25402 -10364 -10979 11668 -10629 -26105 -4011 9922
9246 9922 45516 54259 16973 31152 29667 11063 -34545 -27797 20937 13219 -1695 -8602 -81511
9233 -81511 -109576 -89721 -49912 -49815 -67998 -45623 -9957 -5802 -3670 -9395 -37822 -65991 -35717
9220 -35717 -28666 -22527 11201 31832 13412 -754 606 10654 -16766 -19987 -19870 -16480 -17363 -8109
9206 -8109 3613 3667 -37211 -49147 -30267 -13977 -3126 -4510 -12151 32491 52390 9822 6014
9193 6014 3250 -15073 -25926 -18695 -29745 -37309 -26040 -31757 -61408 -28642 -22738 -2616 1988
9180 1988 7783 -19661 -833 13018 17482 25787 66986 77853 41863 -20155 -62603 -49861 -14612
9167a4612K3125M1332L2341q980j1673l2656m9219k6627K3243J2834Q049J6850
9155A4007J9642J9435P906m0219j0387P201Q165k5917J5597P443l5228j5760j3268
9142d1383L3920J3982k4996k4137k0587M2820K6895J1656N864r606l2056n942
9130b3570L194Q209J1816l125j3564m9747J1717J6433M085K9116J220m268J4289
9117E805m501L8490k0101K6949p134k3280l104M4461l4522m5051M548l452J3572
9104g320K4904K4829K0265p736m1887j8571l879J942M6108k1643j5752K4086J5676
9091D1022j5574m4673K876J7922P426j7879j7389j5657k0140K365K2098k2847
9079f0450r197K0369r98N819J7863K2064K378k7129L73o531K048M716m302J9864
$$ plain form
9167 -14612 8513 49845 82186 73206 61533 28877 -20342 -46969 -23726 -10892 -2843 14007
9155 14007 33649 53084 60990 20771 10384 17585 25750 -167 15430 22873 -12355 -28115 -41383
9142 -41383 -7463 6519 -18477 -42614 -63201 -20381 6514 18170 24034 14428 -17628 -23570
9130 -23570 -20376 -12167 -351 -3476 -17040 -66787 -55070 -38637 -34552 -5436 -4216 -8484 5805
9117 5805 1304 39794 19693 46642 39508 16228 13124 57585 23063 -21988 -17440 -20892 -7320
9104 -7320 17584 42413 62678 54942 13055 -5516 -9395 -7453 38655 17012 1260 25346 41022
9091 41022 25448 -19225 -16349 1573 8999 -8880 -26269 -41926 -62066 -59701 -37603 -60450
9079 -60450 -69647 -49278 -50276 -44457 -26594 -4530 -2152 -29281 -28908 -35439 -33391 -28675 -32977 -13113
9065a3113J4411K1830K1635l3424k5635K5479O1861N971l7293m8170m90J210L2964
9052B7236l744m040j2551Q353J4244k2766j4376j030J06L2214J4870q859j3177
9039A6480l4736K2910J8816k5381L822j3402k431K857r39K5712j3623r320l1712
9026d0947k798J6715k940j8854K6905L1636J652M106Q140L031K7842m9233j2254
9013f999j2138K3295q7J2549m8600M05K5936M403M1824m3575m5539l0521J7972
9000f1075L5708J6722K735K3905k3951o879j8080r543K1304L3695L6453l0661
8988B0333j9819k2782N831K7936O29k1324j2615L4170N4028j2049Q1j7320n703
8975C1396J3366q556p18N781l866r490k3210m0272k0439K0273J9053k0599k8319
$$ plain form
9065 -13113 1298 23128 44763 11339 -14296 11183 73044 79015 41722 -6448 -6938 -5728 27236
9052 27236 23492 19452 6901 15254 29498 6732 -7644 -8674 -8568 23646 38516 29657 16480
9039 16480 -18256 4654 23470 -1911 1911 -11491 -13922 -11065 -12004 13708 85 -9235 -40947
9026 -40947 -43745 -27030 -29970 -48824 -21919 9717 11369 15475 23615 26646 54488 5255 -6999
9013 -6999 -19137 4158 4071 16620 -31980 -31575 -5639 -1236 40588 -2987 -48526 -79047 -61075
9000 -61075 -25367 -8645 -5910 17995 -5956 -12835 -30915 -40458 -19154 14541 50994 20333
8988 20333 514 -22268 -16437 11499 12128 -9196 -21811 12359 66387 54338 54419 37099 31396
8975 31396 44762 36206 35488 41269 37403 27913 4703 -35569 -56008 -35735 -16682 -37281 -65600
8962f5600k7650j128L1437K0360M4568L1436k4498k6292j2772O931L2826m385
8950E233J7769K2264k2726o695K1243k402J3025j2835k6849M14K0246R840k9849
8937H678k8039j7819j3925j8487L0029N05j5352k022M1012M0200m2072o7902k5469
8924a10663K1780M8603L8235l700j1768p704J9045j1621j0623m875K5975J9570
8912A2254r937J5474J2880L9189j833l4321p952N628m0918l0120K012j2692K9137
8899b1199L6849q772M82m701j5992L2941J6915M560j0185k6704j2295J4250N6248
8886F2397l8372l2896n948J0961L3005L7460j970m3322j7553j7748j0182O815
8874a7353K9585k6115j250N7222j757k7885k1184J5458K4504k347o326K562J4509
$$ plain form
8962 -65600 -93250 -94378 -62941 -42581 1987 33423 8925 -17367 -30139 -23208 9618 5233
8950 5233 23002 45266 22540 15845 37088 34686 47711 34876 8027 8441 28687 38527 8678
8937 8678 -19361 -37180 -51105 -69592 -39563 -39058 -54410 -56432 -15420 24780 -17292 -85194 -110663
8924 -110663 -88883 -40280 -2045 -5745 -17513 -25217 -6172 -17793 -28416 -33291 -7316 12254
8912 12254 2317 17791 30671 69860 68027 33706 25754 31382 -9536 -39656 -37644 -50336 -21199
8899 -21199 15650 6878 7360 2659 -13333 19608 36523 41083 30898 4194 -8101 6149 62397
8886 62397 24025 -8871 -14819 -3858 29147 66607 64637 21315 3762 -13986 -24168 -17353
8874 -17353 12232 -13883 -15133 42089 40332 12447 -8737 6721 31225 28878 22552 25114 39623
8861C9623k6545k5278n8152j9023M248K626J2512M1080L3044K1733k475k1441
8849A952l3267M7387K9395K196l6851P37j9187l5720n475J7879K1547k077l760
8836a5244L6394m10j3868k6255k3626M276M4311N5590m096o5896j7813j1882q882
8823d7401p47j3324K0129J7462J326J1781k029j2020J2979K8453l0039p288J9590
8810a128K1272m9508j6728j8455m709j6303p023O571j4877K907Q022K4822K4657
8797d0480J1753P559J3922M4581k3802l1696l8827J46J6189K2289j1717L5247
8785E164K9028l3315R618p180L35K9675j0867k1832J4721j0453l5181O185m09
8772b4511J1821L367K8795J3615J9614m3241k8352R65L4987r414r238K6457r67
$$ plain form
8861 39623 13078 -12200 -70352 -89375 -85127 -82501 -69989 -28909 4135 25868 23393 1952
8849 1952 -31315 16072 45467 47663 10812 11549 -7638 -43358 -48833 -30954 -9407 -11484 -15244
8836 -15244 21150 20740 6872 -19383 -43009 -38733 5578 61168 57072 -8824 -26637 -38519 -47401
8823 -47401 -48148 -61472 -41343 -23881 -22555 -10774 -12803 -24823 -11844 16609 -13430 -20718 -1128
8810 -1128 20144 -29364 -46092 -64547 -69256 -85559 -92582 -86011 -100888 -97981 -89959 -65137 -40480
8797 -40480 -28727 -21168 -7246 37335 13533 -18163 -56990 -56844 -40655 -18366 -30083 5164
8785 5164 34192 877 10495 3315 3650 33325 22458 626 15347 4894 -30287 -24102 -24511
8772 -24511 -12690 -9323 19472 33087 52701 9460 -18892 -17927 17060 7646 -1592 24865 23898
8759B3898k0092k0193K3853r445J3955Q742k4490J9119K3800m956M1332l3108
8747D2415n9965R663J6542K8268j1695J763M3520O98j6294l4370n368o955J1490
8734A9712k3576K737J9750M0862l6520k3122k2575O619K4579K1580J0706l5614
8722E138r63L1609p674l7258J7360k6484N720j2905L6060K360K939N386M0508
8709F1796J5531l8106l3073k1708l616j2875K9009L4471j0207j4705k6741m1455
8697f1679k335J6966R949k7373K5477P248M2559L5783k2387l1195k498M633P006
8684B154j5024K1586O2743J0693m1406m0261J9196J2854L5339j1306l0501l2210
8672f143N386M1969J142k6702L0935o88j7706j3487K7064K1459O535j5698o511
$$ plain form
8759 23898 3806 -16387 7466 -1979 11976 20718 -3772 15347 39147 34191 75523 42415
8747 42415 -17550 -7887 8655 36923 25228 26991 70511 71209 54915 20545 15177 8222 19712
8734 19712 -3864 -1127 18623 59485 22965 -157 -22732 -16113 8466 30046 40752 5138
8722 5138 4175 35784 28110 -9148 8212 -18272 -12552 -25457 10603 12963 15902 21288 61796
8709 61796 77327 39221 6148 -15560 -19176 -32051 -3042 31429 21222 6517 -20224 -61679
8697 -61679 -64014 -47048 -37099 -64472 -38995 -31747 10812 46595 24208 -6987 -9485 -4852 2154
8684 2154 -12870 8716 71459 82152 40746 485 19681 32535 67874 56568 26067 -6143
8672 -6143 -757 41212 42354 15652 46587 45899 28193 14706 41770 63229 69764 54066 47555
8659D7555m7450k3772M2523K3881j2000j5883j0480j8832K9848L3113n5090o800
8647a3387L0031J7281j38R217J8345N90K2783N2094l0759n998J3377M972k340
8634A16068l9727j2552l610j755j5557j4001j4748K749L1692J8459k3308j5200
8622B8510P314p02K6896p237M243R298j2329K7961N4409k0526m4845j4073J0670
8609F9589L2301l258L608l060K6523J6975j7959L7529k806J003j5578L998k0112
8596A28753m7993P540K9306n683j5307k2716j7295P271O225p017n3734k3985j5995
8583c0630k4064L3661q841n297K5009J6927M5056M2473l9206m7890N6947J2906
8571G7051R252L1037L0367j5246l2839l7786m4514m1586P283K5451j2554K5033
$$ plain form
8659 47555 105 -23667 18856 42737 30737 14854 4374 -14458 15390 48503 -6587 -13387
8647 -13387 16644 33925 33787 43004 61349 61939 84722 136816 106057 100059 113436 118408 116068
8634 116068 76341 63789 60179 58424 42867 28866 14118 16867 48559 67018 43710 28510
8622 28510 35824 35122 62018 54781 59024 68322 55993 83954 138363 117837 72992 58919 69589
8609 69589 101890 98632 102240 99180 125703 142678 124719 162248 159442 160445 144867 148865 128753
8596 128753 80760 88300 117606 111923 96616 73900 56605 63876 70101 63084 9350 -14635 -30630
8583 -30630 -54694 -21033 -29874 -35171 -10162 6765 51821 94294 55088 7198 64145 77051
8571 77051 86303 117340 147707 132461 99622 61836 17322 -24264 -16981 8470 -4084 20949
8559B0949K2958m8894k6032j4233P870K0730J2049J410k9473l132J0564K5714
8547D80K0361l881j039m4656k1379L3830K5710m8221l1131J4510M8866M078j6876
8534a9348K2472L653K8135j1058k5521q058J0448R664Q540k7020l8098P259l8995
8521g7927L2977L8202J0187L5984R059J3076m706p267J0120l0456j3076J2381
8509B8554K428j9715p869M015K0834K9928J7423O912o2147k8734j9393l4716j9723
8496h2203M9623L6073M693J5308L8574L032k2173o181Q116k1841o3307K5400Q7565
8483G2679K1721j7659n2494J6859l023q952J5017J2311k9838l8457j9503K7348
8471c991K3165J5488m452J2638o788J2797m9630n7736M247M2316M6944N814k7185
$$ plain form
8559 20949 43907 -4987 -31019 -45252 -37382 -16652 -4603 -3193 -32666 -35798 -25234 480
8547 480 20841 16960 15921 -28735 -50114 -16284 9426 -38795 -69926 -55416 -6550 -2472 -19348
8534 -19348 3124 6777 34912 23854 -1667 -9725 723 10387 18927 -8093 -46191 -38932 -77927
8521 -77927 -44950 -6748 3439 39423 48482 61558 56852 49585 59705 29249 16173 28554
8509 28554 30982 11267 3398 7413 28247 58175 75598 82510 20363 -8371 -27764 -62480 -82203
8496 -82203 -32580 3493 8186 23494 62068 65100 42927 36746 44862 23021 -40286 -14886 72679
8483 72679 94400 76741 24247 41106 38083 29131 44148 56459 26621 -11836 -31339 -3991
8471 -3991 19174 34662 30210 42848 36060 48857 -773 -58509 -54262 -11946 34998 40812 13627
8458A3627k4489k8806N986j2760K1075J4992k0487j7243j976l7452j2358O3641
8446c6250K9849J4108L6571M8130l2718o0230j2227N1335M397m3814m7211L4112
8434a3948N005l1413L0982J8009j190j0383j907k918m3329q706N2379J4687K419
8421I687q59L0034j4958k0999n610p649N850j474K0497j1957p456J4156m0171
8408c0909l1198J4222L8246J6629l241J4373J303n079K3489M977p035j1547m616
8395A9614L4960L6J400m0630j0364k9274J4162J4182R268j4120m1392J4398O341
8382b1419K3244K5950o973J4000k1141k9960J1457J1035k935J0223k2282J4279
8370E478J4667o4620l1259J7131J8842J6023J4205k0229m6379r392L3029J7452
$$ plain form
8458 13627 -10862 -39668 -33682 -46442 -25367 -10375 -30862 -48105 -50081 -87533 -99891 -36250
8446 -36250 -6401 7707 44278 92408 59690 -540 -12767 38568 42965 -849 -48060 -13948
8434 -13948 -8943 -40356 -9374 8635 7445 -2938 -4845 -7763 -51092 -59798 -7419 7268 9687
8421 9687 8828 38862 23904 2905 -2705 -10354 -4504 -5978 14519 2562 -4894 9262 -30909
8408 -30909 -62107 -47885 -9639 6990 3749 18122 19425 14346 37835 42812 35777 24230 19614
8395 19614 54574 54610 56010 15380 5016 -24258 -10096 4086 13354 -766 -42158 -27760 -21419
8382 -21419 1825 27775 20802 34802 13661 -16299 -4842 6193 3258 13481 -8801 5478
8370 5478 20145 -44475 -75734 -58603 -39761 -23738 -9533 -29762 -76141 -85533 -52504 -35052
8358c5052J5566p206p597K3518K4531l8265j7520o250n326L306K2491k304M3117
8345A3009K4029l2728n876j8712j979K4429j0531j0648J3835m475J6446J8004
8333B4803J2253L0942J591m7547k0035j9853K0284j7616k7339n654K0696J0117
8321a7358N4645K4427k400l3039k9669k6138p754Q225N985M068J8897r225o908
8308a6244L437k9660J6087L1727k2040L423Q266p290k69J9834M6448q838l9535
8295E346P089L8508k26q4q804m4723k597k1733J1385J7902J6121k0773k6528j4783
8281d3900k0025K3108j152q833K7403K1763J2207J3209N026k6680J4419K3392
8269C9937l3208m2644l707j62K861O791J0731K1810m3293n5169J8117R474K3265
$$ plain form
8358 -35052 -19486 -26692 -34289 -10771 13760 -24505 -42025 -48275 -53601 -50295 -27804 -30108 13009
8345 13009 37038 4310 -1566 -20278 -22257 2172 -8359 -19007 -5172 -9647 6799 24803
8333 24803 37056 67998 69589 22042 2007 -17846 2438 -15178 -42517 -48171 -27475 -17358
8321 -17358 37287 61714 59314 26275 -3394 -29532 -37286 -29061 -23076 -19008 -111 -9336 -16244
8308 -16244 -12807 -42467 -26380 5347 -16693 -13270 -5004 -12294 -12563 7271 53719 44881 5346
8295 5346 12435 50943 50717 50633 41829 -2894 -5491 -27224 -15839 2063 18184 -2589 -29117 -43900
8281 -43900 -63925 -40817 -41969 -50802 -23399 -1636 10571 23780 28806 2126 16545 39937
8269 39937 6729 -35915 -39622 -39784 -36923 -30132 -19401 2409 -40884 -96053 -77936 -68462 -45197
8256d5197p718k4754L2402K3468N039k2582j0057L0017M4219j3101P24m232J0842
8243A9070K2211J3734k7791k5263l248K4070j9468j8370j3186J6376J7693K3715
8231B9543j7283m9121J1532M4409m674j791j4986L2239j0495J7788J4647j5931
8219C5877k1422k8098m1866J0445N7961M4353N380K0587k2981j8798k7276r932
8207D230k0087l8230K9205L085K0172Q143J571l0670O066M7007J4313q095j6331
8194B0379j214p556J343k045n8496J0326N4698M4006l7698j2853l6682j3846M0331
8181F93N011j9748l1771j6004j8177N1638L6751K1315k815k1599n323r036K1885
8168A2820K8511k2821o219P451n391r842k5356p553L9501j5983l5572O786K5291
$$ plain form
8256 -45197 -52915 -77669 -45267 -21799 -16760 -39342 -49399 -19382 24837 11736 12460 8228 19070
8243 19070 41281 55015 27224 1961 -1287 22783 3315 -15055 -28241 -11865 5828 29543
8231 29543 12260 -36861 -25329 19080 14406 12615 -2371 29868 19373 37161 51808 35877
8219 35877 14455 -13643 -55509 -45064 12897 57250 62630 83217 60236 41438 14162 4230
8207 4230 -15857 -54087 -24882 -21797 -1625 6518 8089 -22581 -16515 30492 44805 36710 20379
8194 20379 19165 11609 12952 10907 -47589 -37263 17435 61441 23743 10890 -25792 -39638 693
8181 693 5704 -14044 -45815 -61819 -79996 -28358 8393 29708 26893 5294 -29 -9065 12820
8168 12820 41331 18510 12291 19742 14351 4509 -20847 -28400 11101 -4882 -40454 -33668 -8377
8155h377n077N998j9743m675K8477K0553l242j9778J2785J5284J7024n8805n0844
8142g0420J6811K7113N8178n410R677q06K3750j4174k7575r785P156K9552O705
8129E0772j8488k8707k6728j8781j7903K5585L3670J9161j4046r137p346m424
8117a6372J0430j0095J1434K6011k1421j8331L6216j1790l965j9983m0413J5435
$$ plain form
8155 -8377 -13454 -7456 -27199 -31874 -3397 17156 13914 -5864 6921 22205 39229 -19576 -70420
8142 -70420 -53609 -26496 31682 26272 35949 35143 58893 44719 17144 7359 14515 44067 50772
8129 50772 32284 3577 -23151 -41932 -59835 -34250 -580 18581 4535 -4602 -11948 -16372
8117 -16372 -5942 -16037 -4603 21408 -13 -18344 17872 6082 2117 -17866 -58279 -42844
$$ [...]
##END NTUPLES=NMR SPECTRUM
##END=
