##TITLE=Analysis number 313014
Compound Code cc 42013
Book Reference 437/32
Project Code adrs
Chemist Name wendyb
##JCAMPDX= 6.0         $$ Bruker NMR JCAMP-DX V2.0
##DATA TYPE= NMR SPECTRUM
##DATA CLASS= NTUPLES
##ORIGIN= Bruker BioSpin GmbH
##OWNER= NMR
$$ XWIN-NMR		Version 3.5
$$ Tue Aug 23 11:51:34 2005 GMT Daylight Time (UT+1h)  MAYBRIDGE\NMR@NMR_250MHZ
##.OBSERVE FREQUENCY= 250.131544655141
##.OBSERVE NUCLEUS= ^1H
##.ACQUISITION MODE= SIMULTANEOUS (DQD)
##.ACQUISITION SCHEME= undefined
##.AVERAGES= 16
##.DIGITISER RES= 18
##SPECTROMETER/DATA SYSTEM= dpx250
##.PULSE SEQUENCE= zg30
##.SOLVENT NAME= CDCl3
##.SHIFT REFERENCE= (INTERNAL, CDCl3, 0, 16.522)
##AUDIT TRAIL= $$ (NUMBER, WHEN, WHO, WHERE, WHAT)
$$ ##TITLE= Audit trail, XWIN-NMR		Version 3.5
$$ ##JCAMPDX= 5.01
$$ ##ORIGIN= Bruker BioSpin GmbH
$$ ##OWNER= NMR
$$ C:\u/data/dgb/nmr/ADRS/8390/pdata/1/auditp.txt
$$ ##AUDIT TRAIL=  $$ (NUMBER, WHEN, WHO, WHERE, WHAT)
(   1,<2005-08-23 11:51:01.69 +100>,<MAYBRIDGE\NMR>,<NMR_250MHZ>,
      <created by zg, POWCHK disabled, PULCHK disabled
       configuration hash MD5:
       62 19 C7 07 E1 42 D1 B7 37 6C 3D D0 77 39 F9 E6
       data hash MD5: 64K
       20 97 AB F0 49 53 8D 7C DA AF 92 FE A0 58 8B EB>)
(   2,<2005-08-23 11:51:16.71 +100>,<MAYBRIDGE\NMR>,<NMR_250MHZ>,
      <Start of raw data processing
       ef LB = 0.3 FT_mod = 6 PKNL = 1 SI = 32K 
       data hash MD5: 32K
       3C 7D 2C 8D 26 5D E5 A3 8A 25 E8 26 0E D4 CB BD>)
(   3,<2005-08-23 11:51:20.35 +100>,<MAYBRIDGE\NMR>,<NMR_250MHZ>,
      <apk 
       data hash MD5: 32K
       BD 9C 67 F7 F3 4A BB 42 16 A6 27 4A 10 DC C1 7F>)
(   4,<2005-08-23 11:51:21.53 +100>,<MAYBRIDGE\NMR>,<NMR_250MHZ>,
      <abs ABSG = 5 
       data hash MD5: 32K
       E8 A3 A3 15 28 0B F9 EA 73 6B 25 C4 56 93 0A 99>)
$$ ##END=
$$ 
$$ hash MD5
$$ 29 84 D2 7D 8D 75 09 86 00 F7 85 BF A0 8B DD B5
##$RELAX= 
##$RELAX= 
##$RELAX= 
##$RELAX= 
##$RELAX= 
##$RELAX= 
##$RELAX= 
$$ Bruker specific parameters
$$ --------------------------
##$DU= <C:\u>
##$EXPNO= 8390
##$NAME= <ADRS>
##$PROCNO= 1
##$TYPE= <nmr>
##$USER= <dgb>
##$AMP= (0..31)
100 100 100 100 100 100 100 100 100 100 100 100 100 100 100 100 100 100 
100 100 100 100 100 100 100 100 100 100 100 100 100 100 
##$AQSEQ= 0
##$AQ_mod= 3
##$AUNM= <au_zg>
##$AUTOPOS= <18 >
##$BF1= 250.13
##$BF2= 250.13
##$BF3= 250.13
##$BF4= 250.13
##$BF5= 500.13
##$BF6= 500.13
##$BF7= 500.13
##$BF8= 500.13
##$BYTORDA= 1
##$CFDGTYP= 0
##$CFRGTYP= 5
##$CHEMSTR= <none>
##$CNST= (0..31)
1 1 145 1 1 1 1 1 1 1 1 1 1 1 1 1 1 1 1 1 1 1 1 1 1 1 1 1 1 1 1 1 
##$CPDPRG= <>
##$CPDPRG1= <>
##$CPDPRG2= <>
##$CPDPRG3= <>
##$CPDPRG4= <mlev>
##$CPDPRG5= <mlev>
##$CPDPRG6= <mlev>
##$CPDPRG7= <mlev>
##$CPDPRG8= <mlev>
##$CPDPRGB= <>
##$CPDPRGT= <>
##$D= (0..31)
0 1 0 0 0 0 0 0 0 0.06 0 0 0 0 0 0 0.0002 0 0 0 0 0 0 0 0 0 0 0 0 0 0 
0 
##$DATE= 1124794260
##$DBL= (0..7)
120 120 120 120 120 120 120 120 
##$DBP= (0..7)
150 150 150 150 150 150 150 150 
##$DBP07= 0
##$DBPNAM0= <>
##$DBPNAM1= <>
$$ [...]
##$SUBNAM7= <"">
##$SUBNAM8= <"">
##$SUBNAM9= <"">
##$SW= 20.6930455092707
##$SWIBOX= (0..15)
0 0 3 0 0 0 0 0 0 0 0 0 0 0 0 0 
##$SW_h= 5175.983436853
##$TD= 65536
##$TD0= 1
##$TE= 295.16
##$TE2= 300
##$TE3= 300
##$TEG= 300
##$TL= (0..7)
0 120 120 120 120 120 120 120 
##$TP= (0..7)
150 150 150 150 150 150 150 150 
##$TP07= 0
##$TPNAME0= <>
##$TPNAME1= <>
##$TPNAME2= <>
##$TPNAME3= <>
##$TPNAME4= <>
##$TPNAME5= <>
##$TPNAME6= <>
##$TPNAME7= <>
##$TPOAL= (0..7)
0.5 0.5 0.5 0.5 0.5 0.5 0.5 0.5 
##$TPOFFS= (0..7)
0 0 0 0 0 0 0 0 
##$TUNHIN= 0
##$TUNHOUT= 0
##$TUNXOUT= 0
##$USERA1= <user>
##$USERA2= <user>
##$USERA3= <user>
##$USERA4= <user>
##$USERA5= <user>
##$V9= 5
##$VALIST= <valist>
##$VCLIST= <CCCCCCCCCCCCCCC>
##$VD= 0
##$VDLIST= <DDDDDDDDDDDDDDD>
##$VPLIST= <PPPPPPPPPPPPPPP>
##$VTLIST= <TTTTTTTTTTTTTTT>
##$WBST= 1024
##$WBSW= 4
##$XGAIN= (0..3)
0 0 0 0 
##$XL= 0
##$YL= 0
##$YMAX_a= 276913
##$YMIN_a= -517357
##$ZGOPTNS= <>
##$ZL1= 120
##$ZL2= 120
##$ZL3= 120
##$ZL4= 120
##$ABSF1= 16.522
##$ABSF2= -4.171173
##$ABSG= 5
##$ABSL= 3
##$ALPHA= 0
##$AQORDER= 0
##$ASSFAC= 0
##$ASSFACI= 0
##$ASSFACX= 0
##$ASSWID= 0
##$AUNMP= <proc_1d>
##$AZFE= 0.1
##$AZFW= 0.1
##$BCFW= 0
##$BC_mod= 0
##$BYTORDP= 0
##$COROFFS= 0
##$CY= 12.5
##$DATMOD= 1
##$DC= 0
##$DFILT= <>
##$DTYPP= 0
##$F1P= 14.0000005364418
##$F2P= -0.99999901652339
##$FCOR= 0.5
##$FTSIZE= 32768
##$FT_mod= 6
##$GAMMA= 0
##$GB= 0
##$INTBC= 1
##$INTSCL= 1
##$ISEN= 128
##$LB= 0.3
##$LEV0= 0
##$LPBIN= 0
##$MAXI= 10000
##$MC2= 0
##$MEAN= 0
##$ME_mod= 0
##$MI= 0
##$NCOEF= 0
##$NC_proc= -5
##$NLEV= 6
##$NOISF1= 0
##$NOISF2= 0
##$NSP= 0
##$NTH_PI= 0
##$NZP= 0
##$OFFSET= 16.522
##$PC= 1
##$PHC0= -79.32191
##$PHC1= 6.67061
##$PH_mod= 1
##$PKNL= yes
##$PPARMOD= 0
##$PSCAL= 4
##$PSIGN= 0
##$REVERSE= no
##$SF= 250.13
##$SI= 32768
##$SIGF1= 0
##$SIGF2= 0
##$SINO= 400
##$SIOLD= 32768
##$SREGLST= <1H.CDCl3>
##$SSB= 0
##$STSI= 32768
##$STSR= 0
##$SW_p= 5175.98343685301
##$SYMM= 0
##$S_DEV= 0
##$TDeff= 65536
##$TDoff= 0
##$TI= <Analysis number 999999
Compound Code 99
Book Reference 9
Project Code 9>
##$TILT= no
##$TM1= 0
##$TM2= 0
##$TOPLEV= 0
##$USERP1= <user>
##$USERP2= <user>
##$USERP3= <user>
##$USERP4= <user>
##$USERP5= <user>
##$WDW= 1
##$XDIM= 32768
##$YMAX_p= 326316367
##$YMIN_p= -231761
$$ End of Bruker specific parameters
$$ ---------------------------------
##NTUPLES= NMR SPECTRUM
##VAR_NAME=  FREQUENCY,     SPECTRUM/REAL,   SPECTRUM/IMAG
##SYMBOL=    X,             R,               I
##VAR_TYPE=  INDEPENDENT,   DEPENDENT,       DEPENDENT
##VAR_FORM=  AFFN,          ASDF,            ASDF
##VAR_DIM=   32768,         32768,           32768
##UNITS=     HZ,            ARBITRARY UNITS, ARBITRARY UNITS
##FACTOR=    0.157963299565203, 1,           1
##FIRST=     4132.6476996994, 0,             0
##LAST=      -1043.33573715361, 0,           0
##MIN=       -1043.33573715361, -231761,     0
##MAX=       4132.6476996994, 326316367,     0
$$ Real data points
##PAGE= N=1
##DATA TABLE= (X++(R..R)), XYDATA
$$ [...]
18084A8147166j37149k86092k27062Q8333M06444O47729J045482J643351K393610
18075B3721812L163409M292314N773904P596944R523144J1206292J2106395J1011855
18067H8396069O834490k30509q357879j4060989j5215943j2598981q645105n197727
18059C0923426k904832j569976r28593p72321j034509j534238k044478k131418
18051A8003061j901884j391916r90727o46967l29692q2528N7628K29404L76558
18042A3322937M27658L47342K97750K10524J01199J010j09313j38353m9214J38370
18032A4549910L42023P25306J104633J432804J738015J938395J805967J263495
18024B4900548N47115N9705L91679J473788K880709M421661N673158O217147N639673
$$ y = [18147166, 18010017, 17723925, 17496863, 17585196, 17991640, 18639369, 19684851, 21328202, 23721812, 26885221, 31177535, 36951439, 44548383, 54071527, 65277819, 77384214, 88396069, 95230559, 95000050, 86642171, 72581182, 57365239, 44766258, 36121153, 30923426, 28018594, 26448618, 25520025, 24747704, 23713195, 22178957, 20134479, 18003061, 16101177, 14709261, 13718534, 13071567, 12741875, 12659347, 12716975, 12946379, 13322937, 13750595, 14097937, 14395687, 14606211, 14707410, 14708420, 14599107, 14460754, 14411540, 14549910, 14891933, 15617239, 16721872, 18154676, 19892691, 21831086, 23637053, 24900548, 25447663, 25507368, 25899047, 27372835, 30253544, 34675205, 40348363, 46565510, 52205183]
18015E2205183L259733q58012n577582q803400r160474p433243n134254l403568
18007A5094383k238914j553227j090283p70206n93590n32021m12368l00317k67875
17998G335582k38494k37793j10392q2134n226P3831P8512J2482N9382R5479n394
17987F975835j53470k91558l65410m38584n13973m84159m57073l97468l47035
17978C527105k80828j97841j80374j66073j77790q7702n5894r9837p9929n1295
17968B149542n4702m7063n2908p3548l8424o5242J1912J6287n0390r2708j37657
17957A565099q0723q7220r5630M00j6064n0236q7549o2403M969m9955K000L9095
17945A081783k5791o9857n2474l692l6605n8853m4387j9364K6828k7464o9970
$$ y = [52205183, 55464916, 54606904, 49029322, 40225922, 31065448, 23632205, 18497951, 15094383, 12855469, 11302242, 10211959, 9441753, 8848163, 8316142, 7903774, 7603457, 7335582, 7097088, 6859295, 6748903, 6666769, 6661543, 6735374, 6813886, 6826368, 6885750, 6981229, 6975835, 6822365, 6530807, 6165397, 5726813, 5212840, 4728681, 4271608, 3874140, 3527105, 3246277, 3048436, 2868062, 2701989, 2524199, 2436497, 2380603, 2280766, 2200837, 2149542, 2094840, 2047777, 1994869, 1921321, 1882897, 1817655, 1829567, 1845854, 1795464, 1702756, 1565099, 1484376, 1397156, 1301526, 1301926, 1285862, 1235626, 1148077, 1085674, 1090643, 1040688, 1042688, 1081783, 1055992, 986135, 933661, 929969, 893364, 834511, 790124, 770760, 797588, 770124, 700154]
17934G00154k5759l594j3672j297J0595M6694J7490k9793n1019m8693j3277M5440
17922F33269K3952j9735J5937j6735J7968k2970q1924j567M5933P013M9595j9093
17910F31643l1431j5943o6373l1055j7723M4647m0634L6778O7716L914m3387j4269
17898E23883J9946M2835J031l101N190L9271J8694l5041j6445P4532j9808l0512
17886F20475L1525K7323k324m081O429j1066k5017K3701R871L2918q978J5407
17874G16183l7023m507K491L6692J1827n749m2906m1696o1104o0136m347n0239
17862D59486K220R3785R582l1343n095K7127l137l3575o0845L6434n990j2787
17850D75862M6741J1567L1210o5529q8069L384K2225l570r904N5635K3636L2565
$$ y = [700154, 674395, 670801, 657129, 655832, 666427, 713121, 730611, 700818, 649799, 601106, 587829, 633269, 657221, 637486, 653423, 636688, 654656, 631686, 549762, 548195, 594128, 601141, 650736, 631643, 600212, 584269, 517896, 486841, 469118, 513765, 473131, 509909, 577625, 581539, 538152, 523883, 543829, 586664, 587695, 584594, 589784, 629055, 647749, 612708, 596263, 670795, 650987, 620475, 652000, 679323, 676999, 672918, 679347, 668281, 643264, 666965, 676836, 709754, 700776, 716183, 679160, 674653, 677144, 713836, 725663, 719914, 677008, 635312, 574208, 514072, 509725, 459486, 461706, 555491, 565073, 533730, 528635, 555762, 552625, 519050, 458205, 494639, 488649, 475862, 522603, 534170, 565380, 499851, 411782, 415166, 437391, 433821, 423917, 479552, 503188, 535753]
17838E35753Q2306N6284r623k1257k4960j7163L9070m656j2894l652l0743j4436
17826E74029K8507L2951P047j2052L8445J8656n372m8406q4394k1323J2940K1824
17814E62852K1107O639O5292Q408o3404k9801O8173k9753n5692j01105m5297j5080
17802C92339K0483r196N006J6429L8601m4705k0489L4281L4012k9030l967l4498
17790C99266k734L2428K3280j0795L1831N0227j1177k2994l0854m5395L3747K3865
17778D70695M1356J1356J251k4993m7290k0948J4880j9033l5942l0639k0416N4275
17766C94552L9861K8728m117J3383j5796p396K8326j7938P116L6754L3232M289
17754E40994j2547k8414J324n081K4381k1701k1152m033j2325J2714n854j0411
$$ y = [535753, 618059, 674343, 664720, 643463, 618503, 601340, 640410, 635754, 622860, 619208, 588465, 574029, 602536, 635487, 642534, 630482, 668927, 687583, 682211, 633805, 549411, 528088, 541028, 562852, 583959, 590598, 655890, 664298, 600894, 571093, 639266, 609513, 553821, 452716, 407419, 392339, 412822, 403626, 408632, 425061, 463662, 418957, 398468, 432749, 466761, 437731, 433764, 399266, 396532, 428960, 452240, 441445, 473276, 523503, 512326, 489332, 458478, 413083, 446830, 470695, 512051, 523407, 524658, 499665, 452375, 431427, 446307, 427274, 391332, 360693, 340277, 394552, 434413, 463141, 459024, 472407, 456611, 449215, 477541, 459603, 466719, 503473, 536705, 540994, 528447, 500033, 501357, 496276, 520657, 498956, 477804, 473771, 461446, 474160, 468306, 457895]
17742D57895l594k2123K028j8253n6556r853K3751M6992J4647M6856j2750J0670
17730D79710r373n5546L1572l6834L4272j6432l0719n8544l9772K3075M6617L0115
17718C98141M8237K1755L8185O4366N9813P3072L914q671M3101J9232n5665m7844
17706F57636j580k5041l8202j6404P861J7496n08P9487J36579Q5640L6617K6910
17694I66491k0328j25704j02447L0798K7979Q392O7959N4401M5999J13097L9297
17683A105934m4719n4337L1437M9494j9489m8672l6047l5263L4986K4750N8637
17672A066711M4012N0357N7664R5320j7126J610M0340j8451l7298o2692m4379
17661A176068K665K4393j9908j6028N7588Q6682Q3730L9434N1860M0288O825k9795
$$ y = [457895, 454301, 432178, 434206, 415953, 359397, 349544, 373295, 420287, 434934, 481790, 469040, 479710, 470337, 414791, 446363, 409529, 443801, 427369, 396650, 338106, 298334, 321409, 368026, 398141, 446378, 468133, 506318, 570684, 630497, 703569, 707483, 698812, 741913, 761145, 705480, 657636, 656056, 631015, 592813, 576409, 584270, 601766, 601258, 680745, 817324, 902964, 939581, 966491, 946163, 820459, 718012, 748810, 776789, 785181, 853140, 907541, 953540, 1066637, 1105934, 1061215, 1006878, 1038315, 1087809, 1068320, 1019648, 983601, 948338, 983324, 1008074, 1066711, 1110723, 1161080, 1218744, 1314064, 1296938, 1298548, 1338888, 1320437, 1283139, 1220447, 1176068, 1178733, 1203126, 1183218, 1167190, 1224778, 1311460, 1395190, 1434624, 1486484, 1526772, 1533597, 1503802]
17649A503802O3198N8414M8426R5885Q2825O108J8589N254l9161l2467K1022k7618
17637A804277J5604J31926O5940l9525K5254L2111J4332l808n46J27471J3991
17626B187027n6825o7874o4496j13642p8022j012J0149m4033q5069l6285p9791
17615A570127j4598N7039L9936l5756K5553N6238N8955M9668J2644j677Q3951
17604A902080M6908Q2495K4312j9748M2007R8921L4392M8740M4223L3133L4594
17593B372057O3624L1910P3856J16175R8605P0146P8335N6465J435Q2082P9962
17582C124652P7195Q1209J62331J44973J10316J84900J62690R6706J19980J70001
17572D434953K52639K83327K37654J80215J74164J46195J96154K79215L81688
$$ y = [1503802, 1567000, 1625414, 1673840, 1769725, 1852550, 1858658, 1877247, 1882501, 1843340, 1810873, 1831895, 1804277, 1819881, 1951807, 2017747, 1978222, 2003476, 2035587, 2049919, 2046111, 2045565, 2173036, 2187027, 2130202, 2062328, 1997832, 1884190, 1806168, 1805156, 1815305, 1771272, 1686203, 1649918, 1570127, 1555529, 1612568, 1652504, 1616748, 1642301, 1698539, 1757494, 1807162, 1819806, 1818129, 1902080, 1948988, 2031483, 2055795, 2036047, 2078054, 2176975, 2211367, 2260107, 2304330, 2337463, 2372057, 2435681, 2467591, 2541447, 2657622, 2756227, 2826373, 2904708, 2961173, 2962608, 3044690, 3124652, 3201847, 3283056, 3445387, 3590360, 3700676, 3885576, 4048266, 4144972, 4264952, 4434953, 4687592, 4970919, 5208573, 5388788, 5562952, 5709147, 5905301, 6184516, 6566204]
17563F566204L93824N22650O75331Q23316R64430J162060J508756J809918K167903
17554A6594392K536224K988231L265985L314455L320279L665444L879338L704688
17546D3269036L348018L375301L647873L866281L805415K995255J777945J463236
17538F7548360J718572R19043q16656j746601j731805j774209k164118k853563
17530E9099023l918390m264898l153593j981482j436782q43256N34153J934642
17522D5969417L022184L688357L738648L473168L209922K958698K139589R99152
17514F9199135P08952J574318K770924L417132L756541M237595M969527N760321
17506I6394445N761308M482537L092234K862081L222021K870684K053091J839241
$$ y = [6566204, 6960028, 7482678, 8158009, 8981325, 9945755, 11107815, 12616571, 14426489, 16594392, 19130616, 22118847, 25384832, 28699287, 32019566, 35685010, 39564348, 43269036, 46617054, 49992355, 53640228, 57506509, 61311924, 64307179, 66085124, 67548360, 69266932, 70185975, 69369319, 67622718, 65890913, 64116704, 61952586, 59099023, 55180633, 50915735, 47762142, 45780660, 44343878, 43500622, 44034775, 45969417, 48991601, 52679958, 56418606, 59891774, 63101696, 66060394, 68199983, 69199135, 69908087, 71482405, 74253329, 77670461, 81427002, 85664597, 90634124, 96394445, 102155753, 106638290, 109730524, 112592605, 115814626, 118685310, 120738401, 122577642]
17498A22577642K290966K975487L190253L368155K950361J448132k47898j893693
17490A36659405n064126r784951j2967808j2976882j2213263j1988903j1322321
17483F0341151r499809p217409n203662l712244k766596k207825j936262j617553
17475B6179791j372904j243521j098042r78286r15477q68146p45360o40148o48234
17466A7669673n69752n90352p00977o91513p28394p31241p26764p25250o62000
17457A1543430n92048n07218n16803n44177n00751m28925m20972l64430l34714
17448G333392k61952l08280k49850j74627k16409k09756j44068j08268j35946
17439E524236j98873k57207k84290k29813j85648j75565j17140j04008p6475j0276
$$ y = [122577642, 124868608, 127844095, 131034348, 134402503, 137352864, 138800996, 138553098, 136659405, 131595279, 121810328, 108842520, 95865638, 83652375, 71663472, 60341151, 50841342, 43623933, 38420271, 34708027, 31941431, 29733606, 27797344, 26179791, 24806887, 23563366, 22465324, 21487038, 20571561, 19703415, 18958055, 18317907, 17669673, 17099921, 16509569, 15808592, 15117079, 14388685, 13657444, 12930680, 12205430, 11543430, 10951382, 10444164, 9927361, 9383184, 8882433, 8453508, 8032536, 7668106, 7333392, 7071440, 6763160, 6513310, 6338683, 6122274, 5912518, 5768450, 5660182, 5524236, 5325363, 5068156, 4783866, 4554053, 4368405, 4192840, 4075700, 3971692, 3895217, 3884941]
17429C884941l4678n0371l2091o3609l0238L962j1815K9364K0516O685L2678L5222
17417C790566K4991M7386Q390J6893j4855N5635J29608R4421Q1644J16898J12805
17406D464382J38325K07839K11863K42899K35316L05494L90993M60853O03967
17397G261931P66999Q20932J019363J249340J561036K063918K661987L262400
17389B0667906L926924M522744M900714M787574M216588L187292J936538P45892
17381D8892172M6905k75192n96140j156814j680075k307177k645642k178585j326725
17372C6772727j96480R60853J741512J991542J711026J065870K10367n49349r88927
17363D2719141j248787j692829k200288k857727l505353l736740l535682l050221
$$ y = [3884941, 3850263, 3799892, 3767801, 3704192, 3673954, 3677916, 3666101, 3695465, 3715981, 3722666, 3755344, 3790566, 3815557, 3862943, 3871333, 3888226, 3873371, 3929006, 4058614, 4153035, 4234679, 4351577, 4464382, 4602707, 4810546, 5022409, 5265308, 5500624, 5806118, 6197111, 6657964, 7261931, 8028930, 8849862, 9869225, 11118565, 12679601, 14743519, 17405506, 20667906, 24594830, 29117574, 34018288, 38805862, 43022450, 46209742, 48146280, 48892172, 48939077, 48663885, 48067745, 46910931, 45230856, 42923679, 40278037, 38099452, 36772727, 36576247, 37537100, 39278612, 41270154, 42981180, 44047050, 44257417, 43708068, 42719141, 41470354, 39777525, 37577237, 34719510, 31214157, 27477417, 23941735, 20891514]
17355B0891514k348747j686377j074370o43764m52607l40832k21763r9248N962
17346A4029768J48917K56086M62872P45872R66285J233603J576175K125183K641671
17337B4186432L113824L475490L499859L096100K378129J399434K35244p03375
17329D0681137r31821n96338j04566L20014N97513M87723J12930k64551m08596
17320C9893445l12770l39916n16334o80138j048008j343537j175701p35622l97294
17311C3344125l62959n53136j133557k048626k937175l248277l151941k844301
17303A7064153k322559j769092j241680q78894p00686n29830m60095l55273l64180
17294H441864m14785l20929k63392k94580l33819l23778k47378l01456k82570
$$ y = [20891514, 18542767, 16856390, 15782020, 15138256, 14685649, 14344817, 14123054, 14023806, 14029768, 14178685, 14434771, 14897643, 15643515, 16609800, 17843403, 19419578, 21544761, 24186432, 27300256, 30775746, 34275605, 37371705, 39749834, 41149268, 41384512, 40681137, 39749316, 39152978, 39048412, 39368426, 39965939, 40453662, 40566592, 40302041, 39893445, 39580675, 39240759, 38724425, 38044287, 36996279, 35652742, 34477041, 33741419, 33344125, 32981166, 32428030, 31294473, 29245847, 26308672, 23060395, 19908454, 17064153, 14741594, 12972502, 11730822, 10851928, 10151242, 9621412, 9161317, 8806044, 8441864, 8027079, 7706150, 7442758, 7148178, 6814359, 6490581, 6243203, 5941747, 5659177]
17285E659177l25327l61778l35269k58667k47466k66790k28331k34473j89902
17276C211174j68513j51269j40003k04788j45738j56673j20795q2290j05256q5978
17266A849871q9423j04492j11049p5723m4231n0442m1772r9604o1279n0875n3930
17255A067051o0194n2982q6031l5545k3061n4590k7681L0094J0102o5595m1801
17244F59767n2440m1081j0236k9842l1025j2568L0731k7890k9784n7068j1561
17233C87003O4203l677k9993k316m9429r75N6925n8267k4854p1254m4222N0146
17221B73290O5933q646m3986m2276m3946Q788J6692Q201n943j3750O0752k4509
17209B50600K2806M7062r093m672L4361K0190m7444j1632P4864K5814j4734l2222
$$ y = [5659177, 5333850, 4972072, 4636803, 4378136, 4130670, 3863880, 3635549, 3401076, 3211174, 3042661, 2891392, 2751389, 2546601, 2400863, 2244190, 2123395, 2041105, 1935849, 1849871, 1760448, 1655956, 1544907, 1469184, 1424953, 1374511, 1332739, 1233135, 1171856, 1120981, 1067051, 1006857, 953875, 867844, 832299, 809238, 754648, 726967, 757061, 767163, 701568, 659767, 607327, 566246, 556010, 526168, 495143, 482575, 513306, 485416, 455632, 398564, 387003, 451206, 447529, 417536, 415220, 365791, 364816, 421741, 363474, 338620, 267366, 223144, 273290, 339223, 330577, 286591, 244315, 200369, 209157, 225849, 234050, 228107, 214357, 275109, 250600, 273406, 320468, 311375, 306703, 341064, 361254, 313810, 302178, 377042, 402856, 388122, 355900]
17197C55900l0046j4792J6538N4156o830k7463m2366J8639L561m3086j4949o3125
17185B06137p19l6325J1808K8281O376K7201P599p5044n3344K0567K9791k1437
17173A50891J1607J430j5994K116k2031N41J5364R894o691L614K4761k2557k6385
17160A26560n475J6471J2879l6541M0036O6992K3306n2396q0474Q930P188o827
17148A20649M3350L7301J1728r407n3148J5215R074J4121R716m9023k4955k883
17136A21738J7516M0408o1210J3490M3223j2842K8855J5436k8099j4109J7064
17125A81470l7756j9122J0719p4276p6986L9531j4180k3891M4371L6278O910m5602
17113B7466o4715L590N0927M7548l1136j5871j6094J366j3024P9145L0926k5778
$$ y = [355900, 325854, 311062, 327600, 381756, 374926, 347463, 305097, 323736, 327297, 284211, 269262, 206137, 205418, 169093, 180901, 209182, 215558, 242759, 250358, 175314, 121970, 142537, 172328, 150891, 162498, 163928, 147934, 150050, 128019, 128560, 143924, 153818, 147127, 150741, 175502, 152945, 126560, 121085, 137556, 150435, 113894, 153930, 220922, 244228, 191832, 111358, 120288, 127476, 120649, 163999, 201300, 213028, 203621, 150473, 165688, 174762, 188883, 198599, 149576, 124621, 121738, 139254, 179662, 118452, 131942, 175165, 162323, 191178, 206614, 178515, 164406, 181470, 143714, 124592, 135311, 61035, -15951, 23580, 9400, -14491, 29880, 66158, 73068, 27466, -37249, -33659, 17268, 64816, 33680, 17809, 1715, 3081, -9943, 69202, 100128, 74350]
17101G4350m3405M796N3012j4550p1995N530P7363L6499m4221j1301j8128L0725
17089G8675k33l6698l7K7398Q116M773j3796l2448j2630Q813Q081j2938o265J0513
17075C1324J1056J6271k1295J6313j6612m077K6057L6249l3797m2627J2949M0867
17063G2678j7625J494j7763K806P1596J8161j6206k8121j5987O487j4117J5989
17051G9392P141K9807O4441L6986p1419m7335L420R6946P7032j8192l7605m7975
17039A72639O4400N1507j1548R897P0050K3998k3415n3709J2577K1854l0064j7825
17027B90361J9088M786K6771J0839J2020J0543L7037J740k0169R536p598r295
17015C85659J4338M5449J2689J9925J686n0004P618M5532L523K1900m1576m6806
$$ y = [74350, 30945, 35741, 88753, 74203, 2208, 7738, 85101, 121600, 77379, 66078, 47950, 78675, 78442, 41744, 41707, 69105, 77221, 81994, 68198, 35750, 23120, 31933, 40014, 27076, 20811, 31324, 42380, 58651, 37356, 53669, 37057, 32980, 59037, 95286, 61489, 18862, 31811, 72678, 55053, 56547, 38784, 41590, 113186, 131347, 115141, 87020, 71033, 77520, 63403, 79392, 86533, 116340, 180781, 217767, 146348, 99013, 102433, 199379, 276411, 258219, 220614, 172639, 237039, 288546, 276998, 286895, 356945, 380943, 357528, 303819, 316396, 338250, 308186, 290361, 309449, 314235, 341006, 351845, 363865, 374408, 411445, 413185, 393016, 402552, 394954, 385659, 399997, 445446, 458135, 478060, 479746, 429742, 437360, 482892, 486415, 508315, 466739, 419933]
17003D19933J7179K7818L6431J3868j5974J3760J5977N937k7112k8589k2022J6828
16991D74034J2049J3294j428R185o1812j30608l3876m0812m7860l8332J7701j3
16979A71522n8174l7525K8326O890k1788p62J1607L9188J0111l7936m3438l3304
16967C4717L5402l251K363L4504k8750p2410o7314l376J2243L9964J807K6839
16955A2738l8686j5674j1041M5136O7068K2999m1563K2813K3500n4756p7905J7137
16943b8234J5170l0534J3846j9062Q344M4007J50n8399k69J4772N5785j8225m3016
16930d5665P752l1838m07j2416l30J3562P3492P2366j694m2449j6636l3337k1239
16917c8839M7338J9767n323k0756j2050l812K9656j4112o1219M2688N864j7060
$$ y = [419933, 437112, 464930, 501361, 515229, 499255, 513015, 528992, 534929, 507817, 479228, 457206, 474034, 486083, 499377, 497949, 507134, 445322, 314714, 280838, 240026, 192166, 153834, 171535, 171522, 113348, 75823, 104149, 111039, 89251, 88489, 100096, 139284, 149395, 111459, 68021, 34717, 70119, 66868, 69231, 103735, 74985, 2575, -64739, -68115, -55872, -15908, -14101, 12738, -25948, -41622, -52663, -7527, 59541, 82540, 40977, 63790, 87290, 32534, -45371, -28234, -13064, -43598, -29752, -48814, -40470, 3537, 3687, -54712, -54981, -40209, 15576, -2649, -45665, -37913, -69751, -70158, -82574, -82904, -69342, 4150, 76516, 74822, 32373, 15737, -17600, -38839, 8499, 28266, 22943, 2187, -9863, -13675, 15981, 1869, -59350, -16662, -10798, -27858]
16905b7858k061r254J1950q357l4989J8771Q38q048N8831L5391m9973K8721N2785
16892F6747m1668m2940l3610k7799M5814N6726K4841j5170o653j4715k1798L8093
16880B7868O4851M247j7060O5078M3304M0258R76l2489K10M854j1074K5030k4506
16867A91547l8514p7289j0903M4060M3155J8307N7408K7834Q315k3733q292j3971
16855B17924k7353o5044j8995L962p939K41j4544L698k6341j4139m6872m4590
16843c9992j5001K8720j965L9931N2792N977j2537n4341P815K8795j7504M8748
16831G1438P5348K6052K3422k0404K020k0943m0306n7554P636R896J475P0432
16819A48512L0237l8392o3569K6976j6728n4342l9556r48L8405O6259L5968J2314
$$ y = [-27858, -29919, -39173, -27223, -35580, -70569, -51798, -50960, -59008, -177, 35214, -14759, 13962, 66747, 25079, -17861, -51471, -79270, -33456, 23270, 48111, 32941, 26288, 11573, -10225, 27868, 92719, 96966, 79906, 144984, 188288, 228546, 229522, 197033, 197243, 202097, 191023, 216053, 191547, 153033, 75744, 64841, 108901, 152056, 170363, 227771, 255605, 263920, 240187, 231895, 217924, 190571, 125527, 106532, 110494, 102555, 102796, 88252, 91950, 65609, 51470, 4598, -39992, -54993, -26273, -28238, 11693, 64485, 70462, 57925, 3584, 11399, 40194, 22690, 71438, 146786, 172838, 196260, 175856, 177876, 156933, 116627, 59073, 66709, 76605, 78080, 148512, 178749, 140357, 76788, 103764, 87036, 32694, -6862, -7810, 30595, 96854, 132822, 145136]
16807A45136j9525O944J97L4114N4423n6915j2953K8941j04550n7624j6691m9236
16795d7739L4192K5867M635K7668k4455l3497J2114k2148k4589K8734K6701m1382
16783c3899k2056L9k8576l2735N5608N0211k2390m1027Q903j4426L7720O2358
16771A9730L8962n9747p3495j0278o7175N9361J214J2720P790K1807m8083j0928
16759a08122K2125M948O4582k174k0283l7596K1037M1551L5566k0744j1571j3845
16747b4526o915J534K0067j5275K3751r660M641k7044m3891L009K4781M2566O33
16734f329P101n6939m5338R492L3530M106j0905l1511n319L6031L4918k6534O599
16721e1098M9940j2530m3144m405j3249J3061L4183j5327J0687J8931l9105n2473
$$ y = [145136, 125611, 132555, 132752, 166866, 221289, 164374, 151421, 180362, 75812, 18188, 1497, -47739, -13547, 12320, 16955, 44623, 20168, -13329, -1215, -23363, -47952, -19218, 7483, -33899, -55955, -55916, -84492, -117227, -61619, -11408, -33798, -74825, -65922, -80348, -42628, 19730, 58692, -1055, -74550, -84828, -152003, -92642, -91428, -78708, -70918, -49111, -97194, -108122, -85997, -81049, -16467, -18641, -38924, -76520, -55483, -13932, 21634, 890, -10681, -24526, -31441, -29907, -9840, -25115, -1364, -11024, -6383, -33427, -77318, -74309, -49528, -6962, -6329, 772, -56167, -101505, -92013, -58483, -54377, -65282, -96793, -102112, -66081, -31163, -57697, -51098, -1158, -13688, -56832, -61237, -74486, -61425, -27242, -42569, -31882, -12951, -52056, -104529]
16709a04529L4218K7723j4701o0859m3098R518L8117j6712K0750K6315m146m1049
16697a28453J3782P5702n29j8200k365L7120J6143q8697m2778K1891K9078n5464
16685a42770n3438P860M0700N8676M2883k7635m2857P335K6749o254l3123M645
16673a17229j0661j1847O353N6147N8452j2833j666J3921K4430M5072j0385m6682
16661f928q8137k7152m720q306j3242L9454M3096m2533L118p7130O357Q6320L7046
16648e2757k9842k4077L2209O301n2942k5058L5848Q5462O1190J6372m2674l2606
16636b2574j2431L7007k9994J0485m3247l7616m1322j6075J5874N0478K1183K7618
16624d0614J0396k1590j8644k5719m8019K5522q096K9646J6154j6632l9435L09
$$ y = [-104529, -70311, -42588, -57289, -118148, -161246, -151728, -113611, -130323, -109573, -83258, -87404, -128453, -114671, -38969, -39498, -57698, -60063, -22943, -6800, -95497, -138275, -116384, -87306, -142770, -196208, -188348, -147648, -88972, -46089, -73724, -116581, -109246, -82497, -88751, -121874, -117229, -127890, -139737, -133384, -77237, -18785, -31618, -33284, -19363, 5067, 50139, 39754, -6928, -95065, -122217, -126937, -135243, -148485, -109031, -65935, -108468, -105350, -182480, -176123, -89803, -52757, -82599, -106676, -74467, -68166, -121108, -146166, -110318, -24856, 36334, 52706, 10032, -22574, -35005, 2002, -27992, -17507, -60754, -98370, -139692, -155767, -139893, -89415, -68232, -40614, -30218, -51808, -70452, -96171, -144190, -118668, -126764, -97118, -80964, -97596, -137031, -136722]
16612a36722N52j5180j0435L5045R127L1391K2555k2267M7431M4138J5333K5992
16600D6960k8992n6649k1533K5872j1421q300k1985r0466m7747M1922O4545J9811
16588h7983N6260l7588p4299J2926J2250j0232R956j8183L6617P784m7132l5874
16576a75498K9486M3214P9170L8463j0912K8445k1608m8430k1083k9548K3107
16565f5194O969j506K6475l0234k4282k048L8899M3686J1223J943K3305L500q556
16552B4180n8888k6862n6857m7283J4143O4823K4066l4660k063j2556K7369M4908
16540c9680N6761M473p4130n6498J7210N4161J3459o070K8108l4173l9424m5396
16528a21199J5160K7234J9632Q991p244N683j2226l5720n5365q445N2953O7568
$$ y = [-136722, -136170, -151350, -161785, -126740, -117613, -86222, -63667, -85934, -38503, 5635, 20968, 46960, 17968, -38681, -60214, -34342, -45763, -54063, -76048, -166514, -214261, -172339, -107794, -87983, -31723, -69311, -143610, -130684, -118434, -128666, -118710, -136893, -100276, -92492, -139624, -175498, -146012, -102798, -23628, 14835, 3923, 32368, 10760, -37670, -58753, -88301, -65194, -58225, -59731, -33256, -63490, -87772, -89820, -50921, -7235, 3988, 5931, 29236, 32736, 24180, -34708, -61570, -118427, -165710, -151567, -86744, -62678, -97338, -99401, -111957, -84588, -39680, 17081, 21554, -52576, -109074, -91864, -37703, -24244, -30314, -2206, -36379, -75803, -121199, -106039, -78805, -59173, -50182, -57426, -51743, -63969, -99689, -155054, -163499, -110546, -42978]
16516d2978k1524l0488K4936k0221o1884L7329P9459Q290m6276k4985l1512K399
16504a27455L7785O140j153L4867K3151L2904J0401o4249k6278J0979O960K2758
16492c3190j1899K610k4000l358k3813J6968P7834k2768K149J5439k7438L2590
16480A124m0212m5015J9296o773k4549J449L7071R824J375n2701K3969K7295o576
16467e4423m479k4747K054q193j4514m3783j126P6933K5741j5643M624L827N945
16454d7784M1527k1929L305j1335k0700m9887k1673m724M5964p279l684l3808
16442a32007M1515M1594L0885j598o7168l7881M3008M2032j1099J6457J954K9592
16430b716l2767n5836K5065K2386K5131l5166j3530J9546n438J0142j491K3704
$$ y = [-42978, -64502, -94990, -70054, -90275, -152159, -114830, -35371, -27081, -73357, -98342, -129854, -127455, -89670, -83530, -84683, -49816, -26665, 6239, 16640, -47609, -73887, -62908, -55948, -33190, -45089, -42479, -66479, -69837, -93650, -76682, 1152, -21616, -19467, -4028, -31466, 1124, -39088, -84103, -64807, -71580, -96129, -94680, -57609, -47785, -46410, -99111, -75142, -47847, -54423, -58902, -83649, -81595, -89788, -104302, -148085, -149211, -72278, -46537, -62180, -57556, -53729, -47784, -6257, -28186, -24881, -36216, -56916, -106803, -128476, -133200, -87236, -94515, -98199, -132007, -90492, -48898, -18013, -19611, -86779, -124660, -81652, -39620, -50719, -34262, -32308, -2716, -35483, -91319, -66254, -43868, -18737, -53903, -67433, -47887, -53325, -43183, -44674, -20970]
16418b0970l4752n2197J3210J3909O679l3269J6737K9485J4880J8975k8924l2015
16406h8252j0685m51r502L8282J8604l4325L4581p584m186K4672J1983n6318j1725
16393i4906M1122K5855N916k355l4916k4937M4107L2327K3270j5592l7300J765
16381c5644l2187k7749M5025l760Q436L146P400N06o763K398J8256k4643j1229
16368e6808k6085L4178p829j0598N584Q291l8627j00662K2420K0723j3008K7355
16356a35066O7445j7676o33L1285J3378J1714l0526k7850j9574n0164K560J9113
16344a35994M2897J6339j5013k0176l6272N0090N8196K3258l0011m6116l1647
16333a24449J0758L2331N3245L9159j0330N713q718j2182k1186J4826J3091K7223
$$ y = [-20970, -55722, -107919, -94709, -80800, -74121, -107390, -90653, -61168, -46288, -27313, -56237, -88252, -98937, -99388, -108890, -70608, -52004, -86329, -51748, -59332, -63518, -38846, -26863, -83181, -94906, -53784, -27929, -22013, -24368, -59284, -84221, -40114, -7787, 15483, -109, -37409, -35644, -67831, -95580, -50555, -54315, -45879, -42733, -35333, -34827, -41590, -39192, -20936, -45579, -56808, -82893, -48715, -56544, -67142, -61558, -53267, -91894, -192556, -170136, -149413, -162421, -135066, -67621, -85297, -85930, -54645, -41267, -29553, -60079, -87929, -107503, -157667, -155107, -135994, -93097, -76758, -91771, -111947, -148219, -98129, -39933, -16675, -46686, -92802, -124449, -113691, -81360, -28115, 11044, 714, 6427, -2291, -14473, -35659, -20833, -7742, 19481]
16321A9481p900L8010J8590m9490l3830j9832m2163K4981J3093K3810k2526k2326
16309f0102k8025k5737J6411N8530L2310o8200l5580k8210Q901M020J5711k1288
16297a31259N399L0133K6341J8563M237k0032J2749j4686k2609j223r415J4878
16285h6924N818M975N8862k4850n2938J3133L6771j2141j9485P10j4959r082N4518
16272d5592M4107n508J7114Q62m2159k3148m0203Q098q571N3750P3113m144o0072
16259c2353k9959j0999N485J0965J4343m5353M1936K5059L5780K5587p4324P3930
16247D0097O086J4290l0055N018m574m2706m7170L9223J193j4242N1188l76k2423
16234d451j7520J9052Q2905Q715l7268j4747k045J7749l4347l4762P979j3011
$$ y = [19481, 11581, 49591, 68181, 18691, -15139, -34971, -77134, -52153, -39060, -15250, -37776, -60102, -88127, -113864, -97453, -38923, -6613, -74813, -110393, -138603, -129702, -125682, -109971, -131259, -125860, -95727, -69386, -50823, -46586, -66618, -53869, -68555, -91164, -92387, -101802, -86924, -81106, -76131, -17269, -42119, -95057, -81924, -45153, -57294, -76779, -76069, -91028, -100110, -45592, -1485, -6993, 10121, 10983, -31176, -54324, -94527, -86429, -95000, -41250, 31863, 27719, -32353, -62312, -73311, -67826, -56861, -42518, -87871, -45935, -20876, 14904, 40491, -33833, 40097, 46183, 60473, 30418, 35436, 30862, -11844, -59014, -19791, -18598, -32840, 18348, 17972, -4451, -21971, -2919, 79986, 88701, 51433, 36686, 34641, 52390, 18043, -16719, -8740, -21751]
16222b1751k6209L5156r868R298K9854J7756n031k6648o338k2384m6921K2628
16210e0458J1713m98n194M1038K7854J5197j5751o0102m9034k2381k3244M2253
16198h8607M7217J3874k6728l1019k6984O6893k0332l0211l495M7765N1354K3987
16186B3714J6729j065M5950J3437m1218o1900l994L0204r43n484K8941j1872m3938
16173a1439K9194O323j0616n283k8991k9165P071L9383M4268j7266o4545m2570
16161h3636K4487K1779L2255l1349j1911K4448J0526k3056l0682L1162M5186J6350
16149B5559L011q4720j00866L1123L911l114K7377L4720N3460N620m1464Q742
16137c6641K4900L9474J1692l7825m3700R918N6029r644m6525J8397N0511K4287
$$ y = [-21751, -47960, -12804, -22672, -13374, 16480, 34236, 29205, 2557, -3781, -26165, -73086, -50458, -38745, -39243, -44437, -3399, 24455, 39652, 23901, -36201, -85235, -107616, -130860, -88607, -41390, -27516, -54244, -85263, -112247, -45354, -65686, -95897, -99392, -51627, -273, 23714, 40443, 39378, 85328, 98765, 57547, -4353, -8347, 21857, 20914, 15430, 44371, 32499, -11439, 17755, 24078, 13462, 8179, -20812, -49977, -42906, -3523, 40745, 23479, -41066, -83636, -59149, -37370, -5115, -36464, -48375, -23927, -13401, -36457, -67139, -35977, 9209, 25559, 28570, -56150, -157016, -125893, -121982, -125096, -97719, -62999, -9539, -3919, -45383, -36641, -11741, 27733, 39425, 1600, -42100, -32182, 23847, 14203, -32322, -13925, 36586, 60873]
16125F0873j9932o0357l7698m3466j3486Q3458q979l8607O9361K9769p8794m7041
16113a04899k4841n739K0430Q8179N7516J8513L2014o9087q3339L106J7712M1281
16101i154L7695J9520k693j9465O309J6219n4134k6542k2643m8955m8890L7172
16089a15561K3783j3310O6896P6623q0160N77M5698J6718J9682k03k1542q2501
16077f3300l2027N7695L0871j3402Q939K6008L499n9924k2444j0032K2151N2356
16065C90j0130j9595K6294k0838J0721L2346q053m0104j3893j6765o817L5789
16053c0655j1882n7898r440q599K3296M4489R983J3453J7092j6372m5823J9584
16041e2772L3974m4480q673L4991L1353L010l6277l7274J0669M7877l2894L0106
$$ y = [60873, 40941, -19416, -57114, -100580, -114066, -30608, -39587, -78194, -8833, 20936, -57858, -104899, -129740, -135479, -115049, -26870, 30646, 49159, 81173, 12086, -71253, -68147, -50435, -9154, 28541, 48061, 45368, 25903, 32212, 48431, -5703, -32245, -54888, -103843, -152733, -115561, -91778, -105088, -38192, 38431, -41729, -41152, 4546, 21264, 40946, 40743, 19201, -63300, -95327, -37632, -6761, -20163, -11224, 14784, 18283, -41641, -64085, -74117, -51966, 390, -9740, -29335, -3041, -23879, -13158, 19188, 11135, -28969, -42862, -59627, -66444, -30655, -42537, -100435, -109875, -118474, -95178, -50689, -40706, -27253, -10161, -26533, -72356, -52772, -18798, -63278, -71951, -36960, -5607, -2597, -38874, -76148, -65479, -17602, -50496, -20390]
16029b0390M0446j8322p90J1929N5606l5939m7578j5451k9012Q055k2242l7738
16017a11426j1352O9788J0908Q2815J0054n9187J7768L9674j4077n2002k6316
16006d3353J8720N2142M2175n3815m2934J8457k3201o732M7358J6379k4688q974
15994h466J8934K358M8064o2749p2090o064J0248l655L3111k2964m0350N721M3696
15981e4206m950M2882M8049n3622q5871m4725N3445N4192o511m4282L4112M3360
15969a8127j9630j279K8696J2698l4735k7177j6346J0168j0089J0172L300l0548
15957i2897K758o767k6639J0113M461o9422m9598l770M8040K3707O324L7669P5664
15944d0357j486K4327N0481k8425k1427j8772k648N785N8929L0028r138m4570
$$ y = [-20390, 20056, 1734, 944, 12873, 68479, 32540, -15038, -30489, -59501, -51446, -73688, -111426, -122778, -52990, -42082, 40733, 50787, -8400, 9368, 49042, 34965, -17037, -43353, -24633, 27509, 69684, 15869, -27065, -8608, -31809, -38541, 8817, 25196, 508, -8466, 10468, 12826, 60890, -1859, -73949, -80013, -69765, -73420, -40309, -63273, -103623, -97902, -54206, -59156, -16274, 31775, -21847, -107718, -152443, -98998, -44806, -51317, -95599, -61487, -18127, -37757, -39036, -10340, 2358, -32377, -59554, -75900, -65732, -75821, -65649, -62349, -92897, -90139, -96906, -123545, -113432, -108971, -178393, -227991, -231761, -183721, -160014, -153690, -116021, -40357, -41843, -17516, 32965, 4540, -16887, -35659, -38307, -32522, 26407, 56435, 47297, 2727]
15932B727K793M1856m6833Q613J1096m2103l0489r91Q7170L0578j7054K2177P362
15919G6902l0677l5608p792K9580m9485n0077J7431L6803Q113k8141j9202N6404
15907D251M3638k9046M727N527J7656L1203J2734n1673l4032K3698N2790o5790
15895A5683l8408N2143l343k1858m1111L0504J471L0770J8728L0158k1924m6142
15883F671j8903j4308M4485j5178k1560J0459O923j4289j7163l6614l002M5319
15871b7160M6949O1396m55n0304m096k0631k4510M371p061J856J3501J3120o1763
15858e4787n2561N3316M9042K829p3731j7200J6316L282R346m5857N246O2227
15846d2532l1474k8713K8896K9924R556J4503O9589j9051p7824n6972O905J4041
$$ y = [2727, 5520, 47376, 543, 9156, 20252, -21851, -52340, -53331, 33839, 64417, 47363, 69540, 76902, 46225, 10617, 2825, 32405, -17080, -67157, -49726, -12923, -4810, -32951, -52153, 4251, 47889, 18843, 23570, 29097, 46753, 77956, 90690, 39017, 4985, 28683, 81473, 15683, -22725, 29418, 26075, 4217, -36894, -6390, -4919, 25851, 44579, 74737, 52813, 6671, -12232, -26540, 17945, 2767, -18793, -8334, -1411, -15700, -32863, -69477, -72479, -27160, 19789, 81185, 80730, 30426, 26330, 5699, -18811, -14440, -21501, -19645, -6144, 6976, -54787, -107348, -54032, -4990, -2161, -75892, -93092, -76776, -73494, -64148, -110005, -104759, -42532, -74006, -102719, -73823, -43899, -34343, -19840, 49749, 30698, -47126, -104098, -97193, -83152]
15834h3152M3618J3567k0626m3586n087l9956j6347J430K5960N5077M1068J8202
15822i832n9018k2029O735L9712m0341K557J6311L8635k8245k6436J3056O4612
15810d283J8508J8548O673J149k9671j5053q099r054L816M385J2499n408o859
15797a2849N906j4306j1767j875N2261k233K2814J1529k303l2855k4562j69n312
15784a5721K3990j2527k923n190K203l8797j0632K1364M6137L100m8327m687K3342
15771a8668M3976P081j4180l9372j0050J9111K2997L31M461m4781k8333j6349
15759g3776J3477J4635K4109N339k6719J0800M564M4190j1686J5244k9008J9586
15747A0755L3067m8n909m4631j2968M1432J3156R234N0091K8254J6118l8897q4120
$$ y = [-83152, -39534, -25967, -46593, -90179, -95266, -135222, -151569, -150139, -124179, -69102, -28034, -9832, -68850, -90879, -84144, -44432, -84773, -82216, -65905, -27270, -55515, -81951, -68895, -4283, 14225, 32773, 39446, 40595, 10924, -4129, -12228, -21282, -17466, -13081, -582, -5990, -12849, -6943, -21249, -33016, -34891, 17370, 15137, 37951, 49480, 47177, 14322, -10240, -10409, -15721, 8269, -4258, -7181, -12371, -10168, -48965, -59597, -38233, 7904, 11004, -37323, -42010, -18668, 25308, 32389, 18209, -21163, -31213, -12102, 10895, 11226, 15687, -29094, -57427, -73776, -60299, -45664, -21555, -16216, -42935, -32135, -27571, 16619, 4933, 20177, -8831, 10755, 43822, 43774, 37865, -6766, -19734, 21698, 34854, 44088, 94179, 122433, 138551, 99654, 15534]
15734A5534m8174M0605M8197J0867n0745k8487J6506k3600j061M1350k0809j3251
15722a3068M1966J9651r986p1469l6143j2323K5478K4133L6532J2610j3581j3164
15710i364L9852j9799m2045L629l3000o3412j0187Q9050L7171k883J5220J8152
15698B2384M1621j8959o350j6411L763j4126L4975j3891n0419m7586q554j7795
15686i1348O3743N1967j8480l1173j4337J5279L891J4893M7570l122m5903l90
15674g410P3798P6260k515q3254o4926k419L7413J9743j9793l6812K9184J936
15662B1205J8138o0774o6570K935Q332O3154Q773l0910l671O64K6275l906L411
15649a2944l9606j2990J2823k0379k1837J3071M3580J159m4535J3098j0754K1181
$$ y = [15534, -32640, 7965, 56162, 67029, 16284, -12203, 4303, -19297, -20358, 20992, 183, -13068, 28898, 48549, 38563, -32906, -69049, -81372, -55894, -31761, 4771, 17381, 3800, -9364, 30488, 10689, -31356, -27727, -60727, -124139, -134326, -45276, -8105, -10988, 4232, 22384, 64005, 45046, 38696, 22285, 26048, 11922, 46897, 33006, -17413, -64999, -73553, -91348, -27605, 24362, 5882, -25291, -39628, -24349, -20458, -5565, 42005, 38883, -7020, -7410, 66388, 142648, 140133, 56879, -8047, -10466, 26947, 46690, 26897, -9915, 19269, 21205, 39343, -21431, -88001, -85066, -76734, -13580, -4807, -35717, -39388, -38724, -12449, -16355, -12944, -52550, -65540, -52717, -73096, -94933, -81862, -38282, -37123, -81658, -68560, -79314, -58133]
15637e8133Q3278J6045l3597k5674J3803O0674R236n5227n200l697J8880K1692
15625D2080o6400m1494K2098j0000n5869N3550O1660j3115j5122o930J9126n74
15613a0990n0028j3290p268M2883N4707j3152J1331L6590r119j4126l9616j6248
15601b8326l8127L8622K1589n363O308K8422O487o740k630k6595R563l7806K3903
15588a0693r0847J9710N6346r756L25J6963J4180l4590K2249M6333m251m2720
15576a6751J0111L4756r294m8804l8186J8048M0029j9598j9153n840Q8883N2095
15564H6296k8760k154m5516o928l2043j8258R22j2411l309K3457k8097q479K0431
15551e4849K6222J9020j8775o1644J5282L9235o14L550J2869k663j9579p362M1513
$$ y = [-58133, 25145, 41190, 7593, -18081, -4278, 56396, 65632, 10405, 5205, 1508, 20388, 42080, -24320, -65814, -43716, -53716, -109585, -56035, 5625, -7490, -22612, -29542, -10416, -10990, -61018, -74308, -81576, -38693, 16014, 2862, 14193, 50783, 41664, 27538, -12078, -28326, -66453, -27831, -6242, -11605, -5297, 23125, 29612, 22872, 20242, -6353, 3210, -34596, -10693, -101540, -81830, -25484, -35240, -34915, -17952, -3772, -38362, -16113, 30220, 25969, -16751, -6640, 28116, 18822, -29982, -68168, -50120, -10091, -29689, -48842, -54682, 34201, 86296, 57536, 55382, 9866, 2938, -29105, -47363, -46441, -58852, -62161, -38704, -66801, -75280, -54849, -28627, -9607, -28382, -90026, -74744, -35509, -36123, -32573, -19704, -22367, -41946, -49308, -7795]
15538g795N4313K6001K8111m0451q96K7119j7313N233k0730N839k9777k3228l8239
15525c1813K9131k8384j3622K7935O4228P7553p042k4153l6583m6594R601l7980
15513a7723k8805o1775J4409N5213N1995o640m7503J474K9757O722m0788l0592
15501g4256j63K6537K4616R490j5017l0604J7389J4095K561Q511K1322m8795j078
15488d5392K1642j6616R1L4937P388J052k0514k8858l116J209l7315l7441K475
15475a20458M1055J7985K0009L2580n1973k3891k3118q154j3351J840L2959N0926
15463d3591J0403o727m7516K2790J00000M1477k6615k2299k0573J3081q539o401
15451E490J8355n4826j4885Q9395L2911j5458k2894l5748l3101J3807l3209k0569
$$ y = [-7795, 46518, 72519, 100630, 60179, 59283, 86402, 69089, 74322, 53592, 59431, 29654, 6426, -31813, -2682, -31066, -44688, -16753, 47475, 125028, 117986, 93833, 57250, 10656, 20257, -17723, -46528, -108303, -93894, -38681, 13314, 6674, -40829, -39355, -9598, -2876, -43664, -74256, -74419, -47882, -23266, -13776, -28793, -59397, -42008, -27913, -25352, -16841, 4481, -44314, -45392, -23750, -40366, -40275, -5338, 2050, 3102, -17412, -46270, -49386, -48177, -85492, -122933, -120458, -79403, -61418, -41409, -8829, -60802, -84693, -107811, -115965, -129316, -127476, -94517, -43591, -33188, -39915, -87431, -64641, 35359, 76836, 50221, 27922, 7349, 20430, 11891, 5490, 23845, -30981, -45866, 43529, 76440, 60982, 38088, 2340, -30761, -16954, -50163, -70732]
15439g0732q885K0171J4959L9212J3968j2896O438Q192l2446J4308K4471J7846
15427C4606l3573K8766J2682k2946J6129N714m452R451p241k8960l0984m2920
15415f3728M705K0530L7611k7006L1230j415J0142J8548m2044p28n783N754J0373
15402a811r705l4719n2967Q602N1901L3169k7438j280L2111J1155J1743q32K8094
15389D8023j4765p0077K2844K7516J1995n7087j221j8166L2801K9309o347j3459
15377h634K7704j2257k6085J0690J9120m3976k5301O1313N441m5034j6830p341
15365f1190L9673N4677K84m5904j2688O543Q6503j639l0860j0825j5610j7180
15353h216L3991K800k0353k0966l4251Q367k0097L094K9429L5856P060k4294j243
$$ y = [-70732, -79617, -59446, -44487, -5275, 8693, -4203, 2235, 10427, -22019, -7711, 16760, 34606, 1033, 29799, 42481, 19535, 35664, 41378, 36926, 46377, 39136, 10176, -20808, -63728, -59023, -38493, -882, -27888, 3342, 1927, 12069, 30617, -11427, -12155, -17938, -12184, -1811, -11516, -46235, -99202, -90600, -38699, -5530, -32968, -34248, -2137, 9018, 20761, 19929, 48023, 33258, -36819, -13975, 13541, 25536, -31551, -32772, -50938, -18137, 11172, 4825, -8634, 19070, 6813, -19272, -8582, 10538, -33438, -58739, 2574, 8015, -37019, -53849, -61190, -21517, 33160, 33444, -12460, -25148, -18605, 67898, 66259, 35399, 24574, 8964, -8216, 25775, 28575, 8222, -12744, -46995, -38628, -58725, -55631, -26202, 9654, 16714, -7580, -8823]
15340h823m3334j1971J3959N5410J0105J5349K5265j1877l1548J5486m0412J8520
15328F129J5617L7761j2351k6245J1618K3990m7674l8729k9042l8404J1882J2363
15316g3085j8079Q514O6046L0632j112m5150n7233M6323j2357N610R127k4761
15304f5525K8902J0063k1379l5978M3749L4032k74O221j3368J1507L7349K5004
15292F0303R662Q786q6294J4336M4198o9566m4042K7926k8307Q295O8401N325
15280A9023l5757j5893K5178L4746J2962j3672m6684J1812M5054L2168n8689o9301
15268e9053j1475p295K625Q125K0016k995n0850J4447M6369L6955J8740j8626
15256c017M3336J1838j372l7244j0367M3503L9008k5266l2490l5606R212K3987
$$ y = [-8823, -52157, -64128, -50169, 5241, 15346, 30695, 55960, 44083, 12535, 28021, -12391, 6129, 21746, 59507, 47156, 20911, 32529, 56519, 8845, -29884, -58926, -97330, -85448, -73085, -91164, -82650, -16604, 14028, 12916, -32234, -89467, -43144, -55501, -49891, -40764, -65525, -36623, -26560, -47939, -83917, -40168, -6136, -6410, -189, -13557, -2050, 35299, 60303, 69965, 78751, -7543, 6793, 50991, -18575, -62617, -34691, -62998, -54703, 13698, 19023, -16734, -32627, -7449, 27297, 40259, 26587, -20097, -8285, 36769, 68937, 10248, -59053, -70528, -77823, -75198, -67073, -47057, -50052, -100902, -86455, -40086, -3131, 15609, -3017, 40319, 52157, 50785, 13541, 3174, 46677, 85685, 60419, 27929, -7677, 1535, 25522]
15244B5522P057J3716m847M7040M524k9037M2703p296k3134k4568k6173k5232
15232B75p918O756j4280n0753j9656Q2108J9265q219L1832J495j0965K8228N7538
15219A15706K6837o3418n3626m7356l334K2486k0929O0647N8002o6704n6773k270
15207c0732L8660J2431j0882j6603j971k0613J0837m703m3705n4254j0199N1246
15195h0488K5774k1904j9478R6698j0858k2503K6141L7843k622n0205k5619N5084
15183G863R121j3082L7933J1074J4672J069M398J9098K569l6493m954J5137j4102
15170E4303m683N347k9073m8413q421L0475J0031l5858j3486j6001L9170L3785
15158A7176k5002l1613J8989K5046k9243J6467K1099k549n134n067r792M6323
$$ y = [25522, 32579, 46295, 41448, 88488, 93012, 63975, 106678, 99382, 76248, 51680, 25507, 275, -7643, -887, -15167, -65920, -85576, -3468, 15797, 7578, 39410, 40905, 29940, 58168, 115706, 142543, 79125, 25499, -21857, -25191, -2705, -23634, 37013, 95015, 28311, -28462, -30732, 7928, 20359, 9477, -7126, -9097, -29710, -18873, -23576, -67281, -121535, -131734, -80488, -54714, -76618, -96096, 602, -10256, -32759, -6618, 31225, 28603, -21602, -47221, 7863, 16984, 3902, 41835, 52909, 67581, 68650, 73048, 92146, 94715, 58222, 53268, 68405, 54303, 49620, 54967, 25894, -22519, -30940, -465, 9566, -26292, -39778, -55779, -16609, 17176, -7826, -39439, -20450, 4596, -24647, -8180, 12919, 10370, 5236, 169, -9623, 36700]
15146C6700K304k280P528k1147o514P35j4229M2459m44N384j8635J7019l3821
15133A5059q2300k1319N1262K2938j6654k552L6642M137P26J4877O6849R41m1444
15120D9162j8255L128L1093l4181k9025M543N5599J7228o5302l815o689M40l0838
15107b6912l8584P630J5007K1728N0751M589j0259J2306j2747J1199r557l0959
15095e808J2922J7066K9161K079j62k3440j3383K3940K1011R587N81j1413J9862
15082H2003l5944k2567R583K0608k3664j1017k866j6307p4243k4995M0716N7450
15070a243L9038J6589J7934k4330j0459K7051j2801l4569o0747p9012J5192N7506
15058d9851M8183J3025K4612k1128j7835N3618l1083k9427j046n393k8574j0111
$$ y = [36700, 39004, 36724, 44252, 23105, 16591, 17326, 3097, 45556, 45112, 50496, 31861, 48880, 15059, -67241, -88560, -37298, -14360, -31014, -33566, 3076, 7213, 7939, 22816, 89665, 90606, 49162, 30907, 34035, 65128, 30947, 1922, 6465, 62064, 79292, 13990, 10175, 3486, 3926, -26912, -65496, -57866, -42859, -21131, 29620, 34209, 23950, 36256, 23509, 34708, 25151, -5808, 7114, 24180, 53341, 55420, 55258, 31818, 18435, 42375, 63386, 72973, 73554, 62141, 82003, 46059, 23492, 33075, 53683, 30019, 19002, 16136, -171, -74414, -99409, -58693, -1243, 37795, 54384, 72318, 47988, 37529, 64580, 51779, 17210, -43537, -122549, -107357, -49851, -1668, 11357, 35969, 14841, -2994, 50624, 19541, -9886, -10932, -16325, -44899, -55010]
15046e5010l7684J6739P3330j7284m7489K6478L5961r321J8461K7779K3616L0559
15034H6135K130j3137p231J9165n8307k3085L6773O898K3384M2316J4678N154
15022A34873P718l2999p4414L6694K343k2553J292K19j9274J645k3675l7308Q43
15009b4596o078R120K5319J8996n723l3208l9141l9408J1532L8375K6848j0225
14997b8189J9261p935K7428j6890L6594j1653J1455P798Q225p746j997J8243K5158
14984G9752j0566N846l412l2460J5461l8703K6457K619L9967k1008L3506Q896
14972A06355o855p210J5627o2863n4722l5642j8713k1754M7254m4334n5665N1335
14960h7187P2340L11o0736K1586M4813L4228J4413j5709j142L462L5372j3964
$$ y = [-55010, -92694, -75955, -2625, -19909, -67398, -40920, -4959, -14280, 4181, 31960, 55576, 86135, 88265, 75128, 67897, 87062, 28755, 5670, 42443, 49341, 72725, 115041, 129719, 134873, 142591, 109592, 35178, 71872, 74215, 51662, 52954, 53173, 33899, 35544, 11869, -25439, -24596, -30674, -21554, 3765, 22761, 17038, -16170, -55311, -94719, -83187, -44812, -17964, -28189, -8928, -16863, 10565, -6325, 30269, 18616, 30071, 37869, 46094, 38348, 36351, 54594, 79752, 69186, 75032, 71620, 39160, 54621, 15918, 42375, 44994, 84961, 63953, 97459, 106355, 99500, 92290, 107917, 45054, -9668, -45310, -64023, -85777, -38523, -82857, -138522, -87187, -14847, -14536, -75272, -53686, -8873, 25355, 39768, 24059, 22917, 26379, 61751, 47787]
14948D7787n9713J1817K7306K8571k5112p6156J0987K8558p938O6437j9513p4085
14936d1054k7439j1154N678k0949j2877O8134N0895L3135n4298n0775K1559N7877
14924A8732M8062L270j1962l7998o2068j7943L3179p592L2063P84m1423j867L6501
14911h262P3484m3977l6542R803K2123J5839l7979k508N4777k4134j6311K011
14899H324r352l1487m0200p652l3080J7769O1078M9655k9283J8407P002l8939
14887b7758r543K6106J3920n507K45l391l2731j8835M8945N4862q53m0658M0325
14874D5127L6519m6565m2303q445M9988J4901K390q663l2742O139m154K9544l8749
14861B987l3757J5944J4938k6346j4392J4674r720L5879M11l1675r190N0017k9169
$$ y = [47787, -11926, -109, 27197, 55768, 30656, -45500, -34513, -5955, -13893, 52544, 33031, -41054, -68493, -79647, -73969, -94918, -107795, -39661, 11234, 44369, -9929, -60704, -39145, 18732, 66794, 70064, 58102, 20104, -41964, -59907, -26728, -34320, -2257, -1473, -42896, -44763, -8262, 65222, 21245, -15297, -5494, 16629, 32468, -5511, -8019, 46758, 22624, 6313, 8324, -1028, -32515, -72715, -80367, -113447, -95678, -34600, 15055, -14228, 4179, 11181, -27758, -37301, -11195, 2725, -2782, -2537, -5928, -38659, -57494, -8549, 46313, 45460, 4802, 45127, 81646, 35081, -7222, -15667, 34321, 49222, 51612, 42949, 10207, 16346, 12192, 41736, 2987, -30770, -14826, 112, -26234, -40626, -25952, -35672, 207, 618, -31057, -40247, 9770, -19399]
14848a9399o9463K4345N3249R7616M6559J1459n4060n5050M150j3755J3151m457
14836C4345k0589J8411k4009j1198n6608j0300K6332O8696K8716L3682n4088m1788
14824h398l0442M2825J2548K115k9617j8479K8563K4053P6382K0446o2002m9374
14812H620L1715j0399k1733j3197L5877J03108J0761n1701o0560n435m548j5612
14800F896K8916K0719J2701K5611P3492r235n8888J1763q399q8863j9344M9186
14788D4555J7868j2978o5234l6058L1820L9316N0997q330k8881l5486M1153N8733
14776I7475n6275n2119k699M7210K0638o5872k8679O0998K7151j2886m834j3875
14764A6233o09Q445o5546Q54J2786N564L6967J453m1330m0370J4639J9156n528
$$ y = [-19399, -88862, -64517, -11268, 86348, 132907, 144366, 90306, 35256, 39406, 25651, 38802, 34345, 13756, 32167, 8158, -3040, -59648, -69948, -43616, 25080, 53796, 87478, 33390, -8398, -38840, 3985, 16533, 18648, -10969, -29448, -885, 23168, 99550, 119996, 57994, 8620, 40335, 29936, 8203, -4994, 30883, 133991, 144752, 93051, 32491, 27056, 22508, 6896, 35812, 56531, 69232, 94843, 168335, 159100, 100212, 111975, 103576, 14713, -4631, 44555, 62423, 49445, -15789, -51847, -20027, 19289, 70286, 61956, 33075, -2411, 38742, 97475, 41200, -10919, -13618, 33592, 54230, -11642, -40321, 20677, 47828, 34942, 30108, 16233, 15624, 24069, -41477, -40623, -27837, -22273, 14694, 16147, -25183, -65553, -50914, -31758, -37286]
14751c7286J338Q9638j0576o9406M3431L9832J0661l8838K1569k4749O529p0148
14739c8005k7511M6181K7488J2347N404k4111J1834K6067j8645M000J2676k7244
14727A0481K0210J9365j0825m948J3305R085Q41j1703k9138k4910k0276j3578
14715d2091j4457l5062k0786M0692M0215M8157J701m9984J6140J3614p192l3554
14703d2607J1006L3036l1905J4840M1153K0907l7911j2635L9617k7342j42K8802
14691C6819J049l9928k876p481O127p53l2455K2373M219j5267K5329L2532J9793
14678D9481K3446L589m7298l6849K8365J1008J6181N7039q967k0138r565p618
14666E8674k5587R071K8299M9481l7376m3335K8932M4972k0814j5346J2921N462
$$ y = [-37286, -35948, 53690, 43114, -26292, 17139, 56971, 67632, 28794, 50363, 25614, 32143, -38005, -65516, -19335, 8153, 20500, 25904, 1793, 13627, 39694, 21049, 25049, 37725, 10481, 30691, 50056, 39231, 34283, 47588, 56673, 57514, 45811, 16673, -8237, -28513, -42091, -56548, -91610, -112396, -71704, -31489, 16668, 18369, -31615, -15475, -1861, -9053, -42607, -31601, 1435, -30470, -15630, 25523, 46430, 8519, -4116, 35501, 8159, 8017, 36819, 37868, -2060, -4936, -12417, -6290, -7043, -39498, -17125, -12906, -28173, -2844, 29688, 49481, 72927, 76516, 29218, -7631, 20734, 31742, 47923, 104962, 95995, 75857, 66292, 58674, 33087, 42158, 70457, 119938, 82562, 39227, 68159, 113131, 92317, 76971, 89892, 95354]
14654I5354n4755j8681l5815L6330J5876K0721j3446l1306K2394K1384n213j7764
14642C5079k651M924q461l3346j0668j0614l6999j8716K1764K9401J0399J5005
14630d883J5393R24K8345M74m287P3921K2198l1019l8030J9801K5091J4135k5743
14617I6320m5811k1465j993J43L5398K9845o463k5101N3531j2865n1040j7058
14605C3441J2807j0239J0009L1484O4997J9181m3156j293N201j7457k918q880
14593I3177K8619L009L7253o4981n8625k3538L7635K3490l1942o8414q8153j000
14581a13470P3612J7621n622L1278j9377L7320L5998J234j7492M2474K4970l5614
14569G2932j9680L42J6767n757k3410K7995K3094P44l4046j6736M2432m1121k4311
$$ y = [95354, 40599, 21918, -13897, 22433, 38309, 59030, 45584, 14278, 36672, 58056, 52843, 35079, 32428, 37352, 28891, -4455, -15123, -25737, -62736, -81452, -59688, -30287, -19888, -4883, 10510, 11434, 39779, 40253, 35966, 109887, 132085, 101066, 63036, 82837, 107928, 122063, 96320, 50509, 29044, 27051, 27194, 62592, 92437, 85974, 60873, 114404, 101539, 50499, 33441, 46248, 36009, 46018, 77502, 142499, 161680, 118524, 117231, 122432, 104975, 102057, 93177, 121796, 124805, 162058, 97077, 38452, 14914, 52549, 76039, 44097, -24317, -112470, -113470, -39858, -22237, -27859, 3419, -15958, 21362, 57360, 58594, 41102, 83576, 108546, 72932, 53252, 53594, 70361, 64604, 41194, 69189, 92283, 93027, 58981, 42245, 84677, 43556, 19245]
14556A9245N575L4778L8543o628n8105l7300N743J33K2491J1550M3845K0831L3847
14543A34548m2544m8080m273M4087J7996m2241r025l793K4642M8017L1275m8296
14531A02313m7015k8648M7604l719q9630o2567l2005J8310K2202N6570L9964K7147
14519E0526l5674J4160j3908J3510J5593J4370j8150R011L9683O3196J5501k181
14507A65637L7385m5073r022J5427k4383M967o3723p9816J0561K34j6136m0887
14495d4829K7615O0594R493M7778K7353n0806n4093J8984K4181K825O08N69n4233
14482A6039L1994Q5175n73j7858M552k4104j0420K2315J1514o8592m1692O364
14470A4714J5659N2214P36K3552L3482N0376J406m8107r0934o8050j4585m3M4691
$$ y = [19245, 24820, 59598, 98141, 91513, 33408, -3892, 1851, 1984, 24475, 36025, 79870, 100701, 134548, 92004, 43924, 39651, 83738, 101734, 59493, 50468, 46675, 71317, 119334, 150609, 102313, 55298, 26650, 74254, 70535, -19095, -81662, -113667, -95357, -73155, -16585, 23379, 50526, 14852, 29012, 15104, 28614, 44207, 58577, 40427, 49438, 89121, 152317, 167818, 165637, 203022, 157949, 148927, 164354, 139971, 144938, 81215, 1399, 11960, 12194, -3942, -44829, -17214, 43380, 52873, 100651, 128004, 77198, 23105, 42089, 66270, 69095, 69703, 70272, 16039, 48033, 133208, 132635, 114777, 119329, 95225, 84805, 107120, 118634, 50042, 8350, 14714, 30373, 82587, 83323, 106875, 140357, 190733, 192139, 144032, 53098, -14952, -29537, -29580, 15111]
14457A5111L1878M1860k7004l9571o657K7929J7983L2916k8816o057K4362K7032
14445A10966P181M0007m385m9503j1984k122l194P277q074n8845l799L9307n496
14432E7336J0758M2739K3804O822j2613Q258R08n595m0565J5338K2946l3480k3060
14419G3596K7145k8904l2963K8954J9314L6751k4213Q867q410m597o4402l962
14407B7176L243k5147K0190O4240N1782j4253N257J4588l7331m2517M7356j662
14395A12922K537j5459M5821Q002o1353j7912J3814j8718R62K1159P946m3432
14383E6289k2753L3126L311N046Q624L3427k069o0870m0193K4492K644N4596M578
14370A00248o39J5991O151n3909l1339L1844K6496M3812R746l1862l2744J1436
$$ y = [15111, 46989, 88849, 61845, 22274, 15617, 43546, 61529, 94445, 65629, 59572, 83934, 110966, 118147, 158154, 153769, 104266, 92282, 90160, 86966, 94243, 86169, 27324, 23525, 62832, 57336, 68094, 110833, 134637, 141459, 128846, 137104, 138012, 132417, 91852, 107190, 130136, 96656, 73596, 100741, 71837, 38874, 67828, 87142, 123893, 99680, 108547, 100137, 95540, 31138, 27176, 30419, 5272, 25462, 89702, 141484, 127231, 132488, 147076, 109745, 67228, 114584, 112922, 115459, 100000, 145821, 153823, 92470, 74558, 88372, 69654, 70616, 91775, 99721, 56289, 33536, 66662, 69973, 75019, 83643, 117070, 115001, 54131, 13938, 38430, 41074, 95670, 100248, 99609, 115600, 121751, 67842, 36503, 68347, 94843, 138655, 148401, 116539, 83795, 95231]
14358I5231L8717J7558l4978j8624J0351n1389j0006O466j5118J1115N2585J8112
14346A20020k1869n3468n9439j8173K2698L8701m203K4187m225M2833M132J5150
14334A06344k534j7371o5991K7562P085l238K4947M9843q199n3571K5269M3846
14322A33992L708j4768m1645L621M3184J3506P777k1062m2971J2159n7481m4567
14310d547o812L6709O0133o546o04K1363l8424N591K081l9736M0160Q202J7723
14297I5293j2053k1112j5769k2121k4580m962K2056M2390J2858L1079J8749m481
14285A17347m5117J7248n322j6213j1651k6728K6941j7281J468j4852m1527k0321
14273c6008L3681k1817O2647n912l8405j8960j3604l9426L5616P4782O6584L3190
$$ y = [95231, 133948, 151506, 116528, 97904, 108255, 56866, 46860, 53326, 38208, 49323, 101908, 120020, 98151, 44683, -14756, -32929, -10231, 28470, 24267, 48454, 44229, 87062, 91194, 106344, 103810, 86439, 20448, 48010, 55095, 51857, 76804, 126647, 118448, 64877, 90146, 133992, 137700, 122932, 81287, 84908, 128092, 141598, 149375, 128313, 85342, 97501, 40020, -4547, -11359, 25350, 85483, 78937, 78333, 99696, 61272, 66863, 68944, 29208, 69368, 77570, 95293, 83240, 62128, 46359, 24238, -342, -5304, 16752, 59142, 72000, 103079, 121828, 117347, 72230, 89478, 84156, 67943, 56292, 29564, 56505, 39224, 40692, 25840, -15687, -36008, -2327, -24144, 38503, 32591, -5814, -24774, -38378, -77804, -42188, 32594, 99178, 132368]
14261A32368K5740k7899j5343J0213L3640n178j4934L3709k2980l4374N2283K5173
14249A92418m1492r061M7662o768o6423J8208j8589l8474m2304M418M8332L6340
14237A24267l9473q508K0517L2541k0893l0267k0342l1687J369n097M696K2784
14225D9907M1571N4463K8170n551m835o699m3981p792L0787K553p5480L4243L8061
14212A35417j9159m0743l165p0M0486J6040N577L0925J1655j3709K674J934n0583
14199A17279k0254L5761k0639K0782M1588k0306K5161R5131R067k6330K6723O4368
14187C48331M9463O4433M3691M8435O3980Q2112J18561J22387J38140J37029J23665
14176A340227R0239Q3735J21085J01767J20032J23227N1517r858M3604j7373p6710
$$ y = [132368, 158108, 130209, 114866, 125079, 158719, 153541, 138607, 172316, 149336, 114962, 167245, 192418, 150926, 141865, 189527, 182759, 116336, 134544, 115955, 77481, 35177, 39595, 87927, 124267, 84794, 76286, 96803, 129344, 108451, 78184, 57842, 26155, 27524, 22427, 27123, 49907, 91478, 145941, 174111, 168560, 163725, 157026, 113045, 105253, 136040, 138593, 63113, 97356, 135417, 116258, 75515, 72350, 72280, 112766, 128806, 134383, 165308, 176963, 163254, 165928, 167862, 117279, 97025, 132786, 112147, 132929, 174517, 154211, 179372, 274503, 283570, 257240, 283963, 348331, 397794, 462227, 505918, 554353, 618333, 700445, 819006, 941393, 1079533, 1216562, 1340227, 1430466, 1514201, 1635286, 1737053, 1857085, 1980312, 2031829, 2021971, 2065575, 2048202, 1971492]
14165A971492k8126j2865j13351j31807j24555j43571j55147j11966j31673j57368
14155H61063j20960r584k9891n0285p3427l4281j8770n1059r894j4376o0295n3178
14143C35063L2214O39j3459k964l1274j0925N0921r288j8958j6137k1415j8699
14131B75718q282K3342P199k8932p755M214K0771J7833L350l6658p3708M0029
14119B37121l491l6771m3042P738J2913o27O5323Q606l6179r3179k7856K8611
14107A19167M0133J03027K0603n3613k9766K2324k735p940L8007m924m4234J2320
14095B12369J1258j9945k7411j3598M3784k5276k6451J1192K0126P2256l8140
14084B20164k6648k1641p638k0115k7019L4492L220m0405n1394L1075N6032j3943
$$ y = [1971492, 1943366, 1930501, 1817150, 1685343, 1560788, 1417217, 1262070, 1150104, 1018431, 861063, 740103, 730519, 700628, 650343, 576916, 542635, 523865, 472806, 462912, 448536, 388241, 335063, 367277, 367916, 354457, 351493, 320219, 309294, 360215, 350927, 331969, 315832, 294417, 275718, 267436, 290778, 297977, 269045, 261290, 265504, 286275, 304108, 307458, 270800, 197092, 237121, 233630, 196859, 153817, 161555, 174468, 173841, 239164, 247770, 211591, 118412, 90556, 119167, 159300, 262327, 282930, 229317, 199551, 221875, 219140, 211200, 249207, 244283, 200049, 212369, 223627, 203682, 176271, 162673, 206457, 181181, 154730, 165922, 186048, 258304, 220164, 193516, 171875, 164237, 144122, 117103, 151595, 154815, 114410, 63016, 94091, 150123, 136180]
14072A36180p100k5823J1650q352m377Q076J8202m6596M100J0695M471N1311l939
14059A48498q585Q893M751J2233j3119j80j9591j4036M3377j5037N916K4036O206
14046A83362J1714k453m0664l7906j7283n841M9831N4072J9961o626j8437m2984
14034A46746l7179k6331j092k1485q376K0830j1531M0986R3361L827j1023M2631
14022B31364P0615K0698m8390o4864p5957J3744J9586L6611M0634K0284m4937
14011B19388l6639K9753J4787o8445r95J8971K3277K1679N6586j9225n5858K0
13999B03299K5490j763j66p685m4077l312J5027p84j8617R195k7651k6733j3845
13986A08378r650R703N1617L0163K9860L508J2388l3535k3895o6915j1502K3983
$$ y = [136180, 129080, 103257, 114907, 106555, 102178, 110254, 128456, 81860, 85960, 96655, 101126, 152437, 148498, 139913, 148806, 153557, 165790, 152671, 152491, 132900, 118864, 162241, 147204, 153120, 177156, 183362, 195076, 192623, 151959, 114053, 96770, 90929, 140760, 194832, 214793, 208167, 189730, 146746, 109567, 83236, 82144, 60659, 52283, 73113, 61582, 102568, 195929, 199756, 188733, 231364, 301979, 322677, 274287, 209423, 133466, 147210, 166796, 203407, 244041, 264325, 219388, 182749, 212502, 227289, 158844, 157849, 176820, 200097, 221776, 278362, 259137, 203279, 203299, 228789, 227026, 226860, 219175, 175098, 171786, 186813, 186029, 167412, 176607, 148956, 122223, 108378, 98728, 108431, 160048, 190211, 220071, 223579, 235967, 202432, 178537, 111622, 100120, 124103]
13974A24103K9465l805k5432j5470J9823M9603N2324J0665l516q0327k5732K1377
13962A53078P0458P527Q284m579o6021l9071m083j153k9188n777L6977L405l5177
13949I4680J0988L6204J13647J7727m4137o8975l4710L4183l7475O861Q1974M7020
13937B57987j0908m951m3654m7717L6625L1200l5427n822l9110J654n4000p2478
13925A3399L3299J1565K9745L8124j518K4984O5303J6564m5728o668j0309K1098
13913A89858L7566k9445o3793q933Q868l1674j9257N8254L9410J899j4619M386
13901A72520j6512j0200k7187k378M0082L3507K766J4210l4673n0205m3975k1064
13889E6891l9746L4451O1019j4740q104k6053K8027K6361L7614L4531j1558l0148
$$ y = [124103, 153568, 149763, 124331, 108861, 128684, 178287, 230611, 241276, 237760, 157433, 131701, 153078, 223536, 231063, 239347, 234768, 168747, 129676, 125593, 124440, 95252, 89475, 126452, 129857, 94680, 105668, 141872, 255519, 273246, 229109, 160134, 125424, 159607, 122132, 128993, 210967, 257987, 247079, 242128, 198474, 150757, 187382, 218582, 183155, 177333, 138223, 139877, 85877, 13399, 46698, 58263, 88008, 126132, 124614, 149598, 214901, 231465, 185737, 179069, 168760, 189858, 227424, 197979, 134186, 125253, 134121, 102447, 83190, 141444, 180854, 182753, 168134, 172520, 156008, 145808, 118621, 116243, 156325, 189832, 192598, 206808, 172135, 121930, 77955, 56891, 17145, 51596, 112615, 97875, 89771, 63718, 91745, 118106, 155720, 190251, 178693, 148545]
13877A48545j8409j0485k8628L637j4734P8263N7389K8505l4863m0478k8159K9487
13865A70070R651J3353J841M6068o8940l3177L039m1199K3926M0583k3951l8941
13853A02323L0680N0668l3997k1654O3678K7116l4902n2989l4767k8815M3576
13842A10917M6668l2638N8658J8296m5910j4638L6775k0213k1254l6309q667K0770
13830A12455K7105M0473k2204k4827j987M4101L927j890J8177n3203L178K3130
13818A68435M057r341Q277K1580n2994j947M7578K1817L023k7545J6995M8512
13806B48447j2165J9880p711L3047r202l6840K2940M3925K20n0835k4776j9318
13794B07612J4615M6728l1752n9851k4058k084L5688N6172R43J9971j0630j4116
$$ y = [148545, 130136, 119651, 91023, 94660, 79926, 158189, 215578, 244083, 209220, 168742, 140583, 170070, 179721, 193074, 194915, 240983, 172043, 138866, 141905, 100706, 124632, 165215, 141264, 102323, 133003, 183671, 149674, 128020, 191698, 218814, 183912, 130923, 96156, 67341, 110917, 157585, 124947, 183605, 201901, 155991, 141353, 178128, 157915, 136661, 100352, 91685, 112455, 139560, 180033, 157829, 133002, 131015, 175116, 179043, 177153, 195330, 142127, 145305, 168435, 172492, 163151, 171428, 193008, 140014, 138067, 185645, 207462, 210485, 182940, 199935, 248447, 236282, 256162, 248451, 281498, 272296, 235456, 258396, 302321, 302541, 251706, 226930, 207612, 222227, 268955, 237203, 177352, 153294, 151210, 186898, 243070, 244013, 263984, 253354, 239238]
13782B39238l5484R269K4155M8787l6033o4990L6513j8096L0813L6028j4387l890
13770B51923j387Q878k3368q58M4067K3847p079l2608M5316K4378j2085j8433
13758C02591L943m2607l5799M41K6781m94m4034L922N6223M2257m0162J5446K3692
13745C12200k1547o3850p836M589L169L4780N183K0861K118m9137j0624q12K0183
13732B49277P912J4269K0256L6703K1029p8266n6299k178j1324Q3092j3747K498
13720B73222j6743l8196k7896L3044J2002p428q598J4919m835K1212J339m30l647
13707B47965l0406j8629k2641K962K5866k3223J8690j4990J0029L5367M9035j0312
13695B69713J4701Q56n2877L3835O6411p7220o291M7461m4084m4910J0602j2804
$$ y = [239238, 203754, 213023, 237178, 285965, 249932, 184942, 221455, 203359, 234172, 270200, 255813, 251923, 250536, 259414, 236046, 235188, 279255, 303102, 296023, 263415, 308731, 333109, 321024, 302591, 306534, 263927, 228128, 228569, 255350, 254856, 210822, 214744, 270967, 313224, 273062, 288508, 312200, 290653, 226803, 218967, 223556, 226725, 261505, 266688, 287549, 289667, 240530, 229906, 229094, 249277, 257189, 271458, 291714, 328417, 349446, 271180, 214881, 212703, 201379, 284471, 270724, 273222, 256479, 218283, 190387, 223431, 235433, 228005, 219407, 234326, 229491, 250703, 252042, 251612, 247965, 217559, 198930, 176289, 179251, 205117, 181894, 200584, 185594, 195623, 230990, 280025, 269713, 284414, 285270, 232393, 266228, 332639, 255419, 249128, 296589, 252505, 207595, 218197, 205393]
13683B05393Q73J3930M570j4849l9488J5208K9940P0386N8417l0626l9715N2160
13671C26199L1799l4887o7971k055M3320k0994J7342L3323j9925p513m2339M4824
13659C01123l234j7546M3488J1017K6207O359K2118L4986Q070j9900L9753J0096
13647D62537k6362k4742J9747J046K2590L9621j9470l9055R006Q8402k6279l0864
13635D76177J5028L3964j7486M179m014k1561O2427M7866K5662m5055m03j7935
13623E58849L1513O8748M4283R775m074J8982J09353J46983P3861J04915J50212
13612A313400J17898J56631J16461J41799J26441J86605K08623J28502J20082
13603B616442J52384K15116L15657K73874K49420K48525K26791K67221K52829
$$ y = [205393, 206266, 220196, 224766, 209917, 170429, 185637, 215577, 285963, 344380, 313754, 274039, 326199, 357998, 323111, 255140, 253085, 296405, 275411, 292753, 326076, 306151, 298638, 256299, 301123, 297889, 280343, 323831, 334848, 361055, 367414, 389532, 424518, 432588, 412688, 452441, 462537, 436175, 411433, 431180, 432226, 454816, 494437, 474967, 435912, 444918, 533320, 507041, 476177, 491205, 525169, 507683, 511862, 507848, 486287, 548714, 596580, 622242, 577187, 576784, 558849, 590362, 659110, 703393, 713168, 709094, 728076, 837429, 984412, 1058273, 1163188, 1313400, 1431298, 1587929, 1704390, 1846189, 1972630, 2159235, 2367858, 2496360, 2616442, 2768826, 2983942, 3299599, 3573473, 3822893, 4071418, 4298209, 4565430, 4818259]
13594D818259K12065K28645J70605J87894J52741Q8580J11886M0520k8349k5588
13584E957258N8602l8674j75537j88862j35702r7172j65621k43086j61575j33238
13574D676393j08378j29062k10980k97354k95262l11151k95572k37642k26553
13565B564439j94218j58729j09619j53878j40308j08449j08212k7245p4542o9664
13555A419575o9583l9734k4254n0588m0614k7008k574k9750p2360n6257j589J0807
13543A016071M8531N6925K1320M964Q6599K0718k3760j1869o2582j22161q1800
13532I52956p7843k5136n1755l9704k9439k9262n2599m6030l7177k1200k8231
13521E14580K7679K8372o9730n4399J9902N6960M0572M0133M0886l10p64k5290
$$ y = [4818259, 5030324, 5258969, 5429574, 5617468, 5770209, 5858789, 5970675, 6011195, 5982846, 5957258, 6015860, 5977186, 5801649, 5612787, 5477085, 5379913, 5214292, 4971206, 4809631, 4676393, 4568015, 4438953, 4227973, 3930619, 3635357, 3324206, 3028634, 2790992, 2564439, 2370221, 2211492, 2101873, 1947995, 1807687, 1699238, 1591026, 1563781, 1489239, 1419575, 1349992, 1310258, 1286004, 1235416, 1194802, 1167794, 1165220, 1135470, 1063110, 1006853, 1005264, 1016071, 1064602, 1121527, 1142847, 1147811, 1234410, 1255128, 1231368, 1219499, 1156917, 1034756, 952956, 875113, 849977, 798222, 758518, 729079, 699817, 647218, 601188, 564011, 542811, 514580, 542259, 570631, 500901, 446502, 466404, 523364, 563936, 604069, 644955, 644645, 643881, 618591]
13509F18591p119J4649J2591m0558l9174j7948R639q46n1639J2124K9716J9114
13497E59140k2939l0738l528q886l1740m6197p2288k1427J3391L2234L8265j3578
13485C91709j957O1767L1536k0296m6404l5042K5966q447L2978J0754j311k6794
13473D14459m3692K6554j7055m0910l4057L826K4255K8853M6124j3905J0757L857
13461D09066l5629Q5M6785L6136j5508q3789o254L9332M3889O896j8965j1803
13449D10241j7529L3108L1120K8647J1881P093k1588m276j9431j4389J7033J5537
13437D77447j903l2582n0470R555N432k2216M2925L2535M9221m8246n517n442
13425D50739N32n477k3545K8557N6551j0108j04478K9917K9108J4622K6116L7700
$$ y = [618591, 611472, 626121, 638712, 598154, 558980, 541032, 550671, 549825, 498186, 510310, 540026, 559140, 536201, 505463, 501935, 493049, 461309, 415112, 342824, 321397, 334788, 367022, 405287, 391709, 389752, 451519, 483055, 462759, 416355, 381313, 407279, 398832, 431810, 442564, 441253, 414459, 370767, 397321, 380266, 339356, 305299, 309125, 333380, 362233, 408357, 394452, 405209, 409066, 373437, 373522, 420307, 456443, 440935, 357146, 350892, 390224, 434113, 441009, 422044, 410241, 392712, 425820, 456940, 485587, 497468, 504561, 482973, 478697, 459266, 444877, 461910, 477447, 475544, 442962, 392492, 402047, 407479, 385263, 428188, 460723, 509944, 461698, 456181, 450739, 451271, 445794, 422249, 450806, 507357, 497249, 392771, 422688, 451796, 466418, 492534, 530234]
13413E30234P933L7829J1950k9889n9447k3703J2660L8412J8137k6185j0951M481
13401E11461l8322m5744l6476l0402J7962L7488j4163M2136J6769q036l8421n1104
13389C63148J8465N5395Q1887O9317K8200N205k1275K6056L3914K9858N1966l6019
13377G06117o6359j3441k2784j393k8136m9170o4563M908j0827m6219n756J8405
13365D20782k1345J7352P556l470q015K6697l8955m5877O478j4737J3018K7969
13353C87453j6146O3580L9976k1524L8364k1915m2452j5754N5725O1073j9820
13342E08560j0717R998K872k0030m2465j6q671K8031O0775n2203j1448j599l3
13329D63054M043l4397N210Q072M4461m8933J0488K9760m3577n1320m7366o200
$$ y = [530234, 538167, 575996, 587946, 558057, 498610, 474907, 487567, 525979, 544116, 517931, 506980, 511461, 473139, 427395, 390919, 360517, 378479, 415967, 401804, 443940, 460709, 452673, 414252, 363148, 381613, 437008, 518895, 588212, 616412, 621617, 600342, 626398, 660312, 690170, 742136, 706117, 639758, 626317, 603533, 602140, 574004, 524834, 460271, 465179, 454352, 408133, 402377, 420782, 399437, 416789, 424345, 420875, 412860, 439557, 400602, 354725, 361203, 346466, 359484, 387453, 371307, 434887, 474863, 453339, 491703, 469788, 427336, 411582, 467307, 528380, 508560, 497843, 507841, 510713, 490683, 448218, 448202, 439531, 467562, 528337, 476134, 464686, 463087, 463054, 467097, 432700, 437910, 445982, 490443, 441510, 451998, 481758, 438181, 386861, 339495, 333295]
13317C33295K6770J3209R361P2582K0225K9277J3738O1675K1806N010J6885J8862
13305F42695j9547m539p4918m783K7177J3391M9524K6491j6679j4548K086l5861
13293E90489l646J761Q9932P66l0325L646L6291k658k9532o1122n9702L0302L2786
13280E98988L1337O4319O8139K2655Q902N2725K3492j7458K8048L901J5083J2395
13268I12526p7264n0533r699Q1130J03521l2767l2148O4533Q5053O3142p988m9678
13256A049828J5096Q3306j0217P3027O6061K8416N7505O3376O1344Q1426J07396
13245A676564N6206J4530k838L752J1967p2812o0864p7451n2663J4089J0633J3319
13233A534432N0683L609r005j9472m150J3449r660j1444N4798O3415N9778L8913
$$ y = [333295, 360065, 373274, 382635, 455217, 475442, 504719, 518457, 580132, 601938, 606948, 623833, 642695, 623148, 618609, 543691, 538908, 566085, 579476, 629000, 655491, 638812, 624264, 626350, 590489, 586843, 588604, 678536, 679302, 648977, 652623, 688914, 686256, 656724, 595602, 535900, 566202, 598988, 630325, 694644, 762783, 785438, 794340, 847065, 870557, 853099, 881147, 885048, 900131, 912526, 835262, 784729, 775030, 856160, 959681, 926914, 894766, 959299, 1044352, 1107494, 1099506, 1049828, 1064924, 1148230, 1138013, 1211040, 1277101, 1305517, 1363022, 1426398, 1487742, 1569168, 1676564, 1732770, 1747300, 1744462, 1748214, 1760181, 1687369, 1626505, 1549054, 1496391, 1510480, 1521113, 1534432, 1585115, 1588724, 1579719, 1560247, 1556097, 1569546, 1559886, 1548442, 1603240, 1666655, 1726433, 1765346]
13221A765346K5602K5103O7461P6883J02662K4429P1524Q6963J04605J29795J07503
13210B587876Q3232J31533L0882k8314m2137m529j1071o6516J905L2389L7463
13199B752713Q1693P8035J2449L762M4783J04357J22031J79028J92582J37583
13189C709016R8862K14890L02967L15465L19270L63525L71543M00765M60342M88047
13179G044692N95175O98046Q62391J033894J123562J305283J362320J584478J853689
13170A7463530K253237K804160L427120M356116N548342P017275Q625396J0232996
13162F1728172J1437920J1564382R659856N014028k145556r543115j3753986j3629040
13154F0332661j0822375p590876n142043l584641k558207j826003j301969q54400
$$ y = [1765346, 1790948, 1816051, 1883512, 1960395, 2063057, 2087486, 2159010, 2245973, 2350578, 2480373, 2587876, 2671108, 2802641, 2833523, 2805209, 2763072, 2758543, 2747472, 2680956, 2682861, 2715250, 2752713, 2834406, 2912441, 2924890, 2928652, 2973435, 3077792, 3199823, 3378851, 3571433, 3709016, 3807878, 4022768, 4325735, 4641200, 4960470, 5323995, 5695538, 6096303, 6556645, 7044692, 7639867, 8337913, 9200304, 10234198, 11357760, 12663043, 14025363, 15609841, 17463530, 19716767, 22520927, 25948047, 30304163, 35852505, 42869780, 51495176, 61728172, 73166092, 84730474, 94390330, 99404358, 97258802, 87715687, 73961701, 60332661, 49510286, 41919410, 36777367, 33192726, 30634519, 28808516, 27506547, 26652147]
13146B6652147m34121j78986k8371P7299K16470M19098P93018J244043J622973
13137C0383570K090497K660775L379438M185011N217188O547858Q193926J0450592
13129G3108855J3239368J6559046K0059303K2855005K3905450K1515455J3486601
13122B04729083o03595j7014452k8806626l1300871k6398623j9118033j2940536
13115F8546347q817240o409317m968871l861644l032568k374024j930659j527166
13107C5624858j066422p26475l26069j3121K53131M59944O86933Q79015J107530
13098C6879324J383052J827157K458179L287909M300919N679704P330259R079391
13090G2225894J0501631J1239553J0431725P182321P74080p442648j4127679j6445418
$$ y = [26652147, 26218026, 26039040, 26010669, 26087968, 26304438, 26723536, 27516554, 28760597, 30383570, 32474067, 35134842, 38514280, 42699291, 47916479, 54464337, 62658263, 73108855, 86348223, 102907269, 122966572, 145821577, 169727027, 191242482, 204729083, 204125488, 187111036, 158304410, 127003539, 100604916, 81486883, 68546347, 59729107, 53319790, 48350919, 44489275, 41456707, 39082683, 37152024, 35624858, 34558436, 33831961, 33505892, 33492771, 33745902, 34205846, 34892779, 35771794, 36879324, 38262376, 40089533, 42547712, 45835621, 50136540, 55816244, 63146503, 72225894, 82727525, 93967078, 104398803, 111581124, 112355204, 104912556, 90784877, 74339459]
13082G4339459j4536135j0914995p649857n488219m123442l182260k592664k183912
13074B3667975j874848j512051j372784j292003j120178q97123p62834o07791
13066A4228363n06223m58905l72711l18110l52722l96277l55378l79803m42706
13057A0645528m49951l84861l73821l60128l65493l01513k61826k97605l05356
13048G544974l48118m11469l50801m20042l83455l60477l30323l25867k83810
13039D330612j56325j66546j73810j20675j60974j30955j15186n3034p0506j48024
13029C034577o4696m4607j46186j67932j09637r5574k7872l5100K5951r2L852
13018B372684L2993K4248J0492K9550J1350J3197K247n4094j05513j40353j26000
$$ y = [74339459, 59803324, 48888329, 41238472, 35750253, 31626811, 28444551, 25851887, 23667975, 21793127, 20281076, 18908292, 17616289, 16496111, 15598988, 14836154, 14228363, 13722140, 13263235, 12890524, 12572414, 12219692, 11823415, 11468037, 11088234, 10645528, 10195577, 9810716, 9436895, 9076767, 8711274, 8409761, 8147935, 7850330, 7544974, 7196856, 6785387, 6434586, 6014544, 5631089, 5270612, 4940289, 4614422, 4330612, 4174287, 4007741, 3833931, 3713256, 3552282, 3421327, 3306141, 3253107, 3182601, 3034577, 2969881, 2925274, 2779088, 2611156, 2501519, 2405945, 2378073, 2342973, 2368924, 2368832, 2372684, 2405677, 2429925, 2440417, 2469967, 2481317, 2494514, 2496761, 2442667, 2337154, 2196801, 2070801]
13007B070801j28786j16949o2130K776N0430M9133Q3346M4047K6788O4792M8123
12996B132371N0768J12503P7653R470J19327k8689o3398j44395j28336j65503
12986A971771j50126k9034k3489r4912p9601N783P3067J15229P8866L8613L2443
12975A938610M710m9716j3933j1010J0574k61Q6186J49191Q1367K6811L9162L6783
12963B298474K6892L8119j9212J8067k3603m6605j0211j10894p8167n6699q7498
12952A948663l5702l349j321k9520r1864j4634n2427l5810l2131k059K9838K2819
12940A702503O3673N5781K5831P8856J04196J09964J20468Q1531m373m8325l7417
12929B252688j07423r3661o8593q9021r8606j52283r0567o3888q3372j07492o2569
$$ y = [2070801, 1942015, 1825066, 1762936, 1765712, 1816142, 1865275, 1948621, 1992668, 2019456, 2084248, 2132371, 2183139, 2295642, 2373295, 2382765, 2502092, 2473403, 2410005, 2265610, 2137274, 1971771, 1821645, 1792611, 1769122, 1674210, 1594609, 1600392, 1673459, 1788688, 1867554, 1906167, 1938610, 1943320, 1893604, 1879671, 1868661, 1879235, 1878974, 1965160, 2114351, 2195718, 2222529, 2261691, 2298474, 2325366, 2363485, 2344273, 2362340, 2338737, 2292132, 2281921, 2171027, 2092860, 2036161, 1948663, 1912961, 1909612, 1908291, 1878771, 1786907, 1772273, 1719846, 1684036, 1651905, 1649846, 1679684, 1702503, 1766176, 1821957, 1847788, 1926644, 2030840, 2140804, 2261272, 2342803, 2338430, 2290105, 2252688, 2145265, 2051604, 1983011, 1893990, 1795384, 1643101, 1552534, 1488646, 1405274, 1297782, 1235213]
12918A235213k482n0452q478R616p261q4227k042K7249M2864k5103O912j4823
12906A126986l4586r8256l0415K5493L54j1884p0052o0403j0124J0631N0408L5553
12894I33705o1750p2422j5610M9049J4447J9116J8701m6674m7499k5829O799M1737
12882H13770k6599L2334J0865k5095j275N6324L9065K8553R4993M1284L7793P8694
12870A180706J09225N4102O8245J37236P8971N3100O527j07797j40903j57321
12860A282091q1803k6634p3149j37404o4638K2249n3376j8534K2464Q053m2867
12849H36452j2983j2851k0156j1779r3m0232j1596l7659j9313j008K4528M9963
12837G43273k0766J4010P2265Q5667R3556P9811l698O75O6382j1969l8657K6824
$$ y = [1235213, 1232731, 1182279, 1173801, 1183417, 1176156, 1091929, 1089887, 1117136, 1160000, 1134897, 1141809, 1126986, 1092400, 994144, 963729, 989222, 989576, 977692, 907640, 847237, 837113, 847744, 898152, 933705, 871955, 799533, 783923, 832972, 847419, 866535, 885236, 838562, 791063, 765234, 772033, 813770, 787171, 819505, 830370, 805275, 804000, 860324, 899389, 927942, 1022935, 1064219, 1102012, 1180706, 1289931, 1344033, 1412278, 1549514, 1628485, 1681585, 1688112, 1580315, 1439412, 1282091, 1200288, 1173654, 1100505, 963101, 898463, 920712, 867336, 848802, 871266, 879319, 836452, 823469, 810618, 790462, 778683, 778590, 738358, 726762, 689103, 669790, 668782, 693310, 743273, 722507, 736517, 808782, 894449, 988005, 1067816, 1064118, 1064793, 1131175, 1119206, 1080549, 1107373]
12825A107373J0642p201K1027K2173l1985Q757P4435L5904k526j0421J7007M243
12813A249428k477M9221R4276o993l1585J3116J7252K9886L2221L8991L0792k8278
12801A485850j6142l7645m0307m6852o1968m3271K2939j4621m3332J3270m652
12790A213269K5451N7326k0722P426l2224k268L8866J02679O1232N326J3704K1294
12778A491359N3975N8678O4349J7929l1639K6520N8326K4506O1224J6502K8583
12767A870312J5515J8242M2039M2358n460Q479K3381M4037N3475k5365n6332l5864
12755A994817K5601R1532L3466K72K6736Q4355M0155N8990Q7299J6017J3167Q6561
12743B558968N1350P667J6531L2139Q3022P7501k215L3460J24702R3484P0871
$$ y = [1107373, 1118015, 1110814, 1131841, 1154014, 1122029, 1130786, 1205221, 1241125, 1238599, 1228178, 1245185, 1249428, 1246951, 1296172, 1390448, 1383455, 1351870, 1364986, 1382238, 1412124, 1444345, 1483336, 1514128, 1485850, 1469708, 1432063, 1391756, 1344904, 1282936, 1239665, 1262604, 1247983, 1204651, 1217921, 1213269, 1238720, 1296046, 1275324, 1282750, 1250526, 1248258, 1287124, 1389803, 1451035, 1456361, 1470065, 1491359, 1545334, 1604012, 1668361, 1686290, 1654651, 1681171, 1739497, 1764003, 1825227, 1841729, 1870312, 1885827, 1904069, 1946108, 1988466, 1983006, 1991485, 2014866, 2058903, 2112378, 2087013, 2030681, 1994817, 2020418, 2111950, 2145416, 2145688, 2172424, 2256779, 2296934, 2355924, 2443223, 2459240, 2472407, 2558968, 2610318, 2617985, 2634516, 2666655, 2749677, 2827178, 2824963, 2858423, 2983125, 3076609, 3147480]
12732C147480J2863N541L8174R1146J43439R6016P7039L7687R1618J77628J55449
12721D074080J67666J79703K12730K05768K06187K42540K38467K92882L97529
12712F217552L44623L48982M69203N52501N65240O55774Q16094R62082J109898
12703A2041949J275834J446991J679737J906493K163956K551813K974414L349024
12695B9390211L882816M543755N348341O433930P915981J0056864J2863167J6473396
12687I6908461K0868444K5813842L0388800L3357690L3607505L1229448K6550123
12680B98724313J9046878Q545176l528634j4411257k3735362l0887473l5379368
12673B18374273l5533722l2631855k8335600k3531818j8080621j2456073q296614
$$ y = [3147480, 3160343, 3165884, 3204058, 3295204, 3438643, 3534659, 3611698, 3649385, 3741003, 3918631, 4074080, 4241746, 4421449, 4634179, 4839947, 5046134, 5288674, 5527141, 5820023, 6217552, 6562175, 6911157, 7380360, 7932861, 8498101, 9153875, 9969969, 10932051, 12041949, 13317783, 14764774, 16444511, 18351004, 20514960, 23066773, 26041187, 29390211, 33273027, 37816782, 43165123, 49599053, 57515034, 67571898, 80435065, 96908461, 117776905, 143590747, 173979547, 207337237, 240944742, 272174190, 298724313, 317771191, 326316367, 322787733, 308376476, 284641114, 253753641, 218374273, 182840551, 150208696, 121873096, 98341278, 80260657, 67804584, 59507970]
12666E9507970n742009m243804l419276k894820k509067k167678j836693j557421
12658C5137202j371253j109846q71002q29179p73849p90935q57772r13082j066553
12649B6553731j202705j221518j272559j298289j250343j096447j067339j015411
12641A7129120r15511q63110p82015o58462o58516n47090m83363m68621m83293
12632A1269139m25003l90051l90872m01736m18006m05635l87907l52625l20434
12623G776870l06582k72109k19055k66085k69821j83602j17864j86558j34232
12614E820962j15791j38956o6621j19808r3095k0839l0566l3851o0389j18723
12604E022323l2979q5604l7708K0145J4382O426J7024J6920L2014o433N7116Q7705
$$ y = [59507970, 53765961, 49522157, 46102881, 43208061, 40698994, 38531316, 36694623, 35137202, 33765949, 32656103, 31785101, 30955922, 30182073, 29391138, 28533366, 27620284, 26553731, 25351026, 24129508, 22856949, 21558660, 20308317, 19211870, 18144531, 17129120, 16213609, 15350499, 14568484, 13910022, 13251506, 12704416, 12221053, 11752432, 11269139, 10844136, 10454085, 10063213, 9661477, 9243471, 8837836, 8449929, 8097304, 7776870, 7470288, 7198179, 6979124, 6713039, 6443218, 6259616, 6141752, 5955194, 5820962, 5705171, 5566215, 5499594, 5379786, 5286691, 5265852, 5235286, 5201435, 5141046, 5022323, 4989344, 4903740, 4866032, 4886177, 4900559, 4906985, 4924009, 4940929, 4972943, 4966510, 5023626, 5111331]
12592E111331O0154J87150J65893J37593J94529K55140K57945K62287K28641K59067
12582G119730K66219L38670L23403K86720K04314J41279J60267K33362J73713
12573I247677J85943L18237M24985M38703M85332O11688P41354Q40851R24134
12564A4218904J187897J273605J408874J609804J907642K152210K327788K621937
12556B8708661L074381L705913M478790N439343O710816Q332802J0337628J2716451
12548H3504785J5369527J7938733J9905326K0359795J8469151J3239022M311906
12541A93098245o581865j5613387j9619026j8673220j5219277j1078831p287090
12534I9025549m179746j645891M98811K363918L932027N388935O773456P876474
$$ y = [5111331, 5171485, 5358635, 5524528, 5662121, 5856650, 6111790, 6369735, 6632022, 6860663, 7119730, 7385949, 7724619, 8048022, 8334742, 8539056, 8680335, 8840602, 9073964, 9247677, 9433620, 9751857, 10176842, 10615545, 11100877, 11712565, 12453919, 13294770, 14218904, 15406801, 16680406, 18089280, 19699084, 21606726, 23758936, 26086724, 28708661, 31783042, 35488955, 39967745, 45407088, 52117904, 60450706, 70788334, 83504785, 98874312, 116813045, 136718371, 157078166, 175547317, 188786339, 193098245, 186516380, 170902993, 151283967, 132610747, 117391470, 106312639, 99025549, 94845803, 93199912, 93698723, 96062641, 99994668, 105383603, 112157059, 120033533]
12526A20033533Q478588Q872716Q989283Q993259R040572R033944R051041R078166
12518A91571102Q709688Q024976O790008N055222K898930N18152j930518m229545
12510B17408015n987841p202568p844011p930638p629020p280324o810452o451951
12502A60271210o298978o271690o310734o247524n929012n216399m223640k959057
12494A16814176j208380O77411K782466N060507P593697J0390738J3185164J5408910
12486A70704689J6493905J5556576J1878577M794488n099097j5346039k2718269
12479A76264830k4975683k2898188j8877864j4899166j1593936r090347p316577
12472F6613069n971900m819282m006915l261588k720607k324314k004425j821197
$$ y = [120033533, 128512121, 137384837, 146374120, 155367379, 164407951, 173441895, 182492936, 191571102, 200280790, 208305766, 215095774, 220150996, 223049926, 223568078, 221637560, 217408015, 211420174, 204217606, 196373595, 188442957, 180813937, 173533613, 166723161, 160271210, 153972232, 147700542, 141389808, 135142284, 129213272, 123996873, 119773233, 116814176, 115605796, 116283207, 119065673, 124126180, 131719877, 142110615, 155295779, 170704689, 187198594, 202755170, 214633747, 219428235, 214329138, 198983099, 176264830, 151289147, 128390959, 109513095, 94613929, 83019993, 73929646, 66613069, 60641169, 55821887, 51814972, 48553384, 45832777, 43508463, 41504038, 39682841]
12464C9682841j688813j553227j404794j256386j115780j175384j186119j283270
12456B9019068j424583j459468j431789j349194j307733j195807j074556r93684
12448A8782254r70558r54817p42149o50847o62996o64043n67604n17987n56288
12439A2494965n36023m67452m28240l69666l93141m27130l67405l92003m63877
12430H650028m46581m43587m50689l25438k81722l41167l01071k81539k03384
12421E574850j46269k41922k19563j82267j53015j33915n1851j02213j65223j52769
12411D025843p5267p0962m138r017J3682N3252N5229L421o8400n9519r8736j31476
12399C633912j70669j93375j87169k00517j87280j27735j93319j90646r0099o5177
$$ y = [39682841, 37994028, 36440801, 35036007, 33779621, 32663841, 31488457, 30302338, 29019068, 27594485, 26135017, 24703228, 23354034, 22046301, 20850494, 19775938, 18782254, 17811696, 16856879, 16114730, 15463883, 14800887, 14136844, 13569240, 13051253, 12494965, 11958942, 11491490, 11063250, 10693584, 10300443, 9873313, 9505908, 9113905, 8650028, 8203447, 7759860, 7309171, 6983733, 6702011, 6360844, 6059773, 5778234, 5574850, 5428581, 5186659, 4967096, 4784829, 4631814, 4497899, 4446048, 4343835, 4178612, 4025843, 3950576, 3879614, 3875476, 3866459, 3880141, 3933393, 3988622, 3992043, 3923643, 3864124, 3765388, 3633912, 3463243, 3269868, 3082699, 2882182, 2694902, 2567167, 2373848, 2183202, 2093103, 2027926]
12389B027926N43n7536p5985K2370O5573J12576O8546O1977n581N8604J26186
12378B405199R9095J55826K37823J80803O6272n620k13580k72179k94462k62421
12368B096756j29080q1751n1201p2169n1213L906k3586L1461J21760k3342p4370
12357A747171p5383l1749L2188O1530J1299J3444Q2141K5836K3660M4873O9406
12346B004416J70320K19016J97334J89517J79860O7250J3763m5913j77219k09127
12336B609217k07670j91627j54130j93857j78552j44213o7300l6384K3566R1039
12326A550089K2431k2805m1689n098O465m0073l0433o5036M960O0478N8250k2940
12314A474599l4646M1142P0622P4157M3821J79128K24477J60348J07195r600j06763
$$ y = [2027926, 2028469, 1970933, 1894948, 1917318, 1982891, 2095467, 2164013, 2225990, 2220409, 2279013, 2405199, 2504294, 2660120, 2897943, 3078746, 3145018, 3139398, 2925818, 2653639, 2359177, 2096756, 1967676, 1885925, 1834724, 1762555, 1711342, 1715248, 1691662, 1723123, 1844883, 1821541, 1747171, 1671788, 1640039, 1672227, 1733757, 1745056, 1758500, 1840641, 1866477, 1890137, 1935010, 2004416, 2174736, 2393752, 2591086, 2780603, 2960463, 3027713, 3041476, 2995563, 2818344, 2609217, 2401547, 2209920, 2055790, 1861933, 1683381, 1539168, 1471868, 1435484, 1459050, 1550089, 1572520, 1549715, 1508026, 1502928, 1509393, 1469320, 1438887, 1373851, 1378811, 1439289, 1497539, 1474599, 1439953, 1481095, 1551717, 1625874, 1669695, 1848823, 2073300, 2233648, 2340843, 2331243, 2224480]
12303B224480k37585l47014k51700j84834o8619q1419j28625n1349n2911o5473
12293G54951R525p074l0013l2478K9701r045m3852M405L4764L6993J6858m1472
12281G23263J1151J8404n149J1908j4865r3055r2453N153L887m0624o9218l8767
12269D19635n6424j4890K7548J679L8793O2239Q173o346K4296J2583J03215R9962
12257G20463R6299J51739J19018J41217J26949J57802K04748J04524M5523N3334
12247A921616k0731j88007j41955j32917j46847k22157j52779r0907o0897l971
12237G60448j2403p1052n4302O189q4882j01392p0845o4357q1804m0571O1327
12226B46356K7294M3851o3122n9725l4319M573l0547J0198R9350K2833j2475J567
$$ y = [2224480, 1986895, 1639881, 1388181, 1203347, 1134728, 1053309, 924684, 873335, 820424, 754951, 764476, 757402, 727389, 694911, 724612, 715567, 671715, 676120, 710884, 747877, 764735, 723263, 734414, 752818, 747669, 759577, 744712, 651657, 559204, 564357, 568244, 527620, 458402, 419635, 363211, 348321, 375869, 377548, 416341, 478580, 486753, 480407, 504703, 517286, 620501, 720463, 816762, 968501, 1087519, 1228736, 1355685, 1513487, 1718235, 1822759, 1868282, 1921616, 1900885, 1712878, 1570923, 1438006, 1291159, 1069002, 916223, 825316, 764419, 760448, 748045, 676993, 622691, 628880, 543998, 442606, 371761, 307404, 225600, 185029, 246356, 273650, 317501, 254379, 194654, 160335, 164908, 134361, 144559, 243909, 266742, 254267, 255834]
12214B55834J4316k1778J5988N5638l5034m7402J0663N0592l9230p7758k4991
12203A56838k2898J7305k477n458K341K9617m5516k0664L6355J0694m982j3707
12191A37448N4491R351l0522m3931n9471K8395J1077l5876p982K9159L6467J0271
12179A38877K1456K8109k0037o4066k1556M0336K0738j0267m7243l0358k7504
12168B8485O411J1043K5015J2970m5737j7765o596M1073L5494q503O634j3989
12156G4535J5592o214k8034o604L2424M5079J4695j0735k1847q368j966j768k3765
12143G3024O969K3087j2257k6684l2613k6472P508M4245Q354O9502j077k9764
12131A03822m2351L2853M1131J2191k3026n0849J8032J443l9455K6434K3816J1603
$$ y = [255834, 270150, 248372, 264360, 319998, 284964, 237562, 248225, 298817, 259587, 181829, 156838, 133940, 151245, 148768, 143310, 145651, 175268, 129752, 109088, 145443, 156137, 151155, 137448, 191939, 201290, 170768, 126837, 67366, 95761, 106838, 70962, 62980, 92139, 128606, 138877, 160333, 188442, 168405, 104339, 82783, 123119, 143857, 133590, 86347, 55989, 28485, 34896, 45939, 70954, 83924, 38187, 20422, 13826, 54899, 90393, 81890, 88524, 74535, 90127, 83913, 55879, 49275, 81699, 126778, 141473, 130738, 108891, 100523, 98557, 96789, 73024, 79993, 103080, 90823, 64139, 31526, 5054, 12562, 56807, 65161, 134663, 133586, 103822, 61471, 94324, 135455, 147646, 124620, 73771, 91803, 93246, 53791, 80225, 104041, 115644]
12119A15644L0269J7422k7433n302j7297j9211p3276m6644Q1027R3953J0235j5553
12107A43834m793L7237M3469o529m6307M3563j672J6419K5072K1755O8684P7671
12095D18403j332O5455J8562p254J02035J47027P3831Q3899Q1965L6236n5294
12084I63533n3209p5103j35818q0330m1417o7829K1864J7981o312L7099N7868
12073F38327K5720j3505K6784J04908M9139J3023K6945N3891Q7323K5884M7010
12062A085449J4948K6326L5468M9300j5619l0800N5913K9678n2961l0630n8898
12051A108174n3984m9550j01129j9256M7356l4100j0554o3327k8961n6507m0020
12040F98142J0196L803K8020J9054q188N2171L2812K6037P2176M2810L3734N706
$$ y = [115644, 145913, 163335, 135902, 130600, 113303, 94092, 20816, -25828, 55199, 149152, 159387, 143834, 139041, 176278, 219747, 213218, 166911, 210474, 208802, 225221, 250293, 272048, 340732, 418403, 417071, 482526, 501088, 493834, 595869, 742896, 816727, 900626, 982591, 1018827, 963533, 910324, 835221, 699403, 619073, 577656, 509827, 531691, 549672, 543360, 580459, 638327, 664047, 650542, 677326, 782234, 831373, 844396, 871341, 925232, 1012555, 1038439, 1085449, 1100397, 1126723, 1162191, 1211491, 1195872, 1165072, 1220985, 1250663, 1197702, 1167072, 1108174, 1054190, 1004640, 903511, 884255, 931611, 897511, 886957, 823630, 794669, 738162, 698142, 708338, 712141, 740161, 759215, 751027, 803198, 836010, 862047, 934223, 977033, 1010767, 1016473]
12028A016473N3881O8773k950m6400j15571j60702j28179j09108j16831o7993
12018C91393n1027n9240l8358L99K1375K5135n0177Q111m9779j9563J550P3046
12006B52865J815k3158n8285K603P198l4353K1311L0367J6471o6325J4484K33
11994A65226j1039Q435j6527p2616l2924K0722O5707M613k3792k858m1251m8637
11982A5059m719K9219J5218O477n344N459l4770k0133K5286o121j2348K2818N4691
11969I0792l3059n9239m0688K1339N4938k723O840l0515N448N7743j8243k0659
11957C1974j9003j81j5836M1231L7348K463L0230N2385L4729n3122r9552m1831
11945H35K7809M3008J8870j7927o580l6453n8711j5904M3264l755q615K4317j1759
$$ y = [1016473, 1070354, 1139127, 1136177, 1089777, 974206, 813504, 685325, 576217, 459386, 391393, 340366, 281126, 242768, 243167, 264542, 289677, 239500, 247611, 197832, 178269, 179819, 252865, 254680, 231522, 173237, 175840, 183038, 148685, 169996, 200363, 216834, 150509, 164993, 165226, 154187, 162622, 146095, 73479, 40555, 61277, 126984, 131597, 107805, 104947, 63696, 15059, 10340, 39559, 54777, 61254, 55910, 61369, 26599, 6466, 31752, 25631, 13283, 36101, 90792, 57733, -1506, -42194, -20855, 34083, 31360, 38200, 7685, 13133, 70876, 52633, 31974, 12971, 12790, -3046, 38185, 75533, 77996, 108226, 160611, 195340, 142218, 42666, 835, 28644, 71652, 90522, 72595, 66015, 29562, -29149, -45053, -1789, -5544, -14159, 10158, -1601]
11932a601K2728J5785q466k8121r687j9294L8499J403l3898N0825L4897L1734
11920I4804j3961m0271l6918L3978M0332J7271p967j7705O958J2332n2082J2565
11908D9336N917l54J8282l2679p645Q9976j0431o8358j5911J8697m989O895l7185
11895A1551J0897L0637l0486J1278l1286l3839J3690K6232l2155j1938L7644M2026
11883D4251M5447j4472N283J493l2063l8848O3216j6945l7583n9626M6784M2861
11871D9798K8761L6687k1535m386J1802L400n7096K3588J896r612O8470K0898
11859A52671k6613k172L028l6861m1107k3070j2771K3724j4674m7275J3787K6432
11847A5099l5210p154O762L2149l929M2683K3677m6851r878J2688K2558J1871
$$ y = [-1601, 21127, 36912, 28446, 325, -9362, -28656, 9843, 11246, -22652, 28173, 63070, 94804, 80843, 40572, 3654, 37632, 77964, 95235, 87268, 69563, 76521, 88853, 36771, 49336, 55253, 54899, 73181, 40502, 32857, 122833, 112402, 44044, 28133, 46830, 41841, 48736, 11551, 22448, 53085, 22599, 33877, 2591, -31248, -17558, 8674, -23481, -35419, 2225, 44251, 89698, 75226, 80509, 82002, 49939, 11091, 74307, 57362, 19779, -39847, 6937, 49798, 78559, 115246, 93711, 89325, 101127, 104527, 47431, 71019, 72915, 63303, 131773, 152671, 126058, 123886, 126914, 90053, 48946, 25876, 13105, 36829, 22155, -25120, -11333, 15099, -20111, -27265, -20503, 11646, 7717, 50400, 74077, 27226, 17348, 30036, 52594, 64465]
11835F4465j5514n0102K1892j1796l6195J1959M3978m0246k2522J9378O9769Q2221
11823A37287O604n2229p3954k2706P516Q6608M0038r267k0632k6589k2878j6131
11811C3667k8465J709j910P138J2246k694K5512P707K6850j4583J9317k2884j694
11798F1916l4465j1729K0753J2241k3987K1039J8702L213j2684N4834o011o2821
11786D1001j1577R463N466k6484m1317K0850J4624p608m0372M2285j0393j7120
11774b1182J0038j1837L7286J914r35p691L6462M0911K8406m6051l037L750k9025
11761C9009q000N8888K4633j8054L360q3848n9484k9511J1648O0397O3416N5317
11749A17771r786J5170L3576k8277p6965n1598L1557J2413k674Q606K1685N993
$$ y = [64465, 48951, -1151, 20741, 8945, -27250, -15291, 28687, -11559, -34081, -14703, 55066, 137287, 143891, 91662, 17708, -4998, 2518, 89126, 129164, 119897, 99265, 72676, 49798, 33667, 5202, 6911, 5001, 12139, 24385, 21691, 47203, 54910, 81760, 67177, 86494, 63610, 61916, 27451, 15722, 36475, 48716, 24729, 45768, 64470, 67683, 54999, 109833, 103822, 41001, 29424, 38887, 44353, 17869, -23448, -2598, 12026, 4418, -35954, 6331, -4062, -21182, -11144, -22981, 14305, 16219, 15284, 7593, 44055, 84966, 113372, 67321, 64284, 68034, 39009, 31009, 89897, 114530, 96476, 99836, 15988, -43496, -73007, -61359, -962, 62454, 117771, 107985, 123155, 156731, 128454, 51489, -109, 31448, 43861, 41187, 49793, 71478, 77471]
11737G7471J8840o023n2794J9155L2093k4045M2414L5622o0116j1779j6112N5019
11725A09745K0239j0287k517j12l5484l604J6191M3968l6274J8004M2847J3998
11713A76714l4690j2315L1519O6197P358m5272k0347m3346k8658j7286o170K1137
11701I4841K2478L418j4846O003k4839n5555l30K2261J8193O99P289j9238n4891
11688E483j097N7200L7806o4191P1515J2774K0670o0776j9537J1406j0569r652
11676E1032Q897J1849J2397j3494K3154q680n2314l4951J6417K3481L2431N7000
11664A27219P087k8137M0429J0839j3945o478O8716j642q4215O035L3443j0209
11652A49142m3557k2721K0666M0870l3358q0160j9070L4751N6489n235K1637n186
$$ y = [77471, 96311, 90288, 37494, 56649, 88742, 64697, 107111, 142733, 82617, 70838, 54726, 109745, 129984, 119697, 117180, 117068, 81584, 77980, 94171, 138139, 101865, 119869, 162716, 176714, 142024, 129709, 161228, 227425, 234783, 189511, 169164, 125818, 97160, 79874, 73704, 94841, 117319, 120737, 105891, 111894, 87055, 31500, 31170, 53431, 71624, 72323, 79612, 60374, 5483, 4386, 61586, 99392, 35201, 106716, 119490, 140160, 79384, 59847, 71253, 60684, 51032, 59929, 71778, 84175, 70681, 93835, 85155, 32841, -2110, 14307, 37788, 70219, 127219, 134306, 106169, 146598, 157437, 143492, 137014, 205730, 204088, 119873, 125908, 159351, 149142, 105585, 82864, 103530, 144400, 111042, 30882, 11812, 46563, 103052, 97817, 119454, 114268]
11640A14268k4225L9444L5865M7460M658k1767q1392l2482J8137L529P286j5939
11628I4842k6449M2406K3006n8124m0520l61L8348M5904m9774O4213L9171k3002
11616A49660J6335n7993k6571r011l8224R823j4079J2555K4915J1225k172J4291
11604I0754j9520k53K5455K5057n5622o6536L7894J7094l0034l4735J7771m1855
11592c4530N4629M4400l1575K191j4057L4814j2326K6808j0779K547P195L0304
11580I9621K406K2876L8076m0867p5466L637N1258O0036J3559r77K4964l0217
11568A68906o4586J6156L271o5801l6839K8505l679k557M6731M7165k700j8578
11556A15994L2691K5778J7248k9321j5005J1043j7084M3430O0079k5151r638j6980
$$ y = [114268, 90043, 129487, 165352, 212812, 217470, 195703, 114311, 81829, 99966, 103495, 110781, 94842, 68393, 110799, 133805, 75681, 35161, 34800, 73148, 119052, 69278, 133491, 172662, 149660, 165995, 108002, 81431, 72420, 34196, 44019, 29940, 42495, 67410, 78635, 76463, 90754, 71234, 70981, 96436, 121493, 65871, -665, 37229, 54323, 24289, -10446, 7325, -34530, 20099, 64499, 32924, 35115, 21058, 55872, 43546, 70354, 59575, 62122, 69317, 99621, 102027, 124903, 162979, 122112, 46646, 50283, 101541, 161577, 175136, 174159, 199123, 168906, 104320, 120476, 123747, 57946, 21107, 49612, 45933, 43376, 90107, 137272, 134572, 115994, 148685, 174463, 191711, 162390, 147385, 158428, 141344, 184774, 244853, 219702, 210064, 193084]
11544A93084K5940j5850l3656k8085l0243j2179J0316J6962M324K6191P4042l632
11532B27214j794K5400L974j9745k7226m1647J1890l4018J0336L4053k5031K974
11520A66380J6166K718j1976J3027j0160j2387L6978k1226n493K1419K1301J8973
11508B35720N2301M554K7797K6897q870n1019m4120Q8658J5298M0886N1361Q5114
11496E24577L0245K7995P0445Q0997P9624l7187n7263n9841r7256j04923k6520
11485D30893j6896o666k6781j744M5580j7504n8376l2104n163q463j4294l169
11473B85313K9812M6026M9077M469q383K012M6959k6429k3931J9503N2007N9385
11461E35820J47876J18632J30196R7969R0681P5778J1524m2387r4580j35760j10797
$$ y = [193084, 219024, 203174, 169518, 141433, 111190, 99011, 109327, 126289, 130613, 156804, 230846, 227214, 225420, 250820, 254794, 235049, 207823, 166176, 178066, 144048, 154384, 188437, 163406, 166380, 182546, 185264, 173288, 186315, 176155, 163768, 200746, 179520, 174027, 195446, 216747, 235720, 288021, 292575, 320372, 347269, 338399, 287380, 243260, 331918, 347216, 388102, 439463, 524577, 554822, 582817, 653262, 734259, 813883, 776696, 719433, 659592, 562336, 457413, 430893, 413997, 407331, 380550, 378806, 424386, 406882, 348506, 316402, 311239, 302776, 288482, 285313, 315125, 361151, 410228, 414697, 406314, 408326, 455285, 428856, 404925, 424428, 476435, 535820, 683696, 802328, 932524, 1030493, 1121174, 1196952, 1208476, 1166089, 1071509, 935749, 824952]
11450H24952r0897q0757j05266r9311l4773l1316j8346l7998m4003P883N3185
11439C43353K2108k6120j5965j1219L4516j3386J7690M6298j0665l8849N4881
11428D02642N1149L3851Q5067j0225K1084L5332l5112O1029J6245Q333N0668m2301
11416F77762p5364l8212r1853q5262M71k8921m8697L8095M362q0109J1235j0860
11404B72647m1650M4051M9757L5497J477n3124L3274M4253m3662o282K0368Q140
11392C64746r818n0138l8353k6348k6422j2660l6414m1004N8639O8519L5712R042
11380B95501n6491p0803p572J5738Q340N3907Q331m094K923q288n9664p4175L0764
11367A34417L5831J6149K3455J3648K4004K451n723k0702R041J9708J6159J3827
$$ y = [824952, 734055, 653298, 548032, 448721, 413948, 382632, 364286, 326288, 282285, 290168, 343353, 365461, 339341, 323376, 312157, 346673, 333287, 350977, 397275, 386610, 347761, 402642, 453791, 487642, 572709, 562484, 583568, 618900, 583788, 644817, 661062, 669395, 720063, 677762, 602398, 564186, 472333, 387071, 387542, 358621, 309924, 348019, 352381, 272272, 283507, 272647, 230997, 275048, 324805, 360302, 361779, 308655, 341929, 386182, 342520, 336238, 356606, 364746, 354928, 304790, 266437, 240089, 213667, 201007, 164593, 123589, 182228, 250747, 286459, 295501, 239010, 168207, 160635, 176373, 184713, 238620, 246951, 242857, 245780, 237492, 177828, 103653, 134417, 170248, 186397, 209852, 223500, 247504, 249955, 244232, 223530, 232571, 252279, 268438, 282265]
11355B82265j8581K9769P916L086L9458k883J209l9878o0947l1414n507j4186
11343A90307l3098J3029Q7299O8602L2613J0385q394L0560j3889j4079o6J7770
11331C81039M7838o554j5678j8121R041L5698m7466n7109l5790J9099J2802r985
11319C14814N8325M4613R576j3562m8296k6511L446j2901q440j8242J8671J168
11307C22661q3093N0392O9658K4919J1758m0964K9494P1204j5038q562n296J807
11295D28940J07088M5944P304m3881n5356n5234l9892o9151M1145P937n7635k674
11283C14535L2531j2554n8497j4097J1613k2655L4535K6094r093m4679L410j7463
11271B43680P336k1687M1345P1771K4285L775J8667O624R470J1955J3934J3597
$$ y = [282265, 263684, 293453, 301369, 304455, 343913, 341030, 342239, 302361, 241414, 210000, 204493, 190307, 157209, 170238, 257537, 326139, 358752, 369137, 360743, 391303, 377414, 363335, 363269, 381039, 428877, 422323, 406645, 388524, 397565, 433263, 385797, 328688, 292898, 311997, 324799, 314814, 373139, 417752, 427328, 413766, 365470, 338959, 342405, 329504, 321064, 302822, 321493, 322661, 239568, 289960, 359618, 384537, 396295, 355331, 384825, 456029, 440991, 432429, 427133, 428940, 536028, 581972, 589276, 545395, 490039, 434805, 394913, 325762, 366907, 374844, 317209, 314535, 347066, 334512, 276015, 261918, 273531, 250876, 285411, 311505, 302412, 257733, 261143, 243680, 251016, 229329, 270674, 342445, 366730, 370505, 389172, 395796, 405266, 417221, 431155, 444752]
11259D44752J9818k6183l3250k3204r01K1474K2722M929J635m1162j4762J3730
11247C89598j3079l1597m3437j225P87L9753N5436P648l7815p7997K9198K2940
11235C40210J4136J5671Q572J8485o557N371K2700L0439q800J7572N009k63m832
11222D57713m0104J6845l3489K7994O7573J1721q479J9446M4746j2312j0586j1659
11210E29409l4225o891L9233K3050K8603K7028P040n16r957L4828R540p112k9337
11197F10693Q22K0028M5379L4191L9081J04797Q3201K0416K5570J9060N3091N8408
11185A114737Q9079J42387J28451L4111R400q3990j05158j23394o1922M3558j2629
11174A174630J2279N4655N2895j9783L0739P478J6657L7261J07049J0202L7672
$$ y = [444752, 464570, 438387, 405137, 381933, 381032, 402506, 425228, 430157, 431792, 390630, 375868, 389598, 376519, 344922, 301485, 300260, 301047, 340800, 396236, 403884, 366069, 288072, 317270, 340210, 354346, 370017, 378589, 397074, 390517, 395888, 418588, 449027, 440227, 457799, 462808, 462545, 457713, 417609, 434454, 400965, 428959, 496532, 508253, 499774, 519220, 563966, 551654, 541068, 529409, 495184, 488293, 527526, 550576, 579179, 606207, 613247, 612731, 602774, 637602, 647142, 640030, 610693, 611515, 631543, 676922, 711113, 750194, 854991, 938192, 958608, 984178, 1003238, 1056329, 1114737, 1203816, 1346203, 1474654, 1508765, 1518165, 1434175, 1329017, 1205623, 1143701, 1187259, 1174630, 1186909, 1241564, 1294459, 1274676, 1305415, 1312893, 1329550, 1366811, 1473860, 1484062, 1521734]
11163A521734Q3886O6876o04m0301j6030P4653O7635N8064O3696N4691Q3281O1345
11151B078926J2615l8645l3576r632L173K8677M2805N8261P5926M5428L6564N0351
11139B350873J01241R3579P8608Q8676O4814K1871k666r551O1353J3553k8150
11128B834201N3640Q5737J07760P6546N7507P1759P6548M2594k1328r052m3019
11117C332893M6448P1616Q3138P7332J30423J31459R4461J02818J51095J09758
11107D331441J87011J67683J53471K27723K43287K14879K79948L35991L44145
11098F485579M02050M81619N87171O56343O82348P89009R50193J073387J230012
11089A3337711J397204J519777J835800K308410K943511L687007M695920N941369
$$ y = [1521734, 1605620, 1672496, 1671892, 1631591, 1615561, 1690214, 1757849, 1815913, 1879609, 1934300, 2017581, 2078926, 2091541, 2052896, 2019320, 2009688, 2012861, 2041538, 2084343, 2142604, 2218530, 2263958, 2300522, 2350873, 2452114, 2545693, 2624301, 2712977, 2777791, 2799662, 2796996, 2787445, 2848798, 2862351, 2834201, 2887841, 2973578, 3081338, 3157884, 3215391, 3287150, 3363698, 3406292, 3384964, 3375912, 3332893, 3379341, 3450957, 3534095, 3611427, 3741850, 3873309, 3967770, 4070588, 4221683, 4331441, 4518452, 4686135, 4839606, 5067329, 5310616, 5525495, 5805443, 6141434, 6485579, 6887629, 7369248, 7956419, 8612762, 9295110, 10084119, 11034312, 12107699, 13337711, 14734915, 16254692, 18090492, 20398902, 23342413, 27029420, 31725340, 37666709]
11081C7666709P524937R401182J1219854J2535706J2799017J1029463O084253
11074A08261121k228983j1402897j6569391j5785326j1891763q126102n350243
11067C6906416l461499k249757j302798n62656r4854J56317K19558J47494O5321
11058B9823542Q6005K01735N40455R26129J420961J896631K426630K949561L774116
11049D4045765M886708O152861P847629J0111557J3215915J6837495K0524370
11042A23622300K3595451K4864191K2446056J3904826j687399k0008392l2389455
11035A54347578l3432666k6409664j8227199j2116216q102853n504213l765800
11028D6788967k524662j656597j129020q83938p41922r05167j057283j091320
$$ y = [37666709, 45191646, 54592828, 65812682, 78348388, 91147405, 102176868, 108261121, 106032138, 94629241, 78059850, 62274524, 50382761, 42256659, 36906416, 33444917, 31195160, 29892362, 29329706, 29234852, 29391169, 29610727, 29758221, 29823542, 29909547, 30111282, 30651737, 31577866, 32998827, 34895458, 37322088, 40271649, 44045765, 48932473, 55085334, 62932963, 73044520, 86260435, 103097930, 123622300, 147217751, 172081942, 194527998, 208432824, 206745425, 186737033, 154347578, 120914912, 94505248, 76278049, 64161833, 56058980, 50554767, 46788967, 44264305, 42607708, 41478688, 40594750, 39852828, 38947661, 37890378, 36799058]
11020C6799058r18402n70477l6401L27900N73434Q06106J120598J528870K120513
11011D1751199K867017L797193N070258O649573Q248243R747100J0548434J0008748
11003I8687765P072698R99244p320604j4540706j6671536j4065622j0137740o974135
10995C7049364m797739l356474k430628j784474j403079j102961q57979q14029
10987B0502001q59467r97297j119893j072269j014738q47497o23063m52055l20826
10978A3194896l37035l30455m55855m85015n38849o18586n89116o00610n59109
10969H680266m88310m23367l93913l60260l43482l07544k94098l06161k88187
10960E474944k67975k17820k00258j55395k06416j66675j42467j07244k9269n2762
$$ y = [36799058, 35880656, 35310179, 35273778, 35601678, 36175112, 36981218, 38101816, 39630686, 41751199, 44618216, 48415409, 53485667, 60135240, 68383483, 78130583, 88679017, 98687765, 105760463, 106759707, 99439103, 84898397, 68226861, 54161239, 44023499, 37049364, 32251625, 28895151, 26464523, 24680049, 23276970, 22174009, 21316030, 20502001, 19642534, 18645237, 17525344, 16453075, 15438337, 14590840, 13967777, 13515722, 13194896, 12857861, 12527406, 12071551, 11586536, 11047687, 10429101, 9839985, 9239375, 8680266, 8191956, 7768589, 7374676, 7014416, 6670934, 6363390, 6069292, 5763131, 5474944, 5206969, 4989149, 4788891, 4633496, 4427080, 4260405, 4117938, 4010694, 3981425, 3928663]
10950C928663o1249j42908j67253j03905l3417n0301l1371j03087r3126j15815
10940C026231j22813j15730j19124j34175j15636r2146j38993q1917k4699r7700
10930A983298r4529o7842j7858j13j9861n0033j9731n9885m1502r925L7125L5569
10918A674713O3051L0341M94J9179K6397k8223k5451P767O2263q773n8481q049
10906A755228l471o993q7124q2994o6249n9492m7569o5344k2401l5523m3965r0902
10894A143201q705j5383m480k2213j29745q31J9495K8838Q8149O2372J04869O2211
10882A327778P06L3063M6939K4291O8322L0139K9324P9565O4679Q8123Q2645P4720
10870A950294O9172M7961k5070l232n607m0063m68n5976j4157n1914n9330r3072
$$ y = [3928663, 3867414, 3724506, 3557253, 3453348, 3419931, 3369630, 3338259, 3235172, 3142046, 3026231, 2903418, 2787688, 2668564, 2534389, 2418753, 2326607, 2187614, 2105697, 2080998, 1983298, 1888769, 1820927, 1803069, 1802956, 1783095, 1733062, 1713331, 1653446, 1611944, 1602019, 1639144, 1674713, 1737764, 1768105, 1768599, 1787778, 1814175, 1785952, 1760501, 1768268, 1830531, 1821758, 1763277, 1755228, 1751757, 1744764, 1657640, 1574646, 1508397, 1448905, 1401336, 1335992, 1313591, 1278068, 1234103, 1143201, 1134496, 1119113, 1114633, 1092420, 962675, 961844, 981339, 1010177, 1098326, 1160698, 1265567, 1327778, 1328484, 1361547, 1408486, 1432777, 1501099, 1531238, 1560562, 1640127, 1704806, 1792929, 1875574, 1950294, 2019466, 2067427, 2042357, 2039125, 2033518, 1993455, 1992987, 1937011, 1922854, 1870940, 1811610, 1718538]
10858A718538m7550m207j6465l0284n1910P4469R745j3142L9394O4506Q2592K8961
10846A854647Q5331O5089O5714P4682L1173O2725J2471M9465K5632K3964o38j1948
10834B338307O5099J10456R5723Q3490Q8660Q3284r881m719n4735q0859p755m9084
10822B657986j01126o0078p9728k4687J693L0878P356K892L5450j737P61R1816
10810B561476Q7053m5942k2435L0585J48498O0868k0360j3434O85k5933l1408
10799B729653M5703R2007M8963J8048N0419N1395N6907O7413M5822N8287O6752
10788C331369P910P3745P0076M5830M0079N8371K5518O5032J45966M3615P7098
10777C984609M6039Q8007O7043O320M742J16233J54828J45212J37868L9855P1019
$$ y = [1718538, 1670988, 1666781, 1650316, 1620032, 1568122, 1642591, 1652336, 1639194, 1678588, 1743094, 1825686, 1854647, 1939978, 2005067, 2070781, 2145463, 2176636, 2239361, 2251832, 2301297, 2326929, 2350893, 2350255, 2338307, 2403406, 2513862, 2609585, 2693075, 2781735, 2865019, 2855138, 2850419, 2795684, 2714825, 2707070, 2657986, 2556860, 2496782, 2417054, 2392367, 2394060, 2424938, 2432294, 2435186, 2470636, 2468899, 2469660, 2561476, 2648529, 2602587, 2580152, 2610737, 2759235, 2820103, 2799743, 2786309, 2786994, 2761061, 2729653, 2775356, 2867363, 2916326, 2934374, 2984793, 3036188, 3093095, 3160508, 3206330, 3264617, 3331369, 3339279, 3413024, 3483100, 3528930, 3569009, 3627380, 3652898, 3717930, 3863896, 3907511, 3984609, 4030648, 4118655, 4185698, 4192018, 4196760, 4312993, 4467821, 4613033, 4750901, 4790756, 4861775]
10766D861775J50891J64354J28447J76331J47213J43088J52685J92154K14248
10757F331186K69946K31727K49604L16795L03470K93153L60542L42686L68904
10748I068013M85800M68192M60418N13402O53287P39213P49316Q81208R88179
10739A5007028J092019J266395J446932J572799J804717K026810K235593K507964
10731B8960257K912803L350944L863241M491512N227364O123262P214944Q463870
10723G0608197R879757J1360919J2747176J3731376J3946117J3062514J0707426
10716A56043482O769364J616510l714654p840283j0198652j0437694r228928p258452
10708A15750693m963704k778075o89744J150989K739500M154645N249491N945798
$$ y = [4861775, 5012666, 5177020, 5305467, 5481798, 5629011, 5772099, 5924784, 6116938, 6331186, 6601132, 6832859, 7082463, 7399258, 7702728, 7995881, 8356423, 8699109, 9068013, 9553813, 10022005, 10482423, 10995825, 11649112, 12388325, 13137641, 14018849, 15007028, 16099047, 17365442, 18812374, 20385173, 22189890, 24216700, 26452293, 28960257, 31873060, 35224004, 39087245, 43578757, 48806121, 54929383, 62144327, 70608197, 80487954, 91848873, 104596049, 118327425, 132273542, 145336056, 156043482, 162812846, 164429356, 160714702, 152874419, 142675767, 132238073, 123009145, 115750693, 110786989, 108008914, 107319170, 108470159, 111209659, 115364304, 120613795, 126559593]
10700A26559593O157163N770599M890283L735194K678499K068808K289574L402761
10692A57552474N058600O692256P959274Q534145P964761O231856L230307n01637
10684B02722036m175929p089336q697109q704556p479096n649891l853160k473706
10676A54599253j725671j803458k564164l805547n030995n646701n475849m738029
10668A23808839l485784j932334j59771J655825L337058M920331O338690P363215
10660A41846069P854712P436706N971322L440578n9338m160975q310168j1477926
10652A42540980j3078571j3089810j2042665j0561227r025715p632055o448536
10645G0662401n546745m788999m186480l731740l253226k913386k575365k290480
$$ y = [126559593, 132716756, 138487355, 143377638, 147112832, 149791331, 151860139, 154149713, 157552474, 162611074, 169303330, 177262604, 185796749, 193761510, 199993366, 203223673, 202722036, 198546107, 191456771, 182759662, 174055106, 166576010, 160926119, 157072959, 154599253, 152873582, 151070124, 148505960, 144700413, 139669418, 134022717, 128546868, 123808839, 120323055, 118390721, 118230950, 119886775, 123223833, 128144164, 134482854, 141846069, 149700781, 157137487, 163108809, 166549387, 166490049, 162329074, 154018906, 142540980, 129462409, 116372599, 104329934, 93768707, 84742992, 77110937, 70662401, 65115656, 60326657, 56140177, 52408437, 49155211, 46241825, 43666460, 41375980]
10637D1375980k106338j817547j621428j448017j269631j217291j129140j089029
10629B9677559j167857j106930j081311r88426r79395j038622j113003j100821
10621B1101194r74948q67019q61042p68999p05113o89294p06759o92215o99163
10612A4136642o43804o22133n79356m88047m07915l82685k59670j87909j49355
10603A0415768q9469j39299j71229j19752j78341k46382k06754j99986j10721
10594H953835k6214l6679P4800P9355j1333j17677r8235m3022j31095k71826m91577
10583G880332n00093l90353k52856j70133j43952j78180j36522o2552o6490p4208
10573E904993j21494l9139J66j8010n1449p2639j05440j21025j22261j26915j55284
$$ y = [41375980, 39269642, 37452095, 35830667, 34382650, 33113019, 31895728, 30766588, 29677559, 28509702, 27402772, 26321461, 25333035, 24353640, 23315018, 22202015, 21101194, 20126246, 19259227, 18398185, 17629186, 16924073, 16234779, 15528020, 14835805, 14136642, 13492838, 12870705, 12291349, 11803302, 11395387, 11012702, 10753032, 10565123, 10415768, 10326299, 10187000, 10015771, 9896019, 9717678, 9471296, 9264542, 9064556, 8953835, 8927621, 8890942, 8965742, 9045097, 9033764, 8916087, 8817852, 8774830, 8643735, 8371909, 7880332, 7380239, 6989886, 6737030, 6566897, 6422945, 6244765, 6108243, 6045691, 5979201, 5904993, 5783499, 5744360, 5744526, 5726516, 5675067, 5602428, 5496988, 5375963, 5253702, 5126787, 4971503]
10562D971503p3403p4316j3807o3701r3787n2097o6353j21451q4402m1910m7967
10551D238309K6133K3010P3157J25899J57973R0232J15142Q2593L9049m854j03113
10540D863530j46075j48986j32804j80990k02098k09170j80711j28244j17635
10531C416817j26967j06094j05750j06679n8580j11016r4966l0653l0235q4060
10521B561817j2235m9503m2756l3588l5512J9174J5205K100l2247P779O4142q455
10509B455921j4351j5555J8678j32k4704J9671J2460K6440k3255j8657q4337m8741
10497B303438k291l3685n3119o9030p7436m8425o4348l5547l9643l2226L544L9108
10485A890340K1094L5380j7800J798O74p8783r2000m9686q5444k2786M4312K15
$$ y = [4971503, 4898100, 4823784, 4809977, 4746276, 4652489, 4600392, 4534039, 4412588, 4328186, 4286276, 4238309, 4264442, 4287452, 4360609, 4486508, 4644481, 4734713, 4849855, 4932448, 4971497, 4966643, 4863530, 4717455, 4568469, 4435665, 4254675, 4052577, 3843407, 3662696, 3534452, 3416817, 3289850, 3183756, 3078006, 2971327, 2912747, 2801731, 2706765, 2676112, 2645877, 2561817, 2549582, 2500079, 2457323, 2423735, 2388223, 2407397, 2422602, 2424702, 2392455, 2400234, 2464376, 2455921, 2441570, 2426015, 2444693, 2444561, 2419857, 2439528, 2451988, 2478428, 2455173, 2436516, 2352179, 2303438, 2301147, 2267462, 2214343, 2145313, 2067877, 2019452, 1955104, 1919557, 1879914, 1847688, 1851232, 1890340, 1911434, 1946814, 1929014, 1930812, 1931486, 1852703, 1760703, 1711017, 1625573, 1602787, 1647099, 1647314]
10473A647314m8427k1007J926J3609J6575j649m490k4082j0328R005j4300l7730
10461A526416J5364m090j7229j41646m5398M0229J1304n3755p2197k3161Q946
10450A244783m4482m6698K543J9925J2622R745J0597J19028J52514M5598M2876
10439A569051R2573R0376J52573P2685K7914p7141j68725j28135l2384j5570n6722
10428A526495l9711o1162p9394m7128p9336l1443j9601j1454L4900K9714l8739
10417A183141k998L2859L7715L3509k5996j3054k2229k587R157J7633N4361k3627
10405A277884q5282R895L2008P2715j6164K687j3073J3534K9430J6908R5471N7010
10393A493023L201P4729K1647L1899n6781j45106j74519j24332n6253o7521o7118
$$ y = [1647314, 1598887, 1577880, 1579806, 1593415, 1609990, 1608341, 1603851, 1579769, 1569441, 1578446, 1564146, 1526416, 1541780, 1537690, 1520461, 1378815, 1333417, 1373646, 1384950, 1331195, 1258998, 1235837, 1244783, 1200301, 1153603, 1156146, 1176071, 1188693, 1198438, 1209035, 1328063, 1480577, 1526175, 1569051, 1661624, 1752000, 1904573, 1977258, 2005172, 1928031, 1759306, 1631171, 1598787, 1583217, 1526495, 1486784, 1425622, 1346228, 1299100, 1219764, 1188321, 1168720, 1157266, 1192166, 1221880, 1183141, 1180143, 1213002, 1250717, 1284226, 1258230, 1245176, 1222947, 1220360, 1229517, 1247150, 1301511, 1277884, 1192602, 1202497, 1234505, 1307220, 1291056, 1293743, 1280670, 1294204, 1323634, 1340542, 1436013, 1493023, 1496224, 1570953, 1592600, 1624499, 1567718, 1422612, 1248093, 1123761, 1067508, 999987, 932869]
10382I32869m0892M1194J4961k7019L0733M7257K4599N6583M3459j2812K4389
10371A135321K6922o511r759l1844m2825p4529o8028p5548l6543m6655k9251p6217
10359F64533p1678k6704K5050k0527m8771m2495l5167M5353K4702P9900K0686
10348F14882j4513k5889m6137m480J3207j3949n5519p6295n2665N306J4753r275
10336C49426J6333J0053R874o999M1098L0814L6733k0561n4275k5349j9866k6056
10324C41225m7074J4785k0882j11463J0975M3061p59l7903k8213K5257L1101K1634
10312B41744M0569l8832KP2000p593K7270N7667N5491j518k8529J728N3713O7708
10299E41420M6134L0142l870N1647M9251M5036M2658N4392M8974o3159J8260L6068
$$ y = [932869, 891977, 933171, 948132, 921113, 951846, 999103, 1023702, 1080285, 1123744, 1110932, 1135321, 1162243, 1155732, 1145973, 1114129, 1071304, 996775, 928747, 853199, 816656, 770001, 740750, 664533, 592855, 566151, 591201, 570674, 521903, 479408, 444241, 489594, 514296, 594196, 614882, 600369, 574480, 528343, 523863, 537070, 523121, 467602, 391307, 338642, 343948, 358701, 349426, 365759, 375812, 385686, 378687, 419785, 450599, 487332, 466771, 412496, 387147, 367281, 341225, 294151, 308936, 288054, 176591, 187566, 230627, 229868, 191965, 163752, 189009, 220110, 241744, 282313, 243481, 243483, 315483, 307890, 335160, 392827, 448318, 446800, 418271, 419999, 473712, 541420, 587554, 617696, 613826, 665473, 714724, 759760, 802418, 856810, 905784, 842625, 860885, 896953]
10287H96953j9875o8704j17959m5763j2188M0524K814L4241J6722J6787q84M4605
10275G87273M3580O0518M541j1423J195j2596r678L3920N9049K1083L2775N2158
10263A062395L3064m473m5207K73O5533J5787p0389o3567o0935K5904J1799l1012
10251I39172L5661J9424o9197L409O703j5201m3941p4223n7288j00361j4592L6271
10239F65837K6153Q836L573M4109L4043M4845N1915M4211l1808k8747k5171n0079
10227G87717p3693o3583k3182O708p5025j47599l9862Q667k4912n0051m8366R375
10215B66194K9930l5742n8903j9464K9385k020n5627N684O799L2516p045l2467
10203A59240p422O9308J6316J4263m164j6807j5872k2143n2333m8151q396l8216
$$ y = [896953, 877078, 808374, 690415, 644652, 632464, 672988, 675802, 710043, 726765, 743552, 742668, 787273, 830853, 891371, 895912, 884489, 885684, 873088, 863410, 897330, 956379, 977462, 1010237, 1062395, 1095459, 1090986, 1045779, 1046052, 1111585, 1127372, 1056983, 993416, 932481, 958385, 970184, 939172, 974833, 994257, 925060, 928469, 935172, 919971, 876030, 801807, 744519, 644158, 629566, 665837, 691990, 700826, 704399, 748508, 782551, 827396, 879311, 923522, 891714, 862967, 837796, 787717, 714024, 650441, 627259, 633967, 558942, 411343, 371481, 380148, 355236, 305185, 256819, 266194, 296124, 260382, 201479, 182015, 211400, 209380, 153753, 159437, 166236, 198752, 191707, 159240, 151818, 221126, 237442, 251705, 247541, 230734, 214862, 192719, 140386, 92235, 83839, 45623]
10191D5623O531J8616K8688J5498q205m3855P557j8345j86N7720K4997J3743L8601
10178A86983p974J1946n7539l9731l1441l1036L3109R33Q687L5327O680m5664
10166G0280M5791M5848l2571q2879P452O3560K0046K0151l1240q1810m293K1598
10154F1933J6631j1781j6205q5375l7990L0607J6589Kq311J9220k2196J4083M7784
10141B4991L1418M573M6038R6013o108o8435o1421l1587j6066L0833Q6512J9460
10129A56221m803L053N528K1414l5889o4257j7643j1171K9589o2209o4013J6252
10117b7928N5908L3252O133m1054M847K2901n3122L2628M2754R974p231R517m5379
10104D3200l6617J0869O2508j6924l281o132N9529K4064R890l2805N553L111J8549
$$ y = [45623, 52154, 70770, 99458, 114956, 106751, 62896, 70453, 52108, 51922, 109642, 134639, 148382, 186983, 179009, 190955, 133416, 93685, 62244, 31208, 64317, 65250, 73937, 109264, 115944, 70280, 116071, 161919, 129348, 46469, 53921, 117481, 137527, 157678, 126438, 44628, 40335, 61933, 78564, 66783, 50578, -34797, -72787, -42180, -25591, -25589, -33900, -14680, -36876, -22793, 24991, 56409, 60982, 107020, 203033, 196925, 128490, 67069, 35482, 19416, 50249, 136761, 156221, 151418, 154471, 159999, 181413, 145524, 81267, 63624, 52453, 82042, 19833, -44180, -27928, 27980, 61232, 67365, 26311, 31158, 54059, 937, 33565, 76319, 86293, 79062, 88579, 43200, 6583, 17452, 79960, 63036, 59755, 53623, 113152, 137216, 147106, 114301, 119854, 122965, 141514]
10091A41514k8745m7955m5746r392o16j5310M0945L6261l6151J3827M4674j0962
10079H2344M417m462j4055K8661J9085k5660N916J757m9336j1028q848r274M748
10066B4265R4225k8894k4575J5969M9963L3178P944m4422o2997Q737P2999N5562
10054B01954j9863j549O1916J1100j2092N2783j882L629K5383J1028l123K9291
10042C58575K0502N7356P2493J36561J72468K11797K38645L01102K15622P100
10032A792221l26746m68491l11103j53909q2994r456j5389l3660n3741n4921K2439
10021C04250M6745j8566J2305K4407n2162r7766J422m1837j4753J3922J6682j6123
10009A78526j8264J9543M4962j2577n254K5980j1891o5893K829L6803j3581m7769
$$ y = [141514, 112769, 64814, 19068, 9676, 9060, -6250, 34695, 70956, 34805, 48632, 93306, 82344, 86761, 82299, 68244, 96905, 115990, 90330, 96246, 98003, 48667, 37639, 28791, 19517, 24265, 118490, 89596, 65021, 80990, 130953, 164131, 172075, 127653, 64656, 73393, 146392, 201954, 182091, 180542, 242458, 253558, 241466, 294249, 292367, 295996, 321379, 332407, 329284, 358575, 379077, 436433, 508926, 645487, 817955, 1029752, 1268397, 1569499, 1785121, 1792221, 1465475, 996984, 685881, 531972, 448978, 439522, 424133, 390473, 336732, 281811, 304250, 350995, 332429, 344734, 369141, 316979, 219213, 220635, 178798, 164045, 177967, 194649, 178526, 160262, 179805, 224767, 212190, 206936, 232916, 221025, 155132, 157961, 194764, 181183, 133414]
9997A33414j5539K1851j3392k2897K6499M6433m2314j5706J372l7792J7739L8188
9985A37856O6836L2137p318n3642J1015j883l8273j2366j5205K663M5644J4642
9973A82106M0049J8985k5491O1628q035m0285j2251M671R825J686l7609K2917
9961B18196j240j456l2983l2469R505l3921k3681J3412K9715Q394N9380M0736
9949B53588P18l9085J8799P6932K8124L1606k1261M5194O2170K1608M5948L2778
9937E57119M5428O9951n371m0094O3141J19910R8011Q5691J80828J20177P2081
9926A366872J65960K36563K17172K65213K87271L72168N05940N55910O49146P27999
9916E350214P36701O79223N84397M09615L45661L82861M62251N83376O49447M94012
$$ y = [133414, 117875, 139726, 126334, 103437, 129936, 176369, 134055, 118349, 119721, 81929, 99668, 137856, 204692, 236829, 229511, 175869, 186884, 185001, 146728, 134362, 119157, 121820, 167464, 182106, 222155, 241140, 215649, 277277, 269242, 228957, 216706, 221377, 231202, 232888, 195279, 218196, 216956, 215500, 182517, 150048, 159553, 125632, 101951, 115363, 145078, 153472, 212852, 253588, 254306, 215221, 234020, 310952, 339076, 370682, 349421, 394615, 456785, 478393, 524341, 557119, 602547, 672498, 667127, 627033, 690174, 810084, 908095, 993786, 1174614, 1294791, 1366872, 1532832, 1769395, 1986567, 2251780, 2539051, 2911219, 3417159, 3973069, 4622215, 5350214, 6086915, 6766138, 7350535, 7760150, 8105811, 8488672, 8950923, 9534299, 10183746, 10677758]
9906A0677758J89288j99022p08785q07150p46265n69872l78215k93111l49529
9897F815097m41939o52483p43569o51456n31969m41782m37084k87668j70491j73837
9887B282819k05257j11927q6117p2037o4158o4585o0141l3710n3897q0010l8888
9876A412092q9173j18221l5824q4093l0736j7843o2602n1813l8217n9437r626
9865H14507l1643m5335o3287o2910k7360o3328k1460l723n0270p0660j518K6100
9853C99113J9276r51k0168J7579L2939J5382M859o2552r547k8485p2485n0598
9841B44362p882k492M3199j4811L5313R0850p94o2561n6091j4936k0839O21O285
9828B40224j8305k6550j1118l8749j8920L4615M2923J3340J3575k8481J4335j6057
$$ y = [10677758, 10867046, 10668024, 9959239, 9152089, 8405824, 7835952, 7457737, 7164626, 6815097, 6373158, 5720675, 4977106, 4325650, 3793681, 3351899, 2914815, 2627147, 2456656, 2282819, 2077562, 1965635, 1879518, 1807481, 1743323, 1678738, 1618597, 1584887, 1530990, 1450980, 1412092, 1322919, 1204698, 1168874, 1084781, 1054045, 1036202, 973600, 921787, 883570, 824133, 814507, 782864, 737529, 674242, 611332, 583972, 520644, 499184, 495461, 445191, 374531, 373013, 399113, 418389, 417438, 397270, 414849, 447788, 463170, 468029, 405477, 395930, 367445, 294960, 244362, 236480, 233988, 277187, 262376, 297689, 388539, 387745, 325184, 269093, 254157, 233318, 233939, 240224, 221919, 195369, 184251, 145502, 126582, 161197, 204120, 217460, 231035, 202554, 216889, 200832]
9816B00832j9276R611J4712K8334N3954J1204o7713K2300O4079N3911O4116o7256
9804C68808J1437J0754k6113k0930n4646l0701m5806j6628l973j5974n0172R882
9792A35938J1398O8387L3788L6940J9048R642N261j7441L7546l0834o1586k2854
9780B25233m093M105n21J0481k942M1922k7666j0753J5896q59J887K5714J6491
9767B94895j4522M887n0448l1090L2889J3501J7261O2726J3192o2064m1249P633
9755B47611n739k360J1785Q231Q957k7923K4497J9215N9678M7518M2895N6193
9743D90558p191n5568L291N1634N9562j3927l2007j6611l2149m7707k4821n543
9731C69521L8251m49m0413j3764l57k0444l1651k6915K0991K2538k1580K677m1765
$$ y = [200832, 181556, 191167, 205879, 234213, 288167, 299371, 231658, 253958, 318037, 371948, 436064, 368808, 380245, 390999, 364886, 343956, 289310, 258609, 212803, 196175, 192202, 176228, 126056, 135938, 147336, 215723, 249511, 286451, 305499, 315141, 320402, 302961, 340507, 309673, 248087, 225233, 221140, 225245, 224724, 235205, 232263, 274185, 246519, 235766, 251662, 250803, 252690, 278404, 294895, 280373, 285260, 234812, 203722, 236611, 250112, 267373, 330099, 343291, 281227, 239978, 247611, 241872, 239512, 251297, 259528, 268485, 240562, 265059, 284274, 343952, 391470, 434365, 490558, 483367, 427799, 431090, 482724, 542286, 528359, 496352, 479741, 447592, 399885, 375064, 369521, 407772, 407323, 366910, 353146, 352789, 332345, 300694, 273779, 294770, 317308, 295728, 298405, 256640]
9718B56640r750L8399k4715K5518L1727j348Q1925L0942k9470n960m48J9081j7598
9705C94943n8208o4914j2096K4278L5710q190o756m2371K3140L2485L0543O1724
9693D10288L0517L0206n7586m8228L5610J21649O5823K4424M282J5589p546p777
9681F17251M7706N6908K0026M6139K8888O3107J18686J51962J36424J33532J25267
9670A545896J01308J94648K22296J66376K41775L80162M22217N54451O43678P62934
9660E235741R12574J027936J238689J306529J283720J140222R18498O88265M01792
9651A4153966p2256o68225j140036j342369j359914j257802j248762j107421r19945
9642E037236p23101n94362m53923l60360k55037j71570r3376j17173j47829j07969
$$ y = [256640, 246890, 285289, 260574, 286092, 317819, 316471, 398396, 429338, 399868, 393908, 393460, 412541, 394943, 336735, 271821, 259725, 284003, 319713, 311523, 304767, 262396, 285536, 318021, 348564, 410288, 440805, 471011, 413425, 365197, 400807, 522456, 588279, 612703, 616985, 632574, 625028, 617251, 664957, 721865, 741891, 788030, 816918, 880025, 998711, 1150673, 1287097, 1420629, 1545896, 1647204, 1841852, 2064148, 2230524, 2472299, 2852461, 3274678, 3829129, 4472807, 5235741, 6148315, 7176251, 8414940, 9721469, 11005189, 12145411, 13063909, 13752174, 14153966, 14081710, 13413485, 12273449, 10931080, 9571166, 8313364, 7064602, 5957181, 5037236, 4314135, 3719773, 3265850, 2905490, 2650453, 2478883, 2385507, 2268334, 2120505, 2012536]
9632B012536k1520p4432j43180q0241m5355q215l1569j6553m2859o3770l7602
9621A447240o2169l9027k8809p153n7028n2000j3728j6368j7324M202J0680q2908
9609A085608q0320j02765r1138N125m6138q6335l1024j7847k9993l7232L2553
9598F00494j4266l7764L9500k1275o3190J7295M276l1545m9277j8907L2589K5086
9586D83016l4300J1812q027m7678J2841K2094J8935N8733J1314Q438j7108N9005
9574E79075l6449K0676P5646K1536M187J6602m4732p8935o0787R600j0012k2490
9562D73917J4564k7538l1058K5603J0434M4064J695L6002J1957m70K2917N5903
9550F37990M0784m926r1823n3460L9698N8568J3140j8227j8254n1082l2528j8659
$$ y = [2012536, 1991016, 1916584, 1773404, 1693163, 1647808, 1639593, 1608024, 1591471, 1548612, 1484842, 1447240, 1385071, 1346044, 1317235, 1310082, 1253054, 1201054, 1187326, 1170958, 1153634, 1157836, 1168516, 1085608, 1005288, 902523, 811385, 816510, 770372, 684037, 653013, 635166, 605173, 567941, 600494, 586228, 548464, 587964, 566689, 503499, 520794, 525070, 493525, 444248, 425341, 457930, 483016, 448716, 460528, 452501, 404823, 417664, 439758, 458693, 517426, 528740, 537178, 520070, 579075, 542626, 563302, 638948, 660484, 664671, 681273, 636541, 557606, 496819, 506419, 496407, 473917, 488481, 460943, 429885, 455488, 465922, 509986, 511681, 547683, 559640, 559170, 582087, 637990, 678774, 673848, 582025, 528565, 568263, 626831, 639971, 621744, 603490, 552408, 519880, 501221]
9538E01221L1224K3304L8554P4400N2391P2031J0548L9505J07009P4267N498j09518
9526I20434r0116p0858n3527j7531l8962j5378o4665p97L8677M0623J7249k3115
9514F42034K5554R402j4192J6808l9550l0104K3818L8184k3131Q573j0178k3777
9502F23441k761L4119k6474n5083n2503K1804J3007k273J7123K8389N5676O0229
9490G14694M3137L2056L9283M2271N8087O859j18594j14250n6840j12035m5689
9479D88979N938K3825K2337l7012l5188N6098M1423J325K760k5906K1199q76l8795
9466E26107q0330k1611o281k9199M143k6984j0867n4081j3657M9117O9650M4646
9454D50653O2657n461J6242l7824m0663N9313L274l1215j7549q225K6076o839
$$ y = [501221, 532445, 555749, 594303, 668703, 721094, 793125, 803673, 843178, 950187, 1024454, 1029952, 920434, 830318, 759460, 705933, 688402, 649440, 634062, 569397, 568600, 607277, 647900, 665149, 642034, 667588, 676990, 662798, 679606, 640056, 609952, 633770, 671954, 648823, 657396, 647218, 623441, 620680, 654799, 628325, 573242, 520739, 542543, 555550, 553277, 570400, 598789, 654465, 714694, 757831, 789887, 829170, 871441, 929528, 936387, 817793, 703543, 646703, 534668, 488979, 494917, 518742, 541079, 504067, 468879, 524977, 566400, 567725, 570485, 544579, 565778, 564902, 526107, 445777, 424166, 417885, 388686, 392829, 365845, 354978, 300897, 287240, 336357, 406007, 450653, 513310, 507849, 524091, 486267, 445604, 504917, 508191, 476976, 459427, 451202, 477278, 470439]
9442D70439n0661L7844P6178M0214p773n5278n0246o839l463k7282l2784N7639
9430D47988O4547P245m8203n0426J0868m2926m7779N9460L6136J1803q697L5650
9418D75666K6163l3056m1543m7435K0802N8394J6905l4521n5755J3634K770O5482
9406D67506j5613N2575Q852K7669K4954J2960m909j74J3128P2305l360l2138J4048
9393F37803n2651o0496l6914k4584K8770K0627J0219N4770N693J8779l7864J90
9381E64342O7458k0307p4184m661j9026L9677J987r342k2299k0304L2707L5264
9369E71312M2227O5574Q081R65j9702K6336m0377j7818M623K6855l6046k4951
9357F07079K8732K2153j4451J8212N660R088l6540j5732l0524J6015K7426k6908
$$ y = [470439, 419778, 457622, 533800, 574014, 566241, 510963, 460717, 453878, 450415, 423133, 390349, 447988, 512535, 519780, 471577, 421151, 432019, 389093, 341314, 400774, 436910, 448713, 440016, 475666, 501829, 468773, 427230, 379795, 400597, 458991, 475896, 441375, 385620, 399254, 402024, 467506, 451893, 504468, 513320, 540989, 565943, 578903, 573994, 573820, 586948, 659253, 655893, 623755, 637803, 585152, 524656, 487742, 463158, 491928, 512555, 522774, 577544, 583237, 602016, 564152, 564342, 631800, 611493, 537309, 532648, 513622, 553299, 555286, 545944, 523645, 503341, 536048, 571312, 613539, 679113, 687194, 688159, 668457, 694793, 654416, 636598, 641221, 668076, 632030, 607079, 635811, 657964, 643513, 661725, 667385, 676473, 639933, 624201, 593677, 609692, 637118, 610210]
9345F10210j0597O3020q775L3M0745j1987j7086K797L560K396m4398q2599j7086
9332E30233Q634K6809L9382J2063Q555J6875k9785o98N3007Q0117M0222J6872
9320H02286p1827r196l3929j689L8830K2810j1937N663j6418P763L4377k561K4476
9307G88648J3474K7602J7357L4115J5672l992N1006J4026J659L5905K3395L990
9295A022857J5798K8638M2017J3266k5248l24j9144M1717Q4534J147j41J9465
9283A224582J33144M6453J3322N2328K0196q4359q6472p1255k7765j0250j8394
9272A191530J0545J1358M0075J5148K4624J3548M6605P7603O9520J8735J9231
9261A538522p098o096J7882K1920m409L1969k0015l0613L7320N9533L5153K7695
$$ y = [610210, 599613, 662633, 653858, 653891, 694636, 682649, 665563, 668360, 671920, 674316, 629918, 547319, 530233, 538867, 565676, 605058, 617121, 625676, 642551, 612766, 612068, 665075, 745192, 785414, 802286, 730459, 721263, 687334, 685645, 724475, 747285, 735348, 741011, 724593, 732356, 766733, 764172, 788648, 802122, 829724, 847081, 881196, 896868, 892876, 943882, 957908, 959567, 995472, 1018867, 1022857, 1038655, 1067293, 1109310, 1122576, 1097328, 1097004, 1077860, 1119577, 1204111, 1205258, 1205117, 1224582, 1357726, 1404179, 1417501, 1469829, 1490025, 1405666, 1319194, 1247939, 1220174, 1209924, 1191530, 1202075, 1213433, 1253508, 1268656, 1293280, 1306828, 1353433, 1431036, 1500556, 1519291, 1538522, 1531424, 1525328, 1543210, 1565130, 1560721, 1592690, 1572675, 1542062, 1579382, 1638915, 1674068, 1701763]
9249A701763O1866M9813Q4645J46482J22219M2424N0411k1792p4198j14007j16580
9238A933046j03204j04765k2168L3255K8147l2461q130P284o82J1824K5002j0071
9226A757077J6538K2188L0670L0309N2654n3897m5483l7306l0888j4242K1661
9215A749281N3223N8290q212M3349k687p7203L2240J18680R2596M514m7147J5278
9203B032202M2147O825k9708k385j6387M9124k495N143l617j2765N2198N4262
9191B174544K8818L0765O8631K6212P3527O1011N3905L574j8461m1749M0373P7927
9179B579077L0178K65O0588R1509J33547M1940J1169N3624k5099Q40J6214K4308
9167C018160R9732Q6098N1801q686m437L7732N9039M7048J5194N7561O8134J5616
$$ y = [1701763, 1763629, 1813442, 1898087, 2044569, 2166788, 2209212, 2259623, 2237831, 2163633, 2049626, 1933046, 1829842, 1725077, 1702909, 1736164, 1764311, 1731850, 1723720, 1731004, 1730322, 1742146, 1767148, 1757077, 1773615, 1795803, 1826473, 1856782, 1909436, 1855539, 1810056, 1772750, 1741862, 1727620, 1749281, 1802504, 1860794, 1852582, 1895931, 1893244, 1816041, 1848281, 1966961, 2059557, 2064071, 2016924, 2032202, 2074349, 2081174, 2051466, 2049081, 2032694, 2081818, 2079323, 2084466, 2080849, 2068084, 2120282, 2174544, 2203362, 2234127, 2302758, 2328970, 2402497, 2463508, 2517413, 2520987, 2502526, 2460777, 2501150, 2579077, 2609255, 2609520, 2670108, 2761617, 2895164, 2937104, 2948273, 3001897, 2976798, 2977638, 2993852, 3018160, 3117892, 3203990, 3255791, 3247105, 3242668, 3280400, 3339439, 3386487, 3401681, 3459242, 3527376, 3542992]
9155C542992p749R4433O4132N5002O5670J00201K1040O2234M6381M4246J8602
9144D107184M3233R5557J14967J28557P0492Q5786O3568n174M4030P8697J16094
9133D942991Q9476Q4177P6896J11916J70031J10893N2380Q7284J47323J48872
9123F022239J43935J77021J25536J22126R3760J50298K03303J90207J20375J41330
9113G490130K02625K29727J56128J73241J93111J52392J68113K00663K13337K17575
9103I397042K88218K48511K06973K43494K56903K50214K78383L48011L28676L05308
9093A2151733L20503K94924L67006M42205M51328M09215M36454M75751N65487
9084A5914606N72769N17954N07834N56131O36444O64960O81368O78614P20280
$$ y = [3542992, 3535243, 3629676, 3693808, 3748810, 3814480, 3914681, 3935721, 3997955, 4044336, 4088582, 4107184, 4150417, 4245974, 4360941, 4489498, 4559990, 4645776, 4709344, 4704170, 4748200, 4826897, 4942991, 5032467, 5116644, 5193540, 5305456, 5475487, 5586380, 5638760, 5726044, 5873367, 6022239, 6166174, 6343195, 6468731, 6590857, 6684617, 6834915, 7038218, 7228425, 7348800, 7490130, 7692755, 7922482, 8078610, 8251851, 8444962, 8597354, 8765467, 8966130, 9179467, 9397042, 9685260, 9933771, 10140744, 10384238, 10641141, 10891355, 11169738, 11517749, 11846425, 12151733, 12472236, 12767160, 13134166, 13576371, 14027699, 14436914, 14873368, 15349119, 15914606, 16487375, 17005329, 17513163, 18069294, 18705738, 19370698, 20052066, 20730680, 21450960]
9075B1450960P74307Q35846Q91331R33415R86813J008282J041276J126677J240462
9066C0289369J284629J299698J352255J439221J547763J653940J709032J766247
9058D2342154J903052J999295K100026K147001K295374K446187K501864K521514
9050F0256467K605563K678759K794287K797444K863084K820647K795217K749780
9042H2361248K661611K536937K380308K172470J973236J693727J390840J069176
9034I8239553O75492K80099l5320l67755p12532j096270j313727j610006j885644
9025I2173890k067238k231678k347709k399272k452114k484533k512420k526799
9017G3152127k429036k413962k390813k285873k230932k098628k015394j972088
$$ y = [21450960, 22225267, 23061113, 23952444, 24885859, 25872672, 26880954, 27922230, 29048907, 30289369, 31573998, 32873696, 34225951, 35665172, 37212935, 38866875, 40575907, 42342154, 44245206, 46244501, 48344527, 50491528, 52786902, 55233089, 57734953, 60256467, 62862030, 65540789, 68335076, 71132520, 73995604, 76816251, 79611468, 82361248, 85022859, 87559796, 89940104, 92112574, 94085810, 95779537, 97170377, 98239553, 98915045, 99195144, 99159824, 98792069, 98079537, 96983267, 95669540, 94059534, 92173890, 90106652, 87874974, 85527265, 83127993, 80675879, 78191346, 75678926, 73152127, 70723091, 68309129, 65918316, 63632443, 61401511, 59302883, 57287489, 55315401]
9009E5315401j888663j766923j616758j553735j473010j430518j383788j373085
9001D2828921j412071j424430j472010j411309j411563j343801j261514j209170
8993C1883053j157698j146949j067668j012732r23528r34223r06245q52734q10040
8984B3071236p03379o68630o84394o26531o17308o57753o19388o21016o16361
8975A7256476n40017n49636m72622m46784m52775m39902m51405m48562m02323
8966A3052450l96512l59409k69294k61053k95565l10531l40226l47882k92887
8957A0179091k06404k41752k66311k78802k19243j99932k14189j92731k52814
8948H106913k05828k03147k20086j58002j78254j73358j25028j42836j28480o1729
$$ y = [55315401, 53426738, 51659815, 50043057, 48489322, 47016312, 45585794, 44202006, 42828921, 41416850, 39992420, 38520410, 37109101, 35697538, 34353737, 33092223, 31883053, 30725355, 29578406, 28510738, 27498006, 26574478, 25640255, 24734010, 23881276, 23071236, 22367857, 21699227, 21014833, 20388302, 19770994, 19113241, 18493853, 17872837, 17256476, 16716459, 16166823, 15694201, 15247417, 14794642, 14354740, 13903335, 13454773, 13052450, 12655938, 12296529, 12027235, 11766182, 11470617, 11160086, 10819860, 10471978, 10179091, 9972687, 9730935, 9464624, 9185822, 8966579, 8766647, 8552458, 8359727, 8106913, 7901085, 7697938, 7477852, 7319850, 7141596, 6968238, 6843210, 6700374, 6571894, 6510165]
8938F510165j16970j66885j40332q0616j21540j44114q7073j03590j41380j23024
8928E284641l5577l6127j10584j07342k1172p3109n4809m8740q4913n9486m2916
8917D609866j3378q0305j57876j07264l8450l4930q1587r7264r5145r5957q7657
8906C720053q5032j22117p7062l1090j11387m2728K776n9615m6516j8227p8240
8895C050815n4133j24218q4910R929j4135k1805l3826n8482j19600k8159j9027
8884B502449l197q389n6156m5284L7153l365l9940k2974J3733k3874k3542O506
8872B333120m0916R811k0658N34M841n755k7870l3176j0838k1407n9329q0217
8860B048140n4266j1371j1474L5408n9753q2280p4531o109J0680L883M2305m055
$$ y = [6510165, 6393195, 6226310, 6085978, 6005362, 5883822, 5739708, 5652635, 5549045, 5407665, 5284641, 5249064, 5212937, 5102353, 4995011, 4973839, 4900730, 4845921, 4797181, 4712268, 4652782, 4609866, 4596488, 4516183, 4358307, 4251043, 4212593, 4177663, 4096076, 3998812, 3903667, 3807710, 3720053, 3635021, 3512904, 3435842, 3404752, 3293365, 3250637, 3253413, 3193798, 3147282, 3129055, 3050815, 2996682, 2872464, 2787554, 2797483, 2783348, 2761543, 2727717, 2669235, 2549635, 2521476, 2502449, 2499252, 2490863, 2434707, 2389423, 2426576, 2423211, 2383271, 2360297, 2374030, 2350156, 2326614, 2333120, 2292204, 2302015, 2281357, 2281891, 2286732, 2280977, 2253107, 2219931, 2209093, 2187686, 2128357, 2048140, 1993874, 1982503, 1971029, 2006437, 1946684, 1864404, 1789873, 1783764, 1794444, 1798327, 1840632, 1836577]
8848A836577m3329p0484J9418o608n1033k1544M1096J5402m1940k4766K3462n5077
8836A621174j08761k3073K4129P361r69l1891q0616j333k3754j2570M5788k1786
8824A393699j4853J0944q2791k8271J1081k8459m2566o3282q510P2445Q677j5875
8812A212239q848l9646m1664n829Q93M2061J8611r966R47l3312o4650k7836K2490
8799A065490j4337J9705K526j6551j0117O471l6536l4071m1516J1906K7146n332
8787I74784k0708J1998m7101n7647n9566J2795k1306p814J3098J0820L7009o2593
8775G83769l4051Q408o358p4763j1252M1616N1644K1234k3784m5222O1406r923
8763G62724k5420k6537n2501M49K4463P7014L224m7252k1939L6390Q656l5890
$$ y = [1836577, 1793248, 1722764, 1742182, 1735574, 1684541, 1662997, 1704093, 1719495, 1677555, 1652789, 1676251, 1621174, 1512413, 1489340, 1513469, 1520830, 1519861, 1487970, 1407354, 1406021, 1382267, 1369697, 1415485, 1393699, 1378846, 1389790, 1306999, 1278728, 1289809, 1261350, 1218784, 1155502, 1146992, 1219437, 1228114, 1212239, 1203391, 1163745, 1122081, 1116252, 1117145, 1159206, 1177817, 1167851, 1168798, 1135486, 1070836, 1043000, 1065490, 1051153, 1070858, 1073384, 1056833, 1046716, 1053187, 1016651, 982580, 941064, 952970, 980116, 974784, 954076, 966074, 918973, 861326, 801760, 814555, 793249, 785435, 798533, 809353, 846362, 783769, 749718, 758126, 751768, 677005, 665753, 707369, 759013, 780247, 756463, 711241, 772647, 762724, 737304, 710767, 658266, 658715, 683178, 760192, 763416, 716164, 694225, 730615, 739271, 703381]
8751G03381n1684J0543L2003M972q5450L2818j6910r2861M5146K1058p747m3789
8739E51480j0944k6721j9356l056j1976P0209L7967p5858k5639K4441N2410J7025
8727E79982o3200j2774L7266J8920q038l5804k4852N2220J3957l4998K8036p15
8715E50000J1935o7003m3999n4278l1728N6063K393M2438M4421j6252n0436j0981
8703D32573j3107J9996J0446k3910M0642k611m7666K6249L2612m7123m9185l3183
8691C45733n189J6569K2366K6486m0280L2947M4170M7746m162m2099L4437N354
8679D84078k6982o946m2114J0199K3249M2669j2550m5560j5216n6297J2394K9161
8667C96085M1905l1894J2847q643k7663q079K2196k3535J633J5574r371p0229
$$ y = [703381, 651697, 662240, 694243, 699215, 613765, 646583, 629673, 536812, 581958, 603016, 595269, 551480, 540536, 513815, 494459, 491403, 479427, 549636, 587603, 511745, 486106, 510547, 562957, 579982, 516782, 504008, 541274, 560194, 552156, 516352, 491500, 543720, 557677, 522679, 550715, 550000, 561935, 494932, 450933, 396655, 364927, 420990, 423383, 465821, 510242, 493990, 443554, 432573, 419466, 439462, 449908, 425998, 466640, 464029, 416363, 442612, 475224, 428101, 378916, 345733, 340544, 357113, 379479, 405965, 365685, 398632, 442802, 490548, 486386, 444287, 478724, 484078, 457096, 450150, 408036, 418235, 441484, 484153, 471603, 426043, 410827, 354530, 366924, 396085, 437990, 406096, 418943, 410300, 382637, 374558, 396754, 373219, 374852, 390426, 381055, 310826]
8655C10826l314m5907K4836K3627l724K8174j1687p628K460J1761M1135k4085
8643C46474k129j0803l0876L8854l2345l8467M6069L4736K1270m6582l1572M1711
8631C36340j3738K362k4274p5729k1219K3458J4043L4395N2646m8083K4230M2802
8619C47233j649n1341L3263P6586j30k672K1280k924k1327o8513K3640N9278J4987
8606D27711O9845L6428j1996J0955K2754L8619N0375M7600O7182o7989p9671j2757
8594E99056k1502p68o5827n5653L6139M518J885J0909L358l6343K732q408L5381
8581E05477P2376m2675n5415k0718J5955j9079o5929L0062J474l3938l5159L415
8569C55846R304j7641K9593K9862r45M6965Q6658P1054q317J1444k5726n8252
$$ y = [310826, 307512, 261605, 286441, 310068, 306344, 334518, 322831, 315203, 317663, 329424, 370559, 346474, 344345, 333542, 302666, 341520, 309175, 270708, 316777, 351513, 372783, 326201, 294629, 336340, 322602, 324964, 300690, 224961, 203742, 227200, 241243, 275638, 328284, 280201, 304431, 347233, 345584, 294243, 327506, 404092, 403962, 401290, 422570, 419646, 398319, 329806, 353446, 412724, 427711, 497556, 533984, 521988, 532943, 555697, 594316, 644691, 692291, 759473, 691484, 611813, 599056, 577554, 576786, 510959, 455306, 491445, 495963, 497848, 508757, 512115, 475772, 478504, 470096, 505477, 577853, 535178, 479763, 459045, 475000, 455921, 389992, 420054, 421528, 387590, 352431, 355846, 365150, 347509, 377102, 406964, 406019, 452984, 539642, 610696, 602379, 613823, 588097, 529845]
8557E29845n5195m0496j00724p7779j5860l4050J5220J7680j9269L0867K4875
8546B75114k8110O9707k0547k3261K372L1057J3705k2735l0070k6144m002M8720
8534B85806o4467p696O3018j3696q302N817J219M0948J2798j0662l4572j1013
8522B59198N4377N1094L1264k7326r1776n9234l6005k1375O0736M8072q771K1011
8510B81265m6415n7086L9018P981P740j5912k8164p6758k3645j222j0042M0922
8498A17682N3896L5029k1079m2458k559R548j0561P988J7133K4181n25N5273O1181
8485C04729p6229l1251M4050r533l998l446n167k5088n5894l7759l0063j5610
8473E4741L5647L9438J1955L2163j6934N3727K472k2640K6362J2716m6605O645
$$ y = [529845, 474650, 434154, 333430, 255651, 239791, 205741, 220961, 238641, 219372, 250239, 275114, 247004, 316711, 296164, 272903, 275275, 306332, 320037, 297302, 267232, 241088, 237086, 285806, 221339, 213643, 276661, 262965, 254663, 260480, 261699, 302647, 315445, 304783, 270211, 259198, 313575, 364669, 395933, 368607, 276831, 217597, 181592, 160217, 220953, 269025, 260254, 281265, 234850, 177764, 216782, 224763, 232503, 216591, 188427, 111669, 88024, 86802, 76760, 117682, 171578, 206607, 185528, 143070, 140511, 150059, 139498, 147486, 164619, 188800, 188275, 243548, 304729, 228500, 197249, 241299, 231766, 227768, 224322, 219155, 194067, 138173, 100414, 70351, 54741, 90388, 129826, 141781, 173944, 157010, 210737, 213209, 190569, 216931, 229647, 183042, 189687]
8461A89687K2891K1871m045j14269o009R4057l534l5411J5806K7167P312j7274
8449A98249M4698J2002l2986n3648J3737R56O2283P5137m3823r1213k8948J1295
8437A67739K4633P019j1919R542l6306j6197l006l7176J0487J9674o221M826l5616
8424I7479N060K0586k5751L241m869L169J9745n3968n7605K1422k0218J0741N4186
8411G3218K7901j9767o449J2271M6906N2624o402j2486O6012n791k2705M0064
8399B45396J5609l3789J2572K631n2018l8426l7270L0711N5217K836k7281l647
8387A72541j2078K945k8010j3292J4182L6602Q5892M2860j0420j75J0403K0431
8375C21881j0010O6665J06543L5560M9913R5542J19845N2180l1993j20207j39880
$$ y = [189687, 212578, 234449, 230404, 116135, 110126, 204183, 200649, 165238, 181044, 208211, 215523, 198249, 242947, 254949, 221963, 168315, 182052, 183008, 245291, 320428, 276605, 185392, 156444, 167739, 192372, 199391, 187472, 197014, 160708, 144511, 141505, 104329, 114816, 134490, 128269, 133095, 97479, 102539, 123125, 97374, 100615, 95746, 98915, 118660, 64692, 7087, 28509, 8291, 19032, 73218, 101119, 81352, 74903, 87174, 134080, 186704, 180302, 167816, 233828, 228037, 205332, 245396, 261005, 227216, 239788, 242419, 190401, 151975, 114705, 145416, 200633, 203469, 176188, 172541, 160463, 163408, 135398, 122106, 136288, 172890, 258782, 301642, 291222, 291047, 301450, 321881, 311871, 378536, 485079, 520639, 570552, 666094, 785939, 838119, 806126, 685919, 546039]
8364E46039j44986q7693j5283k0612k9374J407k9849j6104L308N33K6787J186
8352B35359m874k9810j653N2547k4560n4991N5825k7252m159P3511K702j4663
8340B57982K0095j8189m1056j9388K1578R396l568K3434M4186O7273K8897O3941
8328D54581R5551J36283J53749J77643J99407J93112J09440j18583k37333k87428
8318H76422k47251j59581j60410p9341l8697K9347Q907p2770o8494O3718O5114
8307B16964K0895j5232Q537M138l7857J7059l5318m6345m5903K4649K7139j466
8295A37260N1238L4948m6715q4759N5820L1801K3739M5314J9030j3591J8427J8286
8283B90798M4824k6089M8618Q9949J25151P7417N7390M4597j24172j28656q0777
$$ y = [546039, 401053, 313360, 298077, 277465, 248091, 249498, 219649, 203545, 206853, 207386, 234173, 235359, 230485, 200675, 199022, 251569, 227009, 172018, 227843, 200591, 196432, 269943, 272645, 257982, 278077, 259888, 218832, 199444, 221022, 230418, 226850, 250284, 294470, 361743, 390640, 454581, 550132, 686415, 840164, 1017807, 1217214, 1410326, 1519766, 1401183, 1163850, 876422, 629171, 469590, 309180, 229839, 191142, 220489, 229396, 156626, 88132, 151850, 216964, 237859, 222627, 231164, 235302, 197445, 214504, 179186, 132841, 86938, 111587, 138726, 137260, 188498, 223446, 176731, 91972, 147792, 179593, 203332, 248646, 267676, 254085, 272512, 290798, 335622, 309533, 358151, 448100, 573251, 650668, 708058, 752655, 628483, 499827, 419050]
8272D19050l6132p8306r4160n7552l8502j5966j9800k1400N3205K0934K598r846
8260A24123Q072j9508q0446L054N0071K115l6321o1800o848L5466O9017k3889
8248F3106n184R2433r957l5218n94J1665l5080O344j5429m1333p468q876n3709
8235c9300p215P4627N0308l9982l9447O834m769M3560L3857q965O625r920k9214
8222C6999p503P828J5739R851K9694j545j3402M6505m187n2737R194L7078m6628
8209F6886l6085L0007k12o2328K1920M2636m2893j7706O2420p68M438K4554k7721
8196F5148p2497l5217O9057N3806J5227n8233j4216M0596J7298J9920J061n0031
8184E1919n2092J9485N7824N29j7369l8930k0531L8462J2818K0465r903K6328
$$ y = [419050, 382918, 304612, 210452, 152900, 114398, 98432, 78632, 57232, 110437, 131371, 133969, 124123, 132195, 112687, 32241, 35295, 85366, 87481, 51160, -10640, -17488, 17978, 86995, 63106, 57922, 150355, 140398, 105180, 104586, 116251, 81171, 87515, 72086, 30753, 23285, 14409, -39300, -46515, 28112, 78420, 38438, -1009, 5825, 1056, 44616, 78473, 69508, 76133, 66213, 36999, 29496, 37324, 53063, 62914, 92608, 91063, 77661, 124166, 119979, 67242, 76436, 113514, 66886, 30801, 60808, 60596, -1732, 20188, 62824, 19931, 2225, 64645, 63877, 68315, 92869, 65148, -7349, -42566, 26491, 80297, 95524, 37291, 23075, 63671, 80969, 100889, 101950, 51919, -173, 19312, 77136, 77665, 60296, 21366, 835, 39297, 52115, 72580, 62677, 89005]
8172H9005k0233q2319j9134J1134K1766J4924P8177p197n2728o488N135m9563
8160a7521K9842O2566L976K0001J0912m541L0186n998o1648k395j6696l5034m5284
8147c1634J9386o396J5844J6336J1745P915o75J8039N305m001o7447k6854J1543
8134c0894J6494M9117j4667l2826o568O2892N1953Q203m7643m5453J9J5209k6463
8121f27j3314k9257J8899L7020M6864M6858m4446l7145k4510m12J901K2266J6750
8108D0847k2834M1322L0617k2978j2814k4137k834l0218o8460k7635J1273M9548
8096c8303J06865K7461p7806o5468J7140L9326j0866j8170k8712O990J6393o3159
8084h8309Q47R1844O1071l051j8443n4339p313K7301J8640n731N720R467L947
$$ y = [89005, 68772, -13547, -32681, -21547, 219, 15143, 93320, 86123, 33395, 26907, 32042, -17521, 12321, 74887, 78863, 98864, 109776, 105235, 135421, 129423, 67775, 65380, 48684, 13650, -31634, -12248, -18644, -2800, 13536, 25281, 33196, 32521, 50560, 55865, 51864, -15583, -42437, -30894, -14400, 34717, 20050, -12776, -19344, 43548, 95501, 103704, 56061, 10608, 10627, 25836, -627, -13941, -43198, -24299, 12721, 59585, 106443, 61997, 24852, 342, -70, 1831, 24097, 40847, 18013, 59335, 89952, 66974, 54160, 30023, 27189, -3029, -71489, -99124, -87851, -38303, 68562, 96023, 18217, -47251, -30111, 9215, -1651, -19821, -48533, -41543, -25150, -88309, -87462, 4382, 65453, 62402, 43959, -10380, -17693, 9608, 28248, 22517, 28237, 37704, 41651]
8071D1651k0319k1400K0436L5169k875m4906J9880K130K9107J0447J9378O194
8059I4892l438L2285m7700j5117p7777j2643n940l014R005K6058N3702J0350o2460
8046a797j2781K0345J7794O406j6480K9486J5855j0125m6359L9152k4352J3298
8034C0442O623k77K422k2220P841N3848L5162k3587j5187L3838m159K9606J394
8021A35746l9052o6120m1006l9663J4969j2475n104J908L2530L5421J5365n0307
8009a7788l6515J1019K833L6921K2067r76L7075r014O985J0310j3948l3500j7644
7996b175L3373l910K4280K833L1275j6287l5455n2712M260K0683j1032K2383K2953
7983D0469k014K348n4017L2429N6348J1833m6718Q519M2626M183J2721k866l2699
$$ y = [41651, 21332, -68, 20368, 55537, 52662, 7756, 27636, 29766, 58873, 69320, 88698, 94892, 91454, 123739, 76039, 60922, -16855, -29498, -35438, -38452, -29447, -3389, 50313, 60663, -1797, -14578, 5767, 23561, 29967, 13487, 42973, 58828, 48703, 2344, 41496, 17144, 30442, 37065, 36788, 39210, 16990, 24831, 78679, 113841, 90254, 75067, 108905, 104746, 134352, 135746, 96694, 30574, -10432, -50095, -35126, -47601, -52705, -50797, -18267, 17154, 32519, -17788, -54303, -43284, -40451, -3530, 18537, 17561, 54636, 45622, 52607, 62917, 48969, 15469, -2175, 31198, 27288, 51568, 54401, 85676, 69389, 33934, -18778, -14518, 6165, -4867, 17516, 40469, 38455, 40803, -13214, 19215, 75563, 87396, 40678, 49197, 91823, 96006, 108727, 105861, 73162]
7970G3162m6945J2228k1432K935L9703N0457j1278k8892j7337k298R941k196k0632
7957C7416L2048m903j1722K5400q523J1785O023J7884l1114l4071k3694J5196
7945C1725J6828L4250L5201Q772K9052K703l9161k22N0324N357p5064m7485p4947
7932b2667o5975M3050M3169N200p672K9038N4570k8211r305k6482J8394J8106
7920E1215n2256k2363L0145K0657M191j5428K1452J5402M3276J6275K90j9597
7908I3259k9723j4632l0298k6103j1398j9073J5168J9523l2437L5495L4713J8889
7896E3383m37J3546m4395m2037J3910r505K526N1005J078R06M5228N3582j4819
7883A23971R490n1546l2761j0459l7942j5522k6533L0689J2329m4020j1237O4798
$$ y = [73162, 26217, 38445, 17013, 19948, 59651, 110108, 98830, 69938, 52601, 50303, 60244, 58048, 37416, 69464, 64561, 52839, 78239, 69716, 81501, 87524, 105408, 74294, 40223, 16529, 31725, 48553, 82803, 118004, 126776, 155828, 158531, 119370, 119148, 169472, 174829, 99765, 52280, -22667, -88642, -45592, -2423, 2777, -4895, 24143, 78713, 50502, 41197, 14715, 33109, 51215, -1041, -23404, 6741, 27398, 31589, 16161, 37613, 53015, 96291, 112566, 112856, 93259, 63536, 48904, 18606, -7497, -18895, -37968, -22800, -3277, -35714, -219, 34494, 53383, 52946, 66492, 22097, -19940, -6030, -15535, -13009, 37996, 39074, 39980, 85208, 138790, 123971, 133461, 81915, 49154, 38695, 753, -14769, -41302, -10613, 1716, -42304, -53541, 11257]
7871A1257R1158P3213N405m1596k7854j7933j6206Q03M2937k7661j6031l5967
7859D1525o3691m2818R644O4157K0560j3078j9868R648K0916q728k436K7512o1106
7846a7763m2830M0916k8197J6939j6051k8645N2344M3235L391k1355m4787L0725
7834a2078N9168j6642l3795L9243j5595m0614o2759o356M9928Q1539L3207p081
7822F8165L3081K9823k060r05K5102l2343n4158o6651n0686k360J804l1298P941
7809g4545N1305N2872J0370N914J3538n0300k4603j9775L989p188J361J9564J4739
7796b759K3269K137o059j4039Q968j7002j1613j8940J1274L3877L2333K105J6997
7783F0548j4633j5445L1648J1152r561o8120o4519m3669j141L753k239j3031J5762
$$ y = [11257, 102415, 175628, 181033, 139437, 111583, 93650, 77444, 78247, 121184, 93523, 77492, 41525, -22166, -64984, -55340, 8817, 29377, 16299, -3569, 6079, 26995, 18267, 15831, 43343, -17763, -60593, -19677, -47874, -30935, -46986, -75631, -23287, 19948, 23339, 1984, -42803, -12078, 47090, 30448, -3347, 35896, 20301, -20313, -83072, -89428, -39500, 42039, 75246, 68165, 101246, 131069, 129009, 128104, 153206, 120863, 66705, 54, -50632, -52992, -51188, -82486, -74545, -23240, 29632, 40002, 45916, 59454, 9154, -15449, -35224, -31235, -38423, -37062, -17498, -2759, 20510, 22647, 16588, 2549, 11517, -5485, -17098, -36038, -24764, 9113, 41446, 43551, 60548, 45915, 30470, 62118, 73270, 63709, -4411, -68930, -112599, -113740, -109987, -112226, -125257, -109495]
7770a09495N2587L7406N9003N1017o2923m5863K0562q876k247J0543o6914q249
7758g3449r749K8205M9603k3241n1776Q977N0742p907l9513j042j6753m0481K7488
7745i8896M7849L0135j797m931j8662m7417r558l3148L2761P3504Q790L5120R2484
7732A06234j3290n1571p68l5723P412R41K4885N682m018J1663K1378l0306n4070
7719a1551j8981L4928N5160J6135p6937k9738M3068J8212L5261j1081n0985M5443
7707D8934K1192m1669m6478k6028l6874o33P6744J9706k0206k4694P396K8423
7695E813l9601l5819j6522K9085N3347M4103p06j6749J3376M956K280k1208m5911
7682b3556l0384L1805J3309n324K1377k3912q4595k6184k298M3128N4036K2801
$$ y = [-109495, -56908, -19502, 39501, 90518, 27595, -18268, 2294, -6582, -8829, 1714, -65200, -73449, -83198, -54993, -5390, -28631, -80407, -71430, -20688, -28595, -68108, -69150, -85903, -126384, -98896, -51047, -20912, -22709, -27640, -46302, -93719, -103277, -136425, -103664, -30160, -21370, 13750, 106234, 92944, 41373, 40605, 4882, 12294, 13235, 38120, 43802, 39784, 51447, 72825, 42519, -11551, -30532, 4396, 59556, 75691, -1246, -30984, 12084, 30296, 65557, 54476, 3491, 48934, 70126, 28457, -18021, -44049, -80923, -81556, -4812, 14894, -5312, -30006, -22610, 5813, -33788, -69607, -86129, -57044, -3697, 40406, 39700, 22951, 36327, 41283, 43563, 22355, -23556, -53940, -22135, -8826, -14150, 7227, -16685, -101280, -127464, -129762, -86634, -32598, -9797]
7670i797M269O754k8058K2494P8036O5933p4572n1861j7347j1315L4437Q873J6882
7657D4728j0626j9882k4453k2054L6407N9231l2017P304j7878p836j6141J3197
7645I980J7143K0156k0876m2624J274j1755p698L1680k552J2960L3771p167m5737
7632a1445q725J9479K1085O465L0386k775q804k2748m5800J5814N1099j742K7393
7619F9682j1622l9731M430K3676P2816l0226n2005j7510J8042l5153Q90j5955
7607a2666K7990L8651k8352k2425m5690L436j119K6408q504Q3708J2689k9059
7595D5067n1326n7574j8977J2296r626m2120k2926N1099M7701M1530K5886o495
7583A4535k8335k1095p4212k0487N716p971P0720M9366j6073P844J8680o595L2689
$$ y = [-9797, -5528, 1226, -26832, -4338, 73698, 139631, 65059, 13198, -4149, -15464, 18973, 27846, 44728, 34102, 14220, -10233, -32287, 4120, 63351, 31334, 38638, 20760, 12924, -3217, 9980, 27123, 47279, 26403, -16221, -14947, -26702, -34400, -2720, -5272, 7688, 41459, 34292, -11445, -20170, -691, 20394, 26859, 57245, 54470, 45666, 22918, -22882, -7068, 44031, 42289, 69682, 58060, 18329, 22759, 46435, 119251, 89025, 37020, 19510, 37552, 2399, 3289, -12666, 15324, 53975, 25623, 3198, -42492, -39056, -40175, -13767, -22271, 61437, 74126, 45067, -6259, -63833, -82810, -70514, -80140, -122260, -145186, -94087, -46386, -4856, 21030, 14535, -13800, -34895, -109107, -129594, -123878, -131849, -61129, -11763, -27836, -19992, -1312, -7907, 24782]
7570B4782o039k6331K0376n0197M619R790O848n6531J227J8023K2717M2140j6963
7557e539j9372l4466R71Q4136J7420p022n919n6m1010m9468K423O6089Q544n0386
7543c3655m1816J3730M3163m4697k0660L0875M4176j5949K1779L722o2235k934
7531f4501j0583q375m4647m8686P8058O0581k4511m79J1228j4348n2341l362O4626
7518e7340J3567l3180n318M891N6248K7501J6863J2315k9290p0885m1799K879
7506a03548J3995l2383n874L2968K6144J7696L4644j928K474m9653L338J5592
7494d6535j4325l358K7805l730M8219M1390j2510L9472j3436j4110k6790m2522
7482b0430J877J4358j8291q31j0634R0o582J1647L3029K0183o2351O614K5394
$$ y = [24782, 18743, -7588, 12788, -37409, -32790, -23000, -16152, -72683, -71456, -53433, -30716, 11424, -5539, -24911, -59377, -58406, 25730, 43150, 36128, 30209, 30153, -10857, -60325, -57902, 8187, 16731, -33655, -75471, -61741, -18578, -63275, -83935, -53060, -8884, -24833, -3054, 668, -61567, -64501, -75084, -83459, -128106, -176792, -98734, -38153, -62664, -63143, -51915, -66263, -118604, -121966, -57340, -43773, -76953, -82271, -77380, -21132, 6369, 23232, 35547, 6257, -64628, -106427, -103548, -89553, -121936, -127810, -94842, -68698, -51002, -16358, -18286, -15812, -65465, -62127, -46535, -60860, -64218, -36413, -40143, 8076, 49466, 36956, 76428, 62992, 48882, 22092, -20430, -18553, -4195, -22486, -23317, -33951, -33861, -40443, -28796, 4233, 24416, -37935, -31321, -5927]
7469e927M338K0628L7118L9254l9835m8489O700p5886J7626j666j1493M722J9970
7456c2940j1982K285p596P588k857p130K4110L8808l1748K8950K0637K8728J1414
7443F8267L098R404k9634k2192k4042o2482n0396J1741K5551l5667j7351j2024
7431a35727L8525P0173O0057m0022l693M0405m3582j4313N080Q1412l7386m5680
7419b4751J9828r577J0870l2835j5056L8719k8545l4895q860N4001O103p3392
$$ y = [-5927, -1589, 19039, 56157, 95411, 55576, 7087, 13787, -62099, -44473, -46139, -57632, -52910, -32940, -44922, -42637, -50233, -42645, -45502, -52632, -28522, 10286, -21462, 7488, 28125, 56853, 68267, 71365, 80769, 51135, 28943, 4901, -57581, -107977, -96236, -70685, -106352, -123703, -135727, -97202, -27029, 33028, -6994, -10687, 29718, -13864, -28177, -23097, 58315, 20929, -24751, -4923, -14500, -3630, -36465, -51521, -12802, -41347, -76242, -85102, -31101, -24998, -98390]
$$ [...]
##END NTUPLES=NMR SPECTRUM
##END=
