##TITLE=Analysis number 312568
Compound Code cc 42022
Book Reference 437/13
Project Code adrs
Chemist Name wendyb
##JCAMPDX= 6.0         $$ Bruker NMR JCAMP-DX V2.0
##DATA TYPE= NMR SPECTRUM
##DATA CLASS= NTUPLES
##ORIGIN= Bruker BioSpin GmbH
##OWNER= NMR
$$ XWIN-NMR		Version 3.5
$$ Tue Aug  9 08:32:25 2005 GMT Daylight Time (UT+1h)  MAYBRIDGE\NMR@NMR_250MHZ
##.OBSERVE FREQUENCY= 250.131544655141
##.OBSERVE NUCLEUS= ^1H
##.ACQUISITION MODE= SIMULTANEOUS (DQD)
##.ACQUISITION SCHEME= undefined
##.AVERAGES= 16
##.DIGITISER RES= 18
##SPECTROMETER/DATA SYSTEM= dpx250
##.PULSE SEQUENCE= zg30
##.SOLVENT NAME= CDCl3
##.SHIFT REFERENCE= (INTERNAL, CDCl3, 0, 16.522)
##AUDIT TRAIL= $$ (NUMBER, WHEN, WHO, WHERE, WHAT)
$$ ##TITLE= Audit trail, XWIN-NMR		Version 3.5
$$ ##JCAMPDX= 5.01
$$ ##ORIGIN= Bruker BioSpin GmbH
$$ ##OWNER= NMR
$$ C:\u/data/dgb/nmr/ADRS/7320/pdata/1/auditp.txt
$$ ##AUDIT TRAIL=  $$ (NUMBER, WHEN, WHO, WHERE, WHAT)
(   1,<2005-08-09 08:32:05.57 +100>,<MAYBRIDGE\NMR>,<NMR_250MHZ>,
      <created by zg, POWCHK disabled, PULCHK disabled
       configuration hash MD5:
       62 19 C7 07 E1 42 D1 B7 37 6C 3D D0 77 39 F9 E6
       data hash MD5: 64K
       83 82 03 32 BE 95 80 43 AE 87 51 36 86 41 58 57>)
(   2,<2005-08-09 08:32:16.73 +100>,<MAYBRIDGE\NMR>,<NMR_250MHZ>,
      <Start of raw data processing
       ef LB = 0.3 FT_mod = 6 PKNL = 1 SI = 32K 
       data hash MD5: 32K
       08 C1 D5 36 AE 80 3B 0B 26 57 F8 5A E3 5D 84 83>)
(   3,<2005-08-09 08:32:18.68 +100>,<MAYBRIDGE\NMR>,<NMR_250MHZ>,
      <apk 
       data hash MD5: 32K
       3A 65 07 5B 59 98 0A CA 5A 76 E0 2C 6B 7A 13 4C>)
(   4,<2005-08-09 08:32:19.54 +100>,<MAYBRIDGE\NMR>,<NMR_250MHZ>,
      <abs ABSG = 5 
       data hash MD5: 32K
       20 7A 00 BB 94 C1 F1 FA 41 B6 EA D2 54 82 52 BC>)
$$ ##END=
$$ 
$$ hash MD5
$$ DF F2 78 46 22 28 3B 46 A8 B6 33 84 3B 09 2E 94
##$RELAX= 
##$RELAX= 
##$RELAX= 
##$RELAX= 
##$RELAX= 
##$RELAX= 
##$RELAX= 
$$ Bruker specific parameters
$$ --------------------------
##$DU= <C:\u>
##$EXPNO= 7320
##$NAME= <ADRS>
##$PROCNO= 1
##$TYPE= <nmr>
##$USER= <dgb>
##$AMP= (0..31)
100 100 100 100 100 100 100 100 100 100 100 100 100 100 100 100 100 100 
100 100 100 100 100 100 100 100 100 100 100 100 100 100 
##$AQSEQ= 0
##$AQ_mod= 3
##$AUNM= <au_zg>
##$AUTOPOS= <2 >
##$BF1= 250.13
##$BF2= 250.13
##$BF3= 250.13
##$BF4= 250.13
##$BF5= 500.13
##$BF6= 500.13
##$BF7= 500.13
##$BF8= 500.13
##$BYTORDA= 1
##$CFDGTYP= 0
##$CFRGTYP= 5
##$CHEMSTR= <none>
##$CNST= (0..31)
1 1 145 1 1 1 1 1 1 1 1 1 1 1 1 1 1 1 1 1 1 1 1 1 1 1 1 1 1 1 1 1 
##$CPDPRG= <>
##$CPDPRG1= <>
##$CPDPRG2= <>
##$CPDPRG3= <>
##$CPDPRG4= <mlev>
##$CPDPRG5= <mlev>
##$CPDPRG6= <mlev>
##$CPDPRG7= <mlev>
##$CPDPRG8= <mlev>
##$CPDPRGB= <>
##$CPDPRGT= <>
##$D= (0..31)
0 1 0 0 0 0 0 0 0 0.06 0 0 0 0 0 0 0.0002 0 0 0 0 0 0 0 0 0 0 0 0 0 0 
0 
##$DATE= 1123572724
##$DBL= (0..7)
120 120 120 120 120 120 120 120 
##$DBP= (0..7)
150 150 150 150 150 150 150 150 
##$DBP07= 0
##$DBPNAM0= <>
##$DBPNAM1= <>
$$ [...]
##$SUBNAM7= <"">
##$SUBNAM8= <"">
##$SUBNAM9= <"">
##$SW= 20.6930455092707
##$SWIBOX= (0..15)
0 0 3 0 0 0 0 0 0 0 0 0 0 0 0 0 
##$SW_h= 5175.983436853
##$TD= 65536
##$TD0= 1
##$TE= 295.16
##$TE2= 300
##$TE3= 300
##$TEG= 300
##$TL= (0..7)
0 120 120 120 120 120 120 120 
##$TP= (0..7)
150 150 150 150 150 150 150 150 
##$TP07= 0
##$TPNAME0= <>
##$TPNAME1= <>
##$TPNAME2= <>
##$TPNAME3= <>
##$TPNAME4= <>
##$TPNAME5= <>
##$TPNAME6= <>
##$TPNAME7= <>
##$TPOAL= (0..7)
0.5 0.5 0.5 0.5 0.5 0.5 0.5 0.5 
##$TPOFFS= (0..7)
0 0 0 0 0 0 0 0 
##$TUNHIN= 0
##$TUNHOUT= 0
##$TUNXOUT= 0
##$USERA1= <user>
##$USERA2= <user>
##$USERA3= <user>
##$USERA4= <user>
##$USERA5= <user>
##$V9= 5
##$VALIST= <valist>
##$VCLIST= <CCCCCCCCCCCCCCC>
##$VD= 0
##$VDLIST= <DDDDDDDDDDDDDDD>
##$VPLIST= <PPPPPPPPPPPPPPP>
##$VTLIST= <TTTTTTTTTTTTTTT>
##$WBST= 1024
##$WBSW= 4
##$XGAIN= (0..3)
0 0 0 0 
##$XL= 0
##$YL= 0
##$YMAX_a= 416237
##$YMIN_a= -590109
##$ZGOPTNS= <>
##$ZL1= 120
##$ZL2= 120
##$ZL3= 120
##$ZL4= 120
##$ABSF1= 16.522
##$ABSF2= -4.171173
##$ABSG= 5
##$ABSL= 3
##$ALPHA= 0
##$AQORDER= 0
##$ASSFAC= 0
##$ASSFACI= 0
##$ASSFACX= 0
##$ASSWID= 0
##$AUNMP= <proc_1d>
##$AZFE= 0.1
##$AZFW= 0.1
##$BCFW= 0
##$BC_mod= 0
##$BYTORDP= 0
##$COROFFS= 0
##$CY= 12.5
##$DATMOD= 1
##$DC= 0
##$DFILT= <>
##$DTYPP= 0
##$F1P= 14.0000005364418
##$F2P= -0.99999901652339
##$FCOR= 0.5
##$FTSIZE= 32768
##$FT_mod= 6
##$GAMMA= 0
##$GB= 0
##$INTBC= 1
##$INTSCL= 1
##$ISEN= 128
##$LB= 0.3
##$LEV0= 0
##$LPBIN= 0
##$MAXI= 10000
##$MC2= 0
##$MEAN= 0
##$ME_mod= 0
##$MI= 0
##$NCOEF= 0
##$NC_proc= -3
##$NLEV= 6
##$NOISF1= 0
##$NOISF2= 0
##$NSP= 0
##$NTH_PI= 0
##$NZP= 0
##$OFFSET= 16.522
##$PC= 1
##$PHC0= -79.25397
##$PHC1= 5.396429
##$PH_mod= 1
##$PKNL= yes
##$PPARMOD= 0
##$PSCAL= 4
##$PSIGN= 0
##$REVERSE= no
##$SF= 250.13
##$SI= 32768
##$SIGF1= 0
##$SIGF2= 0
##$SINO= 400
##$SIOLD= 32768
##$SREGLST= <1H.CDCl3>
##$SSB= 0
##$STSI= 32768
##$STSR= 0
##$SW_p= 5175.98343685301
##$SYMM= 0
##$S_DEV= 0
##$TDeff= 65536
##$TDoff= 0
##$TI= <Analysis number 999999
Compound Code 99
Book Reference 9
Project Code 9>
##$TILT= no
##$TM1= 0
##$TM2= 0
##$TOPLEV= 0
##$USERP1= <user>
##$USERP2= <user>
##$USERP3= <user>
##$USERP4= <user>
##$USERP5= <user>
##$WDW= 1
##$XDIM= 32768
##$YMAX_p= 357652757
##$YMIN_p= -51564
$$ End of Bruker specific parameters
$$ ---------------------------------
##NTUPLES= NMR SPECTRUM
##VAR_NAME=  FREQUENCY,     SPECTRUM/REAL,   SPECTRUM/IMAG
##SYMBOL=    X,             R,               I
##VAR_TYPE=  INDEPENDENT,   DEPENDENT,       DEPENDENT
##VAR_FORM=  AFFN,          ASDF,            ASDF
##VAR_DIM=   32768,         32768,           32768
##UNITS=     HZ,            ARBITRARY UNITS, ARBITRARY UNITS
##FACTOR=    0.157963299565203, 1,           1
##FIRST=     4132.6476996994, 0,             0
##LAST=      -1043.33573715361, 0,           0
##MIN=       -1043.33573715361, -51564,      0
##MAX=       4132.6476996994, 357652757,     0
$$ Real data points
##PAGE= N=1
##DATA TABLE= (X++(R..R)), XYDATA
$$ [...]
18811B73417l968k205J258k90m581j2988k8736j6247j4953l805N572o940k0776
$$ 273417 269449 267244 268502 268212 263631 250643 221907 205660 190707 186902 192474 185534 164758
18798A64758j1736J3868J7337J1658N887L689r869m584Q985J4451O616J0896J2884
$$ 164758 153022 166890 184227 195885 201772 205461 195592 191008 199993 214444 221060 231956 244840
18785B44840O610J2135J2368l865J3187K850k0260l103j1653k7823r098J5693
$$ 244840 251450 263585 275953 272088 285275 288125 267865 264762 253109 225286 216188 231881
18773B31881J4355J0389R117m83J8276L2931M9375L2620K028j7667l3274k2928
$$ 231881 246236 256625 265742 265259 283535 316466 365841 398461 400489 382822 349548 326620
18761C26620j5890Q569p559j3044K69R065N424L579k758P5J6993L2171J4905J4385
$$ 326620 310730 319299 311740 298696 298965 308030 313454 317033 314275 314350 331343 363514 378419 392804
18747C92804L8902M3424K0339K7000L8638L7851M7283N7599N2256O7053R7544
$$ 392804 431706 475130 495469 522469 561107 598958 646241 703840 756096 823149 920693
18736I20693J09325J12014R4038J11062J11934J08965J25271J45207J68528J97598
$$ 920693 1030018 1142032 1236070 1347132 1459066 1568031 1693302 1838509 2007037 2204635
18726B204635K65485L71068M95792P01446J043416J581514K361450L001783K518891
$$ 2204635 2470120 2841188 3336980 4038426 5081842 6663356 9024806 12026589 14545480
18717A4545480R47144o18978r71520R7829J777548L004816K950883J976549N99962
$$ 14545480 15492624 14873646 13902126 13999955 15777503 18782319 21733202 23709751 24309713
18708B4309713r45183k345102l049351k348944o19869J059814J363238j07469
$$ 24309713 23364530 21019428 17970077 15621133 15001264 16061078 17424316 17316847
18700A7316847k236508l474714l166965k190714j371431q55772n25126l54743
$$ 17316847 15080339 11605625 8438660 6247946 4876515 4020743 3495617 3140874
18692C140874k34587j74395j18297o8669k9141k6303l1371j9052j7178M6039P4221
$$ 3140874 2906287 2731892 2613595 2544926 2515785 2489482 2458111 2439059 2421881 2467920 2542141
18681B542141R5723J37584J83876K42099L29874M92384P27362J059139J618665
$$ 2542141 2637864 2775448 2959324 3201423 3531297 4023681 4751043 5810182 7428847
18672G428847K497626L468916L422917J780139l39533j339457n11967J390653
$$ 7428847 9926473 13395389 16818306 18598445 18258912 16919455 16407488 17798141
18664A7798141L143179L718047L083842J875349M0104k171953l841047l705137
$$ 17798141 20941320 24659367 27743209 29618558 29658662 27486709 23645662 19940525
18656A9940525j766066N74800J730540O62765j858956l938517m218724l206318
$$ 19940525 18174459 18749259 20479799 21142564 19283608 15345091 11126367 7920049
18648G920049k118178j358392r07523o25413m39829l23627k31175j81220j53453
$$ 7920049 5801871 4443479 3535956 2910543 2470714 2147087 1915912 1734692 1581239
18639A581239j13800r9962q0142n7887n9281o1085o1229n8361m6254m5150k9089
$$ 1581239 1467439 1367477 1287335 1229448 1170167 1109082 1047853 989492 943238 898088 868999
18628H68999r596j0601j6033k0211k3293p885K3126L7375L1397K4459N5122M6119
$$ 868999 859403 848802 832769 812558 789265 781380 804506 841881 873278 897737 952859 998978
18616I98978O5037Q6375Q5087J05162J25792J42686J52993J71382J86365K26142
$$ 998978 1064015 1150390 1235477 1340639 1466431 1609117 1762110 1933492 2119857 2345999
18606B345999K46744K94571L60228M63346N96179P69255J026732J432855K117049
$$ 2345999 2592743 2887314 3247542 3710888 4307067 5076322 6103054 7535909 9652958
18597I652958L049249M005917M472039M039575K788862R56074j025277k483105
$$ 9652958 12702207 16708124 21180163 25219738 28008600 28964674 27939397 25456292
18589B5456292k775353j723944J09811J785884K515343K202461J256639J72161
$$ 25456292 22680939 20956995 21066806 22852690 25368033 27570494 28827133 28999294
18581B8999294n15274m10942N09709J515538J727568R28865o06099k301577l436774
$$ 28999294 28484020 28073078 28582787 30098325 31825893 32754758 32148659 29847082 26410308
18572B6410308l433897k170350k70046J352603J892059J222499k08529j828364
$$ 26410308 22976411 20806061 20536015 21888618 23780677 25003176 24794647 22966283
18564B2966283l179030l900357l845987l157969k240082j529250j050474p27005
$$ 22966283 19787253 15886896 12040909 8882940 6642858 5113608 4063134 3336129
18556C336129n30480m12141l18302k37952j86722j60195j38091j31470j14849
$$ 3336129 2805649 2393508 2075206 1837254 1650532 1490337 1352246 1220776 1105927
18547A105927j20277r8450r2053p3504o1925m8298l7115m5568n1386m8235k3455
$$ 1105927 985650 887200 795147 721643 659718 611420 574305 528737 477351 429116 405661
18536D05661j990k0282j6736j2244j9650j087K729q817r541p508j4457J400P808
$$ 405661 403671 383389 366653 354409 334759 333672 336401 327584 318043 310535 296078 297478 305286
18523C05286j119N264K818p280M856J0680Q598M503K909M550m358k712k397M090
$$ 305286 304167 309431 312249 304969 309825 320505 329103 333606 336515 341065 336707 333995 331598 335688
18509C35688J1857P952j551p245J389P029k8811j1845j1829j6469l039k194j0302
$$ 335688 347545 355497 353946 346701 348090 355119 326308 314463 302634 286165 283126 280932 270630
18496B70630j6209j046M839r105n949j8566j6569j6705j4643l015r652j0380r087
$$ 270630 254421 253375 258214 249109 243160 224594 208025 191320 176677 173662 164010 153630 144543
18483A44543j7228m308o604k1577q654J3006q543j4531O038J2200N373j375o982
$$ 144543 127315 123007 116403 94826 86172 99178 90635 76104 82142 94342 99715 98340 91358
18470I1358j0366l594L332J0529J4972k569J1049m068j2648n837l726M478N592
$$ 91358 80992 77398 80730 91259 106231 103662 114711 110643 97995 92158 88432 92910 98502
18457I8502L352L523M827O867j434p704j5784q336j5266N887p242k138K0198Q219
$$ 98502 101854 105377 110204 117071 115637 107933 92149 83813 68547 74434 67192 65054 85252 93471
18443I3471q691j0298j2673n305N313j373o481n279N61k856r550N078J025J0832
$$ 93471 84780 74482 61809 56504 61817 60444 53963 48684 49245 46389 36839 41917 42942 53774
18429E3774L887J698L089m071O351M167O5k445L324J1842J239o497J1494N849
$$ 53774 57661 59359 62448 58377 64728 68895 68960 66515 69839 81681 82920 76423 87917 93766
18415I3766l13j2258j1890l962l493o206r22J0119l947q96Q244J8053J5716J5931
$$ 93766 93453 81195 69305 65343 61850 55644 54722 64841 60894 59998 68242 86295 102011 117942
18401A17942J5813J7612l210M486j5418r898M399P141Q286J2782K0565N731n356
$$ 117942 133755 151367 148157 152643 137225 127327 131726 138867 147153 159935 180500 186231 180875
18388A80875K000l183j7030K228K2008J9226K5833L0316J6865J9092O785k075
$$ 180875 182875 179692 162662 164890 186898 206124 231957 262273 279138 298230 305015 302940
18376C02940J0664J6685P612n331l103K955J1296j0286O362l441r380n979l901
$$ 302940 313604 330289 337901 332570 329467 332422 343718 333432 339794 336353 326973 320994 317093
18363C17093k18R127K764K1017J6252J3039J6569K4445J8613K5509J4774l694
$$ 317093 316875 326002 328766 349783 366035 379074 395643 420088 438701 464210 478984 475290
18351D75290j4692j3717p920K141r401j9601j6791q031L986K2624P648J2753J2213
$$ 475290 460598 446881 438961 441102 431701 412100 395309 387278 391264 413888 421536 434289 446502
18338D46502q417k6157k7522j2109l137J1776Q967J9663J2356l443q228N245R907
$$ 446502 438085 411928 384406 372297 369160 380936 389903 409566 421922 418479 410251 415496 425403
18325D25403N119J887o140j7697k2199j8621j7507j2263k0495j0899q179n596
$$ 425403 430522 432409 426269 408572 386373 367752 350245 337982 317487 306588 298409 292813
18313B92813l378N995P090Q362K2550J8903N258L0838L0439J1321J9662P844Q594
$$ 292813 289435 295430 302520 310882 333432 352335 357593 388431 418870 430191 449853 457697 466291
18300D66291K502J4386K7047M4431M1429N1356N2007K7742J6101J0330l275k0847
$$ 466291 468793 483179 510226 554657 596086 647442 699449 727191 743292 753622 750347 729500
18288G29500k3321k0289l530J0559L4932O8104P3498Q0686J17389J39656J58231
$$ 729500 706179 685890 682360 692919 727851 795955 869453 950139 1067528 1207184 1365415
18277A365415J89549K38510K76085L18760M06813N47946P67167J091240J637735
$$ 1365415 1554964 1793474 2069559 2388319 2795132 3343078 4110245 5201485 6839220
18268F839220K560586L774432M465977L798455K119476n3185k212609l880910
$$ 6839220 9399806 13174238 17640215 21438670 23558146 23504961 21292352 17411442
18260A7411442m490135l791289k618223j701949j131101p80767n59233m09970
$$ 17411442 12921307 9130018 6511795 4809846 3678745 2897978 2338745 1928775
18252A928775k93070j86295j09456p9116m9273k1270J0198M0302M0718N3605L2207
$$ 1928775 1635705 1449410 1339954 1260838 1211565 1190295 1200493 1240795 1281513 1335118 1367325
18241A367325K7149J7328J9067K0159L8704M7254O3635N3931O6063J02181J34863
$$ 1367325 1394474 1411802 1430869 1451028 1489732 1536986 1600621 1654552 1720615 1822796 1957659
18230A957659J37260J91572K65476L41296M29495N44057O88299Q79138J168983
$$ 1957659 2094919 2286491 2551967 2893263 3322758 3866815 4555114 5434252 6603235
18221F603235J659580K429378L581112M738703N185501N097840N003451M402800
$$ 6603235 8262815 10692193 14273305 19012008 24197509 29295349 34298800 38701600
18213C8701600K452549l37425k806376m765875o235304o775815n821563m143427
$$ 38701600 41154149 40816724 38010348 33244473 27009169 20233354 14411791 10268364
18205A0268364k753806j849251j253705q77402o53609m67199l37358k39436j54199
$$ 10268364 7514558 5665307 4411602 3534200 2880591 2413392 2076034 1836598 1682399
18196A682399r8807p7039m0915l6500k4082k6171k3970p845L833L3009M6400P7697
$$ 1682399 1583592 1506553 1465638 1429138 1405056 1378885 1354915 1347070 1350903 1383912 1430312 1508009
18184A508009N9383M6362R529K5404M1648N0848J12275J88569K27883K75835L25815
$$ 1508009 1567392 1613754 1623283 1648687 1690335 1741183 1853458 2042027 2269910 2545745 2871560
18173B871560L89430N04189O91079R44623J382516K133285L336619M550092M649492
$$ 2871560 3260990 3765179 4456258 5400881 6783397 8916682 12253301 16803393 21452885
18164B1452885L327418J178601j239637l402777m795157m766357l602233k378923
$$ 21452885 24780303 25958904 24719267 21316490 16521333 11754976 8152743 5773820
18156E773820j543611j036856p14446n08305l86911k79593j97218j48280j15862
$$ 5773820 4230209 3193353 2478907 1970602 1583691 1304098 1106880 958600 842738
18147H42738q8037n5715n7397m9229k3996p218j0722M757K1964L6505L5179L0823
$$ 842738 754701 698986 641589 592360 568364 561146 550424 555181 577145 613650 648829 679652
18135F79652K8914K3229k686k2670m4957k4258j1999R239K3152K3779K3781K2232
$$ 679652 708566 731795 729109 706439 661482 637224 625225 634464 657616 681395 705176 727408
18123G27408M2625P0003Q7873J21666J68450K03290K45800K80785L56327M58053
$$ 727408 770033 840036 927909 1049575 1218025 1421315 1667115 1947900 2304227 2762280
18113B762280O69193J019830J708522L096219N418157O946054M661714o9645m755698
$$ 2762280 3431473 4451303 6159825 9256044 14674201 21620255 26281969 26212324 21456626
18104B1456626o992966n523108l254234j842652j091956p04041m86652l35592
$$ 21456626 14463660 8940552 5686318 3843666 2751710 2047669 1561017 1225425
18096A225425k17057j74453j29361r6630r4409o4555l9803l1143j6629l4423l1178
$$ 1225425 1008368 833915 704554 607924 513515 448960 409157 378014 361385 326962 295784
18085B95784j7180n961m229p65j0470J6478K1787P708o71P382J056N596K3097
$$ 295784 278604 272643 268414 267649 257179 273657 295444 303152 302481 309863 310919 316515 339612
18072C39612P024j794k515J7645K033K032j1040n9J380o432l49O45j9552j5245
$$ 339612 346636 344842 342327 359972 362005 364037 352997 352938 354318 347886 347537 348182 328630 313385
18058C13385j3853j5218j2142j2817j3971j1934J2512N041j5577j5123l4102k7695
$$ 313385 299532 284314 272172 259355 245384 233450 245962 251003 235426 220303 186201 158506
18046A58506j2274j4732m819L38J928j5774j9385K889J460l319p706J0879j823
$$ 158506 146232 131500 126681 127019 128947 113173 93788 96677 98137 94818 87112 97991 96168
18033I6168j0887q365O569P254J3354J0533k558j1733j3142J1515L6396M3023
$$ 96168 85281 76916 83485 90739 104093 114626 112068 100335 87193 98708 135104 178127
18021A78127K6843J6978J4495K3673J1331J480M766j0299j7133O98m714R60k0618
$$ 178127 204970 221948 236443 260116 271447 272927 277693 267394 250261 250959 246245 247205 226587
18008B26587j9374j9441l0260k1811N91Q575Q081n60J853j868J597J524p313o872
$$ 226587 207213 187772 157512 135701 136292 144867 152948 152388 154241 152373 153970 155494 148181 141309
17994A41309J475L270O6J0851o339j3456L633o303N838J580M755o837j2550j4600
$$ 141309 142784 146054 146120 156971 150632 137176 140809 134506 140344 141924 146679 139842 127292 112692
17980A12692J2943J0925L443L83L577O199J646j4125J368J8108J1721M946K629
$$ 112692 125635 136560 140003 140386 143963 150162 151808 137683 139051 157159 168880 173826 176455
17967A76455J6384J5251J419j3524N905L976N690j4768k0194k770j763L293M511
$$ 176455 192839 208090 209509 195985 201890 205866 211556 196788 176594 173824 172061 175354 179865
17954A79865K352j3170n008k022L271l6N834k243n565m177Q320J2452J611K056
$$ 179865 182217 169047 164039 162017 165288 165252 171086 168843 163278 159101 167421 179873 181484 183540
17940A83540N197J2178k194j0283m73K26N019P685N512J5049J5747N230J0814
$$ 183540 188737 200915 198721 188438 187965 188191 193210 200895 206407 221456 237203 242433 253247
17927B53247M499M874J0284P426M672K1098J0450J6430L4708L1203L6482L0069
$$ 253247 257746 262620 272904 280330 285002 306100 316550 332980 367688 398891 435373 465442
17915D65442M0840N1693O1693N3394M0589N0276N6515N9563P4023J06368J00708
$$ 465442 506282 557975 619668 673062 713651 763927 820442 880005 954028 1060396 1161104
17904A161104R0855J13564J47624J99471K59402L19611L80658M50104N76255P46856
$$ 1161104 1251959 1365523 1513147 1712618 1972020 2291631 2672289 3122393 3698648 4445504
17894D445504J088210J652729K501680L456551L676977K463347K84842j446998
$$ 4445504 5533714 7186443 9688123 13144674 16821651 19284998 19569840 18122842
17886A8122842j514877j44420J510135K031754P24524j509290l053919l072327
$$ 18122842 16607965 16463545 17973680 20005434 20729958 19220668 16166749 13094422
17878A3094422k084566q62588L17818J527036K616521K948086J876162j24667
$$ 13094422 11009856 10147268 10465086 11992122 14608643 17556729 19432891 19308224
17870A9308224j651159j677528l65883J124190J504688J94863j922004l394009
$$ 19308224 17657065 15979537 15613654 16737844 18242532 18437395 16515391 13121382
17862A3121382l469855k639148j778162j141763p30254m63971k98470j94021j52568
$$ 13121382 9651527 7012379 5234217 4092454 3362200 2898229 2599759 2405738 2253170
17853B253170j06146l9188q363K4661P5588J13441J54465K04910K57322L41725
$$ 2253170 2147024 2107836 2099473 2124134 2199722 2313163 2467628 2672538 2929860 3271585
17843C271585M59659O81098J067754J681173K468646K872393K225998O08109r30614
$$ 3271585 3731244 4412342 5480096 7161269 9629915 12502308 14728306 15336415 14405801
17834A4405801j350495n48073P15855J414092Q07698o97321k011922k329100j767145
$$ 14405801 13055306 12507233 13223088 14637180 15444878 14747557 12735635 10406535 8639390
17825H639390q69299N0113R76521J892885K368626J762954K05848j234006j559499
$$ 8639390 7770091 7820204 8796725 10689610 13058236 14821190 15027038 13793032 12233533
17816A2233533o91865N30917J116716M18526j112429k396652k680861k136389
$$ 12233533 11541668 12072585 13189301 13607827 12495398 10098746 7417885 5281496
17808E281496j461762r47040o07592m02404k92312k23074j78618j52496j26202
$$ 5281496 3819734 2872694 2265102 1862698 1570386 1347312 1168694 1016198 889996
17799H89996r8364p2560o7975p0533n1842m0020k8349l2444k5465k0138k0573
$$ 889996 791632 719072 651097 580564 528722 488702 460353 427909 402444 382306 361733
17788C61733l1982k6263j9823m602l308j6614j9276j2804j08j0921j2162M095
$$ 361733 329751 303488 283665 279063 275755 259141 239865 227061 226953 216032 203870 207965
17776B07965O744j4886j4574p433N030R387O358j0606j1740k733q59J0025P794
$$ 207965 214709 199823 185249 177816 182846 192233 198591 187985 176245 173512 172653 182678 190472
17763A90472r35j3096k0880q955J3103N346N938Q082m021m091j074r327J4140
$$ 190472 189537 176441 155561 146606 159709 165055 170993 179075 175054 170963 169889 160562 174702
17750A74702K419J7587J2778R752K7377J9371J89r053j6528k1107l9942k0241
$$ 174702 177121 194708 207486 217238 244615 263986 264175 255122 238594 217487 177545 157304
17738A57304k1625j3356j5667k1756j3561j4346J546j123j714N230n004j295L889
$$ 157304 135679 122323 106656 84900 71339 56993 58539 57416 55702 60932 55928 54633 58522
17725E8522O19l56K173M253O140M418N099J0459N226r970o370R0N133l050k460
$$ 58522 59141 58785 60958 65211 71351 75769 80868 91327 96553 86583 80213 80303 85436 82386 79926
17710G9926K0394J2466n616j0203J0826M91m649k006j113J6003K6090K9143L2121
$$ 79926 100320 112786 107170 96967 107793 108284 103635 101629 100516 116519 142609 171752 203873
17697B03873K4405R048o258j2243j2847j2429k8138l2498k5577k4497k6149k0527
$$ 203873 228278 237326 231068 218825 205978 193549 165411 132913 107336 82839 56690 36163
17685C6163j8075j0473k799l856N490L207k0608j8283J1403N675J1369J2409N523
$$ 36163 18088 7615 4816 960 6450 9657 -10951 -29234 -17831 -12156 -787 11622 17145
17672A7145J210m80R467j1415j3982K604L4q32K771k857L079J0665l465k5389
$$ 17145 18355 17875 27342 15927 1945 4549 4583 3751 6522 3665 6744 17409 13944 -11445
17658a1445p656P108J1223L282J4333J0865m472p60p74J2962O111P548J9846J4478
$$ -11445 -19101 -11993 -770 2512 16845 27710 23238 22478 21704 34666 40777 48325 68171 82649
17644H2649p367n904j9347j9214m885Q797O76o910j2238j389K955j2526j3406
$$ 82649 75282 69378 50031 30817 25932 34729 35405 28495 16257 14868 17823 5297 -8109
17631h109l671m974l436q566Q812J0034J5572M453P63n602M161o817K849N471
$$ -8109 -11780 -16754 -20190 -28756 -19944 -9910 5662 10115 10878 5276 9437 2620 5469 10940
17617A0940k439K975O576j700o894l166j0565L819M681p975l393K509o42j9455
$$ 10940 8501 11476 18052 16352 9458 6292 -4273 -454 4227 -3748 -7141 -4632 -5274 -24729
17603b4729J643k25O023K2664R114R565k812j6563j0736O282j064J502J0325L880
$$ -24729 -23086 -23311 -17288 5376 14490 24055 21243 4680 -6056 226 -838 664 10989 14869
17589A4869k94K802o011n022K501q39J977k905O146r353j1272K641o930m411M111
$$ 14869 14575 17377 11366 6344 8845 8006 9983 7078 13224 3871 -7401 -4760 -11690 -16101 -11990
17574a1990M813Q685J1230J352j2894j3524R613J3087j406L727k185j1069j4582
$$ -11990 -7177 1508 12738 14090 1196 -12328 -2715 10372 8966 12693 10508 -561 -15143
17561a5143P363J6919n205k909l852k175K016n789o545j2322L984J3863J4572
$$ -15143 -7780 9139 3934 1025 -2827 -5002 -2986 -8775 -15320 -27642 -23658 -9795 4777
17548D777J252N614N599j7167L167n597L63J04k149q708j601n269m649R03o482
$$ 4777 6029 11643 17242 75 3242 -2355 -1992 -1888 -4037 -12745 -14346 -19615 -24264 -23361 -29843
17533b9843m68J4929J2469K61M144o082j3656J504L104J02J251r359n114m36k518
$$ -29843 -30311 -15382 -2913 -2652 1492 -4590 -18246 -16742 -13638 -13536 -12285 -21644 -26758 -27194 -29712
17518b9712j866J2527J413j5401N610J7632J2605l591n655l691K97J589K230Q287
$$ -29712 -31578 -19051 -17638 -33039 -27429 -9797 2808 -783 -6438 -10129 -9832 -8243 -6013 2274
17504B274k824N545j273j4533n262Q27J886j1539j865r008o095R35J3991O170
$$ 2274 -550 4995 3722 -10811 -16073 -15246 -13360 -24899 -26764 -35772 -41867 -40932 -26941 -20771
17490b0771J672Q020M970R01K562P603L018j9176r480m322p3j415j3174J1001
$$ -20771 -19099 -11079 -6109 -5208 -2646 4957 7975 -11201 -20681 -25003 -25076 -26491 -39665 -28664
17476b8664J8455j306q233m700O920O556J498J474o532J4370J650j0962N764J2438
$$ -28664 -10209 -11515 -19748 -24448 -17528 -10972 -9474 -8000 -14532 -162 1488 -9474 -3710 8728
17462H728l429p942q351m419J5390J6278r331r377q89o735j0549M370L416J0384
$$ 8728 5299 -2643 -10994 -15413 -23 16255 6924 -2453 -3342 -10077 -20626 -16256 -12840 -2456
17448b456K729J63M643O539N338K6947M4108L1491K3710p611l0932n2085l8014
$$ -2456 273 436 5079 11618 16956 43903 88011 119502 143212 135601 104669 52584 14570
17435A4570p127J4067o745r621j1936P792l578J576P282N064L81L498j5690l304
$$ 14570 7443 21510 14765 5144 -6792 1000 -2578 -1002 6280 11344 11725 15223 -467 -3771
17421c771j464n386J0099l431r617r640M486L120O618n21K091m13J1218q103j2725
$$ -3771 -5235 -10621 -522 -3953 -13570 -23210 -18724 -15604 -8986 -9507 -7416 -7829 3389 -4714 -17439
17406a7439N67J4528m904j1132J3001Q62P571K164j876O569j1178m591Q458o880
$$ -17439 -16872 -2344 -7248 -18380 -5379 -4517 3054 5218 3342 9911 -1267 -5858 2600 -4280
17392d280r916R927o229J2172J0128j4184J679K1870J3738J1659K5596J1932j2397
$$ -4280 -14196 -4269 -10498 1674 11802 -2382 -703 21167 34905 46564 72160 84092 71695
17379G1695j7029K604O630P427J8195o79k2278k3481o12J850p023n615J4482K836
$$ 71695 54666 57270 63900 71327 89522 88843 66565 43084 42472 44322 37299 31684 46166 49002
17365D9002L04K839J0311q1l077N289J1969J4988j760j5393j1606j6997k5551
$$ 49002 49306 52145 62456 62375 59298 64587 76556 91544 89784 74391 62785 45788 20237
17352B0237j5192K122J5801P216j9872O831M942l743J0179q652k6132j6905J54
$$ 20237 5045 7167 22968 30184 10312 17143 22085 18342 28521 19869 -6263 -23168 -23014
17339b3014J1079P397P564Q251M835MK3717l360P388K8953N461O559M366q487
$$ -23014 -11935 -4538 3026 11277 16112 16116 39833 36473 43861 72814 78275 84834 89200 80713
17325H0713m771k240j7056p17Q154l463j0739k1329m197K02J4677J5391k21j813
$$ 80713 75942 73702 56646 55929 64083 60620 49881 28552 24355 24557 39234 54625 54404 52591
17311E2591J3491P594m170K05K000n20J2583N285j5328j4633j3196l2575k1266
$$ 52591 66082 73676 69506 69711 71711 71191 83774 89059 73731 59098 45902 13327 -7939
17298g939N524J0588L182j7859j0042J421k862j6091m118Q313Q094k111m800K979
$$ -7939 -2415 8173 11355 -6504 -16546 -15125 -17987 -34078 -38196 -29883 -21789 -23900 -28700 -25721
17284b5721J9993O21J1436N385r29j8809j6668o744N181J1937J082j0950M336
$$ -25721 -5728 -5107 6329 11714 10785 -8024 -24692 -31436 -26255 -14318 -13236 -24186 -19850
17271a9850k525L466K2565O982j597k6j1153j4892n349M309R480O176r129n663
$$ -19850 -22375 -18909 3656 10638 9041 9015 -2138 -17030 -22379 -18070 -8590 -2414 -11543 -17206
17257a7206m651K303N075Q391N888N313l431o655l515p1L697j3522j6182J103
$$ -17206 -21857 -19554 -14479 -6088 -200 5113 1682 -4973 -8488 -8559 -4862 -18384 -34566 -33463
17243c3463J7142K816o64l78J2661L400q970n374L8l462M452L490j7382L03J7737
$$ -33463 -16321 -13505 -14169 -14547 -1886 1514 -7456 -12830 -12792 -16254 -11802 -8312 -25694 -25391 -7654
17228g654N191K464Q08R126p3l29n928r55O19L132R890l012r876l249J727l349
$$ -7654 -2463 1 809 9935 9862 9533 3605 2650 3269 6401 16291 13279 3403 154 1881 -1468
17212a468j0256L030l649j341J436m346p684M266N875J7352Q955j4070r544P803
$$ -1468 -11724 -8694 -12343 -13684 -12248 -16594 -24278 -20012 -14137 3215 12170 -1900 -11444 -3641
17198c641p394l49L238K338r728j8403J9843m365J242J3007R711L01q989R776
$$ -3641 -11035 -11384 -8146 -5808 -15536 -33939 -14096 -18461 -17219 -4212 5499 5800 -3189 6587
17184F587J6271l302j1752M320J5228J453j4363k6792n480k534P47k576O757N621
$$ 6587 22858 19556 7804 12124 27352 28805 14442 -12350 -17830 -20364 -19617 -22193 -15436 -9815
17170i815j0096j77J2508k418j1062J3574j238R7l027j56J2387J025p450o453
$$ -9815 -19911 -20088 -7580 -9998 -21060 -7486 -8724 -8627 -11654 -11810 577 1602 -5848 -12301
17156a2301l841q882P193n482r027J5148l112j738k671R020M660P646P694K371
$$ -12301 -16142 -25024 -17831 -23313 -32340 -17192 -20304 -22042 -24713 -15693 -11033 -3387 4307 6678
17142F678p980o147o095L469J4144P207o978j5932j0379J7428J7309o676p619
$$ 6678 -1302 -7449 -13544 -10075 4069 11276 4298 -11634 -22013 -4585 12724 6048 -1571
17129a571N71l84K109j118q821j0654m106J7055M972m947M651j0861L415L186
$$ -1571 -1000 -1384 725 -393 -9214 -19868 -23974 -6919 -1947 -6894 -2243 -13104 -9689 -6503
17115f503m856J2868L693J766k882q374r121j1214o80J398O891J411o37K058N712
$$ -6503 -11359 1509 5202 6968 4086 -4288 -13409 -24623 -25303 -23905 -17014 -15603 -16240 -14182 -8470
17100h470j3032N133J2882K339m737R766L758P061Q337o159j9576n426J1473p078
$$ -8470 -21502 -16369 -3487 -1148 -5885 3881 7639 14700 23037 16878 -2698 -8124 3349 -3729
17086c729o263p401N637N176r589k162N021k849K23m012j0562j837J5316q84J2445
$$ -3729 -9992 -17393 -11756 -6580 -16169 -18331 -13310 -16159 -15936 -19948 -30510 -32347 -17031 -17915 -5470
17071e470J1265k670j0524Q44J3820j1700n769L009K903J092J534p456L385p419
$$ -5470 5795 3125 -7399 -6555 7265 -4435 -10204 -7195 -4292 -3200 -1666 -9122 -5737 -13156
17057a3156J68J999r070L982J3323K710K378N600r624j528O98r098J093k87J931
$$ -13156 -12988 -10989 -20059 -16077 -2754 -44 2334 7934 -1690 -3218 -2520 -11618 -10525 -10812 -8881
17042h881L065r873J681j210p209Q868k19l749P961n726l759K279P353Q56m874
$$ -8881 -5816 -15689 -14008 -15218 -22427 -13559 -13778 -17527 -9566 -15292 -19051 -16772 -9419 -8563 -13437
17027a3437r332o403Q843J0933N112J0755p474j9180P79M631l001m97K679j518
$$ -13437 -22769 -29172 -20329 -9396 -4284 6471 -1003 -20183 -19404 -14773 -17774 -18271 -15592 -17110
17013a7110o204O476l341P438J6744j2444L429J9567k32R42o264j5474j3183n434
$$ -17110 -23314 -16838 -20179 -12741 4003 -8441 -5012 14555 14323 15265 9001 -6473 -19656 -25090
16999b5090Q743m780k639P978J588j251J4632M244K407j6648j6666J4972J5059
$$ -25090 -16347 -21127 -23766 -15788 -14200 -15451 -819 3425 5832 -10816 -27482 -12510 2549
16986B549l340o618P366m72J054q930j2121J370K235k225Q672O22q550R538M179
$$ 2549 -791 -7409 -43 -515 539 -8391 -20512 -19142 -16907 -19132 -10460 -9838 -18388 -8850 -4671
16971d671Q506J987j1712n553K659M852n826q010L959P220j0269p23J4652O757
$$ -4671 3835 5822 -5890 -11443 -8784 -3932 -9758 -17768 -13809 -6589 -16858 -17581 -2929 3828
16957C828l18j0434j023P328R8k770J4676P628q270p151j8329j303M807K10L57
$$ 3828 3510 -6924 -7947 -619 -521 -3291 11385 19013 10743 3592 -14737 -16040 -11233 -11023 -10666
16942a0666L521j4306M30O934K029N717m84P291n074j8655J128R847O167M870
$$ -10666 -7145 -21451 -21021 -14087 -12058 -6341 -6825 466 -4608 -23263 -22135 -12288 -6121 -1251
16928a251j0458l914R598l250m744M866L984R74M863P079j0757j4768q288J0012
$$ -1251 -11709 -15623 -6025 -9275 -14019 -9153 -5169 -4195 668 7747 -3010 -17778 -26066 -16054
16914a6054J1619k241r30R844n777o932q2J1432J001p682l748J851k968p469o307
$$ -16054 -4435 -6676 -7606 2238 -3539 -10471 -10553 879 1880 -5802 -9550 -7699 -10667 -18136 -24443
16899b4443q554R769J9628R373P197n729j1312j2236j1717J1719K560m723j124
$$ -24443 -32997 -23228 -3600 5773 12970 7241 -4071 -16307 -28024 -16305 -13745 -18468 -19592
16886a9592Q838Q325j3933Q61r67r384J0961J5385j298l328k444j2604K892J4123
$$ -19592 -10754 -2429 -16362 -15501 -16468 -25852 -14891 494 -804 -4132 -6576 -19180 -16288 -2165
16872b165Q087Q566K407j1487q825m223j7302k317J3942J3194O464m672N91n913
$$ -2165 5922 14488 16895 5408 -3417 -7640 -24942 -27259 -13317 -123 6341 1669 2260 -3653
16858c653j2134j825N733L536Q480K949J575Q140J0115q28k1480n02J103J0981
$$ -3653 -15787 -17612 -11879 -8343 137 3086 4661 12801 22916 22088 608 106 1209 12190
16844A2190j518j6697j1964R955Q857P581l374k05o418j9623p847J1633J0862
$$ 12190 10672 -6025 -17989 -8034 823 8404 5030 4825 -1593 -21216 -29063 -17430 -6568
16831f568J737q298P161K385o89j50j1371p270l796l0J2162k038m549J805R48
$$ -6568 -4831 -13129 -5968 -3583 -4272 -4422 -15793 -23063 -26859 -26889 -14727 -16765 -21314 -19509 -18561
16816a8561Q832O083N949r964r176K464J058L375p602p322J4053M615j3330J0700
$$ -18561 -9729 -3646 2303 -7661 -16837 -14373 -13315 -9940 -17542 -24864 -10811 -6196 -19526 -8826
16802h826k594m645P7J5845R397j1917m536J3934J680j3998j0773l423k971q492
$$ -8826 -11420 -16065 -15988 -143 9254 -2663 -7199 6735 8415 -5583 -16356 -19779 -22750 -31242
16788c1242M935P870m688p002Q973N623q48N123j507l354K671p209M763M493L931
$$ -31242 -26307 -18437 -23125 -30127 -21154 -15531 -16379 -11256 -12763 -16117 -13446 -20655 -15892 -11399 -7468
16773g468N711l168p853K933J300k02o165o61J0503J4288r7j1684R755J1191j0204
$$ -7468 -1757 -4925 -12778 -9845 -8545 -8747 -14912 -15573 -5070 9218 9121 -2563 7192 18383 8179
16758H179j4450L924Q013j4062p835m322o139q77P925J1792J9095K454j7456j6408
$$ 8179 -6271 -2347 5666 -8396 -16231 -20553 -26692 -27569 -19644 -7852 11243 13697 -3759 -20167
16744b0167L156m201o555k709J000J1256L798N286j4726L231O352m277M05L461
$$ -20167 -17011 -21212 -27767 -30476 -29476 -18220 -14422 -9136 -23862 -20631 -14279 -18556 -18151 -14690
16730a4690N365o761O958j223K933P296N678K878K895K028j23P688L77o126n896
$$ -14690 -9325 -16086 -9128 -10351 -7418 -122 5556 8434 11329 13357 13234 20922 21299 15173 9277
16715I277l439j198K011l131j152n177K437L148j3817o166L614k784j455O607
$$ 9277 5838 4640 6651 3520 2368 -2809 -372 2776 -11041 -17207 -13593 -16377 -17832 -11225
16701a1225j2261k3029J047J8373L966J144L396J1756P283O363n616M491j7243
$$ -11225 -23486 -46515 -45468 -27095 -23129 -21985 -18589 -6833 450 6813 1197 5688 -11555
16688a1555j0349Q500o37J758j055r691M492M22k859l448Q924O547Q391r460K151
$$ -11555 -21904 -13404 -14041 -12283 -13338 -23029 -18537 -18115 -20974 -24422 -15498 -8951 -560 -10020 -7869
16673g869K971r587M335J5608p210j4886O327q233n371L761k688K3M24N577J4677
$$ -7869 -4898 -14485 -10150 5458 -1752 -16638 -10311 -18544 -23915 -20154 -22842 -22819 -22395 -16818 -2141
16658b141q413n76Q542k360m298J2094K268n259r526k900p638j1129k964N679
$$ -2141 -10554 -11130 -2588 -4948 -9246 2848 5116 -143 -9669 -12569 -20207 -31336 -34300 -28621
16644b8621R204R464p796K601J9393Q456n858j1339r375l233N280p137j0914K023
$$ -28621 -19417 -9953 -17749 -15148 4245 12701 6843 -4496 -13871 -17104 -11824 -18961 -29875 -27852
16630b7852Q012q153j059N821L67l442J0735L772J987K986k985Q797K259R48n476
$$ -27852 -19840 -27993 -29052 -23231 -22864 -26306 -15571 -11799 -9812 -6826 -9811 -1014 1245 2193 -3283
16615c283j3011K220j3174m22J3677J1973o189p361K172j1389K987K6000M334
$$ -3283 -16294 -14074 -27248 -27670 -13993 -2020 -8209 -15570 -13398 -24787 -21800 4200 8534
16602H534p087j2939O389k239q48Q196m427j4677K3J2067M176K955J780j2619
$$ 8534 1447 -11492 -5103 -7342 -8190 6 -4421 -19098 -19075 -7008 -2832 123 1903 -10716
16588a0716j0399q68Q761j357J222M636k223J5809J5079L314n115j4070j470M264
$$ -10716 -21115 -21983 -13222 -14579 -13357 -8721 -10944 4865 19944 23258 18143 4073 2603 6867
16574F867M831o723j3527O786p172j631L236J531p593J3041l331M397O123j044
$$ 6867 11698 4975 -8552 -1766 -8938 -10569 -7333 -5802 -13395 -354 -3685 712 6835 5791
16560E791k933j7871j584l99K353M324N361o936j6058k663q12Q146J2759N147
$$ 5791 2858 -15013 -16597 -16996 -14643 -10319 -4958 -11894 -27952 -30615 -31427 -23281 -10522 -5375
16546e375q767J570N431Q17n494J3503j354m15j1778R75R446Q457l035k1396r85
$$ -5375 -14142 -12572 -7141 -6324 -11818 1685 331 -84 -11862 -10887 -1441 7016 3981 -17415 -18400
16531a8400J1951j1503J45J8616m030k0M842q017O305J0058R145j822n527k0686
$$ -18400 -6449 -17952 -17807 809 -3221 -3241 1601 -6416 -111 9947 19092 17270 11743 -8943
16517h943j1475j727k0263P583J8245M477Q39k914j250L069Q978P947N595k077
$$ -8943 -20418 -22145 -42408 -34825 -16580 -12103 -11264 -14178 -15428 -12359 -3381 4566 10161 8084
16503H084m886j2197m586L354J11o891J99j1838J475Q293L017j523q983k87o966
$$ 8084 3198 -8999 -13585 -10231 -10120 -17011 -16812 -28650 -27175 -18882 -15865 -17388 -26371 -26658 -33624
16488c3624J4497O292K989J594P3k188j256J618R121K3886k856j1684J408L130
$$ -33624 -19127 -12835 -9846 -8252 -8179 -10367 -11623 -10005 -884 23002 20146 8462 9870 13000
16474A3000l464p280j2346r955p336l684J0158M497l365p766M302l162O431p963
$$ 13000 9536 2256 -10090 -20045 -27381 -31065 -20907 -16410 -19775 -27541 -23239 -26401 -19970 -27933
16460b7933J739R993N640p823J856K6016J5570j1132r875k079p848n323n037L842
$$ -27933 -26194 -16201 -10561 -18384 -16528 9488 25058 13926 4051 1972 -5876 -11199 -16236 -12394
16446a2394J4035n17j4086j5965k705L843k949k945m969j0667R522J3631O45O839
$$ -12394 1641 1124 -12962 -28927 -31632 -27789 -30738 -33683 -38652 -49319 -39797 -26166 -25521 -18682
16432a8682q25N733N638q207j2878j61J0991J0080M415Q625J3338o617j4084j0595
$$ -18682 -19507 -13774 -8136 -16343 -29221 -29382 -18391 -8311 -3896 4729 18067 11450 -2634 -13229
16418a3229L66q788l576O816R478O182k351m134m978p731N29n936L912M974N484
$$ -13229 -12863 -21651 -25227 -18411 -8933 -2751 -5102 -9236 -14214 -21945 -21416 -27352 -23440 -18466 -12982
16403a2982l141L619O019P781m744k185p147j4670J807N411K533L47l343j0058
$$ -12982 -16123 -12504 -6485 1296 -3448 -5633 -12780 -27450 -25643 -20232 -17699 -17352 -20695 -30753
16389c0753K568J1328p520k4366J3046O355P711R788K87K025L282O829k581J185
$$ -30753 -28185 -16857 -24377 -48743 -35697 -29342 -21631 -11843 -11556 -9531 -6249 580 -2001 -816
16375h16j424j3079o207J527M000P534J4938j030k075j5647r048m453J055J7857
$$ -816 -2240 -15319 -21526 -19999 -15999 -8465 6473 5443 3368 -12279 -21327 -25780 -24725 -6868
16361f868J3218J448k950O582q846m81k341l149n779o174j7681r605J5067P861
$$ -6868 6350 7798 4848 11430 2584 2103 -238 -3387 -9166 -15340 -33021 -42626 -27559 -19698
16347a9698l443J79J962J0373J602n187J1256k843j5077j8542P19P762K523L715
$$ -19698 -23141 -22962 -21000 -10627 -9025 -14212 -2956 -5799 -20876 -39418 -38699 -30937 -28414 -24699
16333b4699J6160J2903k253r334m632L925j999N39M715p616J971K260j8226J206
$$ -24699 -8539 4364 2111 -7223 -11855 -7930 -9929 -9390 -4675 -12291 -10320 -8060 -26286 -25080
16319b5080J0001p490j1105J078K5093J5161j1843k0332n471N361J2626N038J2783
$$ -25080 -15079 -22569 -33674 -32596 -7503 7658 -4185 -24517 -29988 -24627 -12001 -6963 5820
16306E820M377p223n321Q787p1r609n895j91o356K09L167J2009M619m146n346
$$ 5820 10197 2974 -2347 6440 6369 -3240 -9135 -9326 -15682 -15473 -12306 -297 4322 176 -5170
16291e170l621q853r338O088M495l691J358L254K691L400J4966j540j377p307
$$ -5170 -8791 -17644 -26982 -20894 -16399 -20090 -18732 -15478 -12787 -9387 5579 4039 2662 -4645
16277d645j323k725K60O186k453R419m354k993J872l529o382l131j0922K142M489
$$ -4645 -5968 -8693 -8433 -2247 -4700 4719 365 -2628 -756 -4285 -10667 -13798 -24720 -22578 -18089
16262a8089N567Q632q02k1099L057J7587k392j5020r866Q168N251K005j2752j0156
$$ -18089 -12522 -3890 -4692 -25791 -22734 -5147 -7539 -22559 -32425 -24257 -19006 -17001 -29753 -39909
16248c9909J2422L0873J0499O619P365q36q666m950p030M181j0559J537Q124j6151
$$ -39909 -27487 3386 13885 20504 27869 27033 18367 13417 6387 10568 9 1546 9670 -6481
16234f481n530K956Q73l238m964R844Q609o796P610L779N476N371L330j2447k2130
$$ -6481 -12011 -9055 -8182 -11420 -16384 -6540 2069 -4727 2883 6662 12138 17509 20839 8392 -13738
16219a3738n195k148J2198K080q200Q98p376M323K905l290m611k413Q760L337
$$ -13738 -18933 -21081 -8883 -6803 -15003 -14105 -21481 -17158 -14253 -17543 -22154 -24567 -15807 -12470
16205a2470k62l642j7543j0628K2478K0096K112j0220m084N074l625Q756j4411
$$ -12470 -12732 -16374 -33917 -44545 -22067 -1971 141 -10079 -14163 -9089 -12714 -3958 -18369
16192a8369Q81q833N277K3420M416p207k5349o673Q997j2202J955N933K1334J3702
$$ -18369 -17488 -26321 -21044 2376 6792 -415 -25764 -32437 -23440 -35642 -33687 -27754 -6420 7282
16178G282n50L689r28o403m009K99N27L022m601j1378N419j376J2394n105o947
$$ 7282 6732 10421 9493 3090 -919 -620 -93 2929 -1672 -13050 -7631 -9007 3387 -1718 -8665
16163h665r026Q647n258j5749o375J2463P04P855J1204N213k49J674n467k2979
$$ -8665 -17691 -9044 -14302 -30051 -36426 -23963 -23259 -15404 -4200 1013 764 2438 -3029 -26008
16149b6008L6J1399p15O112J3338K213j783J3944o51j1015L234n186K560p033
$$ -26008 -25972 -14573 -15288 -9176 4162 6375 4592 18536 17885 6870 10104 4918 7478 445
16135D45M396n889o208k232o187j896Q525k815J6J636P119J975L516l39J821J1902
$$ 445 4841 -1048 -7256 -9488 -15675 -17571 -9046 -11861 -11845 -10209 -3090 -1115 2401 2062 3883 15785
16119A5785j362j075n091p838M894J063n431j4252n102M784J0727J690j389O346
$$ 15785 14423 13348 8257 419 5313 6376 945 -13307 -18409 -13625 -2898 -1208 -2597 3749
16105C749l98j4296j1001J6638Q966j6353P97K34J3471J77M90P359j5204j2052
$$ 3749 3351 -10945 -21946 -5308 3658 -12695 -11898 -11664 1807 1984 2474 9833 -5371 -17423
16091a7423j1573O674M799o669Q551K020P772J4402L99j2014k6574P046M471J8413
$$ -17423 -28996 -22322 -17523 -24192 -15641 -13621 -5849 8553 8952 -3062 -29636 -22590 -18119 294
16077B94L928k705O316K169o450l886p873j199J141K191M506j456l460J453K881
$$ 294 4222 1517 7833 10002 3552 -334 -8207 -9406 -8265 -6074 -1568 -3024 -6484 -5031 -2150
16062b150r190Q331K202o263o955J7355N518j7152j6196R74N277R220l992j0355
$$ -2150 -11340 -3009 -807 -7070 -14025 3330 8848 -8304 -24500 -23526 -18249 -9029 -13021 -23376
16048b3376Q35J1740K0362N616o87q081j3111q273M900j406n897M263m067l8O428
$$ -23376 -22541 -10801 9561 15177 14490 6409 -6702 -14975 -10075 -11481 -17378 -13115 -17182 -17220 -10792
16033a0792K310R333p812k795Q342n433l823Q656Q789n33P494q610j6245j1421
$$ -10792 -8482 851 -6961 -9756 -1414 -6847 -10670 -2014 6775 6242 13736 5126 -11119 -22540
16019b2540p041L809n617P580J2546Q248j829l803Q111J1842j1550l579m416j2848
$$ -22540 -29581 -25772 -31389 -23809 -11263 -3015 -4844 -8647 -536 11306 -244 -3823 -8239 -21087
16005b1087p350k223P791O697Q381N295K104m94l654l255j65J3690K985n678P361
$$ -21087 -28437 -30660 -22869 -16172 -7791 -2496 -392 -886 -4540 -7795 -7960 5730 8715 3037 10398
15990A0398M74r330Q21l749o695K621J2768n474K393O977J0300O8j0576j1806
$$ 10398 10872 1542 2363 -1386 -8081 -5460 7308 1834 4227 11204 21504 21572 10996 -810
15976h10o518N131Q918Q742J1258j5211n275L113p295j318O760k163q307K551
$$ -810 -7328 -2197 6721 15463 26721 11510 6235 9348 2053 735 7495 5332 -2975 -424
15962d24o24k294j640J0822q01l071o509k703n11J815j025o963N949R807J5566
$$ -424 -1048 -3342 -4982 5840 5039 1968 -4541 -7244 -7755 -5940 -6965 -13928 -7979 1828 17394
15947A7394Q256j483p959r821L357O330M7l4K028k139m527P507K722O04J816j1246
$$ 17394 25650 24167 16208 6387 9744 16074 16121 16087 18115 15976 11449 18956 21678 22282 24098 12852
15931A2852J58M494q257j900J251N739r129j408K684K487m099r317L136M811j110
$$ 12852 13010 17504 9247 7347 8598 14337 5208 3800 6484 8971 4872 -4445 -1309 3502 2392
15916B392p808m041J1673j969N662J122O064k583q994Q09P167O359m70j4564l395
$$ 2392 -5416 -9457 2216 247 5909 7031 13095 10512 1518 2327 9494 15853 15383 819 -2576
15901b576P081O867Q979J400p27R04M335j5253l504J6466p699m844O066r478K657
$$ -2576 4505 11372 20351 21751 21024 21928 26263 11010 7506 23972 16273 11429 17495 8017 10674
15886A0674j134n150N265J1482j0287p561R045P79j525K419k450m465Q532R167
$$ 10674 9540 4390 9655 21137 10850 3289 12334 13113 11588 14007 11557 7092 15624 24791
15872B4791L200j2399p211Q141J2086j1869p298P454k962K893M208j0531J533
$$ 24791 27991 15592 8381 16522 28608 16739 9441 16895 13933 16826 21034 10503 12036
15859A2036J376r58j4683o499J7452j604M974j424j0382k141J146l097r132O556
$$ 12036 13412 12454 -2229 -8728 8724 7120 12094 10670 288 -1853 -707 -3804 -12936 -6380
15845f380N679L537n451k554q372p449n794J0536J063K861O833K421r533k749
$$ -6380 -701 2836 -2615 -5169 -13541 -20990 -26784 -16248 -15185 -12324 -5491 -3070 -12603 -15352
15831a5352k966L779q777k143L357k897K6184n131r571R229Q586q69p642m62n860
$$ -15352 -18318 -14539 -23316 -25459 -22102 -24999 1185 -3946 -13517 -4288 4298 3429 -4213 -4675 -10535
15816a0535M940r2O906j1452j3395J3252J6714p983M273N882r535q978J2176Q123
$$ -10535 -5595 -5687 1219 -10233 -23628 -10376 6338 -1645 2628 8510 -1025 -10003 2173 10296
15802A0296j5805P797N92K17P581q998J147O286k655j622J526J597M066Q928j2363
$$ 10296 -5509 2288 2880 3097 10678 1680 2827 9113 6458 4836 6362 7959 12025 20953 8590
15787H590n099P094q727j0494p278J7754O368n62o405p78k071J943K0245k548
$$ 8590 3491 10585 1858 -8636 -15914 1840 8208 7646 1241 463 -1608 335 20580 18032
15773A8032j2783o161N66L237J1121O252l58m90j2100o542o668L428N622J4595
$$ 18032 5249 -912 -346 2891 14012 20264 19906 19416 7316 774 -5894 -2466 3156 17751
15759A7751O10j252j4414n903J9205l957j0184q603J2639N216K258N854k59L68
$$ 17751 18361 17109 2695 -3208 15997 12040 1856 -6747 5892 11108 13366 19220 18961 19329
15745A9329q406J4224L057j5271r658j4805J564P4J257l772P11J1743J341k197
$$ 19329 10923 25147 28204 12933 3275 -11530 -9966 -9892 -8635 -12407 -11696 47 1388 -809
15731h09J0526p505j0184o532M901J577M454l631k948n13j2210J9654Q103k787
$$ -809 9717 2212 -7972 -14504 -9603 -8026 -3572 -7203 -10151 -10664 -22874 -3220 4883 2096
15717B096J345Q770Q227k415j6428L93n472j4286L356j890r750R32j817M593L490
$$ 2096 3441 12211 20438 18023 1595 1988 -3484 -17770 -14414 -16304 -26054 -25122 -26939 -22346 -18856
15702a8856l093R232k857O683K776Q20p672o093j1727Q880J3289M812M508M145
$$ -18856 -21949 -12717 -15574 -8891 -6115 -5295 -12967 -19060 -30787 -21907 -8618 -3806 702 4847
15688D847L637p250p855j504K059p002P044N496m004n175P878J0058k909j1109
$$ 4847 8484 1234 -6621 -8125 -6066 -13068 -6024 -528 -4532 -9707 -1829 8229 5320 -5789
15674e789l028P913m468O56K605l034J5009Q656j503l830N733p616n752J314k896
$$ -5789 -8817 -904 -5372 -4716 -2111 -5145 9864 18520 17017 13187 18920 11304 5552 6866 3970
15659C970m807m868p751P657N256j3586j6548k47Q927J9349K351J664N419m458
$$ 3970 -837 -5705 -13456 -5799 -543 -14129 -30677 -30924 -21997 -2648 -297 1367 6786 2328
15645B328j4758n438J4956k927n951N778n101Q97R72J0291N075j1777J629l274
$$ 2328 -12430 -17868 -2912 -5839 -11790 -6012 -11113 -10216 -9244 1047 6122 -5655 -4026 -7300
15631g300J0036P973q274k850J4992K448N241l565k0363K611Q468M243p417j8826
$$ -7300 2736 10709 2435 -415 14577 17025 22266 18701 -1662 949 9417 13660 6243 -12583
15617a2583j7274J752J2795J0899L803l525j73p546k217J8568k139j969K260K800
$$ -12583 -29857 -28105 -15310 -4411 -608 -4133 -4306 -11852 -14069 4499 2360 391 2651 5451
15603E451o009L137qM10Q851Q92j601j091N26L437r634j25j488q969n207J6085
$$ 5451 -558 2579 2571 2981 11832 12724 11123 10032 10558 13995 4361 4236 2748 -6221 -11428 4657
15587D657P427j5633j753J4122j0562n824J0788Q970O359J1121j1773j5529m875
$$ 4657 12084 -3549 -5302 8820 -1742 -7566 3222 12192 18551 29672 17899 2370 -2505
15574b505j03K578k768k219M376K113q582R981J1091r269o699J639O264J358j8207
$$ -2505 -2608 -30 -2798 -5017 -641 1472 -7110 2871 13962 4693 -2006 -367 5897 7255 -10952
15559a0952N263N600P25j7443j672l957l943L504J2328k767o68k433j6395J2887
$$ -10952 -5689 -89 636 -16807 -18479 -22436 -26379 -22875 -10547 -13314 -13982 -16415 -32810 -19923
15545a9923O538J4392j455m144r028J770J2282j6131P75P511j021O785M567n020
$$ -19923 -13385 1007 -448 -4592 -13620 -11850 432 -15699 -14924 -7413 -8434 -1649 2918 -2102
15531b102q607j88J1945J3618m541p358n46Q873j118q165q390r017o442R350J8057
$$ -2102 -10709 -10897 1048 14666 10125 2767 2221 11094 9976 1811 -6579 -15596 -22038 -12688 5369
15516E369n780j9636J2810M171j6126N401L1692P970j4039o457K507j3389J762
$$ 5369 -411 -20047 -7237 -3066 -19192 -13791 17901 25871 11832 5375 7882 -5507 -3745
15503c745O635k17o940o544M659L927k910N401j0378j1376l909J0446J3118o74
$$ -3745 2890 2673 -4267 -10811 -6152 -2225 -5135 266 -10112 -21488 -25397 -14951 -1833 -2507
15489b507m252j2758k682Q655K4547R591n78N744j0145r463p517l225m230O205
$$ -2507 -6759 -19517 -22199 -13544 11003 20594 20016 25760 15615 6152 -1365 -4590 -8820 -2615
15475b615M765r821J3842M408j0002k724o478J8950P303k937j8396q337L072k012
$$ -2615 2150 -7671 6171 10579 577 -2147 -8625 10325 17628 14691 -3705 -12042 -8970 -10982
15461a0982N310j95L010M950J720N146M625R072j4138j2545O846J1596l004j2909
$$ -10982 -5672 -5867 -2857 2093 3813 8959 13584 22656 8518 -4027 2819 14415 11411 -1498
15447a498j820K03p367J2401O626L653P212r041k0943j1465J2983N478K527L933
$$ -1498 -3318 -3115 -10482 1919 8545 12198 19410 10369 -10574 -22039 -9056 -3578 -1051 2882
15433B882k214r883m190K988J3885R552L319L063k0148j5428L702p163m669J4720
$$ 2882 668 -9215 -13405 -10417 3468 13020 16339 19402 -746 -16174 -12472 -19635 -24304 -9584
15419i584p5j8878k695J6990M839L957K068j811Q410k659p420j087k385N947n014
$$ -9584 -9659 -28537 -31232 -14242 -9403 -5446 -3378 -5189 3221 562 -6858 -7945 -10330 -4383 -9397
15404i397p417k323L082J8305J3753P409Q276j4809k736J1229o709j9309j958
$$ -9397 -16814 -19137 -16055 2250 16003 23412 31688 16879 14143 25372 18663 -646 -2604
15391b604j259m239J4451L9K445j4324j8949K124J1687L484K310r25k320O992
$$ -2604 -3863 -8102 6349 6388 8833 -5491 -24440 -22316 -10629 -7145 -4835 -5760 -8080 -1088
15377a088O554p676j289J4225O792P609l767r164j7304J67j800N146l916J1027
$$ -1088 5466 -2210 -3499 10726 17518 25127 21360 12196 -5108 -4941 -6741 -1595 -5511 5516
15363E516N531J6651M189j2246j3000P77P132P57J702M596M743o197j2137j1728
$$ 5516 11047 27698 31887 19641 6641 7418 14550 15307 17009 21605 26348 20151 8014 -3714
15349c714k351K998J28J2910m249j7589n335K47o646J349L205K3980N251k477
$$ -3714 -6065 -3067 -2939 9971 5722 -11867 -17202 -16955 -23601 -22252 -19047 4933 10184 7707
15335G707n395L501k166m062j3804p357J5301J7989N837l280j5970o749k963L6
$$ 7707 2312 5813 3647 -415 -14219 -21576 -6275 11714 17551 14271 -1699 -8448 -11411 -11375
15321a1375m214k860R269K803R007J9168l335j3361k736K43q402J762P473J8302
$$ -11375 -15589 -18449 -9180 -6377 2630 21798 18463 5102 2366 2609 -5793 -4031 3442 21744
15307B1744J2426j6366k0035m849L203N568p001o037l38J4718n245J977l948N088
$$ 21744 34170 17804 -2231 -7080 -3877 1691 -5310 -11347 -11685 3033 -2212 -235 -4183 905
15293I05R957J743n653p350K563K527K15N377J2127L644n637j4876j9501q901
$$ 905 10862 12605 6952 -398 2165 4692 4907 10284 22411 26055 20418 5542 -13959 -22860
15279b2860q602J1055K5159M476j5968k178L072J7388N556N282J306N382J3514
$$ -22860 -31462 -20407 4752 9228 -6740 -8918 -5846 11542 17098 22380 23686 29068 42582
15266D2582R947l912j673p491q73j0535k355J813n759j0641l561m937q030n648
$$ 42582 52529 48617 46944 39453 38580 28045 25690 27503 21744 11103 7542 2605 -5425 -11073
15252a1073M971J4319J5029L681K811k3434j9275O315J576K498j390j1837q17
$$ -11073 -6102 8217 23246 26927 29738 6304 -12971 -6656 -5080 -2582 -3972 -15809 -16626
15239a6626j0800K087J2658O921P72J100l253Q126p002m643k721k428J1405L190
$$ -16626 -27426 -25339 -12681 -5760 -4988 -3888 -7141 985 -6017 -10660 -13381 -15809 -4404 -1214
15225a214R229K949K617l145j0356r627M665J1686n301j2930j2803M962K2303
$$ -1214 8015 10964 13581 10436 80 -9547 -4882 6804 1503 -11427 -24230 -19268 3035
15212C035J0179j015j6745p725q784n891P395R174j1342M632M999j1957M2J0342
$$ 3035 13214 12199 -4546 -12271 -21055 -26946 -19551 -10377 -21719 -17087 -12088 -24045 -24003 -13661
15198a3661K0456L854j480K411r701q647J0754J6199k629r486J0972n446k718
$$ -13661 6795 10649 9169 11580 1879 -6768 3986 20185 17556 8070 19042 13596 10878
15185A0878p927m293n913N6J4509M174k923K427k642o840o082L526l955R07m086
$$ 10878 2951 -1342 -7255 -7199 7310 11484 8561 10988 8346 1506 -4576 -1050 -5005 -4098 -8184
15170h184q868P414J1545k669K654L411M051O714J191k475q263j1153l422j4702
$$ -8184 -17052 -9638 1907 -762 1892 5303 9354 16068 17259 14784 6521 -4632 -8054 -22756
15156b2756j374O714O247J1369M507j1714J566J1429J3743J0253j1532q238O146
$$ -22756 -24130 -17416 -11169 200 4707 -7007 -5441 5988 19731 29984 18452 10214 16360
15143A6360o80K515p320M909j4273m979l097n276K764n08p157O342Q029O745P540
$$ 16360 15680 18195 10875 15784 1511 -3468 -6565 -11841 -9077 -9585 -16742 -10400 -2371 4374 11914
15128A1914j2088j3017q03L137n588q62Q207J231j175j592L754L19o510P240J3833
$$ 11914 -174 -13191 -13994 -10857 -16445 -17307 -9100 -7869 -9044 -10636 -6882 -6563 -13073 -5833 8000
15113H000j106K886J2531r137j0997k344l990j22K418O029K83M444J1289M331
$$ 8000 6894 9780 22311 13174 2177 -167 -4157 -4279 -1861 4168 4451 8895 20184 24515
15099B4515q804o955Q5J5453R677l593j5907p611K319q52l801m574L357K564l130
$$ 24515 15711 8756 8841 24294 33971 30378 14471 6860 9179 8327 4526 -48 3309 5873 2743
15084B743r255j1942j2358K790J4741N293L087L215N320q295J173J635K556m50
$$ 2743 -6512 -18454 -30812 -28022 -13281 -7988 -4901 -1686 3634 -4661 -3488 -1853 703 253
15070B53M389j6854N356m677j0280J4917R923j431R877N863j0254M090k422p548
$$ 253 4642 -12212 -6856 -11533 -21813 -6896 3027 1596 11473 17336 7082 11172 8750 1202
15056A202j1249K864J079p282q2J5467j4384j2643o645J4784J1244L121r710O33
$$ 1202 -10047 -7183 -6104 -13386 -13468 1999 -12385 -25028 -31673 -16889 -5645 -2524 -12234 -11601
15042a1601R728K0669J0032o120P536j1560r625r785m212K989l409O508O403r372
$$ -11601 -1873 18796 28828 22708 30244 18684 9059 -726 -4938 -1949 -5358 1150 7553 -1819
15028a819o709J1431k828R695m944k6776R62N798J3249M808R900j278J633k413
$$ -1819 -8528 2903 75 9770 4826 -21950 -20988 -15190 -1941 2867 12767 11489 13122 10709
15014A0709L884p078n459r920J1752J7441m976J970p682j9473J4668K2838j6357
$$ 10709 14593 7515 2056 -7864 3888 21329 16353 18323 10641 -8832 5836 28674 12317
15001A2317k5192j932j0396k426P234N419M371J819R95q714l112J053J029JJ2267
$$ 12317 -12875 -14807 -25203 -27629 -20395 -14976 -10605 -8786 -7791 -16505 -19617 -18564 -17535 -17534 -5267
14986e267k203P593q62p12N982L574n072n737o682O351l681o953R409J4969O27
$$ -5267 -7470 123 -739 -1451 4531 8105 3033 -2704 -9386 -3035 -6716 -13669 -4260 10709 11336
14971A1336M159p262o515p09m96J5586m576j0626n831k383K244J603m457L47J3336
$$ 11336 15495 8233 1718 1009 513 16099 11523 897 -4934 -7317 -5073 -3470 -7927 -7580 5756
14956E756J5224M827o451j1301k3592l173J4920M638p039k418J1604O407R1Q302
$$ 5756 20980 25807 19356 8055 -15537 -18710 -3790 848 -6191 -8609 2995 9402 9493 17795
14942A7795j078n151M079M118l546R53L799m978n604M765J0084m924j0545K519
$$ 17795 16717 11566 15645 19763 16217 17170 20969 15991 10387 15152 25236 20312 9767 12286
14928A2286Q339L595n808m630j3920j759k41m025k234j867N69J2663Q963N93j0909
$$ 12286 20625 24220 18412 13782 -138 -1897 -2138 -6163 -8397 -10264 -9695 2968 11931 12524 1615
14913A615J394n910k239O473J6953J5465j1622o860j2672N93Q301o245J0678L951
$$ 1615 3009 -2901 -5140 1333 18286 33751 22129 15269 2597 3190 11491 5246 15924 19875
14899A9875j4927j1149o778K4945J0303j4497q802j411N207J882P600j1559p819
$$ 19875 4948 -6201 -12979 11966 22269 7772 -1030 -2441 2766 4648 12248 689 -7130
14886g130O594J1708k775j1437k38J2505J1553o28p594p183N826J2759l196n212
$$ -7130 -536 11172 8397 -3040 -3278 9227 20780 20152 12558 5375 11201 23960 20764 15552
14872A5552j7562J5017Q221r097p230M73O973j2796k0574K308J6409M617K423
$$ 15552 -2010 13007 21228 12131 4901 5374 12347 -449 -21023 -18715 -2306 2311 4734
14859D734Q6M636n0Q597L763n339n11q601o432r791q486J2466J3239k827m793
$$ 4734 4820 9456 9406 18003 21766 16427 15916 7315 883 -8908 -17394 -4928 8311 5484 691
14844F91q08n108K584M995M248k625j2501k0802Q872K1136N556M777n685j1167
$$ 691 -117 -5225 -2641 2354 6602 3977 -8524 -29326 -20454 682 6238 11015 5330 -5837
14830e837o205l044L417J2509k023J1843L737p255K448k243r018j0783j097P980
$$ -5837 -12042 -15086 -11669 840 -1183 10660 14397 7142 9590 7347 -1671 -12454 -13551 -5571
14816e571J3533K241L779r523k095q35R939J9502q186j4418j6073L574J4161P333
$$ -5571 7962 10203 13982 4459 2364 1529 11468 30970 22784 8366 -7707 -4133 10028 17361
14802A7361J751r862J933J1474n756j2386N669P175n230j7169m858J1166j4944
$$ 17361 19112 9250 11183 22657 16901 4515 10184 17359 12129 -5040 -9898 1268 -13676
14789a3676J0050K387j824m795j1442P00p015J729K5587J7397Q47J596K809J122
$$ -13676 -3626 -1239 -3063 -7858 -19300 -18600 -25615 -23886 1701 19098 19945 21541 24350 25472
14775B5472j1342j3565M758K454J535m455K771K233j9650m729J7723R245j2290
$$ 25472 14130 565 5323 7777 9312 4857 7628 9861 -9789 -14518 3205 12450 160
14762A60j1141J756J1773R440q93q087l813L831K683R98j049K604O586J1475k720
$$ 160 -10981 -9225 2548 11988 11095 3008 -805 3026 5709 6707 5658 8262 14848 26323 23603
14747B3603j8410p4Q277m882J682R63n377n053l916k518k994j988m237r329Q629
$$ 23603 5193 5119 13396 8514 10196 11159 5782 729 -3187 -5705 -8699 -10687 -14924 -24253 -15624
14732a5624J2572N628N46o650p99Q21j0899N929R398k169j617Q932R897n832m493
$$ -15624 -3052 2576 3122 -3528 -4327 -3506 -14405 -8476 922 -1247 -2864 6068 15965 10133 5640
14717E640J048O951ml429j4715p327J8084N946j3859N24Q441J1673r967m124K404
$$ 5640 6688 13639 13635 10206 -4509 -11836 6248 12194 -1665 -1141 7300 18973 9006 4882 7286
14702G286m329j0663j6468J998R411J8898P386r715n720p680j3969m323J3549
$$ 7286 2957 -7706 -24174 -22176 -12765 6133 13519 3804 -1916 -9596 -23565 -27888 -14339
14689a4339R253O504P267N26o314J1963J4395k569l185j2389l791j1079q730p11
$$ -14339 -5086 1418 8685 9211 2897 14860 29255 26686 23501 11112 7321 -3758 -12488 -13199
14675a3199K5400J6445l114j0813j877L384L781P717j1067k0532k30R113j769
$$ -13199 12201 28646 25532 14719 12842 16226 20007 27724 16657 -3875 -4105 5008 3239
14662C239q750k823L147R44O562M370j515j3688j439L606q293k125J4456R236
$$ 3239 -5511 -8334 -5187 -4243 2319 6689 5174 -8514 -9953 -6347 -14640 -16765 -2309 6927
14648F927J1907J767o191m850J753K451j1541r617q66k922N11r67J834K190j2572
$$ 6927 18834 20601 14410 9560 11313 13764 2223 -7394 -8260 -11182 -10671 -11638 -9804 -7614 -20186
14633b0186m048J7385J823l263N732R925j0963J331Q287J3102Q115k932P105Q085
$$ -20186 -24234 -6849 -5026 -8289 -2557 7368 -3595 -2264 6023 19125 27240 24308 31413 39498
14619C9498r548j2771m847k762l232j426L477L276l711k0567j0371J3973J0808
$$ 39498 29950 17179 12332 9570 6338 4912 8389 11665 7954 -12613 -22984 -9011 1797
14606A797m017N396j066J038O804l451k930M266P403L471n689q785R728J806j0461
$$ 1797 -2220 3176 2110 3148 9952 6501 3571 7837 15240 18711 13022 4237 13965 15771 5310
14591E310n445n275m774j532l949k528M9J1994J5849J6791J409j5396j399K218
$$ 5310 -135 -5410 -10184 -11716 -15665 -18193 -18144 -6150 9699 26490 27899 12503 11104 13322
14577A3322j077k570k564M87N185J3861q476n771o780N360k44L07J244Q654J2896
$$ 13322 12245 9675 7111 7598 12783 26644 18168 12397 5617 10977 10733 11040 12284 20938 33834
14562C3834p916j8865j1660l162M242N46J3630Q187p504k595J7428k897j3371
$$ 33834 25918 7053 -4607 -7769 -3527 -2981 10649 18836 11332 8737 26165 23268 9897
14549I897M117m976n3j2214k732Q889r465m498j500L370O459r70k473k843q845
$$ 9897 14014 9038 8985 -3229 -5961 2928 -6537 -11035 -12535 -9165 -2706 -3676 -6149 -8992 -17837
14534a7837p576J4226L259j0761J630J453o992O221J4053O038K833j113k526n940
$$ -17837 -25413 -11187 -7928 -18689 -17059 -15606 -22598 -16377 -2324 3714 6547 5434 2908 -3032
14520c032q67J6420K6220L939j0339j7844j7260l924J859k038l398P157N113j300
$$ -3032 -3899 12521 38741 42680 32341 14497 -2763 -6687 -4828 -6866 -10264 -3107 2006 706
14506G06k139O099N023J6957J3968r636k8235j3965j953K268J2847J6462P043
$$ 706 -1433 4666 9689 26646 40614 30978 2743 -11222 -13175 -10907 1940 18402 25445
14493B5445j722J88j0507k017M175j1468j4979K454L238J4171m185J0805K171
$$ 25445 23723 23911 13404 11387 15562 4094 -10885 -8431 -5193 8978 4793 15598 17769
14480A7769l711j7064n246m8Q79J3205J3585M092q472o90k980n784J036J1467
$$ 17769 14058 -3006 -8252 -8300 -7421 5784 19369 23461 14989 14299 11319 5535 6571 18038
14466A8038j3418j6040O740K2510M512j6567j1930L086K682K063l566M933M055
$$ 18038 4620 -11420 -4680 17830 22342 5775 -6155 -3069 -387 1676 -1890 3043 7098
14453G098q474J3122K2850m9q33o293j2943r091j1020K887n162N618J7252J2783
$$ 7098 -1376 11746 34596 34547 33714 27421 14478 5387 -5633 -2746 -7908 -2290 14962 27745
14439B7745j0593q309N885R070P70Q936q348n110L024j433j426J06O022p275j3908
$$ 27745 17152 8843 14728 23798 24568 33504 25156 20046 23070 21637 20211 20317 26339 19064 5156
14424E156R484J0375l497M110q913L054K2434J1401j5077j5361j0142p953n236
$$ 5156 14640 25015 21518 25628 16715 19769 42203 53604 38527 23166 13024 5071 -165
14411a65J1601J1791n979p110m762L630J0592j681l864M332l300n687O715K701
$$ -165 11436 23227 17248 10138 5376 9006 19598 17917 14053 18385 15085 9398 16113 18814
14397A8814o995m946m096K565J046l212p781k07J1728P076R982q696n434N323
$$ 18814 11819 6873 2777 5342 6388 3176 -4605 -4812 6916 13992 23974 15278 9844 15167
14383A5167k719j257P406j1901q006qj2524O885P620N24J277n957m103J0567L239
$$ 15167 12448 11191 18597 6696 -1310 -1318 -13842 -6957 663 1187 2464 -3493 -7596 2971 6210
14368F210k512j1854o810J1920R280n92n015O085O813P266O500j1642k189k414
$$ 6210 3698 -8156 -14966 -3046 6234 5642 627 6712 13525 20791 27291 15649 13460 11046
14354A1046m626J821m26N47N41M793Q57O710K859j1240r648o05J1538j592j1469
$$ 11046 6420 8241 7815 8362 8903 13696 14553 21263 24122 12882 3234 2629 14167 12575 1106
14339A106l540J8967N335L960k499k3234j2043p26K7343J4620R514R13p208p889
$$ 1106 -2434 16533 21868 25828 23329 95 -11948 -12674 14669 29289 38803 39716 32508 24619
14325B4619K489p206j1322l655M560Q646P580J89n212K276O996j2131m596L617
$$ 24619 27108 19902 8580 4925 9485 18131 25711 25900 20688 22964 29960 17829 13233 16850
14311A6850M1J555N781n078o280j121P63J040J10j50Q088r835o671N97q830J3813
$$ 16850 16891 18446 24227 19149 12869 11748 12511 13551 13661 13511 21599 11764 5093 5690 -3140 10673
14295A0673q06K693N415j4091l324K932l759N087j639j0408R892J5932J2105j482
$$ 10673 9867 12560 17975 3884 560 3492 -267 4820 3181 -7227 2665 18597 30702 29220
14281B9220l592J5975K565j5002j4186J2401J0648j0022k0977n476N622J24J0817
$$ 29220 25628 41603 44168 29166 14980 27381 38029 28007 7030 1554 7176 7300 18117
14268A8117l991k065m860j859K56N081M93P842j1166p004p296J7762Q683n259
$$ 18117 14126 12061 7201 5342 5598 10679 11172 19014 7848 844 -6452 11310 19993 14734
14254A4734P995J7192J0675J1748n997o696n401r778N876k521k463N872n145j5168
$$ 14734 22729 39921 50596 62344 56347 49651 44250 34472 40348 37827 35364 41236 36091 20923
14240B0923j1936m894M905J6890n040j1994r619k854Q709O862Q471k56m13j4554
$$ 20923 8987 4093 8998 25888 20848 8854 -765 -3619 5090 11952 20423 20167 19754 5200
14226E200j7887k989O632K8361J3788k317j5264O83L644J6769J846q478o956j083
$$ 5200 -12687 -15676 -9044 19317 33105 30788 15524 16207 19851 36620 38466 29988 23032 21949
14212B1949O15q543j791N688K275n867K612o994K239K4845P003k334j2797p846
$$ 21949 22564 14021 12230 17918 20193 14326 16938 9944 12183 37028 44031 41697 28900 21054
14198B1054k451j9k582p82l310l952O68j2760M646K3993n102r165p270q969J2198
$$ 21054 18603 18584 16002 15220 11910 7958 8626 -4134 512 24505 19403 10238 2968 -6001 6197
14183F197K6209K140M229O292q559J719K945j459L085J818k534J839o342j1459
$$ 6197 32406 34546 38775 45067 36508 38227 41172 39713 42798 44616 42082 43921 37579 26120
14169B6120j484m928K2850K0537j3652k0015n425j411J044j116l667K962O0L696
$$ 26120 24636 19708 42558 63095 49443 29428 24003 22592 23636 22520 18853 21815 21875 25571
14155B5571l672Q135n33k514k554P918M883m277m876q900l31J982n177j186L19
$$ 25571 21899 30034 29501 26987 24433 32351 37234 32957 28081 19181 18850 20832 15655 14469 14788
14140A4788J2482N906L487M372k746r051k392p721O69J337J1981M318n057O959
$$ 14788 27270 33176 36663 41035 38289 29238 26846 19125 19794 21131 33112 37430 32373 39332
14126C9332Q168R142J576j5960p205P248Q051m882n254n46L663r61m749p065L464
$$ 39332 47500 56642 58218 42258 35053 42301 50352 45470 40216 39670 43333 42372 37623 30558 34022
14111C4022k860n653M072L681q289m305J6158J6528N671l141j113k217J471k807
$$ 34022 31162 25509 29581 33262 24973 20668 36826 53354 59025 55884 54771 52554 54025 51218
14097E1218j6513r403n161o808J1073l409N617J8863J1885j21M082k525L586J043
$$ 51218 34705 25302 20141 13333 24406 20997 26614 45477 57362 57241 61323 58798 62384 63427
14083F3427k0257q951j5544P750J5862M938p437K151Q44o737l982n479L010J6152
$$ 63427 43170 34219 18675 26425 42287 47225 39788 41939 42783 36046 32064 26585 29595 45747
14069D5747P526j4782l547l865n683J1298J7804K358m292J386j339K445J4715
$$ 45747 53273 38491 34944 31079 25396 36694 54498 56856 52564 53950 52611 55056 69771
14056F9771N44N417M301k03N59k223P082K254p160q293p646n18r871J118Q065
$$ 69771 70315 75732 80033 79830 80389 78166 85248 87502 80342 72049 64403 63885 54014 55132 63197
14041F3197J846k022q844l050L434R580J2143O248J8048J901o895r90m058n800
$$ 63197 65043 63021 54177 51127 54561 64141 76284 82532 100580 102481 95586 94596 90538 84738
14027H4738P243J283N912J2822O235J404m58M802p550m573j012K229k569J2036
$$ 84738 91981 93264 99176 111998 118233 119637 119179 123981 116431 111858 110846 113075 110506 122542
14013A22542J1198j2890P534O114K790N686o963n69Q180j5952m999q18J221L247
$$ 122542 133740 120850 128384 134498 137288 142974 136011 135442 143622 127670 122671 121853 123074 126321
13999A26321j1129J489L788M409p961j0539K809N156N713K26j004l188k1920o995
$$ 126321 115192 116681 120469 124878 116917 106378 109187 114343 120056 120282 119278 116090 94170 87175
13985H7175o680R96J5986P932N823j4858L607J9411q711M11J0980J1150j0437
$$ 87175 80495 81491 97477 105409 111232 96374 99981 119392 110681 111092 122072 133222 122785
13972A22785k1286j2068Q732J307J393J8717K511j2109j7048o791J756J4583J9591
$$ 122785 101499 89431 98163 99470 100863 119580 122091 109982 92934 86143 87899 102482 122073
13959A22073m117j3799p985j726j589L444N68m564O17l760r91k273R523J178j7833
$$ 122073 117956 104157 96172 94446 92857 96301 96869 92305 92922 89162 88171 85898 95421 96599 78766
13944G8766p330Q003M255N423J1429k756m525J12l998l594p428q498m97N467j3412
$$ 78766 71436 79439 83694 89117 100546 97790 93265 93377 89379 85785 78357 69859 69362 74829 61417
13929F1417J430J708j2045j4338j890K0055K1843L377R937R555o913j6583r68
$$ 61417 62847 64555 52510 38172 36282 56337 78180 81557 91494 101049 94136 77553 76585
13916G6585j350k990N551K906p51j3400L772J8020p19m833k592K0380j1550K882
$$ 76585 75235 72245 77796 80702 79951 66551 70323 88343 87624 82791 80199 100579 89029 91911
13902I1911Q292k793L242j4923j1379j2064j389O977M775R650K712K232j0397
$$ 91911 100203 97410 100652 85729 74350 62286 60897 67874 72649 82299 85011 87243 76846
13889G6846K049J1747M969Q823J738j3091q174m71J8347M487l590O735Q360J778
$$ 76846 78895 90642 95611 104434 106172 93081 84907 84436 102783 107270 103680 110415 118775 120553
13875A20553l610m463J3609k483n411P627j5583j3387J9620N172j573k898P73
$$ 120553 116943 112480 126089 123606 118195 125822 110239 96852 116472 121644 120071 117173 117946
13862A17946n8O698j2335n14J577N312M344O919r09K769J5157P100J0690P459
$$ 117946 117888 124586 112251 111737 113314 118626 122970 129889 128980 131749 146906 154006 164696 172155
13848A72155o983m042M714J4569O62j470k122j3192j5247O738R332M679P196J124
$$ 172155 165172 161130 165844 180413 181075 179605 177483 164291 149044 155782 165114 169793 176989 178113
13834A78113M941M015j1668j3829j3610n075O760R941k270m584O768J2610P579
$$ 178113 183054 187069 175401 161572 147962 142887 149647 159588 157318 152734 159502 172112 179691
13821A79691j7787j186P475J732o231n731o643p174N678m110k876m482J8290r302
$$ 179691 161904 160718 168193 169925 163694 157963 151320 144146 149824 145714 142838 138356 156646 147344
13807A47344n875n12R45j3860j1815o030Q476Q398o384o816o096o176L114m320
$$ 147344 141469 140957 141902 128042 116227 110197 118673 127071 120687 113871 107775 101599 104713 100393
13793A00393r219j1112m200L361J516j1102P552J8994J5701r865j1482K609J2983
$$ 100393 91174 80062 75862 79223 80739 69637 77189 96183 111884 102019 90537 93146 106129
13780A06129L752M00J001j340j3691k854Q298Q029j1175j0522p221k113k376Q271
$$ 106129 109881 110281 111282 109942 96251 93397 101695 109724 98549 88027 80806 78693 76317 84588
13766H4588J2181j7926j3272J3451J1557o12p810r734O944P542m861r403K603
$$ 84588 96769 78843 65571 79022 90579 89967 82157 72423 79367 86909 82048 72645 75248
13753G5248M109L516J500J511r40q195P305J4162K062k131Q255P524j3989k6297
$$ 75248 79357 82873 84373 85884 84944 76749 84054 98216 100278 98147 106402 113926 99937 73640
13739G3640J390K099j0937k1056q092K587J5043o579l582N2K1845k156j1227j458
$$ 73640 75030 77129 66192 45136 37044 39631 54674 48095 44513 44565 66410 64254 53027 51569
13725E1569l379J0372P24p075m388P317J3317o70j2735n242L068J2062J0108Q040
$$ 51569 48190 58562 59286 52211 47823 55140 68457 67787 55052 49810 52878 64940 75048 83088
13711H3088k29p157j1618l738P095l571M160O528J2333P488n068k371j4872p057
$$ 83088 82859 75702 64084 60346 67441 63870 68030 74558 86891 94379 89311 86940 72068 65011
13697F5011l715K449J017M230N594J539r768P342K750J4172M851J0741K2313L4873
$$ 65011 61296 63745 64762 68992 74586 76125 66357 73699 76449 90621 95472 106213 128526 163399
13683A63399J8985K8383K1838L85j9952l0639j4520j4524n429l723j6252j3147
$$ 163399 182384 210767 232605 232990 213038 182399 167879 153355 147926 144203 127951 114804
13671A14804K18L130r747p853j979R897Q512K0756J6844K7257L1273J3404K8722
$$ 114804 115022 118152 108405 100552 98573 108470 116982 137738 154582 181839 213112 226516 255238
13658B55238L8318J4387k4165k5373k6572k9271j5691J856M751J0067K8923M4438
$$ 255238 293556 307943 283778 258405 231833 202562 186871 188727 193478 203545 232468 276906
13646B76906N2777N9003M6478O119l9030o1172n6281m5360k7022k3376j2210m603
$$ 276906 329683 388686 435164 441283 402253 341081 284800 239440 212418 189042 176832 172229
13634A72229j3670M213R061J37m179K0759L0497L4389L8504N4591O6371N8503
$$ 172229 158559 162772 171833 171970 167791 188550 219047 253436 291940 346531 412902 471405
13622D71405K5078j1143m4733o0705o3268n4993l0394k8810p502M469j6536j2657
$$ 471405 496483 485340 440607 379902 316634 261641 231247 202437 194935 199404 182868 170211
13610A70211L2103J8133K4855K6615J571j7248k9602k5222l5346k4705j0751o961
$$ 170211 202314 220447 245302 271917 273488 256240 226638 201416 166070 141365 130614 123653
13598A23653j3097O20Q581R357J2203l472j470L020J4817L3177L1746M1002J5991
$$ 123653 110556 111176 119757 129114 141317 137845 136375 139395 154212 187389 219135 260137 276128
13585B76128k0878j0474k2162m6812k8612j4917j4474o654o563j4868m188N208
$$ 276128 255250 244776 222614 175802 147190 132273 117799 111145 104582 89714 85526 90734
13573I0734N403o060q522j6854l690k676J4390j661r667J020J3127q718J13J4142
$$ 90734 96137 90077 81555 64701 61011 58335 72725 71064 61397 62417 75544 66826 66939 81081
13559H1081J5789l698j8195r997J0764J648j6L372J399m502J1826p525j1088j1343
$$ 81081 96870 93172 74977 64980 75744 77392 77376 80748 82147 77645 89471 81946 70858 59515
13545E9515K540N507L002P222p457j2319J2729K746j937M00L992j18M535K627
$$ 59515 62055 67562 70564 77786 70329 58010 70739 73485 71548 71948 75940 75822 80357 82984
13531H2984O366J0950R365K97j0201P314m059K19J01n230o146j187J0272P273
$$ 82984 89350 100300 109665 109962 99761 107075 103016 103235 103336 98106 91960 90773 101045 108318
13517A08318K878o053j3741j1646Q32o274r630o071J7926R823J966k440P205J6691
$$ 108318 111196 105143 91402 79756 80588 74314 64684 58613 76539 86362 88328 85888 93093 109784
13503A09784K597k950k722N393k132o449j3419m486J5438N100m388J267l61L545
$$ 109784 112381 109431 106709 112102 109970 103521 90102 85616 101054 106154 101766 103033 102672 106217
13489A06217r1P01k53Q422N986o118j261m238k356j568K557J165p451j2322j2688
$$ 106217 106126 106827 106574 114996 120982 114864 113603 109365 107009 105441 107998 109163 101712 89390 76702
13474G6702Q304J0337l570M94K038O430Q576l328R900N897j1268j195N077N271
$$ 76702 85006 95343 91773 92267 94305 100735 109311 105983 115883 121780 110512 109317 114394 119665
13460A19665j477m155J4973J7507k0714k0876j726o882L95m259j414M802J915
$$ 119665 118188 114033 129006 146513 125799 104923 103197 96315 96710 92451 91037 95839 97754
13447I7754Q813J835p83J0004P619n822n539m591L741k423N572K635J251k0428
$$ 97754 106567 108402 107619 117623 125242 119420 113881 109290 113031 110608 116180 118815 120066 99638
13433I9638q940R385J4120N858M117P661N281M221j444k483K02R852p914p789
$$ 99638 90698 100083 114203 120061 124178 131839 137120 141341 139897 137414 137616 147468 139554 131765
13419A31765p226k609R942p990r429R986k593o733R354p777j583Q883l115q529
$$ 131765 124539 121930 131872 123882 114453 124439 121846 115113 124467 116690 115107 123990 120875 112346
13405A12346m871J4030M064K555J5194J3279J1826J0230J4228J392n805p184p814
$$ 112346 107475 121505 125569 128124 143318 156597 168423 178653 192881 194273 188468 181284 173470
13392A73470M398l425l626l332o486n599k146L348n168r390m019J3478k913p671
$$ 173470 177868 174443 170817 167485 160999 155400 153254 156602 151434 142044 138025 151503 148590 140919
13378A40919J7248J478j7660j3887k796K518K0390l53K336K410l266O759K3488
$$ 140919 158167 159645 141985 128098 125302 127820 148210 147857 150193 152603 149337 156096 179584
13365A79584K1825K8137K1297P346J8865M445n344j4640j2725j0371j8672o190
$$ 179584 201409 229546 250843 258189 277054 281499 276155 261515 248790 238419 219747 213557
13353B13557k588l301k158J6359J2436N708P116r319j7665k976L426Q271J0865
$$ 213557 210969 207668 205510 221869 234305 240013 247129 237810 220145 217169 220595 228866 239731
13340B39731J7553R306L973R560R419K329k027Q169m11j5593j1419R208L197k704
$$ 239731 257284 266590 270563 280123 289542 291871 289844 298013 297602 282009 270590 279798 282995 280291
13326B80291N335K0472k73r548N639j6095j6715n54R039j369Q78k822n985L809
$$ 280291 285626 306098 305825 296277 301916 285821 269106 268552 277591 276222 277100 274278 268293 272102
13312B72102L915M800M906j579P385J0830J2473K5451R323J5357K3246L3061K3969
$$ 272102 276017 280817 285723 284144 291529 302359 314832 340283 349606 364963 388209 421270 445239
13299D45239P776Q915Q883j5346k5835k2913m3440k7905l096J0497M408o9N152
$$ 445239 453015 461930 470813 455467 429632 406719 363279 335374 332278 342775 347183 347114 352266
13286C52266L348o939r64k71J3033J4688M953m79J5777P564M053J0546K958J6679
$$ 352266 355614 348675 347711 347440 360473 375161 380114 379635 395412 402976 407029 417575 420533 437212
13272D37212J3851J4450m393N691K2995K0797J4707K9306L8660L5389J8550J1329
$$ 437212 451063 465513 461120 466811 489806 510603 525310 554616 593276 628665 647215 658544
13260F58544R488K3541K0508J1784L2137O4848P2960Q6508J42465K20049L43448
$$ 658544 668032 691573 712081 723865 756002 820850 893810 980318 1122783 1342832 1686280
13249A686280M30305L19600K7828k69277l92488l15080k06015j25172o5812j8714
$$ 1686280 2116585 2436185 2464013 2194736 1802248 1487168 1281153 1155981 1090169 1071455
13239A071455J6088L5134K7860N3458O3250N7399M7204N9451Q1705J01378J18417
$$ 1071455 1087543 1122677 1150537 1203995 1267245 1324644 1371848 1431299 1513004 1614382 1732799
13228A732799J42324J61817J75415K12540K63414L21317L90715M73901N80493
$$ 1732799 1875123 2036940 2212355 2424895 2688309 3009626 3400341 3874242 4454735
13219D454735O97961Q40010J031660J307643J669010K261940L108636M302066
$$ 4454735 5152696 5992706 7024366 8332009 10001019 12262959 15371595 19673661
13211A9673661N722781O760036O375182L835700k41661m153325o340138o523916
$$ 19673661 25396442 32156478 38531660 42367360 42125699 37972374 31632236 25108320
13203B5108320n459577m100220k929845k055362j455498j014457o90364m41107
$$ 25108320 19648743 15548523 12618678 10563316 9107818 8093361 7402997 6961890
13195F961890k81734k09671j73132j51569r4532J0380J58246L10547M68299O16092
$$ 6961890 6680156 6470485 6297353 6145784 6051252 6061632 6219878 6530425 6998724 7614816
13185G614816Q20870J045676J302753J625559K029046K556501L320592M512132
$$ 7614816 8435686 9481362 10784115 12409674 14438720 16995221 20315813 24827945
13177B4827945O336841Q912426J1956909J4140963J3300054P995517n48795q940096
$$ 24827945 31164786 40077212 52034121 66175084 79475138 87470655 86921860 77981764
13169G7981764j3891751j4523308j2235034r091564o379190m470944l206048k341445
$$ 77981764 64090013 49566705 37331671 28240107 21860917 17389973 14183925 11842480
13161A1842480j765637j353709j022196p70066n80144m09255k32652q7905M8943
$$ 11842480 10076843 8723134 7700938 6930872 6350728 5941473 5708821 5620916 5669859
13152E669859J72863L00838M06191M35907M30720M86304O21195Q58514J193079
$$ 5669859 5842722 6143560 6549751 6985658 7416378 7902682 8523877 9382391 10575470
13143A0575470J652402K280557L206261M459342N924829O971488O493949L748001
$$ 10575470 12227872 14508429 17714690 22174032 28098861 35070349 41564298 45312299
13135D5312299o44105m855012p209736p339009o126163m589889l264657k331341
$$ 45312299 44668194 39813182 32603446 25264437 19138274 14548385 11283728 8952387
13127H952387j721926j281968r82084p82874o15652m94219l94244l09356k47743
$$ 8952387 7230461 5948493 4966409 4183535 3567883 3073664 2679420 2370064 2122321
13118B122321k08347j76375j45681j22536j14984r0071p2601o2169o8664m7770
$$ 2122321 1913974 1737599 1591918 1469382 1354398 1264327 1191726 1129557 1060893 1013123
13108A013123l3559l4511k3810k4576j7458k2676j8136k3951k6342j9747r06j0574
$$ 1013123 979564 945053 921243 896667 879209 856533 838397 814446 788104 768357 767451 756877
13096G56877l0778j8462k9196m2183m0489k2254J1466L819r737j6233l1111l4295
$$ 756877 726099 707637 678441 636258 595769 573515 584981 588800 579063 562830 531719 497424
13084D97424m073q94M130j803j0880j705o545j0768p209n157J5264j953m79J2546
$$ 497424 493351 492457 496587 494784 483904 482199 475654 464886 457677 452520 467784 465831 465352 477898
13070D77898k537j342j912j2764o734q921p993j3971j9349M418K2668J8800J7950
$$ 477898 475361 474019 472107 459343 452609 443688 435695 421724 402375 406793 429461 448261 466211
13057D66211Q090n67o456J997L871Q898O556n537J146k413N963N103J1557O824
$$ 466211 474301 473734 467278 469275 473146 482044 488600 483063 484209 481796 487759 492862 504419 511243
13043E11243N165J4736L4445O4757M7636N076l3858m2733m9739k8826m8322k9856
$$ 511243 516408 531144 565589 630346 677982 683058 649200 606467 556728 527902 479580 449724
13031D49724N298J3106J7499j549r665j5833q714K843j0507j0293n80j1472J6245
$$ 449724 455022 468128 485627 484078 474413 458580 449866 452709 442202 431909 431329 419857 436102
13018D36102J969J059M881K2680J3263P477O061M851r318l419o298j492J660l390
$$ 436102 438071 439130 444011 466691 479954 487431 493492 498343 489025 485606 479308 477816 479476 476086
13004D76086P325M938k57J3783J6213K7983M4681M5745M4883L6121K7459r161
$$ 476086 483411 488349 488092 501875 518088 546071 590752 636497 681380 717501 744960 735799
12992G35799m3022o0696o4645n7197l4968k6002j8467k1820j1960j4862j2781
$$ 735799 692777 632081 567436 510239 475271 449269 430802 408982 397022 382160 369379
12981C69379K0087O1630J32331K05208J96075N5437k9366n7125k9707l550j5025
$$ 369379 389466 451096 583427 788635 984710 1040147 1010781 953656 923949 920399 905374
12970I05374q137n261q284k4954r422K0054J2122k5148k9604j2274k1703j6668
$$ 905374 897237 891976 883692 858738 849316 869370 881492 856344 826740 814466 792763 776095
12958G76095j4002k3512p469k1517j3995j4781j0739j8794l6082m2083p401p510
$$ 776095 762093 738581 731112 709595 695600 680819 670080 651286 615204 573121 565720 558210
12946E58210j2628P97K2700K4049K5657L0674M5485L2629N4598P0895M7894L8220
$$ 558210 545582 546379 569079 593128 618785 649459 694944 727573 782171 853066 900960 939180
12934I39180L1986L17l1683n1142n0483m0874l4088k7689j4982j0065J0880l07
$$ 939180 971166 971483 939800 888658 838175 797301 763213 735524 720542 710477 721357 721050
12922G21050j6157L615L796K4880L6907P6136J20025J29445P4737N3661J26996
$$ 721050 704893 708508 712304 737184 774091 850227 970252 1099697 1174434 1228095 1355091
12911A355091J03051j43217k69572j54611q6656l0211j8531k1289j8039j9474
$$ 1355091 1458142 1314925 1045353 890742 804086 773875 755344 734055 716016 696542
12901F96542k8717l0032q861J7j0256l482L237J2925P215j3391k0682j3165p499
$$ 696542 667825 637793 628932 628949 618693 615211 618448 631373 638588 625197 604515 591350 583851
12888E83851Q868J1152p390n743j0910k669J3510L72M122N829K3157O042k927
$$ 583851 592719 603871 596481 590738 579828 577159 590669 591041 595163 600992 624149 630191 627264
12875F27264J2359J6292O532N929o386k619p05l14j580K2609K1865K5241J4073
$$ 627264 639623 655915 662447 668376 661990 659371 658666 658352 656772 679381 701246 726487 740560
12862G40560l5P030K5740K4943J266Q736J2780J8010K6801K9641Q383R442K0999
$$ 740560 740525 747555 773295 798238 799504 808240 821020 839030 865831 895472 903855 913297 934296
12849I34296J4125J9503L3024L8390L7792L1255Q718J1066L2155J7104J6472L0815
$$ 934296 948421 967924 1000948 1039338 1077130 1108385 1117103 1128169 1160324 1177428 1193900 1224715
12837A224715L6865M6302M3212K8137K8050P0122P1851P6389J12046J08050J01363
$$ 1224715 1261580 1307882 1351094 1379231 1407281 1477403 1549254 1625643 1737689 1845739 1947102
12826A947102J14604R8070R7738J14586J53177K08575L19338M54566N92601O50995
$$ 1947102 2061706 2159776 2257514 2372100 2525277 2733852 3053190 3507756 4100357 4751352
12816D751352N12464J74333o1738j18307k7869Q2032J72751K67201L76378N24498
$$ 4751352 5263816 5438149 5376411 5258104 5230235 5312267 5485018 5752219 6128597 6653095
12806F653095O48771Q09310R90509J189707J504725J877883K315224K805386L199439
$$ 6653095 7301866 8111176 9101685 10291392 11796117 13674000 15989224 18794610 21994049
12797B1994049L461109L798508M580168O141060Q640149J2573009J9189033L0584201
$$ 21994049 25455158 29253666 33833834 39974894 48615043 61188052 80377085 110961286
12789A10961286M9657551P4569888Q0630382M1833650k2653894p2928034q0783848
$$ 110961286 160618837 235188725 315819107 357652757 334998863 262070829 181286981
12782A81286981o0258698l8568092k3902920j5242610j0250792p169668m946762
$$ 181286981 121028283 82460191 58557271 43314661 33063869 25894201 20947439
12775B0947439l297079k419658k116239k034910j794828j419107j075478q35343
$$ 20947439 17650360 15230702 13114463 11079553 9284725 7865618 6790140 5954797
12767E954797o59599n48103m61850l94382l51858l25659l01061k55301j67776
$$ 5954797 5295198 4747095 4285245 3890863 3539005 3213346 2912285 2656984 2489208
12758B489208j17453q9029o4703l3069k7423k2591l1942n0045p1505j01321j47742
$$ 2489208 2371755 2282726 2218023 2184954 2157531 2134940 2102998 2052953 1981448 1880127 1732385
12747A732385j59169j38019r6485o0055n8821l1706j5323l1253m6213m2943k2042
$$ 1732385 1573216 1435197 1338712 1278657 1219836 1188130 1172807 1141554 1095341 1052398 1030356
12736A030356k0560j9283j5354l6067m8661n8298n9538l1001k4083k3043j6454
$$ 1030356 1009796 990513 975159 939092 890431 832133 772595 741594 717511 694468 678014
12725F78014p430K68j0920J417J0629O553M374K6560O3488P1636N9172L4662M830
$$ 678014 670584 670852 659932 661349 671978 678531 682905 709465 772953 844589 903761 938423 943253
12712I43253l4524n7672n4923m3529k4700k5734K025kk2233j0521m42K7715J9583
$$ 943253 908729 851057 796134 752605 727905 702171 704196 704194 681961 671440 670998 698713 718296
12699G18296J8016K1497K7409L5647Q4300J16478J52214K08834K80872L11387
$$ 718296 736312 757809 785218 820865 905165 1021643 1173857 1382691 1663563 1974950
12689A974950K09466k9656k57731l38319k90789k10645j36801p6391k4691r293
$$ 1974950 2184416 2154760 1897029 1558710 1267921 1057276 920475 844084 819393 810100
12679H10100Q627J8922K3534Q308o689j1396j5438j7368j6840K031k2205m0690
$$ 810100 818727 837649 861183 869491 862802 851406 835968 818600 801760 803791 781586 740896
12667G40896k8552l4176k1054J3617M4958j664j02189j5862N6757k7957n1729
$$ 740896 712344 678168 657114 670731 715689 714025 611836 595974 652731 624774 573045
12656E73045m942J1374R469N793k294J1694L864r43p835p559m033j5799m585Q116
$$ 573045 568103 579477 588946 594739 592445 604139 608003 607060 599225 591666 587633 571834 567249 575365
12642E75365N461k487R091J2876J5190K064k0555k6538j1287J0044P922J4671
$$ 575365 580826 578339 587430 600306 615496 617560 597005 570467 559180 569224 577146 591817
12630E91817O452K146P728j3710j2198J1934M322k05j5497M716M47Q367L0169
$$ 591817 598269 600415 608143 594433 582235 594169 598491 598286 582789 587505 587952 596319 626488
12617F26488L6674J1469L0526K6778J3375J6650J1144o157j3362j5181j3828k0050
$$ 626488 663162 674631 705157 731935 745310 761960 773104 766947 753585 738404 724576 704526
12605G04526j9858k0411k4348k0934p071r518k0020j8656m7260l2240L4545J02972
$$ 704526 684668 664257 639909 618975 611904 602386 582366 563710 516450 484210 518755 621727
12593F21727J40840J59508J18294P2462M5440L5412L1758K6876M1220L8865M7367
$$ 621727 762567 922075 1040369 1112831 1158271 1193683 1225441 1252317 1293537 1332402 1379769
12582A379769M9670M5727M9326O0172Q3893R5402R1121J18062J19051J25853J61316
$$ 1379769 1429439 1475166 1524492 1584664 1668557 1763959 1855080 1973142 2092193 2218046 2379362
12571B379362J73865J81065J77796J99583K45179K76406L19120L90271M39214
$$ 2379362 2553227 2734292 2912088 3111671 3356850 3633256 3952376 4342647 4781861
12562D781861N02154N78695O73735P84403R10127J086154J309533J606712K012569
$$ 4781861 5284015 5862710 6536445 7320848 8230975 9317129 10626662 12233374 14245943
12553A4245943K554438L307355M333709N748603P515408R470227J0974207J0816876
$$ 14245943 16800381 20107736 24441445 30190048 37705456 47175683 58149890 68966766
12545F8966766P905098K454398l671026q164447r947246r435730p761162n803854
$$ 68966766 76871864 79326262 75655236 67490789 57543543 48107813 40346651 34542797
12537C4542797m023984k561176j365823l67497M63146J210919J919451K555808
$$ 34542797 30518813 27957637 26591814 26224317 26687463 27898382 29817833 32373641
12529C2373641L035900L364251L502856L498995L431650L333329L298702L342157
$$ 32373641 35409541 38773792 42276648 45775643 49207293 52540622 55839324 59181481
12521E9181481L458287L548663L527346L269313K731017J845905O94264n44921
$$ 59181481 62639768 66188431 69715777 72985090 75716107 77562012 78256276 77711355
12513G7711355j733558k696935l300368l565053l575531l404428l174419k953093
$$ 77711355 75977797 73280862 69980494 66415441 62839910 59435482 56261063 53307970
12505E3307970k793014k752657k792703k864038k894693k797449k569316k183508
$$ 53307970 50514956 47762299 44969596 42105558 39210865 36413416 33844100 31660592
12497C1660592j671561j049081l36420M57953J374820K527542L958304N681096
$$ 31660592 29989031 28939950 28603530 29061483 30436303 32963845 36922149 42603245
12489D2603245P579714R231162R816105Q338671M266543j617859p279988j0775698
$$ 42603245 50182959 59414121 69230226 77568897 81835440 80217581 72937593 62161895
12481F2161895j1518619j0360744q449682o550102m971817l758621k853411k161833
$$ 62161895 50643276 40282532 31832850 25282748 20310931 16552310 13698899 11537066
12473A1537066j659400j288950r98899q16268o81730n86287n00616m47660l93240
$$ 11537066 9877666 8588716 7589817 6773549 6091819 5505532 5004916 4557256 4164016
12464D164016l19788k87226k65173k07118j59298j13513o9929l0440k9754n1893
$$ 4164016 3844228 3557002 3291829 3084711 2925413 2811900 2741971 2711531 2681777 2629884
12454B629884p3273p0086o3419p8449q3951p3361p7163q0326q4419j00881r6318
$$ 2629884 2556611 2486525 2423106 2344657 2260706 2187345 2110182 2029856 1945437 1844556 1748238
12443A748238q3292q1839m1003j1267j2850j2879k1978m8327o3692n7136n5600
$$ 1748238 1664946 1583107 1542104 1530837 1517987 1505108 1483130 1434803 1371111 1313975 1258375
12432A258375n9641m4026j4703j5548p608l018M878q538k0878k0829j8839j5462
$$ 1258375 1198734 1154708 1140005 1124457 1116849 1113831 1118709 1110171 1089293 1068464 1049625 1034163
12420A034163lj6766j3527k031N683J1456p904j7741k9613k7599k1021k3196l7269
$$ 1034163 1034160 1017394 1003867 1001836 1007519 1018975 1011071 993330 963717 936118 915097 891901 854632
12407H54632l7306k1953k1104k1325j0392Q891L647j5557L391J4798L576J1622
$$ 854632 817326 795373 774269 752944 742552 751443 755090 739533 742924 757722 761298 772920
12395G72920K442j0805p881j9432j5287j029j1590k0113j0998J1k2390k8636q111
$$ 772920 775362 764557 756676 737244 721957 720928 709338 689225 678227 678238 655848 627212 619101
12382F19101k8445l7857k3367o928j1063k696j5073R73L02J9231L5823L3060M060
$$ 619101 590656 552799 529432 522504 511441 508745 493672 494645 494947 514178 550001 583061 587121
12369E87121j4613j6484m6237n7496n1534j6728j3710k6300k2015l3843k4273
$$ 587121 572508 556024 509787 452291 400757 384029 370319 344019 322004 288161 263888
12358B63888j9559j6391j2021j9655j4958O507L411J3350J2081J6602r462j494
$$ 263888 244329 227938 215917 196262 181304 187811 191222 204572 216653 233255 223793 222299
12346B22299R43o277O068J605J5127Q394n251K2786L9984K1236K155k1199l4029
$$ 222299 223242 216965 223033 224638 239765 248159 242908 265694 305678 326914 329069 307870 273841
12333B73841k2152m227K501J384l452O949J4053K1105J1036K2476N9323R2634
$$ 273841 251689 247462 249963 251347 247895 254844 268897 290002 301038 323514 382837 475471
12321D75471J26143K06415L21465M14412L34896N7855k57276m12522l57185k55262
$$ 475471 601614 808029 1129494 1543906 1878802 1936657 1679381 1266859 909674 654412
12311F54412j70948j05658o6050l6830j9736j4998j989J4825J4422J0806r455
$$ 654412 483464 377806 311756 274926 255190 240192 238203 253028 267450 278256 268801
12300B68801l3365n4383n4481m2600k5201k0518j3171L00O920J6038K9238J3582
$$ 268801 235436 181053 126572 83972 58771 38253 25082 25382 32302 48340 77578 91160
12288I1160R770Q376J4326J4405o548o251J3083n328j1640R452K4765K6764L3140
$$ 91160 100930 109306 123632 138037 131489 125238 138321 132993 121353 130805 155570 182334 215474
12275B15474Q267m671q892j3760j9738k0139j1996j034j2371k5968j3338r369
$$ 215474 223741 219070 210178 196418 176680 156541 144545 143511 131140 105172 91834 82465
12263H2465j8882L763o850o171J354Q746n060k628n676j147J1633L665q043J2225
$$ 82465 63583 67346 60496 54325 55679 64425 59365 56737 51061 49914 61547 65212 57169 69394
12249F9394L144j5011k740Q346j124L415P331N184q861j2450J273q088q311j481
$$ 69394 72538 57527 54787 63133 62009 65424 72755 77939 69078 56628 57901 49813 41502 40021
12235D0021j54K154J7223K3631K0023L791j3297j4303m508j1470k2202l921K768
$$ 40021 39867 42021 59244 82875 102898 106689 93392 79089 74581 63111 40909 36988 39756
12222C9756J4245N534o86m055k2783j6623O405j618J1061J2519r616j6379K444
$$ 39756 54001 59535 58849 54794 32011 15388 21793 20175 31236 43755 34139 17760 20204
12209B0204P66M89p795j501j221R189Q93j2013N584J4075N756k525j2801j1268
$$ 20204 20970 21459 13664 12163 10942 20131 21024 9011 14595 28670 34426 31901 19100 7832
12195G832p736J824M418R194j742j0212n810L490R020J609l193m388N561J473
$$ 7832 96 1920 6338 15532 13790 3578 -2232 1258 10278 11887 8694 4306 9867 11340
12181A1340M106K218m299j5188O854J4515q357q522J5123J3744j7552k825L923
$$ 11340 15446 17664 13365 -1823 5031 19546 11189 2667 17790 31534 13982 11157 15080
12168A5080n378m933l754p997N482k472l321K3928J0483r821j825K47M26n290
$$ 15080 9702 4769 1015 -6982 -1500 -3972 -7293 16635 27118 17297 15472 15719 16145 10855
12154A0855j1947m923M855K507J0581M190j0726j8312O02Q87P781J6919M365n664
$$ 10855 -1092 -6015 -1160 1347 11928 16118 5392 -12920 -12318 -11431 -3650 13269 17634 11970
12140A1970o746N296N799m098j777O10j7682N042J1926K645M405p886m703n16
$$ 11970 5224 10520 16319 12221 10444 11054 -6628 -1586 10340 12985 17390 9504 4801 4285
12126D285J198N689Q335Q650m624O311O426R481l697p796O078O502J330J2862
$$ 4285 5483 11172 19507 28157 23533 29844 36270 45751 42054 34258 40336 46838 48168 61030
12112F1030K834l870j2699k280J5483N03k13m917k157J2861J1569M389M077J2564
$$ 61030 63864 59994 47295 45015 60498 61001 60788 55871 53714 66575 78144 82533 86610 99174
12098I9174P499Q124R246J5605M3052M1381M1331O1162N9294L8365J3085J931
$$ 99174 106673 114797 124043 139648 182700 224081 265412 326574 385868 424233 437318 439249
12086D39249l0630m2966o2038n2124m4786j9161k670k533k538R770L476j5184
$$ 439249 408619 365653 303615 251491 206705 187544 184874 182341 179803 189573 193049 177865
12074A77865J3428K1848K9981J4251J4604K1102O455J6028J4059O928K3769K2285
$$ 177865 191293 213141 243122 257373 271977 293079 299534 315562 329621 336549 360318 382603
12062C82603J0767K0140Q953M771j1916j6366j5183q472k3555l3470j7099j5198
$$ 382603 393370 413510 422463 427234 415318 398952 383769 375297 351742 318272 301173 285975
12050B85975k0914j9867r398q338r303n413M705r822k4731n377J942m824Q44R478
$$ 285975 265061 245194 235796 227458 218155 212742 217447 207625 182894 177517 179459 174635 175479 184957
12036A84957M227J8118J9558K7366K8006N0649M8670K0772P444j8094n6143o2947
$$ 184957 189184 207302 226860 254226 282232 332881 381551 402323 409767 391673 335530 272583
12024B72583m9735n5717k8608k1435k8642l2766r922j427m482N011o753j1492
$$ 272583 222848 167131 138523 117088 88446 55680 45758 44331 39849 44860 38107 26615
12012B6615N294J2139K247j0284m38l466l173o149j2019K993N771k057K09R631
$$ 26615 31909 44048 46295 36011 35573 32107 28934 22785 10766 13759 19530 17473 17682 27313
11998B7313J533j3940r529J1230P887q688j3483K093J2127j385l083o68p150L04
$$ 27313 28846 14906 5377 16607 24494 15806 2323 4416 16543 15158 12075 11407 4257 4561
11984D561p073l09Q576J1229k856n563p91K494M318J317R955J402n573r159n20
$$ 4561 -2512 -2821 5755 16984 14128 8565 7774 10268 14586 15903 25858 27260 21687 12528 12008
11969A2008l571j753N025L685l828n014p253J306M276q376K080O081r840j1097
$$ 12008 8437 6684 11709 15394 11566 6552 -701 605 4881 -3495 -1415 4666 -5174 -16271
11955a6271P209J3154O139J628q820j890m363l586q633J9833N367J2388J0184
$$ -16271 -9062 4092 10231 11859 3039 1149 -3214 -6800 -15433 4400 9767 22155 32339
11942C2339j260r561j7062j2384M027R010k373j23L401M586r156j5609k19m018
$$ 32339 31079 21518 4456 -7928 -3901 5109 2736 2613 6014 10600 1444 -14165 -14384 -18402
11928a8402k716K1406Q858j0417l239J0943P210O121P521p239k127r53J4109J133
$$ -18402 -21118 288 9146 -1271 -4510 6433 13643 19764 27285 20046 17919 16966 31075 32208
11914C2208j1988n480K539k656K858q186o782J4311Q69p802n792N712k578K534
$$ 32208 20220 14740 17279 14623 17481 9295 2513 16824 17693 9891 4099 9811 7233 9767
11900I767P055l322j3069p570L777p57m385J3459J2652n62p78p237n482J0160
$$ 9767 16822 13500 431 -7139 -3362 -4119 -8504 4955 17607 17045 16267 9030 3548 13708
11886A3708J4618j365r066M820O393j7715m698K044N843n975l478L869J1964q52
$$ 13708 28326 26961 17895 22715 29108 11393 6695 8739 14582 8607 5129 8998 20962 20110
11872B0110j1708m817N136N012q157k627j81j315L910Q37K198L6J715j488p517
$$ 20110 8402 3585 8721 13733 5576 2949 2768 1453 5363 6200 8398 8434 10149 8661 1144
11857A144J401N34J484M04j559r66L877p598O868R713j0515k138J1048J3966N240
$$ 1144 2545 3079 4563 4967 3408 2442 6319 -1279 5589 15302 4787 2649 13697 27663 32903
11842C2903m094k29J760J299p527n346j909J2593l565k200j3207k603J255o485
$$ 32903 28809 28580 30340 31639 24112 18766 16857 29450 25885 23685 10478 7875 9130 2645
11828B645K213j3997k997k876o779J4253l111K849P374R359J96j116J8210L727
$$ 2645 4858 -9139 -12136 -15012 -21791 -7538 -10649 -7800 -426 8933 9129 8013 26223 29950
11814B9950p923L256k80l982p764j982J0950n836o311K597j358m777N449O018
$$ 29950 22027 25283 25003 21021 13257 11275 22225 16389 10078 12675 11317 6540 11989 18007
11800A8007J0892l76q936l538L635j2804q946p96m809L299J388L616R236k50r506
$$ 18007 28899 28523 19587 16049 19684 6880 -2066 -2862 -7671 -4372 -2984 632 9868 9618 112
11785A12k20J778q652n76P898L224K826L458L934o358m661j990P63N540M154j1303
$$ 112 -108 1670 -6982 -7558 340 3564 6390 9848 13782 7424 2763 773 1536 7076 11230 -73
11769g3j0318R271Q573n128j0655k05N532J0190m775R993J4010n80j800j630l002
$$ -73 -10391 -1120 7453 2325 -8330 -8535 -3003 7187 2412 12405 26415 25835 24035 22405 19403
11754A9403r033L441p245r625J928K909N8K102K204M228Q994m540j0752n932M106
$$ 19403 10370 13811 6566 -3059 -1131 1778 1836 3938 6142 10370 19364 14824 4072 -1860 2246
11739B246K421L514M558j0889q515p425p86P929J4004L001n615p539p990m79N113
$$ 2246 4667 8181 12739 1850 -6665 -14090 -14876 -6947 7057 10058 4443 -3096 -11086 -11565 -6452
11724f452o02l187m066Q761J023M6N029J4329J611Q37J548J1713n928J0399L817
$$ -6452 -7054 -10241 -14307 -5546 -4523 -4477 552 14881 16492 17329 18877 30590 24662 35061 38878
11709C8878L70m303j4065j491J35n150n338N477m645J127J1830Q526n731q64j1820
$$ 38878 39248 34945 20880 19389 19524 14374 9036 14513 9868 10995 22825 31351 25620 24756 12936
11694A2936L314k50J210L733o804R40N962k913J0737J1335J206n639j2446j944
$$ 12936 16250 16000 17210 20943 14139 15079 21041 18128 28865 40200 41406 35767 23321 21377
11680B1377L043j839K144k4174l135O213N802Q464q025j3202Q198J3567J376j3056
$$ 21377 24420 22581 24725 551 -2584 3629 9431 17895 9870 -3332 4866 18433 19809 6753
11666F753m851M327J7233J1082Q006L523j4743r688o005Q481p205N524M661l718
$$ 6753 1902 6229 23462 34544 42550 46073 31330 21642 15637 24118 16913 22437 27098 23380
11652B3380p04N139M908p050n947N626K55j6661j1545N040J356k069k488O32K0995
$$ 23380 22676 27815 32723 25673 19726 25352 25607 8946 -2599 2441 3797 1728 -760 -128 20867
11637B0867J3697N897L300j0983M366o712J6018n136k865J030p235j4245q126
$$ 20867 34564 40461 43761 32778 37144 30432 46450 41314 38449 39479 32244 17999 9873
11624I873R134P061L293J4547q055l432n986O964R262M129k955k08j5690m301
$$ 9873 19007 26068 29361 43908 35853 32421 26435 33399 42661 46790 43835 43627 27937 23636
11610B3636r891O09N716n78j158L589R512K817n791l462k166j730l942R349j9205
$$ 23636 13745 14354 20070 19492 18334 21923 31435 34252 28461 24999 22833 21103 17161 26510 7305
11595G305j4506J7923J9580L902n636q033J057J1898P724l42q18J198m485L450
$$ 7305 -7201 10722 30302 34204 28568 20535 21592 33490 41214 40872 40054 41252 36767 40217
11581D0217n548J563K144l381K539k757n647j445m324n979P302N56O444J0283
$$ 40217 34669 36232 38376 34995 37534 34777 29130 27685 23361 17382 24684 25240 31684 41967
11567D1967J449j0058o430J76J65K344m067O09k346J692L357J3781J0157o943
$$ 41967 43416 33358 26928 27104 27269 29613 25546 26155 23809 25501 28858 42639 52796 45853
11553D5853j2068J716L314m403R96N574n136m43N612m035j3648K23J1431M592
$$ 45853 33785 35501 38815 34412 35408 40982 35846 35403 41015 36980 23332 23555 34986 39578
11539C9578P640m045l034M532O464J2091l724j1310m48P330Q833j2798K196K469
$$ 39578 47218 43173 40139 44671 51135 63226 59502 48192 47744 55074 63907 51109 53305 55774
11525E5774M880N944J199m474N822j679m075L108J6741J6053J2289M851K1793
$$ 55774 60654 66598 67797 63323 69145 67466 63391 66499 83240 99293 111582 116433 138226
11512A38226L2172L8241L0069J7213R167o233l4024l9273k8597l0980j7767l067
$$ 138226 170398 208639 238708 255921 265088 258855 224831 185558 156961 125981 108214 105147
11500A05147P1j3307q420P518l707p408N782j403J367J2098N450p078l930N766
$$ 105147 105218 91911 83491 91009 87302 79894 85676 84273 85640 97738 103188 96110 92180 97946
11486I7946L589N811J7438J6828l322j972J6458K1028L3444L7867M8914N9196
$$ 97946 101535 107346 124784 141612 138290 136318 152776 173804 207248 245115 294029 353225
11474C53225O2121N5553K7155k5427n4866p4845n3777m9156n5265m4623k7268
$$ 353225 415346 470899 498054 472627 417761 342916 289139 239983 184718 140095 112827
11463A12827j3644o54O468n791j5298J775Q92q407M650o576n968N163o960j186
$$ 112827 99183 98529 104997 99206 83908 85683 86575 78168 82818 76242 70274 75437 68477 67291
11449F7291J2454R463j937L872J806K1323K9120J6785J7980J7613J6127J6959
$$ 67291 79745 89208 87271 91143 92949 114272 143392 160177 178157 195770 211897 228856
11437B28856J6733M744r757j5106k9078k0262k5071j0053p485j6404k3308k5352
$$ 228856 245589 250333 240576 225470 196392 176130 151059 141006 133521 117117 93809 68457
11425F8457R789N131l230J401J1085J0548l846o943n358M876r331L953l525q924
$$ 68457 78246 83377 80147 81548 92633 103181 99335 92392 87034 91910 82579 86532 83007 74083
11411G4083K023M627O084J4554K777K736J691J625M038o568l714P303r336r684
$$ 74083 76106 80733 86817 101371 104148 106884 108575 110200 114238 107670 103956 111259 101923 92239
11397I2239j6873j1546j4133R85M035J3958J672p486l498L299J6119J5868M105
$$ 92239 75366 63820 49687 50672 54707 68665 70337 62851 59353 62652 78771 94639 98744
11384I8744q427j0623M729J5486J4903l932k1993O214q305k500L385N344J4574
$$ 98744 90317 79694 84423 99909 114812 110880 88887 95101 86796 84296 87681 93025 107599
11371A07599P224L416N162O647j375r550K132p919j3742O88L052P391Q868J0904
$$ 107599 114823 118239 123401 130048 128673 119123 121255 113336 99594 100282 103334 110725 119593 130497
11357A30497l512N29K920J4747k213J0051O974J6893M72k197J4981J1471q05l302
$$ 130497 126985 127514 130434 145181 142968 153019 159993 176886 177358 175161 190142 201613 200808 197506
11343A97506m428P82n064k047O598n791q321J0871M783k980j0188O809J418L826
$$ 197506 193078 193860 188796 186749 193347 187556 179235 190106 194889 191909 181721 188530 189948 193774
11329A93774P39M39J5829O58q273J6805K3669J3114l149j1943j5647r256J6926
$$ 193774 194513 194952 210781 211439 203166 219971 243640 256754 253605 241662 226015 216759 233685
11316B33685J3394m987j838k891K701P94L519K5744n438N868n193j4595j59l697
$$ 233685 247079 242092 240254 237363 240064 240858 244377 270121 264683 270551 265358 250763 250604 246907
11302B46907Q446K961k4343j3375j4465j3734p807l153o923R751j3950l796J1514
$$ 246907 255353 258314 233971 220596 206131 192397 184590 181437 174514 184265 170315 166519 178033
11289A78033N221n31j3419P706J0627J4763O022R108J2288K768q127m484j2476
$$ 178033 183254 182723 169304 177010 187637 202400 208422 217530 229818 232586 224459 219975 207499
11276B07499j6211j3493L95L451R008l197j2134q247K492M609m140n514j1733
$$ 207499 191288 177795 178190 181641 190649 187452 175318 167071 169563 174172 170032 164518 152785
11263A52785q257M003r198j0294M658J8806p586j1115m275o189O161O273P118
$$ 152785 144528 148531 139333 129039 133697 152503 144917 133802 129527 123338 129499 135772 142890
11250A42890K2972L0300M0264J9489O253j1361p883J606j4521j490q480j0341
$$ 142890 165862 196162 236426 255915 262168 250807 242924 244530 230009 228519 220039 209698
11238B09698j6854k1987m094Q892n590J252J8740J003P077r590n2m002L249J6317
$$ 209698 192844 170857 166763 175655 170065 171317 190057 191060 198137 188547 188495 184493 187742 204059
11224B04059J1132P675J4641J1334k508K9489m914j1335k17l632m73j55k023J1450
$$ 204059 215191 222866 237507 248841 246333 275822 270908 259573 259356 255724 255251 255096 253073 264523
11210B64523P56k846J1024P331M098n505J0151o957m274j3409j1205l192k017
$$ 264523 265279 262433 273457 280788 284886 279381 289532 282575 278301 264892 253687 250495 248478
11197B48478K709J2328o937q361K418J9238O836j1194K1307K1854K6682K5870
$$ 248478 251187 263515 256578 248217 250635 269873 276709 265515 286822 308676 335358 361228
11185C61228L6502N1603K3701J7377J2370j2736j5074k7140l0177j9397j8789
$$ 361228 397730 449333 473034 490411 502781 490045 474971 447831 417654 398257 379468
11174C79468k560N121J012j2004j1062L266M466K017O800K145L811J3548J1401
$$ 379468 376908 382029 383041 371037 359975 363241 367707 369724 376524 378669 382480 396028 407429
11161D07429J5644J2564J2160O055P368K2980O722K2725J3265J8792K7738K7012
$$ 407429 423073 435637 447797 453852 461220 484200 490922 513647 526912 545704 573442 600454
11149F00454K7833K4412L5575L3771K4210K4438m66l738J011K2641K7961M1595
$$ 600454 628287 652699 688274 722045 746255 770693 770227 766489 767500 790141 818102 859697
11137H59697L2282L4588K9333J2717P315k3j0656o590K481J4541J1668K5381N3636
$$ 859697 891979 926567 955900 968617 975932 975909 965253 958663 961144 975685 987353 1012734 1066370
11124A066370N4858O8314Q6037Q7637P8740O3512Q3798R8134Q5887R0811J18715
$$ 1066370 1121228 1189542 1275579 1363216 1441956 1505468 1589266 1687400 1773287 1864098 1982813
11113A982813J40352J66819K01758K62734L00842L47129L85561M25642M52150
$$ 1982813 2123165 2289984 2491742 2754476 3055318 3402447 3788008 4213650 4665800
11104D665800N02016O01176P44845R22245J188457J555226K111503K978069M220974
$$ 4665800 5167816 5768992 6513837 7436082 8624539 10179765 12291268 15269337 19490311
11095A9490311N800072P347044P674806N449501P95811m223493p255182p580700
$$ 19490311 25290383 32637427 40312233 45761734 46557545 42334052 35078870 27498170
11087B7498170o287571m624511l248701k231196j520305j007025n96267l14763
$$ 27498170 21210599 16586088 13337387 11106191 9585886 8578861 7982594 7667831
11079G667831j60424j33980j68452j73771j00065J9390J59685L12903M63380N64595
$$ 7667831 7507407 7373427 7204975 7031204 6931139 6950529 7110214 7423117 7886497 8451092
11069H451092O40326Q03733J011293J285328J657361K161978K920312M076115
$$ 8451092 9091418 9895151 10906444 12191772 13849133 16011111 18931423 23007538
11061B3007538N825624Q430213J1799070J4752586J4820845R854945N13510r126912
$$ 23007538 28833162 37263375 49062445 63815031 78635876 88490821 89004331 79877419
11053G9877419j4851879j5377419j2634406r215887o408648m447668l119251k181814
$$ 79877419 65025540 49648121 37013715 27797828 21389180 16941512 13822261 11640447
11045A1640447j542799j109549p83135n77369m45968l56374k81161k16900r1168
$$ 11640447 10097648 8988099 8204964 7627595 7181627 6825253 6544092 6327192 6236024
11036F236024P8744K25262K84068K45240K02307K59399M12439O62199R53899J350463
$$ 6236024 6314768 6540030 6824098 7069338 7271645 7531044 7943483 8605682 9559581 10910044
11026A0910044J908508K713650L825226N240309O580751O789582M641448L02523
$$ 10910044 12818552 15532202 19357428 24597737 31178488 37968070 42609518 42912041
11018D2912041m331695p081192p320537o044920m463056l157925k226750j596884
$$ 42912041 38580346 31499154 24178617 18133697 13670641 10512716 8285966 6689082
11010F689082j143668q28718o38125m84344l78006l18728k72685k71883k85346
$$ 6689082 5545414 4716696 4078571 3594227 3216221 2897493 2624808 2352925 2067579
11001B067579k56060j95784j57837j24690j15042j01560p0286p2531p3248l9874
$$ 2067579 1811519 1615735 1457898 1333208 1218166 1116606 1046320 973789 900541 860667
10991H60667k0336k2270l0113k2786q308j1797j1142k0777q094Q287J2901N5991
$$ 860667 840331 818061 787948 765162 756854 745057 733915 713138 705044 713331 726232 782223
10979G82223M0925J8362m238l7008o5856p5518n3200l4325k3650k3016k1310k0018
$$ 782223 823148 841510 837272 800264 734408 658890 605690 571365 547715 524699 503389 483371
10967D83371l0325j2929j4155j5510q974j2120j854n049j8545k8300j6285K899
$$ 483371 453046 440117 425962 410452 401478 389358 387504 382455 363910 335610 319325 322224
10955C22224N799n178J904J3198l375l320J1647J0355K8295K3112L5832K3909
$$ 322224 328023 322845 324749 337947 334572 331252 342899 353254 381549 404661 440493 464402
10943D64402M749m995J5618m796k1276k4219l4052l9781j8266k1095j3958m552
$$ 464402 469151 464156 479774 474978 453702 429483 395431 355650 337384 316289 302331 297779
10931B97779P59O764m089j2886j4586k6253j3254r868N191J4829l685j2986M989
$$ 297779 298538 305302 301213 288327 273741 247488 234234 224366 229557 244386 240701 227715 232704
10918B32704Q352K427Q224P083m055R177n935l329L1740L1755J8344R851J1764
$$ 232704 241056 243483 251707 258790 254735 263912 257977 254648 286388 318143 336487 346338 358102
10905C58102L745M57k730k112k222j324k0553j9110J482k785j2580j6199r616
$$ 358102 361847 362304 359574 357462 355240 353916 333363 314253 315735 312950 300370 284171 274555
10892B74555j4662P418R400l721l421J412k357q869o669Q270J7414M471J4837
$$ 274555 259893 267311 276711 272990 269569 270981 268624 259755 253086 261356 278770 283241 298078
10879B98078J6345l207J4369J388j3776N872l114q696j0840n949j072j3759l383
$$ 298078 314423 311216 325585 326973 313197 319069 315955 307259 296419 290470 289398 275639 272256
10866B72256J2095J8638J3772R906K9542L0518L6732K0149J3532M945O286J0817
$$ 272256 284351 302989 316761 326667 356209 386727 423459 443608 457140 462085 468371 479188
10854D79188M945M025M404J4133J8664K1101K3159J9562J8701J8338J4416R298
$$ 479188 484133 488158 492562 506695 525359 546460 569619 589181 607882 626220 640636 649934
10842F49934K2774R653j6636k1632p100q48J2759K843M457O953o334n19J0314
$$ 649934 672708 682361 665725 644093 636993 636145 648904 651747 656204 663157 656823 656304 666618
10829F66618k207N71Q649k103p11L096K059O966J2851J0068J0849R463J9388K3854
$$ 666618 664411 664982 673631 671528 670817 673913 675972 682938 695789 705857 716706 726169 745557 769411
10815G69411J209m405J794j665l312p813j0967j0636j2992N056K1261Q568l628
$$ 769411 770620 766215 768009 766344 763032 755219 744252 733616 720624 725680 746941 755509 751881
10802G51881M875m610Q413J4825N847N087P273O501n88P166K8176L1920L2222
$$ 751881 756756 752146 760559 775384 781231 786318 793591 800092 799504 806670 834846 866766 898988
10789H98988K6996J9211K3827L6080K9556K5885K4637J0306J0836J1426K431O80
$$ 898988 925984 945195 969022 1005102 1034658 1060543 1085180 1095486 1106322 1117748 1120179 1120859
10777A120859J4884J7903K4888J3388P076J5793J1806K3968K2645K8394N3706
$$ 1120859 1135743 1153646 1178534 1191922 1198998 1214791 1226597 1250565 1273210 1301604 1355310
10766A355310N3315N0129L3972N1913N7400M2517M8008P4320P0120P6833Q2654
$$ 1355310 1408625 1458754 1492726 1544639 1602039 1644556 1692564 1766884 1837004 1913837 1996491
10755A996491R2485R3295R1993R4601J16436J26154J29076J50009J60283J92907
$$ 1996491 2088976 2182271 2274264 2368865 2485301 2611455 2740531 2890540 3050823 3243730
10745C243730K07220K24370K35463K54237K98371L35789L72329M34897M89187
$$ 3243730 3450950 3675320 3910783 4165020 4463391 4799180 5171509 5606406 6095593
10736F095593N53331O43713P36089Q52600J005524J154428J342398J594651J891918
$$ 6095593 6648924 7292637 8028726 8881326 9886850 11041278 12383676 13978327 15870245
10727A5870245K250924K745687L362186M101443M964031N919172O751614P143869
$$ 15870245 18121169 20866856 24229042 28330485 33294516 39213688 45965302 53109171
10719E3109171O647104M973946K247259q66218l543322n236400n837326n562138
$$ 53109171 59756275 64730221 66977480 66111262 62567940 57331540 51494214 45932076
10711D5932076m747112l688675k607719j543293n24762L96953J249490K030885
$$ 45932076 41184964 37496289 34888570 33345277 32820515 33217468 34466958 36497843
10703C6497843K638562K962787K881386K423219J641548P77467J50335j153L94609
$$ 36497843 39136405 42099192 44980578 47403797 49045345 49822812 49973147 49971994 50366603
10694E0366603J235405K292343L356782M196665M540514M159197K960224J037641
$$ 50366603 51602008 53894351 57251133 61447798 65988312 70147509 73107733 74145374
10686G4145374j159906l105492m352938m710559m327464l453878k358233j333933
$$ 74145374 72985468 69879976 65527038 60816479 56489015 53035137 50676904 49342971
10678D9342971o19882l73075o60141j298440k007120k549350k761298k629973
$$ 49342971 48723089 48350014 47689873 46391433 44384313 41834963 39073665 36443692
10670C6443692k203849j551617q14585m6660P73270J603090K459967L314056M050945
$$ 36443692 34239843 32688226 31873641 31826981 32600251 34203341 36663308 39977364 44028309
10661D4028309M550549M555452L782855K123473k05637k697635m750928n945494
$$ 44028309 48578858 53134310 56917165 59040638 58835001 56137366 51386438 45440944
10653D5440944o224751n847173n147089m351089l603860k941923k405651j951178
$$ 45440944 39216193 33369020 28221931 23870842 20266982 17325059 14919408 12968230
10645A2968230j596373j304979j076215r15972p70216o38085n34967m66135l97999
$$ 12968230 11371857 10066878 8990663 8074691 7304475 6666390 6131423 5665288 5267289
10636E267289l31686k55024k10908j95195k03442k15779k07728k21894k36401
$$ 5267289 4935603 4680579 4469671 4274476 4071034 3855255 3647527 3425633 3189232
10627C189232j98902j62777j34915j25034j37348j22330j15656j16539j06946
$$ 3189232 2990330 2827553 2692638 2567604 2430256 2307926 2192270 2075731 1968785
10618A968785j05385j07560q7492o2096n0047m0304m0901m3932n7784m6838l3634
$$ 1968785 1863400 1755840 1668348 1606252 1556205 1515901 1475000 1431068 1373284 1326446 1292812
10607A292812j7632r562Q815p089J2387J8455L9687L3964L4127L0253Q841q730
$$ 1292812 1275180 1265618 1274433 1267344 1279731 1298186 1337873 1371837 1405964 1436217 1445058 1436328
10595A436328l0746m6775m6608l9774k3955j3799l8470m8015j6377K4480Q2049
$$ 1436328 1405582 1358807 1312199 1272425 1248470 1234671 1196201 1148186 1131809 1156289 1238338
10584A238338J26842J52581Q4839m7586j37274j55765j40500j00170n4248l3858
$$ 1238338 1365180 1517761 1602600 1555014 1417740 1261975 1121475 1021305 967057 933199
10574I33199k8847j0471J2562L6437K2103M059M824j44J978j7652j1739j1776
$$ 933199 904352 893881 906443 942880 964983 969042 973866 973722 975700 958048 946309 934533
10562I34533j5183l259o397j375p564j4332j3374k0243k8348k7448k5814k3424
$$ 934533 919350 916091 909694 908319 900755 886423 873049 852806 824458 797010 771196 747772
10550G47772j2347q312p761P264J6296J8283K7474K6832L5636K1692K4352m373
$$ 747772 735425 727113 719352 726616 742912 761195 788669 815501 851137 872829 897181 892808
10538H92808j9579k0720l2795n3795m5571k5126l8742k6597k339j7589j5631l1839
$$ 892808 873229 852509 819714 765919 720348 695222 656480 629883 627544 609955 594324 562485
10526E62485k6099q033j4848m081j6444j2752j0068l765j0317k8151l6801k1921
$$ 562485 536386 528353 513505 509424 492980 480228 470160 466395 456078 427927 391126 369205
10514C69205j6700l637q59j3676j2421j3912L795m273o338Q636j570M89K4058
$$ 369205 352505 348868 348009 334333 321912 308000 311795 307522 301184 309820 308250 308739 332797
10501C32797P303J4744o858m348r702j4212j5662n051j3218j8304j5764k0987
$$ 332797 340100 354844 347986 343638 333936 319724 304062 299011 285793 267489 251725 230738
10489B30738j0421j1033q291j0617M64q83q6R096r654j7330o751r657j2289m086
$$ 230738 220317 209284 200993 190376 190840 189957 189871 198967 189313 171983 165232 155575 143286 139200
10475A39200L763l640o293N776j0513j0338N934j416o619k307R796J3400J1089
$$ 139200 142963 139323 133030 138806 128293 117955 123889 122473 115854 113547 123343 136743 147832
10462A47832n71L877M012J0328O73M336r578m965R721J5782q937K830o774r310
$$ 147832 147261 151138 155150 165478 166151 170487 160909 155944 165665 181447 172510 175340 168566 159256
10448A59256k444j49o813L455J752R381j941l57M686o995j0755P554j0512J91
$$ 159256 156812 156663 149850 153305 155057 164438 162497 162140 166826 159831 149076 156630 146118 146309
10434A46309P076j878Q87O197j457j455J1235l128o615p73o480r103Q439L003
$$ 146309 153385 151507 152394 158591 157134 155679 166914 163786 157171 156398 149918 140815 149254 152257
10420A52257n221L653j4751M050J0470M902J2094n247r692k644j3325p948o920
$$ 152257 147036 150689 135938 139988 150458 155360 167454 162207 152515 149871 136546 128598 121678
10407A21678j154j2491k013J1112P045m730l846O579o264l897q967p069R909J3366
$$ 121678 120524 108033 106020 117132 124177 119447 115601 122180 115916 112019 103052 95983 105892 119258
10393A19258P682J5946O326j3705j8484J093K424P417N010K676J2680j6125o478
$$ 119258 126940 142886 149212 135507 117023 118116 120540 127957 132967 135643 148323 132198 125720
10380A25720r8J580j120N631J007K969L190m006j0377K157k893p708J643q570
$$ 125720 125622 127202 126082 131713 132720 135689 138879 134873 124496 126653 123760 116052 117695 109125
10366A09125j8466p319J2575J7805J2470L583j39Q797j612j385k83J426m738j3415
$$ 109125 90659 83340 95915 113720 126190 129773 129634 138431 136819 135434 135151 136577 131839 118424
10352A18424k048r108m076J0669R98N39j873O413K766J145P984P279m925L056
$$ 118424 116376 107268 103192 113861 114859 115398 113525 119938 122704 123849 131833 139112 134187 137243
10338A37243J1608P547r821j3100l190M511R535O034p535n531K5705J5631j2341
$$ 137243 148851 156398 146577 133477 130287 134798 144333 150367 142832 137301 163006 178637 166296
10325A66296m553J193N427N055R399k591j5071J184K3946j012m616J4011R632
$$ 166296 161743 162936 168363 173418 182817 180226 165155 166339 190285 189273 184657 198668 208300
10312B08300K971n840j176P413J1245Q841J955j0338J3333L6527L0784K2826J8801
$$ 208300 211271 205431 204255 211668 222913 231754 233709 223371 236704 273231 304015 326841 345642
10299C45642K9815K5444L8098L1602K2709K1017K7653P010j0923p497j7680k2771
$$ 345642 375457 400901 438999 470601 493310 514327 541980 548990 538067 530570 512890 490119
10287D90119j1608k4321l6154j7180N606l603L654Q731P612L195J9581J9252J5137
$$ 490119 478511 454190 418036 400856 406462 402859 406513 415244 422856 426051 445632 464884 480021
10274D80021J7332J7228J455o020m060K8244J3424J341Q665L3058K0333J5572
$$ 480021 497353 514581 516036 510016 505956 534200 547624 548965 557630 590688 611021 626593
10262F26593P503j1502j5131j5171j6650j7300j126j7206k6571j2596J168O067
$$ 626593 634096 622594 607463 592292 575642 558342 557216 540010 513439 500843 502011 508078
10250E08078Q022j1479k4211j9388j4585j2216j5399j118J9401J3380J6917J9554
$$ 508078 516100 504621 480410 461022 446437 434221 418822 417704 437105 450485 467402 486956
10238D86956J1080R027J6071J5293K4463J8686K859j6227j8116j9695k0158k3214
$$ 486956 498036 507063 523134 538427 562890 581576 584435 568208 550092 530397 510239 487025
10226D87025l1072l1281l4950j4748r398j5252l480j1012k0676J682J3688N329
$$ 487025 455953 424672 389722 374974 365576 350324 346844 335832 315156 316838 330526 335855
10214C35855N56p583j6834n974J0838p452j3634j8499Q866J7435k204P112j1828
$$ 335855 336411 328828 311994 306020 316858 309406 295772 277273 286139 303574 301370 308482 296654
10201B96654r848J7230J3897p134L351R12j0186N757p974r939m217l308k384J1606
$$ 296654 286806 304036 317933 310799 314150 315062 304876 310633 302659 292720 288503 285195 282811 294417
10187B94417l558j2176p683N25Q901j2173L020j660j057M61o640p199L605L347
$$ 294417 290859 278683 271000 271525 280426 268253 271273 269613 268556 269017 262377 255178 258783 262130
10173B62130r021J662l157N066N57J2407O009l1433j0290J0185R326o264J537
$$ 262130 253109 254771 251614 256680 257237 269644 275653 244220 233930 244115 253441 247177 248714
10160B48714O781k452N079P00O552j593n125K320m316q03o860j5797j2483Q740
$$ 248714 255495 253043 258122 258822 265374 263781 258656 260976 256660 255857 248997 233200 220717 229457
10146B29457m566P473j2577l285J2896P699L704j2142j442j0619n625p064P350
$$ 229457 224891 232364 219787 216502 229398 237097 240801 228659 227217 216598 210973 203909 211259
10133B11259J3126J543o019m826j5595n245m109j3655J945J6500Q235j492p645
$$ 211259 224385 225928 219909 215083 199488 194243 190134 176479 178424 194924 203159 201667 194022
10120A94022j0240K220N116r529n655j592L174O535q652j6430j4254Q109J5319
$$ 194022 183782 186002 191118 181589 175934 174342 177516 184051 175399 158969 144715 152824 168143
10107A68143m492k621J562m179j0151l660n759Q533J1655P364J622J9706K324
$$ 168143 163651 161030 162592 158413 148262 144602 138843 147376 159031 166395 168017 187723 190047
10094A90047o445j5253k563k4225n025P223K141j645j6061j581J2537m44q598
$$ 190047 183602 168349 165786 141561 136536 143759 145900 144255 128194 126613 139150 138706 130108
10081A30108N062k096p91l057N83K529m829N62o006m797j309K399J162n684o400
$$ 130108 135170 133074 132283 129226 129809 132338 127509 128071 122065 117268 115959 118358 119520 113836 107436
10066A07436N120R033j2840j2049K13O4L622J873J290m035J390k645r823r891
$$ 107436 112556 121589 108749 96700 96913 96977 100599 102472 103762 99727 101117 98472 88649 78758
10052G8758N263N086Q688J0174j606j0701n884k712k703N258j0876p011Q30Q548
$$ 78758 84021 89107 97795 107969 106363 95662 89778 87066 84363 89621 78745 71734 72564 81112
10038H1112K256q565k063O289J8292J223o377n697n443P16j83K73K223p932o267
$$ 81112 83368 74803 72740 79029 97321 98544 92167 86470 81027 81743 81560 81833 84056 76124 69857
10023F9857M020P537q091k971n226p562J1963l26m390O99J904M400M72J115L698
$$ 69857 73877 81414 73323 70352 65126 57564 69527 69201 64811 65510 67414 71814 72286 73401 77099
10008G7099L900j6455K701P959R968j9777j4166k563j10J0977O43J440J1425O007
$$ 77099 80999 64544 67245 75204 85172 65395 51229 48666 48556 59533 60176 61616 73041 79048
9994G9048m438j0688p957m287q684l272R76O541K739k306l767l34J367O398l908
$$ 79048 74610 63922 55965 51678 42994 39722 40698 47239 49978 47672 43905 43571 44938 51336 47428
9979D7428L858K606p683l979m613N398K981l103j7257j6485O435R710Q557j329
$$ 47428 51286 53892 46209 42230 37617 43015 45996 42893 25636 9151 15586 25296 33853 32524
9965C2524Q089Q609q67j0708j0620N655N385K298Q269J651j2513p782j0254j4326
$$ 32524 40613 49222 48355 37647 27027 32682 38067 40365 48634 50285 37772 29990 19736 5410
9951E410L875P798J6987J5370K0168o191j0820r722o356L002J241r041q429J0734
$$ 5410 9285 17083 34070 49440 69608 63417 52597 42875 36519 39521 40762 31721 23292 34026
9937C4026J6190m764n976k52m810j6912N590l14K091o746N244l03J4522K562j2055
$$ 34026 50216 45452 39476 39224 34414 17502 23092 22778 24869 18123 23367 23064 37586 40148 28093
9922B8093r121o462m282K272J9060K878q650J0853J2760r930j1437j1034r372
$$ 28093 18972 12510 8228 10500 29560 32438 23788 34641 47401 37471 26034 15000 5628
9909E628j264J4137m060j2525J295J2070J1708K45q002l793J2725J8331P038J928
$$ 5628 4364 18501 14441 1916 3211 15281 26989 27234 19232 15439 28164 46495 53533 55461
9895E5461kP017q472n145Q431J0347k2436n910j7001M90j1588O752J1226K136
$$ 55461 55459 62476 54004 48859 57290 67637 45201 39291 22290 22780 11192 17944 29170 31306
9881C1306j6852l222M05Q599L281l119j23K877M122p322o394p87m070J2901J0450
$$ 31306 14454 11232 11637 20236 23517 20398 20275 23152 27274 19952 13558 12771 8701 21602 32052
9866C2052J4349n832k0678o039J7506N692N823j8530j9863N855l540r922M351
$$ 32052 46401 40569 19891 13852 31358 37050 42873 24343 4480 10335 6795 -3127 1224
9853A224M877J7838r07O953r952o118J4643L325P524j329j0695j0652j959Q222
$$ 1224 6101 23939 23032 29985 20033 13915 28558 31883 39407 38078 27383 16731 14772 22994
9839B2994J042p158Q964O137K478N721l523m328j91o287r96L902p387o177l659
$$ 22994 24036 16878 25842 31979 34457 40178 36655 32327 32136 25849 24853 28755 21368 15191 11532
9824A1532l978J0146J1902n945q943j783M709L577J229M163J60j1937l48J3845
$$ 11532 7554 17700 29602 23657 14714 12931 17640 21217 22446 26609 26769 14832 14484 28329
9810B8329m79l285p41P47L952r470j0470K3004J5452P290k617q934l363J201o359
$$ 28329 27850 24565 23824 24571 28523 19053 8583 31587 47039 54329 51712 42778 39415 40616 34257
9795C4257j295L364J9205J8253J605J3233P909k396P563K3967K0812k699P423
$$ 34257 32962 36326 55531 73784 75389 88622 96531 94135 101698 125665 146477 143778 151201
9782A51201J7219J9940K6777L5482M4579N1382N2040Q1344J14486J47925K65821
$$ 151201 168420 188360 215137 250619 295198 346580 398620 479964 594450 742375 1008196
9771A008196M33503P75888J181165J089755K32528q15903j234785r75533o07612
$$ 1008196 1441699 2217587 3398752 4488507 4721035 3905132 2670347 1694814 1087202
9762A087202l60978j99250j20062r8374p8094m6412k6217k2850j2300j2687k2360
$$ 1087202 726224 526974 406912 308538 230444 184032 157815 134965 122665 109978 87618
9751H7618j3499j3314j7682r101j2692M115j11N601J814o854j3290P757J3925
$$ 87618 74119 60805 43123 34022 21330 25445 25334 30935 32749 25895 12605 20362 34287
9738C4287p215k723J8972N470L71q104j3233l568l628J0536j3003o326J135J9
$$ 34287 27072 24349 43321 48791 49162 41058 27825 24257 20629 31165 18162 11836 12971 12990
9724A2990j1557P229J232M748L519O158m04j2073j8516j1358P308J0019O125M747
$$ 12990 1433 8662 9894 14642 18161 24319 23915 11842 -6674 -18032 -10724 -705 5420 10167
9710A0167J4310J038j2404K253J91r488J826k530K087j2171J4413M874j170o662
$$ 10167 24477 25515 13111 15364 15555 6067 7893 5363 7450 -4721 9692 14566 13396 6734
9696F734k1110l877R854Q689J60j9049M90P020L468j6842q688J0345J8080J0573
$$ 6734 -14376 -18253 -8399 290 450 -18599 -18109 -11089 -7621 -24463 -33151 -22806 -4726 5847
9682E847J527j0224m638J2735L622o518M240J605J596q119O758k474J0487Q243
$$ 5847 7374 -2850 -7488 5247 8869 2351 6591 8196 9792 1673 8431 5957 16444 24687
9668B4687r507P45k380P863j0604j5918J746l080r376Q062O015j249P814j1846
$$ 24687 15180 15925 13545 21408 10804 -5114 -3368 -6448 -15824 -7762 -1747 -2996 4818 -7028
9654g028q344R05P030j34l435J3093L07L595J2479j2814q033J0409K322j3218
$$ -7028 -15372 -14467 -7437 -7571 -11006 2087 2394 5989 18468 5654 -2379 8030 10352 -2866
9640b866j0986p884R86R677J547j3883J5459J0144Rl348j0163M351J97j0555N283
$$ -2866 -13852 -21736 -20750 -11073 -9526 -23409 -7950 2194 2203 -1145 -11308 -6957 -6760 -17315 -12032
9625a2032J3193r468r87o690m099Q728J8384K51Q441n291j4536R20k729k43P609
$$ -12032 1161 -8307 -9294 -15984 -20083 -11355 7029 7280 15721 10430 -4106 -3186 -5915 -6158 1451
9610A451r27q607j2679L931J3622Q288L237n59J090p192k71k776n364n941q114
$$ 1451 524 -8083 -20762 -16831 -3209 5079 8316 7757 8847 1655 1384 -1392 -6756 -12697 -20811
9595b0811k701L710L650m588j1288J7213Q413j7158L43Q351L513n695j1290k168
$$ -20811 -23512 -19802 -16152 -20740 -32028 -14815 -6402 -23560 -23217 -14866 -11353 -17048 -28338 -30506
9581c0506J982M746R717M367j1541o583K806J4986J3485J580j5002O99J0106r200
$$ -30506 -28524 -23778 -14061 -9694 -21235 -27818 -25012 -10026 3459 5039 -9963 -9264 842 -8358
9567h358o950NJ4097N474o381p533j0332P599J5146j3693M932N089j2872q64O825
$$ -8358 -15308 -15303 -1206 4268 -2113 -9646 -19978 -12379 2767 -10926 -5994 -905 -13777 -14641 -7816
9552g816J1003p50N731N397p018j5262m672j2232o968K769J0313N629j777P716
$$ -7816 3187 2437 8168 13565 6547 -8715 -13387 -25619 -32587 -29818 -19505 -13876 -15653 -7937
9538g937m771J0262j1285l073J1437J4464L299q339J097p081l984P850l712j3253
$$ -7937 -12708 -2446 -13731 -16804 -5367 9097 12396 4057 5154 -1927 -5911 1939 -1773 -15026
9524a5026j7068j564J7524l526k505J5154K0466j2744j5534Q499l728j7179k037
$$ -15026 -32094 -33658 -16134 -19660 -22165 -7011 13455 711 -14823 -6324 -10052 -27231 -29268
9511b9268o718K771J8922J387J5023p592p737N752J9875P3j6184l956r241K174
$$ -29268 -35986 -33215 -14293 -12906 2117 -5475 -13212 -7460 12415 12488 -3696 -7652 -16893 -14719
9497a4719J0973l407o972n635p350Q638k090J1518M600Q73q764R51M825M812J3223
$$ -14719 -3746 -7153 -14125 -19760 -27110 -18472 -20562 -9044 -4444 -3571 -12335 -11384 -6559 -1747 11476
9482A1476q467j7081o174K502R372J2935m100K746K832L100K820L15L815M68o383
$$ 11476 3009 -14072 -20246 -17744 -8372 4563 463 3209 6041 9141 11961 12276 16091 16559 10176
9467A0176o555m582j2378r141J4190R083j987j585j866j344n458p953l72O214
$$ 10176 3621 -961 -13339 -22480 -8290 793 -1194 -2779 -4645 -5989 -11447 -19400 -19772 -13558
9453a3558K263m496N67l374j0852J175N54M319J7603J4064o178J975O867L099
$$ -13558 -11295 -15791 -15224 -18598 -29450 -28275 -27721 -23402 -5799 8265 2087 4062 10929 14028
9439A4028q528J352K348l371j972n891n515J300l599m416j708J744L517J162K534
$$ 14028 5500 6852 9200 5829 3857 -2034 -7549 -6249 -9848 -14264 -15972 -14228 -10711 -9549 -7015
9424g015R261M612m755r451J0363M752j0405q945o925L027Q459j182p54k117k813
$$ -7015 2246 6858 2103 -7348 3015 7767 -2638 -11583 -18508 -15481 -7022 -8204 -8958 -11075 -13888
9409a3888K929n315L08K819K920n274n81m049J2641J2869J6899j342n439j5839
$$ -13888 -10959 -16274 -15966 -13147 -10227 -15501 -16082 -20131 -7490 5379 22278 20936 15497 -342
9395c42O316N23j7731j182J2179J412k607m626J523m04J218r565M439J85J422
$$ -342 5974 6497 -11234 -12416 -237 1175 -1432 -6058 -4535 -4939 -3721 -13286 -8847 -8662 -7240
9380g240O516j3673k817o455j3690J0255J7706J3436k421j1474r109J0311Q702
$$ -7240 -724 -14397 -17214 -23669 -37359 -27104 -9398 4038 1617 -9857 -18966 -8655 47
9367D7O468m400l786r448N128M130k639j694J346j461p310r838J0859J3591j206
$$ 47 6515 2115 -1671 -11119 -5991 -1861 -4500 -6194 -4848 -6309 -13619 -23457 -12598 993 -213
9352b13n458K530O769q997R180P845r800o23q29m94J1990M421Q159j722k089M982
$$ -213 -5671 -3141 3628 -5369 3811 11656 1856 1233 404 -90 11900 16321 24480 22758 20669 25651
9336B5651P465l49L475M423k9148k3940n23N033O776J7366O048r967j3800n991
$$ 25651 33116 32767 36242 40665 11517 -12423 -12946 -7913 -1137 16229 22277 12310 -1490 -7481
9322g481o929K539m943J290J3899J275J7024r542j0549l976m557P270k087o781
$$ -7481 -14410 -11871 -16814 -15524 -1625 -350 16674 7132 -3417 -7393 -11950 -4680 -6767 -13548
9308a3548J3151K206J284L325o010m171n310M694l843J005J2929K893k687R29
$$ -13548 -397 1809 3093 6418 408 -3763 -9073 -4379 -8222 -7217 5712 8605 5918 6847
9294F847r915k347M622O248P998K198K641n848p600k0573J299J3492J2334M423
$$ 6847 -3068 -5415 -793 5455 13453 15651 18292 12444 4844 -15729 -14430 -938 11396 15819
9280A5819O547m233k711j2502j180O539q891j1660k49j8529K295Q348j805j082
$$ 15819 22366 18133 15422 2920 1740 8279 -612 -12272 -12521 -31050 -28755 -20407 -22212 -23294
9266b3294P313l9L44J4121J3085M407n57r495M583L528L044r8j0786l595j493
$$ -23294 -15981 -16020 -15676 -1555 11530 15937 15380 5885 10468 13996 17040 16942 6156 2561 1068
9251A068n932j1715R991P983n355k624M15P257l100n295l315n246Q698J2797N097
$$ 1068 -4864 -16579 -6588 1395 -3960 -6584 -6169 1088 -2012 -7307 -10622 -15868 -7170 5627 10724
9236A0724K121q651j0156J900n335N25M778m85P192m013M783p76j1200O068r16
$$ 10724 12845 4194 -5962 -4062 -9397 -8872 -4094 -4579 2613 -1400 3383 2607 -8593 -2525 -3441
9221c441P960m224n043O424R471j2641J923K346N214j889j2111L919R680J4540
$$ -3441 4519 295 -4748 1676 11147 -1494 429 2775 7989 6100 -6011 -2092 7588 22128
9207B2128J3007j3798j4565K648m233l139j0451j7831L107K1304L568j2083n778
$$ 22128 35135 21337 6772 9420 5187 2048 -8403 -26234 -23127 -1823 1745 -10338 -16116
9194a6116M500J6617O883m813j5892K530J0254O265n373q357r435l385J5212J703
$$ -16116 -11616 5001 11884 7071 -8821 -6291 3963 10228 4855 -3502 -12937 -16322 -1110 593
9180E93K49r298J1858M685R895j5006j3545j0308m508N814m842J4791O988n183
$$ 593 842 -8456 3402 8087 17982 2976 -10569 -20877 -25385 -19571 -24413 -9622 -2634 -7817
9166g817J2144M533m690p723m792k92J1015M392Q17m512o544k538l32K3087n25
$$ -7817 4327 8860 4170 -3553 -8345 -8637 2378 6770 7587 3075 -3469 -6007 -6339 16748 16223
9151A6223R340k996j8171l954L449m702l274n241j4502q878P920J4125J2695k86
$$ 16223 25563 22567 4396 442 3891 -811 -4085 -9326 -23828 -32706 -24786 -10661 2034 1748
9137A748j1381m800J4013j3193n971O795J490J5481J992j8806j2428P125Q597
$$ 1748 -9633 -14433 -420 -13613 -19584 -12789 -11299 4182 6174 -12632 -25060 -17935 -9338
9124i338k977M770J3228O693p700o199p454L711M441m57K075M60m02p395j0625
$$ -9338 -12315 -7545 5683 12376 4676 -1523 -8977 -5266 -825 -1282 793 1253 851 -6544 -17169
9109a7169j548J0621j883mK3370K030j0720n27M474q828K657j2390r071P751K754
$$ -17169 -18717 -8096 -9979 -9983 13387 15417 4697 4170 8644 -184 2473 -9917 -18988 -11237 -8483
9094h483M377O00k4177j0641J7865J5466N0O77j0050N945P534k83q042j958l05
$$ -8483 -4106 -3506 -27683 -38324 -20459 -4993 -4943 -4266 -14316 -8371 -837 -1120 -9162 -11120 -11425
9079a1425R027n978n65J317N278J118J1998N808Q078o696l630k630o63M529Q403
$$ -11425 -2398 -8376 -8941 -7624 -2346 -1228 10770 16578 24656 17960 14330 11700 11037 15566 23969
9064B3969j9289j9987L56J4742K916O28q114r225p722J880P17J6747J0203k633
$$ 23969 4680 -15307 -14951 -209 2707 3335 -4779 -14004 -21726 -19846 -19129 -2382 7821 5188
9050E188k43r698j9065k504J3165J8565Q144j511j024r012o46Q318N631j094j2132
$$ 5188 4945 -4753 -23818 -26322 -13157 5408 13552 12041 11017 2005 1359 9677 15308 14214 2082
9035B082r407m91O352o091o697K669R634j0963P294R277K422p940O680j0900Q026
$$ 2082 -7325 -7816 -1464 -7555 -14252 -11583 -1949 -12912 -5618 3659 6081 -1859 4821 -6079 1947
9020A947Q469j3610J250o606j7542P262Q809k641M233k300O29j2996K683J0856
$$ 1947 10416 -3194 -1944 -8550 -26092 -18830 -10021 -12662 -8429 -10729 -10100 -23096 -20413 -9557
9006i557N643k999J0209p052q16L317P874l54m858k184j2229r874K0936J0451
$$ -9557 -3914 -6913 3296 -3756 -4572 -1255 6619 6265 1407 -777 -13006 -22880 -1944 8507
8992H507N600J024P24j673l407o221j5436o30m709Q439J3125N956J926q501j3006
$$ 8507 14107 15131 15855 14182 10775 4554 -10882 -11512 -16221 -7782 5343 11299 13225 4724 -8282
8977h282j4870L545k383J880l761M940O057L258Q392k101R799J2282o160L986
$$ -8282 -23152 -19607 -21990 -20110 -23871 -18931 -12874 -9616 -1224 -3325 6474 18756 12596 16582
8963A6582M727p176j4534l735L955J948L351o219J138J1372P814r810J828j0850
$$ 16582 21309 14133 -401 -4136 -181 1767 5118 -1101 37 11409 19223 9413 11241 391
8949C91k849J482j53o421j6586K558J2529L323l811l925j345J1514J9048j068
$$ 391 -2458 -976 -1129 -7550 -24136 -21578 -9049 -5726 -9537 -13462 -14807 -3293 15755 14687
8935A4687j2187O098K178j773j2720Q18R593J7587N195j1914n752M008r082o922
$$ 14687 2500 8598 10776 9003 -3717 -2899 6694 24281 29476 17562 11810 15818 6736 -186
8921a86p216j2297p86j038J850J3628K121N588Q444r140l939M347K464n827j194
$$ -186 -7402 -19699 -20485 -21523 -19673 -6045 -3924 1664 10108 968 -2971 1376 3840 -1987 -3181
8906c181M905j5814r755J999J4276O576k764j2870O742R725N314L331L731k97
$$ -3181 1724 -14090 -23845 -21846 -7570 -994 -3758 -16628 -9886 -161 5153 8484 12215 11918
8892A1918N932J513L581K590m530r01j995L281k562m464L295n357r438l458J0873
$$ 11918 17850 19363 22944 25534 21004 20103 18108 21389 18827 14363 17658 12301 2863 -595 10278
8877A0278O53K39n232n823k501q86q459K42k506p003j4384m002J0241J2415Q190
$$ 10278 10931 11170 5938 115 -2386 -3272 -11731 -11489 -13995 -20998 -35382 -39384 -29143 -16728 -8538
8862h538J4827J4061J0279j415j4735J0985Q172j3108r710N218Q850j0176j4405
$$ -8538 6289 20350 30629 29214 14479 25464 33636 20528 10818 16036 24886 14710 305
8849C05K879P532p724j867p93Q384K515j859q949j9693k554n22K519M523J1465
$$ 305 3184 10716 2992 1125 332 8716 11231 9372 423 -19270 -21824 -22346 -19827 -15304 -3839
8834c839J3666J2800p150k185K496j288l562L826M186j8733q248O249o320l423
$$ -3839 9827 22627 15477 13292 15788 14500 10938 14764 18950 217 -8031 -1782 -8102 -11525
8820a1525P558o157m108L649k827n290O103M014m139M267N855o106j0121J980
$$ -11525 -3967 -10124 -14232 -10583 -13410 -18700 -12597 -8583 -12722 -8455 -2600 -8706 -18827 -16847
8806a6847J5887N783p515j431J9802P160p166R656J934o329r049p161J0793j672
$$ -16847 -960 4823 -2692 -4123 15679 22839 15673 25329 27263 20934 11885 4724 15517 13845
8792A3845J307p668o774r540J0188Q606o31N084J0064q426r012n33K841o244O969
$$ 13845 15152 7484 710 -8830 1358 9964 9333 14417 24481 16055 7043 6510 9351 3107 10076
8777A0076Q662j3324r815J008j1943J608J4282J2682j439P054Q81j3005L028N681
$$ 10076 18738 5414 -4401 -3393 -15336 -13728 554 13236 11797 18851 19732 6727 9755 15436
8763A5436O236p483m164M39O825M932j1220j3834p796Q584J1287N586r813o257
$$ 15436 21672 14189 10025 10464 17289 22221 11001 -2833 -10629 -2045 9242 14828 5015 -1242
8749a242J469N823O856P700N884j4015o983l130m707r852J1819K590K777J5175
$$ -1242 227 6050 12906 20606 26490 12475 5492 2362 -2345 -12197 -378 2212 4989 20164
8735B0164J5609R379o030o64Q903L65j2842j5930J446O475R41K079R489N560J387
$$ 20164 35773 45152 39122 38458 47361 47726 34884 18954 20400 26875 27816 29895 39384 44944 46331
8720D6331j5452J83J5585K382j4651j9859K592l164l252p706q925K247J8772J4948
$$ 46331 30879 31062 46647 49029 34378 14519 17111 13947 10695 2989 -5936 -3689 15083 30031
8706C0031k440j7663o015J889O924J5132J6543K453o921k3821j7837K620R443
$$ 30031 27591 9928 3913 5802 12726 27858 44401 46854 39933 16112 -1725 895 10338
8693A0338O007M693J5105m367o606n083M212R349k97J671k109n860j663J304N845
$$ 10338 16345 21038 36143 31776 25170 20087 24299 33648 33351 35022 32913 27053 25390 26694 32539
8678C2539N164Q361r596M178J1520j9610j7650m445n46R387Q265j7566n515l371
$$ 32539 37703 46064 36468 40646 52166 32556 14906 10461 9915 19302 27567 10001 4486 1115
8664A115P380l781n687l704J9717N297j3554j0001k358N164p201k827l140J9582
$$ 1115 8495 4714 -973 -4677 15040 20337 6783 -3218 -5576 -412 -7613 -10440 -13580 6002
8650F002K0006M857K663j1040j094K243j1249N841q86j115J059J3702K606n276
$$ 6002 26008 30865 33528 22488 21394 23637 12388 18229 17343 16228 17287 30989 33595 28319
8636B8319O269k573j2207K001J5147K460L563j2856r504r01P741j2829J2432P868
$$ 28319 34588 32015 19808 21809 36956 39416 42979 30123 20619 19718 27459 14630 27062 34930
8622C4930J2702r01o37k857k458m324l941j558r05M512J4283j327l358O286r424
$$ 34930 47632 46731 46094 43237 40779 36455 32514 30956 30051 34563 48846 47519 44161 50447 41023
8607D1023j0158M511q210l15M626M886n251M438j218O086P04m431M543J5273j695
$$ 41023 30865 35376 27166 26851 31477 36363 31112 35550 34332 40418 41122 36691 41234 56507 54812
8592E4812o524p897p7J5006Q998J757R47n827J43p601l150j774j742K29P310k396
$$ 54812 48288 40391 40314 55320 64318 66075 67022 61195 61338 53737 50587 48813 47071 47300 54610 52214
8576E2214q277K829J700J665n555J79n240K988O407m275l500M89j4411r129j1126
$$ 52214 43937 46766 48466 50131 44576 44755 39515 42503 48910 44635 41135 41624 27213 18084 6958
8561F958l763R22p64l234P887Q978J4915k169j3034n367p246R84j184n392j636
$$ 6958 3195 4117 3353 119 8006 16984 31899 29730 16696 11329 4083 5067 3883 -1509 -3145
8546c145P019r869K626J1366m374M444J0861o481Q24m158j4039m59Q252l521K45
$$ -3145 3874 -5995 -3369 7997 3623 8067 18928 12447 13271 9113 -4926 -5385 2867 -654 -409
8531d09L256K312R015M537q986j5353J847l109l230J2349J8229R143P086r554
$$ -409 2847 5159 14174 18711 9725 -5628 -3781 -6890 -10120 2229 20458 29601 36687 27133
8517B7133j3647r524Q702j897p010J1751L383q641m781l005K925p035M675P886
$$ 27133 13486 3962 12664 10767 3757 15508 18891 10250 5469 2464 5389 -1646 3029 10915
8503A0915n181j1972O346j279j1452j93J4642P674n457j219P685O04q117p635
$$ 10915 5734 -6238 108 -1171 -12623 -12816 1826 9500 4043 2824 10509 11113 2996 -4639
8489d639Q127n485l444k879r362K473j204O322M349k076J1319p354n394Q678m730
$$ -4639 3488 -1997 -5441 -8320 -17682 -15209 -16413 -10091 -5742 -7818 3501 -3853 -9247 -569 -5299
8474e299P011J6118l860j6793p942Q851L457P298o20L916j506j6292q418O6K534
$$ -5299 1712 17830 13970 -2823 -10765 -1914 1543 8841 8221 12137 10631 -5661 -14079 -14013 -11479
8459a1479J1478N349p653P845J409n584j10R488P719M288l34N017j2922M39J2774
$$ -11479 -1 5348 -2305 5540 6949 1365 1255 10743 18462 22750 22416 27433 14511 14950 27724
8444B7724j0451j129q965p572n378Q819M057j3642o704k119N828P662p515M388
$$ 27724 17273 16144 7179 -393 -5771 3048 7105 -6537 -13241 -15360 -9532 -1870 -9385 -4997
8430d997L947j0477L389q57M854J6861K049K378l395j639j9175O167P628J1613
$$ -4997 -1050 -11527 -8138 -8995 -4141 12720 14769 17147 13752 12113 -7062 -895 6733 18346
8416A8346N051o244j4220r181j0842J883Q813l922m458P215Q388J3181K991o29
$$ 18346 23397 17153 2933 -6248 -17090 -15207 -6394 -10316 -14774 -7559 829 14010 17001 16372
8402A6372j8912m846K130M138J3555J1422r083o886m197o161O15j0607Q397k643
$$ 16372 -2540 -7386 -5256 -1118 12437 23859 14776 7890 3693 -2468 -1853 -12460 -4063 -6706
8388f706N372J199j0934J961O881p893J0072j248Q331J661o859J0554L245l590
$$ -6706 -1334 -135 -11069 -9108 -2227 -10120 -48 -1296 7035 8696 1837 12391 15636 12046
8374A2046R382M343l673j0587j3069o933o103j180N058J2025P822N485k938j0505
$$ 12046 21428 25771 22098 11511 -1558 -8491 -14594 -15774 -10716 1309 9131 14616 11678 1173
8360A173K69q965P71M804J2510n579k0008m82O012K226o456O958M997o538J800
$$ 1173 1442 -7523 -6752 -1948 10562 4983 -15025 -15507 -9495 -7269 -13725 -6767 -1770 -8308 -6508
8345f508J4095m029m297r182m748k047n452o94J4012K349o119q387n941P363L09
$$ -6508 7587 3558 -739 -9921 -14669 -16716 -22168 -22862 -8850 -6501 -12620 -21007 -26948 -19585 -19276
8330a9276K651M947l653M512K912P26K632J415m407q544p131P611K425O71j359
$$ -19276 -16625 -11678 -15331 -10819 -7907 -7181 -4549 -3134 -7541 -16085 -23216 -15605 -13180 -12509 -13868
8315a3868M811N270O573J382l332j9790j2250O570O758q960Q92K782N000N693
$$ -13868 -9057 -3787 2786 4168 836 -18954 -31204 -24634 -17876 -26836 -25944 -23162 -18162 -12469
8301a2469J8686J6807j3653q577J0084n08m927J497N766o161l478M791m211m480
$$ -12469 6217 23024 9371 794 10878 10370 5443 6940 12706 6545 3067 7858 3647 -833
8287h33k947k313J3468M941j6411j0962J3438R269j0756J0777p128N1P410P254
$$ -833 -3780 -6093 7375 12316 -4095 -15057 -1619 7650 -3106 7671 543 594 8004 15258
8273A5258N590K046j8479j8238L967P440q728J0637J5262O66j4609l44R099O705
$$ 15258 20848 22894 4415 -13823 -9856 -2416 -11144 -507 14755 15421 812 468 9567 16272
8259A6272q122k932L842L082j0240n775k714Q141K336j1437l745J213N533J0183
$$ 16272 8150 5218 9060 12142 1902 -3873 -6587 1554 3890 -7547 -11292 -10079 -4546 5637
8245E637J294o430j6154J209J5386l1J1213Q026O473J570j7522j2780K495M339
$$ 5637 6931 501 -15653 -14444 942 911 12124 20150 26623 28193 10671 -2109 386 4725
8231D725l419L968Q440P02K392L570K549J5728J2650j864o876r944p138N32j210
$$ 4725 1306 5274 13714 14416 16808 20378 22927 38655 51305 49441 42565 32621 25483 26015 24805
8216B4805L638j3265j782r275l551j0086j1223M421J0665Q900K10r578J3959L378
$$ 24805 28443 15178 13396 4121 570 -9516 -20739 -16318 -5653 3247 3457 -6121 7838 11216
8202A1216j5142J546J158p611j157M692O407J804M548N364N30k623M592Q838j763
$$ 11216 -3926 -2380 -1222 -8833 -9990 -5298 1109 2913 7461 12825 13355 10732 15324 24162 22399
8187B2399p096J798N668o785J517q599Q128J864r6R193j0652j5421N55J2503N577
$$ 22399 15303 17101 22769 15984 17501 8902 17030 18894 18798 27991 17339 1918 2473 14976 20553
8172B0553K704j304Q064q527j6049l289J4898K166n644l292q087N219J6703m671
$$ 20553 23257 21953 30017 21490 5441 2152 17050 19216 13572 10280 2193 7412 24115 19444
8158A9444o302l139j3402j4297P372L011J5841J5859J434r052j1819M18O734m13
$$ 19444 13142 10003 -3399 -17696 -10324 -7313 8528 24387 25821 16769 4950 5368 12102 11689
8144A1689k7755k0582J2578J5961j0469p567P459m438k068k127J3309R08L415
$$ 11689 -16066 -36648 -24070 -8109 -18578 -26145 -18686 -23124 -25192 -27319 -14010 -13102 -9687
8131i687L694R230J8822R519j789j121j1314r560p934p762j017R145k851l680
$$ -9687 -5993 3237 22059 31578 29789 28668 17354 7794 -140 -7902 -8919 226 -2625 -6305
8117f305l240L391J8504M446k302j713k651j6574l218J831J556O464m502M244
$$ -6305 -9545 -6154 12350 16796 14494 12781 10130 -6444 -9662 -7831 -6275 189 -4313 -69
8103f9P386K340J835q299q527R006J0757n460k1446j229R225k491R09J936M954
$$ -69 7317 9657 11492 3193 -5334 3672 14429 8969 -12477 -13706 -4481 -6972 -6063 -4127 827
8088H27j1470k330n335Q79l155q520J2556J4927Q403l948m872j2493j956N99L477
$$ 827 -10643 -12973 -18308 -17429 -20584 -29104 -16548 -1621 6782 2834 -2038 -14531 -16487 -15888 -12411
8073a2411L762J8692J019j6508O507K632j612q871j4548p639O936R614K989M299
$$ -12411 -8649 10043 11062 -5446 1061 3693 2081 -6790 -21338 -28977 -22041 -12427 -9438 -5139
8059e139o534l820R212M388J3524J6304M198K266p138j263m27j0857q112L128
$$ -5139 -11673 -15493 -6281 -1893 11631 27935 32133 34399 27261 25998 25571 14714 6602 9730
8045I730j2235J809N254J2473P237k896q488j359p289Q268P134O758o29r602j708
$$ 9730 -2505 -696 4558 17031 24268 21372 12884 11525 4236 12504 19638 26396 25767 16165 14457
8030A4457J730N48l303N882K534N940O952N067Q39j8623j0803J051M25J3337J1417
$$ 14457 16187 16735 13432 19314 21848 27788 34740 39807 40646 22023 11220 12271 12696 26033 37450
8015C7450J55J737q020j9493r371J3980P881M280o575K564P151J1838J3629j960
$$ 37450 37605 39342 31322 11829 2458 16438 24319 28599 22024 24588 31739 43577 57206 55246
8001E5246q120J0805l396n197j842q448P68l40j35k487n750m959O141L767k959
$$ 55246 47126 57931 54535 49338 47496 39048 39816 39476 39341 36854 31104 26145 32286 36053 33094
7986C3094n242L354P817L602J0714K803j117j3946r505K530k168r615R012J7003
$$ 33094 27852 31206 39023 42625 53339 56142 55025 41079 31574 34104 31936 22321 31333 48336
7972D8336K458j2018k094o885J8891J1330M758j5963L043J0953J908K642M105
$$ 48336 50794 38776 36682 29797 48688 60018 64776 48813 51856 62809 64717 67359 71464
7959G1464k536j2718r512k028q386Q406P029L387O673J707k126k359j077j1916
$$ 71464 68928 56210 46698 44670 36284 44690 51719 55106 61779 63486 61360 59001 57924 46008
7945D6008r434P110j1555N83K186j5852R048j905o419P494K962o21m254o563L659
$$ 46008 36574 43684 32129 32712 34898 19046 28094 26189 19770 27264 30226 29605 25351 18788 22447
7930B2447M657m433k641L54k9m634L558k510M140J4989R067R956q327p226O516
$$ 22447 27104 22671 20030 20384 20355 15721 19279 16769 20909 35898 44965 54921 46594 39368 45884
7915D5884K516O7m187m838l046j115n506l066O152L255J10l661J006j2045n407
$$ 45884 48400 48467 44280 39442 36396 35281 29775 26709 32861 36116 36226 32565 33571 21526 16119
7900A6119q87O114M05j946j42n007p737J6649j973J776l918n22K34j5201j3980
$$ 16119 15232 21346 21751 19805 19663 14656 6919 23568 21595 23371 19453 18931 19165 3964 -10016
7885a0016L966j68Q919L529k957Q498N334k191k028k1785n191J7177O256L206
$$ -10016 -6050 -6218 2701 6230 3273 11771 17105 14914 12886 -8899 -14090 3087 9343 12549
7871A2549m805l944L826l840N956N205o163m808J3504L95o613n022l915J53J0286
$$ 12549 7744 3800 7626 3786 9742 14947 8784 3976 17480 17875 11262 6240 2325 2478 12764
7856A2764p983o773l566P698J286l882n559M615n769o493k213Q717L624N997K680
$$ 12764 4781 -1992 -5558 2140 3426 -456 -6015 -1400 -7169 -13662 -15875 -7158 -3534 2463 5143
7841E143j292L639m385K025R086N810j9002j0598K18L668O824J6238O536r494
$$ 5143 3851 7490 3105 5130 14216 20026 1024 -9574 -9356 -5688 1136 17374 23910 14416
7827A4416j4129Q3M857k829j0382M797M099P017n564J430j675l046P688p546j2609
$$ 14416 287 370 5227 2398 -7984 -3187 912 7929 2365 3795 2120 -926 6762 -784 -13393
7812a3393M965O8o02l465j723r40J3833M762j835m95R671P091j6845j2454r969
$$ -13393 -8428 -8360 -8962 -12427 -14150 -15090 -1257 3505 1670 1175 10846 17937 1092 -11362 -21331
7797b1331O899L813N904q734j684j426j903K695M446j1446l304J040R78K051m580
$$ -21331 -14432 -10619 -4715 -13449 -15133 -16559 -18462 -15767 -11321 -22767 -26071 -25031 -24053 -22002 -26582
7782b6582n127J2817K5747K362K044p756j056j832j1763L311J8265P429j8784
$$ -26582 -31709 -18892 6855 9217 11261 3505 2449 617 -11146 -7835 10430 17859 -925
7769i25k946n325j704L22R586o957l090J1774o99N230J555q715j3410q30J9490
$$ -925 -3871 -9196 -10900 -10578 -992 -7949 -11039 735 36 5266 6821 -1894 -15304 -16134 3356
7754C356Q442j2397R06J5719k555q207j4096j639k17J051K4932q20j6093K035
$$ 3356 11798 -599 307 16026 13471 5264 -8832 -10471 -10688 -9637 15295 14475 -1618 417
7740D17J9390J99o312k866q897k723J3547J0876N022j950k2612j3088M381m161
$$ 417 19807 20006 13694 10828 1931 -792 12755 23631 28653 26703 4091 -8997 -4616 -8777
7726h777p68m248J327j908m095j110R585O046L387J15M843Q895L535l835r121
$$ -8777 -9545 -13793 -12466 -14374 -18469 -19579 -9994 -3948 -561 -446 4397 13292 16827 12992 3871
7711C871L04N09j6778l936j5629M356Q242J1336J1097N908N693l643j2606r072
$$ 3871 4175 4684 -12094 -16030 -31659 -27303 -19061 -7725 3372 9280 14973 11330 -1276 -10348
7697a0348j0212m291J7975j84J497M835q532K107J6015q593o056N054q416o878
$$ -10348 -20560 -24851 -6876 -7060 -5563 -728 -9260 -7153 8862 269 -5787 -733 -9149 -16027
7683a6027J295l249o739j010M912J3215j960k996J1431K228j6007l504R316L448
$$ -16027 -14732 -17981 -24720 -25730 -20818 -7603 -9563 -12559 -1128 1100 -14907 -18411 -9095 -5647
7669e647J399L796r231J089P323j782L170J308j3240o350N576O496R49O357K984
$$ -5647 -4248 -452 -9683 -8594 -1271 -3053 117 1425 -11815 -18165 -12589 -6093 -5144 1213 4197
7654D197j0773l416j7065L718J1333p54o411k58q105j786J4616P008K367j0J766
$$ 4197 -6576 -9992 -27057 -23339 -12006 -12760 -19171 -19429 -27534 -29320 -14704 -7696 -5329 -5339 -3573
7639c573n607l804Lk331J4488l73p130l279J3988R61k223q709o081r127O063l608
$$ -3573 -9180 -12984 -12981 -15312 -824 -1197 -8327 -11606 2382 3343 1120 -7589 -13670 -22797 -16734 -20342
7623b0342k1770M577P849l284O603K0298J3648J264m145m062o35k204j0057j2097
$$ -20342 -42112 -37535 -29686 -32970 -26367 -6069 7579 8843 4698 636 1 -2203 -12260 -24357
7609b4357p253p508n519K3923K0354J845N771M629j5182j5083o675O114J906o68
$$ -24357 -31610 -39118 -44637 -20714 -360 1485 7256 11885 -3297 -18380 -25055 -18941 -17035 -17703
7595a7703Q90j0716k562P178K31j1287m608O810J2439R641j0943p928J4803J063
$$ -17703 -16813 -27529 -30091 -22913 -22682 -33969 -38577 -31767 -19328 -9687 -20630 -28558 -13755 -12692
7581a2692m658L471L257r06O742P715K021k293N826J891j5965J890M410N287l337
$$ -12692 -17350 -13879 -10622 -11528 -4786 2929 4950 2657 8483 10374 -5591 -3701 709 5996 2659
7566B659n769k125l267j4434N880k51J3123M875K240R25k215l521l167M314m872
$$ 2659 -3110 -5235 -8502 -22936 -17056 -17307 -4184 691 2931 3856 1641 -1880 -5047 -733 -5605
7551e605N942J1055j242O01J4433M459r901j90j657r326l104O117K974p576j462
$$ -5605 337 11392 10150 10751 25184 29643 19742 19552 17895 8569 5465 11582 14556 6980 5518
7536E518q809q553o322k76J640k848N019q902j680J0625J0026j5666j9378Q156
$$ 5518 -3291 -11844 -18166 -18442 -16802 -19650 -14631 -23533 -25213 -14588 -4562 -20228 -39606 -31450
7522c1450R480j98n31j9036m058J3980M038P572k141K393K555R691R088R204M856
$$ -31450 -21970 -22168 -22699 -41735 -45793 -31813 -27775 -20203 -22344 -19951 -17396 -7705 1383 10587 15443
7507A5443K796l158j1206n82p27j9956J0489J2370J394P091K882L3k969m087j3437
$$ 15443 18239 15081 3875 3293 2566 -17390 -6901 5469 6863 13954 16836 16869 13900 9813 -3624
7492c624r214L890L044M117J630l695j448P465N611N642m371j5494p350Q999j869
$$ -3624 -12838 -8948 -5904 -1787 -157 -3852 -5300 2165 7776 13418 9047 -6447 -13797 -4798 -6667
7477f667P78j0896M314J8021J3162L432j4765j3650j019Q136L724o512J1503j586
$$ -6667 -5889 -16785 -12471 5550 18712 22144 7379 -6271 -7290 846 4570 -1942 9561 7975
7463G975j4394p332j467J1586j4082j0898j699m068J717J254J0726R969Q49Q292
$$ 7975 -6419 -13751 -15218 -3632 -17714 -28612 -30311 -34379 -32662 -31408 -20682 -10713 -9864 -1572
7449a572k11j6406j4868j2987K803R734J5238K814k844n059P352R305J1491q264
$$ -1572 -1783 -18189 -33057 -46044 -43241 -33507 -18269 -15455 -18299 -23358 -16006 -6701 4790 -3474
7435c474j1961N100L710k461L625J3239K82j3711o099O424O538L514P631m716
$$ -3474 -15435 -10335 -6625 -9086 -5461 7778 8060 -5651 -11750 -5326 1212 4726 12357 7641
7421G641q979q29o673j1787k868n198j55K253J3964J136J6920Q597n943J538K921
$$ 7641 -1338 -2167 -8840 -20627 -23495 -28693 -28848 -26595 -12631 -11495 5425 14022 8079 9617 12538
7406A2538j9861l661j305r807j077J6909K937m385q315J052L525L43p786J988
$$ 12538 -7323 -10984 -12289 -22096 -23173 -6264 -3327 -7712 -16027 -14975 -11450 -11107 -18893 -16905
7392a6905P524n645q281O828j662O174P820k855k753J3387J0683m99j5754j0034
$$ -16905 -9381 -15026 -23307 -16479 -18141 -11967 -4147 -7002 -9755 3632 14315 13816 -1938 -11972
7378a1972m664l014l483P99k546n853J74J9838J7504p93r341L530O092L166n113
$$ -11972 -16636 -19650 -23133 -22334 -24880 -30733 -30559 -10721 6783 5990 -3351 179 6271 9437 4324
7363D324o230k076J722j572N91K0039J3048r523j1089j3977J0816p703j0152O566
$$ 4324 -1906 -3982 -2260 -3832 -3241 16798 29846 20323 9234 -4743 6073 -1630 -11782 -5216
7349e216M240L969M422o329k773O515k156n288J949M681m182j2710Q504j745J742
$$ -5216 -976 2993 7415 1086 -1687 4828 2672 -2616 -667 4014 -168 -12878 -4374 -6119 -4377
7334d377J1216q195n625m165O039J0575Q686Q407m882j3915m775j4958n645J1844
$$ -4377 6839 -1356 -6981 -11146 -5107 5468 14154 22561 17679 3764 -1011 -15969 -21614 -9770
7320i770J0130m505R53j1372k905J6972J945N257l011k8193p824J3634P630j5687
$$ -9770 360 -4145 -3192 -14564 -17469 -497 1448 6705 3694 -24499 -32323 -18689 -11059 -26746
7306b6746r143J6028L953n358j465m55J8667P85P51R711J120q332J174L152J0357
$$ -26746 -35889 -19861 -15908 -21266 -22731 -23186 -4519 -3734 -2983 6728 7848 -484 690 3842 14199
7291A4199m9j4742r613o891o015J2374J431l372k600J3464P834M385j920k222
$$ 14199 14150 -592 -10205 -17096 -23111 -10737 -9306 -12678 -15278 -1814 6020 10405 8485 6263
7277F263j5314p166N959J1428J7600o555m187J027m180j1720p689P480Q72j3611
$$ 6263 -9051 -16217 -10258 1170 18770 12215 8028 9055 4875 -6845 -14534 -7054 -6182 -19793
7263a9793L311J2828q755l770J1156N536M852k1900j2603P46J3783P713j3798
$$ -19793 -16482 -3654 -12409 -16179 -5023 513 5365 -16535 -29138 -28392 -14609 -6896 -20694
7250b0694j8668L103R263M377J1877O730O900n848N085o429j5701J437J5935J7506
$$ -20694 -39362 -36259 -26996 -22619 -10742 -4012 2888 -2960 2125 -4304 -20005 -18568 -2633 14873
7236A4873p458R058J873j7777j2023j3730j1077Q173J6255J7221J488J432O521
$$ 14873 7415 16473 18346 569 -11454 -25184 -36261 -28088 -11833 5388 6876 8308 14829
7223A4829K806p915L458n525q033j624K553M21J578j4674J757R432J0927j7025
$$ 14829 17635 9720 13178 7653 -380 -2004 549 970 2548 -12126 -10369 -937 9990 -7035
7209g035j5927p230l282J5702K2074J1584K141l496o650p453O128j0408j3980
$$ -7035 -22962 -30192 -33474 -17772 4302 15886 18027 14531 7881 428 6556 -3852 -17832
7196a7832j3388M469P334J0005P705O038K410j688J5629o80q476o214j124p369
$$ -17832 -31220 -26751 -19417 -9412 -1707 4331 6741 5053 20682 20002 11526 5312 4188 -3181
7182c181j4870R47J7202L688m184L982K016P191o284m702j4255j862r96L502K720
$$ -3181 -18051 -17104 98 3786 -398 3584 5600 12791 6507 1805 -12450 -14312 -15308 -11806 -9086
7167i086K831O306P132q15K401j0511M660p520p390P763M229k81j354l902p289
$$ -9086 -6255 51 7183 6368 8769 -1742 2918 -4602 -11992 -4229 0 -281 -1635 -5537 -12826
7152a2826l201J0311K06j0422j0538j299Q338j957O920m510J5606J3079j1975
$$ -12826 -16027 -5716 -5510 -15932 -26470 -27769 -19431 -21388 -14468 -18978 -3372 9707 -2268
7139b268M410J416j7460j041N089m595n025K367J105P648O734L341n545j6772
$$ -2268 2142 3558 -13902 -14943 -9854 -14449 -19474 -17107 -16002 -8354 -1620 1721 -3824 -20596
7125b0596M045J573M274l038J2705j348j3304r194o790n05J0792J3944Q748k110
$$ -20596 -16551 -14978 -10704 -13742 -1037 -2385 -15689 -24883 -31673 -32178 -21386 -7442 1306 -804
7111h04j1086J1012J7717P01q937j2224n291j3919Q878J2268K555n2l074n179
$$ -804 -11890 -878 16839 17540 8603 -3621 -8912 -22831 -13953 -1685 870 818 -2256 -7435
7097g435L254J1157j0697o923J5183l229m694K5987k189r020J179m214j470j167
$$ -7435 -4181 6976 -3721 -10644 4539 1310 -3384 22603 20414 11394 12573 8359 6889 5722
7083E722q107o227P64m261J856R228K910j3299r352k537J5567J1558J498Q57K278
$$ 5722 -2385 -8612 -7848 -12109 -10253 -1025 1885 -11414 -20766 -23303 -7736 3822 5320 6177 8455
7068H455K673M658p620q931L919J24p628k941L264L578k145Q577M339q919Q214
$$ 8455 11128 15786 8166 -765 3154 3278 -4350 -7291 -4027 -449 -2594 5983 10322 1403 9617
7053I617k812J666k361m125o349M910M680q625n449m621J563j0466j2525L71R805
$$ 9617 6805 8471 6110 1985 -4364 546 5226 -3399 -8848 -13469 -11906 -22372 -34897 -34526 -24721
7038b4721J4099J0387L8l010j2779j22J1706Q843J321r883o040L215K252m977
$$ -24721 -10622 -235 -197 -3207 -15986 -16108 -4402 4441 5762 -4121 -10161 -6946 -4694 -9671
7024i671j3500p326P232O663L482R392p130p42q163Q038Q904Q1l716J1931Q213
$$ -9671 -23171 -30497 -23265 -16602 -13120 -3728 -10858 -11600 -19763 -11725 -2821 -2740 -6456 5475 13688
7009A3688O734L14M806j1112j6229m075o855K887O885L168N442J0440Q486j2216
$$ 13688 20422 20736 25542 14430 -1799 -5874 -12729 -9842 -2957 211 5653 16093 24579 12363
6995A2363j0926o668j577n21j809L004J5763K484j831m283O474k684j2138p189
$$ 12363 1437 -5231 -6808 -7329 -9138 -6134 9629 12113 10282 5999 12473 9789 -2349 -9538
6981i538m313J2082P18m38j437j2828j1783K364L459J8560K682r081K12o92Q81
$$ -9538 -13851 -1769 -1051 -1489 -2926 -15754 -27537 -25173 -21714 -3154 -472 -9553 -9341 -10033 -9152
6966i152j1375p947K197R764J0539m487n92J3251M334j1218k684r815O052N36
$$ -9152 -20527 -28474 -26277 -16513 -5974 -10461 -11053 2198 6532 -4686 -7370 -17185 -11133 -10597
6952a0597l719j427l235O067K544n71J0902m793N45o05j0547O149J1517l507k326
$$ -10597 -14316 -15743 -18978 -12911 -10367 -10938 -36 -4829 -4284 -4889 -15436 -9287 2230 -1277 -3603
6937c603l819J01n771k073J0091k690L724k064J0959l835L48N147J171q011j0577
$$ -3603 -7422 -7321 -13092 -15165 -5074 -7764 -4040 -6104 4855 1020 1368 6515 7686 -325 -10902
6922a0902n802j236l72O747Q760J299j338j1449q273k294M153J3222k465n319
$$ -10902 -16704 -17940 -18312 -11565 -2805 -1506 -2844 -14293 -22566 -24860 -20707 -7485 -9950 -15269
6908a5269o682M741J8950j61k001r65r442K313p352p439J1894P639O922M647Q975
$$ -15269 -21951 -17210 1740 1579 -422 -1387 -10829 -8516 -15868 -23307 -11413 -3774 3148 7795 16770
6893A6770o298j7161j3554Q6P478J996q435r644M849N13P323P711q844m080R909
$$ 16770 10472 -6689 -20243 -20157 -12679 -10683 -19118 -28762 -23913 -23400 -16077 -8366 -17210 -21290 -11381
6878a1381J5044N008j5331j8156J3500K0025J4762O235K629m272o625j0509j1889
$$ -11381 3663 8671 -6660 -24816 -11316 8709 23471 29706 32335 28063 21438 10929 -960
6865i60L859M620M85P13j6725R413l335j1618O65J8025K302k0255p776J3367Q773
$$ -960 2899 7519 8004 8717 -8008 1405 -1930 -13548 -12883 5142 7444 -12811 -20587 -7220 1553
6850A553l701j1419k26J697r293r447l290J0104P862j331J3510P72k476j4756
$$ 1553 -2148 -13567 -13793 -12096 -21389 -30836 -34126 -24022 -16160 -17491 -3981 -3209 -5685 -20441
6836b0441m583L95J5792R357r14n638n482Q181M738j172j406q326K884O04j0166
$$ -20441 -25024 -24629 -8837 520 -394 -6032 -11514 -3333 1405 233 -1173 -9499 -6615 -6011 -16177
6821a6177L636O855n764Q205Q558q227J569J7969L531l985j2567j217k364L661
$$ -16177 -12541 -5686 -11450 -3245 5313 -2914 -1345 16624 20155 16170 3603 2386 22 3683
6807C683k239j2097j896M791k394M96J1273j4175R201J0779r351P56k927L154
$$ 3683 1444 -10653 -12549 -7758 -10152 -9656 1617 -12558 -3357 7422 -1929 -1173 -4100 -946
6793i46J5808Q917j2812n682O853r985r253Q39q33Q153J0710o92j3490r254Q780
$$ -946 14862 23779 10967 5285 12138 2153 -7100 -6261 -7094 1059 11769 11077 -2413 -11667 -2887
6778b887J4493M119N652m993j8910J183j1369p256m725j859J6045O939r70m966
$$ -2887 11606 15725 21377 16384 -2526 -1343 -12712 -19968 -24693 -26552 -10507 -3568 -4538 -9504
6764i504m068J2607N66K721J200j6555j1333L011M357J0519J173P051K729J194
$$ -9504 -13572 -965 -399 2322 3522 -13033 -24366 -21355 -16998 -6479 -5306 1745 4474 5668
6750E668j8217q631J99o24J4443m284n522J662o153r012P237N42L003J0021j880
$$ 5668 -12549 -21180 -20981 -21605 -7162 -11446 -16968 -15306 -21459 -30471 -23234 -22692 -19689 -9668 -11548
6735a1548O321K468J4383q355n869n798j412q191p751M746j5137o725J1172P771
$$ -11548 -5227 -2759 11624 3269 -2600 -8398 -9810 -18001 -25752 -21006 -36143 -42868 -31696 -23925
6721b3925q343Q46o920J3459L1726k13j7202p981o80O475P170O214J643L718P490
$$ -23925 -32268 -31422 -38342 -24883 6843 6630 -10572 -18553 -19233 -12758 -5588 626 2269 5987 13477
6706A3477J072q54o661r402Q31q429j5500M999L125O208Q225M287N164Q389L501
$$ 13477 14549 13695 7034 -2368 -1537 -9966 -25466 -20467 -17342 -11134 -2909 1378 6542 14931 18432
6691A8432j6780k611P931J4969l370k571j0465o149j1677o790J0965J5821J1464
$$ 18432 1652 -959 6972 21941 18571 16000 5535 -614 -12291 -19081 -8116 7705 19169
6678A9169l946p672M975j53m027J733J762J873m066j4808R271N755m723N53O85
$$ 19169 15223 7551 12526 12373 8346 10079 11841 13714 9648 -5160 4111 9866 5143 5696 6381
6663F381k392K847q263N278Q661j2787p474J321R209n589J028k561q109J531M812
$$ 6381 3989 6836 -1427 3851 12512 -275 -7749 -6428 2781 -2808 -1780 -4341 -12450 -10919 -6107
6648f107O06j1164l94J1511J4745N454j8953j844P805P818p903j1227j0795q98
$$ -6107 -5501 -16665 -17059 -5548 9197 14651 -4302 -6146 1659 9477 1574 -9653 -20448 -21346
$$ [...]
##END NTUPLES=NMR SPECTRUM
##END=
