##TITLE=Analysis number 313234
Compound Code cc 43113
Book Reference 447/96
Project Code adrs
Chemist Name bos
##JCAMPDX= 6.0         $$ Bruker NMR JCAMP-DX V2.0
##DATA TYPE= NMR SPECTRUM
##DATA CLASS= NTUPLES
##ORIGIN= Bruker BioSpin GmbH
##OWNER= NMR
$$ XWIN-NMR		Version 3.5
$$ Tue Aug 30 11:23:10 2005 GMT Daylight Time (UT+1h)  MAYBRIDGE\NMR@NMR_250MHZ
##.OBSERVE FREQUENCY= 250.131544655141
##.OBSERVE NUCLEUS= ^1H
##.ACQUISITION MODE= SIMULTANEOUS (DQD)
##.ACQUISITION SCHEME= undefined
##.AVERAGES= 16
##.DIGITISER RES= 18
##SPECTROMETER/DATA SYSTEM= dpx250
##.PULSE SEQUENCE= zg30
##.SOLVENT NAME= CDCl3
##.SHIFT REFERENCE= (INTERNAL, CDCl3, 0, 16.4683)
##AUDIT TRAIL= $$ (NUMBER, WHEN, WHO, WHERE, WHAT)
$$ ##TITLE= Audit trail, XWIN-NMR		Version 3.5
$$ ##JCAMPDX= 5.01
$$ ##ORIGIN= Bruker BioSpin GmbH
$$ ##OWNER= NMR
$$ C:\u/data/dgb/nmr/ADRS/8750/pdata/1/auditp.txt
$$ ##AUDIT TRAIL=  $$ (NUMBER, WHEN, WHO, WHERE, WHAT)
(   1,<2005-08-30 11:22:51.21 +100>,<MAYBRIDGE\NMR>,<NMR_250MHZ>,
      <created by zg, POWCHK disabled, PULCHK disabled
       configuration hash MD5:
       62 19 C7 07 E1 42 D1 B7 37 6C 3D D0 77 39 F9 E6
       data hash MD5: 64K
       81 6E 08 6F 50 8F FB C5 E7 FA 52 52 73 7A 8F 1E>)
(   2,<2005-08-30 11:23:01.75 +100>,<MAYBRIDGE\NMR>,<NMR_250MHZ>,
      <Start of raw data processing
       ef LB = 0.3 FT_mod = 6 PKNL = 1 SI = 32K 
       data hash MD5: 32K
       EA 3F 3B 2B 37 20 87 0A 9C 83 6C C3 B5 78 F6 88>)
(   3,<2005-08-30 11:23:03.55 +100>,<MAYBRIDGE\NMR>,<NMR_250MHZ>,
      <apk 
       data hash MD5: 32K
       CC 72 45 90 53 F6 E4 8C 9B 53 13 69 C7 36 DB C3>)
(   4,<2005-08-30 11:23:04.21 +100>,<MAYBRIDGE\NMR>,<NMR_250MHZ>,
      <abs ABSG = 5 
       data hash MD5: 32K
       EE 22 DE F8 23 70 28 51 4A A3 E9 37 CB 5E 16 81>)
$$ ##END=
$$ 
$$ hash MD5
$$ 72 91 80 3A E8 BF 82 CB 86 46 CE 26 95 44 0B 81
##$RELAX= 
##$RELAX= 
##$RELAX= 
##$RELAX= 
##$RELAX= 
##$RELAX= 
##$RELAX= 
$$ Bruker specific parameters
$$ --------------------------
##$DU= <C:\u>
##$EXPNO= 8750
##$NAME= <ADRS>
##$PROCNO= 1
##$TYPE= <nmr>
##$USER= <dgb>
##$AMP= (0..31)
100 100 100 100 100 100 100 100 100 100 100 100 100 100 100 100 100 100 
100 100 100 100 100 100 100 100 100 100 100 100 100 100 
##$AQSEQ= 0
##$AQ_mod= 3
##$AUNM= <au_zg>
##$AUTOPOS= <13 >
##$BF1= 250.13
##$BF2= 250.13
##$BF3= 250.13
##$BF4= 250.13
##$BF5= 500.13
##$BF6= 500.13
##$BF7= 500.13
##$BF8= 500.13
##$BYTORDA= 1
##$CFDGTYP= 0
##$CFRGTYP= 5
##$CHEMSTR= <none>
##$CNST= (0..31)
1 1 145 1 1 1 1 1 1 1 1 1 1 1 1 1 1 1 1 1 1 1 1 1 1 1 1 1 1 1 1 1 
##$CPDPRG= <>
##$CPDPRG1= <>
##$CPDPRG2= <>
##$CPDPRG3= <>
##$CPDPRG4= <mlev>
##$CPDPRG5= <mlev>
##$CPDPRG6= <mlev>
##$CPDPRG7= <mlev>
##$CPDPRG8= <mlev>
##$CPDPRGB= <>
##$CPDPRGT= <>
##$D= (0..31)
0 1 0 0 0 0 0 0 0 0.06 0 0 0 0 0 0 0.0002 0 0 0 0 0 0 0 0 0 0 0 0 0 0 
0 
##$DATE= 1125397370
##$DBL= (0..7)
120 120 120 120 120 120 120 120 
##$DBP= (0..7)
150 150 150 150 150 150 150 150 
##$DBP07= 0
##$DBPNAM0= <>
##$DBPNAM1= <>
$$ [...]
##$SUBNAM7= <"">
##$SUBNAM8= <"">
##$SUBNAM9= <"">
##$SW= 20.6930455092707
##$SWIBOX= (0..15)
0 0 3 0 0 0 0 0 0 0 0 0 0 0 0 0 
##$SW_h= 5175.983436853
##$TD= 65536
##$TD0= 1
##$TE= 295.16
##$TE2= 300
##$TE3= 300
##$TEG= 300
##$TL= (0..7)
0 120 120 120 120 120 120 120 
##$TP= (0..7)
150 150 150 150 150 150 150 150 
##$TP07= 0
##$TPNAME0= <>
##$TPNAME1= <>
##$TPNAME2= <>
##$TPNAME3= <>
##$TPNAME4= <>
##$TPNAME5= <>
##$TPNAME6= <>
##$TPNAME7= <>
##$TPOAL= (0..7)
0.5 0.5 0.5 0.5 0.5 0.5 0.5 0.5 
##$TPOFFS= (0..7)
0 0 0 0 0 0 0 0 
##$TUNHIN= 0
##$TUNHOUT= 0
##$TUNXOUT= 0
##$USERA1= <user>
##$USERA2= <user>
##$USERA3= <user>
##$USERA4= <user>
##$USERA5= <user>
##$V9= 5
##$VALIST= <valist>
##$VCLIST= <CCCCCCCCCCCCCCC>
##$VD= 0
##$VDLIST= <DDDDDDDDDDDDDDD>
##$VPLIST= <PPPPPPPPPPPPPPP>
##$VTLIST= <TTTTTTTTTTTTTTT>
##$WBST= 1024
##$WBSW= 4
##$XGAIN= (0..3)
0 0 0 0 
##$XL= 0
##$YL= 0
##$YMAX_a= 476707
##$YMIN_a= -682637
##$ZGOPTNS= <>
##$ZL1= 120
##$ZL2= 120
##$ZL3= 120
##$ZL4= 120
##$ABSF1= 16.46835
##$ABSF2= -4.224823
##$ABSG= 5
##$ABSL= 3
##$ALPHA= 0
##$AQORDER= 0
##$ASSFAC= 0
##$ASSFACI= 0
##$ASSFACX= 0
##$ASSWID= 0
##$AUNMP= <proc_1d>
##$AZFE= 0.1
##$AZFW= 0.1
##$BCFW= 0
##$BC_mod= 0
##$BYTORDP= 0
##$COROFFS= 0
##$CY= 12.5
##$DATMOD= 1
##$DC= 0
##$DFILT= <>
##$DTYPP= 0
##$F1P= 14.0000005364418
##$F2P= -0.99999901652339
##$FCOR= 0.5
##$FTSIZE= 32768
##$FT_mod= 6
##$GAMMA= 0
##$GB= 0
##$INTBC= 1
##$INTSCL= 1
##$ISEN= 128
##$LB= 0.3
##$LEV0= 0
##$LPBIN= 0
##$MAXI= 10000
##$MC2= 0
##$MEAN= 0
##$ME_mod= 0
##$MI= 0
##$NCOEF= 0
##$NC_proc= -4
##$NLEV= 6
##$NOISF1= 0
##$NOISF2= 0
##$NSP= 0
##$NTH_PI= 0
##$NZP= 0
##$OFFSET= 16.46835
##$PC= 1
##$PHC0= -83.10734
##$PHC1= 7.063104
##$PH_mod= 1
##$PKNL= yes
##$PPARMOD= 0
##$PSCAL= 4
##$PSIGN= 0
##$REVERSE= no
##$SF= 250.130013417256
##$SI= 32768
##$SIGF1= 0
##$SIGF2= 0
##$SINO= 400
##$SIOLD= 32768
##$SREGLST= <1H.CDCl3>
##$SSB= 0
##$STSI= 32768
##$STSR= 0
##$SW_p= 5175.98343685301
##$SYMM= 0
##$S_DEV= 0
##$TDeff= 65536
##$TDoff= 0
##$TI= <Analysis number 999999
Compound Code 99
Book Reference 9
Project Code 9>
##$TILT= no
##$TM1= 0
##$TM2= 0
##$TOPLEV= 0
##$USERP1= <user>
##$USERP2= <user>
##$USERP3= <user>
##$USERP4= <user>
##$USERP5= <user>
##$WDW= 1
##$XDIM= 32768
##$YMAX_p= 452926665
##$YMIN_p= -261071
$$ End of Bruker specific parameters
$$ ---------------------------------
##NTUPLES= NMR SPECTRUM
##VAR_NAME=  FREQUENCY,     SPECTRUM/REAL,   SPECTRUM/IMAG
##SYMBOL=    X,             R,               I
##VAR_TYPE=  INDEPENDENT,   DEPENDENT,       DEPENDENT
##VAR_FORM=  AFFN,          ASDF,            ASDF
##VAR_DIM=   32768,         32768,           32768
##UNITS=     HZ,            ARBITRARY UNITS, ARBITRARY UNITS
##FACTOR=    0.157963299565203, 1,           1
##FIRST=     4119.22847058622, 0,            0
##LAST=      -1056.75496626679, 0,           0
##MIN=       -1056.75496626679, -261071,     0
##MAX=       4119.22847058622, 452926665,    0
$$ Real data points
##PAGE= N=1
##DATA TABLE= (X++(R..R)), XYDATA
$$ [...]
18212G0340L071J9736J9229j1964j9999J7939L382J2394m283o134J2800K108k2182
18199I6437k3895M858L2669K4698J8787k2780r384q856q490j2024J7731J430M3679
18186A54860r011k0988l344q507J3975k206m016K4184L4172L5758j2745j7283
18174A84849M565k4134l621Q938J7017J5359J3949P603j124L18K0490J640m115
18161B41734j1371k3565j0884J7971J1211J1582l710q888M0415r008k031J5008
18149B68464J5687o916R234K2386K1953L5072J3061K1045M0807q547j6139K6671
18137D42778M3769M5870N1624K5865M7167K0444L0519L0810L8166O1505J08725
18126I47242Q7692Q5347J27877J66571J83954J77687K23034L17210L92870M96629
$$ y = [70340, 73411, 93147, 112376, 100412, 80413, 98352, 101734, 114128, 109845, 103711, 116511, 118619, 96437, 72542, 77400, 110069, 134767, 153554, 130774, 121390, 112534, 104044, 92020, 109751, 111181, 154860, 145849, 124861, 121517, 113010, 126985, 124779, 120763, 144947, 179119, 214877, 202132, 184849, 189414, 165280, 161659, 170597, 187614, 202973, 216922, 224525, 223401, 223719, 244209, 245849, 241734, 230363, 206798, 195914, 213885, 225096, 236678, 232968, 224080, 264495, 255487, 253456, 268464, 284151, 277235, 286469, 308855, 330808, 365880, 378941, 399986, 440793, 432246, 416107, 442778, 486547, 532417, 584041, 609906, 657073, 677517, 708036, 738846, 777012, 838517, 947242, 1034934, 1120281, 1248158, 1414729, 1598683, 1776370, 1999404, 2316614, 2709484, 3206113]
18116C206113O81023Q57994J113376J543458K328566L937113P105910J1503762
18108C2277315J0910148K174077l428499r479755j1006539p444077m662459l101242
18100F238969j971349j255697q14527n41285l65035k66641k06461j59839j07556
18091E50579q2238p6596o4191l9986m4576l5111k599k3793k4924k1645R557j765
18079A42712k4685q374j832K0474j0331k9044l9364j2568m079k3036m382J465
18067F956O1927K6664J3363l8243o355K4485P246k0015m566K9415N976M047k8898
18054H2002j7629J6654P397J736j5264K8988p005k0016j2340J7954N745k7874
18042F0348j9294j7870k679J582K1129L0755j1279j7485j7575k2246Q041r894
$$ y = [3206113, 3887136, 4745130, 5858506, 7401964, 9730530, 13667643, 20773553, 32277315, 43187463, 45361540, 41933041, 32453286, 21446747, 14002670, 9340211, 6238969, 4267620, 3011923, 2197396, 1656111, 1291076, 1024435, 817974, 658135, 550579, 468341, 391745, 327554, 287568, 242992, 207881, 205282, 181489, 156565, 134920, 144477, 142712, 118027, 109653, 107821, 128295, 117964, 88920, 49556, 36988, 32909, 9873, 5491, 6956, 68883, 95547, 108910, 70667, 64312, 88797, 96043, 76028, 71462, 100877, 106853, 110900, 82002, 64373, 81027, 88424, 90160, 74896, 103884, 96879, 76863, 64523, 82477, 88222, 60348, 41054, 23184, 20505, 22087, 43216, 73971, 62692, 45207, 27632, 5386, 13427, 3533]
18030C533p352M198J7868k362n139L3669J9576r061J9748j1612j9712K4083K2116
18017H9553O860k0877m791j1470k7222k0057l746l357J2813K0710O606P108Q031
18004F0161J1050j9093j0864K7665j56k4305P115J4259q834j7293k6145K9017
17992D2577J4578Q513J1263l717j8110j1681J2362K3744M2561J5549k0971j9956
17980I6712k1601l1483J6617M855o594j3721L189K435o682J8592J1562R15k0835
17967E3961j0991o320n284q111k1522J5693O688O635R457K6563m026N171J9011
17954H6925o290j8747j8402K4603j2048k7304j8211L015M871K832O683j600J3458
17941C9785J0234J0439R448k3855m9843n95K5932J3323j6782P68Q429J5877L2393
$$ y = [3533, -3819, 379, 18247, 15885, 10746, 44415, 63991, 54930, 74678, 63066, 43354, 67437, 89553, 96413, 75536, 70745, 59275, 32053, 11996, 8250, 4893, 17706, 38416, 45022, 52130, 60161, 71211, 52118, 41254, 68919, 68763, 44458, 51573, 65832, 56998, 39705, 13560, 42577, 57155, 65668, 76931, 73214, 55104, 43423, 55785, 79529, 122090, 137639, 116668, 96712, 75111, 43628, 60245, 65100, 58506, 44785, 47974, 50409, 43727, 62319, 73881, 74796, 53961, 42970, 36650, 31366, 23255, 1733, 17426, 24114, 30749, 40206, 66769, 62743, 67914, 86925, 80635, 61888, 43486, 68089, 56041, 28737, 10526, 13541, 18412, 21244, 27927, 26327, 39785, 50019, 60458, 69906, 46051, -3792, -4387, 21545, 34868, 18086, 18854, 27283, 43160, 75553]
17928G5553q911k3047K3983r915j1899j4940k4492j0626k201k8503j5960K6038
17916b4920J4707P852M5251J8186k4077L90Q797O986M82K3741J8249j9161j9684
17903E6799o571j5845j6333K4063K5592O334j925N283N360J3350Q966J0946k701
17890A13318L659j4323j8498k0597j2242j8577m804J6427j1411J4897K6237j2660
17878F1426J013M863R527r627N472N672j868k2236j6080J6785J9598J3684K3907
17865A12136J0228j1422j8211J709J1752M014q914J446j7263j9100n021j3895
17853D7459j9013J7303J0047j6333j3958l857J6947O971j1077n095J2408J520
17841D3322R05R15J149L0879j3240j4483j443J2852L0772K2607j4625m071J0520
$$ y = [75553, 66642, 43595, 67578, 57663, 45764, 30824, 6332, -4294, -6495, -34998, -50958, -24920, -10213, -2361, 42890, 61076, 36999, 37389, 46186, 53172, 53654, 77395, 95644, 76483, 56799, 50228, 34383, 18050, 42113, 67705, 74039, 72114, 77397, 82757, 96107, 105073, 116019, 113318, 116977, 102654, 84156, 63559, 51317, 32740, 27936, 44363, 32952, 47849, 74086, 61426, 62439, 67302, 76829, 67202, 72674, 78346, 76478, 54242, 38162, 54947, 74545, 88229, 112136, 122364, 110942, 92731, 94440, 106192, 110206, 101292, 102738, 85475, 66375, 61354, 47459, 28446, 45749, 55796, 39463, 25505, 21648, 38595, 45566, 34489, 29394, 41802, 43322, 44227, 45142, 46291, 77170, 63930, 49447, 48004, 60856, 91628, 114235, 99610, 95539, 106059]
17828A06059m8187l3746O649K2886J5453K7761Q068J3100N849P2K1273O739j3
17815A51963J2410j4450j8821J1566r98o512j8559m037j5100k0338J5051K387
17803I4562j106j1974j1035j6594l286L1608J6314J8423j4310k1115l36p10J1379
17790I1820q58K7480P699J0299O550l2371J1980l397j2201j969q220j3636N48
17777H3724M06K1912m973j8272Q33L477k873N056m367M822R008K4264M687j8431
17763A09273o007n94Q534P528j6980K4547p711k0854k250K6038r395M931o81J3916
17749A30295J9012J1216j8666j6101J0522L2597j4733k4159J2971j5651k4396
17738A02907J036K2804j4336m187j2026L470j2576K4786K0588o940J4143J8122
$$ y = [106059, 57872, 24126, 30775, 53661, 69114, 96875, 104943, 118043, 123892, 123964, 145237, 151976, 151963, 164373, 149923, 131102, 142668, 141670, 135158, 116599, 112562, 97462, 77124, 92175, 94562, 93456, 81482, 70447, 53853, 50567, 82175, 98489, 116912, 102602, 81487, 81151, 80441, 91820, 90962, 118442, 126141, 136440, 142990, 110619, 122599, 119202, 107001, 105032, 96812, 83176, 83724, 84130, 106042, 101069, 82797, 83630, 87107, 84234, 89290, 84923, 89745, 98753, 123017, 127704, 109273, 103266, 102672, 111206, 118734, 101754, 126301, 118590, 97736, 95486, 121524, 112129, 117060, 116379, 130295, 149307, 160523, 141857, 125756, 136278, 168875, 154142, 129983, 142954, 127303, 102907, 103943, 126747, 112411, 108224, 96198, 99668, 87092, 111878, 132466, 125526, 139669, 157791]
17726A57791l6967K712O358k2002n463J9668L3333k738l1272k6372k0865K1695
17714I5878K186K6192J1115J558K90j2693l077K2443K3374J4670j859K270P38
17701A83085o185q333j6773Q218q607n14J4215L595J9642K478k7076J917J5534
17688A81196n450L144L875j7965J4405o516p266k2830K0318M8479N2381j5518
17676B48253j6971j0533k9660J2702J9914N033J228O905l841j1543N247J5211
17664B41945J2627J6624L0082p217r016O156N41j4949J2914J7593L3665j1425
17652C29540J5679j6630O766K3396q777l7405k1928k519n5603L935J6142R29j1815
17639B41710o596R735j8369m048J9660K4162r175j8536J5068K9131K893k208l3824
$$ y = [157791, 120824, 123536, 129894, 107892, 102429, 122097, 155430, 152692, 121420, 95048, 74183, 95878, 98064, 124256, 135371, 136929, 137219, 124526, 121449, 143892, 167266, 181936, 180077, 182347, 183085, 176900, 168567, 151794, 160012, 151405, 150891, 165106, 168701, 188343, 190821, 163745, 165662, 181196, 175746, 178890, 182765, 164800, 179205, 172689, 165423, 142593, 162911, 211390, 263771, 248253, 231282, 220749, 191089, 203791, 223705, 228738, 229966, 236871, 233030, 221487, 226734, 241945, 254572, 271196, 301278, 294061, 285045, 291201, 291742, 276793, 289707, 307300, 340965, 329540, 345219, 328589, 335355, 358751, 349974, 312569, 290641, 288122, 232519, 236454, 252596, 253525, 241710, 235114, 244849, 226480, 222432, 242092, 266254, 257079, 238543, 253611, 282742, 285635, 283427, 249603]
17626B49603j631K2652P280j1822J2512N11n943J9286J462J3567L487L373m49
17613C13888j6046r240M05l891j1046j733M74J5770J9257K7949L1539K1874L1708
17600D20908N9183M3529M8492K1912M8872M5700L743K2370L1706K5065L1655K1237
17588H24372L752J0784r371K139J1487J2975N705j1879J9055L3962R044k0640
17576H91385n0373R734K416j189l0620l0975l7035k2793l7190l5916k0766j4945
17564F21733j4510k6963o711K65o311k2143k459k2496J082q425l2838l4858j8179
17551D27187l2283j7560m1113n2410j8008k2503O502K583J0557J7674r401k5680
17539B45545n108J2964R061J2842m057J1812J0618m3622k1010o989Q877J9600
$$ y = [249603, 247972, 270624, 277904, 266082, 278594, 279105, 273162, 292448, 293910, 307477, 310964, 314337, 313888, 297842, 288602, 289007, 285116, 274070, 272337, 272811, 288581, 307838, 335787, 367326, 389200, 420908, 480091, 523620, 572112, 594024, 642896, 688596, 692339, 714709, 746415, 771480, 803135, 824372, 828124, 838908, 829537, 831676, 843163, 856138, 861843, 849964, 869019, 902981, 912025, 891385, 841012, 850746, 853162, 851973, 821353, 790378, 753343, 730550, 693360, 657444, 636678, 621733, 607223, 580260, 573549, 573814, 567503, 545360, 542901, 520405, 521487, 513062, 480224, 445366, 427187, 394904, 377344, 336231, 283821, 265813, 243310, 249812, 252395, 262952, 280626, 271225, 245545, 240437, 253401, 262462, 275304, 271247, 283059, 293677, 250055, 229045, 222056, 230933, 250533]
17527B50533r054j6483J092L2866j1370k3349J3706K8580R330k5144j9583m373
17515B26751R885K8872j2749k5459o275l6156j002K5268J2049r735o687L876J3042
17502B21680J17M251J583J2251L2881j5684R907O683O051p903k828J6262K4672
17489C09923N025j4325k0204R272m638N41r380j8002O03j554K3281J9752Q005
17476C08299k2261j2716o798K0840K7368K3859o479j9576K513j754j2981q951
17464B91363K6501n984O133L84Q495O048o935J8143j6960k6022P437O902Q558
17451C24063K1929l2142k0785L5007j1726j5930o348K5986P3962P1544O2932q575
17439E19917k1247k6680p7466n9547L631P009r08q38L297r149J4336j8453k4264
$$ y = [250533, 241479, 224996, 226088, 258954, 247584, 224235, 237941, 266521, 275851, 250707, 231124, 226751, 236636, 265508, 252759, 227300, 221025, 184869, 183867, 209135, 221184, 211449, 204762, 208638, 221680, 221797, 226048, 227631, 239882, 272763, 257079, 266986, 273669, 279720, 271817, 268989, 285251, 309923, 314948, 300623, 280419, 289691, 285053, 285594, 276214, 258212, 258815, 257261, 280542, 300294, 308299, 286038, 273322, 266524, 287364, 314732, 338591, 332112, 312536, 315049, 313295, 300314, 291363, 317864, 311880, 318013, 318397, 326892, 332940, 326005, 344148, 327188, 301166, 308603, 315505, 324063, 345992, 313850, 293065, 328072, 316346, 300416, 294068, 320054, 394016, 465560, 528492, 519917, 498670, 471990, 394524, 334977, 338608, 345617, 344709, 343871, 347168, 338019, 352355, 333902, 309638]
17426C09638j2336R780M2101L6766j2361P994j6154L632J7307J2221R345j4744
17414C93189j7546r804p434R408j1868o746n385J0619J9010q815L673K4241K0214
17401D12756l338j3213n294J3985l0576j0270K1612J4644J0911M5098L7654n385
17389D88584j6851m668Q418K1934J8832M896k1060K481M0606K5804o950j3596
17377E48430r434j7552K9990J6699J4435J1500m994r845j852p334j8010k2639
17365E29394Q653j0656J3157j0171j5503N901j3416l5702J352J1780r255O811
17353D82345L5756J2534P52J0413J5012l684k3911L497K4729Q396L1729N665J5341
17340F18574K8292K5126J4071n243J7538J3062R416J922J8561l3415p01r341l5577
$$ y = [309638, 297302, 307082, 349183, 385949, 373588, 381582, 365428, 369060, 386367, 398588, 407933, 393189, 375643, 365839, 358405, 367813, 355945, 349199, 343814, 354433, 373443, 364628, 368301, 392542, 412756, 409418, 396205, 390911, 404896, 374320, 364050, 385662, 400306, 411217, 456315, 493969, 488584, 471733, 467065, 475483, 497417, 516249, 521145, 500085, 502566, 543172, 568976, 562026, 548430, 538996, 521444, 551434, 568133, 582568, 594068, 589074, 579229, 577377, 570043, 552033, 529394, 538047, 527391, 540548, 530377, 514874, 520775, 507359, 471657, 473009, 484789, 475534, 482345, 518101, 530635, 531387, 541800, 556812, 553128, 529217, 532714, 557443, 565839, 597568, 603233, 618574, 646866, 671992, 686063, 680820, 698358, 711420, 720836, 722758, 741319, 707904, 707203, 697862, 662285]
17327F62285l5158j6619K246Q456r8L333K8120n185m2079j1796K1723K6901K509
17314F44638J4187O87l539J1960Q384j481M793K0775J1829L844J1538m797K5698
17301G48516p900k0515J070j1394o537l532q155j5605R331Q04j0417r351j1117
17288F55198k5917J8034J4193J7419J5912K6930K9314L3418N3701M8292N0227
17277I36721N7639Q6806Q5844P0096O3496M1134M041o526k344p078j6443l5030
17265A278356j9469j1329k3667r033l4478j7209k8756r966l7022j7936J148r877
17253A060762j3778j2396j0543L3333M5806J4602j3108J5855M2514K8396j6040
17242A175403m299J5335K7236j3572k2252k537j4033K512P777J3721L0472n294
$$ y = [662285, 627127, 610508, 612754, 621210, 621112, 624445, 652565, 647380, 605301, 593505, 615228, 642129, 644638, 658825, 659512, 655973, 667933, 676317, 674836, 679629, 700404, 712233, 716077, 727615, 722818, 748516, 740616, 720101, 721171, 709777, 703240, 699708, 691553, 675948, 685279, 686083, 675666, 666315, 655198, 629281, 647315, 661508, 678927, 694839, 721769, 751083, 784501, 838202, 886494, 936721, 994360, 1081166, 1167010, 1237106, 1300602, 1341736, 1345777, 1339251, 1336907, 1329829, 1313386, 1278356, 1258887, 1247558, 1223891, 1214858, 1180380, 1163171, 1134415, 1124449, 1087427, 1069491, 1070639, 1060762, 1046984, 1034588, 1024045, 1057378, 1103184, 1117786, 1104678, 1120533, 1163047, 1191443, 1175403, 1171104, 1186439, 1213675, 1200103, 1177851, 1175314, 1161281, 1163793, 1171570, 1185291, 1215763, 1210469]
17230A210469k3677m596L6769M1231J9791j8071N958Q552L185L6386J3311J4557
17218A343865L1832M3984M1393M7922K5979K7449L4997N0222M6861K0269M1629
17207A756402M4718L5911K4685m042m970J3351J3309j5091l5677j439J4022K649
17195A843828K0609K3296J2193n382P314N4845L8611K4725J4469K7296L3545L9011
17183B134360L1371L5725L2958L8582Q7403P5170R1010R9081R4131J05746J85860
17172C011397K53831K77430L42438L10968K32542J41274J3398n8483j1496N1595
17162D564894J04026J33976P0430m0977j39041k29270k59417k61798k32167j62538
17152C548118j25127o8416n5388k8377l455J7948K5086j427M2016P9519Q1707
$$ y = [1210469, 1186792, 1182196, 1218965, 1260196, 1279987, 1261916, 1267874, 1276426, 1279611, 1315997, 1329308, 1343865, 1375697, 1419681, 1461074, 1508996, 1534975, 1562424, 1597421, 1647643, 1694504, 1714773, 1756402, 1801120, 1837031, 1861716, 1857674, 1852704, 1866055, 1879364, 1864273, 1828596, 1827157, 1841179, 1843828, 1864437, 1887733, 1899926, 1894544, 1901858, 1956703, 1995314, 2020039, 2034508, 2061804, 2095349, 2134360, 2165731, 2201456, 2234414, 2272996, 2360399, 2435569, 2526579, 2625660, 2719791, 2825537, 3011397, 3265228, 3542658, 3885096, 4196064, 4428606, 4569880, 4583278, 4524795, 4513299, 4564894, 4668920, 4802896, 4873326, 4832349, 4693308, 4464038, 4204621, 3942823, 3710656, 3548118, 3422991, 3354575, 3299187, 3270810, 3267355, 3285303, 3310389, 3308962, 3350978, 3430497, 3512204]
17141C512204J11976J83307K44867K75261L49035L21336K30851J19978L9455J0243
17131E398513Q3683J79686K55733L23549K45827J76977R2327L7801J3671K7362
17121F835129J7346L2485M5187P6294J60036K02481K50234K65195K10824J71752
17111H266963J39846J50374J73484K42971L64055N09995O40723P18076Q29109
17102A2035596R77766J126584J319001J594022J917521K229645K645340L243739
17094B7089214M123187N521441P620550J0767122J4926297J9118668K1194058
17087A10360537K0421885J9377369K0060220K0295028J5626795O042607l515233
17080B08669208j0500256j3900546j5298136j6525669j7306987j6877334j5269821
$$ y = [3512204, 3624180, 3807487, 4052354, 4327615, 4676650, 4997986, 5228837, 5348815, 5388270, 5398513, 5482196, 5661882, 5917615, 6241164, 6486991, 6663968, 6756295, 6794096, 6807767, 6835129, 6852475, 6884960, 6930147, 7006441, 7166477, 7368958, 7619192, 7884387, 8095211, 8266963, 8406809, 8557183, 8730667, 8973638, 9337693, 9847688, 10488411, 11206487, 12035596, 13013362, 14139946, 15458947, 17052969, 18970490, 21200135, 23845475, 27089214, 31212401, 36733842, 44354392, 55121514, 70047811, 89166479, 110360537, 130782422, 150159791, 170220011, 190515039, 206141834, 212184441, 208669208, 198168952, 184268406, 168970270, 152444601, 135137614, 118260280, 102990459]
17073A02990459j3390023j1712995j0066289q313269o949592o275529n940444
17066D0342318n423210m404094l036425j602412r0399J573355L370805N051386
17058C5781324N942097O162826O439573O297748M553730J885446k95997j966836
17050F4799911k886698l403815l702799l537794l150312l261977l729764m258578
17042C6868174m726797m827467m602523m346778l859369l061483k240762j583925
17034G619070j150173q60138o52347m91191l96098l16401k59841k29773j81970
17025C081138j63908j39858j07444q3364n5883k7160N77K2164P2408O8647R9323
17014B766640J66366J87854K25327K58342K91418L54423L67894L06800K98765
$$ y = [102990459, 89600436, 77887441, 67821152, 59507883, 52558291, 46282762, 40342318, 34919108, 30515014, 27478589, 25876177, 25785778, 27359133, 30729938, 35781324, 41723421, 47886247, 54325820, 60623568, 65177298, 67062744, 66766747, 64799911, 61913213, 58509398, 54806599, 51268805, 48118493, 44856516, 41126752, 36868174, 32141377, 27313910, 22711387, 18364609, 14505240, 11443757, 9202995, 7619070, 6468897, 5608759, 4956412, 4465221, 4069123, 3752722, 3492881, 3263108, 3081138, 2917230, 2777372, 2669928, 2586564, 2530681, 2503521, 2504098, 2526262, 2598670, 2667317, 2766640, 2933006, 3120860, 3346187, 3604529, 3895947, 4250370, 4618264, 4925064, 5223829]
17005E223829K92142K34626J56052J09246N8610r877k5421n628K2174R7715J34572
16994F288040J55149J25940J05289L242j0100m7946q8142j07538j17563j25958
16984F180413j36196j28241o4843o7503o4134r4773j75580k98298l82946m71348
16974D296551m65187m10259l45160k65765k10301j71992q7972o6176n4476j9239
16964B200024J5830K7528K1884L2627L0883K3314o071k5986k7017m9955o6739
16953B176322n0740n4124o6695r2680n5061p3164p2521r1686q7405n2645n0552
16942A429049l2137n1647k2035k7726o2752q7575n3714m2675k8816J2068P729
16931A039769J6016O785K307n769n733p258j1819Q124K31n199j6129K679J1261
$$ y = [5223829, 5515971, 5750597, 5906649, 6015895, 6074505, 6064628, 6039207, 6033579, 6055753, 6153468, 6288040, 6443189, 6569129, 6674418, 6677660, 6667560, 6619614, 6531472, 6423934, 6306371, 6180413, 6044217, 5915976, 5851133, 5783630, 5719496, 5624723, 5449143, 5150845, 4767899, 4296551, 3831364, 3421105, 3075945, 2810180, 2599879, 2427887, 2339915, 2273739, 2219263, 2200024, 2215854, 2243382, 2265266, 2297893, 2328776, 2352090, 2346019, 2320033, 2293016, 2243061, 2176322, 2125582, 2071458, 2004763, 1912083, 1857022, 1783858, 1711337, 1619651, 1532246, 1479601, 1429049, 1396912, 1345265, 1323230, 1295504, 1232752, 1145177, 1091463, 1048788, 1019972, 1032040, 1039769, 1055785, 1062570, 1064877, 1059108, 1053375, 1046117, 1034298, 1042422, 1042653, 1037454, 1021325, 1024004, 1035265]
16918A035265L125j9768k5047n0351m3018l1785m5968m9207o0648m7049l9084
16907F26465l7866o6537o7898m7267l0317m7939l4518m2099p0995o4825n1737
16896F4467q6554n4678l1850k4368K629N002K3020K8091M3900P3485N0536M8672
16884A42352J518J0098L6170M2209L1037J7347P502R110O933K281j7471j7805
16872B71281m0707Q952k9234o1240k1115m820k7481k5525n260K0863J4773R074
16860A09561k810K2383K7790K5756J8664j0951j951K3301K9964K8729J6660J2318
16848B99414n429L4519Q229r766J3030J5294o871j8519M4311J4820j8399j8653
16836C51980r572m4927k5664l0039k0274K963l942J5131N799l6182j8603L500
$$ y = [1035265, 1038390, 1018622, 993575, 943224, 900206, 868421, 822453, 773246, 712598, 665549, 626465, 588599, 522062, 454164, 406897, 376580, 328641, 294123, 252024, 181029, 116204, 64467, -22087, -76765, -108615, -132983, -130354, -125352, -102332, -74241, -30341, 43144, 93680, 142352, 143870, 153968, 190138, 232347, 263384, 280731, 288233, 297343, 304276, 306557, 289086, 271281, 230574, 239526, 210292, 149052, 127937, 123117, 95636, 70111, 64851, 85714, 100487, 109561, 106751, 129134, 156924, 182680, 201344, 190393, 188442, 211743, 241707, 270436, 287096, 299414, 293985, 328504, 336733, 326967, 339997, 355291, 348420, 329901, 374212, 389032, 370633, 351980, 342408, 297481, 271817, 241778, 221504, 224467, 220525, 235656, 241455, 205273, 186670, 190170]
16824A90170J8351Q377m0458j0059M760k165k104j7046k7038J3026o870l4327
16812I4617j5103J5075N77j1984k6754r092j0344p396k9098O093J314L802K1528
16799C3235J0199k1303j0136j2211j561L587q546j8524j812K1561j2258j0106
16787b7875m368L0283J4582n289M308j8419j7668L3974L3850J9085k0564j5595
16775B6304r062L403J974R414J1526K34j271J8042R742M525K35k39M563L620j9944
16760F3066r516j4526N578J4576k870k3601J260L0403Q863j9983k923K996n843
16747D7480l006k75J2063K9777j8362l7097j2880K4309K2302p437J1848q74k2416
16734D5432k530n31J993M266J8243j2235j2314p719p435J374r686j6658N3054
$$ y = [190170, 208521, 216898, 176440, 166381, 171141, 168976, 166872, 149826, 122788, 135814, 128944, 94617, 79514, 94589, 95166, 83182, 56428, 47336, 36992, 29596, 498, 6591, 7905, 11707, 33235, 43434, 22131, 11995, -216, -1777, 1810, -6736, -25260, -27072, -5511, -17769, -27875, -32243, -1960, 12622, 7333, 11641, -6778, -24446, 9528, 43378, 62463, 41899, 26304, 17242, 20645, 22619, 32033, 43559, 43793, 42522, 60564, 70306, 74831, 75066, 74827, 79390, 83010, 63066, 53550, 39024, 44602, 59178, 56308, 32707, 33967, 64370, 73233, 53250, 50327, 53323, 47480, 44474, 44199, 56262, 86039, 67677, 30580, 17700, 42009, 64311, 56874, 68722, 67848, 45432, 42902, 42371, 44364, 48630, 66873, 54638, 42324, 34605, 27170, 28544, 18858, 2200, 55254]
16721E5254R107j4581L879J5374k16k8434o542J9152p690k5021K3371M467M226
16708E2346J6674m785l230j9107o229N2175L2079L6948L0885o700J214o447L35
16695A76158M622j05K8648M2383J7597j2379o593k4537j3188j1635L834p412l9814
16682A57579k3477l1570q352N508J7948J8788k275l4324n0818j4991%k16j4850
16669A8950j1725j5290j940n820q005Q420K7360m654R105Q804K0800K140K3397
16656G1542M744k4545l6503q594J4818Q330j197m32J2455O54m314P039k557J958
16642D3398J2469J5259j8404j5786k7542J5078q341J7297P079Q484J0080Q928
16630F7999j9410l4895K2796K3507O106J754m858l3993j5871N390O273L6269K5132
$$ y = [55254, 64361, 49780, 53659, 69033, 68817, 40383, 33841, 52993, 45303, 20282, 43653, 48120, 52346, 69020, 64235, 61005, 41898, 35669, 87844, 119923, 156871, 187756, 181056, 182270, 175823, 176158, 180780, 180675, 209323, 251706, 269303, 256924, 250331, 225794, 212606, 200971, 204805, 197393, 157579, 134102, 102532, 94180, 99688, 117636, 136424, 134149, 99825, 49007, 34016, 34016, 33800, 18950, 7225, -8065, -10005, -15825, -23830, -15410, 11950, 7296, 16401, 25205, 46005, 48145, 71542, 76286, 51741, 15238, 6644, 21462, 29792, 28595, 28163, 40618, 41272, 36958, 43997, 41440, 43398, 55867, 71126, 52722, 36936, 9394, 24472, 16131, 33428, 40507, 48991, 59071, 67999, 48589, 13694, 36490, 59997, 66103, 67857, 62999, 29006, 13135, 18525, 24798, 61067, 86199]
16617H6199R793K1264j5133L716j0542j6796j6040j868J0803o362j3611r270K1405
16604F3558K647j4972k0387K352J255L7222K4102J3973J1395J8953K7919K8076
16592A96093L2262L2316L6120N0249K7917L8983L7841K8884L1936L5799N2082
16581F00482L3181M1359J4833j1171o311J0977J5517J6900K6372J4777k5885j8725
16569G12306k5162n4608m0865m5192l9250k7815l9991m1383l7290j6271m5468
16558B99011j8639m4708n6527m3049m3733j3245k3642K0659j2180j7128j1191
16547C5628j7373Q796N546L2651O695J6059K1926L6135M5132R447M453K3039K6313
16534B54447K3075m127k9491j3977O30r620k760k4835l4318n6165k2184j4604
$$ y = [86199, 95992, 117256, 102123, 105839, 95297, 78501, 62461, 60593, 71396, 65034, 51423, 42153, 63558, 66205, 51233, 30846, 33198, 34453, 71675, 95777, 109750, 121145, 140098, 168017, 196093, 228355, 260671, 296791, 347040, 374957, 413940, 451781, 480665, 512601, 548400, 600482, 633663, 675022, 689855, 678684, 672373, 683350, 698867, 715767, 742139, 756916, 731031, 712306, 687144, 632536, 591671, 546479, 507229, 479414, 439423, 398040, 360750, 344479, 299011, 280372, 235664, 179137, 136088, 92355, 79110, 55468, 76127, 63947, 46819, 35628, 18255, 27051, 32597, 65248, 71943, 88002, 109928, 146063, 191195, 200642, 205095, 228134, 254447, 277522, 273395, 243904, 229927, 230557, 220937, 218177, 193342, 159024, 102859, 80675, 66071]
16522F6071j3040o859o764j5094r837o871j3083R194l8205k6183q598J187K7206
16509d0876K1127J956L4047q940m324J9625J6458m366J4048K5050j3354J6807
16497G7258n845o569J8452Q517r504M380j606J4018j1206k2575J6165j6337k2273
16484D2875j030l054r318j28J4712O567J9321j448j216n589P68j9451n0162Q325
16470A172K1115j1303M5665L0103l927M101J5341J4945l0217k2557k0637j1633
16458C2168l0272J5904M2865k3714r357j5362j3533J3478k5222J5974N802p192
16446A539j9187k5502J506n499k6559j6532L2609K1501j3924k6728M400J7104
16434e5272k1060j3469Q806K0302K953L0928M634j0628p252O182j8574p071J5337
$$ y = [66071, 53031, 46172, 39408, 24314, 14477, 7606, -5477, 3717, -34488, -60671, -69269, -68082, -40876, -19749, -17793, 16254, 7314, 2990, 22615, 39073, 34707, 48755, 73805, 60451, 77258, 71413, 64844, 83296, 91813, 82309, 86689, 85083, 99101, 87895, 65320, 81485, 65148, 42875, 41845, 38791, 29473, 29345, 44057, 50624, 69945, 68497, 67281, 61692, 62460, 43009, -7153, 1172, 22287, 10984, 56649, 86752, 82825, 86926, 102267, 117212, 86995, 64438, 43801, 32168, 1896, 17800, 60665, 36951, 27594, 12232, -1301, 12177, -13045, 2929, 8731, 1539, -17648, -43150, -41644, -47143, -73702, -90234, -57625, -36124, -50048, -76776, -72376, -55272, -76332, -89801, -80995, -60693, -57740, -26812, -22178, -32806, -40058, -33876, -52450, -59521, -44184]
16421d4184K3599r842Q644J6055l3144j8347q27q281M815L1410K0152k270j3761
16408b5981j486q214k8140j9130k211o225K0512M0094Q426J0612J0974K1458k2490
16395a801k8713m044J6835j4382K9508J3708k0269n401J413J8308j5342J509j4256
16382b2927j5348j0162j7249J2598K0964q741r355P450J5029p771k613P595J1199
16369a9331j2422J9443L078k6142j5123M997o89L3747n83l0680k2550J360Q329
16356e6566j0072J9816K7437O014N172J4402K2977o808j4393j4522Q034j6382
16344a4891M268K6107K7166L0225j5159p195j1876j7135N5458J8769j5574j8633
16332F1530j6361k1120j6113J4849L9243J3874k8373m5974P201J8415r253j6981
$$ y = [-44184, -20585, -30427, -21783, -5728, -38872, -57219, -58046, -66327, -61512, -30102, -9950, -12220, -25981, -27467, -35681, -63821, -82951, -85162, -91387, -70875, -30781, -22355, -11743, -769, 20689, -1801, -30514, -34558, -17723, -32105, -2597, 11111, -9158, -14559, -13146, 5162, -10180, -8671, -22927, -38275, -48437, -65686, -53088, -32124, -40865, -50220, -42770, -27741, -35512, -38125, -30530, -19331, -31753, -12310, -9232, -35374, -50497, -45500, -46189, -12442, -13025, -43705, -66255, -64895, -56566, -66638, -46822, -19385, -13371, -8199, 6203, 29180, 22372, 7979, -6543, 1491, -14891, -10623, 15484, 42650, 72875, 57716, 50521, 38645, 21510, 76968, 95737, 80163, 61530, 45169, 24049, 7936, 22785, 62028, 75902, 47529, 1555, 8756, 27171, 17918, 937]
16320I37k9797k1846K6879j3951N479r992L666J0904K6806K5263K601o24l890
16307B2435M645J1036K8185J5764o252j0728j1038O892K0673K1462K1305j8306
16295A06073j4552j9043j1002L140O171Q34O965k1389l959K8388L9878J8302J831
16282A41637j7935P763J3441k7079n89K5451K2026j0489j6018j5214j0600k055
16270A10339q916K5690j0164k8764l0319m591q545k9356n791J1995j6686m15Q360
16257A2837k4091j0673K7530J9911k4863p018n731k020K5583n136k6420K1839
16245A748J3880J2037p980J5559J1691N200j787j0008k164k9746k6124k4982M184
16232c8492K5882k0251K053K5454m559o474n325j0141O622J8908J460k7037j2739
$$ y = [937, -28860, -50706, -23827, -37778, -32299, -42291, -38625, -27721, -915, 24348, 26949, 26325, 22435, 27080, 38116, 66301, 82065, 75813, 65085, 54047, 60939, 81612, 103074, 124379, 106073, 91521, 72478, 61476, 64616, 70787, 71621, 78586, 57197, 53238, 81626, 121504, 139806, 141637, 123702, 131465, 144906, 117827, 117238, 142689, 164715, 154226, 138208, 122994, 112394, 110339, 101423, 127113, 116949, 88185, 57866, 53275, 44730, 15374, 9583, 21578, 4892, 4477, 12837, -11254, -21927, 5603, 25514, 651, -6367, -12098, -14118, 11465, 6329, -20091, 1748, 15628, 27665, 19685, 35244, 46935, 52135, 50348, 40340, 38176, 8430, -17694, -42676, -38492, -12610, -32861, -30808, -5354, -9913, -16387, -21712, -31853, -25231, -6323, -4863, -31900, -44639]
16219d4639J5471L0765K127o090K124J939K8243J8537j4539j8076j426J9708L473
16206C7617O370j7538Q467N800l4915N778j0325m0917O144O374j0080J3897P218
16193a6110j347N753p582k5122j0087N684O444J3307K4599L3874q335j3131j4125
16180f178l293k4983n76j0488J0728K1568K647L7926K731j7564K952M890p300
16167A3060j5043o650J6167n0j2308j9691k2623P143j5098j0870J3729J3090J8372
16154b0772R451K957k5388M419K6445J0554M593K7008K3433j8180l430l1166j0387
16141d63P834K3004j8087j4809M667N728n297n457j5507P280J1740k2596k2731
16128d4694O566L6977L8051M575J65l779l2695k5825R03K7138J1241p357j0841
$$ y = [-44639, -29168, 1597, 3724, -2366, -242, 1697, 29940, 48477, 33938, 15862, 14436, 34144, 37617, 43987, 26449, 34916, 40716, 5801, 11579, 1254, -39663, -33519, -27145, -37225, -23328, -16110, -17457, -11704, -19286, -44408, -54495, -48811, -42367, -29060, -4461, 29413, 21078, 7947, -6178, -9471, -34454, -35030, -45518, -34790, -13222, -10575, 27351, 30082, 12518, 15470, 20360, 13060, -1983, -8633, 7534, 7484, -4824, -24515, -47138, -39995, -55093, -65963, -52234, -39144, -20772, -11321, -8364, -33752, -29333, -2888, 7666, 12259, 39267, 62700, 44520, 41090, 9924, -463, 7371, 30375, 12288, -2521, 2146, 7874, 2577, -2880, -18387, -11107, 633, -21963, -44694, -38128, -1151, 36900, 41475, 41640, 37861, 5166, -20659, -19756, 7382, 18623, 11266, 425]
16115D25K6690J7904k2914J2982J4473K3894K357j4280l3195l2829j0115j3625
16103b8233K7606J0637J5992j998l637J2317J4548p846J0990L084K3873J8464
16091I5797k6530j8629j5907j985k5180k394j7581K059J1379J1397J0172j2985
16079I613J9259J1177j5255P611J2953j572k3149l360l0674j7413J1845J0265
16067h700K275r323k6420J1025k471N584j5982L128k2615j0067j9260M194K4488
16054f4144J655j0699J9587M1280K8197k9328k7871l408J6298o627M550M2474
16042A1964P993k5081P554J910l4311o142l1023j776L2076J0898r353q810r125
16029e3226k780o95K1734J8584p094L467L829N336o362J284n285K2959k8070l2786
$$ y = [425, 27115, 45019, 22105, 35087, 49560, 73454, 75811, 61531, 28336, -4493, -14608, -28233, -627, 10010, 26002, 24004, 20367, 32684, 47232, 39386, 50376, 53460, 77333, 95797, 69267, 50638, 34731, 32746, 7566, 5172, -12409, -10350, 1029, 12426, 22598, 9613, 28872, 40049, 24794, 32405, 45358, 43786, 20637, 17277, -13397, -30810, -18965, -8700, -6425, -15748, -42168, -31143, -33614, -28030, -44012, -40884, -63499, -73566, -92826, -88632, -64144, -62489, -73188, -53601, -12321, 15876, -13452, -41323, -44731, -28433, -35060, -30510, 11964, 19957, -5124, 2430, 4340, -29971, -36113, -67136, -68912, -36836, -25938, -35291, -44101, -53226, -56006, -56701, -34967, -16383, -23477, -20010, -16181, -10845, -17207, -15923, -21208, 1751, -26319, -59105]
16015e9105J3870L1211j3581l6540O167L9264m036n870J4956k1907n275J8822
16003b2024K2830j362j6488P532L051j5106j7553j9815K7988K1400J964J5601
15991H018P025k7503k2223k9591o524j3767K5831L9838L361L986j2019p62K418
15978b1912j9015j9732J6811J6902L6517R266j3780k8824q240K480p692R9j355
15965c8475J8177j8936o888K1325M563O682J3361M527l1543j420q171K8684o088
15952a4202j7610R762j0493L384J8896R052j7806j9233J1282K6864J4289j5404
15940a219l1007R282R501k2715q067L4734L1208k5851k2434l215J9342j4462k0691
15927d5594j4529J2013Q564j1401n224k220K68M316N522J482K4659J4467J1512
$$ y = [-59105, -45235, -14024, -27605, -64145, -57978, -18714, -22750, -28620, -13664, -35571, -40846, -22024, 806, -556, -17044, -9512, -6461, -21567, -39120, -58935, -30947, -9547, -7583, 8018, 15043, -12460, -34683, -64274, -70798, -84565, -58734, -18896, -15535, -11549, -23568, -24330, -21912, -40927, -60659, -43848, -26946, 9571, 18837, 5057, -23767, -32007, -29527, -37219, -37120, -38475, -20298, -39234, -46122, -24797, -20234, -13552, -191, 4336, -27207, -28627, -36798, -8114, -14202, -31812, -22050, -32543, -29159, -10263, -1211, -19017, -38250, -26968, -104, 14185, -1219, -32226, -22944, -13443, -36158, -44225, -9491, 21717, -4134, -26568, -29783, -10441, -24903, -45594, -60123, -48110, -39546, -50947, -56171, -58391, -58123, -53807, -48285, -46803, -22144, -7677, 3835]
15914C835o078K7874j0350k2036j7981j7374O772J5654M070M162N217p222L964
15901i493J3085J2490k1912j8095j7808j2252P152M803J447J6747J0570p292J6673
15888c885L286J2853j2816J35p798j4517K8284K3710n106r836k0699j3670l709
15875b3768R365j185J725j9501k71J38p000k51q765J3321Q035p570k088K096j1088
15860d6807k242J1274J977K3294K7230J6372j5124j3797p892k8931K228K3955
15848h463Q441j3751l184j8435R477M325K1898q984l540K1492P427j8434K114
15835C83k165M750J4780r343k4688k4141l8288J0917J8293O192M4753R39k3662
15822b1280k3907J2785K5694J0927Q082k0268M435O809P085j3593j4956O766J8820
$$ y = [3835, -2243, 25631, 15281, -6755, -24736, -42110, -35338, -19684, -15614, -11452, -6235, -13457, -9493, 3592, 16082, -5830, -23925, -41733, -53985, -46833, -42030, -40583, -23836, -13266, -20558, -3885, -599, 12254, -562, -427, -8225, -22742, 5542, 29252, 24146, 14310, -6389, -20059, -23768, -14403, -15588, -13863, -33364, -33635, -33497, -40497, -40748, -49513, -36192, -28157, -35727, -37815, -35719, -46807, -49049, -37775, -35798, -12504, 14726, 31098, 15974, 2177, -5715, -34646, -32418, -8463, -22, -13773, -16957, -35392, -25915, -21590, 308, -8676, -12216, 9276, 16703, -1731, 383, -1782, 2968, 17748, 8405, -16283, -40424, -78712, -67795, -49502, -43310, 1443, 2382, -21280, -45187, -32402, -6708, 4219, 12301, -7967, -3532, 3277, 10362, -3231, -18187, -11421, 7399]
15809G399K0173L040J403j8277J3737O770j4185j2808j7364J4747O7J4333k855
15796A6180o593Q574J4600j7437N206K0185p071j7282j8836K970K2987k931o265
15783A4287k2459o01J899K5520j2915k0993j0393R462R739l815r381l718K2376
15770i92L5435j2807P981Q696j6362j4493m430J2049p749N617n680J2054q469
15757A0850j0754K8862k2598n52j0342l6390R163J2386N252K0926O088j6007R690
15744F574J0765K147k9056L933Q544q230Q97q314K5953j1804j9575j30Q409K689
15730g198M919J7359j1688K0616R379j5234J78p105j2986k1368o755Q030j3027
15717c4880K425R107j32k2022q282k1919K3622K306J9957j1253J2856o289j7188
$$ y = [7399, 27572, 30612, 32015, 13738, 27475, 34245, 20060, 7252, -10112, 4635, 4702, 19035, 16180, 9587, 18161, 32761, 15324, 20530, 40715, 33644, 16362, -2474, 496, 23483, 20552, 14287, -8172, -8773, -6874, 18646, 5731, -15262, -25655, -16193, -6454, -10269, -19650, -23368, -992, 34443, 21636, 29617, 38313, 21951, 7458, 3028, 15077, 7328, 12945, 7265, 19319, 10850, 96, 28958, 6360, 5808, -4534, -40924, -31761, -19375, -14123, 6803, 12891, -3116, 6574, 17339, 19486, -9570, -5637, 2907, -5323, -4426, -12740, 13213, 1409, -18166, -18296, -9887, -7198, -2279, 15080, 3392, 24008, 33387, 18153, 18331, 11226, -1760, -23128, -29883, -21853, -34880, -32455, -23348, -23480, -45502, -53784, -75703, -52081, -49775, -29818, -41071, -28215, -34504, -51692]
15704e1692j2017J1782K9826J8458j1324j1341R200L7007J7948k2489L953J6015
15692C5326M045k0026J2505J3655K705k3665k550m002L32M468k0542j8538k8180
15679d4467j1532N265M2784J864J5790p538J2161J806M185k0596o22j1439l487
15666a5826N051Q56j222k0219O509P67Q903J0889p720J0175L3518Q767l2517P711
15652A5642Q867l06j3842L8157j463q52k6422j6612J1175J6327k1700q712l9847
15639c9588N427K8068J3449J3504k891l834j8116k2594k18J7218J4350J1502J2431
15626B8708m963J601j2202k7575j1303J5766J6552Q858j5845r619J937L997J4607
15613A0519K2460J847j4089j2541j1420k0577J3717J2682r016J620M178N411j3292
$$ y = [-51692, -63709, -51927, -22101, -3643, -14967, -26308, -17108, 19899, 37847, 15358, 19311, 35326, 39371, 19345, 31850, 45505, 48210, 24545, 21995, 17993, 18325, 22793, 2251, -16287, -44467, -55999, -50734, -7950, -6086, 9704, 2166, 14327, 16133, 20318, -278, -900, -12339, -15826, -10775, -9919, -11141, -31360, -24851, -24084, -15181, -4292, -12012, -1837, 31681, 40448, 7931, 15642, 24509, 24203, 10361, 48518, 47055, 46203, 19781, 3169, 14344, 30671, 8971, 259, -39588, -34161, -6093, 7356, 20860, 17969, 14135, -3981, -26575, -26793, -9575, 4775, 16277, 28708, 23745, 25346, 13144, -14431, -25734, -9968, 6584, 15442, -403, -10022, -8085, -4088, 10519, 32979, 34826, 20737, 8196, -3224, -23801, -10084, 2598, -6418, -4798, -620, 4791, -8501]
15600h501K364J6325O316j2704L894O967k5542j4652L895q018n222J0979K0264
15587c635K5342M459k0712r09J3750K4788j6493j1422m107L047J781j1686M33
15574D636L615k1737r06j3345j1428N196Q260L5616K110M161n497n815K4844L1
15560B9741n961j7833q935K8143K0544J5177l2056j2905Q309R429k9711j7505
15548a3563m967k3760K4273N1069K4117j0064P4j0123j3518p771k098J4722k4014
15535D377J7772J9178J9054j8402k0808j2975j3187K2117J9100J4473K8009O631
15523H5339j7153k949k8335j0198J3253J8567J0720r241l8470l6347r097L6175
15511A2264K949j1900J4050o206k1898K6824K0722j2331p070j3752q961j2218
$$ y = [-8501, -6137, 10188, 16504, 3800, 7694, 14661, -10881, -25533, -21638, -29656, -34878, -23899, -3635, 21707, 26166, 5454, 4545, 18295, 43083, 26590, 15168, 11061, 14108, 15889, 4203, 4636, 8251, -13486, -14392, -27737, -39165, -33969, -25709, 9907, 12017, 16178, 10681, 4866, 29710, 29741, 23780, 5947, -2988, 25155, 45699, 60876, 28820, 15915, 24224, 33653, 3942, -13563, -18530, -42290, -18017, 33052, 57169, 47105, 47179, 37056, 23538, 15767, 13669, 28391, 4377, 22149, 41327, 60381, 41979, 21171, 8196, -4991, 17126, 36226, 50699, 78708, 85339, 68186, 65237, 36902, 26704, 39957, 58524, 69244, 60003, 21533, -14814, -23911, 12264, 15213, 3313, 17363, 11157, -10741, 16083, 36805, 24474, 17404, 3652, -5309, -17527]
15499a7527l552l907K5318K7195m917k216l491P386o279r279J665M166j3373K119
15485C308L5082K5884j0410j4313J0218J2159p21j2526O677J6801k2131m0835
15473I193l9427J5139K3954K4083j3606k101O388L704m854J598L378k4687J2329
15460A5091J9957L373j1213O458K4653o452k5258M248k607k3548k8458J5526L1372
15447B3142J1613j1368j4948j1320q991L490Q354O093o363l503L1328N340k3414
15434I453O352j238K9876K0134j4171j5210j2707j4943K2867R380k3762p413j0430
15421a812N737J4476O151M911k972l8117o381Q920N363Q242j97J2190J2625j2712
15407A6424l509J6937K257j8634k0025J4827M3660q930m0429j3304K5763J5669
$$ y = [-17527, -21079, -24986, 332, 27527, 22610, 20394, 16903, 24289, 18010, 8731, 10396, 14562, 1189, 3308, 38390, 64274, 53864, 39551, 49769, 61928, 61207, 48681, 55358, 72159, 50028, 9193, -30234, -15095, 8859, 32942, 19336, 17235, 23623, 27327, 22473, 24071, 27449, 2762, 15091, 35048, 38421, 27208, 33666, 58319, 51867, 26609, 30857, 28250, 4702, -23756, -8230, 23142, 34755, 23387, 8439, -2881, -11872, -8382, -28, 6065, -298, -3801, 27527, 32867, 9453, 15805, 14567, 44443, 64577, 50406, 35196, 22489, 7546, 30413, 39793, 16031, 8618, -1812, 3925, 18401, 24552, 29463, 26491, -11626, -18007, -9087, -3724, 4518, 4321, 16511, 29136, 16424, 12915, 29852, 32109, 13475, -6550, 8277, 51937, 43007, 2578, -10726, 15037, 30706]
15395C0706J633K2997M007O75q108j3428J9745p277p538K0700N741J2345m409
15382G7789k1260k256p651M367n889k0035K4000J9219K459J2596j0757k5012k466
15369D5104j6022O247J4961n736K087r262j533k5171j1612j663J9618L7801J591
15356E6410O37J9766j1222m1767o333L5972P349K966L44n784j0458j72j0755n949
15342C1004J9198j1047J7540n788J7951K2598l0490O003L641k7740k4977J351
15330A9244J8129K1355j0962k5317k9321N699K4558j2914k969J6087q313n154
15318A0122l262J4050j0353j5743L194M22K005P384O048J345P651J7852Q749k1613
15304B7851j3078K0332j4836o624j860k145k105K6939L6295J2546n787j5286k167
$$ y = [30706, 32339, 55336, 59343, 60018, 51910, 38482, 58227, 50950, 43412, 64112, 69853, 82198, 77789, 56529, 54273, 46622, 50989, 45100, 25065, 49065, 68284, 70743, 83339, 72582, 47570, 45104, 29082, 35329, 50290, 44554, 46641, 37379, 35846, 10675, -937, -2600, 17018, 54819, 56410, 57047, 76813, 65591, 23824, 17491, 53463, 60812, 63778, 64122, 58338, 47880, 47708, 36953, 31004, 50202, 39155, 56695, 50907, 68858, 91456, 60966, 66969, 70610, 42870, 17893, 19244, 37373, 58728, 47766, 22449, -6872, -1173, 23385, 10471, 7502, 23589, 15276, 10122, 6860, 20910, 10557, -5186, -1992, -1570, 435, 7819, 13867, 15212, 22863, 40715, 49464, 27851, 14773, 35105, 20269, 13645, 11785, 9640, 7535, 34474, 70769, 83315, 77528, 62242, 60075]
15291F0075L893j3622j8629L456j293N156j3337J6059M301J6392j7043j6296o488
15278B2624N292J3878P260j0628l325p786k0807k9688R043K0637J498Q121P90
15265A6909j542n399J04j6381Q87J509k210M519J5202m338K0586P176K9696K4638
15251I1356N187n016r750l141N396n864m5577k7025l2325K3743K8259k5591J419
15238A071K1487n191r096J4611j7406J0400K072K975n787M028P162J4078k558
15225C7846j8099p223O305p166J6197j9189J144R753N124j837j2536J0918J2450
15212C3687L349M372m879j6313j5076L5542L8427P096k8151J1240N84k5285l2828
15199A1765k29J0931J1180M299Q466j8729j5186M380J8488p958j2975L4517M165
$$ y = [60075, 63968, 50346, 31717, 35173, 33880, 39036, 25699, 41758, 46059, 62451, 45408, 29112, 22624, 27916, 41794, 49054, 38426, 35101, 27315, 6508, -23180, -14137, 6500, 7998, 16119, 16909, 15367, 9968, 10072, -6309, -5422, -3913, -6123, -1604, 13598, 9260, 29846, 37022, 66718, 91356, 96543, 91527, 81777, 78636, 84032, 78168, 32591, 5566, -26759, -3016, 25243, -348, 1071, 22558, 17367, 8271, 22882, 5476, 15876, 17948, 20923, 15136, 19164, 26326, 40404, 37846, 19747, 12524, 18829, 11663, 27860, 8671, 9815, 19568, 24692, 22855, 10319, 21237, 33687, 37036, 41408, 36529, 20216, 5140, 40682, 79109, 86205, 58054, 69294, 69878, 44593, 11765, 11536, 22467, 33647, 37946, 46412, 27683, 12497, 16877, 35365, 27407, 14432, 48949, 53114]
15186E3114J016N002j339k4300k1946N34J1288J7840K4895j8491m460L0630J9768
15173I3551k0131l7453J514K0783J5937P21q466j8793K6489j849m2102l913M3971
15160G0259R788O482L811Q524R750k4816j8060m1602M714J6414K5888k700K2679
15147I1131K2127p276p985n084n331n660k7722j7892j4271J7033J3789l663k1636
15134B7560j176O435k518K2084J3597o183R120l058P120O562k4791m759l257L417
15120E0153J5657j8546j0949q177L623J1891j1587J4912J6187j2738r943K1842
15108F2325J245p197R552J4459P444k93j0529P227K275R162J1774N634J864o883
15094A08059j0301m281o509J5249p282j739p934K6834M97r032j8612N471m461
$$ y = [53114, 54130, 59132, 57793, 33493, 11547, 12081, 23369, 41209, 66104, 47613, 43153, 73783, 93551, 73420, 35967, 37481, 58264, 74201, 74922, 66456, 47663, 74152, 72303, 30201, 26288, 70259, 80047, 86529, 90340, 98864, 108614, 83798, 65738, 24136, 28850, 45264, 71152, 68452, 91131, 113258, 105982, 97997, 92913, 87582, 81922, 54200, 36308, 22037, 39070, 52859, 49196, 27560, 26384, 32819, 30301, 52385, 65982, 59799, 68919, 65861, 72981, 79543, 54752, 49993, 46736, 50153, 65810, 47264, 36315, 28138, 31761, 43652, 32065, 46977, 63164, 50426, 40483, 62325, 63570, 56373, 65925, 80384, 87828, 87535, 77006, 84233, 86508, 95670, 107444, 113078, 114942, 108059, 97758, 93477, 86968, 102217, 94935, 93196, 85262, 112096, 112593, 103561, 84949, 90420, 85959]
15081H5959j2616o691J1193N115J7316J9873k1247j6378P99j6890R440k039k9982
15068D3852j4677J1281Q646K1559J402l218J8650m019J5485K1758J2815j4717
15056A18817l2422p715k0455k3675J8576P138l410j7528o470l576J6901K3537
15044F9718J8132L5532j1740k450j854j9008r113k566k905K0691J3282j1701l254
15031I2764J8285o40o693o023K2027J1515m172j4666M370P532J4886l101q248
15018A27836j4535J4404o825K3201J4959l936J017k2046J783n786O719M466j1699
15005A29558J5647R187j145m725J0078J6463J7341N683k1918k146l496j0201M417
14992A64743K9361J1325j2043L589O751K4853K8484P826M2018L3122L9367N0793
$$ y = [85959, 73343, 66652, 77845, 82960, 100276, 120149, 98902, 82524, 83323, 66433, 75873, 73834, 43852, 29175, 40456, 49102, 70661, 72063, 68845, 87495, 83476, 98961, 120719, 133534, 118817, 86395, 78680, 58225, 34550, 53126, 60264, 56854, 39326, 32856, 29280, 46181, 69718, 87850, 123382, 111642, 109192, 107338, 88330, 79217, 76651, 73746, 94437, 107719, 96018, 92764, 111049, 110409, 103716, 97693, 119720, 131235, 127063, 112397, 116767, 124299, 139185, 136084, 127836, 113301, 127705, 120880, 144081, 159040, 155104, 156121, 134075, 135858, 130072, 136791, 141257, 129558, 145205, 154392, 153247, 148522, 158600, 175063, 192404, 198087, 176169, 174023, 170527, 160326, 164743, 194104, 205429, 193386, 196975, 203726, 228579, 257063, 264889, 306907, 340029, 379396, 430189]
14980D30189O3375Q0797P3927J06545J45981K20322K96801M11564O72994J174851
14970C677346K071903K460032R54960m64176j577071k260858j703008j049904
14962B109224o92433m50963k81607j80171r6752o3837p0320m9722n8259l716J8052
14951A79496l2334n4267J0550m944L996J659L341L076j461j442p300j1113q733
14938H0524P895J9434M380l721q284k1839k3224J1930O333K884j4703k0249j3495
14925B7865J3223J9812Q322J2794r839O969k403j8716k1492k159K467R501O103
14912E2447K1330J3329j1243q2K5928K5669k094j1503k936j3101k4823p073j866
14899F3982M889Q368j6262j628J255M692L326j251O43J4608R629j4919j0841J3972
$$ y = [430189, 493564, 574361, 648288, 754833, 900814, 1121136, 1417937, 1829501, 2502495, 3677346, 5749249, 8209281, 9164241, 8700065, 7122994, 4862136, 3159128, 2109224, 1416791, 965828, 684221, 504050, 407298, 343461, 273141, 223419, 165160, 161444, 179496, 147162, 92895, 103445, 98501, 102497, 104156, 107497, 110573, 109112, 107670, 100370, 89257, 80524, 88419, 107853, 112233, 108512, 100228, 78389, 55165, 67095, 73428, 76312, 61609, 41360, 27865, 41088, 60900, 69222, 82016, 72177, 79146, 76743, 58027, 36535, 34376, 36843, 46344, 52447, 73777, 87106, 75863, 75781, 101709, 127378, 125284, 113781, 110845, 97744, 72921, 65848, 63982, 68871, 77239, 60977, 59349, 60604, 65296, 68622, 67371, 68014, 82622, 92251, 77332, 66491, 80463]
14885H0463r408p812r165J7158L7400L106j5478q105j5221O233j0019q61K0408
14872H8699p10M767M121J934k9061j5769J5232M1649K2106l926j9782k9775J3083
14859I2568L1048j6627k5876R450J8837l468l633J2234p701l8572J418J106N268
14846G6052p745j4003O548J7171L931Q288j5369k7541K409MM663q134l624n990
14832C6660l413r862L6246J3514k4750k2378L6352K7598k014J3447o850l0653
14820F3897J71J862R613N556q109o356J7541P629j2120k798l063O2r971j0047
14806E3867M237m67J3611J3150k3914j9392j605K3526P518k1892J2703M7483J8766
14793A27591q16j3534k9172p007J817o661j6769K9138m849J4993N71j8706l784
$$ y = [80463, 71055, 63243, 54078, 71236, 108636, 111742, 96264, 88159, 72938, 79171, 69152, 68291, 88699, 87989, 92756, 96877, 98811, 69750, 53981, 69213, 110862, 132968, 129042, 109260, 79485, 92568, 123616, 106989, 81113, 90563, 109400, 105932, 102299, 114533, 106832, 68260, 69678, 70784, 76052, 68307, 54304, 60852, 78023, 81954, 90242, 74873, 47332, 49741, 49745, 54408, 46274, 42650, 36660, 33247, 23385, 59631, 73145, 48395, 26017, 62369, 89967, 87953, 101400, 94550, 63897, 64068, 65930, 75543, 81099, 72990, 66634, 84175, 91804, 79684, 76886, 73823, 73885, 63914, 53867, 58104, 57637, 71248, 84398, 60484, 41092, 39487, 63013, 70531, 48639, 61342, 108825, 127591, 126775, 113241, 84069, 77062, 78879, 72218, 55449, 84587, 79738, 94731, 95302, 76596, 72812]
14780G2812N495l4907p529R230J5261L2671L1980K7106j8815k4575k1552q300
14768G8877p71J2773K5758L1054k7531J376R105J3862j6563j8761J3646J1268
14756A34093J0032Q779j7077L061J1109k567J1819q454l7705k6581n679L0389
14744A11219q09O297n767K319K3890K3526J880J746l7294k9599j6562J0146N267
14731I6259k6142M1112L334j8363r410j8443J0299L3036N161J124j5567l8712
14719F3688P760L496k687L9656O805k8048J0909j2040K383J674K472j8078K479
14706H0469J5143J0526J1622j2103k3825L514O931J0001O894J8494j3441q906
14694A05319J1790j3161R205m724O578K309m000J0878j2254J84j174J989R230
$$ y = [72812, 78307, 43400, 35871, 45101, 60362, 93033, 125013, 152119, 133304, 108729, 87177, 78877, 78106, 90879, 116637, 147691, 120160, 121536, 130641, 144503, 127940, 109179, 122825, 134093, 144125, 152904, 135827, 138888, 149997, 147430, 159249, 150795, 113090, 86509, 80830, 111219, 110410, 116707, 110940, 113259, 137149, 160675, 162555, 164301, 127007, 97408, 80846, 90992, 96259, 70117, 111229, 114563, 96200, 86790, 68347, 78646, 111682, 116843, 117967, 102400, 63688, 71448, 74944, 72257, 111913, 118718, 90670, 101579, 89539, 91922, 93596, 96068, 77990, 80469, 95612, 106138, 117760, 105657, 81832, 85346, 92277, 102278, 109172, 127666, 114225, 105319, 117109, 103948, 113153, 108429, 115007, 117316, 113316, 124194, 111940, 112124, 110950, 112939, 122169]
14681A22169j3399M576J7546K049k1966J510J2670L803J0406k1659J6195j1363
14669A22537P312L876o609r207K0783L6915j1479p684n466k749k1616l750J3315
14656A36178n048j3511j2530P641J6902K992M81O267j285j480Q632J7677J374
14643A64290q152r320k0806j0535j4220K116k3781j0283K3698M6108j0838r285
14631A18992j2813k420n126J8931L0422J9035P010o483R811j5198k3908m844K858
14618A36267j1717k5451K3503J5087j1523j5917o265j3178K3863l58M971J08p934
14605A11456R146L3785J360m345k335p348j6936k182J740N474J9541j2118K163
14592A39401m014J0636P273J5484n929J6049l84q588k6718j1754J397k148L0940
$$ y = [122169, 108770, 113346, 130892, 132941, 110975, 112485, 125155, 128958, 139364, 117705, 133900, 122537, 129849, 133725, 127116, 117909, 138692, 175607, 164128, 156444, 150978, 148229, 126613, 122863, 136178, 131130, 117619, 105089, 112730, 129632, 132624, 133105, 139372, 138087, 136607, 145239, 162916, 164290, 156138, 146818, 126012, 115477, 101257, 103373, 79592, 69309, 93007, 139115, 128277, 118992, 106179, 103759, 98633, 117564, 147986, 167021, 174031, 167548, 177359, 162161, 138253, 133409, 136267, 124550, 99099, 122602, 137689, 126166, 110249, 103984, 90806, 114669, 114311, 119282, 119390, 111456, 120602, 154387, 155747, 151402, 149067, 141719, 124783, 122601, 124341, 129815, 149356, 137238, 139401, 135387, 146023, 153296, 168780, 162851, 178900, 178516, 169928, 143210, 131456, 132853, 130705, 161645]
14579A61645L0756M991j4244k1347o114J9867L417k1363j6664O396L9243O972
14567A93555j1635j896j2715J1652K2787J2694j7097j0911L312k0743k5697l100
14555A40206m508K6846l531q779L1656j0274j534L2602K022l86K671j0184n633
14542A91174q759k7188m354j3413R96J7999K248K163j6911j0043K0412L8765R182
14529B02271O520k2321l367j2815J4291K2937r422k6065k309r086j4373J0328
14517A56589P494O843l374K963K09q990J2798J6253n487k6895n26j3333j1693
14504A32851J8049k578K2000o349O62P490q443j5806m496k9048Q102J4498J2710
14491A49642J0607J3998K785K0323J3490O69k6517k1724J0223K1477q59o792j1966
$$ y = [161645, 192401, 197392, 183148, 161801, 155687, 175554, 178971, 157608, 140944, 147340, 186583, 193555, 181920, 180024, 167309, 178961, 201748, 214442, 197345, 186434, 189746, 169003, 143306, 140206, 135698, 162544, 159013, 150234, 181890, 171616, 170082, 202684, 204706, 204320, 206991, 196807, 191174, 182415, 155227, 150873, 137460, 138456, 156455, 158703, 160866, 143955, 133912, 154324, 193089, 202271, 208791, 186470, 183103, 170288, 184579, 207516, 198094, 172029, 169720, 160634, 146261, 156589, 164083, 170926, 167552, 170515, 170724, 161734, 174532, 190785, 185298, 158403, 157877, 144544, 132851, 150900, 148322, 170322, 163973, 164635, 172125, 163682, 147876, 143380, 114332, 122434, 136932, 149642, 160249, 174247, 177032, 197355, 210845, 211514, 184997, 163273, 173496, 194973, 194114, 187322, 175356]
14478A75356k6195Q289K299J634K3338J6279M594O546j4140k4015R822J1516M570
14465A99893j1922J764l0116k7146J0105Q602N280M596J5560N244P647j7506j6117
14452A55884l130N709n870J5410j1916J544p628K9J7491L0953K5717J5282j4049
14439B25426k5034p012R356j1855j3590j1917K0383J8024M711P439K0778K1418
14427B58127M99N399L2213J7095k2184k2155j4026j5460j1098n065J4499K1274
14415B59118j5647k5364j4333L3859N520j58o036k645o436j5438l7581K0068L6170
14402B31097J4572j0085l330n504k2336J486M266p281J9616P537j2854j3252j2829
14389A91103n572j6673k4598O751j321Q315K2886J6451k8216j6818N164J4069
$$ y = [175356, 149161, 157450, 159749, 161383, 184721, 201000, 205594, 212140, 198000, 173985, 183807, 195323, 199893, 187971, 189735, 159619, 132473, 142578, 151180, 156460, 161056, 176616, 181860, 189507, 172001, 155884, 152754, 158463, 152593, 168003, 156087, 157631, 150003, 150032, 167523, 198476, 224193, 239475, 225426, 200392, 193380, 202736, 190881, 177291, 165374, 185757, 203781, 208492, 215931, 236709, 258127, 258626, 264025, 296238, 313333, 291149, 268994, 254968, 239508, 228410, 223345, 237844, 259118, 243471, 218107, 203774, 237633, 243153, 242995, 236959, 234314, 227878, 212440, 174859, 194927, 231097, 245669, 235584, 232254, 226750, 204414, 205900, 210166, 202885, 222501, 230038, 217184, 203932, 191103, 185531, 168858, 144260, 151011, 149690, 158005, 180891, 197342, 169126, 152308, 157472, 171541]
14377A71541R794K8679j4635l741L921L428r154O906M179J2497r198j677K922
14364B05462p335o568p742O820o628K735R4J1510J0872p943l2147m166J7720M216
14350A86900P298J0125N339j8312k6043Q079l761Q368j8271K6616K2753j814k5336
14337A81941l2868n033K0012J813k0620j0114J675K9033J2191J2830O083r512
14325A87431j8162K2945K4831r060k0204P699O521q81J4902p854j05Q485Q040
14312B24588L272O179J6569k7515k9440K374K7715J6287j1253q497l718j0745
14300B05816j796j6987r383Q520J913J9160P388j315K388M656K631j2698o256
14287B04037P790J1771L154p89J6773l3641j830K9711r77J8322k0691l9058J7845
$$ y = [171541, 181335, 210014, 195379, 191638, 195559, 198987, 189833, 196739, 200918, 213415, 204217, 202540, 205462, 198127, 191559, 183817, 190637, 184009, 186744, 186838, 198348, 209220, 201277, 169130, 164964, 182684, 186900, 194198, 204323, 209662, 191350, 165307, 173386, 169625, 177993, 159722, 186338, 209091, 207277, 181941, 149073, 144040, 164052, 165865, 145245, 135131, 136806, 165839, 178030, 190860, 196943, 187431, 169269, 192214, 217045, 207985, 187781, 195480, 202001, 201120, 216022, 208168, 208063, 216548, 224588, 227860, 234039, 250608, 223093, 193653, 196027, 223742, 240029, 228776, 220279, 216561, 205816, 204020, 187033, 177650, 186170, 188083, 207243, 214631, 213316, 215704, 220360, 222991, 210293, 204037, 211827, 223598, 226752, 225963, 242736, 209095, 207265, 236976, 235999, 254321, 233630, 194572, 212417]
14274B12417L407J0992J4374J2687l576j4649k4289J3169J0471J679J0987l843
14262B43826k0126K0122M5274n530k5101j4526R795n836j8171N26J2668P638j1175
14249B39384K4505J6687k2440j5800J7154J0820k4870l2247k7744N3J2403K6341
14237B24246l332p563P611j780J1713k2137m172L5322n441j8378O827J1739J979
14224B36634J9551K7521K5634j4888k0111k470J3179J8407j8816p81o635l030
14212B74195K0685K3164K0304M230Q461P815k505J281m48L006Q931k9967j5949
14199C23203j5718k1414k0313k5786p06J3259j903O287K1663Q279R685j861j2934
14186B81741J6314m617l2039k3975n397q343J6209M0760O93k0216K8363M1934
$$ y = [212417, 215824, 226816, 241190, 253877, 250301, 235652, 211363, 224532, 235003, 236682, 247669, 243826, 223700, 243822, 289096, 283566, 258465, 243939, 253734, 247898, 229727, 230253, 242921, 250559, 239384, 263889, 280576, 258136, 242336, 259490, 270310, 245440, 213193, 185449, 185502, 197905, 224246, 220914, 213351, 220962, 219182, 230895, 208758, 204586, 239908, 234467, 216089, 222916, 234655, 236634, 256185, 283706, 309340, 294452, 274341, 271871, 285050, 303457, 284641, 283860, 277225, 274195, 294880, 318044, 338348, 342578, 351039, 358854, 356349, 357630, 357182, 360188, 369119, 339152, 323203, 307485, 286071, 265758, 239972, 239266, 252525, 250622, 256909, 278572, 286851, 296536, 294675, 281741, 298055, 293438, 261399, 237424, 232027, 223684, 239893, 280653, 281346, 261130, 289493, 331427]
14174C31427R053J7111o32q332O732j1267o585l113o641k7054J6591O128J2205
14161C35623n696Q57j4404j6366k6703R140J4536r319j3576j2070L684k138k2500
14148B41068L18L5736p358J4348J1852k1440p196m299K367K3161N702J3495j741
14135C06013l015P030j0188o901l7963j5566K2456J980K1430O760l062J1435K9333
14122C29742M434q818P429L074L665j2033p984k314L8606P387m3544k0715m804
14109B94125q272j2432m633K7796N558m443n234k1703O653K0206k854J4947J4853
14096C24567N815J0842K0722K3920L501P296j260l202K2499M540K897J7120J8001
14083D57258Q97j5058q701J8435k2830k4048O677J7217N808k0223l4659k6461
$$ y = [331427, 340480, 357591, 356959, 348627, 355359, 344092, 337507, 334394, 327753, 300699, 317290, 323418, 335623, 329927, 330784, 316380, 300014, 273311, 282451, 296987, 287668, 274092, 262022, 265706, 263568, 241068, 241386, 277122, 269764, 284112, 295964, 274524, 267328, 263029, 265396, 288557, 294259, 307754, 306013, 302998, 310028, 299840, 292939, 254976, 239410, 261866, 263846, 285276, 292036, 288974, 300409, 329742, 334176, 325358, 332787, 335861, 339526, 327493, 319509, 317195, 355801, 363188, 319644, 298929, 294125, 285853, 273421, 268788, 296584, 302142, 297699, 292465, 270762, 277415, 297621, 294767, 309714, 324567, 330382, 341224, 361946, 385866, 389367, 396663, 395403, 392201, 414700, 419240, 422137, 439257, 457258, 458155, 443097, 434396, 452831, 430001, 405953, 412630, 429847, 435655, 415432, 380773, 354312]
14071C54312j1091r301j7117q671k0567P344K2013O418K925P119K232k909m136
14058C28571j6095k451k1097k998J9645l1720r197Q52m296K205J495K1856r212
14045B77558j0304L1396j656j7214k243K1901O943n628M870j0051o410j1148K707
14032B80721N298k7623N478J1933O627M54P351J4066p446j12J9963M755j2064
14019C09401J075k2169q684L577k370o017j9246J3545L2356j341J1752k944q118
14006C00817Q114J1578l1593o947J0175j7741k0371J770J1379K5413J631j0896
13994B83329J4534M919q671L3516J7182P585n703l472j2945m113j0374K0095J8477
13981C54359n84k2018k822J5191k7709j6387K5658K4084l742k2574n428L2278
$$ y = [354312, 343221, 333920, 316803, 308132, 287565, 294909, 316922, 323340, 326265, 333384, 335616, 332707, 328571, 312476, 310025, 288928, 285930, 305575, 273855, 264658, 265510, 261214, 263419, 264914, 286770, 277558, 267254, 298650, 296994, 279780, 277537, 299438, 306381, 300753, 305623, 295572, 289162, 278014, 280721, 286019, 258396, 263874, 275807, 282434, 282888, 290239, 304305, 296859, 296747, 316710, 321465, 309401, 310476, 288307, 279623, 283200, 280830, 274813, 255567, 269112, 301468, 300127, 311879, 308935, 300817, 308931, 320509, 288916, 281969, 292144, 274403, 254032, 255802, 267181, 292594, 294225, 283329, 297863, 302782, 294111, 327627, 344809, 352394, 346691, 343219, 330274, 326161, 315787, 335882, 354359, 353775, 331757, 328935, 344126, 316417, 300030, 325688, 349772, 346030, 323456, 318028, 350306]
13969C50306N944O109j791l0228j2792p106K6573l8968j312J5561L707J7348J4745
13956C48096j1737j5722o008M657k328J4070j1127k800P374p82j3386J847k320
13943C09834M261m932j5814K7426K098r890P931r971Q319K717K2380J172m2438
13930C03093j7632J6986J1181k792r80l4381j1999O962K1043L2186l953K4532
13918C44246n638k220k1810l6218q017J6017K0292n148L294K5475r926L176j6299
13905C07224p853K0260J4066o294j8813K0738K1929m4372j0942K3149j563k7214
13893B90315n365L7220J4343o891l50J7456j3478j1385N45O568m502J6794J4677
13880C55947q351j0175N930j0599o714K9937R911l0253r365j0038k5018j4273
$$ y = [350306, 356250, 362359, 360568, 330340, 317548, 310442, 337015, 298047, 296735, 312296, 316003, 333351, 348096, 336359, 320637, 314629, 319286, 316958, 331028, 319901, 317101, 324475, 323693, 310307, 312154, 309834, 314095, 309163, 293349, 320775, 322873, 312983, 320914, 310943, 319262, 321979, 344359, 345531, 303093, 285461, 302447, 313628, 310836, 309856, 275475, 263476, 270438, 291481, 323667, 319714, 344246, 338608, 336388, 314578, 278360, 270343, 286360, 306652, 301504, 304798, 330273, 320347, 323523, 307224, 299371, 319631, 333697, 327403, 308590, 329328, 351257, 306885, 295943, 319092, 317529, 290315, 284950, 322170, 336513, 329622, 329272, 346728, 333250, 321865, 322410, 328978, 324476, 341270, 355947, 347596, 337421, 343351, 332752, 326038, 355975, 365886, 335633, 326268, 316230, 291212, 276939]
13868B76939K1943K7395K2519J6111J0467j3197l087l803j5658m125K4189j0802
13856C48891K187J3917k206K6565M661j3650l1550n805P091L222j861j2880r535
13843C29047L7281j210p933J4132J3877J4225J879k4872J0234K982l723J4535
13831D00454P84r052j4427r408l670k3755r683K4207L6171K1669k226n899l125
13818D02040J553k5348j6870K6772K7651p170m828R439L9691j7766J9431l186
13806D51409q015k3740j4182K4195J4772m075q415m20J534P772l967q346K3549
13793D52071K2768o991j4595j0136P131p819k16K59J3526n311K490m488q638l66
13779D39685o530L0218K6617j903j6459P266J5247M93Q557N46o416k2218q801
$$ y = [276939, 298882, 326277, 348796, 364907, 375374, 362177, 359090, 355287, 339629, 335504, 359693, 348891, 351078, 364995, 362789, 389354, 394015, 380365, 348815, 343010, 350101, 353323, 351462, 338582, 329047, 366328, 365118, 357185, 371317, 385194, 399419, 401298, 376426, 386660, 389642, 385919, 400454, 401238, 392186, 377759, 368351, 364681, 340926, 331243, 355450, 391621, 413290, 411064, 405165, 402040, 403593, 378245, 361375, 388147, 415798, 408628, 403800, 413239, 452930, 435164, 454595, 451409, 443394, 419654, 405472, 429667, 444439, 440364, 431949, 431529, 433063, 440835, 436868, 428522, 452071, 474839, 467848, 453253, 443117, 450248, 442429, 442213, 442472, 455998, 450687, 453177, 448689, 440051, 439685, 433155, 463373, 489990, 488087, 471628, 478894, 494141, 494634, 503191, 503737, 497321, 475103, 466302]
13766D66302N488R009O712J5984J7665k0703J6635K6912j7105l867N868J544K489
13753E32933k4873J7163j681k0573j0550R312q827p873P755K7218K1566K1109
13741E62679K80k1463j8243m720L7947J8319J5948M5793M71m8199r039p564m4197
13728E28012o492J9371k7797j5736M137K3522J6349J8942p427j2944r803J98N919
13715E36251L2453k100J2264J5004j0850k542J0139K147p314j4482M138J0362
13703E85470J6314K1156K5263J374q809J2072Q493K2791k421P487k634K4883K4463
13690G35902K053K9057K7929N002k5574J4715J595K8433R762J9337K2197K0800
13678H91208k146k670j6528p660j896N272L1975j0805J933R38j7762M137J3291
$$ y = [466302, 471790, 480799, 487511, 503495, 521160, 500457, 517092, 544004, 526899, 523032, 528900, 530444, 532933, 508060, 525223, 523542, 502969, 492419, 501731, 492904, 485031, 492786, 520004, 541570, 562679, 562959, 541496, 523253, 518533, 556480, 574799, 590747, 636540, 637011, 588812, 579773, 572209, 528012, 521520, 540891, 513094, 497358, 501495, 525017, 541366, 560308, 552881, 539937, 530134, 530332, 536251, 568704, 566604, 578868, 593872, 583022, 580480, 590619, 592766, 585452, 570970, 575108, 585470, 601784, 622940, 648203, 649577, 640768, 652840, 661333, 684124, 681703, 689190, 686556, 711439, 735902, 737955, 767012, 794941, 799943, 774369, 789084, 790679, 819112, 828874, 848211, 870408, 891208, 889062, 886392, 869864, 862204, 860308, 865580, 897555, 886750, 888683, 889621, 871859, 875996, 889287]
13665H89287J737K3620J274l5661n714O296K158o8M425j8988j8623k5757j7892
13652H06094j150j2794l898l15J2010k1091n2055j2541j3621n854N181j1792j3120
13639F75054m968L007L3630r916K769P141J8898r833N609j9543J698K4735j6042
13626G12239R549M9449J1133P773r930j8474j8040o809O046K5024L5481K1227
13614H24668k1677j3981r60k383n146k6185K26L1085K8816q252N235j7839k9957
13601G63650j1458O67j3662P93M3263K4046L1831j6527M003p310k9159r47J1640
13588H00830j4411M395J1548J1764R916J4075K1924k2474K445K0149L285j1150
13576H52296L0291l557j6108k779j6707k1612j2975Q513P028n171j6147J950o673
$$ y = [889287, 891024, 914644, 915918, 880257, 874543, 880839, 882997, 882929, 887354, 868366, 849743, 823986, 806094, 804944, 792150, 788252, 787937, 799947, 778856, 726801, 714260, 700639, 694785, 699966, 688174, 675054, 670086, 673093, 706723, 696807, 699576, 706717, 725615, 715782, 721391, 701848, 703546, 728281, 712239, 721788, 771237, 782370, 790143, 780213, 761739, 743699, 736890, 742936, 767960, 803441, 824668, 802991, 789010, 788050, 785667, 780521, 754336, 754562, 785647, 814463, 806211, 811446, 793607, 763650, 752192, 752859, 739197, 739990, 783253, 807299, 839130, 822603, 826606, 819296, 790137, 789190, 800830, 786419, 790814, 802362, 814126, 824042, 838117, 860041, 837567, 840012, 860161, 863446, 852296, 882587, 879030, 862922, 860143, 843436, 821824, 808849, 817362, 824390, 819219, 803072, 805022, 798349]
13563G98349j7804j8760l1850n033Q983J1031R116k2695l497M2925M3396Q553
13551H22714k121N564L018j6372r524J6762m627r916K289J3678n580r444j1562
13538G94879J2180K3655K2878J0164l6427k5976k0789N621J1792j2349J8134K9659
13526H33421K1541K343j6678n429q804J774K9141K2920J4427L1745M2240M1858
13514A010499M2266L6278K8835K0635N1907O8289N4058M1757N3379P2095P3619
13503A553617P3279O6497Q3602J3058K8026M9041L2789K8244o310n911K3649m1413
13491A898168n3104k7197n1973l3068m7984o9027l8764p3664o1706k3927N784
13480A423538k4425m0387R617L7434K1966L2607L3767N659L7835L9237K4083O3069
$$ y = [798349, 780545, 761785, 729935, 724902, 733885, 744916, 754032, 731337, 727840, 770765, 814161, 822714, 820593, 826157, 829175, 812803, 803279, 820041, 815414, 805498, 807787, 821465, 815885, 806441, 794879, 807059, 830714, 853592, 863756, 827329, 801353, 780564, 786185, 797977, 785628, 803762, 833421, 854962, 857305, 840627, 835198, 826394, 828168, 857309, 880229, 894656, 926401, 968641, 1010499, 1052765, 1089043, 1117878, 1138513, 1190420, 1258709, 1312767, 1354524, 1407903, 1479998, 1553617, 1626896, 1693393, 1776995, 1790053, 1818079, 1867120, 1899909, 1928153, 1921843, 1915932, 1939581, 1898168, 1845064, 1817867, 1765894, 1732826, 1684842, 1615815, 1577051, 1503387, 1441681, 1417754, 1423538, 1399113, 1358726, 1368343, 1405777, 1427743, 1460350, 1494117, 1499776, 1537611, 1576848, 1600931, 1664000]
13468A664000P3140K0929J0038Q185K8427K5724K8633L7369J6850N7714O3950
13457B034959L6522K7531J2836j6617l2973j9075m7833p6582q5385j01186r1886
13446A640311q2985r4580p9265n7488p9297m7981m2127N353k4722l2984p06J3618
13434A117147k1867m1481k7982k018k1413m9018j0292k403k8002j6286m477j0096
13422H81812m810r04j0845j3473q55o353j9975j877l7836k595o220j3723j7696
13409G44650L9003J3841m831m997K061j0742J0181J6859O215K2289K3725K2778
13397H81032r105j4727K5981K9342R917M218R591P722J6820N569R820j5303Q180
13384I69057N0533J963k4021k7388l671K0761r584l289m638n855j2454p915O866
$$ y = [1664000, 1737140, 1758069, 1768107, 1776292, 1804719, 1830443, 1859076, 1896445, 1913295, 1971009, 2034959, 2071481, 2099012, 2111848, 2095231, 2062258, 2043183, 1995350, 1918768, 1833383, 1732197, 1640311, 1557326, 1462746, 1383481, 1325993, 1246696, 1198715, 1156588, 1161941, 1137219, 1104235, 1103529, 1117147, 1095280, 1053799, 1025817, 1023799, 1002386, 953368, 943076, 940673, 912671, 896385, 891908, 881812, 877002, 876098, 865253, 851780, 850925, 844572, 824597, 822720, 784884, 782289, 776069, 762346, 744650, 783653, 797494, 792663, 787666, 789727, 778985, 789166, 806025, 812240, 834529, 858254, 881032, 871927, 857200, 883181, 912523, 922440, 926658, 936249, 943971, 960791, 966360, 976180, 960877, 969057, 1019590, 1021553, 997532, 970144, 966473, 987234, 977650, 974361, 969723, 963868, 951414, 943499, 950365]
13371I50365j3955L185O450j0298j8647j2108R14P014J4708K6864J2374J4127
13359I80993J9817K1524J8997L2935J6520l0430r750J9272R268J5245J8328K7657
13347A140376j5252L094K1607j6167k3045k4922j5569L4037J5001k377Q00m830
13335A112753Q720k1778M092K072q487k1925J2597R963m849j0348n306K1944J9216
13322A118664j749l0915k8922k2092l593k5288k835j3572K4656l792m6606k3108
13310I40848p822p814K7598J5947k1311l1642q80K3602p386q652K7942J8411k890
13297I65951j1Q885j0118J0330J8770j1418l823M72j5035J4221K194J8287N35
13284I99240k5471j3805j312j5415k2421J2664K2592k9523m7538j5176j369L6626
$$ y = [950365, 936410, 939595, 946045, 935747, 917100, 904992, 905906, 912920, 927628, 954492, 966866, 980993, 1000810, 1022334, 1041331, 1074266, 1090786, 1060356, 1050606, 1069878, 1079146, 1094391, 1112719, 1140376, 1125124, 1128218, 1149825, 1133658, 1110613, 1085691, 1070122, 1104159, 1119160, 1116783, 1117583, 1112753, 1121473, 1099695, 1103787, 1105859, 1097372, 1075447, 1088044, 1098007, 1093158, 1082810, 1077504, 1099448, 1118664, 1116915, 1086000, 1057078, 1034986, 1031393, 1006105, 1003270, 989698, 1014354, 1010562, 963956, 940848, 933026, 925212, 952810, 968757, 947446, 915804, 914924, 938526, 931140, 922488, 950430, 968841, 965951, 965940, 974825, 964707, 975037, 993807, 982389, 978566, 979038, 964003, 978224, 980418, 998705, 999240, 973769, 959964, 958652, 943237, 920816, 933480, 956072, 926549, 879011, 863835, 862466, 899092]
13272H99092J9075p075j3146J3741j2642k0141L054j6619j2866k9941K445K8604
13260H53581Q413m411j6438k0075J856M154P771j6561J720m586J8759K8824J3410
13247H76417K7064J466p944L149k7824j2762K9295J7828J7822o08J7251R31j7716
13234I24369o231L2629j91O164Q619M959j106M564P130k628k7318m3683j3021
13221H94256J6430P07j4698j9632J5063K6695L0111Q415m7404j9053K4535j3948
13209I01477L467J7045R876L917n886j8962k07M892K2548l0198K9976L7430l8136
13196I37239j0817L2769R151j3027j611l048j9510j0020J1776K3830m402j3875
13184I38455K903M3291M8517m139k370L2772K4877k6607K0340K2916J5802J2677
$$ y = [899092, 918167, 911092, 897946, 911687, 899045, 878904, 881958, 865339, 852473, 822532, 824977, 853581, 861994, 857583, 841145, 821070, 822926, 827080, 834851, 818290, 820010, 815424, 834183, 863007, 876417, 903481, 904947, 897003, 900152, 872328, 859566, 888861, 906689, 924511, 923903, 941154, 942085, 924369, 918138, 950767, 950576, 956740, 965359, 970318, 969212, 973776, 980906, 978278, 950960, 907277, 894256, 910686, 911393, 896695, 877063, 892126, 918821, 948932, 957347, 909943, 890890, 915425, 901477, 904944, 921989, 931865, 935782, 929896, 910934, 910727, 915619, 938167, 907969, 937945, 975375, 937239, 926422, 959191, 968342, 955315, 953704, 950656, 931146, 921126, 932902, 956732, 952330, 938455, 941358, 984649, 1033166, 1029027, 1026657, 1059429, 1084306, 1057699, 1078039, 1100955, 1116757, 1129434]
13172A129434M8921M4126N7409J30050K06190J87611P5388k0581j13859j44210
13162A600479j52305j52861q4098k2721j1316q698P363J9838J990r770j0921J7004
13150A193984J3889P77j6578N545j614n989m970K7471J9176K2774K7063J477r450
13137A273555J3432L9102L8724J9399k167L5337O2011P0872O7904Q9625J43123
13126A850917J95462K91620M17492N59566N84897M21407J43510j94096l79603
13117C891172m25770k93849j44531n4465J7032M6868k4193j29467j68181j74907
13107B539709j64195j67723j18739r6890r0598o6620m1393N374K1555K5899J3911
13096A860290N980J4318N2772K6477K9862M8038O9329O8825J00180O6023P6411
$$ y = [1129434, 1178355, 1222481, 1279890, 1409940, 1616130, 1803741, 1879129, 1858548, 1744689, 1600479, 1448174, 1295313, 1211215, 1188494, 1177178, 1168480, 1175843, 1195681, 1197671, 1187901, 1176980, 1193984, 1207873, 1208650, 1192072, 1197617, 1196003, 1190014, 1185044, 1212515, 1231691, 1254465, 1281528, 1283005, 1273555, 1286987, 1326089, 1364813, 1384212, 1382045, 1417382, 1479393, 1550265, 1618169, 1707794, 1850917, 2046379, 2337999, 2755491, 3315057, 3899954, 4321361, 4464871, 4270775, 3891172, 3465402, 3171553, 3027022, 2972557, 2989589, 3036457, 3012264, 2882797, 2714616, 2539709, 2375514, 2207791, 2089052, 1992162, 1901564, 1834944, 1793551, 1798925, 1820480, 1846379, 1860290, 1866270, 1880588, 1933360, 1959837, 1989699, 2037737, 2107066, 2175891, 2276071, 2342094, 2418505]
13085B418505P0834J15690J74130J77574J63924J98612K83715M13387M70350L85788
13075D872509Q8860k52864m76920n53381m92303l96874k43871j96543j06252k6441
13065B215920k3355j2964q543j502N8840Q0256Q8426J21822J44998J86240J76264
13054C026402J90913K32733K39103J63040M3162q6117j78405k33792k80404l02819
13044B813816k52248j92286j65746j00352o6476o3669n9723q440M7840N4978R6744
13033B104438J41914J91544J75415O8087m5329j21984j90395j95967j32761p6454
13023A918508q5735n3016l7248k8621k6371k1842l5190k10j2715j4509Q08j4154
13011A589705j058K1732J5686P522K480J5489J2246j4131j0341j5379J4820J9528
$$ y = [2418505, 2489339, 2605029, 2779159, 2956733, 3120657, 3319269, 3602984, 4016371, 4486721, 4872509, 4961369, 4708505, 4231585, 3678204, 3185901, 2789027, 2545156, 2348613, 2242361, 2215920, 2192565, 2179601, 2171058, 2169556, 2228396, 2308652, 2397078, 2518900, 2663898, 2850138, 3026402, 3217315, 3450048, 3689151, 3852191, 3895353, 3809236, 3630831, 3397039, 3116635, 2813816, 2561568, 2369282, 2203536, 2103184, 2036708, 1973039, 1913316, 1904876, 1952716, 2007694, 2104438, 2246352, 2437896, 2613311, 2681398, 2636069, 2514085, 2323690, 2127723, 1994962, 1918508, 1832773, 1779757, 1742509, 1713888, 1687517, 1665675, 1630485, 1630275, 1617560, 1603051, 1603859, 1589705, 1588647, 1610379, 1626065, 1633587, 1636067, 1651556, 1663802, 1649671, 1639330, 1623951, 1638771, 1658299]
12999A658299R982P776Q363L7552J3231J763p993j2913j422L0183j0137m1716
12987A692968J375K526q119l0339j5960p496n690J8857J7192l3197j5626o342
12975A610149K7564J6037R344k501j1967j9477K2668K6089L1197K9552L9038L0757
12963A808450K9302N504K1928M8299K9402L8964M4476N3007O1969J6045L9382
12952B196728N7736O4211P4433J07108J09110J40039J62230J97078K54074L35935
12942C698682L69657L81339M23922M24613L51009K27943K5661j56500l11375m36072
12932D998879m76448m59695m45260l62126k58489k26858j60272j25168r7398o6633
12922B320532n2607n1367m6344l0156j2968M521j8725J0181k0346k5833L119K512
$$ y = [1658299, 1668281, 1676057, 1684420, 1721972, 1735203, 1736966, 1728973, 1716060, 1714638, 1744821, 1734684, 1692968, 1694343, 1696869, 1688750, 1658411, 1642451, 1634955, 1629265, 1648122, 1665314, 1632117, 1616491, 1610149, 1637713, 1653750, 1663094, 1660593, 1648626, 1629149, 1651817, 1677906, 1709103, 1738655, 1777693, 1808450, 1837752, 1843256, 1865184, 1913483, 1942885, 1981849, 2026325, 2079332, 2141301, 2157346, 2196728, 2254464, 2318675, 2393108, 2500216, 2609326, 2749365, 2911595, 3108673, 3362747, 3698682, 4068339, 4449678, 4873600, 5298213, 5649222, 5877165, 5902826, 5746326, 5434951, 4998879, 4522431, 4062736, 3617476, 3255350, 2996861, 2770003, 2609731, 2484563, 2387165, 2320532, 2267925, 2216558, 2170214, 2140058, 2127090, 2131611, 2112886, 2123067, 2102721, 2076888, 2080007, 2082519]
12910B082519M061j707n7708k3153L8323J2136J300K0867j6058k7484n706J2770
12898B040160K190K1752N052K2838K0497O824P177J615j0103j4898K0764K5483
12886B149351M4874j779K9196M5731m844R632p634j2153k9539J840Q183N05j7923
12873B215440k4579K0145P907l02l3872l1813k143K9531R853J0699L565K920K0519
12860B227870K4203J2420J7704O7042Q4272Q2057R6021R2627R8352K8359k5823
12849B805104n5772m9158p9311l4641k218k1591l3054p022K8987K1136L5798K0693
12837B628951K8315M8991M6234N9895Q8886Q6574J16622J07746R4931J34017J59497
12826C600659K00966K77415L33079L71757L82576M49202M95773N37402N78659
$$ y = [2082519, 2086580, 2084873, 2027165, 2004012, 2042335, 2054471, 2055771, 2076638, 2060580, 2033096, 2027390, 2040160, 2042350, 2064102, 2069154, 2091992, 2112489, 2119313, 2126490, 2128105, 2118002, 2103104, 2123868, 2149351, 2194225, 2192446, 2221642, 2267373, 2262529, 2272161, 2264527, 2252374, 2222835, 2224675, 2232858, 2233363, 2215440, 2190861, 2211006, 2218913, 2218611, 2184739, 2152926, 2150783, 2180314, 2190167, 2200866, 2204431, 2207351, 2227870, 2252073, 2264493, 2282197, 2349239, 2433511, 2515568, 2611589, 2704216, 2802568, 2830927, 2805104, 2749332, 2700174, 2620863, 2586222, 2584004, 2562413, 2529359, 2522337, 2551324, 2572460, 2608258, 2628951, 2657266, 2706257, 2752491, 2812386, 2901272, 2987846, 3104468, 3212214, 3307145, 3441162, 3600659, 3801625, 4079040, 4412119, 4783876, 5166452, 5615654, 6111427, 6648829, 7227488]
12817G227488N51864M84439L13552Q4096j76038l94199n81492o74453o43835n52701
12807E638721m82793l81914l06644k48059j84746j41352j12275q0497l1091n4012
12797C615338o7935j2130L5966N6395R5126J34441J43052Q8215M5010N4104q852
12786D178730m6700r4245j08741q7564p3192p4590m2029m1723j1280n907Q978
12775C601737L9867K3966K3354K5636j360J6242M4371Q657J4957M4164L5228L1664
12763C908483N1590Q0912Q0616N7288N1015M7278P5370N5599K8463R102j1604
12752D434112O460J1582o074J8916O505l924p792J1589r809K6100L6617J4620
12740D538902K747R777M4906P4495P6352O1842L8283L7492N1642Q0603P1994R6250
$$ y = [7227488, 7779352, 8263791, 8577343, 8661439, 8485401, 8091202, 7509710, 6835257, 6191422, 5638721, 5155928, 4774014, 4467370, 4219311, 4034565, 3893213, 3780938, 3700441, 3669350, 3615338, 3547403, 3535273, 3571239, 3627634, 3722760, 3857201, 4000253, 4088468, 4133478, 4187582, 4178730, 4132030, 4037785, 3929044, 3841480, 3768288, 3693698, 3651669, 3609946, 3598666, 3592759, 3601737, 3641604, 3665570, 3688924, 3714560, 3713200, 3729442, 3773813, 3782470, 3797427, 3841591, 3876819, 3908483, 3960073, 4040985, 4121601, 4178889, 4229904, 4277182, 4352552, 4408151, 4436614, 4445716, 4434112, 4440572, 4452154, 4446080, 4464996, 4471501, 4467577, 4459785, 4471374, 4461565, 4487665, 4524282, 4538902, 4541649, 4551426, 4596332, 4670827, 4747179, 4809021, 4847304, 4884796, 4936438, 5017041, 5089035, 5185285]
12728E185285J02619J00742P2933O5291N8277M4913K6756K7012M8848M8919O7600
12717E849195Q1153Q3647P7166J00642O2800Q7656J05785J13985J23017J02028
12707F787074J13757J47442J29876J05507J30760J28786K01460K18302K24512
12698H187476K07647K22672K16967K20734K56023K57768K89533L37231L42581
12689A0538632L90363M14513M30319M81874N80865O54071P17163Q19304R36602
12680A5963706J054560J202592J347845J466698J689267J957850K357504K894414
12672B9934436L605566M559221N870241P623644J0000166J3227503J7319941K1732240
12664A13872958K4660623K3234326J5720745L804653q540234j7623755k1345652
$$ y = [5185285, 5287904, 5388646, 5461579, 5526870, 5585147, 5630060, 5656816, 5683828, 5732676, 5781595, 5849195, 5930348, 6013995, 6091161, 6191803, 6254603, 6342259, 6448044, 6562029, 6685046, 6787074, 6900831, 7048273, 7178149, 7283656, 7414416, 7543202, 7744662, 7962964, 8187476, 8395123, 8617795, 8834762, 9055496, 9311519, 9569287, 9858820, 10196051, 10538632, 10928995, 11343508, 11773827, 12255701, 12836566, 13490637, 14207800, 15027104, 15963706, 17018266, 18220858, 19568703, 21035401, 22724668, 24682518, 27040022, 29934436, 33540002, 38099223, 43969464, 51593108, 61593274, 74820777, 92140718, 113872958, 138533581, 161767907, 177488652, 181293305, 172753071, 155129316, 133783664]
12657A33783664k0391675j6797779j2414772q228573m607703j594007Q96173L035879
12649G3681207M897334O436846P417503P583048P236262P021327P755891R853797
12641A31883215J2965492J6341978J9237971K1535573K3947991K7699259L3434903
12634B87046382L9819381M2559571L7729269K6658660J4384183M729219k919943
12627D50006722r793954j6269930k1799164k4956972k6726554k9166508l2457898
12620B88835742l4641672l3966362k9854152k3500299j6963685j1777037q580126
12613A29552409p126821o412322n603895m290954k376772Q2299L064841O840442
12605A13729227J1706953J7588337K3434815K7090394K5773061J7251087K359546
$$ y = [133783664, 113391989, 96594210, 84179438, 75950865, 71343162, 69749155, 70645328, 73681207, 78578541, 85015387, 92432890, 100015938, 107252200, 114273527, 122029418, 131883215, 144848707, 161190685, 180428656, 201964229, 225912220, 253611479, 287046382, 326865763, 369425334, 407154603, 433813263, 448197446, 452926665, 450006722, 440212768, 423942838, 402143674, 377186702, 350460148, 321293640, 288835742, 254194070, 220227708, 190373556, 166873257, 149909572, 138132535, 129552409, 122425588, 116013266, 110409371, 106118417, 103741645, 103823944, 106888785, 113729227, 125436180, 143024517, 166459332, 193549726, 219322787, 236573874, 238933420]
12598B38933420j3878362k6236645l1985677l1149381k6354849k0618814j5474642
12591G3235050j1261434q036670n724946m126018l034211k233517j697908j387682
12583C5732664j251666j220156j289160j392163j461695j587093j617044j595245
12575B4318442j475236j323686j191403j010935q77597p78804o93824o65283o99930
12566A5601744p59325p68949p59674p75997q03008p54848o93898o65478n76530
12557I044037n32188m92115m55433m12468l76542l41121k77344k06273j59588
12548E790965j27802j50992j36659j33357j00850j26178j36594j15801j16119
12539D646613r8554r3262j09794j03765q6070r9460j30798j21668j19949j43043
$$ y = [238933420, 225055058, 198818413, 166832736, 135683355, 109328506, 88709692, 73235050, 61973616, 53936946, 48212000, 44085982, 41051771, 38818254, 37120346, 35732664, 34480998, 33260842, 31971682, 30579519, 29117824, 27530731, 25913687, 24318442, 22843206, 21519520, 20328117, 19317182, 18439585, 17660781, 16966957, 16301674, 15601744, 14842419, 14073470, 13313796, 12537799, 11734791, 10979943, 10286045, 9620567, 9044037, 8511849, 8019734, 7564301, 7151833, 6775291, 6434170, 6156826, 5950553, 5790965, 5663163, 5512171, 5375512, 5242155, 5141305, 5015127, 4878533, 4762732, 4646613, 4548059, 4454797, 4345003, 4241238, 4155168, 4055708, 3924910, 3803242, 3683293, 3540250]
12529C540250j11361j11969j07690n7974o7503o3765p9777q0547j02187j03011
12519B654466n7811m2560k7549l7613J592J1245m263J2107K6270M5960O5154M8392
12507B695390L2219J9410K0313K6328J5469j5047m9714m6941o6977k5799k3359
12496B581292k6598l3806l8497O397J0162K7577K6797n30K5394K0126K4925O4167
12484B687406Q1341J06865J45336J91539J91998J38791J11214L7749j01155j69548
12474C421536k14979k38222j94382j54836q2061n7178k7297J4134M5305O0781
12464B572801K9949K9380M4377M5788O1451R0167J01789J19304Q0285M9280p330
12453C217241J55K9085L7455N3650J1818n2064q4780j04281q3655r5707r6387
$$ y = [3540250, 3428889, 3316920, 3209230, 3151256, 3083753, 3019988, 2940211, 2859664, 2757477, 2654466, 2596655, 2554095, 2526546, 2488933, 2490525, 2501770, 2497507, 2509614, 2535884, 2581844, 2646998, 2695390, 2727609, 2747019, 2767332, 2793660, 2809129, 2794082, 2744368, 2697427, 2630450, 2604651, 2581292, 2554694, 2520888, 2482391, 2488788, 2498950, 2526527, 2553324, 2552794, 2578188, 2598314, 2623239, 2687406, 2768747, 2875612, 3020948, 3212487, 3404485, 3543276, 3654490, 3692239, 3591084, 3421536, 3206557, 2968335, 2773953, 2619117, 2537056, 2479878, 2452581, 2466715, 2512020, 2572801, 2602750, 2632130, 2676507, 2722295, 2783746, 2873913, 2975702, 3095006, 3175291, 3224571, 3217241, 3217396, 3246481, 3283936, 3337586, 3349404, 3297340, 3212560, 3108279, 3024624, 2928917, 2832530]
12442B832530j6452J04246K03885L74851N88700O74488N48913K86319l4593l48881
12432E214006m81335m67647l53889k31235j33490l1587J9556M9446J05480J18685
12422C807990J36671J68633J32906Q8713J15462Q6748P1187N4447N5002P9611
12412D797370L4715o453J5601J35441L09715L16533J94856l5761k60600l82750
12402E118667l94233l37774k41535k01350j25091o4710r4428r3284j08892j49798
12392C307572j25194j10782j36635j47835j42583j36276j02796m2725l5017P6849
12382B404578J38467K14802L70290N12160O16707N56068L05650o2238m07716o32874
12372D015894o57332n57037m00831k64202j95591j44362q7443n1544o197K2522
$$ y = [2832530, 2816078, 2920324, 3124209, 3499060, 4087760, 4762248, 5311161, 5597480, 5562887, 5214006, 4732671, 4265024, 3911135, 3679900, 3546410, 3514823, 3534379, 3583825, 3689305, 3807990, 3944661, 4113294, 4246200, 4334913, 4450375, 4537123, 4608310, 4662757, 4717759, 4797370, 4832085, 4825632, 4841233, 4976674, 5286389, 5602922, 5797778, 5762017, 5501417, 5118667, 4724434, 4386660, 4145125, 3943775, 3818684, 3753974, 3659546, 3566262, 3457370, 3307572, 3182378, 3071596, 2934961, 2787126, 2644543, 2508267, 2405471, 2362746, 2327729, 2404578, 2543045, 2757847, 3128137, 3640297, 4257004, 4813072, 5118722, 5056484, 4648768, 4015894, 3358562, 2801525, 2400694, 2136492, 1940901, 1796539, 1709096, 1657552, 1651355, 1673877]
12362A673877L4242J7680k6481m3181p5718p6816n4724o2133l0371l2030l4984
12351A289361j9705q809j1447M024K9M953J1907J1334j7966j1764L5219K3584
12339A310720J2494K1891J5178K8821L4174N992N6224O0002K4905M9348N5759
12328A675508N5463j1207j7563k3434j3012k200n129k2383l2642k5001J0005J8522
12316A606927K3620J0272Q60l33K752K1603P116J4156O878J89K3798L4329O6837
12303A819004R5402J01945J55404J86141J49206J57701J30893R2648P6127L9035
12293C003506k7672q7281p7870j14951j19157j18982j61650q4231l8737m7962
12283B125013n6793k9464J6748J6778k1334J6373L6984K2669J4665L2411j97Q273
$$ y = [1673877, 1708119, 1725799, 1699318, 1656137, 1580419, 1503603, 1448879, 1386746, 1356375, 1324345, 1289361, 1269656, 1260847, 1249400, 1253424, 1253453, 1258406, 1270313, 1281647, 1263681, 1251917, 1287136, 1310720, 1323214, 1345105, 1360283, 1389104, 1423278, 1429270, 1485494, 1545496, 1570401, 1619749, 1675508, 1730971, 1719764, 1702201, 1678767, 1665755, 1663555, 1658426, 1636043, 1603401, 1578400, 1588405, 1606927, 1630547, 1640819, 1641679, 1641346, 1644098, 1665701, 1672817, 1686973, 1693851, 1694040, 1717838, 1752167, 1819004, 1914406, 2016351, 2171755, 2357896, 2507102, 2664803, 2795696, 2888344, 2964471, 3003506, 2975834, 2888553, 2810683, 2695732, 2576575, 2457593, 2295943, 2211712, 2172975, 2125013, 2068220, 2038756, 2055504, 2072282, 2050948, 2067321, 2104305, 2126974, 2141639, 2174050, 2173853, 2182126]
12271B182126O7509L3771K8034L1735O1802M6107K986J2034J7927J7092J8918
12260B520041j5580J9709M4315L9498L7245L0307L348K4265o45q340j282K5090
12248B717971K1508J9778M0597L9750M6358M0601M0691N5831R3435Q6797J04275
12237C307592Q1025J8782N7460O1400M7270M4573M9830K4076N8464O2082P9112
12226C891666Q0747P5510P8079J07130J05642J09369Q2438Q6916Q8863J18311
12216D824671J32210J07177Q9535J01476J55944J90258K09005K15133K52121K70966
12206F548496K82520L09843L47265M13239M35506M46997M44427M57995M79384
12197A0165672M76340M77052M72192M87428N21446N79536O47504P71923R13980
$$ y = [2182126, 2249635, 2283406, 2311440, 2343175, 2404977, 2451084, 2454070, 2466104, 2484031, 2501123, 2520041, 2504461, 2524170, 2568485, 2607983, 2645228, 2675535, 2678883, 2703148, 2702503, 2694163, 2692881, 2717971, 2739479, 2759257, 2799854, 2839604, 2885962, 2926563, 2967254, 3023085, 3116520, 3203317, 3307592, 3388617, 3407399, 3464859, 3526259, 3573529, 3618102, 3667932, 3692008, 3750472, 3812554, 3891666, 3972413, 4047923, 4126002, 4233132, 4338774, 4448143, 4530581, 4617497, 4706360, 4824671, 4956881, 5064058, 5153593, 5255069, 5411013, 5601271, 5810276, 6025409, 6277530, 6548496, 6831016, 7140859, 7488124, 7901363, 8336869, 8783866, 9228293, 9686288, 10165672, 10642012, 11119064, 11591256, 12078684, 12600130, 13179666, 13827170, 14599093, 15513073]
12188A5513073J094192J325538J601877J974197K454702L004327L691769M545830
12180C5205505N676202P301464R617978J2828511J7185623K2498575K7670029
12173A37983887L0369859K7520147J7862557L413943j1388015k2384364k7205882
12166A56172132k6276384k1850745j6026919j0496839n812699k191333L56761
12159G3873974J799737K040790J415157O25931M89866J429939L356146N830751
12151I0862291Q117348R240892Q636453O444987L630679J898295K554486N769173
12143A37154604J0700966J5663173J8551587J7712894J2599080M632130l613258
12136B13401176r907895j3450605j4761573j5002613j5077924j4943835j4047429
$$ y = [15513073, 16607265, 17932803, 19534680, 21508877, 23963579, 26967906, 30659675, 35205505, 40881707, 48183171, 57801149, 70629660, 87815283, 110313858, 137983887, 168353746, 195873893, 213736450, 217150393, 205762378, 183378014, 156172132, 129895748, 108045003, 92018084, 81521245, 75708546, 73517213, 73873974, 75673711, 77714501, 79129658, 79755589, 80245455, 81675394, 85031540, 90862291, 98979639, 108220531, 116856984, 123301971, 126932650, 128830945, 131385431, 137154604, 147855570, 163518743, 182070330, 199783224, 212382304, 217014434, 213401176, 203493281, 190042676, 175281103, 160278490, 145200566, 130256731, 116209302]
12129A16209302j2222481r754563p000316m632887l197247k840872l290126l849991
12121F9420819l860569l004331j426210O00311K699383M975967P582538J0542585
12113H7530493J3921927J7479490K0078722J9530110J3856108L495245q298455
12106A67593640j7852297k2715221k2702697j9635814j5634153j1828359q672479
12099D8552620o216796m501845l360105k602566k052845j635529j287942j037136
12091B5857856q75037q37750q02944p63411p86960p67763o79311n55228m14423
12082A9375029k70362k17597j90718j68948j96984l15817m37657n58139n95107
12073A6423700n73455n03893l79228k02562o9866K0292L8273j0232o9365j60265
$$ y = [116209302, 103986821, 94232258, 87231942, 82599055, 79401808, 76560936, 73270810, 69420819, 65560250, 62555919, 61129709, 61730020, 64429403, 69405370, 76987908, 87530493, 101452420, 118931910, 139010632, 158540742, 172396850, 175892095, 167593640, 149741343, 127026122, 104323425, 84687611, 69053458, 57225099, 48552620, 42335824, 37833979, 34473874, 31871308, 29818463, 28182934, 26894992, 25857856, 24982819, 24145069, 23342125, 22578714, 21791754, 21023991, 20344680, 19789452, 19375029, 19104667, 18887070, 18696352, 18527404, 18330420, 18014603, 17576946, 17018807, 16423700, 15850245, 15346352, 14967124, 14764562, 14694696, 14714988, 14753261, 14743029, 14673664, 14513399]
12063A4513399k78473m02536m36532m43435l91865l48501l08618k65735k16091
12054A1421613j83793j98092k03195j90366j93420k43021l18062k85930k98582
12045I307152l86207l95045m17260l97943l80454l56819l12401k73462k30905
12036F156656k00684j88028j76832j63571j58858j66366j57317j60674j15608
12027D668718j22889j19281j04300p0984l2630j5361k6002l1894k7062l7325p5630
12016D005360r8438j75541k04304j71949j80169j70984j80067j41482j09537r2132
12006B480757j22934q8551p8427m5918m3870o6414l9627j0433n2941p4426n1716
11995A805500m2089m1143j1572J0117k2439j7314l894P939j827m0470n2928q5721
$$ y = [14513399, 14234926, 13832390, 13395858, 12952423, 12560558, 12212057, 11903439, 11637704, 11421613, 11237820, 11039728, 10836533, 10646167, 10452747, 10209726, 9891664, 9605734, 9307152, 8920945, 8525900, 8108640, 7710697, 7330243, 6973424, 6661023, 6387561, 6156656, 5955972, 5767944, 5591112, 5427541, 5268683, 5102317, 4945000, 4784326, 4668718, 4545829, 4426548, 4322248, 4251264, 4218634, 4203273, 4177271, 4145377, 4118315, 4080990, 4005360, 3906922, 3731381, 3527077, 3355128, 3174959, 3003975, 2823908, 2682426, 2572889, 2480757, 2357823, 2269272, 2190845, 2144927, 2101057, 2034643, 1995016, 1984583, 1931642, 1857216, 1805500, 1763411, 1722268, 1710696, 1720813, 1698374, 1681060, 1677166, 1685105, 1683278, 1642808, 1589880, 1504159]
11983A504159j13682j22295j24989j01255p3186k607L0078N2833L8601M1491K4966
11972A154114O648j5107l6405q228K1224J889j8111j6073n470m93l2865m6203
11960A004920l9284k0293k3675m379L3540J1247J1689m2132k4121k2015N581Q927
11948I00005L2630P7315R5233J28272J08346R1280J08034J04966J01958P8681
11938A826720N0437L8967K8288L1000R641k2533J1904L3879n22j7270K4393J3196
11926B028100k9893k4814j4071k9243l7698k4767j8774j5238Q387M6800P1779
11915A960568O5898R7229Q6225M2271K2296K7374L9143J9861l8619o7530j7722
11904B236994M2338L3789k2332m0983m3383m4904q290k0338l9053k0025j5066
$$ y = [1504159, 1390477, 1268182, 1143193, 1041938, 968752, 966145, 996223, 1049056, 1087657, 1129148, 1154114, 1160762, 1145655, 1109250, 1101022, 1122246, 1124135, 1106024, 1089951, 1084481, 1083988, 1051123, 1004920, 965636, 945343, 921668, 917289, 950829, 962076, 973765, 931633, 907512, 885497, 891078, 900005, 932635, 1009950, 1105183, 1233455, 1341801, 1433081, 1541115, 1646081, 1748039, 1826720, 1877157, 1916124, 1944412, 1975412, 1985053, 1962520, 1974424, 2008303, 2007781, 1990511, 2014904, 2028100, 1998207, 1973393, 1959322, 1930079, 1892381, 1867614, 1848840, 1833602, 1841989, 1888789, 1960568, 2026466, 2123695, 2209920, 2252191, 2274487, 2301861, 2341004, 2360865, 2322246, 2254716, 2236994, 2279332, 2313121, 2290789, 2249806, 2206423, 2161519, 2153229, 2132891, 2093838, 2073813, 2058747]
11893B058747j0267k2147m6262p0226l9931l754l365O060J8894J1708J1330j8200
11881A892587m7559m4207l6112k5231l7642m3205m6400k0564k0900o2909n0848
11870A457010K838k7047n0547n5465l3846l860l8278m1210k9890j4936l2071l0116
11858A102582n172k096k2723k3521p152J765P224L263j4504k0554k989R138k3421
11845A001840j7723j4111l3525m3551m9351q3071o0606j771P979j4058J081J6692
11833G09825l174k105L682k4429k731m691j5824k2135j2322M051j2076O901R063
11820F34035l2182l1307K222k3404j7492j1165k1184P75J5571K828j5105o649
11808D96943k4413k2523R15K020J6939L833k0173j0112J4527r495l1044j0289
$$ y = [2058747, 2048480, 2026333, 1980071, 1909845, 1869914, 1866160, 1862795, 1868855, 1887749, 1899457, 1910787, 1892587, 1845028, 1800821, 1764709, 1739478, 1701836, 1658631, 1612231, 1591667, 1570767, 1507858, 1457010, 1459848, 1432801, 1382254, 1326789, 1292943, 1289083, 1250805, 1209595, 1179705, 1164769, 1132698, 1102582, 1097410, 1095314, 1072591, 1049070, 1041918, 1043683, 1050907, 1054170, 1039666, 1019112, 1016123, 1025261, 1001840, 984117, 970006, 936481, 892930, 843579, 760508, 699902, 698131, 706110, 692052, 693133, 709825, 706651, 704546, 708228, 683799, 681068, 676377, 660553, 638418, 626096, 630147, 618071, 624972, 634035, 601853, 570546, 572768, 549364, 531872, 520707, 499523, 500298, 515869, 518697, 503592, 496943, 472530, 450007, 450922, 452942, 469881, 473714, 453541, 443429, 457956, 448461, 417417, 407128]
11796D07128L391k160n843K6283o682j2788j8297o058m109k729j8315k138j0059
11783C47624M898l652o832m5976l1848J0599p283k0713m978L0778k717m9901k9125
11770A90874J4000R798R312j1979q138j967k7147k8282l1510N687J4134J6728
11758A51510k5054p430j4921J5270l449K5702J2616l032M5884o066K548J7176
11746B10754M7123L4680L1580M4666L8649O2488J14212J16639J06647P9173P5817
11735I62428L7837l4370o1528q0288j29196j29305r5400r1333o6758n0893j8189
11724B43005J9737L7307J1234L224l004k079N43L9175M3734O3798L7791L4765
11712E29230M8268M2727L7149N2427N1427M5850P0795P3468O2908m320n1170m6724
$$ y = [407128, 410519, 408359, 402516, 428799, 422117, 409329, 391032, 384974, 380865, 378136, 359821, 357683, 347624, 352522, 348870, 342038, 296062, 264214, 274813, 267530, 246817, 241839, 272617, 269900, 219999, 190874, 204874, 214672, 223984, 212005, 203867, 201900, 174753, 146471, 114961, 120648, 134782, 151510, 126456, 119026, 104105, 119375, 115926, 141628, 154244, 151212, 197096, 191030, 193578, 210754, 257877, 292557, 324137, 368803, 407452, 469940, 584152, 700791, 807438, 886611, 962428, 1000265, 965895, 904367, 824079, 694883, 565578, 470178, 378845, 312087, 261194, 243005, 262742, 300049, 311283, 314507, 311503, 309424, 309967, 349142, 392876, 456674, 494465, 529230, 577498, 620225, 657374, 709801, 761228, 807078, 877873, 951341, 1014249, 1009929, 958759, 912035]
11700I12035k8928n2733n5541k9778m8159m2389m8278n8140o6273o3449j2913
11689D05454k632l1154k2506r770l0405k9447j804M382J9398O1562L8292L8144
11677D39514J20297J19853J08542P2716J4115j9918m6077r0762j02332j29397
11667D86551r4388o8011o4929n2938k3311k0617j3721k3588l1388k9596N347J736
11655G1147j918j9743n164J2310J9910K566r24o682N774O150j4244k2944L0703
11642G6941j10j5862l490O701P038P104Q780r414k1475J4055J7087K8022L2874
11629A48251L0787M659j7076J1064J5619j4923r981l660p660k9746N43q33M195
11616A31239o757k2092k6957J405o225l0019k7748j5347K4043J1213K1437P498
$$ y = [912035, 883107, 830374, 774833, 745055, 696896, 654507, 606229, 548089, 481816, 418367, 405454, 402822, 371668, 349162, 339392, 308987, 279540, 277736, 282118, 301516, 363078, 401370, 439514, 559811, 679664, 788206, 860922, 875037, 855119, 809042, 718280, 615948, 486551, 392163, 324152, 259223, 206285, 182974, 162357, 148636, 125048, 93660, 64064, 69411, 71147, 69229, 49486, 44322, 56632, 76542, 79108, 78184, 71502, 77276, 83426, 69182, 46238, 76941, 76831, 60969, 57479, 64180, 71218, 78322, 87102, 77688, 56213, 70268, 87355, 115377, 148251, 179038, 183697, 166621, 177685, 193304, 178381, 168400, 164740, 157080, 127334, 127877, 127044, 131239, 124482, 102390, 75433, 76838, 70613, 40594, 12846, -2501, 21542, 32755, 54192, 61690]
11604F1690k3569k0591l3756j8774Q338J4232P084K0207k3461K642L0121k548
11592B1615k8745m620m084l3946R683K9169K9679l062l548j8167k4824Q457J1843
11579a0550n275j6612J0266J0323L3557M661R002J155l4145k579P900j6964K5899
11566A6638M1806J6935K715K2393k49k2750J1696J6288J10J2035n584k2442k1810
11553F7781j2234N598K9748j4559q469j9531J3447L6988j7882l3411j4642k5683
11541G151L553K4203J3036j803o832p478k2834k553j1209p995J6051M4779n930
11528D2139k2050q234o913k8481l7815k3619L0759M1497L3163j746Q090n750N087
11515B6127j4162j7310K7867k4695k3813J6998K1932l489j9315J6225l339L205
$$ y = [61690, 38121, 17530, -16226, -35000, -26662, -12430, -5346, 14861, -8600, -5958, 24163, 21615, -7130, -11750, -15834, -49780, -40097, -10928, 18751, 15689, 12141, -6026, -30850, -22393, -10550, -15825, -32437, -22171, -11848, 21709, 26370, 35372, 36527, 2382, -197, 7703, -9261, 16638, 58444, 75379, 78094, 100487, 100238, 77488, 89184, 105472, 105582, 117617, 112033, 89591, 67781, 55547, 61145, 90893, 76334, 67865, 48334, 61781, 98769, 80887, 47476, 32834, 7151, 10704, 34907, 47943, 46140, 39308, 31830, 8996, 6443, -4766, -12761, 3290, 48069, 42139, 20089, 11855, 4942, -23539, -61354, -84973, -54214, -12717, 20446, 18700, 26790, 21040, 26127, 11965, -5345, 22522, -2173, -25986, -8988, 12944, 9455, -9860, 6365, 3026, 6231]
11503F231J0030J9765j2314J7135J5078m9430k7501j5979J7400j3391k2919k1488
11491g7383L893K2405L3160m517J6675q421k2527P246J3144j7113J6787k157K7687
11478H879Q629r053L531J0478k1091j3124J4057K669o564j1266k1681k951L4061
11465c426L9620P627K027j7230j5220k1336R016J0046l113J9644P782j2111l069
11452B0257K4980l867J685j4452m1799J4208O208k068j8121r144j0401K4010K3289
11439A4785O372n139q066J7989K4390L0363L0596J0670l1833k9164n132j3227
11427D2604K2856J5033J9480j6691k5182J9699K6790O897r149N731n875j4703
11415H7490l6073L679L5907J9063k0150j3386j9130J738l994M825J2838R9o710
$$ y = [6231, 16261, 36026, 23712, 40847, 55925, 6495, -21006, -36985, -19585, -32976, -55895, -77383, -73490, -51085, -17925, -22442, -5767, -14188, -36715, -29469, -16325, -33438, -16651, -18808, 8879, 17508, 8455, 11986, 22464, 1373, -11751, 2306, 4975, -1589, -12855, -34536, -37487, -3426, 36194, 43821, 45848, 28618, 13398, -7938, 1078, 11124, 8011, 27655, 35437, 23326, 20257, 45237, 41370, 43055, 28603, -13196, 1012, 7220, 5152, -12969, -22113, -32514, -8504, 14785, 21157, 16018, 7952, 25941, 50331, 80694, 111290, 121960, 90127, 60963, 55831, 42604, 65460, 80493, 99973, 83282, 58100, 77799, 104589, 111486, 102337, 108068, 102193, 87490, 51417, 55096, 91003, 110066, 89916, 76530, 57400, 59138, 55144, 59969, 72807, 72906, 66196]
11402F6196j0787k261k0159k9928L48L2491R625K0674L0197J966R075J1757m2590
11389G6604J4247K5245l554J871K0439j1147k9902l6066J4898K0155j3618q965
11377G0207n608o116J0435q398J2109M141l840P836K80Q257L9829L4618k0710
11364A43040r920J3100K2550k5157K1349J2667k7656m1070j4509K9718J6513R972
11352A50597M753j6907j2860J2979j839N240n389j4819j3276J897j4539j6876
11340G8961J4181K6490J7288j7095r763O800k9132j3107n177k3379q866K3219
11328F0420K4424R205l783o918K0720R550l574j1437k8463k207K8105J7384m44
11315A12982K4949j356k0300o898k209r522L573k2672N67K6095K2058M340p766
$$ y = [66196, 55409, 53148, 32989, 3061, 3409, 35900, 45525, 66199, 96396, 98362, 107437, 119194, 76604, 90851, 116096, 112542, 114413, 134852, 123705, 93803, 57737, 72635, 92790, 79172, 70207, 64599, 58483, 68918, 60520, 72629, 76770, 72930, 80766, 81046, 89303, 129132, 163750, 143040, 133120, 146220, 168770, 143613, 164962, 177629, 149973, 108903, 94394, 124112, 140625, 150597, 155350, 138443, 125583, 138562, 136723, 141963, 136574, 121755, 108479, 110376, 95837, 78961, 93142, 119632, 136920, 119825, 110062, 116862, 87730, 74623, 69446, 46067, 37201, 60420, 84844, 94049, 90266, 83348, 104068, 113618, 110044, 98607, 70144, 67937, 96042, 113426, 112982, 137931, 136575, 116275, 109377, 107168, 97646, 101219, 78547, 79114, 105209, 127267, 131607, 123841]
11302A23841m5726p412K6758J1474o350l1585j8786K5948m006j0794o604K0753
11290G7511M380J4804K1502O697l183k8008l7481q3L8584P644j2836p666O301
11277H8166l683Q662J8554l333k9785N867j841J0425J214J9569K8159k2970j0260
11264A08744j6824K4J6453J2809J6647l733l1411q621l5617J9299K7344j6694
11252H8420P375J0775p043l048L0130J6189J1982N408j1723j1438j8203j3414
11240A05410k465J5969j3114j4707J0000k737k475l951P780L188N070l224J2169
11227A16913n918j2158n077o729j6689n094K3708K4706j1174o98J4425P43r983
11214A06975J7853J964K8390R935J8832J897m4791k830N3251n455o668j4456j6388
$$ y = [123841, 78115, 70703, 97461, 108935, 102585, 71000, 52214, 78162, 74156, 63362, 56758, 77511, 81891, 96695, 118197, 124894, 121711, 93703, 56222, 56139, 94723, 102367, 89531, 81865, 88166, 84483, 93145, 111699, 108366, 78581, 84448, 82607, 93032, 94246, 113815, 141974, 119004, 108744, 91920, 91944, 108397, 121206, 137853, 134120, 102709, 94088, 58471, 77770, 105114, 88420, 95795, 106570, 99527, 96479, 126609, 142798, 154780, 160188, 148465, 137027, 118824, 105410, 102945, 118914, 105800, 91093, 101093, 98356, 95881, 91930, 99710, 102898, 107968, 104744, 116913, 110995, 98837, 93760, 87031, 70342, 65248, 88956, 113662, 102488, 101790, 116215, 116958, 106975, 124828, 126792, 155182, 165117, 183949, 185846, 141055, 138225, 191476, 186021, 179353, 164897, 148509]
11201A48509m970j0410J0426J3647j0051j4615R898P275k2509M103K6539m641
11189A53201K4910L5740J0045j9719j4741m142O362l62J0627L1760n016j3472
11177B15193J1308L4361K4974J6223K2395K9963M8507J9583J9994M6249O2526
11166E51276Q6410J43045J62925K29532L20676M57289O32709P22861O46023L37863
11156D290609j03816m91159o49423o35788n15021l54135k57110j31075l0560l5592
11146A086930K0393Q7129J45300J35906R0769O1401P6610J13203J33824J11031
11136B062496Q3090N3850M5108M7983J07286K41043L74277M56236M01957K05643
11126D078969n2013k69477l65948l79658k97586j96702j67471q4912r6544j45248
$$ y = [148509, 143539, 133129, 143555, 157202, 147151, 132536, 142434, 149709, 127200, 131303, 157842, 153201, 178111, 213851, 223896, 204177, 189436, 185294, 191656, 191294, 201921, 233681, 228665, 215193, 226501, 260862, 285836, 302059, 324454, 354417, 402924, 422507, 442501, 488750, 551276, 637686, 780731, 943656, 1173188, 1493864, 1951153, 2583862, 3306723, 3952746, 4290609, 4186793, 3695634, 3046211, 2410423, 1895402, 1541267, 1284157, 1153082, 1122522, 1086930, 1107323, 1194452, 1339752, 1475658, 1566427, 1627828, 1704438, 1817641, 1951465, 2062496, 2145586, 2199436, 2244544, 2292527, 2399813, 2640856, 3015133, 3471369, 3873326, 4078969, 4026956, 3757479, 3391531, 3011873, 2714287, 2517585, 2350114, 2265202, 2168658, 2023410]
11116B023410j69506j49664j07829p3460o2888j00936j33898q2028p7290l3434
11106A032477K9397N5525J08999K07557L15419M40274O01647O34023M15563M5493
11096C886374l24847o25320p06095n92229m25775k95947k08033j31194r9050o4617
11086D13267m3070k6095P246j8797k0739j9221K809p49j5369Q019k3830j7812
11074B45659K4413J5794k5052q727M762Q369J3448L318k994k5468q724L674L936
11061B52408p196j9290p523j2174N236J8037j3454J4284l008K1277N455Q091j064
11048B61079j9455j2880J1816K3190k6848M345K324j596j3764P212K0522k0869
11036B35076j6814L0373K4902P513K3535l913K087j122m837P701p900J7310L0365
$$ y = [2023410, 1853904, 1704240, 1596411, 1522951, 1460063, 1359127, 1225229, 1143201, 1065911, 1032477, 1061874, 1117399, 1226398, 1433955, 1749374, 2189648, 2791295, 3425318, 3840881, 3886374, 3561527, 2936207, 2230112, 1637883, 1212108, 916161, 708128, 576934, 477884, 413267, 370197, 344102, 351348, 332551, 311812, 292591, 295400, 294651, 279282, 287301, 263471, 245659, 270072, 285866, 260814, 252087, 256849, 265218, 278666, 281984, 278990, 253522, 244798, 248472, 252408, 245212, 225922, 218399, 206225, 211461, 229498, 216044, 230328, 227320, 248597, 254052, 262143, 261079, 241624, 228744, 240560, 263750, 236902, 241247, 243571, 241975, 228211, 235423, 255945, 235076, 218262, 248635, 273537, 281050, 304585, 300672, 302759, 301637, 296800, 304501, 296601, 313911, 344276]
11023C44276L6361K1865L942P412j8996J446j7719Q211l6395p065r050L4023J6309
11010C84620m686j8187j111J9622J6022J942j8859k3488J8328J3339q371L395
10998C82566N362K6733N992p49j7461k9890O654J0032p026j8564k4474q677J9187
10985C49685K5502N634J4845p928N63N568K1478N990l6644j6586j2076L064J1316
10972C70411n890P018k1928N576j424P25J1785J1052j5908o898J0672K2505J8013
10959D05709o958k6633j8720Q527O324J2770J8576J0196J5925j2377O328J1449
10947D31116j917j522P90j2376k1809m299Q552k518J0006L8732J0850q972K1675
10934D68308L2412M5881L2770K3848P550l8297j2578L9536M2998j5168j2398P507
$$ y = [344276, 380637, 402502, 406444, 413856, 394860, 396306, 378587, 386798, 350403, 343338, 334288, 368311, 384620, 379934, 361747, 360636, 380258, 396280, 398222, 379363, 355875, 374203, 387542, 379171, 382566, 387928, 414661, 420653, 419904, 402443, 372553, 379207, 389239, 382213, 363649, 339175, 330498, 349685, 375187, 380821, 395666, 387738, 388301, 393869, 415347, 421337, 384693, 368107, 356031, 359095, 370411, 364521, 371539, 349611, 355187, 353763, 354488, 366273, 377325, 361417, 354519, 365191, 387696, 405709, 398751, 372118, 353398, 361925, 368249, 381019, 399595, 409791, 425716, 413339, 419667, 431116, 429199, 427677, 428467, 416091, 394282, 389983, 398535, 396017, 406023, 444755, 455605, 446633, 468308, 500720, 546601, 579371, 603219, 610769, 572472, 559894, 599430, 642428, 627260, 614862, 622369]
10922F22369N365L3213L0356j9129j4285k1489j5695L3975J4202P754j3672q357
10910F54607M422J8707K7546N850r113m867j5004Q305N473K718q114J0571J1873
10897G12974O689Q170k954J2575L3461N1558K7070j6980K095J1648j8967j5008
10885H12331k3236m8913j8200j8835j3615o184j6729n433J7247K5558P796p048
10873G04739j3485j066L5062L3024l0890j910J3434J2075K5451J6190m2942j5560
10861G34122K0227J1097K2506M5497K2237m525j6774k199J5369n338K7574q993
10849H60800k5927k5446j1561k4710j7328p325J7889J1438j1457n7990n369o545
10837F96469J2257K8695j5667m763o228J686k22N086L3999M1205J9143l878J397
$$ y = [622369, 627734, 660947, 691303, 672174, 657889, 636400, 620705, 654680, 668882, 676636, 662964, 654607, 659029, 677736, 705282, 711132, 702019, 697152, 682148, 690453, 695926, 698644, 690530, 701101, 712974, 719663, 727833, 724879, 737454, 770915, 822473, 849543, 832563, 834658, 846306, 827339, 812331, 789095, 740182, 721982, 703147, 689532, 683348, 666619, 661186, 678433, 703991, 711787, 704739, 691254, 690188, 725250, 758274, 727384, 725474, 738908, 750983, 776434, 792624, 749682, 734122, 754349, 765446, 787952, 833449, 855686, 851161, 834387, 832188, 847557, 842219, 869793, 860800, 834873, 809427, 797866, 773156, 755828, 748503, 766392, 777830, 766373, 708383, 703014, 696469, 708726, 737421, 721754, 716991, 710763, 712449, 712227, 717313, 751312, 792517, 811660, 807782, 809179]
10824H09179J9053K7128J9068j1407k5964J4580j3393l5409j1920j7872j5169
10813G57874k5016j0369k106k7593k3255k4978q257R959L8896k983o982J5522
10801F90712J8150K1254J729k0122l1308j7424j2070j6594k2722k8852r355n665
10789E67733J3759J9608J7559Q548n32k6898m3422M17J8472p61O833l987J1317
10776E88646j3924p209P883j9861R32K8930N568j0483j881M1752K3885K2685k110
10763F64813r361J3948j6817M396j510O768m800K3208l142q074r873j3102n164
10750F41290j6308o172R461L0415K3279P610K8290j8308j8847k6185j3424q074
10738F33027q424P462K1148K3397k6996M621j1662L870j46k6726m588q874j8387
$$ y = [809179, 828232, 855360, 874428, 863021, 837057, 851637, 838244, 802835, 790915, 773043, 757874, 732858, 722489, 720383, 692790, 669535, 644557, 636300, 646259, 685155, 682172, 675190, 690712, 708862, 730116, 731845, 711723, 680415, 662991, 650921, 634327, 611605, 582753, 573398, 567733, 581492, 601100, 618659, 627207, 626675, 599777, 556355, 556772, 575244, 574483, 581316, 577329, 588646, 574722, 567513, 575396, 555535, 556467, 585397, 590965, 580482, 578601, 620353, 644238, 666923, 664813, 655452, 669400, 652583, 656979, 655469, 662237, 657437, 680645, 677503, 669429, 659556, 646454, 641290, 624982, 618810, 628271, 658686, 681965, 689575, 717865, 699557, 680710, 654525, 641101, 633027, 624603, 632065, 653213, 676610, 649614, 654235, 642573, 646443, 646297, 619571, 614983, 606109, 587722]
10725E87722P021k1676j5568K623L0177M215j7595j8551M600p357q184p341q620
10712E31466L6310K6214J4904J062k1038j0709j2325J5911J1948n74J8430K5195
10700F36794J7390o565p920L263o350k345K0577J7869j4213k1371K4217N10R920
10687F71776O459j3741k6909j5870Q451l676k1705Q560j8853l266K4470j9418
10675E96278k5478J7458L2977j3984l0388L27K1626L9789N065k8693J024Q627
10663F24628l2597m0357o487K8039o196j1415k0241M397K1846J8867L660J9261
10651F03405J8404O034J7837q174j4166J6061k1782m2563j6975j5173R995M209
10639E57112k184r596J1530P268R271J094o826r135j2855R231L1274K2016J0104
$$ y = [587722, 594743, 573067, 557499, 560122, 590299, 594514, 576919, 558368, 562968, 555611, 547427, 540086, 531466, 567776, 593990, 608894, 609956, 588918, 578209, 565884, 581795, 593743, 593169, 611599, 636794, 654184, 647619, 639699, 642962, 636612, 634267, 654844, 672713, 658500, 637129, 661346, 661856, 671776, 678235, 664494, 637585, 621715, 630166, 626490, 604785, 613345, 594492, 591226, 615696, 596278, 570800, 588258, 621235, 607251, 576863, 577190, 598816, 638605, 643670, 614977, 616001, 624628, 592031, 551674, 545187, 573226, 567030, 555615, 535374, 539771, 561617, 580484, 584144, 603405, 621809, 627843, 645680, 637506, 623340, 639401, 617619, 575056, 558081, 542908, 552903, 557112, 554928, 545332, 556862, 564130, 573401, 574495, 567669, 558534, 545679, 554910, 586184, 608200, 618304]
10626F18304m608J3303j3502k3610k1289l7114P014p054J5677O336k846o556j8911
10613E25144p604j1330L600j2433j5315J975K0903J8525J007j4720j147J0725
10601E19330l2328q730K0656J9950J9649K1117k3782m2719j0195J6813k085N607
10589E03283q951J2324L4883j5632k1626N889K442M637J1372j9471O14o688l160
10576D99916k7013K1026M0223J865j5203J3047J4222k8133N769K1175p942J5135
10564E54087K6777J1164L1319J8105N167j4723Q554j7596j2733j5554j2806l813
10552E77948l2458r648K5202J3659k0428p14P471J4514J6580j8109k0204k6174
10540E27639J57J0856K2757L860K8364K6190N489J8955L2626Q431l895K491n092
$$ y = [618304, 613696, 626999, 613497, 589887, 568598, 531484, 538498, 531444, 547121, 553457, 550611, 544055, 525144, 517540, 506210, 509810, 497377, 482062, 484037, 504940, 523465, 524472, 509752, 508605, 519330, 487002, 478272, 498928, 518878, 538527, 559644, 535862, 493143, 482948, 499761, 497676, 503283, 494332, 506656, 541539, 525907, 504281, 510170, 512612, 517249, 528621, 509150, 509764, 503076, 499916, 472903, 493929, 534152, 536017, 520814, 533861, 548083, 519950, 525719, 546894, 538952, 554087, 580864, 592028, 623347, 641452, 646619, 631896, 640450, 622854, 610121, 594567, 581761, 577948, 545490, 535842, 561044, 574703, 554275, 553561, 561032, 575546, 592126, 574017, 553813, 527639, 527796, 538652, 561409, 565269, 593633, 619823, 625312, 644267, 676893, 685324, 681429, 683920, 678828]
10527F78828P89J0562J6557n09j4149j1935O441J8517j5841j8627o072j3367r524
10514F41670J5431N549J265R745r524q121p105P900j1483J707M0794m013k1306
10501F62509N094o361L5105K3806j1349m1253J3350K4948j7565l6081k1182J9004
10489F50025J0439q913j1560J2392j194O02l221R53j0348J807J0963R715K440
10476F64100K018r16Q653K1331L3671L7243L2693Q7085N6892Q836m0694n0766
10464H60146n4542o4724k4096k5604k6738m9652j1642j3019j1263P191J8653K3856
10452F28566K6080Q746J0433j297o622j3626j8632m518K248n868n462K1483J2147
10439F53678q493j0516j6099j0738m1048j2336P280j7908j304N222J6867L0773
$$ y = [678828, 679617, 690179, 706736, 706227, 692078, 680143, 686584, 705101, 689260, 670633, 664561, 651194, 641670, 657101, 662650, 663915, 673660, 664136, 656015, 648910, 656810, 645327, 647034, 687828, 683815, 662509, 667603, 661242, 696347, 720153, 708804, 667551, 680901, 705849, 688284, 652203, 631021, 650025, 660464, 651551, 639991, 652383, 651189, 651791, 648570, 649523, 639175, 640982, 651945, 661660, 664100, 666118, 665202, 673855, 695186, 728857, 766100, 798793, 885878, 942770, 951606, 910912, 860146, 805604, 740880, 716784, 691180, 664442, 614790, 603148, 590129, 578866, 586057, 604710, 628566, 654646, 663392, 673825, 672528, 665906, 652280, 633648, 629130, 631378, 625510, 620048, 641531, 653678, 645185, 634669, 618570, 607832, 566784, 554448, 561728, 543820, 542516, 547738, 564605, 595378]
10427E95378p88p94L979j975M507K3973n455q427q782P161K969j9495K59J0046
10413F02556J0761L731k749J6184J3985j0485j1950K1707J6133m3030m4215m58
10401E72170R975J7200j6441L330J9025l890j1922R935M384J0942J1777o569J8103
10388F38019k0782l973J693l0976j0658k796J333J1666L2448J680p552k834o428
10375F00840k2088j9877l1775o716l417L6373J864j490J0837J9957l283L107k917
10362E81415j2408m840L7805K6428J9795Q143m1917l2784l3719J918L7554J2099
10350E99489j6135k7418j5014p39J5480J8077l539j9776J4770k8191k2810J8654
10338E32848N943k6864k8282J595m839L6270J4712J6377J1404K944j5319K9961
$$ y = [595378, 594590, 593796, 597775, 595800, 600307, 624280, 618825, 610398, 601616, 608777, 611746, 592251, 592510, 602556, 613317, 617048, 614299, 630483, 644468, 633983, 622033, 643740, 659873, 616843, 572628, 572170, 582145, 599345, 582904, 586234, 605259, 601369, 589447, 599382, 603766, 614708, 626485, 619916, 638019, 617237, 613264, 614957, 583981, 573323, 570527, 571860, 583526, 615974, 617654, 610102, 607268, 600840, 578752, 558875, 527100, 520384, 516967, 553340, 555204, 553714, 564551, 584508, 581225, 584332, 581415, 569007, 564167, 601972, 628400, 648195, 656338, 614421, 581637, 547918, 549836, 587390, 599489, 583354, 555936, 540922, 540183, 555663, 573740, 570201, 550425, 565195, 537004, 514194, 532848, 538791, 511927, 483645, 485240, 480401, 516671, 531383, 547760, 559164, 562108, 546789, 576750]
10326E76750j269k335m736j283K7799M273l0513l1056O084M724J8591K4062L122
10313E94213j189O299J6138J2712J9187j1651j1022j8416K5216R246k3282j6964
10301F00487j6152J1147R581o437o530K1519j938P653n601k1565j9578k18j7027
10288E55341L365k0309m753j4779n140L9572J4450L27p89j1159J03N342L613j6261
10274E48923j9709j6709J2662o872Q234J0959R888L536K2975l566k770Q967M4040
10261F20558L786j3865K5792j2979K856k0021j184n36k2564n813J4902J789j6695
10248E76026o708P99r029j4187k437J3029n493j8270N420R805j3391J4412J1131
10235E61107L897m02R894J3098r884R06M7329K7541l6990l0427K3821J2729k6744
$$ y = [576750, 575481, 573146, 568410, 567127, 594926, 599199, 568686, 537630, 543714, 548438, 567029, 591091, 594213, 593024, 599323, 615461, 628173, 647360, 635709, 624687, 606271, 631487, 640733, 617451, 600487, 584335, 595482, 605063, 598626, 592096, 613615, 611677, 619330, 613729, 592164, 572586, 572368, 555341, 558706, 538397, 533644, 518865, 513725, 553297, 567747, 568074, 567285, 556126, 556229, 561571, 565184, 548923, 529214, 512505, 525167, 518295, 526529, 537488, 547376, 550912, 573887, 570321, 567551, 576518, 620558, 624344, 610479, 636271, 623292, 626148, 606127, 604943, 604407, 581843, 576030, 590932, 592721, 576026, 569318, 570117, 561088, 546901, 544464, 557493, 552000, 533730, 539150, 548955, 535564, 549976, 561107, 565004, 564602, 574496, 587594, 577710, 578616, 625945, 653486, 616496, 586069, 609890, 622619, 595875]
10222E95875K408N3798M0491k289l1288j8092K497k871j0168m784Q691L3515J531
10209F69314m691J874j4073m776K0463J0031J7123O705q21n701k4252L037k5062
10196F49171O083J491k532L2415M006j0031l808O146j1444l1115N414J2075J9396
10183F77267m5577k1541L760L3020J4358j1362j0609l383j421L6763J323j3121
10171F59477K0335K0961K5279k142j2012j5426L060n164j9982j3210l0144k1697
10159F09335K839K0302J9996l055O759J8296j9588j5215j6874j2981J8916ll492
10146F25235m840q593L1815K2321j3018J925J5973m666m026o578j3983K2210N205
10133F68980R479N963k2165N951k969p137l215J5664J6379j469j8287q442k2810
$$ y = [595875, 598283, 652081, 692572, 690283, 658995, 640903, 643400, 640529, 630361, 625577, 634268, 667783, 669314, 664623, 666497, 652424, 647648, 668111, 678142, 695265, 701970, 701149, 695448, 671196, 674233, 649171, 655254, 656745, 654213, 686628, 690634, 680603, 676795, 682941, 671497, 640382, 645796, 657871, 677267, 631690, 610149, 613909, 646929, 661287, 649925, 639316, 635933, 634512, 671275, 672598, 659477, 679812, 700773, 726052, 723910, 711898, 696472, 699532, 694368, 674386, 661176, 631032, 609335, 612174, 632476, 652472, 649417, 656176, 674472, 654884, 639669, 622795, 609814, 628730, 628727, 625235, 620395, 611802, 643617, 665938, 652920, 654845, 670818, 666152, 662126, 655548, 641565, 663775, 668980, 678459, 684422, 662257, 668208, 665239, 658102, 654887, 670551, 686930, 685461, 667174, 658732, 635922]
10120F35922k0796P782m567k9208j929J0452L2804O5666O99j4687j1394o569J1151
10107F75326N461O212J2192o22k4111J4907L788q087l093m695J3140m645l499
10094F82274J2004j1389N008P497j3393j8233J9896J8177j455j7303P299J2197
10082G02579K2151j8608j385K616p218K2357J8830k4824l0913J1480J6203J3614
10070G26882k6180J8987J8759l5425j4467O747J6396p622M93p940j6160o450j8907
10057F55113L2480M8121l115j1526k1102J787j3965l8297q37l268O011p430L691
10044F47663L036j4983J6533K6178m623j9857q363L0322K2938m464J9968j1723
10032G02625O584P137o866R109L40j3523K4906K7836J8278k9066j0520K0948j2517
$$ y = [635922, 615126, 622908, 618341, 589133, 587204, 597656, 630460, 696126, 696825, 682138, 670744, 664175, 675326, 680787, 686999, 699191, 698569, 674458, 689365, 693153, 685066, 681973, 677278, 690418, 685773, 682274, 694278, 682889, 687897, 695394, 682001, 663768, 683664, 701841, 700386, 683083, 690382, 702579, 724730, 706122, 704737, 707353, 700135, 722492, 741322, 716498, 685585, 697065, 713268, 726882, 700702, 719689, 738448, 703023, 688556, 695303, 711699, 704077, 704570, 696630, 680470, 674020, 655113, 687593, 735714, 732599, 721073, 699971, 701758, 687793, 649496, 648659, 645391, 651402, 643972, 647663, 650699, 635716, 652249, 678427, 673804, 653947, 645584, 675906, 698844, 694380, 714348, 702625, 709209, 716346, 709480, 718589, 718929, 705406, 730312, 758148, 776426, 747360, 736840, 757788, 745271]
10019G45271l5816n162J2336N246J4336R890M4922J9254p15l4645j0470k0835
10007G43612j7220J1579K856k751Q9q611j7953j8528j971Q721j8895J1637O325
9994F98890j1468r915O415Q126J5284R522j7992k1262l412J3967r465l789J0239
9981F85140P814j6996q575J5258J8089J4929M09p699P47J6968n844K666j5464
9968G07442l1574j0527J1427m144j5234o294R723K803K6726n298j1319p230j6037
9955F50464m542J4621L7829J0232k2144m284L9503M353J1510M757m756r226n644
9942G22673J7924K232K176K2504R328m569J3960K2930L3178M0297K1261L7473
9930I41367M4291Q2866J29703J71618J42722P5013j1593k6391l4608k502N4400
$$ y = [745271, 709455, 704293, 716629, 721875, 736211, 746101, 791023, 810277, 809562, 774917, 764447, 743612, 726392, 737971, 740827, 738076, 738165, 729554, 711601, 693073, 691102, 699823, 680928, 692565, 698890, 687422, 677507, 683922, 692048, 707332, 716854, 698862, 677600, 674188, 688155, 678690, 674901, 685140, 692954, 675958, 667383, 682641, 700730, 715659, 716068, 708369, 709116, 726084, 720240, 722906, 707442, 675868, 665341, 676768, 672624, 657390, 651096, 660819, 663622, 690348, 685050, 673731, 666501, 650464, 645922, 660543, 698372, 708604, 686460, 682176, 721679, 726032, 737542, 742299, 737543, 728317, 722673, 740597, 742829, 745005, 767509, 776837, 772268, 786228, 809158, 842336, 882633, 903894, 941367, 985658, 1068524, 1198227, 1369845, 1512567, 1587580, 1575987, 1549596, 1514988, 1512486, 1566886]
9919A566886K10690L09390K25078O1265j30651k51139k79166j97316r9121m372
9909A411544N5845M8758N955p0496j57970j79593j20655p1403m0286l7298k4124
9898H20277l7589m9949j1255m206R946k781Q058P595J3150j2161j0749j1783l3357
9885F85196J2992J6899r045R628J2434j5038q589l090j3234K8837L4516J5368
9873G66874k3830R261m283k6578J1050L9412J3437R952l1582l402J657m666j8280
9860G39022k151K6847M457J2058P611Q216K6943J3610q163J9147K2895J0503j6660
9847H64335J1112J6063K9545L7145L529M517K0689J9918j2700K3671O0426O0702
9835A138952O6693P2082O4385P5263J22031J98895L27171M33003M86231M44796
$$ y = [1566886, 1777576, 2086966, 2312044, 2373309, 2242658, 1991519, 1712353, 1515037, 1415916, 1411544, 1467389, 1516147, 1522102, 1451606, 1293636, 1114043, 993388, 921985, 881699, 844401, 820277, 782688, 732739, 721484, 717278, 727224, 724443, 732501, 740096, 753246, 741085, 730336, 718553, 685196, 698188, 715087, 706042, 715670, 728104, 713066, 704477, 701387, 688153, 716990, 751506, 766874, 743044, 752305, 748022, 721444, 732494, 771906, 785343, 795295, 763713, 760311, 761968, 757302, 739022, 736871, 763718, 768175, 780233, 787844, 796060, 823003, 836613, 828450, 847597, 870492, 880995, 864335, 875447, 891510, 921055, 958200, 961729, 966246, 986935, 1006853, 994153, 1017824, 1078250, 1138952, 1205645, 1277727, 1342112, 1417375, 1539406, 1738301, 2065472, 2498475, 2984706, 3429502]
9825C429502K87246Q3167j14199k10442j74020K1935K32577N93232J206958K033362
9815G389318K685793K285584P82878r20263k253909k641613k178915j489905r70829
9806B688139o08787l84836k21955j65454j15043p2653p0260p0880n1169j8182
9796I08920J7121R671o103J0127l8122k5545L5299k9461j9095J8187N955j9167
9784H67787n873l124p29k4846O962L6103j9659n851j5292p78l211J73L737J28
9770H35527j6461j8287j3014Q624k656L241J7733o844M315o346K9607M2402L4391
9757I12232j0621m786k4405j7326L091l274j4511l2160N454J0066P628k9254k1068
9744G81066K467n923J0400J9974K5976m59k953J2018J6140n675j3846p52j1592
$$ y = [3429502, 3716748, 3799915, 3685716, 3475274, 3301254, 3323189, 3555766, 4148998, 5355956, 7389318, 10075111, 12360695, 13143573, 12223310, 9969401, 7327788, 5148873, 3658968, 2688139, 2079352, 1694516, 1472561, 1307107, 1192064, 1119411, 1049151, 978271, 927102, 908920, 926041, 935712, 929609, 939736, 901614, 876069, 911368, 881907, 862812, 880999, 886954, 867787, 861914, 858790, 858061, 833215, 840177, 876280, 856621, 850770, 835478, 834700, 831489, 831662, 835399, 835527, 819066, 800779, 787765, 796389, 793733, 796974, 814707, 807863, 812178, 805832, 835439, 877841, 912232, 901611, 896825, 872420, 855094, 858185, 854911, 840400, 808240, 813694, 823760, 831388, 802134, 781066, 783533, 777610, 788010, 807984, 833960, 833501, 830548, 842566, 858706, 853031, 839185, 838433, 826841]
9731H26841J1943K6851K3808o382k406N261n311j2336k253J2020K6191J4912l2749
9718H86390p115R972n638l1069j3101j2347q063o274K1214K0891L927j1193j4518
9705H33076J0150J4021N084K0489j647p443K0179J9261j1435j8254j6320j0430
9693H56731o334j2093k1469J7475M2788j1836k4044k58J7106J3658o153J7338
9681H82909K6105P824l0641P084K6953M8675J8908k7042k6175J713j5327j0532
9669I10454J4670M6134K6347M925m462O466J9066R002J4513p369j6370l6003m4869
9656I42504L637K0640p803r661J7291J9581Q825l017J1538q288J6929J3147J5457
9643A040780K7963N1473L1115L6408K7464J0769M3886O5745J00110J51961K16295
$$ y = [826841, 838784, 865635, 889443, 883061, 880655, 885916, 880605, 868269, 866016, 878036, 904227, 919139, 886390, 879275, 889247, 883609, 852540, 839439, 827092, 819029, 812755, 833969, 854860, 858787, 847594, 833076, 843226, 857247, 862331, 882820, 881173, 873730, 893909, 913170, 901735, 883481, 867161, 856731, 850397, 838304, 816835, 834310, 877098, 865262, 841218, 840960, 858066, 871724, 865571, 882909, 909014, 916838, 886197, 893281, 920234, 968909, 987817, 960775, 934600, 936313, 920986, 910454, 925124, 971258, 997605, 1002530, 998068, 1004534, 1023600, 1032602, 1047115, 1039746, 1023376, 987373, 942504, 946141, 966781, 958978, 949317, 966608, 986189, 995014, 991997, 1003535, 995247, 1012176, 1025323, 1040780, 1068743, 1120216, 1151331, 1187739, 1215203, 1225972, 1269858, 1335603, 1435713, 1587674, 1803969]
9632A803969K15926J83547J68770J53535K03167K08669L7520j36974k38751k13655
9622B385723j42523j64290k05814k42841j86091j23432j01492n8983m6139l6762
9612A077356k2995j8226l0067J469M310k3539k2741O059J8129N977L699L8028
9600A037459l723j5874j266M489L2420O620l241P967K1800j7672j9945P778O084
9587A062896M8834R395J2715o238j8695p126J0376J8482q796J2785j0374l561
9575A120693J2255m062K623l4808j9724L663O539k389O674K0850K4001j894k2959
9562A111462P453J3540J2314J2378J9039r090P848K039J134j1370L020j2668K2960
9549A180059R893p56k3077k833K0348j0629R851L6085L9109L1889k4351m3256
$$ y = [1803969, 2019895, 2203442, 2372212, 2525747, 2728914, 2937583, 2975103, 2838129, 2599378, 2385723, 2243200, 2078910, 1873096, 1630255, 1444164, 1320732, 1219240, 1160257, 1114118, 1077356, 1054361, 1036135, 1006068, 1007537, 1011847, 988308, 965567, 971626, 989755, 995732, 999431, 1037459, 1033736, 1017862, 1016596, 1021085, 1053505, 1060125, 1056884, 1064851, 1086651, 1068979, 1049034, 1056812, 1062896, 1111730, 1121125, 1133840, 1127602, 1108907, 1101781, 1112157, 1130639, 1121843, 1134628, 1124254, 1120693, 1132948, 1128886, 1131509, 1096701, 1076977, 1080640, 1087179, 1084790, 1091464, 1112314, 1136315, 1134421, 1111462, 1118915, 1132455, 1144769, 1157147, 1176186, 1167096, 1174944, 1176983, 1178117, 1166747, 1169767, 1157099, 1180059, 1189952, 1189196, 1166119, 1163286, 1183634, 1173005, 1182856, 1218941, 1258050, 1289939, 1265588, 1222332]
9537A222332j616L3P698l00K3441o895l0771K2618K9498L100R963J4207q195K3781
9523A308894J6437K5832K2315Q389j0715j0529J3266J1421m541K8334L4834P503
9511A451440j5706J865R947J2558N615m08l3286J1436K3669J3830j5438q473k9895
9498A427154l0502o201l593j8129J8755O661K0642n178M715k1302k3202q052n916
9485A355852K683m940j6809R982J2234j889L1894K4514k6473k2434M403K3986
9473A393003j4782M24r794n456j7374l3907M909J2109J1224J7930K4773o787r690
9460A366582l464m112j5211j1769k0751l458J3079j9103J117O439Q05M56J4362
9447A324972K5435J5606K059o000j2754J074K091K3221J2527m071k844J6083j0220
$$ y = [1222332, 1220716, 1220749, 1228447, 1228147, 1251588, 1244693, 1213922, 1236540, 1266038, 1269138, 1279101, 1293308, 1285113, 1308894, 1325331, 1351163, 1373478, 1381867, 1371152, 1360623, 1373889, 1385310, 1380769, 1409103, 1443937, 1451440, 1435734, 1437599, 1447546, 1460104, 1465719, 1465311, 1432025, 1443461, 1467130, 1480960, 1465522, 1457049, 1427154, 1396652, 1390451, 1386858, 1368729, 1387484, 1394145, 1414787, 1409609, 1414324, 1393022, 1369820, 1361768, 1355852, 1358535, 1353595, 1336786, 1346768, 1359002, 1357113, 1389007, 1413521, 1387048, 1364614, 1369017, 1393003, 1378221, 1378645, 1368851, 1363395, 1346021, 1312114, 1317023, 1329132, 1340356, 1358286, 1383059, 1376272, 1366582, 1363118, 1359006, 1343795, 1332026, 1311275, 1307817, 1320896, 1301793, 1302910, 1309349, 1310154, 1310610, 1324972, 1350407, 1366013, 1368072, 1362072, 1349318, 1350392, 1352483, 1375704, 1388231, 1384160, 1381316, 1397399, 1387179]
9434A387179K1973K4268J2535p823l0896k0936k4954j8292J8671J5505l359P982
9422A381853K2351K0941J0342J0828l309m406n352J4479K0938K580j9408k480
9410A449357K7035P173L7151n243n733l1251L1096N7528K4260k479k7856J663
9398A562701M104l395k8361J2204j6431j6518r69K1450k233K8091J3331p423r613
9385A556938J1087K0065J0587q458j3778J0641l924j6468k2988l678N478N41J9253
9372A565296R522J7802m836j6921j2955L6406K6402m414j9418p228K5415j2134
9360A602937J3763J7311k2163J5601J7668j3951J9602K1953l451k7884k1799j4272
9348A605315K2530K1141M673J391j0155J8659Q057j509k7673j2540L6185j1405
$$ y = [1387179, 1409152, 1433420, 1445955, 1438132, 1407236, 1386300, 1361346, 1343054, 1361725, 1377230, 1373871, 1381853, 1404204, 1425145, 1435487, 1446315, 1443006, 1438600, 1433248, 1447727, 1468665, 1471245, 1451837, 1449357, 1476392, 1483565, 1520716, 1515473, 1509740, 1478489, 1509585, 1567113, 1591373, 1588894, 1561038, 1562701, 1566805, 1563410, 1535049, 1547253, 1530822, 1514304, 1513335, 1534785, 1532552, 1560643, 1573974, 1566551, 1556938, 1568025, 1588090, 1598677, 1590219, 1576441, 1587082, 1583158, 1566690, 1543702, 1540024, 1545502, 1546043, 1565296, 1574818, 1592620, 1587784, 1570863, 1557908, 1594314, 1620716, 1616302, 1596884, 1589656, 1615071, 1602937, 1616700, 1634011, 1611848, 1627449, 1645117, 1631166, 1650768, 1672721, 1669270, 1641386, 1619587, 1605315, 1627845, 1648986, 1653659, 1655050, 1644895, 1663554, 1671611, 1670102, 1642429, 1629889, 1666074, 1654669]
9336A654669k0193p252P639J8918p072J1041J0149J2744M370P097O686O953Q076
9323A713825o897r974K1349J1882j8707Q490m706O188N495K3656J8944o585J8458
9310A781418J8180J3952R294l031P431m610p105J9962J4259K1306k48P324J6739
9297A894871L4134L733J1723J0003P440K344R61k4059q623K3260J8587R70j5712
9284A959632j2465k0077J9179k033N4612J6359n392k4826k8166J5321n441O675
9272A973378J0564L128r005P35J2573L4865K2467j1711l0837J2932L4012K2907
9260B076008K0349L2109K5059K882Q718J1305J4924q708N209p788K4032L7811
9248B241910L3634J9045k9851l6438J2155N1396L3939K3502j3612p680j329j8255
$$ y = [1654669, 1634476, 1627224, 1634863, 1653781, 1646709, 1657750, 1667899, 1680643, 1685013, 1692110, 1698796, 1705749, 1713825, 1706928, 1696954, 1718303, 1730185, 1711478, 1719968, 1715262, 1721450, 1726945, 1750601, 1769545, 1762960, 1781418, 1799598, 1813550, 1822844, 1819813, 1827244, 1822634, 1815529, 1835491, 1849750, 1871056, 1870808, 1878132, 1894871, 1929005, 1932738, 1944461, 1954464, 1961904, 1964248, 1965209, 1941150, 1932527, 1955787, 1974374, 1975344, 1959632, 1947167, 1927090, 1946269, 1944236, 1998848, 2015207, 2009815, 1984989, 1956823, 1972144, 1966703, 1973378, 1983942, 1987070, 1978065, 1978800, 1991373, 2026238, 2048705, 2036994, 2006157, 2019089, 2053101, 2076008, 2096357, 2128466, 2153525, 2156407, 2165125, 2176430, 2191354, 2182646, 2187855, 2180067, 2204099, 2241910, 2275544, 2294589, 2264738, 2228300, 2240455, 2291851, 2325790, 2349292, 2335680, 2328000, 2326671, 2308416]
9236B308416K884J5178J5827J09M055l383L3829L2585P903M76R604J7120L4913
9223B479516N6601M5559R084k2664j6932J6685K6887o20J685j3867q21p698N727
9210B579142K7860q919R105o098P819K95J9229R880j3629K6214J8958N382m899
9197B670339J6782N938j0789k688L6701J7403J4563P649l689R441K9618O7856
9185B859124K3539J3236J4095K2405j3169p772N947M5035J3750o305K3500K9466
9173C022851M77K761K480j8021j1597j200L5589L7494j7334J8452K9676M3581
9161C145209M4126r83K877J361J9753K182L5235J6379o14R569K9384K2290J253
9148C328021J1436o462L5273M4105L9527K1047k5587k543M433q119M255J6094
$$ y = [2308416, 2311300, 2326478, 2342305, 2342414, 2346469, 2343086, 2376915, 2409500, 2417403, 2417879, 2427483, 2444603, 2479516, 2536117, 2581676, 2590760, 2568096, 2551164, 2567849, 2594736, 2594116, 2595801, 2581934, 2581113, 2573415, 2579142, 2607002, 2598083, 2607188, 2601090, 2608909, 2609204, 2628433, 2638313, 2624684, 2650898, 2669856, 2675238, 2670339, 2687121, 2693059, 2682270, 2679582, 2716283, 2733686, 2748249, 2755898, 2752209, 2761650, 2791268, 2859124, 2882663, 2895899, 2909994, 2932399, 2919230, 2911458, 2917405, 2962440, 2976190, 2969885, 2993385, 3022851, 3023328, 3026089, 3028569, 3010548, 2998951, 2997751, 3033340, 3070834, 3053500, 3071952, 3101628, 3145209, 3189335, 3188352, 3191229, 3192590, 3212343, 3214525, 3249760, 3266139, 3265525, 3275094, 3304478, 3326768, 3328021, 3339457, 3332995, 3368268, 3412373, 3451900, 3472947, 3447360, 3444817, 3449250, 3441131, 3445386, 3461480]
9136C461480J4480L6737K8016K0915k861L0615J7129K7322K944Q864P13P262K4280
9123C677896J6783O829J4611L0342K3401K1087J3781j4200J3098P867K3198M5392
9111C880085J9359K6093M4819M3600O5536N463j452k914J5207M9867M2138l289
9099D184512K8197J1976n83L7759J8987N329L6532M4237L1466k0050L2285N5899
9087D466546K9580J7134K5612J4968K3583L9318K3658M3396K8648K4715L8317
9076D775475j7604j3633M7845L3856N3032K3227K1142M3053J3504L7671K2958
9065E040526K0804K7758N1640J8370K3025N8714M2759N0973J8455L5796M0613
9054E429433P120M2503L2434Q377j961L8736M9006J9341K0799O1493P5370M4503
$$ y = [3461480, 3475960, 3512697, 3540713, 3561628, 3558767, 3589382, 3606511, 3633833, 3636777, 3645641, 3646354, 3653616, 3677896, 3694679, 3701508, 3716119, 3746461, 3769862, 3790949, 3804730, 3790530, 3803628, 3811495, 3834693, 3880085, 3899444, 3925537, 3970356, 4013956, 4079492, 4084955, 4083503, 4080589, 4095796, 4145663, 4187801, 4184512, 4212709, 4224685, 4224102, 4261861, 4280848, 4286177, 4322709, 4366946, 4398412, 4378362, 4410647, 4466546, 4496126, 4513260, 4538872, 4553840, 4577423, 4616741, 4640399, 4683795, 4712443, 4737158, 4775475, 4757871, 4744238, 4792083, 4825939, 4878971, 4902198, 4923340, 4966393, 4979897, 5017568, 5040526, 5061330, 5089088, 5140728, 5159098, 5182123, 5240837, 5283596, 5334569, 5353024, 5388820, 5429433, 5436553, 5479056, 5511490, 5519867, 5517906, 5556642, 5605648, 5624989, 5645788, 5707281, 5782651, 5827154]
9042E827154L2159L3585J4743J1566L7693N9369L6610N0504M8479L4904L3597
9031F220363L9767O4945L2155N506O3637N2198N1447M3546L7120K6932K1802J8554
9019F677972O4430Q6777J01033P3742K0156K3471L6238N8172N6695O0935N9474
9008G319095K7593K4452K2335M9354O1861N4820K9081L7258Q4908P8907M7763
8997G837427Q2069O2966O4365J3005P860N3141N1128N4804R9693P3015P2874P8296
8985H550643N0407O9109Q5858O6529P0312Q3128Q1665N6487Q0800Q5728J16089
8974I396755J18636J15524J29039Q3420J04640J78846K15865K33687K47020K72494
8964A1095926L19589M04584N52222O38654O02889M30741J28500j83050l94442
$$ y = [5827154, 5859313, 5892898, 5907641, 5919207, 5956900, 6016269, 6052879, 6103383, 6151862, 6186766, 6220363, 6260130, 6325075, 6357230, 6362736, 6426373, 6478571, 6530018, 6573564, 6610684, 6637616, 6659418, 6677972, 6742402, 6829179, 6930212, 7003954, 7024110, 7047581, 7083819, 7141991, 7198686, 7259621, 7319095, 7346688, 7371140, 7393475, 7442829, 7504690, 7559510, 7588591, 7625849, 7710757, 7789664, 7837427, 7919496, 7982462, 8046827, 8059832, 8067692, 8120833, 8171961, 8226765, 8326458, 8399473, 8472347, 8550643, 8601050, 8670159, 8756017, 8822546, 8892858, 8975986, 9057651, 9114138, 9194938, 9280666, 9396755, 9515391, 9630915, 9759954, 9843374, 9948014, 10126860, 10342725, 10576412, 10823432, 11095926, 11415515, 11820099, 12372321, 13010975, 13613864, 14044605, 14173105, 13990055, 13595613]
8955A3595613m90257m59648l95532l15610k30291j48076q9642p2502l4675K3169
8945A1382549M6807N517j740J1353M1535K9486N1194O0288N1866K6635N8375O5620
8933A1829485K6330L2334L6417Q6091P4500P5888N2076O7996P0939O8552O1463
8922A2482071O3399O2680N7448O9575L3406L2021L1777N7270O6880O4279N8422
8911A3079228L5443L4432N1521N8331Q5837P4680N7187N3229M7695L7416O6213
8900A3681212J2395L0114L8286M2497L0185J2281K6530L5069M7192L0640L1848
8889A4018249M7655N6020L1506p146L7489K4599J8910M5335M8121j313j1123J3153
8877A4321455K2776k0216J0953j2970j4723O069L6639J3520j75n669L854K348
$$ y = [13595613, 13105356, 12645708, 12250176, 11934566, 11704275, 11556199, 11466557, 11394055, 11359380, 11382549, 11429356, 11434873, 11433133, 11444486, 11486021, 11515507, 11566701, 11626989, 11678855, 11705490, 11763865, 11829485, 11855815, 11888149, 11924566, 12010657, 12085157, 12161045, 12213121, 12281117, 12352056, 12420608, 12482071, 12545470, 12608150, 12665598, 12735173, 12768579, 12800600, 12832377, 12889647, 12956527, 13020806, 13079228, 13114671, 13149103, 13200624, 13258955, 13344792, 13419472, 13476659, 13529888, 13577583, 13614999, 13681212, 13693607, 13723721, 13762007, 13804504, 13834689, 13846970, 13873500, 13908569, 13955761, 13986401, 14018249, 14065904, 14121924, 14153430, 14146284, 14183773, 14208372, 14227282, 14272617, 14320738, 14319425, 14308302, 14321455, 14344231, 14324015, 14334968, 14321998, 14307275, 14313344, 14349983, 14363503, 14363328, 14357659, 14361513, 14363861]
8865A4363861P787r231k2138j2582l851j4836k5197o866j6844k7833k2102k8498
8853A4181670k7682l9395l8358k038k2333l7023l1409n3412k9919j7834k0949
8842A3861318m6878o5925l7912j7403l7008n4844l5789n2571n1504p1830o2913
8831A3326741o1496m8049k8014l5537n8518p6321o6909k6028n0216p1231p4353
8820A2730069n1195k7787l9948o7333p3990p8810j00730o6408o9288p4120o9068
8809A2011392q9598p8062o5628q2329n9350m1036m7903p9601p8233j01395j00744
8798A1187513q7298l8248m8201p2564r1851r5659o9067m5527o4432o8114n4488
8787A0452064p1073p8802p4122r1894o3457p7492r7794m9758o3077p2397q9091
$$ y = [14363861, 14371648, 14362417, 14340279, 14327697, 14323846, 14309010, 14283813, 14276947, 14260103, 14232270, 14210168, 14181670, 14153988, 14114593, 14076235, 14074197, 14051864, 14014841, 13983432, 13930020, 13900101, 13882267, 13861318, 13814440, 13748515, 13710603, 13693200, 13656192, 13601348, 13565559, 13512988, 13461484, 13389654, 13326741, 13265245, 13217196, 13189182, 13153645, 13095127, 13018806, 12951897, 12925869, 12875653, 12804422, 12730069, 12678874, 12651087, 12611139, 12543806, 12469816, 12391006, 12290276, 12223868, 12154580, 12080460, 12011392, 11921794, 11843732, 11778104, 11695775, 11636425, 11595389, 11547486, 11467885, 11389652, 11288257, 11187513, 11100215, 11061967, 11013766, 10941202, 10849351, 10753692, 10684625, 10639098, 10574666, 10506552, 10452064, 10380991, 10302189, 10228067, 10136173, 10072716, 9995224, 9897430, 9847672, 9784595, 9712198, 9623107]
8776I623107q2463m2679n9923o0770m9810r1135p7344r3234q4011o0537q6574
8765H834627q2460n9745n7445n5489p4467o8097r0366o1604n5362n2325p8366
8754H098901n1806k7796n9715o2119l2442o7760p1907o9578q5763n8884p5431
8743G435700o7645k4350m7972o6860q3345q2780m9153k8416n4165m7998l5489
8732F847527o6751n4681o7237l8324l3403q5102p1501m0558l6897n0052o4573
8721F238448m7444l7337m2191k6076m3208n4886n8453k8854m7407n8172m3831
8710E750589k4542k9248l8640k8600n8044o5588k5756l399k2687o2899k5540j1034
8698E354612l1768j5967K516M257M493J602Q369K2178J2305M0689J8528m446p690
$$ y = [9623107, 9540644, 9497965, 9438042, 9377272, 9327462, 9236327, 9158983, 9065749, 8981738, 8921201, 8834627, 8752167, 8692422, 8634977, 8579488, 8505021, 8436924, 8346558, 8284954, 8229592, 8177267, 8098901, 8047095, 8019299, 7959584, 7897465, 7865023, 7797263, 7725356, 7655778, 7570015, 7511131, 7435700, 7368055, 7343705, 7295733, 7228873, 7145528, 7062748, 7013595, 6985179, 6931014, 6883016, 6847527, 6780776, 6726095, 6658858, 6620534, 6587131, 6502029, 6430528, 6389970, 6353073, 6303021, 6238448, 6191004, 6153667, 6111476, 6085400, 6042192, 5987306, 5928853, 5899999, 5852592, 5794420, 5750589, 5726047, 5696799, 5658159, 5629559, 5571515, 5505927, 5480171, 5476772, 5454085, 5391186, 5365646, 5354612, 5322844, 5306877, 5309393, 5313650, 5318143, 5319745, 5328114, 5350292, 5362597, 5403286, 5421814, 5417368, 5409678]
8685E409678j0415m588n5948p8918q5994j02724j13801j01482j31486j10727p9127
8674D534468n7826o0174m4965k2300m3822o0308m0177l4089o3441m4734j3124
8663D049508l0848o9682o0900L7803Q501j0069K263k5253J780O418l214p882j5896
8650C882529j0389l0781n8177j2978l0786m3585m1437l9296k6039m3256o4375
8639C481430n0599l5717j8789o1675n7527j9043L740j9689k9978q183j3445k8559
8627C141966j8209K022K3335L139L2435L4971L3117O2759R5377K03337L08213
8616C922462N37120P36084O18851J10080k97572o29946p15671n12722l44456k60978
8606C163252j58547j08145r4428o4641n8180j6612R72N754j1936k7112k3810m0657
$$ y = [5409678, 5399263, 5394675, 5338727, 5259809, 5173815, 5071091, 4957290, 4855808, 4724322, 4613595, 4534468, 4476642, 4416468, 4371503, 4349203, 4305381, 4245073, 4204896, 4170807, 4107366, 4062632, 4049508, 4018660, 3948978, 3888078, 3925881, 3934382, 3924313, 3926576, 3901323, 3903103, 3909521, 3906307, 3898425, 3882529, 3872140, 3841359, 3783182, 3770204, 3739418, 3695833, 3654396, 3615100, 3589061, 3545805, 3481430, 3430831, 3395114, 3376325, 3314650, 3257123, 3238080, 3241820, 3222131, 3192153, 3183970, 3170525, 3141966, 3123757, 3125779, 3149114, 3152253, 3184688, 3219659, 3252776, 3315535, 3410912, 3614249, 3922462, 4459582, 5195666, 5814517, 5924597, 5627025, 4997079, 4281408, 3768686, 3424230, 3163252, 3004705, 2896560, 2802132, 2737491, 2679311, 2662699, 2663671, 2669425, 2657489, 2630377, 2606567, 2565910]
8594B565910k7084l2151k7398r580O248l4675j1814K416K6937K6861J4965K484
8582B503119K2413M3018K2220L9740O4637P9299R3181J65125K00135L31629N70047
8571D134563R47347J503641J519187N54054l39835j174650j488576j172353q01420
8562C681958n35872l57489k81212j61922j16382q4458n7463m9706M826l8058m6132
8551A958090J122n1571m2277j1241l065k0735k0102P591J7144J9802J8697k6392
8539A847063K51J3431j0337P13L9882k713K1084O2612N3868Q4029J02586J81603
8527B394072K81932M90192Q29489R63800M58729r6228n63487r10863p63968n31576
8517B552092l54232k54956j62845j08649q9773m8825k9472j9139k0706l1268k8290
$$ y = [2565910, 2538826, 2506675, 2479277, 2469697, 2475945, 2441270, 2429456, 2431872, 2458809, 2485670, 2500635, 2503119, 2525532, 2568550, 2590770, 2630510, 2695147, 2774446, 2867627, 3032752, 3232887, 3564516, 4134563, 5081910, 6585551, 8104738, 8658792, 8318957, 7144307, 5655731, 4483378, 3681958, 3146086, 2788597, 2507385, 2345463, 2229081, 2144623, 2087160, 2037454, 2042280, 2004222, 1958090, 1959212, 1907641, 1865364, 1854123, 1851058, 1830323, 1810221, 1817812, 1834956, 1854758, 1873455, 1847063, 1847314, 1860745, 1850408, 1851121, 1891003, 1888290, 1909374, 1971986, 2025854, 2109883, 2212469, 2394072, 2676004, 3166196, 3995685, 4959485, 5418214, 5321986, 4758499, 3847636, 3083668, 2552092, 2197860, 1942904, 1780059, 1671410, 1581637, 1532812, 1503340, 1484201, 1463495, 1432227, 1403937]
8506A403937j4524m557j7782k8182j7020j5197j5420j0804J2485L922k3209j5032
8494A258617l0701P421N876L122K1949J261O909J4441J972K037K8886J0916J1104
8481A343810O8606J23895R3439Q35m3893j20509j02584q6119o5214k9709j4014
8470A168543K426k7210l7574m1320k0208M435J7424k571o291k3264j6J6380N321
8457A056075q065K3276O526M455r221q907J8099R563k5957l9055m795Q189k2197
8444A007986l335j6324j1398J2742l22K6533L040j3931j3463P172j402j7778r56
8431I78564j4883j1467J4124K2210r641o96l827K4641J6033J7425L4183R936K636
8418A079238K3318j6141l3718M558K9737J0742J390K8412J0273J5254N3533L8531
$$ y = [1403937, 1389413, 1384856, 1367074, 1338892, 1321872, 1306675, 1291255, 1280451, 1292936, 1296858, 1273649, 1258617, 1227916, 1235337, 1241213, 1244335, 1266284, 1267545, 1274454, 1288895, 1290867, 1292904, 1321790, 1332706, 1343810, 1412416, 1536311, 1629750, 1630585, 1586692, 1466183, 1363599, 1277480, 1212266, 1182557, 1168543, 1170969, 1143759, 1106185, 1064865, 1044657, 1049092, 1066516, 1063945, 1057654, 1034390, 1034374, 1050754, 1056075, 1048010, 1071286, 1077812, 1082267, 1073046, 1064139, 1082238, 1091801, 1065844, 1026789, 1021994, 1030183, 1007986, 1004651, 988327, 976929, 989671, 989349, 1015882, 1018922, 1004991, 991528, 998700, 997298, 979520, 978564, 963681, 952214, 966338, 988548, 978907, 978211, 974384, 999025, 1015058, 1032483, 1066666, 1076602, 1079238, 1102556, 1086415, 1052697, 1057255, 1086992, 1097734, 1099124, 1127536, 1137809, 1153063, 1206596, 1245127]
8406A245127J6458j316R134P781o098l8871n1615m7085l9770m1565m2356k2785
8394I87039J521j7063l019j9212O388M43Q052K5561j1121K978J1162J3957J0912
8381A017598q875j950M6215L9370J5938N7450P1486O2213P0569M1272J4733M2622
8369A468641P757j1730m3824n0023p9326p8965r3695q6514n6911n6047m4405l1521
8357H43437k9012j8142k2433k3931j2695L155J2473O848J5796J98k3505l2464
8345G19725l0812k9822q76P662J3150J0909n0791m0741r935j1846q968l657O768
8332E70766P893J614q805K204j7060q757o368J0277k0481k3157j251K8527K6443
8319E61845J055K4498o162r095j8133l586J0027k9006p559J0184N475M766M483
$$ y = [1245127, 1261585, 1260269, 1269403, 1277184, 1271086, 1232215, 1180600, 1133515, 1093745, 1052180, 1009824, 987039, 988560, 971497, 968478, 949266, 955654, 956097, 964149, 989710, 978589, 981567, 992729, 1006686, 1017598, 1008723, 1006773, 1052988, 1092358, 1108296, 1165746, 1237232, 1299445, 1370014, 1411286, 1426019, 1468641, 1476398, 1464668, 1420844, 1370821, 1291495, 1212530, 1118835, 1032321, 975410, 919363, 874958, 843437, 814425, 796283, 773850, 749919, 737224, 740379, 752852, 759700, 775496, 775694, 752189, 719725, 688913, 659091, 658215, 665877, 679027, 689936, 639145, 598404, 588469, 576623, 567655, 563998, 570766, 578659, 580273, 571468, 573672, 556612, 547855, 541487, 551764, 531283, 508126, 506875, 535402, 561845, 562900, 587398, 581236, 572141, 554008, 550422, 560449, 531443, 523884, 534068, 539543, 544309, 548792]
8306E48792k919j1437q759j5258J1754P553J2607k3952L605J8285J3807o953o564
8293E40561K6881N228j9381j1949q523l0466l4165K6213J9943M8440J7736m217
8281E76301j8856N384k667j9462q609J3198k926k3669J9316L2106M867k1736m372
8268E48875k0257m1929k2876n406K4736K2009J5884k3952J839J0158k7379j1993
8256D69709o18Q818n340l078l2003k0715j6914r592P693P497m0903J862Q001p457
8242C66960j4909K6544N160k6964l012l376M3362M2989J1507R92L031j6952l0676
8229D04656j5816P473J5594J8983q333j1697J933j3058q613n616M997R193J1077
8216D10773L4664L5376k7069l7879N366O179k290P054k6179L928K6871R443j3123
$$ y = [548792, 545873, 534436, 525677, 510419, 522173, 529726, 542333, 518381, 521986, 540271, 554078, 547125, 540561, 567442, 572670, 553289, 541340, 532817, 502351, 468186, 494399, 514342, 562782, 580518, 576301, 557445, 562829, 560162, 540700, 532091, 545289, 542363, 518694, 538010, 570116, 574983, 553247, 548875, 528618, 486689, 463813, 458407, 483143, 505152, 521036, 497084, 498923, 509081, 481702, 469709, 469091, 477909, 472569, 469491, 437488, 416773, 399859, 390267, 397960, 405457, 364554, 366416, 374417, 366960, 352051, 378595, 383755, 356791, 353779, 350403, 393765, 436754, 448261, 449253, 452284, 435332, 404656, 388840, 396313, 411907, 430890, 422557, 410860, 412793, 399735, 391122, 385506, 390503, 399696, 410773, 445437, 480813, 453744, 415865, 421231, 427410, 425120, 432174, 405995, 409923, 436794, 446237, 433114]
8203D33114j8059l6997k0177j0323Q975k079l61j8043M381J467p43k9506k322
8190C09327l373m508J1916m585M796J3070L6008J4992J3843J206k6055P391m622
8177C69406m7067k556J1398M654J6985k6449M402J4920J8522k5317k3170l587
8165C12141j9476J9795K1736K7213j8517l6092j3156r901j0159Q237K5244J5752
8153C22817r903j4314p259q987n809L866J0710Q961l963k4929k2650p207l720
8140B37613J926k144r453j7598L4949K8442j2491j3825R294Q76m322l613n469
8127B44185m05J6262O755k0560M788l912Q679Q741k5378K023J4716j2900j6932
8114B26062P458m138j8460l4922J6865R994k0J7786j0424j8736N152l712j2209
$$ y = [433114, 415055, 378058, 357881, 347558, 356533, 354454, 354093, 336050, 340431, 341898, 341155, 311649, 309327, 305954, 301446, 313362, 308777, 313573, 326643, 362651, 377643, 391486, 392692, 366637, 374028, 369406, 322339, 319783, 331181, 335835, 352820, 326371, 330773, 345693, 364215, 338898, 315728, 312141, 292665, 312460, 334196, 361409, 342892, 306800, 293644, 283743, 273584, 281821, 307065, 322817, 312914, 298600, 291341, 282354, 276545, 280411, 291121, 300082, 296119, 271190, 248540, 241333, 237613, 239539, 237395, 227942, 210344, 245293, 273735, 261244, 247419, 256713, 257589, 253267, 249654, 244185, 243780, 260042, 266797, 246237, 251025, 247113, 255792, 264533, 239155, 241178, 255894, 242994, 226062, 233520, 229382, 210922, 176000, 192865, 202859, 202839, 220625, 210201, 191465, 196617, 192905, 180696]
8101A80696K159J2030j0170L624O669p580J6050J6031k49j1301J0044J1679j5018
8088B14664K9912K1749p572l3170k0910j2262l155J1023R516n731m39K8434j0701
8075B21358k390O199q968o842J6401N730l913k8615k4329m806Q218J3875j0810
8062A81108j1286j5219P237L2864M436J4943J8l7501k5648n833j1558J6314Q25
8049A50700K6331J3251q686j7439j5019M404q705Q127R095L036J0290M529q241
8036A71673r503M402P127K7226R317O032O488k1502l8703j6819N252j5671p661
8023A27658r642k2254P124J2131j0135J3660J4463J044M98k1542q760j3144m608
8010H6493K5717M872J895L197k5107J820L6469J0110m072k5418l484R970j0274
$$ y = [180696, 182855, 194885, 184715, 188339, 195008, 187428, 203478, 219509, 219260, 207959, 218003, 229682, 214664, 244576, 266325, 258753, 225583, 204673, 192411, 189256, 200279, 209795, 204064, 203625, 232059, 221358, 218968, 225167, 216199, 209357, 225758, 231488, 227575, 198960, 174631, 169825, 178043, 191918, 181108, 169822, 154603, 161840, 194704, 199140, 214083, 214101, 176600, 150952, 145119, 133561, 149875, 150700, 177031, 190282, 181596, 164157, 149138, 153542, 144837, 152964, 162059, 165095, 175385, 179914, 171673, 162170, 166572, 173699, 200925, 210242, 216274, 222762, 201260, 162557, 145738, 150990, 135319, 127658, 118016, 95762, 102886, 115017, 104882, 118542, 133005, 134049, 134547, 113005, 104245, 91101, 86493, 112210, 117082, 118977, 122174, 97067, 98887, 135356, 145466, 141394, 115976, 112492, 122462, 112188]
7997A12188K623L9368L1744n075l3853j2925J6661l08k1104j6178j4057r28J5631
7984A13787J2093M274L472K6302O833r851P341k8869m470j2859j1086N617J8587
7971A31171j4529j0083j620L849j344J7780J2722k031J8759N140r152q556k1906
7958A20200j4708L7480j798J2856j671j215j4545j8774J246q123k015J9744K472
7945A31149Q784j9082J441J7253P136j3575j758k7101L156R681q352j747n198
7932A01787j8240o95J3331J8792j774Q487R030J3345N714K42k2615J1077k7048
7919A11433j7840j7228n456K2770K6358J2270O8M139n503k4833j8568L5917J6302
7906A39829j2999l8541j6079J7552L2039L5560j6526j426O94r985r261P610l002
$$ y = [112188, 114811, 154179, 185923, 180848, 146995, 134070, 150731, 150423, 129319, 113141, 99084, 98156, 113787, 125880, 130154, 133626, 159928, 166761, 156910, 164251, 135382, 130912, 118053, 106967, 112584, 131171, 116642, 106559, 104939, 108788, 107444, 125224, 137946, 135915, 154674, 159814, 150662, 142106, 120200, 105492, 142972, 141174, 154030, 152359, 151144, 136599, 117825, 119071, 110948, 108933, 128677, 131149, 139933, 120851, 122292, 139545, 146681, 133106, 131348, 104247, 107403, 117084, 108732, 106985, 101787, 83547, 82852, 96183, 114975, 113201, 121688, 130718, 144063, 149777, 150019, 127404, 138481, 111433, 93593, 76365, 70909, 93679, 120037, 132307, 132375, 136514, 131011, 106178, 87610, 123527, 139829, 126830, 88289, 72210, 89762, 121801, 157361, 140835, 139409, 140103, 130118, 120857, 128467, 125465]
7893A25465j1121n898k973J8424n353j9631r129M0986k1352r318K7250K0914j1245
7880A37019m5819j4422J5047K1117K3700O73J0766j3784k9320j7131j1104J7070
7868I3812N243j0672n07j9112j1818Q352K5680p513q333n170l114m376o933K17
7854E5756L9503N757J0512K239q427q117j1618k6372j5353K59J083J3097J3326
7841G1645J9860O691m911Q037j4267k18k1369J105M1J2399M086O121J3756j3865
7827H9111r589r645Q940L274l014j5210q752O179m91o200k248O410K314o719k2122
7812C2238K2008M0734j0206j2483j7287o1L7451q784k8943n341n036K0832l3342
7799C1780l4716n786L4878M671l5097q414K8203L0754J5057J164o078l473k0717
$$ y = [125465, 114344, 108446, 105473, 123897, 118544, 98913, 89784, 130770, 109418, 100100, 127350, 148264, 137019, 91200, 76778, 91825, 112942, 136642, 137315, 148081, 134297, 104977, 87846, 76742, 93812, 99055, 88383, 87876, 68764, 56946, 65298, 90978, 83465, 75132, 69962, 66848, 62472, 55539, 55756, 95259, 101016, 111528, 113767, 105340, 97223, 85605, 59233, 43880, 44139, 45222, 58319, 71645, 91505, 98196, 93285, 101322, 87055, 86837, 65468, 66573, 66614, 79013, 83099, 89220, 102976, 89111, 79522, 69877, 78817, 82091, 79077, 63867, 55115, 61294, 60803, 54603, 52355, 58765, 61079, 54360, 32238, 54246, 94980, 84774, 72291, 55004, 54943, 92394, 83610, 54667, 49326, 44290, 65122, 31780, -2936, -8722, 26156, 30827, -4270, -12684, 15519, 46273, 61330, 62494, 56416, 52943, 32226]
7786C2226q273P58n770o919J0976M82J0367j4618m703N888k239J3828J8009j2424
7772C7588j2929M651L369j0555J1341j618r195O917L644K684q727O767M980J4030
7758E2947j1751n729J236k2529j3993J4757J0380J9643j0803l5471K9058J4351
7746D2096l680j9496P41P133J0003L312R426k0163k3579M562P067l217K9542J2769
7732E6516j8117j6181J6303p254k8596k2176q343P220M023l521l080j784K9743
7719D753j691R003q005p970j4329J1394J0972K695K474J7745j7461j0993j4956
7706a6369p38K1059J2129j6140j9190q809P259J7022J8432K639Q549o194P538
7693B7187J8709k0865j7242Q684p915j9637j0956P188J5167k304P316K0197p320
$$ y = [32226, 23953, 24711, 18941, 12022, 22998, 23480, 33847, 19229, 14526, 20414, 18175, 32003, 50012, 37588, 24659, 29310, 32679, 22124, 33465, 31847, 22652, 29569, 33213, 35897, 27170, 33937, 38917, 52947, 41196, 35467, 36703, 14174, 181, 14938, 25318, 44961, 34158, -1313, 27745, 42096, 38416, 18920, 19661, 26794, 36797, 40109, 49535, 29372, 5793, 10355, 17422, 14205, 43747, 56516, 38399, 22218, 38521, 31267, 2671, -19505, -27848, -20628, -16605, -20126, -23206, -24990, 4753, 3062, 12065, 4060, -3910, -18239, -6845, 4127, 6822, 9296, 27041, 9580, -1413, -16369, -17107, 3952, 16081, -59, -19249, -28058, -20799, -3777, 14655, 17294, 25843, 19649, 27187, 45896, 25031, 7789, 16473, 8558, -11079, -22035, -14847, 320, -1984, 5332, 25529, 18209]
7680A8209j3307r298J3740k558K0265o409n631j5825o224M081J8369J5040k2085
7667H367J6434J7371k7899k2223J5521K0549l1518N733J2961L5552M5219j4494
7655H1573K343o313j1366p076j6695k1966k1793J1961l739j8094l209O530K1791
7642A3947N926K1491j6830k6895n521j91J5181j638R241o626k333J7923M569R620
7628C7864p873m317l477j9304J3594q173j9723K899k0314l2981j8709L5432L6841
7615h241k05P458k640q590J164J3212J6071l931K6525J4742q633k1427l7532l9313
7601e1340q293J5580o663M734m014M738M6389J2414n578J595K8742q139k6682
7588C483l0736K8151J7044m4068J1929K119M790l672j7228j8183J5936J4378k415
$$ y = [18209, 4902, -4396, 9344, 6786, 27051, 20642, 15011, -814, -7038, -2957, 15412, 30452, 8367, 24801, 42172, 14273, -7950, 7571, 28120, -3398, 2335, 15296, 50848, 96067, 81573, 83916, 77603, 66237, 59161, 42466, 20500, -1293, 10668, 6929, -11165, -14374, -7844, 13947, 19873, 41364, 24534, -2361, -7882, -8073, 7108, 5470, 14711, 8085, 5752, 23675, 28244, 37864, 29991, 25674, 22197, 2893, 16487, 8314, -11409, -8510, -28824, -61805, -80514, -45082, -8241, -8446, -988, -3628, -12218, -11054, 2158, 18229, 14298, 40823, 55565, 46932, 25505, -12027, -51340, -59633, -44053, -50716, -45982, -49996, -45258, 1131, 13545, 7967, 9562, 38304, 30165, 3483, -27253, 898, 17942, -26126, -14197, -12078, -7288, -10960, -28188, -46371, -30435, -16057, -18472]
7575a8472p97L79K953k4892k065K7504r347q959N770L797J2839K6701o694k9363
7561b0646l620j2627j2463J0227l918j3305J3235K6107l147k9539p924l690L74
7548f0936J3188j0695o759L8924M501j1143j5585N508L8717j195k784K0997R038
7535B1776j257m3426J1511N027k0344q568K1112O487J1702j4224k6618M580K4393
7522g849k876j8163J8618J1618k8103o142k891l439K411r511k8496O174K5263
7509d3386K2716J0249o786R575j5529J4263K094R742n123k2319k886j4832K091
7496d0131P842J5131m486j5712K0491p263K8429J5208K2848R43k7663M541P136
7483B7314k198j3130k555j3188j3143l0430l8619K7209R578j2550J1280J1209
$$ y = [-18472, -19269, -18890, -15937, -40829, -42894, -15390, -24737, -33696, -27926, -24129, -11290, 15411, 8717, -20646, -24266, -36893, -49356, -39129, -43047, -56352, -43117, -17010, -20157, -49696, -57620, -61310, -60936, -47748, -58443, -65202, -26278, -21777, -32920, -48505, -42997, -4280, -5475, -8259, 12738, 21776, 20519, -22907, -11396, -6369, -26713, -35281, -14169, -7682, 4020, -10204, -36822, -32242, -7849, -10725, -28888, -10270, 1348, -26755, -32897, -35788, -39227, -36816, -46327, -74823, -68649, -43386, -20670, -10421, -17207, -7632, -23161, -8898, -6804, 2938, -2185, -24504, -27390, -42222, -40131, -32289, -17158, -21644, -37356, -16865, -24128, 4301, 19509, 42357, 43300, 15637, 20178, 27314, 25116, 11986, 9431, -3757, -16900, -47330, -85949, -58740, -49162, -61712, -50432, -39223]
7471c9223J0711j0048o346Q54J1433l873j2031l006J2795L9259O214J2464j7692
7458A511n2047L525j0269j3366p0M6338M137j7485l698k0703K3859J1487j9298
7445d6079N941M1588R873m271m669p816j3094R344N92K455r250N834j2775m545
7431b6872m940L306J3631j775p762j2516J0380O689J7943J3912k4930k836n237
7418b1007K7814J7976K354j1690k0785k5541k4370Q505J2969J3706K327N060K978
7405i704j3512n095J1916L3103J0538n676j7701j1081k9486j6417J0533n582q194
7392e6358Q166k1401J2873Q905K87J8362J1958l745n302j7494k0509K1610K2795
7379a9853q470j5074K4938M196l784p494n565K7080O006k5300N263j7951Q02K4576
$$ y = [-39223, -28512, -38560, -44906, -44052, -32619, -36492, -48523, -51529, -38734, 525, 6739, 19203, 1511, -50536, -47011, -57280, -70646, -70716, -24378, -20241, -37726, -41424, -62127, -38268, -26781, -46079, -40138, 1450, 11323, 7052, 2383, -5433, -18527, -9183, -8591, -6136, -15386, -9552, -22327, -26872, -31812, -28506, -14875, -16650, -24412, -36928, -26548, -19859, -1916, 11996, -12934, -15770, -21007, 6807, 24783, 27137, 15447, -5338, -30879, -55249, -46744, -33775, -20069, -17742, -12682, -9704, -23216, -28311, -16395, 16708, 27246, 21570, 3869, -7212, -36698, -53115, -42582, -48164, -56358, -48192, -69593, -56720, -47815, -47528, -29166, -17208, -20953, -26255, -43749, -64258, -42648, -19853, -28323, -43397, -18459, -14263, -18047, -25541, -31106, -4026, 1980, -23320, -18057, -36008, -35206, -10630]
7365a0630Q888Q218l98r461j6654l287j068k200m004j0030J2765J1088j1361J5419
7351a2715O844p579k4052M864O935L989J2913k6265N055L39J6169k4384j6693
7338e4580R331M437Q542K7833k583m0253k16J6494J5120J1522k4650k6688j2614
7325f8305J746L2314J6242p448m2745j9072L912J3482L6926K8451Q927k009L765
7312F186o880K5746K1904k1884m7274r213o52J237J9204j1123M213M674l577K3654
7298F215m322k536K274k1332m666k348j7211j4667J5093P671j4750J3577Q813
7285b8189j3173R457Q790K1871j6853k1391j3113k433M392j2218K492J7758K7892
7272a4718p733j5907K8611J2713r039k4283j2973K6229J8282j6847j0039k0542
$$ y = [-10630, -1742, 6476, 6078, -3383, -20037, -23324, -24392, -26592, -30596, -40626, -27861, -16773, -28134, -12715, -5871, -13450, -37502, -32638, -25703, -21714, -8801, -35066, -30011, -29672, -13503, -37887, -54580, -45249, -40812, -32270, -4437, -7020, -47273, -47489, -30995, -15875, -4353, -29003, -55691, -68305, -66559, -34245, -18003, -25451, -68196, -87268, -83356, -69874, -32948, -4497, 4430, 2421, 6186, -694, 25052, 46956, 25072, -22202, -31415, -32067, -30830, -11626, -22749, -18536, -13862, -17439, 6215, 1893, -643, 1631, -19701, -24367, -26715, -43926, -58593, -43500, -35829, -50579, -37002, -28189, -41362, -31905, -23115, -1244, -18097, -39488, -52601, -55034, -50642, -62860, -60368, -42610, -14718, -22451, -38358, -9747, 2966, -6073, -30356, -43329, -17100, 1182, -15665, -25704, -46246]
7260d6246j7568q123N229L1186K3665N541p351j1681j9492J6680J7028N073j0801
7247a6860j3132J2140P719J4218r46j1869j7068k6552o921J8619L8979J2879k483
7234H723k2810k9318k1007J090K2105n751l426M484J6136K8032l419l1458k2084
7221e8703J0876p435P730J8026J2348J2731k4370l756K1826j764L071K9592P770
7208B7942j9284l5872k6771J4408J7879O496L62o123j167q08j1660J5179P142
7195a2277k4813k2508J4904K3871j618L3k504M014r545l3592N713J1738j2805
7182e9389o430P699L6287R486J3680J7108n086l8338q045K7824J5823P125j3079
7169D665k4618j4050J9669M672l8111m1953M335l467K9764L0864M0000O350m147
$$ y = [-46246, -63814, -71937, -66708, -35522, -11857, -6316, -13667, -25348, -44840, -28160, -11132, -6059, -16860, -29992, -17852, -10133, 4085, 3139, -8730, -25798, -52350, -59271, -40652, -1673, 11206, 8723, -14087, -43405, -64412, -63322, -41217, -46968, -50394, -45910, -29774, -1742, -5161, -36619, -58703, -47827, -55262, -47532, -29506, -17158, -4427, -28797, -32553, -10727, -12491, -9420, 20172, 27942, 8658, -27214, -53985, -39577, -21698, -15202, -14840, -20963, -22130, -22938, -34598, -19419, -12277, -37090, -59598, -44694, -20823, -22441, -22408, -24912, -20898, -30443, -64035, -58322, -46584, -59389, -65819, -58120, -21833, -12347, 1333, 18441, 13355, -24983, -33028, -5204, 10619, 17744, 4665, -19953, -34003, -14334, -9662, -47773, -89726, -85391, -88858, -59094, -28230, 11770, 18120, 13973]
7156A3973r356k8504k341Q736K377j633k8772q393J0201J9777J8658l480K0472
$$ y = [13973, 4617, -23887, -26228, -17492, -15115, -16748, -45520, -53913, -43712, -23935, -5277, -8757, 11715]
$$ [...]
##END NTUPLES=NMR SPECTRUM
##END=
