##TITLE=Analysis number 312704
Compound Code cc 43446
Book Reference 445/26/2
Project Code adrs
Chemist Name laurenf
##JCAMPDX= 6.0         $$ Bruker NMR JCAMP-DX V2.0
##DATA TYPE= NMR SPECTRUM
##DATA CLASS= NTUPLES
##ORIGIN= Bruker BioSpin GmbH
##OWNER= NMR
$$ XWIN-NMR		Version 3.5
$$ Thu Aug 11 11:52:40 2005 GMT Daylight Time (UT+1h)  MAYBRIDGE\NMR@NMR_250MHZ
##.OBSERVE FREQUENCY= 250.131544655141
##.OBSERVE NUCLEUS= ^1H
##.ACQUISITION MODE= SIMULTANEOUS (DQD)
##.ACQUISITION SCHEME= undefined
##.AVERAGES= 16
##.DIGITISER RES= 18
##SPECTROMETER/DATA SYSTEM= dpx250
##.PULSE SEQUENCE= zg30
##.SOLVENT NAME= CDCl3
##.SHIFT REFERENCE= (INTERNAL, CDCl3, 0, 16.522)
##AUDIT TRAIL= $$ (NUMBER, WHEN, WHO, WHERE, WHAT)
$$ ##TITLE= Audit trail, XWIN-NMR		Version 3.5
$$ ##JCAMPDX= 5.01
$$ ##ORIGIN= Bruker BioSpin GmbH
$$ ##OWNER= NMR
$$ C:\u/data/dgb/nmr/ADRS/7630/pdata/1/auditp.txt
$$ ##AUDIT TRAIL=  $$ (NUMBER, WHEN, WHO, WHERE, WHAT)
(   1,<2005-08-11 11:51:58.53 +100>,<MAYBRIDGE\NMR>,<NMR_250MHZ>,
      <created by zg, POWCHK disabled, PULCHK disabled
       configuration hash MD5:
       62 19 C7 07 E1 42 D1 B7 37 6C 3D D0 77 39 F9 E6
       data hash MD5: 64K
       15 D4 E2 B4 10 00 F1 80 E0 88 62 E2 FE 5D FE F1>)
(   2,<2005-08-11 11:52:17.90 +100>,<MAYBRIDGE\NMR>,<NMR_250MHZ>,
      <Start of raw data processing
       ef LB = 0.3 FT_mod = 6 PKNL = 1 SI = 32K 
       data hash MD5: 32K
       39 8C 4A BB 25 94 79 8C 9C DA DA 47 18 09 AB 3D>)
(   3,<2005-08-11 11:52:22.98 +100>,<MAYBRIDGE\NMR>,<NMR_250MHZ>,
      <apk 
       data hash MD5: 32K
       25 E1 B1 96 D9 F6 DC 13 36 C3 E0 FE AE 66 DD B5>)
(   4,<2005-08-11 11:52:24.54 +100>,<MAYBRIDGE\NMR>,<NMR_250MHZ>,
      <abs ABSG = 5 
       data hash MD5: 32K
       5B 30 A3 4D 38 B2 3D B5 00 44 BA C9 95 B6 37 6B>)
$$ ##END=
$$ 
$$ hash MD5
$$ 44 FE 84 D6 E8 D8 BD B0 B7 9B D6 EC F9 E9 2F DE
##$RELAX= 
##$RELAX= 
##$RELAX= 
##$RELAX= 
##$RELAX= 
##$RELAX= 
##$RELAX= 
$$ Bruker specific parameters
$$ --------------------------
##$DU= <C:\u>
##$EXPNO= 7630
##$NAME= <ADRS>
##$PROCNO= 1
##$TYPE= <nmr>
##$USER= <dgb>
##$AMP= (0..31)
100 100 100 100 100 100 100 100 100 100 100 100 100 100 100 100 100 100 
100 100 100 100 100 100 100 100 100 100 100 100 100 100 
##$AQSEQ= 0
##$AQ_mod= 3
##$AUNM= <au_zg>
##$AUTOPOS= <20 >
##$BF1= 250.13
##$BF2= 250.13
##$BF3= 250.13
##$BF4= 250.13
##$BF5= 500.13
##$BF6= 500.13
##$BF7= 500.13
##$BF8= 500.13
##$BYTORDA= 1
##$CFDGTYP= 0
##$CFRGTYP= 5
##$CHEMSTR= <none>
##$CNST= (0..31)
1 1 145 1 1 1 1 1 1 1 1 1 1 1 1 1 1 1 1 1 1 1 1 1 1 1 1 1 1 1 1 1 
##$CPDPRG= <>
##$CPDPRG1= <>
##$CPDPRG2= <>
##$CPDPRG3= <>
##$CPDPRG4= <mlev>
##$CPDPRG5= <mlev>
##$CPDPRG6= <mlev>
##$CPDPRG7= <mlev>
##$CPDPRG8= <mlev>
##$CPDPRGB= <>
##$CPDPRGT= <>
##$D= (0..31)
0 1 0 0 0 0 0 0 0 0.06 0 0 0 0 0 0 0.0002 0 0 0 0 0 0 0 0 0 0 0 0 0 0 
0 
##$DATE= 1123757517
##$DBL= (0..7)
120 120 120 120 120 120 120 120 
##$DBP= (0..7)
150 150 150 150 150 150 150 150 
##$DBP07= 0
##$DBPNAM0= <>
##$DBPNAM1= <>
$$ [...]
##$SUBNAM7= <"">
##$SUBNAM8= <"">
##$SUBNAM9= <"">
##$SW= 20.6930455092707
##$SWIBOX= (0..15)
0 0 3 0 0 0 0 0 0 0 0 0 0 0 0 0 
##$SW_h= 5175.983436853
##$TD= 65536
##$TD0= 1
##$TE= 295.16
##$TE2= 300
##$TE3= 300
##$TEG= 300
##$TL= (0..7)
0 120 120 120 120 120 120 120 
##$TP= (0..7)
150 150 150 150 150 150 150 150 
##$TP07= 0
##$TPNAME0= <>
##$TPNAME1= <>
##$TPNAME2= <>
##$TPNAME3= <>
##$TPNAME4= <>
##$TPNAME5= <>
##$TPNAME6= <>
##$TPNAME7= <>
##$TPOAL= (0..7)
0.5 0.5 0.5 0.5 0.5 0.5 0.5 0.5 
##$TPOFFS= (0..7)
0 0 0 0 0 0 0 0 
##$TUNHIN= 0
##$TUNHOUT= 0
##$TUNXOUT= 0
##$USERA1= <user>
##$USERA2= <user>
##$USERA3= <user>
##$USERA4= <user>
##$USERA5= <user>
##$V9= 5
##$VALIST= <valist>
##$VCLIST= <CCCCCCCCCCCCCCC>
##$VD= 0
##$VDLIST= <DDDDDDDDDDDDDDD>
##$VPLIST= <PPPPPPPPPPPPPPP>
##$VTLIST= <TTTTTTTTTTTTTTT>
##$WBST= 1024
##$WBSW= 4
##$XGAIN= (0..3)
0 0 0 0 
##$XL= 0
##$YL= 0
##$YMAX_a= 517666
##$YMIN_a= -390233
##$ZGOPTNS= <>
##$ZL1= 120
##$ZL2= 120
##$ZL3= 120
##$ZL4= 120
##$ABSF1= 16.522
##$ABSF2= -4.171173
##$ABSG= 5
##$ABSL= 3
##$ALPHA= 0
##$AQORDER= 0
##$ASSFAC= 0
##$ASSFACI= 0
##$ASSFACX= 0
##$ASSWID= 0
##$AUNMP= <proc_1d>
##$AZFE= 0.1
##$AZFW= 0.1
##$BCFW= 0
##$BC_mod= 0
##$BYTORDP= 0
##$COROFFS= 0
##$CY= 12.5
##$DATMOD= 1
##$DC= 0
##$DFILT= <>
##$DTYPP= 0
##$F1P= 14.0000005364418
##$F2P= -0.99999901652339
##$FCOR= 0.5
##$FTSIZE= 32768
##$FT_mod= 6
##$GAMMA= 0
##$GB= 0
##$INTBC= 1
##$INTSCL= 1
##$ISEN= 128
##$LB= 0.3
##$LEV0= 0
##$LPBIN= 0
##$MAXI= 10000
##$MC2= 0
##$MEAN= 0
##$ME_mod= 0
##$MI= 0
##$NCOEF= 0
##$NC_proc= -3
##$NLEV= 6
##$NOISF1= 0
##$NOISF2= 0
##$NSP= 0
##$NTH_PI= 0
##$NZP= 0
##$OFFSET= 16.522
##$PC= 1
##$PHC0= 125.5294
##$PHC1= 8.626684
##$PH_mod= 1
##$PKNL= yes
##$PPARMOD= 0
##$PSCAL= 4
##$PSIGN= 0
##$REVERSE= no
##$SF= 250.13
##$SI= 32768
##$SIGF1= 0
##$SIGF2= 0
##$SINO= 400
##$SIOLD= 32768
##$SREGLST= <1H.CDCl3>
##$SSB= 0
##$STSI= 32768
##$STSR= 0
##$SW_p= 5175.98343685301
##$SYMM= 0
##$S_DEV= 0
##$TDeff= 65536
##$TDoff= 0
##$TI= <Analysis number 999999
Compound Code 99
Book Reference 9
Project Code 9>
##$TILT= no
##$TM1= 0
##$TM2= 0
##$TOPLEV= 0
##$USERP1= <user>
##$USERP2= <user>
##$USERP3= <user>
##$USERP4= <user>
##$USERP5= <user>
##$WDW= 1
##$XDIM= 32768
##$YMAX_p= 356333110
##$YMIN_p= -100134
$$ End of Bruker specific parameters
$$ ---------------------------------
##NTUPLES= NMR SPECTRUM
##VAR_NAME=  FREQUENCY,     SPECTRUM/REAL,   SPECTRUM/IMAG
##SYMBOL=    X,             R,               I
##VAR_TYPE=  INDEPENDENT,   DEPENDENT,       DEPENDENT
##VAR_FORM=  AFFN,          ASDF,            ASDF
##VAR_DIM=   32768,         32768,           32768
##UNITS=     HZ,            ARBITRARY UNITS, ARBITRARY UNITS
##FACTOR=    0.157963299565203, 1,           1
##FIRST=     4132.6476996994, 0,             0
##LAST=      -1043.33573715361, 0,           0
##MIN=       -1043.33573715361, -100134,     0
##MAX=       4132.6476996994, 356333110,     0
$$ Real data points
##PAGE= N=1
##DATA TABLE= (X++(R..R)), XYDATA
$$ [...]
$$ plain form
16579 125817 135633 134210 125383 103149 85125 64231 45227 30759 25337 14021 5731 2637 5255
16566 5255 9388 6205 5776 6501 9631 10310 6568 1096 -5504 -10676 -8366 -80 11876 25867 41531
16551 41531 62699 83351 104817 121189 125482 112989 96650 71632 50108 32593 20494 21964
16539 21964 27548 30553 40326 51758 72601 95362 110824 111146 99968 80771 57238 33260 16971
16526 16971 7945 4259 -3490 -6926 -11358 -12596 -16705 -19106 -15123 -14141 -15327 -14268 -8708 -8745 -8976
16511 -8976 -2637 2122 7897 14836 25936 47684 69448 87504 98774 106851 103365 91361 74069
16498 74069 47825 24129 9951 -601 -11645 -12284 -7928 -14279 -16728 -14623 -19153 -20260 -23107
16485 -23107 -24235 -23265 -22443 -18180 -14159 -14275 -20609 -22465 -22005 -23597 -27108 -35257 -33618 -33051 -25057 -24777
$$ packed form
16579A25817R816j423q827k2234j8024k0894j9004j4468n422j1316q290l094K618
16566E255M133l183m29P25L130O79l742n472o600n172K310Q286J1956J3991J5664
16551D1531K1168K0652K1466J6372M293j2493j6339k5018k1524j7515j2099J470
16539B1964N584L005R773J1432K0843K2761J5462L22j1178j9197k3533k3978j6289
16526A6971r026l686p749l436m432j238m109k401L983R82j186J059N560l7k31
16511h976O339M759N775O939J1100K1748K1764J8056J1270Q077l486j2004j7292
16498G4069k6244k3696j4178j0552j1044o39M356o351k449K105m530j107k847
16485b3107j128R70Q22M263M021j16o334j856M60j592l511q149J639N67P994K80
$$ plain form
16469 -24777 -32747 -33169 -30247 -30254 -32949 -30573 -29044 -28170 -27663 -33129 -37024 -43543 -40199 -36633 -34001 -36844
16453 -36844 -39148 -37287 -32949 -36643 -40984 -43817 -43591 -34391 -34783 -40368 -36238 -40376 -38770 -33953 -31042
16438 -31042 -30240 -29865 -32435 -34469 -31434 -31985 -35354 -37786 -35099 -32699 -30573 -28168 -22330 -23239 -30794
16423 -30794 -31484 -27735 -29213 -28725 -29939 -26472 -20864 -16638 -18173 -19397 -17905 -16526 -16879 -19075 -23688
16408 -23688 -27384 -26408 -25105 -24366 -23775 -18609 -19249 -20683 -20417 -16313 -11487 -12434 -21844 -28783 -23458 -21361
16392 -21361 -23529 -25982 -22398 -18435 -20811 -24406 -27197 -32287 -35786 -33034 -30631 -31632 -27756 -25870
16378 -25870 -24956 -25006 -26759 -28235 -27010 -25679 -27903 -28901 -31642 -32326 -26683 -26435 -31184 -33272 -32638 -32834
16362 -32834 -31063 -32127 -35022 -35803 -36899 -36186 -37696 -40203 -34683 -32192 -30136 -26187 -24455 -24392 -26846
$$ packed form
16469b4777p970m22K922pk695K376J529Q74N07n466l895o519L344L566K632k843
16453c6844k304J861M338l694m341k833K26R200l92n585M130m138J606M817K911
16438c1042Q02L75k570k034L035n51l369k432K687K400K126K405N838r09p555
16423c0794o90L749j478M88j214L467N608M226j535j224J492J379l53k196m613
16408b3688l696R76J303P39N91N166o40j434K66M104M826r47r410o939N325K097
16392b1361k168k453L584L963k376l595k791n090l499K752K403j001L876J886
16378b5870R14n0j753j476J225J331k224r98k741o84N643K48m749k088O34j96
16362c2834J771j064k895p81j096P13j510k507N520K491K056L949J732O3k454
$$ plain form
16347 -26846 -26490 -26501 -23258 -26803 -28044 -24121 -21559 -24473 -26211 -25542 -26736 -24698 -22466 -25545 -30035
16332 -30035 -33730 -41665 -39576 -36602 -32366 -26866 -31609 -36776 -37102 -28138 -19141 -22744 -30217 -34390 -39407
16317 -39407 -36601 -34270 -32005 -32216 -37634 -31359 -22675 -24371 -26365 -22544 -22628 -23871 -18255 -8511 -12370
16302 -12370 -23750 -29745 -29136 -25631 -29336 -29527 -26182 -23385 -20187 -21493 -21417 -28736 -32229 -30069 -21057
16287 -21057 -11635 -13610 -15794 -20713 -26298 -22898 -21745 -18656 -13149 -11435 -17811 -22129 -24457 -21820
16273 -21820 -26514 -26856 -22102 -23641 -18369 -16158 -17315 -16049 -19403 -29670 -32316 -33239 -28251 -28080 -24140
16258 -24140 -21251 -19128 -21261 -23959 -24313 -20582 -19420 -20310 -19313 -15158 -8670 -11710 -20387 -28035 -30091
16243 -30091 -24937 -23831 -25611 -23616 -25139 -28577 -28681 -26152 -22778 -28393 -32189 -26372 -28952 -35464 -35732
$$ packed form
16347b6846L56j1L243l545j241L923K562k914j738O69j194K038K232l079m490
16332c0035l695p935K089K974M236N500m743n167l26Q964Q997l603p473m173n017
16317c9407K806K331K265k11n418O275Q684j696j994L821q4j243N616R744l859
16302a2370j1380n995O09L505l705j91L345K797L198j306P6p319l493K160R012
16287b1057R422j975k184m919n585L400J153L089N507J714o376m318k328K637
16273b1820m694l42M754j539N272K211j157J266l354j0267k646r23M988J71L940
16258b4140K889K123k133k698l54L731J162q90R97M155O488l040q677p648k056
16243c0091N154J106j780J995j523l438j04K529L374n615l796N817k580o512k68
$$ plain form
16228 -35732 -41597 -41381 -30084 -24876 -26144 -25374 -28580 -26634 -18613 -21215 -22081 -23842 -31692 -30933 -29752
16213 -29752 -30153 -30368 -36963 -33981 -27343 -26002 -25470 -25636 -21367 -19339 -24293 -16565 -13460 -10950 -15379
16198 -15379 -16826 -13546 -12342 -18645 -20982 -18450 -16687 -16197 -17207 -25260 -27071 -20190 -22098 -24904 -25331
16183 -25331 -22773 -25654 -28289 -27854 -29864 -32990 -34504 -32403 -29233 -28703 -30091 -30251 -27121 -28363 -26993
16168 -26993 -30088 -35638 -37768 -43212 -46250 -42201 -42043 -38101 -31861 -35444 -34652 -31747 -25900 -25305 -24474
16153 -24474 -28403 -31326 -30196 -30550 -27242 -24122 -27508 -29990 -35668 -32002 -29458 -31052 -32217 -33732 -25682
16138 -25682 -22952 -29740 -29663 -28150 -27044 -25297 -25292 -25894 -29553 -29115 -27715 -25607 -25824 -26710 -26905 -26341 -25568
16121 -25568 -23406 -25338 -25772 -23101 -24844 -31020 -31112 -26715 -34058 -45666 -45175 -36502 -36931 -33791 -29717
$$ packed form
16228c5732n865K16J1297N208j268P70l206J946Q021k602q66j761p850P59J181
16213b9752m01k15o595K982O638J341N32j66M269K028m954P728L105K510m429
16198a5379j447L280J204o303k337K532J763M90j010q053j811O881j908k806m27
16183b5331K558k881k635M35k010l126j514K101L170N30j388j60L130j242J370
16168b6993l095n550k130n444l038M049J58L942O240l583P92K905N847N95Q31
16153b4474l929k923J130l54L308L120l386k482n678L666K544j594j165j515Q050
16138b5682K730o788P7J513J106J747No02l659M38J400K108k17q86j95N64P73
16121b5568K162j932m34K671j743o176r2M397p343j1608M91Q673m29L140M074
$$ plain form
16106 -29717 -30726 -34679 -32600 -21448 -16811 -21700 -25544 -28208 -25098 -26695 -33117 -33224 -29340 -28960 -27170
16091 -27170 -22772 -27699 -27930 -32746 -33885 -29237 -30269 -24436 -20922 -24634 -21599 -17532 -15870 -22278 -24529
16076 -24529 -22604 -31747 -40126 -39179 -37563 -36187 -28360 -26334 -29625 -32550 -30482 -27616 -29425 -31949 -34761
16061 -34761 -36401 -33485 -30989 -23210 -18573 -15028 -8674 -12937 -16587 -17193 -19852 -20198 -25095 -21780 -19611
16046 -19611 -26301 -28342 -29389 -29871 -31783 -31131 -36883 -38498 -30241 -22788 -24209 -23570 -21954 -27397 -26824
16031 -26824 -24126 -27204 -33383 -36329 -39382 -37903 -34836 -28747 -24970 -25396 -21927 -21029 -27915 -31929 -25050
16016 -25050 -20712 -24714 -22656 -25659 -23659 -19500 -20816 -24745 -29144 -23964 -21668 -15257 -11768 -10396
16002 -10396 -6121 -6871 -17782 -29919 -28626 -25821 -23764 -17944 -17219 -14551 -16389 -22379 -25015 -25872 -23788
$$ packed form
16106b9717j009l953K079J1152M637m889l844k664L110j597o422j07L884L80J790
16091b7170M398m927k31m816j139M648j032N833L514l712L035M067J662o408k251
16076b4529J925r143q379R47J616J376P827K026l291k925K068K866j809k524k812
16061c4761j640K916K496P779M637L545O354m263l650o06k659l46m897L315K169
16046a9611o690k041j047m82j912O52n752j615Q257P453j421O39J616n443N73
16031b6824K698l078o179k946l053J479L067O089L777m26L469Q98o886m014O879
16016b5050M338m002K058l003K000M159j316l929m399N180K296O411L489J372
16002a0396M275p50j0911j2137J293K805K057N820P25K668j838n990k636q57K084
$$ plain form
15987 -23788 -27125 -29641 -22892 -15292 -13502 -17388 -28547 -30133 -31825 -32284 -31656 -24673 -17001 -19611 -26653
15972 -26653 -22906 -25742 -28077 -24964 -23058 -28616 -29359 -32298 -28348 -25619 -23692 -23352 -25219 -27156 -25817
15957 -25817 -25278 -25117 -24651 -26281 -34484 -32046 -27187 -27187 -22316 -23363 -29971 -34227 -32306 -25276 -21850 -29014
15941 -29014 -32454 -32124 -29080 -29352 -32841 -30307 -29040 -24733 -27492 -35391 -37481 -35337 -31405 -30362 -28990
15926 -28990 -26177 -19909 -18551 -21894 -24373 -23991 -19718 -18775 -17839 -22588 -22072 -18458 -14443 -21219 -24796
15911 -24796 -20943 -14200 -15987 -24362 -25303 -24778 -27062 -23107 -22199 -14183 -12255 -17602 -25287 -27689 -29186
15896 -29186 -27152 -22322 -17838 -15117 -11192 -16072 -23307 -25013 -21530 -17750 -18455 -23654 -26833 -22419 -28877
15881 -28877 -34672 -33401 -30178 -26565 -24918 -22919 -21819 -19179 -20808 -14728 -12210 -13105 -19957 -24301 -17724
$$ packed form
15987b3788l337k516O749P600J790l886j1159j586j692m59O28O983P672k610p042
15972b6653L747k836k335L113J906n558p43k939L950K729J927L40j867j937J339
15957b5817N39J61M66j630q203K438M859%M871j047o608m256J921P030L426p164
15941b9014l440L30L044k72l489K534J267M307k759p899k090K144L932J043J372
15926b8990K813O268J358l343k479L82M273R43R36m749N16L614M015o776l577
15911b4796L853O743j787q375r41N25k284L955R08Q016J928n347p685k402j497
15896b9186K034M830M484K721L925m880p235j706L483L780p05n199l179M414o458
15881b8877n795J271L223L613J647J999J100K640j629O080K518q95o852m344O577
$$ plain form
15866 -17724 -10076 -8228 -12346 -16991 -23369 -27535 -26341 -21614 -20241 -15331 -12666 -16743 -21933 -31273
15852 -31273 -29936 -22610 -26067 -29913 -30662 -23477 -15921 -15084 -24087 -28485 -25075 -23474 -24592 -20073 -10441
15837 -10441 -6036 -15735 -20575 -23355 -25483 -30979 -27861 -26263 -24368 -29292 -36354 -31407 -23386 -19356
15823 -19356 -20163 -26560 -25410 -21470 -20319 -16151 -17695 -15850 -15590 -20013 -18437 -22267 -25148 -25872 -20205
15808 -20205 -10892 -8748 -11338 -13444 -13678 -18919 -26534 -26095 -24000 -20382 -17380 -17207 -21014 -19630 -16461
15793 -16461 -28184 -32215 -31892 -36850 -33294 -31948 -26845 -25861 -24361 -26629 -21328 -9782 -9398 -22823
15779 -22823 -32241 -34195 -30987 -24606 -23317 -19711 -24251 -27263 -24486 -20183 -20726 -24905 -27498 -26584 -25996
15764 -25996 -26808 -24564 -19812 -23443 -23693 -26361 -32200 -36575 -34868 -32501 -27811 -28647 -30487 -27404 -26503
$$ packed form
15866a7724P648J848m118m645o378m166J194M727J373M910K665m077n190r340
15852c1273J337P326l457l846p49P185P556Q37r003m398L410J601j118M519R632
15837a0441M405r699m840k780k128n496L118J598J895m924p062M947Q021M030
15823a9356q07o397J150L940J151M168j544J845K60m423J576l830k881p24N667
15808b0205R313K144k590k106k34n241p615M39K095L618L002J73l807J384L169
15793a6461j1723m031L23m958L556J346N103R84J500k268N301J1546L84j3425
15779b2823r418j954L208O381J289L606m540l012K777M303n43m179k593R14N88
15764b5996q12K244M752l631k50k668n839m375J707K367M690q36j840L083R01
$$ plain form
15749 -26503 -22204 -18854 -19597 -21620 -29201 -30039 -28962 -26205 -23521 -22834 -25567 -22146 -23920 -25317 -28102
15734 -28102 -27118 -21999 -24191 -25559 -24600 -25314 -16923 -19319 -23386 -22443 -28009 -29762 -25782 -26442 -31216 -31915
15718 -31915 -28915 -26316 -18987 -14364 -14003 -19988 -26494 -27965 -26639 -30796 -32307 -31083 -26893 -25358 -24073
15703 -24073 -17352 -9703 -8844 -12238 -15118 -22901 -25919 -22758 -19174 -20098 -24517 -23646 -25345 -30098 -31004
15688 -31004 -26407 -19764 -17306 -18373 -11683 -11642 -14257 -17064 -16466 -20371 -23045 -15796 -14011 -14964 -15194 -11205
15672 -11205 -17020 -22261 -23290 -22906 -20738 -21162 -22014 -27924 -26715 -27145 -26323 -20841 -17487 -24326 -23372 -19191
15656 -19191 -17607 -15692 -14095 -15532 -24047 -24066 -20262 -16778 -13974 -16520 -15057 -20794 -17205 -14238 -16368
15641 -16368 -22161 -25531 -26482 -28141 -26233 -30890 -34543 -23734 -15464 -12788 -7652 -10968 -18861 -25143
$$ packed form
15749b6503M299L350p43k023p581q38J077K757K684O87k733L421j774j397k785
15734b8102R84N119k192j368R59p14Q391k396m067R43n566j753L980o60m774o99
15718c1915L000K599P329M623L61n985o506j471J326m157j511J224M190J535J285
15703b4073O721P649Q59l394k880p783l018L161L584r24m419Q71j699m753r06
15688c1004M597O643K458j067O690M1k615k807N98l905k674P249J785r53k30L989
15672a1205n815n241j029L84K168m24q52n910J209m30Q22N482L354o839R54M181
15656a9191J584J915J597j437q515j9L804L484K804k546J463n737L589K967k130
15641a6368n793l370r51j659J908m657l653J0809Q270K676N136l316p893o282
$$ plain form
15627 -25143 -29418 -27911 -28710 -25998 -20870 -17113 -15148 -15625 -23022 -26276 -29690 -27998 -27005 -26503 -23732
15612 -23732 -24665 -27984 -27037 -22985 -24637 -22099 -21911 -18536 -14383 -15299 -16296 -20417 -26264 -19667 -8389
15597 -8389 -2994 -7443 -16488 -21812 -21567 -22918 -24012 -29414 -28273 -26287 -21234 -17469 -17594 -23038 -23038 -17408
15581 -17408 -15392 -17001 -19823 -20594 -18378 -10877 -7222 -9108 -12584 -19700 -22979 -26511 -31075 -33282 -30207
15566 -30207 -24662 -19942 -21834 -21202 -20875 -23845 -22685 -17962 -19612 -23129 -23468 -20280 -14893 -16074 -17596
15551 -17596 -10309 -11095 -15215 -12602 -12643 -12909 -14919 -15918 -15051 -21825 -21202 -24625 -25634 -23480 -19643 -20300
15535 -20300 -23534 -27259 -22793 -17241 -12616 -11544 -12639 -14621 -21324 -30845 -30423 -21824 -16470 -16234 -17247
15520 -17247 -16308 -19766 -22067 -20764 -16004 -16914 -19480 -23718 -20173 -14842 -14732 -21152 -26928 -27718 -29096
$$ packed form
15627b5143m275J507p99K712N128L757J965m77p397l254l414J692R93N02K771
15612b3732r33l319R47M052j652K538J88L375M153r16r97m121n847O597J1278
15597h389N395m449r045n324K45j351j094n402J141J986N053L765j25n444%N630
15581a7408K016j609k822p71K216P501L655j886l476p116l279l532m564k207L075
15566c0207N545M720j892O32L27k970J160M723j650l517l39L188N387j181j522
15551a7596P287p86m120K613m1k66k010r99Q67o774O23l423j009K154L837o57
15535b0300l234l725M466N552M625J072j095j982o703r521M22Q599N354K36j013
15520a7247R39l458k301J303M760r10k566m238L545N331J10o420n776p90j378
$$ plain form
15505 -29096 -24838 -22434 -22268 -24649 -24071 -23806 -18973 -16733 -14855 -17204 -14169 -13378 -13517 -18912 -23634 -23687
15489 -23687 -21916 -20302 -20727 -20128 -14594 -11934 -16836 -17882 -14968 -23615 -19647 -17198 -20694 -18993 -16784
15474 -16784 -20178 -28766 -24111 -28465 -28672 -24149 -26822 -29859 -30367 -28684 -22076 -16579 -20141 -26392 -30176
15459 -30176 -22444 -18972 -19947 -19329 -21689 -21203 -16777 -15602 -20346 -26142 -25729 -21127 -16291 -11481 -9963
15444 -9963 -11685 -7252 -8675 -14407 -14952 -6665 -4475 -10624 -13878 -15464 -23999 -21986 -22369 -23708 -22220
15429 -22220 -20166 -21254 -19011 -20932 -22669 -21915 -16613 -16298 -16225 -22691 -22923 -19285 -15723 -15536 -12885 -16675
15413 -16675 -25532 -22137 -13355 -15395 -24192 -28194 -26811 -21200 -15123 -11859 -10281 -6701 -12416 -21085
15399 -21085 -19098 -14125 -14235 -12266 -9785 -7715 -10295 -15204 -18107 -14193 -9082 -14674 -16123 -15717 -16627
$$ packed form
15505b9096M258K404J66k381N78K65M833K240J878k349L035P91j39n395m722n3
15489b3687J771J614m25N99N534K660m902j046K914q647L968K449l496J701K209
15474a6784l394q588M655m354k07M523k673l037n08J683O608N497l562o251l784
15459c0176P732L472r75O18k360M86M426J175m744n796M13M602M836M810J518
15444i963j722M433j423n732n45Q287K190o149l254j586q535K013l83j339J488
15429b2220K054j088K243j921j737P54N302L15P3o466k32L638L562J87K651l790
15413a6675q857L395Q782k040q797m002J383N611O077L264J578L580n715q669
15399b1085J987M973j10J969K481K070k580m909k903L914N111n592j449M06r10
$$ plain form
15384 -16627 -19686 -17150 -12225 -11695 -7775 -4738 -8201 -12345 -13206 -17658 -21536 -17314 -14890 -10140 -10254
15369 -10254 -20787 -23236 -23950 -19646 -22167 -24651 -18457 -21521 -21576 -21218 -22965 -21091 -16319 -16818 -27519
15354 -27519 -27020 -24653 -25614 -26756 -22278 -25233 -25194 -18403 -15347 -19319 -15633 -14962 -18699 -17838 -21666 -29026
15338 -29026 -31142 -27751 -29110 -28997 -28925 -24613 -21573 -16902 -18334 -29553 -32474 -24880 -20068 -20832 -21067
15323 -21067 -22323 -23762 -18680 -18193 -19377 -23626 -18590 -16401 -16522 -20941 -18533 -19889 -21084 -21870 -19370
15308 -19370 -25398 -24420 -20184 -18591 -20686 -21519 -16202 -16030 -9790 -10550 -18856 -20108 -16994 -11123 -10557 -11020
15292 -11020 -15126 -15973 -17157 -16207 -18370 -18286 -15720 -15033 -13804 -14802 -18303 -17547 -16970 -15030 -18171 -19747
15276 -19747 -20654 -18333 -13897 -18808 -22184 -18884 -18518 -17635 -23924 -23169 -22838 -23887 -26888 -33004 -31312 -21595
$$ packed form
15384a6627l059K536M925N30L920L037l463m144q61m452l878M222K424M750j14
15369a0254j0533k449p14M304k521k484O194l064n5L58j747J874M772m99j0701
15354b7519M99K367r61j142M478k955L9O791L056l972L686O71l737Q61l828p360
15338b9026k116L391j359J13P2M312L040M671j432j1219k921P594M812p64k35
15323b1067j256j439N082M87j184m249N036K189j21m419K408j356j195p86K500
15308a9370o028R78M236J593k095q33N317J72O240p60q306j252L114N871N66m63
15292a1020m106q47j184R50k163Q4K566O87J229r98l501P56N77J940l141j576
15276a9747r07K321M436m911l376L300L66Q83o289P55L31j049l001o116J692R717
$$ plain form
15260 -21595 -21605 -20991 -20586 -23968 -23618 -28487 -24253 -18916 -14581 -12789 -15886 -15349 -15438 -14218 -15443 -19877
15244 -19877 -17356 -12247 -13461 -21041 -20655 -19280 -23189 -29776 -29962 -31802 -32679 -29076 -24683 -24322 -27610
15229 -27610 -29552 -29801 -29001 -24859 -18257 -20206 -22079 -20798 -20181 -20715 -26507 -24842 -24136 -24068 -21496 -19857
15213 -19857 -16940 -15607 -10767 -12593 -16134 -16816 -15662 -11341 -11630 -17315 -16813 -12809 -15984 -16001 -16682 -23294
15197 -23294 -28318 -21612 -19559 -14880 -17639 -15388 -13236 -14743 -13800 -13019 -16287 -19937 -16492 -16353 -13331
15182 -13331 -14351 -16326 -13430 -15288 -19455 -22163 -19568 -14776 -16629 -18352 -20455 -17248 -13304 -6912
15168 -6912 -2892 -6306 -9860 -13874 -18091 -15385 -15575 -22683 -24861 -26727 -25462 -19184 -14084 -12324 -12533
15153 -12533 -12600 -17479 -21614 -22173 -19212 -20424 -19802 -20644 -24469 -15524 -7564 -3383 -8349 -17362 -15968 -11783
$$ packed form
15260b1595j0O14M05l382L50m869M234N337M335J792l097N37q9J220j225m434
15244a9877K521N109j214p580L86J375l909o587j86j840q77L603M393L61l288
15229b7610j942k49Q00M142O602j949j873J281O17n34n792J665P06O8K572J639
15213a9857K917J333M840j826l541o82J154M321k89n685N02M004l175j7o81o612
15197b3294n024O706K053M679k759K251K152j507R43P81l268l650L445J39L022
15182a3331j020j975K896j858m167k708K595M792j853j723k103L207L944O392
15168f912M020l414l554m014m217K706j90p108k178j866J265O278N100J760k09
15153a2533o7m879m135n59K961j212O22q42l825Q945P960M181m966r013J394M185
$$ plain form
15137 -11783 -16726 -20715 -22809 -24048 -30742 -27759 -30534 -27446 -22550 -20334 -22151 -26579 -29367 -26745
15123 -26745 -26361 -25839 -21283 -21085 -22900 -12659 -10305 -14070 -12729 -10453 -9940 -13558 -20136 -20141 -12102 -5183
15107 -5183 -7468 -9746 -15051 -12398 -14489 -14662 -12024 -14668 -18617 -15447 -8169 -14922 -17652 -15630 -11111
15092 -11111 -14338 -15290 -17856 -16325 -13341 -13159 -14929 -16822 -17046 -20839 -22159 -21449 -13657 -7406 -12735
15077 -12735 -22958 -23918 -25966 -22144 -14441 -11302 -13340 -13100 -11668 -11851 -9254 -8426 -9407 -12020 -13018 -10840
15061 -10840 -13910 -18889 -14385 -15034 -16642 -15383 -15725 -21493 -23920 -17618 -19202 -22038 -20483 -10251 -11700
15046 -11700 -14166 -15232 -11603 -7361 -11647 -18428 -16940 -21393 -21652 -24678 -25417 -28241 -21102 -20003 -18414
15031 -18414 -24082 -22311 -15901 -11300 -14719 -12420 -13666 -8324 -1224 -2655 -5793 -7535 -6962 -7961 -7751
$$ packed form
15137a1783m943l989k094j239o694K983k775L088M896K216j817m428k788K622
15123b6745L84N22M556J98j815J0241K354l765J341K276N13l618o578nQ039O919
15107e183k285k278n305K653k091j73K638k644l949L170P278o753k730K022M519
15092a1111l227r52k566J531K984J82j770j893k24l793j320P10P792O251n329
15077a2735j0223r60k048L822P703L139k038K40J432j83K597Q28r81k613r98K178
15061a0840l070m979M504o49j608J259l42n768k427O302j584k836J555J0232j449
15046a1700k466j066L629M242m286o781J488m453k59l026p39k824P139J099J589
15031a8414n668J771O410M601l419K299j246N342P100j431l138j742N73r99K10
$$ plain form
15016 -7751 -9269 -8723 -15702 -12446 -15168 -20936 -19579 -10751 -6302 -10295 -13223 -18197 -15806 -17772 -16489
15001 -16489 -19200 -19569 -13896 -6601 -11813 -14486 -19654 -19165 -14607 -16330 -17414 -14919 -13585 -17132 -15497
14986 -15497 -18983 -20108 -16247 -15893 -14772 -14210 -16200 -13226 -11249 -8436 -7902 -21146 -19816 -18997 -24101
14971 -24101 -23172 -20870 -15144 -14486 -15557 -16505 -12700 -9629 -13040 -14163 -13634 -18815 -20384 -24597 -21447
14956 -21447 -21038 -18205 -10857 -6427 -8627 -10993 -13921 -15123 -11925 -17925 -16750 -11260 -2103 15131
14942 15131 32358 64336 111274 141186 138249 116374 73186 37611 12830 -1366 -6635 -2637
14930 -2637 -4098 -6874 -5718 -11257 -12999 -15015 -16377 -14197 -13997 -13655 -18808 -14821 -5303 -10389 -15950
14915 -15950 -13723 -18409 -18311 -15015 -24388 -35863 -36616 -31086 -28657 -31388 -22913 -18147 -10889 -9801 -11549
$$ packed form
15016g751j518N46o979L256k722n768J357Q828M449l993k928m974K391j966J283
15001a6489k711l69N673P295n212k673n168M89M558j723j084K495J334l547J635
14986a5497l486j125L861L54J121N62j990K974J977K813N34j3244J330Q19n104
14971b4101R29K302N726O58j071r48L805L071l411j123N29n181j569m213L150
14956b1447M09K833P348M430k200k366k928j202L198o000J175N490R157J7234
14942A5131J7227L1978M6938K9912k937k1875m3188l5575k4781j4196n269L998
14930b637j461k776J156n539j742k016j362K180K00L42n153L987R518n086n561
14915a5950K227m686R8L296r373j1475p53N530K429k731Q475M766P258J088j748
$$ plain form
14900 -11549 -13404 -9305 -7687 -14359 -23189 -23131 -18895 -17300 -13325 -15573 -19890 -21309 -18371 -20102 -15105
14885 -15105 -10974 -12699 -16817 -25494 -25871 -20398 -16667 -11649 -10935 -10393 -9792 -12550 -18387 -17584 -14540 -13927
14869 -13927 -16240 -19222 -22858 -25600 -30259 -23161 -17910 -16669 -14058 -6611 -7950 -9614 -8420 -14043
14855 -14043 -15862 -15689 -18029 -18465 -20097 -19857 -17703 -16334 -15208 -14458 -16422 -14869 -12995 -14059 -20293
14840 -20293 -16705 -22351 -23918 -16127 -12311 -12819 -13686 -10061 -10616 -14322 -14500 -17482 -14500 -17815 -18015 -13103
14824 -13103 -11264 -11727 -13096 -14635 -16258 -17632 -12651 -17207 -13302 -6779 -6787 -13663 -15855 -18455 -18576 -19174
14808 -19174 -19055 -18252 -16800 -13646 -11613 -13326 -13308 -17273 -20530 -19711 -17162 -17447 -26037 -23061 -14322 -6690
14792 -6690 -12655 -13633 -7403 -6029 -8456 -4481 3092 2282 -4153 -6160 -4495 -5939 -6220 -6822 -9501 -10110
$$ packed form
14900a1549j855M099J618o672q830N8M236J595L975k248m317j419K938j731M997
14885a5105M131j725m118q677l77N473L731N018P14N42O01k758n837Q03L044O13
14869a3927k313k982l636k742m659P098N251J241K611P447j339j664J194n623
14855a4043j819J73k340m36j632K40K154J369J126P50j964J553J874j064o234
14840b0293L588n646j567P791L816n08q67L625n55l706j78k982K982l315k00M912
14824a3103J839m63j369j539j623j374M981m556L905O523qo876k192k600j21n98
14808a9174J19Q03J452L154K033j713J8l965l257Q19K549k85q590K976Q739P632
14792f690n965r78O230J374k427L975P573q10o435k007J665j444k81o02k679o09
$$ plain form
14776 -10110 -12858 -17990 -18961 -15853 -15386 -12641 -11101 -3820 -4848 -12011 -10504 -7249 -14026 -15680 -20718
14761 -20718 -18282 -17094 -19077 -21850 -17132 -15314 -17189 -16964 -13421 -11351 -14523 -13117 -11687 -17438 -19793
14746 -19793 -13746 -7651 -12206 -20159 -20687 -19482 -18243 -17301 -20930 -18322 -15417 -14528 -15930 -18724 -24074
14731 -24074 -21993 -22536 -20858 -13710 -11047 -11146 -14273 -10860 -11080 -14285 -13917 -16957 -18281 -17566 -18537 -22623
14715 -22623 -26488 -20565 -12426 -15876 -21618 -21353 -21810 -22957 -21231 -23820 -22940 -16388 -15090 -21537 -21083
14700 -21083 -18186 -15772 -17148 -14645 -11256 -12841 -14903 -18775 -21688 -21425 -25783 -22823 -20419 -21351 -25017
14685 -25017 -27560 -24583 -20998 -18755 -19846 -18976 -24215 -23302 -20287 -21785 -21396 -17214 -15305 -16737 -17723
14670 -17723 -21626 -16863 -12235 -8420 -7708 -10139 -14587 -17291 -15175 -13579 -18089 -16253 -9950 -9090 -13062
$$ packed form
14776a0110k748n132r71L108M67K745J540P281j028p163J507L255o777j654n038
14761b0718K436J188j983k773M718J818j875K25L543K070l172J406J430n751k355
14746a9793O047O095m555p953n28J205J239R42l629K608K905Q89j402k794n350
14731b4074K081n43J678P148K663r9l127L413k20l205L68l040j324P15r71m086
14715b2623l865N923Q139l450n742K65m57j147J726k589Q80O552J298o447M54
14700b1083K897K414j376K503L389j585k062l872k913K63m358K960K404r32l666
14685b5017k543K977L585K243j091Q70n239R13L015j498L89M182J909j432r86
14670a7723l903M763M628L815P12k431m448k704K116J596m510J836O303Q60l972
$$ plain form
14655 -13062 -16299 -11370 -8588 -9254 -8187 -9303 -14249 -11017 -11740 -11502 -11115 -13212 -14566 -17738 -23145
14640 -23145 -22084 -19575 -13908 -13021 -12527 -17294 -22458 -25073 -16134 -17268 -23073 -18342 -12308 -9658 -8046
14625 -8046 -10782 -13848 -14021 -14917 -14558 -15507 -12866 -12923 -15426 -14440 -13219 -15922 -17225 -11541 -10897 -8715 -13016
14608 -13016 -8946 -7019 -10897 -16414 -16527 -9301 -12590 -15549 -14333 -4301 -2828 -9456 -13423 -11911
14594 -11911 -14341 -9375 -6220 -12654 -17320 -23034 -18190 -8846 -5528 -4404 -9696 -13147 -11633 -12164 -10745
14579 -10745 -5381 -8934 -15652 -9656 15 -1366 -9586 -14407 -11145 -11627 -16960 -18233 -18715 -13553 -5936
14564 -5936 -447 -3321 -4940 1657 1906 -535 -1815 -2855 1200 596 1709 3683 1918 869 -1932
14549 -1932 -5721 -10831 -10023 -2914 -1734 -5876 -12427 -12459 -9968 -7087 -7164 -11712 -14356 -12794 -15133 -16599
$$ packed form
14655a3062l237M929K782o66J067j116m946L232p23K38L87k097j354l172n407
14640b3145J061K509N667Q87M94m767n164k615Q939j134n805M731O034K650J612
14625h046k736l066j73q96L59r49K641n7k503R86J221k703j303N684O44K182m301
14608a3016M070J927l878n517j13P226l289k959J216J0032J473o628l967J512
14594a1911k430M966L155o434m666n714M844R344L318J124n292l451J514n31J419
14579a0745N364l553o718N996R671j381q220m821L262m82n333j273m82N162P617
14564e936N489k874j619O597K49k441j280j040M055o04J113J974j765j049k801
14549a932l789n110Q08P109J180m142o551l2K491K881p7m548k644J562k339j466
$$ plain form
14533 -16599 -20086 -23062 -20130 -20499 -19070 -11046 -7304 -6839 -8169 -14321 -10177 -3458 -3989 -7208 -7518
14518 -7518 -193 -1047 -2779 -8549 -10616 -4711 -2313 -3716 3227 3758 1233 209 -3149 -249 -517
14503 -517 -1898 -7506 -8949 -9983 -8283 -5453 -8607 -15029 -15179 -11316 -11376 -15076 -19361 -19933 -21123 -14895
14487 -14895 -9938 -13281 -15840 -17970 -14029 -14558 -13399 -13467 -17408 -17540 -6355 -2662 -2308 -6911 -10824
14472 -10824 -10125 -9108 -10063 -7972 -6487 924 3327 98 -348 4427 3624 1043 -1097 -4504 2366
14457 2366 -275 -5751 -7597 -7287 -8774 -454 4765 2519 -4181 -5131 -4976 -8113 -8917 -6732 -3203 -1711
14441 -1711 -5404 -3950 364 -1856 -4516 -6244 -9913 -9420 -6220 -8656 -8479 -1844 6434 9101 1120
14426 1120 -4428 -3772 -3229 696 2063 1099 -2630 3449 3297 3669 1705 -269 -8215 -11137 -11665 -8981
$$ packed form
14533a6599l487k976K932l69J429Q024L742M65j330o152M144O719n31l219l10
14518g518P325q54j732n770k067N905K398j403O943N31k525j024l358K900k68
14503e17j381n608j443j034J700K830l154o422j50L863o0l700m285n72j190O228
14487a4895M957l343k559k130L941n29J159o8l941j32J1185L693L54m603l913
14472a0824O99J017r55K091J485P411K403l229m46M775q03k581k140l407O870
14457B366k641n476j846L10j487Q320N219k246o700r50J55l137q04K185L529J492
14441a711l693J454M314k220k660j728l669M93L200k436J77O635Q278K667p981
14426A120n548O56N43L925J367r64l729O079j52L72j964j974p946k922n28K684
$$ plain form
14410 -8981 -4195 -3783 6153 15747 16545 15249 17982 15997 13600 13254 11771 10309 7448 7249 6157 6079
14394 6079 6453 9730 6625 2070 4092 7200 6852 5235 10660 9090 2382 2481 3034 4733 11508 16070
14378 16070 13974 12799 13194 15256 14509 17861 15919 12994 19843 27760 31640 30267 27951 23729 27130
14363 27130 32163 38984 41435 41541 36234 36248 37399 32877 33036 41649 47045 48846 50523 48496 45636
14348 45636 38389 34972 43669 42891 42148 41304 45739 48355 55089 49066 45869 46354 53070 53595 55472 58246
14332 58246 58605 52621 61659 66505 64798 56972 54299 58429 63645 58611 58260 57973 62946 66619 66891
14317 66891 73233 80565 83345 85115 76866 80166 77097 73014 76682 82533 89700 86854 82123 90216
14303 90216 93812 91291 88564 94114 102588 98393 96323 97849 104384 108832 108355 102474 99357 104217 108084
$$ packed form
14410h981M786M12R936R594P98j296K733j985k397l46j483j462k861j99j092p8
14394F079L74L277l105m555K022L108l48j617N425j570o708R9N53J699O775M562
14378A6070k096j175L95K062p47L352j942k925O849P917L880j373k316m222L401
14363B7130N033O821K451J06n307J4J151m522J59Q613N396J801J677k027k860
14348D5636p247l417Q697p78p43q44M435K616O734o023l197M85O716N25J877K774
14332E8246L59n984R038M846j707p826k673M130N216n034l51k87M973L673K72
14317F6891O342P332K780J770q249L300l069m083L668N851P167k846m731Q093
14303I0216L596k521k727N550Q474m195k070J526O535M448m77n881l117M860L867
$$ plain form
14288 108084 109171 107988 110990 110516 114848 115998 112442 111599 112054 109674 107908 112660 112424 116020 115640
14273 115640 114759 119068 123510 126916 130876 133515 136254 138984 143727 139895 130751 128705 124634 121823
14259 121823 123817 129811 142093 145899 151147 152695 154893 159234 163428 161849 155008 147530 144992 149902
14245 149902 143038 136648 139042 139337 142873 147999 148551 151063 152835 149473 145392 144857 145150 144819 147472
14230 147472 146590 146912 145150 144168 140573 138182 142179 143792 142379 138963 141108 142935 143490 143878 142388
14215 142388 138422 147549 152996 147429 149067 152568 152552 152663 151606 151157 141026 131675 133262 134984 138367
14200 138367 133700 131323 128678 122886 119907 120031 120385 123871 127334 129121 123778 117916 118024 110665 104982
14185 104982 104150 106132 111179 113438 110220 106414 98917 96293 98561 98472 98565 97551 97426 98003 90718 87332
$$ packed form
14288A08084J087j183L002m74M332J150l556q43M55k380j766M752k36L596l80
14273A15640q81M309M442L406L960K639K739K730M743l832r144k046m071k811
14259A21823J994N994J2282L806N248J548K198M341M194j579o841p478k538M910
14245A49902o864o390K394K95L536N126N52K512J772l362m081n35K93l31K653
14230A47472q82L22j762r82l595k391L997J613j413l416K145J827N55L88j490
14215A42388l966R127N447n567J638L501j6J11j057m49j0131r351J587J722L383
14200A38367m667k377k645n792k979J24L54L486L463J787n343n862J08p359n683
14185A04982q32J982N047K259l218l806p497k624K268q9R3j014j25N77p285l386
$$ plain form
14169 87332 92428 99916 101146 92200 86474 86666 82914 81231 79563 76931 80502 82179 78478 76911 83114
14154 83114 87807 80555 82032 77752 72147 76782 69850 65234 66908 63496 59169 55358 57734 64891
14140 64891 64377 63778 60325 55534 50881 47876 50729 55735 58733 56433 55028 49554 51465 47728 48666
14125 48666 49154 50154 47794 49218 46171 42581 36012 23775 20088 22284 23015 31332 34848 32839 34846
14110 34846 36075 38206 33443 26206 23613 22533 19849 17376 18459 27596 38544 37060 35228 36765
14096 36765 32350 29169 22034 25461 29975 31154 32159 26144 19084 18250 16884 12622 13295 17648 24417
14081 24417 23029 21585 19679 16033 16989 12590 9870 8526 9583 12193 13664 11348 7853 4673 6514
14066 6514 9448 12730 11580 12871 18493 20049 13346 12591 16841 16771 14134 10388 4791 220 7136
$$ packed form
14169H7332N096P488J230q946n726J92l752j683j668k632L571J677l701j567O203
14154H3114M693p252J477m280n605M635o932m616J674l412m327l811K376P157
14140F4891n14n99l453m791m653l005K853N006K998k300j405n474J911l737R38
14125D8666M88J000k360J424l047l590o569j2237l687K196P31Q317L516k009K007
14110C4846J229K131m763p237k593j080k684k473J083R137J0948j484j832J537
14096C6765m415l181p135L427M514J179J005o015p060q34j366m262O73M353O769
14081B4417j388j444j906l646R56m399k720j344J057K610J471k316l495l180J841
14066F514K934L282j150J291N622J556o703p55M250p0k637l746n597m571O916
$$ plain form
14051 7136 10853 13957 16595 21123 18534 12932 14341 13692 9524 9825 9302 8362 3322 4287 2322 2653
14035 2653 4805 9902 13664 7758 8888 8265 10191 14257 15875 15371 16717 14343 10881 10225 13930
14020 13930 13883 8456 -123 1121 641 -994 711 5206 10811 12700 6713 8190 19678 17416 16560
14005 16560 15802 9499 8852 11217 7746 12345 17697 20205 19636 22498 22365 19039 22241 20590 14562
13990 14562 10456 695 -3333 -2927 2687 7466 8998 9588 15336 15374 13116 12233 18499 23128 22475 17919
13974 17919 14205 16122 16109 13389 17471 22584 24907 24307 26609 23745 18599 21890 26058 24252 19614
13959 19614 18594 17945 13188 17560 16604 12719 17301 21947 32018 39270 39706 43807 43675 40675 35376
13944 35376 31119 33044 36768 39019 43476 44982 46518 50208 52979 56636 58011 59306 62997 69816
$$ packed form
14051G136L717L104K638M528k589n602J409o49m168L01n23r40n040R65j965L31
14035B653K152N097L762n906J130o23J926M066J618n04J346k374l462o56L705
14020A3930m7n427q579J244m80j635J705M495N605J889n987J477J1488k262q56
14005A6560p58o303o47K365l471M599N352K508n69K862j33l326L202j651o028
13990A4562m106r761m028M06N614M779J532N90N748L8k258q83O266M629o53m556
13974A7919l714J917j3k720M082N113K323o00K302k864n146L291M168j806m638
13959A9614j020o49m757M372r56l885M582M646J0071P252M36M101j32l000n299
13944C5376m257J925L724K251M457J506J536L690K771L657J375J295L691O819
$$ plain form
13930 69816 66960 67589 77327 90364 101330 116057 124718 133307 153186 174566 198386 225356 251021
13917 251021 280542 318032 371142 432150 510849 613180 741240 910897 1138226 1417238
13907 1417238 1725183 2045755 2348772 2597119 2760454 2832303 2788338 2643844 2412581 2112709
13897 2112709 1787491 1468255 1175303 936682 747577 605556 502195 420283 352362 304006
13887 304006 267800 235078 206419 189702 174470 160249 138362 127151 115527 99369 86290
13876 86290 80581 70328 59716 54931 55186 52042 43969 37319 35989 40922 40928 39097 33260 25782 21556
13861 21556 18466 17511 17288 19688 13553 14990 20529 24873 29101 28786 21678 18278 15889 17752 11936
13846 11936 5935 10876 17490 19556 17497 17339 18721 19777 12399 12326 15579 20000 20514 20411 16795 13186
$$ packed form
13930F9816k856O29R738J3037J0966J4727Q661Q589J9879K1380K3820K6970K5665
13917B51021K9521L7490N3110O1008P8699J02331J28060J69657K27329K79012
13907A417238L07945L20572L03017K48347J63335P1849m3965j44494k31263k99872
13897B112709l25218l19236k92952k38621j89105j42021j03361q1912o7921m8356
13887C04006l6206l2722k8659j6717j5232j4221k1887j1211j1624j6158j3079
13876H6290n709j0253j0612m785K55l144q073o650j330M933Oj831n837p478m226
13861B1556l090r55k23K400o135J437N539M344M228l15p108l400k389J863n816
13846A1936o001M941O614K066k059j58J382J056p378p3L253M421N14j03l616l609
$$ plain form
13830 13186 10873 4242 1821 2323 2656 4796 6181 8635 9940 7396 4340 6280 14964 23227 17274
13815 17274 14957 16203 8806 -622 3187 10989 18991 20844 24155 22201 23654 27299 33556 40436
13801 40436 48086 50855 59454 69170 79164 95042 110899 127200 150821 181327 220198 260917 302108
13788 302108 340646 378920 414940 444153 470236 481310 481164 477519 464776 457011 452004 445340 440473
13775 440473 448077 455416 456390 458183 457089 458594 459342 444947 417418 385941 351663 314381 272965
13762 272965 228713 193148 164656 136885 107236 87424 73084 57666 53551 51568 47299 42739
13750 42739 35974 29447 25126 21241 26159 22399 20697 26359 30024 24635 23641 21077 22243 19592 19370
13735 19370 21488 22071 15366 10240 12081 11775 17465 23399 24907 22809 20529 23147 25119 20178 12524
$$ packed form
13830A3186k313o631k421N02L33K140J385K454J305k544l056J940Q684Q263n953
13815A7274k317J246p397r428L809P802Q002J853L311j954J453L645O257O880
13801D0436P650K769Q599R716R994J5878J5857J6301K3621L0506L8871M0719M1191
13788C02108L8538L8274L6020K9213K6083J1074j46l645j2743p765n007o664m867
13775D40473P604P339R74J793j094J505P48j4395k7529l1477l4278l7282m1416
13762B72965m4252l5565k8492k7771k9649j9812j4340j5418m115j983m269m560
13750D2739o765o527m321l885M918l760j702N662L665n389r94k564J166k651k22
13735A9370K118N83o705n126J841l06N690N934J508k098k280K618J972m941p654
$$ plain form
13720 12524 14326 16771 20528 35930 47233 47557 46930 47132 45837 43895 47073 51866 57752 58508 57510
13705 57510 65553 71358 76193 92262 109856 125592 150959 184387 221596 262661 310795 364551
13693 364551 416418 457253 489219 516733 538061 545544 540414 530863 519487 511708 505490 499235 492791
13680 492791 486458 492712 504466 517040 522792 523113 516081 498254 464111 422626 380261 336216 292518
13667 292518 248353 207289 168771 140641 114427 98389 77655 68268 62428 57427 52814 49387
13655 49387 48069 44652 44695 50999 50381 47743 48118 42191 28482 14556 11914 10107 15302 16468 17763
13640 17763 22253 24768 20215 21040 22071 23053 24345 22413 25634 25152 18198 13794 9562 4546 329
13625 329 4602 7911 8087 10688 14802 16819 16960 17464 17790 19647 20344 14106 13165 17730 21574 20326
$$ packed form
13720A2524J802K445L757J5402J1303L24o27K02j295j942L178M793N886P56r98
13705E7510Q043N805M835J6069J7594J5736K5367L3428L7209M1065M8134N3756
13693C64551N1867M0835L1966K7514K1328P483n130r551j1376p779o218o255o444
13680D92791o333O254J1754J2574N752L21p032j7827l4143m1485m2365m4045m3698
13667B92518m4165m1064l8518k8130k6214j6038k0734r387n840n001m613l427
13655D9387j318l417M3O304o18k638L75n927j3709j3926k642j807N195J166J295
13640A7763M490K515m553Q25J031R82J292j932L221m82o954m404m232n016m217
13625C29M273L309J76K601M114K017J41N04L26J857O97o238r41M565L844j248
$$ plain form
13609 20326 22594 23447 18696 18473 19113 13094 8079 9986 8517 -3243 -972 8752 13145 17207 22069
13594 22069 28658 35354 47131 62233 82817 103921 110695 106482 89136 67574 54035 37166
13582 37166 26186 22634 19350 19939 19413 24263 23164 16057 12590 17259 23866 25103 18689 15350 17710
13567 17710 21326 21487 13250 15776 22595 25204 22568 26090 28722 30034 28382 26521 16149 17784
13553 17784 28005 39656 48660 64974 87268 112409 154523 211318 272237 316212 325429 289720
13541 289720 222101 159722 119737 86690 63366 49187 36716 29283 28015 30904 31125 25779 19891
13528 19891 13630 16310 18836 22282 18792 12173 12113 17879 25528 27010 22005 16104 13895 7983 7143
13513 7143 7002 14451 20276 29410 35003 42625 53019 58275 69426 90729 121842 170741 233996
$$ packed form
13609B0326K268Q53m751k23O40o019n015J907j469j1760K271R724M393M062M862
13594B2069O589O696J1777J5102K0584K1104O774m213j7346k1562j3539j6869
13582C7166j0980l552l284N89n26M850j099p107l467M669O607J237o414l339K360
13567A7710L616J61q237K526O819K609k636L522K632J312j652j861j0372J635
13553A7784J0221J1651R004J6314K2294K5141M2114N6795O0919M3975R217l5709
13541B89720o7619o2379l9985l3047k3324j4179j2471p433j268K889K21n346n888
13528A9891o261K680K526L446l490o619o0N766P649J482n005n901k209n912q40
13513G143j41P449N825R134N593P622J0394N256J1151K1303L1113M8899O3255
$$ plain form
13500 233996 298158 336878 332483 279284 203361 139487 99087 74545 55235 43533 41587 38237
13488 38237 32189 31027 24324 22928 24102 18919 14184 15926 14257 10541 7704 996 -244 537 1343
13473 1343 4232 10278 16735 25080 26793 27865 25427 29859 26131 19837 17821 25221 32446 37307 49810
13458 49810 59885 76801 99955 119204 129575 124659 102801 76727 58339 52820 50014 40834
13446 40834 35072 29759 26847 24589 24613 25450 28378 31359 25064 19864 18225 14247 11160 6694 4714
13431 4714 3870 2234 5648 10835 14287 17092 22181 20321 16697 10695 5045 3568 3643 8674 9444 9441
13415 9441 8425 6252 6169 11747 16262 18104 16345 16435 8907 3340 6206 9919 12954 12571 16867 24142
13399 24142 20332 10152 7780 12152 15388 13421 14380 18416 20823 16867 16040 14561 11098 9399 10889
$$ packed form
13500B33996O4162L8720m395n3199p5923o3874m0400k4542j9310j1702j946l350
13488C8237o048j162o703j396J174n183m735J742j669l716k837o708j240P81Q06
13473A343K889O046O457Q345J713J072k438M432l728o294k016P400P225M861J2503
13458D9810J0075J6916K3154J9249J0371m916k1858k6074j8388n519k806r180
13446D0834n762n313k912k258K4Q37K928K981o295n200j639l978l087m466j980
13431D714q44j636L414N187L452K805N089j860l624o002n650j477P5N031P70l
13415I441j016k173q3N578M515J842j759R0p528n567K866L713L035l83M296P275
13399B4142l810j0180k372M372L236j967R59M036K407l956q27j479l463j699J490
$$ plain form
13384 10889 19964 19343 15524 18338 17050 18381 22187 25437 19069 10223 12610 18433 16158 13866 12378
13369 12378 10280 8427 7411 11972 15628 19704 21280 19807 13732 11501 8026 3956 4752 1381 3085
13354 3085 4491 10103 10118 14523 22199 22193 10631 9724 14388 12395 12641 12858 17874 14426 12968 14218
13338 14218 11109 6367 7641 12105 15022 17276 14369 11808 10972 12875 13073 9376 13295 14040 12184
13323 12184 16072 20232 25819 21539 18715 13175 8315 13436 17189 13919 13176 15714 11075 7766 10233
13308 10233 14963 15202 8925 8307 15234 21604 16670 12137 9433 15511 20113 19579 13872 15134 20238
13293 20238 22168 20830 18899 16050 15521 18564 16294 14060 12351 16403 19207 19191 20025 25531 24772 25362
13277 25362 19459 19313 19979 18634 23259 23807 27096 28633 27546 28174 28791 27200 25413 27951 26113 26241
$$ packed form
13384A0889R075o21l819K814j288J331L806L250o368q846K387N823k275k292j488
13369A2378k098j853j016M561L656M076J576j473o075k231l475m070P96l371J704
13354C085J406N612J5M405P676oj1562r07M664j993K46K17N016l448j458J250
13338A4218l109m742J274M464K917K254k907k561q36J903J98l697L919P45j856
13323A2184L888M160N587m280k824n540m860N121L753l270p43K538m639l309K467
13308A0233M730K39o277o18O927O370m934m533k704O078M602n34n707J262N104
13293B0238J930j338j931k849n29L043k270k234j709M052K804j6Q34N506p59N90
13277B5362n903j46O66j345M625N48L289J537j087O28O17j591j787K538j838J28
$$ plain form
13261 26241 27173 34578 34480 35485 38459 32274 33767 36290 41511 33207 27002 24058 20773 25876 27866
13246 27866 30917 30725 23633 16362 15299 23211 29767 32212 30086 27257 27920 27870 32093 32005 31659 33562
13230 33562 35973 37620 39645 43920 39848 26023 24821 30614 37872 38071 35157 34431 34376 29522 27886
13215 27886 27549 26898 20912 19620 25042 28119 33647 33482 36670 34823 33663 39307 41340 37634 33995
13200 33995 30631 27616 29683 35272 36890 44935 46441 41193 33192 32925 33043 31474 33368 29468 30336
13185 30336 30094 29489 30950 33145 30898 33266 34536 35384 36081 39217 39395 39128 34741 29122 35186 43505
13169 43505 50280 48158 43274 44300 48863 47438 49603 53956 59275 64412 68579 77622 81645 88104
13155 88104 93309 103430 114178 136048 179687 236210 307859 375934 423852 430466 380673 302618
$$ packed form
13261B6241R32P405r8J005K974o185J493K523N221q304o205k944l285N103J990
13246B7866L051j92p092p271j063P912O556K445k126k829O63n0M223q8l46J903
13230C3562K411J647K025M275m072j3825j202N793P258J99k914p26n5m854j636
13215B7886l37o51n986j292N422L077N528j65L188j847j160N644K033l706l639
13200C3995l364l015K067N589J618Q045J506n248q001k67J18j569J894l900Q68
13185C0336k42o05J461K195k247K368J270Q48O97L136J78k67m387n619O064Q319
13169D3505O775k122m884J026M563j425K165M353N319N137M167R043M023O459
13155H8104N205J0121J0748K1870M3639N6523P1649O8075M7918O614m9793p8055
$$ plain form
13143 302618 231652 176059 141925 108226 90203 88704 86534 79973 72652 63825 61609 62014 60998
13130 60998 60234 66391 64836 66441 66139 68361 70232 73915 79243 88685 93301 92260 90003 88323 99472
13115 99472 102334 103666 115217 130339 154616 182395 206765 241816 308497 411223 567839 782230
13103 782230 1015641 1195583 1244795 1130442 908346 666214 465445 334629 253049 205215
13093 205215 179914 159239 142679 126443 118194 117168 114091 106711 94819 95006 95957 92663 83968
13080 83968 82646 86773 93105 94303 89657 96074 99939 100561 108089 116741 119491 128219 138007 146520 160269
13065 160269 182660 214865 251455 302834 395399 538417 746004 985121 1189986 1271522 1195997
13054 1195997 992390 739079 519165 367651 269838 209441 182040 166268 151332 139817
$$ packed form
13143C02618p0966n5593l4134l3699j8023j499k170o561p321q827k216M05j016
13130F0998p64O157j555J605l02K222J871L683N328R442M616j041k257j680J1149
13115I9472K862J332J1551J5122K4277K7779K4370L5051O6681J02726J56616K14391
13103G82230K33411J79942M9212j14353k22096k42132k00769j30816q1580m7834
13093B05215k5301k0675j6560j6236q249j026l077p380j1892J87R51l294q695
13080H3968j322M127O332J198m646O417L865O22P528Q652K750Q728R788Q513J3749
13065A60269K2391L2205L6590N1379R2565J43018K07587K39117K04865Q1536p5525
13054A195997k03607k53311k19914j51514r7813o0397k7401j5772j4936j1515
$$ plain form
13044 139817 125163 109570 98521 90249 92814 95197 89851 81423 81383 75037 77968 86089 89330 88396
13030 88396 83180 74835 77048 81759 82640 87273 88155 85758 89373 99579 105305 106764 115756 138383
13016 138383 175771 220115 286748 368401 441507 476244 459829 395895 313866 237990 173360
13005 173360 142514 121319 104346 98191 91990 81882 82274 83477 87088 93776 94629 86985 83652 85541
12991 85541 84638 78783 68331 66963 76541 81713 83213 73516 63879 65292 65072 65631 70693 79195 84700
12976 84700 82438 84038 85788 82826 76501 80514 80023 80532 80838 76623 81830 88721 88732 82767 76739 76288
12960 76288 82761 82924 88603 92589 92101 97019 114644 126435 130932 131455 117149 104518 88569 76870
12946 76870 64184 51053 40807 28680 18756 6627 9365 13309 17328 22486 26224 34955 42547
$$ packed form
13044A39817j4654j5593j1049q272K565K383n346q428m0o346K931Q121L241r34
13030H8396n216q345K213M711Q81M633Q82k397L615J0206N726J459Q992K2627
13016A38383L7388M4344O6633Q1653P3106L4737j6415o3934q2029p5876o4630
13005A73360l0846k1195j6973o155o201j0108L92J203L611O688Q53p644l333J889
12991H5541r03n855j0452j368R578N172J500r697r637J413k20N59N062Q502N505
12976H4700k262J600J750k962o325M013m91N09L06m215N207O891J1n965o028m51
12960G6288O473J63N679L986m88M918J7625J1791M497N23j4306j2631j5949j1699
12946G6870j2686j3131j0246j2127r924j2129K738L944M019N158L738Q731P592
$$ plain form
12933 42547 47413 52084 55119 52413 55283 62997 70982 77033 81253 82360 85671 88714 88763 92594 104376
12918 104376 115985 122565 119654 124629 141540 158404 175052 199480 238644 284317 336322 411822
12906 411822 501277 591561 678165 760913 814541 844063 840558 801578 727487 635855 540501 443353
12894 443353 358156 283262 228864 189731 158319 140325 134993 134139 126067 121520 115118 108174 101704
12881 101704 98720 90378 81448 72252 73108 74357 74841 71639 70246 70707 72545 76502 78394 74768 75467
12866 75467 74312 67800 64823 63554 65335 66315 62801 58034 61348 64443 70667 74650 76004 77787 82598
12851 82598 83655 87153 84906 84135 82506 74284 66755 69795 68413 62386 63004 66678 66171 66262 64773 57383
12835 57383 55534 56599 56365 50755 52618 56872 60111 53815 52527 50030 52261 60434 70260 64063 60448
$$ packed form
12933D2547M866M671L035k706K870P714P985O051M220J107L311L043M9L831J1782
12918A04376J1609O580k911M975J6911J6864J6648K4428L9164M5673N2005P5500
12906D11822Q9455R0284Q6604Q2748N3628K9522l505l8980p4091r1632r5354r7148
12894D43353q5197p4894n4398l9133l1412j7994n332q54q072m547o402o944o470
12881A01704k984q342q930r196Q56J249M84l202j393M61J838L957J892l626O99
12866G5467j155o512k977j269J781R80l514m767L314L095O224L983J354J783M811
12851H2598J057L498k247p71j629q222p529L040j382o027O18L674n07R1j489p390
12835E7383j849J065k34n610J863M254L239o296j288k497K231Q173R826o197l615
$$ plain form
12820 60448 68306 70733 78876 84248 85999 83614 84606 85176 80349 71309 67677 69348 83209 94249
12806 94249 91085 90858 96683 98263 95386 94432 98098 98387 101945 101335 101041 100309 96366 88909 83214 68796
12790 68796 57475 53118 45665 34528 31767 35409 41095 35153 29617 31575 30702 29613 43928 53020
12776 53020 56295 51899 46855 53175 57965 64212 66142 65008 73229 78469 80911 80587 87481 82729 86660
12761 86660 86727 81757 81194 85623 88445 98250 93718 87988 87594 90541 85990 78805 76838 73066 77652
12746 77652 84456 88492 89333 95194 94714 104741 119042 129573 146920 164651 189454 213776 227308
12733 227308 227708 226007 218808 212203 206927 193385 177800 166304 154808 149205 138865 129243 125729
12720 125729 124473 117224 119038 120644 122910 123632 118736 111310 109429 110028 111595 112915 116049 120538 119160
$$ packed form
12820F0448P858K427Q143N372J751k385R92N70m827r040l632J671J3861J1040
12806I4249l164k27N825J580k877r54L666K89L558o10k94p32l943p457n695j4418
12790F8796j1321m357p453j1137k761L642N686n942n536J958q73j089J4315R092
12776E3020L275m396n044O320M790O247J930j134Q221N240K442l24O894m752L931
12761H6660O7m970n63M429K822R805m532n730l94K947m551p185j967l772M586
12746G7652O804M036Q41N861m80J0027J4301J0531J7347J7731K4803K4322J3532
12733B27308M00j701p199o605n276j3542j5585j1496j1496n603j0340r622l514
12720A25729j256p249J814J606K266P22m896p426j881N99J567J320L134M489j378
$$ plain form
12705 119160 120735 120127 116522 116271 114108 114439 118677 112624 108297 103947 96478 90238 87928 86301 89301
12690 89301 86455 81473 86472 93653 95885 89147 84755 84534 84287 85343 82507 77459 89549 93814 96393
12675 96393 103115 119381 127894 132763 135694 140651 155340 172986 191224 217512 251377 290739 328839
12662 328839 371500 403729 411249 404783 388196 370106 351965 344798 342637 333577 331767 337325 340828
12649 340828 345204 339872 329645 315735 304478 292984 279885 266370 255478 245786 248375 256958
12637 256958 275466 294059 311823 337320 356060 372415 395890 411517 422112 432933 439708 450343
12625 450343 478225 522771 581669 666170 771886 878219 965890 1010792 992329 929509 835061
12614 835061 736935 664256 608869 580515 580046 599261 629599 667279 698747 719115 727043 721532
$$ packed form
12705A19160J575o08l605k51k163L31M238o053m327m350p469o240k310j627L000
12690H9301k846m982M999P181K232o738m392k21k47J056k836n048J2090M265K579
12675I6393O722J6266Q513M869K931M957J4689J7646J8238K6288L3865L9362L8100
12662C28839M2661L2229P520o466j6587j8090j8141p167k161r060j810N558L503
12649C40828M376n332j0227j3910j1257j1494j3099j3515j0892r692K589Q583
12637B56958J8508J8593J7764K5497J8740J6355K3475J5627J0595J0821O775J0635
12625D50343K7882M4546N8898Q4501J05716J06333Q7671M4902j8463o2820r4448
12614H35061r8126p2679n5387k8354m69J9215L0338L7680L1468K0368P928n511
$$ plain form
12602 721532 699999 676536 643728 597401 553533 513074 477867 450079 427127 414552 409949 408930
12590 408930 409245 407418 416715 420295 418109 418888 423130 424728 439499 460800 491972 527594 558148
12577 558148 580565 596801 594814 574038 541504 509488 472327 451040 442193 442843 450417 454625 456150
12564 456150 464941 476001 490585 505272 517413 529736 547435 567651 580890 589811 605067 620032
12552 620032 630307 643578 658319 667228 674147 683322 689417 697862 711265 723682 737624 752091
12540 752091 776239 800590 833258 868965 907091 954119 1015779 1087969 1174614 1283816 1416420
12529 1416420 1567661 1723764 1875899 2018264 2133563 2203773 2233679 2214582 2164566 2107428
12519 2107428 2062801 2026854 2006349 2007177 2026341 2073260 2144847 2238839 2352074 2490627 2664586
$$ packed form
12602G21532k1533k3463l2808m6327m3868m0459l5207k7788k2952j2575m603j019
12590D08930L15j827R297L580k186P79M242J598J4771K1301L1172L5622L0554
12577E58148K2417J6236j987k0776l2534l2016l7161k1287q847O50P574M208J525
12564D56150Q791J1060J4584J4687J2141J2323J7699K0216J3239Q921J5256J4965
12552F20032J0275J3271J4741Q909O919R175O095Q445J3403J2417J3942J4467
12540G52091K4148K4351L2668L5707L8126M7028O1660P2190Q6645J09202J32604
12529A416420J51241J56103J52135J42365J15299P0210K9906j9097n0016n7138
12519B107428m4627l5947k0505Q28J9164M6919P1587R3992J13235J38553J73959
$$ plain form
12508 2664586 2862597 3085414 3344326 3652669 4009906 4427006 4919417 5506398 6195411
12499 6195411 7004552 7940487 9019481 10255518 11651031 13233782 15041033 17141458
12491 17141458 19664269 22821392 26976227 32681808 40700962 51819019 66436419 84102977
12483 84102977 103505564 122668743 139288260 151485072 157858053 157583305 150745691 138124096
12475 138124096 121182973 101758633 82083750 64121613 49173437 37846973 29810088
12468 29810088 24223270 20264674 17343285 15092420 13273579 11737921 10387143 9166549
12460 9166549 8055334 7059752 6178807 5419787 4796652 4296488 3890840 3561283 3292473
12451 3292473 3072608 2889025 2728904 2596547 2473184 2346132 2215055 2076677 1937391
$$ packed form
12508B664586J98011K22817K58912L08343L57237M17100M92411N86981O89013
12499F195411Q09141R35935J078994J236037J395513J582751J807251K100425
12491A7141458K522811L157123M154835N705581Q019154J1118057J4617400J7666558
12483H4102977J9402587J9163179J6619517J2196812O372981k74748o837614j2621595
12475A38124096j6941123j9424340j9674883j7962137j4948176j1326464q036885
12468B9810088n586818l958596k921389k250865j818841j535658j350778j220594
12460I166549j111215r95582q80945p59020o23135n00164m05648l29557k68810
12451C292473k19865j83583j60121j32357j23363j27052j31077j38378j39286
$$ plain form
12442 1937391 1805416 1686317 1590333 1506369 1433899 1377289 1337738 1314216 1316882 1338885 1378828
12431 1378828 1427046 1473548 1526523 1573689 1609049 1634588 1666449 1701813 1735400 1770643 1780662
12420 1780662 1761463 1725360 1669640 1599887 1529313 1456832 1379471 1303047 1218633 1126953 1052734
12409 1052734 988288 937830 906847 875828 826838 774616 729372 678853 631326 595452 563301
12398 563301 526201 498743 472126 458291 448060 437917 440057 445914 452362 456311 458486 473061
12386 473061 491859 504118 509018 507165 499417 490273 479886 471617 468114 462982 471845 498006 519659
12373 519659 543604 571126 596340 611609 621867 634960 655703 673159 672549 649777 604969 559948
12361 559948 519431 492065 472224 463249 462106 458913 456670 454228 451329 443970 435340 426509 417176
$$ packed form
12442A937391j31975j19099r5984q3964p2470n6610l9551k3522K666K2003L9943
12431A378828M8218M6502N2975M7166L5360K5539L1861L5364L3587L5243J0019
12420A780662j9199l6103n5720o9753p0574p2481p7361p6424q4414r1680p4219
12409A052734o4446n0458l0983l1019m8990n2222m5244n0519m7527l5874l2151
12398E63301l7100k7458k6617j3835j0231j0143K140N857O448L949K175J4575
12386D73061J8798J2259M900j853p748r144j0387q269l503n132Q863K6161K1653
12373E19659K3945K7522K5214J5269J0258J3093K0743J7456o10k2772m4808m5021
12361E59948m0517k7366j9841q975j143l193k243k442k899p359q630q831r333
$$ plain form
12348 417176 402647 397728 401186 398539 398470 387042 370334 359994 349910 341420 331477 318087 312716
12335 312716 302256 298401 303819 318402 341535 369322 399879 418519 424364 427344 437196 455194
12323 455194 473711 497715 523135 539661 559623 577247 589786 603988 619153 632700 649160
12312 649160 661057 668718 674964 677718 682079 683693 696057 718344 751495 800071 848408 881004
12300 881004 889932 895827 898219 908311 938342 998480 1074245 1170326 1273879 1368326 1445725 1499718
12288 1499718 1524860 1522400 1498556 1451093 1400940 1359857 1338539 1351572 1371784 1401827 1427376
12277 1427376 1456369 1485731 1519002 1568197 1621409 1674136 1706644 1711006 1688449 1650901 1606386
12266 1606386 1572513 1546532 1541427 1554335 1574539 1613764 1663748 1711299 1755718 1808416 1877295
$$ packed form
12348D17176j4529m919L458k647o9j1428j6708j0340j0084q490r943j3390n371
12335C12716j0460l855N418J4583K3133K7787L0557J8640N845K980R852J7998
12323D55194J8517K4004K5420J6526J9962J7624J2539J4202J5165J3547J6460
12312F49160J1897P661O246K754M361J614J2364K2287L3151M8576M8337L2596
12300H81004Q928N895K392J0092L0031O0138P5765R6081J03553R4447P7399N3993
12288A499718K5142k460k3844m7463n0153m1083k1318J3033K0212L0043K5549
12277A427376K8993K9362L3271M9195N3212N2727L2508M362k2557l7548m4515
12266A606386l3873k5981n105J2908K0204L9225M9984M7551M4419N2698O8879
$$ plain form
12255 1877295 1961218 2077658 2233638 2438102 2682128 2957227 3236526 3502470 3734225 3950273
12245 3950273 4180369 4472137 4856362 5334080 5862385 6364282 6766838 7043287 7217517
12236 7217517 7350751 7501645 7687684 7897373 8124487 8403279 8775698 9296352 10040532
12227 10040532 11076146 12507015 14524740 17429156 21586220 27326998 34614819 42633177
12219 42633177 49652378 53601573 53231927 48861805 42278286 35745422 30720242 27505386
12211 27505386 25727187 24891745 24606360 24691533 25142862 26024686 27363232 29019774 30688571
12202 30688571 32018730 32836768 33248193 33554938 34047010 34813420 35806066 37018854 38465408
12193 38465408 40048163 41434706 42214520 42160277 41402210 40380006 39607796 39458757 40132654
$$ packed form
12255A877295Q3923J16440J55980K04464K44026K75099K79299K65944K31755K16048
12245C950273K30096K91768L84225M77718N28305N01897M02556K76449J74230
12236G217517J33234J50894J86039K09689K27114K78792L72419N20654P44180
12227A0040532J035614J430869K017725K904416M157064N740778P287821Q018358
12219D2633177P019201L949195l69646m370122o583519o532864n025180l214856
12211B7505386j778199q35442k85385Q5173M51329Q81824J338546J656542J668797
12202C0688571J330159Q18038M11425L06745M92072P66410R92646J212788J446554
12193C8465408J582755J386543P79814n4243p58067j022204p72210j49039O73897
$$ plain form
12184 40132654 41699969 44246154 48178251 54414423 64377399 79478305 99674967 121743631
12176 121743631 139261114 145798463 138702837 120533374 98057667 77930405 63097905
12169 63097905 53282498 47095802 43258941 40983871 39909487 39862069 40609562 41714142
12161 41714142 42603847 42740829 41865112 40123110 37973220 35911670 34252989 33081388
12153 33081388 32378671 32106625 32102781 32050499 31594806 30572008 29115825 27590522 26358068
12144 26358068 25596238 25274179 25290185 25590098 26247451 27584562 30116289 34386791 40493980
12135 40493980 47571826 53637533 56385001 54457579 48204857 39589100 30986756 23866832
12127 23866832 18613265 14974991 12528208 10895686 9805425 9070328 8570613 8214386
$$ packed form
12184D0132654J567315K546185L932097O236172R962976J5100906K0196662K2068664
12176A21743631J7517483O537349p095626j8169463k2475707k0127262j4832500
12169F3097905r815407o186696l836861k275070j074384m7418P47493J104580
12161D1714142Q89705J36982q75717j742002k149890k061550j658681j171601
12153C3081388p02717k72046l844n2282m55693j022798j456183j525303j232454
12144B6358068p61830l22059J6006K99913O57353J337111K531727M270502O107189
12135D0493980P077846O065707K747468j927422o252722q615757q602344p119924
12127B3866832n253567l638274k446783j632522j090261p35097m99715l56227
$$ plain form
12119 8214386 7939446 7683663 7417100 7142366 6864713 6589353 6295772 5950693 5546317
12110 5546317 5115887 4699451 4331268 4042597 3831493 3663306 3506627 3303580 3058188
12101 3058188 2779842 2496464 2222118 1981627 1785632 1640091 1535396 1470836 1437853 1415976
12091 1415976 1405782 1412667 1422083 1439847 1462583 1486245 1519572 1552511 1587111 1613864 1624924 1605115
12079 1605115 1559467 1489196 1400886 1311830 1234064 1188464 1157797 1148298 1140890 1137146 1141846 1158970
12067 1158970 1199664 1254764 1316984 1377084 1421001 1441243 1415814 1358333 1290769 1212686 1150315
12056 1150315 1125326 1133541 1164071 1218999 1272915 1312888 1324566 1310824 1268474 1199237 1112112
12045 1112112 1009827 886839 774866 680122 605451 546493 496622 461333 431203 403465 382233
$$ packed form
12119H214386k74940k55783k66563k74734k77653k75360k93581l45079m04376
12110E546317m30430m16436l68183k88671k11104j68187j56679k03047k45392
12101C058188k78346k83378k74346k40491j95995j45541j04695o4560l2983k1877
12091A415976j0194O885R416J7764K2736K3662L3327L2939L4600K6753J1060j9809
12079A605115m5648p0271q8310q9056p7766m5600l0667r499p408l744M700J7124
12067A158970M0694N5100O2220O0100M3917K0242k5429n7481o7564p8083o2371
12056A150315k4989Q215L0530N4928N3916L9973J1678j3742m2350o9237q7125
12045A112112j02285j22988j11973r4744p4671n8958m9871l5289l0130k7738k1232
$$ plain form
12034 382233 363136 349131 336804 332020 318724 313935 305232 300826 297417 290261 279690 267942 264356
12021 264356 264502 272059 290899 306900 317040 320814 308027 288925 271841 256593 248422 235963
12009 235963 224758 212687 210104 215971 227136 242879 269673 297487 340850 401812 476867 560252
11997 560252 636118 689405 713467 696901 636522 554360 476166 396736 332830 291874 257259
11986 257259 228161 203934 182897 177224 164672 153122 146244 139125 136453 143204 151887 151927 146908
11973 146908 144067 144611 139503 133142 133650 128307 122583 123741 128797 130304 131076 128580 121579 126361 131802
11958 131802 124303 119889 113743 104332 94769 88720 89750 97261 103054 105710 110991 116234 118253 118216 125210
11943 125210 137993 147300 158803 170984 184964 204550 223829 260421 311570 379050 459175 545853
$$ packed form
12034C82233j9097j4005j2327m784j3296m789q703m406l409p156j0571j1748l586
12021B64356J46P557J8840J6001J0140L774j2787j9102j7084j5248q171j2459
12009B35963j1205j2071k583N867J1165J5743K6794K7814M3363O0962P5055Q3385
11997E60252P5866N3287K4062j6566o0379q2162p8194p9430o3906m0956l4615
11986B57259k9098k4227k1037n673j2552j1550o878p119k672O751Q683M0n019
11973A46908k841N44n108o361N08n343n724J158N056J507P72k496p001M782N441
11958A31802p499m414o146r411r563o049J030P511N793K656N281N243K019l7O994
11943A25210J2783R307J1503J2181J3980J9586J9279L6592N1149O7480Q0125Q6678
$$ plain form
11931 545853 629237 689979 713826 694964 649530 576819 502477 441848 393739 360861 346858
11920 346858 334594 325216 314948 296315 278927 256576 232359 216640 206897 199231 202339 215113
11908 215113 232572 261258 304131 363980 429656 501759 570852 616150 623609 589628 533335 458003
11896 458003 377470 299148 240534 190778 154279 134913 117952 111561 103577 86973 73349 68415
11884 68415 77031 75004 74363 73173 69003 63806 63621 65724 60741 62412 66925 69791 74341 74339 76071 79073
11868 79073 72769 66752 64012 58494 51681 50182 48861 53609 52060 41912 39234 36375 36085 38159
11854 38159 36741 40074 48420 56439 63389 71428 79123 90418 95189 99705 106914 123672 149605 184843
11840 184843 234347 299089 368878 437809 502008 544253 561730 540224 483009 413520 336363
$$ packed form
11931E45853Q3384O0742K3847j8862m5434p2711p4342o0629m8109l2878j4003
11920C46858j2264r378j0268j8633j7388k2351k4217j5719r743p666L108J2774
11908B15113J7459K8686M2873N9849O5676P2103O9093M5298P459l3981n6293p5332
11896D58003q0533p8322n8614m9756l6499j9366j6961o391p984j6604j3624m934
11884F8415Q616k027o41j190m170n197j85K103m983J671M513K866M550kJ732L002
11868G9073o304o017k740n518o813j499j321M748j549j0148k678k859k90K074
11854C8159j418L333Q346Q019O950Q039P695J1295M771M516P209J6758K5933L5238
11840A84843M9504O4742O9789O8931O4199M2245J7477k1506n7215o9489p7157
$$ plain form
11829 336363 264565 214029 172663 137852 114982 96415 85924 73168 57951 51042 45838 41915
11817 41915 33678 30038 31239 37284 40518 37393 34637 34776 33036 30986 28440 32533 34273 34917 30940
11802 30940 20541 21792 24907 22340 26450 27323 20799 22459 22383 22877 21222 20545 20642 28427 35180 40439
11786 40439 40732 37452 47378 54971 63386 61892 59231 65136 65597 66366 71715 87613 106627 128140
11772 128140 158537 195392 234296 261395 273247 273595 265220 240517 207726 179911 167596 165639
11760 165639 165878 172662 171988 169696 166766 165119 160298 159084 154501 153206 154319 164134 177609 197117
11746 197117 217124 223415 227957 229952 229058 231898 236784 237790 233195 220247 216280 218309 229380 251723
11732 251723 277726 314754 373766 460747 564127 663115 735599 764114 741951 667551 561991
$$ packed form
11829C36363p1798n0536m1366l4811k2870j8567j0491j2756j5217o909n204l923
11817D1915q237l640J201O045L234l125k756J39j740k050k546M093J740O44l977
11802C0940j0399J251L115k567M110Q73o524J660p6M94j655o77R7P785O753N259
11786D0439K93l280R926P593Q415j494k661N905M61P69N349J5898J9014K1513
11772A28140L0397L6855L8904K7099J1852L48q375k4703l2791k7815j2315j957
11760A65639K39O784o74k292k930j647m821j214m583j295J113R815J3475J9508
11746A97117K0007O291M542J995q94K840M886J006m595j2948l967K029J1071K2343
11732B51723K6003L7028N9012Q6981J03380R8988P2484K8515k2163p4400j05560
$$ plain form
11721 561991 460594 376023 308047 265096 241655 216239 205331 202881 197791 196530 197663 191766
11709 191766 178863 162916 147884 142824 146161 149526 145103 141158 138068 142039 141594 141359 147271 155249
11695 155249 162479 165457 156976 151894 154936 159265 166200 175822 188943 214513 243541 263881 268137
11682 268137 254391 221003 183730 149030 115720 84550 64466 56724 50740 42801 43679 41165 41343
11669 41343 35092 28971 22289 16430 10522 7950 7710 5940 5279 424 1613 7353 10327 13500 12195
11654 12195 16431 21762 25390 26704 21834 17259 17300 15744 14332 9960 8544 9366 11417 7976 2134
11639 2134 4428 12744 12747 9007 9276 19306 27567 23908 16569 18663 22069 34213 42415 49205 61168
11624 61168 74300 100920 131382 169126 215739 263251 300706 331124 353879 365402 385696 410316
$$ packed form
11721E61991j01397q4571o7976m2951k3441k5416j0908k450n090j261J133n897
11709A91766j2903j5947j5032n060L337L365m423l945l090L971m45k35N912P978
11695A55249P230K978q481n082L042M329O935R622J3121K5570K9028K0340M256
11682B68137j3746l3388l7273l4700l3310l1170k0084p742n984p939Q78k514J78
11669D1343o251o121o682n859n908k572k40j770o61m855J189N740K974L173j305
11654A2195M236N331L628J314m870m575M1j556j412m372j416Q22K051l441n842
11639B134K294Q316Ll740K69J0030Q261l659p339K094L406J2144Q202O790J1963
11624F1168J3132K6620L0462L7744M6613M7512L7455L0418K2755J1523K0294K4620
$$ plain form
11612 410316 429305 442592 447217 447492 438114 427277 406606 379659 351996 329329 316337 310419
11600 310419 308126 305802 310608 313229 323725 344085 358529 373532 378092 377739 371682 354338 334924
11587 334924 325221 324101 320320 315429 308287 305522 308902 310307 319612 331977 344547 368453 401571
11574 401571 441098 483887 517110 529861 519981 500484 479445 463855 463558 466706 469914 467368 473608
11561 473608 483086 499095 531562 567289 601598 632140 653431 671881 690522 704766 715123 725800
11549 725800 733504 744280 751831 753630 740869 701938 650709 583246 519691 472690 440437 408142
11537 408142 378630 353905 329323 307176 290425 282611 290419 301800 321915 335270 340200 339338
11525 339338 329014 320623 310502 303218 303119 295423 290965 298248 308042 327416 351958 368097 388035
$$ packed form
11612D10316J8989J3287M625K75r378j0837k0671k6947k7663k2667j2992n918
11600C10419k293k324M806K621J0496K0360J4444J5003M560l53o057j7344j9414
11587C34924r703j120l781m891p142k765L380J405R305J2365J2570K3906L3118
11574D01571L9527M2789L3223J2751r880j9497k1039j5590k97L148L208k546O240
11561D73608R478J6009L2467L5727L4309L0542K1291J8450J8641J4244J0357J0677
11549G25800P704J0776P551J799j2761l8931n1229o7463o3555m7001l2253l2295
11537D08142k9512k4725k4582k2147j6751p814P808J1381K0115J3355M930q62
11525C39338j0324q391j0121p284r9p696m458P283R794J9374K4542J6139J9938
$$ plain form
11512 388035 413510 438518 445764 436525 416006 388265 354224 327747 309209 300449 298801 297522
11500 297522 299279 305395 310341 308424 303163 302068 311761 331707 362068 382213 388329 386939 375933
11487 375933 350603 325947 308816 291335 275271 250733 224170 194024 161595 132632 105752
11476 105752 85848 75782 66023 55098 46295 31840 23491 17599 8890 7311 10535 9705 4403
11463 4403 6199 5641 -1491 -7813 -3867 1961 1353 -3340 -6363 -7289 -6126 -2347 -1165 -3344 -8828
11448 -8828 -6938 -7671 -12571 -13515 -1959 4311 5273 2070 1076 312 -2857 -14428 -15839 -16529 -13147 -5394
11432 -5394 1022 -3748 -5804 -4502 -538 6542 10357 5024 9422 10681 2829 -640 8378 8558 7587
11417 7587 3848 376 3034 5684 2367 336 -5009 -14027 -17219 -14451 -7704 -6705 -8283 -8178 -6170
$$ packed form
11512C88035K5475K5008P246r239k0519k7741l4041k6477j8538q760j648j279
11500B97522J757O116M946j917n261j095R693J9946L0361K0145O116j390j1006
11487C75933k5330k4656j7131j7481j6064k4538k6563l0146l2429k8963k6880
11476A05752j9904j0066r759j0925q803j4455q349n892q709j579L224q30n302
11463D403J796n58p132o322L946N828o08m693l023r26J163L779J182k179n484
11448h828J890p33m900r44J1556O270R62l203r94p64l169j1571j411o90L382P753
11432e394O416m770k056J302L964P080L815n333M398J259p852l469R018J80r71
11417G587l739l472K658K650l317k031n345r018l192K768O747R99j578J05K008
$$ plain form
11402 -6170 -3957 1887 10368 14312 12481 6027 887 -6326 -15830 -14000 -17466 -15918 -12780 -10328 -11771
11387 -11771 -11113 -3822 -3215 -829 1655 -3856 -8649 -9259 -6523 -9273 -2645 -752 -3898 -5214 -11120
11372 -11120 -13760 -13536 -9769 -9040 -12090 -11897 -9633 -10455 -17590 -19316 -16504 -16671 -18984 -17415 -11046 -1610
11356 -1610 1232 -3345 -6908 -13264 -15383 -10988 -14239 -11484 -7260 -8448 -15301 -14791 -9973 -1747 -721
11341 -721 -3199 1114 -873 -4483 -1036 -1802 4672 8076 5609 7746 5907 -572 -7666 -10311 -8406
11326 -8406 -5339 2046 5027 -5592 -10022 -11199 -10651 -6138 -6655 -8037 -2160 2916 -528 -2234 -7366
11311 -7366 -5947 1243 -2122 -7413 -9690 -14856 -17948 -12589 -1065 -3567 -6008 -10897 -5930 -6284 -10842
11296 -10842 -7574 -4478 -4045 -6053 -2668 -552 3342 1734 -4483 -5845 -1523 4179 862 -1698 -460
$$ packed form
11402f170K213N844Q481L944j831o454n140p213r504J830l466J548L138K452j443
11387a1771O58P291O07K386K484n511m793o10K736k750O628J893l146j316n906
11372a1120k640K24L767P29l050J93K264q22p135j726K812j67k313J569O369R436
11356a610K842m577l563o356k119M395l251K755M224j188o853N10M818Q226J026
11341g21k478M313j987l610L447p66O474L404k467K137j839o479p094k645J905
11326h406L067P385K981j0619m430j177N48M513n17j382N877N076l444j706n132
11311g366J419P190l365n291k277n166l092N359J1524k502k441m889M967l54m558
11296a0842L268L096M33k008L385K116L894j608o217j362M322N702l317k560J238
$$ plain form
11281 -460 935 169 1960 4087 4619 2340 4136 8682 15150 19467 22543 31054 35336 37961 53191
11266 53191 79120 94549 107750 119543 139386 165073 187044 205645 214424 207429 184050 147897
11254 147897 116319 92584 72774 57499 47551 32712 25025 20335 17440 17955 19839 18783 18523
11241 18523 15201 15376 14276 12148 9968 7087 4637 1082 94 3345 6584 7045 4027 1858 -3137
11226 -3137 -8571 -7467 1059 3417 5217 10128 11631 10666 993 -7054 -3434 3565 179 34 159
11211 159 261 -1180 -3692 -2316 3044 6064 13050 12953 6529 5035 -48 -2511 821 7673 7367 851
11195 851 -5366 -1820 -2175 -2481 -2412 -4710 -3700 834 3672 -44 -2430 1459 11020 24788 34241 33860
11179 33860 34721 33206 29436 22361 6685 -4713 -5006 2500 10381 6116 1447 -4346 -3787 715 2883
$$ packed form
11281d60J395p66J791K127N32k279J796M546O468M317L076Q511M282K625J5230
11266E3191K5929J5429J3201J1793J9843K5687K1971J8601Q779o995k3379l6153
11254A47897l1578k3735j9810j5275r948j4839p687m690k895N15J884j056k60
11241A8523l322J75j100k128k180k881k450l555r88L251L239M61l018k169m995
11226c137n434J104Q526K358J800M911J503r65r673q047L620O999l386j45J25
11211A59J02j441k512J376N360L020O986r7o424j494n083k463L332O852l06o516
11195H51o217L546l55l06O9k298J010M534K838l716k386L889R561J3768R453l81
11179C3860Q61j515l770p075j5676j1398k93P506P881m265m669n793N59M502K168
$$ plain form
11164 2883 8603 5101 2433 3921 280 -4034 703 6598 7253 4460 1826 5527 5996 6694 4172
11149 4172 4332 780 1411 -2704 929 5419 5932 524 -3777 -641 7900 15598 13628 15551 11480
11134 11480 10090 5936 8346 8089 4560 9999 12543 14209 10100 4041 -1065 -3500 -1067 -3149 -8599
11119 -8599 -8103 1233 6333 9203 10505 6263 2615 774 -1307 -5184 -2140 3375 7334 13811 11020
11104 11020 4138 2941 1080 3220 10788 16721 12035 6189 6486 12830 11852 5613 6052 11813 18197
11089 18197 21251 19389 20233 18614 20753 21676 22685 19091 13247 10028 9429 15036 10020 13039 17732
11074 17732 10601 5827 8904 8886 11148 10303 4696 2936 -1272 -6041 -4839 1116 5091 12724 19463
11059 19463 18303 17528 17822 12213 8240 11051 17676 21493 17778 14837 17409 14608 13410 17727 20229
$$ packed form
11164B883N720l502k668J488l641m314M737N895O55k793k634L701M69O98k522
11149D172J60l552O31m115L633M490N13n408m301L136Q541P698j970J923m071
11134A1480j390m154K410k57l529N439K544J666m109o059n106k435K433k082n450
11119h599M96R336N100K870J302m242l648j841k081l877L044N515L959O477k791
11104A1020o882j197j861K140P568N933m686n846K97O344r78o239M39N761O384
11089A8197L054j862Q44j619K139R23J009l594n844l219n99N607n016L019M693
11074A7732p131m774L077j8K262q45n607j760m208m769J202N955L975P633O739
11059A9463j160p75K94n609l973K811O625L817l715k941K572k801j198M317K502
$$ plain form
11044 20229 21161 26653 23645 21099 23153 23056 19059 10048 9005 10202 12113 8416 8577 5339 3276
11029 3276 1909 4845 11459 14930 12620 10629 14376 19021 18358 14525 15626 15106 15762 20601 21115 22119
11013 22119 18406 19140 21594 22211 23218 20167 19653 19038 23156 27799 27297 21955 18489 20168 20444 19812
10997 19812 26377 28446 26931 27838 30168 38091 37309 39598 37549 41126 47814 54714 63391 77486 97099
10982 97099 122913 143499 162385 174815 175105 166135 140662 121732 102020 77776 71067 63199 58128
10969 58128 55913 61551 60149 55023 50291 49624 53885 57736 58817 51960 52411 53013 58220 65035 70348
10954 70348 74938 77277 93050 118242 135769 153373 163865 156482 133866 114156 93766 76218
10942 76218 66394 61296 59822 53385 43629 43305 42400 43782 39827 34006 28855 26978 19878 15065 18232
$$ packed form
11044B0229R32N492l008k546K054r7l997r011j043J197J911l697J61l238k063
11029C276j367K936O614L471k310j991L747M645o63l833J101n20O56M839N14J004
11013B2119l713P34K454O17J007l051n14o15M118M643n02n342l466J679K76o32
10997A9812O565K069j515R07K330P923p82K289k049L577O688O900Q677J4095J9613
10982I7099K5814K0586J8886J2430K90q970k5473j8930j9712k4244o709p868n071
10969E8128k215N638j402n126m732o67M261L851J081o857M51O02N207O815N313
10954G0348M590K339J5773K5192J7527J7604J0492p383k2616j9710k0390j7548
10942G6218r824n098j474o437r756l24r05J382l955n821n151j877p100m813L167
$$ plain form
10927 18232 21881 21072 19628 23104 29163 33335 30427 28728 36703 35419 35148 40534 41717 41309 48710
10912 48710 52373 46737 54771 62849 60635 58809 58111 60316 57394 55636 50594 56333 55628 56578 56814
10897 56814 57363 59632 57926 57859 55473 52510 51163 44964 44624 48309 50501 51526 58727 59044 60609 57346
10881 57346 61040 64882 65605 66375 65341 65034 70692 85808 100299 105025 94379 55735 5830 -46044
10867 -46044 -83891 -100134 -91800 -73921 -56155 -47557 -41070 -37205 -31315 -28250 -16884 -5394 2195
10854 2195 9864 11257 14034 18422 17442 17707 23736 26921 35325 41236 38454 42859 50184 56620 63024
10839 63024 69906 68967 69498 77221 79698 89774 109237 128330 153583 190813 221738 260215 336504
10826 336504 446940 608343 854107 1185062 1544964 1826676 1911283 1753357 1415688 1038598
$$ packed form
10927A8232L649q09j444L476O059M172k908j699P975j284k71N386J183m08P401
10912D8710L663n636Q034Q078k214j826o98K205k922j758n042N739p05R50K36
10897E6814N49K269j706o7k386k963j347o199l40L685K192J025P201L17J565l263
10881E7346L694L842P23P70j034l07N658J5116J4491M726j0646l8644m9905n1874
10867d6044l7847j6243Q334J7879J7766Q598O487L865N890L065J1366J1490P589
10854B195P669J393K777M388r80K65O029L185Q404N911k782M405P325O436O404
10839F3024O882r39N31P723K477J0076J9463J9093K5253L7230L0925L8477P6289
10826C36504J10436J61403K45764L30955L59902K81712Q4607j57926l37669l77090
$$ plain form
10816 1038598 728108 523049 393021 306563 252207 205551 164485 133682 109943 99052 94545
10805 94545 90924 84758 90139 83223 74266 69686 64221 54190 44692 38009 38483 43233 38849 35664
10791 35664 36462 40065 33192 32270 34629 42881 38939 42540 49015 53297 48214 43374 44029 45015 44417 35687
10775 35687 34142 34176 27866 22621 21290 20247 25311 25874 22926 27436 31139 31656 30173 31091 28305 28570
10759 28570 28541 31264 37952 37842 34657 28171 20804 14310 15751 15474 15939 16722 23756 28653 24980 24868
10743 24868 27969 30974 28544 25148 19607 12880 12430 20714 34239 42961 50298 53261 54411 61093
10729 61093 58163 53138 56309 59969 63184 65534 64531 63768 66755 76934 73067 63674 45409 22310
10715 22310 4380 -9532 -17304 -25863 -30650 -29337 -28736 -34839 -34464 -23885 -16041 -10363 -5437 -4355
$$ packed form
10816A038598l10490k05059j30028q6458n4356m6656m1066l0803k3739j0891m507
10805I4545l621o166N381o916q957m580n465j0031r498o683M74M750m384l185
10791C5664P98L603o873r22K359Q252l942L601O475M282n083m840O55R86n98q730
10775C5687j545L4o310n245j331j043N064N63k948M510L703N17j483R18k786K65
10759B8570k9K723O688j10l185o486p367o494J441k77M65P83P034M897l673j12
10743B4868L101L005k430l396n541o727m50Q284J3525Q722P337K963J150O682
10729F1093k930n025L171L660L215K350j003p63K987J0179l867r393j8265k3099
10715B2310j7930j3912p772q559m787J313O01o103L75J0579P844N678M926J082
$$ plain form
10701 -4355 -3437 -1518 2527 6073 11012 16580 23507 20921 17228 25721 29889 31430 28781 31116 31256
10686 31256 29560 32431 36581 39674 41733 47583 52252 53036 51130 46586 43162 43519 40519 29153 29494
10671 29494 33904 33561 36333 37295 40751 42817 47809 53385 61961 80578 116777 170499 221020 265726
10657 265726 308138 343645 362925 336510 279235 224780 173056 127681 102375 88256 81899 82947
10645 82947 84876 83689 90457 100167 97842 90063 77192 70275 64411 61285 63428 68316 67417 69865
10631 69865 81188 94255 104050 108198 103940 102071 87220 67719 56865 53235 50272 44156 40469
10618 40469 29352 16521 13515 10231 -2334 -4358 -6398 1379 8125 10582 9301 6753 4480 -951
10604 -951 -7892 -14736 -17215 -16208 -7879 210 4755 -231 -4664 -4424 6345 29872 50909 55316
$$ packed form
10701d355R18J919M045L546M939N568O927k586l693Q493M168J541k649K335J40
10686C1256j696K871M150L093K059N850M669P84j906m544l424L57l000j1366L41
10671B9494M410l43K772R62L456K066M992N576Q576J8617L6199N3722N0521M4706
10657B65726M2412L5507J9280k6415n7275n4455n1724m5375k5306j4119o357J048
10645H2947J929j187O768R710k325p779j2871o917n864l126K143M888q99K448
10631F9865J1323J3067R795M148m258j869j4851j9501j0854l630k963o116l687
10618D0469j1117j2831l006l284j2565k024k040P777O746K457j281k548k273n431
10604i51o941o844k479J007Q329Q089M545m986m433K40J0769K3527K1037M407
$$ plain form
10590 55316 42980 36760 45499 64416 88641 105298 112587 112741 112878 121757 139126 148997 157666 160581
10576 160581 154567 144795 138510 137110 132706 126451 115874 107631 106797 97357 89720 79435 72792 60893
10562 60893 53145 50309 59613 100543 175404 263057 334775 362211 352429 327006 308707 287487
10550 287487 276165 268508 256783 248981 250599 255211 265639 271335 284291 296727 312198 326628
10538 326628 333288 342631 344239 350449 351743 351784 385943 489186 645419 793421 879632 870301 811948
10525 811948 713829 605232 521244 456503 404332 373091 362499 356068 350690 339299 322065 306135
10513 306135 297775 288368 287163 292638 300129 303233 304128 322765 345653 369244 380046 389526 397131
10500 397131 400018 401343 404311 400178 398831 395374 394553 399443 410555 437992 465346 481523 500079
$$ packed form
10590E5316j2336o220Q739J8917K4225J6657P289J54J37Q879J7369R871Q669K915
10576A60581o014r772o285j400m404o255j0577q243q34r440p637j0285o643j1899
10562F0893p748k836R304M0930P4861Q7653P1718K7436r782k5423j8299k1220
10550B87487j1322p657j1725p802J618M612J0428N696J2956J2436J5471J4430
10538C26628O660R343J608O210J294M1L4159J03243J56233J48002Q6211r331n8353
10525H11948r8119j08597q3988o4741n2171l1241j0592o431n378j1391j7234j5930
10513C06135q360r407j205N475P491L104Q95J8637K2888K3591J0802R480P605
10500C97131K887J325K968m133j347l457q21M890J1112K7437K7354J6177J8556
$$ plain form
10487 500079 521534 535864 546744 565130 592993 631264 673268 714189 741930 767776 796459
10476 796459 822162 859717 905771 949278 990799 1026840 1053743 1071625 1066679 1044842 1015592 986055
10464 986055 959350 944695 949040 960509 981936 1013604 1042774 1065964 1091326 1130502 1174678 1223840
10452 1223840 1285772 1360359 1441182 1524551 1604327 1680099 1747922 1828015 1903183 1975809 2051628
10441 2051628 2121913 2189864 2257108 2333050 2437330 2590405 2792859 3040965 3331819 3640029
10431 3640029 3957511 4284480 4616750 4972953 5403203 5935721 6585591 7367278 8291945
10422 8291945 9355723 10506322 11646321 12700618 13723931 14933898 16615883 18977574
10414 18977574 22145244 26219141 31370790 37902714 46453615 58238992 75387493 101501223
$$ packed form
10487E00079K1455J4330J0880J8386K7863L8271M2004M0921K7741K5846K8683
10476G96459K5703L7555M6054M3507M1521L6041K6903J7882m946k1837k9250k9537
10464I86055k6705j4655M345J1469K1427L1668K9170K3190K5362L9176M4176M9162
10452A223840O1932P4587Q0823Q3369P9776P5772O7823Q0093P5168P2626P5819
10441B051628P0285O7951O7244P5942J04280J53075K02454K48106K90854L08210
10431C640029L17482L26969L32270L56203M30250N32518O49870P81687R24667
10422H291945J063778J150599J139999J054297J023313J209967J681985K361691
10414A8977574L167670M073897N151649O531924Q550901J1785377J7148501K6113730
$$ plain form
10406 101501223 141741508 199542636 268791385 329148332 356333110 340499043 285946243
10399 285946243 213299280 149990228 105644453 76811330 58120425 45722927 37137116
10392 37137116 30854401 25956670 21973876 18704883 16052665 13961131 12362355 11107376
10384 11107376 10058779 9067225 8044207 7049797 6200452 5525929 5013805 4611174 4272273
10375 4272273 3982232 3727942 3498863 3300550 3128379 2965630 2807437 2643652 2458586
10366 2458586 2264093 2070956 1900809 1764603 1644524 1544165 1461764 1389989 1310404 1232219
10356 1232219 1162338 1115631 1082956 1062347 1044281 1029124 999249 965860 936424 907075 873137
10345 873137 842252 816088 795292 769369 741088 703766 656249 613868 568745 531690 500603
$$ packed form
10406A01501223M0240285N7801128O9248749O0356947K7184778j5834067n4552800
10399B85946243p2646963o3309052m4345775k8833123j8690905j2397498q585811
10392C7137116o282715m897731l982794l268993k652218k091534j598776j254979
10384A1107376j048597r91554j023018r94410q49345o74523n12124m02631l38901
10375D272273k90041k54290k29079j98313j72171j62749j58193j63785j85066
10366B458586j94493j93137j70147j36206j20079j00359q2401p1775p9585p8185
10356A232219o9881m6707l2675k0609j8066j5157k9875l3389k9436k9349l3938
10345H73137l0885k6164k0796k5923k8281l7322m7517m2381m5123l7055l1087
$$ plain form
10334 500603 484644 476010 459042 444951 431582 418664 401063 379791 353717 341463 341885 348277
10322 348277 369240 394699 412359 422930 419124 420592 450632 503010 561100 631101 701220 757580
10310 757580 762069 707726 611895 515869 443365 388077 349184 319082 298026 279616 276068 280169
10298 280169 288178 292122 293631 285036 278989 280050 279694 272111 257964 239222 218519 208517 208449 213569
10284 213569 221873 222168 222629 229878 255911 300251 324227 316062 310702 342591 379966 389117 361892
10271 361892 313287 255413 207146 171618 147325 129825 117771 107704 107291 107255 105657 105245 102198
10258 102198 92937 85184 78442 61650 42688 22979 6069 -16946 -44460 -61287 -34747 26994
10246 26994 102815 179836 227266 241237 237416 215805 190748 174780 159583 157719 158236 150513 139572
$$ packed form
10334E00603j5959q634j6968j4091j3369j2918j7601k1272k6074j2254M22O392
10322C48277K0963K5459J7660J0571l806J468L0040N2378N8090P0001P0119N6360
10310G57580M489n4343r5831r6026p2504n5288l8893l0102k1056j8410l548M101
10298B80169Q009L944J509q595o047J061l56p583j4147j8742k0703j0002o8N120
10284B13569Q304K95M61P249K6033M4340K3976q165n360L1889L7375R151k7225
10271C61892m8605n7874m8267l5528k4293j7500j2054j0067m13l6j598m12l047
10258A02198r261p753o742j6792j8962j9709j6910k3015k7514j6827K6540O1741
10246B6994P5821P7021M7430J3971l821k1611k5057j5968j5197j864N17p723j0941
$$ plain form
10233 139572 126857 113591 106557 91098 74519 71686 69160 64056 64131 62256 69057 86506 96315
10220 96315 104966 116472 129040 145740 162891 178321 182302 177097 176351 187231 203854 210001 208372
10207 208372 207933 204268 208000 212021 208052 213624 218870 217658 208714 200647 194253 185996 183249 185623
10193 185623 191164 193393 189708 183724 179779 170160 159110 150299 149137 144629 146420 139843 128047 110733
10179 110733 93435 78845 71301 62968 61037 72523 82216 90210 95518 98917 102724 107430 108609
10166 108609 104299 97188 88988 83774 89752 95584 100615 102302 109267 116089 124340 127486 128777 124363
10152 124363 117852 117286 121181 126891 127959 125364 128313 134459 132239 137946 141858 136429 140357 152485
10138 152485 163120 171914 174372 163996 154749 154414 160562 162858 168996 181043 194723 203947 208995
$$ packed form
10233A39572j2715j3266p034j5459j6579k833k526n104P5j875O801J7449R809
10220I6315Q651J1506J2568J6700J7151J5430L981n205p46J0880J6623O147j629
10207B08372m39l665L732M021l969N572N246j212q944q067o394q257k747K374
10193A85623N541K229l685n984l945r619j1050q811j162m508J791o577j1796j7314
10179A10733j7298j4590p544q333j931J1486R693P994N308L399L807M706J179
10166A08609m310p111q200n214N978N832N031J687O965O822Q251L146J291m414
10152A24363o511n66L895N710J068k595K949O146k220N707L912n429L928J2128
10138A52485J0635Q794K458j0376r247l35O148K296O138J2047J3680R224N048
$$ plain form
10125 208995 206369 197663 198784 193468 188755 186629 185387 182858 177862 180351 179796 176378 172750 169986
10111 169986 176511 174128 166237 155629 161480 175255 188893 198619 209905 225176 241814 251353 267389
10098 267389 279555 289148 295298 296453 295842 289950 281733 283931 300076 326880 359307 391915 422030
10085 422030 450921 484992 519137 534190 534830 526186 502619 470041 444128 434736 437743 446131 472728
10072 472728 524142 587624 669633 778137 919084 1092654 1316420 1598214 1940430 2323180
10062 2323180 2708646 3036481 3266550 3345565 3258566 3030744 2706064 2337696 1971871 1649498
10052 1649498 1387776 1189270 1043425 946061 892374 873433 878577 903182 938860 990954 1051298
10041 1051298 1104689 1144767 1176861 1185699 1177317 1170283 1181302 1235973 1352395 1547544 1816313
$$ packed form
10125B08995k626q706J121n316m713k126j242k529m996K489n55l418l628k764
10111A69986O525k383p891j0608N851J3775J3638R726J1286J5271J6638R539J6036
10098B67389J2166R593O150J155o11n892q217K198J6145K6804L2427L2608L0115
10085D22030K8891L4071L4145J5053O40q644k3567l2578k5913r392L007Q388K6597
10072D72728N1414O3482Q2009J08504J40947J73570K23766K81794L42216L82750
10062B323180L85466L27835K30069P9015q6999k27822l24680l68368l65825l22373
10052A649498k61722j98506j45845r7364n3687j8941N144K4605L5678N2094O0344
10041A051298N3391M0078L2094Q838q382p034J1019N4671J16422J95149K68769
$$ plain form
10030 1816313 2121915 2429891 2719498 2972472 3189247 3375041 3478770 3460471 3301995 3017704
10020 3017704 2650621 2246268 1866420 1536548 1264258 1050304 888916 763496 674726 611602
10010 611602 567005 531241 502340 483380 468538 466320 477928 500119 535270 585309 646303 706624
9998 706624 764351 807237 813631 797756 768137 737738 719804 735913 785223 866006 961845 1056054
9986 1056054 1130849 1176992 1192035 1200660 1251234 1382162 1618049 1911562 2151003 2198416 2018392
9975 2018392 1661875 1266428 948497 732089 585054 489483 424463 373689 339480 312039
9965 312039 287858 276645 273234 264170 255630 259691 278706 296557 315094 330224 342440 347970 339569
9952 339569 329467 314225 299325 286656 286711 288510 296795 292427 293394 299820 301365 300528 302866 302221 301860
$$ packed form
10030A816313L05602L07976K89607K52974K16775J85794J03729j8299j58476k84291
10020C017704l67083m04353l79848l29872k72290k13954j61388j25420q8770o3124
10010F11602m4597l5764k8901j8960j4842k218J1608K2191L5151N0039O0994O0321
9998G06624N7727M2886O394j5875k9619l0399j7934J6109M9310Q0783R5839R4209
9986A056054P4795M6143J5043Q625N0574J30928K35887K93513K39441M7413j80024
9975B018392l56517l95447l17931k16408j47035r5571o5020n0774l4209k7441
9965C12039k4181j1213l411r064q540M061J9015J7851J8537J5130J2216N530q401
9952C39569j0102j5242j4900j2669N5J799Q285m368R67O426J545q37K338o45l61
$$ plain form
9937 301860 285668 251913 203492 143212 96520 80494 82655 90880 97996 106649 115385 131371 143696
9924 143696 147979 152482 158388 168198 172593 172968 176927 172297 166619 169237 174643 180522 185364 188702 186122
9909 186122 189467 193969 198364 202143 206468 209694 218303 228547 232070 236296 237060 240344 244227 241174
9895 241174 240895 237680 234999 234519 227945 225623 222696 223758 234403 247125 268074 293465 319012 341276
9881 341276 366340 394824 414103 428186 430742 431533 436464 440884 447264 462584 482361 506296 534986
9868 534986 566957 592515 605182 605141 587376 556958 526800 501590 491335 497371 514960 532255
9856 532255 544818 559485 583551 597967 602357 598353 591317 583467 579502 579130 583840 582737 576612 570410
9842 570410 563050 560977 570606 596033 628199 664655 687831 697320 701195 703499 703828 697126 681908
$$ packed form
9937C01860j6192l3755m8421o0280m6692j6026K161Q225P116Q653Q736J5986J2325
9924A43696M283M503N906R810M395L75L959m630n678K618N406N879M842L338k580
9909A86122L345M502M395L779M325L226Q609J0244L523M226P64L284L883l053
9895B41174k79l215k681m80o574k322k927J062J0645J2722K0949K5391K5547K2264
9881C41276K5064K8484J9279J4083K556P91M931M420O380J5320J9777K3935K8690
9868E34986L1971K5558J2667m1j7765l0418l0158k5210j0255O036J7589J7295
9856E32255J2563J4667K4066J4416M390m004p036p850l965l72M710j103o125o202
9842E70410p360k073R629K5427L2166L6456K3176R489L875K304L29o702j5218
$$ plain form
9829 681908 671419 649100 621587 601904 591887 591183 595785 605665 610917 603341 597373 588278 598169
9816 598169 620795 648988 686836 731943 778914 815333 844130 853301 849013 849870 872692 914269
9804 914269 967038 1028695 1107017 1196494 1299946 1439937 1649165 2006582 2625484 3582405
9794 3582405 4766570 5798657 6220545 5789884 4672419 3391602 2388156 1771990 1420734
9785 1420734 1209414 1068130 972988 913750 893713 894883 899247 912081 924681 936868 947840
9774 947840 941567 935111 936665 948033 955791 954642 939590 910250 878784 854164 849084 857634 865957
9761 865957 877277 885463 889232 894171 891213 895338 911479 947505 997226 1048560 1083693 1099083 1113043
9748 1113043 1128064 1149522 1179084 1215966 1272322 1349063 1433992 1519691 1589567 1643835 1697067
$$ packed form
9829F81908j0489k2319k7513j9683j0017p04M602R880N252p576n968r095R891
9816E98169K2626K8193L7848M5107M6971L6419K8797R171m288Q57K2822M1577
9804I14269N2769O1657P8322Q9477J03452J39991K09228L57417O18902R56921
9794C582405J184165J032087M21888m30661j117465j280817j003446o16166l51256
9785A420734k11320j41284r5142n9238k0037J170M364J2834J2600J2187J0972
9774I47840o273o456J554J1368P758j149j5052k9340l1466k4620n080Q550Q323
9761H65957J1320Q186L769M939k958M125J6141L6026M9721N1334L5133J5390J3960
9748A113043J5021K1458K9562L6882N6356P6741Q4929Q5699O9876N4268N3232
$$ plain form
9737 1697067 1753986 1821752 1895261 1981428 2082691 2166290 2223301 2249531 2244939 2220168 2187890
9726 2187890 2143896 2082175 2002513 1927207 1860076 1810563 1784358 1783753 1806139 1856416 1942207 2074206
9714 2074206 2264288 2528720 2882088 3321218 3816770 4299349 4689385 4925819 5006801 4965333
9704 4965333 4843046 4675532 4472534 4246319 4013931 3791523 3605809 3452830 3328718 3237025
9694 3237025 3175785 3141824 3136697 3177698 3262636 3390506 3575210 3826059 4130975 4474751 4856589
9683 4856589 5274308 5733891 6260301 6897514 7683435 8664061 9930144 11608164 13891405
9674 13891405 17027505 21351948 27194942 34633381 43027843 50716303 55477008 55789980
9666 55789980 51680462 44756343 37362708 31057192 26307064 23034023 20974046 19890282
$$ packed form
9737A697067N6919O7766P3509Q6167J01263Q3599N7011K6230m592k4771l2278
9726B187890m3994o1721p9662p5306o7131m9513k6205o05K2386N0277Q5791J31999
9714B074206J90082K64432L53368M39130M95552M82579L90036K36434Q0982m1468
9704D965333j22287j67514k02998k26215k32388k22408j85714j52979j24112r1693
9694C237025o1240l3961n127M1001Q4938J27870J84704K50849L04916L43776L81838
9683D856589M17719M59583N26410O37213P85921R80626J266083J678020K283241
9674A3891405L136100M324443N842994P438439Q394462P688460M760705L12972
9666E5789980m109518o924119p393635o305516m750128l273041k059977j083764
$$ plain form
9658 19890282 19655092 20233180 21648805 23922567 27003349 30669826 34580449 38368216
9650 38368216 41704122 44396888 46447343 47957438 49058506 49797464 50026643 49496526 48063350
9641 48063350 45830590 43126915 40422552 38163785 36641088 35899848 35948985 37005008 39548874
9632 39548874 44307590 52181560 64223268 81158112 102189410 123612244 139110814
9625 139110814 143196766 134340910 115465484 93438709 73937525 59089886 48864095
9618 48864095 42307586 38376527 36279493 35485454 35679368 36687051 38346051 40474748
9610 40474748 42845830 45138063 47014296 48233221 48697840 48515878 47886065 46956833 45676315
9601 45676315 43728381 40821518 37001011 32695758 28466994 24807818 22017559 20134433
$$ packed form
9658A9890282k35190N78088J415625K273762L080782L666477L910623L787767
9650C8368216L335906K692766K050455J510095J101068P38958K29179n30117j433176
9641D8063350k232760k703675k704363k258767j522697p41240M9137J056023K543866
9632C9548874M758716P873970J2041708J6934844K1031298K1422834J5498570
9625A39110814M085952q855856j8875426k2026775j9501184j4847639j0225791
9618D8864095o556509l931059k097034p94039J93914J007683J659000K128697
9610D0474748K371082K292233J876233J218925M64619j81962o29813r29232j280518
9601D5676315j947934k906863l820507m305253m228764l659176k790259j883126
$$ plain form
9593 20134433 19080128 18786779 19238794 20501975 22706333 26056248 30765308 36790778
9585 36790778 43481830 49329206 52392707 51343400 46268063 38677882 30770043 24075222
9577 24075222 19012604 15373112 12772721 10871654 9429787 8299868 7398557 6669189
9569 6669189 6072003 5556646 5110786 4710975 4358103 4052416 3790703 3574502 3417401 3319314
9559 3319314 3271566 3259076 3262339 3275873 3299249 3341854 3407869 3500850 3636686 3826570 4057288
9548 4057288 4308940 4544557 4723807 4816558 4793698 4632373 4343132 3961619 3543314 3167575
9538 3167575 2861173 2612329 2402212 2227459 2075012 1954331 1862545 1809494 1796648 1817636
9528 1817636 1862324 1914053 1967375 2015088 2064740 2104589 2124646 2130295 2110269 2066454 2005886 1941409
$$ packed form
9593B0134433j054305k93349M52015J263181K204358L349915M709060O025470
9585C6790778O691052N847376L063501j049307n075337p590181p907839o694821
9577B4075222n062618l639492k600391j901067j441867j129919r01311p29368
9569F669189n97186n15357m45860l99811l52872l05687k61713k16201j57101r8087
9559C319314m7748j2490L263J3534K3376M2605O6015R2981J35836J89884K30718
9548D057288K51652K35617J79250R2751k2860j61325k89241l81513m18305l75739
9538C167575l06402k48844k10117j74753j52447j20681r1786n3051j2846K0988
9528A817636M4688N1729N3322M7713M9652L9849K0057N649k0026m3815o0568o4477
$$ plain form
9516 1941409 1887019 1839229 1791758 1736392 1662218 1559703 1434900 1308764 1190733 1077932
9506 1077932 986833 919845 874980 846743 836871 822968 809372 803523 801774 786823 774270 752332
9494 752332 718133 680014 644678 613632 586997 565886 547074 532543 531448 528224 518248 513020
9482 513020 505007 490967 472910 463372 464161 457965 449487 444333 439887 440671 444035 448610 458917 462543
9468 462543 459586 451251 435191 411648 378466 352141 341849 332959 329362 322482 313474 303820 296784
9455 296784 292893 290258 288361 278873 260733 252514 255430 256931 259732 266783 270847 278716 281556 285297
9441 285297 290712 296758 299571 304698 308172 304596 298942 302827 298046 289307 277991 271948 266978 262776
9427 262776 263181 270801 278149 279635 272722 265628 265615 268250 267818 263314 257537 252188 249533 254265 255416
$$ packed form
9516A941409n4390m7790m7471n5366p4174j02515j24803j26136j18031j12801
9506A077932r1099o6988m4865k8237r872j3903j3596n849j749j4951j2553k1938
9494G52332l4199l8119l5336l1046k6635k1111j8812j4531j095l224r976n228
9482E13020q013j4040j8057r538P89o196q478n154m446P84L364M575J0307L626
9468D62543k957q335j6060k3543l3182k6325j0292q890l597o880r008r654p036
9455B96784l891k635j897r488j8140q219K916J501K801P051M064P869K840L741
9441B85297N415O046K813N127L474l576n654L885m781q739j1316o043m970m202
9427B62776M05P620P348J486o913p094j3K635m32m504n777n349k655M732J151
$$ plain form
9412 255416 252067 246766 234362 220164 216691 216028 211549 203708 197838 200044 205138 204504 206875 205951 207565
9397 207565 210966 216218 217452 219485 223502 221195 218237 212571 202964 199710 199474 199627 201868 206983 213178
9382 213178 216112 220902 217718 214367 210956 209131 211474 213183 207280 203145 204790 207371 211632 209225
9368 209225 210357 207812 207500 206064 198802 197075 200817 204787 198154 189654 189283 188676 187125 181570 169114
9353 169114 166465 166860 167068 168696 174163 179922 178112 178501 179555 179673 180440 182103 183904 186606 187967 189484
9337 189484 188271 185654 184924 182679 176744 174652 180387 179190 171648 172621 177756 182210 180331 176133 176045
9322 176045 179879 178042 185192 193856 197964 190843 185353 180814 176006 169608 163233 156457 147803 146645
9308 146645 150687 155195 161648 164949 164485 161953 169735 176326 185474 189333 190414 193235 198288 211222
$$ packed form
9412B55416l349n301j2404j4198l473o63m479p841n870K206N094o34K371r24J614
9397B07565L401N252J234K033M017k307k958n666r607l254k36J53K241N115O195
9382B13178K934M790l184l351l411j825K343J709n903m135J645K581M261k407
9368B09225J132k545l12j436p262j727L742L970o633q500l71o07j551n555j2456
9353A69114k649L95K08J628N467N759j810L89J054J18P67J663J801K702J361J517
9337A89484j213k617p30k245n935k092N735j197p542R73N135M454j879m198q8
9322A76045L834j837P150Q664M108p121n490m539m808o398o375o776q654j158
9308A46645M042M508O453L301m64k532P782O591R148L859J081K821N053J2934
$$ plain form
9294 211222 227760 254554 272830 278740 284280 284417 281493 271632 258284 239797 216419 204257 196837
9281 196837 190865 190375 184671 183475 183965 181380 186659 185449 180507 178323 172060 170737 171937 179981 181350
9266 181350 179059 182641 184539 182231 187828 193076 201139 210474 220116 225799 238091 262040 288870 322303
9252 322303 369690 437663 511138 575053 622344 650474 636248 591858 536790 479549 422345 371569
9240 371569 329851 297237 274714 257773 245084 237238 232317 232521 226335 220353 214274 211080 208303
9227 208303 202267 199889 203649 210773 211869 215685 220558 230960 241422 241192 247418 259933 270634 284553
9213 284553 301863 336024 377268 431726 501231 592675 683560 753276 799386 800427 768445 716317
9201 716317 655634 587412 514873 449159 395215 350681 320565 300871 282115 267036 257565 250080
$$ packed form
9294B11222J6538K6794J8276N910N540J37k924r861j3348j8487k3378j2162p420
9281A96837n972m90n704j196M90k585N279j210m942k184o263j323J200Q044J369
9266A81350k291L582J898k308N597N248Q063R335R642N683J2292K3949K6830L3433
9252C22303M7387O7973P3475O3915M7291K8130j4226m4390n5068n7241n7204n0776
9240C71569m1718l2614k2523j6941j2689p846m921K04o186n982o079l194k777
9227B08303o036k378L760P124J096L816M873J0402J0462k30O226J2515J0701J3919
9213B84553J7310L4161M1244N4458O9505R1444R0885O9716M6110J041l1982n2128
9201G16317o0683o8222p2539o5714n3944m4534l0116j9694j8756j5079r471p485
$$ plain form
9189 250080 248318 245909 236675 226207 223737 216759 215195 209567 200204 194845 202137 212689 223362 227079
9175 227079 226137 227324 227550 230778 242979 259077 280949 313061 357776 409926 464962 513285 554484
9162 554484 567796 556046 531519 498752 459842 409897 358701 318596 283809 253959 239191 231274
9150 231274 228493 220745 211952 201870 197423 194765 193283 190362 186518 186549 188562 180986 172984 168217 169305
9135 169305 171191 167948 171141 176886 173712 167919 168193 173392 179053 184690 189155 201557 216177 233624
9121 233624 241195 239973 245990 248429 242494 234221 225191 215342 210123 199019 191255 186250 182432 178802
9107 178802 178581 171484 170160 168044 168359 164962 161958 168239 173812 178312 180751 183406 181410 178184 176479
9092 176479 177439 179979 175622 176352 182337 185261 182399 177831 175540 176095 175849 178624 178853 180494 186401 194763
$$ packed form
9189B50080j762k409r234j0468k470o978j564n628r363n359P292J0552J0673L717
9175B27079r42J187K26L228J2201J6098K1872L2112M4715N2150N5036M8323M1199
9162E54484J3312j1750k4527l2767l8910m9945n1196m0105l4787k9850j4768p917
9150B31274k781p748q793j0082m447k658j482k921l844L1K013p576q002m767J088
9135A69305J886l243L193N745l174n793K74N199N661N637M465J2402J4620J7447
9121B33624P571j222O017K439n935q273r030r849n219j1104p764n005l818l630
9107A78802k21p097j324k116L15l397l004O281N573M500K439K655j996l226j705
9092A76479R60K540m357P30N985K924k862m568k291N55k46K775K29J641N907Q362
$$ plain form
9076 194763 186242 180029 180787 191398 197862 197075 199736 200526 198905 200398 200539 201170 196710 187677 186976 187513
9060 187513 186991 184696 188232 193384 195763 194033 189534 185333 184595 181854 181695 184099 184950 183651 186837
9045 186837 191528 188945 187360 194790 199606 199909 202577 198581 196471 197375 194346 200667 204182 204682 202129
9030 202129 198472 203837 206276 204976 197236 194960 200970 201071 200789 204887 205146 206570 200920 198720 198340
9015 198340 204854 210487 216839 220910 215034 212626 219240 221058 227123 230449 231634 232141 230899 232017 237881
9000 237881 240497 246456 251958 255157 248999 246935 245832 247399 251858 249630 248277 245027 250054 252104
8986 252104 254256 259858 255114 256086 263498 262613 258026 251901 247766 250409 259347 272071 278409 278984 271788
8971 271788 264468 269780 272348 272103 275215 277107 278208 281340 280225 284649 291397 294154 298919 298688 293990
$$ packed form
9076A94763q521o213P58J0611O464p87K661P90j621J493J41O31m460r033p01N37
9060A87513n22k295L536N152K379j730m499m201p38k741j59K404Q51j299L186
9045A86837M691k583j585P430M816L03K668l996k110R04l029O321L515N00k553
9030B02129l657N365K439j300p740k276O010J01k82M098K59J424n650k200l80
9015A98340O514N633O352M071n876k408O614J818O065L326J185N07j242J118N864
9000B37881K616N959N502L199o158k064j103J567M459k228j353l250N027K050
8986B52104K152N602m744R72P412q85m587o125m135K643Q938J2724O338N75p196
8971B71788p320N312K568k45L112J892J101L132j115M424O748K757M765k31m698
$$ plain form
8956 293990 296829 307255 313654 317436 317447 320575 330151 333756 333256 330789 330786 335246 331663 330979 331840 330133
8940 330133 326541 329247 332009 329250 331058 331103 334562 339548 341537 341627 346761 344031 347182 353832 362597
8925 362597 369995 374789 374196 373188 370761 370057 377466 381448 381817 385796 383569 387461 391554 389739 403980
8910 403980 417744 416505 418616 419111 418141 419815 422586 426302 428056 428782 434121 437772 440684 442180 442449
8895 442449 445932 455515 464871 469863 468960 469387 476713 479692 477091 475116 483314 492575 498313 501411 508281
8880 508281 511546 518334 526410 536841 544401 545704 550854 555889 570153 584181 589255 598064 600846 601385
8866 601385 605625 607858 612611 621054 628595 633524 646425 651690 655546 665305 673451 683408 691111 703044
8852 703044 719582 738942 753084 767015 772264 774546 780948 787258 795102 799515 803837 816652 832239
$$ packed form
8956B93990K839J0426O399L782J1L128R576L605n00k467lM460l583o84Q61j707
8940C30133l592K706K762k759J808M5L459M986J989R0N134k730L151O650Q765
8925C62597P398M794n93j008k427p04P409L982L69L979k227L892M093j815J4241
8910D03980J3764j239K111M95r70J674K771L716J754P26N339L651K912J496K69
8895D42449L483R583R356M992r03M27P326K979k601j975Q198R261N738L098O870
8880E08281L265O788Q076J0431P560J303N150N035J4264J4028N074Q809K782N39
8866F01385M240K233M753Q443P541M929J2901N265L856R759Q146R957P703J1933
8852G03044J6538J9360J4142J3931N249K282O402O310P844M413M322J2815J5587
$$ plain form
8839 832239 839838 844424 848435 859411 873819 891791 909034 929879 937454 950327 974387 987510
8827 987510 1006414 1035065 1060751 1089235 1134881 1183519 1246413 1327560 1409911 1460964 1462959 1428820
8815 1428820 1395887 1372543 1353461 1334373 1326312 1318554 1319461 1340328 1366784 1381665 1386975 1392472 1406584
8802 1406584 1417598 1427812 1444167 1470729 1494659 1513738 1539557 1570378 1598394 1621679 1648468
8791 1648468 1681317 1717679 1746339 1777626 1811330 1844013 1886120 1929634 1975414 2026815 2085589
8780 2085589 2153784 2228521 2320025 2451438 2629697 2831121 2992069 3056101 3013948 2905624
8770 2905624 2813074 2768463 2764755 2787714 2827081 2870640 2917314 2972043 3036203 3103764 3178199 3247081
8758 3247081 3321905 3401854 3481129 3567401 3646733 3726573 3818052 3921582 4022091 4131150 4244929
$$ packed form
8839H32239P599M586M011J0976J4408J7972J7243K0845P575J2873K4060J3123
8827I87510J8904K8651K5686K8484M5646M8638O2894Q1147Q2351N1053J995l4139
8815A428820l2933k3344j9082j9088q061p758R07K0867K6456J4881N310N497J4112
8802A406584J1014J0214J6355K6562K3930J9079K5819L0821K8016K3285K6789
8791A648468L2849L6362K8660L1287L3704L2683M2107M3514M5780N1401N8774
8780B085589O8195P4737R1504J31413J78259K01424J60948O4032m2153j08324
8770B905624r2550m4611l708K2959L9367M3559M6674N4729O4160O7561P4435O8882
8758C247081P4824P9949P9275Q6272P9332P9840R1479J03530J00509J09059J13779
$$ plain form
8747 4244929 4359570 4479305 4600935 4723013 4845824 4980109 5113437 5246589 5397673 5551110
8737 5551110 5711097 5877225 6053592 6237625 6437037 6656308 6899385 7142346 7366153 7545639
8727 7545639 7683740 7808054 7942328 8091225 8265613 8451567 8642832 8840427 9037700 9233503
8717 9233503 9428234 9618206 9806305 9990534 10167083 10334557 10499831 10657246 10798076 10928489
8707 10928489 11044506 11155189 11248268 11328660 11389581 11432137 11456609 11473645 11471095 11439535 11398011
8696 11398011 11346206 11273516 11182555 11075924 10956447 10830989 10692919 10546588 10386938 10213558
8686 10213558 10031529 9853707 9665354 9471573 9278944 9084940 8886765 8689181 8492665
8677 8492665 8298257 8100204 7900012 7701964 7500971 7297032 7103944 6917427 6728263 6537575
$$ packed form
8747D244929J14641J19735J21630J22078J22811J34285J33328J33152J51084J53437
8737E551110J59987J66128J76367J84033J99412K19271K43077K42961K23807J79486
8727G545639J38101J24314J34274J48897J74388J85954J91265J97595J97273J95803
8717I233503J94731J89972J88099J84229J76549J67474J65274J57415J40830J30413
8707A0928489J16017J10683R3079Q0392O0921M2556K4472J7036k550l1560m1524
8696A1398011n1805p2690r0961j06631j19477j25458j38070j46331j59650j73380
8686A0213558j82029j77822j88353j93781j92629j94004j98175j97584j96516
8677H492665j94408j98053k00192j98048k00993k03939j93088j86517j89164j90688
$$ plain form
8667 6537575 6362792 6191660 6029144 5873857 5720166 5566518 5423664 5279269 5131890 4991881
8657 4991881 4857637 4732856 4614662 4498000 4378987 4258951 4146319 4043408 3945256 3848672
8647 3848672 3756582 3675671 3586322 3505586 3421771 3334576 3242536 3174781 3111840 3045623 2972830
8636 2972830 2895310 2828338 2770390 2718900 2675675 2632733 2580045 2523855 2465915 2414867 2359330
8625 2359330 2301061 2247493 2204187 2174790 2141374 2102124 2060518 2020634 1985035 1950716 1919093
8614 1919093 1891374 1867114 1838949 1811687 1784615 1757644 1729390 1713191 1698531 1681124 1670103
8603 1670103 1665675 1663007 1667572 1690098 1729047 1816984 1984092 2241239 2553730 2792560 2828831
8592 2828831 2644249 2282038 1946204 1723892 1591949 1505770 1443015 1400169 1360214 1328407
$$ packed form
8667F537575j74783j71132j62516j55287j53691j53648j42854j44395j47379j40009
8657D991881j34244j24781j18194j16662j19013j20036j12632j02911r8152r6584
8647C848672r2090q0911q9349q0736q3815q7195r2040o7755o2941o6217p2793
8636B972830p7520o6972n7948n1490m3225m2942n2688n6190n7940n1048n5537
8625B359330n8269n3568m3306k9397l3416l9250m1606l9884l5599l4319l1623
8614A919093k7719k4260k8165k7262k7072k6971k8254j6199j4660j7407j1021
8603A670103m428k668M565K2526L8949Q7937J67108K57147L12491K38830L6271
8592B828831j84582l62211l35834k22312j31943q6179o2755m2846l9955l1807
$$ plain form
8582 1328407 1308193 1300071 1282936 1268334 1258144 1252360 1239375 1227304 1222080 1221510 1223945 1223577 1223209
8569 1223209 1227161 1228116 1237545 1247298 1260049 1284858 1312059 1344293 1376294 1417211 1459381 1513976
8557 1513976 1580984 1655125 1754574 1899239 2098645 2425804 2949103 3630923 4249845 4497365
8547 4497365 4298516 3675310 3000865 2527933 2231875 2038993 1900745 1786055 1679856 1572025
8537 1572025 1472540 1384485 1294817 1205242 1124553 1054430 985078 927349 878282 840366 809802
8526 809802 784365 758817 733101 718716 706117 693917 688427 678336 665713 660754 654135 650194
8514 650194 653097 656616 664525 677259 696708 726205 789846 908881 1108414 1388894 1673877
8503 1673877 1827634 1775727 1513547 1175285 913632 761182 667399 601191 562996 532367
$$ packed form
8582A328407k0214q122j7135j4602j0190n784j2985j2071n224n70K435l68l68
8569A223209L952R55R429R753J2751K4809K7201L2234L2001M0917M2170N4595
8557A513976O7008P4141R9449J44665J99406L27159N23299O81820O18922K47520
8547D497365j98849o23206o74445m72932k96058j92882j38248j14690j06199j07831
8537A572025r9485q8055q9668q9575q0689p0123o9352n7729m9067l7916l0564
8526H09802k5437k5548k5716j4385j2599j2200n490j0091j2623m959o619l941
8514F50194K903L519P909J2734J9449K9497O3641J19035J99533K80480K84983
8503A673877J53757n1907k62180l38262k61653j52450r3783o6208l8195l0629
$$ plain form
8493 532367 518762 504667 487620 474674 467355 463529 456099 444872 429545 416291 411574 408760 410529
8480 410529 406656 402971 397437 388919 382266 383558 387058 385037 376568 365901 360238 360629 361598 358832 350132
8465 350132 341404 336223 337471 333173 326600 323656 321427 324595 325491 326954 321925 316227 320345 318221 312875
8450 312875 300949 298778 295215 291938 292386 295290 297875 297214 290426 282976 278777 280107 284288 282913 279570
8435 279570 276388 273460 271354 275380 272492 262634 260685 264707 259990 257222 256171 261040 261787 259018 260056
8420 260056 263044 259961 251267 244424 243375 245604 246770 243748 243778 242431 241047 243188 240210 230788 231289
8405 231289 230298 225119 227070 226258 223489 227701 227561 218888 217358 215534 216664 218188 213436 216701 211147
8390 211147 209072 207449 202689 206879 210319 206075 204390 205500 213181 204204 194964 193224 201442 201472 200995
$$ packed form
8493E32367j3605j4095j7047j2946p319l826p430j1227j5327j3254m717k814J769
8480D10529l873l685n534q518o653J292L500k021q469j0667n663L91R69k766q700
8465C50132q728n181J248m298o573k944k229L168Q96J463n029n698M118k124n346
8450C12875j1926k171l563l277M48K904K585o61o788p450m199J330M181j375l343
8435B79570l182k928k106M026k888r858j949M022m717k768j051M869P47k769J038
8420B60056K988l083q694o843j049K229J166l022L0j347j384K141k978r422N01
8405B31289r91n179J951q12k769M212j40q673j530j824J130J524m752L265n554
8390B11147k075j623m760M190L440m244j685J110P681q977r240j740Q218L0m77
$$ plain form
8375 200995 202823 199614 199517 194475 180719 174988 167630 166293 167841 171964 169394 167047 171779 180840 176853
8360 176853 167518 169401 171050 168548 169041 168787 165734 166750 167894 168196 168936 169204 164880 157398 159067 158972
8344 158972 159126 155784 149114 153319 161697 159509 157746 163831 165321 168861 168290 169017 159722 167819 178262
8329 178262 182700 188015 192438 194157 192076 188352 181417 175917 161301 147394 146823 139673 140295 140856 136596
8314 136596 141507 141341 137675 136864 138051 139345 137080 138489 139332 134113 128152 124366 126090 131929 132105
8299 132105 125540 126289 126446 120691 124760 128598 129513 132819 134735 135955 128971 125325 124299 121134 110718
8284 110718 111131 113935 109186 107708 109143 108603 109726 110494 113348 120796 122058 126420 128807 129897 124042
8269 124042 119272 124824 127460 129580 124166 122016 116983 112701 115175 126573 128680 125142 124695 123538
$$ packed form
8375B00995J828l209r7n042j3756n731p358j337J548M123k570k347M732R061l987
8360A76853r335J883J649k502M93k54l053J016J144L02P40K68m324p482J669r5
8344A58972J54l342o670M205Q378k188j763O085J490L540n71P27r295Q097J0443
8329A78262M438N315M423J719k081l724o935n500j4616j3907n71p150O22N61m260
8314A36596M911j66l666q11J187J294k265J409Q43n219n961l786J724N839J76
8299A32105o565P49J57n755M069L838R15L306J916J220o984l646j026l165j0416
8284A10718M13K804m749j478J435n40J123P68K854P448J262M362K387J090n855
8269A24042m770N552K636K120n414k150n033m282K474J1398K107l538m47j157
$$ plain form
8255 123538 118469 121161 122386 126843 126068 118524 110691 107825 108659 108217 108020 106380 104408 102632 96676
8240 96676 100569 109119 111479 113453 114736 110940 107962 114159 114591 114286 119166 123812 135226 142454 145352
8225 145352 161580 187295 221582 260513 281966 288512 266331 229900 202891 181602 161951 146535
8213 146535 134012 125227 118337 113109 107166 105823 107129 105838 104262 102420 103504 105014 105579 103718
8199 103718 102541 106298 103617 103999 102112 101475 104572 106341 108179 112511 116765 119796 117537 122930 128942
8184 128942 143570 164397 186828 218179 252553 277464 275857 252788 218494 181324 160180 143455
8172 143455 128536 122166 124218 112273 101550 98167 93255 93543 103565 105461 102372 97056 96211 95120
8158 95120 89054 81387 84439 85094 80419 81007 82730 83712 84827 85132 84507 83463 85996 87299 91069 91976
$$ packed form
8255A23538n069K692J225M457p75p544p833k866Q34m42j97j640j972j776n956
8240I6676L893Q550K360J974J283l796k978O197M32l05M880M646J1414P228K898
8225A45352J6228K5715L4287L8931K1453O546k2181l6431k7009k1289j9651j5416
8213A46535j2523q785o890n228n943j343J306j291j576j842J084J510N65j861
8199A03718j177L757k681L82j887o37L097J769J838M332M254L031k259N393O012
8184A28942J4628K0827K2431L1351L4374K4911j607k3069l4294l7170k1144j6725
8172A43455j4919o370K052j1945j0723l383m912K88J0022J896l089n316q45j091
8158I5120o066p667L052O55m675N88J723R82J115L05o25j044K533J303L770R07
$$ plain form
8142 91976 86747 81699 82629 86552 87636 82623 83866 85130 74313 73774 71577 73670 75023 73084 76328
8127 76328 75563 75099 80840 75788 75245 76831 81221 82917 73993 73680 71764 68880 63377 64534 68826 77316
8111 77316 84844 83538 81423 80287 77101 80218 81549 79734 71071 67438 67574 74114 80109 82614 87281
8096 87281 91373 93993 84901 81134 75617 74866 73570 73707 72517 67728 66465 68021 68059 69408 76927 77497
8080 77497 71919 72519 72194 65596 64409 57186 58160 55196 50849 55736 63858 73836 75014 73964 72967 68678
8064 68678 65804 68700 77305 80587 74986 70498 68597 71140 71694 66211 66215 69403 67890 61484 61100 62657
8048 62657 69236 74178 68306 63819 62924 63007 60735 61201 59946 57859 55316 58398 58857 58650 56968 48206
8032 48206 43002 38207 37690 42003 44638 51357 57123 56333 53322 53167 59819 65028 61168 60940 65831 71788
$$ packed form
8142I1976n229n048R30L923J084n013J243J264j0817n39k197K093J353j939L244
8127G6328p65m64N741n052n43J586M390J696q924l13j916k884n503J157M292Q490
8111G7316P528j306k115j136l186L117J331j815q663l633J36O540N995K505M667
8096H7281M092K620r092l767n517p51j296J37j190m789j263J556L8J349P519N70
8080G7497n578O00l25o598j187p223R74k964m347M887Q122R978J178j050r97m289
8064F8678k874K896Q605L282n601m488j901K543N54n483ML188j513o406l84J557
8048F2657O579M942n872m487q95Q3k272M66j255k087k543L082M59k07j682q762
8032D8206n204m795n17M313K635O719N766p90l011j55O652N209l860k28M891N957
$$ plain form
8016 71788 75784 75005 77435 77657 76555 82407 83092 80951 79881 83255 84083 88332 91449 95686 97106 96795
8000 96795 96604 102920 113481 112501 109328 107665 110868 111529 109536 112489 112735 110598 109732 108377 105245 107076
7984 107076 106132 104733 98744 93136 93835 99239 100259 99541 99885 101790 104671 102618 100896 105014 108640
7969 108640 107887 108580 112497 116954 118935 122248 126452 131663 139689 146660 155218 163875 181271 201349
7955 201349 221163 239640 250443 254192 241610 219241 198090 177549 163001 152574 142826 138065
7943 138065 131342 119086 111831 107555 100176 96220 94957 92235 94037 99060 103107 103657 101413 102481
7929 102481 109162 116017 112387 113369 116770 114842 123981 134917 138808 142342 147259 148560 153831 160862
7915 160862 165181 170969 174688 178431 179657 181703 181362 181443 174242 165777 162633 161229 155778 144368 131645
$$ packed form
8016G1788L996p79K430K22j102N852O85k141j070L374Q28M249L117M237J420l11
8000I6795j91O316J0561r80l173j663L203O61j993K953K46k137q66j355l132J831
7984A07076r44j399n989n608O99N404J020p18L44J905K881k053j722M118L626
7969A08640p53O93L917M457J981L313M204N211Q026O971Q558Q657J7396K0078
7955B01349J9814J8477J0803L749j2582k2369k1151k0541j4548j0427r748m761
7943A38065o723j2256p255m276p379l956j263k722J802N023M047N50k244J068
7929A02481O681O855l630R82L401j928R139J0936L891L534M917J301N271P031
7915A60862M319N788L719L743J226K046l41Q1p201q465l144j404n451j1410j2723
$$ plain form
7900 131645 124121 118239 117217 115270 120598 118430 111059 101373 88510 87815 88100 91843 97311 97084 101119
7885 101119 111128 116158 115366 114812 118737 121987 122401 121197 118101 115993 115299 116675 114049 115310 117247
7870 117247 111721 110931 108867 97754 93619 93410 92059 86217 80957 77748 81271 82661 76720 74156 81865
7855 81865 89980 95168 99366 94402 86743 79511 69525 62458 59256 56687 54267 53191 53585 55957 59660
7840 59660 58718 62470 65659 59196 56140 57753 57612 51942 54059 54531 52781 54358 52621 45149 42524
7825 42524 35870 39790 48712 49080 46100 44786 45194 51856 48835 44946 40332 38241 39207 43503 43123 39946
7809 39946 37692 36394 26926 13248 12390 17559 24289 31751 31902 29978 27951 21119 27858 35474 36378
7794 36378 36822 34166 29945 27298 30584 28269 22213 18659 20292 22413 19116 18449 17599 10435 13192
$$ packed form
7900A31645p524n882j022j947N328k168p371r686j2863o95K85L743N468k27M035
7885A01119J0009N030p92n54L925L250M14j204l096k108o94J376k626J261J937
7870A17247n526p90k064j1113m135k09j351n842n260l209L523J390n941k564P709
7855H1865Q115N188M198m964p659p232r986p067l202k569k420j076L94K372L703
7840E9660r42L752L189o463l056J613j41n670K117M72j750J577j737p472k625
7825D2524o654L920Q922L68k980j314M08O662l021l889m614k091R66M296l80l177
7809C9946k254j298r468j3678q58N169O730P462J51j924k027o832O739P616R04
7794C6378M44k656m221k647L286k315o056l554J633K121l297o67q50p164K757
$$ plain form
7779 13192 16745 11976 14598 16808 13367 12078 18023 18213 14758 10479 9875 8082 12836 16345 15149
7764 15149 7581 5350 6023 -1303 -3557 1348 7600 10361 10561 12055 5505 3770 8461 13875 14251
7749 14251 13631 10184 5027 4638 5790 7661 8585 5801 5986 6786 10041 12685 13162 14653 12505 11869
7733 11869 7119 7378 8007 10480 11030 7085 2808 4681 8171 8437 13258 15760 15229 9120 8147 13930
7717 13930 12245 10950 16851 24929 23820 21321 15442 11607 8104 2954 -2927 -2447 -3523 -3070 -4781
7702 -4781 -4294 4622 8591 5510 5456 19409 25209 18189 10970 11806 7308 9334 18098 19750 19160 18310
7686 18310 17734 13425 12065 4821 918 7929 9642 10383 9750 11836 5370 3407 2154 4442 4074 1653
7670 1653 4592 6702 6362 5600 205 -5409 -3782 -6229 -4081 1660 3261 8691 6475 3348 10304
$$ packed form
7779A3192L553m769K622K210l441j289N945J90l455m279o04j793M754L509j196
7764A5149p568k231O73p326k254M905O252K761K00J494o550j735M691N414L76
7749A4251o20l447n157l89J152J871R24k784J85Q00L255K644M77J491k148o36
7733A1869m750K59O29K473N50l945m277J873L490K66M821K502n31o109r73N783
7717A3930j685j295N901Q078j109k499n879l835l503n150n881M80j076M53j711
7702d781M87Q916L969l081n4J3953N800p020p219Q36m498K026Q764J652n90q50
7686A8310n76m309j360p244l903P011J713P41o33K086o466j963j253K288l68k421
7670A653K939K110l40p62n395n614J627k447K148N741J601N430k216l127O956
$$ plain form
7655 10304 7319 2944 4275 8825 7072 12167 8281 8397 13870 10734 2041 61 304 4143 207
7640 207 -4421 -4343 -2803 -1080 -1771 4594 9605 11876 10232 6920 7782 4757 -899 -3886 -3217 -1895
7624 -1895 -2650 -1070 -1277 2009 3181 45 21 478 3527 10365 9690 4241 7724 7681 4210 -5693 -5896
7607 -5896 3381 2168 6402 6435 8354 9311 8862 9768 8216 11756 13202 12411 13492 14773 12180 14333
7591 14333 13907 14092 13403 11592 8387 6737 12013 8195 -4116 -1937 8358 14703 9093 -778 -2689
7576 -2689 1286 9004 11611 6851 7836 10271 16246 16048 8875 2671 -85 -577 4612 8571 14878 12552
7560 12552 5281 2635 4796 11263 10163 2403 -3976 3653 8507 11028 16005 17004 14615 10191 9232
7545 9232 -1798 -7174 -6293 -3439 -2621 -1296 -3636 -5406 -11188 -13724 -11747 -1780 1742 -2434 -810
$$ packed form
7655A0304k985m375J331M550j753N095l886J16N473l136q693j980K43L839l936
7640B07m628P8J540J723o91O365N011K271j644l312Q62l025n656k987O69J322
7624a895p55J580k07L286J172l136k4M57L049O838o75n449L483m3l471r903k03
7607e896R277j213M234L3J919R57m49R06j552L540J446p91J081J281k593K153
7591A4333m26J85o89j811l205j650N276l818j2311K179J0295O345n610r871j911
7576b689L975P718K607m760R85K435N975j98p173o204k756m92N189L959O307k326
7560A2552p271k646K161O467j100p760o379P629M854K521M977R99k389m424r59
7545I232j1030n376Q81K854Q18J325k340j770n782k536J977R967L522m176J624
$$ plain form
7530 -810 1024 245 3772 980 -4064 -150 5855 5364 2934 1119 651 3688 9776 12777 11345 2810
7514 2810 -2433 -3504 1693 -104 4034 6556 10237 10569 4480 -1933 -7483 -4015 -452 -3595 -3557 -9790
7498 -9790 -7376 -5791 -5237 491 -148 2929 3363 5670 4215 -3424 -7884 -10721 -6621 -4875 -2608 -3448
7482 -3448 -179 6793 7057 7008 5401 2482 3792 -4236 -6482 -5555 -5017 -4206 -3399 272 -983 -1549 69
7465 69 1376 1842 -755 722 2617 144 -3401 -7098 -4401 -2795 3853 2235 -4801 -6999 -4318 -4135
7449 -4135 1699 9157 5764 2677 3600 3521 10963 13124 7156 3054 8341 9016 11650 11879 8323 9666
7433 9666 6641 5054 1360 -1137 -2134 -1823 -3667 -6549 -9793 -12398 -9295 -3323 -3772 -1719 -4455 -4580
7417 -4580 3523 4228 -2192 -5795 -3992 -2574 -528 -4520 -8149 -1977 2585 536 2739 4874 4734
$$ packed form
7530h10J834p79L527k792n044L914O005m91k430j815m68L037O088L001j432q535
7514B810n243j071N197j797M138K522L681L32o089o413n550L468L563l143L8o233
7498i790K414J585N54N728o39L077M34K307j455p639m460k837M100J746K267q40
7482c448L269O972K64m9j607k919J310q028k246R27N38Q11Q07L671j255n66J618
7465F9J307M66k597J477J895k473l545l697K697J606O648j618p036k198K681J83
7449d135N834P458l393l087R23p9P442K161n968m102N287O75K634K29l556J343
7433I666l025j587l694k497r97L11j844k882l244k605L103N972m49K053k736j25
7417d580Q103P05o420l603J803J418K046l992l629O172M562k049K203K135j40
$$ plain form
7402 4734 6478 2844 -4753 -6400 -3879 -8603 -8943 -9386 -9572 -12116 -2792 -3623 -10492 -11447 -10531 -7725
7386 -7725 -5776 -1163 1217 -2209 -4946 -5352 -7876 -4989 -4230 -3570 -5668 -4253 -649 2762 3357 7659
7370 7659 9107 1248 -6102 -5547 -2263 3770 10908 6213 3814 -1653 -6308 -5099 -4959 -9908 -7125
7355 -7125 -4475 -5612 -2423 -2773 -1136 1474 1242 -3853 -5649 -10230 -15504 -13145 -6879 -9204 -8751 -11273
7339 -11273 -10085 -6992 -2615 -2078 2798 1830 1017 1161 5487 5596 7004 5141 2225 4123 6456 5415
7323 5415 927 -2548 -4133 1102 -1541 -2550 10473 10108 853 -4757 -7955 -8635 -6489 -5872 -7215
7308 -7215 -7121 -8838 -4602 -1639 1331 865 -5406 -6122 -7232 -7644 -2016 -1949 -5034 -2570 -895 1385 -1296
7291 -1296 -894 2903 -515 -5202 -1493 5317 10164 2044 -5616 -4221 -6113 -8255 -5275 -7033 3076
$$ packed form
7402D734J744l634p597j647K521m724l40m43j86k544R324q31o869r55R16K806
7386g725J949M613K380l426k737m06k524K887P59O60k098J415L604L411N95M302
7370G659J448p859p350N55L284O033P138m695k399n467m655J209J40m949K783
7355g125K650j137L189l50J637K610k32n095j796m581n274K359O266k325M53k522
7339a1273J188L093M377N37M876r68q13J44M326J09J408j863k916J898K333j041
7323E415m488l475j585N235k643j009J3023l65r255n610l198o80K146O17j343
7308g215R4j717M236K963K970m66o271p16j110m12N628O7l085K464J675K280k681
7291a296M02L797l418m687L709O810M847q120p660J395j892k142K980j758J0109
$$ plain form
7276 3076 7438 3481 2882 2016 -945 -4022 -12115 -10825 -4191 -1476 -5631 1497 2674 3975 4162 -574
7260 -574 -4834 -5607 -7816 -8216 -7560 -9879 -8981 -7672 -6114 -7867 -1855 1227 -6362 -6812 -4995 -5167 -2971
7243 -2971 -7887 -11175 -5319 1465 1221 343 -942 -1983 -2841 -5837 -6296 -4482 -4856 -755 -3218 -5010
7227 -5010 -39 2863 3754 3474 2291 -2502 -6290 -5305 -6199 -7050 -4850 -2057 -69 -3367 -2911 -3064 -2028
7210 -2028 -6778 -7201 -4642 -4833 -11939 -8315 -7179 -8246 -9061 -5830 -7109 -1346 2417 1568 -555 3770
7194 3770 9341 5780 -1607 -6090 -6198 -5946 -8445 -9811 -12672 -8963 -8883 -1097 648 730 2031 5787
7178 5787 4024 -9346 -13101 -10006 -8206 -8399 298 6272 -1131 -5611 -6382 -6209 -12593 -10616 -1213
7163 -1213 5965 7010 4957 3931 1302 -4672 -2504 5464 2986 1531 -2090 -5065 -9588 -5014 -350
$$ packed form
7276C076M362l957n99q66k961l077q093J290O634K715m155P128J177J301J87m736
7260e74m260p73k209m00O56k319Q98J309J558j753O012L082p589m50J817j72K196
7243b971m916l288N856O784k44q78j285j041q58k996m59J814l74M101k463j792
7227e010M971K902Q91k80j183m793l788R85q94q51K200K793J988l298M56j53J036
7210b028m750m23K559j91p106L624J136j067q15L231j279N763L763q49k123M325
7194C770N571l561p387m483j08K52k499j366k861L709Q0P786J745Q2J301L756
7178E787j763j3370l755L095J800j93Q697N974p403m480p71J73o384J977R403
7163a213P178J045k053j026k629n974K168P968k478j455l621k975m523M574M664
$$ plain form
7148 -350 803 -2323 -4028 -9174 -7907 -4635 -7987 -7519 -10593 -8509 -4714 -7237 -2644 1380 -4787
7133 -4787 -14234 -10894 -2132 -2740 -8449 -6852 -4722 -9112 -4778 2142 -145 -3195 -8557 -9711 -4226
7118 -4226 -6383 -10625 -7745 -2727 -1067 3127 5984 -4384 -12422 -14603 -5257 -3475 -896 -1404 -4984
7103 -4984 -4660 -7696 -8163 -4877 3099 3987 -1894 -9123 -8055 -11058 -13603 -10638 -6232 -7182 -8817 -8430
7087 -8430 -3459 -297 -4151 1616 6817 10248 2189 -3384 -2891 -4306 -4600 -10920 -8717 -6370 -140
7072 -140 2479 -680 -3679 -4145 -2738 -3113 1481 6568 7811 8225 5955 -241 -646 5044 6462 8347
7056 8347 4573 1623 865 -4407 -12458 -12440 -8757 -411 5798 3845 1323 -191 -605 -2012 -3980 653
7040 653 -709 -8017 -17011 -10025 -8264 -9845 -7219 -2164 405 5898 5533 753 -7198 -3517 -1026
$$ packed form
7148c50J153l126j705n146J267L272l352M68l074K084L795k523M593M024o167
7133d787r447L340Q762o08n709J597K130m390M334O920k287l050n362j154N485
7118d226k157m242K880N018J660M194K857j0368q038k181R346J782K579n08l580
7103d984L24l036m67L286P976Q88n881p229J068l003k545K965M406r50j635L87
7087h430M971L162l854N767N201L431q059n573M93j415k94o320K203K347O230
7072a40K619l159k999m66J407l75M594N087J243M14k270o196m05N690J418J885
7056H347l774k950p58n272q051J8L683Q346O209j953k522j514m14j407j968M633
7040F53j362p308q994O986J761j581K626N055K569N493l65m780p951L681K491
$$ plain form
7025 -1026 -546 -1220 1042 5191 3851 -1084 -7215 -8677 -10604 -13043 -9281 -3542 -2833 -4714 -6411 -8351
7009 -8351 -320 2481 -2537 -3923 -6562 -11420 -5024 -4067 -5340 -9067 -4066 2601 779 -2309 951
6994 951 -5010 -8079 -2826 -2122 -154 -2120 -3589 -6724 -2005 2744 5629 -2044 -1912 2602 6472 3908
6978 3908 3154 2244 6397 2433 731 1059 -2693 -9449 -4502 -1571 162 -5328 -12011 -12810 -9490 -4347
6962 -4347 -1466 1454 -6952 -14080 -10515 -5463 -6149 -5175 -5829 -6940 23 5788 1338 -3200 -3571 -9499
6946 -9499 -6356 710 3218 -4149 -10936 -7702 -6168 1248 8156 6046 740 2079 -3199 -2135 -3491
6931 -3491 -9804 -6560 -1739 661 3536 3427 4024 1744 -2097 -3222 -6204 -13986 -13253 -12013 -9057 -5063
6915 -5063 -8914 -10129 -11331 -12071 -12653 -11571 -11058 -7049 889 2299 -4006 -6898 -7719 -4756 2697 2794
$$ packed form
7025a026M80o74K262M149j340m935o131j462j927k439L762N739P09j881j697j940
7009h351Q031K801n018j386k639m858O396R57j273l727N001O667j822l088L260
6994I51n961l069N253P04J968j966j469l135M719M749K885p673J32M514L870k564
6978C908p54r10M153l964j702L28l752o756M947K931J733n490o683p99L320N143
6962d347K881K920q406p128L565N052o86R74o54j111O963N765m450m538l71n928
6946i499L143P066K508p367o787L234J534P416O908k110n306J339n278J064j356
6931c491o313L244M821K400K875j09N97k280l841j125k982p782P33J240K956L994
6915e063l851j215j202p40n82J082N13M009P938J410o305k892q21K963P453R7
$$ plain form
6899 2794 1497 3248 1259 2745 2188 -793 2487 3515 -4379 -12602 -14049 -9945 -459 -1162 -4788
6884 -4788 -9140 -12621 -14832 -15432 -12867 -18648 -14638 -6087 -3988 -4815 -6686 -7875 -10200 -7592 -6367
6869 -6367 -7989 -6985 -5595 -3516 -4400 -3548 1868 -3153 -3624 -6648 -8533 -8297 -2182 -3125 -3313 -7550
6853 -7550 -7867 -3986 7732 11412 13152 8444 3213 3712 7503 12261 10275 10594 11741 9403 1021
6838 1021 -2091 -4679 -4658 -2408 -1993 -5014 -2607 -3196 -2507 -7640 -6462 -7412 -5446 -4118 -5713 -4389
6822 -4389 3313 6413 3148 -2942 -5096 -7845 -6154 -2057 -1746 -2909 -6224 -5956 -5303 -1089 -3212 -3014
6806 -3014 -1528 -6898 -13242 -19513 -18115 -10205 -7477 -5042 -5633 -10598 -10294 -4708 -3803 -7551 -6030 -4485
6790 -4485 -5837 -6839 -2407 -1291 115 2763 5124 2537 1900 4545 45 -7687 -8388 -3505 -5919
$$ packed form
6899B794j297J751j989J486n57k981L280J028p894q223j447M104R486p03l626
6884d788m352l481k211o00K565n781M010Q551K099q27j871j189k325K608J225
6869f367j622J004J390K079q84Q52N416n021m71l024j885K36O115r43j88m237
6853g550l17L881J1718L680J740m708n231M99L791M758j986L19J147k338q382
6838A021l112k588K1K250M15l021K407n89O89n133J178r50J966J328j595J324
6822d389P702L100l265o090k154k749J691M097L11j163l315K68O53M214k123J98
6806c014J486n370o344o271J398P910K728K435n91m965L04N586R05l748J521J545
6790d485j352j002M432J116J406K648K361k587o37K645m500p732p01M883k414
$$ plain form
6775 -5919 -7172 -2504 1218 -4205 -3316 -2339 3063 8282 7778 5126 7172 6845 1543 -3975 -7424 -7841
6759 -7841 -2344 -2447 -6054 -6512 -8746 -5798 -5506 -2488 -4025 -4602 1740 4990 1107 3360 7553 3079
6743 3079 -5720 -8508 -6538 -4965 3408 9648 5224 3949 6193 2701 6735 6000 1817 352 -2225
6728 -2225 -4180 -2269 -3394 -7558 -7545 -9537 -3249 -1940 -1112 918 4946 6883 1671 -1734 5036 6582
6712 6582 4544 -2231 1371 1679 6035 7074 1649 -1845 -1957 2134 6754 5961 8580 5622 2963 219
6696 219 -1522 869 3347 1058 -42 -3104 5630 5486 -959 9356 16421 11870 18750 28360 30623
6681 30623 27153 20119 12743 9654 7143 2065 -917 -606 2075 532 -5605 -7048 -3241 -5819 -7695
6666 -7695 -6005 -3293 -4685 -8856 -7053 -7857 -3800 1893 2768 298 -484 -3774 -3154 -9343 -15025 -14388
$$ packed form
6775e919j253M668L722n423Q89R77N402N219n04k652K046l27n302n518l449m17
6759g841N497j03l607m58k234K948K92L018j537n77O342L250l883K253M193m474
6743C079q799k788J970J573Q373O240m424j275K244l492M034p35m183j465k577
6728b225j955J911j125m164J3j992O288J309Q28K030M028J937n212l405O770J546
6712F582k038o775L602L08M356J039n425l494j12M091M620p93K619k958k659k744
6696B19j741K391K478k289j100l062Q734j44o445J0315P065m551O880R610K263
6681C0623l470p034p376l089k511n078k982L11K681j543o137j443L807k578j876
6666g695J690K712j392m171J803q04M057N693Q75k470p82l290O20o189n682O37
$$ plain form
6650 -14388 -10127 -11191 -9456 -6802 -8516 -3385 -6690 -7248 -8376 3524 7506 2574 -4506 -814 4589
6635 4589 5551 -749 -8843 -8055 -4244 -6220 -5807 -9131 -7298 -790 2190 453 451 3268 9438 8389
6619 8389 3480 2918 -3877 -8252 -5908 -1647 -3683 -4429 -6770 -12197 -15864 -16008 -8172 -10798 -13429 -11734
6603 -11734 -5578 -4834 -10249 -10210 -8588 -7650 -4320 -4496 -8512 -10491 -9684 -8097 -3624 -5929 -6431 -9150
6587 -9150 -7837 -4517 -7956 -6341 -1072 -1707 -4607 1029 1214 -3295 -2821 3755 6580 6186 7527 9327
6571 9327 8762 10294 1940 -3138 -5782 -3317 -1716 6692 6266 2325 4390 2531 -1096 2948 6372
6556 6372 3613 -1954 -10615 -11811 -12927 -15058 -13094 -7086 680 -219 -3314 -3418 -4504 -5147 -6155 -5121
6540 -5121 776 4617 6386 3028 5573 10090 6926 936 -1964 -7673 -1206 3967 -1666 -8761 -13629
$$ packed form
6650a4388M261j064J735K654j714N131l305n58j128J1900L982m932p080L692N403
6635D589R62o300q094P88L811j976M13l324J833O508K980j737kK817O170j049
6619H389m909n62o795m375K344M261k036p46k341n427l667j44P836k626k631J695
6603a1734O156P44n415L9J622R38L330j76m016j979Q07J587M473k305n02k719
6587i150J313L320l439J615N269o35k900N636J85m509M74O576K825l94J341J800
6571I327n65J532q354n078k644K465J601Q408m26l941K065j859l627M044L424
6556F372k759n567q661j196j116k131J964O008P766q99l095j04j086o43j008J034
6540e121N897L841J769l358K545M517l164n990k900n709O467N173n633p095m868
$$ plain form
6525 -13629 -10106 -3296 -691 1336 1011 276 281 2973 -418 1080 6370 11047 12767 6161 1646 542
6509 542 5246 10388 12193 12463 6231 -918 -3870 -9770 -8480 -1807 2882 -1099 -6294 -6826 -10538 -13189
6493 -13189 -11177 -10325 -7736 -4551 -4119 -5626 -5424 -3085 -4659 -7003 -9557 -10610 -9294 -8808 -14436 -14803
6477 -14803 -15593 -12018 -11448 -13383 -7423 4408 12002 9211 4002 3814 7591 -2396 -9897 -13326 -16645
6462 -16645 -19403 -18669 -14412 -13085 -10857 -13587 -18506 -17147 -12476 -7180 -8283 -15836 -16795 -14274 -11853
6447 -11853 -10887 -5785 -2787 -3759 -887 -848 -7317 -15349 -13346 -7954 -8733 -12413 -14173 -11814 -6398 -2528
6431 -2528 -9055 -14353 -9200 -2301 -277 -414 -4610 501 1069 -1000 -722 -319 -7335 -9927 -5915 -4957
6415 -4957 246 2395 5541 8782 9353 284 3059 -3262 -3994 -397 433 -1513 -4527 -1627 1701 1185
$$ packed form
6525a3629L523O810K605K027l25p35NK692l391J498N290M677J720o606m515j104
6509E42M704N142J805K70o232p149k952n900J290O673M689l981n195n32l712k651
6493a3189K012Q52K589L185M32j507K02K339j574k344k554j053J316M86n628l67
6477a4803p90L575N70j935N960J1831P594k791n209j88L777r987p501l429l319
6462a6645k758P34M257J327K228k730m919J359M671N296j103p553r59K521K421
6447a1853R66N102K998r72K872L9o469q032K003N392p79l680j760K359N416L870
6431b528o527n298N153O899K024j37m196N111N68k069K78M03p016k592M012R58
6415d957N203K149L146L241N71r069K775o321p32L597Q30j946l014K900L328n16
$$ plain form
6399 1185 2498 1809 -1154 -6542 -3877 -3549 -5979 -1531 -2829 2415 8735 11626 8539 6657 4444
6384 4444 3370 1874 1093 2779 775 -2049 -455 823 403 -757 -4292 -7200 -8550 -7297 36
6369 36 -1901 -423 4036 1531 -1257 -7606 -6638 3535 -484 -2738 2967 829 -10403 -9465 -6478
6354 -6478 -7310 -9587 -8467 -9415 -8581 -9162 -10782 -8269 -5648 -7185 -5143 -2697 1999 -1744 -12381 -18348
6338 -18348 -20762 -18315 -18203 -17227 -14272 -8516 -3426 -3825 518 839 -5810 -7945 -13806 -16888 -16524 -14575
6322 -14575 -4419 1210 -3264 -7917 -1447 -7874 -15781 -19382 -19040 -16521 -9780 -6021 -7230 -7677 -8172
6307 -8172 -5166 -5821 -11521 -8934 -6343 -4156 -5982 -4402 -7887 -6048 -3313 -6356 -4239 -1028 4339
6292 4339 2371 1554 1169 -3494 -4185 1101 3298 4386 7008 7658 4962 -703 -4954 -1362 2434 -1762
$$ packed form
6399A185J313o89k963n388K665L28k430M448j298N244O320K891l087j882k213
6384D444j074j496p81J686k004k824J594J278m20j160l535k908j350J253P333
6369C6j937J478M459k505k788o349R68J0173m019k254N705k138j1232R38K987
6354f478q32k277J120r48Q34n81j620K513K621j537K042K446M696l743j0637n967
6338a8348k414K447J12R76K955N756N090l99M343L21o649k135n861l082L64J949
6322a4575J0156N629m474m653O470o427p907l601L42K519O741L759j209m47m95
6307h172L006o55n700K587K591K187j826J580l485J839K735l043K117L211N367
6292D339j968q17l85m663o91N286K197J088K622O50k696n665m251L592L796m196
$$ plain form
6276 -1762 -5330 -7652 -8292 -10644 -10195 -11259 -9045 -7768 -2624 -2758 -663 2522 1097 -1422 1495 -5494
6260 -5494 -14224 -14454 -14237 -12067 -8288 -5238 -3696 -6900 -13144 -22782 -25062 -18766 -17136 -17830 -17981 -15543
6244 -15543 -7922 -5797 -4599 -10363 -11296 -11090 -14822 -14247 -10154 -11424 -14626 -15087 -8711 -4220 250 5251
6228 5251 7199 5537 1681 6655 4809 -105 -1883 908 -387 1602 441 -265 7 1232 -2804
6213 -2804 -7038 -4758 439 -2375 -6596 4353 8632 1475 -1729 -3015 -3024 -2294 456 -1806 -831 3680
6197 3680 -1739 580 6218 5559 7015 7826 5388 2832 -248 -3323 -4493 -5693 1036 4717 7425
6182 7425 9781 9005 7986 2893 2572 1224 -787 -640 -3832 -5292 -5444 6074 6074 -4228 -11681 -12327
6166 -12327 -7118 978 8829 7674 1914 265 2617 1565 -2336 -2508 2373 4387 10152 9169 11340
$$ packed form
6276a762l568k322o40k352M49j064K214J277N144j34K095L185j425k519K917o989
6260e494q730k30K17K170L779L050J542l204o244r638k280O296J630o94j51K438
6244a5543P621K125J198n764r33K06l732N75M093j270l202m61O376M491M470N001
6228E251J948j662l856M974j846m914j778K791j295J989j161p06K72J225m036
6213b804m234K280N197k814m221J0949M279p157l204j286rP30K750k262R75M511
6197C680n419K319N638o59J456Q11k438k556l080l075j170j200O729L681K708
6182G425K356p76j019n093l21j348k011J47l192j460j52J1518%j0302p453o46
6166a2327N209Q096P851j155n760j649K352j052l901j72M881K014N765r83K171
$$ plain form
6151 11340 6018 -3651 -2110 -840 -619 4310 2291 2234 1492 4334 1920 4636 4287 -1151 -7593 -5054
6135 -5054 -3255 -2207 462 -4038 -10159 -4309 616 741 -2633 -1727 -324 -4524 -8610 -3906 1952
6120 1952 -201 2379 1403 1068 515 -4300 -5834 1465 6699 8315 5727 -2940 -8523 -9178 -4791 -1223
6104 -1223 -829 -7762 -10830 -6342 -66 6193 9336 2517 -1133 -388 1574 -196 -282 588 464 -1110
6088 -1110 -2984 -6760 -5692 863 2010 -1144 -5291 -9250 -10885 -10711 -9293 -10505 -7718 -2048 1230
6073 1230 2214 4194 -183 -5047 -2136 236 1741 2581 -19 -5534 -9580 -9923 -5766 -1340 -1365 -8563
6057 -8563 -12091 -10113 -4043 -50 1412 4916 325 -1566 -1601 -1929 -1691 -5507 -8185 -6529 -2111 -9608
6041 -9608 -13112 -11452 -8381 -7647 -6069 -7169 -6276 599 5418 1610 364 -2454 -4265 -266 -3366
$$ packed form
6151A1340n322r669J541J270K21M929k019n7p42K842k414K716l49n438o442K539
6135e054J799J048K669m500o121N850M925J25l374R06J403m200m086M704N858
6120A952k153K580r76l35n53m815j534P299N234J616k588q667n583o55M387L568
6104a223L94o933l068M488O276O259L143o819l650P45J962j770q6Q70j24j574
6088a110j874l776J068O555J147l154m147l959j635J74J418j212K787N670L278
6073A230R84J980m377m864K911K372J505Q40k600n515m046l43M157M426k5p198
6057h563l528J978O070L993J462L504m591j891l5l28K38l816k678J656M418p497
6041i608l504J660L071P34J578j100Q93O875M819l808j246k818j811L999l100
$$ plain form
6026 -3366 787 8188 9182 6075 4831 4076 1711 1032 3148 4820 4349 1761 -4034 -4018 -1990 1830
6010 1830 5299 3186 3858 5983 -1221 -4987 -333 -2036 -4217 -2637 -1076 -456 -172 611 -2798 -9502
5994 -9502 -13293 -7147 -3580 -4338 -7499 -10332 -3002 4892 6657 5037 6585 2213 3175 -669 270 -714
5978 -714 -6047 -1474 633 807 156 1750 -3743 -2686 -4952 -8381 -7391 -9846 -10016 -6303 -9291 -6545
5962 -6545 -5632 -10509 -5996 2707 1867 518 666 2011 1669 2651 4876 215 -1064 1432 1325 -2505
5946 -2505 -2277 -1643 -328 -2735 -4761 1046 2218 2569 -1227 910 1513 -2892 -4281 -3343 -1222 -2477
5930 -2477 -5332 -4475 -3507 -6027 -5350 -10097 -14033 -14113 -7551 2947 4931 2320 2552 3056 -2836 -3627 -6842
5913 -6842 -8694 -973 3800 1473 8094 6122 1635 2073 -2898 -6201 -8291 -7483 -2973 -1748 1455
$$ packed form
6026c366M153P401R94l107j244p55k365o79K116J672m71k588n795J6K028L820
6010A830L469k113O72K125p204l766M654j703k181J580J561O20K84P83l409o704
5994i502l791O146L567p58l161k833P330P894J765j620J548m372R62l844R39r84
5978g14n333M573K107J74o51J594n493J057k266l429R90k455j70L713k988K746
5962f545R13m877M513Q703q40j349J48J345l42R82K225m661j279K496j07l830
5946b505K28O34J315k407k026N807J172L51l796K137O03m405j389R38K121j255
5930b477k855Q57R68k520O77m747l936q0O562J0498J984k611K32N04n892p91l215
5913f842j852P721M773k327O621j972m487M38m971l303k090Q08M510J225L203
$$ plain form
5898 1455 -256 -10646 -10876 -4719 941 -539 -2830 -1637 1577 556 -811 -1893 -4287 -2359 7149
5883 7149 14657 10566 2926 -3454 -397 -1470 -6697 -8383 -5641 -6345 -6090 -8417 -7905 -4363 -826 -2422
5867 -2422 -3197 -3444 -4877 -6881 -7800 -12211 -10584 -9031 -6040 -3203 -4699 -6931 -10788 -10131 -7540 -2016
5851 -2016 828 -3504 -4988 -7741 -9976 -4419 -2611 -3060 -8649 -12408 -12031 -10299 -5670 -5822 -7408 -6045
5835 -6045 -5622 -6085 -9254 -8887 -14256 -14579 -10506 -2500 382 2912 82 -5510 -7544 -5142 -7504 -11682
5819 -11682 -12406 -8619 -5252 -7598 -9381 -8688 -5010 -842 1142 2435 2979 -164 -7663 -11363 -11833 -10922
5803 -10922 -6812 -2715 889 869 -1786 -5677 -3228 -2998 -6475 -8821 -12149 -13465 -15107 -14512 -10375 -11241
5787 -11241 -8520 -9588 -7888 -2754 4679 8680 8551 6929 40 -1798 -2677 -5417 -8721 -8981 -5392
$$ packed form
5898A455j711j0390k30O157N660j480k291J193L214j021j367j082k394J928R508
5883G149P508m091p640o380L057j073n227j686K742p04K55k327N12L542L537j596
5867b422p75k47j433k004r19m411J627J553K991K837j496k232l857O57K591N524
5851b016K844m332j484k753k235N557J808m49n589l759L77J732M629j52j586J363
5835f045M23m63l169L67n369l23M073Q006K882K530k830n592k034K402k362m178
5819a1682p24L787L367k346j783O93L678M168J984J293N44l143p499l700m70R11
5803a0922M110M097L604k0k655l891K449K30l477k346l328j316j642N95M137q66
5787a1241K721j068J700N134P433M001j29j622o889j838q79k740l304k60L589
$$ plain form
5772 -5392 -8230 -9050 -9209 -6223 -5489 -6501 -2192 -4741 -8739 -6064 -9628 -4108 5416 11028 12719 15909
5756 15909 10522 1285 -3547 -3985 -3747 -7328 -6746 -10098 -9564 -7864 -4610 -3731 -5280 -3364 -6028 -7419
5740 -7419 -8700 -1953 4742 6874 7469 2746 -5176 -11411 -10965 -7772 -3890 -2003 -1905 -5424 -3706 -3976
5724 -3976 -5755 -7297 -5656 -2132 3657 8778 9387 8544 6999 8573 7807 2811 2511 3018 -4317 -7771
5708 -7771 -525 887 -3268 -6311 -5671 331 5387 2635 -5886 -10333 -10889 -10058 -9833 -8608 -7174 -3544
5692 -3544 3573 -1210 -5900 -9016 -6107 -3293 -4479 -2489 -5578 -202 -4449 -8902 -5976 -3811 -9496
5677 -9496 -8218 -7732 -7570 -4168 -1904 -7702 -9253 -2072 -3340 -5281 -4602 -5582 751 -3097 -13964 -11699
5661 -11699 -5827 -3163 -2667 -2880 -1005 -6112 -4816 -8994 -7231 -1958 -436 -7083 -8782 -8887 -5211
$$ packed form
5772e392k838q20j59K986P34j012M309k549l998K675l564N520R524N612J691L190
5756A5909n387r237m832m38K38l581N82l352N34J700L254Q79j549J916k664j391
5740g419j281O747O695K132N95m723p922o235M46L193L882J887R8l519J718k70
5724c976j779j542J641L524N789N121O09q43j545J574p66m996l00N07p335l454
5708g771P246J412m155l043O40O002N056k752q521m447n56Q31K25J225J434L630
5692c544P117m783m690l116K909K814j186J990l089N376m247m453K926K165n685
5677i496J278M86J62L402K264n798j551P181j268j941O79r80O333l848j0867K265
5661a1699N872K664M96k13J875n107J296m178J763N273J522o647j699j05L676
$$ plain form
5646 -5211 -1131 1888 9411 7251 -1140 5313 3871 -161 -5245 -2928 -2684 -3792 -5917 -3668 -5359
5631 -5359 -10034 -12571 -9616 -9413 -6795 -1496 -2061 -2652 -6322 -5697 -4267 -4058 508 2297 -2517 -1713
5615 -1713 857 1596 5786 3258 -3196 -1990 5151 3793 -2549 943 1892 -3970 -4198 -6065 -6174 -6854
5599 -6854 -1365 4018 1645 864 -4358 -1025 982 -3973 -9277 -14362 -17360 -17451 -10310 -6602 -9599 -12887
5583 -12887 -12681 -10469 -8058 -5238 -5699 -3804 -6436 -7710 -3702 1842 1058 -3098 -4790 -3629 -6230
5568 -6230 -2908 -6597 -6275 -4060 -2531 -4098 -1063 5531 -554 -6879 -10120 -6223 -3358 -3872 -2984 6722
5552 6722 11279 8550 4297 -127 -3013 -3820 -2857 -3627 -5909 -3134 -6221 -6294 -3602 -4970 -2308 131
5536 131 -921 -5998 -12471 -6656 -4809 -658 -2637 -5986 -5867 -1841 -31 5416 7108 4652 2258
$$ packed form
5646e211M080L019P523k160q391O453j442m032n084K317K44j108k125K249j691
5631e359m675k537K955K03K618N299n65n91l670O25J430K09M566J789m814Q04
5615a713K570P39M190k528o454J206P141j358o342L492R49n862k28j867j09o80
5599f854N489N383k373p81n222L333K007m955n304n085k998r1P141L708k997l288
5583a2887K06K212K411K820m61J895k632j274M008N544p84m156j692J161k601
5568f230L322l689L22K215J529j567L035O594o085o325l241L897K865n14Q88R706
5552F722M557k729m253m424k886q07R63p70k282K775l087p3K692j368K662K439
5536A31j052n077o473N815J847M151j979l349J19M026J810N447J692k456k394
$$ plain form
5521 2258 548 165 919 -392 -1101 -1741 -88 -291 -5573 -7637 -2045 -510 -2104 -1218 -1347 -3606 -2236
5504 -2236 -7339 -11827 -15490 -10017 -11508 -16011 -12716 -4788 -2330 -3954 -6948 -10146 -14467 -12234 -6294
5489 -6294 -4225 -5046 -4937 -4220 -1528 -5986 -7221 -4238 -609 -1288 -2199 -1086 -1582 -1185 -5469 -5051 -5864
5472 -5864 -4042 -6271 -4322 -5659 -7061 -7985 -9615 -14082 -15530 -12481 -10288 -12138 -8015 -2591 -1826
5457 -1826 -5018 -6677 -7606 -14014 -14326 -14004 -13385 -8237 -2486 2863 1759 6867 10300 9350 2032 -971
5441 -971 755 3031 1306 -2192 319 8820 10454 7056 -5345 -9883 -4695 -1338 -3351 -9191 -10212
5426 -10212 -5193 -2412 9237 10412 10092 7351 8700 8672 3888 2100 -1432 -3853 -2369 -397 -1925
5411 -1925 -3146 -5080 -10264 -9822 -8506 -5212 -1281 -3975 -7147 -4527 -3415 -5232 -4326 -87 1080
$$ packed form
5521B258j710l83P54j311p09o40J653k03n282k064N592J535j594Q86j29k259J370
5504b236n103m488l663N473j491m503L295P928K458j624k994l198m321K233N940
5489f294K069q21J09P17K692m458j235K983L629o79r11J113m96L97m284M18q13
5472e864J822k229J949j337j402r24j630m467j448L049K193j850M123N424P65
5457a826l192j659r29o408l12L22O19N148N751N349j104N108L433r50p318l003
5441i71J726K276j725l498K511Q501J634l398j2401m538N188L357k013n840j021
5426a0212N019K781J1649J175l20k741J349k8m784j788l532k421J484J972j528
5411a925j221j934n184M42J316L294L931k694l172K620J112j817R06M239J167
$$ plain form
5396 1080 5 -190 2543 1302 -5584 -4008 -2512 -3095 -1418 -6610 -8767 -5709 -1275 4534 6218
5381 6218 5536 5328 5968 4692 4268 -828 -1741 -4749 -7096 -4348 -650 572 -4602 -4346 -4750 -3343 -1315
5364 -1315 -423 41 -114 -5510 -12175 -11226 -9786 -11296 -9475 -3146 -5927 -7729 -3875 -1232 -2137 -1988
5348 -1988 160 -73 -5959 -8040 -7838 -9909 -17662 -23600 -20124 -12817 -8479 -6829 -4536 -359 -435 -685
5332 -685 -6935 -8338 -5634 -4322 -5707 -2523 -2462 -3863 645 3999 2326 -5530 -2868 1032 616 1613
5316 1613 2706 -3194 -3497 -545 -2309 -779 -928 -11342 -9241 -3317 2027 1029 2255 1135 -1631
5301 -1631 -3787 -485 5461 4272 2793 1633 -2778 -1563 2433 4336 1475 2316 -1413 -3302 -4405
5286 -4405 -5296 1372 4631 -3159 -2186 -5232 -9321 -10670 -10811 -11928 -14606 -13674 -13215 -10077 -9525 -8387
$$ packed form
5396A080j075j95K733j241o886J576J496n83J677n192k157L058M434N809J684
5381F218o82k08O40j276m24n096r13l008k347K748L698J222n174K56m04J407K028
5364a315Q92M64j55n396o665R49J440j510J821O329k781j802L854K643r05J49
5348a988K148k33n886k081K02k071p753n938L476P307M338J650K293M177p6k50
5332f85o250j403K704J312j385L184O1j401M508L354j673p856K662L900m16R97
5316A613J093n900l03K952j764J530j49j0414K101N924N344r98J226j120k766
5301a631k156L302N946j189j479j160m411J215L996J903k861Q41l729j889j103
5286d405q91O668L259p790R73l046m089j349j41j117k678R32M59L138N52J138
$$ plain form
5270 -8387 -4759 -5687 -7351 -9103 -8640 -5247 -2724 -7633 -5685 2349 6819 4291 2903 5412 8639
5255 8639 8787 5936 5333 8462 8020 8358 5076 1676 -2856 -4278 -4966 -1147 -1751 -7554 1301 4630
5239 4630 731 5990 9093 6469 8321 -1245 -9232 -7137 -2087 2281 4849 183 -2486 -5309 -6254
5224 -6254 -2883 -4240 -6301 -2692 -2275 -6165 -3492 -2109 -5567 -8566 -13128 -15120 -16613 -15781 -19006
5209 -19006 -19498 -15423 -14645 -13681 -9899 -4934 -2571 -3060 -9149 -2909 5766 8947 7982 4299 1839 519
5193 519 125 -121 -4089 -8007 -907 2547 -376 -430 -3569 -1336 3948 1691 5533 14207 18051 11583
5177 11583 1037 -2861 -3085 2053 -3293 -2802 4801 10612 11272 7780 4337 4940 6405 9247 8000
5162 8000 -1872 -6568 -5040 -4876 -3669 -2320 659 6202 898 -3430 -2684 4023 7912 4463 739
$$ packed form
5270h387L628r28j664j752M63L393K523m909J948Q034M470k528j388K509L227
5255H639J48k851o03L129m42L38l282l400m532j422o88L819o04n803Q855L329
5239D630l899N259L103k624J852r566p987K095N050M368K568m666k669k823r45
5224f254L371j357k061L609M17l890K673J383l458k999m562j992j493Q32l225
5209a9006m92M075P78R64L782M965K363m89o089O240Q675L181r65l683k460j320
5193E19l94k46l968l918P100L454k923n4l139K233N284k257L842Q674L844o468
5177A1583j0546l898k24N138n346M91P603N811O60l492l443O03J465K842j247
5162H000r872m696J528J64J207J349K979N543n304m328P46O707L889l449l724
$$ plain form
5147 739 -6857 -12470 -9439 -3128 1184 -2262 354 7112 8320 7216 4781 4195 4807 2994 -1833 -958
5131 -958 2096 -1451 -817 2403 -1285 233 2654 1138 2679 5388 3890 -4386 -8893 -13301 -11591
5116 -11591 -3860 -999 3177 6698 3755 3648 6305 5268 797 -2310 -1274 -613 -1415 -431 1972 -140
5100 -140 -2274 -421 -2933 -6346 -9084 -6463 -6838 -5001 80 92 -8042 -12249 -10505 -13065 -18343 -11670
5084 -11670 -9195 -6045 2965 7847 7914 1179 -2225 -1339 -2989 -3598 -9337 -12603 -8823 -5348 -9461 -13667
5068 -13667 -12977 -10641 -10681 -12497 -17014 -16153 -8754 -8591 -8234 -2447 -3129 -5800 -10594 -12960 -10889 -6516
5052 -6516 -7282 -9133 -12617 -9397 -8464 -6605 -2285 -3395 -2938 -4855 633 5096 7664 2341 4710 9474
5036 9474 6280 6938 -539 -4618 3475 2328 6144 10234 4711 215 -4636 -6821 -8935 -11939 -8715
$$ packed form
5147G39p596n613L031O311M312l446K616O758J208j104k435n86O12j813m827Q75
5131i58L054l547O34L220l688J518K421j516J541K709j498q276m507m408J710
5116a1591P731K861M176L521k943j07K657j037m471l107J036O61q02R84K403k112
5100a40k134J853k512l413k738K621l75J837N081J2q134m207J744k560n278O673
5084a1670K475L150R010M882O7o735l404Q86j650o09n739l266L780L475m113m206
5068a3667O90K336m0j816m517Q61P399J63L57N787o82k671m794k366K071M373
5052f516p66j851l484L220R33J859M320j110M57j917N488M463K568n323K369M764
5036I474l194O58p477m079Q093j147L816M090n523m496m851k185k114l004L224
$$ plain form
5021 -8715 -5738 -8948 -10893 -11035 -5969 -2557 1092 1486 -6621 -9489 -9351 -8681 -3314 -598 994 -197
5005 -197 -169 -6778 -5507 659 3062 8095 10831 5604 -1281 -456 308 -1469 -5919 -7158 -2428 659
4989 659 828 930 -481 -919 -3265 -3545 -1393 -2872 3200 4515 -1757 -3916 -6583 -5636 -3897 959
4973 959 4366 7122 8430 8358 4209 -2894 2047 1406 -5880 -6582 -6145 -8428 -11977 -10145 -6007 -6975 -6894
4956 -6894 -1860 2708 -1386 -10291 -14570 -11044 -7557 -3570 1500 5694 3829 4394 4015 5295 4097
4941 4097 2634 1474 2443 5780 3005 -99 4031 4422 4443 1637 -3837 -638 -3618 -3534 -2518 -101
4925 -101 -2234 3932 9510 3547 -788 2546 922 2410 2850 2193 -4985 -7953 -5551 1081 -2735 -7702
4909 -7702 -6074 -3812 -3281 -2515 -2723 -6167 -4605 -2473 1711 -1257 4996 2191 -4030 -4832 -392 -1007
$$ packed form
5021h715K977l210j945j42N066L412L649L94q107k868J38O70N367K716J592j191
5005a97K8o609J271O166K403N033K736n227o885Q25P64j777m450j239M730L087
4989F59J69J02j411m38k346k80K152j479O072J315o272k159k667R47J739M856
4973I59L407K756J308p2m149p103M941o41p286p02M37k283l549J832M138r68Q1
4956f894N034M568m094q905m279L526L487L987N070M194j865N65l79J280j198
4941D097j463j160R69L337k775l104M130L91K1k806n474L199k980Q4J016K417
4925a01k133O166N578n963m335L334j624J488M40o57p178k968K402O632l816m967
4909g702J628K262N31P66k08l444J562K132M184k968O253k805o221q02M440o15
$$ plain form
4893 -1007 -1761 -1793 -123 3235 3464 5215 6342 424 -5857 -9166 -8364 -4783 -6004 -4312 -9000 -9605
4877 -9605 -9558 -7919 -1628 5346 11840 9978 4034 -3333 -6842 -3128 4045 3579 5673 668 -7761 -6441
4861 -6441 -2132 -1450 -702 -4796 -7640 -2015 -5012 -4555 -3796 -5842 -9305 -8607 -6819 -10511 -10070 -10121 -7471
4844 -7471 -5333 -9369 -10162 -9021 -2463 -2243 -5372 -7931 -6469 -3344 -6967 -6069 -5706 -6288 -6338 -4385 -7194
4827 -7194 -9680 -7825 -279 6023 7528 9861 7135 7767 13287 8753 5750 1067 2047 3710 4727
4812 4727 -1644 -3131 -3584 -6266 -3756 -3311 -5505 949 3348 2561 4008 496 913 7552 5397 11597
4796 11597 10893 6109 5985 3259 5018 4221 -5302 -8040 -7790 -5439 -2185 -3402 2020 3745 3782 4940
4780 4940 7003 6060 -4457 -2736 -272 -3583 -1082 4281 7047 7011 8109 11601 11402 6991 6300 573
$$ packed form
4893a007p54l2J670L358K29J751J127n918o281l309Q02L581j221J692m688o05
4877i605M7J639O291O974O494j862n944p367l509L714P173m66K094n005q429J320
4861f441M309O82P48m094k844N625k997M57P59k046l463O98J788l692M41n1K650
4844g471K138m036p93J141O558K20l129k559J462L125l623Q98L63n82n0J953k809
4827g194k486J855P546O302J505K333k726O32N520m534l003m683R80J663J017
4812D727o371j487m53k682K510M45k194O454K399p87J447l512M17O639k155O200
4796A1597p04m784j24k726J759p97r523k738K50K351L254j217N422J725L7J158
4780D940K063r43j0517J721K464l311K501N363K766l6J098L492j99m411o91n727
$$ plain form
4764 573 -3135 -6012 -756 -1163 -3384 -4459 -9896 -7657 -8075 -6707 -9391 -11030 -8666 -2255 2544 1695
4748 1695 -169 -4419 -1507 -7765 -11455 -12900 -7924 742 3837 2807 -69 2581 3707 2312 6540
4733 6540 -718 -8973 -5462 -8502 -6877 -3810 3721 10741 9957 13677 8861 4438 -913 -7634 -13992
4718 -13992 -14483 -14644 -8795 -9641 -10739 -5837 2146 -41 1344 6751 4425 -5414 -11815 -10537 -7372
4703 -7372 -2989 2456 915 -4223 -12600 -14229 -7728 -4772 -5473 -5575 -1040 1930 2316 1655 -1778 -3099
4687 -3099 1039 -3039 -2788 5059 3893 -3687 -5429 -4086 -7989 -6380 -3357 -4527 -7363 -7189 -5290
4672 -5290 -5059 -4381 -4244 -5947 1720 1424 -5476 -7391 -8858 -5128 44 2006 3352 -342 -7465 -9408
4656 -9408 -10756 -13516 -9697 -6613 -6447 -3830 -4401 -5001 -2393 -7284 -8989 -3641 1888 2351 6793 5097
$$ packed form
4764E73l708k877N256m07k221j075n437K239m18J368k684j639K364O411M799q49
4748A695j864m250K912o258l690j445M976Q666L095j030k876K650J126j395M228
4733F540p258q255L511l040J625L067P531P020p84L720m816m423n351o721o358
4718a3992m91j61N849q46j098M902P983k187J385N407k326r839o401J278L165
4703g372M383N445j541n138q377j629O501K956p01j02M535K970L86o61l433j321
4687c099M138m078K51P847j166p580j742J343l903J609L023j170k836J74J899
4672e290K31O78J37j703P667k96o900j915j467L730N172J962J346l694p123j943
4656i408j348k760L819L084J66K617n71o00K608m891j705N348N529M63M442j696
$$ plain form
4640 5097 4297 -2313 -7179 -3188 1712 2371 4783 291 -2144 -1826 -1668 -6566 -10593 -9359 -8847 -9531
4624 -9531 -9011 -7067 1163 -562 355 -2241 286 2630 4773 10440 14910 10237 9643 6689 2739 2132
4608 2132 1160 5817 9932 9623 11758 16252 20074 13040 2691 -2481 -3894 -261 591 1574 1654 -649
4592 -649 -1216 -3442 -205 -1580 -4979 -2713 3052 3286 -3037 -10516 -12320 -7793 -2194 -867 3367 1347
4576 1347 -2287 -4604 -8998 -11685 -10602 -3664 844 -1237 -2813 -3168 -9945 -15998 -6625 -1135 1169
4561 1169 4993 6819 5758 4236 6679 10030 5000 5106 3305 2424 -1456 3045 9904 5977 5834 6817
4545 6817 -3199 -4010 1492 7857 4729 2682 8158 12738 9756 7514 5013 2190 -392 3118 499
4530 499 4375 3572 -5472 -10268 -6947 -9501 -8731 -8940 -10186 -7278 -11031 -9599 -15672 -10687 -1436 -5200
$$ packed form
4640E097q00o610m866L991M900O59K412m492k435L18J58m898m027J234N12o84
4624i531N20J944Q230j725R17k596K527K344K143N667M470m673n94k954l950o07
4608B132r72M657M115l09K135M494L822p034j0349n172j413L633Q52R83Q0k303
4592f49n67k226L237j375l399K266N765K34o323p479j804M527N599J327M234k020
4576A347l634k317m394k687J083O938M508k081j576l55o777o053R373N490K304
4561A169L824J826j061j522K443L351n030J06j801q81l880M501O859l927j43R83
4545F817j0016q11N502O365l128k047N476M580k982k242k501k823k582L510k619
4530D99L876q03r044m796L321k554P70k09j246K908l753J432o073M985R251l764
$$ plain form
4514 -5200 -5585 -2739 -6032 -6813 -1138 -5335 -3199 3244 4487 5453 12617 10548 991 462 5503 -211
4498 -211 -638 -748 -4344 1130 4680 -951 -1491 1098 -255 -8242 -10254 -9395 -4395 1358 1856 4212
4482 4212 1113 4013 1183 5673 8380 12323 9682 7479 5894 1048 -1494 -1792 -1077 -4050 -1317
4467 -1317 4749 5841 6012 6598 2268 3773 2055 -1579 -8658 -5984 -5630 -5419 -6300 -4212 -3402 -2555 894
4450 894 -1228 -2842 -7526 -7570 -6572 -2599 2616 3797 -4336 -2855 4030 3365 -215 -4696 -6306 -7902
4434 -7902 -8019 -9262 -8134 -6330 -9859 -12187 -14466 -10087 941 -4452 -8172 -6256 -7100 -12312 -8933
4419 -8933 -5747 -2739 113 3904 -128 -3345 -224 -6060 -7164 -7914 -9267 -6934 376 -2018 -52
4404 -52 -891 -1135 -1987 -6520 -10437 -11625 -3915 2572 2415 2067 -3099 -7890 -3224 -981 -5554 -5481 303
$$ packed form
4514e200l85K846l293p81N675m197K136O443J243R66P164k069r557n29N041n714
4498b11m27j10l596N474L550n631n40K589j353p987k012Q59N000N753M98K356
4482D212l099K900k830M490K707L943k641k203j585m846k542k98P15k973K733
4467a317O066J092J71N86m330J505j718l634p079K674L54K11q81K088Q10Q47L449
4450H94k122j614m684m4R98L973N215J181q133J481O885o65l580m481j610j596
4434g902j17j243J128J804l529k328k279M379J1028n393l720J916q44n212L379
4419h933L186L008K852L791m032l217L121n836j104p50j353K333P310k394J966
4404e2q39k44q52m533l917j188P710O487j57l48n166m791M666K243m573P3N784
$$ plain form
4387 303 -1146 -1778 4953 6754 5121 8375 5495 969 -5452 -6445 -2492 -4339 -1768 -6167 -11993 -3816
4371 -3816 1313 1802 -4178 -8000 -4474 65 -655 -1081 -3332 -3736 -7049 -6127 -1622 -801 2928 806
4355 806 -1779 -3049 3382 6758 7106 13178 7734 3712 7435 5939 1427 5827 10247 6203 2235
4340 2235 -4685 -4808 -2372 -5328 -7705 -5360 -4354 -2793 -2356 -2347 -7529 -7671 -3619 -2970 1219 -2041 -2061
4323 -2061 1839 3810 -577 -2188 -7841 -7239 -6863 -3780 -5571 -3519 -3013 -1169 -4732 -5159 -3203 1054
4307 1054 203 -827 -620 -2634 -3269 -1719 -2753 -7780 -8454 -6648 -7393 -3718 1194 2727 -2259 -4641
4291 -4641 -2021 710 -494 -5778 -8855 -7528 -10058 -14968 -12051 -10700 -6464 -1471 -1612 1788 1289
4276 1289 694 1562 171 -1825 -1126 7532 4399 -5409 131 6097 4675 5110 1278 -1155 -1996 908
$$ packed form
4387C03j449o32O731J801j633L254k880m526o421r93L953j847K571m399n826Q177
4371c816N129M89n980l822L526M539p20m26k251m04l313R22M505Q21L729k122
4355H06k585j270O431L376L48O072n444m022L723j496m512M400M420m044l968
4340B235o920j23K436k956k377K345J006J561M37Rn182j42M052O49M189l260k0
4323b061L900J971m387j611n653O02L76L083j791K052N06J844l563m27J956M257
4307A054q51j030K07k014o35J550j034n027o74J806p45L675M912J533m986k382
4291d641K620K731j204n284l077J327k530m910K917J351M236M993j41L400m99
4276A289n95Q68j391j996O99Q658l133r808N540N966j422M35l832k433q41K904
$$ plain form
4260 908 1730 -1822 -1888 -3433 -6784 -10571 -6389 -4535 -4401 -7689 -6669 -4135 5225 5821 5873 7341 5949
4243 5949 3590 -2091 -4681 -6946 -6583 -4277 -1360 219 1689 5614 3120 1521 4577 6469 9271
4228 9271 14260 13991 8348 1776 -1612 -2119 1927 2724 3039 -163 -8723 -14096 -9320 -2332 -1518 255
4212 255 -4481 -3651 -3975 -175 2755 1933 80 4584 6106 4250 11 -4658 -7630 -4627 -1711 -872
4196 -872 -6300 -9749 -7986 -4701 -4766 -3467 -3985 -5009 -10452 -4282 -7629 -8496 -5960 -5111 -7650 -5692
4180 -5692 -2221 18 397 335 3758 3347 3009 8413 6649 3238 -502 -3518 -125 -3583 -7691 -4189
4164 -4189 -1464 -3215 751 2182 6034 6535 9768 3934 3406 2908 -4342 -4021 1108 617 -8389 -3725
4148 -3725 -2118 -1389 -2384 -9240 -9567 -8798 -10388 -10462 -8208 -7312 -8778 -9224 -5339 -3364 -5430 -8420 -770
$$ packed form
4260I08Q22l552o6j545l351l787M182J854J34l288J020K534R360N96N2J468j392
4243E949k359n681k590k265L63K306K917J579J470L925k494j599L056J892K802
4228I271M989k69n643o572l388n07M046P97L15l202q560n373M776O988Q14J773
4212B55m736Q30l24L800K930q22j853M504J522j856m239m669k972L003K916Q39
4196h72n428l449J763L285o5J299n18j024n443O170l347q67K536Q49k539J958
4180e692L471K239L79o2L423m11l38N404j764l411l740l016L393l458m108L502
4164d189K725j751L966J431L852N01L233n834n28m98p250L21N129m91r006M664
4148c725J607P29r95o856l27P69j590p4K254Q96j466m46L885J975k066k990P650
$$ plain form
4131 -770 318 -4829 -6750 -11098 -12232 -8695 -11981 -8950 -2148 -1034 -6130 -11322 -9334 -200 7360
4116 7360 6305 10995 7332 -5761 -9832 -6570 4101 7149 -2731 -6163 -10081 -8719 -1156 1186
4102 1186 1019 5502 8995 6920 3866 10994 12544 7751 5882 4598 8305 7226 9789 14855 14044
4087 14044 9276 4950 4562 1986 4204 9275 910 -8896 -6514 -697 -2103 -5627 -10794 -14096 -11494
4072 -11494 -7936 637 13815 7241 3212 -1057 -5729 -3691 -8866 -10980 -6235 890 703 -934 -2602
4057 -2602 -3033 -6175 -6657 -2613 -5576 -2802 533 6864 -963 -2970 3005 8502 7979 5789 6814 5310
4041 5310 1822 -2684 -4554 -4551 -3705 1542 5010 4613 -95 1515 3087 2960 2961 4000 -1206 1109 4103
4024 4103 3520 1408 8277 11868 9374 6550 4241 2474 -2905 -8553 -9175 -10961 -3851 2227 -1633
$$ packed form
4131g70J088n147j921m348j134L537l286L031O802J114n096n192J988R134P560
4116G360j055M690l663j3093m071L262J0671L048r880l432l918J362P563K342
4102A186j67M483L493k075l054P128J550m793j869j284L707j079K563N066q11
4087A4044m768m326l88k576K218N071q365r806K382N817j406l524n167l302K602
4072a1494L558Q573J3178o574m029m269m672K038n175k114M745P125j87j637j668
4057b602m31l142m82M044k963K774L335O331p827k007N975N497n23k190J025j504
4041E310l488m506j870LQ46N247L468l97m708J610J572j27JJ039n206K315K994
4024D103n83k112O869L591k494k824k309j767n379n648o22j786P110O078l860
$$ plain form
4009 -1633 -8215 -3485 -1434 -1342 -968 1742 1361 1292 5291 7366 7939 2911 512 -1091 -4694 -9453 -13923
3992 -13923 -18123 -11667 -5759 40 2072 -5066 -12983 -13267 -10148 -6645 -2891 -8558 -14949 -13051 -4212
3977 -4212 -1913 2357 3290 -1151 -1315 -65 4535 1224 579 2276 5376 466 -10452 -10928 2059
3962 2059 9811 9967 5369 6482 6930 4178 2007 4863 845 -28 -5057 -16055 -15259 -10840 -4442 -3023
$$ packed form
4009a633o582M730K051R2L74K710l81o9L999K075N73n028k399j603l603m759m470
3992a3923m200O456N908N799K032p138p917k84L119L503L754n667o391J898Q839
3977d212K299M270R33m441j64J250M600l311o45J697L100m910j0918m76J2987
3962B059P752J56m598J113M48k752k171K856m018q73n029j0998P96M419O398J419
$$ [...]
##END NTUPLES=NMR SPECTRUM
##END=
