##TITLE=Analysis number 312026
Compound Code cc 44001
Book Reference 413/178
Project Code adrs
Chemist Name stevem
+insols
##JCAMPDX= 6.0         $$ Bruker NMR JCAMP-DX V2.0
##DATA TYPE= NMR SPECTRUM
##DATA CLASS= NTUPLES
##ORIGIN= Bruker BioSpin GmbH
##OWNER= NMR
$$ XWIN-NMR		Version 3.5
$$ Thu Jul 21 14:47:11 2005 GMT Daylight Time (UT+1h)  MAYBRIDGE\NMR@NMR_250MHZ
##.OBSERVE FREQUENCY= 250.131544655141
##.OBSERVE NUCLEUS= ^1H
##.ACQUISITION MODE= SIMULTANEOUS (DQD)
##.ACQUISITION SCHEME= undefined
##.AVERAGES= 16
##.DIGITISER RES= 18
##SPECTROMETER/DATA SYSTEM= dpx250
##.PULSE SEQUENCE= zg30
##.SOLVENT NAME= DMSO
##.SHIFT REFERENCE= (INTERNAL, DMSO, 0, 16.522)
##AUDIT TRAIL= $$ (NUMBER, WHEN, WHO, WHERE, WHAT)
$$ ##TITLE= Audit trail, XWIN-NMR		Version 3.5
$$ ##JCAMPDX= 5.01
$$ ##ORIGIN= Bruker BioSpin GmbH
$$ ##OWNER= NMR
$$ C:\u/data/dgb/nmr/ADRS/6300/pdata/1/auditp.txt
$$ ##AUDIT TRAIL=  $$ (NUMBER, WHEN, WHO, WHERE, WHAT)
(   1,<2005-07-21 14:46:30.46 +100>,<MAYBRIDGE\NMR>,<NMR_250MHZ>,
      <created by zg, POWCHK disabled, PULCHK disabled
       configuration hash MD5:
       62 19 C7 07 E1 42 D1 B7 37 6C 3D D0 77 39 F9 E6
       data hash MD5: 64K
       5B B6 F9 DB EE 74 EE 00 F0 4B B8 52 CD 81 06 5C>)
(   2,<2005-07-21 14:46:47.18 +100>,<MAYBRIDGE\NMR>,<NMR_250MHZ>,
      <Start of raw data processing
       ef LB = 0.3 FT_mod = 6 PKNL = 1 SI = 32K 
       data hash MD5: 32K
       0A 93 92 02 49 F9 B0 73 ED 9F 71 47 49 0B 1C 25>)
(   3,<2005-07-21 14:46:52.49 +100>,<MAYBRIDGE\NMR>,<NMR_250MHZ>,
      <apk 
       data hash MD5: 32K
       34 E5 B5 22 5D 89 5F 7E 4B D4 B2 79 2B 5B E4 AA>)
(   4,<2005-07-21 14:46:54.05 +100>,<MAYBRIDGE\NMR>,<NMR_250MHZ>,
      <abs ABSG = 5 
       data hash MD5: 32K
       CF 70 AE 95 89 91 94 5D BE 42 D5 8B 87 AE 2F DE>)
$$ ##END=
$$ 
$$ hash MD5
$$ 33 12 9A 35 8C F5 75 D4 04 3B 58 C0 A1 FC 6C D3
##$RELAX= 
##$RELAX= 
##$RELAX= 
##$RELAX= 
##$RELAX= 
##$RELAX= 
##$RELAX= 
$$ Bruker specific parameters
$$ --------------------------
##$DU= <C:\u>
##$EXPNO= 6300
##$NAME= <ADRS>
##$PROCNO= 1
##$TYPE= <nmr>
##$USER= <dgb>
##$AMP= (0..31)
100 100 100 100 100 100 100 100 100 100 100 100 100 100 100 100 100 100 
100 100 100 100 100 100 100 100 100 100 100 100 100 100 
##$AQSEQ= 0
##$AQ_mod= 3
##$AUNM= <au_zg>
##$AUTOPOS= <36 >
##$BF1= 250.13
##$BF2= 250.13
##$BF3= 250.13
##$BF4= 250.13
##$BF5= 500.13
##$BF6= 500.13
##$BF7= 500.13
##$BF8= 500.13
##$BYTORDA= 1
##$CFDGTYP= 0
##$CFRGTYP= 5
##$CHEMSTR= <none>
##$CNST= (0..31)
1 1 145 1 1 1 1 1 1 1 1 1 1 1 1 1 1 1 1 1 1 1 1 1 1 1 1 1 1 1 1 1 
##$CPDPRG= <>
##$CPDPRG1= <>
##$CPDPRG2= <>
##$CPDPRG3= <>
##$CPDPRG4= <mlev>
##$CPDPRG5= <mlev>
##$CPDPRG6= <mlev>
##$CPDPRG7= <mlev>
##$CPDPRG8= <mlev>
##$CPDPRGB= <>
##$CPDPRGT= <>
##$D= (0..31)
0 1 0 0 0 0 0 0 0 0.06 0 0 0 0 0 0 0.0002 0 0 0 0 0 0 0 0 0 0 0 0 0 0 
0 
##$DATE= 1121953588
##$DBL= (0..7)
120 120 120 120 120 120 120 120 
##$DBP= (0..7)
150 150 150 150 150 150 150 150 
##$DBP07= 0
##$DBPNAM0= <>
$$ [...]
##$SUBNAM7= <"">
##$SUBNAM8= <"">
##$SUBNAM9= <"">
##$SW= 20.6930455092707
##$SWIBOX= (0..15)
0 0 3 0 0 0 0 0 0 0 0 0 0 0 0 0 
##$SW_h= 5175.983436853
##$TD= 65536
##$TD0= 1
##$TE= 295.16
##$TE2= 300
##$TE3= 300
##$TEG= 300
##$TL= (0..7)
0 120 120 120 120 120 120 120 
##$TP= (0..7)
150 150 150 150 150 150 150 150 
##$TP07= 0
##$TPNAME0= <>
##$TPNAME1= <>
##$TPNAME2= <>
##$TPNAME3= <>
##$TPNAME4= <>
##$TPNAME5= <>
##$TPNAME6= <>
##$TPNAME7= <>
##$TPOAL= (0..7)
0.5 0.5 0.5 0.5 0.5 0.5 0.5 0.5 
##$TPOFFS= (0..7)
0 0 0 0 0 0 0 0 
##$TUNHIN= 0
##$TUNHOUT= 0
##$TUNXOUT= 0
##$USERA1= <user>
##$USERA2= <user>
##$USERA3= <user>
##$USERA4= <user>
##$USERA5= <user>
##$V9= 5
##$VALIST= <valist>
##$VCLIST= <CCCCCCCCCCCCCCC>
##$VD= 0
##$VDLIST= <DDDDDDDDDDDDDDD>
##$VPLIST= <PPPPPPPPPPPPPPP>
##$VTLIST= <TTTTTTTTTTTTTTT>
##$WBST= 1024
##$WBSW= 4
##$XGAIN= (0..3)
0 0 0 0 
##$XL= 0
##$YL= 0
##$YMAX_a= 254748
##$YMIN_a= -377101
##$ZGOPTNS= <>
##$ZL1= 120
##$ZL2= 120
##$ZL3= 120
##$ZL4= 120
##$ABSF1= 16.522
##$ABSF2= -4.171173
##$ABSG= 5
##$ABSL= 3
##$ALPHA= 0
##$AQORDER= 0
##$ASSFAC= 0
##$ASSFACI= 0
##$ASSFACX= 0
##$ASSWID= 0
##$AUNMP= <proc_1d>
##$AZFE= 0.1
##$AZFW= 0.1
##$BCFW= 0
##$BC_mod= 0
##$BYTORDP= 0
##$COROFFS= 0
##$CY= 12.5
##$DATMOD= 1
##$DC= 0
##$DFILT= <>
##$DTYPP= 0
##$F1P= 14.0000005364418
##$F2P= -0.99999901652339
##$FCOR= 0.5
##$FTSIZE= 32768
##$FT_mod= 6
##$GAMMA= 0
##$GB= 0
##$INTBC= 1
##$INTSCL= 1
##$ISEN= 128
##$LB= 0.3
##$LEV0= 0
##$LPBIN= 0
##$MAXI= 10000
##$MC2= 0
##$MEAN= 0
##$ME_mod= 0
##$MI= 0
##$NCOEF= 0
##$NC_proc= -3
##$NLEV= 6
##$NOISF1= 0
##$NOISF2= 0
##$NSP= 0
##$NTH_PI= 0
##$NZP= 0
##$OFFSET= 16.522
##$PC= 1
##$PHC0= -90.81786
##$PHC1= 13.23353
##$PH_mod= 1
##$PKNL= yes
##$PPARMOD= 0
##$PSCAL= 4
##$PSIGN= 0
##$REVERSE= no
##$SF= 250.13
##$SI= 32768
##$SIGF1= 0
##$SIGF2= 0
##$SINO= 400
##$SIOLD= 32768
##$SREGLST= <1H.DMSO>
##$SSB= 0
##$STSI= 32768
##$STSR= 0
##$SW_p= 5175.98343685301
##$SYMM= 0
##$S_DEV= 0
##$TDeff= 65536
##$TDoff= 0
##$TI= <Analysis number 999999
Compound Code 99
Book Reference 9
Project Code 9>
##$TILT= no
##$TM1= 0
##$TM2= 0
##$TOPLEV= 0
##$USERP1= <user>
##$USERP2= <user>
##$USERP3= <user>
##$USERP4= <user>
##$USERP5= <user>
##$WDW= 1
##$XDIM= 32768
##$YMAX_p= 375795359
##$YMIN_p= -164253
$$ End of Bruker specific parameters
$$ ---------------------------------
##NTUPLES= NMR SPECTRUM
##VAR_NAME=  FREQUENCY,     SPECTRUM/REAL,   SPECTRUM/IMAG
##SYMBOL=    X,             R,               I
##VAR_TYPE=  INDEPENDENT,   DEPENDENT,       DEPENDENT
##VAR_FORM=  AFFN,          ASDF,            ASDF
##VAR_DIM=   32768,         32768,           32768
##UNITS=     HZ,            ARBITRARY UNITS, ARBITRARY UNITS
##FACTOR=    0.157963299565203, 1,           1
##FIRST=     4132.6476996994, 0,             0
##LAST=      -1043.33573715361, 0,           0
##MIN=       -1043.33573715361, -164253,     0
##MAX=       4132.6476996994, 375795359,     0
$$ Real data points
##PAGE= N=1
##DATA TABLE= (X++(R..R)), XYDATA
$$ [...]
##PAGE= N=2
##DATA TABLE= (X++(I..I)), XYDATA
17864A220231J4873M9830Q1134J9977k8406K7565K7167n793J2777O9918L6760
17853A526033l2961l5974q455J9869J4996J8586J9367M864n805r463j1464L6318
17841A535911K4535L5870P1906J3580k9252O720k1065k5555k9564m531K4243j7139
17829A585659r321O730m955k5354K2314M5943j4624J7038R656K7222P173l9925
17817A627556l50M2904l055j578k1146j0195K9061r246K5674m848M2715K7433
17805A744925J835r950K1919L2419m213N899J1759k5550j0963j1539o0806k085
17793A693650L3390K2911L1644L93q768j5267J7519q37J9631P003K693J5763j166
17780A818559j9755K6971J0122J0592K7557m222j9495K920J4900K9926Q119L1969
$$ y = [1220231, 1235104, 1284934, 1366068, 1386045, 1357639, 1385204, 1412371, 1406578, 1419355, 1489273, 1526033, 1493072, 1457098, 1448643, 1468512, 1483508, 1502094, 1521461, 1526325, 1520520, 1511057, 1499593, 1535911, 1560446, 1596316, 1668222, 1681802, 1652550, 1659270, 1638205, 1612650, 1583086, 1578555, 1602798, 1585659, 1576338, 1583068, 1578113, 1552759, 1575073, 1621016, 1606392, 1623430, 1633086, 1660308, 1667481, 1627556, 1627206, 1670110, 1667055, 1665477, 1644331, 1634136, 1663197, 1653951, 1679625, 1674777, 1717492, 1744925, 1746760, 1736810, 1758729, 1791148, 1786935, 1792834, 1804593, 1779043, 1768080, 1756541, 1695735, 1693650, 1727040, 1749951, 1781595, 1781988, 1773220, 1757953, 1775472, 1774635, 1794266, 1801269, 1803962, 1819725, 1818559, 1798804, 1825775, 1835897, 1846489, 1874046, 1869824, 1850329, 1853249, 1868149, 1898075, 1906194, 1938163]
17768A938163m1118n1871K4078M0484R394m0525L6033P1275l1778j9521R728j2615
17756A931727k0260J2706p377l2529k5168K1746N0450M2972K1609j132L261N73
17744A998578j3652L265M303L3674L6199J292k3596q045K4128K865j5662k1252
17732B022097K8942N122K5335J0011O104J5150J6707K2466N2271Q720k91k7031
17720B185603l9959J6849L4582m6672n5119M8466Q0761M4514J9322k5882l0866
17709B231599j1261K0870N1155m488l0640m3371j8994J3982L6530L9685L0634
17698B315701n204o591j0905k3051K1616Q844J9737K3120p655P918p049o755N4843
17685B384569o072k6696j1114L1584N2614j5416m8419J6465M5006j0631q880R016
$$ y = [1938163, 1897045, 1845174, 1869252, 1909736, 1919130, 1878605, 1914638, 1985913, 1954135, 1934614, 1944342, 1931727, 1911467, 1924173, 1916796, 1884267, 1859099, 1880845, 1931295, 1974267, 1995876, 1994744, 1998005, 1998578, 1984926, 1988191, 1992494, 2026168, 2062367, 2063659, 2040063, 2032018, 2056146, 2059011, 2043349, 2022097, 2051039, 2056161, 2081496, 2091507, 2097611, 2112761, 2129468, 2151934, 2204205, 2212925, 2212634, 2185603, 2145644, 2162493, 2197075, 2150403, 2095284, 2143750, 2224511, 2269025, 2288347, 2262465, 2231599, 2220338, 2241208, 2292363, 2287875, 2257235, 2213864, 2194870, 2208852, 2245382, 2285067, 2315701, 2310497, 2303906, 2293001, 2269950, 2291566, 2300410, 2320147, 2343267, 2335612, 2343530, 2336481, 2329726, 2384569, 2378497, 2351801, 2340687, 2372271, 2424885, 2409469, 2361050, 2377515, 2422521, 2411890, 2403010, 2412026]
17673B412026M5261L5354l5738J3616L6314j1615L3295k697r883M2248o089k5104
17661B526988K3395M8115J5150n229k4576M775N2165K703K08J374p01P003k8523
17648B622847K596L9453k46P640p012L3874J2229j7105j0946L073L1323K3143
17636B740869k090j8868r762o928K6818K1558r297K8006m123J320N1048J3481
17624B832032L3741K1630J3686K6705K6616j4645P625K2125j813P548p640M0764
17612C008374J8074j859K6498L045n3528k324K2367J9848N9244L7936O431J9137
17600C163243J7298N619P123R756j1849K275K4013K1361K7787L2784N6626J5489
17588C371525L0241J9153L1821j9963j6201P469K5541M264r277o659J802M1269
$$ y = [2412026, 2457287, 2492641, 2456903, 2470519, 2506833, 2495218, 2528513, 2525816, 2515933, 2558181, 2552092, 2526988, 2550383, 2598498, 2613648, 2608419, 2583843, 2588618, 2640783, 2643486, 2643694, 2645068, 2644367, 2651370, 2622847, 2625443, 2664896, 2664650, 2672290, 2665278, 2699152, 2711381, 2694276, 2683330, 2686403, 2717726, 2740869, 2738779, 2719911, 2710149, 2703221, 2730039, 2751597, 2742300, 2770306, 2766183, 2767503, 2818551, 2832032, 2865773, 2887403, 2901089, 2927794, 2954410, 2939765, 2947390, 2969515, 2967702, 2975250, 2967610, 3008374, 3026448, 3024589, 3051087, 3054132, 3000604, 2998280, 3020647, 3040495, 3099739, 3137675, 3144106, 3163243, 3180541, 3186160, 3193283, 3203039, 3191190, 3193465, 3217478, 3238839, 3266626, 3299410, 3356036, 3371525, 3401766, 3420919, 3452740, 3432777, 3416576, 3424045, 3449586, 3453850, 3444573, 3437914, 3439716, 3480985]
17576C480985K6937k3226P881O2265J0584r271N4271Q321J4752L732M1034j2365
17564C665900j913M1437L2678M0465K5625M3951N6741N0842n565l6350o399l413
17552C903999m1912n5906n081J9986J4894L0883O5569K2226k0004M4360O1768
17541D040782K4452l173K0709R815N8605R5647M3626K633N1396J9402p816l2479
17529D323599L7140O7563P3979L3952J7519M3992k6266J311j935o35K7977O6204
17517D664400M8260q805j0751L2453P3640N9801R967L2622K7618L5957M2992L6259
17505E044413M024N1408L6335j7281J6524Q8793P8412M0832O6000N5169M9301
17494E513930K1038K6732L4553O6099L6095O4003N0689L1862N0699K5344N1402
$$ y = [3480985, 3507922, 3484696, 3492577, 3554842, 3565426, 3556155, 3610426, 3618747, 3633499, 3637231, 3678265, 3665900, 3663987, 3705424, 3738102, 3778567, 3804192, 3848143, 3904884, 3955726, 3950161, 3913811, 3907412, 3903999, 3862087, 3806181, 3801100, 3821086, 3835980, 3866863, 3932432, 3954658, 3934654, 3979014, 4040782, 4065234, 4062061, 4082770, 4092585, 4151190, 4246837, 4290463, 4293096, 4344492, 4363894, 4356078, 4323599, 4360739, 4428302, 4502281, 4536233, 4553752, 4597744, 4571478, 4572789, 4570854, 4570219, 4598196, 4664400, 4712660, 4703855, 4693104, 4725557, 4799197, 4858998, 4868965, 4901587, 4929205, 4965162, 5008154, 5044413, 5048437, 5099845, 5136180, 5118899, 5135423, 5224216, 5302628, 5343460, 5409460, 5464629, 5513930, 5534968, 5561700, 5596253, 5662352, 5698447, 5762450, 5813139, 5845001, 5895700, 5921044, 5972446]
17483E972446P3797M9153J9154P2741Q7243O6479J7453M7902N6546N7693M6162
17472F566769O2730J10568R9163M8141N8258Q5304Q6202O6863Q8173J16089R6006
17461G484266R2856Q0491O5098J13852J04270J01141J32619O6266J16800J32908
17451H490567R3440J22048J69231J38148J05990J22294J37476J12192J59782K07487
17441I858655J78018J13018J30199J64059J55661K13904K18920K19972J86540
17432A1438946K04220K27612K25441K60916K78684K97049K72236K91161L49956
17423A3846221L93814M15505M65010M87062N12970M91609M85363N97684P05138
17414A8400376P25014Q30715Q71877R55982J197237J403876J678518K048453K464394
$$ y = [5972446, 6046243, 6095396, 6114550, 6187291, 6274534, 6341013, 6358466, 6406368, 6462914, 6520607, 6566769, 6629499, 6740067, 6839230, 6887371, 6945629, 7030933, 7117135, 7183998, 7272171, 7388260, 7484266, 7577122, 7657613, 7722711, 7836563, 7940833, 8041974, 8174593, 8240859, 8357659, 8490567, 8584007, 8706055, 8875286, 9013434, 9119424, 9241718, 9379194, 9491386, 9651168, 9858655, 10036673, 10149691, 10279890, 10443949, 10599610, 10813514, 11032434, 11252406, 11438946, 11643166, 11870778, 12096219, 12357135, 12635819, 12932868, 13205104, 13496265, 13846221, 14240035, 14655540, 15120550, 15607612, 16120582, 16612191, 17097554, 17695238, 18400376, 19125390, 19956105, 20827982, 21783964, 22981201, 24385077, 26063595, 28112048, 30576442]
17405C0576442K977838L713149M281461L263812k910098j0135156q482647l204432
17397B0080369J528436K073294n459648j1978574q850272l084747K065117N143891
17389A517866O367616N676888K52107p848328p609948l030677J532870K597268
17381e44338m179669j2296116j0465671n233337l78035K387928L091782L035988
17373b4581468K779553K429730K079933J814709J589890J329930J183455J097638
17365a0276630J022986Q73908P59388O94202O68083O36802O31980O27060N79504
17356c782717N29523N01590N24645N25403N54996N38314N41111N17896M98761
17347I49522M77729M27176N05792N50590N48212N59051N44063N61986O83066P13237
$$ y = [30576442, 33554280, 37267429, 41548890, 44812702, 41902604, 31767448, 23284801, 20080369, 21608805, 23682099, 18222451, 6243877, -2606395, -5691142, -3626025, 1517866, 7885482, 13562370, 13814477, 5966149, -1643799, -4674476, -3141606, -544338, -4724007, -17020123, -27485794, -32719131, -33097166, -30709238, -27617456, -24581468, -21801915, -19372185, -17292252, -15477543, -13887653, -12557723, -11374268, -10276630, -9253644, -8379736, -7620348, -6926146, -6258063, -5621261, -4989281, -4362221, -3782717, -3253194, -2751604, -2226959, -1701556, -1146560, -608246, -67135, 450761, 949522, 1427251, 1854427, 2360219, 2910809, 3459021, 4018072, 4562135, 5124121, 5807187, 6520424]
17337F520424P24338P52203P33907O46935O95549P96773R47761J135170J181965
17328A4135025J242785J409887J662036J996940K456894L024332L666865M574410
17320C4169174N592602O421431N636050N14388q584470j6132120j6359976j0450676
17312H06403m637868m527121r791659j4400660j3391045p771683j665790K417562
17304e2961861M177337M457135M112651L593836L068160K654136K219141J835340
17296b6844125J522773J327262J152003J107110R97101Q38156P54838O84672O08425
17287a7851785N69350N58091N49987N53428N27444M79201M33757M07281M15894
17278a3357352L44411L13899L20383L36139K69463K23160K12466K59632K35532
$$ y = [6520424, 7244762, 7996965, 8730872, 9377807, 10073356, 10870129, 11817890, 12953060, 14135025, 15377810, 16787697, 18449733, 20446673, 22903567, 25927899, 29594764, 34169174, 39761776, 46183207, 51819257, 52333645, 43749175, 27617055, 11257079, 806403, -3831465, -8358586, -18150245, -32550905, -45941950, -53713633, -55379423, -52961861, -48784524, -44327389, -40214738, -36620902, -33552742, -30898606, -28679465, -26844125, -25321352, -23994090, -22842087, -21734977, -20737876, -19899720, -19144882, -18460210, -17851785, -17282435, -16724344, -16174357, -15620929, -15093485, -14614284, -14180527, -13773246, -13357352, -13012941, -12699042, -12378659, -12042520, -11773057, -11549897, -11337431, -11077799, -10842267]
17269a0842267J99547K36082K28003K12952J70667J73653J47160K03583K22342
17260i048278J75197J23118J29491J23911R0043J40460J31384J37419J15660Q1648
17250g799947J50491J32177J27159P0383J05856R8028P9460N8895Q9063P5716
17240f812719Q7249J06996J09008N4586N3423M8165L8180P3572P8821P8399R4793
17229e989527J04266M9399O7530P6872R5338O7585O2584k0221N6273O1369K0471
17218e348061Q3174R5103O5229L3519P5862M2112N0173L1235p68K924P1494R7457
17206d700547M2734L4487O8309L3011K4578O257L0999L3707N6021P5349O0424
17195d234671L4994k2450K9318J5945N3112O0991R792J9118R716N3246M8084J082
$$ y = [-10842267, -10642720, -10406638, -10178635, -9965683, -9795016, -9621363, -9474203, -9270620, -9048278, -8873081, -8749963, -8620472, -8496561, -8406518, -8266058, -8134674, -7997255, -7881595, -7799947, -7649456, -7517279, -7390120, -7319737, -7213881, -7115853, -7036393, -6977498, -6888435, -6812719, -6725470, -6618474, -6509466, -6454880, -6401457, -6353292, -6315112, -6241540, -6162719, -6084320, -5989527, -5885261, -5835862, -5768332, -5691460, -5596122, -5528537, -5465953, -5486174, -5429901, -5368532, -5348061, -5264887, -5169784, -5104555, -5071036, -4995174, -4953062, -4902889, -4871654, -4872422, -4869498, -4798004, -4700547, -4657813, -4623326, -4555017, -4522006, -4497428, -4491171, -4460172, -4426465, -4370444, -4295095, -4234671, -4199677, -4222127, -4192809, -4176864, -4123752, -4062761, -4052969, -4033851, -4024135, -3970889, -3922805, -3921723]
17183c921723n25q621J2891K8109M5668N8684M5051l325J4136L6655J2963P969
17171c672068j8227O0318M7418M9907J7005M0050O5290K9304M7078L0927L66L3273
17159c269359J7721L4185M5020J4550L8823M3289n653k4703N666K9159L2916N0792
17147b987594N6633M6639K2107L3838l323j9419n2434J263M8709K7742l3095m8016
17135b906950M656J0222m657J6643O9206P3148K0238l1178l1419j573J2253k4184
17123b793595n6898l2397L335L0992L7819L6556J206Q763q651N2884J6447k7276
17111b730815o464n570L0148P6979M1322j0458P922K0747L2228J026q136J9185
17099b531886M7066L1358M6334j564Q047K0155M511N370M4881N0470m2121k2430
$$ y = [-3921723, -3922248, -3930869, -3917978, -3889869, -3844201, -3785517, -3740466, -3743791, -3729655, -3693000, -3680037, -3672068, -3690295, -3629977, -3582559, -3532652, -3515647, -3475597, -3410307, -3381003, -3333925, -3302998, -3302632, -3269359, -3251638, -3217453, -3172433, -3157883, -3119060, -3075771, -3081424, -3106127, -3100461, -3071302, -3038386, -2987594, -2930961, -2884322, -2862215, -2828377, -2831700, -2851119, -2903553, -2902290, -2853581, -2825839, -2858934, -2906950, -2902294, -2892072, -2896729, -2880086, -2810880, -2737732, -2717494, -2748672, -2780091, -2781664, -2769411, -2793595, -2850493, -2882890, -2879555, -2848563, -2810744, -2774188, -2772982, -2764219, -2772870, -2719986, -2703539, -2730815, -2737279, -2742849, -2712701, -2635722, -2594400, -2604858, -2596936, -2576189, -2543961, -2542935, -2551071, -2531886, -2484820, -2453462, -2407128, -2408692, -2400645, -2380490, -2375979, -2370609, -2325728, -2275258, -2317379, -2339809]
17087b339809j768j1615K981K6461L0437K4032J4781j8195m41q723L0516K4394
17075b226949M0773M7724J454r51J260K0075J4835P785p12L6382J4708j2249k4555
17062b080420p501L4641J8277J3138l7327j2598L3269L3546K1737M0687K7099
17051a915452K9727L748J2931K1983l9283l8601Q753J5837J9846j1306k5562r52
17039a918331m439L2783M6027L57P929r315K1386K9432M956J7073m58J5116N6657
17026a700827r615m0952N3706J5940q700l7588j8169N859K7534j1241R554J1398
17014a703101L488j0772M481K9311N1499O0814m6200l00O843j8379m2601J9395
17002a645522K9864j0605m156L3300N2426K9909K2141J4242j5216k0708N780N468
$$ y = [-2339809, -2341577, -2353192, -2350211, -2323750, -2293313, -2269281, -2254500, -2272695, -2273136, -2281859, -2251343, -2226949, -2186176, -2138452, -2136998, -2137949, -2136689, -2116614, -2101779, -2093994, -2094706, -2058324, -2043616, -2055865, -2080420, -2087921, -2053280, -2035003, -2021865, -2059192, -2071790, -2038521, -2004975, -1983238, -1942551, -1915452, -1885725, -1881977, -1869046, -1847063, -1886346, -1924947, -1916194, -1900357, -1880511, -1891817, -1917379, -1918331, -1922770, -1889987, -1843960, -1843603, -1835674, -1844989, -1823603, -1794171, -1789215, -1772142, -1772600, -1757484, -1700827, -1710442, -1751394, -1697688, -1681748, -1690448, -1728036, -1746205, -1740346, -1712812, -1724053, -1714499, -1703101, -1699613, -1710385, -1705904, -1676593, -1625094, -1564280, -1610480, -1610780, -1603937, -1622316, -1664917, -1645522, -1615658, -1626263, -1630419, -1597119, -1544693, -1514784, -1492643, -1478401, -1493617, -1514325, -1508545, -1503077]
16990a503077L4384R295j0652m256L3236m1665j9346k0305L2749N6301K4201K8163
16978a380972M266k430p996k908k6153k745J7301L144k2961l738P385M1009K100
16965a374698l145J9465p158O803L1196L218p557M400K7747J0621M476o88k8625
16952a313945n35p095J9165K7018J1469J5539J588j1552k3690n415j0296j3541
16940a311290M2089K4702J7852K7474p953q296k7993J9011J936K5812j8523Q899
16928a206280N812L5576K8013R093k6531j2169p325J1964L0640j8519J5425K3406
16916a110895J6665L7133j2971k3093n669L1964k4179m6198k3691M55K679M1883
16904a115917K7515k4896j9605K9859J0667R683j5190M5371K7172k3488k5700
$$ y = [-1503077, -1468693, -1459398, -1470050, -1474306, -1441070, -1482735, -1502081, -1522386, -1489637, -1433336, -1409135, -1380972, -1376706, -1379136, -1387132, -1390040, -1416193, -1418938, -1401637, -1398493, -1421454, -1425192, -1417807, -1376798, -1374698, -1377843, -1358378, -1365536, -1358733, -1327537, -1324319, -1331876, -1327476, -1299729, -1289108, -1284632, -1285320, -1313945, -1314480, -1321575, -1302410, -1275392, -1263923, -1248384, -1246796, -1258348, -1282038, -1287453, -1297749, -1311290, -1269201, -1244499, -1226647, -1199173, -1207126, -1215422, -1243415, -1224404, -1222468, -1196656, -1215179, -1206280, -1200468, -1164892, -1136879, -1127786, -1154317, -1166486, -1173811, -1161847, -1131207, -1149726, -1134301, -1110895, -1094230, -1057097, -1070068, -1093161, -1098830, -1066866, -1091045, -1137243, -1160934, -1160479, -1157800, -1115917, -1088402, -1113298, -1132903, -1103044, -1092377, -1082694, -1097884, -1052513, -1025341, -1048829, -1074529]
16893a074529K4408j0354J5438P4330o208M762K2416J971L0003l601o1131j408
16881i83903L0437O568n6932l2392M2641J1290k7308J5801J4877Q688m450K9737
16869i44946K2619j355l6107K6351L7649q559o635J5764n506k8382L7346K4194
16857h67567M1470P918J7151j8707l8036j2152l3763M3110L6098L6055L338o968
16845g92053m68l9833k5903L9764L6508J1392j8789j8131K0338K3562L5869K1279
16833g06465L9415j9331r148L2365J2237J9297J2177o6625o0735j5230L3021L3246
16821f95776j0832k4630j8353j8071j9873J1377K6800K5280J2910l292J964j02969
16809h15465l2871K1593j9898l1036n4168j2926j263l1343l4962L8678K8327K7412
$$ y = [-1074529, -1050121, -1060475, -1045037, -970707, -976915, -972153, -949737, -947766, -917763, -921364, -982495, -983903, -953466, -946898, -1003830, -1036222, -993581, -982291, -1009599, -993798, -978921, -970233, -974683, -944946, -922327, -923682, -959789, -933438, -895789, -904348, -910983, -895219, -900725, -929107, -891761, -867567, -826097, -818179, -801028, -819735, -857771, -869923, -903686, -860576, -824478, -788423, -785085, -792053, -792521, -832354, -858257, -818493, -781985, -770593, -789382, -807513, -787175, -763613, -727744, -706465, -667050, -686381, -695529, -663164, -650927, -631630, -619453, -686078, -746813, -762043, -729022, -695776, -706608, -731238, -749591, -767662, -787535, -776158, -749358, -724078, -711168, -714460, -712496, -815465, -848336, -826743, -846641, -877677, -931845, -944771, -946034, -977377, -1012339, -973661, -945334, -917922]
16797i17922K1180P5396K0098Q099J3781j0376l9284j0383k0760J4234K7554Q326
16785h10057l4480j2283J3968N756M0096K6442M449L606J8053M0561J5624q913
16773f97178j7870J8204M6639p27j1489o579j2647k1329k259K0085J3317O3816
16761f08017J6025j4548J9635L7487p737L9143j7992L1575P613K3376J1641J6071
16749d45728J9168L5204J9942m6062o5462o8789r3052o2902q297l9150k2920k9188
16737h07236q0219k1114j1160n505j4735r261J3755L8373K4927L4261K7247k5496
16725h36163L3038K1087j2649O483m2183L2578K0704k7560R617L7996K6290M2834
16713f87928m626N764O7960K1363k2518j5168l5974k6576m642k3644j4033K7384
$$ y = [-917922, -896742, -821346, -801248, -793149, -779368, -789744, -829028, -839411, -860171, -845937, -818383, -810057, -844537, -856820, -842852, -837096, -797000, -770558, -766109, -762503, -744450, -703889, -688265, -697178, -715048, -696844, -650205, -650932, -662421, -669000, -681647, -702976, -705235, -685150, -671833, -608017, -591992, -606540, -586905, -549418, -557155, -518012, -536004, -504429, -496816, -473440, -461799, -445728, -426560, -391356, -371414, -417476, -482938, -551727, -644779, -707681, -715978, -755128, -778048, -807236, -887455, -908569, -919729, -925234, -939969, -949230, -935475, -897102, -872175, -837914, -810667, -836163, -803125, -782038, -794687, -788204, -830387, -797809, -777105, -804665, -795048, -757052, -730762, -687928, -692554, -686790, -618830, -597467, -619985, -635153, -671127, -697703, -702345, -725989, -740022, -712638]
16701g12638N2562N925k6426K8541j1700N955r660m3578K7655L1924L3033N2978
16689e65429N459j5187l5712J5553L1669l4792k8105K3596j1886o16J0933K5170
16677e79347M107n1696k2403P1305q75m2573k4553M994Q106J64L0285J1207M8023
16664e43256j3530m4504j3863r515k601m846K6082J7207K3092q247k2609J4334
16652e82256P528M868K1458L3895l9631J6676M9333j7328k5089J7832J9311k3919
16640e17322l0681Q901K3516k0618j8109L877M4283L5484p669m068n817j5173
16628e03396j1783N90J4433q734j0008J8336J9147m975o628J7749J1857J7957
16616d45455L5783L2612q381K7288J84k6752R702j1445j16m081j6756P94J0617
$$ y = [-712638, -660076, -654151, -680577, -652036, -663736, -657781, -667441, -711019, -683364, -651440, -618407, -565429, -559970, -575157, -610869, -595316, -563647, -598439, -626544, -602948, -614834, -615450, -604517, -579347, -575240, -626936, -649339, -578034, -578909, -621482, -646035, -641041, -632935, -632771, -602486, -591279, -543256, -556786, -601290, -615153, -624668, -627269, -632115, -606033, -588826, -565734, -573981, -596590, -582256, -574728, -569860, -548402, -514507, -554138, -537462, -488129, -505457, -530546, -512714, -493403, -517322, -548003, -539102, -515586, -536204, -554313, -550436, -506153, -470669, -478338, -482406, -488223, -503396, -515179, -514589, -500156, -508890, -518898, -500562, -481415, -486390, -493018, -475269, -463412, -445455, -409672, -377060, -385441, -358153, -357969, -384721, -375019, -386464, -386580, -390661, -407417, -406623, -396006]
16603c96006j5539J5252k6819n7978k3063L3987K5939j3841J8902K7894j0178
16592d21450j7159L9948M5821j2009k8869j3909K8935o73l2701Q310k4466k7422
16580d55644P601O19K5J0151P312l900l1609j249p128N8020M7343k258j6272j7506
16566d04495J0793L0778J470o875O076l3623m6302m274m0642N669L6513L991j1768
16553d52689R666L9175K5103K8016k4204m164K0113j2182n619K567o290J132j35
16540c79511K5070L7959O914K6645P331n451l3356j6193M3390l238o8817l0798
16528c90055M286L7427K2719J4692j4313k0402K27J9747j5265L726J1892j2537
16516c37856J0643K4402J0708j1071J7527j0780j0777j884J3666J7436P0M484
$$ y = [-396006, -411545, -396293, -423112, -481090, -504153, -470166, -444227, -458068, -439166, -411272, -421450, -438609, -398661, -352840, -364849, -393718, -407627, -378692, -379365, -412066, -403756, -428222, -455644, -448043, -447424, -447399, -437248, -429936, -433836, -465445, -466694, -473822, -415802, -368459, -370717, -386989, -404495, -393702, -362924, -361454, -368329, -362253, -395876, -442178, -446452, -487094, -481425, -444912, -440921, -452689, -443023, -403848, -378745, -350729, -374933, -379097, -358984, -371166, -376785, -374218, -380508, -379376, -379511, -354441, -316482, -309568, -282923, -275592, -281043, -314399, -330592, -287202, -290440, -359257, -390055, -385769, -348342, -325623, -310931, -325244, -345646, -345419, -325672, -340937, -337211, -325319, -337856, -327213, -302811, -292103, -303174, -285647, -296427, -307204, -309088, -295422, -277986, -277916, -273432]
16504b73432K3628k0461k3367l1180m0510m943K2389K9369l772J0829J2560J5229
16492b83661k4179k8374Q348K345L6833L8877M849k3078j6267J539N2570j8408
16480b48606l9683j9257N187J6281r583J4098J8530K6893L6489j3460n3212j9100
16468b85423p593m1074J3431L7983L8132P725K2349M1478j7039n583M631J5897
16456a75086M517j7296K0752j3847m9401k7218J55L3376O10J270m182j9656m143
16443b50149J0307M6987m0602m3567k8381k5445J8304K3609J1421o765k5364J7609
16431b92036K3595k221R402j612L938K5267L0553J3473l7795o0126k685M3936
16419b46311k6058O539K8051L0054J4393k4833k9337j0967l3299K5196J2384J1090
$$ y = [-273432, -249804, -270265, -293632, -324812, -365322, -370265, -347876, -318507, -322279, -311450, -298890, -283661, -307840, -336214, -327866, -325521, -288688, -249811, -244962, -268040, -284307, -282768, -230198, -248606, -288289, -307546, -302359, -286078, -295661, -281563, -263033, -236140, -199651, -213111, -266323, -285423, -293016, -334090, -320659, -282676, -244544, -236819, -214470, -172992, -190031, -195614, -190983, -175086, -170569, -187865, -167113, -180960, -230361, -257579, -257424, -224048, -223438, -222168, -226350, -246006, -250149, -239842, -192855, -233457, -277024, -305405, -330850, -312546, -288937, -277516, -284281, -309645, -292036, -268441, -270662, -261260, -262872, -258934, -233667, -203114, -189641, -227436, -287562, -290247, -246311, -272369, -265830, -237779, -207725, -193332, -218165, -247502, -258469, -291768, -266572, -254188, -243098]
16407b43098J1820L9150q60j085N422M749m100l113J86k05l4499J0314J0318K131
16393b02870j9547p309j2874L4345L6718L677j0395k940l1196L7591J249K3384
16381a50167Q024j3974k6345k9143M0679L4646K519L213J1887l0475k1732K8351
16369a42517N2621J2340j8181J9009O520l3242k1300J1442R000k4617M131r642
16357a34436P81O283N3996j918k4173m439O387k8217J8471l1642k3321o747j3526
16344a82501J7258K1162k6881J1341J3223K0385p232L8359M1347j033l3597k4659
16332a12828j93J2781L0426P251k452j020j081m4694M674j3750K1331J773J0342
16319h7440n238J6429J204k2991j0495K3317j272j8034n5413q475K2605R643K873
$$ y = [-243098, -231278, -192128, -192988, -194073, -188651, -183902, -188002, -191115, -190929, -191134, -225633, -215319, -205001, -202870, -222417, -229726, -242600, -208255, -171537, -167860, -178255, -181195, -212391, -174800, -173551, -150167, -142143, -156117, -182462, -211605, -170926, -136280, -133761, -130548, -118661, -149136, -170868, -142517, -89896, -77556, -95737, -76728, -70208, -103450, -124750, -113308, -104308, -128925, -124794, -134436, -133655, -127372, -73376, -75294, -99467, -103906, -97519, -125736, -107265, -138907, -162228, -168975, -182501, -165243, -144081, -170962, -159621, -146398, -126013, -133245, -94886, -53539, -54572, -88169, -112828, -113021, -100240, -69814, -62563, -65015, -66035, -67116, -111810, -107136, -120886, -99555, -97782, -87440, -92678, -76249, -75045, -98036, -108531, -85214, -86486, -104520, -159933, -168408, -145803, -136160, -133287]
16306a33287l4164Q339K2768l075K1293K491m575J4404K1868J9013M9312j3741
16294b9354k9949j0635k5537K0115J9769Q436m3802l8778k4598O463L2588M0858
16282g4424P908K843Q024J1239K2225q269l9480L3368K8195l4307j8489J2111
16270d9056R100K8500L4485J0873o4650m7129O705j2473l5405n425K1764N4680
16258d8031n756K439K7826l2756j9668n39J5838O030k701j5824r457q221N2118
16245c8702P2512o365j9434J1943j0067j6696l0125m6632P985M3965k294J6248
16233a7662M2536M190j9014o702j3898j8795K9299L7426M69l3073j2265k829k8136
16220c8454j2140j123L2548J3019l0567o72K9034j7954O003O372k0964N709q035
$$ y = [-133287, -167451, -159112, -136344, -139419, -118126, -115635, -120210, -105806, -83938, -64925, -15613, -29354, -59303, -69938, -95475, -75360, -55591, -47155, -90957, -129735, -154333, -147870, -115282, -74424, -66516, -63673, -55649, -44410, -22185, -30454, -69934, -36566, -8371, -42678, -61167, -49056, -39956, -11456, 23029, 33902, -30748, -77877, -71172, -83645, -119050, -124475, -102711, -48031, -53787, -51348, -23522, -56278, -75946, -76485, -60647, -54617, -57318, -73142, -82599, -90820, -38702, 33810, 27445, 8011, 19954, 9887, -6809, -36934, -83566, -75581, -31616, -33910, -17662, 24874, 29064, 10050, 3348, -10550, -29345, -46, 37380, 37849, 4776, -7489, -10318, -38454, -50594, -51717, -19169, -6150, -36717, -37389, -8355, -26309, -20306, -13934, -34898, -29189, -37224]
16207c7224j38J6388J9924M967j1731j6688m559n0690N014P0233P879K7263K6182
16194E6820k1913r885K5294l3137n5391m3773o912K2712Q929N612M224J2095l0279
16181f5604p075J4919J0703n19K7934K4375J7563K5k1894l764J8857J5150J9611
16168E0281J7836R668Q452K0580k8913k0536R626k2797Q784M9215K2645J2272
16156A37113k0272J3329l4210k8663j9851l7546R940K0986L0679L1537k5121m8814
16144B9107n199L6627L8333Q456p27j5400L5275k1566j2038j0704L701L2518K8002
16131A46385J3761L531l0392N6927N1487k909j2393j2310r80k2882j6223l9260
16119A34742k1449n851k0810m4010l8733k0323J0913J2851O131l617M8234Q239
$$ y = [-37224, -37362, -20974, -1050, 3917, -7814, -24502, -29061, -79751, -74737, -4504, 3375, 30638, 56820, 34907, 25022, 50316, 17179, -38212, -81985, -88897, -66185, -57256, -51644, -47420, -35325, -65604, -72679, -57760, -47057, -47576, -19642, 4733, 22296, 22321, 427, -3337, 15520, 30670, 50281, 68117, 77785, 86237, 106817, 77904, 57368, 66994, 44197, 52981, 102196, 124841, 137113, 116841, 130170, 95960, 67297, 47446, 9900, 19840, 40826, 71505, 103042, 77921, 29107, 23908, 60535, 98868, 107324, 106597, 91197, 126472, 104906, 92868, 82164, 85865, 118383, 146385, 160146, 163677, 133285, 190212, 241699, 238790, 226397, 214087, 213107, 190225, 174002, 134742, 113293, 107442, 86632, 42622, 3889, -16434, -5521, 7330, 13461, 9844, 58078, 66317]
16107F6317J5695M2736L668j2571l6393j6703n7935l720j4374l6946o4426l2993
16095a47645J1781P984L5111L1513L1663L5771Q922J2703K4631N480l5781M6910
16083F9043J6074l8351N847L042m2351l9699j0753N328L195K1219K9246q769k1584
16070h513k9753k5849N0642L6331J1094n09J398P952L2235M4996q105o145K9346
16057A35120k2335l2069o61K8546K259k5362k4224O060J0690l0731J602j6360
16045C2535J1957L5792J4443j1791l3989P990L632K4216j280J1407l7450P081
16033F4543R309J1253j7638j0053J1643L0968j5854k9857p820j7337K4115J6263
16021F9535R934l1177J047J1786L017k2221M389K4311K4271m226l629J2550M1453
$$ y = [66317, 82012, 124748, 128416, 115845, 79452, 62749, 4814, 1094, -13280, -50226, -114652, -147645, -135864, -127880, -92769, -61256, -29593, 6178, 15100, 27803, 52434, 57914, 22133, 69043, 85117, 46766, 52613, 55655, 13304, -26395, -37148, -31820, -28625, -7406, 21840, 13071, -8513, -38266, -64115, -13473, 22858, 33952, 33443, 34841, 42793, 75028, 120024, 111919, 105774, 135120, 112785, 80716, 80055, 108601, 110860, 85498, 61274, 67334, 78024, 47293, 48895, 32535, 44492, 80284, 94727, 82936, 48947, 56937, 60569, 84785, 83505, 94912, 57462, 64543, 73852, 85105, 67467, 57414, 69057, 100025, 84171, 54314, 46494, 29157, 53272, 69535, 79469, 48292, 49339, 61125, 64142, 41921, 46310, 70621, 94892, 90666, 87037, 99587, 141040]
16008A41040j0479l5232q776r249K9005j2858j5202J6450K6410K4787k4948n694
15996A15254K364j1162K377J4303R151N18R902j2560r362J4256J0947m355k4240
15983A17393N428n471k004J101K4953l7008J1009j2523j4602L9733L2232k8042
15971A32199l0043o123k0636K4814L5826j9891k5504m1122q464q630k8381K8775
15959C2820L8307M4914l5925n9173n140P408M492J3320K8105O3613j2039l1965
15947H8737K0926P218K969j443N701m3769L1739J461j2829J214r382L6978K4559
15934A54079q153l832r159L307J348PQ480l916m724K1380J9751m3295l4262O28
15920A01639M5461L0193o954r417J4295l24m4671j5014J1817L875k1716k749l494
$$ y = [141040, 130561, 95329, 86553, 77304, 106309, 93451, 78249, 94699, 121109, 145896, 120948, 115254, 117618, 106456, 108833, 123136, 132287, 132805, 142707, 130147, 120785, 135041, 145988, 141633, 117393, 122821, 117350, 115346, 116447, 141400, 104392, 115401, 102878, 88276, 128009, 160241, 132199, 102156, 96033, 75397, 100211, 136037, 116146, 90642, 49520, 41056, 32426, 4045, 32820, 71127, 116041, 80116, 20943, 15803, 23211, 27703, 41023, 69128, 132741, 120702, 88737, 109663, 116881, 119850, 118407, 124108, 80339, 112078, 113539, 100710, 101924, 92542, 129520, 154079, 145926, 142094, 132935, 136242, 137590, 137597, 146077, 142161, 137437, 158817, 178568, 135273, 101011, 101639, 147100, 177293, 170339, 160922, 175217, 174893, 130222, 115208, 127025, 130900, 109184, 106435, 102941]
15907A02941M2266J4771J5973n5868m4288K8170L7164L3149J1092l3065l644J8185
15895A66846M036k7326l2843n06P082p518K2495N878Q709O5355N2344j2355o7821
15882A84376k684L6313K364J6842j6673n3680k9738q063K0791L1170K0192j5478
15870A85732j4575N058q515p643K3892o7471k6938k6772M212L3546L2699L7058
15858A70283N401p180L82j5408J0406L667K1594K2701R605k5221O361J0413K6766
15845B39770J1380k7399l8913k5576J0358K3912J7785J8960k02O703m1877o0327
15833A34574m547J0142k850J543O728L9251J9514o756q088j7781j6020k4768j1323
15820A19619J6187L2044L0541N050J2563J21m1554n778K8398M5317N640j9243
$$ y = [102941, 145207, 159978, 175951, 120083, 75795, 103965, 141129, 174278, 185370, 152305, 148661, 166846, 170882, 143556, 110713, 110207, 117289, 109771, 132266, 138144, 146853, 212208, 264552, 252197, 184376, 181692, 218005, 220369, 237211, 220538, 166858, 137120, 129057, 149848, 181018, 201210, 185732, 171157, 176215, 167700, 160057, 183949, 116478, 89540, 62768, 66980, 100526, 133225, 170283, 175684, 168504, 168886, 153478, 163884, 167551, 189145, 211846, 221451, 196230, 202591, 213004, 239770, 251150, 223751, 184838, 159262, 169620, 193532, 211317, 230277, 230075, 236778, 194901, 134574, 130027, 140169, 137319, 138862, 145590, 184841, 204355, 197599, 189511, 171730, 155710, 130942, 119619, 135806, 167850, 198391, 203441, 216004, 216125, 174571, 168793, 197191, 242508, 248148, 228905]
15808B28905j8596p984J1476n143l1319j7464L7157L4687K3413j0239o785K0182
15796B58290k649M574J3637l4474l4601J4085j6441k9222J2485J2948J3072K2934
15784B34638J7916K1991k0353J8778K3379Q01l5888P266J0026J9160j0094k4563
15772B63057m6203J1575N434j1225M4700J2918J0416m1537k1108M8130J1485k5209
15760B62433N591j7365k7064j8611J1231K3267j9824j0745K0415N558L642j9748
15748B18780J6887L4535K2246j0639o803k764j2215j0372M4611J2765n727l562
15736B97742j3350Q75k347P077R786j0550N2880m921m5138k0507j8529K6186P2205
15723C51409j5541l4803p191Q063j3656m880m272L3411J868j7592j7213P03K203
$$ y = [228905, 210309, 202325, 213801, 208658, 177339, 159875, 197032, 231719, 255132, 244893, 238108, 258290, 255641, 260215, 273852, 239378, 204777, 218862, 202421, 173199, 185684, 198632, 211704, 234638, 252554, 274545, 254192, 272970, 296349, 297150, 261262, 268528, 278554, 297714, 287620, 263057, 216854, 228429, 233863, 222638, 267338, 280256, 290672, 249135, 228027, 276157, 287642, 262433, 268024, 250659, 223595, 204984, 216215, 239482, 219658, 208913, 229328, 234886, 238528, 218780, 235667, 270202, 292448, 281809, 275006, 272242, 260027, 249655, 294266, 307031, 301304, 297742, 284392, 285267, 282920, 289997, 299783, 289233, 342113, 337192, 292054, 271547, 253018, 279204, 351409, 335868, 301065, 293874, 301937, 288281, 283401, 279129, 312540, 314408, 296816, 279603, 280306, 282509]
15710B82509N7l6650P588O919l920N005L7203J0524k7737n0043m8466j1104J121
15697A73006L2908N5568J4571k645j9326K0633K4315J0035M131k6304k1148R267
15685B75011O0723K3448l7197o4725m2549M2960L4935J3573o178n6021j9307L9379
15673B64052l7453K6713K2001r924L97j4851L3302Q141j3096K265J9106L6410
15661C37063L4158J0573k3331m6641k0376r531o588J841O748l0422k4820M1532
15649B70206P28K7334N2780J5124J2872J7816j2425l5482j2319j947K1994R563
15637C66244m1556l3530N26L5640L0552j1102J148l771k5508n1655r672J6113
15625B73429J6962O701P407q482k252J6341o785K7091j9864j0218q334L6818L9111
$$ y = [282509, 282566, 245916, 253504, 260423, 256503, 261508, 298711, 309235, 281498, 231455, 182989, 171885, 173006, 205914, 261482, 276053, 273408, 254082, 274715, 299030, 309065, 313196, 286892, 265744, 275011, 335734, 359182, 321985, 257260, 214711, 257671, 292606, 306179, 300001, 243980, 224673, 264052, 226599, 253312, 275313, 265389, 265786, 250935, 284237, 292378, 279282, 281547, 300653, 337063, 371221, 381794, 358463, 311822, 291446, 281915, 275327, 277168, 283916, 253494, 228674, 270206, 270934, 298268, 351048, 366172, 379044, 396860, 384435, 348953, 336634, 334687, 356681, 366244, 324688, 291158, 291684, 327324, 357876, 346774, 347922, 344151, 318643, 266988, 257316, 273429, 290391, 297092, 304499, 296017, 293765, 310106, 303321, 330412, 310548, 300330, 291996, 328814, 367925]
15612C67925J458k6745j1989P119n748q340k9253J514M0925M2894N243j5654j0940
15599C58409j5446k9452k0687K0651K3556O78l1037k7674l993J9717J4522m102
15587C05142M7004N9525J6188p2892o5878L5295L5282K9254L3736p0318l8109
15576C14229R968L1812R172P10J2135P918J3711k0462m059k7465l929l726J9787
15563C59801j8391L3562N2179P960m834m2462j9158J5766r568j730N968J0236
15551C89329k622n2622j7599N337M1757k5080k2108N4999M1720r967K842l3545
15539C72441j3888m175L7517K944n0038j0866M126K8712Q738j2597j3296P552
15527C57170K3251K0530J4244N647j7806j4497k4224k6644p277k50K3349K8354
$$ y = [367925, 369383, 342638, 330649, 337768, 332020, 323680, 294427, 295941, 336866, 379760, 385003, 369349, 358409, 342963, 313511, 292824, 313475, 337031, 337709, 306672, 278998, 275005, 294722, 309244, 305142, 352146, 411671, 427859, 354967, 289089, 324384, 359666, 388920, 422656, 352338, 314229, 324197, 356009, 365181, 365891, 378026, 385944, 399655, 379193, 375134, 347669, 343740, 340014, 359801, 341410, 374972, 427151, 435111, 430277, 387815, 368657, 384423, 374855, 373125, 379093, 389329, 386707, 334085, 316486, 321823, 363580, 338500, 316392, 371391, 413111, 403144, 405986, 372441, 358553, 354378, 391895, 394839, 344801, 333935, 338061, 366773, 375511, 362914, 349618, 357170, 380421, 400951, 415195, 420842, 403036, 388539, 364315, 337671, 330394, 330144, 353493, 381847]
15515C81847L9331K7160k5020k4276j2960L7842Q746J3806J8464n220m0824j9295
15503C99601P962J585R571N8909J454k7049k3176k9621k1078j8857N489L5600
15491D00390J3932l434K7075l2879j4476J3127O835K2900J391k7259K805j4240
15479C96167j9507L947j776P354K8837k4401l2219l362q630K5426J9613k9356
15467C62093J4723J5038K816J2271L2715K3517J855l7371K8996J5286l965m6389
15455D21585j4563M4841L611K2922k0980k0100l9070J2415J6893O264K7525j2888
15443D48455j5164M3224J5980O095O704k4331K8792M6835l1411l1012o86J353
15431D94834l9396p522J2307j6608K1705j0924m1925J9913L0427P984k4732n939
$$ y = [381847, 421178, 448338, 423318, 399042, 386082, 423924, 432670, 446476, 464940, 459720, 418896, 399601, 407563, 409148, 418719, 477628, 479082, 452033, 428857, 399236, 378158, 359301, 364790, 400390, 414322, 410888, 437963, 405084, 390608, 403735, 410570, 433470, 434861, 407602, 410407, 396167, 376660, 380607, 378831, 386185, 415022, 390621, 358402, 355040, 346410, 371836, 391449, 362093, 376816, 391854, 394670, 406941, 439656, 463173, 465028, 427657, 456653, 471939, 467974, 421585, 407022, 451863, 455474, 478396, 457416, 437316, 398246, 410661, 427554, 433818, 461343, 448455, 433291, 476515, 492495, 498590, 505294, 480963, 509755, 556590, 525179, 494167, 493481, 494834, 455438, 447916, 460223, 443615, 465320, 454396, 412471, 432384, 462811, 470795, 446063, 440124]
15419D40124J3189P307L389O482k1726q083L1697K1809l5408l3132J6524K3776
15407D65948M0567j923p5271m8221K0244J3426Q020J4204j9525M0036K5618j5997
15395D67126m9243j2173K3921J1734L3852m045m0405m3189J3447K5384l147r096
15383D14166J1060j956J3428J9382j5327k1648j2664J3550K3443k6429j0428J7049
15371D23626j0459n570J7094O106j3858n477M5449K9298M1315L144l0030l1024
15359D69614P1081L3822l2497j5078k0363m391j7701k1553J5974M0299P282n740
15347E20749n675k8436o820O291M6866R33j065k3907n6905o443M5387L0174k3380
15334D97769J3222k6390L1314J4226M930k6309m0323l4467j0575j948M4680M1241
$$ y = [440124, 453313, 460620, 464009, 470491, 448765, 440682, 472379, 494188, 458780, 425648, 442172, 465948, 506515, 504592, 429321, 381100, 401344, 414770, 422790, 436994, 417469, 457505, 483123, 467126, 417883, 405710, 429631, 441365, 475217, 471172, 430767, 387578, 401025, 426409, 423262, 414166, 425226, 423270, 436698, 456080, 440753, 419105, 406441, 419991, 443434, 417005, 406577, 423626, 413167, 407597, 424691, 430797, 416939, 411462, 456911, 486209, 527524, 530668, 500638, 469614, 540695, 574517, 542020, 526942, 506579, 502188, 484487, 462934, 478908, 519207, 526489, 520749, 515074, 486638, 479818, 486109, 532975, 533908, 532843, 508936, 452031, 445588, 490975, 521149, 497769, 510991, 484601, 515915, 530141, 535071, 508762, 468439, 433972, 423397, 421449, 466129, 507370]
15322E07370k13l9810J5768n4103j8936J3131K6832l4813O699P049M1531L1935
15310E02440l4304j047j5921o069p571N8014l58j2254p765j5775J6785p586J9018
15297D87607M2966q642m7015k6046J8542J6001j5588l4112p404K5949n146M0879
15285D87991M215r198K1481K5233O528n2077l5892L0712L1598L6659J8365N82
15273E66197m0466K7085j065m9936M2887K7394p750j2223l0610k1208R523m3558
15261D66270J7413K5576K7572k0062K8224O872o164j7494l4631Q337J0448l6239
15249D76122J1860M3376K9181j842p952N013l2736K2324M9508M847l238j8354
15237E78109K701k3028l3125m6552k3648N1209O71J3573O7228P361j7676q629
$$ y = [507370, 507157, 467347, 483115, 429012, 410076, 423207, 450039, 415226, 421925, 428974, 470505, 502440, 468136, 467089, 451168, 445099, 437528, 495542, 495184, 482930, 475165, 459390, 476175, 468589, 487607, 530573, 521931, 474916, 448870, 467412, 483413, 467825, 433713, 426309, 452258, 447112, 487991, 492206, 483008, 504489, 529722, 536250, 484173, 448281, 478993, 510591, 547250, 565615, 566197, 525731, 552816, 551751, 501815, 544702, 572096, 564346, 552123, 521513, 500305, 509828, 466270, 483683, 509259, 536831, 516769, 544993, 551865, 545701, 528207, 493576, 501913, 512361, 476122, 487982, 531358, 560539, 558697, 550745, 555758, 523022, 545346, 594854, 599701, 596463, 578109, 580810, 557782, 524657, 478105, 454457, 505666, 506337, 519910, 587138, 594499, 576823, 568194]
15225E68194j4039k5741L6707P0300n332l7944J4346j0509l8802j2668R602Q203
15213E62317N4703O7916o454q0753k0509j2788o1003o010j4424q154K4725J2033
15201E11599K0924J2448K0493L8760k0475l9472P749m604j0471q699N71J22r955
15188E18990o074K8174l030N301K25K075j3363j450K7086L9192K2779L615k5516
15175E98004l7600k2652K4698M6680k4951m0272N920K5691l935k1670m6775l7350
15163D65788L63J0541J1441k562L8893K8434l419j8598N8419L4985j1047m4842
15151E68396J7835J1819o045J5090j3253k2631K5182L2051J9605o381m6301j8084
15139E77283J5547L6366p874r107j4707j2842k1144k971K5723L4053J1673Q273
$$ y = [568194, 554155, 528414, 565121, 635421, 630089, 592145, 606491, 595982, 557180, 544512, 554114, 562317, 617020, 684936, 678482, 597729, 577220, 564432, 503429, 497419, 482995, 474841, 499566, 511599, 532523, 544971, 565464, 604224, 583749, 544277, 552026, 547422, 536951, 528252, 528823, 528945, 518990, 512916, 541090, 538060, 543361, 543586, 545661, 532298, 530848, 557934, 597126, 619905, 623520, 598004, 560404, 537752, 562450, 609130, 584179, 543907, 549827, 575518, 571583, 549913, 503138, 465788, 466151, 476692, 488133, 485571, 524464, 552898, 549479, 530881, 589300, 624285, 613238, 568396, 586231, 598050, 592005, 607095, 593842, 571211, 596393, 628444, 648049, 641668, 595367, 577283, 592830, 629196, 621322, 612215, 597508, 584666, 563522, 560551, 586274, 620327, 632000, 640273]
15127F40273q490l4715k8969P268L2994o143k4563m0434q681L2355L696J8341
15115E82932M8213j1510l9195l5220K3602J2360p319J9634j5407M998n93m4460
15103E38035l1568q56J4011J4330J06356J5954n786P046m2111j4669K173m70L6134
15090F38579L0449J3182j1837J872j9959J4175r01n5350n310K4565m623k6677
15078E98165l349k727K7401Q559k7314q399J5308k1011l221K1088k9848J2163
15066E86815L418K8875M6953k724j7579j6613M817j9551J3025R341K2146J2915
15054F71838K4384L156m9942q9259k1871K7548L9396K9337J9167n733p499j5499
15042F25023L68j6601l0208Q527L1304J8971L694k013j459r752K41l4128q283
$$ y = [640273, 631783, 597068, 568099, 575367, 608361, 602218, 577655, 537221, 528540, 560895, 564591, 582932, 631145, 619635, 580440, 545220, 568822, 581182, 573863, 593497, 578090, 583088, 582495, 538035, 506467, 505611, 519622, 533952, 640308, 656262, 650476, 657522, 615411, 600742, 602915, 602445, 638579, 669028, 682210, 670373, 672245, 652286, 666461, 665560, 610210, 604900, 629465, 624842, 598165, 594816, 592089, 619490, 628049, 600735, 592336, 607644, 586633, 583412, 604500, 574652, 586815, 590233, 619108, 666061, 663337, 645758, 629145, 633962, 614411, 627436, 636777, 658923, 671838, 696222, 699378, 649436, 560177, 538306, 565854, 605250, 634587, 653754, 648021, 640522, 625023, 625391, 608790, 578582, 587109, 618413, 637384, 641078, 639065, 637606, 627854, 628095, 593967, 585684]
15029E85684j0177r877j552J1611K6944J6592n458J7501P217j1430J013j0021
15017F18047K4301K4425l2501k895K2658j2247m168K871l1261J6788Q382q131
15005F26269k4768k5896J5297O1727J7406J5987Q996k3482l2771l4428o3864J9225
14993E59698N3459N0734k6072k3900j9221j7392K3565J8859k4882J3409J148M2527
14981F51932L6266R837j6168k5279K7025j2081L4891Q12k6877o913L8146J9561
14969G31152K7131m0411k124K661l0875j8425N5317J0750j9022n2962n0542M982
14957F17632J7044L4802J7624k91l5074J357J214m094N993K2719R304R996J7224
14944G15450J2533j3048k2111j5042L241O427k0705J7666J937J3347K9091j3101
$$ y = [585684, 575507, 565630, 564078, 575689, 602633, 619225, 613767, 631268, 638485, 627055, 628068, 618047, 642348, 666773, 634272, 631377, 654035, 641788, 637620, 640491, 609230, 626018, 634400, 626269, 601501, 575605, 590902, 652629, 670035, 686022, 695018, 671536, 638765, 604337, 540473, 559698, 613157, 663891, 637819, 613919, 594698, 577306, 600871, 619730, 594848, 608257, 609405, 651932, 688198, 698035, 681867, 656588, 683613, 671532, 706423, 707235, 680358, 673445, 711591, 731152, 758283, 717872, 715748, 718409, 687534, 669109, 724426, 735176, 716154, 663192, 612650, 617632, 634676, 669478, 687102, 686811, 651737, 653094, 654308, 650214, 656207, 678926, 688230, 698226, 715450, 727983, 714935, 692824, 677782, 681023, 687450, 666745, 684411, 686348, 699695, 728786, 715685]
14932G15685k9139l3763k9012J6274J6760M470L8909o282l391j3287k651L8326
14920G12899J7929K642j1474L3528N165k6505K02k4939R473N391l7985j3849K0067
14907F92544K4689N456m941j4262r974J2784K519k0610J0144L0868N8111L690
14895G91018m5713l2617j4906J4342j3447K6269N514r088j2476j5888k6027P175
14883F74156L1532j2432J8522P688j9412L1629k8405J4860L7019m704L390k9484
14871G24359k6375k8847k6356J0660J0700O0378M2879o936q38J1234j3833n040
14859G51985M848O59k8966q817K068L4292J0412l1110k5364J5710j3020J3261
14847G25958k4040J0604K2830J9993j4291p494j5150P368K4640L8384Q249m7562
$$ y = [715685, 686546, 652783, 623771, 640045, 656805, 661275, 700184, 693902, 690511, 677224, 674573, 712899, 730828, 733470, 721996, 755524, 760689, 734184, 734386, 709447, 718920, 724311, 686326, 672477, 692544, 717233, 722689, 717748, 703486, 693512, 706296, 708815, 688205, 698349, 729217, 787328, 791018, 745305, 712688, 697782, 712124, 698677, 724946, 730460, 721372, 708896, 693008, 666981, 674156, 705688, 693256, 711778, 719466, 700054, 731683, 703278, 718138, 755157, 750453, 753843, 724359, 697984, 669137, 642781, 653441, 664141, 724519, 767398, 760462, 759624, 770858, 757025, 751985, 756833, 757492, 728526, 719709, 721777, 756069, 766481, 735371, 710007, 725717, 712697, 725958, 701918, 712522, 735352, 755345, 741054, 733560, 718410, 725778, 750418, 788802, 797051, 749489]
14835G49489k174L4600M4327J2510m6549m3211k1612j0988L845P996J6069K0958
14823G65260j4373J0156L1371m1405k8052P896q462j3148J8496K3540K7901n755
14811G73425K1573L6621J2120l3261m0095M107O800r29j0229o335M162J1025L4133
14798H13117J928j3200j7603j7695j4190q777j0644p766L9871K9674k190p393
14786G85132k66r646k8147O986L0749L1537j7060r729j138J332l7188J5561L0432
14773G98555j486q812j9954m9030j553P496L2427J4732n822l195M200k3796o939
14760G36823Q16L4241J2837K1087J6376j7555k5823p960k8337K4975N9054K0071
14748H46605k1226m3360n892Q001K661l005j7982k487j2574J3775L5823K3832
$$ y = [749489, 747315, 781915, 826242, 838752, 792203, 748992, 727380, 716392, 720237, 728233, 744302, 765260, 750887, 761043, 792414, 751009, 722957, 730853, 722391, 709243, 727739, 751279, 779180, 773425, 794998, 831619, 843739, 810478, 770383, 774490, 781290, 780361, 770132, 763797, 767959, 778984, 813117, 815045, 801845, 784242, 766547, 752357, 743580, 732936, 725170, 765041, 794715, 792525, 785132, 784866, 775220, 747073, 754059, 784808, 816345, 799285, 789556, 788418, 789750, 752562, 768123, 798555, 797069, 788257, 768303, 719273, 717720, 725216, 757643, 772375, 766553, 763358, 767558, 743762, 736823, 737639, 771880, 784717, 805804, 822180, 804625, 778802, 770842, 742505, 767480, 826534, 846605, 825379, 782019, 776127, 784128, 786789, 783784, 765802, 763315, 750741, 764516, 800339, 824171]
14736H24171K3469J3204o875j167k8626k5033l0755o330J6344m683O072J6067
14724G95858L2793L4509K5657O080k5549j7799N89K143L2472j4308j6160K668
14712H58953n161j7795j1089k7477P209m883L0352L6171J1490P499M123k6379
14700H63013k7756k618L5196j74m7128j1635M9127o59l0038j5011j9626L66l246
14687G89811L4052O4925o340k5618k8081K0677M2661k3742m9256K1m0094q556
14675G70460J9583M7868L2324J5019j4138P446J9421k3511p1509l1107M202K4536
14663H00594l1591o637J9584M9091K4231R037j0941N213k0992l1207N774J5388
14651H27544j2047Q201k1458m0575R886M1688R39K1707N1084K3389m296j6897
$$ y = [824171, 847640, 860844, 853969, 852802, 824176, 799143, 768388, 762058, 778402, 773719, 779791, 795858, 828651, 863160, 888817, 894897, 869348, 851549, 852138, 854281, 886753, 872445, 856285, 858953, 853792, 835997, 824908, 797431, 804640, 799757, 830109, 866280, 877770, 885269, 889392, 863013, 835257, 832639, 867835, 867661, 820533, 808898, 858025, 857366, 827328, 812317, 792691, 793057, 789811, 823863, 888788, 882448, 856830, 828749, 849426, 892087, 868345, 819089, 819110, 779016, 770460, 790043, 837911, 870235, 885254, 871116, 878562, 897983, 874472, 802963, 771856, 776058, 800594, 769003, 762366, 781950, 831041, 855272, 864309, 853368, 858581, 837589, 806382, 812156, 827544, 815497, 823698, 802240, 761665, 771551, 813239, 814178, 835885, 886969, 910358, 906062, 889165]
14639H89165k9138L8237l854j6390m4283M8143J8726K5624l0554j1695J863J0655
14627H96499N361r557j3297j1101K7184K8151j7888o034J1687j0890m4476J0222
14615H65861j5677K2029J6195J4037J0824L3289M922k3541k3949o078l785K6647
14603I20774k6967l7711K6502K3370K8197P443j8305m2290m5346M45O9814M4917
14591I50843k4436P175j123j7329m19k1278M0558Q968m1448j5643K5186n969L9502
14578I44587q444k6342K3933j360l3969J4202L2355M5159k3876l3661o037M6108
14566I72655o474k3216j3761P574L3743p019m587L196K75Q522k4681J0933k745
14553I54415j6805q395J6999L3024J9911m6969J6149Q295l3419l4779j6921J9790
$$ y = [889165, 860027, 898264, 894410, 878020, 833737, 881880, 900606, 926230, 895676, 883981, 885844, 896499, 901860, 892303, 879006, 867905, 895089, 923240, 905352, 899318, 911005, 900115, 855639, 865861, 850184, 872213, 888408, 902445, 913269, 946558, 951480, 927939, 903990, 897912, 894127, 920774, 893807, 856096, 882598, 905968, 934165, 941608, 923303, 881013, 835667, 836112, 905926, 950843, 926407, 933582, 932459, 915130, 914711, 893433, 933991, 942959, 901511, 885868, 911054, 905085, 944587, 936143, 909801, 933734, 932374, 898405, 912607, 944962, 990121, 966245, 932584, 926547, 972655, 966181, 942965, 929204, 936778, 970521, 963502, 958915, 962111, 962386, 970908, 946227, 957160, 954415, 937610, 929215, 946214, 979238, 999149, 952180, 968329, 976624, 943205, 908426, 891505, 911295]
14541I11295M3153J793P92q627k818j7415M421L807J150o3318m8591j3302M8140
14528H60480P7093N1376L892l2565l3081o297J6729k2692J8859M9803K2064J1154
14516A016815l4161m7199l4509L878L5206L9036j500L1525l418k2552j5517O698
14504I74302J9997j7991j7206K2636J8699L067o998K2531l419j1000J6151j6304
14492A004465m7683M176L5620K6948j5846l8971j7978J824j1521j4051M7935K6523
14480A001441k8532l824L4625M9474m633j7296j1937j6057r104K5647j2394l4126
14468I73284K2255J1171k310o3915l2454j5901N1788O4310J0389R052j0415m1050
14456I76204k073l251K0159r587k5836k1246M1513N4744J6375j1238j2779l0842
$$ y = [911295, 954448, 956241, 957033, 948406, 945588, 928173, 932594, 936401, 937551, 874233, 825642, 812340, 860480, 937573, 988949, 992841, 960276, 927195, 920898, 937627, 914935, 933794, 983597, 1005661, 1016815, 982654, 935455, 900946, 904824, 940030, 979066, 977566, 1009091, 1005673, 983121, 967604, 974302, 994299, 976308, 959102, 981738, 1000437, 1003504, 996506, 1019037, 1015618, 1004618, 1020769, 1004465, 956782, 960958, 996578, 1023526, 1007680, 968709, 950731, 952555, 941034, 926983, 974918, 1001441, 972909, 969085, 1003710, 1053184, 1048551, 1031255, 1019318, 1003261, 994157, 1019804, 1007410, 973284, 995539, 1006710, 1004400, 940485, 908031, 892130, 943918, 1008228, 1018617, 1027669, 1017254, 976204, 974131, 970880, 991039, 981452, 955616, 934370, 975883, 1030627, 1047002, 1035764, 1022985, 992143]
14444I92143J7032K7494K5926p394k1366m0222K3500j24j4911k7582k258P184
14432I79422k7840K3111m824l3449J3247J9065k014L3363M4611J1924r430j7394
14420A029792Q074K5822K4258l4627m6278P667M0593L1018K6193j0110j300L506
14408A104608n0462k1018K1876J881p527K3594j1377l159n3155j5018J7502K2408
14396A030153L7418L0596l711L3886j4104n7674n2784j3858J3064O592J5407j729
14384A023256J3976j9757j0589O765K84j8474o928J7363J7660K2630K6744J6076
14372A089006j0377k2023J4235J1582K2223M130k0606J3673j4632j8404K47j5856
14360A053198m9645L2495M4159K467l2512j1034J694k4046J0460J9687j3654J227
$$ y = [992143, 1009175, 1036669, 1062595, 1055201, 1033835, 993613, 1017113, 1016989, 1002078, 974496, 972238, 979422, 951582, 974693, 969869, 936420, 949667, 968732, 966718, 1000081, 1044692, 1056616, 1047186, 1029792, 1037866, 1063688, 1087946, 1053319, 1007041, 1014708, 1055301, 1086319, 1112512, 1102402, 1101102, 1104608, 1054146, 1033128, 1055004, 1056885, 1049358, 1072952, 1061575, 1058416, 1005261, 990243, 1007745, 1030153, 1067571, 1098167, 1094456, 1128342, 1114238, 1056564, 1003780, 989922, 1002986, 1009578, 1024985, 1023256, 1037232, 1017475, 1006886, 1013651, 1013935, 995461, 988533, 1005896, 1023556, 1046186, 1072930, 1089006, 1078629, 1056606, 1070841, 1082423, 1104646, 1108776, 1088170, 1101843, 1087211, 1068807, 1069054, 1053198, 1003553, 1036048, 1080207, 1082674, 1050162, 1039128, 1040822, 1016776, 1027236, 1046923, 1033269, 1034496]
14348A034496l2993k9677L3391N8829J6574k4444R793j0425J7382R481P148J6236
14336A105791k845K1728n951m0161N749j3952n597K2691M7704R128p166j5657
14324A121462k6414K2231L7432J3717n976n940K0534o3437k6200J8771J4257L2035
14312A152472N6472K8452k1251j6490j1288l9948j7518j672J4687l4850j3105
14301A095961J7284j4318J3324L6378O040l867k6563k9409Q160P108j887K1581
14289A129792j5576k0196J3935M461J3371K0328O073j0190l7251k4270J760J1724
14277A093961N992M6523N6951k5434j7824N078M845K9299n2129m8126j5824K4726
14265A108038j4141j2813N0685l874q720K9185J7034K7560J3601k8598N550k4521
$$ y = [1034496, 1001503, 971826, 1005217, 1064046, 1080620, 1056176, 1065969, 1055544, 1072926, 1082407, 1089555, 1105791, 1102946, 1124674, 1118723, 1078562, 1084311, 1070359, 1064762, 1087453, 1135157, 1144285, 1137119, 1121462, 1095048, 1117279, 1154711, 1168428, 1162452, 1156512, 1177046, 1113609, 1087409, 1106180, 1120437, 1152472, 1208944, 1237396, 1216145, 1199655, 1188367, 1148419, 1130901, 1129229, 1143916, 1109066, 1095961, 1113245, 1098927, 1112251, 1148629, 1154669, 1150802, 1124239, 1094830, 1102990, 1110098, 1108211, 1129792, 1114216, 1094020, 1107955, 1112416, 1125787, 1146115, 1152188, 1141998, 1104747, 1080477, 1082237, 1093961, 1099953, 1146476, 1203427, 1177993, 1160169, 1165247, 1170092, 1199391, 1147262, 1099136, 1083312, 1108038, 1093897, 1081084, 1131769, 1127895, 1119175, 1148360, 1165394, 1192954, 1206555, 1177957, 1183507, 1158986]
14253A158986k8281K7059L7891N571q827K1964K8813k6529j0905j3361j6176K9818
14241A206023j6272j1931k1938Q491J3229L0341M4649k4228K967l6671o7226k9002
14229A098432K7739K4799K8924K7792K5463k2607l6101j2303j6984K6263l490
14218A167927L7388L3526j9914j5237o091m0869k4413j8378j0157M738K7810K0528
14206A156858M2372J3226l6765N128J834P030P727N241J8006J8468k241j2449
14194A224435M978J2943l369p815q378J0777j5697J1145j066L2205L3575P60j6823
14181A277670j4279m5335l0118k0300k0607L0370M6103k247k7036N2241M8534
14170A294996J1334k9589l5001p770P239l744l2864L7912J5617j6139J5361N2660
$$ y = [1158986, 1130705, 1157764, 1195655, 1201226, 1192399, 1214363, 1243176, 1216647, 1205742, 1192381, 1176205, 1206023, 1189751, 1177820, 1155882, 1164373, 1177602, 1207943, 1252592, 1228364, 1231331, 1194660, 1127434, 1098432, 1126171, 1150970, 1179894, 1207686, 1233149, 1210542, 1174441, 1162138, 1145154, 1171417, 1167927, 1205315, 1238841, 1218927, 1203690, 1197599, 1156730, 1132317, 1113939, 1103782, 1108520, 1136330, 1156858, 1199230, 1212456, 1175691, 1180819, 1182653, 1189683, 1197410, 1202651, 1220657, 1239125, 1236884, 1224435, 1229413, 1242356, 1238987, 1231172, 1222794, 1233571, 1217874, 1229019, 1227953, 1260158, 1293733, 1294493, 1277670, 1263391, 1218056, 1187938, 1167638, 1147031, 1177401, 1223504, 1221257, 1194221, 1246462, 1294996, 1306330, 1276741, 1241740, 1233970, 1241209, 1237465, 1204601, 1242513, 1258130, 1241991, 1257352, 1310012]
14158A310012O014j8370j7652n4725P62K7552l1880k640L1379m3394n918L7725
14146A238865J5364m5947o585n417P156M6944J9254l135J5374K1078R638J5679
14134A328268p277K642J4683J1006M380n1711J5935M2572J4330K4185J9656L145
14122A421814o1645o4463N903K5965m9766j3109J8327K0951K7513k1939k3326
14111A286225L8814L3811K7514j3750p2279r356J2044k9419L982K0087M6374J2438
14099A356485P033P836k8788J545q364L4351J2637j0003k3289k4543J5692L6421
14087A377013o228j6104m2185J0842n889l1100K3146p602J3780L0399P260L177
14075A356509j7164M476m5175j9325L5774L6683K8375J4031p851j0490L1335l946
$$ y = [1310012, 1316026, 1297656, 1280004, 1225279, 1226041, 1253593, 1221713, 1219073, 1250452, 1207058, 1201140, 1238865, 1254229, 1208282, 1201697, 1196280, 1203436, 1250380, 1269634, 1266499, 1281873, 1302951, 1312589, 1328268, 1320991, 1323633, 1338316, 1349322, 1353702, 1301991, 1317926, 1360498, 1374828, 1399013, 1418669, 1421814, 1360169, 1295706, 1301609, 1327574, 1277808, 1264699, 1283026, 1303977, 1331490, 1309551, 1286225, 1325039, 1358850, 1386364, 1372614, 1300335, 1290979, 1303023, 1273604, 1277586, 1297673, 1344047, 1356485, 1363518, 1371354, 1342566, 1344111, 1335747, 1370098, 1382735, 1372732, 1349443, 1324900, 1340592, 1377013, 1370785, 1354681, 1312496, 1323338, 1317449, 1286349, 1309495, 1301893, 1315673, 1346072, 1353332, 1356509, 1339345, 1343821, 1298646, 1279321, 1315095, 1351778, 1380153, 1394184, 1386333, 1375843, 1407178, 1403232]
14063A403232p233l2354K5016K5886j6848m0642j445j7139J8553K0738R351m0787
14051A346328j0726L6155L6275j6258n240P504m0685k1563J4332j9914k070N1644
14039A375782J7994L001j85q2017j6608O0747K0643K1951K1873r357Q395p010
14027A415209j4134k6022N130J3466l8877r616K3529J1878J7121p271p631N9375
14015A442157K0986j113N714p07j5620r731o384p420m660K1481m9101p219K2246
14002A410629J7303J6989l510k6146k0189k5083l991j0335R380L6377j411J9425
13990A419438K1574Q4413K2996m8346k6501n2649l5422O141M6304M3472J8595
13979A500015r838q956J7521J7802m80L857k9810J5904L2324L024l7456N826m026
$$ y = [1403232, 1395999, 1363645, 1388661, 1414547, 1397699, 1357057, 1355612, 1338473, 1357026, 1377764, 1387115, 1346328, 1335602, 1371757, 1408032, 1391774, 1386534, 1394038, 1353353, 1331790, 1346122, 1326208, 1324138, 1375782, 1393776, 1396777, 1396592, 1314575, 1297967, 1358714, 1379357, 1401308, 1423181, 1413824, 1422219, 1415209, 1401075, 1375053, 1380183, 1393649, 1354772, 1345156, 1368685, 1380563, 1397684, 1390413, 1382782, 1442157, 1463143, 1462030, 1467744, 1467037, 1451417, 1441686, 1435302, 1427882, 1423222, 1444703, 1395602, 1388383, 1410629, 1427932, 1444921, 1441411, 1415265, 1395076, 1369993, 1366002, 1355667, 1365047, 1401424, 1400013, 1419438, 1441012, 1525425, 1548421, 1500075, 1473574, 1420925, 1385503, 1391644, 1437948, 1481420, 1500015, 1490177, 1481221, 1498742, 1516544, 1516064, 1519921, 1490111, 1506015, 1538339, 1541363, 1503907, 1509733, 1505707]
13966A505707L2450L1728l3362m0252j8907K8807K2076j0668o501l6231J3941
13955A488788k299Q662L0225L62K7175K6139R024m3792j016N764l034k7914l8615
13942A479469J285N3312K0463j3236k7174j939k3927m326K2284K9802K8736m5184
13930A519565m0595L2016K6722N055L317k8381K4538M3711j8049l2807K9311K5962
13918A590365k4953j6275l453J4490K9408n881l5677R536m7899j6656K39K3230
13906A516474M996P400J141m059K790K4481r098n314K5866L3654K5489P791m8481
13893A583130n380J9780k1470j493J1617L443o691m6171k0241j7929r404K3043
13881A512234K1916M4891r948l5503K2012L5423J0813q086k9464k4916Q2470L9080
$$ y = [1505707, 1538157, 1569885, 1536523, 1496271, 1477364, 1506171, 1528247, 1517579, 1511078, 1474847, 1488788, 1486489, 1495151, 1525376, 1525738, 1552913, 1579052, 1588076, 1544284, 1543268, 1549032, 1545998, 1518084, 1479469, 1480754, 1534066, 1554529, 1541293, 1514119, 1512180, 1488253, 1483927, 1506211, 1536013, 1564749, 1519565, 1478970, 1510986, 1537708, 1542763, 1546080, 1517699, 1542237, 1585948, 1567899, 1535092, 1564403, 1590365, 1565412, 1549137, 1545684, 1560174, 1589582, 1583701, 1548024, 1557560, 1509661, 1493005, 1493244, 1516474, 1521470, 1528870, 1530011, 1525952, 1528742, 1553223, 1544125, 1538811, 1564677, 1598331, 1623820, 1631611, 1583130, 1577750, 1597530, 1576060, 1574567, 1586184, 1589627, 1582936, 1536765, 1516524, 1498595, 1489191, 1512234, 1534150, 1579041, 1569093, 1533590, 1555602, 1591025, 1601838, 1593752, 1564288, 1539372, 1621842, 1660922]
13869A660922l9986N907J4982j3026j0111J8632k4270n618P994J5151K5305o591
13857A649291k0109J7801O765k7730j1521K1838j2823P927J3724j5249J9805m223
13845A645496M39J3999K4624P085L473J1505J0013J393l9676j4514k931n5007
13833A605899j9245P0608J9457m2456l5988K5556M8109J7692M3668N0456p893
13822A775863l3483n4081j8893j7552Q713P410R37L871j3334m5352K6777j0192
13810A630684j8847l83K6884L0119p25K7764M926l704k2353m3958j1901O0908
13798A679414L1150P397J9453J545l194N1405K2250J5312Jp5519k4043J7779j5804
13785A727146J3256K0117j8488j8719Q352J2579M5810j5023K72R817K6069J5369
$$ y = [1660922, 1620936, 1626843, 1641825, 1628799, 1618688, 1637320, 1613050, 1607432, 1615426, 1630577, 1655882, 1649291, 1629182, 1646983, 1653748, 1626018, 1614497, 1636335, 1623512, 1631439, 1645163, 1629914, 1649719, 1645496, 1645935, 1659934, 1684558, 1691643, 1695116, 1706621, 1716634, 1718027, 1678351, 1663837, 1660906, 1605899, 1586654, 1657262, 1676719, 1634263, 1598275, 1623831, 1671940, 1689632, 1733300, 1783756, 1775863, 1742380, 1688299, 1669406, 1651854, 1660567, 1667977, 1668914, 1672785, 1659451, 1614099, 1640876, 1630684, 1611837, 1611454, 1638338, 1668457, 1667732, 1695496, 1700422, 1696718, 1674365, 1630407, 1618506, 1679414, 1710564, 1717961, 1737414, 1738959, 1735765, 1787170, 1809420, 1824732, 1824733, 1749214, 1725171, 1742950, 1727146, 1740402, 1760519, 1742031, 1723312, 1731664, 1744243, 1790053, 1775030, 1775302, 1785119, 1811188, 1826557]
13773A826557m0895n1362P039r018m9137K8804M7303J1418J0791l0784m5754j0276
13761A694686K3516N5851M3298J0356J7985k2989k5811n273k1909r776K2386k1368
13749A760952J9099L6272Q603j9872k5248j6363L8950j61l478P023J4868J1196
13737A831841J6518n077l7699n782L5005O709l4177J3479K1380J5857k0488j8171
13725A819395J0591n000K6020q04K2692J1590J7573k467j5237M2917J126l0092
13713A898304P549J3961j7885j6406M498j803Q4M2546K1301k2262k9083J6346
13701A917150l7k1752l1556J5526J8593K367J0387o689K8372m7189k2828J2780
13689A875124J1145M0826M2302K2679j879j1449k0365o732K8544J2522k6765j6154
$$ y = [1826557, 1785662, 1734300, 1741339, 1732321, 1683184, 1711988, 1759291, 1770709, 1781500, 1750716, 1704962, 1694686, 1718202, 1774053, 1817351, 1827707, 1845692, 1822703, 1796892, 1791619, 1769710, 1759934, 1782320, 1760952, 1780051, 1816323, 1824926, 1805054, 1779806, 1763443, 1802393, 1802232, 1798754, 1805777, 1820645, 1831841, 1848359, 1843282, 1805583, 1799801, 1834806, 1841515, 1807338, 1820817, 1842197, 1858054, 1837566, 1819395, 1829986, 1824986, 1851006, 1850202, 1872894, 1884484, 1902057, 1899590, 1884353, 1927270, 1928396, 1898304, 1905853, 1919814, 1901929, 1885523, 1890021, 1888218, 1888302, 1930848, 1952149, 1929887, 1900804, 1917150, 1917113, 1895361, 1863805, 1879331, 1897924, 1900291, 1910678, 1903989, 1932361, 1885172, 1862344, 1875124, 1886269, 1927095, 1969397, 1992076, 1990197, 1978748, 1958383, 1951651, 1980195, 1992717, 1965952, 1949798]
13677A949798N841j6846K0928K3376R236K984K315K9596l6234m9286j9599j4452
13665A907657J0601N189L7956J4197O166k1221j443M629k451j1833K4543O153
13653A980143P062N418k6312M3201K1993o8342n0744n474M2118K2578N1500O0011
13641B083152l1529o9691n068j713r540M9206J0746r59J3243J3446k866j0759
13629B037668l9225k8666j154L9030L7368K1760l6323N8266M1880o8505o2539
13618A999560K2624p341m052K9459J4461L7913K5565j0991J3720K544m8655K1602
13606B096409J8935K4844n857M490P957n271j7529j7571L9770j7341k0891J1623
13594B119568o276P857l14J6502J5744J0897N757K6821m745j7190l4316m6922
$$ y = [1949798, 1955639, 1938793, 1959721, 1983097, 1992333, 1995317, 1997632, 2027228, 1990994, 1941708, 1922109, 1907657, 1918258, 1923447, 1961403, 1975600, 1981766, 1960545, 1959102, 1963731, 1961280, 1949447, 1973990, 1980143, 1987205, 1992623, 1966311, 2009512, 2031505, 1963163, 1912419, 1906945, 1949063, 1971641, 2023141, 2083152, 2051623, 1981932, 1976864, 1975151, 1965611, 2014817, 2025563, 2024604, 2037847, 2051293, 2048427, 2037668, 1998443, 1969777, 1968623, 2007653, 2045021, 2066781, 2030458, 2088724, 2130604, 2062099, 1999560, 2022184, 2014843, 2010791, 2040250, 2054711, 2092624, 2118189, 2107198, 2120918, 2123462, 2074807, 2096409, 2115344, 2140188, 2134331, 2138821, 2146778, 2141507, 2123978, 2106407, 2146177, 2128836, 2107945, 2119568, 2113292, 2121149, 2120835, 2137337, 2153081, 2163978, 2169735, 2196556, 2191811, 2174621, 2140305, 2093383]
13582B093383m925j7308L9643J0053k5331K2938J7916J8723n502N105k5107j6605
13570B112983K5276k2059L7872L2713L4740q814k1326l4410P872J5061M717L453
13558B188078j5330l5392r703q159j528j2003J1876L0064M0554p408K8636M1368
13546B251053K5064m548o601J6798l7194K2437L5535p898K1218k3799m2556N477
13534B254986J3948M3202j9401j3275j9451k5882L221l788j2285O3834J8694M5235
13522B349038L685n54L2333M058l5317j3635K3143j0348J3775K2848M882l3522
13510B360386k1117J98J1093M6276L3291k5381n888J9784K4306j5322j395k0184
13498B406047r082J656J5047m3621k406O254q88k4875K4766L4830j5481j9533
$$ y = [2093383, 2088458, 2071150, 2110793, 2120846, 2095515, 2118453, 2136369, 2155092, 2149590, 2154695, 2129588, 2112983, 2138259, 2116200, 2154072, 2186785, 2221525, 2212711, 2191385, 2156975, 2164847, 2179908, 2184625, 2188078, 2172748, 2137356, 2127653, 2119494, 2117966, 2105963, 2117839, 2147903, 2188457, 2181049, 2209685, 2251053, 2276117, 2271569, 2264968, 2281766, 2244572, 2267009, 2302544, 2294646, 2315864, 2292065, 2249509, 2254986, 2268934, 2312136, 2292735, 2279460, 2260009, 2234127, 2237348, 2233560, 2221275, 2285109, 2303803, 2349038, 2352723, 2352169, 2384502, 2388560, 2353243, 2339608, 2362751, 2352403, 2366178, 2389026, 2393908, 2360386, 2339269, 2339467, 2350560, 2396836, 2430127, 2404746, 2398858, 2418642, 2442948, 2427626, 2426231, 2406047, 2396965, 2398621, 2413668, 2370047, 2367641, 2373895, 2373007, 2348132, 2372898, 2407728, 2392247, 2372714]
13486B372714J8305K2126l31Q547M2950J8221j7180k2611K2034j7336K2105L0369
13474B499913J5258j5988J1837K237J232K48J4975j0404J9944J3277m6237j385
13462B504907K5074J5632K1677J5J2176j5095j5588J7130k3410J9847J7219l40
13450B579244l0961j7133J1367J1162J3849j9733j3093M871J9943L1844L0315
13439B621675m8715k8108n838L4918j302j3793j509L9698R675o011M2534m182
13427B639042k494O662o295q847k457L5025J0868j4101L1003J660m0308k6434
13415B623324L0065M5473K4116j8273o5220j4483O0960M7852J4501l5695k2015
13404B690605R469j4304m0910J1408O8429J6646j1320J1590K6988L4608J6988
$$ y = [2372714, 2391019, 2413145, 2412814, 2421361, 2464311, 2482532, 2465352, 2442741, 2464775, 2447439, 2469544, 2499913, 2515171, 2499183, 2511020, 2513257, 2514489, 2514737, 2529712, 2519308, 2539252, 2552529, 2506292, 2504907, 2529981, 2545613, 2567290, 2567305, 2579481, 2564386, 2548798, 2565928, 2542518, 2562365, 2579584, 2579244, 2548283, 2531150, 2542517, 2553679, 2567528, 2547795, 2534702, 2539573, 2559516, 2591360, 2621675, 2572960, 2544852, 2539014, 2573932, 2572630, 2558837, 2557328, 2597026, 2606701, 2600690, 2643224, 2639042, 2636548, 2643210, 2636915, 2628068, 2625611, 2660636, 2671504, 2657403, 2688406, 2690066, 2649758, 2623324, 2653389, 2698862, 2722978, 2704705, 2639485, 2625002, 2685962, 2733814, 2748315, 2712620, 2690605, 2700074, 2685770, 2644860, 2656268, 2724697, 2741343, 2730023, 2741613, 2768601, 2803209, 2820197]
13393B820197m885j079k8141k9558L307L0179L0359j1405k2834l417l574j2433
13381B766716J7833L8606J2080N016O900J1723K01N7453R604j3671l6285r399
13369B866777j2308K2243j2686P490J6725N0780N4060N2188m0994l8808k8700
13358B936767K863N1787O228m3791q404n3028q828K8822K7004K4614K3097j3617
13346B973514j4563K400K0699L2029J3351J3028M8831J3842K3518o05p900k4585
13334C093559N308l5649M1014K877m4982m1689L3810M3362m642j6643K0150k1547
13322C074928q384K4336Q888J3273L6488k82r868Q281L717J8208k9093l930M6212
13309C182774N8479j3919l4192k4678J0679M6109K3916o660n494l121J7274L550
$$ y = [2820197, 2815312, 2814233, 2786092, 2756534, 2759841, 2790020, 2820379, 2808974, 2786140, 2782723, 2779149, 2766716, 2784549, 2823155, 2835235, 2840251, 2847151, 2858874, 2859075, 2916528, 2926132, 2912461, 2876176, 2866777, 2854469, 2876712, 2864026, 2871516, 2888241, 2939021, 2993081, 3045269, 3004275, 2965467, 2936767, 2939630, 2991417, 2997645, 2953854, 2945450, 2892422, 2883594, 2912416, 2939420, 2964034, 2987131, 2973514, 2958951, 2961351, 2982050, 3014079, 3027430, 3040458, 3089289, 3103131, 3126649, 3126044, 3118144, 3093559, 3098867, 3063218, 3104232, 3107109, 3062127, 3020438, 3054248, 3097610, 3092968, 3076325, 3096475, 3074928, 3066544, 3090880, 3099768, 3113041, 3149529, 3149247, 3139379, 3147660, 3151377, 3169585, 3140492, 3136562, 3182774, 3241253, 3227334, 3193142, 3168464, 3179143, 3225252, 3249168, 3242508, 3237014, 3233893, 3251167, 3254717]
13297C254717L6241J1016j0816J674J7552k768j0669M0046J77k2823N5715K8198
13285C398260j6980K204L4686O6338Q626Q711L8006J0788o054j3567j58L0116
13273C560976K3200K3043L1458J3865J0619N5267K7036L2733M9821P6579R4466
13262C999063J22535J29379J10785n311k65721n16463n14326l59784j94319o9420
13252B436418O3332P1465P8066J10463Q4112Q6306Q2993N5417O8388J1882k388
13241C146454k0622R73L4923M8752J1864J5208R487Q354M76O179J7811L799J4687
13228C298345L2710K4802M3567j809N675L8326R95p40J7862M6091J5102m67k6184
13215C494275Q926K8485J7689K6803K4149o705L9973L097K1910L241k4649o865
$$ y = [3254717, 3290958, 3301974, 3291158, 3292832, 3310384, 3307616, 3296947, 3336993, 3337170, 3314347, 3370062, 3398260, 3381280, 3383484, 3418170, 3484508, 3493134, 3501845, 3539851, 3550639, 3544585, 3531018, 3530860, 3560976, 3584176, 3607219, 3638677, 3652542, 3663161, 3718428, 3745464, 3778197, 3828018, 3904597, 3999063, 4121598, 4250977, 4361762, 4356451, 4090730, 3574267, 3059941, 2700157, 2505838, 2436418, 2499750, 2571215, 2649281, 2759744, 2843856, 2930162, 3013155, 3068572, 3136960, 3148842, 3146454, 3125832, 3126805, 3161728, 3210480, 3222344, 3237552, 3247039, 3255393, 3255869, 3262048, 3279859, 3283658, 3298345, 3331055, 3355857, 3399424, 3397615, 3403290, 3441616, 3442611, 3441871, 3459733, 3505824, 3520926, 3520459, 3494275, 3503201, 3531686, 3549375, 3576178, 3600327, 3593622, 3633595, 3636692, 3658602, 3661843, 3637194, 3630329]
13203C630329K7894J2766L3190K2352J787r720P375k098L5925J0196L17L4830
13191C805143J7676j7226j5896L47M0824l588J1676K1038K0133O934j0357N945
13179C882649N0634Q942J2122o211N590O631M7367K6916m409p2581k101L7373
13167C992922m188J2710M9007M222j0814J8690L9652L8007J4603L807j5425n4271
13155D088922j4703L0095M2498K5872j0461o459J8303K8145R205J7191M0854M4932
13143D314394L0788M981O380K2789p74Q377J0770J6151J2808k434l6232J2179
13131D400177J1178j362K886J8728j5824K4762L2254O015k23L305M825M0129K9652
13118D556502R323J4395M9757M2072k3889l9961L5947Q7111P0540M969r943Q753
$$ y = [3630329, 3658223, 3670989, 3704179, 3726531, 3728318, 3718598, 3725973, 3723875, 3759800, 3769996, 3770313, 3805143, 3822819, 3805593, 3789697, 3790044, 3830868, 3827280, 3838956, 3859994, 3880127, 3887061, 3876704, 3882649, 3933283, 3942225, 3954347, 3948136, 3953726, 3960357, 4007724, 4034640, 4030231, 3957650, 3955549, 3992922, 3988734, 4001444, 4050451, 4054673, 4043859, 4062549, 4102201, 4140208, 4154811, 4158618, 4143193, 4088922, 4074219, 4104314, 4146812, 4172684, 4162223, 4155764, 4174067, 4202212, 4211417, 4228608, 4269462, 4314394, 4345182, 4350163, 4356543, 4379332, 4378558, 4386935, 4397705, 4413856, 4426664, 4424230, 4387998, 4400177, 4411355, 4409993, 4412879, 4431607, 4415783, 4440545, 4472799, 4478814, 4478591, 4481896, 4486721, 4526850, 4556502, 4565825, 4580220, 4629977, 4672049, 4648160, 4608199, 4644146, 4731257, 4801797, 4806766, 4796823, 4805576]
13106D805576J9202K1971K4937K2160j7916j4168K2194j6924J1630Q2916M7736
13095E009314k0670j222K5014j5956l2072K3119R0087M2296J4737O412K862N972
13083E149893K3798j612L8636L2112J8347L6844M8183q106N2110Q366p6084n9764
13071E262723j2292J9039q678J3505J0973j4746j4638K8901L1046k324L5063Q7051
13059E435623M0974J158M262j7799K0449O7862M3097L0630n795j96J8842L1058
13047E670165J8879j3814K5167M8312N86L3968O4792O7385N7399L1101K0071J2146
13035F036157l3865J7471L8492J4080m048O401N1548N0883l2296M123K5242O8548
13023F242736P4388M4171K8348N781K6212M8490J9332M1591M5404K7471j575J0796
$$ y = [4805576, 4824778, 4846749, 4871686, 4893846, 4875930, 4861762, 4883956, 4867032, 4878662, 4961578, 5009314, 4988644, 4987422, 5012436, 4996480, 4964408, 4987527, 5077614, 5119910, 5134647, 5141059, 5143921, 5149893, 5173691, 5172079, 5210715, 5242827, 5261174, 5298018, 5346201, 5338095, 5390205, 5398571, 5322487, 5262723, 5250431, 5269470, 5260792, 5274297, 5285270, 5270524, 5255886, 5284787, 5315833, 5313509, 5348572, 5435623, 5476597, 5477755, 5482017, 5464218, 5484667, 5552529, 5595626, 5626256, 5620461, 5620265, 5639107, 5670165, 5689044, 5675230, 5700397, 5748709, 5749295, 5783263, 5848055, 5915440, 5972839, 6003940, 6024011, 6036157, 6002292, 6019763, 6058255, 6072335, 6068287, 6074688, 6126236, 6177119, 6144823, 6148946, 6174188, 6242736, 6317124, 6361295, 6389643, 6395424, 6421636, 6470126, 6489458, 6531049, 6576453, 6603924, 6602349, 6613145]
13011F613145L7733M8041O628r422r55N7896K6056K057J3742M648L4336L7068
12999F870973N8084O1336M4319O2311Q1767M5505M8824N5823M9997o420j4692
12988G357827K2119N4472L1199O3094M6479N0457L1829K0546J5636R5349N5181
12977G844188r46L7628O0808Q9454Q5767P7830Q8814O1452R440O6441P0886j2933
12965H478829k0872N11J4899M4533P7058M7369O2860R7310Q1640K8070O1136M4717
12953I018060P1908J11402N5018Q2805J37668J10904Q4268J5980p2178o3367j5905
12942I536563L3310N3519L1266l6216r475O7451J34970J32118J27613J38659P7229
12931A0287007J04581R1824N4774O9842R0082P4757J16489J39677M9437P3861
$$ y = [6613145, 6650878, 6698919, 6705547, 6696125, 6695170, 6753066, 6779122, 6781179, 6794921, 6799569, 6833905, 6870973, 6929057, 6990393, 7034712, 7097023, 7178790, 7224295, 7273119, 7328942, 7378939, 7372519, 7357827, 7379946, 7434418, 7465617, 7528711, 7575190, 7625647, 7657476, 7678022, 7693658, 7789007, 7844188, 7843242, 7880870, 7941678, 8031132, 8116899, 8194729, 8283543, 8344995, 8354435, 8420876, 8491762, 8478829, 8457957, 8458468, 8473367, 8517900, 8594958, 8642327, 8705187, 8802497, 8884137, 8912207, 8973343, 9018060, 9089968, 9201370, 9256388, 9339193, 9476861, 9587765, 9672033, 9688013, 9615835, 9552468, 9536563, 9569873, 9623392, 9654658, 9618442, 9608967, 9676418, 9811388, 9943506, 10071119, 10209778, 10287007, 10391588, 10483412, 10538186, 10608028, 10698110, 10772867, 10889356, 11029033, 11078470, 11152331]
12921A1152331J20000J21138P0408Q9227P2894J37870J33127R8262R8418J14235
12911A2207910J12072P8715J00996J19021J64793J88125J47726J81321J53634
12902A3454313J08767J09926J60421J68847J23271J52916J79223J94802J58579
12893A4811065J31044J18817J59960J85859J68445J64489K18987K21451K17146
12884A6397263K84222K45759J90162K21016K99909K87239K28120K31619K39744
12875A8625053K49352K74081L41803L58032L33449L57208M05484L78394L85770
12866B1708626M03565L72874M45129M74645M58114M66650N34969N22508N72699
12857B5959779N68905N67035O33309P15598P48890P71275P67680P52268Q03051
$$ y = [11152331, 11272331, 11393469, 11463877, 11553104, 11625998, 11763868, 11896995, 11995257, 12093675, 12207910, 12319982, 12398697, 12499693, 12618714, 12783507, 12971632, 13119358, 13300679, 13454313, 13563080, 13673006, 13833427, 14002274, 14125545, 14278461, 14457684, 14652486, 14811065, 14942109, 15060926, 15220886, 15406745, 15575190, 15739679, 15958666, 16180117, 16397263, 16681485, 16927244, 17117406, 17338422, 17638331, 17925570, 18153690, 18385309, 18625053, 18874405, 19148486, 19490289, 19848321, 20181770, 20538978, 20944462, 21322856, 21708626, 22112191, 22485065, 22930194, 23404839, 23862953, 24329603, 24864572, 25387080, 25959779, 26528684, 27095719, 27729028, 28444626, 29193516, 29964791, 30732471, 31484739, 32287790]
12848C2287790Q03521R52907J077054J190297J194379J275635J409623J483746
12840D1674952J543063J680243J837859K061528K292400K464128K671086K982054
12832E9207313L383994L812529M281957M756138N252103N780827O595313P875879
12824A00946053R606013J1592286J4207370J7664684K1608492K4148457J8044797
12817B17818152j2634834p0009082j12179351j06004967o8059474k8401965j328596
12810a80800117J1392487J5173555J4923318J3424162J1626099R855640Q301986
12803i6102870P050899O217633N644245N168352M597228M126507L698623L327029
12795e6272354K989645K678079K418501K233038K033921J875041J782803J628926
$$ y = [32287790, 33091311, 34044218, 35121272, 36311569, 37505948, 38781583, 40191206, 41674952, 43218015, 44898258, 46736117, 48797645, 51090045, 53554173, 56225259, 59207313, 62591307, 66403836, 70685793, 75441931, 80694034, 86474861, 93070174, 100946053, 110552066, 122144352, 136351722, 154016406, 175624898, 199773355, 217818152, 205183318, 135174236, 22994885, -83010082, -151069556, -179471521, -180800117, -169407630, -154234075, -139310757, -125886595, -114260496, -104404856, -96102870, -89051971, -82834338, -77190093, -72021741, -67424513, -63298006, -59599383, -56272354, -53282709, -50604630, -48186129, -45953091, -43919170, -42044129, -40261326, -38632400]
12787c8632400J503693J387850J254604J120203J090946J053923J013150R74482
12779b9233549Q97734Q05946P77538P45492O84126O41680O73073O01750N45537
12770b2860673N41320N79211N16852M42990M42032M32442M52948L92783L72746
12761a8687349M23561M06596L37035L25755L02183L33978L17103K94877K57652
12752a5688609K40721K52082K92069L19163K98762K53992K70315K60274J73071
12743a3328160K42076K20625J80270J71445J09700J37750J17901J08945J24860
12734a1914588J93394J92081J44692J32242J72486J98283J75595J28329J86479
12725a0391007J57972J29375J31537R3740J45557R9336J29358J37989J44196J46111
$$ y = [-38632400, -37128707, -35740857, -34486253, -33366050, -32275104, -31221181, -30208031, -29233549, -28335815, -27529869, -26752331, -26006839, -25322713, -24681033, -24007960, -23406210, -22860673, -22319353, -21740142, -21223290, -20780300, -20338268, -19905826, -19452878, -19060095, -18687349, -18263788, -17857192, -17520157, -17194402, -16892219, -16558241, -16241138, -15946261, -15688609, -15447888, -15195806, -14903737, -14584574, -14285812, -14031820, -13761505, -13501231, -13328160, -13086084, -12865459, -12685189, -12513744, -12404044, -12266294, -12148393, -12039448, -11914588, -11721194, -11529113, -11384421, -11252179, -11079693, -10881410, -10705815, -10577486, -10391007, -10233035, -10103660, -9972123, -9878383, -9732826, -9633490, -9504132, -9366143, -9221947, -9075836]
12715i075836J34121J53787P7098N4022J24911J02663J32067P0295M6511J18136
12705h062225J72613J01651O9238O9797J08403J03838P8133J09870J42728J13900
12695f992054Q7689L8422N570M754M2679Q7605N1953K7664l2203K2019P4380Q7663
12683f493859N1547N3841R1749M3247R2214O4459O9544N0298M4379N7876R0490
12672e784215N7480N496P5678P7024N6800K8625N7588J06232O1402J13938R8367
12661e045585M5487Q4249L8627Q367j1367j3868M0366N0567L4483O0607K5651
12650d682416N6482O5364P5838N7000l7240m1L9661P2008N0868M6056P654L0674
12638d218092M8867P2916Q0642J0892K5388J4404r80R498k2326J7087L4156K1808
$$ y = [-9075836, -8941715, -8787928, -8710830, -8656808, -8531897, -8429234, -8297167, -8226872, -8180361, -8062225, -7889612, -7787961, -7718723, -7648926, -7540523, -7436685, -7358552, -7248682, -7105954, -6992054, -6904365, -6865943, -6860373, -6855619, -6812940, -6725335, -6673382, -6645718, -6677921, -6655902, -6581522, -6493859, -6442312, -6388471, -6296722, -6253475, -6161261, -6096802, -6027258, -5976960, -5932581, -5874705, -5784215, -5726735, -5721239, -5645561, -5568537, -5511737, -5483112, -5425524, -5319292, -5257890, -5143952, -5045585, -5000098, -4915849, -4877222, -4868855, -4880222, -4894090, -4853724, -4803157, -4768674, -4708067, -4682416, -4625934, -4560570, -4484732, -4427732, -4464972, -4465013, -4425352, -4353344, -4302476, -4256420, -4248766, -4218092, -4169225, -4096309, -4015667, -4004775, -3979387, -3964983, -3965963, -3956465, -3978791, -3961704, -3927548, -3905740]
12626c905740O7951L1181L3940Q9878Q3638K5651N832K3861N4634M9969N1985
12615c387220N4320L8584K7604J0422N096K1319P650M9985O5949L0344M0570K1241
12603c014136K2538P399L3953m454K9730J7829J3662M3859L9984J0108L8199K5749
12591b735580O3576N1847P081J2681K5582K2945K0873J9943M0586K1296Q09J6519
12579b431842j5266M964K6725N7321J4326k1795M4481M4986K6792N3108L4769
12568b161431K7367K5454K5534l1347N7975L4590j1734k6069L5232N1643M2882
12557a929904J3445L0475L4796l075j4629R279K3584m741K001M5748K0575J4205
12545a758241K9704J6830L3778L717l45K5634L5814K4637L8306j7289L2257M7716
$$ y = [-3905740, -3837789, -3806608, -3772668, -3682790, -3599152, -3573501, -3567669, -3543808, -3489174, -3439205, -3387220, -3332900, -3294316, -3266712, -3256290, -3251194, -3229875, -3222225, -3172240, -3106291, -3075947, -3035377, -3014136, -2991598, -2984199, -2950246, -2954700, -2924970, -2907141, -2893479, -2849620, -2809636, -2799528, -2761329, -2735580, -2672004, -2620157, -2613076, -2600395, -2574813, -2551868, -2530995, -2511052, -2470466, -2449170, -2448361, -2431842, -2447108, -2442144, -2415419, -2358098, -2343772, -2365567, -2321086, -2276100, -2249308, -2196200, -2161431, -2134064, -2108610, -2083076, -2114423, -2056448, -2021858, -2033592, -2059661, -2024429, -1972786, -1929904, -1916459, -1885984, -1851188, -1854263, -1868892, -1859613, -1836029, -1840770, -1838769, -1793021, -1772446, -1758241, -1728537, -1711707, -1677929, -1674212, -1674557, -1648923, -1613109, -1588472, -1550166, -1567455, -1535198, -1487482]
12533a487482L4817N6198M1222j9646k9194L2840M7391q829p925K2387K4435J2159
12521a281627K3759O1610M632j5944M3319K8843Q357J2556j2117J5257N3259M3594
12509a014502K6644J083j708m697k1124q558K6159L6369J2119N139J7130p639
12497i33585J0334M0565M6322L9088K5104P4508N9957k5452r434j8173o809L519
12485f94056K6224L2654L3516J2245m3931L8945P7384k7424p899K6831P1496M3259
12473d10756j9126j8010o826J6331K7882l3278M1783k356k6964L9282J1693J4566
12461c65779P2977k1783m2675L7643M7793J8826L2923j0256R293L3635M3342L3042
12449a11019J1464j3299J8666k6575K0078M3312K5751L2302J6264Q67q151l4871
$$ y = [-1487482, -1452665, -1396467, -1355245, -1374891, -1404085, -1371245, -1323854, -1332683, -1340608, -1318221, -1293786, -1281627, -1257868, -1196258, -1191626, -1207570, -1164251, -1135408, -1127051, -1114495, -1126612, -1111355, -1058096, -1014502, -987858, -986775, -988483, -993180, -1014304, -1022862, -996703, -960334, -948215, -943076, -925946, -933585, -923251, -882686, -836364, -797276, -772172, -697664, -637707, -663159, -672593, -690766, -697575, -694056, -667832, -635178, -601662, -589417, -633348, -594403, -517019, -544443, -552342, -525511, -454015, -410756, -429882, -447892, -454718, -438387, -410505, -443783, -402000, -404356, -431320, -392038, -380345, -365779, -292802, -314585, -357260, -319617, -271824, -252998, -220075, -230331, -221038, -187403, -144061, -111019, -99555, -112854, -94188, -120763, -100685, -57373, -31622, 680, 16944, 17811, 9660, -25211]
12437b5211K9321Q188K6762N2854O5857o027P21O4423K8264M3508J0741m247N1636
12424C46790K4909M5801K4654L0348L1890N8896M8582O429P1986Q6146P2149L4492
12412H83072N6314R9321J67037K14578J13562j50227l66620n33113n88969l29318
12402d34363j06945j0567N8765J19577J39199J06756J28921P8393L0640K3823
12392A34199M6436O8357N5561m294J8098O2963O5761N1726n039K4170P8995L6527
12380F33460J8633K3186K8154N2466N2638J14020R3844J33591J36239J36197J38839
12369A561267R3927q9122l62239n35689m43837k85712j24593p16J3076N0214N9997
12358f3427L5984Q9541P5036N2197Q2302O0540O6945K7763M7460L5275N844M4145
$$ y = [-25211, 4110, 12298, 39060, 91914, 157771, 151744, 152465, 216888, 245152, 288660, 299401, 295154, 346790, 371699, 417500, 442154, 472502, 504392, 563288, 611870, 618299, 690285, 776431, 848580, 883072, 939386, 1038707, 1205744, 1420322, 1533884, 1383657, 1017037, 483924, -105045, -434363, -541308, -551875, -493110, -373533, -234334, -127578, 1343, 79736, 110376, 134199, 180635, 248992, 304553, 300259, 318357, 381320, 447081, 498807, 493768, 517938, 596933, 633460, 652093, 675279, 703433, 755899, 808537, 922557, 1016401, 1149992, 1286231, 1422428, 1561267, 1655194, 1566072, 1203833, 668144, 224307, -61405, -185998, -186714, -173638, -123424, -63427, -27443, 62098, 137134, 189331, 271633, 332173, 399118, 426881, 474341, 509616, 515460, 559605]
12346E59605M1371L7266J5033J6137J5410L0009K9877M2646L2459J0420N8198
12335H88431K901l195M2032L7503J5825k3643k4621R04k795q215M4043L1563J4057
12322A014790K6003J1969n3557l7777J5083R636O563K8858k0235j2532L3112K4240
12310A046153L9672O651J1685M6137O3999M6872K4519k5035j4793J9868L0665
12299A296393J2816J704o221L5919J3467O78L4733Q503Q154L184K7681L8184K7391
12286A502586n045R105P2228k6102k5109K4984L5840k186J1604M4650J140K8906
12274A672601N1777L2125K7640j3827o646J8589L1810J9450r046K041L0643K0014
12262A877171P965N3015K7343k2682L0103P3127j1836k6141J9619K8754L1376
$$ y = [559605, 600976, 638242, 653275, 669412, 684822, 714831, 744708, 787354, 819813, 830233, 888431, 891332, 888137, 930169, 967672, 983497, 959854, 935233, 936137, 933342, 925127, 969170, 1000733, 1014790, 1040793, 1052762, 999205, 961428, 976511, 986147, 992710, 1021568, 1001333, 988801, 1021913, 1046153, 1085825, 1092476, 1104161, 1150298, 1214297, 1261169, 1285688, 1260653, 1245860, 1265728, 1296393, 1309209, 1310913, 1304692, 1340611, 1354078, 1354756, 1389489, 1397992, 1406146, 1409330, 1437011, 1475195, 1502586, 1497541, 1506646, 1578874, 1552772, 1527663, 1552647, 1588487, 1586301, 1597905, 1642555, 1643695, 1672601, 1724378, 1756503, 1784143, 1770316, 1763670, 1782259, 1814069, 1833519, 1824473, 1826514, 1857157, 1877171, 1885136, 1938151, 1965494, 1942812, 1972915, 2046042, 2034206, 2008065, 2027684, 2056438, 2087814]
12251B087814J8668k9971J1499J4590R245N7393J9167k28N9101L2496k0445K6032
12239B285361O9866N6343J7395m7446P162L8923J0987n979L085N1563O5384K616
12227B555260k8994j6707N404M2845N6612J9496J5756K8187L7751j7742K5536
12216B723404N6657k455M8571J5589K1477k06J9592Q134k8581N171K0840R863
12204B898056L9288N9071P1588q798m481K5526M2250J1694K999P537L3237K4652
12192C202619J5579Q031K7859L2332M2819O0728M1243j6596J1427M2465M789K510
12180C475805R881K5506M3118L7039L8810Q35L8350n855L3531M1281M2255J7814
12168C798370k7313M6178N0827K8132O5118Q687R814K8691K2548k5937K2222P1412
$$ y = [2087814, 2106482, 2076511, 2088010, 2102600, 2111845, 2169238, 2188405, 2188177, 2247278, 2279774, 2259329, 2285361, 2355227, 2411570, 2428965, 2381519, 2388681, 2427604, 2438591, 2432612, 2435697, 2487260, 2552644, 2555260, 2526266, 2509559, 2514963, 2557808, 2614420, 2633916, 2649672, 2677859, 2715610, 2697868, 2723404, 2780061, 2777606, 2826177, 2841766, 2863243, 2863037, 2882629, 2890763, 2862182, 2867353, 2888193, 2898056, 2937344, 2996415, 3068003, 3059205, 3054724, 3080250, 3122500, 3134194, 3137193, 3144730, 3177967, 3202619, 3218198, 3226229, 3254088, 3286420, 3329239, 3389967, 3431210, 3414614, 3426041, 3468506, 3473295, 3475805, 3485686, 3511192, 3554310, 3591349, 3630159, 3630994, 3669344, 3663489, 3697020, 3738301, 3780556, 3798370, 3771057, 3817235, 3868062, 3896194, 3961312, 3969999, 3979813, 4008504, 4031052, 4005115, 4027337, 4098749]
12156D098749O5211O4131K5314j7114O4272J20115L3951J5293N1456o218L4710
12145D549870J6728L9834K7375K0719Q245n1174n1667k1296L1001K8268P9775
12134D677678Q4997O5788L4433K6595K6476o497L4816P3937J05038K8499q780
12123E142980R051M9845M8391M7505L0148M6970M4765N9622N6960J9305N3028
12112E608570O2204K7310L1133M5692N7965O6629O7411J8164N2536O8620O4952
12101F171186O6370P2051O4117N6638P395j07341j30364p5686j2957K0137P3354
12090F204900O1565Q2227R0725R2718P1770O5310Q5689M6575N1780L1497K3973
12079F908729R1007M5213J6550N5884N7097O8633M4292P4912O8459O5849R6264
$$ y = [4098749, 4163960, 4228091, 4253405, 4236291, 4300563, 4420678, 4454629, 4469922, 4521378, 4515160, 4549870, 4566598, 4606432, 4633807, 4654526, 4662771, 4611597, 4559930, 4538634, 4569635, 4597903, 4677678, 4762675, 4828463, 4862896, 4889491, 4915967, 4909470, 4944286, 5018223, 5123261, 5151760, 5142980, 5152031, 5201876, 5250267, 5297772, 5327920, 5374890, 5419655, 5479277, 5536237, 5555542, 5608570, 5670774, 5698084, 5729217, 5774909, 5832874, 5899503, 5966914, 5985078, 6037614, 6106234, 6171186, 6237556, 6309607, 6373724, 6430362, 6437757, 6330416, 6200052, 6124366, 6111409, 6131546, 6204900, 6266465, 6348692, 6439417, 6532135, 6603905, 6669215, 6754904, 6801479, 6853259, 6884756, 6908729, 6999736, 7044949, 7061499, 7117383, 7174480, 7243113, 7287405, 7362317, 7430776, 7496625, 7592889]
12068G592889O5679N5381Q6075O4258M3450M527P5614N0481P6739Q6394O8498
12057H269985P8333N4559J18874J24794M4414j8040j10097o8624K2399J1919M4769
12046H573285P0227N5748P2285O6896J10627J29886R9718N0815K3829N5363Q4133
12035I392812N9518Q1843J17608J00683R2344R2963J7142P4245J21445M2132Q3608
12024A0276343R7222Q1398Q5919Q0553N2249L8265P0228Q0573K7065J0411O8709
12013A0968935P5146L4145N4243L4787L0931P000j7768n8717n8530J3200L0339
12002A1113711J837N4537M0121J5302j1707n2555J1480k3277m3852k7817r3996
11991A0983784j40360n3160j8244m5150o8222r4530j17621j32533j49904j80934
$$ y = [7592889, 7658568, 7713949, 7800024, 7864282, 7907732, 7912259, 7987873, 8038354, 8115093, 8201487, 8269985, 8348318, 8402877, 8521751, 8646545, 8690959, 8672919, 8562822, 8494198, 8516597, 8528516, 8573285, 8643512, 8699260, 8771545, 8838441, 8949068, 9078954, 9178672, 9229487, 9253316, 9308679, 9392812, 9452330, 9534173, 9651781, 9752464, 9844808, 9937771, 9954913, 10029158, 10150603, 10192735, 10276343, 10373565, 10454963, 10540882, 10621435, 10673684, 10711949, 10782177, 10862750, 10889815, 10900226, 10968935, 11044081, 11078226, 11132469, 11167256, 11198187, 11205187, 11187419, 11128702, 11070172, 11083372, 11113711, 11115548, 11170085, 11210206, 11225508, 11213801, 11161246, 11172726, 11149449, 11105597, 11077780, 10983784, 10843424, 10790264, 10772020, 10726870, 10658648, 10564118, 10446497, 10313964, 10164060, 9983126]
11981I983126k04797j69882j83017j95394k26221k75301k60939k28080k17833
11972H021662l16033l06555l25183l30404l36077l50255l67200l92150m25413
11963D872392m12845m64908m52091m42535m52029m81567m70182m97936n16206
11954F82093n03811m88504n26740n02183m53497m19867m59482m87231n22295n28625
11944d210142n05939m60321m14353m47007m26350l99763m16685l86268m03648
11935h070476m32631m03769l25760l14752l04008l07666k63974k34173k41708
11926a0898917k02636k11425k25296k14621j82737j93875j53814j57982j19300
11917a2560603o8084r4935j04490j10263j28074p0226l0043k7258o6778m5229
$$ y = [9983126, 9778329, 9608447, 9425430, 9230036, 9003815, 8728514, 8467575, 8239495, 8021662, 7705629, 7399074, 7073891, 6743487, 6407410, 6057155, 5689955, 5297805, 4872392, 4459547, 3994639, 3542548, 3100013, 2647984, 2166417, 1696235, 1198299, 682093, 178282, -310222, -836962, -1339145, -1792642, -2212509, -2671991, -3159222, -3681517, -4210142, -4716081, -5176402, -5590755, -6037762, -6464112, -6863875, -7280560, -7666828, -8070476, -8503107, -8906876, -9232636, -9547388, -9851396, -10159062, -10423036, -10657209, -10898917, -11101553, -11312978, -11538274, -11752895, -11935632, -12129507, -12283321, -12441303, -12560603, -12628687, -12723622, -12828112, -12938375, -13066449, -13136675, -13166718, -13193976, -13260754, -13305983]
11907a3305983n6541j4607J8830M1670j7157m3620k4773m670N3358K7333J1767
11896a3314393L6709M0888K3397K1505L4917M8368O7842M0236j5666N9686N3315
11885a2903196R6589P0075L7028R3586L6664L9735O0373O4902R9602N3560O7723
11874a2183359K9906M7633R6653L4946L321O7156P1148J03316R2094O6657Q9737
11863a1480792N2195L8652L5439M0730R9120Q8519P1550P1794J7084K912Q2356
11852a0880441R5796R5177M0677L7351N6399N8432M779P3760J04741J07271O6356
11841a0139702R232J1487P4745P7869O9304L5659N6384P5550N4712M8790M3965
11830i582005M1667K6865P8872P9734N1766J5949L357N5994P2198Q9577M9643
$$ y = [-13305983, -13362524, -13377131, -13358301, -13316631, -13333788, -13377408, -13402181, -13406851, -13353493, -13326160, -13314393, -13277684, -13236796, -13213399, -13191894, -13156977, -13108609, -13040767, -13000531, -13016197, -12956511, -12903196, -12806607, -12736532, -12699504, -12605918, -12569254, -12529519, -12469146, -12404244, -12304642, -12251082, -12183359, -12153453, -12105820, -12009167, -11974221, -11970900, -11903744, -11832596, -11729280, -11637186, -11570529, -11480792, -11428597, -11389945, -11354506, -11313776, -11214656, -11126137, -11054587, -10982793, -10965709, -10962797, -10880441, -10784645, -10689468, -10648791, -10611440, -10555041, -10496609, -10491830, -10418070, -10313329, -10206058, -10139702, -10130470, -10118983, -10044238, -9966369, -9897065, -9861406, -9805022, -9729472, -9674760, -9625970, -9582005, -9540338, -9513473, -9434601, -9354867, -9303101, -9287152, -9283795, -9227801, -9155603, -9066026, -9016383]
11819i016383L5555M4627K4988K0931M0050N3531J2139M9744P5093N7178P5770
11808h526777O1394j1253N8116O6797M8727M2687M7705O2371k2423p069K0249
11797h159476L0069Q5353M9036Q384N4669J02798K6074L1809M2686n976j097P7291
11785g658380O7277M1520M3092N1908M3473L9830Q474N580N2302M1570j0876M3073
11773g231157N437J3947Q1243O8924O7810o29O6274J5714k1679K1273J1709m5677
11761f946811K292L9740M5000L6961L0923N1035L1064Q0610L8116k9178j324N7027
11749f564545M8343J8019M3586N407L7428L0604K7366J7182L5249M2689M0542
11738f218130L7162K354k1145K7442L5965J4952K3057L0496K5992N1515J410J7604
$$ y = [-9016383, -8980828, -8936201, -8911213, -8890282, -8850232, -8796701, -8784562, -8734818, -8659725, -8602547, -8526777, -8465383, -8476636, -8418520, -8351723, -8302996, -8260309, -8212604, -8150233, -8172656, -8179725, -8159476, -8129407, -8044054, -7995018, -7986634, -7931965, -7829167, -7803093, -7771284, -7728598, -7734574, -7735671, -7658380, -7591103, -7549583, -7506491, -7454583, -7411110, -7371280, -7362806, -7357226, -7304924, -7263354, -7274230, -7231157, -7225720, -7211773, -7130530, -7061606, -6993796, -6994425, -6928151, -6912437, -6934116, -6912843, -6901134, -6946811, -6944519, -6904779, -6859779, -6822818, -6791895, -6740860, -6709796, -6629186, -6591070, -6620248, -6621572, -6564545, -6516202, -6498183, -6454597, -6449190, -6411762, -6381158, -6353792, -6336610, -6301361, -6258672, -6218130, -6180968, -6178614, -6199759, -6172317, -6136352, -6121400, -6098343, -6067847, -6041855, -5990340, -5988930, -5971326]
11726e971326K2193m840K9080l017K1930N3667L1261K6568K2383K492P128L2332
11714e730149L71K6798M7318P3207J7175J963O55Q348J2650J3205K4158J1162
11702e493139K409R904K9970K9593j0591j5793K0378M9554M9608j5081K997M372
11690e335819M8955N3014K7076K5556J1334L0610J7633J0775K721J5140J8117
11679e074888M940L3588K0007L4900J1786R971J8179K6508L2457k681l2753j3200
11667d931186R034N7462O5098K4455J4250q092K6426K3767o227K2597M1886M542
11655d655988n794j151L2567M0648N0439O840k7369R761N7647N4537J1179q499
11643d435183m8482q4395k2751K1707M0693N4839J3450j6781j6501m4854k3660
$$ y = [-5971326, -5949133, -5953973, -5924893, -5927910, -5905980, -5852313, -5821052, -5794484, -5772101, -5769609, -5762481, -5730149, -5729778, -5702980, -5655662, -5582455, -5565280, -5563317, -5562662, -5554314, -5541664, -5528459, -5504301, -5493139, -5490730, -5480826, -5450856, -5421263, -5431854, -5447647, -5427269, -5377715, -5328107, -5343188, -5340191, -5335819, -5286864, -5233850, -5206774, -5181218, -5169884, -5139274, -5121641, -5110866, -5108145, -5093005, -5074888, -5069948, -5036360, -5016353, -4981453, -4969667, -4959696, -4941517, -4915009, -4882552, -4885233, -4917986, -4931186, -4922152, -4864690, -4799592, -4775137, -4760887, -4768979, -4742553, -4718786, -4725013, -4702416, -4660530, -4655988, -4661782, -4662933, -4630366, -4589718, -4539279, -4532439, -4559808, -4550047, -4492400, -4437863, -4426684, -4435183, -4483665, -4568060, -4590811, -4569104, -4528411, -4473572, -4460122, -4476903, -4493404, -4538258, -4561918]
11632d561918K7458M3519N6883K5452K0138j562J9376M7859K7645M2006L303L0529
11620d219312J710k4068j744R999K7528L7013j379p813l3012M0567L2116K878
11608d135517l72k965N5025M1452m020J1061N3153j862k0084j1138m0320j3297
11596d068884M9772J3302P666k856K0899L6824J1394J0073K1567K8013p789J5697
11584c864322J3818K1422R371J9236l6719k7262j9096P4573Q4426j8771m7237
11573c790561j1677L4645L0820l728q305Q415p755P052n537m129J2784O5070M1953
11560c630953l2954K4941K8675K1648N475J5066R082K388L0244o437K2065J8610
11548c492150r329L221K8852J9512K4493K0801l2569l243L826J5330M3621K739
$$ y = [-4561918, -4534460, -4490941, -4434058, -4408606, -4388468, -4390030, -4370654, -4322795, -4295150, -4253144, -4249841, -4219312, -4217602, -4241670, -4243414, -4233415, -4205887, -4168874, -4170253, -4178066, -4211078, -4170511, -4138395, -4135517, -4135889, -4138854, -4083829, -4042377, -4046397, -4035336, -3982183, -3984045, -4004129, -4015267, -4055587, -4068884, -4019112, -4005810, -3998144, -4001000, -3980101, -3943277, -3931883, -3921810, -3900243, -3872230, -3880019, -3864322, -3850504, -3829082, -3819711, -3800475, -3837194, -3864456, -3883552, -3808979, -3724553, -3743324, -3790561, -3802238, -3767593, -3736773, -3740501, -3748806, -3740391, -3748146, -3741094, -3746631, -3750760, -3737976, -3672906, -3630953, -3663907, -3638966, -3610291, -3588643, -3583168, -3568102, -3559020, -3556632, -3526388, -3532825, -3510760, -3492150, -3501479, -3498258, -3469406, -3449894, -3425401, -3404600, -3437169, -3440412, -3436586, -3421256, -3377635, -3374896]
11536c374896k8712Q327k8771J9360K854R690j1936k0890K2824n771K4578K6275
11524c357068N0606J3118K2980J2491j0330L317P036J6695j8681n568J4352m918
11512c255970R037j6408L0905K5709j6759m490J0309K2348K0069q979j7739M6810
11500c155158L1101N929k0165Q836J9549O01k168q127K9162J4327J103j3783J7681
11487c071112j9466j2320N4869K9358L8262l5676o4301K6742O1557O3599K155
11476b926333J3546M2752J2684k5420m0913n7203l2831k13J0469m186K4227M6425
11464b936996L2675J4553J143j317l372k5402K4625J7263p128O5634K4769j778
11452b795331k6330l9334k561L5951M4578J1674k3522j4755M5823P680r528k5765
$$ y = [-3374896, -3403608, -3395281, -3424052, -3404692, -3401838, -3392148, -3404084, -3424974, -3402150, -3407921, -3383343, -3357068, -3306462, -3293344, -3270364, -3257873, -3268203, -3264886, -3257850, -3241155, -3259836, -3265404, -3251052, -3255970, -3246933, -3263341, -3232436, -3206727, -3223486, -3227976, -3217667, -3195319, -3175250, -3184229, -3201968, -3155158, -3124057, -3118128, -3138293, -3129457, -3109908, -3109307, -3111475, -3119602, -3090440, -3076113, -3075010, -3088793, -3071112, -3090578, -3102898, -3048029, -3018671, -2980409, -3016085, -3080386, -3053644, -2992087, -2928488, -2926333, -2912787, -2870035, -2857351, -2882771, -2923684, -2980887, -3013718, -3013931, -3003462, -3007648, -2983421, -2936996, -2904321, -2889768, -2888625, -2889942, -2893314, -2918716, -2894091, -2876828, -2883956, -2818322, -2793553, -2795331, -2821661, -2860995, -2863556, -2827605, -2783027, -2771353, -2794875, -2809630, -2763807, -2756127, -2765655, -2791420]
11440b791420n439K1821J8013J6813J5174N910k5203l3530J726L3032K5627N2861
11428b664615K7340k0714J6013k3572J5141m574m2212j9489K8105L7897K1003
11417b629677N5576L416l385k5983m05J0181R120L7257J2161O983J2957k8294
11405b540093j7375R59O243p250j8512K1341Q475R16L2761L8334q353j1135m4136
11392b537825j8358K0357j0909L56K1557J4599l268J0087k4919J7961N0622j4685
11380b474425k4849L9948J1995M9531L7317K2436J8283l701K375l9817m6339J3015
11368b394231K6464R807P66J01k4621L8761K2054J2880l6924o437K946j7266K6110
11355b339590L1147l983Q251R004J3940j5403J2371J2698k3223m6683L846L6917
$$ y = [-2791420, -2796859, -2775038, -2757025, -2740212, -2725038, -2719128, -2744331, -2777861, -2776135, -2743103, -2717476, -2664615, -2637275, -2657989, -2641976, -2665548, -2650407, -2654981, -2697193, -2716682, -2688577, -2650680, -2629677, -2574101, -2570685, -2574070, -2600053, -2600458, -2590277, -2581157, -2543900, -2531739, -2524756, -2511799, -2540093, -2557468, -2556509, -2550266, -2557516, -2576028, -2554687, -2546212, -2545296, -2512535, -2474201, -2482554, -2493689, -2537825, -2556183, -2535826, -2546735, -2546379, -2524822, -2510223, -2513491, -2503404, -2528323, -2510362, -2459740, -2474425, -2499274, -2459326, -2447331, -2397800, -2360483, -2338047, -2319764, -2323465, -2321090, -2360907, -2407246, -2394231, -2367767, -2357960, -2357194, -2357093, -2381714, -2342953, -2320899, -2308019, -2344943, -2351380, -2348434, -2365700, -2339590, -2308443, -2312426, -2304175, -2295171, -2281231, -2296634, -2284263, -2271565, -2294788, -2341471, -2337625, -2300708]
11343b300708L8373J3081j6876j3235N2585n105p939L6993o597N1568j9627l1849
11331b209336j1270O0840Q231n356k3371J6932M118J139R761P487p501l38K7890
11318b120774k1852j0741L1783N289j8668N8140L5565k3936n5331Q361n232J8576
11306b098820O5486j4343l7637k2191J847M9502K2586J655J5377l0369k514N9286
11294a990135M2906j0625n442k4327M287l192r263k3123J1712K0618j8838K8125
11282a977297K8722o652O886r32J0241J0524J7309j988j9680l0402K6316L3797
11270a903156j9342k2823J6248O680M3819K8051k5267K7942k34M554L5173j2430
11258a820785k679J9876k6302k0177M7551k473k1119k4118q078K0473J650j4012
$$ y = [-2300708, -2262335, -2249254, -2266130, -2279365, -2226780, -2231885, -2239824, -2202831, -2209428, -2157860, -2177487, -2209336, -2220606, -2159766, -2151535, -2156891, -2180262, -2163330, -2159212, -2158073, -2148312, -2140825, -2148326, -2148664, -2120774, -2142626, -2153367, -2121584, -2116295, -2134963, -2076823, -2041258, -2065194, -2120525, -2112164, -2117396, -2098820, -2033334, -2047677, -2085314, -2107505, -2105658, -2056156, -2033570, -2031915, -2016538, -2046907, -2049421, -1990135, -1947229, -1957854, -1963296, -1987623, -1983336, -1986528, -1995791, -2018914, -2007202, -1986584, -2005422, -1977297, -1948575, -1955227, -1948341, -1949273, -1939032, -1928508, -1911199, -1913187, -1932867, -1963269, -1936953, -1903156, -1922498, -1945321, -1929073, -1922393, -1878574, -1850523, -1875790, -1847848, -1848082, -1843528, -1808355, -1820785, -1823464, -1803588, -1829890, -1850067, -1802516, -1804989, -1826108, -1850226, -1858304, -1837831, -1836181, -1850193]
11246a850193l519J4190K4012J4918K3751J5182N0889j9782k3389M820k3872o780
11234a779773O668J4926J255J6821m4052j3781L673J2816Q836k4595Q914K3467
11222a764825M4764L915Q035k9870P64J3138K6936L5403L9474L0164L12k6952
11210a618742J4597j9006q723K2942K3750K7068J7540j08820k9533R197j8736
11199a688466Q388l0333K2162O0874O390j3970L4J5935p016K472J097L1044J5636
11186a575753K7291j9990k2277K4931M0632K364P192l2784j944K0689K4313P452
11174a497884l4013J0837j2507J3901J3607j1794K1260q473L5276N309J439k923
11162a465965l8848p630J2330l690N317M8464N2246O4407R192j2476l3403l1216
$$ y = [-1850193, -1853712, -1839522, -1815510, -1800592, -1776841, -1761659, -1710770, -1730552, -1753941, -1749121, -1772993, -1779773, -1773105, -1758179, -1756924, -1740103, -1784155, -1797936, -1794263, -1781447, -1772611, -1797206, -1788292, -1764825, -1720061, -1716146, -1708111, -1737981, -1737217, -1724079, -1697143, -1661740, -1622266, -1592102, -1591790, -1618742, -1604145, -1623151, -1631874, -1608932, -1585182, -1558114, -1540574, -1649394, -1678927, -1669730, -1688466, -1680078, -1710411, -1688249, -1627375, -1620985, -1634955, -1634921, -1618986, -1626002, -1623530, -1622433, -1591389, -1575753, -1548462, -1568452, -1590729, -1565798, -1525166, -1522802, -1515610, -1548394, -1550338, -1529649, -1505336, -1497884, -1531897, -1521060, -1533567, -1519666, -1506059, -1517853, -1496593, -1505066, -1469790, -1464481, -1463042, -1465965, -1504813, -1512443, -1500113, -1503803, -1498486, -1450022, -1397776, -1333369, -1324177, -1336653, -1370056, -1401272]
11150a401272K454j660k041N621l604k8662j1928p225Q977q706j6339K7682L8914
11137a397789O832L8633l699k232K9370J9716L247M209J9552K5648J286j5928
11125a271155J1945j7917j8350L3095L0877L167j9759n3679K1523J8287M3472
11114a218494K6455N691O381m029j0870o9714J0514L2919r257k8688P087K6807
11102a225198M3550K474l2258L3317M1854k4549m5412m755K4087R627J0309J3164
11090a153790M3203M751j359l933K9552K8611l0777l9753j938J58J2839J5364
11078a097072K0133J5096M5679j2217m6519l7641J6985Q285L2361J3608J0322
11067a030980K8593J7951r387K0529q794l7300K3499K8291n921p729J6286K8151
$$ y = [-1401272, -1398818, -1400478, -1402519, -1396898, -1400502, -1429164, -1441092, -1448317, -1439340, -1448046, -1464385, -1436703, -1397789, -1390957, -1352324, -1356023, -1358255, -1328885, -1309169, -1305922, -1301713, -1282161, -1256513, -1255227, -1271155, -1259210, -1277127, -1295477, -1262382, -1231505, -1228338, -1248097, -1301776, -1280253, -1261966, -1218494, -1192039, -1186348, -1179967, -1183996, -1194866, -1264580, -1254066, -1221147, -1230404, -1259092, -1252005, -1225198, -1181648, -1179174, -1211432, -1178115, -1136261, -1160810, -1206222, -1210977, -1186890, -1177263, -1166954, -1153790, -1110587, -1105836, -1107195, -1111128, -1081576, -1052965, -1083742, -1123495, -1125433, -1125275, -1112436, -1097072, -1076939, -1061843, -1016164, -1028381, -1074900, -1112541, -1095556, -1087271, -1054910, -1041302, -1030980, -1002387, -984436, -993823, -973294, -982088, -1019388, -995889, -967598, -973519, -981248, -964962, -936811]
11055i36811p527n934j251M0334N8884J3377J2145K3476K2367l6344R677J2829
11043g94778l3015n4668J0349L8616K7210K3535K0147J5082r206K9161n38l6922
11031g65027l2534k4428n9317j669J1949O485k162L9855M8302K8667l8936n3573
11019h42388l4813l1321k8746l2048L1083L3815L2084j8260N566j0672L58J2866
11007h82476l4369j4301k7710k3421L0882j6656j5593L4169L4130Q469J8576q076
10995h96376k3807r836J4629r302K2832l874K154J6879O3167L2743o054l113Q707
10982g91251J575k658J0959L1032J5939K2132R635k1493j2146r775J5115N8626
10970f72310K1256K3669O809j4338J3939J9384k3894r289Q024l8621q331K6096
$$ y = [-936811, -944338, -950272, -951523, -911189, -852305, -838928, -826783, -803307, -780940, -817284, -807607, -794778, -827793, -882461, -872112, -833496, -806286, -782751, -762604, -747522, -756728, -727567, -728105, -765027, -797561, -821989, -881306, -882975, -871026, -864541, -866703, -826848, -778546, -749879, -788815, -842388, -877201, -908522, -937268, -969316, -938233, -904418, -872334, -890594, -885028, -895700, -895342, -882476, -916845, -931146, -958856, -982277, -951395, -968051, -983644, -949475, -915345, -906876, -888300, -896376, -920183, -930019, -915390, -924692, -901860, -905734, -903580, -886701, -823534, -790791, -796845, -799958, -791251, -789676, -792334, -781375, -750343, -734404, -712272, -702637, -724130, -736276, -746051, -730936, -672310, -651054, -627385, -620576, -634914, -620975, -601591, -625485, -634774, -626750, -665371, -673702, -647606]
10958f47606Q335l554L3111j3456J0434j5883J6258L9573l085j195l481l2523
10946f13072l7762O0822K4761j1044M6505N1464K7845j5848Q816j3287j7520K72
10934d88048R176J7455R731q578l1877p644j5702L2115J9328K4382l5005j7187
10922d91854K4586K8729K9937Q419j6937L1108M2928L035p608j7876Q274K1967
10910c35292J9820N0702p021m4988l7972L282L884n679M6986K1114J3458L1628
10898b40078K53M164N3767J1520m644j3990K4205K7069M1168K5930j8421J7742
10886g1315k1987o120j1450J2333J7510K9429K2154p256O013L7348L272j162L8807
10873D7576J8805q349l2417P28L084L0235P445j9930J9652K7072k931J95K9760
$$ y = [-647606, -639271, -642825, -609714, -623170, -612736, -628619, -612361, -572788, -575873, -577068, -580549, -613072, -650834, -590012, -565251, -576295, -529790, -478326, -450481, -466329, -457513, -470800, -488320, -488048, -478872, -461417, -451686, -460264, -492141, -499785, -515487, -483372, -464044, -439662, -474667, -491854, -467268, -438539, -408602, -400183, -417120, -386012, -343084, -340049, -347657, -365533, -357259, -335292, -315472, -264770, -271791, -316779, -354751, -351469, -347585, -353264, -306278, -285164, -271706, -240078, -239825, -235661, -181894, -170374, -175018, -189008, -164803, -137734, -96566, -70636, -89057, -71315, -93302, -99422, -110872, -98539, -81029, -51600, -29446, -36702, -30689, 6659, 9931, 8769, 47576, 66381, 58032, 25615, 26343, 29427, 59662, 67107, 47177, 66829, 93901, 90970, 91165, 120925]
10860A20925m0913r594K4608L8874M3909N2835l1229k0537k0938m205Q848L9998
10848B02581l8409M493J8249J8380q282N075l199P9M6281P9518k1808j5796K0633
10835C07795j0852p160P983J3707j567J3351K8314K7525J8888o038j3383m530
10823C74033K7456O100J098m354J2770K2011J8414L2439L529J2451P197L6906
10811E50050O373k3242J363K7297M7632N635J1531L2570Q609J0009K1252M5539
10799G44618l014l382k8770j899J9313L7926J3314M014J7623O195L3855J5991
10787H55784j1506J5169K4849O900M1435J1857O0981R748k6025j8220K8563M4051
10775A043586N7996O2279K1329k2726k5781n94M2605J9387K4468M1372M0403K3013
$$ y = [120925, 80012, 70418, 95026, 133900, 177809, 230644, 199415, 178878, 157940, 153735, 162583, 202581, 164172, 168665, 186914, 205294, 197012, 202087, 198888, 198967, 245248, 324766, 302958, 287162, 307795, 296943, 289783, 297766, 311473, 309906, 323257, 351571, 379096, 397984, 391946, 378563, 374033, 401489, 407589, 408687, 404333, 417103, 439114, 457528, 489967, 493496, 505947, 513144, 550050, 556423, 533181, 534544, 561841, 609473, 615108, 626639, 659209, 667818, 677827, 699079, 744618, 741604, 738222, 709452, 707553, 726866, 764792, 778106, 782120, 799743, 805938, 839793, 855784, 844278, 859447, 884296, 891196, 932631, 944488, 1005469, 1015217, 989192, 970972, 999535, 1043586, 1101582, 1163861, 1185190, 1162464, 1136683, 1136089, 1178694, 1198081, 1222549, 1263921, 1304324, 1327337]
10763A327337L8858M4136j4267k8004J6180K2546M0737M0907L3477K3500K2537
10752A567944K936J1706K5057N0229M4685K48K5750L6809K0678M3378J7138K691
10740A849249L2694L869P311M5326L0915m143K8231J4509n50K3762M7948M0161
10728B119282J7572J9049N9719L5022N0222L9558r75r85M4871N7942M7750K8800
10716B517827Q644O5913L1535J4188j2624J4257P4313N8278O319R545O3523M1115
10704B892833N0590O2627O7467M8744M7757K5387L9995M4026O1842N7711J2742
10693C411721N5514R4998P1713O0499M2356N3794P9998K3625N4148K8154M3589
10682D020109J06597M3615Q767N7270P2501J09719J04909J08417J01874R3057
$$ y = [1327337, 1366195, 1410331, 1396064, 1368060, 1384240, 1406786, 1447523, 1488430, 1521907, 1545407, 1567944, 1570880, 1582586, 1607643, 1657872, 1702557, 1702805, 1728555, 1765364, 1786042, 1829420, 1846558, 1849249, 1881943, 1885812, 1893123, 1938449, 1969364, 1965221, 1993452, 2007961, 2007411, 2031173, 2079121, 2119282, 2136854, 2155903, 2215622, 2250644, 2300866, 2340424, 2339449, 2338464, 2383335, 2441277, 2489027, 2517827, 2526471, 2592384, 2623919, 2638107, 2625483, 2639740, 2714053, 2772331, 2778650, 2788195, 2851718, 2892833, 2943423, 3006050, 3073517, 3122261, 3170018, 3195405, 3235400, 3279426, 3341268, 3398979, 3411721, 3467235, 3562233, 3633946, 3694445, 3736801, 3790595, 3870593, 3894218, 3948366, 3976520, 4020109, 4126706, 4170321, 4179088, 4236358, 4308859, 4418578, 4523487, 4631904, 4733778, 4826835]
10672D826835R3807R5773J31282J19620R6496M0357O2550P5036P0752J26419J52602
10661E891529J27343J30343J31638J53338J17530R7379J46551J46155J22245J45537
10651G209588J98825J54148J35359K01647J87350K07960J68258J96675K54909
10642H914719K65504K61815K74643K64899L02218K99791L20219L36971L76673
10633A1617452M10995M04568M21601M13602M79973N53597N78349O31624P30761
10624A6242522Q30740R14228J041100J101317J234720J319959J391886J310798
10616B5387270R76210J57256r68479j764480j888805j396474m13774N98829J423599
10607B2111152J974854K284714K221072J292545q23984l676518n661478n752275
$$ y = [4826835, 4920642, 5016415, 5147697, 5267317, 5363813, 5404170, 5466720, 5541756, 5612508, 5738927, 5891529, 6018872, 6149215, 6280853, 6434191, 6551721, 6649100, 6795651, 6941806, 7064051, 7209588, 7408413, 7562561, 7697920, 7899567, 8086917, 8294877, 8463135, 8659810, 8914719, 9180223, 9442038, 9716681, 9981580, 10283798, 10583589, 10903808, 11240779, 11617452, 12028447, 12433015, 12854616, 13268218, 13748191, 14301788, 14880137, 15511761, 16242522, 17073262, 17987490, 19028590, 20129907, 21364627, 22684586, 24076472, 25387270, 26363480, 26520736, 25552257, 23787777, 21898972, 20502498, 20088724, 20687553, 22111152, 24086006, 26370720, 28591792, 29884337, 29060353, 25383835, 19722357, 13970082]
10599A3970082m097111j811808K43994J739119K646470K911711K406829P13068
10591A8722354k584315o707004r292683q882535o227583k927855k55855J534039
10583a6621437K487866K620664K141730P23733j713030m483421n967570n368327
10575b6179792l390973j150116N66357J535880J989114J934509J509835P16971
10567b2468215l68027j470487j972129j674743r08944n61N96308J027375J197712
10558b6041711J203659J125724J054803R80153Q74674Q14902P43290O49228N92750
10549a8002528O16204N69117M58939M49038M86580M23361L48337L16915L41224
10540a3992813L54409L24944K78523K69026K64241K67602K25058K11308J82651
$$ y = [13970082, 9872971, 8061163, 8305157, 10044276, 12690746, 15602457, 18009286, 18722354, 16138039, 9431035, 138352, -8744183, -14971766, -17899621, -18155476, -16621437, -14133571, -11512907, -9371177, -8647444, -10360474, -14843895, -20811465, -26179792, -29570765, -30720881, -30154524, -28618644, -26629530, -24695021, -23185186, -22468215, -22836242, -24306729, -26278858, -27953601, -28862545, -28863106, -28266798, -27239423, -26041711, -24838052, -23712328, -22657525, -21677372, -20802698, -19987796, -19244506, -18595278, -18002528, -17386324, -16817207, -16358268, -15909230, -15422650, -14999289, -14650952, -14334037, -13992813, -13638404, -13313460, -13034937, -12765911, -12501670, -12234068, -12009010, -11797702, -11615051]
10531a1615051J72884J85238J92575J91253J70881J77350J90204J48825J35596
10522a0050245J28108J12690J42020J47026J23243J28538J10179R4385J20492
10513h943564P0869P3286J12033J06837R1576R6562J09098J00078J43173P9996
10503g960056N9244O3930Q1848J20250Q9211O7209O6511P0591P8256N7127K6817
10492g179062O3239Q3086O9694O7233P6226L7589K4068O2186M9353N6740P7834
10481f511814M6126N39L8779N5434K0451M8114Q7187R8820P9373L5592L4894N4610
10469e911895j2728L1399M1379P2802L9152N0075L4117M4058N27M765O0857L2989
10457e512503M5253O3684Q503M1148J4760K9729M6859Q730j6153Q6153O9522O4524
$$ y = [-11615051, -11442167, -11256929, -11064354, -10873101, -10702220, -10524870, -10334666, -10185841, -10050245, -9922137, -9809447, -9667427, -9520401, -9397158, -9268620, -9158441, -9064056, -8943564, -8872695, -8799409, -8687376, -8580539, -8488963, -8392401, -8283303, -8183225, -8040052, -7960056, -7900812, -7836882, -7755034, -7634784, -7545573, -7478364, -7411853, -7341262, -7263006, -7205879, -7179062, -7115823, -7032737, -6963043, -6895810, -6819584, -6781995, -6757927, -6695741, -6646388, -6589648, -6511814, -6465688, -6465149, -6426370, -6370936, -6350485, -6302371, -6215184, -6116364, -6036991, -6001399, -5966505, -5911895, -5924623, -5893224, -5851845, -5779043, -5739891, -5689816, -5655699, -5611641, -5611114, -5606349, -5545492, -5512503, -5467250, -5403566, -5395063, -5353915, -5339155, -5309426, -5262567, -5253837, -5269990, -5183837, -5114315, -5049791]
10445e049791O7721N6674j8003j0998m0199o1426j9934L064L3216M3081K9329
10434d967266J1960K8069O2954L4866M3229J2479j0314n369K8388N1641Q3327
10423d626036Q6527J7355K5274N2041N3261K6103j0735l8500k5281Q0215R4182
10412d265594O1549K7306N0576N6899M5694K5453J7627N5101j2272j69495k35228
10401d342384j53916q9123L532L6470L3788O5112Q1169L6809M2205J5472j4057
10390d284923K3727L1165L6982O6933N8980L5739r248J3070K3776k8220j4673
10379d046692O399R844K3320L6783K2700J4937L7757M2758L7986N8723P2994N3478
10367c629013N6498M4856o1093j95700k36239k02790q7806J2900J6119L1383N7237
$$ y = [-5049791, -4982070, -4925396, -4943399, -4954397, -4994596, -5056022, -5075956, -5072892, -5039676, -4996595, -4967266, -4955306, -4927237, -4864283, -4829417, -4786188, -4773709, -4784023, -4789392, -4761004, -4709363, -4626036, -4539509, -4522154, -4496880, -4444839, -4391578, -4365475, -4376210, -4414710, -4439991, -4359776, -4265594, -4204045, -4176739, -4126163, -4069264, -4023570, -3998117, -3980490, -3925389, -3937661, -4107156, -4342384, -4496300, -4585423, -4581891, -4545421, -4511633, -4446521, -4365352, -4328543, -4286338, -4270866, -4284923, -4261196, -4230031, -4193049, -4126116, -4067136, -4031397, -4040645, -4027575, -4003799, -4032019, -4046692, -4040293, -4030449, -4007129, -3970346, -3947646, -3932709, -3894952, -3852194, -3814208, -3755485, -3682491, -3629013, -3572515, -3527659, -3588752, -3784452, -4020691, -4223481, -4311287, -4298387, -4282268, -4250885, -4193648]
10356d193648J2889M9210P5014M7240P3417L7949j1063n499K9533K9100q797N1927
10344c812728L9348J6919L1132M1280q052R330L5361K2771N0481P875n2234J2430
10332c606087N3150L1987K6046j1671k319j2771l0575n39k4050k0697l3517O687
10320c624356J4513J3661K7123L1096K4232J6658K9241l975j5743M979K4547K439
10308c455585K7960J8618K7702j1590k9978N342M4967K2125K5708K0342m1648
10297c346037l5789K0218O6445j1290Q484J2989J3333K4597L736l3762j0617n756
10285c293449j2645R516O3926M3735M478l2380k7950K071J4769J0322L2100L2635
10273c152872j8214J5965L4970l3136j9751K3282J1238K7848L4914j3266j2897
$$ y = [-4193648, -4180759, -4131549, -4056535, -4009295, -3935878, -3897929, -3908992, -3914491, -3884958, -3855858, -3864655, -3812728, -3773380, -3756461, -3725329, -3684049, -3692101, -3682771, -3647410, -3624639, -3574158, -3566283, -3618517, -3606087, -3552937, -3520950, -3494904, -3506575, -3508894, -3521665, -3552240, -3552779, -3576829, -3597526, -3631043, -3624356, -3609843, -3596182, -3569059, -3537963, -3513731, -3497073, -3467832, -3471807, -3487550, -3482571, -3458024, -3455585, -3427625, -3409007, -3381305, -3392895, -3422873, -3417531, -3372564, -3350439, -3324731, -3304389, -3346037, -3381826, -3361608, -3295163, -3306453, -3297969, -3284980, -3271647, -3247050, -3243314, -3277076, -3287693, -3293449, -3306094, -3296578, -3232652, -3188917, -3184439, -3216819, -3244769, -3242698, -3227929, -3217607, -3185507, -3152872, -3171086, -3155121, -3120151, -3153287, -3173038, -3149756, -3138518, -3110670, -3075756, -3089022, -3101919]
10262c101919J9737J2344N259J148K4131K1301n816m207J9173J2458M154J4529
10250b977708l0292K9200R669l0685l265J5906L4488L1607j0681K6400L282o645
10238b908724j3066L999M7911j360k2747q216l0160L4761N6588J3922l817j0932
10226b841841j0519J1653J5844r369j0163j991l595J0678p7j8329j1364L0222
10214b838851K9265L9304O1525J725J0160j1364k2027J3790o974L3948K0470J4421
10202b654608j599l0494k0354k6382l183L3401M4011k4071q057L3101O1833P496
10190b588906j1291l828L0555J6491j3466N880K84O001J6110M931L6957M3613
10178b456669k5330l9271j2645K787r71J5089k5884j0254K4398L9943L0323j8406
$$ y = [-3101919, -3082182, -3069838, -3064579, -3063431, -3039300, -3017999, -3023815, -3028022, -3008849, -2996391, -2992237, -2977708, -3008000, -2978800, -2969131, -2999816, -3003081, -2987175, -2952687, -2921080, -2931761, -2905361, -2902079, -2908724, -2921790, -2917791, -2869880, -2871240, -2893987, -2902203, -2932363, -2897602, -2841014, -2827092, -2830909, -2841841, -2852360, -2840707, -2824863, -2834232, -2844395, -2846386, -2849981, -2839303, -2839380, -2857709, -2869073, -2838851, -2809586, -2770282, -2708757, -2707032, -2696872, -2708236, -2730263, -2716473, -2723447, -2689499, -2669029, -2654608, -2656207, -2686701, -2707055, -2733437, -2736620, -2703219, -2659208, -2683279, -2691336, -2658235, -2596402, -2588906, -2600197, -2604025, -2573470, -2556979, -2570445, -2564565, -2564281, -2558280, -2542170, -2537239, -2500282, -2456669, -2481999, -2521270, -2533915, -2531128, -2532099, -2517010, -2542894, -2553148, -2528750, -2488807, -2458484, -2476890]
10166b476890j3891J2961J4973l9202n9868n370K266N9690L9928L714l2542k2078
10154b516309k0601l3417l3130k1303J327N501r693K6588K2953K7454R457k4218
10142b565391l167k7312n7647l9584q08j6320L4104L3590q776n2390J0028K2383
10130b671290N2908k3034k1124l654L0557L6415L567j3116n1937l250J544L5312
10118b627102L7549K4215J565L9110O612j3340K2243J3953k3423J3541k4372j3840
10106b543289K0275J8035p063K9317P564k0721K3484K9721Q396M3147j9011j8191
10094b428336k6985M1903n950j5839l276j3329R294L6425L7151K2595n792n016
10082b357155J876q472O803j5973n3801J0123o533N036m422J3990M1342J3674
$$ y = [-2476890, -2490781, -2477820, -2462847, -2502049, -2561917, -2567287, -2565021, -2505331, -2465403, -2461689, -2494231, -2516309, -2536910, -2570327, -2603457, -2624760, -2623433, -2617932, -2627625, -2601037, -2578084, -2550630, -2541173, -2565391, -2568558, -2595870, -2653517, -2693101, -2693909, -2710229, -2676125, -2642535, -2651311, -2703701, -2693673, -2671290, -2618382, -2641416, -2662540, -2666194, -2635637, -2599222, -2595655, -2608771, -2660708, -2663958, -2662414, -2627102, -2589553, -2565338, -2563773, -2524663, -2518051, -2531391, -2509148, -2495195, -2518618, -2505077, -2529449, -2543289, -2523014, -2504979, -2512042, -2482725, -2475161, -2495882, -2472398, -2442677, -2434281, -2391134, -2410145, -2428336, -2455321, -2413418, -2419368, -2435207, -2438483, -2451812, -2442518, -2406093, -2368942, -2346347, -2352139, -2357155, -2355279, -2363751, -2356948, -2372921, -2426722, -2416599, -2423132, -2418096, -2422518, -2408528, -2367186, -2353512]
10070b353512l2214K0314J8253j1124k6254J138J5276L5819j3762k6655J2538
10059b360183L511O754j2380k6892j235m1086J3909M9371M7119R598n283L440
10047b313357j299j632M3250R110l6585l3952N2289N3907K8459R910J198k4584
10035b213286m0871j6799p612M0367l655k1981K058P451L0432J6026J7048J6529
10023b174293n101j8905P219k90J8602N300Q234j2114l9134l4101J8674K1193
10011b204716K7033N2840k6929K0525j2904l3049Q590l5597Q589J8744J3340J9697
9999b143837k0083J8758J3563l3648k2185L7367R747J5326L189L7602O6800J5012
9987b002389o6757p6068l6247M2199M6851k1432k1690l8237K4887j2467l194N155
$$ y = [-2353512, -2385726, -2365412, -2347159, -2358283, -2384537, -2383399, -2368123, -2332304, -2346066, -2372721, -2360183, -2356672, -2349918, -2362298, -2389190, -2390425, -2431511, -2417602, -2368231, -2321112, -2311514, -2316797, -2313357, -2314656, -2316288, -2273038, -2263928, -2300513, -2334465, -2282176, -2228269, -2199810, -2189900, -2188702, -2213286, -2254157, -2270956, -2278568, -2238201, -2241856, -2263837, -2261779, -2254328, -2223896, -2207870, -2190822, -2174293, -2179394, -2198299, -2191080, -2191370, -2172768, -2167468, -2159234, -2171348, -2210482, -2244583, -2225909, -2204716, -2177683, -2124843, -2151772, -2131247, -2144151, -2177200, -2168610, -2204207, -2195618, -2176874, -2163534, -2143837, -2163920, -2145162, -2131599, -2165247, -2187432, -2150065, -2140318, -2124992, -2121803, -2084201, -2017401, -2002389, -2069146, -2145214, -2181461, -2139262, -2092411, -2113843, -2135533, -2173770, -2148883, -2161350, -2164544, -2159389]
9975b159389N0621O7721K8446l2164j4436m7501K60K751J1080j3121O880M1478
9963b057374P068P879J7918m727m0330K8076K5996k0885o24M8592J5941l9239
9951b011709K509j8800l247J8992K3061L8219L5774n6923N147J1416L161j5745
9939a968145j8854K1466N1291K0304k9429J0909K9400O0799J08138O7856j00005
9928a746270k43676j54311r8536k8080K9450L8404J1513j4268j0579k3797L9403
9917b200747j0787L101O894K2666M0044L4205K0750K8907k72j2667n888j6753
9905b090547m668R296L3917J7917p80J6245k751j884j4576K1098l0009K3026J8349
9892b005367n956J5048J5308l6576k1625k67K3961J574J8161k1743P720L1631
$$ y = [-2159389, -2108768, -2041047, -2012601, -2044765, -2059201, -2106702, -2106442, -2103691, -2092611, -2105732, -2098852, -2057374, -2050306, -2042427, -2024509, -2029236, -2069566, -2041490, -2015494, -2036379, -2037003, -1988411, -1972470, -2011709, -2009200, -2028000, -2031247, -2012255, -1989194, -1950975, -1915201, -1972124, -1966977, -1955561, -1952400, -1968145, -1986999, -1965533, -1914242, -1893938, -1923367, -1912458, -1883058, -1822259, -1714121, -1646265, -1746270, -1989946, -2144257, -2242793, -2270873, -2241423, -2203019, -2191506, -2205774, -2216353, -2240150, -2200747, -2211534, -2208433, -2201539, -2178873, -2138829, -2104624, -2083874, -2054967, -2055239, -2067906, -2073794, -2090547, -2095215, -2085919, -2052002, -2034085, -2034865, -2018620, -2021371, -2023255, -2037831, -2016733, -2046742, -2023716, -2005367, -2011323, -1996275, -1980967, -2017543, -2039168, -2039435, -2015474, -2013900, -1995739, -2017482, -2009762, -1978131]
9880a978131j4010m881M5328M881k1538J6726M89l0092o7402J455M0195J8518
9868a988462J1654J974J7901L5943j1223l0016k6754M875K8323K6589j2325k2990
9856a964511k3085K9195K5154K3874r056l3445j3819J2401R727L4021K7477k8265
9844a910332m3395j090Q039k5552N807o181K3275j2926j7034L6956J6385j5517
9832a941565o775J8435K7910K09J5846o838k401L2665J2206R571j9261j5130j4151
9819a889279r42L0684N1900j310l2501j8117M406L2469N47k3329m6361J8197L3694
9806a839942M679K3430l8269o233k1040m706j5473K3716L4972M0320M627k6094
9794a820013k217L9244j3912R985L494J9702L4305J9911n9684n2309j9621k5964
$$ y = [-1978131, -1992141, -1997022, -1951694, -1946813, -1968351, -1951625, -1951136, -1981228, -2048630, -2047175, -2006980, -1988462, -1976808, -1974834, -1956933, -1920990, -1932213, -1962229, -1988983, -1984108, -1955785, -1929196, -1941521, -1964511, -1987596, -1958401, -1933247, -1909373, -1918429, -1951874, -1965693, -1953292, -1943565, -1909544, -1882067, -1910332, -1953727, -1954817, -1946778, -1972330, -1966523, -1972704, -1949429, -1962355, -1979389, -1942433, -1926048, -1941565, -1948340, -1929905, -1901995, -1901786, -1885940, -1892778, -1895179, -1862514, -1850308, -1840737, -1859998, -1875128, -1889279, -1890221, -1859537, -1807637, -1808947, -1841448, -1859565, -1855159, -1822690, -1822143, -1845472, -1891833, -1873636, -1839942, -1835263, -1811833, -1850102, -1856335, -1877375, -1882081, -1897554, -1873838, -1838866, -1798546, -1793919, -1820013, -1822230, -1782986, -1796898, -1786913, -1783419, -1763717, -1729412, -1709501, -1769185, -1821494, -1841115, -1867079]
9782a867079n193N4298J2647j7932J0043K2715m766j8667l3063L6263Q0590j5625
9770a745769o4379k495R74l6065k7728K6463M032j6191l5084l2288j1311O4680
9758a875161N3460N350J6494L105L5086L7439O670k3017n1495K0295M0024k0654
9746a752404l8478m1488l402N5763L1223m642R438k301j3208J5950l337K142L5129
9733a709615L6627L310m0618k9367k0401j1720J4566J6784k1946K3642L9224j0329
9721a709843j7356m45j6483O358P776l5464L055J1373J9235K0134n295m3794K5746
9708a735003J8819J0665L3476j2199j3989k9034q361K9011n297J9466J3996R170
9696a669280p523j5652j7978j9222L5079J9398k4144L4k2981o136j843K6868M2319
$$ y = [-1867079, -1872272, -1817974, -1805327, -1823259, -1813216, -1790501, -1795267, -1813934, -1846997, -1810734, -1730144, -1745769, -1810148, -1812643, -1811669, -1847734, -1875462, -1848999, -1844967, -1861158, -1896242, -1928530, -1939841, -1875161, -1821701, -1816351, -1799857, -1796752, -1761666, -1724227, -1717557, -1740574, -1792069, -1771774, -1731750, -1752404, -1790882, -1832370, -1835772, -1780009, -1748786, -1753428, -1743990, -1746291, -1759499, -1743549, -1746886, -1744744, -1709615, -1672988, -1669678, -1710296, -1739663, -1760064, -1771784, -1757218, -1740434, -1762380, -1738738, -1699514, -1709843, -1727199, -1727644, -1744127, -1737769, -1729993, -1765457, -1762402, -1751029, -1731794, -1711660, -1716955, -1760749, -1735003, -1716184, -1705519, -1672043, -1684242, -1698231, -1727265, -1735626, -1706615, -1711912, -1692446, -1678450, -1669280, -1676803, -1692455, -1710433, -1729655, -1694576, -1675178, -1699322, -1699288, -1722269, -1728405, -1730248, -1703380, -1661061]
9683a661061n05l3591K0951J2759Q812L3210L1566j7957m2113J4015J0405K2604
9671a600905Q452n128j8540Q929M7644K6433k4897R444j9157L0801J7597J3039
9659a506288K1244k8862k2325J5485O7398N7728N2177j7603j37057j54581j55799
9648a808483r0555k5625l866j3918j6237K4878M2258R855J0842K1915O3847M4679
9636a740410L6196l634p490J3737J6970p112j1829J2301R578K8603l0036j0873
9624a693999J8405J2480R307k9719q855R437K1576L4053L20j6593L8329l8238
9612a643497k6515j1835j4862N7073n349R605k3128L174n724R195K6583P033J3928
9599a604319n83k5864L261l2386j5650k1872n395L2546K702p288J1083K3318O318
$$ y = [-1661061, -1661566, -1695157, -1674206, -1661447, -1652635, -1619425, -1587859, -1605816, -1647929, -1633914, -1623509, -1600905, -1592453, -1597581, -1616121, -1607192, -1559548, -1533115, -1558012, -1548568, -1567725, -1536924, -1519327, -1506288, -1485044, -1513906, -1536231, -1520746, -1453348, -1395620, -1343443, -1361046, -1498103, -1652684, -1808483, -1899038, -1924663, -1928529, -1942447, -1958684, -1933806, -1891548, -1881693, -1870851, -1848936, -1785089, -1740410, -1704214, -1707848, -1715338, -1701601, -1684631, -1691743, -1703572, -1691271, -1681693, -1653090, -1683126, -1693999, -1675594, -1663114, -1653807, -1683526, -1692381, -1682944, -1661368, -1627315, -1626995, -1643588, -1605259, -1643497, -1670012, -1681847, -1696709, -1639636, -1644985, -1635380, -1658508, -1655334, -1661058, -1651863, -1625280, -1618247, -1604319, -1604902, -1630766, -1627505, -1659891, -1675541, -1697413, -1702808, -1670262, -1667560, -1674848, -1663765, -1640447, -1634129]
9586a634129N2487K5229k9652m4693J4355L1455L3993l8518j1709K9336l2670
9575a604516p8039l3220J0886J8755K7010N208o775K150K2433O3510K5405l6438
9563a583631k0107j4786j2961P574Q819J7809J1523Q42J9020P911J1779O265k5025
9550a564968j0479J3228k6673k5844N2053K2066m739r447J6744q140k1416j9319
9538a586934n035L9930m421j3612P933O8834R911k7201j9871n0358j8267K9243
9526a569848O342n066L9975K1544Q888j1746k1033R393J1283R824k4553j3553
9514a538550J0257K414j3775j9720n418L5875J6132p826l7173p033m408K1548
9502a547677J5538J2537J6882p155K4995j96k3565k0123l0644j5893n559j5178
$$ y = [-1634129, -1581642, -1556413, -1586065, -1630758, -1616403, -1584948, -1550955, -1589473, -1601182, -1571846, -1604516, -1682555, -1715775, -1704889, -1686134, -1659124, -1653916, -1660691, -1658541, -1636108, -1572598, -1547193, -1583631, -1603738, -1618524, -1631485, -1623911, -1615092, -1597283, -1585760, -1584918, -1565898, -1557987, -1546208, -1539943, -1564968, -1575447, -1562219, -1588892, -1614736, -1562683, -1540617, -1545356, -1554803, -1538059, -1546199, -1567615, -1586934, -1591969, -1552039, -1556460, -1570072, -1562139, -1493305, -1483394, -1510595, -1530466, -1580824, -1599091, -1569848, -1563506, -1568572, -1528597, -1507053, -1498165, -1509911, -1530944, -1521551, -1510268, -1500444, -1524997, -1538550, -1528293, -1525879, -1539654, -1559374, -1564792, -1528917, -1512785, -1520611, -1557784, -1564817, -1569225, -1547677, -1532139, -1519602, -1502720, -1509875, -1484880, -1485076, -1508641, -1528764, -1559408, -1575301, -1580860, -1596038]
9490a596038o502N4535J7785J5792J4514l873K1449o840m7438m5385M9435O1519
9478a471047q866k8598j8345k5745J9113J0224m953M9206j0569k2241J6726K2840
9466a472255j0024l4802l8840n781N2333Q147o986K4711K7378k1355K8732k7456
9454a476198l7864o321J4169j7260k9617Q292K1713L9765Q374o8918l6035p041
9442a586941O4019L1068j9039j7095j4063m0018k3119L5128M8304K7574J4011
9431a480171L885N167L3912L223Q679j5553k3622N352J6675L280m0546k0930J0907
9418a489742n859N7776m353o4795k360j8521K3238P946j4837j3894Q584K794j829
9405a515852M9912n342j9915p592K5371K7898N505o026K0976N629K2576J5634
$$ y = [-1596038, -1602540, -1548005, -1530220, -1514428, -1499914, -1503787, -1482338, -1489178, -1536616, -1582001, -1532566, -1471047, -1479913, -1508511, -1526856, -1552601, -1533488, -1523264, -1528217, -1479011, -1489580, -1511821, -1495095, -1472255, -1482279, -1517081, -1555921, -1561702, -1509369, -1501222, -1508208, -1483497, -1456119, -1477474, -1448742, -1476198, -1514062, -1520383, -1506214, -1523474, -1553091, -1544799, -1523086, -1483321, -1474947, -1543865, -1579900, -1586941, -1522922, -1491854, -1510893, -1527988, -1542051, -1582069, -1605188, -1570060, -1521756, -1494182, -1480171, -1476286, -1471119, -1437207, -1433984, -1425305, -1440858, -1464480, -1459128, -1442453, -1439173, -1479719, -1500649, -1489742, -1495601, -1437825, -1442178, -1506973, -1509333, -1527854, -1504616, -1496670, -1511507, -1525401, -1516817, -1514023, -1515852, -1465940, -1471282, -1491197, -1498789, -1473418, -1445520, -1440015, -1446041, -1425065, -1419436, -1396860, -1381226]
9393a381226m2141o9594m9906K5584K8145J3978k4633J1941J1694J7037m932j3465
9381a477518q63J9391m073m083n136j507K9340q282J1081M8314k1292J058k8721
9368a442291q013k1286k877L448r978L8023L8683K5747l7775k2773K7963j2016
9356a423145K1718j1418J660j3818l7809K6830L5220L5486j239m5898J4093k3414
9344a421734Q989m863P780L2676K6833k2585j8233l2349l6377Q194K5181L929
9332a422559n760j0005j0592m741L2669K6085O898K5767j4894K5033j5436l3988
9320a401523j8534o367J2201L6501R929j930K250k0053k5759J2212n3935o214
9308a461222J2141K2955J3850n5407n752q08j7328N0334L5685p459L2464k4576
$$ y = [-1381226, -1423367, -1492961, -1542867, -1517283, -1489138, -1475160, -1499793, -1487852, -1476158, -1459121, -1464053, -1477518, -1478381, -1458990, -1463063, -1467146, -1472282, -1473789, -1444449, -1452731, -1441650, -1393336, -1414628, -1413570, -1442291, -1450304, -1471590, -1474467, -1471019, -1480997, -1442974, -1404291, -1378544, -1416319, -1439092, -1411129, -1423145, -1401427, -1412845, -1411185, -1425003, -1462812, -1435982, -1400762, -1365276, -1366515, -1412413, -1398320, -1421734, -1412745, -1417608, -1409828, -1377152, -1350319, -1372904, -1391137, -1423486, -1459863, -1451669, -1426488, -1422559, -1428319, -1438324, -1448916, -1453657, -1420988, -1394903, -1388005, -1362238, -1377132, -1352099, -1367535, -1401523, -1420057, -1426424, -1414223, -1377722, -1367793, -1369723, -1367473, -1387526, -1413285, -1401073, -1455008, -1461222, -1449081, -1426126, -1412276, -1467683, -1473435, -1474243, -1491571, -1441237, -1405552, -1413011, -1380547, -1405123]
9296a405123o465k119J8995o65l6737m089K0793O000J5572k2273L011j4696j8281
9283a446077k1192J6556K1224n829J4278J6410O54k9488k504K2546L161o4277
9271a474538k6041K6317O0875M8633M6940k7916k7720j1293Q343k1432L7477L9369
9259a320986k6301n1839m1052K0892J4273K2030J544j8221J1769l6261J9858K2189
9247a382105N1399O4953n359l0848j3813k6310j0358R240l4947k6257k1888q421
9235a434714J9558l074R098M915J6271N4762M0195m8043J1145j1342l9025k637
9223a382891J750Q028L2296O6141n4236m6746n880J9500m533j9315j7457L1581
9211a371762J3706m9671j2630L2805L5685M0647R93n0547k0390K9644j4180l0917
$$ y = [-1405123, -1411588, -1413707, -1394712, -1395377, -1432114, -1436203, -1415410, -1409410, -1393838, -1416111, -1413100, -1427796, -1446077, -1467269, -1450713, -1429489, -1435318, -1421040, -1404630, -1403976, -1433464, -1435968, -1413422, -1410261, -1474538, -1500579, -1474262, -1413387, -1364754, -1317814, -1345730, -1373450, -1384743, -1376400, -1397832, -1360355, -1320986, -1347287, -1399126, -1440178, -1419286, -1405013, -1382983, -1381439, -1399660, -1387891, -1424152, -1404294, -1382105, -1330706, -1265753, -1271112, -1301960, -1315773, -1342083, -1352441, -1343201, -1378148, -1404405, -1426293, -1434714, -1415156, -1418230, -1409132, -1404217, -1387946, -1333184, -1292989, -1341032, -1329887, -1341229, -1380254, -1382891, -1381141, -1373113, -1340817, -1274676, -1328912, -1375658, -1381538, -1362038, -1366571, -1385886, -1403343, -1371762, -1358056, -1407727, -1420357, -1387552, -1351867, -1311220, -1310227, -1360774, -1381164, -1351520, -1365700, -1396617]
9199a396617J1780N866M791j4003q698L7425J8096k4340M140N914R911J6378L1393
9186a297964l0852L0402k984j9194j6287J5358M7249m1328j7914L0067p738n340
9174a316525j487q737M078J022q359k0061M558j493O338l338r034J1991k8967
9161a370014j904J0681J5143n955L1521O2647K7425k8090j1557J4441m0536r975
9149a306173O374M1713K9595m8506k1925p224r377j6225j0657K1225M0241K7524
9137a253415R574K2941R727n5110k7364k8130l5906k4641L9758j4523p166N2408
9125a311847N2048J9879j2491k1350k7859N236K0365J6161L5391j9244n1722J6738
9113a278695L5099l2439l4091R709J3596j5295N081K7009K6107l4572r599r320
$$ y = [-1396617, -1384837, -1378971, -1374180, -1388183, -1396881, -1359456, -1341360, -1365700, -1361560, -1355646, -1345735, -1329357, -1297964, -1328816, -1298414, -1301398, -1320592, -1336879, -1321521, -1274272, -1315600, -1333514, -1303447, -1311185, -1316525, -1318012, -1326749, -1322671, -1321649, -1330008, -1350069, -1345511, -1347004, -1340666, -1344004, -1353038, -1341047, -1370014, -1371918, -1361237, -1346094, -1352049, -1320528, -1257881, -1230456, -1258546, -1270103, -1255662, -1296198, -1306173, -1299799, -1258086, -1228491, -1276997, -1298922, -1306146, -1315523, -1331748, -1342405, -1321180, -1280939, -1253415, -1243841, -1220900, -1211173, -1266283, -1293647, -1321777, -1357683, -1382324, -1342566, -1357089, -1364255, -1311847, -1259799, -1239920, -1252411, -1273761, -1301620, -1296384, -1276019, -1259858, -1224467, -1243711, -1295433, -1278695, -1243596, -1276035, -1310126, -1300417, -1286821, -1302116, -1297035, -1270026, -1243919, -1278491, -1288090, -1297410]
9101a297410M691R751j4934k2136k066J2701O0000L4256n0477k8670j0997J7370
9089a287921j02j0996Q524L0947l2154j4865J5800j8661J6097J1041J1611l99
9077a271078k6644J3960J5066K5930L9713l440j3772K6150j5927m1778K2145M0246
9065a189429J2426P613j5153j1970m5932L3359L3286j256m5499l2367J220N247
9053a248455J9339J1990k0701K941l7609l4390R78j3597O979K9334K2412K3507
9041a237272J9247J7081j2523j2061j1762k2627P856K6963J2708j5098J67M2495
9029a184826K0831J433N207m0918K730O982l1292l4416j4428L6512J8596K3220
9017a190369J811m3126j597p808J2449K0663J6576j500r006j7661M039j2939K4318
$$ y = [-1297410, -1292719, -1282968, -1297902, -1320038, -1322104, -1309403, -1249403, -1215147, -1265624, -1294294, -1305291, -1287921, -1288023, -1299019, -1290495, -1259548, -1291702, -1306567, -1290767, -1309428, -1293331, -1282290, -1270679, -1271078, -1297722, -1283762, -1268696, -1242766, -1203053, -1206493, -1220265, -1194115, -1210042, -1251820, -1229675, -1189429, -1177003, -1169390, -1184543, -1196513, -1242445, -1209086, -1175800, -1177056, -1222555, -1254922, -1253702, -1248455, -1229116, -1217126, -1237827, -1234886, -1272495, -1306885, -1305907, -1319504, -1312525, -1283191, -1260779, -1237272, -1218025, -1200944, -1213467, -1225528, -1237290, -1259917, -1252061, -1225098, -1212390, -1227488, -1227321, -1184826, -1163995, -1162562, -1157355, -1198273, -1195543, -1188561, -1219853, -1254269, -1268697, -1232185, -1213589, -1190369, -1188558, -1231684, -1233281, -1241089, -1228640, -1207977, -1191401, -1192901, -1201907, -1219568, -1215529, -1228468, -1204150]
9004a204150r289m1561o174m843j2654J7604R964O5079k3744J1430r96k7672j2139
8991a239145K8879L2848K0568K5l7212l1075k5958N0267K8370j8215m254K664
8979a192238p682J3281r582l6695j4404q315q723L2115K9037J9512n1102j5608
8967a250404k0027j9285j311J2767j8235n357l398L1022L6427P0372M5461k7754
8955a149722j3120j8703L677j1089k7980j6689j1054l5178M869M8206M2900O226
8943a177657J0036Q353j1703k941k7019L664J6147M2602J985l5422j0131R533
8931a172553j2944J1934R792K627J425J3326m517k939N820J7786k4995o6792n554
8918a227584j0739j6173J6089N7508M1070j9630O375j2265p502K5754L089j7689
$$ y = [-1204150, -1213439, -1255000, -1261174, -1266017, -1278671, -1261067, -1251103, -1186024, -1209768, -1198338, -1199334, -1227006, -1239145, -1210266, -1177418, -1156850, -1156825, -1194037, -1225112, -1251070, -1200803, -1172433, -1190648, -1194902, -1192238, -1199920, -1186639, -1196221, -1232916, -1247320, -1255635, -1264358, -1232243, -1203206, -1183694, -1234796, -1250404, -1270431, -1289716, -1291027, -1278260, -1296495, -1301852, -1305250, -1274228, -1237801, -1167429, -1121968, -1149722, -1162842, -1181545, -1177868, -1188957, -1216937, -1233626, -1244680, -1279858, -1274989, -1226783, -1183883, -1177657, -1167621, -1159268, -1170971, -1173912, -1200931, -1197267, -1181120, -1138518, -1136533, -1171955, -1182086, -1172553, -1185497, -1173563, -1163771, -1161144, -1159719, -1146393, -1150910, -1153849, -1148029, -1130243, -1155238, -1222030, -1227584, -1238323, -1254496, -1238407, -1180899, -1139829, -1159459, -1153084, -1165349, -1172851, -1147097, -1144008, -1161697]
8906a161697k237L878k3564j8990L9309L5738J3338q397l1939J2258L0808k2717
8894a134212m844o638l0060j9394J1627k4948N366P8564N7428k1253K041M472
8882a081851p947j6017m5583j9077j2066K1454J9228L0254m0923k4586L6180j1957
8870a152891o751M332q39J7875j8835k3372l0661r116N1397K8521L4016k357j9700
8857a128381n0669k722M527M031j7490M2875J5460K1120l4414j4030J4189k3430
8845a168934j6396K8037L0799J5510k2209l8490k5764J7098N533j3501J607j1660
8833a198370L3418K7244j7895Q883K1121L9266r106r334J2858l5524l0519q835
8821a166793N239J0339L306M0063l478j6797O070r185j0157M915L8847J3956m2854
$$ y = [-1161697, -1163934, -1160056, -1183620, -1202610, -1163301, -1127563, -1114225, -1122622, -1154561, -1142303, -1111495, -1134212, -1139056, -1145694, -1175754, -1195148, -1183521, -1208469, -1203103, -1124539, -1067111, -1088364, -1086323, -1081851, -1089798, -1105815, -1151398, -1170475, -1182541, -1161087, -1141859, -1111605, -1152528, -1177114, -1140934, -1152891, -1159642, -1155310, -1156149, -1138274, -1157109, -1180481, -1211142, -1220258, -1168861, -1140340, -1106324, -1108681, -1128381, -1179050, -1181772, -1177245, -1173214, -1190704, -1147829, -1132369, -1111249, -1145663, -1159693, -1145504, -1168934, -1185330, -1157293, -1126494, -1110984, -1133193, -1171683, -1197447, -1180349, -1174816, -1188317, -1186710, -1198370, -1164952, -1137708, -1155603, -1146720, -1125599, -1086333, -1095439, -1104773, -1091915, -1127439, -1157958, -1166793, -1161554, -1151215, -1147909, -1107846, -1111324, -1128121, -1122051, -1131236, -1141393, -1136478, -1097631, -1083675, -1126529]
8808a126529k287o382m1195J6216M1954l3214j4375k6363J5988M6197Q423p021
8796a128588L255l0848N8274J5848n978k3064L0204o52j9070m179O677L4579L37
8783a063205O324J2208J9731l0760j8343j8957R211j0577l5863K83K8261J118
8771a100569j4829p372R830J0478l2146J3692k1046m737K0014J8508Q185P941
8759a092051m0576p345L1874K6628K0711n5837k1703j1803n004L7011J6452P346
8747a094297K206k118j0142j3024M0814j9600j3901N2991J3941m2886j3354m136
8735a103506j1728J5195L5147L7568m0710m8945m719L5393L8444q4l7075N773
8723a079247J4696J0021J9848J8605k7254j8988P661j3291k4260L798N6876K9943
$$ y = [-1126529, -1128816, -1135198, -1176393, -1160177, -1118223, -1151437, -1165812, -1192175, -1176187, -1129990, -1121567, -1128588, -1125333, -1156181, -1097907, -1082059, -1088037, -1111101, -1080897, -1081549, -1100619, -1104798, -1098121, -1063542, -1063205, -1056881, -1044673, -1024942, -1055702, -1074045, -1093002, -1083791, -1094368, -1130231, -1129948, -1101687, -1100569, -1115398, -1122770, -1112940, -1102462, -1134608, -1120916, -1141962, -1146699, -1126685, -1108177, -1099992, -1092051, -1132627, -1139972, -1108098, -1081470, -1060759, -1116596, -1138299, -1150102, -1155106, -1118095, -1101643, -1094297, -1092091, -1094209, -1104351, -1117375, -1076561, -1096161, -1110062, -1057071, -1043130, -1086016, -1099370, -1103506, -1115234, -1100039, -1064892, -1027324, -1068034, -1116979, -1121698, -1086305, -1047861, -1047945, -1085020, -1079247, -1064551, -1054530, -1034682, -1016077, -1043331, -1062319, -1054658, -1067949, -1092209, -1088411, -1031535, -1001592]
8711a001592K1737n8742k7383J0193j8412L8051M103r490P724k251m7452m0488
8699a124002K3938M2206M2036o689k8863l9538j6940Q935p75L2995K1493k4398
8687a069602o2994l4860N9060K3257l1951j9809L2353L2046m075q100k9404J8625
8675a095454O9705Q628k6238n1693l6665K6780K3246M1215J0376j1483j4648n307
8663a061538j7296j487L4800P704N30j7278k8419o013r548l6975M397O2931P5176
8650i93016j6457q847J038j2659j3399j6927K9138J9758k7018l266k747j8523
8638a062925j0113J2052J8754L7876K1569k3294K6978J1388L563k961J648L219
8626i62246n3549n328k2253j5704k6931j6620L0313K4633Q912r54o250M2829O023
$$ y = [-1001592, -979855, -1038597, -1065980, -1055787, -1074199, -1036148, -1032045, -1041535, -1033811, -1036062, -1083514, -1124002, -1100064, -1057858, -1015822, -1022511, -1051374, -1090912, -1107852, -1098917, -1099692, -1066697, -1045204, -1069602, -1132596, -1167456, -1108396, -1085139, -1117090, -1136899, -1104546, -1072500, -1076575, -1084675, -1114079, -1095454, -1025749, -1017121, -1043359, -1095052, -1131717, -1104937, -1081691, -1040476, -1030100, -1041583, -1056231, -1061538, -1078834, -1080321, -1045521, -1037817, -1037287, -1054565, -1082984, -1088997, -1098545, -1135520, -1131123, -1068192, -993016, -1009473, -1018320, -1017282, -1029941, -1043340, -1060267, -1031129, -1011371, -1038389, -1041655, -1044402, -1062925, -1073038, -1060986, -1042232, -1004356, -982787, -1006081, -979103, -967715, -964152, -967113, -965465, -962246, -1015795, -1021123, -1043376, -1059080, -1086011, -1102631, -1072318, -1047685, -1038773, -1039727, -1045977, -1003148, -997125]
8613i97125k5968n6345J3405K4863K6718l1308k7705K1838L0724O0254j2079m5103
8601a017831k0546j3455J2201J9418r222J844K1080k2661K1555J4931Q553l0220
8589a014353o016p44j5274m6122N2353M4006j5266k80R246j3222j1836Q920k871
8576a011459K062q325l7704j9193J9947L4457l2246k4092p202J0517Q482K1730
8564a043026k1555N308J1088j3778j429L2518l633o816j2616J4816P584k2461
8552a054000k4985q193k182J2969K5617J4911j2522n51N2867M2955k3202k5227
8540a001543j5995j4238J3494L292j1939k314j2562l5244L073N676M7424K4047
8528i96829l7422j1957p050J9198p132J0493M1567j0657n1803j0721l9341Q700
$$ y = [-997125, -1023093, -1079438, -1066033, -1041170, -1014452, -1045760, -1073465, -1051627, -1020903, -960649, -972728, -1017831, -1038377, -1051832, -1039631, -1020213, -1029435, -1027591, -1006511, -1029172, -1007617, -992686, -984133, -1014353, -1020369, -1021113, -1036387, -1082509, -1030156, -986150, -1001416, -1001696, -992450, -1005672, -1017508, -1008588, -1011459, -1009397, -1017722, -1055426, -1074619, -1054672, -1020215, -1052461, -1076553, -1083755, -1073238, -1064756, -1043026, -1064581, -1059273, -1048185, -1061963, -1063392, -1030874, -1034507, -1041323, -1053939, -1039123, -1031539, -1054000, -1078985, -1087178, -1089360, -1076391, -1050774, -1035863, -1048385, -1048936, -996069, -953114, -976316, -1001543, -1017538, -1031776, -1018282, -1014990, -1026929, -1029243, -1041805, -1077049, -1073976, -1068300, -1020876, -996829, -1034251, -1046208, -1053258, -1034060, -1041192, -1030699, -989132, -999789, -1051592, -1062313, -1101654, -1092954]
8516a092954O577m2876r563N0467K0209j6124R903L7415R427j278j035k0520l370
8503a053722j2991j7359j8561j0106J2757J8926m692M8244Q972k9223L0815k68
8491a027208l3992m3626j2660M9989K2896l5090l9765o632L713j5694M0655L6984
8479a060430m008j6218J1733N0621J0291l1779k5194J0346K739L6332j5185L6573
8467i94179j7838n3880m174J5451R191K1768M0423J7895l1835P257K9781M795
8455i55345l5072J5450n704l1450L3254R357n5533l6723J3675M6872j4546k2514
8443a038279j0720o909k739Q193L145o637N254L5737K3067k3299J643n557l3908
8430a051009j1380L2471Q617k4127m658j4189l3221m983L4221M2072m122p387
$$ y = [-1092954, -1086377, -1129253, -1138816, -1088349, -1068140, -1084264, -1074361, -1036946, -1027519, -1028797, -1029832, -1050352, -1053722, -1066713, -1084072, -1102633, -1112739, -1099982, -1081056, -1085748, -1037504, -1028532, -1057755, -1026940, -1027208, -1061200, -1104826, -1117486, -1067497, -1044601, -1079691, -1119456, -1126088, -1122375, -1138069, -1097414, -1060430, -1064438, -1080656, -1068923, -1018302, -1008011, -1039790, -1064984, -1054638, -1051899, -1015567, -1030752, -994179, -1012017, -1065897, -1070071, -1054620, -1045429, -1023661, -983238, -965343, -997178, -989921, -960140, -955345, -990417, -974967, -980671, -1012121, -978867, -969510, -1025043, -1061766, -1048091, -1001219, -1015765, -1038279, -1048999, -1055908, -1058647, -1050454, -1047309, -1053946, -1048692, -1012955, -989888, -1013187, -1011544, -1017101, -1051009, -1062389, -1029918, -1021301, -1045428, -1050086, -1064275, -1097496, -1102479, -1068258, -1026186, -1030308, -1037695]
8418a037695J3825q039q544J0178j504k2736K358J623M6201J1477k5865n0009
8406a068730k0058L8102L3201k0890m81l1153l1088P500M6881L5979k6793j1760
8394a049290R377J5666K3480O3353L7911j981k6393q270o201J43k2794l8223j259
8381a004481R037K8601J8884m0447l2852k3611Q667K5275r717j831j280J8384
8369a005371O080K7695j0366j5223K4577M8397K04R89J186j9460L8684J1115J2
8356h91481K3813J643n430n3494j7414K6114M1252p640R040L3593l688M5161R1984
8343g06547L3336m9424j34868j58376r1788n8345j2335J7618M285J015L2171J0324
8331a112934N3504N12l0843k2367N6084N2631j8807N8433L0094J8680k5429j5166
$$ y = [-1037695, -1023870, -1031909, -1040453, -1030275, -1031779, -1054515, -1052157, -1050534, -1004333, -992856, -1018721, -1068730, -1088788, -1050686, -1017485, -1038375, -1038856, -1070009, -1101097, -1093597, -1046716, -1010737, -1037530, -1049290, -1039913, -1024247, -1000767, -937414, -899503, -901484, -927877, -936147, -942348, -942205, -964999, -1003222, -1004481, -995444, -966843, -947959, -988406, -1021258, -1044869, -1036202, -1010927, -1020644, -1022475, -1023755, -1005371, -999291, -971596, -981962, -997185, -972608, -924211, -924007, -923018, -921832, -941292, -902608, -891493, -891481, -867668, -866025, -871455, -924949, -942363, -916249, -874997, -882637, -873597, -840004, -843692, -798531, -706547, -673211, -722635, -857503, -1015879, -1107667, -1166012, -1178347, -1160729, -1156444, -1155429, -1123258, -1112934, -1059430, -1058918, -1089761, -1112128, -1056044, -1003413, -1022220, -963787, -933693, -915013, -940442, -955608]
8319i55608P966M0617L443l4410k1435K701K7378J3700J7145n140K8045M6981
8307h28617K2098L0649O7520J8929M1986L1250M1792J16223J04818k0456l16974
8296f90782m07460k51197q1319m472N645R400O6629K5533j0593L2122M1478N5526
8284a209490K802J7031M5480N479J0520K7109k5301l0310K9432L9171k603O058
8272a084622P147K6072k905Q243L775l2711J4086O9826j299L9961J2825m0117
8260i79719J2492J9658P685L2793M6490L0058k9872r0304j48646j05218j09624
8249a314207r2128K6838L7909J8521J8246L8158K93M1515N2777M1338M0718j4529
8237a104551k8317K1976j884j3801k8387j0487l2096K4982K8585J3137o435j9948
$$ y = [-955608, -947642, -907025, -903582, -937992, -959427, -956726, -929348, -915648, -898503, -903643, -875598, -828617, -806519, -775870, -708350, -689421, -647435, -616185, -574393, -458170, -353352, -373808, -690782, -1098242, -1349439, -1430758, -1435230, -1429585, -1420185, -1353556, -1328023, -1338616, -1306494, -1265016, -1209490, -1206688, -1189657, -1144177, -1138698, -1128178, -1101069, -1126370, -1156680, -1127248, -1088077, -1090680, -1084622, -1077475, -1051403, -1054308, -1046065, -1042290, -1075001, -1060915, -991089, -992388, -952427, -939602, -979719, -967227, -947569, -939884, -907091, -860601, -830543, -860415, -950719, -1099365, -1204583, -1314207, -1406335, -1379497, -1341588, -1323067, -1304821, -1266663, -1266370, -1224855, -1172078, -1130740, -1090022, -1104551, -1132868, -1110892, -1112776, -1126577, -1154964, -1165451, -1197547, -1172565, -1143980, -1130843, -1137278, -1157226]
8225a157226k6766J536O6120J0369Q990L6133l449j8899k390K1821J6404J9064
8213a028293m708k2058j2157M390o483K253J8929L370j6760J1902J5868k5316
8201a059063Q059K9127J8848r663o115l3594m8796j5831J7309O79R007J9376R75
8188a069682j5883J2011K411N5k3594J7681N3894m353n407M3412O672l8879j3645
8175a035307N5176k5410n3834K6309K6947k9060j3583q540j3512K0669K4953O794
8163a018398J749J9668k1817k4251k347K049n546j3216j6298k5885R734K6964
8151a067594J4463K415J1417J4240J9610L3363k7790l6007k161J244m2243L815
8139a075228L5561J0150l5836k0829j6768M5182K5832l121o615j3806L9782L175
$$ y = [-1157226, -1183992, -1182456, -1116336, -1105967, -1096977, -1060844, -1064293, -1083192, -1085582, -1063761, -1047357, -1028293, -1033001, -1055059, -1067216, -1062826, -1069309, -1067056, -1048127, -1044757, -1061517, -1049615, -1033747, -1059063, -1051004, -1021877, -1003029, -1012692, -1018807, -1052401, -1101197, -1117028, -1099719, -1099040, -1090033, -1070657, -1069682, -1085565, -1073554, -1071143, -1071088, -1094682, -1077001, -1023107, -1027460, -1032867, -989455, -982783, -1021662, -1035307, -980131, -1005541, -1059375, -1033066, -1006119, -1035179, -1048762, -1057302, -1070814, -1050145, -1025192, -1018398, -1016649, -996981, -1018798, -1043049, -1045396, -1043347, -1048893, -1062109, -1078407, -1104292, -1094558, -1067594, -1053131, -1050716, -1039299, -1025059, -1005449, -972086, -999876, -1035883, -1038044, -1036800, -1079043, -1075228, -1039667, -1029517, -1065353, -1086182, -1102950, -1057768, -1031936, -1035057, -1041672, -1055478, -1015696, -1012521]
8127a012521k630L0844j5891m4374K2156L4233l7232k4534j8040J7957K2412n9090
8115a086710L7856N357k4701M4073N2189j281k4118q586q837j9068L5278J2998
8103i85550J0823j9155r552k3697P693J9509K1805k6437j933n708k5070q938L1211
8090a014999J4686Q984J7152l6066j4418K4480J5720K6542N282n4151p355O703
8078a007440J4813J1971J8602l8640m3871J5457p841m558J4995L5436J6327K0590
8066i54159N6912J9482k2979j8558m7028K330k6162j295j8271K1521M1607j7076
8054i63676m5069j9139Q239j6861k83O3535J5955l8101q71L3857J3133j0415l0393
8041i90089J6487K4395J7471K890k3693r108K794J3210j2803k0305J8849J741
$$ y = [-1012521, -1015151, -984307, -1000198, -1044572, -1022416, -988183, -1025415, -1049949, -1067989, -1050032, -1027620, -1086710, -1048854, -1043497, -1068198, -1024125, -971936, -973217, -997335, -1005921, -1014758, -1033826, -998548, -985550, -974727, -993882, -1003434, -1027131, -1019438, -999929, -978124, -1004561, -1006494, -1012202, -1037272, -1046210, -1014999, -1000313, -991329, -974177, -1010243, -1024661, -1000181, -984461, -957919, -952637, -1006788, -1014143, -1007440, -992627, -980656, -962054, -1000694, -1044565, -1029108, -1036949, -1041507, -1026512, -991076, -974749, -954159, -897247, -877765, -900744, -919302, -966330, -964000, -990162, -991457, -1009728, -988207, -946600, -963676, -1008745, -1027884, -1019645, -1036506, -1036789, -973254, -957299, -995400, -996271, -962414, -949281, -959696, -990089, -973602, -949207, -931736, -928846, -952539, -961647, -958853, -945643, -958446, -978751, -959902, -958161]
8029i58161j6330L3942K756j0171k5135Q638L0251m9221j6270L9424L9867N593
8017i14817n006J8176l1164j959J7787j418N826p191p939j5062r957R539J6753
8004i26432j6225j8388k5611K3007M0739l7815j2179K99k4114M4806L5377J2687
7992i03849k1243k2398L4623j4681K389Q285j387j3012k5662M7598L0482m448
7980h83303l9370l1715K3690L7745M536J3651o9712p8858p57M0522r579J1422
7968i81728M6415L2351J2119J5620k9918l7175J2667J3946L53j7273k1712l3227
7956i87562j5759k5489P711L7424K4332P0290J1367k5582M042k618n0377j3496
7944i65717R891K525m8875l6322J1363r957N4275K2441K9295l839k5527q757j7029
$$ y = [-958161, -974491, -940549, -937793, -947964, -973099, -964461, -934210, -983431, -999701, -960277, -920410, -914817, -919823, -901647, -932811, -934770, -916983, -918401, -912575, -919766, -927705, -942767, -952724, -943185, -926432, -942657, -961045, -986656, -963649, -922910, -960725, -972904, -972605, -996719, -951913, -916536, -903849, -925092, -947490, -912867, -927548, -925159, -916874, -918261, -931273, -956935, -909337, -878855, -883303, -922673, -954388, -930698, -892953, -888417, -874766, -944478, -1023336, -1024093, -983571, -993150, -981728, -935313, -902962, -890843, -875223, -905141, -942316, -929649, -915703, -915350, -932623, -954335, -987562, -1003321, -1028810, -1021099, -983675, -959343, -889053, -877686, -903268, -899226, -901844, -952221, -965717, -955826, -953301, -1002176, -1038498, -1027135, -1037092, -982817, -960376, -931081, -934920, -960447, -969204, -986233]
7931i86233K1461L494N5034R770j4570J2600K3429P676J5548k5556p0036j3446
7919i60829L7283P23j9046K5680k9463k9961R099O696l295r004m079K9732n8o047
7905i52569k7L7444J3830J2104j6078k4794N579O864N624m785P574j3883j7421
7892i40538J0307R706J5772j4908k7150k4174L6433L1136k2702J812j3856j346
7880i39508k3564K0596M1480K061l7647m1468J7011J8678J2213J6419J2584L2385
7868h68760k379k1747q40k7156L489K8047l237P665J5315J517k7232J1716j6966
7855i00568m2046o173R763P394J1620M972M778j020m0854k9158J1287L0918k1368
7842i60455J380m165k415J8339K2619J0885Q855R51M2829q554l1563r122J9488
$$ y = [-986233, -964772, -961278, -906244, -896474, -911044, -898444, -875015, -867339, -851791, -877347, -947383, -960829, -923546, -922823, -941869, -916189, -945652, -975613, -966514, -959818, -963113, -972117, -976196, -946464, -946522, -952569, -952596, -915152, -901322, -889218, -905296, -930090, -924511, -917647, -912023, -916808, -909234, -923117, -940538, -930231, -920525, -904753, -919661, -946811, -970985, -934552, -903416, -926118, -924306, -938162, -939508, -963072, -942476, -900996, -898935, -936582, -978050, -961039, -942361, -930148, -913729, -901145, -868760, -871139, -892886, -893726, -920882, -917393, -889346, -892583, -884918, -869603, -868086, -895318, -883602, -900568, -942614, -948787, -939024, -931630, -920010, -915038, -910260, -911280, -952134, -981292, -970005, -939087, -960455, -959075, -963240, -965655, -947316, -924697, -913812, -904957, -904006, -861177, -869731, -901294, -910416, -890928]
7829h90928J065o530N14J1505J0637j3857k5107J7750j6899K9256R839k951r081
7816h84787n448m4687j1261J5540j8728L9651m208l542Q975N537k1391J3317L4654
$$ y = [-890928, -889863, -896393, -895879, -884374, -873737, -887594, -912701, -894951, -911850, -882594, -872755, -875706, -884787, -890235, -934922, -946183, -930643, -949371, -909720, -913928, -917470, -908495, -902958, -924349, -911032, -876378]
$$ [...]
##END NTUPLES=NMR SPECTRUM
##END=
