##TITLE=Analysis number 312876
Compound Code km 04205
Book Reference 451/19
Project Code adrs
Chemist Name evam
##JCAMPDX= 6.0         $$ Bruker NMR JCAMP-DX V2.0
##DATA TYPE= NMR SPECTRUM
##DATA CLASS= NTUPLES
##ORIGIN= Bruker BioSpin GmbH
##OWNER= NMR
$$ XWIN-NMR		Version 3.5
$$ Wed Aug 17 10:17:13 2005 GMT Daylight Time (UT+1h)  MAYBRIDGE\NMR@NMR_250MHZ
##.OBSERVE FREQUENCY= 250.131544655141
##.OBSERVE NUCLEUS= ^1H
##.ACQUISITION MODE= SIMULTANEOUS (DQD)
##.ACQUISITION SCHEME= undefined
##.AVERAGES= 16
##.DIGITISER RES= 18
##SPECTROMETER/DATA SYSTEM= dpx250
##.PULSE SEQUENCE= zg30
##.SOLVENT NAME= DMSO
##.SHIFT REFERENCE= (INTERNAL, DMSO, 0, 16.522)
##AUDIT TRAIL= $$ (NUMBER, WHEN, WHO, WHERE, WHAT)
$$ ##TITLE= Audit trail, XWIN-NMR		Version 3.5
$$ ##JCAMPDX= 5.01
$$ ##ORIGIN= Bruker BioSpin GmbH
$$ ##OWNER= NMR
$$ C:\u/data/dgb/nmr/ADRS/7990/pdata/1/auditp.txt
$$ ##AUDIT TRAIL=  $$ (NUMBER, WHEN, WHO, WHERE, WHAT)
(   1,<2005-08-17 10:16:52.53 +100>,<MAYBRIDGE\NMR>,<NMR_250MHZ>,
      <created by zg, POWCHK disabled, PULCHK disabled
       configuration hash MD5:
       62 19 C7 07 E1 42 D1 B7 37 6C 3D D0 77 39 F9 E6
       data hash MD5: 64K
       CD DA 30 1C 29 61 31 EB DC 69 C7 03 78 34 A8 DA>)
(   2,<2005-08-17 10:17:05.64 +100>,<MAYBRIDGE\NMR>,<NMR_250MHZ>,
      <Start of raw data processing
       ef LB = 0.3 FT_mod = 6 PKNL = 1 SI = 32K 
       data hash MD5: 32K
       50 3D 6E C8 0A 8A B1 85 9D 16 A0 7C 79 C6 E8 E4>)
(   3,<2005-08-17 10:17:07.50 +100>,<MAYBRIDGE\NMR>,<NMR_250MHZ>,
      <apk 
       data hash MD5: 32K
       93 B4 C6 A6 EE 9F 80 F4 4B 30 14 C8 35 3F 5A 0D>)
(   4,<2005-08-17 10:17:08.31 +100>,<MAYBRIDGE\NMR>,<NMR_250MHZ>,
      <abs ABSG = 5 
       data hash MD5: 32K
       A2 9F 01 59 27 E9 54 3A 74 43 73 7F 06 51 9D 2C>)
$$ ##END=
$$ 
$$ hash MD5
$$ AA 9E 14 BA 2A EC B8 FB CB 4D 04 EB BD 70 37 EC
##$RELAX= 
##$RELAX= 
##$RELAX= 
##$RELAX= 
##$RELAX= 
##$RELAX= 
##$RELAX= 
$$ Bruker specific parameters
$$ --------------------------
##$DU= <C:\u>
##$EXPNO= 7990
##$NAME= <ADRS>
##$PROCNO= 1
##$TYPE= <nmr>
##$USER= <dgb>
##$AMP= (0..31)
100 100 100 100 100 100 100 100 100 100 100 100 100 100 100 100 100 100 
100 100 100 100 100 100 100 100 100 100 100 100 100 100 
##$AQSEQ= 0
##$AQ_mod= 3
##$AUNM= <au_zg>
##$AUTOPOS= <5 >
##$BF1= 250.13
##$BF2= 250.13
##$BF3= 250.13
##$BF4= 250.13
##$BF5= 500.13
##$BF6= 500.13
##$BF7= 500.13
##$BF8= 500.13
##$BYTORDA= 1
##$CFDGTYP= 0
##$CFRGTYP= 5
##$CHEMSTR= <none>
##$CNST= (0..31)
1 1 145 1 1 1 1 1 1 1 1 1 1 1 1 1 1 1 1 1 1 1 1 1 1 1 1 1 1 1 1 1 
##$CPDPRG= <>
##$CPDPRG1= <>
##$CPDPRG2= <>
##$CPDPRG3= <>
##$CPDPRG4= <mlev>
##$CPDPRG5= <mlev>
##$CPDPRG6= <mlev>
##$CPDPRG7= <mlev>
##$CPDPRG8= <mlev>
##$CPDPRGB= <>
##$CPDPRGT= <>
##$D= (0..31)
0 1 0 0 0 0 0 0 0 0.06 0 0 0 0 0 0 0.0002 0 0 0 0 0 0 0 0 0 0 0 0 0 0 
0 
##$DATE= 1124270210
##$DBL= (0..7)
120 120 120 120 120 120 120 120 
##$DBP= (0..7)
150 150 150 150 150 150 150 150 
##$DBP07= 0
##$DBPNAM0= <>
##$DBPNAM1= <>
$$ [...]
##$SUBNAM7= <"">
##$SUBNAM8= <"">
##$SUBNAM9= <"">
##$SW= 20.6930455092707
##$SWIBOX= (0..15)
0 0 3 0 0 0 0 0 0 0 0 0 0 0 0 0 
##$SW_h= 5175.983436853
##$TD= 65536
##$TD0= 1
##$TE= 295.16
##$TE2= 300
##$TE3= 300
##$TEG= 300
##$TL= (0..7)
0 120 120 120 120 120 120 120 
##$TP= (0..7)
150 150 150 150 150 150 150 150 
##$TP07= 0
##$TPNAME0= <>
##$TPNAME1= <>
##$TPNAME2= <>
##$TPNAME3= <>
##$TPNAME4= <>
##$TPNAME5= <>
##$TPNAME6= <>
##$TPNAME7= <>
##$TPOAL= (0..7)
0.5 0.5 0.5 0.5 0.5 0.5 0.5 0.5 
##$TPOFFS= (0..7)
0 0 0 0 0 0 0 0 
##$TUNHIN= 0
##$TUNHOUT= 0
##$TUNXOUT= 0
##$USERA1= <user>
##$USERA2= <user>
##$USERA3= <user>
##$USERA4= <user>
##$USERA5= <user>
##$V9= 5
##$VALIST= <valist>
##$VCLIST= <CCCCCCCCCCCCCCC>
##$VD= 0
##$VDLIST= <DDDDDDDDDDDDDDD>
##$VPLIST= <PPPPPPPPPPPPPPP>
##$VTLIST= <TTTTTTTTTTTTTTT>
##$WBST= 1024
##$WBSW= 4
##$XGAIN= (0..3)
0 0 0 0 
##$XL= 0
##$YL= 0
##$YMAX_a= 320095
##$YMIN_a= -440931
##$ZGOPTNS= <>
##$ZL1= 120
##$ZL2= 120
##$ZL3= 120
##$ZL4= 120
##$ABSF1= 16.522
##$ABSF2= -4.171173
##$ABSG= 5
##$ABSL= 3
##$ALPHA= 0
##$AQORDER= 0
##$ASSFAC= 0
##$ASSFACI= 0
##$ASSFACX= 0
##$ASSWID= 0
##$AUNMP= <proc_1d>
##$AZFE= 0.1
##$AZFW= 0.1
##$BCFW= 0
##$BC_mod= 0
##$BYTORDP= 0
##$COROFFS= 0
##$CY= 12.5
##$DATMOD= 1
##$DC= 0
##$DFILT= <>
##$DTYPP= 0
##$F1P= 14.0000005364418
##$F2P= -0.99999901652339
##$FCOR= 0.5
##$FTSIZE= 32768
##$FT_mod= 6
##$GAMMA= 0
##$GB= 0
##$INTBC= 1
##$INTSCL= 1
##$ISEN= 128
##$LB= 0.3
##$LEV0= 0
##$LPBIN= 0
##$MAXI= 10000
##$MC2= 0
##$MEAN= 0
##$ME_mod= 0
##$MI= 0
##$NCOEF= 0
##$NC_proc= -3
##$NLEV= 6
##$NOISF1= 0
##$NOISF2= 0
##$NSP= 0
##$NTH_PI= 0
##$NZP= 0
##$OFFSET= 16.522
##$PC= 1
##$PHC0= -88.86223
##$PHC1= 13.12992
##$PH_mod= 1
##$PKNL= yes
##$PPARMOD= 0
##$PSCAL= 4
##$PSIGN= 0
##$REVERSE= no
##$SF= 250.13
##$SI= 32768
##$SIGF1= 0
##$SIGF2= 0
##$SINO= 400
##$SIOLD= 32768
##$SREGLST= <1H.DMSO>
##$SSB= 0
##$STSI= 32768
##$STSR= 0
##$SW_p= 5175.98343685301
##$SYMM= 0
##$S_DEV= 0
##$TDeff= 65536
##$TDoff= 0
##$TI= <Analysis number 999999
Compound Code 99
Book Reference 9
Project Code 9>
##$TILT= no
##$TM1= 0
##$TM2= 0
##$TOPLEV= 0
##$USERP1= <user>
##$USERP2= <user>
##$USERP3= <user>
##$USERP4= <user>
##$USERP5= <user>
##$WDW= 1
##$XDIM= 32768
##$YMAX_p= 326566449
##$YMIN_p= -186993
$$ End of Bruker specific parameters
$$ ---------------------------------
##NTUPLES= NMR SPECTRUM
##VAR_NAME=  FREQUENCY,     SPECTRUM/REAL,   SPECTRUM/IMAG
##SYMBOL=    X,             R,               I
##VAR_TYPE=  INDEPENDENT,   DEPENDENT,       DEPENDENT
##VAR_FORM=  AFFN,          ASDF,            ASDF
##VAR_DIM=   32768,         32768,           32768
##UNITS=     HZ,            ARBITRARY UNITS, ARBITRARY UNITS
##FACTOR=    0.157963299565203, 1,           1
##FIRST=     4132.6476996994, 0,             0
##LAST=      -1043.33573715361, 0,           0
##MIN=       -1043.33573715361, -186993,     0
##MAX=       4132.6476996994, 326566449,     0
$$ Real data points
##PAGE= N=1
##DATA TABLE= (X++(R..R)), XYDATA
$$ [...]
16086e1275J419n906N989L4273l5587j4153M1707R255l8169k4n275l9713J3570
16073h3889K9855K3716L7586L4221M832n0481l4067J0608L7091P249j4666K5140
16061B7195m4422n2806M9986J1890j7944l1096J2682k2765J0793K5199L288j9383
16049d7383L3791M2245J4194M205R009j1629K1257L432j6801r5183l3442L8867
16037c7438O560M6083k1505J1268J2480m4148M596j337j5141j6744j0961K0197
16025d6090N3290J4958j9277k4713K2515k189m264L0624n4719m8168l5217K159
16013a11091J7787M9029K5952K7076J9679j4434p8372j7338J5758J2607J4285
16002c9062L631L3007J7116m7343l2119l4867K2476K0567j8311N1670P241n528
$$ y = [-51275, -49856, -55762, -49773, -15500, -51087, -65240, -23533, -14278, -52447, -52471, -57746, -97459, -83889, -54034, -30318, 7268, 41489, 46321, -4160, -38227, -27619, 9472, 16721, 2055, 27195, -17227, -70033, -20047, -8157, -26101, -57197, -44515, -67280, -56487, -31288, -28000, -47383, -13592, 28653, 42847, 47052, 56061, 44432, 65689, 69121, 52320, -42863, -76305, -37438, -30878, 15205, -6300, 4968, 17448, -26700, -22104, -23441, -38582, -55326, -66287, -46090, 7200, 22158, 2881, -21832, 683, -1506, -5770, 24854, -29865, -78033, -113250, -111091, -93304, -44275, -18323, 8753, 28432, 13998, -64374, -81712, -65954, -53347, -39062, -35431, -2424, 14692, -32651, -64770, -99637, -77161, -56594, -74905, -23235, -15994, -21522]
15990b1522L4741J7447j1941l6372K5287R551M5947K2662K9539j8853l0044n0917
15978A5525l8445m270l8223J5984M4256L8446j0274k0613n7393n0049L8529L5938
15966c0589J1862j2083j6725Q063L856o854k077K0699J3543M9973K1372r104j5559
15953C6377j6678m631P208j1581L3221p70k8035L4795p108J8557R999k0225q042
15940D3087k8359n185L4277N439n7054r9094q0104J0743K7730O3676P0281M0878
15928B6315l5887m7390k0397K5367K2860k0468K2544J1822m5133j9592L2593r946
15916e7312q059J0402K0612j3683J5000M381J0018K4512J9563M5853k4296j3528
15904C3463k0094q706M625n899n6937l0883R935J1359k3121O7k3225l022N099
$$ y = [-21522, 13219, 30666, 18725, -17647, 7640, 17191, 63138, 85800, 115339, 96486, 66442, 15525, -22920, -27190, -65413, -49429, -5173, 33273, 22999, 2386, -55007, -105056, -66527, -30589, -18727, -30810, -47535, -39472, -35616, -42470, -44547, -23848, -10305, 39668, 61040, 51936, 36377, 19699, 15068, 22276, 10695, 43916, 43146, 15111, 49906, 42798, 61355, 71354, 51129, 43087, 14728, 9543, 43820, 49259, -7795, -106889, -186993, -176250, -148520, -84844, -14563, 26315, -9572, -56962, -77359, -51992, -29132, -49600, -27056, -15234, -60367, -79959, -47366, -57312, -65371, -54969, -34357, -48040, -33040, -28659, -18641, 5871, 25434, 71287, 46991, 33463, 13369, 4663, 9288, 3389, -53548, -84431, -74496, -63137, -86258, -86191, -109416, -112438, -107339]
15891a07339K590L3133J5859L266L5653j5763J10p821R047J6507K8405L5767j1199
15878C8215k5947m183l4330J7091j2444k0744k4490j4071j2006P169K729L5430
15866d7581L4054L9962M58j4994l088K3563Q110l185q7913r588M5589L762L8905
15853B8054j6040J13J4572l930P871j1227q1921m7828N918m350L6554N2316k475
15840b2373j6862J6657m328K4836k0642M260Q1984L493o0378l0966J4952J3153
15828C786Q963O847K2223l2425o1520J1058J4622l7893n4150m092K4832L6701
15816f1048J1221j1372M960J1999m452k6324K9538N911K9215k2905L6843p203
15804c617q613j5060K8048J2345l5506k9651j3151O4494K253j7601j8488J9953
$$ y = [-107339, -104749, -71616, -55757, -52491, -16838, -32601, -32491, -40312, -31265, -14758, 13647, 49414, 38215, 12268, 8085, -26245, -9154, -21598, -42342, -66832, -80903, -92909, -85740, -83011, -47581, -13527, 26435, 26893, 11899, 8811, 32374, 40484, 37299, -50614, -60202, -14613, -10851, 28054, 12014, 12127, 26699, 22769, 30640, 19413, -62508, -110336, -104418, -108768, -72214, -19898, -22373, -39235, -22578, -26906, -2070, -22712, -18452, 63532, 67025, 6647, -24319, -9367, 3786, 12749, 19596, 41819, 9394, -52126, -41068, -26446, -64339, -118489, -122581, -97749, -61048, -49827, -61199, -56239, -44240, -48692, -75016, -45478, -39567, -10352, -33257, 3586, -3617, -12230, -27290, 758, 13103, -22403, -52054, -65205, -711, 1542, -16059, -34547, -14594]
15792a4594j0618J191o866j5642J3137N240l001J8449r817j4350K0226n1496o336
15779g4477R789l082M8722N2093j6105J1272l1762j7008L5269J7125J5204L3785
15767H0825K392m0565j44374j2972j6914N9142J7201L1889J1995L8398k5044J2299
15755A4272Q429M0495K1327K7188J29815J60847J73058J5515j63119j79444j27118
15744A21265m1542j821j9989l6539p1034J1641P054K408r896P9723O3119n4680
15732D9709q945j5281k3369J7766K9269m5096p5035j3428L8659M6542M1185l462
15720C8514j0553L55L493k8486m1823o554m529P225M7484K5835O613k15j1601
15707B5758k5744k3751j9575j9889P734J322J2344K779p174J7153o614k133M0615
$$ y = [-14594, -25212, -24021, -30887, -46529, -33392, -28152, -31153, -12704, -22521, -36871, -16645, -68141, -74477, -64688, -67770, -19048, 33045, 16940, 28212, -3550, -20558, 14711, 31836, 47040, 80825, 83217, 42652, -101722, -114694, -131608, -72466, -55265, -23376, -11381, 27017, 1973, 14272, 22701, 63196, 84523, 111711, 241526, 402373, 575431, 590946, 427827, 248383, 121265, 79723, 77902, 57913, 21374, -49660, -38019, -30965, -28557, -38453, 41270, 104389, 49709, 40764, 25483, 2114, 19880, 49149, 4053, -70982, -84410, -45751, 791, 41976, 38514, 27961, 28316, 31809, 3323, -38500, -45054, -49583, -42358, 5126, 30961, 37574, 37359, 25758, 14, -23737, -43312, -63201, -55467, -54145, -41801, -39022, -46196, -29043, -35657, -37790, 2825]
15694B825J699n2673o775O0119j4137j1354j2617j5659j7865J33j971J8008N3567
15681C300m693o622L9407K3967k8459q7192q189j873R588N503J1913L3761k0208
15668b9797j9475k1203J936j9911j4866j409L88J9605J1279K6941j9799k7066
15656i3377K3124J9874N078J6406J7384j6248l3871K525N1950K7797J314l2036
15644a0080k5424p133M5819K1719j4962j7186o3790k8800J0452J9047M4795O2106
15632C6563K7252o4080j0511K2726j2545j4700K6212K0644k5134n0667K0705M797
15620a8738O032k1802k3859N3230J0463k6053K3687M382o370K777j2850k2236
15608c1337L55k0419k5741k5537L7375J2879j7213K8861L1983n75k2044l9435
$$ y = [2825, 4524, -48149, -54924, 5195, -8942, -20296, -32913, -48572, -66437, -66304, -68275, -50267, 3300, -1393, -8015, 31392, 55359, 26900, -60292, -68481, -70354, -60766, -55263, -43350, -9589, -29797, -49272, -70475, -68539, -88450, -103316, -104725, -104337, -84732, -73453, -46512, -66311, -93377, -70253, -50379, -45301, -28895, -11511, -27759, -61630, -59105, -7155, 20642, 21956, -10080, -35504, -42637, 3182, 24901, 9939, -7247, -71037, -99837, -89385, -70338, -25543, 36563, 63815, -265, -10776, 11950, -595, -15295, 10917, 31561, 6427, -44240, -23535, -18738, -12706, -34508, -58367, -5137, 5326, -20727, 2960, 7342, 972, 3749, -9101, -31337, -30982, -51401, -77142, -102679, -65304, -52425, -69638, -40777, -8794, -9369, -31413, -70848]
15596g0848P569J7119P742N603J3173l839k8332M907Q31j9789k3790L4943J8744
15583c5967k5033L5075J7655J7504l3018k4580L5056L6705k6491l3908L1715L6545
15571C1258J5224L3934N672l078l5893l843j295L341j1281n6915m7528l4633o484
15558a11521K3339L0964K207j0586m9029k2744q448N2023P3146L9653K891m2289
15546b0394k7601L463j3891k2854J8452J3575J1158M0118k3050l4319L8984J9091
15534B732M0717m1052j5616J6842l5055m5733J3427L1806O6205j2043o4175j0796
15522e2741M2522J7997j2345M3902P375j4493j5816j207M466o9398m6275O5883
15510c0130P08k1563k6113j2090J7426J6546J8508j3208j7111M6673j4399n998
$$ y = [-70848, -63279, -46160, -38418, -32815, -19642, -23481, -51813, -46906, -46075, -65864, -89654, -54711, -35967, -61000, -25925, -8270, 9234, -23784, -48364, -13308, 23397, -3094, -37002, -5287, 31258, 46482, 80416, 86088, 83010, 47117, 43274, 41979, 45320, 34039, -22876, -70404, -105037, -111521, -88182, -57218, -55011, -65597, -114626, -137370, -145818, -93795, -20649, 19004, 21895, -20394, -47995, -44532, -58423, -81277, -62825, -49250, -38092, 2026, -21024, -55343, -16359, 2732, 43449, 2397, -13219, 3623, -31432, -77165, -63738, -31932, 34273, 22230, -41945, -52741, -10219, 7778, -4567, 39335, 46710, 32217, 16401, 15194, 19660, -49738, -96013, -30130, -29422, -50985, -77098, -89188, -71762, -55216, -36708, -49916, -67027, -20354, -34753, -40751]
15498d0751P532J0727L3403j4768j2720R010M798L2687K4939q3729k9824M078
15486e4618L8736k431m8575m0867P321m015k4005K1383K4950M3780J7716o4464
15474h5089k9934M2093m6541P833J6190M679N1984j8176l1001M4993L9060j5991
15462a9900K3351M1851o2503j2551J6434L3865J7441p7812j8900J0585O637n674
15450d7176K5360L3025o3207k60J8868l7249l2007j5642p562o003L3474K2055
15438g6324J1010J8168n0551l4135M4099L160j7697K0742K8099O638m474L15L1970
15425a8980M058N991Q3276j1039n5838j6386J6665r379J5749O895k5986K289M0597
15412C7912l4480M0314k4298l4107J8258j7727k6450m0695K7316L4824L8959j7071
$$ y = [-40751, -33219, -22492, 10911, -3857, -16577, -7567, -2769, 29918, 54857, -28872, -58696, -54618, -15882, -18313, -66888, -107755, -100434, -104449, -128454, -107071, -82121, -38341, -20625, -85089, -115023, -72930, -119471, -111638, -95448, -90769, -38785, -56961, -87962, -42969, -3909, -19900, 3451, 45302, -17201, -29752, -13318, 20547, 37988, -39824, -58724, -48139, -41502, -47176, -21816, 11209, -51998, -52258, -33390, -70639, -102646, -118288, -125850, -131853, -98379, -76324, -65314, -47146, -97697, -131832, -87733, -84573, -102270, -81528, -53429, -46791, -51265, -50950, -18980, -14922, -8931, 74345, 63306, 7468, -8918, 7747, -1632, 14117, 21012, -4974, -2685, 37912, 3432, 43746, 19448, -14659, 3599, -14128, -40578, -81273, -53957, -19133, 19826, 2755]
15400B755J0482L5577o482j7762r376j7201N986J8081m3208j0780L4817O200o731
15387B358L311o6652k414K0095k2592j7925K3125J1869K9986j0930l3402M0723
15375b2448O8314M144K988r806j8349o368k8351j7396L5435L8669K8701Q779k1961
15362F2351n5455l0266j5143K7201M6959J9620M3654J7017l0640l5703l6652l2510
15350a9567k9615k6674O54K2439M7226K7246j6988n7763L1461P097L7130J896
15338B4542O322l9643j931J8292M6642k4493q731l8651k4806M409j294J9372L7560
15325A7590l9662q548K5405R145p3860l2553K8928j0132J0752P405L0500K5747
15313i283L7043L9255l4557o4694J7466L0896L3523j6066L5361R147M967J7179
$$ y = [2755, 13237, 48814, 42332, 24570, 15194, -2007, 3979, 22060, -21148, -31928, 2889, 9089, 2358, 5669, -60983, -63397, -43302, -65894, -83819, -60694, -48825, -18839, -29769, -63171, -22448, 45866, 50010, 52998, 43192, 24843, 18475, -9876, -27272, 8163, 46832, 75533, 84312, 62351, 6896, -23370, -38513, -11312, 35647, 55267, 98921, 115938, 85298, 49595, 12943, -19567, -49182, -75856, -75202, -52763, -5537, 21709, 4721, -53042, -21581, -14484, 22646, 24542, 30864, -8779, -10710, 7582, 54224, 29731, 21000, -17651, -42457, -38048, -39342, -19970, 17590, -22072, -30620, -5215, 3930, -69930, -102483, -73555, -83687, -72935, -65530, -35030, -9283, 27760, 67015, 32458, -32236, -14770, 16126, 49649, 33583, 68944, 78091, 83058, 100237]
15301A00237L311n6979J0109M690L1329k7190l1331k8877p894l0112m3684M3210
15289c3181N2450J9608L073l2350l8559Q42O5802l502o9573J7900K4408O94k9802
15276b2190r047k1744K782l894j340o183Q188r88K6744j1479k0197M440n519k1676
15262h2103K9847M0876J3432n934k2898m4999l1754N6172L7972K6647j459k0802
15250e003N139N9351K0642o3109o2099n0635k2641M8916O2931j4129m5724K5446
15238d0915L4272K4661M1201J2798o0067n3875n7975p134L670O4209R003l9544
15226f9696j4296K5085L4299j1603k2823K0725M5745J2054j0551k5844M0878j5690
15214H283m1758J3542j8517J9912J5991j5115M501m469M4022L0968K257k9739
$$ y = [100237, 103548, 46569, 56678, 61368, 92697, 65507, 34176, 5299, -2595, -32707, -76391, -33181, 19269, 38877, 41950, 9600, -28959, -28117, 37685, 34183, -35390, -17490, 6918, 7612, -22190, -31237, -52981, -50199, -54093, -55433, -61616, -53428, -54416, -27672, -39151, -59348, -54908, -60427, -82103, -52256, -11380, 2052, -3882, -26780, -71779, -103533, -47361, -9389, 17258, 15799, -5003, 136, 59487, 80129, 17020, -45079, -95714, -118355, -69439, -6508, -20637, -66361, -40915, -6643, 18018, 59219, 72017, 11950, -41925, -99900, -107034, -103364, -39155, -30152, -69696, -83992, -58907, -24608, -36211, -59034, -38309, 7436, 19490, 8939, -16905, 23973, 8283, -33475, -19933, -38450, -18538, -2547, -17662, -13161, -17630, 26392, 57360, 59617, 29878]
15202B9878n3635N515J9724m0187L250k252m6344j4836o410K4234M9848K1893
15190i322m9430p4659j6154P1506Q5777M0676P345l4648k85j8005J2498j3176
15178B123m3909L7699P706L02M8183M023l9638l1826J0800m997j5027j4764j1855
15165e1180J0391j5090l2581J178L7893Q940m707j4597m1388K4964O2044j261
15153a5394n9138k4148K2079L0906L2283J2932l2798q095k9550o285J3061N6106
15141h041J9107k140N747j5450N2335j5999k7540k0900M5143K2828J2282j0166
15129E7206m6512l4153J455K0607r472j8050q017J3483m4245K1267N4213K074
15117I856J3111P366j429k539q613l6810k7332J8067m2206p980J25Q613k2990
$$ y = [29878, -23757, -18242, 1482, -38705, -35455, -37707, -84051, -98887, -105297, -81063, -31215, -9322, -58752, -133411, -149565, -78059, 7718, 48394, 55739, 21091, 20806, 2801, 15299, 2123, -41786, -4087, 3619, 3921, 52104, 56127, 16489, -15337, -4537, -9534, -24561, -39325, -51180, -40789, -55879, -88460, -87282, -49389, -40449, -45156, -59753, -101141, -76177, -14133, -15394, -74532, -98680, -76601, -45695, -13412, -480, -33278, -41373, -70923, -77208, -64147, -8041, 11066, 8926, 14673, -777, 51558, 35559, 8019, -12881, 32262, 55090, 67372, 57206, 10694, -23459, -22004, -1397, -10869, -28919, -36936, -23453, -67698, -46431, 7782, 9856, 22967, 30333, 28904, 26365, 17752, -19058, -46390, -28323, -70529, -78509, -78384, -69771, -92761]
15104i2761q182L5789K0549m312J166J0488O8062K6295J5363j2841m2238m1830
15092b4452K6739J8234K8486l8924l461L5683N9956l588p1078j3481L0891o3278
15080a8273m2372O600L3872N6677M902l5824j2996j797L2365K7559K7127l3685
15068D4155K0032L7784l6505o9172p620j4679k6007M2282o763k7665J051J5234
15056b7873J6680K2120j471J3507P3992m990o7712o0606r211K0097L43J025j9279
15043d3378L69k246j5383P018j1990k8097J416M1722M8651J0856l4370j5092k6972
15030f7496l1917m7721O3909P9947K3682M2551n6906l8672K6353k638J5475J5798
15018B2365m0248j8319M7277J3837r209k497M0519j3876O776R415l9626L1361
$$ y = [-92761, -100943, -65154, -44605, -48917, -47751, -37263, 30799, 57094, 72457, 59616, 17378, -24452, 2287, 20521, 49007, 10083, 6622, 42305, 102261, 98673, 27595, 14114, 45005, -18273, -60645, -54045, -20173, 36504, 41406, 5582, -7414, -9211, 23154, 50713, 77840, 44155, 64187, 101971, 65466, -3706, -11326, -26005, -52012, -9730, -16493, -44158, -43107, -27873, -11193, 10927, 9456, 22963, 96955, 91965, 24253, -36353, -45564, -25467, -25124, -24099, -43378, -43009, -45255, -60638, -53620, -65610, -93707, -92291, -50569, -1918, 8938, -25432, -40524, -67496, -99413, -147134, -83225, -3278, 20404, 62955, 6049, -32623, -6270, -8908, 6567, 22365, -17883, -36202, 11075, 24912, 15703, 13206, 53725, 39849, 46625, 56040, 16414, 47775]
15006D7775J9517l5758p916j6649K29j7130l4263r004N8280J7804p9333k5002
14994h1450P1226j5374k1305l9475N4014j9488J732k356m878j7607m4500K158
14982a17303N0814L7932k2671m4243M7410M358L1688K7934l3514l6807L1151J2254
14970a0997J4023o192J9041P118K384l5038O946L972L7427J3536m9361n2876k3371
14957g3388J3377M10j6569M752K0663K4728j8349N86J8862k2640o729Q155m5524
14944i1666r97K1564O034M973l3231r812J7329L7907L2139j8081p135M5423K6181
14931C0628j5861o3718k7070N1200K1756j6001q179L729P664k1605m9677k3181
14919a10315O4661M2921q876j8915M3709O1041p904m463r052l6175K2619J3338
$$ y = [47775, 67292, 31534, 23618, 6969, 7198, -9932, -44195, -53199, 5081, 22885, -56448, -81450, -10224, -25598, -46903, -86378, -32364, -51852, -50120, -52476, -57354, -74961, -119461, -117303, -66489, -28557, -51228, -95471, -48061, -43703, -12015, 15919, -17595, -54402, -23251, -10997, 3026, -3166, 15875, 22993, 25377, -9661, -2715, 1257, 38684, 52220, 2859, -50017, -73388, -60011, -59601, -76170, -71418, -50755, -26027, -44376, -43790, -24928, -47568, -54297, -46142, -91666, -92663, -71099, -65065, -60092, -93323, -103135, -85806, -47899, -15760, -33841, -40976, 4447, 30628, 14767, -48951, -76021, -24821, -3065, -19066, -27245, -23516, -15852, -37457, -87134, -110315, -45654, -2733, -11609, -30524, 13185, 74226, 66322, 61859, 52807, 16632, 39251, 52589]
14907E2589J334L2997p96l7916J922L7228n2379N665r803j3503K188M923J1109
14894C5558q035j0386k2923o2538j1790M8252J6716p842J2509k220O444J0161
14882C906k4580N648m641M0426J5073j5611m3043N866M6133k9227m1278j3103
14870e4431k3316j1478L2756O714l9176M737N7037K8931j859o1654l6769j4386
14858a12894L4706J1006L4055L8243L709k4796J04L1j6822n262J2475M5905M5765
14845F6225k2594j3768K0805K8481P268J3393j5039j9367j2875O167m9094k449
14833G153J1115L1945K4369m4262k0227n6942k5349J1465M8432L1729j2416K7104
14821C4116J0749O545q50j2956K082O524n6412m5421L9735L3483p04j6424k1705
$$ y = [52589, 53923, 86920, 86124, 48208, 50130, 87358, 34979, 40644, 30841, 17338, 19526, 24449, 35558, 27523, 17137, -5786, -68324, -80114, -31862, -15146, -22988, -10479, -12699, -6255, 3906, -20674, -15026, -19667, 20759, 35832, 20221, -22822, -16956, 29177, -50, -41328, -54431, -77747, -89225, -56469, -49755, -88931, -84194, -27157, 1774, -85, -61739, -98508, -112894, -78188, -67182, -33127, 5116, 8825, -15971, -15867, -15836, -32658, -37920, -25445, 20460, 66225, 43631, 29863, 50668, 79149, 86417, 99810, 84771, 65404, 52529, 58696, 9602, 7153, 18268, 50213, 74582, 30320, 10093, -46849, -72198, -60733, -12301, 19428, 7012, 34116, 44865, 51410, 50560, 37604, 39686, 46210, -10202, -55623, -15888, 17595, 16891, 467, -21238]
14808b1238p434j1076n5966K7037K9547M3058j054o7461n623K1859M33n243K2888
14795c0273K2304J4K6232l2071k0214j0468j0084k73M7957Q519N4503N1185l4017
14782G3314m9764j7900j7983j7614j9357J2264J9038J9159K4132q130l1774n322
14770a9937k9693j3075K4589J6890l712k0242K5302N6556l236k3139k7021L0599
14758A3881O0818n1570q2778k4531K4022j5120k1081L6365J4038m7123l028N9564
14746c6543L8267L9704L2890l4460l747k2898O575J0257k7961N3494J4381p0927
14734i68J347L0310k0432n9664J0525J7469j1510J4886M0133M0076l774J7832
14722G6230l6413l662L9235o031m3123j304J8762K6006q62m1764m0534J7188K8422
$$ y = [-21238, -28672, -39748, -95714, -68677, -39130, 3928, 2874, -64587, -70210, -48351, -47918, -53161, -30273, -7969, -7955, 18277, -13794, -34008, -44476, -54560, -54833, -6876, 1643, 56146, 107331, 73314, 23550, 5650, -12333, -29947, -49304, -37040, -18002, 1157, 25289, 17159, -14615, -19937, -49630, -62705, -38116, -21226, -24938, -45180, -19878, 36678, 33442, 10303, -16718, 13881, 74699, 23129, -59649, -84180, -60158, -75278, -96359, -59994, -45956, -93079, -96107, -36543, 1724, 41428, 74318, 39858, 36111, 13213, 19788, 30045, 2084, 55578, 69959, -968, 379, 30689, 10257, -49407, -38882, -21413, -32923, -18037, 22096, 62172, 58398, 76230, 39817, 36155, 75390, 69359, 26236, 24932, 43694, 69700, 68838, 27074, -13460, 3728, 32150]
14709C2150M359N447q676k0593J5404k5026R457Q624K625k4577n1649p653M1701
14696a8407K6912L2065k7891k206l9423m5090j4220L4830O7754J0442J1814j0924
14684B5656O205K5912m8071l380J4885n4167J034N1474J3046l6518j3554K9835
14672A2357J2728n2297l6503O74m18M1603N6180J3137l1629M600R758J2911o0438
14659a7337l880J1679k668k0401J0456J2380M1388l062l4996j786J5881l2911
14647b5257p979N2043J4276j8215l3060k1316j3009J3751J3943k4M9723L0176
14635E5052p510n0769o6339R995N9449q482k4157j4827l6970M1475k0703M8164
14623a5622L0038j2231n3094k0693Q539L0947K7871J349k3l2534P469j2119K7656
$$ y = [32150, 36509, 41956, 33280, 12687, 28091, 3065, 12522, 21146, 23771, -806, -52455, -60108, -18407, 8505, 40570, 12679, 10473, -28950, -74040, -88260, -53430, 14324, 24766, 36580, 25656, 31861, 57773, 9702, 6322, 21207, -32960, -31926, 19548, 32594, -3924, -17478, 12357, 25085, -27212, -63715, -63041, -63459, -21856, 34324, 47461, 15832, 20432, 30190, 43101, -17337, -21217, -9538, -12206, -32607, -22151, -9771, 31617, 28555, -6441, -8227, 7654, -25257, -33236, 18807, 33083, 14868, -18192, -39508, -52517, -38766, -24823, -24847, 24876, 55052, 47542, -3227, -69566, -59571, -122, -8604, -32761, -47588, -84558, -43083, -63786, -15622, 14416, 2185, -50909, -71602, -63063, -32116, -4245, -2896, -2919, -35453, -27984, -40103, -12447]
14610a2447K5494j3452o284L581N021n327j7200p035o510K26o916J6859K3442
14597e48N1005R874m2175k3492L289j5005m8810J7301M4085M5214K610k2955j8455
14584A938J2944j5969o78K5557M9632o425k2906l1232j5397N349N085r82Q209
14571A5125Q085J9950p449j2561P498j4978r924k0517p196o1932J0633M1250K2300
14558i716m2996K1447q058Q276M6800J7845l5994j0071P846l80J0189k5768k9015
14545d9595j4907J4971J7000J3794k2727o3102o976M7819j2386m0395O627K9544
14533h0333K8902M0265K0114J0612l0395n3828J7792K6887R316K3890K0012R234
14521D2468j9414j1734M499N6211L7844l0537j5745l6755l8679k7148L017r010
$$ y = [-12447, 13047, -405, -6689, -3108, 1913, -3414, -20614, -27649, -34159, -33933, -40849, -23990, -548, 50457, 60331, 18156, -5336, -2047, -17052, -65862, -48561, -4476, 40738, 43348, 20393, 1938, 14882, -1087, -1765, 23792, 73424, 66999, 44093, 12861, -2536, 2813, 7898, 6916, 15125, 23210, 43160, 35711, 23150, 30648, 15670, 5746, -14771, -21967, -83899, -73266, -32016, -9716, -52712, -31265, -39323, -31047, 15753, 33598, -2396, -12467, -4621, -5001, 5188, -20580, -49595, -64502, -49531, -32531, -18737, -41464, -104566, -111542, -63723, -76109, -116504, -109877, -80333, -51431, -11166, 8948, 19560, -10835, -64663, -46871, -19984, -10668, 13222, 33234, 42468, 23054, 11320, 15819, 72030, 109874, 79337, 63592, 26837, -11842, -38990, -35973, -44983]
14509d4983j7459p323j5782j964J3495L9608j7682k4995L3959L2143K1520M1548
14497E2085n282k691O361J3291k0763j7387K4988k0088L6643K5122J0475k7525
14485G5229n9056l6098j6994l3257K2373K7742L279K1895L5845j8773j079j0389
14473A0717j6926K0015J8618J2938j9190q749K5068q267m2699m7055l5040Q4243
14461f327R3891m3856k2467j4384J1976P899j8690k1524o3735M8283Q5383J6136
14449G2585n3259r821k5622k8745k6092j1325l3196M3406N2566L1348J4397j4061
14437A2181n5492R563J6938j4584j6085P109j1959q50L6356L4077L8144k735q526
14424D4137k7441q757m1418n2940j7844R2693j5829l4261p301L2352o15o8413
$$ y = [-44983, -62442, -69765, -85547, -87511, -74016, -34408, -52090, -77085, -43126, -10983, 10537, 52085, 46803, 44112, 50473, 63764, 43001, 25614, 50602, 30514, 67157, 92279, 102754, 75229, 16173, -19925, -36919, -70176, -47803, -20061, -16782, 5113, 40958, 22185, 21106, 10717, -6209, 13806, 32424, 45362, 26172, 17423, 42491, 34224, -8475, -55530, -90570, -6327, 87564, 43708, 21241, 6857, 18833, 26732, 8042, -13482, -77217, -28934, 56449, 72585, 19326, 9505, -16117, -44862, -70954, -82279, -115475, -72069, -19503, 11845, 26242, 12181, -43311, -33748, -16810, -31394, -47479, -40370, -52329, -53179, -16823, 17254, 55398, 52663, 44137, 16696, 7939, -33479, -86419, -104263, -11570, -27399, -61660, -68961, -36609, -37224, -105637]
14412a05637j8756O6283L4372K1453k4931k528R214j1830k0608j5104K3419L6720
14400g933K8593P508m2435p784L189J3080m3863K2743M6161M1675K0071j3939
14388F7066k0324J1638j9248j8092k3447n2948n508J1336k0682j2928Q7267N6030
14376F0160j2746m0500j2878o596M553p755J0105K4661K9265o100k9733J7256
14364B9692J1525M0235o705m7095N162j6607j6265j0068M0176L0339M166l7940
14352B6615m7507o085L3973r083l186k0503j7636J5875J1286m7662J2884K1409
14340b9620K0788J3239J8988n684L1991m6879l270K1635k1191m8897l0278J1918
14328f7260K6496l3452p721K9662M1662M3347K855K2735K4135m0484k1752J7809
$$ y = [-105637, -124393, -58110, -23738, -2285, -27216, -29744, -20530, -32360, -52968, -68072, -44653, -7933, 20660, 28168, -14267, -22051, -18862, -5782, -49645, -26902, 19259, 60934, 81005, 67066, 46742, 58380, 39132, 21040, -2407, -55355, -60863, -49527, -70209, -83137, 4130, 60160, 47414, 6914, -5964, -12560, -8007, -15762, -5657, 19004, 48269, 42169, 12436, 29692, 41217, 81452, 74747, 27652, 32814, 16207, -58, -10126, 30050, 60389, 64555, 26615, -20892, -26977, 6996, -2087, -5273, -25776, -43412, -27537, -16251, -63913, -51029, -29620, -8832, 4407, 23395, 17711, 49702, 2823, -447, 21188, -3, -48900, -79178, -67260, -40764, -74216, -81937, -52275, -10613, 32734, 35589, 58324, 82459, 41975, 20223, 38032]
14316C8032j0190l5102K3685J8305j2559L5325q87p1341n1394J2972L7220p893
14304b3827p123J1889k4950L6219j5599l0934N201K6037L0806l1754P239R461
14292g335k8563m6018M7323M3420l0011m1410K653M3473K1622j5992k776m200
14280a7814k9665j7312J6600k0549j9553K5872O3335P571k8595J197j094o333
14268b6340j8894L6627L4694j2482k116p66P926N076J4866m6151L5737L4367j6742
14255D5802O21m0993j9816j2048L5691j7445j484L8478k694k7998k7139J8181
14243a0844L4667j0613k6478L7490P433o0309k6336m4673M399N2311l532J9082
14231b7403K3615J671n5108j3249M8698L2900L0256j2748r188n916j9160K8392
$$ y = [38032, 27842, -7260, 16425, 34730, 22171, 57496, 56609, -14732, -66126, -53154, -15934, -23827, -30950, -19061, -44011, -7792, -23391, -54325, -49124, -23087, 7719, -24035, -16796, -7335, -35898, -81916, -34593, 8827, -21184, -62594, -59941, -16468, 5154, -10838, -13614, -17814, -47479, -64791, -48191, -68740, -88293, -62421, 914, 8485, -20110, -18913, -20007, -26340, -45234, -8607, 26087, 13605, 11489, 10723, 18649, 23725, 38591, -7560, 28177, 62544, 45802, 46423, 5430, -14386, -26434, 9257, -8188, -9672, 28806, 26112, -1886, -29025, -10844, 23823, 13210, -13268, 24222, 31655, -28654, -54990, -99663, -95264, -42953, -46485, -27403, -3788, -2117, -57225, -70474, -21776, 11124, 41380, 28632, 19444, 13528, -5632, 22760]
14219B2760N0335o5861p622m8731k49K6062J4264m2407l1334O7170K3120m070
14207C437l4883J5013m7008r855K1369K8968J6551L0179R915m2186J8392M3781
14195E3673r29n9203j4876O501j0424j5359l0172Q08L5465L2048K818L2699M974
14182C8023l0649m9250j5818j6170m0002o373O6506K0094J2068J6773K1378R632
14170B6212J554l713R597m6633o1470j7843L6684P1279q148m0234L4284K4718
14158B6287l0245j6762J2175K2189J0292m8036N00l5274K6689L0599k1971l754
14146b7311P118J9083M8609L8305m296l8479k7806K041o27j4191m6908j3106J3344
14133d4224K5079K14K9315O185K1113m992l2099j5185k0640J8925r971l0441j2155
$$ y = [22760, 73095, 7234, -388, -49119, -49368, -23306, -9042, -51449, -82783, -15613, 7507, 3437, -31446, -16433, -63441, -73296, -51927, -22959, -6408, 23771, 33686, -8500, 9892, 53673, 52744, -6459, -21335, -14834, -25258, -40617, -70789, -69981, -34516, -2468, 350, 33049, 38023, 7374, -41876, -57694, -73864, -113866, -120239, -53733, -33639, -21571, -4798, 16580, 26212, 27766, 24053, 33650, -12983, -74453, -92296, -55612, 15667, 7519, -32715, 1569, 26287, -3958, -20720, -8545, 13644, 23936, -24100, -23600, -58874, -32185, -1586, -23557, -27311, -20193, -1110, 47499, 85804, 81508, 43029, 15223, 17264, 16637, 2446, -44462, -57568, -44224, -19145, -18931, 10384, 16569, 37682, 32690, 591, -14594, -35234, -16309, -26280, -56721, -68876]
14120f8876j98k236K3190M0450k9257m5831l7117k0585N6749m770N5522K7794
14108e165J4076j914L930K8256r918K1326l4283m6253j9608J4169P9182N0874
14096I4672Q175j5261n9272n0182N378p356P927R582J3784n830Q829P866L4122
14083E2434J7862k179j573m4633m7885N486k0818l6221R956K3706M833J2724k693
14070b9001J5209K3776Q713j8881k5302K1050N5380L1879P95k296p450o7139j6521
14057i788j342M1473m641j4482J7970n792R003n1267J4028o196n030r580K5422
14044b22J7397P725k3715M0990P302j3495l7609m7281O167J8368L7571l1549j9399
14031c7750P35K1190L1629J8296m9819k0017N1608M2698j9915k8809m2738j2820
$$ y = [-68876, -69074, -71310, -48120, -7670, -36927, -82758, -119875, -140460, -83711, -88481, -32959, -5165, 8911, 6997, 10927, 39183, 29265, 50591, 16308, -29945, -49553, -35384, 43798, 94672, 102847, 87586, 28314, -21868, -16490, -23846, -15919, -6337, 7447, 1617, 10446, 18312, 52434, 70296, 68117, 66544, 21911, -25974, -20488, -41306, -77527, -67571, -43865, -39032, -26308, -29001, -13792, 9984, 18697, -184, -25486, -4436, 50944, 82823, 83618, 81322, 73872, 6733, -9788, -11130, 30343, 25702, 11220, 29190, 23398, 32401, -18866, -4838, -11034, -16064, -25644, -222, 17175, 24900, 1185, 42175, 49477, 35982, -1627, -48908, -42741, -24373, 13198, -18351, -37750, -37015, -15825, 15804, 34100, -15719, -35736, 15872, 58570, 38655, 9846, -32892, -45712]
14019d5712J2624N920O4154Q1249K931m4541J8487l5800O103J2098m7886J1858
14007D1485K9790n2401l794r169j0757L8783P084j8770R903J8388N3756P081j816
13994A09563N101J595o0986j6364p816L2045J517n0010P392k4389k1468P5499
13982E1679M4657K5604l8754o0918o6357K365L9061O9708L6837j6168m5888j6915
13970B4911J4989j5269k5822L5226L7600p271n4869l523L7040j5718K0557m803
13958D3048j2540m7035r686K8898J2805l1686r677K5796J9882J3251j0900l87
13946B1769K4907k8264k7896l5559k6817K2269M4093l3202r29L6856j5236l5565
13934e3574L8394L7444m6072m114j4061J8143L9809K8828j0630l5377J1893N7517
$$ y = [-45712, -33088, -27168, 36986, 118235, 121166, 76625, 95112, 59312, 65415, 77513, 29627, 41485, 71275, 18874, 15080, 5911, -4846, 33937, 41021, 22251, 32154, 50542, 104298, 111379, 109563, 114664, 116259, 55273, 38909, 31093, 63138, 64655, 14645, 22037, -2352, -23820, 51679, 96336, 121940, 83186, 22268, -44089, -41724, -2663, 67045, 103882, 87714, 41826, 24911, 39900, 24631, -1191, 34035, 71635, 64364, 9495, 5972, 43012, 27294, 47851, 43048, 30508, -16527, -26213, 2685, 15490, -16196, -25873, -77, 19805, 33056, 22156, 21769, 46676, 18412, -9484, -45043, -71860, -49591, -5498, -38700, -39629, -2773, -18009, -53574, -15180, 22264, -23808, -27922, -41983, -23840, 15969, 44797, 34167, -1210, 10683, 68200]
13922F8200l216p1122l1199j3210M8348M4321m3219O052k6894L9333k1444k1884
13910b5934N1724L1076r358K7920n366p591j2233L1297R077o4944l9772K1012
13898F908K2728n3010q600M5906j4508p1254j1552L8206O0036L5404j9666J6827
13886D7425k9502J452J9617J5764O7N5683k4593l1614K6961k5714n7007k4477
13874b5938O2936K755j4958j9437Q391M6005k3284k6969m7251j5745L3737L2014
13862A2256L2513J1027j9217l7941J1515Q241N0404K7049L7600P5572j0472l4621
13850A63926r66k1652m3987k9556k1437n964q258k2517Q032K0409K6751J0040
13838G4821J3560k6399j839N059k7070n9739l114P5840K86k9326L320K4064L1854
$$ y = [68200, 64984, -6138, -37337, -50547, -2199, 42122, -1097, 4955, -21939, 17394, -4050, -25934, 25790, 56866, 47508, 75428, 70062, 62471, 50238, 81535, 90612, 25668, -14104, 6908, 29636, -23374, -31974, 13932, -576, -71830, -83382, -45176, 14860, 50264, 30598, 47425, 17923, 19375, 38992, 54756, 54823, 110506, 85913, 54299, 81260, 55546, -1461, -25938, 36998, 39753, 24795, 5358, 13749, 59754, 36470, 9501, -37750, -53495, -19758, 12256, 44769, 55796, 36579, -1362, 10153, 18394, 68798, 95847, 133447, 209019, 198547, 163926, 162960, 141308, 97321, 67765, 46328, 40364, 32106, 9589, 17621, 38030, 64781, 74821, 88381, 61982, 60143, 65202, 38132, -21607, -24721, 51119, 51405, 22079, 25399, 49463, 81317]
13825H1317L754l8278k7064N940J0079K7608K4182k0231j3181l1797J1557L167
13813C7053Q457L6566R0583J0813K2246J01560N5936M2967m0649o6622o2597m1286
13801A95027j4199m4106n936o164j5888q630m2242p253l0225k6975J9804L6154
13789D9367J0139k7655j2514J2477n1283j4336M5369N227k2827m273L6043J59
13777B5893J3704M1009k4007j4877k0641k02L7172O0800J5407J0021L5614O387
13765A86280O0961J05162J20600J07734m0971q6211p5521m8779q5975q6519n2714
13754A04047L020K1888k4338o1493n9298o717J2156K4337L3689K9563k7281n5587
13742f014l9297j9246J9285J5245L8691j3362k6934Q312J3348N499k6185J0782
$$ y = [81317, 85071, 46793, 19729, 25669, 35748, 63356, 87538, 67307, 54126, 22329, 33886, 37053, 45510, 82076, 172659, 183472, 205718, 307278, 363214, 406181, 365532, 298910, 236313, 195027, 180828, 136722, 130786, 124622, 108734, 100104, 57862, 50609, 20384, -6591, 13213, 49367, 59506, 31851, 19337, 31814, -19469, -33805, 11564, 16791, -6036, -10309, 25734, 25893, 39597, 80606, 56599, 41722, 21081, 20879, 58051, 118851, 134258, 144279, 179893, 186280, 247241, 352403, 473003, 580737, 539766, 453555, 378034, 329255, 243280, 156761, 104047, 107067, 128955, 104617, 43124, -16174, -22891, -10735, 13602, 47291, 76854, 49573, -6014, -45311, -64557, -45272, -30027, 8664, -4698, -31632, -23320, -9972, -4473, -30658, -19876]
13730a9876O6816L9829J2889k3991k7889J4005J7688K087N342K3480J7329K2341
13718A50050o335m5931m367j1526k625L443O368o516q830j4063m5596o8265k4809
13705g9002O0281L6843K3405k1811L1190J3673P821j3823n2999l7984l802K1457
13693a4751L0367J5284J3737m3458j324l6649j923k5594M4791L8227J1955l142
13681B7520p5421l2112N6447N2193J9345K023j156k571k6008k673j3324O4531
13669F8794K0152M509L4772l7995j4284K4767J5295J4094N111m4934j1522j0304
13657F8455q972K3731K4748J1326k3412o4636L1566L9292k5132k6316k0117K5110
13645E5643Q351J2259L4981P053K046q143p7238m775K3341K3690J5554m3341O3546
$$ y = [-19876, 46940, 86769, 99658, 75667, 47778, 61783, 79471, 81558, 86900, 110380, 127709, 150050, 143715, 97784, 93417, 81891, 79266, 82709, 89077, 82561, 73731, 59668, 14072, -54193, -79002, -18721, 18122, 41527, 19716, 50906, 64579, 72400, 58577, 5578, -32406, -36208, -14751, 15616, 30900, 44637, 1179, -145, -36794, -38717, -64311, -19520, 18707, 30662, 27520, -47901, -80013, -23566, 28627, 47972, 49995, 48839, 46268, 20260, 17587, 4263, 68794, 88946, 93455, 128227, 90232, 75948, 100715, 116010, 130104, 135215, 90281, 78759, 68455, 59483, 83214, 107962, 119288, 95876, 31240, 62806, 102098, 76966, 50650, 30533, 55643, 63994, 76253, 111234, 118287, 120333, 112190, 34952, 30177, 53518, 77208, 92762, 49421, 112967]
13632A12967K4729l5752k8909j4904N872J1942l2461J3638K0736j2507j0507M1777
13620I6621K3754K5096M7606N4805l035o552l5110j6953j4006j1592j7630p342
13608A35662k876L1441n519k8119n848j2620l0372k3282j5177M4488J5836o920
13596I6694j1976M867j1151O799M1367K9355k082J9122k3506K1957m072l0806
13584A36568k5278M1870P1723J6371k1683J2649P5061Q9738M0712J15727J53168
13573G06626J00792N3951n0816r6317j69897j42557n1370j4610k1748j2001n1710
13562B50343m4654j60k0518l762P180j818p854J6742j3398K5192j583p81j7050
13549A87879j3408J9714M4330J4207k2633k5176j841L9520L9195k7704p3191j1816
$$ y = [112967, 137696, 101944, 73035, 58131, 64003, 75945, 43484, 57122, 77858, 65351, 54844, 96621, 120375, 145471, 193077, 247882, 244847, 238295, 203185, 186232, 172226, 160634, 143004, 135662, 132786, 164227, 158708, 130589, 124741, 112121, 81749, 58467, 43290, 87778, 103614, 96694, 84718, 89585, 78434, 85233, 126600, 155955, 153873, 172995, 149489, 171446, 167374, 136568, 111290, 153160, 224883, 241254, 219571, 232220, 307281, 397019, 437731, 553458, 706626, 807418, 861369, 810553, 714236, 544339, 401782, 350412, 335802, 314054, 302053, 250343, 205689, 205529, 185011, 181249, 188429, 186611, 178757, 195499, 182101, 207293, 205710, 204929, 187879, 174471, 194185, 238515, 252722, 230089, 204913, 203072, 242592, 281787, 254083, 180892, 169076]
13537A69076M4742N0226J1857j4210L6507J04334L9658O5078J73710J95515K4558
13526I01051j01700j09348q1566n9324m7844o6616r4723p8118j7120K2714K6474
13515B93880n543m2071o673Q363n4083k6705l3433j4152L8514R0520L2836L7885
13503C19338L934M6770J1516k3074p5193q366K1955k5558P834m3811j3111K2160
13491B44394K6583k2102k8480J5438J4358K961P6889J00539K0906m5063l1457
13480C74966l5027J4389l3285m3291p8208r569J3225L437K1265O1943l477p1132
13468B15236M8345K997j5332k3111l3421l5324L4014Q6388O90N2949Q1449K0086
13456D34966j2774K7575m1569o2881k9563j5709K7251l7034j0917J957o593K6683
$$ y = [169076, 213818, 264044, 275901, 261691, 298198, 402532, 442190, 507268, 680978, 876493, 901051, 799351, 690003, 608437, 549113, 501269, 434653, 339930, 261812, 244692, 267406, 293880, 288337, 246266, 239593, 247956, 193873, 167168, 133735, 119583, 158097, 248617, 281453, 319338, 323272, 370042, 381558, 358484, 283291, 274925, 296880, 271322, 279156, 235345, 222234, 244394, 270977, 248875, 220395, 235833, 250191, 253152, 330041, 430580, 451486, 406423, 374966, 339939, 354328, 321043, 277752, 199544, 189975, 203200, 206637, 227902, 289845, 286368, 215236, 263581, 266578, 251246, 228135, 194714, 159390, 193404, 279792, 280482, 333431, 414880, 434966, 422192, 449767, 408198, 345317, 315754, 300045, 327296, 290262, 279345, 281302, 274709, 301392]
13444C01392L6703k6812l7060n2050o0458j1359P9233L4269L5541J4186L9665
13433C53250K8501j1551k4063l5599k3623K7770J5594J8131j967j776J5688J320
13421C61675q265J8235J3011M7614K1205J2061M3302K4467K5614J5273N5722N6093
13409F86007L5296L6567N4086Q5296Q3647J17124J10158R7255J46005K49361K67958
13398A968760L17410M23419O15759Q12434J183299J855850K916079M042286M951484
13389A9086780M559461K012450j586353m298909m889086l989302k877514j883704
13381F133823j286335q71832n53485m06687l24780k97704k46397j34242j26373
13372A885988j28890q5249j8071q126k1398J2669N2052J02586J19137J05269J05585
$$ y = [301392, 338095, 311283, 274223, 222173, 161715, 150356, 229589, 263858, 299399, 313585, 353250, 381751, 370200, 346137, 310538, 286915, 314685, 330279, 348410, 346443, 344667, 360355, 361675, 353410, 371645, 384656, 432270, 453475, 465536, 508838, 533305, 558919, 574192, 629914, 686007, 721303, 757870, 811956, 897252, 980899, 1098023, 1208181, 1305436, 1451441, 1700802, 1968760, 2286170, 2709589, 3325348, 4137782, 5321081, 7176931, 10093010, 14135296, 19086780, 23646241, 25658691, 24072338, 19773429, 14884343, 10895041, 8017527, 6133823, 4847488, 3975656, 3422171, 3015484, 2690704, 2393000, 2146603, 2012361, 1885988, 1757098, 1671849, 1653778, 1645652, 1624254, 1636923, 1688975, 1791561, 1910698, 2015967, 2121552]
13361B121552J42388J68757K72355L27747M10230N40453O93658Q87196J006022
13352F570358J260092J735673K530846L792814N884675R226350J3597248J7113122
13344F1711178J5646063O218550p059513j6277460j7311148j3043340q587969
13337B1296361n449988l512304k395976j698616j248809r86351p93984o83280
13329D527053n58121m40154l40075k19490j95150j32079q8744p640L521r632N416
13318B544905J4679R5200J05380J77938K57845L04957M00031N31344P22727Q76992
13308F031998J145621J385623J854736K713485M034401O298695R842706J4327698
13300D7634963J7536049J5230910M709239q739578j7315060j7400172j2767893
$$ y = [2121552, 2263940, 2432697, 2705052, 3032799, 3443029, 3983482, 4677140, 5564336, 6570358, 7830450, 9566123, 12096969, 15889783, 21774458, 31000808, 44598056, 61711178, 77357241, 83575791, 76516278, 60238818, 42927670, 29884330, 21296361, 15846373, 12334069, 9938093, 8239477, 6990668, 6004317, 5210333, 4527053, 3968932, 3528778, 3188703, 2969213, 2774063, 2641984, 2553240, 2545600, 2549121, 2539489, 2544905, 2559584, 2654784, 2760164, 2938102, 3195947, 3500904, 3900935, 4432279, 5155006, 6031998, 7177619, 8563242, 10417978, 13131463, 17165864, 23464559, 33307265, 47634963, 65171012, 80401922, 85111161, 76371583, 59056523, 41656351, 28888458]
13293B8888458q296980n270810l432572k312338j637325j240355j018087q56149
13285D823842p19872n73532m36184l71048k64812k01233j38732j31616j35657
13276A851156q5008k0684q095J2045l47L053N6958Q036M7995J48087J36723K22410
13264B372329K79265M02796N35122P10128J009659J481855K252422L363646M692336
13255A7099558N248903L933512O51003l007848n161397n090164l902194k619908
13247G151465j747181j213429p93318o11074m25683l59731l06450k56128k02347
13238A236124j48254j09383l2657j31376r5663m2861m0798j4742O847m9578k4852
13227E52807l1055j0483J9084l5178q7615l0783k6133l8083P164N0392J0419m2244
$$ y = [28888458, 20591478, 15320668, 11888096, 9575758, 7938433, 6698078, 5679991, 4823842, 4103970, 3530438, 3094254, 2723206, 2458394, 2257161, 2118429, 1986813, 1851156, 1766148, 1745464, 1737369, 1749414, 1749067, 1752120, 1809078, 1817114, 1865109, 2013196, 2149919, 2372329, 2651594, 3054390, 3589512, 4299640, 5309299, 6791154, 9043576, 12407222, 17099558, 22348461, 26281973, 26932976, 23925128, 18763731, 13673567, 9771373, 7151465, 5404284, 4190855, 3397537, 2786463, 2360780, 2001049, 1694599, 1438471, 1236124, 1087870, 978487, 945830, 814454, 718791, 675930, 635132, 620390, 627237, 577659, 552807, 521752, 511269, 530353, 495175, 407560, 376777, 350644, 312561, 319725, 370117, 380536, 338292]
13215C38292l1024j8647q0O019Q364L2003k9702m2302m424n6443l2584l9363K4745
13202A54854L7778J6708L566N3055K172q8832l1448J2040J5991k2260o3913K848
13190I2559p321K908L2207k758K9179j417k008M8702n762k9890J2365k6601K5249
13177A67412Q6886m061r4850o3130o73K1011M4309P5410l8996p1755j9060o1064
13165D1439l0655O7940Q3231P732j7494L4741J7700l1240K5811L9962k5143m9370
13153A64654k6508n0839R042Q023J5585n8049R765k738k5932j8264q997J4456
13141C0198j2039M991J6825R743N3860L3664n4928q4353o179p994K5219L815l9351
13128b6529K4397M796l2041m956N121J2854P3656K3473l1544q2149J3398J9260
$$ y = [338292, 307268, 288621, 288541, 294560, 302924, 334927, 305225, 262923, 258499, 202056, 169472, 130109, 154854, 192632, 209340, 212906, 265961, 268133, 179301, 147853, 159893, 175884, 153624, 89711, 92559, 85238, 88146, 120353, 117595, 146774, 145357, 143349, 192051, 186289, 156399, 168764, 142163, 167412, 254298, 250237, 155387, 92257, 91584, 112595, 156904, 232314, 193318, 121563, 102503, 41439, 10784, 78724, 161955, 169687, 152193, 186934, 204634, 173394, 199205, 239167, 214024, 164654, 138146, 87307, 96349, 104372, 119957, 61908, 71673, 68935, 43003, 24739, 15742, 30198, 18159, 23150, 39975, 49718, 103578, 137242, 82314, -2039, -8218, -16212, 9007, 12822, -26529, -2132, 2664, -29377, -34333, -29212, -16358, 57298, 80771, 49227, -32922, -19524, -264]
13116b64J5135q551j5757J8791k2856L4723k4660L0320N7490k553k1090K3859
13104H4587N9k1184k8800m0999M898O9966j0498k5458l4085O124k2341m2007K2243
13091c7495J9570K0611J1326J7464J2782J669j6519J3707l5925l4830N844L7214
13079A5418N4750o755J7875Q715k5348q3302n7314K6854N3725L5587O454L7321
13067H3980J2840j8447l0037j4418J4589j0783k572J8700k2586j4692M069M8538
13055F9181N673J5537l6853n7789l9256N4734K9164j9003L3761L3055j6485J8185
13043H9904o9799l3277j7820N8027L1418K4103n62n8673o5248K9717J8848k5074
13031a8436O626k5661j2045J8459J0167J0268K7713O1498M9329j0803n1396l0630
$$ y = [-264, 14871, 6320, -9437, 9354, -13502, 21221, -3439, 26881, 84371, 81818, 60728, 84587, 84646, 63462, 34662, -6337, -1439, 68527, 58029, 32571, -1514, 4610, -17731, -59738, -37495, -17925, 2686, 14012, 31476, 44258, 45927, 29408, 43115, 7190, -27640, -21796, 15418, 70168, 63413, 81288, 90003, 64655, -18647, -75961, -49107, 4618, 40205, 46659, 83980, 96820, 78373, 48336, 33918, 48507, 37724, 35152, 53852, 31266, 16574, 20643, 69181, 74854, 90391, 53538, -4251, -43507, 11227, 40391, 21388, 55149, 88204, 71719, 89904, 20105, -13172, -30992, 27035, 58453, 82556, 81994, 23321, -41927, -12210, 6638, -18436, -11810, -37471, -49516, -31057, -20890, -10622, 17091, 78589, 127918, 117115, 65719, 35089]
13019C5089O517k5850j7980p689j8176O850M1786K2544k8323k3491j8876k3712
13007e1311N7560M1705J2965n3692m0771j1916m4677J2615K9965J3256r013k761
12995d6075M5688j1408k4134M995L548k2638k2373j7092K7192J8944l0697O2561
12983a1489P0106J2245L1260j2880j9094j8280j3559k4898L051L6438k3986j2486
12971A6428k103L2460K7356M504k0759j451P637N397l9896P880O1822k8821j7982
12958E2472k9189o3476l4973J2898L8891L9335k051Q184J640j743J8216J5300
12946E5504M4096J9635m7599o4614j3976M0739K1607l4233j6008n093p3923l4757
12934a08622J5290P735J5742K3788M9332K1234M7439m1045R916J0705j5855N661
$$ y = [35089, 41606, 15756, -2224, -9913, -28089, -21239, 20547, 43091, 14768, -8723, -27599, -51311, 6249, 47954, 60919, 7227, -33544, -45460, -90137, -77522, -47557, -34301, -43314, -46075, -387, -11795, -35929, -30934, -27386, -50024, -72397, -89489, -62297, -43353, -74050, -11489, 58617, 70862, 102122, 89242, 70148, 51868, 38309, 13411, 16462, 52900, 28914, 16428, 14325, 46785, 74141, 78645, 57886, 56435, 64072, 69469, 29573, 37453, 99275, 70454, 52472, 23283, -40193, -75166, -62268, -23377, 15958, 13907, 22091, 23731, 21988, 40204, 55504, 99600, 119235, 71636, 7022, -6954, 33785, 55392, 21159, 5151, 58, -73865, -108622, -93332, -85597, -69855, -46067, 3265, 24499, 71938, 30893, 40809, 51514, 35659, 41320]
12922D1320l7843O163L1914J8021J5295J9410L1203K3539k2386l1062l3394q8744
12910b6564k058K4718j2364j7050j6453J8153J9373K4544L0402L1828j6005l6627
12898B1897l1689l5956j4992K0940K1981R290P902k176M5386M609k8748k50K6294
12885D4488R701p0118k2292N3981L2293L1064K3974q900r523K7374O6916R3614
12873B72572K1072N5827M8941n4691j17650l6936p9424p1347j7753J1205J9575
12862E1391k3917J5635J416l8340j1255J3957J1841J0544L29N661l5310K393K8306
12849C2651j5944k8128k9665p728L6333J0452J2449J935J0279j1094k2239j3447
12837b4146R979K8359K6973l5176l246O007O8308J11189R9417O3088N0144J2009
$$ y = [41320, 3477, 9640, 41554, 59575, 74870, 94280, 125483, 149022, 126636, 95574, 62180, -26564, -28622, -3904, -16268, -33318, -49771, -31618, -12245, 12299, 42701, 74529, 58524, 21897, -9792, -45748, -60740, -39800, -17819, -8529, -627, -2803, 42583, 47192, 18444, 18194, 44488, 54189, -15929, -38221, 15760, 48053, 79117, 103091, 94191, 84668, 112042, 178958, 272572, 293644, 349471, 398412, 343721, 226071, 189135, 109711, 38364, 20611, 31816, 51391, 27474, 43109, 44525, 6185, -5070, 8887, 20728, 31272, 31601, 37262, 1952, 4345, 32651, 16707, -11421, -41086, -48814, -12481, -2029, 10420, 12355, 22634, 11540, -10699, -24146, -14167, 14192, 41165, 5989, 2743, 8750, 77058, 188247, 287664, 350752, 400896, 412905]
12825D12905n2202o4431m9878n6811p139j01867n0090R535M141j7022K135k1928
12813G348l5123m7504L8951L4370K8277l0395L995K5116O542r82o519q567o8165
12800e2656j2868J2440J1855L385j951O381r742J1570N6384K9341L909L4397P607
12787A00052L1500Q543o1584l2043r406Q753J3383j6507j0736r050L5669K9442
12775H8016m6609k5242k1613k5738k273J021J5998j1550l643n574l229K6226k5758
12762c9968l862M6661l5081l1676N0035J284k890J7702K3490j6547n8137j7484
12750f6473L4123L3001J4839P187n5101k1041K3041K1798M264O297k3362J1899
12738i528L4637l8711l4156K2124M3109K7494L2861n1117l5067K0486J4572L18
$$ y = [412905, 360703, 296272, 246394, 189583, 182444, 80577, 30487, 40022, 44163, 27141, 29276, 7348, -27775, -75279, -36328, -1958, 26319, -4076, -81, 25035, 31577, 30595, 24076, 15509, -52656, -65524, -53084, -41229, -37844, -39795, -33414, -43156, -31586, 24798, 54139, 58048, 92445, 100052, 131552, 140095, 78511, 46468, 37062, 45815, 59198, 42691, 31955, 22905, 58574, 88016, 41407, 16165, -5448, -31186, -33459, -32438, -16440, -27990, -31633, -37207, -40436, -14210, -39968, -43830, 2831, -32250, -63926, -13891, -12607, -15497, 2205, 25695, 9148, -48989, -66473, -32350, 651, 15490, 22677, -32424, -53465, -30424, -8626, -4362, 1935, -21427, -9528, 25109, -13602, -47758, -25634, 17475, 44969, 77830, 26713, -8354, 12132, 26704, 27022]
12726B7022m3800m3617j5974L9525O3934j2309k3712M4254L1072O013m7210k2694
12714B504k4076m5474K178L1955K3712q413K9702j404J0936J6555k1490l7726
12702b1041j6132J3601L3455k4529k1305r433O017J2151K1488q578q92P881k3296
12689c0613k6649O136N9041J7327J152k8768P924o566k5886j9819K0716L2545
12677F540O7342l7256l4023l8242K6575L0773l3937j4229M2559j6899L0351n923
12665B3631k865j75K1655j5446l1010L4113l8283n8415k8330O3606L5685n1793
12653d7627j8452M5909o040p121J4537L7933K7017J0621K908N526P343r902L8502
12640A01154m7716n3883Q382l7227L0935K5589j4625q75j5792L08j7474n326j3331
$$ y = [27022, -16778, -60395, -76369, -36844, 27090, 14781, -8931, 35323, 66395, 72408, 25198, 2504, -21572, -67046, -64868, -32913, -9201, -17614, 12088, 10684, 21620, 38175, 16685, -21041, -37173, -23572, 9883, -14646, -35951, -45384, -39367, -27216, -5728, -14306, -15198, -7317, -30613, -57262, -51126, 7915, 25242, 26394, -2374, 5550, -1016, -26902, -46721, -26005, 6540, 73882, 36626, 2603, -35639, -9064, 21709, -12228, -26457, 16102, -797, 29554, 23631, 20766, 20591, 42246, 26800, -4210, 29903, -8380, -66795, -95125, -31519, 4166, -47627, -66079, -20170, -26210, -33331, -18794, 19139, 46156, 56777, 59685, 65211, 72554, 62652, 101154, 53438, -445, 7937, -29290, 1645, 27234, 12609, 11734, -4058, -3750, -21224, -26550, -39881]
12627c9881Q455J7067k1086j6108K7145N372J2126j1382k303J8110R524K2422
12615B9461J9473l7770j5256P722K676j5873p739m1713J0381J1586j2355p449
12603e6856k0509j8832L1735J985M760L297R1927j7199l1255j748l4366R367J1009
12590b6685K0142M3807P175R09p50N875L0698l2244o7363M0090l9059l1853m2483
12577i1741l305p208k5566K5297K8074L0218J7540k2540k983J258l5101k0048
12565a06105M016K4089k9252R480o932k3227K4800j9444K7757L1156K7053L1242
12553e367P1041l7890j1425K6918m6K757k9378n4042j756p923Q124l646K9592
12540a3041n6078j2680M9762M5678j2728k6732K7570N6560J4912r498P425J9992
$$ y = [-39881, -31426, -14359, -35445, -51553, -24408, -19036, -6910, -18292, -20595, -2485, 7039, 29461, 48934, 11164, -4092, 3630, 6306, -9567, -17306, -59019, -48638, -37052, -49407, -56856, -77365, -96197, -64462, -62477, -57717, -54420, 37507, 20308, -10947, -12695, -47061, -37694, -26685, -6543, 37264, 44439, 45348, 44598, 50473, 81171, 48927, -18436, 21654, -17405, -49258, -91741, -95046, -102254, -127820, -102523, -74449, -44231, -26691, -49231, -52214, -50956, -86057, -106105, -102089, -78000, -107252, -97772, -104704, -127931, -103131, -122575, -94818, -63662, -36609, -5367, 65674, 27784, 16359, 43277, 43231, 45988, 16610, -37432, -39188, -47111, -38987, -42633, -13041, -69119, -81799, -32037, 13641, 913, -25819, 1751, 58311, 73223, 63725, 71150, 91142]
12528I1142k1071k5840k0529m1263J4064L1049J2105K6689p716k3122j2612K9133
12516E2029r524K3510j9914k5624l6061l8240K926N537J4262o218J7140M0911
12504B0734R461j0331j1796m9016j4279k7901P1446M1272l1235L737j5961J6285
12492B416M8243m3949n1674j5255k5182O136L3569j223J2847L524J0031k762P076
12479a6203J9502L230J3534r286p337l1159n3123p2756L5784L8883M9272L8698
12467I039L5975J6671K415j2155j1555o9649k386J8782j0785K554J5617N716L330
12454C569m5561k7125J8967J3907K4640o240o517L2826j5789k8081L2371L6474
12442C3441K4770l33k6612m7652n8723k2232J6343M9516R81L506L0652K6920J4367
$$ y = [91142, 70071, 44231, 23702, -17561, -3497, 27552, 39657, 66346, 58630, 35508, 22896, 52029, 42505, 66015, 46101, 20477, -15584, -53824, -50898, -45361, -31099, -37317, -20177, 20734, 30195, 19864, 8068, -40948, -55227, -83128, -11682, 29590, -1645, 2092, -13869, 2416, 50659, 6710, -44964, -60219, -85401, -79265, -45696, -46919, -34072, -30548, -20517, -23279, -16203, 3299, 6529, 20063, 10777, 3440, -27719, -80842, -153598, -117814, -78931, -29659, 9039, 45014, 61685, 64100, 51945, 40390, -29259, -31645, -12863, -23648, -21094, -5477, 239, 3569, -41992, -69117, -50150, -36243, -11603, -17843, -24360, 8466, -7323, -35404, -3033, 33441, 58211, 57878, 31266, -16386, -75109, -97341, -80998, -31482, -30501, -26995, 3657, 30577, 44944]
12429D4944m8315M91L2954K5022k2464k0321k1688k132K7212l4305n114J1581
12417a2135O928M55L749J1050K1751j2187m2526l4321k4790O838M8337K3027J2792
12404H968j2735m1778o682K843K535M208M7347K6398K2729k1583n2812j9958J1118
12391b9402K9545J5938J5167l5162l2806j3450n6629l271N766J2382K04N785L9857
12378d6076N9110j5108k0469Q833j2589j9417k8748K3563r146p41M2575L9152
12366B0939M7086j8926o6982J0446L6068l5374l5215J0140K0454R183J7331k9671
12354a4521n8044R575K5374P267K2142r876m4586l0835K698L9801K510l6265K7438
12341e7322N8980L4512K433l3479n0162k3003K004J0200K9989K8044Q800J461
$$ y = [44944, -3371, -2880, 30074, 55096, 32632, 12311, -9377, -11509, 15703, -18602, -23716, -12135, -5207, -4752, -1003, 10047, 31798, 19611, -22915, -57236, -82026, -75188, -26851, -3824, 8968, -3767, -45545, -52227, -49384, -46849, -42641, 4706, 31104, 53833, 32250, -20562, -40520, -29402, 143, 16081, 31248, -3914, -36720, -50170, -106799, -110070, -104304, -91922, -91718, -85933, -46076, 13034, -2074, -22543, -13710, -26299, -45716, -74464, -50901, -60047, -60788, -18213, 20939, 68025, 49099, -17883, -7437, 28631, -6743, -41958, -31818, -11364, -2181, 15150, -14521, -72565, -62990, -37616, -30349, -8207, -18083, -62669, -93504, -90806, -51005, -48495, -84760, -57322, 1658, 36170, 38603, 5124, -45038, -68041, -66037, -55837, -25848, 2196, 10996, 12457]
12329A2457J1362k9254N250M527K680j5011k4441J5081N255Q2241J92m5550l4910
12316a0121M694K7473M0253k1646o4092J9164J875J0767j0551o5153J2959Q6772
12304C2394M1813j5491n3156k6132Q185j5471k8150o870J6866J989k1610m8230
12292a13863k6760L6504M0093j5904J9509K7922j6195o0646n8235P467P1326M8487
12280d0295R242J4203L5081l5480k3532q514O0477N4221k5018o1403K8098P148
12268A4228l9090q856K9340J4626J0227r032l0844l1067o115M0281k4426O942
12256c3786L6152J3078P221J8146k800K0223K0670l0546j5150p008m5583n0019
12244f9402j7049K2467J8230L1617M096j6367J205J1191L7901N294n3528k6039
$$ y = [12457, 23819, -5435, -185, 4342, 7022, -7989, -32430, -17349, -12094, 70147, 70339, 24789, -10121, -5427, 22046, 62299, 40653, -23439, -4275, -2400, 8367, -2184, -67337, -54378, 32394, 74207, 58716, 5560, -20572, -12387, -27858, -56008, -62878, -46012, -44023, -65633, -113863, -140623, -104119, -64026, -79930, -60421, -32499, -48694, -109340, -167575, -160108, -88782, -40295, -31053, -16850, 18231, -17249, -40781, -49295, 11182, 65403, 40385, -21018, 7080, 14228, -24862, -33718, -4378, 10248, 20475, 11443, -19401, -50468, -56583, -16302, -40728, -33786, 2366, 15444, 22665, 40811, 38011, 58234, 78904, 48358, 33208, 26200, -19383, -69402, -86451, -63984, -45754, -14137, -10041, -26408, -25203, -14012, 23889, 29183, -24345, -50384]
12232e0384j3032O390q478N3444K017K0416J2448j0579N0634L6741p766n1265
12220D0586j7843N930j8927n337o556q527m2508J6266j8099k546k6578L8558M2275
12207c306j8486k386J9250k6267l6900K3429K1335j0071J9975L0500k8510J6686
12195E249L1023j8389l2355J837j71j775Q736n5362J4734J1681J0632j3550O5207
12182B7497L2643j1162J4396K5454j1906l8419N252k4738m8105K3204N2313N6468
12170A02897n7455l026J4410M64k188k2821m3981n1178m004M8845M6989N2945
12158H1897L7931J8847k4600m9996P392j6380m968n0726Q949L3890k320k0557
12146A9359j2740k4214l8566J0169o514k0291M0516L5166K2412r565Q677M0795
$$ y = [-50384, -63416, -57026, -65504, -12060, -10043, 10373, 22821, 12242, 62876, 99617, 91851, 40586, 22743, 28673, 9746, 4409, -2147, -10674, -53182, -36916, -55015, -57561, -84139, -45581, -3306, -21792, -24178, -4928, -31195, -68095, -44666, -23331, -33402, -13427, 17073, -11437, 5249, 36272, 17883, -14472, -12635, -12806, -14581, -5845, -61207, -46473, -34792, -24160, -37710, 27497, 60140, 48978, 63374, 88828, 76922, 38503, 43755, 19017, -29088, -5884, 46429, 102897, 45442, 42416, 56826, 57290, 55102, 32281, -11700, -62878, -66882, -18037, 28952, 81897, 119828, 138675, 114075, 64079, 71471, 55091, 50123, -603, 8346, 42236, 39916, 19359, 6619, -17595, -56161, -45992, -52506, -72797, -32281, 2885, 25297, 15732, 24409, 65204]
12134F5204L6615O074r843L139l7706l5843k9099j6871K324n797M924J3630N0434
12121D7185l990j3833n261l491K461K3514L9761M3576j581n1550m3475K8143m1313
12108B0146n8516L6340j5932q264m0024k5360j0750l7366J5563N0282k5568M61
12096i8988k1853O983K9423P5255J11792O1162J4144j1049m9676o1746l1577J915
12084B5785L9956J8208L740n5196m0636l0317L7121Q2482J1999l4139j8497K8812
12072F9318K6701j5098J6860K9304k7980k433j3618N7664P109o6035K193j043
12060H2942m4451m4137M5714L45j5326N069M6359M2831N0757P984j0037J305k3390
12047A45965l0979l2918K8515J4175o0708m8093M9081N3945K9494Q158M2352k3365
$$ y = [65204, 101819, 107893, 98050, 101189, 63483, 27640, -1459, -18330, -16006, -21803, -16879, -3249, 47185, 43195, 29362, 24101, 20610, 23071, 46585, 86346, 129922, 128341, 76791, 33316, 61459, 20146, -38370, -2030, -17962, -26226, -66250, -91610, -102360, -139726, -124163, -73881, -99449, -98988, -120841, -113858, -84435, -9180, 102612, 163774, 177918, 166869, 117193, 55447, 23870, 25785, 65741, 83949, 87689, 32493, -8143, -38460, -1339, 81143, 93142, 59003, 40506, 69318, 96019, 80921, 97781, 127085, 99105, 96672, 83054, 140718, 147827, 81792, 83985, 82942, 38491, -5646, 40068, 40413, 25087, 30156, 76515, 119346, 170103, 178087, 168050, 169355, 145965, 114986, 82068, 110583, 124758, 64050, 15957, 65038, 118983, 148477, 156635, 198987, 175622]
12035A75622q1050m3846L0143l2341n0801M3041L9801P651J053J7106K205J3303
12023A21887J3809M9462O071n4378j7171L0316k822O970l1772k6965m8002l764
12011D3641L5675K8563k2090j2488M053K0129J682o3880k3440L5176R6883L5416
11999A79320j6813m4727p3892j9136R3160M7759L6618R748Q094J4126l929j9235
11987B11093m4010J1558K828L578l381r547J94l7712L1554O6203L2586o563K5158
11974B83539Q335l3890j1704j3202N5373M5858O790p663K086M1455K9271J2214
11962D18462j1970N0062l399J972L8521K6838m67J8934J4778l3944M2498P2601
11950F34886M2688O040L9751O6152K5360j9791Q5365P0935M2160J07833J10579
$$ y = [175622, 94572, 50726, 80869, 48528, -2273, 40768, 80569, 88220, 89273, 106379, 108584, 121887, 135696, 185158, 191229, 136851, 119680, 149996, 147174, 154144, 122372, 95407, 47405, 43641, 79316, 107879, 85789, 73301, 77354, 97483, 99165, 35285, 11845, 47021, 143904, 179320, 162507, 117780, 43888, 24752, 117912, 165671, 202289, 212037, 220131, 234257, 230328, 211093, 167083, 178641, 181469, 185047, 181666, 172119, 172313, 134601, 166155, 232358, 264944, 258381, 283539, 291874, 257984, 246280, 233078, 288451, 334309, 341099, 333436, 335522, 376977, 406248, 418462, 406492, 456554, 453155, 455127, 493648, 520486, 520019, 538953, 553731, 519787, 562285, 634886, 677574, 683614, 723365, 789517, 814877, 795086, 880451, 951386, 993546, 1101379, 1211958]
11939A211958Q5165P4772N1391J19954J48023J80038J83787K29603J98441K36869
11929B720001L27698L68923L81703N32257O08460O59078Q49115J058327J342049
11920H847611J760291K309300L123572M363151O315155R404299J4510766K2658682
11912G3292827L3602588M2390573L8356704J4685918j7333369l8813664m1084656
11905A05096921l1585195k1356525j3996066r362513o453456m654176l383798
11898A4305192k478897j834048j466799j159590q99161p67858o50585n33456m65263
11889D049535l99460k92530k27984k70157k66688j95140r5797j57770j69475j64056
11879A810478j46752n3267o8701p2999l3225n7779o0300o4763k4205q4159r7287
$$ y = [1211958, 1297123, 1371895, 1423286, 1543240, 1691263, 1871301, 2055088, 2284691, 2483132, 2720001, 3047699, 3416622, 3798325, 4330582, 4939042, 5598120, 6447235, 7505562, 8847611, 10607902, 12917202, 16040774, 20403925, 26719080, 36123379, 50634145, 73292827, 106895415, 149285988, 187642692, 202328610, 184995241, 146181577, 105096921, 73511726, 52155201, 38159135, 28796622, 22343166, 17688990, 14305192, 11826295, 9992247, 8525448, 7365858, 6466697, 5698839, 5048254, 4514798, 4049535, 3650075, 3357545, 3129561, 2859404, 2592716, 2397576, 2301779, 2144009, 1974534, 1810478, 1663726, 1610459, 1541758, 1468759, 1435534, 1377755, 1317455, 1252692, 1228487, 1144328, 1047041]
11868A047041n6002n6675o7231o5636j5754j4826o6046n1612k4378m430n6832
11857E67619j1857L3972o163k2442j5215k0588l5364n8134j5031k4271r889n9859
11845C22778N2J552l9555l9833l301J4415N4534M6649o923m252K2585l3188o6608
11832B68905o2626l6145J4244K1735M5761M158J4531j2150l3820M3962j6097p9830
11820A72628k1030j3739k075K8287M6636Q017M106k8041L8652k7550n1179j0454
11808A44258M716j9953K8222K5689J2315K4745l5222m727k7349m3651j7636j0924
11796H0483N455K0597m3282K0826Q4370O3839m2823k1177j1366k4879N5381N1615
11784B39039L6335K3556k6811l5432l674n6777q873N0683K0153M7816m3984m8536
$$ y = [1047041, 991039, 934364, 867133, 801497, 785743, 770917, 704871, 653259, 628881, 624451, 567619, 555762, 589734, 583571, 561129, 545914, 525326, 489962, 431828, 416797, 392526, 382637, 322778, 322830, 324382, 284827, 244994, 241693, 256108, 310642, 357291, 350368, 346116, 368701, 335513, 268905, 206279, 170134, 184378, 206113, 251874, 256032, 270563, 258413, 224593, 268555, 252458, 172628, 151598, 137859, 135784, 164071, 210707, 218724, 222830, 194789, 233441, 205891, 154712, 144258, 148974, 129021, 157243, 182932, 195247, 219992, 184770, 180043, 152694, 109043, 91407, 80483, 85938, 106535, 63253, 84079, 168449, 232288, 189465, 168288, 156922, 132043, 187424, 239039, 275374, 298930, 272119, 236687, 233013, 176236, 167363, 218046, 238199, 286015, 242031, 193495]
11772A93495o1221l7823m506K729J0618M810k2495l8843k8832K5626j4428o483
11760B2647k497R546J8455L3430R894L683r8284m3856n078j6608l2058M625l377
11747i9478N4891Q6981K4361k0781p2876j240M2360L9422j1758n2444p0807k4188
11735a05557N0686K0914J007k9376j6286k4710M2197N9683L5384j6193L3261J0906
11723F1916L9301K495n4953L2618M2019M2285N4153n0381J2342n7612m0663L3510
11711A17030L1951l5606j4050J041p784l7017k1111M59J4917Q2597l0121m8647
11699E3659l6324j3639J9102J7729k0374k0507J2426k6306L5026M7238M2223k6636
11687H3617j7268K4959n083n3192l5983N135K7532j0528K4249M6485J586q403
$$ y = [193495, 132274, 94451, 89945, 92674, 103292, 108102, 85607, 46764, 17932, 43558, 29130, 22647, 20150, 29696, 48151, 81581, 91475, 95158, -3126, -46982, -52060, -68668, -100726, -96101, -99478, -44587, 42394, 66755, 45974, -26902, -28142, 14218, 53640, 41882, -10562, -81369, -105557, -54871, -33957, -32950, -62326, -78612, -103322, -61125, -1442, 33942, 17749, 51010, 61916, 101217, 103712, 48759, 81377, 123396, 165681, 219834, 169453, 181795, 124183, 83520, 117030, 148981, 113375, 99325, 100366, 92582, 55565, 34454, 34913, 49830, 132427, 102306, 53659, 17335, 3696, 22798, 40527, 20153, -354, 12072, -14234, 20792, 68030, 110253, 83617, 66349, 91308, 86225, 33033, -2950, 2185, 29717, 19189, 43438, 89923, 91509, 83106]
11675H3106l1963j4280J4836J3534J5382k4366k3021J165J0016m2688J5217n470
11663A1468Q478k4216J648l443K0486R451k5347l6704K6780O120j0047K7023L7279
11650D8976J4577J1076M246J5535O973J8167n6446m4353k4314J5165L8414l062
11638D4954q258K4846J9531j7632P55K7763k7195m9152j6940N5310J7236K042
11626G3260l6388j7063r524m6256J1889K4165J9418j7863q28k2418J4380k2326
11614b9554J0459J8506q960J3797R342j0374k8026l8612N9465N7039j9688m1310
11602g916j4938j0565r000p032K371L0634K446J3729O1554K6665n7610n800o257
11589A8281k6447K2400J3825J0231l8926m907J6433K6211j5119o6925K5484k0395
$$ y = [83106, 51143, 36863, 51699, 65233, 80615, 56249, 33228, 34393, 44409, 1721, 16938, 11468, 19946, -4270, -2622, -6065, 14421, 23872, -1475, -38179, -11399, -5279, -15326, 11697, 48976, 63553, 74629, 78875, 94410, 101383, 119550, 63104, 18751, -5563, 9602, 48016, 44954, 36696, 61542, 81073, 63441, 64196, 91959, 64764, 15612, -1328, 53982, 71218, 73260, 36872, 19809, 10285, -35971, -24082, 83, 19501, 1638, 810, -21608, -7228, -29554, -19095, -589, -9549, 4248, 13590, 3216, -24810, -63422, -3957, 53082, 33394, -7916, -22854, -33419, -42419, -49451, -47080, -16446, -14000, -271, 61283, 87948, 30338, 24538, 18281, -8166, 14234, 28059, 38290, -636, -5543, 10890, 37101, 21982, -44943, -19459, -39854]
11577c9854R140J6284K6989M4760J5846L126L7774l3586k6029j5774j4775K9653
11565E3554l551o321q600K5595j3633m8739K9547L8706l0586L3610K7539o4422
11553C2699n9142j3508N562K4051J0405k668M3498n651l7961L306K4642j484Q51
11540B4600j2640J0266j3454m2846R455L6667r296J0111N1826k8625J310l837
11528C3537J1004k0144l8684j0350M549L9106K0797j460j1646M16L4442O015o926
11515F0656l0613p2668k2782L8942O92K0910K1402n679O779J7433O0473J650j0759
11502H6436M908m378m0695K7406K7927j8464j049K1873k7855m5224J9571K6962
11490G7418o4970n56L2027j8989m8922J0774M088J3789O820j3578k5055K8281
$$ y = [-39854, -30714, -14430, 12559, 57319, 73165, 76291, 114065, 80479, 54450, 38676, 23901, 53554, 50003, 43682, 35082, 60677, 47044, -1695, 27852, 66558, 35972, 69582, 97121, 32699, -26443, -39951, -34389, -10338, 67, -2601, 40897, 35246, -2715, 591, 25233, 23749, 24600, 11960, 22226, 8772, -34074, -24619, 12048, 2752, 12863, 64689, 36064, 37374, 33537, 44541, 24397, -14287, -24637, -20088, 19018, 39815, 38355, 26709, 27125, 61567, 67582, 60656, 30043, -42625, -65407, -26465, -25773, -4863, 16539, 10860, 17639, 35072, 95545, 97195, 86436, 91344, 86966, 46271, 73677, 101604, 83140, 82091, 103964, 76109, 30885, 50456, 77418, 12448, 11892, 43919, 24930, -23992, -13218, -9130, 4659, 11479, -2099, -27154, 1127]
11478A127K6444j5259K7403O281J0319O786J6821q422m0861q4224p55L9647p019
11465b1712l6756L7785M7546k2828N034K8803N8746k571J341O3134n7967p717
11453I2838L417J2224J3255K2464k5396j2665K0723J8669P014l2789l7053K1919
11441A04620L0510K0375k4839p4891m5143M0776K0037r189m0623K0336N0225N996
11429I8190j5603p824K6176k8419j0020M6233L0737j983J3615o260k8114j155
11417A15573K5079N753L6947K6051j1951j3276J4208P423n672q978K593K3006
11405B16756n5673j9781L2061m1120k2753j3404J4944k6169j9694L4025J4245
11394A13437o909l6086N844r404J0190L5655k1993m2846l2450L8217o222J516
$$ y = [1127, 27571, 12312, 39715, 45996, 56315, 63101, 79922, 71500, 30639, -53585, -54340, -14693, -21712, -58468, -20683, 26863, 4035, 9069, 37872, 96618, 94047, 95388, 158522, 100555, 92838, 96255, 108479, 121734, 144198, 118802, 106137, 126860, 145529, 152543, 119754, 82701, 104620, 135130, 155505, 130666, 55775, 10632, 51408, 71445, 62256, 21633, 41969, 92194, 98190, 82587, 74763, 100939, 72520, 62500, 108733, 139470, 137487, 151102, 144842, 116728, 115573, 140652, 146405, 183352, 209403, 197452, 184176, 198384, 205807, 200135, 191157, 193750, 216756, 161083, 141302, 173363, 132243, 109490, 96086, 111030, 84861, 65167, 99192, 113437, 106528, 70442, 76286, 66882, 77072, 112727, 90734, 47888, 15438, 53655, 47433, 48949]
11382D8949l5161j3387k5662M1382K9421q207j0440J6932K2100J6976K6453o0340
11370D9016m1481N921L8125r523o3760m8441K2530M6013q437n003j6519N412J2874
11357a3273o350J8780l652L4023K9122P233R360j7248k4878K4457P777j5775l6063
11344A3513o9188R020M4063K2508m6681k0361K4568K3089N846K839m491l710j6360
11331a5345K4690l0535m3974r575O6598N083K6770M1847L1m5548j1524o069L208
11318E657J0954L9814K0203l4308l2103q706l0507l3517K799M8568L0371j5137
11306D088L620N4445J4424j3235n0559K4481K6093K4874Q139j2503K370n3337
11294C2900k0017N285P685J2252J8039L342l2909r1067N9665K3880L4482L8234
$$ y = [48949, 13788, 401, -25261, 16121, 45542, 37335, 26895, 43827, 65927, 82903, 109356, 49016, 7535, 13456, 51581, 42058, -21702, -70143, -47613, -1600, -10037, -15040, -31559, -26147, -13273, -19623, -843, -4495, 29528, 58650, 65883, 75243, 57995, 33117, 57574, 65351, 49576, 13513, -55675, -46655, -2592, 19916, -26765, -47126, -22558, 531, 6377, 9216, 4725, 1015, -15345, 9345, -21190, -65164, -74739, -8141, -3058, 23712, 65559, 65590, 20042, 8518, 2449, 5657, 16611, 56425, 76628, 42320, 10217, 1511, -28996, -62513, -59714, -11146, 19225, 4088, 7708, 62153, 76577, 63342, 12783, 37264, 63357, 88231, 96370, 83867, 86237, 32900, 12883, 18168, 25853, 38105, 56144, 59486, 26577, -64490, -4825, 19055, 53537, 91771]
11282I1771R160n8385p9095j0123O9725P1852m528j1569m693k972n6352m8753
11270c3962k0209J5609P6031K9351J848k8960k6634k7692K2274O8753J3365l9858
11258D9916k7702j3802K7936P883L2343O5441o833p2719n6959m4116K8807Q9941
11246H0136K3960n4671l0288l2858j8335N7279J0538k295k147m2657l4343m4119
11234h9800J2438P078k6505K5384M1399M6277M787m5141k400O070K2129n587m0893
11221d4764j8828K7870O5861J2693R912n5567J2592J9231k2940o915K6743L5185
11209F1073O702n620N2891R7672O2892O6273J1183P780K4460j9859p4361r4855
11197A96231j10107m3683m87K868M591n1424j0496K8153j581m8554J2237K6687
$$ y = [91771, 100931, 42546, -36549, -46672, 23053, 94905, 90377, 78808, 74115, 71143, 14791, -33962, -54171, -38562, 37469, 66820, 68668, 39708, 13074, -14618, 7656, 76409, 89774, 49916, 22214, 8412, 36348, 44231, 76574, 142015, 135182, 62463, 5504, -38612, -9805, 80136, 104096, 49425, 19137, -13721, -32056, 25223, 35761, 33466, 31319, -11338, -45681, -89800, -77362, -70284, -96789, -71405, -30006, 16271, 21058, -24083, -26483, -20413, 1716, -3871, -44764, -63592, -35722, 30139, 42832, 52744, -2823, 9769, 29000, 6060, -855, 25888, 61073, 67775, 62155, 115046, 212718, 275610, 341883, 353066, 360846, 385306, 365447, 291086, 196231, 86124, 42441, 41954, 44822, 49413, -2011, -12507, 15646, 14065, -34489, -22252, 4435]
11185D435K862J2234j1158K696L037k7887m8387J5004J6126J6735o362l4301N620
11172d9346K3044J9470n303k0479L5093R232J8233p455L3977j2561j1195L0978
11160F3688M5468o71n4425j8239Q239j5662j6080J0769j8933K4806Q775l5230
11148B505k2158O091k1069l1510k0422J8601M8828m941J8739J5501K9184K9738
11136F9087j7305j487L7490k0133k6309k6208l1482k3779l562K9471J177n4437
11124f7477m8320M5640J9007J1043K558o768J1790K6510q603K779K4812J9294
11112C2265K1527j3477k0078l2843J3958M1533j005J4794m954J6783o895k8561
11100C3047o611j3476l5857J6635P321p049K0242j7067N620N507k3680o677j0586
$$ y = [4435, 7297, 19531, 8373, 11069, 14106, -13781, -62168, -47164, -31038, -14303, -20665, -54966, -49346, -26302, -6832, -12135, -32614, 2479, 11711, 29944, 22489, 56466, 43905, 32710, 63688, 109156, 108485, 54060, 35821, 44060, 28398, 12318, 23087, 4154, 28960, 37735, 2505, -19653, -13562, -34631, -66141, -86563, -67962, -19134, -24075, -5336, 10165, 39349, 69087, 51782, 50295, 87785, 67652, 41343, 15135, -16347, -40126, -43688, -14217, -13040, -67477, -115797, -70157, -51150, -40107, -37549, -44317, -32527, -6017, -14620, -11841, 12971, 32265, 53792, 40315, 20237, -12606, 1352, 42885, 41880, 56674, 51720, 68503, 61608, 33047, 26436, 12960, -22897, -6262, 1059, -5990, 14252, -2815, 2805, 8312, -15368, -22045, -32631]
11087c2631l0424J1642L2915N970j9835o0028k4931N0993N7935J3250l4027n4285
11075h3456k149L2599j833l7244L5897N9304K3935l2455l0594M494o1427J9967
11063g2962J5252J0430J5129L7904J432r553o6025n1270P1034M6898k6972K023
11051b6680K0804m866j1302K0593J3515P1261Q1144K1260l3059m3194O677L2339
11039A48492k1901M164Q745J2280k4683K781J9977P5825M8778M4206k2852l9410
11027B56402j8276j452N442r064L6887M1078N5601O2702M4989n0278r3641n2313
11015B78077q3765m5492L0526J1349K8283O9579L7956m2591n87J9170l5424l5457
11003B31624q7439o0748J9615n198J7146J1938M1221N0472k4356j4050o1743m0903
$$ y = [-32631, -63055, -51413, -18498, -12528, -32363, -92391, -117322, -66329, -8394, 4856, -29171, -83456, -85605, -53006, -54839, -92083, -56186, 3118, 27053, -5402, -35996, -31502, -92929, -72962, -57710, -47280, -32151, 5753, 7185, -2368, -68393, -119663, -48629, -1731, -28703, -26680, -5876, -10742, -22044, -1451, 12064, 83325, 164469, 185729, 152670, 109476, 116153, 148492, 126591, 130755, 139500, 151780, 127097, 129878, 149855, 225680, 274458, 318664, 295812, 256402, 238126, 236674, 242116, 233052, 269939, 311017, 366618, 429320, 474309, 424031, 330390, 278077, 194312, 148820, 179346, 190695, 218978, 288557, 326513, 283922, 283335, 302505, 267081, 231624, 144185, 83437, 103052, 97854, 115000, 126938, 168159, 218631, 194275, 180225, 118482, 77579]
10991G7579p374J6573N436l2138j8290K1678k6739n5318K4534n413j1394N5426
10979D4560k374K069j075L752L6710K9051n151k8708L324Q365M4777m3857q4463
10966F980p3995K663L7147j4928J1411n665O7641K9260j3503k5920N8293N0894
10954A30278M3555M8359L6159P031L0725J5095K6124m818r3188p0661n0774l1384
10942H6501n4883j751p05k8166k6944j7690J6065m443P900R767J9355j6399k6950
10929c8343K414Q132o707J7412j0560k0742j0309k2084J2864L381p175k6711m111
10916a02539N6845O8982j7043n4953l6614m0655O0282N626n13M2579J6146j8219
10904b0076j4978K2541n77J851m0665j0684M0160J2130n602m0457J8910l0918
$$ y = [77579, 70205, 86778, 92214, 60076, 41786, 63464, 36725, -18593, 5941, 528, -10866, 44560, 42186, 44255, 43180, 46932, 83642, 112693, 107542, 78834, 82158, 90523, 135300, 91443, 6980, -67015, -64352, -27205, -42133, -30722, -36387, 31254, 60514, 47011, 21091, 79384, 130278, 173833, 222192, 258351, 265382, 296107, 311202, 337326, 332508, 239320, 168659, 117885, 86501, 31618, 29867, 29162, 996, -25948, -43638, -27573, -32016, -24116, -14349, 5006, -11393, -38343, -35929, -27797, -34504, -17092, -27652, -48394, -58703, -80787, -67923, -64542, -71717, -98428, -102539, -45694, 23288, 6245, -48708, -85322, -125977, -65695, -60069, -60582, -18003, -1857, -20076, -35054, -12513, -13090, -11239, -51904, -62588, -22428, -10298, -15900, -56357, -37447, -68365]
10892f8365l4105R689O5357L0784J8808l512O864K7972k8763J0147L3213r946
10880E8143K7442j4871l7650j0073r179Q979j2922O518j625n283L596J0968j0203
10867A3840M0287J8306k0788l1515J4060P505l496O628K8712J0963p8429m9349
10855d3276J1609K2642j3821m7188J8869O3961J7648q073P2088k3355l2384J1061
10843D9781J7573j7056L3543j4230J4194p2955l9596R6949O8926L3149p137l26
10831A62815m7927k0076L6966N3898N7966L126J7513L9114K0018M4310j2631j6779
10819C38313j1620o3355q8043l2683L072l9673M158M514j1072n0585j9647M220
10807C7599j5180k1480K1475n469N27j1059L0823M3090j8132K0046L3510m2904
$$ y = [-68365, -102470, -92781, -27424, 3360, 22168, 18656, 25520, 53492, 24729, 34876, 68089, 58143, 85585, 70714, 33064, 22991, 13812, 22791, 9869, 16387, 14762, 9479, 13075, 24043, 13840, 54127, 72433, 51645, 20130, 34190, 41695, 38199, 44827, 73539, 84502, 6073, -43276, -31667, -9025, -22846, -70034, -51165, 12796, 30444, 22371, 94459, 71104, 38720, 49781, 67354, 50298, 83841, 69611, 83805, 10850, -28746, 68203, 137129, 170278, 163141, 162815, 114888, 94812, 131778, 185676, 243642, 246768, 264281, 303395, 323413, 367723, 355092, 338313, 326693, 263338, 175295, 142612, 145684, 106011, 110169, 114683, 103611, 53026, 33379, 37599, 22419, 939, 22414, 16945, 17472, 6413, 37236, 80326, 62194, 82240, 115750, 72846]
10795G2846p6766k2110j0292K3469M9606j2762K379M6698J815l3511o242N8481
10783I3611L7078k2995l4926N4966Q5507M1956R8113R2349P3457J47233K20732
10772H87081L01178K88150J25433J1541k65907l12651k51843j58596j31622q4939
10762D07825p6295m7003k8606l3521o7210r429J1707k5437l6899J2136K9524K3376
10750A60168L4195j8177l8066L0724l2407J1817L2631j0935k4712O297k9199k1216
10738A01120J6503K1548R479n0999j4793N7642J8218L9640K2414l6834r696l8857
10726A35385m8704q086J2249M9594N5504r950j0947m7973j1583j7399j5105J4768
10714I7753O151L764p162J2158j7357N654N640k3970K2401M1988q976k6696J5533
$$ y = [72846, -3920, -26030, -36322, -12853, 36753, 23991, 26370, 73068, 74883, 41372, 35130, 93611, 130689, 107694, 72768, 127734, 213241, 255197, 353310, 445659, 519116, 666349, 887081, 1188259, 1476409, 1601842, 1613383, 1347476, 1034825, 782982, 624386, 492764, 407825, 331530, 284527, 255921, 222400, 155190, 145761, 157468, 132031, 95132, 107268, 136792, 160168, 194363, 176186, 138120, 168844, 136437, 148254, 180885, 169950, 145238, 151535, 122336, 101120, 117623, 139171, 148650, 97651, 82858, 140500, 158718, 198358, 220772, 183938, 174242, 135385, 86681, 78595, 90844, 140438, 195942, 185992, 175045, 127072, 115489, 98090, 82985, 97753, 103904, 107668, 100506, 112664, 95307, 100961, 106601, 82631, 105032, 147020, 138044, 111348, 126881]
10701A26881J148K4841k1835K0339R411K882k3110k3211m171N7422L4468J4203
10689B19268l434J4594l455j5400k8935K4222M1959K1846K2838J280l7193J0060
10677B67650N4852q960k5035j6137j5900P795N6845k3073j7027M747k859K2283
10665C05181O5015K3829L8249k9628l4720L0515R1704J1915Q0990J00523N2751
10654G36324L9112j6961k4646J8753P09q1263l2635n685j8716N3447j1782m753
10642F51904Q2764n748n382N6649J8016J24861R1597M4477R4295J32774R0695
10631A376902J78773K10914J84688J55058J85081L09059L44164M15610N85553
10622C945802P28431Q98204J031225J169735J482591J969145K681317L358189
$$ y = [126881, 128029, 152870, 131035, 151374, 160785, 163667, 140557, 117346, 113175, 170597, 205065, 219268, 215834, 230428, 226973, 211573, 182638, 206860, 248819, 270665, 293503, 294783, 257590, 267650, 322502, 313542, 288507, 272370, 256470, 264265, 321110, 298037, 281010, 285757, 282898, 305181, 370196, 394025, 432274, 402646, 367926, 398441, 490145, 502060, 583050, 683573, 736324, 775436, 758475, 733829, 752582, 753291, 672028, 639393, 633708, 614992, 668439, 656657, 651904, 734668, 728920, 723538, 780187, 798203, 923064, 1014661, 1059138, 1153433, 1286207, 1376902, 1555675, 1766589, 1951277, 2106335, 2291416, 2600475, 2944639, 3360249, 3945802, 4674233, 5572437, 6603662, 7773397, 9255988, 11225133, 13906450, 17264639]
10614A7264639L571778K869628J451677j49818j183046j306971o85290M22778
10606B2255375J871452L625112N596481P157572P407934N398678J473181k539944
10598E2245841m780467m730558l079273p78112J824952M587087P318845R282056
10590F1890371Q999059N358088p26738o383709r258787q861133o601676l841312
10582D0574163j167311J360578L548019M912879M440864J640283k463816o006683
10574D6838976p459550o796459n022983l119657j503059j38726Q56317J236355
10566B4891214P93273l88218j982060l278666l771242l515640k858508k127331
10558G762822j552339j172805q82394o24095m05376l53845l18806k54641j99976
$$ y = [17264639, 20836417, 23706045, 25157722, 25007904, 23824858, 22517887, 21832597, 22255375, 24126827, 27751939, 33348420, 40505992, 47913926, 53312604, 54785785, 52245841, 47465374, 42734816, 39655543, 38877431, 40702383, 45289470, 52608315, 61890371, 70889430, 76247518, 75520780, 69137071, 59878284, 51017151, 44415475, 40574163, 39406852, 40767430, 44315449, 49228328, 53669192, 55309475, 52845659, 46838976, 39379426, 32582967, 27559984, 24440327, 22937268, 22798542, 23654859, 24891214, 25684487, 25296269, 23314209, 20035543, 16264301, 12748661, 9890153, 7762822, 6210483, 5037678, 4155284, 3531189, 3125813, 2771968, 2453162, 2198521, 1998545]
10549A998545k22272j58525j4595n4199j06199q7688j18307q5276o8502m6557
10539A036425j11615o8526l3003o9099j629L8279l0304k6099r759l4448N200j7738
10527F77684m2223m1831l6843M4732P59J6822J691j6848o0104n7091n539m8710
10515D32499L6522R789m0621j2048N3409J001m8620k7923J0662n700l5825K0555
10503C93700l8379p4214L7087L0514M21j5881O9024P5730N8665J4351j01089j30036
10491C19893l6236M8597L9334m5633l1995l5926J3229L0270K416K7570K3993L8427
10479C93939L5909K7227l1050k713j9404k6889j2147L2236n930L4269L2079j3224
10467D44302m0311l5393J7751n791k8108k7862L2761M2976j4256j5026m9948J7241
$$ y = [1998545, 1776273, 1617748, 1603153, 1548954, 1442755, 1355067, 1236760, 1151484, 1082982, 1036425, 924810, 856284, 823281, 754182, 752553, 790832, 760528, 734429, 724670, 690222, 695422, 677684, 635461, 593630, 556787, 601519, 602278, 619100, 620791, 603943, 543839, 486748, 481209, 432499, 469021, 478810, 438189, 426141, 479550, 480551, 431931, 404008, 414670, 408970, 373145, 393700, 355321, 281107, 318194, 348708, 349129, 333248, 402272, 478002, 536667, 551018, 449929, 319893, 283657, 332254, 371588, 325955, 293960, 258034, 271263, 301533, 303949, 331519, 355512, 393939, 429848, 457075, 426025, 423312, 403908, 377019, 364872, 397108, 391178, 425447, 457526, 444302, 403991, 368598, 386349, 380558, 352450, 324588, 357349, 400325, 386069, 371043, 321095, 338336]
10455C38336K4037l137p810J5432L3961K5915Q22K3948P7J2367l7558l9186m7564
10442C39640K2522M1892M8875K124P259j5777n1467J0488q811j049P019R449p562
10429D04602J3259Q4649P7929L8623L4590J0906L2523M9525o9750J4590J1083
10418G02529M3870K9176J3102J2566N5106M4945K1225N5154L7132J4213L7260
10407A066278Q3586M4435m908J9810R2662J08830J20895R1582J51403J36710J50623
10396B061906J49229J24720J27568K08928L08442L18565L84872M69971O56069
10387D810270P34320P25793N61778L29147L19489N37239P75502J078364J450600
10378A1322502J906411K463590L198477M074284N509688P628534J0708718J5720811
$$ y = [338336, 362373, 359236, 351426, 366858, 400819, 426734, 427556, 451504, 451581, 463948, 426390, 387204, 339640, 362162, 404054, 452929, 455053, 462312, 446535, 395068, 405556, 396745, 395696, 402715, 412164, 404602, 417861, 502510, 580439, 619062, 653652, 664558, 697081, 746606, 676856, 691446, 702529, 746399, 775575, 788677, 801243, 856349, 901294, 922519, 977673, 1014805, 1029018, 1066278, 1149864, 1194299, 1189391, 1209201, 1301863, 1410693, 1531588, 1623170, 1774573, 1911283, 2061906, 2211135, 2335855, 2463423, 2672351, 2980793, 3299358, 3684230, 4154201, 4810270, 5544590, 6270383, 6832161, 7161308, 7480797, 8018036, 8793538, 9871902, 11322502, 13228913, 15692503, 18890980, 22965264, 28474952, 36103486, 46812204, 62533015]
10370F2533015K4102726L7415652N4807746O8063772O0197285J9446253l2092146
10363B94474303o5037473o5161166m8235627l2179790k1062671j4289267j0266087
10356C8242222p572697n600466m158275l179387k566465k045119j688917j304925
10348A0125971r69323o88273m73830k84657k20276l31755n66657p50044o51864
10339E189292n90354m29488k99025l24071k97390k21832j79967k09416j60868
10330B476881o7735j06427j01630j35820j05090j06403q4217p5984k7450n4380
10320A611745j21724j05830r3764p7485p1784j9480k4780j8834m6203n5991j6218
10309I59652k2473l2634q3217k9766n8266L205N4418J0677j7032j2222l6418l2458
$$ y = [62533015, 86635741, 124051393, 178859139, 246922911, 307120196, 326566449, 294474303, 229436830, 164275664, 116040037, 83860247, 62797576, 48508309, 38242222, 30669525, 25069059, 20910784, 17731397, 15164932, 13119813, 11430896, 10125971, 9156648, 8468375, 7994545, 7709888, 7489612, 7157857, 6591200, 5841156, 5189292, 4598938, 4169450, 3870425, 3546354, 3248964, 3027132, 2847165, 2637749, 2476881, 2409146, 2302719, 2201089, 2065269, 1960179, 1853776, 1769559, 1693575, 1666125, 1611745, 1490021, 1384191, 1290427, 1212942, 1141158, 1121678, 1096898, 1078064, 1031861, 975870, 959652, 937179, 904545, 821328, 791562, 733296, 736501, 790919, 801596, 784564, 772342, 735924, 703466]
10297G03466k4975L2121J8826o0199q8827l149M3538k7805l1362j137k3323m3895
10285D93279k4149J3469K4098k9432k7116m2152K4164r384M891k8891o667P985
10273D00095k7111j2382l0469m68m333N7861O8436j6032o8113Q656P386r925j5661
10260C57940p79J1252j6844j03078o1444M7340M1438K1722j5275m0989J9561P9426
10248C40270L9981q008j126J9277K8710J0515j9825o145N0683J7313p35K1680
10236D92590r261J7672M2006M0013m5325m0172n4852l0992j6561l619l709j02192
10224B85598k8422j8750O541M3510k6401p0690k5616L5571P9072M3381l5105n6488
10212B32201o3977m5133j4139o684q893k3347j5871N2090R2494Q1770K8m8434
$$ y = [703466, 678491, 710612, 729438, 669239, 580412, 577263, 620801, 592996, 561634, 560497, 537174, 493279, 469130, 482599, 506697, 477265, 450149, 407997, 432161, 422777, 427668, 398777, 392110, 400095, 372984, 360602, 330133, 329665, 325332, 383193, 451629, 435597, 367484, 376140, 383526, 373601, 357940, 357161, 368413, 351569, 248491, 187047, 234387, 275825, 297547, 282272, 241283, 260844, 340270, 380251, 372243, 371117, 390394, 419104, 429619, 409794, 403649, 454332, 471645, 470910, 492590, 483329, 501001, 543007, 583020, 537695, 497523, 442671, 411679, 395118, 391499, 387790, 285598, 257176, 238426, 244967, 288477, 262076, 191386, 165770, 201341, 280413, 323794, 288689, 232201, 168224, 123091, 108952, 102268, 93375, 70028, 54157, 106247, 198741, 280511, 280539, 232105]
10200B32105m0250n0859j624k9J653K9220q546l6369n3149n0841K7917M1868j0320
10187H0776O5732j4036l1859L4823M1620P0576L2836L2157l1568j6971O1353O6524
10175C91963O9154m930j3788k0671l5166l2036j4704k1561K2990L1028Q087L2373
10163D12739j4518n3834j7988N6562M6662K235M08L8709O272K648Q7512k3503
10151E43904n1343k8574n727p8291k0558J0331j7346M1884N1041N9397J0395n8793
10139D56320r298n0295p3513l4378l8495k8385L1707K3823P2695m749n276j1117
10127C29039l8476l0817j1415J1535j0859l3448j31m4137n2258l1297q025k268
10115G7443Q972M632J8785J3247J3029k1857J8981J1298k6215k6819J1199p299
$$ y = [232105, 191855, 140996, 139372, 139343, 140996, 170216, 161670, 125301, 72152, 21311, 49228, 91096, 80776, 146508, 132472, 100613, 135436, 177056, 247632, 280468, 312625, 281057, 264086, 325439, 391963, 461117, 456187, 442399, 421728, 386562, 354526, 339822, 318261, 341251, 372279, 380366, 412739, 398221, 344387, 326399, 382961, 429623, 431858, 432266, 470975, 477247, 479895, 567407, 543904, 492561, 463987, 458260, 379969, 359411, 369742, 352396, 394280, 445321, 504718, 515113, 456320, 447022, 396727, 323214, 288836, 250341, 221956, 253663, 277486, 350181, 345432, 340156, 329039, 290563, 259746, 248331, 259866, 249007, 215559, 215428, 171291, 119033, 87736, 79711, 77443, 86415, 91047, 109832, 123079, 136108, 114251, 133232, 144530, 118315, 91496, 102695, 95396]
10103I5396k8523m5605J1838M1756M1106j3196O66J512Q3K3813j329l9243P424
10090I5698m1949l2625J0233N0957L3845Q943l2441l6517N6494L9336j5243o0576
10078G6155k4645R668K0600N2834j1333q709l3735K2048N867j3723n523k1675
10066F7829l5858K7124N3328L2971l630K0322l668l8585k7716%k6030k1730J3869
10053E8226M0969L1546k7907j8134L2438j8350l7626j9403l1377M3230L0113R616
10041I3341k6777l1456J2422j0081j761N660J6893K1900j0701j231K9616K841
10029A00666k9134K2801K4395j9368o058L4011o901l7535J4570M682M9555k6226
10017A25458m1147n4915m6131N4481M6133q485O117J3328l8418l7888K1310J038
$$ y = [95396, 66873, 21268, 33106, 74862, 115968, 102772, 103438, 104950, 105033, 128846, 127517, 88274, 95698, 53749, 21124, 31357, 82314, 116159, 125102, 92661, 56144, 112638, 151974, 136731, 76155, 51510, 61178, 81778, 134612, 123279, 114570, 80835, 102883, 108750, 95027, 89504, 67829, 31971, 59095, 112423, 145394, 141764, 162086, 158418, 119833, 92117, 92117, 66087, 44357, 58226, 99195, 130741, 102834, 84700, 117138, 98788, 61162, 41759, 10382, 53612, 83725, 93341, 66564, 35108, 47530, 37449, 35688, 41348, 58241, 80141, 69440, 68209, 97825, 100666, 71532, 94333, 118728, 99360, 93302, 127313, 120412, 82877, 97447, 102129, 151684, 125458, 84311, 29396, -16735, 37746, 83879, 75394, 81511, 94839, 56421, 18533, 39843, 40881]
10005D0881j7853m939j7516Q824L2896l8108P04L3989L1771K6105K2884k5526
9993I4112p7745K0442N1045N407J5964k0167j4484l3104m7907J4717K6584n8117
9981b3253k4087K7248L0095O6914M2874O608J9436k0039k4604n7072m3592K020
9969B548O2855P6247K1981J2661L4955n7362K9956J08676R7701J40656J71970
9958G02844K10667L10148K94998J70836r1994k72980k81963k56925j71444q4372
9948E29815q9217j17403o7430n1147j3707k2703j0632l1011p7314m3972K7782
9937C3061L3383J5362Q599J8073m910j4335n5864J0000J2157q119k886o389l7103
9924A029m2127M004K5271K7870P3973o765j7641J8004J295j7878L7271O113k9483
$$ y = [40881, 23028, 18089, 573, 9397, 42293, 4185, 4889, 38878, 70649, 96754, 119638, 94112, 16367, 36809, 87854, 93261, 109225, 89058, 74574, 41470, -6437, 8280, 34864, -23253, -47340, -20092, 10003, 76917, 119791, 126399, 145835, 125796, 101192, 44120, 528, 2548, 65403, 141650, 163631, 176292, 211247, 153885, 183841, 292517, 390218, 530874, 702844, 913511, 1223659, 1518657, 1689493, 1597499, 1324519, 1042556, 785631, 614187, 529815, 440598, 323195, 255765, 204618, 190911, 168208, 157576, 126565, 49251, 5279, 33061, 66444, 81806, 90405, 108478, 103568, 89233, 33369, 43369, 55526, 47407, 44521, 38132, 1029, -41098, -37094, -11823, 16047, 90020, 83255, 65614, 83618, 84913, 67035, 104306, 110419, 80936]
9911H0936m4849K8583J50n5232p8N577J2445L416l6187R394J0534j6359L085J1590
9897A3005J3342N694j3231J192L2032p38K1795K3954K1133k9379m7147j7531k7459
9884c338q266k9400L8615O3262O871j167j7409m545j3276R86l382j5055K0799
9871C4695j9344l852K6227l3200n393L3349L142l3018r905j350K1130N2476k3145
9858D1812l8967O3232L1594o8060j2611J0720n195O653o298J1283k3472J5102
9846B5793j6634J5743n333j2463Q657K9035L3121m1720K4198J9496l7195m6971
9834d273j8416N7926K3015k8827K786O935m193m5623p712L665k6546o770k0679
9821f8712p981l4558k7710N5570J18537k846j2540K818l9981k729O1696K2018
$$ y = [80936, 36087, 64670, 64820, 9588, 9510, 15087, 27532, 30948, -5239, 4155, 14689, -1670, 1415, 13005, 26347, 32041, 18810, 20002, 52034, 51296, 73091, 97045, 118178, 88799, 41652, 24121, -3338, -11604, -41004, -2389, 60873, 67744, 66577, 49168, 44623, 31347, 32333, 28951, 13896, 34695, 15351, 11499, 37726, 4526, -867, 32482, 35624, 2606, -7299, -8649, 12481, 64957, 41812, 2845, 66077, 97671, 29611, 17000, 27720, 22525, 29178, 22880, 34163, 10691, 25793, 9159, 24902, 19569, 7106, 15763, 44798, 77919, 36199, 60397, 79893, 42698, -4273, -22689, 35237, 58252, 29425, 32211, 39146, 34953, -10670, -18382, -14717, -41263, -48033, -68712, -76693, -111251, -138961, -83391, 35146, 32300, 19760, 22578, -17403, -20132, 41564, 63582]
9809F3582k335M1738l3778q3422p3281L8862J5597p576L0857m007p799m4908j546
9796f8016M5855M1476Q94m5675N362J0392l5962M5007L7254M431R591j3478o361
9783C0770N2633P3911K2594n3161l1308j5009k4374M964J8598j0352L0120k3909
9771G5477l2470l5052J0757L2145q957Q42l3237J3835R528k4025N6075K4332l2541
9758E6709q415O613m0932J4088k5466m0707j3390j8643K8156n042O004q014j3212
9745f2251K1433M2916J5802l3656l9942J5068K0976Q593L1337j3307J207P555
9733A5731q545n5626j3593N915K3455L7946L4255N1519k9484k6236k7756m3511
9721c5930J7686M4505m0555n729K8134L487q841k0808o197J9236k4979L0469K6110
$$ y = [63582, 61247, 102985, 69207, -14215, -87496, -48634, -33037, -40613, -9756, -13763, -21562, -66470, -68016, -22161, 19315, 20209, -25466, -20104, -9712, -45674, -667, 36587, 41018, 50609, 37131, 30770, 83403, 157314, 179908, 126747, 95439, 80430, 56056, 61020, 79618, 69266, 99386, 75477, 43007, 7955, 18712, 50857, 41900, 42742, 9505, 23340, 32868, 8843, 64918, 89250, 56709, 48294, 54907, 13975, 28063, 2597, -38110, -51500, -70143, -41987, -47029, -41025, -49039, -62251, -40818, 2098, 17900, -15756, -55698, -40630, -19654, -11061, 20276, 6969, 8176, 15731, 7186, -48440, -62033, -56118, -32663, 5283, 39538, 91057, 61573, 35337, 7581, -35930, -18244, 26261, -14294, -20023, 8111, 11598, 2757, -18051, -24248, -5012, -29991, 478, 26588]
9708B6588J8556j7560k2216m6926n559J8656J1995L5455J0006J991L7873N3286
9696A22145j7553k3655j6171m5446l0589N1796L9442q33l1210m8919J3142o2n955
9683F132j8295L820J6734j7141K7519M9111m5610k0132r10J4073k6152p37Q013
9670c575q572j3K6791K3161m4571l4071M2353L8447L657j0436k154L4564J484
9657F7065J2791k6570n2437K0200O2186Q3596L4293N6127L0581k0501q1748l8897
9645A46686p2142n3079j4804n5078n2935N547O3650J052L224M943Q382m072M1330
9632B2704Q784m1757l1407l3453N4495m544L1720J5124l0294M521j5608k5742
9620d5457m122m92L2350k7012j3193J2877N4446q165R500K9698J8887K133j0156
$$ y = [26588, 45144, 27584, 5368, -41558, -47117, -28461, -16466, 18989, 28995, 30986, 68859, 122145, 104592, 80937, 64766, 19320, -11269, 40527, 79969, 79136, 47926, -993, 12149, 12087, 6132, -12163, -8343, 8391, -8750, 18769, 67880, 22270, 2138, 1228, 15301, -10851, -11588, -3575, -12147, -12160, 14631, 37792, -6779, -40850, 1503, 39950, 43607, 33171, 31017, 65581, 67065, 79856, 53286, 849, 21049, 83235, 166831, 201124, 257251, 287832, 267331, 185583, 146686, 74544, 21465, 6661, -48417, -101352, -95805, -32155, -31103, -27879, -22936, -14554, -18626, 22704, 31488, -10269, -41676, -75129, -20634, -25178, 6542, 21666, -8628, -4107, -19715, -45457, -49579, -50071, -17721, -44733, -57926, -45049, 9397, 1232, 10732, 40430, 59317, 61450, 51294]
9607E1294k4534l0030m0328J3814J5736J3798j4943J4475mJ4879M8377j7109k663
9594D2762q635l4137Q371k583J1035l6312l271L4924l8106O331O6549J9751l4781
9581C1898l7252K9873m546q509K273P838j7145M843K6405n5448l1025o252l2015
9568h9062J2173L8685J8699l68r666k1377O948N476n2428K7389L1234m1679r992
9555h3968L798J7343O0618M815K5415j0922l067k9378j5780j5275n963P211K5959
9542a9194K1984k4724l9658p699J2513K3367K0951K106Q042M1754N277M727J1315
9529F0761M514m6282j5242k3468k6240l1583k0048L8094R2130K0981k8605o507
9517A8505j0797k9017l0426q074J1608N3955O5421M56k5209l7248l7632Q515o858
$$ y = [51294, 26760, -3270, -43598, -29784, -14048, -250, -15193, -718, -722, 14157, 62534, 45425, 42762, 34127, -10, 8361, 5778, 16813, -19499, -22770, 12154, -25952, -19621, 46928, 66679, 31898, -5354, 24519, 19973, 11464, 13737, 21575, 4430, 9273, 35678, -19770, -50795, -57047, -89062, -76889, -38204, -19505, -19873, -29539, -50916, -43968, -38492, -90920, -63531, -32297, -73976, -83968, -80170, -62827, -2209, 2606, 28021, 17099, 14032, -15346, -31126, -46401, -52364, -45153, -19194, 2790, -21934, -61592, -69291, -56778, -33411, -12460, -10354, -2312, 39442, 44719, 49446, 60761, 65275, 18993, 3751, -19717, -45957, -77540, -97588, -59494, 32636, 53617, 25012, 18505, 7708, -21309, -51735, -59809, -48201, 5754, 71175, 71631, 46422, 9174, -28458, -19943, -26801]
9504b6801N672K2481m305j996j6661k8016j9379M7554L7559J5883j1430l2277
9492a1716l8062K3080L6878L1174m8638q979M4590K6083J5390n5268m9282j6001
9480e0751M279J9998j0395j2409j3950J116k5182o248N1701M2392k9699l8296
9468f7444M7156j4307m3667P700K1407j5004o490O4861O1185L8129m1000n3719
9456a193o565P563N674o297j0917j7949k5343R622K1548K3465K6751j9125m9525
9443d2291P474m61J2088J0228j3105m3531J0836M5035N1806j2211m0086l6021
9431e0239Q826O359j1727O821j2434j4147j5605J7411k4812m986K2568j6616K9656
9418e8925O5167r163m6094K3474j4140m3615J5918K5125r218K4184M5869q739
$$ y = [-26801, -21129, 1352, -2953, -4949, -21610, -49626, -69005, -21451, 16108, 31991, 20561, -11716, -49778, -26698, 10180, 41354, -7284, -16263, 28327, 54410, 69800, 14532, -34750, -50751, -46472, -26474, -36869, -49278, -63228, -62112, -87294, -93542, -41841, 551, -29148, -67444, -20288, -34595, -78262, -70562, -49155, -64159, -70649, -5788, 55397, 93526, 52526, -1193, -7758, -195, 5479, -818, -11735, -29684, -55027, -45405, -23857, -392, 26359, 7234, -42291, -34817, -35278, -23190, -12962, -26067, -69598, -58762, -13727, 38079, 25868, -14218, -50239, -41413, -35054, -46781, -39960, -52394, -66541, -82146, -64735, -89547, -94533, -71965, -88581, -58925, 6242, -2921, -49015, -25541, -39681, -83296, -67378, -42253, -51471, -27287, 18582, 9843]
9406I843j498k4649J1909k9434l2775j6741J4079K9828J688n9555j3466L2435
9394g8336K160K5697o253J728J3751L4237j19j837R70Q0592l5040o2391K740o813
9380b8914M3826m5870r532O7117L7365k331k9085k2034k2284J9961J0954j266
9368A7907j5678k2558j6685m6532L4578M8422J9201m1252k0607L9838o7960k2226
9356i3552O697L8152O5780k6188Q466J0274K0991M524k5758m1474J2251L4284
9344A4447l6078k6644j7101L311J3022K5271l0867o1837o11M8427r0J7834K2286
9331b8630L6762n256m067j3323k8386j3456l4356r435K5293J0073l8832k6585
9319a30198M3995O0728M0758L6181q198l3850n804l4420j9407L7872K5269K8954
$$ y = [9843, 8345, -16304, -4395, -33829, -66604, -83345, -69266, -39438, -37750, -97305, -110771, -78336, -76176, -50479, -56732, -55004, -41253, -7016, -7135, -8972, -8002, 72590, 37550, -24841, -22101, -28914, 14912, -30958, -40490, 26627, 63992, 61661, 32576, 10542, -11742, 8219, 19173, 17907, 2229, -20329, -37014, -83546, -48968, -546, 18655, -22597, -43204, -3366, -71326, -93552, -86855, -48703, 17077, -9111, -645, 9629, 30620, 35144, 9386, -32088, -19837, 14447, -21631, -48275, -65376, -62065, -49043, -23772, -54639, -116476, -117087, -68660, -68750, -50916, -28630, 8132, 2876, -1191, -14514, -42900, -56356, -90712, -100147, -74854, -64781, -103613, -130198, -86203, -25475, 15283, 51464, 43266, 9416, 3612, -30808, -50215, -12343, 12926, 41880]
9307D1880m0716l3016j6259K0436R096l6555r162K3190n2528J4187k6145M1041
9295f4551Q6626L0934j4293J3678J9751k8935j8805m9859n8744K7039K2480m2636
9283g7315L9813L9767n559m681M1313l1413m0720k1307q201K0686L939N1692M0361
9270D8375k1574m1043j0679k787J1006J4865j605k2306n840n7983J0890L5632
9258d3049K3430j0076M905J4754l7102L170J2776J8014k8940k1351L7046M203
9246b2220j6172j1292K7508k1531K091j3724R512J6394K9977J409j5265k6404
9234c9717K6054P428l6725k7631k6561J2862P889j924M350J8208P717L527j0868
9221e5391J5255L8962K2022l7693m1274K3653K225j3875j0583k889L3439j4971
$$ y = [41880, 1164, -31852, -48111, -27675, -18579, -55134, -64296, -41106, -93634, -79447, -105592, -64551, 22075, 53009, 38716, 52394, 72145, 43210, 24405, -25454, -84198, -57159, -34679, -77315, -37502, 2265, -3294, -7975, 33338, 1925, -38795, -60102, -68303, -47617, -43678, 8014, 48375, 26801, -14242, -24921, -27708, -16702, -1837, -3442, -25748, -31588, -89571, -78681, -43049, -19619, -29695, -24790, -10036, -47138, -43968, -31192, -13178, -42118, -63469, -26423, -22220, -38392, -49684, -22176, -43707, -41616, -55340, -45828, -29434, 543, 1952, -13313, -39717, -13663, -6235, -42960, -70591, -97152, -84290, -76401, -78325, -73975, -55767, -48050, -44523, -55391, -40136, -1174, 20848, -16845, -58119, -34466, -32241, -46116, -56699, -59588, -26149, -41120]
9209d1120l2836L053j7488K2737n017q200M8216J9900N917J4043m543P188j0175
9196A675k2177N869J7565L8323K718o1526o2517K372O6944L4512L344J3740m9830
9183h988K0464J6466m9733K2461L9679K4327p538l8387k768j809p344L5459J2950
9170E5239j7667j7224p013k1078J5014R632j9034k2472m8896J110p11M5165m819
9157c2754K88k8694J5542N9684o860n344o2586p447J4111L7850k6594j2756k1152
9144g6712O536J0823k6116M5873O305k1235k5508M1506P88K0544J5700K7320J5334
9131D1158j7776m1508k460j4709l4141M3407M5312K473p3894o506J2242M0753
9119e649K2920j1821N682l1314q427R943J3075j6751k4833l2717N4480J01688
$$ y = [-41120, -73956, -70903, -88391, -65654, -70671, -78871, -30655, -10755, -4838, 9205, 4662, 11850, 1675, -20502, -14633, 2932, 41255, 43973, -17553, -80070, -77698, -10754, 23758, 27102, 40842, -8988, 11476, 27942, -21791, 670, 40349, 64676, 57138, 18751, 15983, 14174, 6830, 42289, 55239, 37572, 20348, 13335, -7743, 7271, 16903, -2131, -24603, -73499, -72389, -73100, -27935, -32754, -32466, -61160, -45618, 14066, 7206, 1862, -60724, -68171, -54060, -16210, -42804, -55560, -76712, -70176, -59353, -85469, -39596, -33291, -54526, -80034, -38528, -37740, -17196, -1496, 25824, 41158, 23382, -18126, -20586, -35295, -69436, -26029, 19283, 21756, -52138, -58644, -46402, -5649, 17271, 5450, 11132, -20182, -28609, -18666, -5591, -22342, -47175, -79892, -25412, 76276]
9107G6276O5562J7930M7828Q8379O5794R0540j0274r0974r1388r5346p4744k5402
9095F4181j4728k8565l5422j1180J2645J0641K7459L4591j519j4747j8209K1868
9083D7015J6475K2385j9986m0697l9332k5580p8884k4715o360k487m899P4439
9071h2626M2994N3101J811N76P476P517j5020L0915P6263R6935J31262J29256
9059D80460J83477K25838J01061p0807j52104k14881j41462j52561r3595j17001
9049D8425m0990k0056L5175N5299k0545k4658l2281j3807j8570K751m6738o013
9037h2008J6774J4874M730K1985N791M790j3739k7054l7497J7262K6945M3463
9025c684M2470J0810K1063J3351L936n6324n2221j421M8605M3389R4624J09298
$$ y = [76276, 141838, 159768, 207596, 295975, 361769, 452309, 442035, 351061, 259673, 164327, 89583, 64181, 49453, 20888, -14534, -25714, -13069, -2428, 25031, 59622, 58103, 43356, 25147, 47015, 63490, 85875, 65889, 25192, -14140, -39720, -118604, -143319, -149679, -152166, -157065, -82626, -39632, 13469, 15280, 15856, 23332, 30849, 15829, 46744, 123007, 219942, 351204, 480460, 663937, 889775, 990836, 920029, 767925, 553044, 411582, 259021, 165426, 48425, 7435, -12621, 22554, 77853, 57308, 32650, 369, -13438, -32008, -29257, -75995, -82008, -65234, -50360, -45630, -23645, -17854, -13064, -26803, -53857, -91354, -74092, -47147, -3684, 38786, 49596, 70659, 84010, 87946, 31622, -20599, -22020, 26585, 69974, 164598, 273896]
9013B73896O2624O3499o9089k9853l1379l0536q9795o2866j2579N234k6857l1487
9001B0812k3746k9579j3104K8307N1084J5486N70J9507o7667p618J0558L0287
8989C4897k8746j6395J1110K7764j8129j5549k5629j3123k4334K9666N2278J6025
8977B9835k5716l8471K329L9087k2613j7409L6901L1589r824l1155o607k7448
8965c9502J7080p15L0725J1044l6654M4973Q184j5044L0146L2442j0928m8035
8953B3716K4672k8665l3500L2423N800M2580l4249o3405N011J2753l4294J4461
8941c2697J4580P594J5367m950k3966K2307K9716M4604k596j3184N7607j9387
8929I4995p2887N839N073J2633j4138J9903K6637K9347k3874n6804n5832J7748
$$ y = [273896, 336520, 400019, 330930, 301077, 269698, 239162, 149367, 86501, 73922, 79156, 52299, 20812, -2934, -32513, -45617, -17310, 33774, 49260, 49830, 69337, 1670, -5948, 4610, 34897, 6151, -10244, 866, 28630, 10501, -5048, -30677, -43800, -68134, -38468, 13810, 29835, 4119, -34352, -32023, 7064, -15549, -32958, 3943, 35532, 25708, -5447, -12054, -39502, -22422, -23137, 7588, 18632, -18022, 26951, 35135, 20091, 50237, 82679, 71751, 23716, 48388, 19723, -13777, 18646, 24446, 67026, 32777, -30628, -25617, -12864, -47158, -32697, -18117, -10523, 4844, -106, -24072, -1765, 27951, 72555, 69959, 56775, 114382, 94995, 22108, 27947, 33020, 45653, 31515, 51418, 78055, 107402, 83528, 26724, -29108, -11360]
8917a1360K9093L6169j7191n1613k5338L6418M8624L2963K0766J2177j4423m191
8905I2094O955l5646l2685p238k9547l2781J4981m292r559l4414M760k8815K6667
8892f9520L1098J3235P0345O6388n1520k3538n51J9629J5979N454P163K6695L9423
8879A50280R996k9869l3461O006K617K6959O928r31n401l8716m7901m7868k3991
8866b5352P044P789K9288O3022M1544J4412J8841j8365L757N753O792l9965r2912
8853B1648O720n1240o3173l7510J0964P1882O5638L7844O3K2009L592j830M8920
8840A35527O0529M1093N8360M0599N0595M3429N2159L7268O9084P4041N5860O5949
8828G84493j2716j09888r8010j06978r6824l2166M1424l2491j0949o758M2922
$$ y = [-11360, 17733, 53902, 36711, -14902, -40240, -3822, 44802, 77765, 98531, 110708, 96285, 92094, 99049, 63403, 30718, 23480, -6067, -38848, -23867, -28159, -37718, -72132, -67372, -96187, -69520, -38422, -25187, 45158, 111546, 60026, 36488, 35937, 55566, 71545, 76999, 84162, 110857, 150280, 160276, 130407, 96946, 102952, 105569, 132528, 139456, 138525, 133124, 94408, 46507, -1361, -25352, -18308, -10519, 18769, 81791, 123335, 137747, 156588, 138223, 141980, 147733, 154525, 114560, 21648, 28368, -22872, -86045, -123555, -112591, -40709, 24929, 62773, 62836, 84845, 88437, 86607, 135527, 196056, 237149, 295509, 336108, 386703, 430132, 482291, 519559, 588643, 662684, 718544, 784493, 771777, 661889, 563879, 456901, 360077, 327911, 369335, 336844, 325895, 319137, 362059]
8817C62059K7820m2771p1654n98j1192M989k6067k3181J1535N9445M2533J3217
8805C46135l0984n6877K4503K3483J3301M9772J2683L521o7724p6316J5127j4932
8793B41692K5081P122P0362J35066R9445J52731J30806J93293K78287K53262P0054
8782A657201j75803k70729k82681k26999j36954r0082n2243n937M6426N0063K4686
8771E36948L0070L3200m7723o3893K2299O816p801K9143K5053l3212P0082Q6396
8759F87378L0040n4011k3444L1858K183k0013p5750q5691m0339l1899K0675L2183
8747D73170j2339N7795J32330O1572N9742L9391M5614J42798J70839R4382p4427
8736A190867j56345j22425p3063M271Q105J7163O7724J11585R8162P9763J31318
$$ y = [362059, 389879, 347108, 275454, 274856, 263664, 268653, 242586, 219405, 230940, 290385, 332918, 346135, 315151, 258274, 282777, 306260, 319561, 369333, 382016, 385537, 317813, 241497, 256624, 241692, 266773, 273895, 344257, 479323, 578768, 731499, 862305, 1055598, 1333885, 1587147, 1657201, 1481398, 1210669, 927988, 700989, 564035, 473953, 421710, 415773, 462199, 512262, 536948, 567018, 600218, 552495, 488602, 510901, 517717, 509916, 539059, 564112, 530900, 600982, 687378, 717418, 663407, 639963, 671821, 674004, 653991, 578241, 492550, 452211, 420312, 440987, 473170, 460831, 518626, 650956, 712528, 772270, 811661, 857275, 1000073, 1170912, 1265294, 1190867, 1034522, 912097, 839034, 843305, 851410, 868573, 936297, 1047882, 1146044, 1225807, 1357125]
8725A357125J79516J23541P1138O5113J37403K10919L48187M11350M59030M37915
8715C801237N30950O39713Q73278J275113J838733K864128M416219O928279J0939044
8706C4106694J5840943J8807061J5022597K985502j0463972j7840064j6829888
8699D1628873j2223549q109995n282480l500095k426250j728236j267713r41482
8691F149073o66484n07703l44372k62463l13861k05555j61031j65393r7193p1977
8681C353041J5359J08833J46660J39723K99749L05850L52395N20218P08163Q16055
8671F766046Q39000R10097J149028J582117K341004L626241N481907Q691350J4390823
8662D5777613K3606359L5535100M2554768L1538547J101898k8773327m1289747
$$ y = [1357125, 1536641, 1660182, 1731320, 1796433, 1933836, 2144755, 2492942, 2904292, 3363322, 3801237, 4332187, 4971900, 5845178, 7120291, 8959024, 11823152, 16239371, 23167650, 34106694, 49947637, 68754698, 83777295, 86762797, 76298825, 58458761, 41628873, 29405324, 21295329, 16012849, 12512754, 10086504, 8358268, 7090555, 6149073, 5482589, 4974886, 4630514, 4368051, 4054190, 3848635, 3687604, 3522211, 3425018, 3353041, 3368400, 3477233, 3623893, 3763616, 4063365, 4369215, 4721610, 5241828, 5949991, 6766046, 7605046, 8515143, 9664171, 11246288, 13587292, 17213533, 22695440, 31386790, 45777613, 69383972, 104919072, 147473840, 179012387, 180114285, 151340958, 110051211]
8655A10051211l4777570k3458662j4829641r444071o302835m405134l144699k199641
8647A1488958j601958j144205q21670o49978o30539n96906n07771n16893m04428
8638D614610l01932k09360k19781n9897j6005J2743N7079K7474J72454K40424
8628D317809K59151L54031M53010M81529O52204R19288J321826J994181L013331
8619A3766360M720286P458561J1538875J6070433J7647533J1913129p49225j2807551
8611F9558401j7843737j5462725j0781781p064340m623336l095841k118711j542887
8603G025043j172933p76559n84165m91139l54383l16838k65876l10327l41048
8594B411775j95814j89057j57662j51421r8945n2569J5637o1185q0119q7998r1825
$$ y = [110051211, 75273641, 51814979, 36985338, 27541267, 21238432, 16833298, 13688599, 11488958, 9887000, 8742795, 7921125, 7271147, 6640608, 6043702, 5535931, 5019038, 4614610, 4312678, 4103318, 3883537, 3823640, 3807635, 3820378, 3877457, 3904931, 4077385, 4317809, 4576960, 4930991, 5384001, 5865530, 6517734, 7437022, 8758848, 10753029, 13766360, 18486646, 25945207, 37484082, 53554515, 71202048, 83115177, 82365952, 69558401, 51714664, 36251939, 25470158, 18405818, 13782482, 10686641, 8567930, 7025043, 5852110, 5075551, 4491386, 4000247, 3645864, 3329026, 3063150, 2752823, 2411775, 2215961, 2026904, 1869242, 1717821, 1618876, 1566307, 1581944, 1520759, 1440640, 1352642, 1260817]
8583A260817k7813n629r710m0647p2273k6689k9109l5482k0284k7380k052j9819
8571I43930K3142j9976l2019l7853n2888l1958q0647o0853J0364k186j8043k6681
8559F14332j0119k1939K8024k1478l2629k6519m2927J810O404k5834k5611j7587
8547D25927m381k389M796K005k1047L8932J9213M0779j6825L2145K1383k8231
8535E12307l0526j1915m056R855K5512r948j0297J4476J3416L7981m6783p4189
8523D25833m8103k403J1700K8327M3720l0503k2767n5709j7640J0106o335j6284
8511C19942j0283L350n6528m8367J8506k877l0393k1756m689M420j92N4083J0814
8498B36030k7818K1241M4785L6174m0477M267K4655M913N847m4358M6592j8957
$$ y = [1260817, 1233004, 1227375, 1217665, 1177018, 1104745, 1078056, 1048947, 1013465, 993181, 965801, 963749, 943930, 967072, 947096, 915077, 877224, 824336, 792378, 711731, 650878, 661242, 659056, 641013, 614332, 604213, 582274, 610298, 588820, 556191, 529672, 486745, 488555, 494959, 469125, 443514, 425927, 421546, 419157, 423953, 425958, 404911, 443843, 463056, 503835, 487010, 519155, 540538, 512307, 481781, 469866, 465810, 475665, 501177, 491229, 480932, 495408, 508824, 546805, 500022, 425833, 377730, 375327, 387027, 415354, 459074, 428571, 405804, 350095, 332455, 342561, 336226, 319942, 309659, 313009, 256481, 208114, 226620, 223743, 193350, 171594, 166905, 171325, 171133, 225216, 236030, 208212, 229453, 274238, 310412, 269935, 274202, 298857, 303770, 309617, 265259, 311851, 292894]
8486B92894o7546j5406j3377K3576j4756J0916k5298k6579J1773J7505O7503K3263
8474B84468O337K9922n544o5630o095L8006J6805j8614K239l1481k1760j5222
8462B13431K1533L7649j6308o6687k1136M9503j3197m7471J0062M9262M7147J6914
8450B80702J7743L1256j1583l2527o0678l4699N8247M426o6049m1880R166r710
8438A44414k0755K0586K2793r853L0386k09k4318K8595k5231k3153J4027J1941
8426A69223j5866K4487J6007L5901k470p1311j9000K7618R322j7255k730L4J8042
8413A72002k7857p8440k1332N6464L8029m7014l0157N3710P6100p03m6035j4044
8401A30723j1796N852L5641K0978l2979o8021l2378K195k0842m1052J8818J2562
$$ y = [292894, 225348, 209942, 196565, 220141, 205385, 216301, 191003, 164424, 176197, 193702, 261205, 284468, 290805, 320727, 315183, 249553, 243458, 281464, 298269, 279655, 281894, 250413, 228653, 213431, 234964, 272613, 256305, 189618, 168482, 217985, 204788, 157317, 167379, 216641, 263788, 280702, 298445, 329701, 318118, 285591, 224913, 190214, 248461, 252887, 186838, 144958, 154124, 144414, 123659, 144245, 167038, 157185, 187571, 187362, 163044, 191639, 166408, 143255, 157282, 169223, 153357, 177844, 193851, 229752, 227282, 155971, 136971, 164589, 173911, 156656, 153926, 153960, 172002, 144145, 65705, 44373, 100837, 138866, 91852, 61695, 115405, 191505, 190802, 144767, 130723, 118927, 124779, 160420, 181398, 148419, 80398, 48020, 50215, 29373, -11679, 7139, 19701]
8389A9701J6709Q008k49M507j9006J1511M7087N1298N454l635m623k9728L7116
8376A44150K1922J2589k5061p1289L362m257k5131j1754j5691M0382M9693k1149
8364I7766k63K4309l1212k6164l6037J6540K0305J0841j825n994J6985J8807J9134
8351A23192J3710J9404J8184n4160k7196j8268m6333q73J9832J0696P1622J1200
8339A41010M498l0067m6698K2412M7675n179p698n325L6247l4922j3955J5137
8327A23135l948K1896k3726j4835n1964m9111O7442O5474L3994K6281Q935J6048
8315B19621p2160m4488N697m865L0066M6386j2902o2294n1457L2564Q4751K3153
8303A94072M4251Q1113J09006P4700K045l0979l7987n3186p8437n4732o5827k4415
$$ y = [19701, 36410, 44418, 44169, 48676, 29670, 41181, 88268, 139566, 145020, 141385, 136762, 107034, 144150, 166072, 178661, 153600, 82311, 85673, 81416, 56285, 44531, 28840, 69222, 118915, 97766, 97503, 121812, 90600, 64436, 28399, 44939, 65244, 76085, 74260, 68266, 85251, 104058, 123192, 136902, 156306, 174490, 120330, 93134, 74866, 28533, 27660, 47492, 58188, 129810, 141010, 145508, 115441, 68743, 91155, 138830, 133651, 125953, 120628, 156875, 121953, 107998, 123135, 119187, 141083, 117357, 102522, 50558, 1447, 68889, 134363, 168357, 194638, 203573, 219621, 147461, 102973, 108670, 103805, 133871, 180257, 167355, 105061, 53604, 86168, 170919, 194072, 238323, 319436, 428442, 503142, 505187, 474208, 436221, 383035, 304598, 249866, 184039, 159624]
8291A59624k6851k5863N927l427k0791n8066J5620j0152M2262k2771l7058O1637
8279H0091L6332L6556K2844j992l1540m0391J7958m977P513j8777j7131O1304
8267A47790j421J5529j3467j9691o88M8665J24093O5167L0636N6105J46828J59406
8255G58952J62252N0989j62364k05025j46933j12957p7980j7020l2830o7441o0559
8244H9084J8883l898m5722L28J8463k998k9501l6117J7509N7687L7548l2665J5363
8231A03964R94P526m8448J460k8Q43N107j6662L3343K4723Q264j3538n7464J2773
8217F2857L8431N2427J3294M6471M7588O8138P8173J4258Q413l4355r5605j03802
8205A96288k8297n1154o2541j1385k441r170k4597J5487K9953K7112J6375j6814
$$ y = [159624, 132773, 106910, 112837, 109410, 88619, 30553, 46173, 36021, 78283, 55512, 18454, 80091, 116423, 152979, 175823, 173831, 142291, 101900, 119858, 114881, 122394, 103617, 86486, 147790, 146369, 161898, 148431, 128740, 128052, 176717, 300810, 365977, 396613, 452718, 599546, 758952, 921204, 972193, 809829, 604804, 457871, 344914, 266934, 249914, 217084, 149643, 89084, 107967, 104069, 58347, 58675, 77138, 74140, 44639, 8522, 26031, 83718, 121266, 88601, 103964, 104958, 112484, 64036, 65496, 65468, 66311, 71418, 54756, 88099, 112822, 121086, 107548, 50084, 62857, 101288, 153715, 167009, 213480, 261068, 329206, 407379, 421637, 430050, 395695, 300090, 196288, 167991, 116837, 54296, 42911, 40470, 31300, 6703, 22190, 52143, 79255, 95630, 78816]
8193G8816k7822j6750r321k5615o421J5782k0656K2524J6956J8286k6574p1908
8181e2703P650J2341M2741K3707M0304j7370j3339q839j7064J5301l2169j2648
8169a2088K9655P1523J5528n5341j7757J6028j1269p271N3122N689J8506L2476
8157A38801k2540l2759K0398J3932o6142L0682J6527k1323l0921J5272n3640j232
8145G055J7767J337J0468k5141j2552K6775L0380n09l5013j6934N9783K5390k991
8132H5815n263n0110L799j4183q993J4419k0318o137K8983L837r311j6374k974
8119C190k463k0058K1977K9546o7744m8517m199O7660N7469M389M884o586m1174
8106a626r139M190J3285O5000K6673m6386k7674l5705K6495M1009L649L350j4706
$$ y = [78816, 50994, 34244, 24923, -692, -7113, 8669, -11987, 10537, 27493, 45779, 19205, -52703, -45053, -32712, 10029, 33736, 74040, 56670, 43331, 34492, 17428, 32729, 560, -12088, 17567, 89090, 104618, 49277, 31520, 47548, 36279, 29008, 82130, 87819, 106325, 138801, 116261, 83502, 103900, 117832, 51690, 82372, 98899, 77576, 46655, 61927, 8287, 7055, 24822, 26159, 36627, 11486, -1066, 25709, 56089, 55580, 20567, 3633, 63416, 88806, 85815, 80552, 30442, 34241, 20058, 11065, 25484, 5166, -971, 28012, 31849, 22538, 6164, 3190, 727, -19331, 2646, 32192, -35552, -84069, -88268, -20608, 36861, 41250, 46134, 39548, -1626, -10765, -6575, 6710, 71710, 98383, 51997, 24323, -11382, 15113, 56122, 59771, 63121, 48415]
8093D8415K7176m2488k6958m7071P0777K9204k5344m2801k4033M6124K0256J2012
8081D5269j1646j2604J9614R795K2906k9443m9621J5049M2714J6336q692k6607
8069C3070j3635L4908k5012L369P845K4398J5592k7941j0773P862J9765M1564
8057A11012L3560m94k7703r613p4895j7329R0664J6339n5318o5619N3049J1454
8045F5107l0744j7079K0433L1073Q916n315j2333m2631j8421O229k9353j1550
8033c5668O767k3693K1201L8562j0956M5717J1359k4784j029L973L7315m234l1186
8020C3344J3813K225L868J1105J454M2345j8134m6263r558R683j8760p633l884
8007A3605M3870K4913M874K7534K3612j9530k9630J2291l273M5072L5205m5266
$$ y = [48415, 75591, 33103, 6145, -40926, 29851, 59055, 33711, -9090, -33123, 13001, 33257, 45269, 33623, 21019, 40633, 50428, 73334, 43891, -5730, 9319, 52033, 68369, 59677, 33070, 19435, 54343, 29331, 32700, 40545, 64943, 80535, 52594, 41821, 49683, 69448, 111012, 144572, 144078, 116375, 106762, 31867, 14538, 105202, 121541, 66223, 604, 53653, 65107, 34363, 17284, 37717, 68790, 77706, 72391, 60058, 17427, -994, 5235, -24118, -35668, -28901, -52594, -31393, 7169, -3787, 41930, 53289, 28505, 27476, 31449, 68764, 64530, 33344, 47157, 49382, 53250, 64355, 65809, 108154, 90020, 43757, 34199, 43882, 25122, 17489, 13605, 57475, 82388, 87262, 114796, 138408, 118878, 89248, 101539, 98266, 143338, 178543, 133277]
7995A33277q7123l2422n976L1788K2594J8638K1739j7130N9533O994j6511k5828
7983A09573k213m701k467N2086K8476m047J324p0584m9881j7800j0726J4336J8363
7970F1739l7723j7273q263O1818K0829j6804j5803j8565n261j6847J6308k4063
7958I2J0890j7197j4375n313K0551q023R459m833L0423P7046K1249m1494l3865
7945D4610N4836O826j9900m4733o4889M1243K5002K7158O124o843j4582Q875J3471
7932G7198n3330l0804j0261O7734J8437m3553k0193l3390n7452l0783q072J8970
7920a05499K3961O919L412L7741P10Q869K1108K0188R444N0630m5949j8402j1478
7907A654k1444j9963m195J4442K7147j381j3799J7412J1055p550J6404J7008L5491
$$ y = [133277, 46154, 13732, 7756, 39544, 62138, 80776, 102515, 85385, 144918, 151912, 135401, 109573, 107360, 102659, 100192, 152278, 180754, 176707, 178031, 107447, 57566, 39766, 29040, 43376, 61739, 24016, 6743, -1520, 60298, 81127, 64323, 48520, 29955, 24694, 7847, 24155, 92, 10982, -6215, -20590, -25903, -5352, -13375, -3916, -8749, 21674, 98720, 119969, 78475, 44610, 99446, 106272, 86372, 41639, -23250, 17993, 42995, 70153, 76277, 69434, 54852, 63727, 77198, 23868, -6936, -17197, 50537, 68974, 25421, 5228, -28162, -85614, -116397, -124469, -105499, -81538, -74619, -71207, -33466, -32756, -23887, -2779, 17409, 26853, 77483, 31534, 13132, 1654, -19790, -39753, -43948, -29506, -2359, -3740, -17539, -127, 10928, 3378, 19782, 36790, 72281]
7894G2281K1589K1563k6691m292m138l0679j7811K664K2934N5128J8532l1978
7882I9102q367k6379k1469J1480k2351l2430l3618j9772K7852L1645J8082l7392
7870a3617m2054k4387J6088K6323J2949L7652l1870k2058M8665M508m7009O130
7858b8680M5951N0275r076J759m2900j7365J4023N458q443K9390O9638q21n6820
7845E2389k4090K7226M99K103J5730J6597k4517j2363m928j5640J3640R894R26
7832E7466l5156L7969O2131m0168k3309N0324o4604n8623l8089M705q501L7729
7820a8126N5610K4942j0047L131K4348l7982k6380m699m943Q314M924n4293K166
7807c3035J2376K3306O5997m273n5468j6821L8913K3690l7796o3872k3019K499
$$ y = [72281, 93870, 115433, 88742, 84450, 80312, 49633, 31822, 34486, 57420, 112548, 131080, 99102, 90735, 64356, 42887, 54367, 32016, -414, -34032, -53804, -25952, 5693, 23775, -13617, -55671, -80058, -63970, -37647, -24698, 12954, -18916, -40974, 7691, 12199, -34810, -28680, 17271, 67546, 58470, 60229, 17329, -36, 13987, 19445, 11002, 40392, 110030, 109209, 52389, 28299, 55525, 56024, 58127, 73857, 90454, 65937, 53574, 48646, 33006, 46646, 56540, 57466, 22310, 60279, 122410, 82242, 58933, 109257, 44653, -13970, -52059, -47354, -55855, -18126, 37484, 62426, 52379, 55510, 79858, 41876, 15496, 10797, 5854, 14168, 19092, -35201, -33035, -20659, 2647, 68644, 64371, 8903, -7918, 30995, 54685, 16889, -46983, -70002, -67503]
7795f7503K1619J8879J4221O232k1799m806J9706R791L0312k1474j0048j7718
7783b2588j4274M2025J4158r673n860N674K7846K4975n6816l0830K0032N394k6516
7770b6453r333O476l940k937M5777j5072k2941P9655M7932k9461k9237l4318r926
7757c778l512j7382L811J7000J4338M1121k9626K8464J5108K0600J0314J2462
7745A08920m3305o2573n4669J5408O6633p146J0001N1998j0039m3813j472L5041
7733F4984o600p5186m21J5319P646J5811J3462j1652p3029K0101J5334k0838N056
7720c0013M4236M1903l7227l6276N5750J7152k9591j8221n326j9854J2022K7827
7708B2382j6115j9288j5031l8579K5467O4744L5271j5274n5880k7927L0720M5517
$$ y = [-67503, -45884, -27005, -12784, -6552, -28351, -33157, -13451, -3660, 26652, 5178, -4870, -22588, -36862, 5163, 19321, 9648, 3788, 9462, 37308, 62283, 5467, -25363, -5331, 63, -26453, -35786, -29310, -33250, -36187, 9590, -5482, -28423, 51232, 99164, 69703, 40466, 6148, -3778, -7290, -24672, -20861, -3861, 10477, 51598, 21972, 50436, 65544, 86144, 96458, 108920, 65615, 3042, -51627, -36219, 30414, 23268, 33269, 85267, 75228, 31415, 29943, 64984, 58384, -16802, -17223, -1904, 5742, 21553, 35015, 23363, -49666, -29565, -14231, -35069, -30013, 14223, 56126, 18899, -17377, 38373, 55525, 25934, 7713, 2387, -17467, -5445, 22382, 6267, -13021, -28052, -66631, -41164, 23580, 58851, 43577, -12303, -40230, -9510, 36007]
7696C6007j7661O820K198Q129p045k9571l452M6011L8268n4697m7118J3770p146
7683a5487m5578K9611P483L8801K6613L1297K2757J236l5827q922l3199n0744
7671c1959K672l4158L7394P1902j6696l8755l552N693j0679o03J4869N210P809
7658I147q270O199m1857n968J8279N3003k9232q469M9718j593R189K4398J413
7645G5957j0597L870L6515K0587j0395n8062K63l7834p9738n3572K1339k1197
7633a12864o079J0937K2331P6720M0966J0371l4632l4463J3787J0064O484m7508
7621d3886k4852L3712M7766J1167k483K3869K6294m1034k8840j7489L9320l600
7609A9944J1170L787k4348j0460K3016k6181l2297Q978O9370L995k4969m4478
$$ y = [36007, 18346, 25166, 27364, 35493, 28448, -1123, -4575, 41436, 79704, 25007, -22111, -8341, -15487, -61065, -31454, -23971, 14830, 41443, 72740, 95497, 96733, 60906, 51984, 18785, -31959, -29287, -63445, -26051, 45851, 29155, -9600, -13152, -7459, -18138, -18741, -3872, 1338, 9147, 877, 7076, -34781, -40749, -22470, 30533, 1301, -7168, 42550, 40957, 50146, 74544, 75957, 65360, 69230, 105745, 126332, 115937, 57875, 58138, 20304, -59434, -113006, -91667, -112864, -118943, -108006, -85675, -8955, 32011, 42382, 7750, -26713, -12926, -2862, 3622, -43886, -68738, -35026, 12740, 23907, 21424, 45293, 71587, 30553, 1713, -15776, 23544, 19944, 31114, 34901, 10553, 93, 23109, -3072, -35369, -26391, 42979, 46974, 22005, -22473]
7597b2473j6277K1411j3815j6215k8121L4121J9185Q003j0556m894N4651M8241
7585G3261k8652k449J0815l0020K5261j3925L081j7072J5789o318m9596m1917
7573f1742J3409K8101O781k0321K061o367j7427k4522r391K0305L0674j3014K2129
7560b9324K756J1603k0204J2588k222j0450k1888j091N6906L0415J2747n8323
7548a6487j7117J2886K9347L2024l6128m7496J0951O9396k780j2918M0804K7776
7536I0258j0562n2764j8640J7761n0153K2002N5702Q970k0241K7063p500r687
7524E2209L091j7588K1746P949K5051m4891m1212N882K1222J2374k8316o415j2649
7511a547p817k633J3353M0307P241l496R324m1215k2583k3996K2075N0937k798
$$ y = [-22473, -38750, -17339, -31154, -47369, -75490, -41369, -22184, -14181, -24737, -29631, 25020, 73261, 44609, 42160, 52975, 22955, 48216, 34291, 37372, 20300, 36089, 29771, -19825, -61742, -48333, -20232, -13451, -33772, -31711, -38078, -55505, -80027, -89418, -69113, -38439, -51453, -29324, -26568, -14965, -35169, -22581, -24803, -35253, -57141, -58232, -1326, 29089, 41836, -16487, -33604, -20718, 8629, 40653, 4525, -42971, -32020, 37376, 34596, 21678, 62482, 90258, 79696, 26932, 8292, 26053, -24100, -2098, 53604, 62574, 42333, 69396, 61896, 52209, 55300, 37712, 59458, 67407, 92458, 47567, 6355, 12237, 33459, 45833, 17517, 11102, -1547, -9364, -11997, 1356, 41663, 48904, 45408, 54732, 13517, -9066, -33062, -10987, 39950, 37152]
7498C7152r279j9680J3428l5097r628L8550K8634j9564j5728J7448K2227l6781
7486A1682k2426P329j34J99R517J9296L4554Q934q908j8339l9747n8952l8316
7473i5311J0872J5060K4777J9193L1770N656O645L037j2401k7103n104K2742M7851
7460D7684K2699m238J963M9042k3521m580J0594J7779k739k9319k5266k3244k0895
7447A5959n6635J787P167O707j6531J5238J8180q20P915J8031K900m4027l5316
7434e9445j126L0911L7887N768L0715j2612l9968l7512J9008M5343R0529k8450
7422H1048j5169q785l6906l7582k0984M2364J5259R40j0680n2229n0400N1629
7410d1495J7783O727M4902K506k1341L1319J4446n2607J4096L5785l2317K3573
$$ y = [37152, 27873, 8193, 21621, -13476, -23104, 15446, 44080, 24516, 8788, 26236, 48463, 11682, -10744, -3415, -3549, -3350, 6167, 25463, 60017, 68951, 60043, 41704, 1957, -56995, -95311, -84439, -69379, -44602, -25409, 6361, 12017, 18662, 21699, 9298, -17805, -22909, -167, 47684, 70383, 66145, 68108, 117150, 93629, 89049, 99643, 117422, 114683, 85364, 60098, 36854, 15959, -40676, -38889, -31722, -25015, -41546, -26308, -8128, -8948, -1033, 16998, 19898, -24129, -59445, -60571, -29660, 8227, 13995, 44710, 32098, -7870, -45382, -26374, 18969, 109498, 81048, 65879, 57094, 20188, -17394, -38378, 3986, 19245, 20185, 9505, -42724, -93124, -41495, -23712, -16985, 27917, 30423, 9082, 40401, 54847, 2240, 16336, 52121, 19804, 43377]
7398D3377J6637n722k8628L7013L3933J3451N618m7921m6664l641j4581k6915
7386b4043J4708k3314k0327j0418r743J8064M0432J6759k5438j662l9879l1196
7374i6057K4717O30K9927P3694L2506r1444l7478M6451K2889K7961J5879K5165
7362G4840l354J3623k6581j9351k9996J7693N2010m4021l8289n1037J3744L4327
7350f392J8199n0463k6115Q523O2398M2303J8108r580n0659j0904J1589O40J514
7337I161k4651m473O782q901l2896R087L0867p286j5846j1457k8217k92N0071
7324b8051P3410M284m3033k076J73m0769O42N2919M5641K6804n1528o5530l2594
7311e9708j4021J3035L5190j3619M2080j3527n3392k1171k0561L6044M5511j4803
$$ y = [43377, 60014, 54292, 25664, 62677, 96610, 110061, 115679, 67758, 21094, 17453, 2872, -24043, -9335, -32649, -52976, -63394, -73137, -55073, -14641, 2118, -23320, -24982, -64861, -96057, -71340, -70710, -40783, 32911, 65417, -26027, -63505, -17054, 5835, 33796, 49675, 74840, 71486, 85109, 58528, 39177, 9181, 26874, 78884, 34863, -3426, -54463, -40719, -6392, 11807, -38656, -64771, -56248, 6150, 48453, 66561, 56981, 6322, -4582, 7007, 7647, 9161, -15490, -19963, -13181, -22082, -54978, -45891, -15024, -22310, -38156, -49613, -77830, -78122, -28051, 45359, 49643, 6610, 4534, 4707, -36062, -35420, 17499, 63140, 89944, 38416, -27114, -59708, -73729, -60694, -25504, -39123, 2957, -10570, -63962, -85133, -105694, -69650, -24139, -38942]
7299c8942L1705M3882j4454n224l2776m4077K1178Q692k7727j3339J4166Q909
7287d8007P6981K1106k7607K144k8578q1880L3532O6741P239n0851j5254j8398
7275f2832j3988k420L4321L0561J906r107R741K904j0610j565J6057N3120O09
7262D8697j9465j1375r832k4615K3179k0464L169L7544O242m1646J3285j0008
7250e289M6359L7599J1086m2047o2389k2736j7647n4881k008R7624L9021l3781
7238i089k5498J9334P1295o793l1436k7154L4475L83l3000m0266q84k6476J2466
7225f2643O6531q536m0442o929m670J549k121k9457N6574L6858j9012m2334M212
7212e0420M6935J5681L6982K7554L2853n1547n1927j3995K4023K0502o0865j2178
$$ y = [-38942, -7237, 36645, 22191, 16967, -15809, -59886, -38708, -30016, -57743, -71082, -56916, -48007, 28974, 50080, 22473, 24617, -3961, -85841, -52309, 14432, 21671, -29180, -44434, -62832, -76820, -79240, -44919, -14358, -12452, -21559, -11818, -8914, -19524, -21089, -5032, 48088, 48697, 29232, 17857, 8025, -16590, 6589, -13875, -10706, 26838, 33080, -8566, 4719, -5289, 41070, 78669, 89755, 47708, -14681, -37417, -55064, -109945, -111953, -14329, 24692, -9089, -34587, -15253, 56042, 49249, 17813, -9341, 25134, 25517, -7483, -47749, -48633, -75109, -62643, 3888, -4648, -45090, -52019, -56689, -55140, -57261, -86718, -30144, 6714, -12298, -54632, -50420, -3485, 12196, 49178, 76732, 109585, 58038, 6111, -7884, 16139, 36641, -24224, -36402]
7200c6402M3859N0650k3212k4127n0501n822M8074L5975J3499L9492J6399M914
7188A12798k9211L0524P833p9084l653j8426m8486J9273l499l434k781K795J317
7175a4034m5037l0126k5815P9069Q6569j1392J9720l5137k2714j822j4625l8428
7163e3772l178J8880K3042M4721M1444P146j3535q935k8508k2672P06k3159R329
7150h491l2161j4049M8383J9292L5716j9335O261J8545L0105j9101m2939L8485
7138F0711j8272o0533M264N8707J0263l6953k8668l0705J350J8980p4033P975
7126h6914P2418L7797k6280k1K2436m5451K6755m1627l8676M8515L7256L1755
7114C7963M131o5171j9157O858j3977J6500K4414J1385k4587k7118J5295M8603
$$ y = [-36402, 7457, 58107, 34895, 10768, -39733, -45555, 2519, 38494, 51993, 91485, 107884, 112798, 83587, 114111, 121944, 42860, 39207, 20781, -27705, -8432, -11931, -15365, -18146, -15351, -14034, -59071, -89197, -115012, -35943, 50626, 39234, 58954, 23817, 1103, -719, -15344, -53772, -56950, -38070, -15028, 29693, 71137, 78283, 64748, 55813, 27305, 4633, 5339, -17820, -8491, -40652, -54701, -6318, 12974, 48690, 29355, 35616, 54161, 84266, 65165, 22226, 60711, 42439, -18094, -13830, 44877, 55140, 18187, -10481, -41186, -39836, -20856, -94889, -86914, -14496, 23301, -2979, -3000, 19436, -26015, 740, -40887, -79563, -31048, 6208, 37963, 42094, -23077, -42234, -35376, -49353, -32853, -8439, 2946, -21641, -48759, -33464, 15139]
7102A5139K020J1258l3183j8932M7375L9032j1886k6097m951l749K672k4483l4416
7089d0201j9632r158J8521J2588J3102R211m3214l4831J9256P2451J2092j105
7077I080m5669k312J4933R952L7337J0608J0507l8588M485L0390L4476K0286l3249
7064F2236n4175k4361P6648M2904l1854J4200k1839k6575k6910k3403K619K3874
7052A3364j9486l296M2354m909J4837j9327j3615n0272m9235J9809K4663N263
7040c9850J3542L2271k2980k607q780K8773k3832n2558k6838N3607M5739L541
7028B8k8476J9335L408j586j7005p166r164L0421M217J2046M4842M1967l9227
7015E3640p3029L777J3955K6044q521l1496Q829M2222J1035j1237k6989j1589
$$ y = [15139, 17159, 28417, -4766, -23698, 23677, 62709, 50823, 24726, 19775, 16026, 18698, -5785, -40201, -59833, -68991, -50470, -37882, -24780, -15569, -58783, -93614, -74358, -1907, 10185, 9080, -36589, -38901, -23968, -14016, 23321, 33929, 44436, 5848, 10333, 40723, 75199, 95485, 62236, 8061, -16300, 60348, 103252, 71398, 85598, 63759, 37184, 10274, -13129, -10510, 13364, -6122, -9418, 32936, 28027, 42864, 23537, 9922, -40350, -89585, -69776, -45113, -39850, -26308, 5963, -17017, -19624, -28404, 369, -23463, -76021, -102859, -49252, -3513, 28, -28448, -9113, -5705, -7291, -24296, -31462, -40626, -10205, -5988, 6058, 50900, 92867, 53640, -19389, -15612, -1657, 24387, 15866, -15630, -6801, 35421, 46456, 35219, 8230, -3359]
7003c359o2395k5345K4220M4747L7384m504l8179M3877N811K1481K9811j4385
6991E9164m8659M5024L171J1860l2819L739q671K6072m4907o2008J1736L4920
6979a378n708r366m3397l4988N1898J1754r808q138Q73M4481M7336K4516J5816
6966H3891K6249p8043j9906k977M587R935N465J6272l0215l366m3324n7002l596
6953i2030L1980J9759P734M8549L036J2912l8606J0609P212M7543j0427L6365
6941H4636j9467P521n0953l2502M1354Q677k1184q085K0869n2051j2862k7683
6929f1730o284J1416L5172L4196L1499j438j384J6837k9394j2735l1247K1788
6917F696j5918k8290P752M5182j4474L637j1463j4947j2871m7514J3659K0859
$$ y = [-3359, -65754, -91099, -66879, -22132, 15252, 10748, -27431, 16446, 22257, 43738, 73549, 59164, 10505, 55529, 58700, 70560, 37741, 41480, 32809, 58881, 13974, -48034, -36298, -1378, -7086, -16452, -59849, -94837, -42939, -31185, -40993, -49131, -48258, -3777, 43559, 68075, 83891, 110140, 32097, 12191, 9214, 13801, 23736, 29201, 45473, 15258, 11892, -31432, -88434, -92030, -60050, -40291, -32557, 15992, 19028, 31940, -6666, 3943, 11155, 58698, 48271, 84636, 65169, 72690, 21737, -10765, 30589, 39266, 18082, 9997, 30866, -21185, -34047, -61730, -68014, -56598, -21426, 12770, 44269, 42831, 41447, 58284, 28890, 16155, -15092, 6696, -9222, -37512, -29760, 15422, 948, 4585, -6878, -21825, -34696, -82210, -68551, -47692]
6905d7692j6217J5380N4393N3915l4845n2785M7752J7598j8115k0478L0061o680
6893B2287l106K9109r09m0872q897O243L3408r907l6343O1181R516n5965l6696
6880c0951J1777J8392o7143k7158K1311J1787N3281l088j4319K5168J6012j8719
6868c650l1909K4l4409l4987k131k1414K9897M6549J509k390j751l2587K2428
6855f4821L2379L7913M7650J8628k3049K7100L8064m2489m1713o0971n26J9250
6843a2585O4829n167k3252q6234n4892j1956J5393K3658P944N655j8895N0598
6831d4904L1171l52j0831L829M8317K1874Q28n0925m325m0235J2593j7304l2702
6818h2966L5422J8655j0596N0264M8982R888K5738j7709j6842k4407j1731k2099
$$ y = [-47692, -63909, -48529, 5864, 59779, 24934, -27851, 19901, 37499, 19384, -1094, 28967, 22287, 19181, 48290, 47381, 6509, -2388, 3855, 37263, 27356, -8987, 52194, 61710, 5745, -30951, -19174, -782, -67925, -95083, -73772, -61985, -8704, -11792, -26111, -943, 15069, -3650, -35559, -35535, -69944, -104931, -107062, -128476, -98579, -52030, -50521, -52911, -54662, -87249, -64821, -32442, 5471, 53121, 71749, 48700, 75800, 113864, 71375, 29662, -31309, -31835, -12585, 52244, 47077, 23825, -62409, -117301, -129257, -113864, -90206, -82262, -76607, -95502, -44904, -13733, -14085, -24916, -21087, 27230, 49104, 49932, -993, -5318, -45553, -32960, -50264, -82966, -47544, -28889, -39485, 10779, 59761, 69649, 95387, 77678, 60836, 36429, 24698, 2599]
6806B599L9112n1169l1593M48K312L722K13j4998K9167K3499K7028m2197n0647
6793f2504l2636P8409M7446k0886k3052n267L2717k7015j1771K9068P229J7502
6781B9240l755j8243k9579j1038l2634M8746Q3408K886m3886k4132k989K2533
6769B0557n2206n243M907l9924K2892L0653K0786Q025L470q988k0680l456L309
6756a5898n9854M1788O711k5914J0162j589k500k3700j1075Q852J04789L6790
6744F8562k5506P935j4193j7675K885J4676k0171k495m245r715j1945l96L4830
6731B2547K4104P237o3786o3704k4766k082j1522M3117J2212K681K7098K4502
6719b362M3042L3592j4789j6137M0434K4797n0597k5406R343N678m1320k8319
$$ y = [2599, 41711, -9458, -41051, -40603, -38291, -34569, -34356, -49354, -20187, 3312, 30340, -11857, -62504, -95140, -16731, 30715, 9829, -13223, -18490, 14227, -12788, -24559, 4509, 11738, 29240, 25485, 7242, -22337, -33375, -66009, -17263, 66145, 69031, 25145, 1013, -1976, 20557, -31649, -36892, -31985, -71909, -49017, -18364, 2422, 10447, 13917, 4929, -15751, -19207, -15898, -75752, -33964, -27253, -53167, -43005, -44594, -47094, -70794, -81869, -73017, 31772, 68562, 43056, 50991, 36798, 19123, 22008, 36684, 16513, 14018, 9773, 58, -11887, -12283, 22547, 46651, 53888, -9898, -73602, -98368, -100450, -111972, -68855, -56643, -53962, -26864, -2362, 40680, 74272, 59483, 43346, 83780, 108577, 57980, 32574, 41917, 47595, 6275, -22044]
6707b2044K9423k114m4548l0057J4952P8718M2509k967m125j0739K1888K3664
6695I4560J1540k0039j1668J5481j4094j4928K6057l1350j2133r287j783K4343
6683E6699m7394m4823j6627l788j5156k2296L1704J9049k6970k9836O285M8002
6671d5151K0445k822J4015m3657j965L4849J6145J0233J6139L5046N9416k7908
6659H4785n1883m9697j3751j6537l615M6859K3053K4499J6760j0674q889k9081
6647A1829l0195K7088j322k7998k4928p516m606M3272J0553j1809n030M1761Q860
6634B9959j5537j6515M355k2306r102R577p413k4942K3469K660L500K2416O595
6621F716j2536P963K061j4414j2704j1012J3443K484j2981k2554o830J4783L4555
$$ y = [-22044, 7379, 5265, -39283, -69340, -54388, 24330, 66839, 63872, 59747, 49008, 70896, 94560, 106100, 86061, 74393, 89874, 75780, 60852, 86909, 55559, 43426, 34139, 32356, 56699, 9305, -35518, -52145, -55933, -71089, -93385, -61681, -42632, -69602, -99438, -93153, -45151, -24706, -27528, -13513, -57170, -59135, -24286, -8141, 2092, 18231, 53277, 112693, 84785, 32902, -16795, -30546, -47083, -50698, -3839, 19214, 43713, 60473, 49799, 40910, 11829, -18366, 8722, 7400, -20598, -45526, -53042, -57648, -14376, -3823, -15632, -20662, 21099, 29959, 14422, -2093, 2262, -20044, -29146, -19569, -26982, -51924, -28455, -25795, -22295, 121, 6716, -5820, 2143, 4204, -10210, -22914, -33926, -20483, -17999, -30980, -53534, -60364, -45581, -11026]
6608a1026k838M7320M0595k4007J6918N5232k951p4180m8394J2626N154M3530
6596E7979j0955p0980j097L6022l5134l8762r59O063k6144M8933M6939Q394o3154
6583d2855j6192q136M2189N6966j1424j691R808j992J5021k0661k1939l440l6945
6570d1291L7925N1800R857q732m0643Q374J6237K702k1699q8704k4241O1415K1028
6557a5972J2519J2759m2415L1030J2138J1279k7557J0939n7233j7145K0343K7282
6545b2033L4625k8085m7317J5664K3467j3619j986K1538K5117l1367l0278M5700
6533h574L6850j3934M1731l9064k3179L7430N303J2709O934l986J0302K1895r926
6520G4491K3545P025m4952l2680j2689n300p979k0653p042K4358K85L7399l3442
$$ y = [-11026, -13864, 33456, 74051, 50044, 66962, 122194, 119243, 45063, -3331, 9295, 14449, 57979, 47024, -23956, -25053, 10969, -24165, -62927, -63886, -57823, -83967, -35034, 11905, 20299, -42855, -59047, -67183, -24994, 31972, 20548, 18857, 28665, 26673, 41694, 21033, -906, -4346, -41291, -3366, 48434, 58291, 49559, 8916, 17290, 33527, 36229, 14530, -74174, -98415, -37000, -15972, -3453, 9306, -33109, -2079, 10059, 21338, -6219, 4720, -52513, -69658, -49315, -22033, 12592, -15493, -62810, -47146, -23679, -37298, -39284, -17746, 7371, -23996, -54274, -8574, 28276, 14342, 56073, 17009, -6170, 31260, 36563, 49272, 56206, 52220, 62522, 84417, 74491, 98036, 105061, 60109, 27429, 14740, 9440, 1461, -19192, -26234, -1876, -1591, 35808, 2366]
6507B366K878q084p743M710J9529j8364k6485J5942R069m0763J5477j9949k0834
6494g2251K3189J7991j4515J388L3880K0126r790p225k7897J9819J5641j4859
6482a4503j7363O986l3137K5143M606r213N2869o838l8111k0867k1685j5987J2769
6469g5331N5107M5687K0984m749j8470K5615K3734l4624m2142j7788K6237M9032
6457E3292k4747o3058j9256M8006J1416j9032j8925L467j0219j057M6807J7857
6445B4551j4731k002p5950j4062M9214J6518j3660O4438K8068J1092k82k9178
6433D4016N224K877L3487j9692k8473k0971N152k3838k2169k1244p902J3274P2462
6420C2203K3329N762O60j3805k6820J208r044j122k470m8031n3837L5118J3500
$$ y = [2366, 5244, -2840, -10583, -5873, 13656, -4708, -31193, -15251, -6182, -46945, -31468, -51417, -72251, -49062, -31071, -45586, -44198, -10318, 9808, 18, -7207, -35104, -15285, 356, -14503, -31866, -24880, -58017, -32874, -28268, -37481, 15388, 8550, -29561, -50428, -72113, -88100, -75331, -20224, 25463, 46447, 41698, 23228, 48843, 72577, 37953, -4189, -21977, 4260, 53292, 28545, -34513, -53769, -5763, 5653, -13379, -32304, -28837, -39056, -40113, 6694, 24551, 9820, 7818, -68132, -82194, -32980, -16462, -30122, 34316, 62384, 73476, 73194, 44016, 49240, 52117, 85604, 65912, 37439, 16468, 21620, -2218, -24387, -45631, -53533, -40259, 32203, 55532, 61294, 61954, 48149, 21329, 22537, 13493, 12371, 9901, -38130, -91967, -56849, -43349]
6407d3349j788M6163j0441j5658J9982o7p4896k9742M476L4211J4240n193K5571
6394c6491L0689K5705J7423r431L9356J2428k1422j8639k623L659l0502k3888
6382a3736m2422l9236l8865N0771M9391J0522L2226l678p956j1622l7797k119
6370e4521j431o0633L4000M3717J7401l680Q316O931n3686q909M8833K3506m7124
6357d7280k7032j5095k1198L4232N3487J4860k9128m6980J5890j1132N688J6838
6345e6850O7823J6221k3599n015N0351L019m707j2319l8336k3762L6301J0371
6333A9498l4226K0400L2629n2665P04K1853L2499J9951m8067q522M7628L5501
6321H7183M640l3110J8387J5253k1012l1621j9851j3077L6589k8539J6779j3226
$$ y = [-43349, -45137, 1026, -9415, -25073, -5091, -5158, -80054, -109796, -105320, -71109, -56869, -62062, -36491, -5802, 19903, 37326, 27895, 67251, 79679, 58257, 39618, 36995, 40654, 10152, -13736, -56158, -95394, -134259, -83488, -34097, -23575, 8651, 4973, -2983, -14605, -52402, -54521, -55952, -116585, -82585, -38868, -21467, -25147, -16831, -9900, -63586, -72495, -23662, -156, -47280, -74312, -89407, -110605, -76373, -22886, -8026, -37154, -84134, -68244, -79376, -73688, -56850, 10973, 27194, 3595, -1420, 48931, 51950, 47243, 34924, -3412, -27174, 9127, 19498, -14728, 5672, 38301, -14364, -13660, 8193, 40692, 60643, 12576, 4054, 51682, 87183, 91823, 58713, 77100, 92353, 71341, 39720, 19869, 6792, 43381, 14842, 31621, 18395]
6309A8395j9778k3365J1155K512M917j1068J4435N8216J2775k6000j7627J9119
6297D3686j6536m0163p795k0834L6218K8904l4519m0651k43K4865N2672M5537
6285G1141n426m4967k0832q759J7956o26J0337j0263m1252M0450L3285j856k7091
6272A2097k4895n925L224M9479J7170m3416l4165j429O2530J0228j6405L4194
6260F2687L2022j0897o6102j0764l3488Q713p66M244L070N1929k3000j5334R190
6247A1504q224O2317L0791k4322O213m0595j24566o181M8903P974P497p722N0039
6234A3628K5845l3392j3907M6549o561O104l234n5648J2927J755J35P083p4397
6221g3113l8362O8969J6939J7629J0500L8364k0016r624L9984l0534m8785l5986
$$ y = [18395, -1383, -24748, -13593, -11081, -6164, -17232, -2797, 55419, 68194, 42194, 24567, 43686, 27150, -13013, -20808, -41642, -5424, 23480, -11039, -51690, -51933, -27068, 25604, 71141, 65715, 20748, -84, -8843, 9113, 8487, 18824, 8561, -32691, 7759, 41044, 39188, 12097, -12798, -18723, -15499, 33980, 51150, 7734, -26431, -27860, 34670, 44898, 28493, 62687, 94709, 83812, 17710, 6946, -26542, -17829, -18595, -14351, -11281, 40648, 17648, 2314, 11504, 3280, 65597, 96388, 72066, 78279, 37684, -86882, -93063, -44160, -36186, -28689, -36411, 13628, 39473, 6081, -7826, 38723, 32162, 38266, 35032, -20616, -7689, -5934, -5799, 1284, -73113, -111475, -42506, -25567, -7938, 2562, 40926, 20910, 11286, 51270, 20736, -28049, -64035]
6209f4035j5377K9477r440k8972O3285N0718k2363k1023K2018J5178L8721K0150
6197G8337P857R60P36j0873K5322J3615m216j405k4500j7139n6176j9832K4374
6184A7060K6980j6356n7132m7062L5556J8232P435k6860N292L8870J4781K5643
6172D2439J6171J078m2669k8111J135J4843L1128k2034r650P731k6102P023o994
6159a4012l6300N5415R034O26j4432k0196j613o043q51P333J8628J9645j3734
6146C500L202k8748J044N567J5462n119R869J1432J6200k3230m9405L061K795
6133c4370k204K0049K639M9503K1692m037l1948r283o0154j1437K3034O093l153
6120c3576N736j5099J59k2389l1837n652m6824L1443M9495L5094m8335m1570L7040
$$ y = [-64035, -79412, -49935, -59375, -88347, -25062, 25656, 3293, -17730, 4288, 19466, 58187, 78337, 86194, 87154, 87890, 77017, 102339, 115954, 111738, 110333, 85833, 68694, 12518, -7314, 17060, 44040, 27684, -29448, -76510, -40954, -22722, -15287, -42147, -36855, 2015, 16796, 42439, 58610, 59688, 17019, -11092, -9957, 4886, 36014, 13980, 4330, 12061, -14041, -7018, -14012, -50312, 5103, 14137, 14763, 331, -19865, -21478, -27521, -28372, -21039, -2411, 17234, 3500, 6702, -22046, -21002, -15435, 27, -5092, 4777, 16209, 32409, 9179, -40226, -37165, -34370, -36574, -16525, -13886, 35617, 57309, 53272, 21324, 12041, -48113, -59550, -36516, -30423, -33576, -27840, -42939, -42780, -65169, -97006, -102658, -149482, -118039, -68544, -33450, -81785, -123355, -86315]
6107h6315N3435J350j8815k5474j8744J4588L9176L3395k2717l4286p876L364
6095f8919L8884q718K6109N1881J0759N30j2732J809r50l4376n6202J7327o550
6082d1148J9623K5112K8508J4239J224J2646p122l0415K0533k0440j211J7186
6070C8735J6496K212o3108r980j9209p872R699Q978p25j2881J0716L301R19J7540
6056e179K8194J3580o036P285j1775K0349n847m900l2345j7196K2205p478l2466
6043c1609O611L9373M101k5258j1414M6674P356M315n5317L2946L1520O2302m2797
6030F8803m7639n8287J9261J6437l0450j9184K3244K9402r437j28L9308K8169
6018E9499k8265m1539k8678l9880q142M0848O0111K3626p947k6837r023l985M2678
$$ y = [-86315, -32880, -31530, -50345, -75819, -94563, -79975, -40799, -7404, -30121, -64407, -72283, -68919, -30035, -38753, -12644, 39237, 49996, 50526, 37794, 39603, 38653, 4277, -51925, -34598, -41148, -21525, 3587, 32095, 46334, 47558, 60204, 53082, 22667, 43200, 22760, 21549, 38735, 55231, 57443, -5665, -15645, -34854, -42726, -33027, -24049, -24774, -37655, -26939, -23638, -22719, -5179, 23015, 36595, 30559, 37844, 26069, 46418, 40571, 35671, 3326, -13870, 8335, 857, -31609, -24998, 14375, 18476, -6782, -18196, 28478, 35834, 40149, -15168, 17778, 49298, 111600, 68803, 21164, -37123, -17862, -1425, -31875, -51059, -27815, 1587, -7850, -7978, 31330, 59499, 31234, -10305, -38983, -78863, -87005, -46157, 13954, 37580, 29633, 2796, -6227, -10212, 32466]
6005C2466k648l4637j4212n3619Q00L3590N361p750k0937J3149J9394l5827N4838
5992a0032Q7396P313m7873l9696k1683J7948j9122R895K191l1058j6654J2682
5980d8693N040R2576P7503j0627r2318p7725k878L9928J6811J8218l18Q039n307
5967B0249m1942k1293l327L0526K1396J0889k1082j122J9045L813J9514k5215
5955A1451j7413M0510r946p295j4387n659j2566L066k9082k5762l736K0575L5596
5942a4648J8503l634j6398n0056n295O9791Q8251K957k4313l3416p624m9157j7312
5929d2351M6965J3950l5550m5926J4936j1725M2601J7513k7215P25l0507J7786
5917c8798j4196N852J9073K771M031q803j7191K9494J8477m5704k0565L9425N5431
$$ y = [32466, 29818, -4819, -19031, -72650, -71850, -38260, -32899, -40649, -61586, -48437, -29043, -64870, -10032, 77364, 84677, 36804, -2892, -24575, -6627, -25749, -15854, -13663, -44721, -61375, -48693, -43653, 48923, 126426, 115799, 23481, -54244, -57122, -17194, -383, 17835, 17517, 25556, 20249, -21693, -42986, -46313, -15787, 5609, 16498, -4584, -5706, 13339, 17152, 36666, 11451, -5962, 34548, 24602, 17307, 2920, -2739, -15305, -12239, -41321, -67083, -70819, -50244, -14648, 3855, 221, -16177, -66233, -71528, -1737, 86514, 89471, 65158, 31742, 24118, -25039, -42351, 4614, 18564, -16986, -62912, -47976, -59701, -17100, 413, -26802, -26077, -56584, -38798, -52994, -47142, -28069, -25298, -21267, -30070, -47261, -17767, 710, -44994, -65559, -26134, 29297]
5904B9297J6176o0285m2331L9639K3979j6041O082k3193m984K5727j7584r084
5892c2602q295j5858J8785K4551m5407j3021M198J9726M2079M7786M8R885j2173
5879C9702M372p251l8043j6379Q604j1120Q934J2914K1155k3835p823L3051J4593
5866C8874o584p1534k4473J2818Q191L1036m4964j7398K2491o482L5244j411J2283
5853a1909K3087K1123j2522l0630l0826j0184L2035J6252o669R382K763n9427
5841e7525J5112L5546J7817M849L9078M8142l1461n9585m347k0348M9948L2301
5829F9527l0400o7189L574J7026m2044O4617O3256J6929j1144k305m0641J7698
5817E8904j7698j8017m5768j6290L4494M7128k645r099J6976k0383j6657l6882
$$ y = [29297, 45473, -14812, -57143, -17504, 6475, -9566, -3484, -26677, -31661, -5934, -23518, -32602, -40897, -56755, -37970, -13419, -58826, -71847, -67649, -47923, -5844, 41942, 41990, 51875, 39702, 44074, 36823, -1220, -17599, -8995, -20115, -11181, 1733, 22888, -947, -8770, 24281, 38874, 32290, -39244, -63717, -50899, -42708, -11672, -56636, -74034, -51543, -58025, -22781, -24192, -11909, 11178, 32301, 19779, -10851, -41677, -51861, -19826, -3574, -10243, -861, 1902, -57525, -42413, -6867, 10950, 15799, 54877, 103019, 71558, 11973, 7626, -12722, 37226, 69527, 39127, -28062, -24488, -7462, -49506, 15111, 78367, 95296, 84152, 81847, 41206, 58904, 41206, 23189, -22579, -38869, -4375, 42753, 40108, 31009, 47985, 27602, 10945, -25937]
5805b5937k4838Q964J3291J7269l821l25j2801k7270p925m2782M7579M6737K1274
5792I415J5107J3334j8278J2330j0382O323q622j6285k2232k1844J4476O5693
5780C9035k0240k2249K9125j1067l1467k6421P495N9380J2059j4391J4316J0711
5768D6286n79q3141p9377m0102J6307N8585j960l2575M680M0656J4516o910J1027
5755e2587O8246K0370l3996P102K290K5101o624n0318l736K6907q782j5008k3097
5742d4132P357r19L67K416l8598j9639O362N6764m6516J3379L8190p271M0340
5729H100m743k4630M1089m1508k3872L5849J4701k5236J0374K4568j9039L9167
5717C4820k8069o0809P845M0182K763J646L0029L178j5639k5658M3073M788R260
$$ y = [-25937, -50775, -41811, -28520, -11251, -15072, -15397, -28198, -55468, -63393, -106175, -58596, -11859, 9415, 24522, 37856, 19578, 31908, 21526, 27849, 19227, 2942, -19290, -41134, -26658, 39035, 18795, -3454, 25671, 14604, -16863, -43284, -35789, 23591, 35650, 21259, 35575, 46286, 45707, -37434, -116811, -156913, -140606, -82021, -83981, -116556, -111876, -71220, -56704, -63614, -52587, 15659, 36029, 2033, 9135, 11425, 36526, 29902, -20416, -24152, 2755, -6027, -21035, -44132, -36775, -37694, -37327, -34911, -73509, -93148, -86786, -30022, -76538, -63159, -24969, -32240, 8100, 3357, -21273, 19816, -21692, -45564, -9715, 4986, -20250, -9876, 14692, -4347, 34820, 6751, -54058, -46213, -6031, -3268, -1622, 28407, 31585, 15946, -9712, 33361, 38149, 47409]
5704D7409k3031k8179J2034L5601N89k663l345L321j8587k5578j5352K0874k3314
5691b0221K3861K9252q286k5154l2430m643J2303J4719r000K2563J9122J055k4934
5678a793m6446q432K6105L0407N56K2852K7339p0105l0787K5361J3272j2560J1471
5665a2760k004P272N306O5041K673l4724l3346o8351k455n602l3471J1747J1980
5652h8694J6495N3809n5102l3432j1625k9222L4549Q3749L3606K2874L3695j8646
5640D2056K9165J4406j1783K0185j7284l0774k8301j5370l3287j7316K9279L8554
5628A9530m333k4145J0923K6251l5958o244j0352o7414r26M4452L7030J5004M489
5615H307J4349l3697l0239k2037O40J8067N7704L5357o462j9635Q083j2058k8627
$$ y = [47409, 24378, -3801, 8233, 43834, 44423, 41760, 38415, 41736, 23149, -2429, -17781, 3093, -20221, 3640, 32892, 24606, -548, -32978, -37621, -25318, -10599, -19599, 2964, 22086, 23141, -1793, -48239, -56671, -30566, -159, 397, 23249, 50588, -19517, -50304, -24943, -11671, -24231, -12760, -14764, -7492, -2186, 62855, 65528, 30804, -2542, -70893, -73348, -78950, -112421, -100674, -88694, -72199, -18390, -73492, -106924, -118549, -147771, -113222, -29473, 4133, 27007, 60702, 42056, 71221, 85627, 73844, 94029, 76745, 45971, 17670, 2300, -30987, -48303, -19024, 19530, 15197, -8948, 1975, 28226, -7732, -13976, -24328, -91742, -92668, -48216, -11186, 3818, 8307, 22656, -11041, -41280, -63317, -62677, -44610, 13094, 48451, 41989, 22354, 30437, 18379, -10248]
5602a0248p8688R38Q3591M891J4193j315j9562j2563J9659J1366r76o091r283
5589d088k2664m3668J9110j8506r550O9076K7537l650r739j7167L9005K1701q640
5576C8757j1018q175q702K4996j7461l52k8664J0741K5018L7714P143m8186J0711
5563C2522m0605N231J0601J9324O96l4384l2327k3471L0275K5468q1541k8721
5551a16932l3396K7811Q5081L6572l528P5397j9483j9132P825j7298J1059K0511
5539E4487j9911j5223k0067j5143p501j1730M3288L4246j6636j0517j4479J2922
5527A3736k303l0664J8160N2018M6508J3681l46m7147k9902m0377l4202l2916
5515g3754J9167o86J352k5574j3288J0608M5819L4484K3314j2202K955j058l8049
$$ y = [-10248, -88936, -87998, -4407, 484, 14677, 13362, -6200, -18763, 896, 12262, 11286, 5195, -4088, -26752, -70420, -51310, -69816, -79366, -10290, 17247, 13597, 3858, -13309, 25696, 47397, 38757, 27739, 19564, 10862, 35858, 18397, 18045, -10619, 122, 25140, 62854, 69997, 21811, 32522, -8083, -2852, 7749, 27073, 27769, -6615, -38942, -62413, -32138, -6670, -88211, -116932, -150328, -122517, -37436, -864, -4392, 71005, 51522, 32390, 40215, 22917, 33976, 54487, 34576, 19353, -714, -15857, -23358, -35088, 8200, 42446, 25810, 15293, 814, 13736, 11433, -19231, -1071, 50947, 97455, 111136, 110790, 63643, 33741, -6636, -40838, -73754, -54587, -55273, -53921, -79495, -92783, -82175, -36356, -1872, 21442, 9240, 12195, 11137, -26912]
5502b6912l4480r935n1193L9374N7759l489j2828k5843r337K3569q442K8545N2834
5489A9622L7617K6309M140m5951k4675j2038L2564M8381J5086l3909j1754k8320
5477B7072M3081K7013k3782l8435j3466J1965L0388o700J0234J9359O165m0168
5465E2726k5010m673K564J7807m3294m6678j1034m169M0828J4846j629P044L4585
5452C3913M6874K8415m9641K883N08K5655k2383o0788m1776k5716l6300k1796
5440a20152n390P0202N7654J9050k0434j736O127j4090M2474l9645j224M7139
5428C9975K6064l7429l0219k096m236p438J3467j9081l2599k2273J3518k876J2753
5415e2470O1535M455O163J2291R509k1598k451J2991K0001n815o4492k4548k534
$$ y = [-26912, -61392, -71327, -122520, -83146, -25387, -28876, -41704, -67547, -76884, -53315, -61757, -33212, 19622, 57239, 83548, 87688, 41737, 17062, 5024, 37588, 85969, 101055, 67146, 55392, 27072, 70153, 97166, 73384, 34949, 21483, 33448, 63836, 57136, 67370, 86729, 92894, 52726, 27716, 23043, 25607, 43414, 120, -46558, -57592, -61761, -20933, -6087, -7716, -672, 33913, 80787, 109202, 59561, 62444, 62952, 88607, 66224, 5436, -36340, -62056, -98356, -120152, -125542, -55340, 2314, 21364, 930, -806, 5321, -8769, 33705, -5940, -7164, 39975, 66039, 28610, -1609, -3705, -7941, -15379, -1912, -20993, -53592, -75865, -62347, -65223, -52470, 9065, 13520, 19683, 31974, 41483, 19885, 17434, 30425, 50426, 44611, -19881, -44429, -46963]
5402d6963j963O253K1569J316K732l089m4263J2114N5285J9165k0844m2597r850
5389e1135K8049J4189q071J2362J8941j9336P653j1313P949K6210k1841j4841
5377a1184m415M091j589p4902r306P4433r809j6464j1466k3176r882J0397J4523
5364f8749K9205J9314J5314m1838k1843k9407L4579M3442K058j7879K5135O6891
5352E6222m1879K9996J8083l3469n677J0619j997J7527k4252k9242K1004j4312
5340B623J4710J2468N0332j1254k5106j7376k7629o0089N611j4558J2913k997
5328f0352L8460K1435m9699j6393J8036K9730O9118M1299k0015k3511n5587o9198
5316g6677P416O5171M3187J0689j6419k1288R428k0806N321o226k3254j9245K5088
$$ y = [-46963, -48926, -42673, -21104, -19788, -17056, -20145, -64408, -52294, 2991, 22156, 1312, -41285, -51135, -23086, -8897, -16968, -4606, 14335, -5001, 2652, -8661, -712, 25498, 3657, -11184, -15599, -11508, -13097, -87999, -97305, -22872, -32681, -49145, -60611, -83787, -93669, -83272, -68749, -39544, -20230, -4916, -46754, -68597, -98004, -63425, -19983, -17925, -35804, -10669, 56222, 14343, 44339, 62422, 28953, 23276, 33895, 31898, 49425, 25173, -4069, 16935, 2623, 17333, 29801, 80133, 68879, 43773, 26397, -1232, -61321, -55710, -70268, -57355, -60352, -21892, -457, -50156, -66549, -48513, -18783, 50335, 91634, 71619, 48108, -7479, -76677, -69261, -4090, 39097, 49786, 33367, 12079, 21507, 701, 6022, -204, -23458, -42703, -17615]
5303a7615J685K47k1761L4456k8044m5344j8566O0678N0253L3091o739m5130k9127
5290c1916l5782N6753O125n5917L4942K9592K8501l8711l6494K6066M0816p278
5278A6697m0638O4332L765n505k947J263L950P265n170k8985J8901o625j7938
5265H365k8591j861N033J4176J8228L8694k7988o4553R390j6052J9061M9909j925
5252B1886m0297k1982J2111K4609M2587j6986n2572N954N1841K7809J7924j4552
5240E8332m4630m2504n517r031R764M0214L4069J1548k0835j6568n822K2647K2621
5227E4288j9106l8631n303k2525j5220j7393M9491L0182j6973j2643N682L858
5215d293k0373n2002J1252N7510p1K4864O5201P736m718k2052r726o6700l7352
$$ y = [-17615, -15930, -15683, -37444, -2988, -31032, -76376, -94942, -34264, 15989, 49080, 42341, -2789, -31916, -67698, -10945, -4820, -60737, -25795, 3797, 32298, -6413, -42907, -16841, 23975, 16697, -23941, 40391, 44156, 38651, 35704, 36967, 40917, 48182, 43012, 14027, 32928, 26303, 8365, -20226, -22087, -17054, -2878, 15350, 54044, 26056, -38497, -29107, -45159, -26098, 23811, 21886, -18411, -40393, -28282, -3673, 38914, 21928, -30644, -24690, 27151, 54960, 72884, 58332, 13702, -28802, -34319, -43350, -33586, 6628, 40697, 52245, 31410, 14842, 9020, 31667, 54288, 35182, -3449, -8752, -31277, -46497, -63890, -14399, 15783, -1190, -13833, -8151, -4293, -24666, -76668, -65416, -7906, -7977, 16887, 82088, 89824, 85106, 63054, 53328, -13372, -50724]
5202e0724K3862L1921K4009K671m9794k4418K352J1558M1964L0966k5116o1131
5190d1880p225j4301M1239L8335o1513j3585L3477L1317k7149j5585m4039L3629
5178d7280J6495o525j2519j4099J3207K0931J7923R724L0485m881m0919k9218
5166d6676m137o922K5205M9851J6110N3897K3864j5157k2684j7384K2418j9483
5154E8902N144j8190Q351M2431P822m8124n3278n5395k4818K8421N1361K8457
5142C1084n0758Q717Q521K4343K5109k6351Q122K1311m979l0316N302J4532K5173
5129E9810J3863j9933l0453K792o776p077j083J1103K0987l8926m782j6777L0788
5116A3536K2939k5225k4144n890l5540M2777L8762j068j9126j9200K6545K0750
$$ y = [-50724, -26862, 5059, 29068, 31739, -18055, -42473, -40121, -28563, 13401, 44367, 19251, -41880, -49105, -63406, -22167, 16168, -45345, -58930, -25453, 5864, -21285, -36870, -80909, -47280, -30785, -37310, -49829, -63928, -50721, -29790, -11867, -2143, 28342, 23461, -17458, -46676, -50813, -57735, -32530, 17321, 33431, 87328, 111192, 96035, 73351, 55967, 78385, 58902, 64046, 45856, 54207, 96638, 104460, 56336, 3058, -52337, -77155, -48734, 2627, 31084, -19674, -10957, -2436, 21907, 47016, 20665, 28787, 50098, 45119, 14803, 20105, 34637, 59810, 73673, 53740, 23287, 26079, 19303, 12226, 11143, 22246, 43233, 4307, -475, -17252, 13536, 36475, 11250, -12894, -18784, -54324, -11547, 27215, 26147, 7021, -12179, 14366, 35116]
5104C5116J7350k2326k7860j6991N0862R843l3070j5770Q384L6486J1356j2951
5092D0429k4449l0184p2680K8556K4230q109k9908l484K8715K6100J8788R551
5080G555N2906K8298j299n9719j2262j3242m294M723L8968q848j780j3J0132j9585
5066B1540m2124O600j4459J9270K914J4623J8356r903m4584m5927K7587M270l247
5053d5084j7213j73J1584K6303N3013j576K0545l8529m6052l7307R56N896N1623
5040a6014O4636l7222R960L2581j392n7096l4481j5603m776m0207q40Q413o156
5027i8197K5914J4580N9545J6262l2860j4310j8093k4132R166L3415P640k3713
5015d4783K7070L6674q66m8719J6801P229J3908r354K2126J1433m8713P109L9176
$$ y = [35116, 52466, 30140, 2280, -14711, 36151, 45994, 12924, -2846, 5538, 42024, 53380, 40429, 15980, -14204, -86884, -58328, -34098, -42207, -72115, -75599, -46884, -20784, -1996, 7555, 60461, 88759, 87460, 27741, 15479, 2237, -2057, 2666, 41634, 32786, 31006, 30993, 41125, 21540, -20584, -13984, -28443, -9173, -6259, 8364, 26720, 16817, -27767, -73694, -46107, -41837, -45084, -62297, -62470, -50886, -24583, 28430, 26854, 47399, 8870, -37182, -74489, -73533, -67637, -16014, 48622, 11400, 21360, 53941, 52549, -4547, -39028, -54631, -59407, -99614, -100454, -92041, -98197, -72283, -57703, 1842, 18104, -14756, -29066, -47159, -71291, -62125, -28710, -21070, -44783, -17713, 18961, 18095, -30624, -13823, -6594, 7314, -2040, 20086, 31519, -17194, -10085, 29091]
5002B9091K0436j6967p0473k5262n842p249l144N5207P4412p9740j2472O5407
4990B3404J45m6628j1592R798Q329k0372K1288L6449o1442K2473M3545l2223r829
4977a6655L375N80j0376p233L0146j6964k0825J8269O227m374Q760l311j1407
4964b3788l835L4748o780K7296r909K7425M74m9084l2751k9935L2258k4791L8637
4951b0035L1699n2033k4506J3143M9156L9918k2276m4491j7843M1174L4827K3058
4939E1791j8280L9832j9357l4129L1114K216k259k4189k8375j9634K0371j9565
4927b0464n93m1319K9510K6339j3757j5022L5125L6075n037J4066J5408j9818
4915D0513l521K7552k886J7248k484q953l5351m9212p40M521J3866m6369l0675
$$ y = [29091, 49527, 32560, -37913, -63175, -69017, -76266, -79410, -24203, 50209, -29531, -42003, 23404, 23549, -23079, -34671, -24873, -16544, -36916, -15628, 20821, -40621, -18148, 25397, -6826, -16655, -13280, -12700, -23076, -30309, -163, -17127, -37952, -19683, -13456, -17830, -9070, -12381, -23788, -27623, 7125, 345, 27641, 17732, 45157, 45631, -3453, -36204, -66139, -33881, -58672, -20035, 11664, -40369, -64875, -51732, -2576, 37342, 15066, -29425, -47268, -6094, 28733, 51791, 33511, 73343, 53986, 19857, 50971, 53187, 50928, 26739, -1636, -21270, -899, -20464, -21057, -62376, -32866, -6527, -20284, -35306, -181, 35894, 30857, 44923, 60331, 40513, 36992, 64544, 61658, 78906, 76422, 67469, 32118, -17094, -17834, -13313, 553, -45816, -76491]
4902g6491l7481J6007M2145K4416r70P657J5050j1047k223l4551L0069N5412O441
4889C4434n715j8361J7442j2351k3604N9307L6066o579l6660m8333q713P232j7595
4876b3430k9497k3458J436K3890M7864K3250k57q091l6213k0265Q684M7585k2584
4863a1086q321j1031k1713L3109L3118n509j0542j552l572K1370N5017J2910j8309
4850F3889j02622k2895j6613L1467O540n53L8625K2596m888L708j5199J7107Q799
4837B9961K8259l6126l1123k0839j2127P1226m220M602l9481l7504j7253J3028
4825e1597K9206J7043j668k9029o411L1567K3813l1088L358M1565j5730J1434
4813B2463K0265m793M4156L1389k5647Q154j3718k9265k2228O527k6304j2977
$$ y = [-76491, -113972, -97965, -55820, -31404, -32374, -24717, -9667, -20714, -22937, -57488, -27419, 27993, 34434, 28719, 10358, 27800, 15449, -8155, 51152, 87218, 80639, 43979, -4354, -13067, -5835, -23430, -52927, -76385, -74949, -51059, -3195, 20055, 19798, 11707, -24506, -44771, -36087, 11498, -11086, -19407, -30438, -52151, -19042, 14076, 8567, -1975, -3527, -7099, 14271, 69288, 82198, 63889, -38733, -61628, -78241, -46774, -40234, -40787, -2162, 20434, 15546, 19254, 4055, 21162, 29961, 58220, 22094, -9029, -29868, -41995, 29231, 25011, 29613, -9868, -47372, -64625, -51597, -22391, -5348, -7016, -36045, -42456, -10889, 12924, -18164, -14806, 26759, 11029, 22463, 42728, 37935, 82091, 113480, 87833, 95987, 82269, 53004, 30776, 37303, 10999, -1978]
4801a978k5382P194j4250L3482J2956J7077k5649K2893J234L486k527R942O859
4788D5337k8909l4415o635J0369L9293J3664m037j3493k5591K903Q064o485l9055
4775c8990o081P330o584K7074J5165J534k3992j0151M2809K4642j1065p1958J6393
4762c3874M43o602N748k4779q052J3821L6797K7669l5390L3857O0865l5211j5123
4749B0169j5223m292j6453K5701J4182q6148j3150L3529O2044L3684L9486l2961
4737F0568p9087n0634K0500J4407l1062j098K2176N7047R088L8676p210l5360
4725A8011n3129P582K5030M6164r246m6484m5514Q325J4352L1759K0827n444K0684
4712C2917j465K06l4351n1129J2913q555j363K6022O01J7945k8570j8552R855
$$ y = [-1978, -27360, -20166, -34416, -934, 12022, 29099, 3450, 26343, 27577, 31063, 28536, 38478, 45337, 16428, -17987, -24622, -14253, 25040, 38704, 34667, 21174, -4417, -1514, 6550, 65, -38990, -45071, -37741, -44325, -17251, -2086, -552, -24544, -34695, 8114, 32756, 21691, -50267, -33874, -33431, -40033, -34285, -59064, -67116, -53295, -16498, 11171, -24219, 9638, 70503, 35292, 20169, 4946, 654, -15799, 9902, 24084, -62064, -75214, -41685, 20359, 54043, 93529, 60568, -18519, -69153, -48653, -34246, -65308, -66406, -44230, 12817, 21905, 60581, 53371, 18011, -35118, -27536, -2506, 43658, 34412, -12072, -57586, -49261, -34909, -3150, 17677, 12233, 32917, 31452, 31658, -2693, -53822, -40909, -49464, -50827, -24805, -24204, -6259, -34829, -53381, -43526]
4699d3526M443N232J8715j2290J3863J6204J724k7926m7968R432M4271O6817J140
4686E0131j9888k5887l763J6302k640K0934N1146o2147k4132M0573q998o1834
4674c0203O875R4216k6134l5636k1846J3940K8041j0909j7235N2600M1950J0953
4662A06612l2475n6496k4242j9935K6510J6361K898o5251m2149K8299Q0474K4371
4650D4977m4931R839K3486j8563q817j294m3035j7216J0902J0616M1094L0057
4638C7115J5288k031J80l9784k5304M7207J0236o978p2894k0407J8023J6708k935
4625b5576j476J8167P042J1644j4337l1261l5072k0250O7394R327j1236J9925
4613e709P013Q202k2392j2188J5010N8327M4421P287l2271l6930k5917Q077J9234
$$ y = [-43526, -39083, -33851, -15136, -27426, -13563, 2641, 4365, -23561, -71529, -62097, -17826, 48991, 50131, 30243, 4356, 593, 16895, 14255, 35189, 86335, 24188, 56, 40629, 31631, -30203, -23328, 70888, 44754, 9118, -12728, 1212, 29253, 18344, 1109, 53709, 95659, 106612, 74137, 17641, -6601, -26536, -26, 16335, 19233, -46018, -88167, -59868, 20606, 44977, 46, 9885, 33371, 14808, 5991, 4697, -38338, -55554, -44652, -34036, 7058, 37115, 52403, 50372, 50552, 10768, -14536, 32671, 42907, 35929, -36965, -57372, -39349, -22641, -25576, -27052, -8885, -1843, 9801, -4536, -35797, -70869, -91119, -23725, -14398, -25634, -5709, 1304, 9506, -12886, -25074, -10064, 48263, 92684, 99971, 67700, 30770, 4853, 12930, 32164]
4600C2164J6597k9766j5982l1159Q425J4325M031K4214j6647j2533J3926j0032
4588b437O7374O248j8911j5992l4822j7897K2818L1255j8174K1359l1880r068
4576a27M374r135N520j2780L5034p261n1765K7250L0961J2475J042p4107j3039
4563e1558n980L0695N2036K6591l6432m2024m774J9435K7366J2198J9247l1124
4551A5676m4142k8298m77L5855M2684k6212l7622j443j1862m491J9576N9709L9581
4538E8534K9473l6990l3527j6175k2862L5084j2764l5880K0094K8103L42n0492
4526c7060l6074L1524M81L9299N7686L3961l9787l3866j8937r880k8985j855J856
4513d1637k0760O065K8126k2777N8559J8271k2934m584m0456k6142j2598k4984
$$ y = [32164, 48761, 18995, 3013, -28146, -19721, -5396, -1365, 22849, 6202, -6331, 7595, -2437, 64937, 71185, 52274, 36282, 1460, -16437, 6381, 37636, 19462, 40821, 8941, -127, 4247, -4888, 632, -12148, 22886, 15625, -36140, -8890, 22071, 34546, 35588, -38519, -51558, -57538, -26843, 25193, 51784, 15352, -26672, -31446, -12011, 15355, 27553, 46800, 15676, -28466, -56764, -57241, -21386, 21298, -4914, -42536, -43979, -55841, -60332, -40756, 18953, 58534, 88007, 51017, 17490, 1315, -21547, 13537, 773, -35107, -15013, 13090, 13432, -37060, -73134, -41610, -41129, -1830, 55856, 89817, 50030, 16164, -2773, -12653, -41638, -43493, -41637, -62397, -56332, -28206, -50983, 7576, 25847, 2913, -1671, -42127, -68269, -80867, -105851]
4501a05851J2020K6960K5861L0483m243K4738j6167K8483O292o7639k3888L9793
4489b3158J09337q583l0252p740P421k6183k3558n498k2828n6483k6328N6315
4477e7538M0120M2q303J6724K6186j0119p844n2739J7786L3792J0520l2460j883
$$ y = [-105851, -93831, -66871, -41010, -10527, -14770, 9968, -6199, 22284, 28576, -39063, -62951, -23158, 86179, 77596, 47344, 39604, 47025, 20842, -2716, -8214, -31042, -87525, -113853, -57538, -17418, -17376, -25679, -8955, 17231, 7112, -732, -53471, -35685, -1893, 8627, -23833, -25716]
$$ [...]
##END NTUPLES=NMR SPECTRUM
##END=
