##TITLE=Analysis number 310510
Compound Code mo 00831
Project Code adrs
Chemist Name fudan
##JCAMPDX= 6.0         $$ Bruker NMR JCAMP-DX V2.0
##DATA TYPE= NMR SPECTRUM
##DATA CLASS= NTUPLES
##ORIGIN= Bruker BioSpin GmbH
##OWNER= NMR
$$ XWIN-NMR		Version 3.5
$$ Tue Jun 21 08:24:11 2005 GMT Daylight Time (UT+1h)  MAYBRIDGE\NMR@NMR_250MHZ
##.OBSERVE FREQUENCY= 250.131544655141
##.OBSERVE NUCLEUS= ^1H
##.ACQUISITION MODE= SIMULTANEOUS (DQD)
##.ACQUISITION SCHEME= undefined
##.AVERAGES= 16
##.DIGITISER RES= 18
##SPECTROMETER/DATA SYSTEM= dpx250
##.PULSE SEQUENCE= zg30
##.SOLVENT NAME= DMSO
##.SHIFT REFERENCE= (INTERNAL, DMSO, 0, 16.522)
##AUDIT TRAIL= $$ (NUMBER, WHEN, WHO, WHERE, WHAT)
$$ ##TITLE= Audit trail, XWIN-NMR		Version 3.5
$$ ##JCAMPDX= 5.01
$$ ##ORIGIN= Bruker BioSpin GmbH
$$ ##OWNER= NMR
$$ C:\u/data/dgb/nmr/ADRS/4320/pdata/1/auditp.txt
$$ ##AUDIT TRAIL=  $$ (NUMBER, WHEN, WHO, WHERE, WHAT)
(   1,<2005-06-21 08:23:37.38 +100>,<MAYBRIDGE\NMR>,<NMR_250MHZ>,
      <created by zg, POWCHK disabled, PULCHK disabled
       configuration hash MD5:
       62 19 C7 07 E1 42 D1 B7 37 6C 3D D0 77 39 F9 E6
       data hash MD5: 64K
       30 03 2C 91 60 D1 40 7C 13 28 F4 FC DA ED B4 1D>)
(   2,<2005-06-21 08:23:58.82 +100>,<MAYBRIDGE\NMR>,<NMR_250MHZ>,
      <Start of raw data processing
       ef LB = 0.3 FT_mod = 6 PKNL = 1 SI = 32K 
       data hash MD5: 32K
       A5 32 1E 2D D5 D4 E9 D6 5A 02 47 08 F9 83 D5 D8>)
(   3,<2005-06-21 08:24:00.96 +100>,<MAYBRIDGE\NMR>,<NMR_250MHZ>,
      <apk 
       data hash MD5: 32K
       EB 0F 63 14 BD E1 14 54 47 66 DB 06 F2 6D 1D E8>)
(   4,<2005-06-21 08:24:01.77 +100>,<MAYBRIDGE\NMR>,<NMR_250MHZ>,
      <abs ABSG = 5 
       data hash MD5: 32K
       B5 48 8A 90 56 1F 7C F9 A5 84 AC 0B BE 49 39 24>)
$$ ##END=
$$ 
$$ hash MD5
$$ 00 8A 19 46 D9 86 9F 95 B8 40 0B 75 FA 7A 75 FA
##$RELAX= 
##$RELAX= 
##$RELAX= 
##$RELAX= 
##$RELAX= 
##$RELAX= 
##$RELAX= 
$$ Bruker specific parameters
$$ --------------------------
##$DU= <C:\u>
##$EXPNO= 4320
##$NAME= <ADRS>
##$PROCNO= 1
##$TYPE= <nmr>
##$USER= <dgb>
##$AMP= (0..31)
100 100 100 100 100 100 100 100 100 100 100 100 100 100 100 100 100 100 
100 100 100 100 100 100 100 100 100 100 100 100 100 100 
##$AQSEQ= 0
##$AQ_mod= 3
##$AUNM= <au_zg>
##$AUTOPOS= <1 >
##$BF1= 250.13
##$BF2= 250.13
##$BF3= 250.13
##$BF4= 250.13
##$BF5= 500.13
##$BF6= 500.13
##$BF7= 500.13
##$BF8= 500.13
##$BYTORDA= 1
##$CFDGTYP= 0
##$CFRGTYP= 5
##$CHEMSTR= <none>
##$CNST= (0..31)
1 1 145 1 1 1 1 1 1 1 1 1 1 1 1 1 1 1 1 1 1 1 1 1 1 1 1 1 1 1 1 1 
##$CPDPRG= <>
##$CPDPRG1= <>
##$CPDPRG2= <>
##$CPDPRG3= <>
##$CPDPRG4= <mlev>
##$CPDPRG5= <mlev>
##$CPDPRG6= <mlev>
##$CPDPRG7= <mlev>
##$CPDPRG8= <mlev>
##$CPDPRGB= <>
##$CPDPRGT= <>
##$D= (0..31)
0 1 0 0 0 0 0 0 0 0.06 0 0 0 0 0 0 0.0002 0 0 0 0 0 0 0 0 0 0 0 0 0 0 
0 
##$DATE= 1119338616
##$DBL= (0..7)
120 120 120 120 120 120 120 120 
##$DBP= (0..7)
150 150 150 150 150 150 150 150 
##$DBP07= 0
##$DBPNAM0= <>
##$DBPNAM1= <>
##$DBPNAM2= <>
##$DBPNAM3= <>
$$ [...]
##$SUBNAM7= <"">
##$SUBNAM8= <"">
##$SUBNAM9= <"">
##$SW= 20.6930455092707
##$SWIBOX= (0..15)
0 0 3 0 0 0 0 0 0 0 0 0 0 0 0 0 
##$SW_h= 5175.983436853
##$TD= 65536
##$TD0= 1
##$TE= 295.16
##$TE2= 300
##$TE3= 300
##$TEG= 300
##$TL= (0..7)
0 120 120 120 120 120 120 120 
##$TP= (0..7)
150 150 150 150 150 150 150 150 
##$TP07= 0
##$TPNAME0= <>
##$TPNAME1= <>
##$TPNAME2= <>
##$TPNAME3= <>
##$TPNAME4= <>
##$TPNAME5= <>
##$TPNAME6= <>
##$TPNAME7= <>
##$TPOAL= (0..7)
0.5 0.5 0.5 0.5 0.5 0.5 0.5 0.5 
##$TPOFFS= (0..7)
0 0 0 0 0 0 0 0 
##$TUNHIN= 0
##$TUNHOUT= 0
##$TUNXOUT= 0
##$USERA1= <user>
##$USERA2= <user>
##$USERA3= <user>
##$USERA4= <user>
##$USERA5= <user>
##$V9= 5
##$VALIST= <valist>
##$VCLIST= <CCCCCCCCCCCCCCC>
##$VD= 0
##$VDLIST= <DDDDDDDDDDDDDDD>
##$VPLIST= <PPPPPPPPPPPPPPP>
##$VTLIST= <TTTTTTTTTTTTTTT>
##$WBST= 1024
##$WBSW= 4
##$XGAIN= (0..3)
0 0 0 0 
##$XL= 0
##$YL= 0
##$YMAX_a= 333514
##$YMIN_a= -354688
##$ZGOPTNS= <>
##$ZL1= 120
##$ZL2= 120
##$ZL3= 120
##$ZL4= 120
##$ABSF1= 16.522
##$ABSF2= -4.171173
##$ABSG= 5
##$ABSL= 3
##$ALPHA= 0
##$AQORDER= 0
##$ASSFAC= 0
##$ASSFACI= 0
##$ASSFACX= 0
##$ASSWID= 0
##$AUNMP= <proc_1d>
##$AZFE= 0.1
##$AZFW= 0.1
##$BCFW= 0
##$BC_mod= 0
##$BYTORDP= 0
##$COROFFS= 0
##$CY= 12.5
##$DATMOD= 1
##$DC= 0
##$DFILT= <>
##$DTYPP= 0
##$F1P= 14.0000005364418
##$F2P= -0.99999901652339
##$FCOR= 0.5
##$FTSIZE= 32768
##$FT_mod= 6
##$GAMMA= 0
##$GB= 0
##$INTBC= 1
##$INTSCL= 1
##$ISEN= 128
##$LB= 0.3
##$LEV0= 0
##$LPBIN= 0
##$MAXI= 10000
##$MC2= 0
##$MEAN= 0
##$ME_mod= 0
##$MI= 0
##$NCOEF= 0
##$NC_proc= -3
##$NLEV= 6
##$NOISF1= 0
##$NOISF2= 0
##$NSP= 0
##$NTH_PI= 0
##$NZP= 0
##$OFFSET= 16.522
##$PC= 1
##$PHC0= -88.42776
##$PHC1= 5.702519
##$PH_mod= 1
##$PKNL= yes
##$PPARMOD= 0
##$PSCAL= 4
##$PSIGN= 0
##$REVERSE= no
##$SF= 250.13
##$SI= 32768
##$SIGF1= 0
##$SIGF2= 0
##$SINO= 400
##$SIOLD= 32768
##$SREGLST= <1H.DMSO>
##$SSB= 0
##$STSI= 32768
##$STSR= 0
##$SW_p= 5175.98343685301
##$SYMM= 0
##$S_DEV= 0
##$TDeff= 65536
##$TDoff= 0
##$TI= <Analysis number 999999
Compound Code 99
Book Reference 9
Project Code 9>
##$TILT= no
##$TM1= 0
##$TM2= 0
##$TOPLEV= 0
##$USERP1= <user>
##$USERP2= <user>
##$USERP3= <user>
##$USERP4= <user>
##$USERP5= <user>
##$WDW= 1
##$XDIM= 32768
##$YMAX_p= 506357019
##$YMIN_p= -190499
$$ End of Bruker specific parameters
$$ ---------------------------------
##NTUPLES= NMR SPECTRUM
##VAR_NAME=  FREQUENCY,     SPECTRUM/REAL,   SPECTRUM/IMAG
##SYMBOL=    X,             R,               I
##VAR_TYPE=  INDEPENDENT,   DEPENDENT,       DEPENDENT
##VAR_FORM=  AFFN,          ASDF,            ASDF
##VAR_DIM=   32768,         32768,           32768
##UNITS=     HZ,            ARBITRARY UNITS, ARBITRARY UNITS
##FACTOR=    0.157963299565203, 1,           1
##FIRST=     4132.6476996994, 0,             0
##LAST=      -1043.33573715361, 0,           0
##MIN=       -1043.33573715361, -190499,     0
##MAX=       4132.6476996994, 506357019,     0
$$ Real data points
##PAGE= N=1
##DATA TABLE= (X++(R..R)), XYDATA
$$ [...]
16071d9258K8259K4732Q49j1554j5755j0337m285K9121K1407K858j0883j5407
$$ -49258 -20999 3733 4582 -6972 -22727 -33064 -37349 -8228 13179 16037 5154 -10253
16059a0253j1656M767J2520J4864k1190k4945K92J3132L404j7447M84K4072J8290
$$ -10253 -21909 -17142 -4622 10242 -10948 -35893 -35601 -22469 -19065 -36512 -36028 -11956 6334
16046F334K302K054L838m6716j0291J0622J7481J4201q837K198j2609n292m5M671
$$ 6334 8636 10690 14528 -32188 -42479 -31857 -14376 -175 -9012 -6814 -19423 -24715 -24760 -20089
16032b0089p699K0437J9502j5848j3085k4698k2083J6512P441O386J2633K1068
$$ -20089 -27788 -7351 12151 -3697 -16782 -41480 -63563 -47051 -39610 -33224 -20591 477
16020D77J297q748O34J1979j8160m132P475O070R371R008j3896k1928k6193O421
$$ 477 1774 -6974 -6340 5639 -12521 -16653 -9178 -3108 6263 15271 1375 -20553 -46746 -40325
16006d0325K582L1949J1719j1417P908J6123j4696j9212K128K1088k612j8008
$$ -40325 -37743 -5794 5925 -5492 2416 18539 3843 -15369 -13241 7847 5235 -12773
15994a2773K2447O422j255Q621N026k0116l4704l326J1844j1071j3292J5448J0208
$$ -12773 9674 16096 14841 23462 28488 8372 -26332 -29658 -17814 -28885 -42177 -26729 -16521
15981a6521K1144k687L050O187j9043j8367l2010j4055Q500L0552o272j6979J1487
$$ -16521 4623 1936 4986 11173 -7870 -26237 -58247 -72302 -63802 -33250 -39522 -56501 -45014
15968d5014K5690M7R036Q971l4889k7396o31N529J3098L5607J5715P10j1124R802
$$ -45014 -19324 -19277 -10241 -1270 -36159 -63555 -64186 -58657 -45559 -9952 5763 6473 -4651 5151
15954E151j5545K704J804r36j9085j6541J2533L6999j3314l3585J6770N1028J5969
$$ 5151 -10394 -7690 -5886 -6822 -25907 -42448 -29915 7084 -6230 -39815 -23045 27983 43952
15941D3952l0992q714L4208M303j9318k1545M661K8665P764j525j7633l8382j9069
$$ 43952 12960 4246 38454 42757 23439 1894 6555 35220 42984 41459 23826 -14556 -33625
15928c3625l1350l494M6660M540k9660p634L4778j1983k6331J6938J7743R862
$$ -33625 -64975 -68469 -21809 -17269 -46929 -54563 -19785 -31768 -58099 -41161 -23418 -13556
15916a3556L557j1717j5093J7874J5163J4048k7225l740L091m741J4752O274J8724
$$ -13556 -9999 -21716 -36809 -18935 -3772 10276 -16949 -20689 -17598 -22339 -7587 -1313 17411
15903A7411j8237m402L0377q479k7962l0730j0912R641J2321M8176k3985l9162
$$ 17411 -826 -5228 25149 16670 -11292 -42022 -52934 -43293 -30972 17204 -6781 -45943
15891d5943L0062L4733L811r229k7443l856M560k422j4583k2169P162L4253K6370
$$ -45943 -15881 18852 22663 13434 -14009 -17865 -13305 -15727 -30310 -52479 -45317 -11064 15306
15878A5306J2297k0301j6895o663J2790O984J462k2001q967J1851L3014q488k1824
$$ 15306 27603 7302 -9593 -16256 -3466 3518 4980 -17021 -25988 -14137 18877 10389 -11435
15865a1435p384O555J1253O447j3446k167j0151O338m575J068k786l69J9528l1464
$$ -11435 -18819 -12264 -1011 5436 -8010 -10177 -20328 -13990 -18565 -17497 -20283 -20652 -1124 -32588
15851c2588j9335J6792J1297N132j8150l3059r980K4020N469k6696J0450J2231
$$ -32588 -51923 -35131 -23834 -18702 -36852 -69911 -79891 -55871 -50402 -77098 -66648 -54417
15839e4417k1275r98K332L9765J1033k0493j1408R064l550L003M635j2002K4469
$$ -54417 -75692 -76690 -74358 -34593 -23560 -44053 -55461 -46397 -49947 -46944 -42309 -54311 -29842
15826b9842K8397J7864K1202k1935l3974J0269L5016M6203r418l7382J913K24
$$ -29842 -1445 16419 37621 15686 -18288 -8019 26997 73200 63782 26400 28313 28537
15814B8537j5226o588O139J2601J63k0080k4663K5431J7861j4397k3322M709j4574
$$ 28537 13311 6723 12862 25463 25626 5546 -19117 6314 24175 9778 -13544 -8835 -23409
15801b3409k4196l378P430J3947K8703J5526k1983m2174l769N925K1078n639M928
$$ -23409 -47605 -50983 -43553 -29606 -903 14623 -7360 -49534 -53303 -47378 -26300 -31939 -27011
15788b7011K9253J102k2939l0732P637Q561k4956Q608K2351r02j395J1183J6594
$$ -27011 2242 3344 -19595 -50327 -42690 -34129 -59085 -50477 -28126 -29028 -30423 -19240 -2646
15775b646J9037j3599k0375j1059o909j0389K1835L1593R961r36k2535k440j9746
$$ -2646 16391 2792 -17583 -28642 -35551 -45940 -24105 7488 17449 16513 -6022 -8462 -28208
15762b8208j1500Q08J3701K618J3377J2651K360j3142o946J257k2442q933j6120
$$ -28208 -39708 -38900 -25199 -22581 -9204 3447 5807 -7335 -14281 -13024 -35466 -44399 -60519
15749f0519J2012K2271J7976r408k5121j7061J7999J5842o01l004J1861K6936
$$ -60519 -48507 -26236 -8260 -17668 -42789 -59850 -41851 -26009 -26610 -29614 -17753 9183
15737I183J2802R054k9233L010m362o133r615N067j7289J3685L9979J821j5807
$$ 9183 21985 31039 1806 4816 454 -5679 -15294 -10227 -27516 -13831 26148 27969 12162
15724A2162l9221r806J7677L9031l265m4446P241L1370n823K4118j0657l2335
$$ 12162 -27059 -36865 -19188 19843 16578 -27868 -20627 10743 4920 29038 18381 -13954
15712a3954k0030q432L9783J6316j1050q942j2919K694K3214l429K235K6369l7792
$$ -13954 -33984 -42416 -2633 13683 2633 -6309 -19228 -16534 6680 3251 5486 31855 -5937
15699e937r111K5031J2452j9062k4332J3643R12R299k0562j399O69K2339j3273
$$ -5937 -15048 9983 22435 3373 -20959 -7316 -6404 2895 -17667 -19066 -18397 3942 -9331
15686i331j7307k6538J8629R993l745l312K5205R634R617j5793j9559j7176Q780
$$ -9331 -26638 -53176 -34547 -24554 -28299 -31611 -6406 3228 12845 -2948 -22507 -39683 -30903
15673c0903K3058J4383m752j4205j3194Q189k0985m0199L6799M5079J9733L579
$$ -30903 -7845 6538 1786 -12419 -25613 -17424 -38409 -78608 -41809 3270 23003 26582
15661B6582j4933l9018M404N4663K7671P661j0879k4970j2079J045r514J5763
$$ 26582 11649 -27369 -22965 31698 59369 67030 56151 31181 19102 20147 10633 26396
15649B6396K1099J0592k8729J3823j2258q337l316k7645k6989K9465J5276j0634
$$ 26396 47495 58087 29358 43181 30923 22586 19270 -8375 -35364 -5899 9377 -1257
15637a257J5532j6916j9066K301j5032R480K089O945J2050j5824j8141J49k471
$$ -1257 14275 -2641 -21707 -19406 -34438 -24958 -22869 -15924 -3874 -19698 -37839 -37690 -40161
15624d0161K0968J0122J713O589K4394K8764j3083l4789l7490j8593r525n740
$$ -40161 -19193 -9071 -7358 -769 23625 52389 39306 4517 -32973 -51566 -61091 -66831
15612f6831o104J9696K6345k1446R912J6403L261L755k336P308J0477q312J2495
$$ -66831 -72935 -53239 -26894 -48340 -38428 -22025 -18764 -15009 -17345 -10037 440 -7872 4623
15599D623o012k5068K7235K9410L188j3166L132n620m0898j5386k913K5256J8781
$$ 4623 -1389 -26457 778 30188 33376 20210 23342 17722 -23176 -38562 -41475 -16219 2562
15586B562q601M639k9122j8200j6616J0796L8913k1412R050R943m934K1198J3542
$$ 2562 -6039 -1400 -30522 -48722 -65338 -54542 -15629 -37041 -27991 -18048 -22982 -1784 11758
15573A1758j0695P430j1589k5344n492O129J6182j696P076K0942K4293J1535l872
$$ 11758 1063 8493 -3096 -28440 -33932 -27803 -11621 -13317 -6241 14701 38994 50529 46657
15560D6657k5347Q450o205n680K0460p37M616p198p588k7271j9883k2269K0383
$$ 46657 21310 29760 23555 17875 38335 37598 42214 35016 27428 157 -19726 -41995 -21612
15547b1612K7862J8211j7333m0282P57Q090op838p38J4094l050j6084J660P74
$$ -21612 6250 24461 7128 -33154 -32397 -24307 -24313 -32151 -32889 -18795 -21845 -37929 -36269 -35495
15533c5495J0508K592J2429j5705k1853Q833K9081J6633r040j7165k7713r218
$$ -35495 -24987 -22395 -9966 -25671 -47524 -38691 -9610 7023 -2017 -19182 -46895 -56113
15521e6113Q025K9849K4651J9394J2999J0036l4070L1j5576K3684J8753j2634
$$ -56113 -48088 -18239 6412 25806 38805 48841 14771 14802 -774 22910 41663 29029
15509B9029l691k546N71j5785j2598o433r569J4787K8233K4358K4473m302L126
$$ 29029 25338 22792 23363 7578 -5020 -11453 -21022 -6235 21998 46356 70829 66527 69653
15496F9653k4379j6786k8511k5291L2058M3752k8415l3706p237J3581k1172j8929
$$ 69653 45274 28488 -23 -25314 6744 50496 22081 -11625 -18862 -5281 -26453 -45382
15484d5382Q568L8112J4484P166l936m5218Q080L2609K8091J7929m954n908J3316
$$ -45382 -36814 1298 15782 22948 19012 -26206 -18126 14483 42574 60503 55549 49641 62957
15471F2957j4891j4151k0381j9067j196m120r26P199l2736p689K4347O6316L3799
$$ 62957 48066 33915 13534 -5533 -6729 -10849 -11775 -4576 -37312 -45001 -20654 45662 79461
15458G9461j8997j3964j5247k4176J303o444k024o607o920P500K1353j8734k7092
$$ 79461 60464 46500 31253 7077 8380 1936 -88 -6695 -13615 -6115 15238 -3496 -30588
15445c0588k84K0432K4495N081k2730m817J0621j1429J4925K4824k2754l3347
$$ -30588 -30872 -10440 14055 19136 -3594 -8411 2210 -9219 5706 30530 7776 -25571
15433b5571N01J2458Q426O56K1237k151l36k2452O081J1153K906K79j3292j0985
$$ -25571 -25070 -12612 -4186 -3530 17707 15556 15220 -7232 -1151 10002 12908 13187 -105 -11090
15419a1090K1172J5464J0462l0187k0717j0652J5462Q333m518K0970q704l6699
$$ -11090 10082 25546 36008 5821 -14896 -25548 -10086 -1753 -6271 14699 5995 -30704
15407c0704J1480Q7K525j671k0380J686K0688p396J9546K4733r97J8017j2569
$$ -30704 -19224 -19137 -16612 -18283 -38663 -36977 -16289 -23685 -4139 20594 19597 37614 25045
15394B5045j5277P260l034R060k989k1797j5714M26J9877M2818O21k0645l9639
$$ 25045 9768 17028 13994 23054 20065 -1732 -17446 -17020 2857 45675 46296 25651 -13988
15381a3988J0400n717K279l6037J2097K0161M039K9784J7577j4238k3204o699
$$ -13988 -3588 -9305 -7026 -43063 -30966 -10805 -6766 23018 40595 26357 3153 -3546
15369c546M782P083J4460J4217k8576l211P572L054j4772K358J0309j382k7138
$$ -3546 1236 8319 22779 36996 8420 5209 12781 15835 1063 3421 13730 12348 -14790
15356a4790k8127K1718J6253K7062j4156k0791j557j9218l0762K6446L6469n973
$$ -14790 -42917 -21199 -4946 22116 7960 -12831 -14388 -33606 -64368 -37922 -1453 -7426
15344g426k1597k037k948n299J4996k1847j5874K2699J1590j826k8194j4249N3396
$$ -7426 -29023 -31060 -34008 -39307 -24311 -46158 -62032 -39333 -27743 -29569 -57763 -72012 -18616
15331a8616K0198j3728J2411j050J2915n899o672j5558j7177L241M730K6250j1231
$$ -18616 1582 -12146 265 -785 12130 6231 -441 -15999 -33176 -29935 -25205 1045 -10186
15318a0186O363N3p504J3304N110n592j6782K0491O596O735l2321n430L1132K3458
$$ -10186 -3823 -3770 -11274 2030 7140 1548 -15234 5257 11853 18588 -13733 -19163 11969 35427
15304C5427l710k2038q426j5317r478O7n963j9200K6432K2068k3772j6275m952
$$ 35427 31717 9679 1253 -14064 -23542 -23475 -29438 -48638 -22206 -138 -23910 -40185 -45137
15291d5137R80L6789L0162J0791k1288j3338J9098o123q602J1251q786j5773j3388
$$ -45137 -44157 -7368 22794 33585 12297 -1041 18057 11934 3332 14583 5797 -9976 -23364
15278b3364J8761K3582L1658l965l2389l921J5542l715o263l5047l0599k1242
$$ -23364 -4603 18979 50637 46672 14283 10362 25904 22189 15926 -19121 -49720 -70962
15266g0962K0100K3143K1262M15j2637N560J7323N414j1189J9128K1939j0364
$$ -70962 -50862 -27719 -6457 -6042 -18679 -13119 4204 9618 -1571 17557 39496 29132
15254B9132k505l963j0895l440k3097Q011L2948p278o578K7619J5622j3868n2756
$$ 29132 26627 22664 11769 8329 -14768 -6757 26191 18913 12335 39954 55576 41708 -11048
15241a1048M271K5993M526o08j1631m5938J9417K5398K7886k818l3318p739K4747
$$ -11048 -6777 19216 23742 23134 11503 -34435 -15018 10380 38266 35448 2130 -5609 19138
15228A9138K499j9511l4337P213l35l269K6375L463j5438k3265J7749J1139r231
$$ 19138 21637 2126 -32211 -24998 -25333 -28602 -2227 1236 -14202 -37467 -19718 -8579 -17810
15215a7810L080K2044J1440k003k2237j059k192L346M1482P286l2039k6856J6136
$$ -17810 -14730 7314 18754 16751 -5486 -6545 -8737 -5391 36091 43377 11338 -15518 618
15202F18K469k5740m718J5168J4890K620l0720n634J310O014k1113K8064K4452
$$ 618 3087 -22653 -27371 -12203 2687 5307 -25413 -31047 -29737 -23723 -44836 -16772 7680
15189G680K1251J9699j8084k6987j6841j8297J5939K6977p136r081k7803k5667
$$ 7680 28931 48630 30546 3559 -13282 -31579 -15640 11337 4201 -4880 -32683 -58350
15177e8350J0258J8431K9933j589J3924k7122k4095P272J4684M022M752j1772
$$ -58350 -48092 -29661 272 -1317 12607 -14515 -38610 -31338 -16654 -12632 -7880 -19652
15165a9652k0926p019J9894J6113j9092o768j1762r30J9324Q792k4447J4722Q983
$$ -19652 -40578 -47597 -27703 -11590 -30682 -37450 -49212 -50142 -30818 -22026 -46473 -31751 -22768
15152b2768J4773J7402Q58p944l00J02m836j2649r056j8073J863m279j5141J4036
$$ -22768 -7995 9407 10265 2321 2021 2123 -2713 -15362 -24418 -42491 -40628 -44907 -60048 -46012
15138d6012K8928M7329M071j462j4006k3046k6887Q423K2187L705L1659J3618
$$ -46012 -17084 30245 34316 32854 18848 -4198 -31085 -22662 -475 3230 34889 48507
15126D8507k6007n5009k6133K5422j209K2377j212j3434j2514m331R199l0570
$$ 48507 22500 -32509 -58642 -33220 -34429 -12052 -13264 -26698 -39212 -43543 -34344 -64914
15114f4914j8381J4603Q365J5666J3130j6441j2545R471m533p508p132J2665J3609
$$ -64914 -83295 -68692 -60327 -44661 -31531 -47972 -60517 -51046 -55579 -63087 -70219 -57554 -43945
15101d3945L3403M089m639P641J4540L9938n093k7500j389K3088k437Q4j4594
$$ -43945 -10542 -6453 -11092 -3451 11089 51027 45934 18434 17045 40133 37696 37780 23186
15088B3186k6764J9677J8762m0733j3181J2979K0822j4950J8569K25O071j7343
$$ 23186 -3578 16099 34861 -5872 -19053 -6074 14748 -202 18367 18592 24663 7320
15076G320K789Q001Q165l3436L17K3695O9k4267j8333o701q437K4160J5304k559
$$ 7320 10109 18110 26275 -7161 -6844 16851 16920 -7347 -25680 -32381 -40818 -16658 -1354 -3913
15062c913J0945L2324P007J7610j7361K6662q358m6063j7904M383M25P544q378
$$ -3913 7032 39356 46363 63973 46612 73274 64916 18853 949 5332 5757 13301 4923
15049D923O021j2416m499J6890L2402J476N330l0106k6289k1340J362m980k2642
$$ 4923 10944 -1472 -5971 10919 43321 44797 50127 20021 -6268 -27608 -26246 -31226 -53868
15036e3868q480J0167J5444L2786p347k0q155J0469J2089n761Q380l3954J3768
$$ -53868 -62348 -52181 -36737 -3951 -11298 -11318 -19473 -9004 3085 -2676 5704 -28250 -14482
15023a4482j5558j5287P393q693L4548J8861R895j3374j1713k8462l3533j5921
$$ -14482 -30040 -45327 -37934 -46627 -12079 6782 16677 3303 -8410 -36872 -70405 -86326
15011h6326L571L7130K9995P825J1944j464K0920r191n750O740J52K392j7k7313
$$ -86326 -82755 -45625 -15630 -7805 4139 2675 23595 14404 8654 15394 15546 17938 17921 -9392
14997i392N316o672l0866j921J2760K8117K0771k1641r332j5265j771R335L275
$$ -9392 -4076 -10748 -41614 -43535 -30775 -2658 18113 -3528 -12860 -28125 -29896 -20561 -17286
14984a7286q516J3244K8650J408R173J5971k8966k8723Q340O989J5646J0896k6445
$$ -17286 -25802 -12558 16092 17500 26673 42644 13678 -15045 -6705 284 15930 26826 381
14971C81k446p34j4144j3513K2023R792k6014o239K4435K7922j5326k1775j939
$$ 381 -2065 -2799 -16943 -30456 -8433 1359 -24655 -30894 -6459 21463 6137 -15638 -17577
14958a7577r157P371J1595O048J642J158j6352K476N414J2358j518j3679k5891
$$ -17577 -26734 -19363 -7768 -1720 -78 1080 -15272 -12796 -7382 4976 3458 -10221 -36112
14945c6112P284K6633m188j2640J1237L0922J5802N080j2998j1738k8783k1768
$$ -36112 -28828 -2195 -6383 -19023 -7786 23136 38938 44018 31020 19282 -9501 -31269
14933c1269O069M319j2701J9381L6784L3867l736k9538N381j4769l2911J2403
$$ -31269 -25200 -20881 -33582 -14201 22583 56450 52714 23176 28557 13788 -19123 -6720
14921f720j9924p654J9277P537j026r041K0081J2254n819j868k127r372k4684
$$ -6720 -26644 -34298 -15021 -7484 -8510 -17551 2530 14784 8965 7097 4970 -4402 -29086
14908b9086k2845m683J2170K0097J2441J7072J0627J828j3694k386j0218j2959
$$ -29086 -51931 -56614 -44444 -24347 -11906 5166 15793 17621 3927 1541 -8677 -21636
14896b1636p194k450J0151l2560j5195p701L1580K5145o95J0781q838n417J7027
$$ -21636 -28830 -31280 -21129 -53689 -68884 -76585 -45005 -19860 -20555 -9774 -18612 -24029 -7002
14883g002j0509J2457K2928o720k8799L249O181P339j969l4953r157J0801m379
$$ -7002 -17511 -5054 17874 11154 -17645 -14396 -8215 -876 -2845 -37798 -46955 -36154 -40533
14870d0533Q577M169Q027p106j5800K6424K4276J8852j9871k0221o535J902j3920
$$ -40533 -31956 -27787 -19760 -26866 -42666 -16242 8034 26886 7015 -13206 -19741 -17839 -31759
14857c1759J1557O835Q665N027N406J0923J811j2155j9645P458l3Q065j186m349
$$ -31759 -20202 -13367 -4702 325 5731 16654 18465 6310 -13335 -5877 -5910 2155 969 -3380
14843c380K0786K8281L402j0054J9847K400j5179J1027j2429L55k2014j644p402
$$ -3380 17406 45687 49089 39035 58882 61282 46103 57130 44701 45056 23042 21398 13996
14830A3996j2310q58R968j3010l2992j3842K5666m643K1797J7287j337k1546j0425
$$ 13996 1686 828 10796 -2214 -35206 -49048 -23382 -28025 -6228 11059 9722 -11824 -22249
14817b2249J3848m291M087j7266o841k1458P068K9405L2224k7206K496J275M188
$$ -22249 -8401 -12692 -8605 -25871 -32712 -54170 -47102 -17697 14527 -12679 -10183 -8908 -4720
14804d720N140l0211k4428q477o03j1420J4298K5590J2260M308q727j3943k7364
$$ -4720 420 -29791 -54219 -62696 -63299 -74719 -60421 -34831 -22571 -18263 -26990 -40933 -68297
14791f8297J326J8757j2364M35K9144J8350K0762K110j231j450J1886N698l017
$$ -68297 -66971 -48214 -60578 -60143 -30999 -12649 8113 10223 8992 7542 19428 25126 22109
14778B2109j5240l9972j3304L8503J1116k6232O059L3703o415l1245r676J1542
$$ 22109 6869 -33103 -46407 -7904 3212 -23020 -16961 16742 10327 -20918 -30594 -19052
14766a9052K6417k2067k9088R616J3584L0966J8188j0227j1823J8704R718j1756
$$ -19052 7365 -14702 -43790 -34174 -20590 10376 28564 18337 6514 25218 34936 23180
14754B3180R899r551J2321R333q28j1797L066L28L547k3591K16K6167l9077R443
$$ 23180 33079 23528 35849 45182 44354 32557 35623 35951 39498 15907 16123 42290 3213 12656
14740A2656J3483j0536M562j5454j2461r14k0376k341j3922K0058L959J8367N702
$$ 12656 26139 15603 20165 4711 -7750 -8664 -29040 -31381 -45303 -25245 -21286 -2919 2783
14727B783R818r440m6877j2370K7586K8251m142J2396L642k578K4599j2746j1200
$$ 2783 12601 3161 -43716 -56086 -28500 -249 -4391 8005 11647 9069 33668 20922 9722
14714I722o694k2877k8043L1259J2088k7641R274J9409k7608j9944J3807K7159
$$ 9722 3028 -19849 -47892 -16633 -4545 -32186 -22912 -3503 -31111 -51055 -37248 -10089
14702a0089K2961j0354k6494K7699J5320l3738O393K3517J3627k9012j5606j1706
$$ -10089 12872 2518 -23976 3723 19043 -14695 -8302 15215 28842 -170 -15776 -27482
14690b7482k8763K7367J3626J805J2714o647m247K2270J3600J7632R24m315j3374
$$ -27482 -56245 -28878 -15252 -13447 -733 -7380 -11627 10643 24243 41875 42799 38484 25110
14677B5110J9663j3381j3918J6326J4933p629j1713J3704J6277q429j4020m9334
$$ 25110 44773 31392 17474 33800 48733 41104 29391 43095 59372 50943 36923 -12411
14665a2411P399K2768j3612J2777J5700k4965j3283K29o997K9666K2548m225j4189
$$ -12411 -5012 17756 4144 16921 32621 7656 -5627 -5398 -12395 17271 39819 35594 21405
14652B1405j1062j7649n778O372N245J0029o287P730j110K633l3401J7563Q941
$$ 21405 10343 -7306 -13084 -6712 -1467 8562 2275 10005 8895 11528 -21873 -4310 4631
14639D631l213k1974K1889K9548J6273r978k9470J9064J8781k9679j8773j4167
$$ 4631 1418 -20556 1333 30881 47154 37176 7706 26770 45551 15872 -2901 -17068
14627a7068n60r900k3436K1978m291M1668P490j525q212j8908J3384J8707j1490
$$ -17068 -17628 -27528 -50964 -28986 -33277 8391 15881 14356 6144 -12764 620 19327 7837
14614G837R668q903k039J0765k346n21k219j9561n392l4631Q906N8862Q461k5605
$$ 7837 17505 8602 6563 17328 14982 14461 12242 -7319 -12711 -47342 -38436 20426 28887 3282
14600C282r520r036j6950l0802K9106M385J5885M938m014J0489J5979q754l1978
$$ 3282 -6238 -15274 -32224 -63026 -33920 -29535 -13650 -8712 -12726 -2237 13742 4988 -26990
14587b6990N868N718J994P451K7620r728j2840j4305m253m253J683O998k010n554
$$ -26990 -21122 -15404 -13410 -5959 21661 11933 -907 -15212 -19465 -23718 -22035 -15037 -17047 -22601
14573b2601R810m80J954K9945j6362j8427J6219K2271k927o074J7883K4446n81
$$ -22601 -12791 -13271 -11317 18628 2266 -16161 58 22329 19402 13328 31211 55657 55076
14560E5076j3392k0369k4296K975J0483j22j4579Q619R160K4837n195j3138n746
$$ 55076 41684 21315 -2981 -6 10477 10355 -4224 4395 13555 38392 33197 20059 14313
14547A4313J3599j4698o087K2407Q415J7455K0607k1952k1620q871K1236J3821
$$ 14313 27912 13214 7127 29534 37949 55404 76011 54059 32439 23568 44804 58625
14535E8625l2188k1133l2743O575L5212K7835L113j1744p605k5439J0632p988
$$ 58625 26437 5304 -27439 -20864 14348 42183 45296 33552 25947 508 11140 3152
14523C152k7270k4851j318K4083j0567K930m572J990p526Q846L2436P046O483
$$ 3152 -24118 -48969 -50287 -26204 -36771 -33841 -38413 -36423 -43949 -35103 -2667 4379 10862
14510A0862n251k7912n356k848J8863J1368K0665L187l6673k069p97l1924J0304
$$ 10862 5611 -22301 -27657 -30505 -11642 -274 20391 23578 -13095 -15164 -15961 -47885 -37581
14497c7581J3814j1477o151q411J362J5178J3017K0635J9805R053j4877j6590
$$ -37581 -23767 -35244 -41395 -49806 -48444 -33266 -20249 386 20191 29244 14367 -2223
14485b223k3148q189J6791j659L555j6990K71J4097K6321K7007k7327o2864k797
$$ -2223 -25371 -33560 -16769 -18428 -14873 -31863 -31592 -17495 8826 35833 8506 -54358 -57155
14472e7155L425j7403J1509J171O586J7907K4679J1472J1362M007j77M28k3473
$$ -57155 -53730 -71133 -59624 -58453 -51867 -33960 -9281 2191 13553 17560 17383 17811 -5662
14459e662J718k9130k3696Q879K2898O16j0020J8756R282L0927P695j2836p032
$$ -5662 -3944 -33074 -56770 -47891 -24993 -24377 -34397 -15641 -6359 24568 32263 19427 12395
14446A2395J2217k2170j9766Q411l1174m2462k848L8578K7774J4375Q668l231
$$ 12395 24612 2442 -17324 -8913 -40087 -82549 -85397 -46819 -19045 -4670 3998 767
14434G67j8262k2514K4593M3633r439Q074J1930J4574j3329N599P418k2930l2088
$$ 767 -17495 -40009 -15416 28217 18778 26852 38782 53356 40027 45626 53044 30114 -1974
14421a974M410K3370J6933o271q341m3310k4868N999K1790K805J0942o965k2830
$$ -1974 2436 25806 42739 36468 28127 -15183 -40051 -34052 -12262 -9457 1485 -5480 -28310
14408b8310q633j3573j5114M808K7417P660m822K739j7850K241J6452L3419J0975
$$ -28310 -36943 -50516 -65630 -60822 -33405 -25745 -30567 -27828 -45678 -43437 -26985 6434 17409
14395A7409N81R42k7183p689J438r682J595l680K8724j964k0140J5754l724k1243
$$ 17409 17990 18932 -8251 -15940 -14502 -24184 -22589 -26269 2455 491 -19649 -3895 -7619 -28862
14381b8862R810P460j7062J1070K1439J0602o416O138k4624O111J7251j0470k0196
$$ -28862 -19052 -11592 -28654 -17584 3855 14457 8041 14179 -10445 -4334 12917 2447 -17749
14368a7749j018j0373q071K683K2633p585k2055r753L4627J7901J1215J4696P36
$$ -17749 -18767 -29140 -37211 -34528 -11895 -19480 -41535 -51288 -16661 1240 12455 27151 27887
14355B7887k5467J7713K6898k6645k2914l0320R472M6208J3201J3916k4334r420
$$ 27887 2420 20133 47031 20386 -2528 -32848 -23376 22832 36033 49949 25615 16195
14343A6195l66j2335l157j408R896p381k0939J7390J0286L934j0191J1758M828
$$ 16195 15829 3494 337 -1071 8825 1444 -19495 -2105 8181 12115 1924 13682 18510
14330A8510p474l1469N788L4519K436o00k7997K499J0306M746K399l668J29K2604
$$ 18510 11036 -20433 -14645 19874 22310 21710 -6287 -3788 6518 11264 13663 9995 10124 32728
14316C2728K2482k8948k1249j1282l711J3858J7133j3987l3941J6626j1254r292
$$ 32728 55210 26262 5013 -6269 -9980 3878 21011 7024 -26917 -10291 -21545 -30837
14304c0837j568j3822j3788K5173K9919K5049L7225j198k3066p813J6120J4950
$$ -30837 -32405 -46227 -60015 -34842 -4923 20126 57351 56153 33087 25274 41394 56344
14292E6344O289l5129l2104K8520K030k786O04q799L14j7639k2132k6497l22J5019
$$ 56344 62633 27504 -4600 23920 25950 23164 23768 14969 15283 -2356 -24488 -50985 -51307 -36288
14278c6288L9914J2374j8428K2635K5939k7613k7181j2617L572j0961P887L7176
$$ -36288 3626 16000 -2428 20207 46146 18533 -8648 -21265 -17693 -28654 -20767 16409
14266A6409K3788j229k1076j7774J0887o62r125J9808J5911j7945j96j2676k334
$$ 16409 40197 38968 17892 118 11005 10343 1218 21026 36937 18992 18796 6120 3786
14253C786J4971J4336m341n93J3586N129q834L729q093j1617O479j2697j5432
$$ 3786 18757 33093 28752 28159 41745 46874 38040 41769 33676 22059 28538 15841 409
14240D09k7671p581J7828J4316L8776R476l1007N803N907l7635l1126J9580l538
$$ 409 -27262 -34843 -17015 -2699 36077 45553 14546 20349 26256 -11379 -42505 -22925 -26463
14227b6463M646M522K9506m097Q373p844M901J1939k2698j5849j8055j9479J7558
$$ -26463 -21817 -17295 12211 8114 16487 8643 13544 25483 2785 -13064 -31119 -50598 -33040
14214c3040K784j2191l0343L2234N0986L0982l396k3427r308j7707j4136l365
$$ -33040 -30256 -42447 -72790 -40556 10430 41412 38016 14589 5281 -12426 -26562 -29927
14202b9927q042L256L2069K6466O536J1004j2636o1169J485J6682j254j2719o840
$$ -29927 -37969 -34713 -2644 23822 30358 41362 28726 -32443 -30958 -14276 -15530 -28249 -35089
14189c5089J8004M3789J900j8995o474j5847p485N396J533O754L382l783J137
$$ -35089 -17085 26704 28604 9609 3135 -12712 -20197 -14801 -13268 -6514 -3132 -6915 -5778
14176e778J5448N522Q462q473j9758Q546K9168J3191k5309J1500K7846o594k5375
$$ -5778 9670 15192 23654 15181 -4577 3969 33137 46328 21019 32519 60365 53771 28396
14163B8396N342k330k4413l0088Q186m754j3557N187J5265n2409J9476n688J10
$$ 28396 33738 31408 6995 -23093 -14907 -19661 -33218 -28031 -12766 -65175 -45699 -51387 -51277
14150e1277N950j4109L126j0315R726N6n699J8772K4042j153k3031j9871j6407
$$ -51277 -45327 -59436 -56310 -66625 -56899 -56843 -62542 -43770 -19728 -20881 -43912 -63783 -80190
14137h0190J2865L077L5511J6467k5844j2754K7134K9856j506q223j730J9894
$$ -80190 -67325 -64248 -28737 -12270 -38114 -50868 -23734 6122 4616 -3607 -5337 14557
14125A4557J4981K4469j2168k8961j1381j0627P198J436p841L0176j1853j1385
$$ 14557 29538 54007 41839 12878 1497 -9130 -1932 -496 -8337 21839 9986 -1399
14113a399Q594J5127P508m643o931m1391k738P543O613J3412p457L087j791L2802
$$ -1399 7195 22322 29830 25187 18256 -23135 -25873 -18330 -11717 1695 -5762 -2675 -4466 28336
14099B8336n239j4338m547j3286M619j2183L964r663k0802J9017L123Q185J6902
$$ 28336 23097 8759 4212 -9074 -4455 -16638 -12674 -22337 -43139 -24122 -20999 -12814 4088
14086D088L700J0423j6243j272J1481J812n161l7764L95K2646k204l3108p867
$$ 4088 7788 18211 1968 696 12177 13989 8828 -28936 -28541 -5895 -8099 -41207 -49074
14073d9074j0252m407j521M650M4126l17J877J3751k0543j9153M86N574J5531
$$ -49074 -59326 -63733 -65254 -60604 -16478 -16795 -14918 -1167 -21710 -40863 -40377 -34803 -19272
14060a9272L306J0564R335m5738q488J1995K9845j238o185j0014N3236K3839r046
$$ -19272 -15966 -5402 3933 -41805 -50293 -38298 -8453 -9691 -15876 -25890 27346 51185 42139
14047D2139k4371j6346k8213J538K3876J8657o559j8121j6349j2718R99M236L7925
$$ 42139 17768 1422 -26791 -25253 -1377 17280 10721 -7400 -23749 -36467 -35468 -31232 6693
14034F693K2168k4358j2032J6852j9561k6016j429M8048L409J6080N176n106k1552
$$ 6693 28861 4503 -7529 9323 -10238 -36254 -37683 10365 13774 29854 35030 29924 8372
14021H372n318K1892k2422j0702o99j3303J0979J1913P723R247j5525n8096l3300
$$ 8372 3054 24946 2524 -8178 -8877 -22180 -11201 712 8435 17682 2157 -55939 -89239
14008h9239J2336M487M0757L2656j492j6823l796Q039j4791R608K774J9869ok4099
$$ -89239 -76903 -72416 -31659 997 -495 -17318 -21114 -13075 -27866 -18258 -15484 4385 4379 -19720
13994a9720J0728J4620p858L764L335M08K3606n704j9073k781o779J124J8057
$$ -19720 -8992 5628 -2230 1534 4869 5277 28883 23179 4106 1325 -5454 -4330 13727
13981A3727J6322j3923J4106n801k6887k3434k114P390j148K8187j0055l558J8393
$$ 13727 30049 16126 30232 24431 -2456 -25890 -28004 -20614 -21762 6425 -3630 -7188 11205
13968A1205j8405q041n998K494N973J7234J857k4067j5836O747k480o375J4722
$$ 11205 -7200 -15241 -21239 -18745 -12772 4462 6319 -17748 -33584 -26837 -29317 -35692 -20970
13955b0970K6917J4106M288j3224k2984k2582p059K6313K1943j3475j1991k2354
$$ -20970 5947 20053 24341 11117 -11867 -34449 -41508 -15195 6748 -6727 -18718 -41072
13943d1072M568M2522m08j4176J875j0443q506L142K7425O688k0355l337j0025
$$ -41072 -36504 6018 5610 -8566 -6691 -17134 -25640 -22498 4927 11615 -8740 -12077 -22102
13930b2102K190K3375R117N7k2502J0755L9937j3774k944j7443k2332j0644q103
$$ -22102 -19912 3463 12580 12637 -9865 890 40827 27053 24109 6666 -15666 -26310 -34413
13917c4413j1036J2151K9821L936j0419M046J2603j1262j946L366l13J0857q292
$$ -34413 -45449 -33298 -3477 459 -9960 -5914 6689 -4573 -6519 -3153 -3466 7391 -901
13904i01L648P416J503l007k9817L2297L4357j4514n094P709O299j9398j3856
$$ -901 2747 10163 11666 8659 -21158 11139 45496 30982 25888 33597 39896 20498 6642
13891F642j2523M905j2686J4051K4291l74j9212l614R589J3049k5715j5009n657
$$ 6642 -5881 -976 -13662 389 24680 24306 5094 1480 11069 24118 -1597 -16606 -22263
13878b2263j3173R264L0233l711J9753J3695j817o04k0657j969j1183n502o658
$$ -22263 -35436 -26172 4061 350 20103 33798 31981 31377 10720 8751 -2432 -7934 -14592
13865a4592j5348l769R991k213j5487J4150L34J0983M512j349L3149K7461J3045
$$ -14592 -29940 -33709 -23718 -25931 -41418 -27268 -26934 -15951 -11439 -12788 20361 47822 60867
13852F0867m298k8081k2113o353P718J5187m8992m4018J3649R656Q504J6115K5043
$$ 60867 56569 28488 6375 22 7740 22927 -26065 -70083 -56434 -46778 -38274 -22159 2884
13839B884L1412K6498P69m0436m5217j8416R040K2799K360O758l3618M732l069
$$ 2884 34296 60794 61563 21127 -24090 -42506 -33466 -10667 -8307 -1549 -35167 -30435 -33504
13826c3504k43l1557q089N4642M0570J984j9022j4702q886k7678J2683K4306j134
$$ -33504 -33747 -65304 -73393 -18751 21819 23803 4781 -9921 -18807 -46485 -33802 -9496 -10630
13813a0630j1693K9443K270j8510M270P312j0269n231M220K3579j8270k7503K8315
$$ -10630 -22323 7120 9390 -9120 -4850 2462 -7807 -13038 -8818 14761 -3509 -31012 -2697
13800b697Q672j2324m675N633O22j544N74J9509K6421q900l613L8942q88l3458
$$ -2697 5975 -6349 -11024 -5391 -4769 -6313 -5739 13770 40191 31291 27678 66620 65732 32274
13786C2274n7837j8423l578J2408k618L6597L1028n221j5376j4189m554O683K0168
$$ 32274 -25563 -43986 -47564 -35156 -37774 -1177 29851 24630 9254 -4935 -9489 -2806 17362
13773A7362l294l4509k5547n511O809j1379L9738J4237k0004j2375J3577j8751
$$ 17362 14068 -20441 -45988 -51499 -44690 -56069 -16331 -2094 -22098 -34473 -20896 -39647
13761c9647j5726J7764K7971J3978m295k3040j648J2264j152o095j2113L2473
$$ -39647 -55373 -37609 -9638 4340 45 -22995 -24643 -12379 -13531 -19626 -31739 734
13749G34N4751Q361R37l509m622j8724j9259m526j0958j8628L414Q169o108k4888
$$ 734 55485 63846 64783 61274 56652 37928 18669 14143 3185 -15443 -12029 -3860 -9968 -34856
13735c4856J3731K3007k8379l719m841J5161R106l0549O875K0069J1665j1547
$$ -34856 -21125 1882 -26497 -30216 -35057 -19896 -10790 -41339 -34464 -14395 -2730 -14277
13723a4277l430k5731l9467k5556J2190J2635K6404J2280L046L9612N313j4703
$$ -14277 -17707 -43438 -82905 -108461 -96271 -83636 -57232 -44952 -41906 -2294 3019 -11684
13711a1684k4067j313J5290J8021K8743K815J1753L999J3492j1212j3561l3031
$$ -11684 -35751 -37064 -21774 -3753 24990 27805 39558 43557 57049 45837 32276 -755
13699g55k8233J3486K1555P043J6113N29k9851j2190L122Q071N185K067l5847
$$ -755 -28988 -15502 6053 13096 29209 29738 -113 -12303 -9181 -1110 4075 6142 -29705
13686b9705l206J9177K5510J6508k7398j6300J0027L4418j4263l5278J0858J0710
$$ -29705 -32911 -13734 11776 28284 886 -15414 -5387 29031 14768 -20510 -9652 1058
13674A058J9529l027k182M852K017l3969k7850P262N094k297J7081L220K544l8201
$$ 1058 20587 17560 15378 20230 22247 -11722 -39572 -32310 -27216 -29513 -12432 -9212 -6668 -44869
13660d4869o595J9319J2085J5907J4351k3021k0689K3749n970j3450r360K0661
$$ -44869 -51464 -32145 -20060 -4153 10198 -12823 -33512 -9763 -15733 -29183 -38543 -17882
13648a7882L0704J0554p522k4313j7085j6985j7059k090j9973M019J1432K6150
$$ -17882 12822 23376 15854 -8459 -25544 -42529 -59588 -61678 -81651 -77632 -66200 -40050
13636d0050J3576J3350L1756P772l3933j0037J0532j65k8887R807K2072r84j1133
$$ -40050 -26474 -13124 18632 26404 -7529 -17566 -7034 -7199 -36086 -26279 -4207 -5191 -16324
13623a6324M357J132j4473Q521n612J6477q73J8956J5539q241j7051m575L3341
$$ -16324 -11967 -10835 -25308 -16787 -22399 -5922 -6795 12161 27700 19459 2408 -2167 31174
13610C1174K0973L46j7579j3066r197n798m567m326j7228j5491N097J4248j8784
$$ 31174 52147 52493 34914 21848 12651 6853 2286 -2040 -19268 -34759 -29662 -15414 -34198
13597c4198j9959J1275L149N669m371O666j4156M943R943O178K3098j0985j7093
$$ -34198 -54157 -42882 -39733 -34064 -38435 -31769 -45925 -40982 -31039 -24861 -1763 -12748 -29841
13584b9841Q737j6863N878M0064J3168j1507J9026R082j6452l0959r974j9844
$$ -29841 -21104 -37967 -32089 7975 21143 9636 28662 37744 21292 -9667 -19641 -39485
13572c9485j799K0852K892N248N155m277M712K7957J6464j9585j5017j8932J0674
$$ -39485 -41284 -20432 -17540 -12292 -7137 -11414 -6702 21255 37719 18134 3117 -15815 -5141
13559e141J9795J7830Q073j4507J288K3564R356j890k2364k4219J0793J800J238
$$ -5141 14654 32484 40557 26050 27338 50902 60258 58368 36004 11785 22578 24378 25616
13546B5616r667Q046j751n996k5644k660j5034j5538L4485L8612j276l3809j6105
$$ 25616 15949 23995 22244 16248 -9396 -12056 -27090 -42628 -8143 30469 29193 -4616 -20721
13533b0721R236K3375N192J5037R950m2799j5514J4057M119j9600m219J8009j8704
$$ -20721 -11485 11890 17082 32119 42069 -730 -16244 -2187 1932 -17668 -21887 -3878 -22582
13520b2582J5949j6710O042M3210K1229k0737k5290J475k312j4737q593Q932J3233
$$ -22582 -6633 -23343 -17301 25909 47138 26401 1111 2586 274 -14463 -23056 -14124 -891
13507h91O065Q714l419m1549l217L2698Q798k4798l417K5585j3279j4690m570
$$ -891 5174 13888 10469 -31080 -34297 -1599 7199 -17599 -21016 4569 -8710 -23400 -27970
13494b7970J2964J7366J4354O635M243k0929M478L978r766J335j6534k9432j898
$$ -27970 -15006 2360 16714 23349 27592 6663 11141 15119 5353 6688 -9846 -39278 -41176
13481d1176L9303R887J247k5452j0595M608K3036l248O694J785o370K689j2398
$$ -41176 -1873 8014 9261 -16191 -26786 -22178 858 -2390 4304 6089 -281 2408 -9990
13468i990m873K0374J9305r44k1733j6116J6844O943o18k9070r186K0735J170
$$ -9990 -14863 5511 24816 23872 2139 -13977 2867 9810 9192 -19878 -29064 -8329 -7159
13455g159j1200J1260j6592j8204J0089N5630J9477j5528k581M890l840k7073
$$ -7159 -18359 -7099 -23691 -41895 -31806 23824 43301 27773 25192 30082 26242 -831
13443h31k3359r654N602M672K6125K0198J6727J101j7989j6614P187P926R730
$$ -831 -24190 -33844 -28242 -23570 2555 22753 39480 40581 22592 5978 13165 21091 30821
13430C0821Q304m867k2439K1324j409j1421N373j9862k6650j2367L0878P2J9129
$$ 30821 39125 34258 11819 33143 31734 20313 25686 5824 -20826 -33193 -2315 -2243 16886
13417A6886M3660q005m1429k6524j3052Q047k8467l5904L1075K2228J1127Q929
$$ 16886 60546 52541 11112 -15412 -28464 -20417 -48884 -84788 -53713 -31485 -20358 -11429
13405a1429J3501j0583k5658J3431J9703q102J8026J041j5804P997L0272J1423
$$ -11429 2072 -8511 -34169 -20738 -1035 -9137 8889 9930 -5874 2123 32395 43818
13393D3818j2471o275j1716k0269n143N029j5567r930Q430p483n406J2304K1668
$$ 43818 31347 25072 13356 -6913 -12056 -7027 -22594 -32524 -24094 -31577 -36983 -24679 -3011
13380c011J5576k0393j0165j6902J5514J1992j8735P970K5452j7497j9K3589J287
$$ -3011 12565 -7828 -17993 -34895 -19381 -7389 -26124 -18154 7298 -10199 -10218 13371 14658
13367A4658q111L4549J5407k6417R903m361n47J3179p099k3079J7227k0256l3056
$$ 14658 6547 41096 56503 30086 39989 35628 35081 48260 41161 18082 35309 15053 -18003
13354a8003k1942r321P972L3715J8057k35L589J1910O910q517r155M206k913O393
$$ -18003 -39945 -49266 -41294 -7579 10478 10243 13832 25742 32652 24135 14980 19186 16273 22666
13340B2666o243J3725k0280l7314L1766K5563j2189K8277K1863j1561m3706k6332
$$ 22666 16423 30148 9868 -27446 4320 29883 17694 45971 67834 56273 12567 -13765
13328a3765K9726N096k3148J5436J5580j6544J463n626l0611K2311K2095M372
$$ -13765 15961 21057 -2091 13345 28925 12381 13844 8218 -22393 -82 22013 26385
13316B6385o430m4741k4617P727m75J9191K3319l9454Q598q380p093J9525Q904
$$ 26385 19955 -24786 -49403 -41676 -42151 -22960 359 -39095 -30497 -38877 -45970 -26445 -17541
13303a7541n027j5429L224J8810O559J1937m694r852k3854j028K1511l106J0524
$$ -17541 -22568 -37997 -34773 -15963 -9404 2533 -2161 -12013 -35867 -36895 -15384 -18490 -7966
13290g966q604l3437J1860K5558K0597J7117j4268k503P16k6576j4282K6043K1838
$$ -7966 -16570 -50007 -38147 -12589 8008 25125 10857 8354 9070 -17506 -31788 -5745 16093
13277A6093L291l0475k5846J2041K7174J3194J9304M9253k454l6353j4827j9725
$$ 16093 19384 -11091 -36937 -24896 2278 15472 34776 84029 81575 45222 30395 10670
13265A0670r57o788J1949R637q937j864k4168K1996J1937o706J3999K636j3954
$$ 10670 9713 2925 14874 24511 15574 13710 -10458 11538 23475 16769 30768 33404 19450
13252A9450J024l2185j498K5232J0627J2273R555j938k8407M81J3989M95q947
$$ 19450 20474 -11711 -13209 12023 22650 34923 44478 42540 14133 14614 28603 29098 20151
13239B0151O374j7523N61j8331r376N43o891K0350L542k3476j0324M978K1381
$$ 20151 26525 9002 9563 -8768 -18144 -17601 -24492 -4142 -600 -24076 -34400 -29422 -8041
13226h041K4332J2520K300P571j3398k790p570j8419l3303K017n262r569K6912
$$ -8041 16291 28811 31111 38682 25284 22494 14924 -3495 -36798 -34781 -40043 -49612 -22700
13213b2700O392L4031j61l7131k5764R827K3970J0679l2597p259J9285M681K0180
$$ -22700 -16308 17723 17562 -19569 -45333 -35506 -11536 -857 -33454 -40713 -21428 -16747 3433
13200C433J2741O657K8673J209k0323j5151j3017l867j0634k5372K357L3763K0029
$$ 3433 16174 22831 51504 52713 32390 17239 4222 355 -10279 -35651 -33294 469 20498
13187B0498J8740J1203K665O116j651R13k6332r144O072j3092k304q556R499j8578
$$ 20498 39238 50441 53106 59222 57571 58484 32152 23008 29080 15988 13684 5128 14627 -3951
13173c951m792L3388j4454N600n573j3910K3525l705m370L430K0776J9562j7566
$$ -3951 -8743 24645 10191 15791 10218 -3692 19833 16128 11758 15188 35964 55526 37960
13160C7960l1441n047M408l808k1582n391K0793r794L3824J8876O713J6983m6929
$$ 37960 6519 1472 5880 2072 -19510 -24901 -4108 -13902 19922 38798 45511 62494 15565
13147A5565j9681J9719j3424K533l574J9829K5877J3240j9991J7036J82m733k0019
$$ 15565 -4116 15603 2179 4712 1138 20967 46844 60084 40093 57129 57311 52578 32559
13134C2559k2779K2420k858k3758Q09O197J073L53j2257r94J0966J8620K3390
$$ 32559 9780 32200 29342 5584 6393 12590 13663 14016 1759 765 11731 30351 53741
13121E3741o106l6647m6043n764K6260Q85k047K3514R605J8084L1624o754k6844
$$ 53741 47635 10988 -35055 -40819 -14559 -13674 -15721 7793 17398 35482 67106 60352 33508
13108C3508J2496O336L223k8392n405J009k229n990O124k0533P160K1640k2979
$$ 33508 46004 52340 55563 27171 21766 22775 20546 14556 20680 147 7307 28947 5968
13095E968k3032m046R681L3261O201O812m887l146j6782k2819J2543J8151l1185
$$ 5968 -17064 -21110 -11429 21832 28033 34845 29958 26812 10030 -12789 -246 17905 -13280
13082a3280k3402K1266J1966m333l0499m264K0196q011L704M777J0766q807j9947
$$ -13280 -36682 -15416 -3450 -7783 -38282 -42546 -22350 -30361 -26657 -21880 -11114 -19921 -39868
13069c9868q440K6162K1268J2680j4479K2505K5926j707j5136k3911o950K5929
$$ -39868 -48308 -22146 -878 11802 -2677 19828 45754 44047 28911 5000 -1950 23979
13057B3979J1632L363K037k4817j6585o141j1315k6541m777M237J2078K7402L6282
$$ 23979 35611 38974 41011 16194 -391 -6532 -17847 -44388 -49165 -44928 -32850 -5448 30834
13044C0834N566k1420j7605o671O115K0121J5107O368j3196k1814j3266J1652
$$ 30834 36400 14980 -2625 -9296 -3181 16940 32047 38415 25219 3405 -9861 1791
13032A791Q242k5744k1036J0981K5517L9002J7677j7834l0128j3080r041j945
$$ 1791 10033 -15711 -36747 -25766 -249 38753 56430 38596 8468 -4612 -13653 -15598
13020a5598K719K2330K6297L4589j3478n4484l2915K431R914J8107O386K5694
$$ -15598 -12879 9451 35748 70337 56859 2375 -30540 -28109 -18195 -88 6298 31992
13008C1992M20j8655k0728l629j4792J1962j4195N734L1055K8586k2537k5263
$$ 31992 32412 13757 -6971 -10600 -25392 -13430 -27625 -21891 9164 37750 15213 -10050
12996a0050p395j2360o922K4962N265J9004k1357l3806M014N1896P386j7058j1184
$$ -10050 -17445 -29805 -36727 -11765 -6500 12504 -8853 -42659 -38645 13251 20637 3579 -7605
12983g605J2797L9525J473j6129j9939k5224P781J483J1056K8970J6078m4468
$$ -7605 5192 44717 46190 30061 10122 -15102 -7321 -5838 5218 34188 50266 5798
12971E798n3501J3434M7932P015l0238J2627K1468j4859k0523K0278Q404o656
$$ 5798 -47703 -34269 13663 20678 -9560 3067 24535 9676 -10847 9431 17835 11179
12959A1179J472j2884k0064Q263J7289j9267j7033M8539L4033j6055j3119O731
$$ 11179 12651 -233 -20297 -12034 5255 -14012 -31045 17494 51527 35472 22353 29084
12947B9084r178k2323l5266J9273P011Q496q532j0191J0132L245K2116j3632K929
$$ 29084 19906 -2417 -37683 -18410 -11399 -2903 -11435 -21626 -11494 -8249 13867 235 3164
12934C164k5477q472J5291J2567k5375J1519J0959j816R018J5516k6012j8946
$$ 3164 -22313 -30785 -15494 -2927 -28302 -16783 -5824 -7640 1378 16894 -9118 -28064
12922b8064J9944M95o427L4409J1706J554J1076j213l9401j5544K503j0883P515
$$ -28064 -8120 -7625 -14052 20357 32063 33617 44693 43480 4079 -11465 -8962 -19845 -12330
12909a2330J0966j130R005p863k4052l6755L1802L0804j1325M6642K8986k9744
$$ -12330 -1364 -2494 6511 -1352 -25404 -62159 -30357 447 -10878 35764 64750 35006
12897C5006j9648J5191K982k4995n583J7444n704k6083J4613M2581J0812k123
$$ 35006 15358 30549 33531 8536 2953 20397 14693 -11390 3223 45804 56616 54493
12885E4493m2087o992L854j9638J2443J1198j4785K778J2349L2756k4863j3899
$$ 54493 12406 5414 9268 -10370 2073 13271 -1514 1264 13613 46369 21506 7607
12873G607Q184j7172J0157J6343j9170l4233J3209l010J5698J1094l0812O565
$$ 7607 15791 -1381 8776 25119 5949 -28284 -15075 -18085 -2387 8707 -22105 -15540
12861a5540L1124K2843l5731r505J6917O200r954j5118j9905J910j0318Q167N332
$$ -15540 15584 38427 2696 -6809 10108 16308 6354 -8764 -28669 -26759 -37077 -28910 -23578
12848b3578n22K7881L40r305j4169L112J2403l278L962J63j1012p076j2994J268
$$ -23578 -24100 3781 4121 -5184 -19353 -16241 -3838 -7116 -3154 -2991 -14003 -21079 -34073 -32805
12834c2805J6001M896l2769j8439J332K7337K1738J9388N6989J4456O802k6200
$$ -32805 -16804 -11908 -44677 -63116 -61784 -34447 -12709 6679 63668 78124 84926 58726
12822E8726k4990j4115l893r406O363r790p374K6504J7092r30L211m3890l3608
$$ 58726 33736 19621 15728 6322 12685 2895 -4479 22025 39117 38187 41398 -2492 -36100
12809c6100J8100J7187l797L4890J9702k1574K70J1620k941J4038r577j9843k1524
$$ -36100 -18000 -813 -4610 30280 49982 28408 28678 40298 37357 51395 41818 21975 451
12796D51j7537R340m541j5939R924K0906J9135K495r312j8202n926Q053K5468
$$ 451 -17086 -7746 -12287 -28226 -18302 2604 21739 24234 14922 -3280 -9206 -1153 24315
12783B4315J4217q22j4140k8197L0675R387n42j7672J3666J480p802K470J2658
$$ 24315 38532 37710 23570 -4627 26048 35435 34893 17221 30887 32367 24565 27035 39693
12770C9693j156j8443j2136J3719j5969j2015o643J0539P787Q148R134p706J4897
$$ 39693 38537 20094 7958 21677 5708 -6307 -12950 -2411 5376 13524 22658 14952 29849
12757B9849j1420o403q952p442J1019K0424J2986m030m1746k9536j174J4040k698
$$ 29849 18429 12026 3074 -4368 6651 27075 40061 36031 -5715 -35251 -36425 -22385 -25083
12744b5083j0253O287J1149K2071m048J6173P373J7089l00r723k605K138J0460
$$ -25083 -35336 -29049 -17900 4171 123 16296 23669 40758 40458 30735 28130 30268 40728
12731D0728J1219j8205j496K321k79l036o837j4381k1699M425j2143O832Q013
$$ 40728 51947 33742 32246 34567 34288 31252 24415 10034 -11665 -7240 -19383 -12551 -4538
12718d538p35O557L926N3k0637R849n330Q020J7906J6886k8896p832J4819m178
$$ -4538 -5273 1284 5210 5263 -15374 -5525 -10855 -2835 15071 31957 3061 -4771 10048 5870
12704E870o419q690J0395L9985n799k9099k7996J8416K4898N209N239n52j9246
$$ 5870 -549 -9239 1156 41141 35342 6243 -21753 -3337 21561 26770 32009 31457 12211
12691A2211k539L777K6978J2275j5819p218m27m990k4118n278L8951M1853J9471
$$ 12211 9672 13449 40427 52702 36883 29665 29238 24248 130 -5148 33803 75656 95127
12678I5127K49J381k5819k5725o835j2611J1742K5653J3417j7628j0310M968j320
$$ 95127 95376 96757 70938 45213 38378 25767 37509 63162 76579 58951 48641 53609 52289
12665E2289k2100N382m2265J5785J5603k829J1760m2521J777K7918p183j5733
$$ 52289 30189 35571 -6694 9091 24694 21865 33625 -8896 -7119 20799 13616 -2117
12653b117P120J0857J7006J0654j650k1747P964K2394p067J2538J7357r980m1518
$$ -2117 5003 15860 32866 43520 41870 20123 28087 50481 43414 55952 73309 63329 21811
12640B1811p585J3504J0265r761l083j8544J0151J7916K0898l7917n1464N257
$$ 21811 14226 27730 37995 28234 25151 6607 16758 34674 55572 17655 -33809 -28552
12628b8552L3509P035n698j6421N744J7035J1081k285k4836K4398L865J3308K0021
$$ -28552 4957 11992 6294 -10127 -4383 12652 23733 21448 -3388 21010 24875 38183 58204
12615E8204P530J7185J7596J0661J1491K0544k4698l2850j7002Q684j4755j9543
$$ 58204 65734 82919 100515 111176 122667 143211 118513 85663 68661 77345 62590 43047
12603D3047j2555J2472K8055J3250O902L482j1141k1082j6648j4045K2339O186
$$ 43047 30492 42964 71019 84269 91171 94653 83512 62430 45782 31737 54076 60262
12591F0262k3498j8260k5083Q449K0675n752J5227N641K2497J1210N696J0421
$$ 60262 36764 18504 -6579 1870 22545 16793 32020 37661 60158 71368 77064 87485
12579H7485o806j42j1042M284j3732L3079J3765O18J177J2844L6849J8341M2255
$$ 87485 80679 80537 69495 73779 60047 93126 106891 107509 108686 121530 158379 176720 218975
12566B18975M9973K1311m317n0274n4073r913k7723k2441k8746N577m613J1729
$$ 218975 268948 290259 285942 235668 181595 171682 143959 121518 92772 98349 93736 105465
12554A05465k866k1268k6571J2425l514k3100l354q621J1602J238K2094L1831
$$ 105465 102599 81331 54760 67185 63671 40571 37217 28596 40198 41436 63530 95361
12542I5361j1178l7128l469K6414J0991l636j2188M512O765R228l34L9087M7577
$$ 95361 84183 47055 43586 70000 80991 77355 65167 69679 76444 85672 85338 124425 172002
12529A72002j2785j2344K167K234j9517R941J3591M4020Q6444N5455q202m8516
$$ 172002 159217 146873 149040 151274 131757 141698 155289 199309 285753 341208 333006 284490
12517B84490p5044k8997q739j665j1792j9236l2996k5673l4006J9095L3900l2627
$$ 284490 209446 180449 171710 170045 158253 139017 106021 80348 46342 65437 99337 66710
12505F6710j0322J2662Q727M48k3610M415J7672k575k546N953P783L736J550N994
$$ 66710 56388 69050 77777 78225 54615 59030 76702 74127 71581 77534 85317 89053 90603 96597
12491I6597n553R128J8207L246R467o926j5913o207L366R621q492j7542L0510
$$ 96597 91044 100172 118379 121625 131092 124166 108253 102046 105412 115033 106541 88999 119509
12478A19509L7733K1462N688N19j9209m9958m9099n556J3909j1689K7111J231
$$ 119509 157242 178704 184392 184911 165702 115744 66645 61089 74998 63309 90420 91651
12466I1651k9436L319K7763L251j319J790j958l444L571K5136k236j8401j9196
$$ 91651 62215 65534 93297 96548 95229 97019 95061 91617 95188 120324 118088 99687 80491
12453H0491P9K4114j1795k2168R368K5307M072m932j3696K2391K8687J2737r032
$$ 80491 80570 104684 92889 70721 80089 105396 109468 104536 90840 113231 141918 154655 145623
12440A45623k7763l035j2912k1354q221P266K2655j6257j1810j147j2971J2027
$$ 145623 117860 114825 101913 80559 72338 79604 102259 86002 74192 73045 60074 72101
12428G2101L2472o278J2673j5830Q226J0071k6395k7994j6914K2417K3417N295
$$ 72101 104573 98295 110968 95138 103364 113435 87040 59046 42132 64549 87966 93261
12416I3261m439L787Q015J2677m009N77J4764j0868k5281N311J2702k6053J6442
$$ 93261 88822 92609 100624 113301 109292 109869 124633 113765 88484 93795 106497 80444 96886
12403I6886N735j4956j7549O639M0087j2714M045k3930j2027N544k2988J3123
$$ 96886 102621 87665 70116 76755 116842 104128 108173 84243 72216 77760 54772 67895
12391F7895R701L1388J8745j6880l8740k147m708j0477J6917L2191L8844Q226
$$ 67895 77596 108984 127729 110849 72109 69962 65254 54777 71694 103885 142729 150955
12379A50955l1664k9429j6094J7869M020J9924J6088j4219l4579K935p114j4934
$$ 150955 119291 89862 73768 91637 95657 115581 131669 117450 82871 85806 78692 63758
12367F3758j9042p263M5340K7413k071J2250j6495n031J500K3233J1415k1136
$$ 63758 44716 37453 82793 110206 108135 120385 103890 98859 100359 123592 135007 113871
12355A13871j7741j2413q931P58J8984K4855j2276N38o60K4255m247j603J1382
$$ 113871 96130 83717 74786 75544 94528 119383 107107 107645 106985 131240 126993 125390 136772
12342A36772K0597j6887k755J1608N883n13J412k7774Q802L995j7628r130J5080
$$ 136772 157369 140482 137727 149335 155218 154705 156117 128343 137145 141140 123512 114382 129462
12329A29462J5800j3731k2960K3117J6906j2269Q20M0731J911m18J4405j8692
$$ 129462 145262 131531 108571 131688 148594 136325 137145 177876 179787 179369 193774 175082
12317A75082l5125K4529K1344p909r65j7162r637p610K813j5943J0436j956J9508
$$ 175082 139957 164486 185830 177921 176956 159794 150157 142547 145360 129417 139853 137897 157405
12304A57405J4424J0880L246k5281J649J1663O758J353J0678J4575o641p342k6991
$$ 157405 171829 182709 185955 160674 162323 173986 180744 182097 192775 207350 200709 193367 166376
12291A66376j995j2764L692Q795J4991Q165J0165L168N158j8344J2302k1572o501
$$ 166376 164381 151617 155309 164104 179095 187260 197425 200593 205751 187407 199709 178137 171636
12278A71636k830P703O506j1298J6827J0109L064j2451q851r109M1660J9670j6555
$$ 171636 168806 176509 183015 171717 188544 198653 201717 189266 180415 171306 212966 232636 216081
12265B16081j5475J3212L0171N687j0926j645j1233j6707P116K710l1022j5738
$$ 216081 200606 213818 243989 249676 238750 237105 225872 209165 216281 218991 187969 172231
12253A72231l3538K9631L2630k1090K5504Q77J0514J3077J261J0811j8646P304
$$ 172231 138693 168324 200954 179864 205368 206245 216759 229836 231097 241908 223262 230566
12241B30566L4833J1349k1226r413J7677L890J2122j0687j1979O975k1750K2562
$$ 230566 265399 276748 255522 246109 263786 267676 279798 269111 257132 264107 242357 264919
12229B64919k496J9959K9029K2993m762J2915r596k1806j5291J6729j9821j978
$$ 264919 262423 282382 311411 334404 329642 342557 332961 311155 295864 312593 292772 290794
12217B90794j414m707j3434K637l1408J2746M7351M768j1717j0423J796M8518
$$ 290794 289380 284673 271239 273876 242468 255214 302565 307333 295616 285193 286989 335507
12205C35507O180k041Q617j41j4054j3217l171L3777K9015j7804j3935l7740j3612
$$ 335507 341687 339646 348263 348122 334068 320851 317680 351457 380472 362668 348733 310993 297381
12192B97381K1003M8724L9452j3136j0026p875q589l1025l810L1631j951l1773
$$ 297381 318384 367108 406560 393424 383398 375523 366934 335909 332099 363730 361779 330006
12180C30006q030K9600N304N027k051J7091q523p116R474L2826J2115k5289j8411
$$ 330006 321976 351576 356880 361907 359856 376947 368424 361308 370782 403608 415723 390434 372023
12167C72023m595n217J3052K50R063K375M722J6351P076J2861R667J5027J3253
$$ 372023 367428 362211 375263 375513 384576 386951 391673 408024 415100 427961 437628 452655 465908
12154D65908j708J2422J1435p384J3965J8558o794k9304m563L5332K6938R732
$$ 465908 464200 476622 488057 480673 494638 513196 506402 477098 472535 507867 534805 544537
12142E44537J1204l379j2979m726K993J1003n781m2829J4498L4054L4477L6722
$$ 544537 555741 552362 539383 534657 537650 548653 542872 500043 514541 548595 583072 619794
12130F19794p725l0420j2444n899K8035L8877J2765J4804J5894J2089m592k7209
$$ 619794 612069 581649 569205 563306 591341 630218 642983 657787 673681 685770 681178 653969
12118F53969q850O825M875J1969j0268O036O5180M2688K1147r963K286J5791P000
$$ 653969 645119 651944 656819 668788 658520 664556 729736 772424 793571 783608 785894 801685 808685
12105H08685J00k707J3923K0730Q333L5789K9893L5663L3692J5862J5949J4764
$$ 808685 808785 806078 820001 840731 849064 884853 914746 950409 984101 999963 1015912 1030676
12093A030676n072l1323L4311J0736O537o788m928J5546J1033K5382L2415J5898
$$ 1030676 1025604 994281 1028592 1039328 1045865 1039077 1034149 1049695 1060728 1086110 1118525 1134423
12081A134423L377k4491l4691j478L1748L6953L6003K2274L3413K9088j1122k363
$$ 1134423 1137800 1113309 1078618 1077140 1108888 1145841 1181844 1204118 1237531 1266619 1255497 1253134
12069A253134o224l923L3803L7477P466L6460M9751N0794L2496l001L1719N0006
$$ 1253134 1246910 1242987 1276790 1314267 1321733 1358193 1407944 1458738 1491234 1488233 1519952 1569958
12057A569958O3259N7002q199L6375O7710J6750q922K7315J8430K5152K7573J4963
$$ 1569958 1633217 1690219 1682020 1718395 1786105 1802855 1793933 1821248 1839678 1864830 1892403 1907366
12045A907366K0083L4671M5768N9422N8608K2676J5958M1964N1875L7820L5667
$$ 1907366 1927449 1962120 2007888 2067310 2125918 2148594 2164552 2206516 2258391 2296211 2331878
12034B331878N7298M2794K2510J7571O9673O8432N6457N0537O1418N6147L7628
$$ 2331878 2389176 2431970 2454480 2472051 2541724 2610156 2666613 2717150 2778568 2834715 2872343
12023B872343N0785N6460P4929J13613P3640M2641N3668R2528J12139R5233P1702
$$ 2872343 2923128 2979588 3054517 3168130 3241770 3284411 3338079 3430607 3542746 3637979 3709681
12012C709681Q0604J09515J08539P1022N4596J06087J34680J24576J12230J12261
$$ 3709681 3790285 3899800 4008339 4079361 4133957 4240044 4374724 4499300 4611530 4723791
12002D723791J31036J14803J03277J18109J54578J79036J74651J70453J50459
$$ 4723791 4854827 4969630 5072907 5191016 5345594 5524630 5699281 5869734 6020193
11993F020193J64135K07974J87442J78603J86770K23021K23078K36663K33060
$$ 6020193 6184328 6392302 6579744 6758347 6945117 7168138 7391216 7627879 7860939
11984G860939K41050K73984K73627K83051K71676K87920L25153L35009L17423
$$ 7860939 8101989 8375973 8649600 8932651 9204327 9492247 9817400 10152409 10469832
11975A0469832L32750L50482L61437M05137L98918M11811M30571M37328M51111
$$ 10469832 10802582 11153064 11514501 11919638 12318556 12730367 13160938 13598266 14049377
11966A4049377M46045M79450M40036M57709M75433M57497M53830M52693M52178
$$ 14049377 14495422 14974872 15414908 15872617 16348050 16805547 17259377 17712070 18164248
11957A8164248M36411M31148M20917M02921L53697L11463K90683K70995K45385
$$ 18164248 18600659 19031807 19452724 19855645 20209342 20520805 20811488 21082483 21327868
11948B1327868J97279J34301O7102M6394R232j3619n2251j07997j27108j86984
$$ 21327868 21525147 21659448 21726550 21772944 21782176 21768557 21716306 21608309 21481201 21294217
11938B1294217k33734k47433k94892l29915l39344l63766l83048l71644l77091
$$ 21294217 21060483 20813050 20518158 20188243 19848899 19485133 19102085 18730441 18353350
11929A8353350l85985m00151m38706m01657m19019l88891l91400m08302l98766
$$ 18353350 17967365 17567214 17128508 16726851 16307832 15918941 15527541 15119239 14720473
11920A4720473l44426l53829m06009l64160l30725l31213l67011l47632k93806
$$ 14720473 14376047 14022218 13616209 13252049 12921324 12590111 12223100 11875468 11581662
11911A1581662l01931l26495k75988k85500l01981k71358k24883k88965k46072
$$ 11581662 11279731 10953236 10677248 10391748 10089767 9818409 9593526 9304561 9058489
11902I058489k41208k49492k14984j94770j91280k10133j81385j67414j84758
$$ 9058489 8817281 8567789 8352805 8158035 7966755 7756622 7575237 7407823 7223065
11893G223065j75684j71051j48658j71442j37046j75357j68238j57139j64164
$$ 7223065 7047381 6876330 6727672 6556230 6419184 6243827 6075589 5918450 5754286
11884E754286j65163j33627j24645j19219j37165j11847j20652j09943q8814j11259
$$ 5754286 5589123 5455496 5330851 5211632 5074467 4962620 4841968 4732025 4643211 4531952
11874D531952j18195j41609j19109o2297q0263q4866j23612j23944o0907n7578
$$ 4531952 4413757 4272148 4153039 4090742 4010479 3925613 3802001 3678057 3617150 3559572
11864C559572q6891o6870o4294o9871o3898o4189p5466n1011m4368m5435m6033
$$ 3559572 3472681 3405811 3341517 3271646 3207748 3143559 3068093 3017082 2972714 2927279 2881246
11853B881246p3696o8524o7853m6081o6269l1750m9167l2888o4347p1265m5005
$$ 2881246 2807550 2739026 2671173 2625092 2558823 2527073 2477906 2445018 2380671 2309406 2264401
11842B264401l3816j9026l1893m4264l8973o6770l5479j2507l7742k8585j7261
$$ 2264401 2230585 2211559 2179666 2135402 2096429 2029659 1994180 1981673 1943931 1915346 1898085
11831A898085l1150n8289l4203j5721m6138n0580J0847j5270l2542k2099m0065
$$ 1898085 1866935 1808646 1774443 1758722 1712584 1662004 1672851 1657581 1625039 1602940 1562875
11820A562875k2825k0033J760q708o6740m1733l7849n6962j9411j0736j0817p353
$$ 1562875 1540050 1520017 1521777 1513069 1446329 1404596 1366747 1309785 1290374 1279638 1268821 1261468
11808A261468m378l2771l2876l0217P110J6869J6067m0232k4811j7849j8788k1247
$$ 1261468 1257090 1224319 1191443 1161226 1168336 1185205 1201272 1161040 1136229 1118380 1099592 1078345
11796A078345k049m637j6229j3248n612m1396j8778n596l4556n586L2894O345
$$ 1078345 1076296 1071659 1055430 1042182 1036570 995174 976396 970800 936244 930658 963552 969897
11784I69897k2423k4765j7049J6854k3496j0198j0307l590k682j7964j5363m794
$$ 969897 947474 922709 905660 922514 899018 888820 878513 874923 872241 854277 838914 834120
11772H34120n6786m0355j1582J4201K3499K3825j7669j4330l4898j9092j0229
$$ 834120 777334 736979 725397 739598 763097 786922 769253 754923 720025 700933 690704
11761F90704J435j1539k080j7628M670L0530k2702j246o378k8008K3620K5620
$$ 690704 692139 680600 678520 660892 665562 696092 673390 672144 665766 637758 661378 686998
11749F86998o488j5653k5689j9169K315L890k4126o4423K891M4437K540l2030
$$ 686998 680510 664857 639168 619999 622314 626204 602078 537655 540546 584983 587523 555493
11737E55493j5519J3852J3349N273j483K976j4815k3914l4847j0384K1859J8894
$$ 555493 539974 553826 567175 572448 570965 573941 559126 535212 500365 489981 511840 530734
11725E30734j1534n012J579K6051k1371o567J3491j8587n2784l279R716J5981
$$ 530734 519200 514188 515767 541818 520447 513880 527371 508784 456000 452721 462437 478418
11713D78418j0863l0564j1361n087j5052Q652L1554j0688m089O991j983m0106
$$ 478418 467555 436991 425630 420543 405491 414143 445697 435009 430920 437911 435928 395822
11701C95822l1262Q975J0229J8238j70k8966Q905J626J572l8660L003O156L725
$$ 395822 364560 373535 383764 402002 401832 372866 381771 383397 384969 346309 349312 355468 359193
11688C59193O046p45k0841P007j182k6186N953J992O583j2395l9844j7690L156
$$ 359193 365239 364494 343653 350660 349478 323292 329245 331237 337820 325425 285581 267891 271047
11675B71047L3219J5247j5933J0093J890l628j4985j8792p942j2717Q661K691
$$ 271047 304266 319513 303580 313673 315563 311935 296950 278158 270216 257499 266160 268851
11663B68851M307q001j797O305m2008l827L1463R317K3708Q053j2630J8494j4109
$$ 268851 273158 265157 263360 269665 227657 223830 255293 264610 288318 296371 283741 302235 288126
11650B88126J4166O028m0346l1131K4889N54j9327q778L811L0592J617o300M2398
$$ 288126 302292 308320 267974 236843 261732 262286 242959 234181 237992 268584 270201 263901 306299
11637C06299j7012j4751j3034l1261j4494Q030O478J537Q633r77J9215L1244j8784
$$ 306299 289287 274536 261502 230241 215747 223777 230255 231792 240425 239448 258663 289907 271123
11624B71123j0162k2048j4238j3549l303k1671k422j9227k844J5462j6463n166
$$ 271123 260961 238913 224675 211126 207823 186152 183730 164503 161659 177121 160658 155492
11612A55492k6974J5790M8111J7543o138J603L075l563j8731j2559P512J7069
$$ 155492 128518 144308 192419 209962 203824 205427 208502 204939 186208 173649 181161 198230
11600A98230j4430R447J6625j4621l5192j7777J3974K1246L1844J5313J848k6647
$$ 198230 183800 193247 209872 195251 160059 142282 156256 177502 209346 224659 226507 199860
11588A99860j9669k857P193K3400K2103l279l9351j5117o541m594o587R124j4871
$$ 199860 180191 177334 184527 207927 230030 226751 187400 172283 165742 161148 154561 163685 148814
11575A48814j6057L1732J8420n142k5025j3025P16j4492n530j3290M648K0824
$$ 148814 132757 164489 182909 177767 152742 139717 140433 125941 120411 107121 111769 132593
11563A32593Q331R242Q300O628l817m8348m0139M039Q069L1413m112m050J4617
$$ 132593 140924 150166 158466 165094 161277 112929 72790 76829 84898 116311 112199 108149 122766
11550A22766J0197K3002p333k2714K1331L2113p906j9066q590n017K3476K5919
$$ 122766 132963 155965 148632 125918 147249 179362 171456 152390 143800 138783 162259 188178
11538A88178J6144k6745j9138k5471m0516k4009j5083K7599j788K191J4585L4500
$$ 188178 204322 177577 158439 132968 92452 68443 53360 80959 79171 81362 95947 130447
11526A30447Q654n682j4246r29L5318k3476n278J8135J5803Q49j3198j4053O664
$$ 130447 139101 133419 119173 118244 153562 130086 124808 142943 158746 159595 146397 132344 139008
11513A39008J256j131l2387r630L0875K2448k5708k0301k693K482j0564R1O524
$$ 139008 140264 139133 106746 97116 127991 150439 124731 104430 101737 104219 93655 93746 100270
11500A00270k3407k9913J5182K0427m623K4367M4246j9197k5015K760Q121J1287
$$ 100270 76863 46950 62132 82559 77936 102303 146549 127352 102337 105097 113218 124505
11488A24505J611M436O380K0108k7612l165R527o085m9459k5879K6778L829k7311
$$ 124505 126116 130552 136932 157040 129428 126263 135790 129705 80246 54367 81145 84974 57663
11475E7663l1239k0977q988M2381M2962P817j8035J6620R193j2712N880L237M994
$$ 57663 26424 5447 -3541 38840 81802 89619 71584 88204 97397 84685 90565 93802 98796
11462I8796M969j3189k654k5256j3265j3450p705j3360K0330O2K2598K5199L851
$$ 98796 103765 90576 87922 62666 49401 35951 28246 14886 35216 35278 57876 83075 86926
11449H6926J5168N565L2672j2799k9350j1266j5068q715J4260K4065K8323J7553
$$ 86926 102094 107659 140331 127532 98182 86916 71848 63133 77393 101458 129781 147334
11437A47334k7591j4341o614l832n264k966K4444n84j9251m715J7076J4226o338
$$ 147334 119743 105402 98788 94956 89692 86726 111170 110586 91335 86620 103696 117922 111584
11424A11584l0654o989M022J5726r017J6372l7871J3018K6843q442J6216J165
$$ 111584 80930 73941 77963 93689 84672 101044 63173 76191 103034 94592 110808 111973
11412A11973k7079k5449R473J1773M753P227j299j564N221j2365k5457r669j4387
$$ 111973 84894 59445 68918 80691 85444 92671 91372 89808 95029 82664 57207 47538 33151
11399C3151k2192K444K3931M7249m726n413J297j4552k7689k0094o709L1466L0450
$$ 33151 10959 13403 37334 84583 79857 74444 75741 61189 33500 13406 6697 38163 68613
11386F8613m859k2891N8J5476J1264J2638j398N962K7110j7608j8570M536N719
$$ 68613 63754 40863 40921 56397 67661 80299 78901 84863 111973 94365 75795 80331 86050
11373H6050P538k774k4236l7298m040J4361M014O974L246K2610R828J082Q876
$$ 86050 93588 90814 66578 29280 25240 39601 43615 50589 53835 76445 86273 87355 96231
11360I6231k2916o716m865m820J3354P628o600J0061r368N394j5233j8547k854
$$ 96231 73315 66599 61734 56914 70268 77896 71296 81357 71989 77383 62150 43603 40749
11347D0749M622K734o233R425J6022j9255q351M449j5735m98j6412j6545J9682
$$ 40749 45371 48105 41872 51297 67319 48064 39713 44162 28427 27929 11517 -5028 14654
11334A4654J1632J647j4037J6587K447L0277J1239j458l6128m521O785M271J4378
$$ 14654 26286 27933 13896 30483 32930 63207 74446 72988 36860 32339 39124 43395 57773
11321E7773J4281m50m2390j5965J0152q726L762K4931L3116j3900j4710k969N858
$$ 57773 72054 71604 29214 13249 23401 14675 18437 43368 76484 62584 47874 44905 50763
11308E0763j3141K7005K9801j0017r600Q107o34j0800J918m707L855R504R321
$$ 50763 37622 64627 94428 84411 74811 82918 82284 71484 73402 68695 72550 82054 91375
11295I1375n926j9566l0641j8290o249J1411J7641J7658p74k6287j5282R631J7871
$$ 91375 85449 65883 35242 16952 10703 22114 39755 57413 56639 30352 15070 24701 42572
11282D2572N76J9746J3026Q050k4432k0834N475k197k0935o26K3346J07p980N440
$$ 42572 43148 62894 75920 83970 59538 38704 44179 41982 21047 20421 43767 43874 35894 41334
11268D1334p019p046J2206J315J9437j9878l5616n168J1362K862L756J0369P200
$$ 41334 34315 27269 39475 40790 60227 40349 4733 -435 10927 13789 17545 27914 35114
11255C5114j2127j754O756J202p246N319J2166q471j6216j153K5358Q440O695
$$ 35114 22987 21233 27989 29191 21945 27264 39430 30959 14743 13590 38948 47388 54083
11242E4083L285l1256k3388J5897O139k6423j95J5851j241R761l852o757j6472
$$ 54083 57368 26112 2724 18621 24760 -1663 -1858 13993 12752 22513 18661 11904 -4568
11229d568p745j2136M0614N176R319J9350l1245R476Q618K3377J5180j5745N982
$$ -4568 -12313 -24449 16165 21341 30660 50010 18765 28241 36859 60236 75416 59671 65653
11216F5653p425j0855R278j7418n212p460J5398K267j3777j0561j9581L07N024
$$ 65653 58228 47373 56651 39233 34021 26561 41959 44226 30449 19888 307 614 5638
11203E638k965K0178K320o911N825j4597k4532J7130N03j854J2897Q464J8783
$$ 5638 2673 22851 25171 18260 24085 9488 -15044 2086 2589 735 13632 22096 40879
11190D0879m100j9544k0448N773K9159m163k3211J3462K0761O526k7208n13K3922
$$ 40879 36779 17235 -3213 2560 31719 27556 4345 17807 38568 45094 17886 17373 41295
11177D1295K1051k0883j3206J7713j9699k2555J8917J1630R917k36k5551K465
$$ 41295 62346 41463 28257 45970 26271 3716 22633 34263 44180 43944 18393 20858
11165B0858J4830k2054l3392P342L2584J2245l5693m8442M2479J5593j0889j4363
$$ 20858 35688 13634 -19758 -12416 20168 32413 -3280 -51722 -9243 6350 -4539 -18902
11153a8902J4989N797O475N95N589j1782K1005K8125L579o25P340l623k817n010
$$ -18902 -3913 1884 8359 8954 14543 2761 23766 51891 55470 54845 62185 58562 55745 50735
11139E0735K316j2705M018j8278k7151K8990K8092k5738j0236J5618K2530K7097
$$ 50735 53051 40346 44364 26086 -1065 27925 56017 30279 20043 35661 58191 85288
11127H5288k065j1899j9233l641k3172J6626J9511k4023k1969j6908l0168K089
$$ 85288 83223 71324 52091 48450 25278 41904 61415 37392 15423 -1485 -31653 -29564
11115b9564J1164J638J7488l66J5060K7401J4600k578m021j3801M55J9105q271
$$ -29564 -18400 -16762 726 360 15420 42821 57421 54843 50822 37021 37476 56581 48310
11102D8310o327m932k2101k4538l552J1459l0295j0006Q852K0705j7583j595K3152
$$ 48310 41983 37051 14950 -9588 -13140 -1681 -31976 -41982 -33130 -12425 -30008 -31603 -8451
11089h451M097J6256J1651n074J3162K732K2586Q882J6887J2181J1471k4196j5358
$$ -8451 -4354 11902 23553 18479 31641 34373 56959 65841 82728 94909 106380 82184 66826
11076F6826o547j8751n840j5293L306p877L8461O625m722k2983q231j9597N201
$$ 66826 60279 41528 35688 20395 23701 15824 54285 60910 56188 33205 24974 5377 10578
11063A0578Q436j4851j0124p869o620j1607o408K4591J5022J2550K0166K8507
$$ 10578 19014 4163 -5961 -13830 -20450 -32057 -38465 -13874 1148 13698 33864 62371
11051F2371j2282k5567j1378L2572L9548o85J7430k2356L2358J4440j868Q84k7338
$$ 62371 50089 24522 13144 45716 85264 84579 102009 79653 112011 126451 124583 125467 98129
11038I8129L1638l93r310N124J9562K8597K4943L085k1055k577R086l2929j7505
$$ 98129 129767 129374 120064 125188 144750 173347 198290 201375 180320 177743 186829 153900 136395
11025A36395L850K8031K9492J9825K2155R350J6163k3498k0885l0594p567J7684
$$ 136395 140245 168276 197768 217593 239748 249098 265261 241763 220878 190284 182717 200401
11013B00401m1211k2481N090Q528j2499K345L3776J3906j3115k1279k5080k190
$$ 200401 159190 136709 141799 150327 137828 140173 173949 187855 174740 153461 128381 126191
11001A26191r372k6658N10n796L158J8855m3520l1018n66q858J1405M928j551
$$ 126191 116819 90161 90671 84875 88033 106888 63368 32350 31784 22926 34331 39259 37708
10988C7708R852P181J0558j4540K584L1003j296j8327l0399k6687n509P354j0434
$$ 37708 47560 54741 65299 50759 53343 84346 83050 64723 34324 7637 2128 9482 -952
10975i52K6677L3436P785l155j1073k7569o220R328P990j23j9526p399j0767l774
$$ -952 25725 59161 66946 63791 52718 25149 18929 28257 36247 36124 16598 9199 -1568 -5342
10961e342K3655j0730j6510J4197j195K2575l961k919k8497j0700J3608k6831
$$ -5342 18313 7583 -8927 5270 4075 26650 22689 19770 -8727 -19427 -5819 -32650
10949c2650m008L9346J3426M916k366L5233K0339j0938k8828R206o286K962m976
$$ -32650 -36658 2688 16114 21030 18664 53897 74236 63298 34470 43676 37390 40352 35376
10936C5376k2676j1272j1372k2382k6267O588P354P218M1952K212R733j7090k2036
$$ 35376 12700 1428 -9944 -32326 -58593 -52005 -44651 -37433 4519 6731 16464 -626 -22662
10923b2662K5414L74p992Q916J9317r818l3269K1021L3667K3689r511j1305m261
$$ -22662 2752 3126 -4866 4050 23367 13549 -19720 1301 34968 58657 49146 37841 33580
10910C3580J5171J0113M514r85k0290j4922j8129k325j518r534K7631M964j0340
$$ 33580 48751 58864 63378 62393 42103 27181 9052 6727 5209 -4325 23306 28270 17930
10897A7930K390P208P895k3757j6241k4270k3617L3632J2508m220Q092J3659P247
$$ 17930 20320 27528 35423 11666 -4575 -28845 -52462 -18830 -6322 -10542 -2450 11209 18456
10884A8456k0962r332j4265j7355j0797L1031L1837J5844J0323Q735j0925R646
$$ 18456 -2506 -11838 -26103 -43458 -54255 -23224 8613 24457 34780 43515 32590 42236
10872D2236J4209j8258k0085O68j2560J3795J2292K3273j5406m566Q304j234J1928
$$ 42236 56445 38187 18102 18770 6210 20005 32297 55570 40164 35598 43902 42668 54596
10859E4596J609j7470j062J3682R810J3487O235k669j5464q019j385K688O640
$$ 54596 56205 38735 37673 51355 61165 74652 80887 78218 62754 54735 53350 56038 62678
10846F2678J7753K8326j3135k3500j2100J3763J2382J7436J8335o398k6324K976
$$ 62678 80431 108757 95622 72122 60022 73785 86167 103603 121938 115540 89216 92192
10834I2192j6811l3815n043N2588J5547j5848j4522K6699J1746k0997r086q63
$$ 92192 75381 41566 36523 89111 104658 88810 74288 100987 112733 91736 82650 81787
10822H1787k2187j3218l225J4961j1306p591m145p235L73M675J059J4728k1783
$$ 81787 59600 46382 43157 58118 46812 39221 35076 27841 28214 32889 33948 48676 26893
10809B6893k4169K7362M3942j7427K4868k1799j7552k8103k984K3473kk1717k4832
$$ 26893 2724 30086 74028 56601 81469 59670 42118 14015 11031 34504 34502 12785 -12047
10796a2047K879K7704j5712N905R477K3995k2463j0572L9136K0117J6113j0355
$$ -12047 -9168 18536 2824 8729 18206 42201 19738 9166 48302 68419 84532 74177
10784G4177j5728J441j1673k8896l012M642j5453O689K0138K5343j5828m2782
$$ 74177 58449 59890 48217 19321 16309 20951 5498 12187 32325 57668 41840 -942
10772i42N473J6018r102k1679N127K6091q889k9001j3419K5729J2204k189R110
$$ -942 4531 20549 11447 -10232 -5105 20986 12097 -16904 -30323 -4594 7610 5421 14531
10759A4531J5511J9685l002j4998k1307j1468Q262L809j4769K4589L4112k5762
$$ 14531 30042 49727 46725 31727 10420 -1048 7214 11023 -3746 20843 54955 29193
10747B9193k579j0943L4874J4194J3192R273j4226k5335P691J1265J122j6977
$$ 29193 26614 15671 50545 64739 77931 87204 72978 47643 55334 66599 67721 50744
10735E0744k938j1092L0834L0013n680k728l942P567K394j6439J5891J3147j8319
$$ 50744 47806 36714 67548 97561 91881 89153 85211 92778 95172 78733 94624 107771 89452
10722H9452j7776J380M1823o447p277L540p663j4363j6981J0706P733j5712N412
$$ 89452 71676 73056 114879 108432 101155 104695 97032 82669 65688 76394 84127 68415 73827
10709G3827K6731J1594j0570l1986j0452K478j3955j6313L2905J8499j6193K6398
$$ 73827 100558 112152 101582 69596 59144 61622 47667 31354 64259 82758 66565 92963
10697I2963P822k5432n1K587j0736K059L5056K3104J4971r829n0168q923K268
$$ 92963 100785 75353 75302 77889 67153 69212 104268 127372 142343 132514 82346 73423 75691
10684G5691K0345K4601K0656k7287J0106J2471J8765J3684L7057k4093l1379k0213
$$ 75691 96036 120637 141293 114006 124112 136583 155348 169032 206089 181996 150617 130404
10672A30404j09Q406J4431M981O30R515L706j341M3640J3971M867J8177Q466j1314
$$ 130404 130295 138701 153132 158113 158743 168258 171964 170623 214263 228234 233101 251278 259744 248430
10658B48430L3917J2954J6122L2101J1407k8021k318N389J0636J7082J6259N329
$$ 248430 282347 295301 311423 343524 354931 326910 324592 329981 340617 357699 373958 379287
10646C79287L194K568L9236J6693O606J6976K7517K6609J7120N2061O55K9735
$$ 379287 382481 385049 424285 440978 447584 464560 492077 518686 535806 587867 588522 618257
10634F18257N3621J14323J02849M5005N9499R4265J21671J23551J33213J70981
$$ 618257 671878 786201 889050 934055 993554 1087819 1209490 1333041 1466254 1637235
10624A637235K45897L15428M26337N36238O97379Q94258J128651J385873J591740
$$ 1637235 1883132 2198560 2624897 3161135 3858514 4752772 5881423 7267296 8859036
10615H859036J658709J437300R40913L72775P9317j376J96110N73981J102193
$$ 8859036 10517745 11955045 12895958 13268733 13348050 13346674 13542784 14116765 15218958
10606A5218958J767845K413654K896461L026187K442085J082925k55165j065225
$$ 15218958 16986803 19400457 22296918 25323105 27765190 28848115 28592950 27527725
10598B7527725j163696p53230k95R75440K036440L030508L727955L745275K619037
$$ 27527725 26364029 25610799 25610504 26585944 28622384 31652892 35380847 39126122 41745159
10589D1745159N63399j441095k709327l235337k973888k176509j155343j30992
$$ 41745159 42308558 40867463 38158136 34922799 31948911 29772402 28617059 28486067
10581B8486067P47994J294906J231091L79233j011628k223813k774132k753780
$$ 28486067 29234061 30528967 31760058 32139291 31127663 28903850 26129718 23375938
10573B3375938k328483j739235j099255n65807j38773R0647K6248l66707r51821
$$ 23375938 21047455 19308220 18208965 17643158 17504385 17595032 17621280 17254573 16302752
10564A6302752j408637j611661j580714j431723j198228r81524p42936o16485
$$ 16302752 14894115 13282454 11701740 10270017 9071789 8090265 7347329 6730844
10556F730844m72562m12611l76607l11774k71873k40830k23789k00953j83802
$$ 6730844 6258282 5845671 5469064 5157290 4885417 4644587 4420798 4219845 4036043
10547D036043j98535j57991j33658j31396j22355j44626j45425j27440j01590
$$ 4036043 3837508 3679517 3545859 3414463 3292108 3147482 3002057 2874617 2773027
10538B773027j08461r2335r1527q1381p1727r0918j23688r9781j20734j04197
$$ 2773027 2664566 2572231 2480704 2399323 2327596 2236678 2112990 2013209 1892475 1788278
10528A788278p9717p6258o0985q4484p4104m7153m8605k9207m8362n0417n8845
$$ 1788278 1708561 1632303 1571318 1486834 1412730 1365577 1316972 1287765 1239403 1188986 1130141
10517A130141m0300k0302J1653k0713m7773n7001n5528o7351l9569j6799n1006
$$ 1130141 1089841 1069539 1081192 1060479 1012706 955705 900177 832826 793257 776458 725452
10506G25452n4827j3543j2126j4195j3122k5447m2470m2369j6342J4674J024j9354
$$ 725452 670625 657082 644956 630761 617639 592192 549722 507353 491011 505685 506709 487355
10494D87355m9780o773j5179o061J9404M033l2528k2163l6994l477K0590p972
$$ 487355 437575 430802 415623 409562 428966 432999 400471 378308 341314 337837 358427 350455
10482C50455l9605k5533p920j953j4635o950J4010J3276L575J1306m303k271L765
$$ 350455 310850 285317 277397 275444 260809 253859 267869 281145 284720 296026 291723 289452 293217
10469B93217j2170j2249j5506J2815K8294k5235j6401l532J2860k6312l5439L299
$$ 293217 281047 268798 253292 266107 294401 269166 252765 249233 262093 235781 200342 203641
10457B03641M2889J2079P74j1347j938J6753J5681J3982R001K7425P037L3421
$$ 203641 246530 258609 259383 248036 246098 262851 278532 292514 301515 328940 335977 369398
10445C69398M8790R577M1410N1446O8447O6257M2054J3555Q984P857l3846p7796
$$ 369398 418188 427765 469175 520621 589068 655325 697379 710934 719918 727775 693929 616133
10433F16133p2146p3645l9847m6997l9026m5293j5235r590k0073J0572K1893M725
$$ 616133 543987 470342 430495 383498 344472 299179 283944 274354 254281 264853 286746 291471
10421B91471j525j0012p618k1854J8300J0541j711j6363j099L9479N799k8568
$$ 291471 289946 279934 272316 250462 268762 279303 277592 261229 260130 299609 305408 276840
10409B76840j7023m1292M460J9761M2471K2597j7014n097O121j9742k4124N299
$$ 276840 259817 218525 222985 242746 285217 307814 290800 285703 291824 272082 247958 253257
10397B53257Q076j3050N675O734J8046l660k6583l973o496j2772j0396J9538K2468
$$ 253257 261333 248283 253958 260692 278738 275078 248495 244522 238026 225254 214858 234396 256864
10384B56864j4273m0259k8160m4980j8779J5505l211k91l908J4008K7741K287
$$ 256864 242591 202332 174172 129192 110413 125918 122707 122416 118508 132516 160257 162544
10372A62544n829n5232l6243K6845J1912o443M6766N4980K7231l124l840k7742
$$ 162544 156715 101483 65240 92085 103997 97554 144320 199300 226531 223407 219567 191825
10360A91825j4322j656L5147J013l0246q430j7843M766N66M281J0499J4844L8319
$$ 191825 177503 175847 210994 212007 181761 173331 155488 160254 160820 165101 175600 190444 228763
10347B28763l575Q411o367J4513n988p406j122l4764r946N985J7420J7022j0668
$$ 228763 225188 233599 227232 241745 235757 228351 227229 192465 182519 188504 205924 222946 212278
10334B12278M265K7396j579k2072j0819K1345L1130O481k2181K062P425K5767
$$ 212278 216543 243939 242360 220288 209469 230814 261944 268425 246244 248306 255731 281498
10322B81498K3561L1282K8592L0503J1826L2287N8879N2793M7826L9825M7026
$$ 281498 305059 336341 364933 395436 407262 439549 498428 551221 599047 638872 685898
10311F85898L9447P226j5834l1095m3997l695k9717j418j0730p0295p4765l2657
$$ 685898 725345 732571 716737 685642 641645 637950 608233 606815 596085 525790 451025 418368
10299D18368J4591L3715J3404J5240P273N511J2566n072k0942K2721r155M23l1459
$$ 418368 432959 466674 480078 495318 502591 508102 520668 515596 494654 517375 508220 508643 477184
10286D77184j1714J8424J6074J152M5180Q1087Q6079M0294j8622l4641L3897N4464
$$ 477184 465470 483894 499968 501120 546300 627387 713466 753760 735138 700497 734394 788858
10274G88858K768M601L3410M173M260Q768K4464M4286j7399j922R265N5875K7299
$$ 788858 791626 796227 829637 833810 838070 846838 871302 915588 898189 896267 905532 961407 988706
10261I88706K7640L0598L7568M9331O6972M2472N0866L6339K2225L1358L9418
$$ 988706 1016346 1046944 1084512 1133843 1200815 1243287 1294153 1330492 1352717 1384075 1423493
10250A423493Q756J370Q244K7756K8512J7302L1811N2604O8324N5499Q6465P9813
$$ 1423493 1432249 1433619 1441863 1469619 1498131 1515433 1547244 1599848 1668172 1723671 1810136 1889949
10238A889949N9572O2473P7422O3097J5701K9908M4217M7364P2388J13691J76675
$$ 1889949 1949521 2011994 2089416 2152513 2168214 2198122 2242339 2289703 2362091 2475782 2652457
10227B652457J50698J40959K27643L44993M41997N39501N32023M11639K37971
$$ 2652457 2803155 2944114 3171757 3516750 3958747 4498248 5030271 5441910 5679881
10218E679881Q9369l553l4585K2495J34104K00007K57799L97587N08065O57138
$$ 5679881 5769250 5765697 5731112 5753607 5887711 6087718 6345517 6743104 7251169 7908307
10208G908307Q35116J007155R64003P21371M83204N52917P76943J015771J335680
$$ 7908307 8743423 9750578 10714581 11435952 11919156 12472073 13249016 14264787 15600467
10199A5600467J783991K416174L243198M304425N607902P330251R680910J2935509
$$ 15600467 17384458 19800632 23043830 27348255 32956157 40286408 49967318 62902827
10191F2902827J7751324K5049472L6048910N1172851O8660682Q5232306R3252844
$$ 62902827 80654151 105703623 141752533 192925384 261586066 346818372 440071216
10184D40071216O6285803r276268o9718953p7997077p1745649o1842599m7267663
$$ 440071216 506357019 497080751 427361798 349364721 277619072 215776473 168508810
10177A68508810l4273939k4838771j8391634j3909433j0635609q209370o421971
$$ 168508810 134234871 109396100 91004466 77095033 66459424 58250054 51828083
10170E1828083n145659m165901l466149k826280k300400j832686j378055j011046
$$ 51828083 46682424 42516523 39050374 36224094 33923694 32091008 30712953 29701907
10162B9701907o83482m66286n45634q66511r85230r19597p92496o35791m15477
$$ 29701907 29018425 28552139 28006505 27139994 26154764 25235167 24442671 23806880 23391403
10153B3391403k48167p2777P0997N6188k14210o19797q71929j027733j076318
$$ 23391403 23143236 23070459 23141456 23197644 22983434 22363637 21491708 20463975 19387657
10144A9387657j012668r63358q94641p72166p31343o86793o39626o35750n88675
$$ 19387657 18374989 17411631 16516990 15744824 15013481 14326688 13687062 13051312 12462637
10135A2462637o21129o04704n75478n50795n09761m57868m21123m16541l38371
$$ 12462637 11841508 11236804 10661326 10110531 9600770 9142902 8721779 8305238 7966867
10126G966867l12666l44224l15285k89654k66303k27476k33473k41321k59485
$$ 7966867 7654201 7309977 6994692 6705038 6438735 6211259 5977786 5736465 5476980
10117E476980k68105k37672k13567k19499k25634k25617j51165j65640j47932
$$ 5476980 5208875 4971203 4757636 4538137 4312503 4086886 3935721 3770081 3622149
10108C622149j19173j03239j27170j19553j31238j16625r1657j23840j11004r8067
$$ 3622149 3502976 3399737 3272567 3153014 3021776 2905151 2813494 2689654 2578650 2480583
10098B480583q0089n5656q1177n1543k7224l8125r2219j11392r8573p9326n4104
$$ 2480583 2400494 2344838 2263661 2212118 2184894 2146769 2054550 1943158 1844585 1765259 1711155
10087A711155m3501p1835n6173p1585m3535p85o0782r1322m9930k0328k5261k2053
$$ 1711155 1667654 1595819 1539646 1468061 1424526 1423741 1362959 1271637 1221707 1201379 1176118 1154065
10075A154065k9210j9154k02j1435o912J4886R30M0961M5100K8439L0349M922
$$ 1154065 1124855 1105701 1105499 1094064 1087152 1102038 1102968 1143929 1189029 1217468 1247817 1252739
10063A252739K7115J4820m8069p9500j04993r5298n4036n3253k8106l7429n2449
$$ 1252739 1279854 1294674 1246605 1167105 1062112 966814 912778 859525 831419 793990 741541
10052G41541m8454l3526j3508j2851m5231q471J7031j3685k0033m8428l1260o644
$$ 741541 693087 659561 646053 633202 587971 579500 596531 582846 562813 514385 483125 476481
10040D76481l07J1588j464j0129r642J302J2574K732l4668j1750J5099q232j3546
$$ 476481 476174 487762 486298 476169 466527 467829 480403 483135 448467 436717 451816 443584 430038
10027D30038J3958K1813Q641J4845j9181K9143N275J1532K9249K0309o255n138
$$ 430038 443996 465809 474450 489295 470114 499257 504532 516064 545313 565622 559367 554229
10015E54229J8292o03J267l3994o952L1052L1203j207L7149N2112k434j7114L0314
$$ 554229 572521 571918 573185 539191 532239 563291 594494 593287 630436 682548 680114 663000 693314
10002F93314K7316j7050K8326M3144K6721o883l4115l3632k2233l3657k6328J0803
$$ 693314 720630 703580 731906 775050 801771 794888 760773 727141 704908 671251 644923 655726
9990F55726m417j9152K2472j2795O416l6023k9929j6805k7156n338j1464r945
$$ 655726 651309 632157 654629 641834 648250 612227 582298 565493 538337 532999 521535 511590
9978E11590K312k1807J845j6296j3455J9516k154k5887k4993M87P284l2245J661
$$ 511590 513902 492095 493940 477644 464189 483705 481551 455664 430671 431158 438442 406197 407858
9965D07858p062j501n050j4113J88P495k0439k8107q492J7777j0196q487p232
$$ 407858 400796 399295 394245 380132 380320 387815 367376 339269 330777 348554 338358 329871 322639
9952C22639k1472j8852j6373L011K3985l307Q03K2942R681q776j1800l6093O884
$$ 322639 301167 282315 265942 268953 292938 289631 290434 313376 323057 314281 302481 266388 273272
9939B73272L0703K6451O772l2646k137r154J0584J8992J614p280k5799m0466l4711
$$ 273272 303975 330426 337198 304552 302415 293261 303845 322837 324451 317171 291372 250906 216195
9926B16195n5550l3805L3594L3214j0063j8086j7091K6221k501O195K8247l0766
$$ 216195 160645 126840 160434 193648 183585 165499 148408 174629 172128 178323 206570 175804
9914A75804l6296o473L4242R132Q783j5272j8648J3836K6639k2995k2425k7079
$$ 175804 139508 133035 167277 176409 185192 169920 151272 165108 191747 168752 146327 119248
9902A19248j3751R095r108N760L813j474rL27m116J2100p432P8j9208J648N7080
$$ 119248 105497 114592 105484 111244 115057 113583 113574 113901 109785 121885 114453 114531 95323 96971 154051
9887A54051k01N529k3509J3570J4923N561L305r593J9115N671M695k5784k4754
$$ 154051 153850 159379 135870 149440 164363 169924 173229 163636 182751 188422 193117 167333 142579
9874A42579p207J4777Q209P779k416l978j7648j3251R70K563j677P540o292Q209
$$ 142579 135372 150149 158358 166137 163721 159743 142095 128844 129814 132377 130700 138240 131948 140157
9860A40157N5215J502k6907k5547k5126j4719k302o910j3235l249N1187L1425
$$ 140157 195372 196874 169967 144420 119294 104575 102273 95363 82128 78879 130066 161491
9848A61491l737J4154O828J538J2801J2937Q165J231K622O129k8222l0494o377
$$ 161491 157754 171908 178736 180274 193075 206012 214177 215408 218030 224159 195937 165443 159066
9835A59066r985j9098J2716L5503p460k8796j1099L1115K1473K9594j2478l422
$$ 159066 149081 129983 142699 178202 170742 141946 130847 161962 183435 213029 200551 197129
9823A97129J314m5897l274q077k1121K5801Q980l582J518q207K522J8972N740
$$ 197129 198443 152546 149272 141195 120074 145875 154855 151273 152791 144584 147106 166078 171818
9810A71818j4636R699O004K321k4053l8383J1148L2860j771J101k8820J054L0544
$$ 171818 157182 166881 172885 175206 151153 112770 123918 156778 155007 156108 127288 128342 158886
9797A58886J5207K4516K3254l391m95j8770J6287P888J9506J9499J3631J6837
$$ 158886 174093 198609 221863 218472 217977 199207 215494 223382 242888 262387 276018 292855
9785B92855K7777N3676P8220R0963J19497J74011K41878L62317M48665M65223
$$ 292855 320632 374308 452528 543491 662988 836999 1078877 1441194 1889859 2355082
9775B355082L42557O479l35434m12007l93105l25713k27401j89717j12081r4246
$$ 2355082 2697639 2704118 2368684 1956677 1563572 1237859 1010458 820741 708660 614414
9765F14414r8920p4895m9112k153k4673k4421r427j1958j5379l7007p166j9024
$$ 614414 515494 440599 391487 389334 364661 340240 330813 318855 303476 266469 259303 240279
9753B40279j0745R070j3075m3l943k0343N504j1887J1182m533m0715N480n36L1005
$$ 240279 229534 238604 225529 225486 221543 201200 206704 194817 205999 201466 160751 166231 165695 196700
9739A96700l93m28J160j885r704l885n064L1310J255P20r031j6220k8519j2745
$$ 196700 196307 195879 197039 195154 185450 181565 176501 207811 209066 209786 200755 184535 156016 143271
9725A43271Q947Q434J3K6j3112k3161q046n474J4735j5962k7320j2636J783J3560
$$ 143271 152218 160652 160665 160691 147579 124418 116372 110898 125633 109671 82351 69715 71498 85058
9711H5058j6837j8853o152L3898M6158J3506k6733r192q674q782j8501J0099K9486
$$ 85058 68221 49368 43216 77114 123272 136778 110045 100853 92179 83397 64896 74995 104481
9698A04481K2607K3472j4097k5413K373K2254J6088n9240l3044K7892L8742q032
$$ 104481 127088 150560 136463 111050 113423 135677 151765 92525 59481 87373 126115 118083
9686A18083j8296k221m08L21k228J0200K6680J4483m916k3076K5892J448J3029
$$ 118083 99787 97566 97158 97479 95251 105451 132131 146614 141698 118622 144514 145962 158991
9673A58991J4018k7427l3069P07m050l432Q116j500K114q155m2979Q086K1066
$$ 158991 173009 145582 112513 113220 109170 105738 113854 112354 114468 106313 63334 71420 92486
9660I2486M6475J2515K0982L1114P5019O5328J30552J70502K30147K53525J46585
$$ 92486 138961 151476 172458 203572 278591 343919 474471 644973 875120 1128645 1275230
9649A275230r9801j96619k10582j94768j15650p6258r0352m8503k9993l2574J6628
$$ 1275230 1175429 978810 768228 573460 457810 381552 291200 242697 212704 180130 196758
9638A96758l1457l4453j2574q052j9887k1426J112J1510j9722l0345N114N644
$$ 196758 165301 130848 118274 110222 90335 68909 70021 81531 61809 31464 36578 42222
9626D2222K1576M0840N002Q164m188L727k5091J1074P2k710J3388L1532j7435
$$ 42222 63798 104638 109640 117804 113616 117343 92252 103326 103398 100688 114076 145608 128173
9613A28173o582p080k6455m399j668j3223N540Q189N803k1906j6337r296J6066
$$ 128173 121591 114511 88056 83657 81989 68766 74306 82495 88298 66392 50055 40759 56825
9600E6825o895L0197L0489j1001l587k8526P847j07J6016l165j1555k6165j2148
$$ 56825 49930 80127 110616 99615 96028 67502 75349 75242 91258 88093 76538 50373 38225
9587C8225M5256K1996j5666m547J9120k3914K487j4570j2140K0856O482N384N465
$$ 38225 83481 105477 89811 85264 104384 80470 82957 68387 56247 77103 83585 88969 94434
9574I4434J5137j6006M25J4818j7159r287K0415N548k4331J8591J1867k2679m2756
$$ 94434 109571 93565 93990 108808 91649 82362 102777 108325 83994 102585 114452 91773 49017
9561D9017P222R730M22o848m1987q773K876K713K7177J7905k1407k5979J3327
$$ 49017 56239 65969 66391 59543 17556 8783 11659 14372 41549 59454 38047 12068 25395
9548B5395p8K863J4318J4610j3485j6560l532j126j1404J3134M448J6995n157
$$ 25395 25317 28180 42498 57108 43623 27063 23531 22405 11001 24135 28583 45578 40421
9535D0421l2232k5509m757j2031o295K4263L2166J5697M284r220j4041k128n864
$$ 40421 8189 -17320 -22077 -34108 -40403 -16140 16026 31723 36007 26787 12746 10618 4754
9522D754Q513k7706r910M0459L0488K0609J4321j7006j1916m965n417j7665l2891
$$ 4754 13267 -14439 -24349 16110 46598 67207 81528 64522 52606 47641 42224 24559 -8332
9509h332j3806k4108L4698L1867j7207j0607J9591J0629J6860J0116J83K7634
$$ -8332 -22138 -46246 -11548 20319 3112 -7495 12096 22725 39585 49701 49884 77518
9497G7518L912k2041r429J190P29k2964k3254J4647j2838M71N325K3721K6458
$$ 77518 81430 59389 49960 51150 51879 28915 5661 20308 7470 7941 13266 36987 63445
9484F3445O079j1814n975j2147j6919j1912Q652J8169k5566k1118K0243M3919
$$ 63445 69524 57710 51735 39588 22669 10757 19409 37578 12012 -9106 11137 55056
9472E5056R497j3472k8659k1973K8172n683k7994J0558K8604l877j0703m12R14
$$ 55056 64553 51081 22422 449 28621 22938 -5056 5502 34106 30229 19526 19114 20028
9459B0028q703k355j4774L1875M5680J4384j4683j4772r699j4060j0675r643J6667
$$ 20028 11325 8970 -5804 26071 71751 86135 71452 56680 46981 32921 22246 12603 29270
9446B9270J3193q065K5181J3797L4090j5639p7462k2605L2952P129j5266J8929
$$ 29270 42463 34398 59579 73376 107466 91827 14365 -8240 24712 31841 16575 35504
9434C5504O339J1046j0512m1880Q233K2125O43m810j897p431R622J4528m75l9970
$$ 35504 41843 52889 42377 497 8730 30855 31498 26688 24791 17360 26982 41510 41035 1065
9420A065j0320K176R962K8353J7156P571k6134o263j2462J1830K3800L874m5133
$$ 1065 -9255 -7079 2883 31236 48392 55963 29829 23566 11104 22934 46734 50608 5475
9407E475J005j2233M815J0601L2144k769k4279j1624N822n027n545k0246j317
$$ 5475 6480 -5753 -938 9663 41807 39038 14759 3135 8957 3930 -1615 -21861 -23178
9394b3178K0061J3491j0712K1437J3987j5512l0183J2026O159n761J7883R331
$$ -23178 -3117 10374 -338 21099 35086 19574 -10609 1417 7576 1815 19698 29029
9382B9029k7548j2927R851j066J2417P16n013J6236j1692k9833M989Q5J0909K0701
$$ 29029 1481 -11446 -1595 -2661 9756 10472 5459 21695 10003 -19830 -14841 -14756 -3847 16854
9368A6854n841J342J3674m584K6795J1974l2520l1067j7383J5553M4907K3020
$$ 16854 11013 12355 26029 21445 48240 60214 27694 -3373 -20756 -5203 39704 62724
9356F2724p588k5684k5972N188K9202O458R43k1432j7995k831j901K5179o020
$$ 62724 55136 29452 3480 8668 37870 44328 45271 23839 5844 3013 1112 26291 20271
9343B0271l666k0094P253R316n304J1890j5561J9990j3694M349M46j3305Q238
$$ 20271 16605 -3489 3764 13080 7776 19666 4105 24095 10401 14750 15196 1891 10129
9330A0129L410N699L2569J0260j6232j9123j4708j6211k0318L452J2748o374O549
$$ 10129 13539 19238 51807 62067 45835 26712 12004 -4207 -24525 -21073 -8325 -14699 -8150
9317h150K4549j666K9912J9200l6692m1137N639K4414j9978j785J5466j3957M381
$$ -8150 16399 14733 44645 63845 27153 -13984 -8345 16069 -3909 -5694 9772 -4185 196
9304A96K09J9709L138k6795j0577M2660L7004k2475j7861M309L94J7891J0633
$$ 196 405 20114 23252 -3543 -14120 28540 65544 43069 25208 29517 29911 47802 58435
9291E8435p382k1929j6957j8956J0086Q896J9463j122j4251j786p191J0061r380
$$ 58435 51053 29124 12167 -6789 3297 12193 31656 30534 16283 14497 7306 17367 7987
9278G987r069n680R813N592N075J9212j5549P946M067n371J8573k0825L15J8342
$$ 7987 -1082 -6762 3051 8643 13718 32930 17381 25327 29394 24023 42596 21771 22086 40428
9264D0428r334l669q91N739j3119j9125M538J3683N528k3080l3454M453k286p337
$$ 40428 31094 27425 26534 32273 19154 29 4567 18250 23778 698 -32756 -28303 -30589 -37926
9250c7926K4212K0708p335r552J183K2074J5057o496k2021L0509l364O764R756
$$ -37926 -13714 6994 -341 -9893 -8710 13364 28421 21925 -96 30413 27049 33813 43569
9237D3569l531k9161P510K1370J3758J123K6800l8714j2050L0168P057k6121R368
$$ 43569 40038 10877 18387 39757 53515 54638 81438 42724 30674 60842 67899 41778 51146
9224E1146j2821o589J1809k9697j9414M297N301K0706q854j9794r006o581J431
$$ 51146 38325 31736 43545 13848 -5566 -1269 4032 24738 15884 -3910 -12916 -19497 -18066
9211a8066L9366J5647J0638K7250j3934m442j1913j1482K2752Q553n926j7146
$$ -18066 21300 36947 47585 74835 60901 56459 44546 33064 55816 64369 58443 41297
9199D1297k4908q924J8031O619j9384j3342j3381Q420J2960M4183j0773j7335
$$ 41297 16389 7465 25496 32115 12731 -611 -13992 -5572 7388 51571 40798 23463
9187B3463r145J2613q177o220j1526j5016j3053J2764J6637J0117O232P72J4684
$$ 23463 14318 26931 18754 12534 1008 -14008 -27061 -14297 2340 12457 18689 19461 34145
9174C4145J6138O657j9070o846K9453k575L0547P220j7188j8698q848l8468j4582
$$ 34145 50283 56940 37870 31024 60477 57902 88449 95669 78481 59783 50935 12467 -2115
9161b115R830M3655R358o224J050j6312Q867p00l2127l7084J6552M1448J2750
$$ -2115 7715 51370 60728 54504 55554 39242 48109 47409 15282 -21802 -5250 36198 48948
9148D8948M275r075k4305p047l416p857J6522J7008j3383k2M230j2543J1581J2528
$$ 48948 53223 44148 19843 12796 9380 1523 18045 35053 21670 21648 25878 13335 24916 37444
9134C7444r994j5220n987j215o614J3299o193n584J5914K9320j1604k4304k9132
$$ 37444 27450 12230 6243 5028 -1586 11713 5520 -64 15850 45170 33566 9262 -19870
9121a9870J5632K5057J8101p797r398r472j26j3658m210J7283J5710r333M977
$$ -19870 -4238 20819 38920 31123 21725 12253 12127 -1531 -5741 11542 27252 17919 22896
9108B2896M72J7397L9514k9609k0465J5265k3992k8436N0214L3707L3197k225
$$ 22896 23368 40765 80279 50670 30205 45470 21478 -6958 43256 76963 110160 107935
9096A07935l0118j6811k9032k0610K7980L8221J272j3064p927j0817l1704J0278
$$ 107935 77817 61006 31974 11364 39344 77565 78837 65773 57846 47029 15325 25603
9084B5603K1370l224q581J0841M5409j4889j4480k361n165K1603J6884k1425j1671
$$ 25603 46973 43749 35168 46009 91418 76529 62049 59688 54523 76126 93010 71585 59914
9071E9914j5789l4369J271J9935M0796Q91J0594j3019j8906k3060O906R032O926
$$ 59914 44125 9756 11027 30962 71758 72649 83243 70224 51318 28258 35164 44196 51122
9058E1122J0620M5153j0888p144l491k1147M547l111j4145J0395k417K1655k4904
$$ 51122 61742 106895 96007 88863 85372 64225 68772 65661 51516 61911 59494 81149 56245
9045E6245r040k3935q747N964L3185L2377k74k7963j9290j0813Q955J9344K366
$$ 56245 47205 23270 14523 20487 53672 86049 85775 57812 38522 27709 36664 56008 58374
9032E8374j2019j5899J3807K0279o30p697j1601J2236P246J2362J2711k0081j8668
$$ 58374 46355 30456 44263 64542 63912 56215 44614 56850 64096 76458 89169 69088 50420
9019E0420j1478k0546L370j0418K2619J3495J0694l2847p365K4929j3616j989
$$ 50420 38942 18396 21766 11348 33967 47462 58156 25309 17944 42873 29257 27268
9007B7268J211j1098J7204j1708M160M6307K3961r073k5257k38K6557p267j2966
$$ 27268 28479 17381 34585 22877 27037 73344 97305 88232 62975 62737 89294 82027 69061
8994F9061m718k514j1628p29L408M430Q387j1797r212P775K8942K1127k7451l9274
$$ 69061 64343 61829 50201 49472 52880 57310 65697 53900 44688 52463 81405 102532 75081 35807
8980C5807l2290J2027P351Q940J3600M00J2343J1855j2890J0736j2389k0551j5511
$$ 35807 3517 15544 22895 31835 45435 45835 58178 70033 57143 67879 55490 34939 19428
8967A9428l559J5788M6867K829k9090k17J095l8419r424L5019J8543k9753o507
$$ 19428 15869 31657 78524 81353 52263 52046 53141 14722 5298 40317 58860 29107 22600
8954B2600J0818K5241O337j8930l9542k0196J2911K6300R17l6562L372J3665J6871
$$ 22600 33418 58659 64996 46066 6524 -13672 -761 25539 26456 -10106 -6734 6931 23802
8941B3802P091Q345r117Q541m665j9545j420O734o820N718J9788J5003p815M787
$$ 23802 30893 39238 30121 38662 33997 14452 13032 19766 12946 18664 38452 53455 45640 50427
8927E0427j1729k3736j6954o14L106J464J2610P799j131j2847l993J3343K6750
$$ 50427 38698 14962 -1992 -2606 500 1964 14574 22373 21242 8395 4402 17745 44495
8914D4495L3164q359l4906k5973J0919L633M768J158j5805j858L804J0266Q912
$$ 44495 77659 69300 34394 8421 19340 22973 27741 28899 13094 11236 15040 25306 34218
8901C4218K1681K1844j3734M096j1708n300J986l8514o097j1680N315L0908j1947
$$ 34218 55899 77743 64009 68105 56397 51097 53083 14569 8472 -3208 2107 33015 21068
8888B1068p956j5649M49J6368K0092L4631j2219j829j0373p992R899j1116j8914
$$ 21068 13112 -2537 -2088 14280 34372 69003 56784 54955 44582 36590 46489 35373 16459
8875A6459J0727r68K205j8575N412j1066Q366k840J1920j0722p728l308J5688
$$ 16459 27186 26218 28423 9848 15260 4194 12560 9720 21640 10918 3190 -118 15570
8862A5570P231l3503m0857n357P306J3858M2745Q752k6317o919M1436K0933j4268
$$ 15570 22801 -10702 -51559 -56916 -49610 -35752 6993 15745 -10572 -17491 23945 44878 30610
8849C0610N862K1155j104j6783l7210k0079M283R120P733N221Q487J1317Q192
$$ 30610 36472 57627 56523 39740 2530 -17549 -13266 -4146 3587 8808 17295 28612 36804
8836C6804j0859k3769P379L0776L372k2836j8366J2615K2045k3090lJ8483J8314
$$ 36804 25945 2176 9555 40331 43703 20867 2501 15116 37161 14071 14068 32551 50865
8823E0865r983J2805p815k5425j5280R846L0110j3496k5884l365o54o425J0978
$$ 50865 40882 53687 45872 20447 5167 15013 45123 31627 5743 2378 1724 -4701 6277
8810F277R866N26j3349l26K4798J2309j5895j1408j6696O953J2787j0324R39j1107
$$ 6277 16143 16669 3320 2994 27792 40101 24206 12798 -3898 3055 15842 5518 6457 -4650
8796d650j647J4985k0780K5118j9372l2767J2083K4545Q539r913j3742j1117M3405
$$ -4650 -6297 8688 -12092 13026 -6346 -39113 -27030 -2485 6054 -3859 -17601 -28718 14687
8783A4687J6701p885K133k1681J139L5662J302k1688k4598M596K6164o067P473
$$ 14687 31388 23503 25636 3955 5094 40756 42058 20370 -4228 368 26532 20465 27938
8770B7938j1634q667M699O504j0939J1752R141K1959j3899r749j3100k927J285
$$ 27938 16304 7637 12336 18840 7901 19653 28794 50753 36854 27105 14005 11078 12363
8757A2363k4562J7426L2634k351J9753j0232n007J3172P642o125O99Q613k9762
$$ 12363 -12199 5227 37861 35510 55263 45031 40024 53196 60838 54713 55412 64025 34263
8744C4263l4369K00r294J2801K8358n340j8653p753J7887K0407j0291k6029P288
$$ 34263 -106 94 -9200 3601 31959 26619 7966 213 18100 38507 28216 2187 9475
8731I475J2793J0892j4157M73j7059k6493K0336K0411j0054n364J6487j7918l5053
$$ 9475 22268 33160 19003 19476 2417 -24076 -3740 16671 6617 1253 17740 -178 -35231
8718c5231J4631L9896K1564k6946j2525J3303J7053n259j6337K3731J1136j2874
$$ -35231 -20600 19296 40860 13914 1389 14692 31745 26486 10149 33880 45016 32142
8706C2142j40J3847j5164k7380P452N025J6619K3501j5653k2274K7520K7823j5054
$$ 32142 32002 45849 30685 3305 10757 15782 32401 55902 40249 17975 45495 73318 58264
8693E8264k568K1196j3696q711K713q261r497N833N711j7149J8193Q954j4552
$$ 58264 55696 76892 63196 54485 57198 48937 39440 45273 50984 33835 52028 60982 46430
8680D6430l3454r83M0312Q571Q2J3937J7804p010j9089l2988J3717K0904J6540
$$ 46430 12976 11993 52305 60876 60958 74895 92699 85689 66600 33612 47329 68233 84773
8667H4773N558k0127k3481m9904j455K3362K5938K0252j2052m443j4055q20r662
$$ 84773 90331 70204 46723 -3181 -4636 18726 44664 64916 52864 48421 34366 33546 23884
8654B3884J4663K9123K5781M388j0402J2493k45j477O139P826K1851r40m997J5080
$$ 23884 38547 67670 93451 97839 87437 99930 99685 98208 104347 112173 134024 133084 128087 143167
8640A43167j4482k7240j0583J4283j9739O193m110M92p164k3690m075P431J7924
$$ 143167 128685 101445 90862 105145 85406 91599 87489 87981 80817 57127 53052 60483 78407
8627G8407K3925K3083J2112k133l7024J4037j6275Q079j4136k1909O924M1838
$$ 78407 102332 125415 137527 135394 98370 112407 96132 104211 90075 68166 75090 116928
8615A16928K541P808J6299L049j0903J3512P793L39j2273J1187K3626r23J7287
$$ 116928 119469 127277 143576 146625 135722 149234 157027 157366 145093 156280 179906 178983 196270
8602A96270M1670J7154K1690L9204K0770j985j9589j8336K0157K5630O526q179
$$ 196270 237940 255094 276784 315988 336758 334773 315184 296848 317005 342635 349161 340982
8590C40982J680J1902M402N0838O4178L2867K5022N2364N2914N5670O7462L1658
$$ 340982 342662 354564 358966 409804 473982 506849 531871 584235 637149 692819 760281 791939
8578G91939J7734K2373k5653k4208l1216m7566m6799o8045m0290m7092k8465k6368
$$ 791939 809673 832046 806393 782185 750969 703403 656604 588559 548269 501177 472712 446344
8566D46344l3002n8638l8659l5908J6m268k5969n670j4176m104k7913R160J987
$$ 446344 413342 354704 316045 280137 280153 275885 249916 244246 230070 225966 198053 207213 209200
8553B09200O916K6132J1968O135k0977j2556l7475l0357N187k2072o898O263k1980
$$ 209200 216116 242248 254216 260351 239374 226818 189343 158986 164173 142101 135203 141466 119486
8540A19486j5175j4732J0785m199P223L3297J297r24j7436k0795J3642O76l6175
$$ 119486 104311 89579 100364 96165 103388 136685 137982 137058 119622 98827 112469 113145 76970
8527G6970o713q820K465K4120k196j2670M21M447L308O664M317o354j2072k2268
$$ 76970 70257 61437 63902 88022 85826 73156 73577 78024 81332 87996 92313 85959 73887 51619
8513E1619N78J2521M117O427j6862j7933l1884J1387l411J0854K6098L0948k7593
$$ 51619 52197 64718 68835 75262 58400 40467 8583 19970 16559 27413 53511 84459 56866
8500E6866l0708j5997J3685J4153o415p477N217J0451J458k5661k2953K861j5221
$$ 56866 26158 10161 23846 37999 31584 24107 29324 39775 41233 15572 -7381 -4520 -19741
8487a9741J977N969K6338J5523j4062J1447M3064n1389o073M2736L864r709L638
$$ -19741 -17764 -11795 14543 30066 16004 27451 70515 19126 13053 55789 59653 49944 53582
8474E3582l1525J2261K5634o191R702j2837m248R45j333j9626L710J3556j5960
$$ 53582 22057 34318 59952 53761 63463 50626 46378 47323 45990 26364 30074 43630 27670
8461B7670m2234k1045M1017L8305Q298J7919N990k1367k677j2015j5581r678K1551
$$ 27670 -14564 -35609 5408 43713 52011 69930 75920 54553 51876 39861 24280 14602 36153
8448C6153j1578K8771J2827k3490l6133O952M2696Q060k2517K576K1012J768l2408
$$ 36153 24575 53346 66173 42683 6550 13502 56198 64258 41741 44317 65329 67097 34689
8435C4689k9173K1673J8784J1522j2470k86p9J7673j1560q658J7594j143K5453
$$ 34689 5516 27189 45973 57495 45025 44739 44660 62333 50773 42115 59709 58566 84019
8422H4019j241L4066O6006P2031N2203O341l9488m5239n3735l5238j2122J5142
$$ 84019 82778 116844 182850 254881 307084 313425 273937 228698 174963 139725 127603 142745
8410A42745l0845l4580j5782J4764J0608r586j9129J1912P92j4689Q266L1972
$$ 142745 111900 77320 61538 76302 86910 77324 58195 70107 70899 56210 64476 96448
8398I6448n081R254l954j1812j7005k1406J0970J7527k2879j1650K603m039M536
$$ 96448 91367 100621 96667 84855 67850 46444 57414 74941 52062 40412 43015 38976 43512
8385D3512k4999K4981J1879l4129M8218L3538N95j9121O0323N7957R9039Q9617
$$ 43512 18513 43494 55373 21244 69462 103000 103595 84474 144797 202754 301793 391410
8373C91410J10296Q8934J7278j06194j03786r3305o7119m8582l9931l3708l1765
$$ 391410 501706 590640 607918 501724 397938 304633 237514 188932 149001 115293 83528
8362H3528j5089K0697N624O305j2363j200j6112k9729j7803l5881n88K049N727
$$ 83528 68439 89136 94760 101065 88702 87502 71390 41661 23858 -12023 -12611 -10562 -4835
8349d835L8777M9354N4874K0442Q750Q752N0833N4874O0573R722l6871m3647l1178
$$ -4835 33942 83296 138170 158612 167362 176114 226947 281821 342394 352116 315245 271598 240420
8336B40420m8166n5358l2478j6564K5148M2568N6073N6573O8659L8241j1481m9918
$$ 240420 192254 136896 104418 87854 113002 155570 211643 268216 336875 375116 363635 313717
8324C13717o3143m0373j8841m2129l8357j5417K1020o955k6364o425l7082j3370
$$ 313717 250574 210201 191360 149231 110874 95457 116477 109522 83158 76733 39651 26281
8312B6281K1909L0131M968j6336Q162M0192J6412P421q231J14K6913M5979Q7629
$$ 26281 48190 78321 83289 66953 75115 115307 131719 139140 130909 131023 157936 203915 291544
8299B91544J40005J41644R6580M825r7793j17214q8671o3715o3078m3376l5280
$$ 291544 431549 573193 669773 674598 576805 459591 370920 307205 244127 200751 165471
8288A65471k5066k5483j3659l18N037n959j5661r646o044j5578K568L398k8635
$$ 165471 140405 114922 101263 100945 105982 100023 84362 74716 68672 53094 55662 59060 30425
8275C0425J6441K7192p684j5377j1089Q425J9835l710R835J2156J137q634k8919
$$ 30425 46866 74058 66374 50997 39908 48333 68168 64458 74293 86449 87586 78952 50033
8262E0033j5306J5438N407O200O2488M5512J3089L9311L5888M9828K2257m2102
$$ 50033 34727 50165 55572 61772 124260 169772 182861 222172 258060 307888 330145 288043
8250B88043o4877l2192o808l4167o2859l3869j1524R782J8820l0135J2242k3325
$$ 288043 223166 190974 184166 149999 87140 53271 41747 51529 70349 40214 52456 29131
8238B9131j0450K518j5214J955j4047R626K5959J4189N924n475J3288j9125j6141
$$ 29131 18681 21199 5985 7940 -6107 3519 29478 43667 49591 44116 57404 38279 22138
8225B2138J8290J7416l1173j3509K5689J3312J9629j2315l0307K014P448j7718
$$ 22138 40428 57844 26671 13162 38851 52163 71792 59477 29170 31184 38632 20914
8213B0914j4255k3951K3676R249P528p787j755N150k8788Q097L6464J097k7994
$$ 20914 6659 -17292 6384 15633 23161 15374 13619 18769 -10019 -1922 34542 35639 7645
8200G645O996N525J0900m188J4834M685K0618n2263j3939M348j4065o875l903
$$ 7645 14641 20166 31066 26878 41712 46397 67015 14752 813 5161 -8904 -15779 -19682
8187a9682Q027O431J8972R355l3607k9228J6141M9691L1677k7698k2215q804m525
$$ -19682 -11655 -5224 13748 23103 -10504 -39732 -23591 26100 57777 30079 7864 -940 -5465
8174e465K952k6739J2823J7176m038j5744N305R736O491J3686k5616Q20j779Q101
$$ -5465 -2513 -29252 -16429 747 -3291 -19035 -13730 -3994 2497 16183 -9433 -8613 -10392 -2291
8160b291J4568j4375l4255j4789J9693K4707K2031j0785k2504J0576J028k0830
$$ -2291 12277 -2098 -36353 -51142 -31449 -6742 15289 4504 -18000 -7424 -6396 -27226
8148b7226l694J3498J9041o745L971m510K0925K5146r167j8973Q804l0932j4604
$$ -27226 -30920 -17422 1619 -5126 -1155 -5665 15260 40406 31239 12266 21070 -9862 -24466
8135b4466J3974J511K8396k584k2810J2139J4288J0523L4611q060k2668J0670
$$ -24466 -10492 -8981 19415 16831 -5979 6160 20448 30971 65582 57522 34854 45524
8123D5524j3317N332P214o652l911j3544L4285K8619J0015l5905l6724J5551J1207
$$ 45524 32207 37539 44753 38101 34190 20646 54931 83550 93565 57660 20936 36487 47694
8110D7694k1426k7757q466j9991J5029J1672J7793n268Q868k522j6149j9434o445
$$ 47694 26268 -1489 -9955 -29946 -14917 -3245 14548 9280 18148 15626 -523 -19957 -26402
8097b6402K2552N256k979N582k7833j5819O058R028J8180R928o464j1469J0910
$$ -26402 -3850 1406 -1573 4009 -23824 -39643 -33585 -24557 -6377 3551 -2913 -14382 -3472
8084c472m864R473K1136N892j3587P914o86n503K1442J7076j109K113k7096k3558
$$ -3472 -8336 1137 22273 28165 14578 22492 21806 16303 37745 54821 53712 55825 28729 5171
8070E171O98j1092j377j597J7012n78k095J3936J7263N06q503J2991J0649J0524
$$ 5171 5869 -5223 -6600 -8197 8815 8237 6142 20078 37341 37847 29344 42335 52984 63508
8056F3508j69n0674l5616o854L552m243J3315M390n912K4732L9883R331q206j7716
$$ 63508 63339 12665 -22951 -29805 -26253 -30496 -17181 -12791 -18703 6029 45912 55243 47037 29321
8042B9321p806j9675k2805n997O999K8224K0637j090j646J1786q121r923o900
$$ 29321 21515 1840 -20965 -26962 -19963 8261 28898 27808 26162 37948 29827 19904 13004
8029A3004K1504J2098j7454l740j2613j9965k0078K4627K4728j0599m587m022
$$ 13004 34508 46606 29152 25412 12799 -7166 -27244 -2617 22111 11512 6925 2903
8017B903M989M1899M5866M051m0037j8479N478l5066j0068K900J5885j0746R193
$$ 2903 7892 49791 95657 99708 59671 41192 46670 11604 1536 4436 20321 9575 18768
8004A8768K528r965J1091J3552J7069O068r097J2242o819j3987Q910J1526Q859
$$ 18768 21296 11331 22422 35974 53043 59111 50014 62256 55437 41450 50360 61886 70745
7991G0745m530l6226J433K2462K9764K1632k6933q134j0724K5395J2586k5898
$$ 70745 66215 29989 31422 53884 83648 105280 78347 70213 59489 84884 97470 71572
7979G1572L681L4959J8288k0085L4821K0757k0916p390J9125j8318k9354j3842
$$ 71572 75253 110212 128500 108415 143236 163993 143077 135687 154812 136494 107140 93298
7967I3298k1676j2107o755P17N473k247l8145K9875K1246k3761K3823P034M484
$$ 93298 71622 59515 52760 53477 58950 56703 18558 48433 69679 45918 69741 76775 81259
7954H1259j8794k8803n239K3517K4482r231j5172O057j7932j502J1991J7010J4617
$$ 81259 62465 33662 28423 51940 76422 67191 52019 58076 40144 38642 50633 67643 82260
7941H2260o185o191k7858J2530Q019J8781m653n100M070J3590j7085r407O897
$$ 82260 76075 69884 42026 54556 62575 81356 76703 71603 75673 89263 72178 62771 69668
7928F9668Q57K0736k0127k2416J6974L706j1398N09K5523J4752m378j8186j4261
$$ 69668 70525 91261 71134 48718 65692 69398 58000 58509 84032 98784 94406 76220 61959
7915F1959k181l740p627r006J0954L5831l1816j3585l79J9304q63j8977O784M698
$$ 61959 59778 56038 48411 39405 50359 86190 54374 40789 40410 59714 58851 39874 46658 51356
7901E1356J4169K238n192K909j2275l0933l2501L0308K6401j4216j4217J683J4904
$$ 51356 65525 67763 62571 65480 53205 22272 -10229 20079 46480 32264 18047 19730 34634
7888C4634m244R219j1000j893j2940o899m84k0343j0486k935L0363l295j3828
$$ 34634 30390 39609 28609 26716 13776 6877 6393 -13950 -24436 -27371 2992 -303 -14131
7875a4131J5609J6719K668J3670K61K12k1935J2882K8500K816n1n937l9846j8890
$$ -14131 1478 18197 20865 34535 34796 35008 13073 25955 54455 57271 57220 51283 11437 -7453
7861g453J7687K0797O183J1596m145J7813o969k5152j8740k053J4999J9542K464
$$ -7453 10234 31031 37214 48810 44665 62478 55509 30357 11617 9564 24563 44105 46569
7848D6569j413R707L595L923j7361K868p292k8760j4268k528j1794K027J0943
$$ 46569 45156 54863 58458 62381 45020 47888 40596 11836 -2432 -4960 -16754 -14727 -3784
7835c784j1628oK3884L5847J7718P160k4230l4988L630K6344J8381L248k7787
$$ -3784 -15412 -15418 8466 44313 62031 69191 44961 9973 13603 39947 58328 61576 33789
7822C3789k4401J597J4816J2578p256K0351L3543j6062j1056j0999j6633r662
$$ 33789 9388 10985 25801 38379 31123 51474 85017 68955 57899 46900 30267 20605
7810B0605J2306P448L691j3478k5622j2433l99k0099J3730K1774j2151k139p75
$$ 20605 32911 40359 44050 30572 4950 -7483 -7882 -27981 -14251 7523 -4628 -6767 -7542
7797g542M565J3906r416J923O109j8091J3946K7341J7643p754j7350n520j1511
$$ -7542 -2977 10929 1513 3436 9545 -8546 5400 32741 50384 42630 25280 19760 8249
7784H249k2045j8048j7279J4504J3953p72K8119J967j5617K340L299j6270q842
$$ 8249 -13796 -31844 -49123 -34619 -20666 -21438 6681 8648 -6969 -4629 -1330 -17600 -26442
7771b6442L706J1633J0324J4370p216P525q956k8895j0451r559K8101J3000j3132
$$ -26442 -22736 -11103 -779 13591 6375 13900 4944 -23951 -34402 -43961 -15860 -2860 -15992
7758a5992p248j4855M532L0803M3714J4132k4316j6490J3519l629L162K7071k6822
$$ -15992 -23240 -38095 -33563 -2760 40954 55086 30770 14280 27799 24170 27332 54403 27581
7745B7581j3364k7187n231J294J0719K6174J4754K386k4610Q248J7059J2396n455
$$ 27581 14217 -12970 -18201 -16907 -6188 19986 34740 37126 12516 20764 37823 50219 44764
7732D4764j8431K213N743j6386K3187K0147k2407l8041k3018j7910r40N101J8443
$$ 44764 26333 28546 34289 17903 41090 61237 38830 789 -22229 -40139 -41079 -35978 -17535
7719a7535q218J4932M560o897L482K4473O041k8415Q88J907O475Q494J7829p256
$$ -17535 -25753 -10821 -6261 -13158 -9676 14797 20838 -7577 -6689 -4782 1693 10187 28016 20760
7705B0760K5062O632j1655j4919r161P273l4151k1720l537j5124R220m80L0781
$$ 20760 45822 52454 40799 25880 16719 23992 -10159 -31879 -35416 -50540 -41320 -41800 -11019
7692a1019K4012n778r320o014n536P568k713l5916k1152N500J8972j2352J1954
$$ -11019 12993 7215 -2105 -8119 -13655 -6087 -8800 -44716 -65868 -60368 -41396 -53748 -41794
7679d1794M8403J9478j2047k5908J5512J3199j4309l32P167l0991m2820o418K4423
$$ -41794 6609 26087 14040 -11868 3644 16843 2534 2202 9369 -21622 -64442 -70860 -46437
7666d6437K8762j2282k064K0651J3903k4460k5316Q232J2341l887P797j1472j2269
$$ -46437 -17675 -29957 -32021 -11370 2533 -21927 -47243 -39011 -26670 -30557 -22760 -34232 -46501
7653d6501O311L5461O548Q168j2403l2262K948K8808N733J3490q153q953j2033
$$ -46501 -40190 -4729 1819 9987 -2416 -34678 -31730 -2922 2811 16301 8148 -805 -12838
7640a2838q871k173Q882L077j0921j1723N2885P777N762q407j5129k5393k32m014
$$ -12838 -21709 -23882 -15000 -11923 -22844 -34567 18318 26095 31857 23450 8321 -17072 -17304 -21318
7626b1318P837J9409j9528J8809K7612k566j0121r648J970L318j289J5215r71
$$ -21318 -13481 5928 -13600 5209 32821 30255 20134 10486 12456 15774 14485 29700 28729
7613B8729p97r558k934j8500M4637J2017k7044m719J3873R625O474j6475k6846
$$ 28729 27932 18374 15440 -3060 41577 53594 26550 21831 35704 45329 51803 35328 8482
7600H482j1613K354j4235l725k0357L0130R905k398k8333j3767k67k0714J0865
$$ 8482 -3131 -777 -15012 -18737 -39094 -8964 941 -1457 -29790 -43557 -43824 -64538 -53673
7587e3673M5786K9870K0468M802n092O819j8528n4078m789L23P224o779p581l8108
$$ -53673 -7887 21983 42451 47253 42161 48980 30452 -23626 -28415 -28092 -20868 -27647 -35228 -73336
7573g3336q483K7094M5579J4391n459J8733O885n396N127J0843j0159j1351R318
$$ -73336 -81819 -54725 -9146 5245 -214 18519 25404 20008 25135 35978 25819 14468 23786
7560B3786r099k5274J4292j3999K846J8534p879l55m899j9363j366R400J5044
$$ 23786 14687 -10587 3705 -10294 -7448 11086 3207 2852 -2047 -21410 -22776 -13376 1668
7547A668j3239n331N951j3251j3671L4103J0361k8084l2753J4084M292K0899K4497
$$ 1668 -11571 -16902 -10951 -24202 -37873 -3770 6591 -21493 -54246 -40162 -35870 -14971 9526
7534I526K468j5244N793j6308o503j1229J2711r35j782n882j565P732K9783M4144
$$ 9526 11994 -3250 2543 -13765 -20268 -31497 -18786 -19721 -21503 -27385 -28950 -21218 8565 52709
7520E2709O088m6876k8643j5944P925K7563J4850J154J4601j0305l390j540j5766
$$ 52709 58797 11921 -16722 -32666 -24741 2822 17672 18826 33427 23122 19732 18192 2426
7507B426m420O416J0528Q115k6474r216J99l535N560j5190J633J1143q220k9929
$$ 2426 -1994 4422 14950 23065 -3409 -12625 -12426 -15961 -10401 -25591 -23958 -12815 -21035 -50964
7493e0964n354Q190k6715J2273K4151R540o711J3571M0922L0572k5600l2472J2540
$$ -50964 -56318 -48128 -74843 -62570 -38419 -28879 -35590 -22019 18903 49475 23875 -8597 3943
7480C943N058p828j0053J6573o78J3454j0019J3033J8698m617n782M710m1725
$$ 3943 9001 1173 -8880 7693 7015 20469 10450 23483 42181 37564 31782 36492 -5233
7467e233l4992j1074K1980J2078J9409J5602P578r586m993j470j0138j6514J5152
$$ -5233 -40225 -51299 -29319 -17241 2168 17770 25348 15762 10769 9299 -839 -17353 -2201
7454b201K6216K799j7032j6928j1953K1380j1325m382K5506j4495j308q130L91
$$ -2201 24015 26814 9782 -7146 -19099 2281 -9044 -13426 12080 -2415 -3723 -11853 -11462
7441a1462M786l1447j2494K3879J9510K5741j062l5007j0316J6952k3576k4488
$$ -11462 -6676 -38123 -50617 -26738 -7228 18513 17451 -17556 -27872 -10920 -34496 -58984
7429e8984l5166L1620M0573M882K1040J0931L774k0402k1655j5805K2409nQ255
$$ -58984 -94150 -62530 -21957 -17075 3965 14896 18670 -1732 -23387 -39192 -16783 -16788 -8533
7416h533L773O537J7392j7789k5761j2344j7759J2114O006K2652n80J9319R308
$$ -8533 -4760 1777 19169 1380 -24381 -36725 -54484 -42370 -36364 -13712 -14292 5027 14335
7403A4335k1207l018K811j4381r569L5971K0640j8841J188J2401j4855J3891K4706
$$ 14335 -6872 -9890 -7079 -21460 -31029 4942 25582 6741 7929 20330 5475 19366 44072
7390D4072j7176l1213P544J4729l7100j9920K1938Q146m118J468L5117L0370j0694
$$ 44072 26896 -4317 3227 17956 -19144 -39064 -17126 -8980 -13098 -11630 23487 53857 43163
7377D3163k7119r177K7318j4494K0824K2622l797j8747p838K7594k435l9624j8748
$$ 43163 16044 6867 34185 19691 40515 63137 59340 40593 32755 60349 57914 18290 -458
7364d58j3721j298J6362j6791N717M112j0835K1458J7337O301j6620m5003Q076
$$ -458 -14179 -15477 885 -15906 -10189 -6077 -16912 4546 21883 28184 11564 -33439 -25363
7351b5363P059K5436J4200r493k7822k8610N754J2153L430K0660J9476K8845l0930
$$ -25363 -18304 7132 21332 11839 -15983 -44593 -38839 -26686 -23256 -2596 16880 45725 14795
7338A4795l6594j9668K8004K8399p00M379r929j8054J772J1433j2646l320R568
$$ 14795 -21799 -41467 -13463 14936 14236 18615 8686 -9368 -7596 3837 -8809 -12129 -2561
7325b561k558j4174q400J0254j4051K5912J6179l6896K5857J0501r331P707j9033
$$ -2561 -5119 -19293 -27693 -17439 -31490 -5578 10601 -26295 -438 10063 732 8439 -10594
7312a0594j7775J1084N448P337K9854j3407r701L334j071o793J8820M133J768
$$ -10594 -28369 -17285 -11837 -4500 25354 11947 2246 5580 4509 -2284 16536 20669 22437
7299B2437J0747K813j407k5972k4180j0575R684K4168j9181k3068j0391L606k2141
$$ 22437 33184 35997 34590 8618 -15562 -26137 -16453 7715 -11466 -34534 -44925 -41319 -63460
7286f3460M2545J9757l0293O969j1018m3228J8604O7296L6863j1167P2l648J1643
$$ -63460 -20915 -1158 -31451 -24482 -35500 -78728 -60124 7172 44035 32868 32940 29292 40935
7273D0935j2828j3186m430k5961P449L277o818J0914M846j2011o396L5000K5242
$$ 40935 28107 14921 10491 -15470 -8021 -4744 -11562 -648 4198 -7813 -14209 20791 46033
7260D6033j2548k5595k1559J8878J6551J256l098r312P293J278k0758j0558R192
$$ 46033 33485 7890 -13669 5209 21760 23016 19918 10606 17899 19177 -1581 -12139 -2947
7247b947K3902L0244k646m0294k7430P281M286N225J3175j2393k399K783N930
$$ -2947 20955 51199 48553 8259 -19171 -11890 -7604 -2379 10796 -1597 -3996 -1213 4717
7234D717P243j3747l1615J2483P667K1289O394l4081p571J3128J498j6469O784
$$ 4717 11960 -1787 -33402 -20919 -13252 8037 14431 -19650 -27221 -14093 -12595 -29064 -22280
7221b2280Q927J4006N225J850j2101j3366j3883l182k1994R165J8938K289r261
$$ -22280 -13353 653 5878 7728 -4373 -17739 -31622 -34804 -56798 -47633 -28695 -26406 -35667
7208c5667J1753K2593P693k3004k281m521j9592j4087K229J6521K6605n064o417
$$ -35667 -23914 -1321 6372 -16632 -18913 -23434 -43026 -57113 -54884 -38363 -11758 -16822 -23239
7195b3239K4817K781k1327j4854N477p837L251m831K301J2031J6411K4910j7008
$$ -23239 1578 4359 -16968 -31822 -26345 -34182 -30931 -35762 -33461 -21430 -5019 19891 2883
7182B883j051k554k2236k3924j0354q143r580J3660L7945L209o099j1388p66o242
$$ 2883 1832 -722 -22958 -46882 -57236 -65379 -74959 -61299 -23354 -20145 -26244 -37632 -38398 -44640
7168d4640o342K9752k61k9348r059L7068J6449l7490l204k3356J8094K1514K4523
$$ -44640 -50982 -21230 -21491 -50839 -59898 -22830 -6381 -43871 -47075 -70431 -52337 -30823 -6300
7155f300M072o997j9874k1878L3965K4296m4798l3301k10L8241J8001M554j108
$$ -6300 -2228 -9225 -29099 -50977 -17012 7284 -37514 -70815 -71025 -32784 -14783 -10229 -11337
7142a1337j0515J2962J7643K9698J2313l1491m6134k3029j7822K691K5090n624
$$ -11337 -21852 -8890 8753 38451 50764 19273 -26861 -49890 -67712 -65021 -39931 -45555
7130d5555O952J8342p592J0203L7261J7346P600K314j7192j6497j7955j9212j9960
$$ -45555 -38603 -20261 -27853 -17650 19611 36957 44557 46871 29679 13182 -4773 -23985 -43945
7117d3945k5771j5182m690J9879J1018r117o379K459P612Q154J0934J3743R018
$$ -43945 -69716 -84898 -89588 -69709 -58691 -67808 -74187 -71728 -64116 -55962 -45028 -31285 -22267
7104b2267K0772j2566P791k9251Q125K1553R487k477J473k9992q602L1040l176
$$ -22267 -1495 -14061 -6270 -35521 -27396 -5843 3644 1167 2640 -27352 -35954 -4914 -8090
7091h090n336j4983j237Q843J0768l4280j9669L4584K4965L290j2743j1630M5943
$$ -8090 -13426 -28409 -29646 -20803 -10035 -44315 -63984 -29400 -4435 -1145 -13888 -25518 20425
7078B0425M633l607j8371J2919m926l8677j8560L01L2568K2662L666j0785k5661
$$ 20425 25058 21451 3080 15999 11073 -27604 -46164 -45863 -13295 9367 13033 2248 -23413
7065b3413K4794J7353J0555o445m0499j1795P033O746l1466Q9K0347K2170n669
$$ -23413 1381 18734 29289 22844 -17655 -29450 -22417 -15671 -47137 -47048 -26701 -4531 -10200
7052a0200l561k0587l630k3080k429J2240R384P436K5223n00k920J57k6187l4959
$$ -10200 -13761 -34348 -37978 -61058 -63487 -51247 -41863 -34427 -9204 -9704 -12624 -12467 -38654 -73613
7038g3613Q366J0618J766M1625K9404P02m0212R629l262l8021o037J9349n585
$$ -73613 -65247 -54629 -52863 -11238 18166 18868 -21344 -11715 -14977 -52998 -59035 -39686 -45271
7025d5271n363J4001J584L6190J1207J1465j6187l815K4871j8907j9793n212J5451
$$ -45271 -50634 -36633 -35049 1141 12348 23813 7626 3811 28682 9775 -10018 -15230 221
7012B21j0643l0070j6413R118K2082n449j5646Q16J0082R123o843j6881K0167
$$ 221 -10422 -40492 -56905 -47787 -25705 -31154 -46800 -45984 -35902 -26779 -33622 -50503 -30336
6999c0336L3029J7129M54k8226J2635J414k4312r920K1335L3252k378m856q077
$$ -30336 2693 19822 20276 -7950 4685 6099 -18213 -28133 -6798 26454 24076 19220 11143
6986A1143r405J124R041J0556J0838m658r515k5338k8317J341O2193j4216J905
$$ 11143 1738 2862 11903 22459 33297 28639 19124 -6214 -34531 -33190 29003 14787 16692
6973A6692r368r311J4499q134p334j971l7917J3348K2658J4034k3335K3772J5265
$$ 16692 7324 -1987 12512 4378 -2956 -4927 -42844 -29496 -6838 7196 -16139 7633 22898
6960B2898p359m204n674M198J0960j9274p145L179q6J1472K4193k4188m5350p391
$$ 22898 15539 11335 5661 9859 20819 1545 -5600 -2421 -2507 8965 33158 8970 -36380 -43771
6946d3771K172k130J7578J0000J6836q044j3389J1459m587l3757q767J2253J7366
$$ -43771 -41599 -43729 -26151 -16151 685 -7359 -20748 -9289 -13876 -47633 -56400 -44147 -26781
6933b6781K0923N211K095L914p030J0322J2355M264K772l0371k5686k367J1233
$$ -26781 -5858 -647 1448 5362 -1668 8654 21009 25273 28045 -2326 -28012 -30379 -19146
6920a9146k4439k047L871L458j3855p547R480K8865N878J6748R294Q300j4553
$$ -19146 -43585 -45632 -41761 -38303 -52158 -59705 -50225 -21360 -15482 1266 10560 18860 4307
6907D307k2788l3615M732J7815p884l440R753j012N126j0355K0172J1216p317
$$ 4307 -18481 -52096 -47364 -29549 -37433 -40873 -31120 -32132 -27006 -37361 -17189 -5973 -13290
6894a3290j0140K143R267J6187J1636r683l0240R808J5894J7388j1339m049k046
$$ -13290 -23430 -21287 -12020 4167 15803 6120 -24120 -14312 1582 18970 7631 3582 1536
6881A536m552p56J061J3270L3310k0122O323j7863j1658n35K753N514M551Q494
$$ 1536 -3016 -3772 -2711 10559 43869 23747 30070 12207 549 14 2767 8281 12832 21326
6867B1326j6036j1534j3912K6282K182j0758n296j6168j9588P296J0735o424q591
$$ 21326 5290 -6244 -20156 6126 8308 -2450 -7746 -23914 -43502 -36206 -25471 -31895 -40486
6854d0486J2529K6906J013N760O875J5680k4249L400k1735k677m742J440J0697
$$ -40486 -27957 -1051 -38 5722 12597 28277 4028 7428 -14307 -16984 -21726 -20286 -9589
6841i589M1154J5240k4048m1806K1105K5106l2264l0890q492J5941m658P869J5170
$$ -9589 31565 46805 22757 -19049 2056 27162 -5102 -35992 -44484 -28543 -33201 -25332 -10162
6828a0162p99J4193p175r614r409J3964k519q730J4888K7510L675m4347k3823
$$ -10162 -10961 3232 -3943 -13557 -22966 -9002 -11521 -20251 -5363 22147 25822 -18525 -42348
6815d2348l490J527j6674k8142J0103M2442Q778K1572M1455M630k1110k1371k4666
$$ -42348 -45838 -44311 -60985 -89127 -79024 -36582 -27804 -6232 35223 39853 18743 -2628 -27294
6802b7294r915J3284K6015q2k2499K8326p779K1310j0253k3197P966n699n841
$$ -27294 -37209 -23925 2090 2008 -20491 7835 56 21366 11113 -12084 -4118 -9817 -15658
6789a5658J4166j0665l2664m0223J6998N5884p47M9L0431M431n999l3757k154
$$ -15658 -1492 -12157 -44821 -85044 -68046 -12162 -12909 -12860 17571 22002 16003 -17754 -19908
6776a9908J8036K3979k1759l8114J0552p838J7508k3593j5267K4044L1569j2475
$$ -19908 -1872 22107 348 -37766 -27214 -35052 -17544 -41137 -56404 -32360 -791 -13266
6764a3266j4176P906J3835L4506L797l1452j0399j6651j8894k1030n149K8676
$$ -13266 -27442 -19536 -5701 28805 32602 1150 -9249 -25900 -44794 -65824 -70973 -42297
6752d2297K721p617R180Q371J5993L1277o349k2150l9058M207L8222j0154R560
$$ -42297 -39576 -47193 -38013 -29642 -13649 17628 11279 -10871 -49929 -45722 -7500 -17654 -8094
6739h094R877p419R079R651j4885O482k7693n419K1114k1809l7715Q995K8436
$$ -8094 1783 -5636 3443 13094 -1791 4691 -23002 -28421 -7307 -29116 -66831 -57836 -29400
6726b9400l605P976j952Q790L5300L993l2272P534J2053m8179l811l443O646L2481
$$ -29400 -33005 -25029 -26981 -18191 17109 21102 -11170 -3636 8417 -39762 -43573 -47016 -40370 -7889
6712g889K628n482m671j083j0436k8582O0R078K5965q284r146j855P903J2284
$$ -7889 -5261 -10743 -15414 -16497 -26933 -55515 -55455 -46377 -20412 -28696 -37842 -39697 -31794 -19510
6698a9510o71J4566j0250O945l31j3237j0668n927j7678P249J1630N132J6022
$$ -19510 -20181 -5615 -15865 -8920 -9251 -22488 -33156 -39083 -56761 -49512 -37882 -32750 -16728
6685a6728L158J5869J3612k5277j775J190l4303k6642l85L1681k2131K3964N2269
$$ -16728 -13570 2299 15911 -9366 -11141 -9951 -44254 -70896 -71281 -39600 -61731 -37767 14502
6672A4502N4436k2136n3370J3191L1038J6171k6608l9253j2841L9853o913L316
$$ 14502 68938 46802 -6568 6623 37661 53832 27224 -12029 -24870 14983 8070 11386
6660A1386J46r670k2326K1642j3301j159m358K0612m283N47J9011k6456K7651
$$ 11386 11532 1862 -20464 1178 -12123 -13282 -17640 2972 -1311 -764 18247 -8209 19442
6647A9442l169j8647k4332P650j3593l081l19K4O335R041K6624j2783k7158l761
$$ 19442 16273 -2374 -26706 -19056 -32649 -35730 -36049 -36025 -29690 -20649 5975 -6808 -33966 -37727
6633c7727N3002k6338o812N498J6547j7148j6561q70R379L5768Q402l5948l9842
$$ -37727 15275 -11063 -17875 -12377 4170 -12978 -29539 -30409 -21030 14738 23140 -12808 -52650
6620e2650J5524N413p359r155K0284j589k4457J6319K196J1582K844J3116k5136
$$ -52650 -37126 -31713 -39072 -48227 -27943 -29532 -53989 -37670 -35474 -23892 -21048 -7932 -33068
6607c3068n577j6139k0353j4920K1655J834J6986J5827J3888L4460J711k422j9065
$$ -33068 -38645 -54784 -75137 -90057 -68402 -66568 -49582 -33755 -19867 14593 16304 13882 -5183
6594e183q692K9065J6899K688j9426j4555L6287j157k3788l500L205n75J242J0678
$$ -5183 -13875 15190 32089 34777 15351 796 37083 35926 12138 8638 11843 11268 12510 23188
6580B3188k623j2738j2217J0119q148K477l933M838k9917l8774P923K9425r553
$$ 23188 20565 7827 -4390 5729 -2419 58 -3875 963 -28954 -67728 -59805 -30380 -39933
6567c9933k0261L722L6511J0435o144j1264J3801J9206l704k94j2136l3164J71
$$ -39933 -60194 -56472 -19961 -9526 -15670 -26934 -13133 6073 2369 2075 -10061 -43225 -43054
6554d3054n616k5351m544K8599J2619k6847j4554M8389J1281k4662m246J8285
$$ -43054 -48670 -74021 -78565 -49966 -37347 -64194 -78748 -30359 -19078 -43740 -47986 -29701
6542b9701K9368p07P718j1991k8613r291J9297n743j7054P04Q756P661l853k231
$$ -29701 -333 -1040 6678 -5313 -33926 -43217 -23920 -29663 -46717 -46013 -37257 -29596 -33449 -35680
6528c5680K1401K7596o623k4422k0056m106K664k710k6096J9343J3003J6949L6620
$$ -35680 -14279 13317 6694 -17728 -37784 -41890 -39226 -41936 -68032 -48689 -35686 -18737 17883
6515A7883o720N685n889j4649j3601M453n560j7652Q32j1986R606K6184o998j4707
$$ 17883 11163 16848 10959 -3690 -17291 -12838 -18398 -36050 -35218 -47204 -37598 -11414 -18412 -33119
6501c3119K1171M932j3537n862K2779K3722j322j5989j5471J4302L313k3716K2167
$$ -33119 -11948 -7016 -20553 -26415 -3636 20086 18764 2775 -12696 1606 4919 -18797 3370
6488C370J2969k7504J5065M809j4113J897n144j3992j4712J1913o946l8498N083
$$ 3370 16339 -11165 3900 8709 -5404 -3507 -8651 -22643 -37355 -25442 -32388 -70886 -65803
6475f5803L4695J389j9519J2534J0027J3877k095j7881j3941J7672L4450j6763
$$ -65803 -31108 -29719 -49238 -36704 -26677 -12800 -14895 -32776 -46717 -29045 5405 -11358
6463a1358k2865n93j5909j6387J7565o291K966k8668p52K5353O0576J6629r833
$$ -11358 -34223 -34816 -50725 -67112 -49547 -55838 -52872 -81540 -82292 -56939 3637 20266 10433
6450A0433N34j2043k1820j2637J3075J3039p257n971j9512O440N1865J6143m1243
$$ 10433 10967 -1076 -22896 -35533 -22458 -9419 -16676 -22647 -42159 -35719 16146 32289 -8954
6437h954j3960j3576k3372P928M582j5868j0674K4531l254M017J2664p373p195
$$ -8954 -22914 -36490 -59862 -51934 -47352 -63220 -73894 -49363 -52617 -48600 -35936 -43309 -50504
6424e0504J5262j3803O714J1554k8220M914J8922K4143J9375P558Q63k1257k8159
$$ -50504 -35242 -49045 -42331 -30777 -58997 -54083 -35161 -11018 8357 15915 16778 -4479 -32638
6411c2638K1293L5887n357j6850j7569j8545J5085J7991j4019j1922J5109L589
$$ -32638 -11345 24542 19185 2335 -15234 -33779 -18694 -703 -14722 -26644 -11535 -7946
6399g946K0214l348k1876J2686P406M065k2071k3779J4085l349K096j3414M368
$$ -7946 12268 8920 -12956 -270 7136 11201 -10870 -34649 -20564 -23913 -21817 -35231 -30863
6386c0863J9063j327J0638M4603n735p642j8496J085l134k347Q137M524k9394
$$ -30863 -11800 -13127 -2489 42114 36379 28737 10241 11326 8192 5845 13982 18506 -10888
6373a0888k7721l297L9211M25n439j5381n251l87j1991j7061N682J9372K5212
$$ -10888 -38609 -41906 -2695 -2270 -7709 -23090 -28341 -28728 -40719 -57780 -52098 -32726 -7514
6360g514L0824P762j6506j6701m642J904j0295M756j5904J0684L8103K2038k0555
$$ -7514 23310 31072 14566 -2135 -6777 -4873 -15168 -10412 -26316 -15632 22471 44509 23954
6347B3954l3796k8125q873L1295O358J2816J1318Q456k0371k7001j9657J1045
$$ 23954 -9842 -37967 -46840 -15545 -9187 3629 14947 23403 3032 -23969 -43626 -32581
6335c2581P106K6516O4q428j3384j6461J2775m995K0921r77l2096K3807m829j0881
$$ -32581 -25475 1041 1105 -7323 -20707 -37168 -24393 -29388 -8467 -9444 -41540 -17733 -22562 -33443
6321c3443j5449k094r732K5382O005P218L4767K8541k3962k8579j3009J9789l736
$$ -33443 -48892 -50986 -60718 -35336 -29331 -22113 12654 41195 17233 -11346 -24355 -4566 -8302
6308h302j8207j5767j606J0488K4964m075J3854q170l5306j0905J3886L1936L4593
$$ -8302 -26509 -42276 -43882 -33394 -8430 -12505 1349 -6821 -42127 -53032 -39146 -7210 27383
6295B7383J6907p851j7943k250j0878R852P277J9632j5918k4193l100l457K0340
$$ 27383 44290 36439 18496 16246 5368 15220 22497 42129 26211 2018 -1082 -4539 15801
6282A5801J1871k2707m243j1338j9549L11M871n376j2834q446j3172R881K4271
$$ 15801 27672 4965 722 -10616 -30165 -29854 -24983 -30359 -43193 -51639 -64811 -54930 -30659
6269c0659r96N564Q016k7613J1134J1537M2149J8793m461m5021o431J6859K7302
$$ -30659 -31655 -26091 -18075 -45688 -34554 -23017 19132 37925 33464 -11557 -17988 -1129 26173
6256B6173m952Q864r132j5294O304J812K948j7623j730k9J0296J0712K5364j3674
$$ 26173 21221 30085 20953 5659 11963 13775 16723 -900 -2630 -2659 7637 18349 43713 30039
6242C0039k5866J621j7321K900m640K2994p224q042K360j0829N015J1619m637
$$ 30039 4173 5794 -11527 -8627 -13267 9727 2503 -5539 -3179 -14008 -8993 2626 -2011
6229b011J7701L6444K6037k7778n5999m1264J1863M0696Q089k3890J3445r107
$$ -2011 15690 52134 78171 50393 -5606 -46870 -35007 5689 13778 -10112 3333 -5774
6217e774J560K3435o857j8707r674J1479j651j3744N391M278o944O426J6989j0562
$$ -5774 -4214 19221 12364 -6343 -16017 -4538 -6189 -19933 -14542 -10264 -17208 -10782 6207 -4355
6203d355K1997J7490l7887q732J9362J4136m515l1238j695l020j0405J2131q439
$$ -4355 17642 35132 -2755 -11487 7875 22011 17496 -13742 -15437 -18457 -28862 -16731 -25170
6190b5170j9470j2271j0773J0727L0514M6582o904l1566q930O091p95N396K2502
$$ -25170 -44640 -56911 -67684 -56957 -26443 20139 13235 -18331 -27261 -21170 -21965 -16569 5933
6177E933N845J8848q132j3486o550j810n912K1599K776p400J6840j6529m579q726
$$ 5933 11778 30626 22494 9008 2458 648 -5264 16335 19111 11711 28551 12022 7443 -1283
6163a283j3880l837k8907P796J3617R227J0077K791P13J2593k1782J1019N059
$$ -1283 -15163 -19000 -47907 -40111 -26494 -17267 -7190 -4399 -3686 8907 -12875 -1856 3203
6150C203l5145j397J6989p831k6441J5804J7896j3401k0271l118J8413J5301l1761
$$ 3203 -31942 -33339 -16350 -24181 -50622 -34818 -16922 -30323 -50594 -53712 -35299 -19998 -51759
6137e1759k9557J5237J6702K5658L3036J7668J1825o7378m7925L6824L0493J6792
$$ -51759 -81316 -66079 -49377 -23719 9317 26985 38810 -28568 -76493 -39669 -9176 7616
6125G616J8292j7110j9998m496J6046J1469j422j7079K097j7721j4876K1378q716
$$ 7616 25908 8798 -11200 -15696 350 11819 10397 -6682 -4585 -22306 -37182 -15804 -24520
6112b4520J0346J1411J3699j3143J2102M0490k1974m0239k5182j634J761O216
$$ -24520 -14174 -2763 10936 -2207 9895 50385 28411 -11828 -37010 -38644 -36883 -30667
6100c0667j0123J1876J1393O502R395j3259r581K3232p58j2556k8507K5495M044
$$ -30667 -40790 -28914 -17521 -11019 -1624 -14883 -24464 -1232 -1990 -14546 -43053 -17558 -13514
6087a3514j1610J1707J1523j060R932J1952j8529l7614n908L4838O324k2827p13
$$ -13514 -25124 -13417 -1894 -2954 6978 18930 401 -37213 -43121 -8283 -1959 -24786 -25499
6074b5499K0519J1680o848j1371k1975k0307q496K3092J0753K9027l837l3811
$$ -25499 -4980 6700 -148 -11519 -33494 -53801 -62297 -39205 -28452 575 -3262 -37073
6062c7073r306J7305O739L037R756J266J560j4705k8661m850J4257L5676k47J0993
$$ -37073 -46379 -29074 -22335 -19298 -9542 -8276 -6716 -21421 -50082 -54932 -40675 -4999 -5246 5747
6048E747J4669Q405l1475n821L761k977J010j5495J345k3527K4754m798j3695
$$ 5747 20416 28821 -2654 -8475 -4714 -7691 -6681 -22176 -20831 -44358 -19604 -24402 -38097
6035c8097j7012r351J1261Q507J2628J0114K4591R123K2928M60k1048k9827k5783
$$ -38097 -55109 -64460 -53199 -44692 -32064 -21950 2641 11764 34692 35152 14104 -15723 -41506
6022d1506J0662J2481L034J077j891J3613R51j1403J9371R00k8889o871M5260
$$ -41506 -30844 -18363 -15329 -14252 -16143 -2530 -1579 -12982 6389 7289 -21600 -28471 16789
6009A6789J621o786J4018n007k6318J685R661p280p336K3308j4282k7027L5236
$$ 16789 18410 11624 25642 20635 -5683 -3998 5663 -1617 -8953 14355 73 -26954 8282
5996H282N346o740p944j8674j0490J9009J5051J4092R042r812k3368L857Q858
$$ 8282 13628 6888 -1056 -19730 -30220 -11211 3840 17932 26974 17162 -6206 -2349 6509
5983F509l659j8564K0763k663j751j290k5027j10K9598P087j7673j1642J2553
$$ 6509 2850 -15714 5049 2386 635 -655 -25682 -25792 3806 10893 -6780 -18422 -5869
5970e869j2360j832o520J4485K6958j1712k3866M999m549J8440J0151j6417M495
$$ -5869 -18229 -20061 -26581 -12096 14862 3150 -20716 -15717 -20266 -1826 8325 -8092 -3597
5957c597J425R5P657m157p80k359K7826r902j3617j9478l9365N888K7128N149
$$ -3597 -2172 -2077 5580 1423 643 -1716 26110 16208 2591 -16887 -56252 -50364 -23236 -18087
5943a8087q988M0521R26j7567m864j2203j9095J178O176J7546N080j5885J1370
$$ -18087 -27075 13446 14372 -3195 -8059 -20262 -39357 -38179 -32003 -14457 -9377 -25262 -13892
5930a3892K541k6480J2791j4508m080J7847n772l0160K4472J3690j0762J0866
$$ -13892 -11351 -37831 -25040 -39548 -43628 -25781 -31553 -61713 -37241 -23551 -34313 -23447
5918b3447N382K8247l2598J0596K2978L992o721O750N492P944k4086j558k869
$$ -23447 -18065 10182 -22416 -11820 11158 15150 8429 15179 20671 28615 4529 2971 102
5905A02j8675L913P854P441P366r894j0507o200J1525N119Q61M473j6265J5739
$$ 102 -18573 -14660 -6806 635 8001 -1893 -12400 -18600 -7075 -1956 -1095 3378 -12887 2852
5891B852J6640j8334j6526M144q943J553M221k237O137L964j3814j4313K9022
$$ 2852 19492 1158 -15368 -11224 -20167 -18614 -14393 -16630 -10493 -6529 -20343 -34656 -5634
5878e634K2389j7313k2480K2576K301k401j6768K1232J8879o369N797l812j1901
$$ -5634 16755 -558 -23038 -462 1839 -562 -17330 3902 22781 16412 22209 18397 6496
5865F496J960k0380q225M4868K7625l6969m0255O219J0095p84q453J5398j0979
$$ 6496 8456 -11924 -20149 24719 52344 15375 -24880 -18661 -8566 -9350 -17803 -2405 -13384
5852a3384k322J8775l1544J7421Q282j7154l2203p78J3734J071k044L8771k5747
$$ -13384 -15706 3069 -28475 -11054 -2772 -19926 -52129 -52907 -39173 -38102 -40146 -1375 -27122
5839b7122j1190l963j68n007J5529R163K9242m13q659j1798L9925J0207l552O925
$$ -27122 -38312 -42275 -42443 -47450 -31921 -22758 6484 6071 -2588 -14386 25539 35746 32194 39119
5825C9119k5181J2404j6684j5111l125j6303L904n978j5987M005Q22R792J9923
$$ 39119 13938 26342 9658 -5453 -8578 -24881 -20977 -26955 -42942 -38937 -38115 -28323 -8400
5812h400J7143j8762N12k2076j8088k4920L2794M1849J8149J6506M228J0093j5151
$$ -8400 8743 -10019 -9507 -31583 -49671 -74591 -41797 52 18201 34707 38935 49028 33877
5799C3877J410k9693j8790J409J1191J8357J2444j8604k0216J0724j6242k839
$$ 33877 35287 5594 -13196 -11787 -596 17761 30205 11601 -8615 2109 -14133 -16972
5787a6972o565m8945L8M439K3490J5200N34J6189p269m680J410l0693n056L1363
$$ -16972 -23537 -72482 -72444 -68005 -44515 -29315 -28781 -12592 -19861 -24541 -23131 -53824 -58880 -27517
5773b7517o36l2774P936J4419K5484j5363j5211k2937J292K1697J2164O392J2645
$$ -27517 -28153 -60927 -52991 -38572 -13088 -28451 -43662 -66599 -65307 -43610 -31446 -25054 -12409
5760a2409K190p530j3273K2721M1414J8078l148n022j4533k9703j6684j0621J5833
$$ -12409 -10219 -17749 -31022 -8301 33113 51191 48043 43021 28488 -1215 -17899 -28520 -12687
5747a2687L238L7103J7035j4762k4426M10M206o664o039j0146p018k4483J6165
$$ -12687 -9449 27654 44689 29927 5501 5911 10117 3453 -2586 -12732 -19750 -44233 -28068
5734b8068k5826k9894K7411L3422K1120M545k0512k3511m1202j3885L5975L3763
$$ -28068 -53894 -83788 -56377 -22955 -1835 2710 -17802 -41313 -82515 -96400 -60425 -26662
5722b6662K2115p740p729k384Q516j2084q141m297M185k0526N71j416m587K3441
$$ -26662 -4547 -12287 -20016 -22400 -13884 -25968 -34109 -38406 -34221 -54747 -54176 -55592 -60179 -36738
5708c6738J4877Q682j8573q754M617j6184J4198j6492m92K1713R420q566q3q400
$$ -36738 -21861 -13179 -31752 -40506 -35889 -52073 -37875 -54367 -54859 -33146 -23726 -32292 -32375 -40775
5694d0775j1647J803J6206N754J4618J64N286j7217N727j6674k8622j9649L4983
$$ -40775 -52422 -50619 -34413 -28659 -14041 -13877 -8591 -25808 -20081 -36755 -65377 -85026 -50043
5681e0043L6104J8356k054K8458n4347j9547J4718j455l619m272P873J4187L791
$$ -50043 -13939 4417 2363 30821 -23526 -43073 -28355 -29810 -33429 -37701 -29828 -15641 -11850
5668a1850J6180j6695K1244Q207j2082P560k2052j7371o782j1517l0074p436K0343
$$ -11850 4330 -12365 8879 17086 5004 12564 -9488 -26859 -33641 -45158 -75232 -82668 -62325
5655f2325N3010J4344L019j8442k2721k1299J0082J0987J4855j2533J514K5867
$$ -62325 -9315 5029 8048 -10394 -33115 -54414 -44332 -33345 -18490 -31023 -29509 -3642
5643c642J9053k0585j5263p960K6128j7557j3200K2323Q276P107m5734J1906N5232
$$ -3642 15411 -5174 -20437 -28397 -2269 -19826 -33026 -10703 -2427 4680 -41054 -29148 26084
5630B6084L6602K08l1607k4068Q194j3689k5363J3192J6235P00o527j1090k7628
$$ 26084 62686 62894 31287 7219 15413 1724 -23639 -10447 5788 6488 -39 -11129 -38757
5617c8757R970O124J5297Q908J8795J151K885k0297k65j3861L994J6906J8482
$$ -38757 -28787 -22663 -7366 1542 20337 21488 24373 4076 3811 -10050 -6056 10850 29332
5604B9332n4919j6029o237K3602L5373j1934n446J8552j6159k9232K597K1390
$$ 29332 -25587 -41616 -47853 -24251 11122 -812 -6258 12294 -3865 -33097 -30500 -9110
5592i110j3268J1284K119J2594k283m500l4515j2706J4125K936m425L437k1308
$$ -9110 -22378 -11094 -8975 3619 1336 -3164 -37679 -50385 -36260 -33324 -37749 -34312 -55620
5579e5620O133m596L1554M2991k414j3818j638m826k5288k6681J0441K518q754
$$ -55620 -49487 -54083 -22529 20462 18048 4230 2592 -2234 -27522 -54203 -43762 -41244 -49998
5566d9998J4199m690J0722K5654L1334K433J6160k0722j3244p926R148r89q406
$$ -49998 -35799 -40489 -29767 -4113 27221 29654 45814 25092 11848 3922 13070 12081 3675
5553C675j839J683K8328J7219o134m539j4422l2498N259J9854L653r127Q332K5585
$$ 3675 1836 3519 31847 49066 42932 38393 23971 -8527 -3268 16586 20239 11112 19444 45029
5539D5029L843m7500l9359j2714j1733j1097J3721K8715J0709Q046j3822K838
$$ 45029 48872 1372 -37987 -50701 -62434 -73531 -59810 -31095 -20386 -12340 -26162 -23324
5527b3324M538J5831N060P87O702r212J7493K7924j000o258j5883n1288r935j1353
$$ -23324 -18786 -2955 2105 2892 9594 382 17875 45799 44799 38541 22658 -28630 -38565 -49918
5513d9918K93K0582J3856L115l3869k0711q701K7471N632j906J7684j5620K7494
$$ -49918 -49625 -29043 -15187 -12072 -45941 -66652 -75353 -47882 -42250 -44156 -26472 -42092 -14598
5500a4598J7368k9484o020p948n926Q120J4513j79j955p036q134j3406P505R958
$$ -14598 2770 -26714 -32734 -40682 -46608 -38488 -23975 -24154 -26109 -33145 -41279 -54685 -47180 -37222
5486c7222n256J3212J2357k6236j3046J3367J6642j4028l331L3262J8153k3453
$$ -37222 -42478 -29266 -16909 -43145 -56191 -42824 -26182 -40210 -43541 -10279 7874 -15579
5474a5579j0460r804J6463k072J8183L2251M999N862j1238p179k8890n323M467
$$ -15579 -26039 -35843 -19380 -21452 -3269 28982 33981 39843 28605 21426 -7464 -12787 -8320
5461h320J7248N874j0064M700k1245j0081J4528L3190m415n604q134k7322j7849
$$ -8320 8928 14802 4738 9438 -11807 -21888 -7360 25830 21415 15811 7677 -19645 -37494
5448c7494J2402K5090R254p334k5814j0553R395K6617L7280N871j7144m676O159
$$ -37494 -25092 -2 9252 1918 -23896 -34449 -25054 1563 38843 44714 27570 22894 29053
5435B9053N807k4711r738J2854K198j7554J1951M395j0274j6134l3545K2143K2206
$$ 29053 34860 10149 411 13265 15463 -2091 9860 14255 3981 -12153 -45698 -23555 -1349
5422a349J4388l2699j9765Q188M0748L7411p098P622j851j2724j4976j1107k3167
$$ -1349 13039 -19660 -39425 -31237 9511 46922 39824 47446 45595 32871 17895 6788 -16379
5409a6379R246n284j968L4264m509m592J5789o199K9770n243l839o82j8225k6604
$$ -16379 -7133 -12417 -14385 19879 15370 10778 26567 20368 50138 44895 41056 40374 22149 -4455
5395d455J7166j289j1709l6835l879K2464K018m68p072Q929P585R339O654j5358
$$ -4455 12711 11422 -287 -37122 -41001 -18537 -16519 -16987 -24059 -15130 -7545 1794 8448 -6910
5381f910K0237o835O252Q705L486o508j6237k196J4470M391k0914j0957j4255
$$ -6910 13327 6492 12744 21449 24935 18427 2190 -6 14464 18855 -2059 -13016 -27271
5368b7271j3107j2186J3030j6713p058P462O647L7034J2304k4029p345j5138J4954
$$ -27271 -40378 -52564 -39534 -56247 -63305 -55843 -49196 -12162 142 -23887 -31232 -46370 -31416
5355c1416J4072K9889k0795k1616K138J1106M832j7261J7557k0948k9106J3704
$$ -31416 -17344 12545 -8250 -29866 -27728 -16622 -11790 -29051 -11494 -32442 -61548 -47844
5343d7844l552J4963J4710j4014k4347k5021J4857J3127O524K294j193j273k7646
$$ -47844 -51396 -36433 -21723 -35737 -60084 -85105 -70248 -57121 -50597 -48303 -49496 -50769 -78415
5330g8415n000K8380L2171J3507j435k726m489K8668J9066M594k4755j1053j3042
$$ -78415 -83415 -55035 -22864 -9357 -10792 -13518 -18007 10661 29727 34321 9566 -1487 -14529
5317a4529M641K8423Q179n036k1006n315O244K1452r857j1186K6503L580j7330
$$ -14529 -9888 18535 26714 21678 672 -4643 1601 23053 13196 2010 28513 32093 14763
5304A4763j1013J174K3033l2206m4679m798L7016M5989j0359k0445j1386j4718
$$ 14763 3750 4924 27957 -4249 -48928 -53726 -16710 29279 18920 -1525 -12911 -27629
5292b7629n140K7238J3824j4945L68J1534P404j4575j4129J2978L51J3982K5121
$$ -27629 -32769 -5531 8293 -6652 -6284 5250 12654 -1921 -16050 -3072 -2721 11261 36382
5279C6382j8241Q122K7538k5110j8253M165K0606J0461j2787j4762K6698J5246
$$ 36382 18141 26263 53801 28691 10438 14603 35209 45670 32883 18121 44819 60065
5267F0065k3254k3759k1749l30K503k3062l4112l12J9382Q71P562J8891J495P103
$$ 60065 36811 13052 -8697 -9027 -6524 -29586 -63698 -64010 -44628 -43757 -36195 -17304 -15809 -8706
5253h706j7935r253K0275L0361r150r429j4106k0581L06M724j0060P650Q562L0128
$$ -8706 -26641 -35894 -15619 14742 5592 -3837 -17943 -38524 -38218 -33494 -43554 -35904 -27342 2786
5239B786J1713j7813k4799J2241J2603j5917k4908J5586L7154J554p719m3338
$$ 2786 14499 -3314 -28113 -15872 -3269 -19186 -44094 -28508 8646 10200 2481 -40857
5227d0857K1788K1700j8967n1p409m871l4974k1878M986n683J1698J2834L2049
$$ -40857 -19069 2631 -16336 -16387 -23796 -28667 -63641 -85519 -80533 -86216 -74518 -61684 -29635
5214b9635J4010J2031O429j9275j2066M815J0558N075k4571N13K9401j1989j9736
$$ -29635 -15625 -3594 2835 -16440 -28506 -23691 -13133 -8058 -32629 -32116 -2715 -14704 -34440
5201c4440m677p399j7399R918K8950n181n059K1868J9878j6855q223K7517J8956
$$ -34440 -39117 -46516 -63915 -53997 -25047 -30228 -35287 -13419 6459 -10396 -18619 8898 27854
5188B7854P789m2977k572J8295j6037j7907J1228j1828j680K2003M717k2771j1771
$$ 27854 35643 -7334 -9906 8389 -7648 -25555 -14327 -26155 -27835 -5832 -1115 -23886 -35657
5175c5657o840N203P240K5781K6388M415r508k090N89k2380j0550l5331k6929
$$ -35657 -42497 -37294 -30054 -4273 22115 26530 17022 14932 15521 -6859 -17409 -52740 -79669
5162g9669L692J1175K2218R235K4230m025O31l3488R438J9190j8030j1604J3894
$$ -79669 -75977 -64802 -42584 -33349 -9119 -13144 -12513 -46001 -36563 -17373 -35403 -47007 -33113
5149c3113J2580K8782n415o285r041J9958K0888l07j6765l064l186r834j090j7255
$$ -33113 -20533 8249 2834 -3451 -12492 7466 28354 28047 11282 8218 5032 -4802 -5892 -23147
5135b3147n546q628O557J8789Q889R747J0157N77j947m684J8779J8855j5316k217
$$ -23147 -28693 -37321 -30764 -11975 -3086 6661 16818 17395 15448 10764 29543 48398 33082 30865
5121C0865j8095j2426P140J208o251k4679o312jn170o778K5918K6689m1455j929
$$ 30865 12770 344 7484 8692 2441 -22238 -28550 -28551 -33721 -40499 -14581 12108 -29347 -31276
5107c1276k101K742L0027J6328k1972k985l51k2080j2359K1360K1197N14k2844
$$ -31276 -33377 -30635 -608 15720 -6252 -9237 -9588 -31668 -44027 -22667 -1470 -956 -23800
5094b3800r824m557j4764L0433L9297p373k3986J5783O154m388k0592j9429r151
$$ -23800 -33624 -38181 -52945 -22512 16785 9412 -14574 1209 7363 2975 -17617 -37046 -46197
5081d6197O276P693j4350k189J3447j081j0626o347R772J6942J4566J4608j7884
$$ -46197 -39921 -32228 -46578 -48767 -35320 -36401 -47027 -53374 -43602 -26660 -12094 2514 -15370
5068a5370r901k2973J309j048M980n148J8383k403M057j4407J4602L2631K2281
$$ -15370 -25271 -48244 -46935 -47983 -43003 -48151 -29768 -32171 -28114 -42521 -27919 4712 26993
5055B6993j6230m1043l9846J4826J9120K0632k0684L977p56K954j0381J3062R861
$$ 26993 10763 -30280 -70126 -55300 -36180 -15548 -36232 -32255 -33011 -30057 -40438 -27376 -17515
5042a7515O043j029r523J3813j3847O321L1444m018q619k7968o570k1195O633
$$ -17515 -11472 -12501 -22024 -8211 -22058 -15737 15707 11689 3070 -24898 -31468 -52663 -46030
5029d6030J0894Q37L521k4846J3518J0661J8216J1725M680j6338k3418q761J2808
$$ -46030 -35136 -34299 -30778 -55624 -42106 -31445 -13229 -1504 3176 -13162 -36580 -45341 -32533
5016c2533J3676j0579q597J1663P813l37J2934J3628j0001r626J4444J2356l784
$$ -32533 -18857 -29436 -38033 -26370 -18557 -18894 -5960 7668 -2333 -11959 2485 14841 11057
5003A1057l9962K1423J5696k3480n525J4835M557j1548M608j094q200j9588R313
$$ 11057 -28905 -7482 8214 -15266 -20791 -5956 -1399 -12947 -8339 -9433 -17633 -37221 -27908
4990b7908J0057k665k613l0963P472J83P415L7806J1498k4678m61n243l859p609
$$ -27908 -17851 -20516 -23129 -54092 -46620 -46437 -39022 -1216 10282 -14396 -14857 -20100 -23959 -31568
4976c1568K235J1522l044K0815K0984J5794m7767j2676j8582O948J6146J0047
$$ -31568 -29333 -17811 -20855 -40 20944 36738 -11029 -23705 -42287 -35339 -19193 -9146
4964i146l1035L874J7785J9989J3605l3667o904r542j1664n979o310K7192K4142
$$ -9146 -40181 -36307 -18522 1467 15072 -18595 -25499 -35041 -46705 -52684 -58994 -31802 -7660
4951g660K5348J1764k86m081n708Q445J2250j2579k3385J0214n97k4589j6019
$$ -7660 17688 29452 29166 25085 19377 27822 40072 27493 4108 14322 13725 -10864 -26883
4938b6883J264L4K0668L902J8521J5363l8300m0184j2126R127M7309m185k4258
$$ -26883 -25619 -25585 -4917 -1015 17506 32869 -5431 -45615 -57741 -48614 -1305 -5490 -29748
4925b9748j6971K5325l3840P855K9871j417J032K2784l55J8502L599j9564R15
$$ -29748 -46719 -21394 -55234 -47379 -17508 -18925 -17893 4891 4536 23038 26637 7073 7988
4912G988L3870K1500j7558m658j3926m6394k6023q270J3034L1515J303k2001P30
$$ 7988 41858 63358 45800 41142 27216 -19178 -45201 -53471 -40437 -8922 -7619 -29620 -28890
4899b8890L816K9185K0843K2139j907J486L471l5766l4306n9575n016O0833K5679
$$ -28890 -25074 4111 24954 47093 45186 46672 50143 14377 -19929 -79504 -84520 -23687 1992
4886A992k0028L395K3646O379J0438J0960K852p287j2017k7526o528J1397k9075
$$ 1992 -18036 -14641 9005 15384 25822 36782 39634 32347 20330 -7196 -13724 -2327 -31402
4873c1402L47l025N027N319J2110j613j8595Q560K4296k4089J7654K5313j3230
$$ -31402 -31055 -34080 -29053 -23734 -11624 -13237 -31832 -23272 1024 -23065 -5411 19902 6672
4860F672J7716P065O403m5323r983J8972k1047q38k2350K9127k0978q749N194
$$ 6672 24388 31453 37856 -7467 -17450 1522 -19525 -20363 -42713 -13586 -34564 -43313 -38119
4847c8119Q049M7355K0077k0103o066k4651j5248k0476J6919L934P787K3321Q558
$$ -38119 -30070 17285 37362 17259 11193 -13458 -28706 -49182 -32263 -28329 -20542 2779 11337
4834A1337K3640l52m8236k0016P598j490o359J8635l336K6848Q103P256j3573
$$ 11337 34977 34625 -13611 -33627 -26029 -27519 -33878 -15243 -18579 8269 16372 23628 10055
4821A0055j7859q414n136P295J4294N033k404j7673k0569O452J1088K5590J7583
$$ 10055 -7804 -16218 -21354 -14059 235 5268 2864 -14809 -35378 -28926 -17838 7752 25335
4808B5335l1697k9693K1128L306M314M36r095K8405K6292j4046l7165j2943j1532
$$ 25335 -6362 -36055 -14927 -11621 -7307 -6871 -15966 12439 38731 24685 -12480 -25423 -36955
4795c6955k051K1553M1989L4085q420l0951j9139j2043o30j705m641q387Q060
$$ -36955 -39006 -17453 24536 58621 50201 19250 111 -11932 -12562 -14267 -18908 -27295 -19235
4782a9235j7571J7089P301p274j0792K6717L0314J4779k2578k4429j2652j0953
$$ -19235 -36806 -19717 -12416 -19690 -30482 -3765 26549 41328 18750 -5679 -18331 -29284
4770b9284K2411n683k4713l0407j2195J0524J7531j3755n634J8652L3295o362
$$ -29284 -6873 -12556 -37269 -67676 -79871 -69347 -51816 -65571 -71205 -52553 -19258 -25620
4758b5620p123j8499K871J9583n655K9839J3223j8838J200L022J0263j6324k6302
$$ -25620 -32743 -51242 -48371 -28788 -34443 -4604 8619 -10219 -9019 -5997 4266 -12058 -38360
4745c8360J3365J9147R811J4606j5632k0772J6724L0400J0433k3053k0197J3553
$$ -38360 -24995 -5848 3963 18569 2937 -17835 -1111 29289 39722 16669 -3528 10025
4733A0025M493P513q717j6600J1470J8640L494j6600k3108J9222k324J3395j4740
$$ 10025 14518 22031 13314 -3286 8184 26824 30318 13718 -9390 9832 7508 20903 6163
4720F163N986p220j0019K4519K756l2516m058L8819J3083k3565j2550M672r496
$$ 6163 12149 4929 -5090 19429 22185 -10331 -14389 24430 37513 13948 1398 6070 -3426
4707c426Q520M455J0985J2170j1812j4360j3967j6016O058n04r222j2081k3424
$$ -3426 5094 9549 20534 32704 20892 6532 -7435 -23451 -17393 -17897 -27119 -39200 -62624
4694f2624j5651K8655P875M2933K0932j2505k6211J1115K600k8417J4253L023
$$ -62624 -78275 -49620 -41745 1188 22120 9615 -16596 -5481 -2881 -31298 -17045 -14022
4682a4022P054N956m44j9347J953j0572q939k4478R269J4233K317k8074j0073
$$ -14022 -6968 -1012 -1456 -20803 -18850 -29422 -38361 -62839 -53570 -39337 -37020 -65094 -75167
4669g5167J2669J2067K0926J3855K1990k847M194J669q231K0262K6729q905k6353
$$ -75167 -62498 -50431 -29505 -15650 6340 3493 7687 9356 1125 21387 48116 39211 12858
4656A2858p852j4166j6770j8125M4846N034k0468j238j1228j2385m321K3101p077
$$ 12858 5006 -9160 -25930 -44055 791 5825 -14643 -15881 -27109 -39494 -43815 -20714 -27791
4643b7791j4153l871J3411J3937J4576P88j2477J8585p250K3094p712j5987J6392
$$ -27791 -41944 -45815 -32404 -18467 -3891 -3103 -15580 3005 -4245 18849 11137 -4850 11542
4630A1542O853k2382j2240L369j159J3249L2291L4034j6196j2051o05l495j4934
$$ 11542 18395 -3987 -16227 -12858 -14017 -768 31523 65557 49361 37310 36705 33210 18276
4617A8276j9728L788j280m985p029N581k4040O171J0599L129o808j557j0614O626
$$ 18276 -1452 2336 1056 -3929 -10958 -5377 -29417 -23246 -12647 -9518 -16326 -17883 -28497 -21871
4603b1871L785n576K3512p42N749n604M050K8703o968j5215L35K1027R376j9841
$$ -21871 -18086 -23662 -150 -892 4857 -747 3303 32006 25038 9823 10158 31185 40561 20720
4589B0720o691L094L760q403j4222L55j0487j7571J7931L888K688N796j9817K962
$$ 20720 14029 17123 20883 12480 -1742 -1387 -11874 -29445 -11514 -7626 -4938 858 -18959 -15997
4575a5997K2055J3904m910j0867l519J107k2771j4049k2900j213K4261K6990J9368
$$ -15997 6058 19962 15052 4185 666 1773 -20998 -35047 -57947 -59160 -34899 -7909 11459
4562A1459r481r387O097j6989j795J2271P523L413l291j1963L614j0626k4120
$$ 11459 1978 -7409 -1312 -18301 -20096 -7825 -302 3111 -180 -12143 -8529 -19155 -43275
4549d3275R684K5997n108K3400J797k4168M075O212p204K408j079N684L345o885
$$ -43275 -33591 -7594 -12702 10698 12495 -11673 -7598 -1386 -8590 -6182 -7261 -1577 1768 -5117
4535e117J7999K1760o409k3038j5532k463J971K8591m992J3089N358j0115R498
$$ -5117 12882 34642 28233 5195 -10337 -12800 -10829 17762 12770 25859 31217 21102 30600
4522C0600n924Q113o734n37O852m2941L82j4116j9480r756M362n908K2374K780
$$ 30600 24676 32789 26055 25518 32370 -10571 -10189 -24305 -43785 -53541 -49179 -55087 -32713 -29933
4508b9933K1070P112j2312M781K4171r259o844n753l637J7816J8479j4344M135
$$ -29933 -8863 -1751 -14063 -9282 14889 5630 -1214 -6967 -10604 7212 25691 11347 15482
4495A5482p743p632o717J5535m842K815O537j8159J9782k5529j8493k4130J8129
$$ 15482 7739 107 -6610 8925 4083 6898 13435 -4724 15058 -10471 -28964 -53094 -34965
4482c4965K2951J1508L6945K740o9751J607K1574K2405j0126m440n275j5383k975
$$ -34965 -12014 -506 36439 39179 -30572 -28965 -7391 15014 4888 448 -4827 -20210 -23185
4469b3185L573J2381j2542j351j2784j6638P850J0715K1618K5733r719j9736J4383
$$ -23185 -19612 -7231 -19773 -21124 -33908 -50546 -42696 -31981 -10363 15370 5651 -14085 298
4456B98j0030n257K7719k588j9841j3494J2653R863J6724J1271j5755K265J54
$$ 298 -9732 -14989 12730 10142 -9699 -23193 -10540 -677 16047 27318 11563 13828 13982
4443A3982o585l2855O018J7409N708p392o534n22j1715j3029j4882K9281L8693
$$ 13982 7397 -25458 -19440 -2031 3677 -3715 -10249 -10771 -22486 -35515 -50397 -21116 17577
4430A7577J0119O813j1387n3826j1378k319J4213M0317J3030j693l0412J0764
$$ 17577 27696 34509 23122 -30704 -42082 -44401 -30188 10129 23159 21466 -8946 1818
4418A818j5818n950l008k6685K3765L2881L103k73J2694l109J0491L976o155o182
$$ 1818 -14000 -19950 -22958 -49643 -25878 7003 10106 9833 22527 19418 29909 33885 27730 21548
4404B1548j1209M791j093l7965j5382K3118K5193k5296k8700K1208L3761M899
$$ 21548 10339 15130 14037 -23928 -39310 -16192 9001 -16295 -44995 -23787 9974 14873
4392A4873L6097J5828o838m558k2422k9278n434k2865j2132M229Q132K5414k0769
$$ 14873 50970 66798 59960 55402 32980 3702 -1732 -24597 -36729 -32500 -24368 1046 -19723
4379a9723j1051K0070N229k3043k080J9099K6097j2950l3858k1034R550K9962
$$ -19723 -30774 -10704 -5475 -28518 -30598 -11499 14598 1648 -32210 -53244 -43694 -13732
4367a3732K9189K585r011q626M009r957o038j1857J7681P040o553k6290j9143
$$ -13732 15457 18042 9031 405 4414 -5543 -11581 -23438 -5757 1283 -5270 -31560 -50703
4354e0703j685k006l353J4243Q389K0410L288q249p801J6847L6797q515j2783
$$ -50703 -52388 -54394 -57747 -43504 -35115 -14705 -11417 -19666 -27467 -10620 26177 17662 4879
4341D879j1058n665K7013M6272j9511m2809k0669Q208K2328J2772l006j2415l4696
$$ 4879 -6179 -11844 15169 61441 41930 -879 -21548 -13340 8988 21760 18754 6339 -28357
4328b8357k0014P869j8131j1691n609J5480J6191J0472K1421K5731J5543R403
$$ -28357 -48371 -40502 -58633 -70324 -75933 -60453 -44262 -33790 -12369 13362 28905 38308
4316C8308k8417k1567K1671M214K023l645J0891N345P001j8129k6619l1944P717
$$ 38308 9891 -11676 9995 14209 16232 12587 23478 28823 35824 17695 -8924 -40868 -33151
4303c3151K8946J9748l835k0179J9119K5103J1447p514k8624j4316k1811L126
$$ -33151 -4205 15543 11708 -8471 10648 35751 47198 39684 11060 -3256 -25067 -21941
4291b1941r070N575J4797k6826J2660J0585J7607J1519J3034O021o667l5337n0153
$$ -21941 -31011 -25436 -10639 -37465 -24805 -14220 3387 14906 27940 33961 27294 -8043 -58196
4278e8196r868K4173Q623J2172l261O815j7200J7874L6884L395j0721j402l3202
$$ -58196 -68064 -43891 -35268 -23096 -26357 -19542 -36742 -18868 18016 21411 10690 9288 -23914
4265b3914J1987K2357J3913k0137j5033o379J2511J027j3129r586J4494m5482
$$ -23914 -11927 10430 24343 4206 -10827 -17206 -4695 -3668 -16797 -26383 -11889 -57371
4253e7371o438M8028J1300k942j3010k1600k96K1851k708K0039J9594K088j5881
$$ -57371 -63809 -15781 -4481 -7423 -20433 -42033 -42329 -20478 -23186 -3147 16447 18535 2654
4240B654p899j6171J3237L2313j8675m284j8434M286P667P12Q54k095K0384n175
$$ 2654 -5245 -21416 -8179 24134 5459 1175 -17259 -12973 -5306 -4594 -3740 -5835 14549 9374
4226I374l7259k9609m115M470K2726J6967J3520J1184M177k838J5322N342l1916
$$ 9374 -27885 -57494 -61609 -57139 -34413 -17446 -3926 7258 11435 8597 23919 29261 -2655
4213b655o96J2860o321j6592L3203j9040k6136q8J7108K0518J1145j471j514j9203
$$ -2655 -3351 9509 3188 -13404 19799 759 -25377 -25465 -8357 12161 23306 21835 20321 1118
4199A118J2309P802J8223k686n006l9082j6243K6803J892k4095j2723N580N44
$$ 1118 13427 21229 39452 36766 31760 -7322 -23565 3238 5130 -18965 -31688 -26108 -25564
4186b5564r13p438l0586k403N393L5234K7605k1931q417K843j4779j3741O737
$$ -25564 -26477 -33915 -64501 -66904 -61511 -26277 1328 -20603 -29020 -26177 -40956 -54697 -47960
4173d7960K1923M9029j1137l6146p204M942O746k0320j6237J8507j442j3285Q552
$$ -47960 -26037 22992 11855 -24291 -31495 -26553 -19807 -40127 -56364 -37857 -39299 -52584 -44032
4160d4032K9871n733j3485l155j0829j3437M885K0919q60O031L7680Q00k0103
$$ -44032 -14161 -19894 -33379 -36534 -47363 -60800 -55915 -34996 -35856 -29825 7855 8655 -11448
4147a1448j8498k196K2193j5582k2731k866k4069L522L5476J9069K1197j2359
$$ -11448 -29946 -32142 -9949 -25531 -48262 -51128 -75197 -71675 -36199 -17130 4067 -8292
4135h292K365P243k0226j9219O745J3358J7675n577l0835N542K8365J1707p058
$$ -8292 -5927 1316 -18910 -38129 -31384 -18026 -351 -5928 -36763 -31221 -2856 8851 1793
4122A793M829k1140N406K3162R8j8754l393j6851j0128o363J8816N362l3018J75
$$ 1793 6622 -14518 -9112 14050 14148 -4606 -7999 -24850 -34978 -41341 -22525 -17163 -50181 -50006
4108e0006K4338L33j8439q29K2431P851n200K6577J2930j9491j3243K2508J8969
$$ -50006 -25668 -25335 -43774 -44603 -22172 -14321 -19521 7056 19986 495 -12748 9760 28729
4095B8729l703j6480K512K5051k4826j3571L147k6916n577J2808l877K5696L589
$$ 28729 25026 8546 11058 36109 11283 -2288 859 -26057 -31634 -18826 -22703 2993 6582
4082F582k3766K794J8743J1911k0850J3126J8161p038k5503k5788K573K0858N433
$$ 6582 -17184 -14390 4353 16264 -4586 8540 26701 19663 -5840 -31628 -29055 -8197 -2764
$$ [...]
##END NTUPLES=NMR SPECTRUM
##END=
