##TITLE=Analysis number 311369
Compound Code mo 07086
Book Reference 414/100/3
Project Code adrs
Chemist Name mattw
##JCAMPDX= 6.0         $$ Bruker NMR JCAMP-DX V2.0
##DATA TYPE= NMR SPECTRUM
##DATA CLASS= NTUPLES
##ORIGIN= Bruker BioSpin GmbH
##OWNER= NMR
$$ XWIN-NMR		Version 3.5
$$ Thu Jul  7 10:06:01 2005 GMT Daylight Time (UT+1h)  MAYBRIDGE\NMR@NMR_250MHZ
##.OBSERVE FREQUENCY= 250.131544655141
##.OBSERVE NUCLEUS= ^1H
##.ACQUISITION MODE= SIMULTANEOUS (DQD)
##.ACQUISITION SCHEME= undefined
##.AVERAGES= 16
##.DIGITISER RES= 18
##SPECTROMETER/DATA SYSTEM= dpx250
##.PULSE SEQUENCE= zg30
##.SOLVENT NAME= DMSO
##.SHIFT REFERENCE= (INTERNAL, DMSO, 0, 16.522)
##AUDIT TRAIL= $$ (NUMBER, WHEN, WHO, WHERE, WHAT)
$$ ##TITLE= Audit trail, XWIN-NMR		Version 3.5
$$ ##JCAMPDX= 5.01
$$ ##ORIGIN= Bruker BioSpin GmbH
$$ ##OWNER= NMR
$$ C:\u/data/dgb/nmr/ADRS/5450/pdata/1/auditp.txt
$$ ##AUDIT TRAIL=  $$ (NUMBER, WHEN, WHO, WHERE, WHAT)
(   1,<2005-07-07 10:05:33.86 +100>,<MAYBRIDGE\NMR>,<NMR_250MHZ>,
      <created by zg, POWCHK disabled, PULCHK disabled
       configuration hash MD5:
       62 19 C7 07 E1 42 D1 B7 37 6C 3D D0 77 39 F9 E6
       data hash MD5: 64K
       A5 D6 85 35 0A CB 86 F6 FA E6 F4 50 C1 F9 6F 8F>)
(   2,<2005-07-07 10:05:50.35 +100>,<MAYBRIDGE\NMR>,<NMR_250MHZ>,
      <Start of raw data processing
       ef LB = 0.3 FT_mod = 6 PKNL = 1 SI = 32K 
       data hash MD5: 32K
       A9 0D F6 53 B5 5E 9F 7C 85 D4 3B B2 61 60 85 6C>)
(   3,<2005-07-07 10:05:52.22 +100>,<MAYBRIDGE\NMR>,<NMR_250MHZ>,
      <apk 
       data hash MD5: 32K
       3E 00 E0 11 8E 77 FD 4C CA CD BC FF 98 7F 1D 64>)
(   4,<2005-07-07 10:05:52.99 +100>,<MAYBRIDGE\NMR>,<NMR_250MHZ>,
      <abs ABSG = 5 
       data hash MD5: 32K
       2B 4C 1C DD DE F3 15 23 16 91 12 C0 57 CC 16 30>)
$$ ##END=
$$ 
$$ hash MD5
$$ E5 01 B1 35 F8 FC D3 18 59 AF D8 4C 55 05 79 54
##$RELAX= 
##$RELAX= 
##$RELAX= 
##$RELAX= 
##$RELAX= 
##$RELAX= 
##$RELAX= 
$$ Bruker specific parameters
$$ --------------------------
##$DU= <C:\u>
##$EXPNO= 5450
##$NAME= <ADRS>
##$PROCNO= 1
##$TYPE= <nmr>
##$USER= <dgb>
##$AMP= (0..31)
100 100 100 100 100 100 100 100 100 100 100 100 100 100 100 100 100 100 
100 100 100 100 100 100 100 100 100 100 100 100 100 100 
##$AQSEQ= 0
##$AQ_mod= 3
##$AUNM= <au_zg>
##$AUTOPOS= <7 >
##$BF1= 250.13
##$BF2= 250.13
##$BF3= 250.13
##$BF4= 250.13
##$BF5= 500.13
##$BF6= 500.13
##$BF7= 500.13
##$BF8= 500.13
##$BYTORDA= 1
##$CFDGTYP= 0
##$CFRGTYP= 5
##$CHEMSTR= <none>
##$CNST= (0..31)
1 1 145 1 1 1 1 1 1 1 1 1 1 1 1 1 1 1 1 1 1 1 1 1 1 1 1 1 1 1 1 1 
##$CPDPRG= <>
##$CPDPRG1= <>
##$CPDPRG2= <>
##$CPDPRG3= <>
##$CPDPRG4= <mlev>
##$CPDPRG5= <mlev>
##$CPDPRG6= <mlev>
##$CPDPRG7= <mlev>
##$CPDPRG8= <mlev>
##$CPDPRGB= <>
##$CPDPRGT= <>
##$D= (0..31)
0 1 0 0 0 0 0 0 0 0.06 0 0 0 0 0 0 0.0002 0 0 0 0 0 0 0 0 0 0 0 0 0 0 
0 
##$DATE= 1120727132
##$DBL= (0..7)
120 120 120 120 120 120 120 120 
##$DBP= (0..7)
150 150 150 150 150 150 150 150 
##$DBP07= 0
##$DBPNAM0= <>
##$DBPNAM1= <>
$$ [...]
##$SUBNAM7= <"">
##$SUBNAM8= <"">
##$SUBNAM9= <"">
##$SW= 20.6930455092707
##$SWIBOX= (0..15)
0 0 3 0 0 0 0 0 0 0 0 0 0 0 0 0 
##$SW_h= 5175.983436853
##$TD= 65536
##$TD0= 1
##$TE= 295.16
##$TE2= 300
##$TE3= 300
##$TEG= 300
##$TL= (0..7)
0 120 120 120 120 120 120 120 
##$TP= (0..7)
150 150 150 150 150 150 150 150 
##$TP07= 0
##$TPNAME0= <>
##$TPNAME1= <>
##$TPNAME2= <>
##$TPNAME3= <>
##$TPNAME4= <>
##$TPNAME5= <>
##$TPNAME6= <>
##$TPNAME7= <>
##$TPOAL= (0..7)
0.5 0.5 0.5 0.5 0.5 0.5 0.5 0.5 
##$TPOFFS= (0..7)
0 0 0 0 0 0 0 0 
##$TUNHIN= 0
##$TUNHOUT= 0
##$TUNXOUT= 0
##$USERA1= <user>
##$USERA2= <user>
##$USERA3= <user>
##$USERA4= <user>
##$USERA5= <user>
##$V9= 5
##$VALIST= <valist>
##$VCLIST= <CCCCCCCCCCCCCCC>
##$VD= 0
##$VDLIST= <DDDDDDDDDDDDDDD>
##$VPLIST= <PPPPPPPPPPPPPPP>
##$VTLIST= <TTTTTTTTTTTTTTT>
##$WBST= 1024
##$WBSW= 4
##$XGAIN= (0..3)
0 0 0 0 
##$XL= 0
##$YL= 0
##$YMAX_a= 392701
##$YMIN_a= -411665
##$ZGOPTNS= <>
##$ZL1= 120
##$ZL2= 120
##$ZL3= 120
##$ZL4= 120
##$ABSF1= 16.522
##$ABSF2= -4.171173
##$ABSG= 5
##$ABSL= 3
##$ALPHA= 0
##$AQORDER= 0
##$ASSFAC= 0
##$ASSFACI= 0
##$ASSFACX= 0
##$ASSWID= 0
##$AUNMP= <proc_1d>
##$AZFE= 0.1
##$AZFW= 0.1
##$BCFW= 0
##$BC_mod= 0
##$BYTORDP= 0
##$COROFFS= 0
##$CY= 12.5
##$DATMOD= 1
##$DC= 0
##$DFILT= <>
##$DTYPP= 0
##$F1P= 14.0000005364418
##$F2P= -0.99999901652339
##$FCOR= 0.5
##$FTSIZE= 32768
##$FT_mod= 6
##$GAMMA= 0
##$GB= 0
##$INTBC= 1
##$INTSCL= 1
##$ISEN= 128
##$LB= 0.3
##$LEV0= 0
##$LPBIN= 0
##$MAXI= 10000
##$MC2= 0
##$MEAN= 0
##$ME_mod= 0
##$MI= 0
##$NCOEF= 0
##$NC_proc= -6
##$NLEV= 6
##$NOISF1= 0
##$NOISF2= 0
##$NSP= 0
##$NTH_PI= 0
##$NZP= 0
##$OFFSET= 16.522
##$PC= 1
##$PHC0= -91.84772
##$PHC1= 13.9914
##$PH_mod= 1
##$PKNL= yes
##$PPARMOD= 0
##$PSCAL= 4
##$PSIGN= 0
##$REVERSE= no
##$SF= 250.13
##$SI= 32768
##$SIGF1= 0
##$SIGF2= 0
##$SINO= 400
##$SIOLD= 32768
##$SREGLST= <1H.DMSO>
##$SSB= 0
##$STSI= 32768
##$STSR= 0
##$SW_p= 5175.98343685301
##$SYMM= 0
##$S_DEV= 0
##$TDeff= 65536
##$TDoff= 0
##$TI= <Analysis number 999999
Compound Code 99
Book Reference 9
Project Code 9>
##$TILT= no
##$TM1= 0
##$TM2= 0
##$TOPLEV= 0
##$USERP1= <user>
##$USERP2= <user>
##$USERP3= <user>
##$USERP4= <user>
##$USERP5= <user>
##$WDW= 1
##$XDIM= 32768
##$YMAX_p= 530729330
##$YMIN_p= -943496
$$ End of Bruker specific parameters
$$ ---------------------------------
##NTUPLES= NMR SPECTRUM
##VAR_NAME=  FREQUENCY,     SPECTRUM/REAL,   SPECTRUM/IMAG
##SYMBOL=    X,             R,               I
##VAR_TYPE=  INDEPENDENT,   DEPENDENT,       DEPENDENT
##VAR_FORM=  AFFN,          ASDF,            ASDF
##VAR_DIM=   32768,         32768,           32768
##UNITS=     HZ,            ARBITRARY UNITS, ARBITRARY UNITS
##FACTOR=    0.157963299565203, 1,           1
##FIRST=     4132.6476996994, 0,             0
##LAST=      -1043.33573715361, 0,           0
##MIN=       -1043.33573715361, -943496,     0
##MAX=       4132.6476996994, 530729330,     0
$$ Real data points
##PAGE= N=1
##DATA TABLE= (X++(R..R)), XYDATA
$$ [...]
21973B00629l01542R7966O7728m2020J28826P3737M0498K26909p7228j95837k81294
$$ 200629 -100913 -2947 64781 22761 151587 225324 265822 492731 415503 219666 -61628
21962f1628k85602j61039M79878J25877k2115L9730j11152l07092k8127O6409
$$ -61628 -347230 -508269 -28391 97486 75371 115101 3949 -303143 -331270 -264861
21952b64861L46934p0161j3804k2087l35096o0196K97356J14132j30698J22160
$$ -264861 82073 11912 -1892 -23979 -359075 -419271 -121915 -7783 -138481 -16321
21942a6321J51139n1470m5991M9368R7865K73023P3245k25446l16878k17682L6443
$$ -16321 134818 83348 37357 86725 184590 457613 530858 305412 -11466 -229148 -192705
21931a92705J20051K6742K42963O3371j8461o8186k27398M2355l7427O7952j03009
$$ -192705 -72654 -45912 197051 260422 241961 173775 -53623 -11268 -48695 19257 -83752
21920h3752j07110j3611Q2370k7845R5454L14914P095m10606j53611Q2717J17633
$$ -83752 -190862 -204473 -122103 -149948 -54494 260420 267515 -143091 -296702 -213985 -96352
21909i6352p6859m7971O622K51292K62508J54497l50127m250K90938j52131P7338
$$ -96352 -173211 -221182 -214560 36732 299240 453737 103610 99360 390298 238167 315505
21898C15505n7640r8076r2113j86743j68860j5118m0959P3188M24047O9550N2500
$$ 315505 257865 159789 67676 -119067 -287927 -303045 -344004 -270816 153231 222781 275281
21887B75281r8858L4505L19240J29087j01061m09150m8102M6747K05706K5956
$$ 275281 176423 210928 530168 659255 558194 149044 100942 147689 353395 379351
21877C79351k23279j5660O2593L4992k06672k81861J24522K16298Q4323J699p9438
$$ 379351 156072 140412 203005 237997 31325 -250536 -126014 90284 174607 176306 96868
21866I6868k73781m4344Q602J86660J31148L26743j3406m61905l62822K0591J32913
$$ 96868 -176913 -221257 -212655 -25995 105153 431896 418490 -43415 -406237 -385646 -252733
21855b52733K55441K7419N869N8720j37189l96309Q4168J31873n878J42982j67256
$$ -252733 2708 30127 35996 94716 -42473 -438782 -354614 -222741 -228619 -85637 -252893
21844b52893l48864K9361k5116l8149J60435J25359J21344K7056O9815N8920q4901
$$ -252893 -601757 -572396 -597512 -635661 -475226 -349867 -228523 -201467 -131652 -72732 -157633
21833a57633j29934j54624j02353R1107J05828L41292K17372j82100j60996K6307
$$ -157633 -287567 -442191 -544544 -453437 -347609 -6317 211055 28955 -132041 -105734
21823a05734J7954p6899J38796j26976l5733p3984j19053P9145L5557j03992j0593
$$ -105734 -87780 -164679 -25883 -152859 -188592 -262576 -381629 -302484 -266927 -370919 -381512
21812c81512N2779M2070j8902k69988J55978J42805K06377L15104m71L1783K435
$$ -381512 -328733 -286663 -305565 -575553 -419575 -276770 -70393 244711 244240 276023 278458
21801B78458m4849l32380l2326j5343M9120r8310l6004L07562j10821k23741r8404
$$ 278458 233609 -98771 -131097 -146440 -97320 -195630 -231634 75928 -34893 -258634 -357038
21790c57038l3890K16789L9661p8147P9108K9927K10329L3361j52939P2199K17431
$$ -357038 -390928 -174139 -134478 -212625 -133517 -103590 106739 140100 -12839 59360 276791
21779B76791J02504j35536k6417q8376m11303L5179j70569j33367j27098K22401
$$ 276791 379295 243759 217342 128966 -282337 -247158 -417727 -551094 -678192 -455791
21769d55791P6111M4154K51597M45290n5099j49687O69K6238R4147j38909k78780
$$ -455791 -379680 -335526 -83929 361361 306262 156575 157244 183482 277629 138720 -140060
21758a40060O1625J17455M15577n1764k51011j4690j69340j48518N4642p1753
$$ -140060 -78435 39020 454597 402833 151822 137132 -32208 -180726 -126084 -197837
21748a97837K10128N0472k29952j48870O5860J71853n7642j51122k5607m1246
$$ -197837 12291 62763 -167189 -316059 -250199 -78346 -135988 -287110 -312717 -353963
21738c53963L84435K73780j33209k72059j01318j62233P7016R275J54842L29429
$$ -353963 30472 304252 171043 -101016 -202334 -364567 -287551 -278276 -123434 205995
21728B05995J43010k1325k90324R6752J78692j02975o9933p971n7674j33725K78506
$$ 205995 349005 327680 37356 134108 312800 209825 139892 131921 74247 -59478 219028
21717B19028R8322j57918k39462L325M1694j85018J01462L56369K12794j32525
$$ 219028 317350 159432 -80030 -76705 -35011 -220029 -118567 237802 450596 318071
21707C18071j20932j36084r6222m9270K52409M2516k56257j81087k7036j13530
$$ 318071 197139 61055 -35167 -84437 167972 210488 -45769 -226856 -253892 -367422
21697c67422k08352M0144J41145K54332J46950j2567k8947J53541J21526K620
$$ -367422 -575774 -535630 -394485 -140153 6797 -5770 -34717 118824 240350 242970
21687B42970j8374k9623j00066l45495j61220J2979q9656j68111K62781K00688
$$ 242970 224596 194973 94907 -250588 -411808 -398829 -488485 -656596 -393815 -193127
21677a93127n5903K53082M4436P2356P2465l06698o8071K04733K81199N9384K09708
$$ -193127 -249030 4052 48488 120844 193309 -113389 -181460 23273 304472 363856 573564
21666E73564r3608k57591k7644j1213q9959k43308M2301K5432K8516N7262N8096
$$ 573564 479956 222365 194721 183508 93549 -149759 -107458 -82026 -53510 3752 61848
21655F1848L13717O2179l3833K25275p0973l52402l15991k441P8380L5450l7723
$$ 61848 375565 437744 403911 629186 558213 205811 -110180 -112621 -34241 1209 -36514
21644c6514q7424J94831R6971j33460l03128P195J49218q1765p0155K17153K22599
$$ -36514 -123938 70893 167864 34404 -268724 -261529 -112311 -194076 -264231 -47078 175521
21633A75521j503l62748k34775O4932J23849J55450J25372Q8766K15763j33212
$$ 175521 174018 -188730 -423505 -358573 -234724 -79274 46098 134864 350627 217415
21623B17415k19459J8989K70749K42373k80989k77361k29195R0641J36251j41775
$$ 217415 -2044 16945 287694 530067 249078 -28283 -257478 -166837 -30586 -172361
21613a72361k44467O6874m095L4307J82879l10N3884J63782J4355P5144k55866
$$ -172361 -416828 -349954 -354049 -319742 -136863 -137173 -83289 80493 94848 169992 -85874
21602h5874J52219J25396n5375l05366n2140J76294J98614j27437l6548N3202
$$ -85874 66345 191741 136366 -169000 -221140 -44846 153768 26331 -10217 42985
21592D2985j53760k30921K43630J62006l6476j60562Q9086R699P0011J30082l111
$$ 42985 -110775 -341696 -98066 63940 27464 -133098 -44012 -34313 35698 165780 162669
21581A62669j66882p939J80728j94505j97776q1894j65718J18612l7154O3589
$$ 162669 -4213 -12152 168576 -25929 -223705 -305599 -471317 -352705 -389859 -326270
21571c26270R2913J13498J13990J2266Q0475J78217L20342p0039k90410j69111
$$ -326270 -233357 -119859 -5869 6397 86872 265089 585431 515392 224982 55871
21561E5871K06167J32976k97869m4601J10157J44364K27431o1076l21604k50899
$$ 55871 262038 395014 97145 52544 162701 307065 534496 473420 151816 -99083
21551i9083J29045N8404j48088J40124N4104l469J34473M21882m9314m60278k27784
$$ -99083 29962 88366 -59722 80402 134506 131037 265510 687392 638078 177800 -49984
21540d9984k17315j92733J13497P6753j22092P4806j02519j2778L20926l4169
$$ -49984 -267299 -460032 -346535 -269782 -391874 -317068 -419587 -432365 -111439 -145608
21530a45608k6681l1768J09211L03701k76909q6966K96710K15527Q6191k96494
$$ -145608 -172289 -204057 -94846 208855 -68054 -155020 141690 357217 443408 146914
21520A46914k88970j92244l036l45985P5473O55118L08299m857J03073j97672
$$ 146914 -142056 -334300 -337336 -683321 -607848 47270 355569 350712 453785 256113
21510B56113J78689l54602K72796J79685j79489j97903q6937k22090p2961L93518
$$ 256113 434802 80200 352996 532681 353192 155289 68352 -153738 -226699 166819
21500A66819J63516j27994Q1424l02899j59335j26592J74972O9605O247j97814
$$ 166819 330335 202341 283765 -19134 -178469 -305061 -130089 -60484 -54237 -252051
21490b52051L661K13434J55605J63681j28778m57886j20609J37628q8724J56619
$$ -252051 -248390 -34956 120649 284330 155552 -302334 -422943 -285315 -374039 -217420
21480b17420k5466p9263K95632Q7902L9748J24237J61280P3709l06124k48190
$$ -217420 -242886 -322149 -26517 61385 101133 225370 386650 460359 154235 -93955
21470i3955R5871m8255j34272N1416J27129l256j88268j43216J07034K35795j1674
$$ -93955 1916 -46339 -180611 -129195 -2066 -5322 -193590 -336806 -229772 6023 -5651
21459e651j21603m8500o6290k3277N2320M2456Q4722j59833j39902M5709K5299
$$ -5651 -127254 -175754 -242044 -265321 -213001 -170545 -85823 -245656 -385558 -339849 -314550
21448c14550o8811M7712J35980L62858J05823j57683n7103K65947j44381j73899
$$ -314550 -383361 -335649 -199669 163189 269012 111329 54226 320173 175792 1893
21438A893J38798K08060q817J42761n6436P7458j70836m4448k47242j47343K96338
$$ 1893 140691 348751 339934 482695 426259 503717 332881 288433 41191 -106152 190186
21427A90186J49693k44940k51808p6408K34976Q9727J05716j27029k70436r5299
$$ 190186 339879 94939 -156869 -233277 1699 91426 197142 70113 -200323 -295622
21417b95622K16701J37261L6749J29430K25105O8102k47555m04615j40684K59310
$$ -295622 -78921 58340 95089 224519 449624 517726 270171 -134444 -275128 -15818
21407a5818K20695p8895k28792J9188J72477k6961j14751J0362k67964j93850
$$ -15818 204877 125982 -102810 -83622 88855 61894 -52857 -42495 -310459 -504309
21397e04309K71332K35682j1780N6219o4825J5465J80752L8822j43680j84840
$$ -504309 -232977 2705 -9075 47144 -17681 -2216 178536 217358 73678 -111162
21387a11162j22591j18607L995Q6748K54438p541N6864K51107m6213k74305k11427
$$ -111162 -233753 -352360 -348365 -261617 -7179 -14720 42144 293251 247038 -27267 -238694
21376b38694m806K78206Q633n5970k81475k44498K77566L52189K2379K541J40340
$$ -238694 -243500 34706 43339 -12631 -294106 -538604 -261038 91151 113530 116071 256411
21365B56411k56615k19003j24620Q130J10324L43806r3872j15113j22459j12778
$$ 256411 -204 -219207 -343827 -335697 -225373 118433 24561 -90552 -213011 -325789
21355c25789r1912J29279K48990p8511K42406N5617j15170J64118q3629j80522
$$ -325789 -417701 -288422 -39432 -117943 124463 180080 64910 229028 145399 -35123
21345c5123J7357J13475n9484r3309j1904m391Q8442J34810K28244j53711J8717
$$ -35123 -17766 95709 36225 -57084 -68988 -73379 15063 149873 378117 224406 243123
21334B43123l18296k05586q3663J16062j3008N7681R3812J3950j7480K98808K11970
$$ 243123 -75173 -280759 -364422 -248360 -261368 -203687 -109875 -95925 -113405 185403 397373
21323C97373j90478m8552M5015l9457r2187Q2151P4417l94091l80205J26112L82977
$$ 397373 206895 158343 203358 163901 71714 153865 228282 -165809 -546014 -419902 -36925
21312c6925K14198j34911n83096j0106J00482k4325K27509r0496J13910J88441
$$ -36925 177273 42362 -540734 -550840 -450358 -474683 -247174 -337670 -223760 -35319
21302c5319k6435j11037j52996K28567K17227J25479M7703j49579p4029P975O0234
$$ -35319 -61754 -172791 -325787 -97220 120007 245486 293189 143610 69581 77556 137790
21291A37790N7260j16621j25575j5329J16692N3610j09598n4119j23755K01227
$$ 137790 195050 78429 -47146 -62475 54217 107827 -1771 -55890 -179645 21582
21281B1582n4166n7334N6080j2537K52131l63688j3659N08920o1223k79320k7426
$$ 21582 -32584 -89918 -33838 -46375 205756 -157932 -171591 337329 276106 -3214 -30640
21270c0640O4296p5284q5918K508N8950j6827j05607r2293J09557O5836l3924
$$ -30640 33656 -41628 -127546 -125038 -66088 -82915 -188522 -280815 -171258 -105422 -139346
21259a39346L07980L6684j39178k7614r5036k35370k77670M9673K35042J35499
$$ -139346 168634 205318 66140 38526 -56510 -291880 -569550 -519877 -284835 -149336
21249a49336J44279n3688j7413L61958m9428m47362M1220K43788J26083j8233
$$ -149336 -5057 -58745 -76158 285800 236372 -210990 -169770 74018 200101 181868
21239A81868M2815k06001K9913K2103l8267l2807N7851j40324j12466j16337N3360
$$ 181868 224683 18682 48595 70698 32431 -376 57475 -82849 -195315 -311652 -258292
21228b58292J89497O6942P3037P3405p4628k4393j62917j27575m7968q6776l3669
$$ -258292 -68795 -1853 71184 144589 69961 45568 -117349 -244924 -292892 -379668 -413337
21217d13337j43371R1961J91170K49792N0987J05669M6657j84708K14363j14404
$$ -413337 -556708 -464747 -273577 -23785 27202 132871 179528 -5180 209183 94779
21207I4779l65589k3250j71841k35701J23120K45029J85643o384l2373L98010
$$ 94779 -270810 -294060 -465901 -701602 -578482 -333453 -147810 -154194 -186567 211443
21197B11443K09490j84748L8321J12954j8885l86951o94588m1906L15981P5850
$$ 211443 420933 236185 274506 387460 368575 -18376 -712964 -754870 -438889 -363039
21187c63039Q4730l300m5620J87687L9702Q0391M3258P3384K61790J9520j17226
$$ -363039 -278309 -281609 -327229 -139542 -99840 -19449 23809 97193 358983 378503 261277
21176B61277O7257j60210k24512j71154J61361L04557J24509j02550r0174K61230
$$ 261277 328534 168324 -56188 -227342 -65981 238576 363085 260535 170361 431591
21166D31591q3421j66486j56896K20422J77480j97589j61688k47050k41593J3780
$$ 431591 348170 181684 24788 245210 422690 225101 63413 -183637 -425230 -411450
21156d11450J1588K59467L26586l4563j97604M4723M0920R3130K28864K13983
$$ -411450 -399862 -140395 186191 151628 -45976 -1253 39667 132797 361661 575644
21146E75644j28390k44420k26635l83256j9399K96234J46367l09141K62017J45224
$$ 575644 447254 202834 -23801 -407057 -426456 -130222 16145 -292996 -30979 114245
21136A14245J65769L93012K5786k52973l35844k50982n5902J33118j41405k44142
$$ 114245 280014 673026 698812 445839 109995 -140987 -196889 -63771 -205176 -449318
21126d49318K73887j0010j87986J9689K07574j60614P7487L03535l487k8935J92330
$$ -449318 -175431 -185441 -373427 -353738 -146164 -306778 -229291 74244 70757 41822 234152
21115B34152K28893k24967j76949j37075J4703J22466M0215P8266r2433j88051
$$ 234152 463045 238078 61129 -75946 -61243 61223 101438 179704 87271 -100780
21105a00780J5463n2748p8125j7450P7287k8285J72834m8011J44216M1471k29942
$$ -100780 -85317 -138065 -216190 -233640 -156353 -184638 -11804 -59815 84401 125872 -104070
21094a04070k24194Q7466Q7544Q5898j8488k82148q7259Q9931K25785K3508J17458
$$ -104070 -328264 -240798 -153254 -67356 -85844 -367992 -455251 -365320 -139535 -116027 1431
21083A431J09164k44145j34721q459J93546K18947R1396j24715j50674J3750M2514
$$ 1431 110595 -133550 -268271 -276730 -83184 135763 227159 102444 -48230 -34480 8034
21072H034q958L9218N1496q1069J03587j07142O5348J35524K83962q435k17377
$$ 8034 -924 38294 89790 8721 112308 5166 70514 206038 490000 481565 264188
21061B64188j8855p0095p9850K61448k7809l11246k7166J9815j52862M7231J19909
$$ 264188 245333 175238 95388 356836 329027 17781 -9385 10430 -142432 -95201 24708
21050B4708M8387J06173J32P3998j79775k40753j22755L341O2533N2791k36566
$$ 24708 73095 179268 179400 253398 73623 -167130 -289885 -286544 -224011 -171220 -407786
21039d07786k26664k9142J51869J13575j23655K38031O0883k07355q0782K11875
$$ -407786 -634450 -663592 -511723 -398148 -521803 -283772 -222889 -430244 -511026 -299151
21029b99151J68835K40466q0933j41141j45014j27861K874O8527J22866j7584
$$ -299151 -130316 110150 29217 -111924 -256938 -384799 -381925 -313398 -190532 -208116
21019b08116K28799J35150j80807k07507R2754q4824n2011K2403R2801j93512
$$ -208116 20683 155833 -24974 -232481 -139727 -224551 -276562 -254159 -161358 -354870
21009c54870K77768L7758Q2651r0055L1420M1895j1015J8777k20216N2451J31719
$$ -354870 -77102 -39344 43307 -46748 -15328 26567 15552 34329 -185887 -133436 -1717
20998a717j4877m4265N5248O9341j92721K47235J73381k0994j0308l0162k91511
$$ -1717 -16594 -60859 -5611 63730 -128991 118244 291625 270631 260323 230161 -61350
20987f1350l28058K73718L41803K37521m620p1985J19659j67995n7736j65343
$$ -61350 -389408 -115690 226113 463634 459014 387029 506688 338693 280957 115614
20977A15614r5937J52485M9425k33933m1533j43448k84038J86650K05739R8618
$$ 115614 19677 172162 221587 -12346 -53879 -197327 -481365 -294715 -88976 9642
20967I642l5240j9861J12887o3773J57739O3443j48101J17417J36721p4798k71800
$$ 9642 -25598 -45459 67428 3655 161394 224837 76736 194153 330874 256076 -15724
20956a5724P478k69946j6933K8886j4154J43614P3480K66722j43852J74560J22065
$$ -15724 -8246 -278192 -295125 -266239 -280393 -136779 -63299 203423 59571 234131 356196
20945C56196j33255J30614k84231l85252m8475J15324J37242L57538J44189k42370
$$ 356196 222941 353555 69324 -315928 -364403 -249079 -111837 245701 389890 147520
20935A47520m6967J874q6728k1973l0114j6246j50160J4932l710R1755J11624
$$ 147520 100553 102427 15699 -6274 -36388 -52634 -202794 -187862 -191572 -99817 11807
20924A1807Q0873L5981j88901j84134J9226J54773J44668K15540q6364l08636
$$ 11807 92680 128661 -60240 -244374 -225148 -70375 74293 289833 203469 -105167
20914a05167j96668j49253M7348J07015L30764J58303K13753j46960j99732k1648
$$ -105167 -301835 -451088 -403740 -296725 34039 192342 406095 259135 59403 37755
20904C7755O8869k87686k9126J09284M6343l8955m500M5978K42397n18J2719m5852
$$ 37755 106624 -181062 -210188 -100904 -54561 -93516 -98016 -52038 190359 189841 202560 156708
20892A56708l21636J34178J02656k05361Q4942q3039J50848O9824m9490k0428
$$ 156708 -164928 -30750 71906 -133455 -48513 -131552 19296 89120 39630 19202
20882A9202L27132k34947k58586n7568K05069j0739J84935J02172q4981L946j5971
$$ 19202 346334 111387 -147199 -204767 302 -10437 174498 276670 191689 195635 179664
20871A79664P1831n5932J26710J62990j98585k89426j74835m1471J28581r1839
$$ 179664 251495 195563 322273 485263 286678 -2748 -177583 -219054 -90473 -182312
20861a82312n6197J33387J7320k27516n7520J68324j63162j05946J26182K18010
$$ -182312 -238509 -105122 -87802 -315318 -372838 -204514 -367676 -473622 -347440 -129430
20851a29430J42082j52066M7712Q3126K43592J26544j50259J56721k93296j39685
$$ -129430 12652 -139414 -91702 -8576 235016 361560 211301 368022 74726 -64959
20841f4959J36021J69563P700l61877j59773K26313p1850j62729J90220n2716
$$ -64959 71062 240625 248325 -113552 -273325 -47012 -118862 -281591 -91371 -144087
20831a44087K13978N9400k55310J38635K64433j49416J0369K29412L01893l02685
$$ -144087 69891 129291 -126019 12616 277049 127633 138002 367414 669307 366622
20821C66622k65715l97434K77970K19892p7680K8791k6413Q110r9831J9078J19145
$$ 366622 100907 -296527 -18557 201335 123655 152446 126033 134143 34312 53390 172535
20810A72535q0128j91044r9208J85991K40060J12662p1684k92059k88786j0034
$$ 172535 92407 -98637 -197845 -11854 228206 340868 269184 -22875 -311661 -321695
20800c21695o8731o0666J66893m137M8057J05426K23414L02302k38048l06880
$$ -321695 -390426 -451092 -284199 -288336 -240279 -134853 88561 390863 152815 -154065
20790a54065l1877k3068N9898j80093Q795L53555K79766J34131J74272j51909
$$ -154065 -185942 -209010 -149112 -329205 -320410 33145 312911 447042 621314 469405
20780D69405l9768j16647O0820j7677l09903j24933l34402j39581J34610J1119
$$ 469405 429637 312990 373810 356133 46230 -78703 -413105 -552686 -418076 -406957
20770d06957L6206m0360N4538K77656R7811K58671l3879k08865n0006L27701Q3315
$$ -406957 -370751 -411111 -356573 -78917 18894 277565 243686 34821 -15185 312516 395831
20759C95831p7909j80018L634J84813k38271m14908j23338N8308L5565K56614
$$ 395831 317922 137904 141538 326351 88080 -326828 -450166 -391858 -356293 -99679
20749i9679Q5522l43687k02730J13190M42198K30542o692p9826k30656j78845
$$ -99679 -14157 -357844 -560574 -447384 -5186 225356 218664 138838 -91818 -270663
20739b70663j1515K23416O8670j79151K507K55917K21559P7325J97924j02137
$$ -270663 -282178 -58762 9908 -169243 -166736 89181 310740 388065 585989 483852
20729D83852m16011j97368J5021J44510j90994n1792j22438j48756J500J93126
$$ 483852 67841 -129527 -114506 30004 -160990 -212782 -335220 -483976 -482476 -289350
20719b89350L39445J39317K36617J96187r5952j35676j57686j04740p7036j42389
$$ -289350 50095 189412 426029 622216 526264 390588 232902 128162 51126 -91263
20709i1263j6748J30620K02865K9101J043L2686k1331l0466k36267j59853K41220
$$ -91263 -108011 22609 225474 254575 255618 288304 266973 236507 240 -159613 81607
20698H1607M8570j27149k33782k05775j92742P2307J93917J27249J04716J09311
$$ 81607 130177 3028 -230754 -436529 -629271 -556964 -363047 -235798 -131082 -21771
20688b1771Q4489k83076o3114K09280K44189n3687k10792J77767J95245k26938
$$ -21771 62718 -220358 -283472 -74192 169997 116310 -94482 83285 278530 51592
20678E1592p1208k26862j62305j07376J95179J42771J72035J8257j05237p1937
$$ 51592 -19616 -246478 -408783 -516159 -320980 -178209 -6174 12083 -93154 -165091
20668a65091K95619J7808k10706j39321j45904l7009N8871N7950J75200O8361
$$ -165091 130528 148336 -62370 -201691 -347595 -384604 -325733 -267783 -92583 -24222
20658b4222j52318R3161P6524M0402J09331J75600p1789k31451q5586J12512k6644
$$ -24222 -176540 -83379 -6855 33547 142878 318478 246689 15238 -70348 42164 15520
20647A5520k9589k71347j02448J01831J74657j7814P4163N7563n1941k23392j85657
$$ 15520 -14069 -285416 -387864 -286033 -111376 -129190 -55027 2536 -49405 -272797 -458454
20636d58454p7929K4975J59732L38562L09841l1149r9189p7720J81087L03886
$$ -458454 -536383 -511408 -351676 -13114 296727 265578 166389 88669 269756 573642
20626E73642R5428l43466r8763K50705J92954n18028m51621O4015L33230K4219
$$ 573642 669070 325604 226841 477546 670500 152472 -299149 -235134 98096 122315
20616A22315n7314M5994J60920k60487j28791j6834J4737M00540J06070p8581
$$ 122315 65001 110995 271915 11428 -117363 -134197 -119460 281080 387150 308569
20606C08569k46743m7558j83150l6400l3408j81522L26480N2444q076J37502Q9735
$$ 308569 61826 14268 -168882 -205282 -238690 -420212 -93732 -41288 -49364 88138 177873
20595A77873j16945J9890J13621Q7296j36180k07496j65054r6428j20270j08225
$$ 177873 60928 80818 194439 281735 145555 -61941 -226995 -323423 -443693 -551918
20585e51918L21788K73938O8574k51071K049k644k4588J48419J66405O1208L5335
$$ -551918 -230130 43808 112382 -138689 -136640 -139284 -163872 -15453 150952 212160 247495
20574B47495n8635q1269j00580P9250l11741n3534J76047k3701K2157K42674j68494
$$ 247495 188860 107591 7011 86261 -225480 -279014 -102967 -126668 -104511 138163 -30331
20563c0331R1818K66201O7665k68225j33422l04819j22380R8533K33756Q8422
$$ -30331 61487 327688 395353 127128 -6294 -311113 -433493 -334960 -101204 -12782
20553a2782K1924K29632q8477J87444j61269P1771p0211J11277j62571J9853J45029
$$ -12782 9142 238774 150297 337741 176472 248243 178032 289309 126738 146591 291620
20542B91620j20462o6611J43200K0555q0121J29559P5095R526j01705k15514J24507
$$ 291620 171158 104547 247747 268302 188181 317740 392835 402361 300656 85142 209649
20531B09649k8893j18624k1193M6823j2643J38932J41894j45448o3169o6346p7486
$$ 209649 180756 62132 40939 87762 75119 214051 355945 210497 147328 80982 3496
20520C496j27008m73640j0853K30944o7016J89150K74612k8524J8128p787K3218
$$ 3496 -123512 -597152 -608005 -377061 -444077 -254927 19685 -8839 9289 1502 24720
20509B4720j46983l7555L22782M34174j6791q3834l4530o5556j51856n4536K31756
$$ 24720 -122263 -159818 162964 597138 580347 496513 461983 396427 244571 190035 421791
20498D21791j75053j33823p689j15460j8930J58404N2900J5793o8094M5892q4283
$$ 421791 246738 112915 105226 -10234 -29164 129240 182140 197933 129839 175731 91448
20487I1448l8503O6876K4062K54265K48767o665j96193m44979j10421j75969q4168
$$ 91448 52945 119821 143883 398148 646915 640250 444057 -922 -111343 -287312 -371480
20476c71480R3562J92710P4482m5150J47145J03760k5168m961j15811j08663k07029
$$ -371480 -277918 -85208 -10726 -55876 91269 195029 169861 164900 49089 -59574 -266603
20465b66603j2009K6798M27J4854P2268O7153k0439J03707L5821j819J27576j25476
$$ -266603 -278612 -251814 -251387 -236533 -164265 -97112 -117551 -13844 21977 20158 147734 22258
20453B2258k9654L792J72035J77888n5453k71249k72658L82081K03213k14234
$$ 22258 -7396 -3604 168431 346319 290866 19617 -253041 129040 332253 118019
20443A18019j84301R5215Q8300n15J05801j5195L6387k09156n1578J21250Q6030
$$ 118019 -66282 28933 117233 116718 222519 207324 243711 34555 -17023 104227 190257
20432A90257j19702J18490j12980j56399J6621M8842K28226J94358p5273k1468
$$ 190257 70555 189045 76065 -80334 -63713 -14871 213355 407713 332440 310972
20422C10972k90592k54455K10961J99000J38808j47263l31357L1171M5347p0201
$$ 310972 20380 -234075 -23114 175886 314694 167431 -163926 -132755 -87408 -157609
20412a57609L7192J68462j64490j02034J3381p0204N3353J00131K15146J44593
$$ -157609 -120417 48045 -116445 -218479 -205098 -275302 -221949 -121818 93328 237921
20402B37921o2475k61445j00305J21299k7745j15783R7408L38870p5373O3513
$$ 237921 175446 -85999 -186304 -65005 -92750 -208533 -111125 227745 152372 215885
20392B15885J12789k27772k83856r8207r1549J47879L31406J89098n3977k19836
$$ 215885 328674 100902 -182954 -281161 -372710 -224831 106575 295673 241696 21860
20382B1860r7448j07578k89052j07494J39941P3306K48240N8405l0902k74647
$$ 21860 -75588 -183166 -472218 -579712 -439771 -366465 -118225 -59820 -90722 -365369
20372c65369j01979j11448P9498J59909J90780K45598n2678k18919j0789K4195
$$ -365369 -467348 -578796 -499298 -339389 -148609 96989 44311 -174608 -185397 -161202
20362a61202q5831q1637J53436M6313j33858j44580L0626J34414K271L59766L9842
$$ -161202 -247033 -328670 -175234 -128921 -262779 -407359 -376733 -242319 -240048 119718 159560
20351A59560k53332J67679n0671N1758j61264j42190P4172Q552p2408O2359j32109
$$ 159560 -93772 73907 23236 74994 -86270 -228460 -154288 -145736 -218144 -155785 -287894
20340b87894j8023j11876O0208J11468P3090J16444J00983o7301j74006k5288
$$ -287894 -305917 -417793 -357585 -246117 -173027 -56583 44400 -22901 -196907 -222195
20330b22195P6817N7037j598J97514P5436j58544j4565R2082N9112j8842J53334
$$ -222195 -145378 -88341 -89939 107575 183011 24467 9902 101984 161096 142254 295588
20319B95588N5o7858r0810L425n6637M9220p3413j97874K36385p4216j8473j25422
$$ 295588 295643 227785 136975 140400 83763 132983 59570 -138304 98081 23865 5392 -120030
20307a20030K35581K38022J3974k70212P4049n1423j52410J07157P2064R9511
$$ -120030 115551 353573 367547 97335 171384 119961 -32449 74708 146772 246283
20297B46283J38284j27434l42634R6805J66858O3117n9340j23133j22470j85706
$$ 246283 384567 257133 -85501 11304 178162 241279 181939 58806 -63664 -249370
20287b49370j41657L61171K56810J86166N0796K8649j20497k93299j75738K34154
$$ -249370 -391027 -29856 226954 413120 463916 492565 372068 78769 -96969 137185
20277A37185q6721J55923J57338j26393j05960j16134J81790J59453j5271J15475
$$ 137185 50464 206387 363725 237332 131372 15238 197028 356481 341210 456685
20267D56685k95201l11902J63062Q4866N5724J74305M7916k98865q6094J41703
$$ 456685 161484 -150418 12644 97510 153234 327539 375455 76590 -9504 132199
20257A32199o1487j97837j0351J68234J8237J4592K95645k80478j48841M2788
$$ 132199 70712 -127125 -137476 30758 48995 63587 359232 78754 -70087 -27299
20247b7299M1423J21443J44473O7520j61861k16891p3297J32970K28113j05238
$$ -27299 14124 135567 280040 347560 185699 -31192 -104489 28481 256594 151356
20237A51356P569L1061j76637J94355K70756M5911J66592o4570k18669n9256J18049
$$ 151356 158925 189986 13349 207704 478460 524371 690963 626393 407724 348468 466517
20226D66517q3142J34519j698n8674k77315k18102L5420J66082R9347j70299n1383
$$ 466517 383375 517894 516196 457522 180207 -37895 -2475 163607 262954 92655 41272
20215D1272M31604l22604j06900J42974K6324l04766N6289J99365J51111J95662
$$ 41272 472876 150272 43372 186346 212670 -92096 -35807 163558 314669 510331
20205E10331n4682k77035j15526j64409R4015J50744k56484P043k41047J10534
$$ 510331 455649 178614 63088 -101321 -7306 143438 -113046 -106003 -347050 -236516
20195b36516K20182j979j02316J13002J58240O4174M5060k7235r5318J225O0174
$$ -236516 -16334 -18313 -120629 -7627 150613 214787 259847 232612 137294 138519 198693
20184A98693O5628J6612k45023N0764J13738L6455N3657j51577j46323l40760
$$ 198693 264321 280933 35910 86674 200412 236867 290524 138947 -7376 -348136
20174c48136p1207K87642J89417o0056J49528R8339j55399O3703J3077J4930O4515
$$ -348136 -419343 -131701 57716 -2340 147188 245527 90128 153831 166908 181838 246353
20163B46353J2957k75696l958k00941j45776l1713L39019K41000j55986j81909
$$ 246353 259310 -16386 -20344 -221285 -367061 -398774 -59755 181245 25259 -156650
20153a56650J45800J82237J03129k56696j61434K19502J06252j6250L03334Q2960
$$ -156650 -10850 171387 274516 17820 -143614 75888 182140 165890 469224 552184
20143E52184j61839l13660K4535J11284q176j27398J29806K38548K19310j71956
$$ 552184 390345 76685 101220 212504 204328 76930 206736 445284 664594 492638
20133D92638j52043j37747O7313L2316j03360k09217j3058N6041q0166Q1059q0913
$$ 492638 340595 202848 270161 302477 199117 -10100 -23158 32883 -47283 33776 -47137
20122d7137j47153J35751L24042K13395L4758j4550o4324j91389l30722L3761
$$ -47137 -194290 -58539 265503 478898 513656 499106 434782 243393 -87329 -53568
20112e3568K26812Q3113j60934j5351O696r1112r6406J58673j00909j33003O2845
$$ -53568 173244 256357 95423 80072 86768 -4344 -100750 57923 -42986 -175989 -113144
20101a13144j35985k66713K03999j80724k40328J40882K06220j91502J3872J81000
$$ -113144 -249129 -515842 -311843 -492567 -732895 -592013 -385793 -577295 -563423 -382423
20091c82423J46048J81519q1465J49376J56554j302l7814k2196k16995j06534
$$ -382423 -236375 -54856 -136321 13055 169609 168307 130493 108297 -108698 -215232
20081b15232K53017N6570j26590k20514l4913L1863J80480L19268k6390m706O6793
$$ -215232 37785 94355 -32235 -252749 -287662 -255799 -75319 243949 217559 212853 279646
20070B79646j44492k20233P00L19130m6073R9511j5O2642j00282j82615J28016
$$ 279646 135154 -85079 -84379 234751 188678 288189 288174 350816 250534 67919 195935
20059A95935K37329r5963j84165L8531R5495j02563k44260j4767n4936n8377o7826
$$ 195935 433264 337301 153136 191667 287162 184599 -59661 -74428 -129364 -187741 -255567
20048b55567K00852J9888J98931J79884J35012j62758p8862n7570m1295q8806
$$ -255567 -54715 -34827 164104 343988 479000 316242 237380 179810 138515 49709
20038D9709N961J10250l8398o4491k5247l2029J90867K124K48254K13520q7131
$$ 49709 55670 165920 127522 63031 37784 5755 196622 198746 447000 660520 573389
20027E73389j85597P6263l03728j54610J59457p116k6769M41460K77751k14359
$$ 573389 387792 464055 160327 5717 165174 158058 131289 572749 850500 636141
20017F36141j5961j34861l44531K0790K6269j22392j28941p045j03486N4437J67992
$$ 636141 620180 485319 140788 161578 187847 65455 -63486 -70531 -174017 -119580 48412
20006D8412L46471l8741K01309K05545k53741l66619q2980j3472K88147M7716
$$ 48412 394883 356142 557451 762996 509255 142636 59656 46184 334331 382047
19996C82047r7540j96474j96750K0396J64671J4840M7582j28226k7978L24485
$$ 382047 284507 88033 -108717 -88321 76350 91190 138772 10546 -17432 307053
19986C07053O9991j67485j71899j33568J02187L00359j1650k97112l2535l0687
$$ 307053 377044 209559 37660 -95908 6279 306638 294988 -2124 -34659 -65346
19976f5346N3496J4237k13898J2230M10463P5149j00487j78833K05039J17926
$$ -65346 -11850 2387 -211511 -199281 211182 286331 185844 7011 212050 329976
19966C29976J12081k6568N7075L044r6473j5435P14o8231r0888j4928j0433m471
$$ 329976 442057 415489 472564 475608 379135 363700 364414 296183 205295 190367 179934 175463
19954A75463m00575J9092L89745L02272k9264k35846j2910p9642K5893K1626L318
$$ 175463 -225112 -206020 183725 485997 456733 220887 207977 128335 154228 175854 179172
19943A79172r2491K05052R3333K7424q6656J39332k68333j28226J04926p2340
$$ 179172 86681 291733 385066 412490 325834 465166 196833 68607 173533 101193
19933A01193j51574J55981K21741Q7291l00664j91633r9779J27000k25959j5368
$$ 101193 -50381 105600 327341 414632 113968 -77665 -177444 -50444 -276403 -291771
19923b91771L64277M67287J87984p1113Q8898j37583k95017K03055j76834j28935
$$ -291771 72506 539793 727777 656664 745562 607979 312962 516017 339183 210248
19913B10248j83k25011J83849L65356O918m31355j44122K16320L46742r0347r7848
$$ 210248 210065 -14946 168903 534259 541177 109822 -34300 182020 528762 438415 340567
19902C40567L1970j49742k20921J764J34969J9250o8843k45546J52757O2862J16600
$$ 340567 372537 222795 1874 3638 138607 157857 89014 -156532 -3775 59087 175687
19891A75687K9305J67180Q2917k54626O216K9605J10859N0984N8211K69900j3805
$$ 175687 204992 372172 455089 200463 206679 236284 347143 398127 456338 726238 712433
19880G12433N1995j92808m03617k09059O2657J1755J9835k32561j96180M6135
$$ 712433 764428 571620 168003 -41056 21601 33356 53191 -179370 -375550 -329415
19870c29415L14723R2483m3833J70116J40243j38150M0304j271R5591R959l6133
$$ -329415 -14692 77791 33958 204074 344317 206167 246471 245200 340791 350750 314617
19859C14617j34942q2248j8128l0438m4303j16375m5191J8412j16955N4811Q5816
$$ 314617 179675 97427 79299 48861 4558 -111817 -157008 -138596 -255551 -200740 -114924
19848a14924k1377J78692J69364n7937o1846m4035l0920J56205J67317R6371j02750
$$ -114924 -136301 42391 211755 153818 91972 47937 17017 173222 340539 436910 334160
19837C34160l09749q9628M93974J17686R8557P4425o4059j14943J11346l14159
$$ 334160 24411 -65217 428757 546443 645000 719425 655366 540423 651769 337610
19827C37610l99209J37554K59807j07232j05080l9915j92730K93358K54758J89434
$$ 337610 -61599 75955 335762 228530 123450 83535 -109195 184163 438921 628355
19817F28355R16j63591j54725R175o8547J45375P8699P8326M1227J66267m4367
$$ 628355 629271 465680 310955 320130 251583 396958 475657 553983 595210 761477 717110
19806G17110k30034o0298k06000m019P9646k12242k4280O4603K39540Q1307l52921
$$ 717110 487076 426778 220778 216759 296405 84163 59883 124486 364026 445333 92412
19795I2412k990R1685l151O6593J58576K1260M8679q0232j10895k3265o7143R6102
$$ 92412 89422 181107 177956 244549 403125 424385 473064 392832 281937 258672 191529 287631
19783B87631P8878j32485j17772k06797o8374J57916N30070J24018q4214q5329
$$ 287631 366509 234024 116252 -90545 -158919 -1003 529067 653085 568871 483542
19773D83542k21333J8219Q3320j0309k0865J30657K09253O2979p5212j67223q4224
$$ 483542 262209 280428 363748 353439 332574 463231 672484 735463 660251 493028 408804
19762D08804K3160n2814j67222L6789j9458J42704J18741o3075J3959k20736k38855
$$ 408804 431964 379150 211928 248717 229259 371963 490704 427629 441588 220852 -18003
19751a8003j84634R0557J74955Q3584k69425K16620J1091J40596M5897o4702J08646
$$ -18003 -202637 -112080 62875 146459 -122966 93654 104745 245341 291238 226536 335182
19740C35182M546M4986J18447J11671K0835R0485J37355j86228p9989J53830j26384
$$ 335182 339728 384714 503161 614832 635667 726152 863507 677279 597290 751120 624736
19729F24736k95159O4837j90710k65468J21006j25856q1765L01406K1177j23573
$$ 624736 329577 394414 203704 -61764 59242 -66614 -148379 153027 174204 50631
19719E0631k55598R1777j0608m8090J94516J88350l2728K70092r6053N3550J48254
$$ 50631 -204967 -113190 -123798 -171888 22628 210978 178250 448342 352289 405839 554093
19708E54093q4382k05218k39002R3560j86134J32360O707K04575R8112j81086
$$ 554093 469711 264493 25491 119051 -67083 65277 71984 276559 374671 193585
19698A93585N4316m6757N2563K9149j58131J69117Q0978j68620K4131L2433J99067
$$ 193585 247901 201144 253707 282856 124725 293842 374820 206200 230331 262764 461831
19687D61831j65489n5773M16252J25198j91180l0289q7842k44187j91365L8583
$$ 461831 296342 240569 656821 782019 590839 560550 472708 228521 37156 75739
19677G5739J64596J64401j51701l5971J00280J35143k779k4131j29065k9538J5400
$$ 75739 240335 404736 253035 217064 317344 452487 449708 425577 296512 266974 282374
19666B82374J86085k39685p8192N0203K1364k02316j71715J42600J53429J52638
$$ 282374 468459 228774 150582 200785 222149 19833 -151882 -9282 144147 296785
19656B96785M942K17942J33946j42941k21714q4851O3551R8903n725j91714j41237
$$ 296785 301727 519669 653615 510674 288960 204109 267660 366563 360838 169124 27887
19645B7887N0264P5616J34704n3197o7517k92491k31182j85501M52613M83556
$$ 27887 78151 153767 288471 235274 167757 -124734 -355916 -541417 -88804 394752
19635C94752J52459N0317k30987j0707j6756J13253L00717l5819j87398q818j12493
$$ 394752 547211 597528 366541 355834 339078 452331 753048 717229 529831 521013 408520
19624D08520j26436l1558K47703j05330j62884k47838K17239J94132P0560J25397
$$ 408520 282084 250526 498229 392899 230015 -17823 199416 393548 464108 589505
19614E89505R0357j91667m72049l04324L9255K20472J68595J6029K58085J59736
$$ 589505 679862 488195 16146 -288178 -248923 -28451 140144 156173 414258 573994
19604E73994k87483k16389j11828K98776Q5144j79785n4627J06710L8416j22845
$$ 573994 286511 70122 -41706 257070 342214 162429 107802 214512 252928 130083
19594A30083j02676n5666J14611q6989n064k9415O1756K68155p2370j095O6561
$$ 130083 27407 -28259 86352 -637 -5701 -35116 26640 294795 222425 221330 287891
19583B87891j61364r7267j15111M1581M6744J44788Q6562j84073K4025O4842O1686
$$ 287891 126527 29260 -85851 -44270 2474 147262 233824 49751 73776 138618 200304
19572B00304J8560l5538j15270P2579K92529p2268J7147q4730l3694K09936j01546
$$ 200304 218864 183326 68056 140635 433164 360896 378043 293313 259619 469555 368009
19561C68009j37508k4211Q8434k4949K73699K13842k42417l17724K64806k47595
$$ 368009 230501 206290 294724 269775 543474 757316 514899 197175 461981 214386
19551B14386j68356l7481J31204P0464k6707p7208J84340j5320K9440N4441P477
$$ 214386 46030 8549 139753 210217 183510 106302 290642 275322 304762 359203 366680
19540C66680q721L6728j24731L5524L12160M4526k98002r0212p6981L6944J98445
$$ 366680 357959 394687 269956 305480 617640 662166 364164 273952 196971 233915 432360
19529D32360O2128r4943K6804j04644m8317q3326L9225j12812k67228o8379K79486
$$ 432360 494488 399545 426349 321705 273388 190062 229287 116475 -150753 -219132 60354
19518F0354P8677L2672J92891L41611J15285j35772k11006j71595p1891R3082
$$ 60354 139031 171703 364594 706205 821490 685718 474712 303117 231226 324308
19508C24308J82934n4830K32123l66776J3606K47626Q6574N6285J55082j17734
$$ 324308 507242 452412 684535 317759 331365 578991 665565 721850 876932 759198
19498G59198k2683k86174l5246l5262M6322L65905j01289k58083k27490m22303
$$ 759198 736515 450341 415095 379833 426155 792060 690771 432688 205198 -217105
19488b17105j11621L0493p9785J47199L50064J80507m6940J04374N5317l8605
$$ -217105 -328726 -298233 -378018 -230819 119245 299752 252812 357186 412503 373898
19478C73898m6610O1488j07121K37590J87967L9337N8376L3276r4464r1826n3411
$$ 373898 327288 388776 281655 519245 707212 746549 804925 838201 743737 651911 598500
19467E98500N2341J06899J6797j82282n0137O1293j728K26030L786k24872j75464
$$ 598500 650841 757740 774537 592255 542118 603411 601683 827713 831499 606627 431163
19456D31163k66675p9404R2518p5125j34425j60286Q8162o1691J16762J06271
$$ 431163 164488 85084 177602 102477 -31948 -192234 -104072 -165763 -49001 57270
19446E7270O3295j1987m8736m0116K60466n2234J06992J23157p2655k88234J5733
$$ 57270 120565 108578 59842 19726 280192 227958 334950 458107 385452 97218 112951
19435A12951J48775P2376R5220M2218j57930J55126J02320j66259N0963j6912
$$ 112951 261726 334102 429322 471540 313610 468736 571056 404797 455760 438848
19425D38848M5505O7967m25966k278J66100J30819K51253k42906L3413J17256
$$ 438848 484353 552320 126354 124076 290176 420995 672248 429342 462755 580011
19415E80011O6948p7726k19167k3037n9761l65579O1794l8790M3538L39576l095
$$ 580011 646959 569233 350066 327029 267268 -98311 -36517 -75307 -31769 307807 304712
19404C04712m1518m7567J30162K011J58996J2383j15607K13518o9219k31195K47212
$$ 304712 263194 215627 345789 347800 506796 519179 403572 617090 547871 316676 563888
19393E63888M00966J57937j48147j58233j3120l94455o0271K25484K18893k28435
$$ 563888 964854 1122791 974644 816411 803291 408836 348565 574049 792942 564507
19383E64507k94270K06879J95515J6180l79690k83163j23811L58889L9160j26998
$$ 564507 270237 477116 672631 688811 309121 25958 -97853 261036 300196 173198
19373A73198k20389N3501J98475o2244r2912K1161O1670L89606K56787L10209
$$ 173198 -47191 6310 204785 142541 49629 70790 132460 522066 778853 1089062
19363A089062k03076q3714j40226j97274J56290O6572o9677p9043O427J10747
$$ 1089062 885986 802272 662046 464772 621062 687634 617957 538914 545341 656088
19353F56088j85338K456r4071J660l3454K65319J12170N8077j43773J29691P6857
$$ 656088 470750 473206 379135 380795 347341 612660 724830 782907 639134 768825 845682
19342H45682M5923j16387k29224j94444k28772j39553K82451M42476K71442k58051
$$ 845682 891605 775218 545994 351550 122778 -16775 265676 708152 979594 721543
19332G21543k48018J64974M0030n4487j99653p9737R3885L82501L15657o9766
$$ 721543 473525 638499 678529 624042 424389 344652 438537 821038 1136695 1066929
19322A066929l21104k31884L9845Q1782J20139p9438j1965L7560l1325O3795K0161
$$ 1066929 745825 513941 553786 635568 755707 676269 664304 701864 670539 734334 754495
19311G54495O2503j22646K4827j07469P8173R7071j26610p8253k30363j98450
$$ 754495 816998 694352 719179 611710 689883 786954 660344 582091 351728 153278
19301A53278R5997J91690R5244Q496K89331M0085j87590N7893L2450j19092k00180
$$ 153278 249275 440965 536209 544705 834036 874121 686531 744424 776874 657782 457602
19290D57602m50650J5865L28450J15646k30436J96989J33993Q2824K52128L265
$$ 457602 6952 22817 351267 466913 236477 433466 567459 650283 902411 905676
19280I05676j74428k87501j19035J57939K96498j24601k33976j01017J02400P8869
$$ 905676 731248 443747 324712 482651 779149 654548 420572 319555 421955 500824
19270E00824j73730K38592J66406Q1117j30656q6517o0719k09849K29470K96271
$$ 500824 327094 565686 732092 813209 682553 596036 535317 325468 554938 851209
19260H51209o8580k07799N9108J24497j12644j12254l325O9653Q0467J35742L6129
$$ 851209 782629 574830 633938 758435 645791 533537 530212 599865 680332 816074 852203
19249H52203K03152k35875j27273K1564J64022j4813j93597k5539O245k14915
$$ 852203 1055355 819480 692207 713771 877793 862980 669383 643844 650089 435174
19239D35174Q5161J65487K499M1939K88965J22473K65898m5571m78818k93944
$$ 435174 520335 685822 688321 730260 1019225 1141698 1407596 1362025 883207 589263
19229E89263J6145L0764P2229J59005J02138N2680N5312o5904k26679j96429M2742
$$ 589263 605408 636172 708401 867406 969544 1022224 1077536 1011632 784953 588524 631266
19218F31266J36626K11707n7408N92l7619L9194j7102j04990j18497J32844J8207
$$ 631266 767892 979599 922191 922783 885164 924358 907256 802266 683769 816613 834820
19207H34820k29921j17301j86418N7115l1159Q1375Q1758L6622L25973O0315j82800
$$ 834820 604899 487598 301180 358295 327136 408511 490269 526891 852864 913179 730379
19196G30379K60162j06062j69633k09626O9441K22120J56902j90020M4153J05785
$$ 730379 990541 884479 714846 505220 574661 796781 953683 763663 807816 913601
19186I13601k7033l8237q6135J28915P1769K19732j98998k05820k13672j04269
$$ 913601 886568 848331 762196 891111 962880 1182612 983614 777794 564122 459853
19176D59853K11956K8938K484L6552r4112j44209m8285k6424J52840J14173P6393
$$ 459853 671809 700747 703231 739783 645671 501462 453177 426753 579593 693766 770159
19165G70159L23206K18198J13879q9755j63146k34727q1669j88459k8393K3747
$$ 770159 1093365 1311563 1425442 1335687 1172541 937814 856145 667686 639293 663040
19155F63040j28993J6465L7796n5225j55184L04581n2286l3670n2506R8188J04509
$$ 663040 534047 550512 588308 533083 377899 682480 630194 596524 544018 642206 746715
19144G46715R616J4722K31922K02529O523j85808k40026j51346J87625L2089k98282
$$ 746715 756331 771053 1002975 1205504 1212027 1026219 786193 634847 822472 854561 556279
19133E56279j16916R694p6407K62047L52825Q014m184l4026J06253J79237J20000
$$ 556279 439363 449057 372650 634697 987522 995536 991352 957326 1063579 1242816 1362816
19122A362816k12004k75719q0557P4933J23258M7768j90998j21110m92j98475
$$ 1362816 1150812 875093 794536 869469 992727 1040495 849497 728387 727895 529420
19112E29420k7888p4945r8084J55090L13149O7410O4094K6640l3532j05434j20742
$$ 529420 501532 426587 328503 483593 796742 864152 928246 954886 921354 815920 695178
19101F95178M3245J12549J06677j27378M4973J6124p2149n5699j15447k06228
$$ 695178 738423 850972 957649 830271 875244 891368 819219 763520 648073 441845
19091D41845K48432K35120O2778j07362J42783r0170J11183P4528k19622o9036
$$ 441845 690277 925397 988175 880813 1023596 933426 1044609 1119137 899515 830479
19081H30479j35291M1956J88607J65370P197k00309j18869O4835K88380O858o9223
$$ 830479 695188 737144 925751 1091121 1098318 898009 779140 843975 1132355 1139213 1069990
19070A069990J39339k0881l88071j1816n46K16653j26075k69746l87334j1778
$$ 1069990 1209329 1188448 800377 788561 788015 1004668 878593 608847 221513 209735
19060B09735K01883m7519k6627K36853n4476r3259P7948J08835J18815j16870
$$ 209735 411618 364099 337472 574325 519849 426590 504538 613373 732188 615318
19050F15318p3211m4012O2953J48662J79754k784J43555m2447J49686q9049N3549
$$ 615318 542107 498095 561048 709710 889464 886680 1030235 987788 1137474 1048425 1101974
19039A101974M7217m4197k71727j88026m6460L2323K8805K8630j42692J23299
$$ 1101974 1149191 1104994 833267 645241 598781 631104 659909 688539 545847 669146
19029F69146L86611N4874k6260R3035k27719j04137J46502j88690K3146j4733
$$ 669146 1055757 1110631 1084371 1177406 949687 845550 992052 803362 826508 811775
19019H11775J3765N4766O0171P9192J85551k28400l2129J68858J34869N0880N540
$$ 811775 825540 880306 940477 1019669 1205220 976820 944691 1113549 1248418 1299298 1304838
19008A304838j4556J12802k25754J52976j62750J48375K87254J52200L8260J01743
$$ 1304838 1290282 1403084 1177330 1330306 1167556 1315931 1603185 1755385 1793645 1895388
18998A895388J19507K42878Q2091l28482j50734l6779J33717J76211J96591j1564
$$ 1895388 2014895 2257773 2339864 2011382 1860648 1823869 1957586 2133797 2330388 2318824
18988B318824J99677j34190J42289J91463K6044o5124j26038k61243k89662j9550
$$ 2318824 2518501 2384311 2526600 2718063 2744107 2678983 2552945 2291702 2002040 1982490
18978A982490n5479j17711J88682K37686l13549l73732o2993Q2577k19448L0832
$$ 1982490 1927011 1809300 1997982 2235668 1922119 1548387 1485394 1567971 1348523 1379355
18968A379355j38395L7518J34782J61847J19349j39074J2577j47861M17452J89853
$$ 1379355 1240960 1278478 1413260 1575107 1694456 1555382 1567959 1420098 1837550 2027403
18958B027403l92705l71906j08306J51924J33077o2853k68280m2731J63339K09039
$$ 2027403 1634698 1262792 1154486 1306410 1439487 1376634 1108354 1065623 1228962 1438001
18948A438001Q216k45540r148K92864K43400K24290j32467j64975J18183M05135
$$ 1438001 1446217 1200677 1191529 1484393 1727793 1952083 1819616 1654641 1772824 2177959
18938B177959K83269J25343j94611l07884J22938P8649J04911L0394Q2889R2176
$$ 2177959 2461228 2586571 2391960 2084076 2207014 2285663 2390574 2420968 2503857 2596033
18928B596033n6594K05972r0751l24260j08526k09490K97061N01879j87438n29544
$$ 2596033 2539439 2745411 2654660 2330400 2221874 2012384 2309445 2811324 2623886 2094342
18918B094342k55974K7055J72141M0492j84497l602j03342m4881j39032K08602
$$ 2094342 1838368 1865423 2037564 2078056 1893559 1889957 1786615 1741734 1602702 1811304
18908A811304Q3478J03463p184P420J99130J17486k19886l08323j39319l94529
$$ 1811304 1894782 1998245 1991061 1998481 2197611 2315097 2095211 1786888 1647569 1253040
18898A253040J3424J09925J40119O115l16447J15166J82156o5633k08968l5111
$$ 1253040 1266464 1376389 1516508 1522623 1206176 1321342 1503498 1437865 1228897 1193786
18888A193786L7615N8555J79840J42390q8832R5589j85016j61467J95274r5221
$$ 1193786 1231401 1289956 1469796 1612186 1523354 1618943 1433927 1272460 1467734 1372513
18878A372513J52351J35682j50442n3878J33806m9680K72942K25778j69697q5218
$$ 1372513 1524864 1660546 1510104 1456226 1590032 1540352 1813294 2039072 1869375 1784157
18868A784157k40322l05210P9322L5279J26597J57588j72603k25052j36875N6450
$$ 1784157 1543835 1238625 1317947 1353226 1479823 1637411 1464808 1239756 1102881 1159331
18858A159331j11735K96393K72724K38274J611o5571l37586p2027J32853p9858
$$ 1159331 1047596 1343989 1616713 1854987 1856598 1791027 1453441 1381414 1514267 1434409
18848A434409j17597n7059J42232K8386J32811J86781J3012k1593K640L3452o4476
$$ 1434409 1316812 1259753 1401985 1430371 1563182 1749963 1762975 1741382 1744022 1777474 1712998
18837A712998m8092j89360k44468J27517k1251j97344J3211P8457M7141J20486
$$ 1712998 1664906 1475546 1231078 1358595 1337344 1140000 1153211 1231668 1278809 1399295
18827A399295r9937P420J0544q2216J7973k6676K70044K04538J83383L09065k99574
$$ 1399295 1299358 1306778 1317322 1235106 1253079 1226403 1496447 1700985 1884368 2193433 1893859
18816A893859k60302N5936J12969Q1845r4476k7153k61176O9369L16665k48776
$$ 1893859 1633557 1689493 1802462 1884307 1789831 1762678 1501502 1570871 1887536 1638760
18806A638760j71641j83999p061O9858J41374J01636o8373j63058o0873K54056
$$ 1638760 1467119 1283120 1276059 1345917 1487291 1588927 1520554 1357496 1296623 1550679
18796A550679K14719p8089j31518M6709J83035J47134j8321p9442n4059n1497
$$ 1550679 1765398 1687309 1555791 1602500 1785535 1932669 1914348 1834906 1780847 1729350
18786A729350K6809k76872k43900J48916J66921n6997n0888r7692N3001L40347
$$ 1729350 1756159 1479287 1235387 1384303 1551224 1494227 1443339 1345647 1398648 1738995
18776A738995N8318k21084j44792K08242M66735J29163j28029k26147k7755K6527
$$ 1738995 1797313 1576229 1431437 1639679 2106414 2235577 2107548 1881401 1853646 1880173
18766A880173M6205j84579J5941j37293K35589J00855Q3983k585q6003J71126
$$ 1880173 1926378 1741799 1757740 1620447 1856036 1956891 2040874 2038289 1952286 2123412
18756B123412L3516M6941l9371K0821j31177J42155K43242O4242j14860r6322
$$ 2123412 2156928 2203869 2164498 2185319 2054142 2196297 2439539 2503781 2388921 2292599
18746B292599j67364j80834M244M30663J94489k32114k85993J41499k1448j16749
$$ 2292599 2125235 1944401 1948645 2379308 2573797 2341683 2055690 2197189 2175741 2058992
18736B058992J86625R4325j34879k5899k8192R1155K42O512m1560o276k48204
$$ 2058992 2245617 2339942 2205063 2179164 2150972 2242127 2242369 2248881 2207321 2201045 1952841
18725A952841K6116L12207K03798K6108l58326o5229L18379O2182r6169R0769
$$ 1952841 1978957 2291164 2494962 2521070 2162744 2097515 2415894 2478076 2381907 2472676
18715B472676J09370K61358J60281j11720j11899Q0926J48085N6130j27691k65424
$$ 2472676 2582046 2843404 3003685 2891965 2780066 2860992 3009077 3065207 2937516 2672092
18705B672092j94713J01737K65011P8904N061K13373j08312L1049J77658J1113
$$ 2672092 2477379 2579116 2844127 2923031 2928092 3141465 3033153 3064202 3241860 3252973
18695C252973n1166p1876K1247r6266j46975j4113J74560P0355J19776N4125j81735
$$ 3252973 3201807 3129931 3151178 3054912 2907937 2893824 3068384 3138739 3258515 3312640 3130905
18684C130905k29106R9935L4275k32927J21679L83931R2281q6677l47807j75239
$$ 3130905 2901799 3001734 3036009 2803082 2924761 3308692 3400973 3314296 2966489 2791250
18674B791250k3443K08971M10441J30447L62007J27461J9032k3776l64019l08011
$$ 2791250 2767807 2976778 3387219 3517666 3879673 4007134 4026166 4002390 3638371 3330360
18664C330360J75422K11434N9113j72475M2094l7693J19892l28055L4431N975
$$ 3330360 3505782 3717216 3776329 3603854 3645948 3608255 3728147 3400092 3434523 3440498
18654C440498j77577O3828K95461J37100k45688j02001K31436L17975N3722k17934
$$ 3440498 3262921 3326749 3622210 3759310 3513622 3411621 3643057 3961032 4014754 3796820
18644C796820j67298J58752L17842J50684M1740N5069J23768J80469L007n6772
$$ 3796820 3629522 3788274 4106116 4256800 4298540 4353609 4477377 4657846 4660853 4604081
18634D604081j67382j86810K22684O4725l21053o5853M2837O0856l4853q4368
$$ 4604081 4436699 4249889 4472573 4537298 4216245 4150392 4193229 4254085 4219232 4134864
18624D134864j165J75010J4687R666J66515R0968J93094J45935l43175k0649J72521
$$ 4134864 4133699 4308709 4323396 4333062 4499577 4590545 4783639 4929574 4586399 4565750 4738271
18613D738271L46356L02392m0898j83835k87194L16903j40371j15258m8293P3432
$$ 4738271 5084627 5387019 5346121 5162286 4875092 5191995 5051624 4936366 4888073 4961505
18603D961505L01947K41021K7526K0919J25065J88259J81492j86280n6833m2308
$$ 4961505 5263452 5504473 5531999 5552918 5677983 5866242 6047734 5861454 5804621 5762313
18593E762313o7717K66753K6421j59531K00354J98866q3809k91918J98326L16681
$$ 5762313 5694596 5961349 5987770 5828239 6028593 6227459 6143650 5851732 6050058 6366739
18583F366739M7686j39869j20505J72688J19694q6589o5986j8567K50048K53338
$$ 6366739 6414425 6274556 6154051 6326739 6446433 6359844 6293858 6275291 6525339 6778677
18573F778677J01677J10972L48191J35997J06230K06227r6257j03634j04303r0572
$$ 6778677 6880354 6991326 7339517 7475514 7581744 7787971 7691714 7588080 7483777 7393205
18563G393205j57172L1041K17393J95926M61210P1498q0123M6457K37556K33085
$$ 7393205 7236033 7267074 7484467 7680393 8141603 8213101 8132978 8179435 8416991 8650076
18553H650076j52384q411K30463J78845J93072L3181j8569J07816O3203K36917
$$ 8650076 8497692 8489281 8719744 8898589 9091661 9124842 9106273 9214089 9277292 9514209
18543I514209K74017P7752J76574K21739J24437L7176K31123K25372M57151N6449
$$ 9514209 9788226 9865978 10042552 10264291 10388728 10425904 10657027 10882399 11339550 11395999
18533A1395999P0909k10705L56614K63589J10767K45314J94120J82150J95344
$$ 11395999 11466908 11256203 11612817 11876406 11987173 12232487 12426607 12608757 12804101
18524A2804101j50850K34018L58904M20313L03404O4761J6220K64580L85026L07066
$$ 12804101 12653251 12887269 13246173 13666486 13969890 14034651 14050871 14315451 14700477 15007543
18514A5007543K02503L93254J61811M53667K29693M0589J57718L61596L96149
$$ 15007543 15210046 15603300 15765111 16218778 16448471 16489060 16646778 17008374 17404523
18505A7404523K81823Q1288J16336M55610L19430P4224M25402M71441N98331N28480
$$ 17404523 17686346 17767634 17883970 18339580 18659010 18733234 19158636 19630077 20228408 20756888
18495B0756888M71733N82485M78968L23427L38985P62793R28985N97846L33457
$$ 20756888 21228621 21811106 22290074 22613501 22952486 23715279 24644264 25242110 25575567
18486B5575567P27600Q22454O13226P82659Q85191J116318P57146O78162J044624
$$ 25575567 26303167 27125621 27738847 28521506 29406697 30523015 31280161 31958323 33002947
18477C3002947J274688J357743J198068J454275J485500J502847J482055J625101
$$ 33002947 34277635 35635378 36833446 38287721 39773221 41276068 42758123 44383224
18469D4383224K082083J957820J932025K284755K272880K543843K740269K993922
$$ 44383224 46465307 48423127 50355152 52639907 54912787 57456630 60196899 63190821
18461F3190821L504268L817549M087705M296835M833527N202734N998557O388870
$$ 63190821 66695089 70512638 74600343 78897178 83730705 88933439 94931996 101320866
18453A01320866P344255Q325483Q918571R901520J0941544J1921378J2688936
$$ 101320866 108665121 116990604 125909175 135810695 146752239 158673617 171362553
18446A71362553J3219544J3844253J4163491J3544930J2708271J1138254R123992
$$ 171362553 184582097 198426350 212589841 226134771 238843042 249981296 259105288
18439B59105288O553502L523657K52092k609037n653243q043815r418853j0509115
$$ 259105288 265658790 269182447 269434539 266825502 261172259 253128444 243709591 233200476
18431B33200476j1341764j1732359j1305333j0872102j0185383r322004q558086
$$ 233200476 221858712 210126353 198821020 187948918 177763535 168441531 159883445
18424A59883445p670842o925355o032186n141859m565359l996374l264501l224110
$$ 159883445 152212603 145287248 139255062 134113203 129547844 125551470 122286969 119062859
18416A19062859k422876k161029j778459j576833j403756j127367r30601p35146
$$ 119062859 116639983 114478954 112700495 111123662 109719906 108592539 107661938 106926792
18408A06926792n56200j85494j6036J72150L70712Q68691J491425J861064K565120
$$ 106926792 106370592 106185098 106169062 106341212 106711924 107580615 109072040 110933104 113498224
18399A13498224L104849L495980M116671M958395N976462P098619P762848Q779007
$$ 113498224 116603073 120099053 124215724 129174119 135150581 142249200 150012048 158791055
18391A58791055J0093867J1112034J2111145J2983127J3864434J4236508J4063442
$$ 158791055 168884922 179996956 192108101 205091228 218955662 233192170 247255612
18384B47255612J3739292J2324571J0239900P944927N001725R45227k591668n420331
$$ 247255612 260994904 273319475 283559375 291504302 296506027 297451254 294859586 289439255
18376B89439255q169289j0387473j1920452j3156110j3747650j3960910j3793891
$$ 289439255 281269966 270882493 258962041 245805931 232058281 218097371 204303480
18369B04303480j3077318j2299952j1216293j0052930r560467q437890p255561
$$ 204303480 191226162 178926210 167709917 157656987 148096520 139658630 132403069
18362A32403069o558007o407927n843511m832755m447255m352225l944227l874762
$$ 132403069 125845062 119437135 113593624 108760869 104313614 99961389 96017162 92142400
18354I2142400l527626l629153l613273l475966l613987l470415l142365k923217
$$ 92142400 88614774 84985621 81372348 77896382 74282395 70811980 67669615 64746398
18346F4746398l197480k682260k364900k538364k465958k519508k252635j831307
$$ 64746398 61548918 58866658 56501758 53963394 51497436 48977928 46725293 44893986
18338D4893986j740180j714278j832154j825865j522033j757894j565144j365472
$$ 44893986 43153806 41439528 39607374 37781509 36259476 34501582 32936438 31570966
18330C1570966j385765j267919j030342j130310j111031o19489n82061p07888
$$ 31570966 30185201 28917282 27886940 26756630 25645599 25026110 24444049 23736161
18322B3736161q95061o89853p37649n62921n93649n60938q05148n90889o85278
$$ 23736161 22841100 22151247 21413598 20850677 20257028 19696090 18890942 18300053 17614775
18313A7614775o30067l88567l94889o33505p30522m35283L0146l6359n53026m05226
$$ 17614775 16984708 16596141 16201252 15567747 14837225 14401942 14432088 14395729 13842703 13437477
18303A3437477l71061n09375n16111k02149j80784j02988j63158n15729l11996
$$ 13437477 13066416 12557041 12040930 11838781 11657997 11555009 11391851 10876122 10564126
18294A0564126j39441n1314j44114k64120l63316k81415Q1322R070p9695k02653
$$ 10564126 10424685 10373371 10229257 9965137 9601821 9320406 9401728 9410798 9331103 9128450
18284I128450n00771l78928M5232k35926j18461l40083q3497J35505J45310j17808
$$ 9128450 8627679 8248751 8293983 8058057 7939596 7599513 7516016 7651521 7796831 7679023
18274G679023J6768j20295p4932J29867M3936m02677L5125p2279l56034j04531
$$ 7679023 7695791 7575496 7500564 7630431 7674367 7271690 7306815 7234536 6878502 6773971
18264F773971J62629J00223l5835j26310k6628k08308P6500Q4386k89392l72527
$$ 6773971 6936600 7036823 7000988 6874678 6848050 6639742 6716242 6800628 6511236 6138709
18254F138709J12721M9564j48601j81016o24402j39697K58751o9343j32102K12179
$$ 6138709 6251430 6300994 6152393 5971377 5346975 5207278 5466029 5396686 5264584 5476763
18244E476763P006l72144k96819K6364K03866J5016L3578l08k68780j81388M1027
$$ 5476763 5483769 5111625 4814806 4841170 5045036 5060052 5093630 5093322 4824542 4643154 4684181
18233D684181K44359Q2157r9022j20690r0244K7234m6829R6673j03007j06812
$$ 4684181 4928540 5010697 4911675 4790985 4700741 4727975 4681146 4777819 4674812 4568000
18223D568000k54768J4147j31980L8001j55506k39284O3455K34731J01401p0129
$$ 4568000 4313232 4327379 4195399 4233400 4077894 3838610 3902065 4136796 4238197 4168068
18213D168068r3274K94396K50858j43691J60559k52376m62891p8821k76245k15184
$$ 4168068 4074794 4369190 4620048 4476357 4636916 4384540 3921649 3842828 3566583 3351399
18203C351399j25510j72409J28959L14326J13359Q2099J12957J14099p0975j4585
$$ 3351399 3225889 3053480 3182439 3496765 3610124 3692223 3805180 3919279 3848304 3833719
18193C833719N4905n028j54906l44322k69175o6670n5625L2517R555j36368k35024
$$ 3833719 3888624 3883596 3728690 3384368 3115193 3048523 2992898 3025415 3034970 2898602 2663578
18182B663578N5066p3859r0618K06206l6977j674k43797k5493J08052K24014L21243
$$ 2663578 2718644 2644785 2554167 2760373 2723396 2721722 2477925 2452432 2560484 2784498 3105741
18171C105741q7046j5075o5572r768j06351J6825L83006j69165k71317j55361
$$ 3105741 3018695 3003620 2938048 2928280 2821929 2838754 3221760 3052595 2781278 2625917
18161B625917N6615K77695Q5102O3110n5721l12987o602J62646k01728k31695
$$ 2625917 2682532 2960227 3045329 3108439 3052718 2739731 2733129 2895775 2694047 2462352
18151B462352j03720M7525L88345K6881n9019j65957j70431r9808J04071j8681
$$ 2462352 2358632 2406157 2794502 2821383 2762364 2596407 2425976 2326168 2430239 2411558
18141B411558p4153n1495k18594j8151J80487q9476J89506K82793J37749k34295
$$ 2411558 2337405 2285910 2067316 2049165 2229652 2140176 2329682 2612475 2750224 2515929
18131B515929j34146M8607P7802k8536j69429j79959j77464k6744q1444k6K31602
$$ 2515929 2381783 2430390 2508192 2479656 2310227 2130268 1952804 1926060 1844616 1844590 2076192
18120B076192J00279n5542o5265J74893k0007N752n0345j4798l2247J1437J51206
$$ 2076192 2176471 2120929 2055664 2230557 2210550 2216302 2165957 2151159 2118912 2130349 2281555
18109B281555l2449j73111j70489J67829k07702Q3453P1819L07853j03203j77841
$$ 2281555 2249106 2075995 1905506 2073335 1865633 1949086 2020905 2328758 2225555 2047714
18099B047714m2550n241l6061J31351o8179j13148K36440K27230K9081n7324j12258
$$ 2047714 2005164 1999923 1963862 2095213 2027034 1913886 2150326 2377556 2406637 2349313 2237055
18088B237055m124j09103l7602J14021r4291k36703j41155n9795J70969K08422
$$ 2237055 2232931 2123828 2086226 2200247 2105956 1869253 1728098 1668303 1839272 2047694
18078B047694k78391J58313M14452J77106l27207k25554Q9309J98803n5819L1293
$$ 2047694 1769303 1927616 2342068 2519174 2191967 1966413 2055722 2254525 2198706 2229999
18068B229999l30470J90657o3707j43754J79868K05595k503j13779k69849k13263
$$ 2229999 1899529 2090186 2026479 1882725 2062593 2268188 2265685 2151906 1882057 1668794
18058A668794J54184j7773k33J10282K34627k39398j85183k6971Q8434R9977N7122
$$ 1668794 1822978 1805205 1804972 1915254 2149881 1910483 1725300 1698329 1786763 1886740 1943862
18047A943862p0821K32090Q8381o9465l51793k2278O2058J3855K42393j73607
$$ 1943862 1873041 2105131 2193512 2124047 1772254 1749976 1812034 1825889 2068282 1894675
18037A894675l3121j0381L36945j73680l33296L0282j65448j02896J58129N9762
$$ 1894675 1861554 1851173 2188118 2014438 1681142 1711424 1545976 1443080 1601209 1660971
18027A660971J28543J7773K63733J90066k27680k16603P5431J32992J09506r9805
$$ 1660971 1789514 1807287 2071020 2261086 2033406 1816803 1892234 2025226 2134732 2034927
18017B034927K08857Q7740K8495n2369L7109m0838J7682K99810M1942l62483n07885
$$ 2034927 2243784 2331524 2360019 2307650 2344759 2303921 2321603 2621413 2663355 2300872 1792987
18006A792987J79958K64385Q7479J0123k5793N5592n3957j70653j12514j15193
$$ 1792987 1972945 2237330 2324809 2334932 2309139 2364731 2310774 2140121 2027607 1912414
17996A912414o0212M6315j17633J47432J45612Q943J67131n1739m7817N695J59357
$$ 1912414 1852202 1898517 1780884 1928316 2073928 2082871 2250002 2198263 2150446 2156141 2315498
17985B315498n0829l5583k56434j6779J05108J98543j9600J83503l15971j48315
$$ 2315498 2264669 2229086 1972652 1955873 2060981 2259524 2239924 2423427 2107456 1959141
17975A959141M90066K76372o5030k90075l29217J21740q4555k36656M5946J26390
$$ 1959141 2449207 2725579 2660549 2370474 2041257 2162997 2078442 1841786 1887732 2014122
17965B014122K2657R661r1285L42929O1172j19949N3450j89144j41558k77195
$$ 2014122 2036779 2046440 1955155 2298084 2359256 2239307 2292757 2103613 1962055 1684860
17955A684860J24283O4845j9002K8694L6918K34475J7948j84463j35783l0527
$$ 1684860 1809143 1873988 1854986 1883680 1920598 2155073 2173021 1988558 1852775 1822248
17945A822248P0090O1669K27835j3011m9178j33632O5813L42576O4023l02593
$$ 1822248 1892338 1954007 2181842 2168831 2119653 1986021 2051834 2394410 2458433 2155840
17935B155840L5542J7495m6449o3308j30196N4778K98809J4937R9743K901N8592
$$ 2155840 2191382 2208877 2162428 2099120 1968924 2023702 2322511 2337448 2437191 2440092 2498684
17924B498684j30654K62846q2371k69345J45853J03616J87897l982j63698J1728
$$ 2498684 2368030 2630876 2548505 2279160 2425013 2528629 2716526 2712544 2548846 2560574
17914B560574J80043J81633j60107R590J55833j74555R160J06303j25104K1956
$$ 2560574 2740617 2922250 2762143 2771733 2927566 2753011 2762171 2868474 2743370 2765326
17904B765326J23912j34578k9731J38968O6387k0645j90130N3499L45723j9977
$$ 2765326 2889238 2754660 2724929 2863897 2930284 2909639 2719509 2773008 3118731 3098754
17894C098754j81514k7172K55390R0254L28992L16429o0924o2010L36383J68953
$$ 3098754 2917240 2890068 3145458 3235712 3564704 3881133 3820209 3758199 4094582 4263535
17884D263535M7997J6699k58724r5418K25739J78330J39044P8227j1010L9460
$$ 4263535 4311532 4328231 4069507 3974089 4199828 4378158 4517202 4595429 4584419 4623879
17874D623879m8635Q8477K47260M3564j75790n2837j0283k26898N808Q6955j80737
$$ 4623879 4575244 4663721 4910981 4954545 4778755 4725918 4715635 4488737 4494545 4581500 4400763
17863D400763o9837k10640J6804N4496l6600K531j40394k95689o871J12170N6708
$$ 4400763 4330926 4120286 4137090 4191586 4154986 4157517 4017123 3721434 3714563 3826733 3883441
17852C883441O7947l23972k29189o7594k5538O1289J28846O439K78177J30842
$$ 3883441 3951388 3627416 3398227 3330633 3305095 3366384 3495230 3501669 3779846 3910688
17842C910688J33192q0634O2862k69278j65525l7926M25863K38031O1570R3568
$$ 3910688 4043880 3963246 4026108 3756830 3591305 3553379 3979242 4217273 4278843 4372411
17832D372411J74202j13146K43909K35051J02599j97161o1997J24172j55221J21012
$$ 4372411 4546613 4433467 4677376 4912427 5015026 4817865 4755868 4880040 4724819 4845831
17822D845831K42679j06482k36719R4560J16078k87431r685K36854J8551K1690
$$ 4845831 5088510 4982028 4745309 4839869 4955947 4668516 4658831 4895685 4914236 4935926
17812D935926j54831l4349J04553j10559j59735P5545k66392k31023j8796j69736
$$ 4935926 4781095 4746746 4851299 4740740 4581005 4656550 4390158 4159135 4140339 3970603
17802C970603k62872J49052J05414j58744j15563l5886k8447J89248J22428k14758
$$ 3970603 3707731 3856783 3962197 3803453 3687890 3652004 3623557 3812805 3935233 3720475
17792C720475l77532J7147m8608J45719j82067j84412J48895J16750j16570k85564
$$ 3720475 3342943 3360090 3311482 3457201 3275134 3090722 3239617 3356367 3239797 2954233
17782B954233p6255m0233K77676N6305P4385j69108k19839o9058k07422J06752
$$ 2954233 2877978 2837745 3115421 3171726 3246111 3077003 2857164 2788106 2580684 2687436
17772B687436O2669k97143N2091J96997J7843M1046M0103k7344O4333L09160k36468
$$ 2687436 2750105 2452962 2505053 2702050 2719893 2760939 2801042 2773698 2838031 3147191 2910723
17761B910723M9143J00164R3988j4497j29378n1703r6245J23218j2496M6134j49394
$$ 2910723 2959866 3060030 3154018 3139521 3010143 2958440 2862195 2985413 2972917 3019051 2869657
17750B869657j44339k5088R9209J14120J0619J21958J69348M1550K725J38148
$$ 2869657 2725318 2700230 2799439 2913559 2924178 3046136 3215484 3257034 3259759 3397907
17740C397907k48254l15346j2843M3663k6572L0298m6835O3485r2033R2187P8212
$$ 3397907 3149653 2834307 2821464 2865127 2838555 2868853 2822018 2885503 2793470 2885657 2963869
17729B963869M3284j26384Q9242O3558J40753M2031R7878K14596l7290M7194J00269
$$ 2963869 3007153 2880769 2970011 3033569 3174322 3216353 3314231 3528827 3491537 3538731 3639000
17718C639000N3069k0804j40886L8315K59953q6544m39583J62233J14705j33886
$$ 3639000 3692069 3671265 3530379 3568694 3828647 3742103 3302520 3464753 3579458 3445572
17708C445572K72939j35578j19912R2991M6130K57999L2549p7488k05350j40997
$$ 3445572 3718511 3582933 3463021 3556012 3602142 3860141 3892690 3815202 3609852 3468855
17698C468855J74453k8064J9469j39904j64045J48198m4145J13575m6574j3071
$$ 3468855 3643308 3615244 3634713 3494809 3330764 3478962 3434817 3548392 3501818 3488747
17688C488747J43119Q2325k26467m1658Q8545M02702M96927j0940p7230j64168
$$ 3488747 3631866 3714191 3487724 3446066 3534611 3937313 4434240 4423300 4346070 4181902
17678D181902k83199m8294Q0267k08552k53485k17726J5063K83868L09082L33442
$$ 4181902 3898703 3850409 3930676 3722124 3468639 3250913 3265976 3549844 3858926 4192368
17668D192368j51663k12286P3633O5633J56886L1731Q0279K13072R2381j59160
$$ 4192368 4040705 3828419 3902052 3967685 4124571 4156302 4236581 4449653 4542034 4382874
17658D382874j26993k3034Q5659K0872K4642j15513r7859P9430M9215j19199J22582
$$ 4382874 4255881 4232847 4318506 4339378 4364020 4248507 4150648 4230078 4279293 4160094 4282676
17647D282676n6031j54853p1792J69379J86458J02701J66195n9242k0234J19118
$$ 4282676 4226645 4071792 4000000 4169379 4355837 4458538 4624733 4565491 4545257 4664375
17637D664375j33511k56197k47338K69792L94403j44883Q625J9182L023K92733
$$ 4664375 4530864 4274667 4027329 4297121 4691524 4546641 4555266 4574448 4577471 4870204
17627D870204r3076J46436L02656k79224o8781R8738M3871j79077j05242K33342
$$ 4870204 4777128 4923564 5226220 4946996 4878215 4976953 5020824 4841747 4736505 4969847
17617D969847K63057K2562R8327o3520j28624k37505j57915l4634m5758L53990
$$ 4969847 5232904 5255466 5353793 5290273 5161649 4924144 4766229 4731595 4685837 5039827
17607E039827K20710Q4860q5873o868n1640j11353K32145J95697l08657M56R307
$$ 5039827 5260537 5345397 5259524 5252656 5201016 5089663 5321808 5517505 5208848 5209304 5218611
17596E218611K31587K04568Q002Q793k5648K8952l89709j74533L46582J21939
$$ 5218611 5450198 5654766 5662768 5671561 5645913 5674865 5285156 5110623 5457205 5579144
17586E579144K5899J2365M20581K09261q0285r0837l7102k83141j973J7448K09386
$$ 5579144 5605043 5617408 6037989 6247250 6166965 6076128 6039026 5755885 5753912 5771360 5980746
17575E980746P5068k50445j67502K89192K09069J4084P8843j6291j00538P7419
$$ 5980746 6055814 5805369 5637867 5927059 6136128 6150212 6229055 6212764 6112226 6189645
17565F189645r0851P5091J27605J62595k50674k30634L08746K89356K00518K08464
$$ 6189645 6098794 6173885 6301490 6464085 6213411 5982777 6291523 6580879 6781397 6989861
17555F989861l4571j1371K13917L2230q8328K657J50858J3700j27974P5475k09899
$$ 6989861 6955290 6943919 7157836 7190066 7101738 7104395 7255253 7268953 7140979 7216454 7006555
17544G006555P6140L80313J6332j95791J28659K71811o3500p4023K42951K85205
$$ 7006555 7082695 7463008 7479340 7283549 7412208 7684019 7620519 7546496 7789447 8074652
17534H074652J69499k31637k03580K46593J03100J82155p8974l37166j23263J8727
$$ 8074652 8244151 8012514 7808934 8055527 8158627 8340782 8261808 7924642 7801379 7820106
17524G820106K07753K22264q612j19941J50896j4460J47564J26076J27827K7347
$$ 7820106 8027859 8250123 8241511 8121570 8272466 8258006 8405570 8531646 8659473 8686820
17514H686820J04612k52212J06781Q8278K69498K85678l2726J18199L5544J15812
$$ 8686820 8791432 8539220 8646001 8734279 9003777 9289455 9256729 9374928 9410472 9526284
17504I526284L03223r2151q6713m025P9476R0187p2795j29710J90638N42380L97650
$$ 9526284 9829507 9737356 9650643 9646618 9726094 9816281 9743486 9613776 9804414 10346794 10744444
17493A0744444k71148j04345R0510j16409k11434K91305P0135J56372M0792k74259
$$ 10744444 10473296 10368951 10459461 10343052 10131618 10422923 10493058 10649430 10690222 10415963
17483A0415963J47491M63262M93298J70950j75795o9008J32279P9577k7371L05641
$$ 10415963 10563454 11026716 11520014 11690964 11515169 11446161 11578440 11658017 11630646 11936287
17473A1936287L01285l6222p0922M1410J64954M2366J25568m7068N2763P4864
$$ 11936287 12237572 12201350 12130428 12171838 12336792 12379158 12504726 12457658 12510421 12585285
17463A2585285O34874L48917n0286Q3684J41638m9796J90629O0165O6174Q5101
$$ 12585285 13220159 13569076 13518790 13602474 13744112 13694316 13884945 13945110 14011284 14096385
17453A4096385n8339K0891j62812J76128L71920Q9956K13952L51370K36632L76386
$$ 14096385 14038046 14058937 13896125 14072253 14444173 14534129 14748081 15099451 15336083 15712469
17443A5712469J16402O3164J61680M00951M80465K24638L0888M3750K8402L66933
$$ 15712469 15828871 15892035 16053715 16454666 16935131 17159769 17190657 17234407 17262809 17629742
17433A7629742L49812L78857L03173N00389O3159L5335J78585L93489L59877N32326
$$ 17629742 17979554 18358411 18661584 19161973 19225132 19260467 19439052 19832541 20192418 20724744
17423B0724744M53608K67700J39576K86109N35037L06526M21651P08723L86515
$$ 20724744 21178352 21446052 21585628 21871737 22406774 22713300 23134951 23843674 24230189
17414B4230189N45607M62566K84479L03745M16512L08612L74358M92557M35915
$$ 24230189 24775796 25238362 25522841 25826586 26243098 26551710 26926068 27418625 27854540
17405B7854540O43907L06373J15714M93691L02335P7562N83725M71082L89775
$$ 27854540 28498447 28804820 28920534 29414225 29716560 29794122 30377847 30848929 31238704
17396C1238704K62533M00138N72405Q12204R22728P14352L92436O68793Q07106
$$ 31238704 31501237 31901375 32473780 33285984 34208712 34923064 35315500 35984293 36791399
17387C6791399M44586Q30895R30749R75560J168446J410397J191929J038566J085473
$$ 36791399 37235985 38066880 38997629 39973189 41141635 42552032 43743961 44782527 45868000
17378D5868000J355905J312619J456921J574155J501112J685393J808908K270286
$$ 45868000 47223905 48536524 49993445 51567600 53068712 54754105 56563013 58833299
17370E8833299K210568K098707K159917K446813K864599K923064L321814L158476
$$ 58833299 61043867 63142574 65302491 67749304 70613903 73536967 76858781 80017257
17362H0017257L156191L940207M525877N233938N679600O159108O449495P274371
$$ 80017257 83173448 87113655 91639532 96873470 102553070 108712178 115161673 122436044
17354A22436044Q467674R410656J0249432J1575811J2661415J3986334J4785947
$$ 122436044 130903718 140314374 150563806 162139617 174801032 188787366 203573313
17347B03573313J5415710J6176144J7104409J6561604J5269200J3409628J0486219
$$ 203573313 218989023 235165167 252269576 268831180 284100380 297510008 307996227
17340C07996227O694665K977813r53068m643041p893075j0415285j2022645j3174470
$$ 307996227 314690892 317668705 316715637 312072596 304179521 293764236 281741591 268567121
17332B68567121j3892115j3591881j3480639j2270144j1251706j0198476r337744
$$ 268567121 254675006 241083125 227602486 215332342 204080636 193882160 184544416
17325A84544416q401914p336399o125745n283477m714456m149221l854496l205768
$$ 184544416 176142502 168806103 162680358 157396881 152682425 148533204 144678708 141472940
17317A41472940k504039k375026k363205j649559j308871j442179j493136j274155
$$ 141472940 138968901 136593875 134230670 132581111 131272240 129830061 128336925 127062770
17309A27062770j042453j011428o48243l17467J12964M01384Q15671J115998J936975
$$ 127062770 126020317 125008889 124360646 124043179 124156143 124557527 125373198 126489196 128426171
17300A28426171K471698K634910L641176M598700N447141O296519P353614Q135922
$$ 128426171 130897869 133532779 137173955 141772655 147219796 153516315 160869929 169005851
17292A69005851Q836127J0306579J1544235J2357242J3123526J3888048J4014790
$$ 169005851 177841978 188148557 199692792 212050034 225173560 239061608 253076398
17285B53076398J3390548J2344466J0290963P368740M233459L60779l106336o001185
$$ 253076398 266466946 278811412 289102375 296471115 300704574 301065353 297959017 291957832
17277B91957832q415453j0642920j2392533j2938853j3342524j3042143j2517995
$$ 291957832 283542379 272899459 260506926 247568073 234225549 221183406 208665411
17270B08665411j1774536j0767935r594472q762419p958770p049308o281159n568012
$$ 208665411 196890875 186122940 176528468 167766049 159807279 152757971 146476812 140908800
17262A40908800n023966m783757m182543l646972l143604l078319k839927k923987
$$ 140908800 135884834 131101077 126918534 123271562 120127958 117049639 114209712 111285725
17254A11285725k639610k981934k918874k668002k417514k554066k085881k100247
$$ 111285725 108646115 105664181 102745307 100077305 97659791 95105725 93019844 90919597
17246I0919597k193974k149535j698571j972497j765893j368769j099327j131785
$$ 90919597 88725623 86576088 84877517 82905020 81139127 79770358 78671031 77539246
17238G7539246j080768j231467j051318q34599r44966p61203o15778n74634m64722
$$ 77539246 76458478 75227011 74175693 73341094 72396128 71634925 71019147 70444513 69979791
17229F9979791n9484j13568n28084j43964L51422l1122j11943n4848n779J57253
$$ 69979791 69920307 69806739 69278655 69134691 69486113 69454991 69343048 69288200 69282421 69439674
17219F9439674M40924N94490M17222J71076L64427O63753O20824P18019N66652
$$ 69439674 69880598 70475088 70892310 71063386 71427813 72091566 72712390 73430409 73997061
17210G3997061P44358P49475N04512N72673J045525J101855R49115J171328J040807
$$ 73997061 74741419 75490894 75995406 76568079 77613604 78715459 79664574 80835902 81876709
17201H1876709J280409J486528J503755J132569J119669J432451J057694J291132
$$ 81876709 83157118 84643646 86147401 87279970 88399639 89832090 90889784 92180916
17193I2180916J890175K044360J989759K138911J923427J893067J741937K353094
$$ 92180916 94071091 96115451 98105210 100244121 102167548 104060615 105802552 108155646
17185A08155646K386607K363286K551289K400626K832874K836105K873290L103766
$$ 108155646 110542253 112905539 115456828 117857454 120690328 123526433 126399723 129503489
17177A29503489L234258L376931L781948L800513L800518L940590M349287M414063
$$ 129503489 132737747 136114678 139896626 143697139 147497657 151438247 155787534 160201597
17169A60201597M457239M946594N098544N358515N555186N780237O215157O168965
$$ 160201597 164658836 169605430 174703974 180062489 185617675 191397912 197613069 203782034
17161B03782034O584295O823197P126326P410935Q154241Q450964Q466347Q983337
$$ 203782034 210366329 217189526 224315852 231726787 239881028 248331992 256798339 265781676
17153B65781676R433860R480461R733979J0221298J0530569J1134649J1549096
$$ 265781676 275215536 284695997 294429976 304651274 315181843 326316492 337865588
17146C37865588J1879204J1995388J2181829J2346867J2440707J2298786J2009334
$$ 337865588 349744792 361740180 373922009 386268876 398709583 411008369 423017703
17139D23017703J2356069J2214287J1661451J1058191J0761012R857735Q927870
$$ 423017703 435373772 447588059 459249510 470307701 481068713 490926448 499854318
17132D99854318P908821P150877N978293M356604L182145J889685M08587o59639
$$ 499854318 507763139 514914016 520892309 525248913 528431058 530320743 530729330 530069691
17124E30069691k179362l413494m886307n990177o764264p802314q318807r197257
$$ 530069691 527890329 524476835 519590528 513600351 506836087 499033773 490714966 481517709
17116D81517709r823496j0117984j0703049j0737538j0439720j0805772j1140804
$$ 481517709 471694213 461576229 450873180 440135642 429695922 418890150 407749346
17109D07749346j1074411j0988589j0896325j0791244j0546891j0216692j0091071
$$ 407749346 396674935 385686346 374790021 363998777 353451886 343235194 333144123
17102C33144123r909928r360539r418083r126022q801729q605479q490848q357897
$$ 333144123 323234195 313873656 304455573 295329551 286527822 277922343 269431495 261073598
17094B61073598q481041p769900p447906p466265p322224o884764o758862o321541
$$ 261073598 252592557 244822657 237374751 229908486 222586262 215701498 208942636 202621095
17086B02621095o465881o307810o174347n705030n333176n106496n009421m970589
$$ 202621095 196155214 189847404 183673057 177968027 172634851 167528355 162518934 157548345
17078A57548345m582156m361222m298921m424315m110002l992443m010435l831257
$$ 157548345 152966189 148604967 144306046 139881731 135771729 131779286 127768851 123937594
17070A23937594l669192l385812l482119l207856k931215l129733k792275k735858
$$ 123937594 120268402 116882590 113400471 110192615 107261400 104131667 101339392 98603534
17062I8603534k742059k531448k399246k468173k392611k733647k228737j915747
$$ 98603534 95861475 93330027 90930781 88462608 86069997 83336350 81107613 79191866
17054G9191866j766549j593266j622075j833039j872184j608350j628204j573722
$$ 79191866 77425317 75832051 74209976 72376937 70504753 68896403 67268199 65694477
17046F5694477j601707j381466j351482j576233j280964j129084j079985j123263
$$ 65694477 64092770 62711304 61359822 59783589 58502625 57373541 56293556 55170293
17038E5170293j026405j083003r17788j163541j334158j198196p82408o90018
$$ 55170293 54143888 53060885 52143097 50979556 49645398 48447202 47664794 46974776
17030D6974776j006867j156823r50062r20237q07677q85655n80613l31247o11188
$$ 46974776 45967909 44811086 43861024 42940787 42133110 41247455 40666842 40335595 39724407
17021C9724407q61780l97102l29596o58956o15730p66011m77319o49163o22572
$$ 39724407 38862627 38465525 38135929 37476973 36861243 36095232 35617913 34968750 34346178
17012C4346178o12405n53129n88544k69020l56501l79770n36389o68611n47464
$$ 34346178 33733773 33180644 32592100 32323080 31966579 31586809 31050420 30381809 29834345
17003B9834345k84242k98775k98405m40002n94237m73722n32331k79873q8527
$$ 29834345 29550103 29251328 28952923 28512921 27918684 27444962 26912631 26632758 26544231
16994B6544231L0723l03686o60857n73466m75524j77840l9601k00450n88822j93172
$$ 26544231 26574954 26271268 25610411 25036945 24561421 24383581 24343980 24143530 23554708 23361536
16984B3361536k997l12928l33554m58187q59033l42475N0664p5357l02882n75596
$$ 23361536 23358539 23045611 22712057 22253870 21394837 21052362 21103026 21027669 20724787 20149191
16974B0149191k71413m9318l18230k83368j19442O6313j9358j19190j86941l52289
$$ 20149191 19877778 19828460 19510230 19226862 19107420 19173733 19154375 19035185 18848244 18495955
16964A8495955l95681q8383l19824l76392o7819j47484j57890j5766r8577l78296
$$ 18495955 18100274 18011891 17692067 17315675 17247856 17100372 16942482 16926716 16828139 16449843
16954A6449843k13705n7734k15791r2762k18502r2029k83334k35020k187R1927
$$ 16449843 16236138 16178404 15962613 15869851 15651349 15559320 15275986 15040966 15038779 15130706
16944A5130706k08994j30809k18607k07005J18679j21476l65087n59286k00685
$$ 15130706 14921712 14790903 14572296 14365291 14483970 14362494 13997407 13438121 13237436
16935A3237436L0019j76638j18263j70834q1597r0157n2384k88567k53996k61847
$$ 13237436 13267455 13090817 12972554 12801720 12720123 12629966 12577582 12289015 12035019 11773172
16925A1773172m27568O7638j17002j34992J78833n5810j20430L23651K18749k04188
$$ 11773172 11345604 11413242 11296240 11161248 11340081 11284271 11163841 11487492 11706241 11502053
16915A1502053l18461m63627j83485j19755l83623l48604L4530k71951k0930r1945
$$ 11502053 11183592 10719965 10536480 10416725 10033102 9684498 9719028 9447077 9426147 9334202
16905I334202l52629K48279k5317j25978L25128O0967k50959j28833j99792p5461
$$ 9334202 8981573 9229852 9204535 9078557 9403685 9464652 9213693 9084860 8885068 8809607
16895H809607j6752j11879O6097K13132k23545l75201j95505J75838n1817j46222
$$ 8809607 8792855 8680976 8747073 8960205 8736660 8361459 8165954 8341792 8289975 8143753
16885H143753J21664j88571J90042J19391k85759j38230j1489L944o8296J26736
$$ 8143753 8265417 8076846 8266888 8386279 8100520 7962290 7950801 7954745 7886449 8013185
16875H013185J55962J26401p055l72567l03984j28535J6447J7941j42491L6660
$$ 8013185 8169147 8295548 8288493 7915926 7611942 7483407 7499854 7517795 7375304 7411964
16865G411964M8964K35949K4068l7845o1744K2196j92776j37598J01009m8995
$$ 7411964 7460928 7696877 7720945 7683100 7621356 7643552 7450776 7313178 7414187 7365192
16855G365192J36293K68368K4676N3872L01180L656j11686M1109l8249j15117
$$ 7365192 7501485 7769853 7794529 7848401 8149581 8153237 8041551 8082660 8044411 7929294
16845G929294k73807k9041M9675k88150j30339m6608j48587J57623J52884q0772
$$ 7929294 7655487 7626446 7676121 7387971 7257632 7211024 7062437 7220060 7372944 7292172
16835G292172j2864m5383q1341k10910j90292j29453o1484j10539k30213j57385
$$ 7292172 7279308 7233925 7152584 6941674 6751382 6621929 6560445 6449906 6219693 6062308
16825F062308K93099J81309K0677j66458j80304M7857l37047k46228L82690L56072
$$ 6062308 6355407 6536716 6557393 6390935 6210631 6258488 5921441 5675213 6057903 6413975
16815F413975j05647j33816J67076j35675p7908M8586n501k84233l4981J46004
$$ 6413975 6308328 6174512 6341588 6205913 6128005 6176591 6171090 5886857 5851876 5997880
16805E997880J27907l1251P4396J85745o0356k08971m6676J5273k97153K40777
$$ 5997880 6125787 6094536 6168932 6354677 6294321 6085350 6038674 6053947 5756794 5997571
16795E997571K10408k61343k67745k70730k6155l8019k36515J12653j00232M0319
$$ 5997571 6207979 5946636 5678891 5408161 5382006 5343987 5107472 5220125 5119893 5160212
16785E160212l82481j22985j3607o8722j27001M10852j83891k64688o9657m2892
$$ 5160212 4777731 4654746 4641139 4572417 4445416 4856268 4672377 4407689 4338032 4295140
16775D295140K58635R2837J37243k29838j63234r3815L4999J53032n9825N0359
$$ 4295140 4553775 4646612 4783855 4554017 4390783 4296968 4331967 4484999 4425174 4475533
16765D475533j19972m05143r7000L9589J50879P9280k7854k6748j16427j4915
$$ 4475533 4355561 3950418 3853418 3893007 4043886 4123166 4095312 4068564 3952137 3937222
16755C937222M6982r144n3465J5653P3389K3681K17039J47372q8789L5418J83895
$$ 3937222 3984204 3975060 3921595 3937248 4010637 4034318 4251357 4398729 4309940 4345358 4529253
16744D529253J46942J16780J53041l66936k57255p3292j63094p6513K31530K5031
$$ 4529253 4676195 4792975 4946016 4579080 4321825 4248533 4085439 4008926 4240456 4265487
16734D265487j9577l21081k08401o8879P9612J41923r9885j01127J3197k2470
$$ 4265487 4245910 3924829 3716428 3647549 3727161 3869084 3769199 3668072 3681269 3658799
16724C658799o1017l45512n0461Q2111J62079J58943O5568k886k66649j57105
$$ 3658799 3597782 3252270 3201809 3283920 3445999 3604942 3670510 3667624 3400975 3243870
16714C243870k9325J07921m0511k64249k17484J21647K32407k52290j77676j06596
$$ 3243870 3214545 3322466 3281955 3017706 2800222 2921869 3154276 2901986 2724310 2617714
16704B617714q6033L05265J77964k6304k19203j78035P2978P8343j25399J55730
$$ 2617714 2531681 2836946 3014910 2988606 2769403 2591368 2664346 2742689 2617290 2773020
16694B773020k01748r2532N1210J43721O2597M116r4478k82436k39226J78004
$$ 2773020 2571272 2478740 2529950 2673671 2736268 2740384 2645906 2363470 2124244 2302248
16684B302248J67161O3321k2102o8693J25352o1727J8162j7458l78189K5288r9521
$$ 2302248 2469409 2532730 2510628 2441935 2567287 2505560 2523722 2506264 2128075 2153363 2053842
16673B053842J07587j72691l7387J50009M5296K8897J77508k3062j5773j68269
$$ 2053842 2161429 1988738 1951351 2101360 2146656 2175553 2353061 2329999 2314226 2145957
16663B145957k2362n261K03130M3046j90157J06291L4072j53349k12740j04362
$$ 2145957 2123595 2118334 2321464 2364510 2174353 2280644 2314716 2161367 1948627 1844265
16653A844265J33338O5354j03049r6132J30031J30740j5913l97606j83821K06837
$$ 1844265 1977603 2042957 1939908 1843776 1973807 2104547 2088634 1691028 1507207 1714044
16643A714044M09758K938l53672m9728K54943r3776N1919k87025j46204R2117
$$ 1714044 2123802 2126740 1773068 1723340 1978283 1884507 1936426 1649401 1503197 1595314
16633A595314k3513O2540K6497l5967k29151j08533J42771M0112K97581J33027
$$ 1595314 1571801 1634341 1660838 1624871 1395720 1287187 1429958 1470070 1767651 1900678
16623A900678l0379j92698L2251J96216j79179k30230j22681o9106R4185K1603
$$ 1900678 1870299 1677601 1709852 1906068 1726889 1496659 1373978 1304872 1399057 1420660
16613A420660J8969J44109n4059j8101j65767P8020J13157O8265J00359j23832
$$ 1420660 1439629 1583738 1529679 1511578 1345811 1423831 1536988 1605253 1705612 1581780
16603A581780m03297l9279j15429K62864L52730k0896j81841j11313M7984j68181
$$ 1581780 1178483 1139204 1023775 1286639 1639369 1618473 1436632 1325319 1373303 1205122
16593A205122J2840K05014J91398p2830l39058p632J61234N8428J68352j11410
$$ 1205122 1217962 1422976 1614374 1541544 1202486 1194854 1356088 1414516 1582868 1471458
16583A471458J63996P5263j08443p8493k25173J57179K45860k18894n3236J08866
$$ 1471458 1635454 1710717 1602274 1523781 1298608 1455787 1701647 1482753 1429517 1538383
16573A538383L66619J18413q8226k65775k74346j31194J62367j77124P5709J99679
$$ 1538383 1905002 2023415 1935189 1669414 1395068 1263874 1426241 1249117 1324826 1524505
16563A524505j11975j22357M8404j59240j26770j03315j36853J3110J57374j54417
$$ 1524505 1412530 1290173 1338577 1179337 1052567 949252 812399 825509 982883 828466
16553H28466m2058L9742L2033O4685R1992K8289J81727j07484k18230q4624J23897
$$ 828466 786408 826150 858183 922868 1014860 1043149 1224876 1117392 899162 814538 938435
16542I38435j4431j75356j04666p6182j7565J60245J89015R1018J31330L90870
$$ 938435 924004 748648 643982 567800 550235 710480 899495 990513 1121843 1512713
16532A512713N0278j1671J64292K8660K9863K4851l58396j25884l4575k16880
$$ 1512713 1562991 1551320 1715612 1744272 1774135 1798986 1440590 1314706 1280131 1063251
16522A063251j06243P7470o7263M5775J3768N9836J1256l43J01226P6868N8750
$$ 1063251 957008 1034478 967215 1012990 1026758 1086594 1097850 1097507 1198733 1275601 1334351
16511A334351J76871j91543j0672o4529k82962m9358J66584k2545j50801q8947
$$ 1334351 1511222 1319679 1309007 1244478 961516 912158 1078742 1056197 905396 816449
16501H16449N864J02004q0062j7963L4127L88440J09620j71538N2057J72650Q2920
$$ 816449 822313 924317 844255 826292 860419 1248859 1358479 1186941 1238998 1411648 1494568
16490A494568j60135m7909l42799l77075P5363P3478O4737q192k17288M3536j0226
$$ 1494568 1334433 1286524 943725 566650 642013 715491 780228 772036 554748 598284 588058
16479E88058m3473j32969n784L65095Q2079K1022r403j78755K42143K5021Q4138
$$ 588058 544585 411616 405832 770927 853006 874028 864625 685870 928013 953034 1037172
16468A037172j32473J51659K6250r7650N8177J08076j90316k04179j46379J12245
$$ 1037172 904699 1056358 1082608 984958 1043135 1151211 960895 756716 610337 722582
16458G22582J82703Q0813j38462r1355m3656L4291k9554j24209j47770O2044R4671
$$ 722582 905285 986098 847636 756281 712625 746916 717362 593153 445383 507427 602098
16447F02098K02676j9038k5280N4149L12714j39585k63850q2354q897J77764J10296
$$ 602098 804774 785736 760456 814605 1127319 987734 723884 641530 632633 810397 920693
16436I20693j14862k37695Q9023N29934K7414k53291r4489J9771K13927k2897
$$ 920693 805831 568136 657159 1187093 1214507 961216 866727 886498 1100425 1077528
16426A077528j12413j42910j4710J56810j0188o8027k06156j95465r8828J87279
$$ 1077528 965115 822205 807495 964305 954117 886090 679934 484469 385641 572920
16416E72920K06163K7701j87400j13224j8729L32802L9397j67751P3687K3764
$$ 572920 779083 806784 619384 506160 487431 820233 859630 691879 765566 789330
16406G89330j69849j46737j52277J67996k8j7508q4277J77928J18155j64721j97664
$$ 789330 619481 472744 320467 488463 488435 470927 386650 564578 682733 518012 320348
16395C20348J06186K95413K64901l03808l50331Q9937J00423P2991K3801N9592
$$ 320348 426534 721947 986848 683040 332709 422646 523069 596060 619861 679453
16385F79453n365n3831k29480m9039J56215L2039k04181J70004J06247j42613
$$ 679453 674088 620257 390777 341738 497953 529992 325811 495815 602062 459449
16375D59449j04642N2196R5237P2716j37017O8407J60909j73849j63015N3420
$$ 459449 354807 407003 502240 574956 437939 506346 667255 493406 330391 383811
16365C83811M520J54864K25489l6082k42653r2438p1750J0471o5337J2016L9579
$$ 383811 388331 543195 768684 732602 489949 397511 325761 336232 270895 282911 322490
16354C22490k45894J08614j96720M9699O1253J65905l4822J48680J41305Q829
$$ 322490 76596 185210 -11510 38189 99442 265347 230525 379205 520510 529339
16344E29339m7836J00702O4537K53076O885l02891k10743j36978m3720p6885j80717
$$ 529339 481503 582205 646742 899818 906703 603812 393069 256091 212371 135486 -45231
16333d5231Q4069J69186M5043J96886m8929k59123K17258K9928K0422j23652k56307
$$ -45231 38838 208024 253067 449953 401024 141901 359159 389087 409509 285857 29550
16322B9550k27753L83453L93333j9334n702l2450j78585k9287n250J6995j31090
$$ 29550 -198203 185250 578583 559249 553547 521097 342512 313225 307975 324970 193880
16311A93880j81350j40985R5891L43035J57261k0492j97543K63671K99448O0066
$$ 193880 12530 -128455 -32564 310471 467732 447240 249697 513368 812816 872882
16301H72882l65899j39820J14706l4121m0Q0155r7577J36036L0256J07346k10857
$$ 872882 506983 367163 481869 447748 447708 527863 430286 566322 596578 703924 493067
16290D93067j91044N6241N3734O0093l32960k11206L0509K34611J93302l5248
$$ 493067 302023 358264 411998 472091 139131 -72075 -41566 193045 386347 351099
16280C51099j48263L2696q6436j68505J28542L04896P8761J0508m7316j44685
$$ 351099 202836 235532 149096 -19409 109133 414029 492790 503298 455982 311297
16270C11297J803M2789p3225j19149j55235k25569J17698M24489J91829Q193j32615
$$ 311297 313100 355889 282664 163515 8280 -217289 -99591 324898 516727 524920 392305
16259C92305j42492J94646m8185J34883K67411l21843l17270O904M0825J85754
$$ 392305 249813 444459 396274 531157 798568 476725 159455 166359 207184 392938
16249C92938m2239k262M2340N758l26780m8060K97253l1781j78192L14631P3165
$$ 392938 350699 348437 390777 396535 69755 21695 318948 287167 108975 423606 496771
16238D96771j10188L184p830j1709k45322l28446q8593J02931K47320m2468l5701
$$ 496771 386583 389767 381937 370228 124906 -203540 -292133 -189202 58118 15650 -20051
16227b0051J26369J40482J46855L01940l1650k79408j55225J91579N1540j81556
$$ -20051 106318 246800 393655 695595 663945 384537 229312 420891 472431 290875
16217B90875J50807K63613J15406k58308j80995m1827J19471j01069J16288L1754
$$ 290875 441682 705295 820701 562393 381398 339571 459042 357973 474261 506015
16207E06015L8963J3982l78580k2527P8019l3980Q156j45989K804J28358j22005
$$ 506015 544978 558960 180380 157853 235872 201892 210048 64059 66863 195221 73216
16196G3216q9602J68829k0104j81742Q8030j26004Q1743N6444p2296O7802l1411
$$ 73216 -16386 152443 132339 -49403 38627 -87377 -5634 50810 -21486 46316 14905
16185A4905l3993J31943J94527o3301j52769N5957M3018l3911k83694J05484J54318
$$ 14905 -19088 112855 307382 244081 91312 147269 190287 156376 -127318 -21834 132484
16174A32484J87216P1254j82155l7493J09739k41375j2344J97964J148R1854n9914
$$ 132484 319700 390954 208799 171306 281045 39670 27326 225290 226438 318292 258378
16163B58378k1633k08943k65006o2036J47632Q6938M1046o626K62539L54884r1667
$$ 258378 236745 27802 -237204 -299240 -151608 -64670 -23624 -30250 232289 587173 495506
16152D95506o2966Q4078m6470j74306k87456j45440J01144R7929j79984l2871
$$ 495506 432540 516618 470148 295842 8386 -137054 -35910 62019 -117965 -150836
16142a50836Q260N3605L99431J6504k45872m1417K26832K49395j46839K70j32807
$$ -150836 -142576 -88971 310460 326964 81092 39675 266507 515902 369063 369333 236526
16131B36526k3907O3147O6155j20116l5934j15398K0650N3490n4116o7328l252
$$ 236526 212619 275766 341921 221805 185871 70473 91123 144613 90497 23169 19917
16120A9917n5813j09309O6329Q7295k13852k57762J78555K47198L49486K93206
$$ 19917 -35896 -145205 -78876 8419 -205433 -463195 -284640 -37442 312044 605250
16110F05250K23164J74301j80669j49395J14312j58996j37915J6276j65527k27132
$$ 605250 828414 1002715 822046 672651 786963 627967 490052 506328 340801 113669
16100A13669J58093N4416j87494j46686J18459P3493l7954j408K78801R4265j47388
$$ 113669 271762 326178 138684 -8002 110457 183950 145996 144588 423389 517654 370266
16089C70266q3931k80340p1277K39759K99762J38299J2645m8272p1796j74941
$$ 370266 286335 5995 -65282 174477 474239 612538 625183 576911 505115 330174
16079C30174j20240n4018r6096k55563J82411K1127o236K04886l6059j08349K66937
$$ 330174 209934 155916 59820 -195743 -13332 7795 1559 206445 170386 62037 328974
16068C28974K25732q851k34673j87644M5326j99219j59330j70970p4175J30516
$$ 328974 554706 545855 311182 123538 168864 -30355 -189685 -360655 -434830 -304314
16058c04314K39530K33956n2974j47496n8501J05945K3101L3328O9124q1049q173
$$ -304314 -64784 169172 116198 -31298 -89799 16146 39247 72575 141699 60650 52477
16047E2477K14276L6054j57940j97031m7005L19677K70749O8540j00277j12273
$$ 52477 266753 302807 144867 -52164 -99169 220508 491257 559797 459520 347247
16037C47247l3184j59234o4676Q2507j1590l78133j56661K96743K89345J89523
$$ 347247 314063 154829 90153 172660 161070 -217063 -373724 -76981 212364 401887
16027D01887P0112n0101J16949j50835k35065m0084r8872p0317p5853J66226K44830
$$ 401887 471999 421898 538847 388012 152947 112863 13991 -56326 -132179 34047 278877
16016B78877Q0130j78669l3337j43107Q8690K54350l6582j95541j41172R1775
$$ 278877 359007 180338 147001 3894 92584 346934 310352 114811 -26361 65414
16006F5414j01121K7113P372l9906r2228l9960R5877j89216p256K80882J05699
$$ 65414 -35707 -8594 -1222 -41128 -133356 -173316 -77439 -266655 -273911 6971 112670
15995A12670k22722q1259L4583J69723J45567J32186R8463j83404k86715r8193
$$ 112670 -110052 -191311 -156728 12995 158562 290748 389211 205807 -80908 -179101
15985a79101K42437Q9022K34503J72233l4920j47105M1712J89639j36615N2430
$$ -179101 63336 152358 386861 559094 524174 377069 418781 608420 471805 524235
15975E24235J83889j4143J1958j49377j62124m24617l03326K6494K28429L37403
$$ 524235 708124 693981 705939 556562 394438 -30179 -333505 -307011 -78582 258821
15965B58821p1430j57896J83764m3444k04651j66840L8871J78305J86689o3797
$$ 258821 187391 29495 213259 169815 -34836 -201676 -162805 15500 202189 138392
15955A38392K56743k630l95310L8369K51104k46246n4144J7473q2718J87252m0223
$$ 138392 395135 392505 -2805 35564 286668 40422 -13722 3751 -78967 108285 68062
15944F8062p9586r7792j3663O6134K90546J33471o1096K2804j74289M0709Q631
$$ 68062 -11524 -109316 -122979 -56845 233701 367172 306076 328880 154591 195300 203931
15933B03931j69734j39201j0130J07101o0501p069r6702n6461m6992l8760J02478
$$ 203931 34197 -105004 -115134 -8033 -68534 -75603 -172305 -228766 -275758 -314518 -212040
15922b12040J08451J32698K65735M6129n4315l69564j69756q5420K98422J99200
$$ -212040 -103589 29109 294844 340973 286658 -82906 -252662 -338082 -39660 159540
15912A59540N6200J55930l6285k03400j23341j20862L8653j5434o213K10923J31153
$$ 159540 215740 371670 335385 131985 8644 -112218 -73565 -88999 -95212 115711 246864
15901B46864j05526j94443N0738J3329k4404j18880J3385R1723J13961P9518J23772
$$ 246864 141338 -53105 -2367 10962 -13442 -132322 -118937 -27214 86747 166265 290037
15890B90037N7674o7364o1515J25537k44922k25496P4904N426J31038Q6519L06044
$$ 290037 347711 280347 218832 344369 99447 -126049 -51145 -45719 85319 171838 477882
15879D77882K29636j07296l58962l29092l8007J21139l6746j48153J70409o8546
$$ 477882 707518 600222 241260 -87832 -125839 -4700 -41446 -189599 -19190 -87736
15869h7736q9734J11516l993n2579J15421K79465R0166k42474J2287q0208l1936
$$ -87736 -177470 -65954 -69947 -122526 -7105 272360 362526 120052 132339 52131 20195
15858B0195n924j91520J95162L1508j01220j31742K44271m1142j14077J07189
$$ 20195 14271 -177249 17913 49421 -51799 -183541 60730 19588 -94489 12700
15848A2700q1626K5946J32603J7469O508p9556r9739M7061O9029l6711j30516
$$ 12700 -68926 -42980 89623 107092 113600 34044 -65695 -18634 50395 13684 -116832
15837a16832K91125m2802k93637N921j39058j09671j55909p4072M03281M79561
$$ -116832 174293 131491 -162146 -156225 -295283 -404954 -560863 -634935 -231654 247907
15827B47907K56162k5359K987j42471j61657L8647J87342K6363n05456k51549
$$ 247907 504069 478710 481697 339226 177569 216216 403558 429921 -75535 -327084
15817c27084n3049L7923L3999j1301r6367J70635J33297K95295K40992k03952
$$ -327084 -380133 -342210 -308211 -319512 -415879 -245244 -111947 183348 424340 220388
15807B20388j29997K35631L8574k09762J19094j78673p2457k10590r6859r8218
$$ 220388 90391 326022 364596 154834 273928 95255 22798 -187792 -284651 -382869
15797c82869O1655K97946K1350j23669j43229L22776J77531K39401l40012m5074
$$ -382869 -321214 -23268 -1918 -125587 -268816 53960 231491 470892 130880 85806
15787H5806R5108K9649m4262L3502R2655j09590l07532m56774q1001J69833J87276
$$ 85806 180914 210563 166301 199803 292458 182868 -124664 -581438 -662439 -492606 -305330
15776c05330n7760r6910j63952O406k09887Q2626L51554J01489J89870N1726r1821
$$ -305330 -363090 -460000 -623952 -617546 -827433 -744807 -393253 -291764 -101894 -50168 -141989
15765a41989K37835K18265J92343j95034j25226j34527Q590J59984j38685k80434
$$ -141989 95846 314111 506454 311420 186194 51667 60257 220241 81556 -198878
15755a98878j44090J10146K7052J15262J26687n8361j15086J1700R7874Q114K23189
$$ -198878 -342968 -232822 -205770 -90508 36179 -22182 -137268 -125568 -27694 -19580 203609
15744B03609J05777k24645l16547k7656l2379k43907J82033j9965l9042R4920
$$ 203609 309386 84741 -231806 -259462 -291841 -535748 -353715 -373680 -412722 -317802
15734c17802K0227k14869P8746K11695J76973o8449n4009m0895l9386L36773j18466
$$ -317802 -297575 -512444 -433698 -222003 -45030 -113479 -167488 -208383 -247769 89004 -29462
15723b9462m4101j8017r0436L29183K56049j44013l61632N5192Q7394J20476K64844
$$ -29462 -73563 -91580 -182016 147167 403216 259203 -102429 -47237 40157 160633 425477
15712D25477L6446m42483j59559J9755r3861n3092K56770M9920k9433L291l7888
$$ 425477 461923 19440 -140119 -120364 -214225 -267317 -10547 39373 9940 13231 -24657
15701b4657p6592p3053J23443J01691L4823o9140k35096K04090P3178r4710j71473
$$ -24657 -101249 -174302 -50859 50832 85655 16515 -218581 -14491 58687 -36023 -207496
15690b07496o9258j24739R775K16747K32743j55951k98666J23050r8418m9247
$$ -207496 -276754 -401493 -391718 -174971 57772 -98179 -396845 -273795 -372213 -421460
15680d21460K47740J27643j3384r7626Q0929j39318m331J92706k815j49773l89800
$$ -421460 -173720 -46077 -59461 -157087 -76158 -215476 -219807 -27101 -29916 -179689 -569489
15669e69489k05887J14628J65279K85021k26568k6065J50283J24338J04495k09373
$$ -569489 -775376 -660748 -495469 -210448 -437016 -463081 -312798 -188460 -83965 -293338
15659b93338k11215J65044K2117p9710k431J43150J71743L973J70900l48q9605
$$ -293338 -504553 -339509 -317392 -397102 -399533 -256383 -84640 -80667 90233 89885 280
15648B80J27742j68390k46584r3117K35737L84934k58942j99498P1898L93700
$$ 280 128022 -40368 -286952 -380069 -144332 240602 -18340 -217838 -145940 247760
15638B47760k8668l50497J83912O8218j27005K4821J49282K45286j53875l60239
$$ 247760 219092 -131405 52507 120725 -6280 18541 167823 413109 259234 -101005
15628a01005j48145L9033K5202K22146J16239q5777j20284k60193o1777k4411
$$ -101005 -249150 -210117 -184915 37231 153470 67693 -52591 -312784 -374561 -398972
15618c98972J40551j21867N2403j06124K47998J96274m3511L18871k1853m1421
$$ -398972 -258421 -380288 -327885 -434009 -186011 10263 -33248 285623 263770 222349
15608B22349j26910j18525j07291K2628K78858K21398k40646q2594j82036k0623
$$ 222349 95439 -23086 -130377 -107749 171109 392507 151861 69267 -112769 -133392
15598a33392P8464K41319J83145k75910r8799k1222k71318j46393L3183L29562
$$ -133392 -54928 186391 369536 93626 -5173 -26395 -297713 -444106 -410923 -81361
15588h1361J72469k02377j35914K67123J6554J19171N2828k15172k1521J26099
$$ -81361 91108 -111269 -247183 19940 36494 155665 208493 -6679 -28200 97899
15578I7899J06557j60683p3120J43222j36351O760J54478J31743l25229m54631
$$ 97899 204456 43773 -29347 113875 -22476 -15716 138762 270505 -54724 -509355
15568e09355k04188O6541M46172J85212n5324m1550j49929M0175j62820k48011
$$ -509355 -713543 -647002 -200830 -15618 -70942 -112492 -262421 -222246 -385066 -633077
15558f33077J46813J79841K57827J13702L7710m9644m6962K21041R3699j3821
$$ -633077 -486264 -306423 -48596 65106 102816 53172 6210 227251 320950 307129
15548C07129k04269j07574M8724q6827j88058j0355N4733k7862n00m3994J53671
$$ 307129 102860 -4714 44010 -42817 -230875 -241230 -186497 -214359 -214859 -258853 -105182
15537a05182L75252n2276q9547K6796L6257l09500k89383R8838L3336J38051O3554
$$ -105182 270070 217794 128247 155043 191300 -118200 -407583 -308745 -275409 -137358 -73804
15526g3804j8042K48420L4811j45801j19866O9442n5678j93375M7617L4325q4982
$$ -73804 -91846 156574 191385 45584 -74282 -4840 -60518 -253893 -206276 -171951 -256933
15515b56933o4164l8694R538L3477J72706J15999J94256J55296j04258r7964K7803
$$ -256933 -321097 -359791 -350253 -316776 -144070 -28071 166185 321481 217223 119259 147062
15504A47062n2687j78487k96126J64884J50675j91183N997J69456k7635r8149
$$ 147062 94375 -84112 -380238 -215354 -64679 -255862 -249865 -80409 -108044 -206193
15494b06193K0768J99356N2649j7682J36084J1423k77381m70076k3057K49318
$$ -206193 -185425 13931 66580 48898 184982 196405 -80976 -551052 -574109 -324791
15484c24791K36l00671J3837J64075J74483J81865k79372O7605J55033M0828j37753
$$ -324791 -324555 -625226 -611389 -447314 -272831 -90966 -370338 -302733 -147700 -106872 -244625
15473b44625q3749o471j62148M9040R8238P395p910j38051K87468m0179J7359
$$ -244625 -328374 -334845 -496993 -447953 -349715 -342320 -350230 -488281 -200813 -240992 -223633
15462b23633j06427l07289J1250K38590P1249L3611m9968Q1759j05133R065J69358
$$ -223633 -330060 -637349 -626099 -387509 -316260 -282649 -332617 -250858 -355991 -346926 -177568
15451a77568j2039j52667k9513J11791Q9832M8751M5131N1325J1201J4905l31183
$$ -177568 -189607 -342274 -371787 -259996 -170164 -121413 -76282 -24957 -13756 1149 -330034
15440c30034l740J34471J34594j4010m647n9231k76994J83545M4837J47802Q036
$$ -330034 -333774 -199303 -64709 -78719 -83366 -142597 -419591 -236046 -191209 -43407 -35371
15429c5371l0693j61338K1724J98701p402l24127k09789J41611L30787K8064K44386
$$ -35371 -66064 -227402 -205678 -6977 -14379 -338506 -548295 -406684 -75897 -47833 196553
15418A96553M8742J7280r559q312o5740o3169m3943l0534j51196J46712k68524
$$ 196553 245295 262575 253016 244704 178964 115795 71852 41318 -109878 36834 -231690
15407b31690j9716M3534O7295J04336j51081N5336o7477m6271j88766K3065J22565
$$ -231690 -251406 -207872 -140577 -36241 -187322 -131986 -199463 -245734 -434500 -411435 -288870
15396b88870j49884R873l0231P9042J1691n822J38127K17097R2873j221K41162
$$ -288870 -438754 -428881 -459112 -380070 -368379 -374201 -236074 -18977 73896 72675 313837
15385C13837j03293j9126k62361j06038j59937l6926J60410L1999N9208M1343
$$ 313837 210544 191418 -70943 -176981 -336918 -373844 -213434 -181435 -122227 -80884
15375h0884J23172m5779J97185k7462N3026k2305k85156j55035p0703K02373N5616
$$ -80884 42288 -3491 193694 166232 219258 196953 -88203 -243238 -313941 -111568 -55952
15364e5952O1545J07315r9240J62032J72978P684j97197k60105k4285r2735q3476
$$ -55952 5593 112908 13668 175700 348678 356362 159165 -100940 -125225 -217960 -301436
15353c01436J52307j24256j30144k1626J32690j70995J11073q5082q4721n4083
$$ -301436 -149129 -273385 -403529 -425155 -292465 -463460 -352387 -437469 -522190 -576273
15343e76273p7936J8209O4616p787k5125J78864n7188l01372J38112P4624r0246
$$ -576273 -654209 -636000 -571384 -579171 -604296 -425432 -482620 -783992 -645880 -571256 -661502
15332f61502J59985J78621J41589Q2264J40484j24255m9965j62927J47950K525
$$ -661502 -501517 -322896 -181307 -99043 41441 -82814 -132779 -295706 -147756 -145231
15322a45231n228J40694J12169K1207l51694n4749K27626J85508L4979O4790r7267
$$ -145231 -150459 -9765 102404 123611 -228083 -282832 -55206 130302 165281 230071 132804
15311A32804j29695k10914P1140j23170j3862K8229k4711j05218k1633K43047
$$ 132804 3109 -207805 -136665 -259835 -273697 -245468 -270179 -375397 -397030 -153983
15301a53983Q7674O6673k58263l36833k6615R8980L85170J22344J76288K00611
$$ -153983 -66309 364 -257899 -594732 -621347 -522367 -137197 -14853 161435 362046
15291C62046p1703M8189j1679p2889J3484l35614k65742j9063n6950r4566J44437
$$ 362046 290343 338532 326853 253964 267448 -68166 -333908 -352971 -409921 -504487 -360050
15280c60050K25419j06750K01705J75154j25221l01449R0083O2821J19293J10954
$$ -360050 -134631 -241381 -39676 135478 10257 -291192 -201109 -138288 -18995 91959
15270I1959Q2161q5621j18428j7923m7443r507O6645J55239J03613q0074j58479
$$ 91959 174120 88499 -29929 -47852 -95295 -104802 -38157 117082 220695 140621 -17858
15259a7858r624o4932n2521n4276j79844n6386K4062L43025P0524J6059r3969
$$ -17858 -27482 -92414 -144935 -199211 -379055 -435441 -411379 -68354 2170 18229 -75740
15248g5740l38261J05510O0673K45061J08685j52973p6595l0971K26293M57009
$$ -75740 -414001 -308491 -247818 -2757 105928 -47045 -123640 -154611 71682 528691
15238E28691j13428m49757K40111J83417K526j62534j75135J02601n9989l61652
$$ 528691 415263 -34494 205617 389034 391560 229026 53891 156492 96503 -265149
15228b65149k48989J18724k768p0685J04884J40522J69347R2110n4135n3261J1741
$$ -265149 -514138 -395414 -398182 -468867 -363983 -223461 -54114 37996 -16139 -69400 -57659
15217e7659k33873j12390L8085k9037K02996K07380l8980R2594L4170m05817l67539
$$ -57659 -291532 -403922 -365837 -394874 -191878 15502 -23478 69116 103286 -302531 -670070
15206f70070o2736L97670j28601N1520J03912M2924L50258K37936L07375K45817
$$ -670070 -732806 -335136 -463737 -412217 -308305 -265381 84877 322813 630188 876005
15196H76005k01493k23157j60719k71562j56886j56761N5479j36508l6148J12718
$$ 876005 674512 451355 290636 19074 -137812 -294573 -239094 -375602 -411750 -299032
15186b99032n3372K09926K33276l06412k55593j8865O5067R6460K13752P7105
$$ -299032 -352404 -142478 90798 -215614 -471207 -490072 -425005 -328545 -114793 -37688
15176c7688l7111r8190k0449J36839n6891n4642O2871K42432o6148k33758K17885
$$ -37688 -74799 -172989 -193438 -56599 -113490 -168132 -105261 137171 71023 -162735 55150
15165E5150M5629l25353k45538J76972J42497j6211R1802J85544J01674o2401
$$ 55150 100779 -224574 -470112 -293140 -150643 -166854 -75052 110492 212166 149765
15155A49765k3116K06393k2239N0470J8901m06857r3300J78690J73036l2484q3767
$$ 149765 126649 333042 310803 361273 380174 -26683 -119983 58707 231743 199259 115492
15144A15492k41529j29678O6634m5834k22865p9966P1949L62504J01732o2529
$$ 115492 -126037 -255715 -189081 -234915 -457780 -537746 -465797 -103293 -1561 -64090
15134f4090k5328p1922j43387k93509j14595K40499M27814P7748j7632j20326
$$ -64090 -89418 -161340 -304727 -598236 -712831 -472332 -44518 33230 15598 -104728
15124a04728j60234k35767j59860K92849K1351l2334K2066k3945J92692L56625
$$ -104728 -264962 -500729 -660589 -367740 -346389 -378723 -356657 -380602 -187910 168715
15114A68715J03281l16202j09070m3701j86299k06268J40718J69027j72083J95271
$$ 168715 271996 -44206 -153276 -196977 -383276 -589544 -448826 -279799 -451882 -256611
15104b56611K71485p299k50300j27058Q3574l7103Q4013K27021R311J41858P2682
$$ -256611 14874 7575 -242725 -369783 -286209 -323312 -239299 -12278 -2967 138891 211573
15093B11573L0706J82096L25765o2262l64403k98191j64140J49011j18873L6306
$$ 211573 242279 424375 750140 687878 323475 25284 -138856 10155 -108718 -72412
15083g2412j84286k35890K7971O5452M8653K3173J48430N7328Q5899o0106j39420
$$ -72412 -256698 -492588 -464617 -399165 -350512 -327339 -178909 -121581 -35682 -95788 -235208
15072b35208p3246j84048P1419M9807k108J41822r9451l7886k1745K34712K44485
$$ -235208 -308454 -492502 -421083 -371276 -373384 -231562 -331013 -368899 -390644 -155932 88553
15061H8553j06006r364r9902k3405j74550j61090J6311K5513J38757M00283n668
$$ 88553 -17453 -26817 -126719 -150124 -324674 -485764 -469453 -443940 -305183 95100 89432
15050H9432k51226o9567M9538M2331n2189j98592Q8916J2200j63286Q3373q3937
$$ 89432 -161794 -231361 -181823 -139492 -191681 -390273 -301357 -289157 -452443 -369070 -453007
15039d53007K04950J43656k0860J34503j27259k01481L6836J02152R0262k11493
$$ -453007 -248057 -104401 -125261 9242 -118017 -319498 -282662 -180510 -90248 -301741
15029c01741m0727K72593o8067M0014K9195J02489K64772J11137j55972k39703
$$ -301741 -342468 -69875 -137942 -97928 -68733 33756 298528 409665 253693 13990
15019A3990K12075J12130m5104q0147k90233k43869L2180J91423J83339k10905
$$ 13990 226065 338195 293091 212944 -77289 -321158 -288978 -97555 85784 -125121
15009a25121q9765K05083Q9697Q846K5506l68425q6374K44229K0963m816p6276
$$ -125121 -214886 -9803 79894 88740 114246 -254179 -340553 -96324 -75361 -80177 -156453
14998a56453j45855k90694K65712P4260l76938j81656K40931j3939J27101K58329
$$ -156453 -302308 -593002 -327290 -253030 -629968 -811624 -570693 -584632 -457531 -199202
14988a99202k39445k04954K66940L65556M4147j08596r7641L0220P9613l3097
$$ -199202 -438647 -643601 -376661 -11105 33042 -75554 -173195 -142975 -63362 -96459
14978i6459j08779k7041r1349k0725j25420l9786K46055K43215q2679k12576k91247
$$ -96459 -205238 -232279 -323628 -344353 -469773 -509559 -263504 -20289 -102968 -315544 -606791
14967f06791J33743K70448Q7097m5172L0366j62135q097L8240o3941Q1567J85179
$$ -606791 -473048 -202600 -115503 -160675 -130309 -292444 -300541 -262301 -326242 -244675 -59496
14956e9496M9162m10681n4909M12381j69125R659M802j67570K5817J21309J57290
$$ -59496 -10334 -421015 -475924 -63543 -232668 -223009 -218207 -385777 -359960 -238651 -81361
14945h1361Q7654P8870K11916q3312j94482l27155k69662P6361q5801j25343k8426
$$ -81361 6293 85163 297079 213767 19285 -307870 -577532 -501171 -586972 -712315 -740741
14934g40741L60410K16791j27167l0301J53918N1374r7635L4596J25996J2096
$$ -740741 -380331 -163540 -290707 -321008 -167090 -115716 -213351 -178755 -52759 -40663
14924d0663K4062o5688k09059K74594J94528k46866O9224J34882k50303r9198
$$ -40663 -16601 -82289 -291348 -16754 177774 -69092 132 135014 -115289 -214487
14914b14487n0602K99918l1719j80992j1049P7485j17940k44860J67329J8520
$$ -214487 -265089 34829 3110 -177882 -188931 -111446 -229386 -474246 -306917 -288397
14904b88397J75364K22501K9693l43199K2025N0074J20499Q998j53239J41757
$$ -288397 -113033 109468 139161 -204038 -182013 -131939 -11440 -2442 -155681 -13924
14894a3924K59458K64479J35168j36637l12547j27613j30085L6301j75398J88101
$$ -13924 245534 510013 645181 508544 195997 68384 -61701 -25400 -200798 -12697
14884a2697n6056r8732K7369l05494J12644M06465R0880M5443j05727l8426j05798
$$ -12697 -68753 -167485 -140116 -445610 -332966 73499 164379 209822 104095 65669 -40129
14873d0129k05571J11887k0839j07761k5740p300l6033j11200j66080J63423J37841
$$ -40129 -245700 -133813 -154652 -262413 -288153 -295453 -331486 -442686 -608766 -445343 -307502
14862c07502j51424j01845P2537J99241M29306J5201j65904k62555n2054Q4321
$$ -307502 -458926 -560771 -488234 -288993 140313 155514 -10390 -272945 -324999 -240678
14852b40678Q8727n4985N0413N5385p7997K15544K5547j83576m6463j95447j6205
$$ -240678 -151951 -206936 -156523 -101138 -179135 36409 61956 -121620 -168083 -363530 -379735
14841c79735N4459l22039j16493K30599J13404J8915K16749J39098o9642m5351
$$ -379735 -325276 -647315 -763808 -533209 -419805 -400890 -184141 -45043 -114685 -160036
14831a60036J39454J11790P4434K003K5197l65773q543O6593k79287l20185J01086
$$ -160036 -20582 91208 165642 167645 192842 -172931 -181474 -114881 -394168 -714353 -613267
14820f13267L13676J84249R0980J05223N2953k0719j61959n6178j4251q9770j33510
$$ -613267 -299591 -115342 -24362 80861 133814 113095 -48864 -105042 -119293 -209063 -342573
14809c42573k06747K75406L81568P9645O6945p4426r0212k82012k82769p3028
$$ -342573 -549320 -273914 107654 187299 254244 179818 89606 -192406 -475175 -548203
14799e48203K28997M3800l33595j13805J24618K181r408j40169Q0755k115j89035
$$ -548203 -319206 -275406 -609001 -722806 -598188 -596007 -605415 -745584 -664829 -666944 -855979
14788h55979L12208L39465P6340j9821K42471J14602l83832l1793K11809J49999
$$ -855979 -543771 -204306 -127966 -147787 94684 209286 -174546 -206339 5470 155469
14778A55469k53212j77953j65010k7752M6209K85945J75668l37006k79679j16334
$$ 155469 -97743 -275696 -440706 -468458 -422249 -136304 39364 -297642 -577321 -693655
14768f93655L18357P2879q5938q5733R1061J57851J29739J46462k0487L78007
$$ -693655 -375298 -302419 -388357 -474090 -383029 -225178 -95439 51023 30536 408543
14758D08543j77370j68775L0291o5012j99629n7829j49246J40906J03556J24618
$$ 408543 231173 62398 92689 27677 -171952 -229781 -379027 -238121 -134565 -9947
14748i947j95988p7152j22601q6461m7681J99144J80159R6914j8184P413j29565
$$ -9947 -205935 -283087 -405688 -492149 -539830 -340686 -160527 -63613 -81797 -74384 -203949
14737b03949j65002r8327J2415K74849o6216O395o7959O9045R2221K6299J2321
$$ -203949 -368951 -467278 -454863 -180014 -246230 -239835 -307794 -238749 -146528 -120229 -107908
14726a07908j11561o1593k14660k92444k7443J8070j34719K95481J39232R569
$$ -107908 -219469 -281062 -495722 -788166 -815609 -797539 -932258 -636777 -497545 -487976
14716d87976R5153L23440o8905l3514K52392q338q3494J23979l5225k33451j00973
$$ -487976 -392823 -69383 -138288 -171802 80590 72252 -11242 112737 77512 -155939 -256912
14705b56912P7460l1888J58924P6406k11152q3570n4540L1678n1950M023J59558
$$ -256912 -179452 -211340 -52416 23990 -187162 -270732 -325272 -293594 -345544 -341521 -181963
14694a81963J13867j31102k37390O7352l07451L68741M12803j83470K7478J58630
$$ -181963 -68096 -199198 -436588 -369236 -676687 -307946 104857 -78613 -51135 107495
14684A07495j52823k48534M6730j8496j10562k34638J40736J50211l2891L8592
$$ 107495 -45328 -293862 -247132 -265628 -376190 -610828 -470092 -319881 -352772 -314180
14674c14180L84r5123K61193R5535O8860J95309j06346k10232r9069R6946j29884
$$ -314180 -313796 -408919 -147726 -52191 16669 211978 105632 -104600 -203669 -106723 -236607
14663b36607p819O5593K25897K4328r2351j0659j08098k0643J34247q9334k4651
$$ -236607 -244426 -178833 47064 71392 -20959 -31618 -139716 -160359 -26112 -115446 -140097
14652a40097K20205p0224j3067M8025J66606O7582j44567r9600J8837R9681k60990
$$ -140097 80108 9884 -3183 44842 211448 279030 134463 34863 53700 153381 -107609
14641a07609l2813o0321J25842K28412M2555K67743m3429l60704J9241K9182j95961
$$ -107609 -140422 -200743 -74901 153511 196066 463809 420380 59676 78917 108099 -87862
14630h7862l3498P1755J19853p6528j32333K26171Q9984K17055Q4051j83663j66964
$$ -87862 -121360 -49605 70248 -6280 -138613 87558 177542 394597 478648 294985 128021
14619A28021k18579M2155p8671n5449P7869m1741l0785O5125m3070J32458q0076
$$ 128021 -90558 -48403 -127074 -182523 -104654 -146395 -177180 -112055 -155125 -22667 -102743
14608a02743m1539k42318r3067k3579p1513J75922j7103j69121K72257L93022
$$ -102743 -144282 -386600 -479667 -503246 -574759 -398837 -415940 -585061 -312804 80218
14598H0218J44580J2503j59576Q9527J78144r8256m3059m6343j20565L0072K71700
$$ 80218 224798 237301 77725 167252 345396 247140 204081 157738 37173 67245 338945
14587C38945J19437p9591k01704k37859j40333K0233j66006n6367L07808R4786
$$ 338945 458382 378791 177087 -60772 -201105 -180872 -346878 -403245 -95437 -651
14577f51p983J41851L12625j19406j64640Q9913j60574m6313O9870k04342Q0608
$$ -651 -8634 133217 445842 326436 161796 251709 91135 44822 114692 -89650 -9042
14566i042J89336m6190p006k47553j32167K50591K05823R7557j51625j84891K34489
$$ -9042 180294 134104 127098 -120455 -252622 -2031 203792 301349 149724 -35167 199322
14555A99322K73765j95315l65894k73347L22809K31310l32314l24567n580P14
$$ 199322 473087 277772 -88122 -361469 -38660 192650 -139664 -464231 -469811 -469097
14545d69097K92703K25959Q6379p002m7497J6087N8441k5743l36007j43438m8918
$$ -469097 -176394 49565 135944 128942 81445 97532 155973 130230 -205777 -349215 -398133
14534c98133J19791J57274J47784k7342p9412j82174Q6179j24724n7560n3634
$$ -398133 -278342 -121068 26716 -626 -80038 -262212 -176033 -300757 -358317 -411951
14524d11951P8078J48651J31872k4546M5643M2527L9596n4997L8735M8939k29998
$$ -411951 -333873 -185222 -53350 -77896 -32253 10274 49870 -5127 33608 82547 -147451
14513a47451J64845p9294l01651n9466j05290p6765K70270J63883J08006L7550
$$ -147451 17394 -61900 -363551 -423017 -528307 -605072 -334802 -170919 -62913 -25363
14503b5363Q5304J19372K33897N9903R778j82556k12886l6522O3201J39479O6220
$$ -25363 59941 179313 413210 473113 482891 300335 87449 50927 114128 253607 319827
14492C19827j86952j27254N5901j5728P5880N195p7739M1848J43762o1556n9722
$$ 319827 132875 5621 61522 45794 121674 126869 49130 90978 234740 173184 113462
14481A13462m01793l8537K42992M06473j69513k01602J68056J8938L3609j14910
$$ 113462 -288331 -326868 -83876 322597 153084 -48518 119538 138476 172085 57175
14471E7175j37967P3049m334j27928o0178l68344K43699K05102R8887l47660r6080
$$ 57175 -80792 -7743 -12077 -140005 -200183 -568527 -324828 -119726 -20839 -368499 -464579
14460d64579L06318K76457l04688j53420R3607o9726o7137p2825J57584J64434
$$ -464579 -158261 118196 -186492 -339912 -246305 -316031 -383168 -455993 -298409 -133975
14450a33975j83570r549K02068P9170j13065J60261k43580m5236J09388n9627
$$ -133975 -317545 -327094 -125026 -45856 -158921 1340 -242240 -287476 -178088 -237715
14440b37715J48179L12197K0482k69487k31837p3365k23030J48000J51465J01499
$$ -237715 -89536 222661 243143 -26344 -258181 -331546 -554576 -406576 -255111 -153612
14430a53612j65955n8123L7800J47711K7721O7693l29511j35267M31778L48127
$$ -153612 -319567 -377690 -339890 -192179 -164458 -96765 -426276 -561543 -129765 218362
14420B18362P3867l14144k48711r0535n982O744M26689K04497m1248k6400K06007
$$ 218362 292229 -21915 -270626 -361161 -367143 -360399 66290 270787 229539 203139 409146
14409D09146J57910j21778o03409k49567J2613J88635J64010j30261J97413Q6832
$$ 409146 567056 445278 -158131 -407698 -395085 -206450 -42440 -172701 24712 111544
14399A11544p7876j27183j90089l0062O1437N8828J10684J17648q3945n2982J55924
$$ 111544 33668 -93515 -283604 -313666 -252229 -193401 -82717 34931 -49014 -101996 53928
14388E3928n2074j06925j77654R5352j44230p0458l2269R7506K28144Q0626L70841
$$ 53928 1854 -105071 -282725 -187373 -331603 -402061 -434330 -336824 -108680 -28054 342787
14377C42787O9667Q148m71717j92054L1929K40613j12015o1067j45264j58619
$$ 342787 412454 420602 -51115 -243169 -211240 29373 -82642 -143709 -288973 -447592
14367d47592J7912O3527J25670K68049j70475r6100J50549L00694K27873j52683
$$ -447592 -429680 -366153 -240483 27566 -142909 -239009 -88460 212234 440107 287424
14357B87424k67317O3103j20186k15580j63892n8540L9521L51874l1387j41477
$$ 287424 20107 83210 -36976 -252556 -416448 -474988 -435467 -83593 -114980 -256457
14347b56457j30202M2226J43120J91868m9670l7243j38887m6601K70051L07521
$$ -256457 -386659 -344433 -201313 -9445 -59115 -96358 -235245 -281846 -11795 295726
14337B95726n0832P1679l37972k10170j20301o0269j0297O2454p4114M5237N15311
$$ 295726 244894 316573 -21399 -231569 -351870 -412139 -422436 -359982 -434096 -388859 126452
14326A26452L0642j61216K0565J43376O0889r0547q919J94022J23183m30082j03780
$$ 126452 157094 -4122 16443 159819 220708 130161 121242 315264 438447 8365 -95415
14315i5415K29107K7882P8065j75748k94107k53718j27512K2870J14501K99649
$$ -95415 133692 161574 239639 63891 -230216 -483934 -611446 -588576 -474075 -174426
14305a74426j32686Q8105K04770p4225r7771L88973K30473q9173j23310j23514
$$ -174426 -307112 -219007 -14237 -88462 -186233 202740 433213 344040 220730 97216
14295I7216j04851m4394K32250J7920k46232k2146l7486k06718J58012K40856
$$ 97216 -7635 -52029 180221 198141 -48091 -70237 -107723 -314441 -156429 84427
14285H4427J6227j99901j32392J6960L40672j32254J54727m9808k65552q8576
$$ 84427 100654 -99247 -231639 -214679 125993 -6261 148466 98658 -166894 -255470
14275b55470K00583l8994j49180J48082J31517o1240k20093N9665J9012J07307
$$ -255470 -54887 -93881 -243061 -94979 36538 -24702 -244795 -185130 -166118 -58811
14265e8811O5012j54200M3576J64016O2160R4541n0503j60472k71926j63714p4903
$$ -58811 6201 -147999 -104423 59593 121753 216294 165791 5319 -266607 -430321 -505224
14254e05224K86613K37035L1290j02344O8234j16675j43212q1575j4041j46231
$$ -505224 -218611 18424 49714 -52630 15604 -101071 -244283 -325858 -339899 -486130
14244d86130J02887J75504L48763R210j80141j81024j14018j12577j8760n9887
$$ -486130 -383243 -207739 141024 150234 -29907 -210931 -324949 -437526 -456286 -516173
14234e16173Q8965R5050K06106J43311k74457M3928O5099j75539J74266l069l0555
$$ -516173 -427208 -332158 -126052 17259 -257198 -213270 -148171 -323710 -149444 -152513 -183068
14223a83068k1826r102q7225j49854K96438J98930j20230n9175J42718R6568K02689
$$ -183068 -204894 -213996 -301221 -451075 -154637 44293 -75937 -135112 7606 104174 306863
14212C06863j7579m54355j19705o4261j43839n9518J71345K22296J86857j93025
$$ 306863 289284 -165071 -284776 -349037 -492876 -552394 -381049 -158753 28104 -164921
14202a64921O2580K2262j88050k65049J42275M24691m5256o6628J22801k9773
$$ -164921 -102341 -80079 -268129 -533178 -390903 33788 -11468 -78096 44705 14932
14192A4932n8466n5364R2308N9904m8365J3421k45066o441j21580o6691O9940
$$ 14932 -43534 -98898 -6590 53314 4949 18370 -226696 -233137 -354717 -421408 -351468
14181c51468K29407J19299p5034J50629q3182l27580j17103j04340Q1887J30140
$$ -351468 -122061 -2762 -77796 72833 -10349 -337929 -455032 -559372 -477485 -347345
14171c47345q4750L01218K98106L3556q2729j36234j75806J49794J68998K90602
$$ -347345 -432095 -130877 167229 200785 118056 -18178 -193984 -44190 124808 415410
14161D15410n4982j67929k09046j51283m8130o932R7324J79495O1209q0271O1142
$$ 415410 360428 192499 -16547 -167830 -215960 -222892 -125568 53927 115136 34865 96007
14150I6007K278k96214k74658N8099L6865J00001k35329j00958K94043K60782
$$ 96007 98285 -197929 -472587 -414488 -377623 -277622 -512951 -613909 -319866 -59084
14140e9084j4954k07295j57339k65677Q0325L27088L84659J05284k20091L1117
$$ -59084 -74038 -281333 -438672 -704349 -624024 -296936 87723 193007 -27084 4033
14130D033K14448J37372k5702j55371q7262k07741O3373m045J16041r2541K8045
$$ 4033 218481 355853 330151 174780 87518 -120223 -56850 -60895 55146 -37395 -9350
14119i350K68619J17496k16057k93995k33436J03040n8912n9201J41422R0435
$$ -9350 259269 376765 160708 -133287 -366723 -263683 -322595 -381796 -240374 -149939
14109a49939q6579J16402K0197j06061P0696N4159P0371k02066o7514J48914K44598
$$ -149939 -236518 -120116 -99919 -205980 -135284 -81125 -10754 -212820 -280334 -131420 113178
14098A13178P7755k2059k3109M7250p9180k60228J28982J91093l7208O5678r0434
$$ 113178 190933 168874 145765 193015 113835 -146393 -17411 173682 136474 202152 111718
14087A11718n6661q7878J00939q5238j53232j07956K8528J11297K29354J19994
$$ 111718 55057 -32821 68118 -17120 -170352 -278308 -249780 -138483 90871 210865
14077B10865k45210q8858j31356p5586j2146K31965J13698J65538J97804p4754
$$ 210865 -34345 -123203 -254559 -330145 -342291 -110326 3372 168910 366714 291960
14067B91960k96068K0515j14949L7651K29075j9883j16244r8876n9072n6525K9047
$$ 291960 -4108 16407 -98542 -60891 168184 148301 32057 -66819 -125891 -182416 -153369
14056a53369j78917q4778K94417Q4490L32810l996j97310L8606J30937J52838
$$ -153369 -332286 -417064 -122647 -38157 294653 290657 93347 131953 262890 415728
14046D15728n3232j52197n396K2229j89658j22891n7524k47022r630j13682j50147
$$ 415728 362496 210299 204903 227132 37474 -85417 -142941 -389963 -399593 -513275 -663422
14035f63422N9109R0688r8403J43448K92588N8618j21480p4144j54095N4390J10568
$$ -663422 -604313 -513625 -612028 -468580 -175992 -117374 -238854 -312998 -467093 -412703 -302135
14024c02135J17909J35710k9550j0089j15511r3720R458j61889j04167J75235
$$ -302135 -184226 -48516 -78066 -88155 -203666 -297386 -287928 -449817 -553984 -378749
14014c78749n1938J00508K45505n5706k78403j00158K13866J63387J0078j33776
$$ -378749 -430687 -330179 -84674 -140380 -418783 -518941 -305075 -141688 -131610 -265386
14004b65386q6132j00341j0820M9703L58102j18054k90409k8123O9397o7917P6534
$$ -265386 -351518 -451859 -462679 -412976 -54874 -172928 -463337 -491460 -422063 -489980 -413446
13993d13446J00523J40738O4005L4290J25375L3474k44174k75131m2323K75348
$$ -413446 -312923 -172185 -108180 -73890 51485 84959 -159215 -434346 -476669 -201321
13983b01321K60208n0960K1923M2103K8483J09353J6038l02517K0013M4738n7760
$$ -201321 58887 7927 29850 71953 100436 209789 225827 -76690 -56677 -11939 -69699
13972f9699R3748j36610O4262j94936k29388P5825O8236j78365K30326K53134
$$ -69699 24049 -112561 -48299 -243235 -472623 -396798 -328562 -506927 -276601 -23467
13962b3467J09930L80516P3730j56248j43929O1803K9531l05370L6782J27395
$$ -23467 86463 466979 540709 384461 240532 302335 331866 26496 63278 190673
13952A90673j89214m7993o4422o0529k4188r1280j46208k91557O484L55862K69879
$$ 190673 1459 -46534 -110956 -171485 -195673 -286953 -433161 -724718 -718234 -362372 -92493
13941i2493l107k01849k17215j81396L81646L510J94355n5995q2800o1295L01370
$$ -92493 -95600 -297449 -514664 -696060 -314414 -310904 -116549 -172544 -255344 -316639 -15269
13930a5269J84759j13589q6443K3653j76588q2344J22541J85982j87k10402q5121
$$ -15269 169490 55901 -30542 -6889 -183477 -265821 -143280 42702 42515 -167887 -253008
13919b53008J6965K33565j43196k19691M83741J59901j71035m36114k54763J20716
$$ -253008 -236043 -2478 -145674 -365365 118376 278277 107242 -328872 -583635 -462919
13909d62919K68533J58312n9852J6498j35239N719p8470J1402O0249Q9344l7486
$$ -462919 -194386 -36074 -95926 -79428 -214667 -208948 -287418 -276016 -215767 -126423 -163909
13898a63909j63017J11249K19151k09484k67662O1000J56481n126J87402K30554
$$ -163909 -326926 -215677 3474 -206010 -473672 -412672 -256191 -261317 -73915 156639
13888A56639K9233r6377k17697k5150J4569k8597O1875M8547k70518N8195M8638
$$ 156639 185872 89495 -128202 -153352 -138783 -167380 -105505 -56958 -327476 -269281 -220643
13877b20643J41515K02676m6171j08122J22615j64309l05050L0949J55774k85102
$$ -220643 -79128 123548 77377 -30745 91870 -72439 -377489 -346540 -190766 -475868
13867d75868J76880J66362J02912k2957J7630j01665o7248J71255J00022j0082
$$ -475868 -298988 -132626 -29714 -52671 -35041 -136706 -203954 -32699 67323 57241
13857E7241k33275J46869M27180K4754k98440l00043n219r1245j33793n9965J05959
$$ 57241 -176034 -29165 398015 422769 124329 -175714 -180933 -272178 -405971 -465936 -359977
13846c59977J65088K06120N7324q8825k499J8687p3156P3686k40387m3467R3178
$$ -359977 -194889 11231 68555 -20270 -22769 -4082 -77238 -3552 -243939 -287406 -194228
13835a94228n3559k60513M7447N8469M3428J0993J58731R9908J4600j05389l31681
$$ -194228 -247787 -508300 -460853 -402384 -358956 -347963 -189232 -89324 -74724 -180113 -511794
13824e11794j45196K50960J51532j2867m759k6152j16112P1281j29224J47850
$$ -511794 -656990 -406030 -254498 -267365 -272124 -298276 -414388 -343107 -472331 -324481
13814c24481L00014N4260j83894Q4314J6745k18316r9120O4654K37207r7249k12280
$$ -324481 -24467 29793 -154101 -69787 -53042 -271358 -370478 -305824 -68617 -165866 -378146
13803c78146L2837L94905J81790j34977j10791n8870k34728J4755L08770J37335
$$ -378146 -345309 49596 231386 96409 -14382 -73252 -307980 -293225 15545 152880
13793A52880j13111l7461m3676Q6662j14517m0029j76520r5782K03542J49326
$$ 152880 39769 2308 -41368 45294 -69223 -109252 -285772 -381554 -178012 -28686
13783b8686j36131k62687j19252J58706N708p939j5318J74904J77581J07024p0568
$$ -28686 -164817 -427504 -546756 -388050 -382342 -390281 -405599 -230695 -53114 53910 -16658
13772a6658m11571k24405O9157K07373J17872j60372O2364N9143J67029j13562
$$ -16658 -428229 -652634 -583477 -376104 -258232 -418604 -356240 -297097 -130068 -243630
13762b43630j4506K92209P640k22519o2651L1141r5899j10016n7557M25510J47691
$$ -243630 -258136 34073 41713 -180806 -243457 -212316 -308215 -418231 -475788 -50278 97413
13751I7413K0002k04995k8888K16974L1687r790n6462j99204q1373N1306L04908
$$ 97413 117415 -87580 -116468 100506 132193 122403 65941 -133263 -214636 -163330 141578
13740A41578n1918k3802j34899k02015J19382j28347o668L59558K00711p0367
$$ 141578 89660 65858 -69041 -271056 -151674 -280021 -286689 72869 273580 203213
13730B03213k79475j36589j21963p6321M5866J90545J94824J98523r8228j59274
$$ 203213 -76262 -212851 -334814 -411135 -365269 -174724 20100 218623 120395 -38879
13720c8879l61147J82118J06263R3295p2821m2345n7623j4674k32867Q9328K35639
$$ -38879 -400026 -217908 -111645 -18350 -91171 -133516 -191139 -205813 -438680 -349352 -113713
13709a13713J56574J32976k05591j05567p2836q4234j01413J12647j47526k60528
$$ -113713 42861 175837 -29754 -135321 -208157 -292391 -393804 -281157 -428683 -689211
13699f89211J88775L79321J79510K23249k3007k56157j07887O0033p5566J35082
$$ -689211 -500436 -121115 58395 281644 258637 2480 -105407 -45374 -120940 14142
13689A4142m997p0624K27137l08437j82581J44558j09543j54191o8352k6421K87206
$$ 14142 9145 -61479 165658 -142779 -325360 -180802 -290345 -444536 -512888 -539309 -252103
13678b52103n9233j29859P9015K72281O8312q5145K47225L77829k60542j39427
$$ -252103 -311336 -441195 -362180 -89899 -21587 -106732 140493 518322 257780 118353
13668A18353j77847m7455k30447J11557J32452k81855j66947K47430J06440R982
$$ 118353 -59494 -106949 -337396 -225839 -93387 -375242 -542189 -294759 -188319 -178337
13658a78337m0606j11223K19318K0944J01121J30281j4477j18724j28945J94148
$$ -178337 -218943 -330166 -110848 -89904 11217 141498 127021 8297 -120648 73500
13648G3500K88089L560m1122j21549n1228J9068K2963M5177m137J1190k19201
$$ 73500 361589 365149 324027 202478 151250 170318 193281 238458 234321 245511 26310
13637B6310j39288l271K35836Q0280J63699k04557j0480J75689L95834k34532
$$ 26310 -112978 -116249 119587 199867 363566 159009 148529 324218 720052 485520
13627D85520j55456k62983j55605p3238Q7768K15172J33703j96769r3017K4550
$$ 485520 330064 67081 -88524 -161762 -73994 141178 274881 78112 -14905 9645
13617I645n0136j40522o3585J58267O4647J40918J40496j32463k07510r5658M3268
$$ 9645 -40491 -181013 -244598 -86331 -21684 119234 259730 127267 -80243 -175901 -132633
13606a32633K75298P5242k10419J01764K22273K73023p0133n69874l21661M0280
$$ -132633 142665 217907 7488 109252 331525 604548 534415 -35459 -357120 -316840
13596c16840J33959k2678J79579O0471j63437n815L70323j32130p6265M0523J08927
$$ -316840 -182881 -205559 -25980 34491 -128946 -134761 235562 103432 27167 67690 176617
13585A76617L98271L52304l88070k02641k3887J59295J08653k00745j43125L3745
$$ 176617 574888 927192 539122 336481 312594 471889 580542 379797 236672 270417
13575B70417J60995K61046J46509Q5554J92736j10654j6372k67263l41760K45820
$$ 270417 431412 692458 838967 924521 1117257 1006603 990231 722968 381208 627028
13565F27028J0176k21839J37826K32798k6668k50078J58764M8814k98924K2952
$$ 627028 637204 415365 553191 785989 759321 509243 668007 716821 417897 440849
13555D40849R1686J73703j19593R4439j3688J13365L02956p5299K8927K17547
$$ 440849 532535 706238 586645 681084 667396 780761 1083717 1008418 1037345 1254892
13545A254892o2509l1464J75646p4868o3446j0185K5273M2357J71451q8722j63691
$$ 1254892 1192383 1160919 1336565 1261697 1198251 1188066 1213339 1255696 1427147 1338425 1174734
13534A174734L8852q7745N5720K88483n7603l23123j27190K9694j33279j52781
$$ 1174734 1213586 1125841 1181561 1470044 1412441 1089318 962128 991822 858543 705762
13524G05762J73623J15156R0824j30508j71658j58882m8513j57966R4486L00884
$$ 705762 879385 994541 1085365 954857 783199 624317 575804 417838 512324 813208
13514H13208J33906J24988p8664k86874J68747L4668j50712o249K3310O2174J8779
$$ 813208 947114 1072102 993438 706564 875311 909979 759267 753018 776328 838502 857281
13503H57281m6162L3402j08070K5214P2640k51760k27561j782j09729m1891J15439
$$ 857281 811119 844521 736451 761665 834305 582545 354984 353202 243473 201582 317021
13492C17021R490L01144R6410p0670J42427L505k53290M6253n307j15979j95478
$$ 317021 326511 627655 724065 653395 795822 799327 546037 592290 586983 471004 275526
13481B75526k80427k25269l7233J49857J93417n8929k01973O9593m026J97091
$$ 275526 -4901 -230170 -267403 -117546 75871 16942 -185031 -115438 -119464 77627
13471G7627p6738o717m3439m08053K39288L69114J51902j46931o0770R7979L8255
$$ 77627 889 -5828 -49267 -457320 -218032 151082 302984 156053 95283 193262 231517
13460B31517k37036j17018L99703p3342j23023L1909j7049k79942j88201J73006
$$ 231517 -5519 -122537 277166 203824 80801 112710 95661 -184281 -372482 -199476
13450a99476j9351q217l9531m5962J08905J40103K88390L20900j78993k70059
$$ -199476 -218827 -227044 -266575 -312537 -203632 -63529 224861 545761 366768 96709
13440I6709k311J94453l3890J4881P3137j67745j85199r3631K06357n7969k83908
$$ 96709 94398 288851 254961 269842 342979 175234 -9965 -103596 102761 44792 -239116
13429b39116j07171K4847o059J71215l2542l903j28715r5768R045J25931J16692
$$ -239116 -346287 -321440 -327499 -156284 -188826 -192729 -321444 -417212 -408167 -282236 -165544
13418a65544P5436k66878O6866J19945J58097l3201j69772R1571M5862k89642
$$ -165544 -90108 -356986 -290120 -170175 -12078 -45279 -215051 -123480 -77618 -367260
13408c67260j22775Q9864k08552K7745K87110J38026J18641J90343l11297k8579
$$ -367260 -490035 -400171 -608723 -580978 -293868 -155842 -37201 153142 -158155 -186734
13398a86734J36962M0025j20914j15018j36800K63856K36576k87724Q2289J01365
$$ -186734 -49772 -9747 -130661 -245679 -382479 -118623 117953 -169771 -87482 13883
13388A3883K12447K72403N0854k23915m4753j55443j87211p3738L4760K43412
$$ 13883 226330 498733 549587 325672 280919 125476 -61735 -135473 -100713 142699
13378A42699L1186j16287j2505O2980J3876J20525o6045k68754l13077j96111
$$ 142699 173885 57598 45093 108073 121949 242474 176429 -92325 -405402 -601513
13368f01513K06884K14999k6499q2768j23563K57701K74094j00008J9538J84003
$$ -601513 -394629 -179630 -206129 -288897 -412460 -154759 119335 19327 38865 222868
13358B22868K446j42171k88634N5756K39497q0100r2089R2985p9725j40844K74961
$$ 222868 225314 83143 -205491 -149735 89762 9662 -82427 10558 -69167 -210011 64950
13347F4950R0943J982m5303j02552Q8802J46855k0354l01549k94067K67986P5778
$$ 64950 155893 157875 112572 10020 98822 245677 225323 -76226 -370293 -102307 -26529
13336b6529Q3901q381R9396k76670k67254P3700O7252K40496J08786P9196K58915
$$ -26529 57372 48991 148387 -128283 -395537 -321837 -254585 -14089 94697 173893 432808
13325D32808r4301j07411q6481q3725N2856J67197p0868L0146j75573j25710o6259
$$ 432808 338507 231096 144615 60890 113746 280943 210075 240221 64648 -61062 -127321
13314a27321j26354R4852K87209l5875j49589l49641j56878K30711J41807J5688
$$ -127321 -253675 -158823 128386 92511 -57078 -406719 -563597 -332886 -191079 -175391
13304a75391j90952k00305O6292M10237n0657K6656J91862L47899J19884j90974
$$ -175391 -366343 -566648 -500356 -90119 -140776 -114120 77742 425641 545525 354551
13294C54551j66282K63562K32976r9948m11664m47797j14551J44012r810J75764
$$ 354551 188269 451831 684807 584859 173195 -274602 -389153 -245141 -254951 -79187
13284g9187J19998o9201n2042r0302N9412L3760j49672j33520J3352P5322q5017
$$ -79187 40811 -28390 -80432 -170734 -111322 -77562 -227234 -360754 -347402 -272080 -357097
13273c57097J10309J28113o825r7547O3228J19836J65184O9328k26694j74131
$$ -357097 -246788 -118675 -125500 -223047 -159819 -39983 125201 194529 -32165 -206296
13263b06296m7713o750J77024L11592P9280p2854J5797k39414k28096L4207J46604
$$ -206296 -254009 -260759 -83735 227857 307137 234283 250080 10666 -217430 -183223 -36619
13252c6619J08316k65523m9835J1823o8508J35699K06292P8682o0123p0543k29224
$$ -36619 71697 -193826 -243661 -231838 -300346 -164647 41645 120327 60204 -10339 -239563
13241b39563j47521N7678J05517k4016K009j11050O2549K02116q7199j29417N0749
$$ -239563 -387084 -329406 -223889 -247905 -245896 -356946 -294397 -92281 -179480 -308897 -258148
13230b58148m2759n791J56466K1327J6972Q821j30615K8437M7327K509P8620J70038
$$ -258148 -300907 -306698 -150232 -128905 -111933 -103112 -233727 -205290 -157963 -155454 -76834 93204
13218I3204J64374R8539J702j79520j91914l8127N2309J68137L17653k80905m98586
$$ 93204 257578 356117 357819 178299 -13615 -51742 567 168704 486357 205452 -293134
13207b93134j3497L15237k2490L7127j00624j84861n3280k21333K81009J16263
$$ -293134 -306631 8606 -13884 23243 -77381 -262242 -315522 -536855 -255846 -139583
13197a39583J64244j20568j03497j78000J88182J63537J59855p9250j39641J29361
$$ -139583 24661 -95907 -199404 -377404 -189222 -25685 134170 54920 -84721 44640
13187D4640J67980O1330L6604M5085J1843k79257q3410q9518Q2592J3808j61026
$$ 44640 212620 273950 310554 355639 367482 88225 4815 -84703 -2111 11697 -149329
13176a49329J67403n1082k5652q0545m9268m77500o7471L27717l4330J39560K1019
$$ -149329 18074 -33008 -58660 -139205 -188473 -665973 -733444 -405727 -440057 -300497 -279478
13165b79478j89562J32277Q0089J7214K29701M5157J64065n9308n3196N0835K35738
$$ -279478 -469040 -336763 -256674 -239460 -9759 35398 199463 140155 86959 137794 373532
13154C73532n1674r0426j58010j05741O9348M23J05420k80180j95556J9989O0304
$$ 373532 321858 231432 73422 -32319 37029 37452 142872 -137308 -332864 -312875 -252571
13143b52571p0694M1707J11788J37461J96040J22709j31184j66835k07566k58256
$$ -252571 -323265 -281558 -169770 -32309 163731 286440 155256 -11579 -219145 -477401
13133d77401q8562J97344L10538J58306J37446M8660j12418l2291K19134J78911
$$ -477401 -565963 -368619 -58081 100225 237671 286331 173913 141622 360756 539667
13123E39667j1420p2270j06495k01006q4117k08354K14294L00279k69047k37834
$$ 539667 528247 455977 349482 148476 64359 -143995 70299 370578 101531 -136303
13113a36303j21926r1328N3158O3853J933J08726k32433j71884J91482Q1273J92188
$$ -136303 -258229 -349557 -296399 -232546 -230613 -121887 -354320 -526204 -334722 -253449 -61261
13102f1261Q130K9681m1874n6811J29941J98437Q3850l18323k3126l1191m8990
$$ -61261 -53131 -23450 -65324 -122135 7806 206243 290093 -28230 -51356 -82547 -131537
13091a31537J65610J19392j46258R0362o7536n6567N1380J1386j65699M3057j8148
$$ -131537 34073 153465 7207 97569 30033 -26534 24846 36232 -129467 -86410 -104558
13080a04558q8410P0402J97803j02441l48677r1043Q6248j31873J85215K76451
$$ -104558 -192968 -122566 75237 -27204 -375881 -466924 -380676 -512549 -327334 -50883
13070e0883N383o1900j01321k24924J39937L68892J31036o009l70692k4806N2614
$$ -50883 -45500 -107400 -208721 -433645 -293708 75184 206220 200211 -170481 -195287 -142673
13059a42673j15375n0235j51008j60378J31978P9174L45044Q5071o7747o9921
$$ -142673 -258048 -308283 -459291 -619669 -487691 -408517 -63473 21598 -46149 -116070
13049a16070j3530n6717l0274n527J63122K40506k03188m1429p6237p4266K70175
$$ -116070 -129600 -186317 -216591 -222118 -58996 181510 -21678 -63107 -139344 -213610 56565
13038E6565R2553j11976j44293J63415l1358J27991n0502j58836l7035L3642k08833
$$ 56565 149118 37142 -107151 56264 24906 152897 102395 -56441 -93476 -59834 -268667
13027b68667j44351M1807M858J04155J80457L2844m5038m5773M6511Q7609j79879
$$ -268667 -413018 -371211 -366353 -262198 -81741 -48897 -93935 -139708 -93197 -5588 -185467
13016a85467k05656j18202J87390K20536K4019J72634j60749k38230J17870J94007
$$ -185467 -391123 -509325 -321935 -101399 -77380 95254 -65495 -303725 -185855 8152
13006H152J72886J04964q9890j23560m8852m0920k03823j88120m14368R4014N057
$$ 8152 181038 286002 196112 72552 23700 -17220 -221043 -409163 -823531 -729517 -724460
12995g24460r5006Q4964P049K22425J11467Q7519q6696K53113L03823J57931L1723
$$ -724460 -819466 -734502 -727453 -505028 -393561 -306042 -392738 -139625 164198 322129 353852
12984C53852m18247j2935J50554M59j84064J58779K8769q9188M4130j17876m48468
$$ 353852 -64395 -77330 73224 73683 -110381 48398 77167 -12021 32109 -85767 -534235
12973e34235K6580K54717l5567r3227k55919j33976J99248L14045J88556J22258
$$ -534235 -507655 -252938 -288505 -381732 -637651 -771627 -572379 -258334 -69778 52480
12963E2480q6847j62760l7406J41803J10343K94510J6878l94397n1668K76452
$$ 52480 -34367 -197127 -234533 -92730 17613 312123 329001 -65396 -117064 159388
12953A59388j76844k67661k60984R2066L25287K647j68185p8143J1097K84788
$$ 159388 -17456 -285117 -546101 -454035 -128748 -126101 -294286 -372429 -361332 -76544
12943g6544M1610j93785J38123O890J17215K35782P8483K6400K46705j76859l0079
$$ -76544 -34934 -228719 -90596 -83706 33509 269291 347774 374174 620879 444020 413941
12932D13941j01266l03610k81226o0837q8457K34725K90519j07047j63743k24173
$$ 413941 312675 9065 -272161 -332998 -421455 -186730 103789 -3258 -167001 -391174
12922c91174j00118M8449r671Q0107K34605J26773r8585j93685n0843j20894J08651
$$ -391174 -491292 -442843 -452514 -372407 -137802 -11029 -109614 -303299 -354142 -475036 -366385
12911c66385N2495M0543n7522M22746O273j57625r227j94081N9435N102m761O5244
$$ -366385 -313890 -273347 -330869 91877 98150 -59475 -68702 -262783 -203348 -198246 -203007 -137763
12899a37763j7993j76223k3840M6254K15054n2924p8689k09434q7054j36810J06262
$$ -137763 -155756 -331979 -355819 -309565 -94511 -147435 -226124 -435558 -522612 -659422 -553160
12888e53160L52630L56292J4764j94668j77748R252k63301l0849K70499k6640
$$ -553160 -200530 155762 170526 -24142 -201890 -192638 -455939 -486788 -216289 -242929
12878b42929P0934J3785k3156K28617j3145j46563k1567O9933N1774k30619K62880
$$ -242929 -171995 -158210 -181366 47251 34106 -112457 -134024 -64091 -12317 -242936 19944
12867A9944n676J73958K59837k44789j90948J83799m8411R0825k73465J88425
$$ 19944 14268 188226 448063 203274 12326 196125 147714 238539 -34926 153499
12857A53499L35215j67257k70773q4601J78217j36691M3090q626M2048r9793J50291
$$ 153499 488714 321457 50684 -33917 144300 7609 50699 42073 84121 -15672 134619
12846A34619j6421J37827j34176j90931j41046j16213q4094P5268Q4493M32110
$$ 134619 118198 256025 121849 -69082 -210128 -326341 -410435 -335167 -250674 181436
12836A81436J14643J07447M9515j48599j08832l0035L15264j45197j24637n8975
$$ 181436 296079 403526 453041 304442 195610 165575 480839 335642 211005 152030
12826A52030k25509N1703j2751r5515J23942K9745L3523j86434j50426j78906
$$ 152030 -73479 -21776 -34527 -130042 -6100 23645 57168 -129266 -279692 -458598
12816d58598K58564K53722K42101j01375j19591j9851J82187M2120k43485Q4591
$$ -458598 -200034 53688 295789 194414 74823 54972 237159 279279 35794 120385
12806A20385r416o971k01641l38529K9301K23851P6487o4798q825J4036J34043
$$ 120385 110969 103998 -97643 -436172 -406871 -183020 -106533 -171331 -180156 -166120 -32077
12795c2077J58208K2380l2356L36953M6737j15545j42274l00017j03052P6378
$$ -32077 126131 148511 116155 453108 499845 384300 242026 -57991 -161043 -84665
12785h4665r2176k3114O5733J87725J30263J09485q4792j31378Q2172N0477Q3908
$$ -84665 -176841 -199955 -134222 53503 183766 293251 208459 77081 159253 209730 293638
12774B93638J70904q5525k3148j89229m9739j73371J1755P7381J88947j3705o3524
$$ 293638 464542 379017 355869 166640 116901 -56470 -44715 32666 221613 207908 144384
12763A44384j36313N9301p1680k9277J19472L5643J0296P5662j93272j82037J02747
$$ 144384 8071 67372 -4308 -33585 85887 121530 131826 207488 14216 -167821 -65074
12752f5074J13410j69319k8472R570q9253m3641J59105k1451k29260J32256R416
$$ -65074 48336 -120983 -149455 -139885 -229138 -272779 -113674 -135125 -364385 -232129 -222713
12741b22713o2554J05394J70279K6082k41235r4848K38240R2524n2748j2491k08067
$$ -222713 -285267 -179873 -9594 16488 -224747 -319595 -81355 11169 -41579 -54070 -262137
12730b62137J04334J64490P6989l09240l90935K35988K12421k6609O5641K12893
$$ -262137 -157803 6687 83676 -225564 -616499 -380511 -168090 -194699 -129058 83835
12720H3835J22923o6616m5108J18772j327K99816L8729k33771n0442J00426k77236
$$ 83835 206758 140142 95034 213806 212479 512295 551024 317253 266811 367237 90001
12709I0001k94723K1220J75383K6843J39617r2226q8378K4021k0780j90892Q5746
$$ 90001 -204722 -183502 -8119 18724 158341 66115 -22263 1758 -19022 -209914 -124168
12698a24168O9925J57530K29662J13839o0117J12346k3678p6479o1159q8393m12324
$$ -124168 -54243 103287 332949 446788 386671 499017 475339 398860 337701 249308 -163016
12687a63016K6899J6004O2601J6115K04548j24110m8187l8940J9214R6063k173
$$ -163016 -136117 -120113 -57512 -41397 163151 39041 -9146 -48086 -28872 67191 65018
12676F5018j27278l26977J26291j34112L7382J67868j474K69934K17845K693k3339
$$ 65018 -62260 -389237 -262946 -397058 -359676 -191808 -193282 76652 294497 297190 273851
12665B73851k7607m8806J65210j34702k42458J37591p2313q1778J25029j25832
$$ 273851 246244 197438 362648 227946 -14512 123079 50766 -31012 94017 -31815
12655c1815J1217K0612k06089J97591J35001k12623j04872j24463j735K35598
$$ -31815 -20598 14 -206075 -8484 126517 -86106 -190978 -315441 -317176 -81578
12645h1578J68822j2873N9640O9092m6675j09803Q6697Q9116j1698j03174r6o3463
$$ -81578 87244 74371 134011 203103 156428 46625 133322 222438 210740 107566 107470 44007
12633D4007r4451R3002J82724J2527r0420L2719m8185l8557j17157m7220R7524
$$ 44007 -50444 42558 225282 237809 147389 180108 131923 93366 -23791 -71011 26513
12622B6513Q6401L98619n6792M2265m5558j41452J09389m2655O6334O7785n9739
$$ 26513 112914 511533 454741 497006 451448 309996 419385 376730 443064 510849 451110
12611D51110N9127j51926k69411O3154L774J21999K10826m3284j39991j88600
$$ 451110 510237 358311 88900 152054 155828 277827 488653 445369 305378 116778
12601A16778K00655J82849l88298k70012j25476j3258o7330J60947Q6742j5871
$$ 116778 317433 500282 111984 -158028 -283504 -296762 -364092 -203145 -116403 -132274
12591a32274k1151k73372P8038R1228O7475K53863j3675J2542L2628n1248n1052
$$ -132274 -153425 -426797 -348759 -257531 -190056 63807 50132 62674 95302 44054 -6998
12580f998J57559L5984j268m8084j30387J59253K26002L67390j86324k12259N6948
$$ -6998 150561 186545 185277 137193 6806 166059 392061 759451 573127 360868 417816
12569D17816o7716j48545J102K2058k12103j2635q599O4744M1810k52683K81843
$$ 417816 350100 201555 202657 224715 12612 -23 -8622 56122 97932 -154751 127092
12558A27092j9003J2860K2370j44799l0439O3925K61931R1135M7845k23284m76243
$$ 127092 108089 120949 143319 -1480 -31919 32006 293937 385072 432917 209633 -266610
12547b66610j30837L356Q8326J09402J0226K32871J22141J43016j94229j25618
$$ -266610 -397447 -394091 -305765 -196363 -186137 46734 168875 311891 117662 -7956
12537g956J82275j49427j51266j4735j4330J2166j70704K21498K21148k13147
$$ -7956 174319 24892 -126374 -141109 -155439 -143273 -313977 -92479 128669 -84478
12527h4478q544J16972L5588J7918p999J05m2281Q3292J19723L5302N0666m1470
$$ -84478 -93022 23950 59538 77456 69457 69562 27281 110573 230296 265598 316264 274794
12515B74794M3068o9172k15014k06835K86043O9998j92963l7271J88247l7972
$$ 274794 317862 248690 33676 -173159 112884 182882 -10081 -47352 140895 102923
12505A02923j07251K00131R7781j00242m1100M6440p2614m4896J52239P9304k00320
$$ 102923 -4328 195803 293584 193342 152242 198682 126068 81172 233411 312715 112395
12494A12395O041J1097J73687P9849K3643k29208j3367l1477K0225J38675K5334
$$ 112395 118436 129533 303220 383069 406712 177504 164137 132660 152885 291560 316894
12483C16894k43901J38307j3994K47226R1229l0259l27015O902R533k13387L6515
$$ 316894 72993 211300 197306 444532 535761 505502 178487 185389 194922 -18465 18050
12472A8050l6223K81036m3168p0009Q6684K05414N3736l01318q3939p5648R014
$$ 18050 -18173 262863 219695 149686 236370 441784 495520 194202 110263 34615 43629
12461D3629j79301Q2692J21831J73994K63051J75m35527l76L6940N4413J20437
$$ 43629 -135672 -52980 68851 242845 505896 506071 70544 70168 107108 161521 281958
12450B81958K1684J19111N4509j14666L1153j97429Q2750l3144j12562Q3165J0266
$$ 281958 303642 422753 477262 362596 393749 196320 279070 245926 133364 216529 226795
12439B26795o7807n1746P2372j75484l9707L19003Q6066j10032l9012o9775J6632
$$ 226795 158988 107242 179614 4130 -35577 283426 369492 259460 220448 150673 167305
12428A67305j16699J0565K42999J15453k16687k90216J6406K17821J04596K85788
$$ 167305 50606 61171 304170 419623 202936 -87280 -70874 146947 251543 537331
12418E37331r3236l6879j95370j53445M264O1276K1107J68366k1732j25812k98421
$$ 537331 444095 407216 211846 58401 62665 123941 145048 313414 291682 165870 -132551
12407a32551R5443O5512K31268q4458k95210r0846j2929L0780L5853q2295k06305
$$ -132551 -37108 28404 259672 175214 -119996 -210842 -223771 -192991 -157138 -239433 -445738
12396d45738L9478J73927L67100M67741J13106j63341K7397j98451l35283k2102
$$ -445738 -406260 -232333 134767 602508 715614 552273 579670 381219 45936 23834
12386B3834N8609J78970K7887l14645o1200O1469L34564J22882L0460p4259j37610
$$ 23834 82443 261413 289300 -25345 -86545 -25076 309488 432370 462830 388571 250961
12375B50961j66082J43129q4839J03334P0494L01739O654k8460r4743j99851o7540
$$ 250961 84879 228008 143169 246503 316997 618736 625390 596930 502187 302336 234796
12364B34796J7109K9671k19703q0857L547O6564J48063Q4370k6131J78903N8920
$$ 234796 251905 281576 61873 -18984 -15437 51127 199190 283560 257429 436332 495252
12353D95252J73831P1781k10223k65818k1538J48021L5529J14233m5803k35850
$$ 495252 669083 740864 530641 264823 243285 391306 426835 541068 495265 259415
12343B59415J34230L7966k16273j7506o2926j09484N9319L17072J25279J72044
$$ 259415 393645 431611 215338 197832 134906 25422 84741 401813 527092 699136
12333F99136j63030j47916j42971l44288O3843L88472l3190k19164J81555P9059
$$ 699136 536106 388190 245219 -99069 -35226 353246 320056 100892 282447 361506
12323C61506J6585p4520j05595o6416L11599L33706j47154k09177J49452j48241
$$ 361506 378091 303571 197976 131560 443159 776865 629711 420534 569986 421745
12313D21745J84721J59351m0192j32763J00162J45703k65517j86754L4510M20165
$$ 421745 606466 765817 725625 592862 693024 838727 573210 386456 420966 841131
12303H41131p7495j66415Q4772l8656J21469k4686l44808k4402K10005K08233
$$ 841131 763636 597221 681993 643337 764806 740120 395312 370910 580915 789148
12293G89148J62286P9939j35195k38864r795J43212Q2464j19543j90852M8824
$$ 789148 951434 1031373 896178 657314 647519 790731 873195 753652 562800 611624
12283F11624q033J1683L2690K03853j4566j62609K20548K83645M0924j12112l15628
$$ 611624 603591 615274 647964 851817 837251 674642 895190 1178835 1219759 1107647 792019
12272G92019p9145L5434q3753k80721Q7686J55465m4311L7521Q7842m5902j51085
$$ 792019 712874 748308 664555 383834 471520 626985 582674 620195 708037 662135 511050
12261E11050k48867j64733O3115M0171K50850J44409J35506K93297J83675l71660
$$ 511050 262183 97450 160565 200736 451586 595995 731501 1024798 1208473 836813
12251H36813p6684P3595o9553M4010J43467k08083k29786k0335M27394J76950
$$ 836813 760129 833724 764171 808181 951648 743565 513779 493444 920838 1097788
12241A097788r4472L3101K1347j97950M4746K20231q3092j44049K8634k7380Q6165
$$ 1097788 1003316 1036417 1057764 859814 904560 1124791 1041699 897650 926284 898904 985069
12230I85069j3404L0573K71579J62760j20503J9084Q5453j94506l44985j00975
$$ 985069 971665 1002238 1273817 1436577 1316074 1335158 1420611 1226105 881120 780145
12220G80145n560j93110J4556J3561N39289M00630q6191l43380q2564N6750K22893
$$ 780145 774585 581475 596031 609592 1148881 1549511 1463320 1119940 1037376 1094126 1317019
12209A317019m1659J9782L7400o2205r0751j37710j43348O8143R7638n3827Q1079
$$ 1317019 1275360 1295142 1332542 1270337 1179586 1041876 898528 966671 1064309 1010482 1091561
12198A091561K67381P8775k263l0989o1092L42883J03309J75601k1835J24927
$$ 1091561 1358942 1437717 1435454 1404465 1343373 1686256 1789565 1965166 1943331 2068258
12188B068258K249k94349J1179n6636j06605k3027j21740L02254K76550l0614
$$ 2068258 2070507 1776158 1787337 1730701 1624096 1601069 1479329 1781583 2058133 2027519
12178B027519l45500j43388J4446M0692m7661J72448J79787j84785K06671K61209
$$ 2027519 1682019 1538631 1553077 1593769 1546108 1718556 1898343 1713558 1920229 2181438
12168B181438O8341J98848k75976j22391R2002j20584k3584N6952N3418K28047
$$ 2181438 2249779 2448627 2172651 2050260 2142262 2021678 1998094 2055046 2108464 2336511
12158B336511j3159j87324J32818L45819J32699m2753l78824k73632J30179K88721
$$ 2336511 2323352 2136028 2268846 2614665 2747364 2704611 2325787 2052155 2182334 2471055
12148B471055M4938J55271j69991j29114j12456K77063J88441j34649K8718J84729
$$ 2471055 2515993 2671264 2501273 2372159 2259703 2536766 2725207 2590558 2619276 2804005
12138B804005k56398J18901K13755p0368K42161L04392m3903k00241n5816M3225
$$ 2804005 2547607 2666508 2880263 2809895 3052056 3356448 3312545 3112304 3056488 3099713
12128C099713j91603k31577R5524J80338M2079k20591N1056K46063N83195M1457
$$ 3099713 2908110 2676533 2772057 2952395 2994474 2773883 2824939 3071002 3654197 3695654
12118C695654l25482k21897J57260J77880L98501r3916k44912J04782J56225Q1153
$$ 3695654 3370172 3148275 3305535 3483415 3881916 3788000 3543088 3647870 3804095 3885248
$$ [...]
##END NTUPLES=NMR SPECTRUM
##END=
