##TITLE=Analysis number 311868
Compound Code mo 07199
Book Reference 407/83
Project Code adrs
Chemist Name andyw
##JCAMPDX= 6.0         $$ Bruker NMR JCAMP-DX V2.0
##DATA TYPE= NMR SPECTRUM
##DATA CLASS= NTUPLES
##ORIGIN= Bruker BioSpin GmbH
##OWNER= NMR
$$ XWIN-NMR		Version 3.5
$$ Tue Jul 19 09:40:02 2005 GMT Daylight Time (UT+1h)  MAYBRIDGE\NMR@NMR_250MHZ
##.OBSERVE FREQUENCY= 250.131544655141
##.OBSERVE NUCLEUS= ^1H
##.ACQUISITION MODE= SIMULTANEOUS (DQD)
##.ACQUISITION SCHEME= undefined
##.AVERAGES= 16
##.DIGITISER RES= 18
##SPECTROMETER/DATA SYSTEM= dpx250
##.PULSE SEQUENCE= zg30
##.SOLVENT NAME= CDCl3
##.SHIFT REFERENCE= (INTERNAL, CDCl3, 0, 16.4588)
##AUDIT TRAIL= $$ (NUMBER, WHEN, WHO, WHERE, WHAT)
$$ ##TITLE= Audit trail, XWIN-NMR		Version 3.5
$$ ##JCAMPDX= 5.01
$$ ##ORIGIN= Bruker BioSpin GmbH
$$ ##OWNER= NMR
$$ C:\u/data/dgb/nmr/ADRS/5990/pdata/1/auditp.txt
$$ ##AUDIT TRAIL=  $$ (NUMBER, WHEN, WHO, WHERE, WHAT)
(   1,<2005-07-19 09:39:23.89 +100>,<MAYBRIDGE\NMR>,<NMR_250MHZ>,
      <created by zg, POWCHK disabled, PULCHK disabled
       configuration hash MD5:
       62 19 C7 07 E1 42 D1 B7 37 6C 3D D0 77 39 F9 E6
       data hash MD5: 64K
       E9 A1 B0 49 AF E8 97 24 D6 3C E5 BB 43 8D EC 00>)
(   2,<2005-07-19 09:39:40.00 +100>,<MAYBRIDGE\NMR>,<NMR_250MHZ>,
      <Start of raw data processing
       ef LB = 0.3 FT_mod = 6 PKNL = 1 SI = 32K 
       data hash MD5: 32K
       55 79 98 74 CE 0F 03 40 48 F2 4C F7 C9 29 8D 68>)
(   3,<2005-07-19 09:39:43.22 +100>,<MAYBRIDGE\NMR>,<NMR_250MHZ>,
      <apk 
       data hash MD5: 32K
       E4 FF 0E 56 03 FA 5D 7B D8 9B 9D 52 74 9F 8F 90>)
(   4,<2005-07-19 09:39:44.46 +100>,<MAYBRIDGE\NMR>,<NMR_250MHZ>,
      <abs ABSG = 5 
       data hash MD5: 32K
       02 69 51 F4 FB 2D B8 43 8E D5 40 6A 30 BC 30 72>)
$$ ##END=
$$ 
$$ hash MD5
$$ 08 9E 02 8B 67 8C 02 AF B7 3C B9 B9 4F 1D 7F 8F
##$RELAX= 
##$RELAX= 
##$RELAX= 
##$RELAX= 
##$RELAX= 
##$RELAX= 
##$RELAX= 
$$ Bruker specific parameters
$$ --------------------------
##$DU= <C:\u>
##$EXPNO= 5990
##$NAME= <ADRS>
##$PROCNO= 1
##$TYPE= <nmr>
##$USER= <dgb>
##$AMP= (0..31)
100 100 100 100 100 100 100 100 100 100 100 100 100 100 100 100 100 100 
100 100 100 100 100 100 100 100 100 100 100 100 100 100 
##$AQSEQ= 0
##$AQ_mod= 3
##$AUNM= <au_zg>
##$AUTOPOS= <2 >
##$BF1= 250.13
##$BF2= 250.13
##$BF3= 250.13
##$BF4= 250.13
##$BF5= 500.13
##$BF6= 500.13
##$BF7= 500.13
##$BF8= 500.13
##$BYTORDA= 1
##$CFDGTYP= 0
##$CFRGTYP= 5
##$CHEMSTR= <none>
##$CNST= (0..31)
1 1 145 1 1 1 1 1 1 1 1 1 1 1 1 1 1 1 1 1 1 1 1 1 1 1 1 1 1 1 1 1 
##$CPDPRG= <>
##$CPDPRG1= <>
##$CPDPRG2= <>
##$CPDPRG3= <>
##$CPDPRG4= <mlev>
##$CPDPRG5= <mlev>
##$CPDPRG6= <mlev>
##$CPDPRG7= <mlev>
##$CPDPRG8= <mlev>
##$CPDPRGB= <>
##$CPDPRGT= <>
##$D= (0..31)
0 1 0 0 0 0 0 0 0 0.06 0 0 0 0 0 0 0.0002 0 0 0 0 0 0 0 0 0 0 0 0 0 0 
0 
##$DATE= 1121762361
##$DBL= (0..7)
120 120 120 120 120 120 120 120 
##$DBP= (0..7)
150 150 150 150 150 150 150 150 
##$DBP07= 0
##$DBPNAM0= <>
##$DBPNAM1= <>
$$ [...]
##$SUBNAM7= <"">
##$SUBNAM8= <"">
##$SUBNAM9= <"">
##$SW= 20.6930455092707
##$SWIBOX= (0..15)
0 0 3 0 0 0 0 0 0 0 0 0 0 0 0 0 
##$SW_h= 5175.983436853
##$TD= 65536
##$TD0= 1
##$TE= 295.16
##$TE2= 300
##$TE3= 300
##$TEG= 300
##$TL= (0..7)
0 120 120 120 120 120 120 120 
##$TP= (0..7)
150 150 150 150 150 150 150 150 
##$TP07= 0
##$TPNAME0= <>
##$TPNAME1= <>
##$TPNAME2= <>
##$TPNAME3= <>
##$TPNAME4= <>
##$TPNAME5= <>
##$TPNAME6= <>
##$TPNAME7= <>
##$TPOAL= (0..7)
0.5 0.5 0.5 0.5 0.5 0.5 0.5 0.5 
##$TPOFFS= (0..7)
0 0 0 0 0 0 0 0 
##$TUNHIN= 0
##$TUNHOUT= 0
##$TUNXOUT= 0
##$USERA1= <user>
##$USERA2= <user>
##$USERA3= <user>
##$USERA4= <user>
##$USERA5= <user>
##$V9= 5
##$VALIST= <valist>
##$VCLIST= <CCCCCCCCCCCCCCC>
##$VD= 0
##$VDLIST= <DDDDDDDDDDDDDDD>
##$VPLIST= <PPPPPPPPPPPPPPP>
##$VTLIST= <TTTTTTTTTTTTTTT>
##$WBST= 1024
##$WBSW= 4
##$XGAIN= (0..3)
0 0 0 0 
##$XL= 0
##$YL= 0
##$YMAX_a= 421363
##$YMIN_a= -492388
##$ZGOPTNS= <>
##$ZL1= 120
##$ZL2= 120
##$ZL3= 120
##$ZL4= 120
##$ABSF1= 16.45883
##$ABSF2= -4.234343
##$ABSG= 5
##$ABSL= 3
##$ALPHA= 0
##$AQORDER= 0
##$ASSFAC= 0
##$ASSFACI= 0
##$ASSFACX= 0
##$ASSWID= 0
##$AUNMP= <proc_1d>
##$AZFE= 0.1
##$AZFW= 0.1
##$BCFW= 0
##$BC_mod= 0
##$BYTORDP= 0
##$COROFFS= 0
##$CY= 12.5
##$DATMOD= 1
##$DC= 0
##$DFILT= <>
##$DTYPP= 0
##$F1P= 14.0000005364418
##$F2P= -0.99999901652339
##$FCOR= 0.5
##$FTSIZE= 32768
##$FT_mod= 6
##$GAMMA= 0
##$GB= 0
##$INTBC= 1
##$INTSCL= 1
##$ISEN= 128
##$LB= 0.3
##$LEV0= 0
##$LPBIN= 0
##$MAXI= 10000
##$MC2= 0
##$MEAN= 0
##$ME_mod= 0
##$MI= 0
##$NCOEF= 0
##$NC_proc= -5
##$NLEV= 6
##$NOISF1= 0
##$NOISF2= 0
##$NSP= 0
##$NTH_PI= 0
##$NZP= 0
##$OFFSET= 16.45883
##$PC= 1
##$PHC0= -78.6443
##$PHC1= 6.445957
##$PH_mod= 1
##$PKNL= yes
##$PPARMOD= 0
##$PSCAL= 4
##$PSIGN= 0
##$REVERSE= no
##$SF= 250.130015799591
##$SI= 32768
##$SIGF1= 0
##$SIGF2= 0
##$SINO= 400
##$SIOLD= 32768
##$SREGLST= <1H.CDCl3>
##$SSB= 0
##$STSI= 32768
##$STSR= 0
##$SW_p= 5175.98343685301
##$SYMM= 0
##$S_DEV= 0
##$TDeff= 65536
##$TDoff= 0
##$TI= <Analysis number 999999
Compound Code 99
Book Reference 9
Project Code 9>
##$TILT= no
##$TM1= 0
##$TM2= 0
##$TOPLEV= 0
##$USERP1= <user>
##$USERP2= <user>
##$USERP3= <user>
##$USERP4= <user>
##$USERP5= <user>
##$WDW= 1
##$XDIM= 32768
##$YMAX_p= 337064610
##$YMIN_p= -365365
$$ End of Bruker specific parameters
$$ ---------------------------------
##NTUPLES= NMR SPECTRUM
##VAR_NAME=  FREQUENCY,     SPECTRUM/REAL,   SPECTRUM/IMAG
##SYMBOL=    X,             R,               I
##VAR_TYPE=  INDEPENDENT,   DEPENDENT,       DEPENDENT
##VAR_FORM=  AFFN,          ASDF,            ASDF
##VAR_DIM=   32768,         32768,           32768
##UNITS=     HZ,            ARBITRARY UNITS, ARBITRARY UNITS
##FACTOR=    0.157963299565203, 1,           1
##FIRST=     4116.84737786734, 0,            0
##LAST=      -1059.13605898567, 0,           0
##MIN=       -1059.13605898567, -365365,     0
##MAX=       4116.84737786734, 337064610,    0
$$ Real data points
##PAGE= N=1
##DATA TABLE= (X++(R..R)), XYDATA
$$ [...]
27711D2896N6555k9102m8287N241p021j2135k5355k7159M833N2644k0907k18k651
$$ 42896 99451 70349 22062 27303 20282 8147 -17208 -44367 -39534 13110 -7797 -8015 -10666
27698a0666m0446o0309J0876P7193K1366K2296P022K3455J8746j07825j20171
$$ -10666 -51112 -111421 -100545 -23352 -1986 20310 27332 50787 69533 -38292 -158463
27687a58463O8927O0863Q1321o7723L0381N4071q0458p3038L6370M2294k0858
$$ -158463 -89536 -28673 52648 -15075 15306 69377 -11081 -84119 -47749 -5455 -26313
27676b6313k3167M7164L1623l0466m3618K959k075P8932J18316p0270l5512n1838
$$ -26313 -49480 -2316 29307 -1159 -44777 -41818 -43893 35039 153355 83085 47573 -4265
27664d265K5870J5180Q751L1481R8506k5536n5899n5015N0622L0793l6453o2905
$$ -4265 21605 36785 45536 77017 175523 149987 94088 39073 89695 120488 84035 21130
27652B1130M2900J0352O03k8519r6493j7919k8809j0772Q4067L4348K5384l9217
$$ 21130 64030 74382 74985 46466 -50027 -67946 -96755 -107527 -23460 10888 36272 -2945
27640b945l5937o8187K7116L4505L9042K1694m9545J8103j1008J00136M9403L6170
$$ -2945 -38882 -107069 -79953 -45448 -6406 15288 -34257 -16154 -27162 72974 122377 158547
27628A58547n0966K0868m9057K2938L5101Q625p2369o229k6388j15742M9497l013
$$ 158547 107581 128449 79392 102330 137431 146056 73687 67458 41070 -74672 -25175 -28188
27616b8188o4377O1528N9970K3549l2351j0658m4888j8402k0312l456n0095K4014
$$ -28188 -92565 -31037 28933 52482 20131 9473 -35415 -53817 -74129 -77585 -127680 -103666
27604a03666Q8111J21974K2836M560K4613q5148p8549m0473l4321J9455p9264
$$ -103666 -15555 106419 129255 133815 158428 73280 -5269 -45742 -80063 -60608 -139872
27593a39872l541Q1145N4600m2322J85q207l7776Q4883L5716n4409q5701O880
$$ -139872 -143413 -62268 -7668 -49990 -49805 -58012 -95788 -10905 24811 -29598 -115299 -108419
27581a08419Q5051l641l7995J23K7685N582L6731J0208J3438L8863j2814j9478
$$ -108419 -23368 -27009 -65004 -64881 -37196 -31614 5117 15325 28763 67626 54812 35334
27569C5334R302J5923N8629j1976n6153r1231o2086l5158J06143K8441m4973L7991
$$ 35334 44636 60559 119188 107212 51059 -40172 -102258 -137416 -31273 -2832 -47805 -9814
27557i814j5991m8133m0719M4372L9491Q4494N8624L8853n6521l9084L8025L5262
$$ -9814 -25805 -73938 -114657 -70285 -30794 53700 112324 151177 94656 55572 93597 128859
27545A28859m5966j5523k6131n1070N9889l5141k5311o0262L7628P3702M1329
$$ 128859 82893 67370 41239 -9831 50058 14917 -10394 -70656 -33028 40674 82003
27534H2003p7234k4408Q2912K3346m3572r643p6259p0919n2826Q8019n2406p397
$$ 82003 4769 -19639 63273 86619 43047 33404 -42855 -113774 -166600 -78581 -130987 -138384
27522a38384L9222L7526k3123L1468Q956k10O1022J7958J1293l4245l7503N0284
$$ -138384 -99162 -61636 -84759 -53291 -44335 -44545 16477 34435 45728 11483 -26020 24264
27510B4264O7527q304p0703r1552O718P9975j4457j0225J1222k8871K3523O5149
$$ 24264 91791 83487 12784 -78768 -72050 7925 -6532 -16757 -5535 -34406 -10883 54266
27498E4266K3655M8853m0177p2333q096k6312L4216R1716J2380P229l0817j13126
$$ 54266 77921 126774 86597 14264 6168 -20144 14072 105788 118168 125397 94580 -18546
27486a8546l5680K0000r710j828q3362N4878q945l6281K7693k7125N521L2770
$$ -18546 -54226 -34226 -43936 -45764 -129126 -74248 -83193 -119474 -91781 -118906 -113385 -80615
27474h0615L983N4290J2309L9543o0381K3107P190N5129p70K5394m2855n442k4253
$$ -80615 -76632 -22342 -10033 29510 -30871 -7764 -574 54555 53785 79179 36324 30882 6629
27461F629o3088O619K344m3959p9884j7528k1000P6347N0873l6330K0728N6055
$$ 6629 -56459 -49840 -47496 -91455 -171339 -188867 -209867 -133520 -82647 -118977 -98249 -42194
27449d2194O3473K4577J6511M9428j2967j13603m2719P4960K8046j4787N714L8246
$$ -42194 21279 45856 62367 111795 98828 -14775 -57494 17466 45512 30725 36439 74685
27437G4685j7403k302N245n8502r802n5959m2645N0491k4109R163J7671P4962
$$ 74685 57282 54980 60225 1723 -8079 -64038 -106683 -56192 -80301 -71138 -53467 21495
27425B1495k0508j6876N918j440P435O4776K109m0993R8992M6675l7846l0362
$$ 21495 987 -15889 -9971 -11411 -3976 60800 62909 21916 120908 167583 129737 99375
27413I9375p5433o7403L6555Q3911j3829K4893k8302l8656J6364J2579k647o1933
$$ 99375 23942 -43461 -6906 77005 63176 88069 59767 21111 37475 50054 47407 -14526
27401a4526j8370N1644P3011J2583l3968l0541l3674L893j2208j3358M7267P6191
$$ -14526 -32896 18748 91759 104342 70374 39833 6159 10052 -2156 -15514 31753 107944
27389A07944Q8293n7397q9508N5824K1748m7611m4189j3647M4411j1735q01k2093
$$ 107944 196237 138840 49332 105156 126904 79293 35104 21457 65868 54133 53332 31239
27377C1239J091r397O0558l4017l3575o953J0329R142k763L3205n8396p7474J00380
$$ 31239 32330 22933 83491 49474 15899 8946 19275 28417 25654 58859 463 -77011 23369
27364B3369K7481m2225p63R148l6091n132m0140k9992J4603Q1262M5324Q894j0062
$$ 23369 50850 8625 7862 17010 -19081 -24213 -64353 -94345 -79742 1520 46844 55738 45676
27351D5676k918p4646k5192j3650M538P7526P75q0453Q7998R406j630n992M439
$$ 45676 42758 -31888 -57080 -70730 -66192 11334 12109 -68344 19654 29060 27430 21438 25877
27338B5877J824m8022O6332P1875r064J4046o2821q0163K6490R4327L6711L8346
$$ 25877 27701 -20321 46011 117886 108822 122868 60047 -20116 6374 100701 137412 175758
27326A75758m3651l7710n5257n7984l1331j1886M9205j062L784K2151J812n0311
$$ 175758 132107 94397 39140 -18844 -50175 -62061 -12856 -13918 -10134 12017 13829 -36482
27314c6482m0639k2513L0330J06211M8816o0026n7245m6295Q8019R3910k8493
$$ -36482 -77121 -99634 -69304 36907 85723 25697 -31548 -77843 10176 104086 75593
27303G5593p7532m4616M1582N4096K9816M3606R207n4081p990k5194l148k6134
$$ 75593 -1939 -46555 -4973 49123 78939 122545 131752 77671 69681 44487 41339 15205
27291A5205K5881o8725j1481k0675L4928k9009j06568J5644Q2121P1503r441n5026
$$ 15205 41086 -27639 -39120 -59795 -24867 -53876 -160444 -144800 -62679 8824 -617 -55643
27279e5643K5850M837L512n210p6730k7056N5597N5765m5019J2219L2808J6041
$$ -55643 -29793 -24956 -21444 -26654 -103384 -130440 -74843 -19078 -64097 -51878 -19070 -3029
27267c029L7805j0758P957l059K9698P838l1044m0165j7975M4978N9466N6689
$$ -3029 34776 24018 31975 28916 58614 66452 35408 -4757 -22732 22246 81712 138401
27255A38401j4709r1916J0743M6427m281L9043l9570k6029Q6772L1932j7377l5979
$$ 138401 123692 31776 42519 88946 84665 123708 84138 58109 144881 176813 159436 123457
27243A23457n1316k9033m4594Q667J775J9858K565l51M5117q708n5768j5773r703
$$ 123457 72141 43108 -1486 7181 8956 28814 31379 31028 76145 67437 11669 -4104 -13807
27230a3807M6604K4721m0945j01428m9605Q772M4403n6O8211K4069k1200o3820
$$ -13807 32797 57518 16573 -84855 -134460 -125688 -81285 -81341 -13130 10939 -10261 -74081
27218g4081j4870M5446O2151K1994K6611j6225j10212M717M674J6070R2665M0680
$$ -74081 -88951 -43505 18646 40640 67251 51026 -59186 -54469 -49795 -33725 58940 99620
27206I9620o6395L9728M466l2349j10010O9608N1715J3030j02634j9571M1870
$$ 99620 33225 72953 77419 45070 -64940 4668 56383 69413 -33221 -52792 -10922
27195a0922K2481Q4294k8285m2518l7406L6247o1436q007n0545J3158r57k9243
$$ -10922 11559 95853 67568 25050 -12356 23891 -37545 -45552 -96097 -82939 -83896 -113139
27183a13139O5442p261k1557k9578L3953L5643L9393k2194k7507J7215r486P109
$$ -113139 -47697 -54958 -76515 -106093 -72140 -36497 2896 -19298 -46805 -29590 -39076 -31967
27171c1967K8386R885l3759P23k2906j9002j0630k4169K1679J11043K4293l6207
$$ -31967 -3581 6304 -27455 -26732 -49638 -68640 -79270 -103439 -81760 29283 53576 17369
27159A7369k4615o2314q212N2780N5541J1445L9218m2303o2730j4958j2478j0662
$$ 17369 -7246 -69560 -77772 -24992 30549 41994 81212 38909 -23821 -38779 -51257 -61919
27147f1919M2093N0911n3008o3381J3738J8520N6058P8737l4025j6251j2464P259
$$ -61919 -19826 31085 -21923 -85304 -71566 -53046 3012 81749 47724 31473 19009 26268
27135B6268n2458n0321j3198M9000j2574J256P4071J5309m7468n8927j6961N2835
$$ 26268 -26190 -76511 -89709 -40709 -53283 -52027 22044 37353 -10115 -69042 -86003 -33168
27123c3168L8407j3087K4066o160j8497M7437P3124k1389J0146o542j1768m5458
$$ -33168 5239 -7848 16218 10058 -8439 38998 112122 90733 100879 94337 82569 37111
27111C7111K1358k298l7040L6093J4922J2033l3721Q43l7354r3573k8258M3523
$$ 37111 58469 56171 19131 55224 70146 82179 48458 49301 11947 -81626 -109884 -66361
27099f6361N2020R8719P5263p4556j16407j6644m22M9713L717j5532k2422L0115
$$ -66361 -14341 84378 159641 85085 -31322 -47966 -48388 1325 5042 -10490 -32912 -2797
27087b797N1917K1247k0223n3949o0927P8933K8795j7012Q4L8742P2868J6698
$$ -2797 49120 70367 50144 -3805 -64732 14201 42996 25984 26068 64810 137678 154376
27075A54376r1980m9121J4467L3108k5782o3570k9403K6969j6174k2575R8092
$$ 154376 62396 13275 27742 60850 35068 -28502 -57905 -30936 -47110 -69685 28407
27064B8407Q0479j0533r7430n8582M2109J2059N7445J8913J2817L364J3582J1239
$$ 28407 108886 98353 923 -57659 -15550 -3491 53954 72867 85684 89048 102630 113869
27052A13869l1555k6482m9121j0714K1252J0486m589m0292o2073k6603L4480J6217
$$ 113869 82314 55832 6711 -4003 17249 27735 23146 -17146 -79219 -105822 -71342 -55125
27040e5125J7405Q3968L035n4715k6109L0548L4664k4789l9811n0876o9132j2086
$$ -55125 -37720 46248 49283 -5432 -31541 -993 33671 8882 -30929 -81805 -150937 -163023
27028a63023Q9669L9007J6000N4707L0022L6747j250l7355l7529k6995L2923J8636
$$ -163023 -73354 -34347 -18347 36360 66382 103129 101879 64524 26995 0 32923 51559
27016E1559K2694p531n9840n590J97k8534O8811L4066q465n3268k7125j5802n5372
$$ 51559 74253 66722 6882 1292 1489 -27045 41766 75832 67367 14099 -13026 -28828 -84200
27003h4200J8912j9597L0921Q1469J9873l1090j9566p884L2125J834m5477j8738
$$ -84200 -65288 -84885 -53964 27505 47378 16288 -3278 -11162 20963 22797 -22680 -41418
26991d1418l7224P308r164J1108m1711Q608j0893N493j148l0814J6671J48892
$$ -41418 -78642 -71334 -80498 -69390 -111101 -102493 -113386 -107893 -109041 -139855 -123184 25708
26979B5708J13390M242o1482l4780p2551K1146M1254k8699r2520k7533Q5449L4266
$$ 25708 139098 143340 81858 47078 -25473 -4327 36927 8228 -84292 -111825 -26376 7890
26967G890L3620K8405J4064k6890k412L0801l3941N1363K9046p621m0068n63q4897
$$ 7890 41510 69915 83979 57089 54677 85478 51537 102900 131946 124325 84257 83694 -1203
26954a203n0339Q3718N1152j2441o7306K0238P7780k304K7901P869j5618m3817
$$ -1203 -51542 32176 83328 70887 3581 23819 101599 99295 127196 135065 119447 75630
26942G5630o0046K6454r302m3873N4157N2680j4861n8538J8409n3144j873K4034
$$ 75630 15584 42038 32736 -11137 43020 95700 80839 22301 40710 -12434 -14307 9727
26930I727m4506o7577j4505N4222O9208L1397l8205l631N5286o046k7086p3427
$$ 9727 -34779 -102356 -116861 -62639 6569 37966 -239 -3870 51416 45370 18284 -55143
26918e5143q5996P7710J05324j0263j3318l0223j8229l5887n5133K936O0408M4220
$$ -55143 -141139 -63429 41895 31632 18314 -11909 -30138 -66025 -121158 -118222 -57814 -13594
26906a3594J8726R26K7963P241o3073j2449j5282j1445K6433M2274J3125J3498
$$ -13594 5132 6058 34021 41262 -21811 -34260 -49542 -60987 -34554 7720 20845 34343
26894C4343J2142O4754O42l76k7768m3811n3765j7166Q4281j9123p536m1297k6057
$$ 34343 46485 111239 111881 111505 83737 39926 -13839 -31005 53276 34153 26617 -14680 -40737
26881d0737l2812l0053L9879p3613J3767R2392J864m6680m8015o5864J52427R1186
$$ -40737 -73549 -103602 -63723 -137336 -123569 -31177 -29313 -75993 -124008 -189872 -37445 53741
26869E3741j3438K0792J553m3411m7075k8150K6054M0222P3224J4195m0568l8744
$$ 53741 40303 61095 62648 19237 -27838 -55988 -29934 10288 83512 97707 57139 18395
26857A8395R780K8829r922L274j3905N4450r0971l5971K7686M175k1880l6400
$$ 18395 28175 57004 47082 50356 36451 90901 -70 -36041 -8355 -4180 -26060 -62460
26845f2460O480P56L7329k2972j8801L8214l3613o487J4096j8440L5282N862M4751
$$ -62460 -55980 -55224 -17895 -40867 -59668 -21454 -55067 -61554 -47458 -65898 -30616 -24754 19997
26832A9997M5687K8438k3407m3658N9804J8937m1106l7792M5821n1215n6807j519
$$ 19997 65684 94122 70715 27057 86861 105798 64692 26900 72721 21506 -35301 -36820
26820c6820L2773k5056L1463O5163L7629j687m6478o9736l6488k7013M0465J3611
$$ -36820 -4047 -29103 2360 67523 105152 103465 56987 -12749 -49237 -76250 -35785 -22174
26808b2174M945M8652K6756j196l8634J1740M420o0181k0580L6341R8136o577
$$ -22174 -17229 31423 58179 56983 18349 30089 34509 -25672 -46252 -9911 88225 81648
26796H1648q1169p7513o7492k6371O0628O0652N3202L8008K3534p8577o5334j9956
$$ 81648 479 -77034 -144526 -170897 -110269 -49617 3585 41593 65127 -13450 -78784 -98740
26784i8740O3434L7536L7877j8761q3831L1956M3026M2387J9935j5121p9985q7701
$$ -98740 -35306 2230 40107 21346 -62485 -30529 12497 54884 74819 59698 -20287 -107988
26772a07988L6151J5902m5412j7938L3224N170o1305O0864K2368o333L3964J4921
$$ -107988 -71837 -55935 -101347 -119285 -86061 -80891 -142196 -81332 -58964 -65297 -31333 -16412
26760a6412M2010N6504K6109o5959p7404N1540M2901K4031n5152o8899O9959l9502
$$ -16412 25598 82102 108211 42252 -35152 16388 59289 83320 28168 -40731 29228 -10274
26748a0274k2341k9914m7581M5044M4932K6134N0215L6674K2094J8815n9119n7250
$$ -10274 -32615 -62529 -110110 -65066 -20134 6000 56215 92889 114983 133798 74679 17429
26736A7429l4945j7752m2186p175K4609k7256l8253N6914L1379J1168j2602L2874
$$ 17429 -17516 -35268 -77454 -84629 -60020 -87276 -125529 -68615 -37236 -26068 -38670 -5796
26724e796N5673L8389k1564k3133k7585o157N9608M7004n02L037l3437p4477O787
$$ -5796 49877 88266 66702 43569 15984 9827 69435 116439 115937 118974 85537 11060 17847
26711A7847M8463P667l4187Q476J9294l6014P437L3855P9357o0554p8213m5460
$$ 17847 66310 73977 39790 48266 67560 31546 38983 72838 152195 91641 13428 -32032
26699c2032m6709j4462n5971P5130J28228j663j3686Q504l743j5225k2464K3982
$$ -32032 -78741 -93203 -149174 -74044 54184 52521 38835 47339 43596 28371 5907 29889
26687B9889M6239j8364o640N9859k3527l0752l5450l5357J12161K2115k4512k1751
$$ 29889 76128 57764 51124 110983 87456 56704 21254 -14103 98058 120173 95661 73910
26675G3910o7306k0882P209j6355J5686J683j1001o0892k9012J3832J8719M838
$$ 73910 6604 -14278 -7069 -23424 -7738 -6055 -17056 -77948 -106960 -93128 -74409 -69571
26663f9571R247P1741L9312k4048m4522J1862M3214j0148p1234K5612K2557K9924
$$ -69571 -60324 11417 50729 26681 -17841 -5979 37235 27087 -44147 -18535 4022 33946
26651C3946k452k6289j9374K1488l5712K0288J1636P5736k0571k0877J7759j7963
$$ 33946 31494 5205 -14169 7319 -28393 -8105 3531 79267 58696 37819 55578 37615
26639C7615o2154N8719K9382L2504R421n0971m6908n9208n1304R399k4079J9465
$$ 37615 -24539 34180 63562 96066 105487 54516 7608 -51600 -102904 -93505 -117584 -98119
26627i8119M0131m02j9433L5495M2605L375o9917j3160O4590P5748k9491K5741
$$ -98119 -57988 -58390 -77823 -42328 277 3652 -66265 -79425 -14835 60913 31422 57163
26615E7163J5841k5548Q8409L6789q3596j1950O8442r920m8020m3033N926n2356
$$ 57163 73004 47456 135865 172654 89058 77108 145550 135630 87610 44577 50503 -1853
26603a853m6284J7067k1344M0490P991N1899o3800J0541O4012l1348m594k3365
$$ -1853 -48137 -31070 -52414 -11924 -3933 47966 -15834 -5293 58719 27371 22777 -588
26591e88j1804j1972J6950O2683K1711J4770L3729l6882p3145o0296k1394L6305
$$ -588 -12392 -24364 -7414 55269 76980 91750 125479 88597 15452 -44844 -66238 -29933
26579b9933J8317P4268j1014m4402j09553j9151K5053L5842L4512l2086R962R4875
$$ -29933 -11616 62652 51638 7236 -102317 -121468 -96415 -60573 -26061 -58147 -48185 46690
26567D6690L1303m0657P5904M1238k3490m3121j27670j7975n8672N3355K9238
$$ 46690 77993 37336 113240 154478 130988 87867 -39803 -57778 -116450 -63095 -33857
26556c3857n222k4085P8809P0282K993o1226n2242Q3860P546L6293m1962j9621
$$ -33857 -39079 -63164 15645 85927 88920 27694 -24548 59312 66858 103151 61189 41568
26544D1568o3538J9971O3825M590R480o0454m2382J2578M6402K5432O069J544
$$ 41568 -21970 -1999 61826 66416 75896 15442 -26940 -14362 32040 57472 63541 65085
26532F5085M762l7989n0450j5417k2842l5686k9098J16637K9648j7789j0967l0737
$$ 65085 69847 31858 -18592 -34009 -56851 -92537 -121635 -4998 24650 6861 -4106 -34843
26520c4843M2439j190P5309K4878j62806k0180Q0112j4639O8690K1131q5422J0330
$$ -34843 7596 6406 81715 106593 -56213 -76393 3719 -10920 57770 78901 -6521 3809
26508C809P6570L7754r5548n8517l974k1519L3744L9275j2418O577K5766L0917
$$ 3809 80379 118133 22585 -35932 -39906 -61425 -27681 11594 -824 5753 31519 62436
26496F2436o5204l2222L9491M3856k5240l1399n2730L7304L3485p4815n9154J8012
$$ 62436 -2768 -34990 4501 48357 23117 -8282 -61012 -23708 9777 -65038 -124192 -106180
26484a06180N2837l0862K545k3049O1813L2225K2541l7608l6892K9759P0329N0552
$$ -106180 -53343 -84205 -81660 -104709 -42896 -10671 11870 -25738 -62630 -32871 37458 88010
26472H8010o1644n3438l5262j0983M4840N0224r2471n0539N2544J7286K2541K1503
$$ 88010 26366 -27072 -62334 -73317 -28477 21747 -70724 -121263 -68719 -51433 -28892 -7389
26460g389L8690k837o5254l546K4493o4585l3952R343L6496J47433J5312k0776
$$ -7389 31301 28464 -36790 -40336 -15843 -80428 -114380 -105037 -68541 78892 94204 73428
26448G3428K7302M185p4115r5961l6261l1474L1861o451M4784P7019L7660K4222
$$ 73428 100730 104915 30800 -65161 -101422 -132896 -101035 -107486 -62702 14317 51977 76199
26436G6199P7597l779j41472k5963O8843M0324M1608q2963k1481k7307m5387K5475
$$ 76199 153796 150017 8545 -17418 51425 91749 133357 50394 28913 1606 -43781 -18306
26424a8306J10298J18900J6115m8924o6066l9822J771p650J3498o1321j2561k6871
$$ -18306 91992 210892 227007 178083 112017 72195 73966 66316 79814 18493 5932 -20939
26412b0939N5211Q9794j8966n0262j6663K8510j1379m475l1845j1461L8813k9452
$$ -20939 34272 124066 105100 54838 38175 66685 55306 50831 18986 7525 46338 16886
26400A6886l4119l0661M0950O7794O355o0656L9189Q1449l4271m4237n2679K5329
$$ 16886 -17233 -47894 -6944 60850 67205 6549 45738 127187 92916 48679 -4000 21329
26388B1329J2901L3827J2265O1614r2472q7151l3041O8653O3430k4357j7349k257
$$ 21329 34230 68057 80322 141936 49464 -37687 -70728 -2075 61355 36998 19649 17392
26376A7392j0397q3011j0464L7737O6547P820l653j5178N2927r417l0183n0983
$$ 17392 6995 -76016 -86480 -48743 17804 25624 21971 6793 59720 50303 20120 -30863
26364c0863o5875J801j362J6201J6402M1869K5953n8958k2930R4672J3116K685
$$ -30863 -96738 -94937 -96299 -80098 -63696 -21827 4126 -54832 -77762 16910 30026 32711
26352C2711J2701j5033j1361J4804n1063m3337K7856j1565k0469k9363j415Q8294
$$ 32711 45412 30379 19018 33822 -17241 -60578 -32722 -44287 -64756 -94119 -95534 -7240
26340g240Q5386p2864k1837j3344N219L8641M3394n8641P0002Q474l8750o6354
$$ -7240 78146 5282 -16555 -29899 -24680 13961 57355 -1286 68716 77190 38440 -27914
26328b7914J3279j0184M1569m682J1464O5815L3323O733j06048j4394K5208k169
$$ -27914 -14635 -24819 16750 12068 23532 89347 122670 129403 23355 8961 34169 32000
26316C2000j2871m3908n3679o7344p402N5711O7731L0616o6147n2149K458K1419
$$ 32000 19129 -24779 -78458 -145802 -153204 -97493 -29762 854 -65293 -117442 -114984 -93565
26304i3565L0854N3586L064j3827M012Q1839N7736l0486j26062k590j3629q3394
$$ -93565 -62711 -9125 -6061 -19888 -15876 65963 123699 93213 -32849 -35439 -49068 -132462
26292a32462o2880J9633J4587P7462M3901j5248p841k5515K2383N1388l9191o1820
$$ -132462 -195342 -175709 -161122 -83660 -39759 -55007 -62848 -88363 -65980 -14592 -53783 -115603
26280a15603L7573k6815K0902P4363l6439p3427K4009L8466K4159M4462K4P519
$$ -115603 -78030 -104845 -83943 -9580 -46019 -119446 -95437 -56971 -32812 11650 11674 19193
26268A9193j2420l1338o34n5824k5560K628R193M862N9592K0468J5295N2505N2222
$$ 19193 6773 -24565 -25199 -81023 -106583 -103955 -94762 -89900 -30308 -9840 5455 57960 110182
26255A10182J5044m1006p617K4818l1934p7735j2768K1915j3006o232n0026q2138
$$ 110182 125226 84220 76603 101421 69487 -8248 -21016 899 -12107 -18339 -68365 -150503
26243a50503K8811R2906N4728K5350r0000N69O5916m8788r0900K8538J1067k5244
$$ -150503 -121692 -28786 25942 51292 -38708 -38139 27777 -21011 -111911 -83373 -72306 -97550
26231i7550N0051J01758L0927k9222O2600p541J3725j5179j3559N684j092m251
$$ -97550 -47499 54259 85186 55964 118564 111023 124748 109569 96010 101694 100602 96351
26219I6351n0719k2945N134L5912J3918M0696P965l6990q0967o1423K6681Q3J4912
$$ 96351 45632 22687 27821 63733 77651 118347 126312 89322 8355 -53068 -26387 -26304 -11392
26206a1392J3146O16K0256l9059n8325K6775J4568O4183l9306j6886K9731m3222
$$ -11392 1754 2370 22626 -16433 -74758 -47983 -33415 30768 -8538 -25424 4307 -38915
26194c8915l0342N1211q0517q545j5601p798M8521J2884L6797K7084j6121J123
$$ -38915 -69257 -18046 -98563 -107108 -122709 -130507 -81986 -69102 -32305 -5221 -21342 -20219
26182b0219n6453N7836R446L9832K1318j7509l5974p8393Q62O9075N7994n0174
$$ -20219 -76672 -18836 -9390 30442 51760 34251 -1723 -80116 -79254 -10179 47815 -2359
26170b359n5550L9156L7446O7448k0397m7718l1774l7195k7303n271J38149J12227
$$ -2359 -57909 -18753 18693 86141 65744 18026 -13748 -50943 -78246 -83517 54632 166859
26158A66859J4336p1911o3704L704M8936R493M6718l5109q9823K1693M5499l6579
$$ 166859 181195 109284 45580 49284 98220 107713 154431 119322 29499 51192 96691 60112
26146F0112O610l8638p8171J7561M0879N1490P2689q432q3385j4636n8054J2387
$$ 60112 66722 28084 -50087 -32526 8353 59843 132532 124100 40715 26079 -31975 -19588
26134a9588j6547L7829M7263Q280k6432l8053L944l4088p4568K0095l1675j610
$$ -19588 -36135 1694 48957 57237 30805 -7248 -3304 -37392 -111960 -91865 -123540 -125150
26122a25150J06591R4254J514O9985k7391k7475J6682j0256k8508O6383K7978
$$ -125150 -18559 75695 77209 147194 119803 92328 109010 98754 70246 136629 164607
26111A64607j00927l8587p995J6831P219p6554m4034o388o1512q4519K1594O3328
$$ 164607 63680 25093 17098 33929 41148 -35406 -79440 -85828 -147340 -231859 -210265 -146937
26099a46937J17271K0262o5841j8695L6286R0157j7815o9974N4769N0320K9071
$$ -146937 -29666 -9404 -75245 -93940 -57654 32503 14688 -55286 -517 49803 78874
26088G8874K0883L4134K219k7453r508o8691k7248L0857l1826p705K8313J32062
$$ 78874 99757 133891 136110 108657 99149 30458 3210 34067 2241 -5464 22849 154911
26076A54911l3876p0209p8340q5697j6166K4868Q1196l2204m934K6280O2325N7546
$$ 154911 121035 50826 -27514 -113211 -129377 -104509 -23313 -55517 -60451 -34171 28154 85700
26064H5700n4338n4064N1141K418l6529K9723o0033n5405k8814P7853N0630r771
$$ 85700 31362 -22702 28439 30857 -5672 24051 -35982 -91387 -120201 -42348 8282 -1489
26052a489l1646p6464j1772J2705N910K1535L5107P8279K559k0915K630J3945
$$ -1489 -33135 -109599 -121371 -108666 -102756 -81221 -46114 32165 34724 13809 16439 30384
26040C0384O5186L196o7695L461J908J0553p639J8594m6055j6184j3876K3401
$$ 30384 95570 98766 31071 34532 36440 46993 39354 57948 11893 -4291 -18167 5234
26028E234O258j8854M96m334k4795K1373j8194O249m3737M5277j3209j9818N6722
$$ 5234 11492 -7362 -6866 -11200 -35995 -14622 -32816 -26567 -70304 -25027 -38236 -58054 -1332
26015a332L9691J97l5420R851R48J5262P012L8387l2166J119M5113l6962r3734
$$ -1332 38359 38556 3136 12987 13935 29197 36209 74596 42430 43549 88662 51700 -42034
26002d2034l0530j6529J0280O3950L4550L4943M464j22162r0541K1843O7186J9181
$$ -42034 -72564 -89093 -78813 -14863 19687 54630 59094 -63068 -153609 -131766 -64580 -45399
25990d5399J8225j3880O451o917Q543J7504K7416K3066j9875j993n0609J0993
$$ -45399 -27174 -41054 -34603 -41520 -32977 -15473 11943 35009 15134 13141 -37468 -26475
25978b6475O9243J3808j9907p3793j2874K2497l0412K3479J3333k945J1210K1337
$$ -26475 42768 56576 36669 -37124 -49998 -27501 -57913 -34434 -21101 -24046 -12836 8501
25966H501R603m0657N0441L1066k3613p5859p7467L1073L2736n6344K1521O7353
$$ 8501 18104 -22553 27888 58954 35341 -40518 -117985 -86912 -54176 -110520 -88999 -21646
25954b1646j6683J1173M1362n1973m3034O1253L3184J3905l128j4766J1211n1918
$$ -21646 -38329 -27156 14206 -37767 -80801 -19548 13636 27541 24413 9647 20858 -31060
25942c1060k0202J9662L567k4956m5171L8494o161L5939r576n218R0142k4481
$$ -31060 -51262 -31600 -28033 -52989 -98160 -59666 -65827 -29888 -39464 -44682 45460 20979
25930B0979K5054M7320l7373q2248m6641P2177O6649K0192j5220m6860Q135P6632
$$ 20979 46033 93353 55980 -26268 -72909 -732 65917 86109 70889 24029 32164 108796
25918A08796J1484j48312r4962J1839l083N8807m481j5473j6118O6041R3273J9323
$$ 108796 120280 -28032 -122994 -111155 -114238 -55431 -59912 -75385 -91503 -25462 67811 87134
25906H7134m5301J3616N861j3783L9263m3445j19932K6966m2766k8448J09084
$$ 87134 41833 55449 61310 47527 86790 43345 -76587 -49621 -92387 -120835 -11751
25895a1751N2492L6745Q571m4481k4825m2674j7970k6622j4456k1680O0812Q4001
$$ -11751 40741 77486 86057 41576 16751 -25923 -43893 -70515 -84971 -106651 -45839 38162
25883C8162L4593j8843l0154k2405L6112k785K592p2648l1958P9859N1424O945
$$ 38162 72755 53912 23758 1353 37465 34680 37272 -35376 -67334 12525 63949 70894
25871G0894j5643n7760m1883K5722M774j13728J3604J00907M8314M0961Q190o2923
$$ 70894 55251 -2509 -44392 -18670 -13896 -127624 -114020 -13113 35201 76162 84352 21429
25859B1429J862k8741m8898L7997N5977p5804o7926N0689J36331K7937o9550p612
$$ 21429 23291 -5450 -54348 -16351 39626 -36178 -104104 -53415 82916 110853 41303 33691
25847C3691j00580J5882J20496k7504m6077K8658j543q8881Q879K764L1774J8755
$$ 33691 -66889 -51007 69489 41985 -4092 24566 23023 -65858 -56979 -54215 -22441 -3686
25835c686k1205M8422L4955M2624l2204j5855M4305Q306K3729P020o5668l2272
$$ -3686 -24891 23531 58486 101110 68906 53051 97356 105662 129391 136411 70743 38471
25823C8471k2811k9104Q3669j5967o0654l9652p305M9761K2057l685L4398k4202
$$ 38471 15660 -13444 70225 54258 -6396 -46048 -53353 -3592 18465 14780 49178 24976
25811B4976j1529K6427M702p0499j1446L915r140P7515k951L1665N3330m0964
$$ 24976 13447 39874 44576 -25923 -37369 -33454 -42594 34921 31970 63635 116965 76001
25799G6001m6416j7260j7876K1511L9533L8941J4600p5761o672R479l8052m3455
$$ 76001 29585 12325 -5551 15960 55493 94434 109034 33273 26601 36080 -1972 -45427
25787d5427m8874J684O4162J0758m3179n0127n882Q8726Q3515m2229k0787N6864
$$ -45427 -94301 -92617 -28455 -17697 -60876 -111003 -116885 -28159 55356 13127 -7660 49204
25775D9204K3661k5215l2035O2580P3723J5123p1239l8542l3538q876n1102p4795
$$ 49204 72865 47650 15615 78195 151918 167041 95802 57260 23722 14846 -36256 -111051
25763a11051L5403o98k1784L667k301p763k9499l8604J8379R9159M808j06026
$$ -111051 -75648 -76346 -98130 -94463 -96764 -104527 -134026 -172630 -154251 -55092 -50284 -156310
25751a56310o4279M7943M3123M1317O4810J8427J7496M8891O4560o7124l8696
$$ -156310 -220589 -172646 -129523 -88206 -23396 -4969 12527 61418 125978 58854 20158
25740B0158K3130o4189m0032m4273j07434M443J21444q825J500M9336R1491L3536
$$ 20158 43288 -20901 -60933 -105206 -212640 -208197 -86753 -95578 -94078 -44742 46749 80285
25728H0285l0513l5216j0307O2498k9970l7589J543K089N6959m455l0865l9159
$$ 80285 49772 14556 4249 66747 36777 -812 731 2820 59779 55324 24459 -14700
25716a4700m4566o62J00018N2574K2778l9725p1335k6451k113O339L2583O1061
$$ -14700 -59266 -59928 40090 92664 115442 75717 4382 -22069 -24182 -17843 14740 75801
25704G5801K3410k8644l0211P69P9941L236k1238m5198J4523K836m904R490o4952
$$ 75801 99211 70567 40356 41125 121066 124302 103064 57866 72389 75225 70321 79811 14859
25691A4859p1399L9272K0885m1455n165P9047m4225L038L6678o6370m3532n673
$$ 14859 -56540 -17268 3617 -37838 -43003 36044 -8181 -5143 31535 -34835 -78367 -84040
25679h4040N7986m4570j1247J18311P2386m4727m4640k2223Q629q61l1654O9929
$$ -84040 -26054 -70624 -81871 36440 108826 64099 19459 -2764 5865 5004 -26650 43279
25667D3279J5475K0988q6591k4857J0308J5218O6848J8920o6938m5027m8636J3039
$$ 43279 58754 79742 -6849 -31706 -21398 -6180 60668 79588 12650 -32377 -81013 -67974
25655f7974M4013O0101L6608J0728K2204j1516P4794M7340l1878n5834o5921k0508
$$ -67974 -23961 36140 72748 83476 105680 94164 168958 216298 184420 128586 62665 42157
25643D2157m696j268k2926k8251m2147N3719Q5456n2991j2748M0598J12294Q752
$$ 42157 37461 36193 13267 -14984 -57131 -3412 82044 29053 16305 56903 169197 177949
25631A77949m8627l7860q7772k2366l2661p0376N3008J39194M2569j621k8441
$$ 177949 129322 91462 3690 -18676 -51337 -121713 -68705 70489 113058 111437 82996
25620H2996j9349m2494p5213m366k0113l4704o5131O3226N7013j5577q1121q2623
$$ 82996 63647 21153 -54060 -58426 -78539 -113243 -178374 -115148 -58135 -73712 -154833 -237456
25608b37456J5363J15425R9492k5793l4317N1976K8918M3424J3061m6109L8965
$$ -237456 -222093 -106668 -7176 -32969 -67286 -15310 13608 57032 70093 23984 62949
25597F2949m5310p6454K2030k4842j3848L158j7180L7928j9072o393J4294N9719
$$ 62949 17639 -58815 -36785 -61627 -75475 -72317 -89497 -51569 -70641 -77034 -62740 -3021
25585c021J04864K3503j6048J1832n2813j09294k2659L7996M2948M8584l1438
$$ -3021 101843 125346 109298 121130 68317 -40977 -63636 -25640 17308 65892 34454
25574C4454m5156J3525j3728k1664M8814j9224K4228K1943j10376r0699m5432
$$ 34454 -10702 2823 -10905 -32569 16245 -2979 21249 43192 -67184 -157883 -203315
25563b03315j2528k4544J03409J22382Q9202k538n4758l7656K7085J00813l0030
$$ -203315 -215843 -240387 -136978 -14596 74606 72068 17310 -20346 6739 107552 77522
25552G7522r4146m9264K2908M2156k8257N8036L2712j29871n4201L892K0453P5651
$$ 77522 -16624 -65888 -42980 -824 -29081 28955 61667 -68204 -122405 -118513 -98060 -22409
25540b2409N4628r485p1326J7345K771M1369r3613n3027q6962R2030J25596K4824
$$ -22409 32219 22734 -48592 -31247 -28476 12893 -80720 -133747 -220709 -128679 -3083 21741
25528B1741m1054O2433K0211n2309J079K7106k315J3385l0005o5722k7913M8231
$$ 21741 -19313 43120 63331 11022 12101 39207 36892 50277 20272 -45450 -73363 -25132
25516b5132J09693L4526K2853n838J7494J3670n2979m9099r8083n3022M6283K0780
$$ -25132 84561 119087 141940 136102 153596 167266 114287 65188 -32895 -85917 -39634 -18854
25504a8854j7072j0114O8404J181j2537l5782K789N4618n9956l4857R817L3399
$$ -18854 -35926 -46040 22364 23545 11008 -24774 -21985 32633 -27323 -62180 -52363 -18964
25492a8964K8781K4573J7500q9292p1257J00119K3705L3701m2621j40697M8084
$$ -18964 9817 34390 51890 -37402 -108659 -8540 15165 48866 6245 -134452 -86368
25481h6368K9596n9204n8913n066k7992P9950Q3031r472L1424L030m1997R0802
$$ -86368 -56772 -115976 -174889 -179955 -207947 -127997 -44966 -54438 -23014 -19984 -61981 28821
25469B8821O1379o5890J9922k6202n2269k1679k939m1211n6496M9875Q0472l3530
$$ 28821 90200 24310 44232 18030 -34239 -55918 -58857 -100068 -156564 -106689 -26217 -59747
25457e9747K211M8597K9812L3478k095n1889j04553J8239J7733K3788J9827J01351
$$ -59747 -57536 -8939 20873 54351 52256 367 -104186 -85947 -68214 -44426 -24599 76752
25445G6752j5575k4578N830P201l1811l0575k8597M6943N545Q0130n2637o8968
$$ 76752 61177 36599 42429 49630 17819 -12756 -41353 5590 11135 91265 38628 -30340
25433c0340q6786q3410N851M6350O1793M5676L5595L2464j0006j5304O1868M9830
$$ -30340 -117126 -200536 -194685 -148335 -86542 -40866 -5271 27193 17187 1883 63751 113581
25421A13581k5387j6989j2340o0084L0403m0126P425l9339L2952J7613j6197m0072
$$ 113581 88194 71205 58865 -1219 29184 -10942 -3517 -42856 -9904 7709 -8488 -48560
25409d8560m1539J08929J8112l0626J8636P860m5835q10j2750m6460p4956Q8616
$$ -48560 -90099 18830 36942 6316 24952 32812 -13023 -13833 -26583 -73043 -147999 -59383
25397e9383R604o3919J37727J19688l339p5743j5831k656j9799n980l9715l1959
$$ -59383 -49779 -113698 24029 143717 140378 64635 48804 46148 26349 20369 -19346 -51305
25385e1305o5747O8582O648p335N009l1752K4962j1089K5383j176p087J2221p1731
$$ -51305 -117052 -48470 -41822 -49157 -44148 -75900 -50938 -62027 -36644 -37820 -44907 -32686 -104417
25372a04417l3667J44008R3435j6869j08963l7372p2066J18451O500p993m1077
$$ -104417 -138084 5924 99359 82490 -26473 -63845 -135911 -17460 -10960 -18953 -60030
25361f0030k9800J9279L0963n671N6607m1712J5767o1422l1123M883l1881R9213
$$ -60030 -89830 -70551 -39588 -45259 11348 -30364 -14597 -76019 -107142 -102259 -134140 -34927
25349c4927J20867l6216K649J0007j3745K2443o2395l8238m37J0995K3059m0863
$$ -34927 85940 49724 52373 62380 48635 71078 8683 -29555 -29992 -18997 4062 -36801
25337c6801o9881K0439K7210R9464M8608j7004p5450o2223L56K4530q858m8002
$$ -36801 -106682 -86243 -59033 40431 89039 72035 -3415 -65638 -65282 -40752 -49610 -97612
25325i7612N5374q508p212O049K0846m113k2562K9206Q984L4060J1274p5249m8388
$$ -97612 -42238 -50746 -57958 -51909 -31063 -35176 -57738 -28532 -19548 14512 25786 -49463 -97851
25312i7851q5818n6379L5820P1195j8270l1432l1388o702m061O1112P7354n7384
$$ -97851 -183669 -240048 -204228 -133033 -151303 -182735 -214123 -220825 -224886 -163774 -86420 -143804
25300a43804J4573J30916K9911m7526j2067l1443K6752l0130O1360P1290N3916
$$ -143804 -129231 1685 31596 -15930 -27997 -59440 -32688 -62818 -1458 69832 123748
25289A23748L6344k7524m0554p0744k0651p7159Q9656J1687n9014K4351l479K0852
$$ 123748 160092 132568 92014 21270 619 -76540 13116 24803 -34211 -9860 -13339 7513
25277G513l0912j4952J6992n5493J4216q552P3298k0840R680l6785J0338J5218
$$ 7513 -23399 -38351 -21359 -76852 -62636 -71188 2110 -18730 -9050 -45835 -35497 -20279
25265b0279J3880J0725K2128q7015J1668O3984K7102l7173L051L9611m6548l3206
$$ -20279 -6399 4326 26454 -60561 -48893 15091 42193 5020 8071 47682 1134 -32072
25253c2072k5160P8107J04308o450p3654O655L7783j7188p9028p3096j2102k977
$$ -32072 -57232 20875 125183 118733 45079 51734 89517 72329 -6699 -79795 -91897 -94874
25241i4874K5326M7111R475r819K1694m852q1384R0069j4510r2200j887K3002
$$ -94874 -69548 -22437 -12962 -22781 -1087 -5939 -87323 2746 -11764 -103964 -105851 -82849
25229h2849L2749k091J2374O7030k937l5024l3209K7868K975L279R846L5085Q7786
$$ -82849 -50100 -52191 -39817 27213 24276 -10748 -43957 -16089 -13114 -9835 11 35096 122882
25216A22882l1151o6226K4250l3557M6740K6689k8633L063J8634n3435n4374n8825
$$ 122882 91731 25505 49755 16198 62938 89627 60994 64057 82691 29256 -25118 -83943
25204h3943L6506l5919J0655N4205j2477N972Q8682M1130j463l7782K2675J5703
$$ -83943 -47437 -83356 -72701 -18496 -30973 -25001 63681 104811 103348 65566 88241 103944
25192A03944J4017n0247m2550P9237j899l2708L9494Q124o9324J4458L3889M3086
$$ 103944 117961 67714 25164 104401 102502 69794 109288 117412 48088 62546 96435 139521
25180A39521k6548L3308r307j33516j07001R671M2692O0166o6351j12252k2379
$$ 139521 112973 146281 136974 3458 -103543 -93872 -51180 8986 -57365 -169617 -191996
25169a91996L4289N7819L7173K7548k587l116l0989k0060M913Q564R4490p646
$$ -191996 -157707 -99888 -62715 -35167 -37754 -40870 -71859 -91919 -87006 -78442 16048 8402
25157H402K0991n2860l5326L7794j4402j3599l7209Q0563N4041M050k7700N2075
$$ 8402 29393 -23467 -58793 -20999 -35401 -49000 -86209 -5646 48395 52445 24745 76820
25145G6820L6543J644j2705J8376j02816o9837M6943M4872K9607J3084M261m6758
$$ 76820 113363 115007 102302 120678 17862 -51975 -5032 39840 69447 82531 86792 40034
25133D0034p0615K8045j00735m4845M9793Q4823L669J2570p9173l0780L7894q776
$$ 40034 -30581 -2536 -103271 -148116 -98323 -13500 -9831 2739 -76434 -107214 -69320 -78096
25121g8096J1530R125R0087O4800l1626p9489j38271L3844R9757J6392K4961P9055
$$ -78096 -66566 -57441 32646 97446 65820 -13669 -151940 -118096 -18339 -1947 23014 102069
25109A02069m0073p5114l8237K0491O3872J3164m2859Q628K7473N465r994p1802
$$ 102069 61996 -13118 -51355 -30864 33008 46172 3313 11941 39414 44879 34885 -36917
25097c6917J7954n1894K8255L6244K2782Q071m0272m0453Q660k7589N72K3121
$$ -36917 -18963 -70857 -42602 -6358 16424 24495 -15777 -56230 -47570 -75159 -74587 -51466
25085e1466N3030K2980j0481r9764m7300R4749R5956o3952n4894M1250L3844j0127
$$ -51466 1564 24544 14063 -85701 -133001 -38252 57704 -6248 -61142 -19892 13952 3825
25073C825o9346l9568K3231P6411R6983k9827r8234o3424O9751L8847l072L9523
$$ 3825 -65521 -105089 -81858 -5447 91536 61709 -36525 -99949 -30198 8649 5577 45100
25061D5100k3281m9412J7867K1155k191L0845j1642l7015n2198m1589K6189K7116
$$ 45100 21819 -27593 -9726 11429 9238 40083 28441 -8574 -60772 -102361 -76172 -49056
25049d9056j0051L1093P6895K5718l0082j4488q5773k4196K9111j4341m561N40
$$ -49056 -59107 -28014 48881 74599 44517 30029 -55744 -79940 -50829 -65170 -69731 -69191
25037f9191J0684j5582J00941k1173L2917J9340l239j8329M2515J5226l5416L5899
$$ -69191 -58507 -74089 26852 5679 38596 57936 54697 36368 78883 94109 58693 94592
25025I4592l1460p8817m656k6194L492l135N6995J7628q4510k9213L7169k5759
$$ 94592 63132 -15685 -20341 -46535 -43043 -46178 10817 28445 -56065 -85278 -48109 -73868
25013g3868N0710K7873k8397m5939k883K5254J4825O337K8292p89n9624j9459
$$ -73868 -23158 4715 -23682 -69621 -72504 -47250 -32425 -26088 2204 1415 -58209 -77668
25001g7668O1197m6900k6398O500M3211N6730Q1786k5260j28877l2869M9376P116
$$ -77668 -16471 -63371 -89769 -83269 -40058 16672 98458 73198 -55679 -88548 -39172 -32056
24989c2056k5010l8577O8936J00630N806j8426Q3713o1003j21915j9372P7130
$$ -32056 -57066 -95643 -26707 73923 79729 61303 145016 84013 -37902 -57274 19856
24978A9856k0670r1506O881M5319N9531N439k2852p5383k8462N3737J7403J3788
$$ 19856 -814 -92320 -85439 -40120 19411 24850 1998 -73385 -101847 -48110 -30707 -16919
24966a6919L9824j9529p8919n3416O3854J10711N7187J4208Q511k6849p2243j10688
$$ -16919 22905 3376 -75543 -128959 -65105 45606 102793 117001 125512 98663 26420 -84268
24954h4268O019O0556J3051l878j544j3236J1908N8856R410k8720l8503L3802
$$ -84268 -78249 -17693 -4642 -8520 -10064 -23300 -11392 47464 56874 28154 -10349 23453
24942B3453m4300m1679J3402L2410N5180O4761K430m8952J37K233J0086l1426
$$ 23453 -20847 -62526 -49124 -16714 38466 103227 105657 56705 56842 59075 69161 37735
24930C7735j3121j7015k2137l8013N3620R1049m7131n6426l5891P6062q8590O7579
$$ 37735 24614 7599 -14538 -52551 1069 92118 44987 -11439 -47330 28732 -59858 7721
24918G721O7656J3073q535n447p8866j4964k6077q3140L5462N5799J7167k3682
$$ 7721 75377 88450 79915 74468 -4398 -19362 -45439 -128579 -93117 -37318 -20151 -43833
24906d3833n3093O0234P0465j16695k9602K6811J3700O61J4855M5079K9813k2233
$$ -43833 -96926 -36692 33773 -82922 -112524 -85713 -72013 -71352 -56497 -11418 18395 -3838
24894c838R060N7686J02090q7461m9510q77M764j5321O822K5484n921o3359j5960
$$ -3838 5222 62908 164998 77537 28027 27150 31914 16593 23415 48899 42978 -20381 -36341
24881c6341m402K2437K9991J2957n4521m8946l7944L7557N5995K832M435p315
$$ -36341 -40743 -18306 11685 24642 -29879 -78825 -116769 -79212 -23217 -20385 -15950 -23265
24869b3265o5955j9402J6243Q6777M7121m0711J5654L0485l1045o0581L5258L5271
$$ -23265 -89220 -108622 -92379 -5602 41519 808 16462 46947 15902 -44679 -9421 25850
24857B5850p609L3043j4657k2408n7561j5226l487m0788N7362M973m2966o993
$$ 25850 18241 51284 36627 14219 -43342 -58568 -62055 -102843 -45481 -40508 -83474 -90467
24845i0467K2902K2478O1010J8622l8960l8988M0628P4455j5133k0057l2648K998
$$ -90467 -67565 -45087 15923 34545 -4415 -43403 -2775 71680 56547 36490 3842 6840
24833F840J045l9541l6692n1542P1595L9870p3988L6783J1224n9428N4844P1212
$$ 6840 7885 -31656 -68348 -119890 -48295 -8425 -82413 -45630 -34406 -93834 -38990 32222
24821C2222r0217o4772N4329R5636O5917o2779q4410m4474l4818J5694P784O5994
$$ 32222 -57995 -122767 -68438 27198 93115 30336 -54074 -98548 -133366 -117672 -109888 -43894
24809d3894L9047k3781l3421l6538m030O9947N8574M5963q5068m5684j0704r518
$$ -43894 -4847 -28628 -62049 -98587 -102617 -32670 25904 71867 -13201 -58885 -69589 -79107
24797g9107j585j4360k5317R421K5308N3825J43074l1975o4458m8081n6003N9137
$$ -79107 -80692 -95052 -120369 -110948 -85640 -31815 111259 79284 14826 -33255 -89258 -30121
24785c0121Q5171k0681l8375l8199j7406N3144k1216K2497M699m3547j7700K7158
$$ -30121 55050 34369 -4006 -42205 -59611 -6467 -27683 -5186 -487 -44034 -61734 -34576
24773c4576R1874J1714N624J7437J5570J5101l5855o6011o2683M2169j8589o2507
$$ -34576 57298 69012 74636 92073 107643 122744 86889 20878 -41805 364 -18225 -80732
24761h0732l6228K7932J6380L9715j541J4157O3324K3592j12738m4078j004k6624
$$ -80732 -116960 -89028 -72648 -32933 -34474 -20317 43007 66599 -46139 -90217 -91221 -117845
24749a17845Q811j130O3946K9813p025J9452J2458L4469J1930l5771J6603l0269
$$ -117845 -109034 -110164 -46218 -16405 -23430 -3978 8480 42949 54879 19108 35711 5442
24737E442q7146k5813q239k4861N4976J2438j0161L2185j4583n1484J886P3997
$$ 5442 -81704 -107517 -115756 -140617 -85641 -73203 -83364 -51179 -65762 -117246 -115360 -41363
24725d1363K2784p4958J4808Q6517o135l6891K6926K6110R937q132n7561m8429
$$ -41363 -18579 -93537 -78729 7788 1653 -35238 -8312 17798 27735 19603 -37958 -86387
24713h6387k4721N8418O1102K0450k5591K6868j060L8340j1933n3233P749N9009
$$ -86387 -111108 -52690 8412 28862 3271 30139 29079 67419 55486 2253 10002 69011
24701F9011L1412l7271k3197j1510K2074O8169k2267j5667n5870l9179M1934j6199
$$ 69011 100423 63152 39955 28445 50519 118688 96421 80754 24884 -14295 27639 11440
24689A1440n8079k3792O6061n456J1875O330m6153K0244L4893J0843n5662q635
$$ 11440 -46639 -70431 -4370 -9826 2049 8379 -37774 -17530 17363 28206 -27456 -36091
24677c6091j5218m4684K806P7166L5488O5170l4688k1543M6962M4777m2562n9407
$$ -36091 -51309 -95993 -93187 -16021 19467 84637 49949 28406 75368 120145 77583 18176
24665A8176p2668O5117K9595j281j581o7340M7249M2972N2296j1936p044l5480
$$ 18176 -54492 10625 40220 38939 37358 -29982 17267 60239 112535 100599 93555 58075
24653E8075r8971k2152Q8856L9721n5175m511O8768j8417m3814j5480K206L3513
$$ 58075 -40896 -63048 25808 65529 10354 5843 74611 56194 12380 -3100 -894 32619
24641C2619M1566p974m2283j6489j4039O5066J1055m400l057n4421n930Q338N7806
$$ 32619 74185 66211 23928 7439 -6600 58466 69521 65121 62064 7643 1713 10051 67857
24628F7857J2532m4771m4350Q241M6804K5418n6062m0412M4424O1182M1052m9603
$$ 67857 80389 35618 -8732 -491 46313 71731 15669 -24743 19681 80863 121915 72312
24616G2312n6049j3604L7649O002j0176m7214o585m1173k7062n8723p417K61L3460
$$ 72312 16263 2659 40308 46310 36134 -11080 -17665 -58838 -85900 -144623 -152040 -151779 -118319
24603a18319J6891L3659J6237j6849Q59M7123m7654k2651p553n2599Q2137J26535
$$ -118319 -101428 -67769 -51532 -68381 -67522 -20399 -68053 -90704 -98257 -150856 -68719 57816
24591E7816K3882q1558l0328j8525j3904n9540P5669Q4429K0193l0068r368M4048
$$ 57816 81698 140 -30188 -48713 -62617 -122157 -46488 37941 58134 28066 18698 62746
24579F2746k7250r941J4181M129k073n2950j4649K9504n726k0978l5204K0839
$$ 62746 35496 25555 39736 43865 41792 -11158 -25807 3697 -2029 -23007 -58211 -37372
24567c7372J43141J00892j11491j6649M5211r988r140k6911q499j21784n5940
$$ -37372 105769 206661 95170 78521 123732 113744 104604 77693 69194 -52590 -108530
24556a08530O0242J2695J1287K5434P299L8607M1065P5205m4952r5968l2894l6576
$$ -108530 -48288 -35593 -24306 1128 8427 47034 88099 163304 118352 22384 -10510 -47086
24544d7086N322O00J0951J681o2627q8454j2664l079N5544M2052r030K7512L9834
$$ -47086 -41764 -41164 -30213 -28532 -91159 -179613 -192277 -195356 -139812 -97760 -106790 -79278 -39444
24531c9444j3062L4007j9202J3102k1569j2332O1874M1135j4636k2601k1008L069
$$ -39444 -52506 -18499 -37701 -24599 -46168 -58500 3374 44509 29873 7272 -13736 -10667
24519a0667n394j0031J1317L2789J88L854Q678L7635J4810n070M403o3525l9937
$$ -10667 -16061 -26092 -14775 18014 18202 22056 30734 68369 83179 78109 82512 18987 -20950
24506b0950l830k249L7134J2776n3571m0741J0722Q7115K2219K5313m7015q4574
$$ -20950 -24780 -27029 10105 22881 -30690 -71431 -60709 26406 48625 73938 26923 -57651
24494e7651k2267M9371L7463r2656p8844M1904J23749R4699p0451l2941n5893
$$ -57651 -79918 -30547 6916 -85740 -164584 -122680 1069 95768 25317 -7624 -63517
24483f3517p9700O1379K1179J1556L5168l429l4019k1519J15084N7524k8580m9654
$$ -63517 -143217 -81838 -60659 -49103 -13935 -17364 -51383 -72902 42182 99706 71126 21472
24471B1472o3241p4420L0295J9275M6072L0140K9948r4005p6701J5153Q7105O4507
$$ 21472 -41769 -116189 -85894 -66619 -20547 9593 39541 -54464 -131165 -116012 -28907 35600
24459C5600o0040o7616K7092L5194o3630L8512L0155k6296k332m7147R792l8892
$$ 35600 -24440 -92056 -64964 -29770 -93400 -54888 -24733 -51029 -53361 -100508 -90716 -129608
24447a29608P2384j0932P0130L9545P3617L3370o8864j00310o0492j2337J8455
$$ -129608 -57224 -68156 1974 41519 115136 148506 79642 -20668 -81160 -93497 -75042
24436g5042R7258N7808k0997k5582J9950l4161J9586p6229j26085N092M9714M7326
$$ -75042 22216 80024 59027 33445 53395 19234 38820 -37409 -163494 -158402 -108688 -61362
24424f1362O3600K4707J6389J12471O5738m5496r3460n8122n623J009j8551l1083
$$ -61362 2238 26945 43334 155805 221543 176047 82587 24465 18842 19851 1300 -29783
24412b9783k7826K2005J8522n9967O032j3632l7896k8334P3241M4580R2804K0518
$$ -29783 -57609 -35604 -17082 -77049 -71017 -84649 -122545 -150879 -77638 -33058 59746 80264
24400H0264k6519O5264j11826l1518K4628l481j7885m5072O266R1137N4723j07031
$$ 80264 53745 119009 7183 -24335 293 -3188 -21073 -66145 -59879 31258 85981 -21050
24388b1050m7664J9842N6612n1062J2490Q5992M7041k2773J362j7989n9574r747
$$ -21050 -68714 -48872 7740 -43322 -30832 55160 102201 79428 80790 62801 3227 -6520
24376f520J049m4784r881p46K3519P4485P0869k4279j2639m3184J3965k5157J0327
$$ -6520 -5471 -50255 -60136 -60882 -37363 37122 107991 83712 71073 27889 41854 16697 27024
24363B7024N9712k4862J8047O612m8176M113l4130q4373K8762P9047N5011j2713
$$ 27024 86736 61874 79921 86533 38357 42470 8340 -76033 -47271 31776 86787 74074
24351G4074l5846k1884o3968K8798m6332L1468k07o5133J648Q5663M3904k6603
$$ 74074 38228 16344 -47624 -18826 -65158 -33690 -33897 -99030 -97382 -11719 32185 5582
24339E582K900l9285n6480J3241o361L2870P0363R2998m1623q6469r141k248j2353
$$ 5582 8482 -30803 -87283 -74042 -80403 -47533 22830 115828 74205 -12264 -21405 -23653 -36006
24326c6006L4109O516k6326p2446N8305L1250m4533j04211J0027M4617N9734q688
$$ -36006 -1897 4619 -21707 -94153 -35848 -4598 -49131 -153342 -143315 -98698 -38964 -47652
24314d7652m9362K7924K1216m7860m453P3921L2309p0484l0861M7852L8815m2561
$$ -47652 -97014 -69090 -47874 -95734 -100187 -26266 6043 -64441 -95302 -47450 -8635 -51196
24302e1196j18727j0726M7695J1551O8733L9992m6462j7903J8031M4714K1903
$$ -51196 -169923 -180649 -132954 -121403 -52670 -12678 -59140 -77043 -59012 -14298 7605
24291G605R736K8930N5627l2821m7588q3010k2389m9641o851N2412P635Q986J1236
$$ 7605 17341 46271 101898 69077 21489 -61521 -83910 -133551 -140402 -87990 -80355 -71369 -60133
24278f0133L4335M0436L0348m7490j15964n1131M5439N0123J4313L1147n606j7208
$$ -60133 -25798 14638 44986 -2504 -118468 -169599 -124160 -74037 -59724 -28577 -34183 -51391
24266e1391j0279m2842M9326N5291K3095N8123J3609K4406j0520p5927n5178m6007
$$ -51391 -61670 -104512 -55186 105 23200 81323 94932 119338 108818 32891 -22287 -68294
24254f8294K6730N647K6785j6918k8370L5685K4645L6962N8035L9142j6042n2908
$$ -68294 -41564 -35917 -9132 -26050 -54420 -18735 5910 42872 100907 140049 124007 71099
24242G1099L844n7665n672O306O51q78O5965L2236p1247k3004L6833l0873k3042
$$ 71099 74943 17278 11606 17912 18563 17685 83650 115886 44639 21635 58468 27595 4553
24229D553J4224N0547j22414j1534M3323J2748r8151J1155l2731L6970J17122
$$ 4553 18777 69324 -53090 -64624 -21301 -8553 -106704 -95549 -128280 -91310 25812
24218B5812R5881k6982k3759m4243p7113j2787N0939p4702n4891N8676J7203L3556
$$ 25812 121693 94711 70952 26709 -50404 -63191 -12252 -86954 -141845 -83169 -65966 -32410
24206c2410J4639N7215Q3757k880o5328j0932l4826k5234m9391n5304L429M2201
$$ -32410 -17771 39444 123201 120321 54993 44061 9235 -15999 -65390 -120694 -117265 -75064
24194g5064o067n287M7477M7023K8399j06689k4298N2476L4254m9068p9929Q3885
$$ -75064 -81131 -86418 -38941 8082 36481 -70208 -94506 -42030 -7776 -56844 -136773 -52888
24182e2888K745l4789n5362j10586K9164J58376N4989J1991P800k4152k1023N9762
$$ -52888 -50143 -84932 -140294 -250880 -221716 -63340 -8351 3640 11440 -12712 -33735 26027
24170B6027L6034l2482L1970j1688q4339m8992k3018j4656m7887P146O8855N5247
$$ 26027 62061 29579 61549 49861 -34478 -83470 -106488 -121144 -169031 -161885 -93030 -37783
24158c7783l3773o893m5461q8639N6766N985l0841M8504l5632j1869Q9102N8982
$$ -37783 -71556 -78449 -123910 -212549 -155783 -149798 -180639 -132135 -167767 -179636 -90534 -31552
24146c1552O4470l4526o0159K5127Q7319L4890j00851j9477m7068n3020k8582
$$ -31552 32918 -1608 -61767 -36640 50679 85569 -15282 -34759 -81827 -134847 -163429
24135a63429N3426O5983m170M5624N525n395q1644p5912Q6158K9385p6765N3056
$$ -163429 -110003 -44020 -48190 -2566 2959 -2436 -84080 -159992 -73834 -44449 -121214 -68158
24123f8158k9089m708M744L6139M0995L3880m3007M8971n3919l3900M8430K3203
$$ -68158 -97247 -101955 -97211 -61072 -20077 13803 -29204 19767 -34152 -68052 -19622 3581
24111C581o931k1235L8373K7099l1149j02195p2432L0652J3904N6772L012L8150
$$ 3581 -3350 -24585 13788 40887 9738 -92457 -164889 -134237 -120333 -63561 -60549 -22399
24099b2399j9274k1460K6220K5885N9736O3291j2728K5699j06917j9665R293m679
$$ -22399 -41673 -63133 -36913 -11028 48708 111999 99271 124970 18053 -1612 7681 3002
24087C002l313M6329m433m6043m5980M7467J9212j00348p7311L5737R414M1217
$$ 3002 -311 46018 41585 -4458 -50438 -2971 16241 -84107 -161418 -125681 -116267 -75050
24075g5050M0368K6620J2089j5686m1118l7660K5045O6479L1461l1352k3694O4736
$$ -75050 -34682 -8062 4027 -11659 -52777 -90437 -65392 1087 32548 1196 -22498 42238
24063D2238j3914k5342m3973R073k5775L337k589O945n7382K3063J08717J428
$$ 42238 28324 2982 -40991 -31918 -57693 -54356 -56945 -50000 -107382 -84319 24398 25826
24051B5826J2574O920L4266M3210j9007k9470n4193m7795j6843L2710L1749q713
$$ 25826 38400 45320 79586 122796 103789 74319 20126 -27669 -44512 -11802 19947 11234
24039A1234j9827j3844J5746J3697j6040J6173j65l7802O8274M0109m5253n498
$$ 11234 -8593 -22437 -6691 7006 -9034 7139 6974 -30828 37446 77555 32302 26804
24027B6804k635m2471j6275N7249j3277K2363o1371k8016k964J9550n6582N754
$$ 26804 24169 -18302 -34577 22672 9395 31758 -29613 -57629 -60593 -41043 -97625 -91871
24015i1871M0755j7204L3952l6305M8085P1155m8327o1054l4118R5043J8091o9717
$$ -91871 -51116 -68320 -34368 -70673 -22588 48567 240 -60814 -94932 111 18202 -51515
24003e1515j8889P3927Q233q2566M0918l2024L4069P5315j9000j08911j7768M0471
$$ -51515 -70404 3523 11756 -70810 -29892 -61916 -27847 47468 28468 -80443 -98211 -57740
23991e7740K4043j9133J8348P8791L9279M2064j6825L1009o5794n9008Q526l7307
$$ -57740 -33697 -52830 -34482 44309 83588 125652 108827 139836 74042 15034 23560 -13747
23979a3747n6120m6800j4011N0382Q6136m713L2293L6503k1065n803L1720K1321
$$ -13747 -69867 -116667 -130678 -80296 5840 1127 33420 69923 48858 43055 74775 96096
23967I6096l5646j6752p8892l6073k7369J6443J30286L71k5711q5029m5021L0720
$$ 96096 60450 43698 -35194 -71267 -98636 -82193 48093 48464 22753 -62276 -107297 -76577
23955g6577P491k4187m1091O387N4964Q7364L4346N8279j3708n1954P188n0920
$$ -76577 -69086 -93273 -134364 -127977 -73013 14351 48697 106976 93268 41314 48502 -2418
23943b418q9890p0257O8616P299m144M1509K707p3148k9352N0102M8036j9861
$$ -2418 -92308 -162565 -93949 -86650 -90794 -49285 -46578 -119726 -149078 -98976 -50940 -70801
23931g0801r2237m0425K3652N7380m1384m678N1284O972J4597k2244j2837l081
$$ -70801 -163038 -203463 -179811 -122431 -163815 -168493 -117209 -110237 -95640 -117884 -130721 -133802
23919a33802q315J1141j7715J770K7512J07130J5799K7649L21k1261p4417Q049
$$ -133802 -142117 -130976 -148691 -146921 -119409 -12279 3520 31169 31490 10229 -64188 -56139
23907e6139n292J8768l608l964K8732l795k929K0608O0008J6657M3146m0726p6866
$$ -56139 -61431 -42663 -46271 -50235 -21503 -25298 -28227 -7619 52389 69046 112192 71466 -5400
23894e400q825o430M4172j0427l4285K9316M5141Q634q1181L2782K5388J8979
$$ -5400 -14225 -20655 23517 13090 -21195 8121 53262 61896 -19285 13497 38885 57864
23882E7864K4055q140q8733o1929K3761L0056m020n8841r730K363P5622M5066
$$ 57864 81919 73779 -14954 -76883 -53122 -23066 -27086 -85927 -95657 -93294 -17672 27394
23870B7394m2633q9186l1538N5212j0941l2466q004N8415M9493N6741j984l0328
$$ 27394 -15239 -104425 -135963 -80751 -91692 -124158 -132162 -73747 -24254 32487 30503 175
23858A75J1979K1938k591j4250k7822L3899L8299j8208R763l8512q8015n237n5374
$$ 175 12154 34092 31501 17251 -10571 23328 61627 43419 53182 14670 -73345 -78582 -133956
23845a33956m2204k4999O3508L1410K5505R91j5394m1265O2399K0756L808p9227
$$ -133956 -176160 -201159 -137651 -106241 -80736 -79745 -95139 -136404 -74005 -53249 -49441 -128668
23833a28668P1992J66296M084p6278j1844M922l0525l6039R1772L8764J5925N615
$$ -128668 -56676 109620 113704 37426 25582 30504 -21 -36060 55712 94476 110401 116016
23821A16016o1143j55857l3797N5644M3591k3508J6800l6411O0705Q169p049L1104
$$ 116016 54873 -100984 -134781 -79137 -35546 -59054 -42254 -78665 -17960 -9791 -16840 14264
23809A4264l272K5659M2977k3146m9294M5292m9969l8841L4391k0041K7181j3963
$$ 14264 10992 36651 79628 56482 7188 52480 2511 -36330 -1939 -21980 5201 -8762
23797h762r6725r9557R2410J12265L5385r8081r3351n853M2401P5199P1110M6375
$$ -8762 -105487 -205044 -112634 -369 35016 -63065 -156416 -162269 -119868 -44669 26441 72816
23785G2816o8468o1469j0468J2226m4657L7330N2069q474j06656l922N1384L7886
$$ 72816 4348 -57121 -67589 -55363 -100020 -62690 -10621 -19095 -125751 -129673 -78289 -40403
23773d0403k3723o801l8992O5689K2428m8430K2218J1064l159K5730M5563n2919
$$ -40403 -64126 -70927 -109919 -44230 -21802 -70232 -48014 -36950 -40109 -14379 31184 -21735
23761b1735q3099N3344Q0072N923q4197L5636L0914J3762J2594k1845l2094J601
$$ -21735 -104834 -51490 28582 34505 -49692 -14056 16858 30620 43214 21369 -10725 -9124
23749i124P0976j3016j21756j5187J2102J13498M5062j8557M7962o0488m1181
$$ -9124 61852 48836 -72920 -88107 -76005 37493 82555 63998 111960 51472 10291
23738A0291K1379m0369K5588j9792o796Q8384K1508j9350k9103m4085n5695j1266
$$ 10291 31670 -8699 16889 -2903 -9699 78685 100193 80843 51740 7655 -48040 -59306
23726e9306K4384L8036m5156o0321k5930K6475K8187R3898l9126j806J2254j3112
$$ -59306 -34922 3114 -42042 -102363 -128293 -101818 -73631 20267 -18859 -20665 -8411 -21523
23714b1523P6217J8585n5793j959K7480M587p4761l0526j3582L2003n913m8798
$$ -21523 54694 73279 17486 15527 43007 47594 -27167 -57693 -71275 -39272 -45185 -93983
23702i3983n9714j8761O2632L0766O1501L0965o5400O5004j2654k2931M9981l5872
$$ -93983 -153697 -172458 -109826 -79060 -17559 13406 -51994 13010 356 -22575 27406 -8466
23690h466p0252o2312J5058O3268N9247j5584K7145P6920n9135q1110l2491L0292
$$ -8466 -78718 -141030 -125972 -62704 -3457 -19041 8104 85024 25889 -55221 -87712 -57420
23678e7420m2359o0065Q3951R4797K0739P354P115p0836n6609k488m5752K6093
$$ -57420 -99779 -159844 -75893 18904 39643 46997 54112 -16724 -73333 -75821 -121573 -95480
23666i5480l8214L5888K2115l5823J0515k9689k8821k466J0889l5089Q306Q5856
$$ -95480 -133694 -97806 -75691 -111514 -100999 -130688 -159509 -161975 -151086 -186175 -177869 -92013
23654i2013P8028M2312l0327o746n8321n1499M6138K9371l6665M9186M5883p5911
$$ -92013 -13985 28327 -2000 -8746 -67067 -118566 -72428 -43057 -79722 -30536 15347 -60564
23642f0564K3373Q4115Q1253R111n2413m6198P999M8779K5640j2820j22024m5578
$$ -60564 -37191 46924 128177 137288 84875 38677 46676 95455 121095 108275 -13749 -59327
23630e9327J6348L3673M1373k208k2789l1069m7070m3160O8292P0625k3256L4557
$$ -59327 -42979 -9306 32067 29859 7070 -23999 -71069 -114229 -45937 24688 1432 35989
23618C5989J05891M4542o3658o0308o265m8566p617J9379K5577L2930l2604L9084
$$ 35989 141880 186422 122764 62456 56191 7625 8 19387 44964 77894 45290 84374
23606H4374J3179M1468j992k4757L8643r056j8327m8529p2621n3290R4330m6344
$$ 84374 97553 139021 137029 112272 150915 141859 123532 75003 2382 -50908 43422 -2922
23594b922m4507m1882N8753K3692k5913J5583N9144m9348j140M8624L1634q0033
$$ -2922 -47429 -89311 -30558 -6866 -32779 -17196 41948 -7400 -8540 40084 71718 -8315
23582h315J9893Q6281q1427k7254K5005l1207o2433l196L9948n9677o316P5720
$$ -8315 11578 97859 16432 -10822 14183 -17024 -79457 -82653 -42705 -102382 -108698 -32978
23570c2978L0807j4039L931j1656k7785l5990m8531K3358L4147J04745l607o2158
$$ -32978 -2171 -16210 -12279 -23935 -51720 -87710 -136241 -112883 -78736 26009 22402 -39756
23558c9756r912n8650M7971N9247O1504l929k0373N3467J8135o8877j0340J950
$$ -39756 -49668 -108318 -60347 -1100 60404 56475 36102 89569 107704 38827 28487 30437
23546C0437o4031o018k0899J8164k5210N388K8651K3905J05423R3276M118r2021
$$ 30437 -33594 -39612 -60511 -42347 -67557 -62169 -33518 -9613 95810 189086 193204 101183
23534A01183m1941m0424p463r1122J3725L8642L6287J7897m0882k320P1872M2145
$$ 101183 59242 18818 11355 -79767 -66042 -27400 8887 26784 -14098 -16418 55454 97599
23522I7599J3731n2684j63885K4786L2196r162P3833L8494m3153J3694J3209K8144
$$ 97599 111330 58646 -105239 -80453 -48257 -57419 16414 54908 11755 25449 38658 66802
23510F6802N5837n8827n6940K2976l2920l2138l9079J2822P937N867K3151J3307
$$ 66802 122639 63812 6872 29848 -3072 -35210 -74289 -61467 -53530 -47663 -24512 -11205
23498a1205k4858r9440m5997R5362K6961L3985R9589J3629K6655k8051j3749m3060
$$ -11205 -36063 -135503 -181500 -86138 -59177 -25192 74397 88026 114681 86630 72881 29821
23486B9821o733r911P0775l4618n9515l0066k4384j9397K3866M7251j9138m200
$$ 29821 23088 13177 83952 49334 -10181 -40247 -64631 -84028 -60162 -12911 -32049 -36249
23474c6249J7492o8295q580P524p382j9219l2962l6012p140M3946K2235N8469
$$ -36249 -18757 -87052 -95632 -88108 -95490 -114709 -147671 -183683 -190823 -146877 -124642 -66173
23462f6173P6043J9777J210R799k3303J3963M1183k6783j13287k5070L3872p928
$$ -66173 9870 29647 30857 40656 17353 31316 72499 45716 -67571 -92641 -58769 -66697
23450f6697m8802M6786K5395M441k2659r3145K8502o916l080K3239L3941Q228
$$ -66697 -115499 -68713 -43318 -38877 -61536 -154681 -126179 -133095 -136175 -112936 -78995 -70767
23438g0767k5506k5114L9434O3769L197m5527p930K2342M9571L7784m14m8587
$$ -70767 -96273 -121387 -81953 -18184 -14987 -60514 -68444 -46102 3469 41253 40839 -7748
23426g748j7761l6266j5633M9472k2297p1053j0164L2604L0707o5204K6457R1323
$$ -7748 -25509 -61775 -77408 -27936 -50233 -121286 -131450 -98846 -68139 -133343 -106886 -15563
23414a5563N7937R614J3536m5177n2786m5145k4125K9362N1861j6202l6692o594
$$ -15563 42374 51988 65524 20347 -32439 -77584 -101709 -72347 -20486 -36688 -73380 -79974
23402g9974Q410l5894P6326J8239K6299L6660n997m5245l5092j3380k9870k4058
$$ -79974 -71564 -107458 -31132 -12893 13406 50066 44069 -1176 -36268 -49648 -79518 -103576
23390a03576M4389j3928j3944J7361k5918k6013L0138L2279K0543L7256P2463
$$ -103576 -59187 -73115 -87059 -69698 -95616 -121629 -91491 -59212 -38669 -1413 71050
23379G1050m5724m6477l6102j0717o6425L9830P0270l5611m4487K6556M9186K7625
$$ 71050 25326 -21151 -57253 -67970 -134395 -94565 -24295 -59906 -104393 -77837 -28651 -1026
23367a026P2629j5206m6068k3052k42L0441j0375Q936J0513k4393l6383j4888
$$ -1026 71603 56397 10329 -12723 -12965 17476 7101 16037 26550 2157 -34226 -49114
23355d9114L4299K2584k6621q413r818M2680N4999M5432o575p2097l7128j056
$$ -49114 -14815 7769 -18852 -27265 -37083 5597 60596 106028 99453 27356 -9772 -10828
23343a0828M093k0219K2662j0469l0956n5066K7267K8569N2908L7392j6377j2437
$$ -10828 -6735 -26954 -4292 -14761 -45717 -100783 -73516 -44947 7961 45353 28976 16539
23331A6539k6888O060N909j7846M253k5298n7669L7679K7272K317l8798K3797
$$ 16539 -10349 -4289 1620 -16226 -11973 -37271 -94940 -57261 -29989 -27672 -66470 -42673
23319d2673m5113O0353Q353K156L606l9044k713M9496R3876J770m5854K2540n8155
$$ -42673 -87786 -27433 -19080 -16924 -13318 -52362 -55075 -5579 88297 90067 44213 66753 8598
23306H598M0075r192L2692q5775K4343J01671j36M360j28367j37014l3417O1804
$$ 8598 48673 39481 72173 -13602 10741 112412 112276 116636 -11731 -148745 -182162 -120358
23294a20358L5519J10764K1744j4874L4417j5856k7394j3349j7282L0929M8772
$$ -120358 -84839 25925 47669 32795 67212 51356 23962 10613 -6669 24260 73032
23283G3032Q8680j4575q0253n8079n4484J7516N9650M4880j1877l9637j5151m6370
$$ 73032 161712 147137 66884 8805 -45679 -28163 31487 76367 64490 24853 9702 -36668
23271c6668Q227O7628L4115m4645r191l8647K04p305m4877m2341R137J03082M3152
$$ -36668 -28441 39187 73302 28657 19466 -19181 -18977 -26282 -71159 -113500 -104363 -1281 41871
23258D1871L1389j2985o2897j2000P6704K6989o1469j10721p391M087j6641M6707
$$ 41871 73260 60275 -2622 -14622 62082 89071 27602 -83119 -90510 -86423 -103064 -56357
23246e6357L0698J135j989N5073K9089j4007J6637K2550k0312l0720m1953K3168
$$ -56357 -25659 -24524 -26513 28560 57649 43642 60279 82829 62517 31797 -10156 13012
23234A3012j558n552k8906J5682j45n226l8634L322J8785L6069O7133M0879j4125
$$ 13012 11454 5902 -23004 -7322 -7467 -12693 -51327 -48005 -29220 6849 73982 114861 100736
23221A00736l4661n4904l9701M398P269K840K0233m7174K9858J7644Q721L4469
$$ 100736 66075 11171 -28530 -24132 -16863 -14023 6210 -40964 -11106 6538 15259 49728
23209D9728N3542k5445j7071q1373m6899K3325M6944Q2931l8270j4934j6948m7474
$$ 49728 103270 77825 60754 -20619 -67518 -44193 2751 85682 47412 32478 15530 -31944
23197c1944N7104N2854Q0160k2355n6879n9634J0398K8646L629l3283M482K6228
$$ -31944 25160 78014 158174 135819 78940 19306 29704 58350 61979 28696 33178 59406
23185E9406N115m1268j2405J4185m0496J66L9685m61K9347l9326l1095O351j2330
$$ 59406 64521 23253 10848 25033 -15463 -15297 24388 23927 53274 13948 -17147 -10796 -23126
23172b3126P4300k6344k5659o400l4296M1735N9835m287q2132m5412M2323j330
$$ -23126 51174 24830 -829 -7229 -41525 210 60045 55758 -26374 -71786 -29463 -30793
23160c0793j9259Q9958j0041p4062j1261k874j9427K613L7594K3682j3547J2982
$$ -30793 -50052 39906 29865 -44197 -55458 -58332 -77759 -75146 -37552 -13870 -27417 -14435
23148a4435K3377n7112k2025M1364M1587n7636p8966m713M3538j8665O4068Q6381
$$ -14435 8942 -48170 -70195 -28831 12756 -44880 -123846 -128559 -85021 -103686 -39618 46763
23136D6763l3319o9898M9535Q6548M3868o8567p4558p5522M5975p2825j00079
$$ 46763 13444 -56454 -6919 79629 123497 54930 -19628 -95150 -49175 -122000 -222079
23125b22079P9540R5973J9471l5907J36q642j7919j4767J2170J8643N0605K731
$$ -222079 -142539 -46566 -27095 -63002 -62866 -71508 -89427 -104194 -92024 -73381 -22776 -20045
23113b0045o7603q994M657p8779n99R0943L0153M9211L8733J97j8732k0043j11587
$$ -20045 -87648 -96642 -91985 -170764 -171363 -80420 -50267 -1056 37677 37874 19142 -901 -112488
23100a12488n0628L3223R6171J2762M5077K5017n6218m9253J4190j0248O0151
$$ -112488 -163116 -129893 -33722 -20960 24117 49134 -7084 -56337 -42147 -52395 7756
23089G756N9033L4167J7947q422k0266j0799j00889l555N5465j895j2893p552
$$ 7756 66789 100956 118903 110481 90215 79416 -21473 -25028 30437 28542 15649 8097
23077H097o1024l8133O0659P3883l4693p9933n2259k1328K6415O2573J07744L1123
$$ 8097 -52927 -91060 -30401 43482 8789 -71144 -123403 -144731 -118316 -55743 52001 83124
23065H3124l2936r2782m0923L6067O868Q3872n8507m3653O1783m0228n692L733
$$ 83124 50188 -42594 -83517 -47450 -40582 43290 -15217 -58870 2913 -37315 -43007 -39274
23053c9274R1N6816N5909j583o4085r2938r295M4552J2854N7078j1786K4226M5627
$$ -39274 -39183 17633 73542 71959 7874 -85064 -94359 -49807 -36953 20125 8339 32565 78192
23040G8192M5144j1175k1821j3499r856n6644K7984P209K0990J8925J6313j2931
$$ 78192 123336 112161 90340 76841 66985 10341 38325 45534 66524 85449 101762 88831
23028H8831k6823o0050m1363j00241l052L9179J03668J6409l5321M1780k2059
$$ 88831 62008 1958 -39405 -139646 -142698 -103519 149 16558 -18763 23017 958
23017I58p3805J4123K5805J2898O2174J7798k7163k4747q964k3955j4285P6157
$$ 958 -72847 -58724 -32919 -20021 42153 59951 32788 8041 -923 -24878 -39163 36994
23005C6994j0455k9200l4976q8245M9298K0968M975m2802J6071k780L9094o4503
$$ 36994 26539 -2661 -37637 -125882 -76584 -55616 -50641 -93443 -77372 -80152 -41058 -105561
22993a05561L6181L8805O930n1473Q4228P8566l423o7781j092P3585N3880K5216
$$ -105561 -69380 -30575 -23645 -75118 9110 87676 84253 16472 15380 88965 142845 168061
22981A68061m390j2674M3335K4899l0337m7476r0572j45063k3363N0584m5760
$$ 168061 163671 150997 194332 219231 188894 141418 50846 -94217 -117580 -66996 -112756
22970a12756R0982j7855j7410O5834L9180k0098p510m0968m3851n185m6560M412
$$ -112756 -21774 -39629 -57039 8795 47975 27877 20367 -20601 -64452 -69637 -116197 -111785
22958a11785L1323M9315m2954k6858L1785N6595J8599m2190J1456m5773J0642
$$ -111785 -80462 -31147 -74101 -100959 -69174 -12579 6020 -36170 -24714 -70487 -59845
22947e9845M1406N4319O8127n4259r6358j3315l7926j1990O9602j8668j5416M2620
$$ -59845 -18439 35880 104007 49748 -46610 -59925 -97851 -109841 -40239 -58907 -74323 -31703
22935c1703Q5530N2571n0070l8393l3232n5607k6746j0425j4375n042Q3229L3427
$$ -31703 53827 106398 56328 17935 -15297 -70904 -97650 -108075 -122450 -127492 -44263 -10836
22923a0836k1049n412K3475m6372m0095P6722J2457l0424J6441M5590r4291o4443
$$ -10836 -31885 -37297 -13822 -60194 -100289 -23567 -11110 -41534 -25093 20497 -73794 -138237
22911a38237R0824K5272j0723L7411j3036k5911K489K0483l4031K7661l5610p5057
$$ -138237 -47413 -22141 -32864 4547 -8489 -34400 -31911 -11428 -45459 -17798 -53408 -128465
22899a28465k2754Q2100M4316J4689M7386K6045j0662m3900p9229m0489N4650
$$ -128465 -151219 -69119 -24803 -10114 37272 63317 52655 8755 -70474 -110963 -56313
22888e6313O6206Q0903K8484k3235l5004n7736q4317j8358L2844O9113M9481J863
$$ -56313 9893 90796 119280 96045 61041 3305 -81012 -99370 -66526 2587 52068 53931
22876E3931p1798M4414K1335J0203J1047j4052n4899l4652n990m5669r377M3738
$$ 53931 -17867 26547 47882 58085 69132 55080 181 -34471 -40461 -86130 -95507 -51769
22864e1769l3255P474J9844k624k4883K2892J7646M1700p1457r7273N2100l1473
$$ -51769 -85024 -77550 -57706 -60330 -85213 -62321 -44675 -2975 -74432 -171705 -119605 -151078
22852a51078K7390R9741K2086k5082l0297J6074P924L1928Q2590J1133j9566r9838
$$ -151078 -123688 -23947 -1861 -26943 -57240 -41166 -33242 -1314 81276 92409 72843 -26995
22840b6995K6794K8205r6279k1008J3555p6420m5977M6129P6086M3735L6459M2449
$$ -26995 -201 28004 -68275 -89283 -75728 -152148 -198125 -151996 -75910 -32175 4284 46733
22828D6733M5565m5626l3836O569K3119k3354J7469M4556k1301j5976Q326P5001
$$ 46733 92298 46672 12836 19405 42524 19170 36639 81195 59894 43918 52244 127245
22816A27245k6724m275p9415j25752O8005J04027K4731j6251K2977J3346j5354
$$ 127245 100521 96246 16831 -108921 -40916 63111 87842 71591 94568 107914 92560
22805I2560p148O8206p9127l8376n7166n7582K5865l4747k5172N5742K2167l4857
$$ 92560 85412 153618 74491 36115 -21051 -78633 -52768 -87515 -112687 -56945 -34778 -69635
22793f9635r6152j5254Q0793M7274m091n6960R096M5630M2375n206J3940N2326
$$ -69635 -165787 -181041 -100248 -52974 -57065 -114025 -104929 -59299 -16924 -22130 -8190 44136
22781D4136L0824N155m8605o669L3768l1091r266J4327L6651q46m3876L2121N3283
$$ 44136 74960 80115 31510 24841 58609 27518 18252 32579 69230 68384 24508 56629 109912
22768A09912o7135n9371k9184j7851N4508Q1720K4969p5521o012k1635l3231L0627
$$ 109912 42777 -16594 -45778 -63629 -9121 72599 97568 22047 16035 -5600 -38831 -8204
22756h204K8508L2509k0766K810N1457P362l1789m1576q317M9807j5547k7370
$$ -8204 20304 52813 32047 34857 86314 93676 61887 20311 11994 61801 46254 18884
22744A8884l5765M0055K4755k7058k899j7101K173k9511l8180l529L5106k6749
$$ 18884 -16881 23174 47929 20871 17972 871 3044 -26467 -64647 -68176 -33070 -59819
22732e9819N8899L2384M903k141M3122l2561k0883j9004M3619j6534n7674k526
$$ -59819 -920 31464 36367 34226 77348 44787 23904 4900 48519 31985 -25689 -28215
22720b8215j6702L6142M1029L4890J2162l0877K4027j14590l5030m3404k2149
$$ -28215 -44917 -8775 32254 67144 79306 48429 72456 -42134 -77164 -120568 -142717
22709a42717M2529L6401o138l018O0333j1005O6980K5527o2910J3428k1570k757
$$ -142717 -100188 -63787 -69925 -72943 -12610 -23615 43365 68892 5982 19410 -2160 -4917
22697d917p3173K27M4887K3757m5465k8471l6195O6186K0149p1630l343Q8748
$$ -4917 -78090 -77863 -32976 -9219 -54684 -83155 -119350 -53164 -33015 -104645 -107988 -19240
22685a9240Q1318j2425p8754O6711j8720j8862P3836L7193L0486j4223m8117k3475
$$ -19240 62078 49653 -29101 37610 18890 28 73864 111057 141543 127320 79203 55728
22673E5728j9596m8303J5557l8852N5975l7174o7376K3785O1822K0886L4254R610
$$ 55728 36132 -12171 3386 -35466 20509 -16665 -84041 -60256 1566 22452 56706 66316
22661F6316R244L7739j2988M46n4476J5475K5173L1072j2203j23360j7234j6708
$$ 66316 75560 113299 100311 100757 46281 61756 86929 118001 105798 -17562 -34796 -51504
22649e1504j9575K9418K1436J20942n7818p8993N6241Q2606o7604l1720k3686
$$ -51504 -71079 -41661 -20225 100717 42899 -36094 20147 102753 35149 3429 -20257
22638b0257k307N0028J451j43828n545O3119K2821K8565k9496j4125K8445Q1523
$$ -20257 -22564 27464 28915 -114913 -120458 -57339 -34518 -5953 -35449 -49574 -21129 60394
22626F0394M4171K2155N2933k106p339q0668n7531m7893n097M8038p4932m8617
$$ 60394 104565 126720 179653 177547 170208 89540 32009 -15884 -20981 27057 -47875 -96492
22614i6492N2352M7338k4618m1714M8499J3646n4121n0853o956L0876J2282N8158
$$ -96492 -44140 3198 -21420 -63134 -14635 -989 -55110 -105963 -112919 -82043 -69761 -11603
22602a1603M9121m2801J6618Q018M6064M1591n781k1857n7550j3068J4041P1498
$$ -11603 37518 -5283 11335 19353 65417 107008 101227 79370 21820 8752 22793 94291
22590I4291j7490q148l2009j16015n2O7827L0975O058K4323L5220n6339k3916
$$ 94291 76801 68653 36644 -79371 -79423 -11596 19379 25437 49760 84980 28641 4725
22578D725K7472J3204L329K1297m3800j9691M6884N7801P0187J34791j9504K5637
$$ 4725 32197 45401 48730 70027 26227 6536 53420 111221 181408 316199 296695 322332
22566C22332J67712K08460K41263K20732K65795J86087J31808N4226m4619j07198
$$ 322332 490044 698504 939767 1160499 1426294 1612381 1744189 1798415 1753796 1646598
22556A646598j49650j18707k49038k61882k24315j70398l2687j36872m1040j6345
$$ 1646598 1496948 1378241 1129203 867321 643006 472608 439921 303049 262009 245664
22546B45664n0566K040J7353J9509N6401L3792l1693j24123o2706k2407L7413
$$ 245664 195098 197138 214491 234000 290401 324193 292500 168377 105671 83264 120677
22535A20677J7387l719J1914K3698M4554k7726l7768J21228K3967j02814n6312
$$ 120677 138064 134345 146259 169957 214511 186785 149017 270245 294212 191398 135086
22524A35086o5109k5652M5823l2273n1662J6216j3124P6632P6477o1143p771N4438
$$ 135086 69977 44325 90148 57875 6213 22429 9305 85937 162414 101271 93500 147938
22512A47938j0555L2265l2752K2091P1400Q2159O1968M9136O9827N6797M7562
$$ 147938 137383 169648 136896 158987 230387 312546 374514 423650 493477 550274 597836
22501E97836m8983m4375p2840l8719n1903j24818l4969j101l6500p2195m6251
$$ 597836 548853 504478 431638 392919 341016 216198 181229 180128 143628 71433 25182
22490B5182j6728M4683k2897N7799J1500j3945o6620K7125N2696q069m644k3285
$$ 25182 8454 53137 30240 88039 99539 85594 18974 46099 98795 90726 86082 62797
22478F2797j11955l8701L5441J62519o472j49662r8655M9906J33419P9988k5999
$$ 62797 -49158 -87859 -52418 110101 103629 -46033 -144688 -94782 38637 118625 92626
22467I2626O813J2970p4483j7050K3340k1561n3142l4757K8K5236K3095M3573
$$ 92626 99439 112409 37926 20876 44216 22655 -30487 -65244 -65216 -39980 -16885 26688
22455B6688k1869P9094N3433Q8K7992l0414K5503M7691L1341J30189R0817O8891
$$ 26688 4819 83913 137346 137434 165426 135012 160515 208206 239547 369736 460553 529444
22443E29444Q5849N5956O6613k0190Q430j6315m9886q1357j60743j56987m9862
$$ 529444 615293 671249 737862 717672 726102 709787 659901 578544 417801 260814 210952
22432B10952k2675q2935j09830l1557Q7375M2375j05452p4233N3969k9056O7739
$$ 210952 188277 105342 -4488 -36045 51330 93705 -11747 -85980 -32011 -61067 6672
22421F672P4274m795L3342J20731n995m6302m2023q3349k7065r273J2223n9267
$$ 6672 80946 76151 109493 230224 224229 177927 135904 52555 25490 16217 28440 -30827
22409c0827o9701N7054P4391R6911P5765q2840k2764n3695n527j2047p4771L736
$$ -30827 -100528 -43474 30917 127828 203593 120753 97989 44294 38767 26720 -48051 -44315
22397d4315K7998l3368m5961K3972K3150K5797O2431p3776r2951K6262m307J05968
$$ -44315 -16317 -49685 -95646 -71674 -48524 -22727 39704 -34072 -127023 -100761 -105068 900
22385I00J2078n4226K2408P4235J14341l1746p7025o8640K5313N7208M086p3556
$$ 900 12978 -41248 -18840 55395 169736 137990 60965 -7675 17638 74846 78932 5376
22373E376N2584M6260j6398m95l8059J04j7964N6090N7580j7092m3394k5063m39
$$ 5376 57960 104220 87822 87327 49268 49372 31408 87498 145078 127986 84592 59529 59090
22360E9090j0523L7562L3113n1353r0724k2373K288P9129J4797k6133p2545n4565
$$ 59090 48567 86129 119242 67889 -22835 -45208 -42920 36209 51006 24873 -47672 -102237
22348a02237L5078O8497J8474j0465j3074P1249O8215o1752m1071jl9476K5266
$$ -102237 -67159 1338 19812 9347 -3727 67522 135737 73985 32914 32913 -6563 18703
22336A8703k2041k8869j0780o695K149m9439j26823j9649K8816N062Q7238M6525
$$ 18703 -3338 -32207 -42987 -49682 -47533 -96972 -223795 -243444 -214628 -209566 -122328 -75803
22324g5803k2647j2927J6449L1383L2883k0121l2765N295N2238J33810o336K9143
$$ -75803 -98450 -111377 -94928 -63545 -30662 -50783 -83548 -78253 -26015 107795 101459 130602
22312A30602m044p1096K1566M1204M1804L1757j4688n3J9725l6063j5765k8123
$$ 130602 126558 55462 77028 118232 160036 191793 177105 177052 196777 160714 144949 116826
22300A16826n1228K8673J3015K7705k4274j4022k8160l580k3707R244J3165J5378
$$ 116826 65598 94271 107286 134991 110717 96695 68535 64955 41248 50492 63657 79035
22288G9035j01914J5967L2479N8428L0994K2638J7953j5285q4353N3486Q4499
$$ 79035 -22879 -6912 25567 83995 114989 137627 155580 140295 55942 109428 193927
22277A93927J05605M2445L6029q1519j01442j742m3008n4735j8626P388j3556
$$ 193927 299532 341977 378006 296487 195045 193303 150295 95560 76934 84322 70766
22266G0766K2300O1760n7924k5877m729k0763L1444j0323o5881Q277m5613k9077
$$ 70766 93066 154826 96902 71025 66296 45533 76977 66654 773 9050 -36563 -65640
22254f5640K7273K0305k530L1313k5668M5664P2027L0715K4758m1508j2177L5231
$$ -65640 -38367 -18062 -20592 10721 -14947 30717 102744 133459 158217 116709 104532 139763
22242A39763l5767L0470L252l6078R2487j7438m8986k747L6849L9862j0564q3506
$$ 139763 103996 134466 137718 101640 194127 176689 127703 124956 161805 201667 191103 107597
22230A07597o9646L1503J24564N9919P3547l462l9535K9688L5927j6243l9285
$$ 107597 37951 69454 194018 253937 327484 324022 284487 314175 350102 333859 294574
22219B94574K4180o13l1988j926m1011P7777M1475j3770J4407j9971n7846l9373
$$ 294574 318754 318141 286153 284227 243216 320993 362468 348698 363105 343134 285288 245915
22207B45915n9710m7592Q1830J06386p1686m0067j1260N5485M195o184k9916k779
$$ 245915 186205 138613 220443 326829 255143 215076 203816 259301 263496 257312 227396 224617
22195B24617o5183m9821j4929J6224P458M7772l7979j4771R6217R053M9936m5612
$$ 224617 159434 109613 94684 110908 118366 166138 128159 113388 209605 218658 268594 222982
22183B22982l6249j5635K2564L9075j4311L2904L7082o939P8894M9922k7807j2041
$$ 222982 186733 171098 193662 232737 218426 251330 288412 281473 360367 410289 382482 370441
22171C70441q3980j1899K4336P5713L1760K3937j2108M0808P9893k806j930Q2527
$$ 370441 286461 274562 298898 374611 406371 430308 418200 459008 538901 536095 534165 616692
22159F16692J06039O7896J96109J80412J30508R2688K48087K90332K57677K27642
$$ 616692 722731 790627 986736 1167148 1297656 1390344 1638431 1928763 2186440 2414082
22149B414082J66141N0894j27893k24237j72608k06879l12922k52577j38611p4328
$$ 2414082 2580223 2631117 2503224 2278987 2106379 1899500 1586578 1334001 1195390 1121062
22139A121062j40646n9728j33910j04141Q066K8474L1083j02470j51128k2117
$$ 1121062 980416 920688 786778 682637 690703 719177 750260 647790 496662 474545
22129D74545L5728J03246M5908J5526J02368L2294j7291n511j2128J400L2363
$$ 474545 510273 613519 659427 674953 777321 809615 792324 786813 774685 776085 808448
22118H08448J12444O63M6736k709K8128M1705Q803k3256P4243P7994L0067J2711
$$ 808448 920892 921555 968291 965582 993710 1035415 1044218 1020962 1095205 1173199 1203266 1215977
22106A215977L6450O3139N7979O2577K15610L19450L39401K53126J89764J61218
$$ 1215977 1252427 1315566 1373545 1436122 1651732 1971182 2310583 2563709 2753473 2914691
22096B914691J95704O3326j03712j85217j56863j55488k84437l02214j85569j06686
$$ 2914691 3110395 3173721 3070009 2884792 2727929 2572441 2288004 1985790 1800221 1693535
22086A693535j279J1783k8596K8133P2515J3617j0252l6788O705N6819o675Q3864
$$ 1693535 1692256 1704039 1675443 1703576 1776091 1789708 1779456 1742668 1749373 1806192 1799517 1883381
22074A883381Q2847O9616Q5916K1858O9761N1671M8332L1131J05703J54466J46822
$$ 1883381 1966228 2035844 2121760 2143618 2213379 2265050 2313382 2344513 2450216 2604682 2751504
22063B751504J6079K2352J20754J90095O8381J30516K32687J62239J33101K08249
$$ 2751504 2767583 2789935 2910689 3100784 3169165 3299681 3532368 3694607 3827708 4035957
22053D035957K68891L35873L06846L66119M62906N75461O81056O48362Q26429
$$ 4035957 4304848 4640721 4947567 5313686 5776592 6352053 7033109 7681471 8507900
22044H507900R82387J195887J495779J747130K003645K359445K930515L605851
$$ 8507900 9490287 10686174 12181953 13929083 15932728 18292173 21222688 24828539
22036B4828539M429657N522196O963585R021761J1900057J5712291K0742485K7424987
$$ 24828539 29258196 34780392 41743977 50765738 62665795 78378086 99120571 126545558
22028A26545558L4854127M1078375M3875783M1960032L2496137J6254598j944286
$$ 126545558 161399685 202478060 246353843 288313875 320810012 337064610 335120324
22021C35120324j5962728k5491011l4586729m3962560m8180399m3044076l1144674
$$ 335120324 319157596 293666585 259079856 215117296 166936897 123892821 92748147
22014I2748147k0011348j2590687q434755o032302m517477l542824k781109k147210
$$ 92748147 72736799 60146112 51711357 45679055 41161578 37618754 34837645 32690435
22006C2690435j727786j259369q69745m37334l57956n33702o16514o98363q31558
$$ 32690435 30962649 29703280 28833535 28396201 28038245 27504543 26888029 26189666 25358108
21997B5358108r56079j258535j390546j467071j458559j343029j228916j181448
$$ 25358108 24402029 23143494 21752948 20285877 18827318 17484289 16255373 15073925
21989A5073925j144201r52115q93662q09242q20101p92735o72756o02740n50015
$$ 15073925 13929724 12977609 12083947 11274705 10454604 9661869 8989113 8386373 7836358
21980G836358m81645m84106l69190l84355m05778l87645l07195k76564k99631
$$ 7836358 7354713 6870607 6501417 6117062 5711284 5323639 5016444 4739880 4440249
21971D440249j35236j01779k15635k27048k29635k46491j95453m7966q3321j63347
$$ 4440249 4305013 4203234 3987599 3760551 3530916 3284425 3088972 3041006 2957685 2794338
21961B794338q8158j29711j24051q5254j31431J7933M1798l4567M3436J85269
$$ 2794338 2706180 2576469 2452418 2367164 2235733 2253666 2295464 2260897 2304333 2489602
21951B489602J13513J60862J52727N1727m7302j26291k26541k98805l35742l00748
$$ 2489602 2603115 2763977 2916704 2968431 2921129 2794838 2568297 2269492 1933750 1633002
21941A633002k48929j99385j99224r8896l5725p2055l0574Q3266m6885j05989
$$ 1633002 1384073 1184688 985464 886568 850843 778788 748214 831480 784595 678606
21931F78606q8373k6819m2339k9218k2511k434l4362K2145j0993l0322l4840J8626
$$ 678606 590233 563414 521075 491857 469346 466912 432550 454695 443702 413380 378540 397166
21919C97166n4631l9742j05525n26K9460l7749K2635Q2454L4583n3510l7996k5473
$$ 397166 342535 302793 197268 196742 226202 188453 211088 293542 328125 274615 236619 211146
21907B11146N3217j5510L6720L5919L7569M1161K3965K634L6678j555l6287j8832
$$ 211146 264363 248853 285573 321492 359061 400222 424187 426821 463499 461944 425657 406825
21895D06825j4754k023k8360J3005k3380R537n0956j37872o3413K9642L0072K3408
$$ 406825 392071 390048 361688 374693 351313 360850 309894 172022 108609 138251 168323 191731
21883A91731J3737n2563j24572m4163k4757k1376m0281M5748J03637Q8572R254
$$ 191731 205468 152905 28333 -15830 -40587 -61963 -102244 -56496 47141 135713 144967
21872A44967M7122l3896o0032O5432Q2638K2244m1429j1515K9406L4728N6831
$$ 144967 192089 158193 98161 163593 246231 268475 227046 215531 244937 279665 336496
21861C36496P2331K7660k7302p9987q1338O5836J5893Q3724O7185q3641p5349
$$ 336496 408827 436487 409185 329198 247860 313696 329589 413313 480498 396857 321508
21850C21508N4094M3188l438j12337N981L7875j8095m1378O692l2949p5461j14078
$$ 321508 375602 418790 415352 303015 308996 346871 328776 287398 294090 261141 185680 71602
21838G1602O7509J12057Q497n3767l8309J9148n6127j3221R3943K9002m6789M0726
$$ 71602 139111 251168 259665 205898 167589 186737 130610 117389 211332 240334 193545 234271
21826B34271o4785q0018l4093P2583n7023m311P4699P93k7291M211R070j2174
$$ 234271 169486 89468 55375 127958 70935 66624 141323 142116 114825 119036 128106 115932
21814A15932n3725n4041p6083k2212N0739Q808K5641m6873P292l0532j7989m2066
$$ 115932 62207 8166 -67917 -90129 -39390 -30582 -4941 -51814 -44522 -75054 -93043 -135109
21802a35109J8098O518J01860N7399j4542R467M108r687k9476P074j4596Q584
$$ -135109 -117011 -110493 -8633 48766 34224 43691 47799 38112 8636 15710 1114 9698
21790I698O3603J12386K9646n0199n3414n8330k0921L4286n2573l8046K1809J2709
$$ 9698 73301 185687 215333 165134 111720 53390 32469 66755 14182 -23864 -2055 10654
21778A0654L3579N0710j2264j166J5656M319K1729J3762m543L6416K6647l8582
$$ 10654 44233 94943 82679 81513 97169 101488 123217 136979 132436 168852 195499 156917
21766A56917o2752n3822K2090l5524j4805j2943j2728k3129L7585J0348j8711
$$ 156917 94165 40343 62433 26909 12104 -839 -13567 -36696 889 11237 -7474
21755g474K1577L8321P0718j3655o7252o7166n469K1889j054K5781R059j1376
$$ -7474 14103 52424 123142 109487 42235 -24931 -30400 -8511 -9565 16216 25275 13899
21743A3899k6990p473M8653l713L6073L0929J5324J5655l823J8883r223o9900
$$ 13899 -13091 -20564 28089 24376 60449 91378 106702 122357 118534 137417 128194 58294
21731E8294q6737k1593l3695K7820K3915J6634k0723N1183r872l9542K3478J24377
$$ 58294 -28443 -50036 -83731 -55911 -31996 -15362 -36085 15098 5226 -34316 -10838 113539
21719A13539O5249N7570j3518n552n9957j1021k4958p61j0178J445m3886k5386
$$ 113539 178788 236358 222840 217288 157331 146310 121352 120591 110413 111858 67972 42586
21707D2586K0474k2307l438O249l262j7811j6365l5999N991j6024K4173j9849
$$ 42586 63060 40753 37315 43564 40302 22491 6126 -29873 -23882 -39906 -15733 -35582
21695c5582p2584n3630K0079J02803O326l7783l5712O5388j0909j333M6570O939
$$ -35582 -108166 -161796 -141717 -38914 -32588 -70371 -106083 -40695 -51604 -52937 -6367 572
21683E72l2339k1161J862J7480N7363N6997j5148j4888O732j0076j4403O1877
$$ 572 -31767 -52928 -51066 -33586 23777 80774 65626 50738 57470 47394 32991 94868
21671I4868l0721l7042o9155k6624J6596K3670N0602q0932n1064J9348M6268n024
$$ 94868 64147 27105 -42050 -68674 -52078 -28408 22194 -58738 -109802 -90454 -44186 -49210
21659d9210Q0091k9941j0588J3866N1266L5576R734K888l1552k5690j4802j0106
$$ -49210 30881 940 -9648 4218 55484 91060 100794 103682 72130 46440 31638 21532
21647B1532l6460p5936j6088O4552O1723P169l7297j8040L874k5246l3732K3788
$$ 21532 -14928 -90864 -106952 -42400 19323 26492 -10805 -28845 -24971 -50217 -83949 -60161
21635f0161L8999L3472m6043r3629J6831P4550M2234N2459n594m6463O5455M3772
$$ -60161 -21162 12310 -33733 -127362 -110531 -35981 6253 58712 53118 6655 72110 115882
21623A15882m1729k5850o753l3305r137J2032j5041l9073L4192n9731n3825j6532
$$ 115882 74153 48303 41550 8245 -892 11140 -3901 -42974 -8782 -68513 -122338 -138870
21611a38870O8527N0119N369K9450N1420m2842O62l685M6325k744j21232J0324
$$ -138870 -70343 -20224 -14855 14595 66015 23173 23835 20150 66475 63731 -57501 -47177
21599d7177K7127L8446m9706L7939J8462K4378l2471j7688o1432J3646K4780M7751
$$ -47177 -20050 18396 -31310 6629 25091 49469 16998 -690 -62122 -48476 -23696 24055
21587B4055L9162l6148j7559q3792q0094L6883P1055L4J4413N9852L2784P6351
$$ 24055 63217 27069 9510 -74282 -154376 -117493 -46438 -46404 -31991 27861 60645 136996
21575A36996N0268l5148o1109l754k2113p8568o0534L575P5441Q791j6987O0453
$$ 136996 187264 152116 91007 87253 65140 -13428 -73962 -70387 5054 13845 -3142 57311
21563E7311J00281K420j3364j0825l6316j0950J0517k4758m9437M4067k8619n3632
$$ 57311 157592 160012 146648 135823 99507 88557 99074 74316 24879 68946 40327 -13305
21551a3305n900J8501m7673J0772L5317L4340j8184L8149L5690l1811n9453k5910
$$ -13305 -19205 -704 -48377 -37605 -2288 32052 13868 52017 87707 55896 -3557 -29467
21539b9467L3781L8088M1410j232n2501k3409o8986l1394M9209j388j4237Q7065
$$ -29467 4314 42402 83812 82580 30079 6670 -62316 -93710 -44501 -45889 -60126 26939
21527B6939p2835p4359J9186J6979Q8601M6744n1278n3555M9832K4794n5392p112
$$ 26939 -45896 -120255 -101069 -84090 4511 51255 -23 -53578 -3746 21048 -34344 -41456
21515d1456K0363l255Q096j0105L8791M2830M0835m7631K9230M1211M3819R761
$$ -41456 -21093 -24348 -16252 -26357 12434 55264 96099 48468 77698 118909 162728 172489
21503A72489k5685j15877j3296J7557j8507k7964m0361j1061P3191L3801L6010
$$ 172489 146804 30927 17631 35188 16681 -11283 -51644 -62705 10486 44287 80297
21492H0297L850L0489O8417Q1615Q3110j4978J323L8276Q6469K18196J97922K97959
$$ 80297 84147 114636 183053 264668 347778 332800 334123 372399 458868 677064 874986 1172945
21480A172945J91289J58448J87080J533m8817j35565j65213j88728j73067j92401
$$ 1172945 1364234 1522682 1709762 1711295 1662478 1526913 1361700 1172972 999905 807504
21470H07504j68412j42426j11892p2810k5735L9848L0963m9769r2655r4272j167
$$ 807504 639092 496666 384774 311964 286229 326077 357040 307271 214616 120344 119177
21459A19177L6532n0337j7138L6624m4120q5538l8565J15949Q4337K1899n0919
$$ 119177 155709 105372 88234 124858 80738 -4800 -43365 72584 156921 178820 127901
21448A27901p5209l7331K0989J8143n9870M5574M5857m536m2235l2330m9305p4174
$$ 127901 52692 15361 36350 54493 -5377 40197 86054 81518 39283 6953 -42352 -116526
21436a16526m7252P3695L0776K4552Q1639m0244l2577l0884o2428N0077L2631
$$ -116526 -163778 -90083 -59307 -34755 46884 6640 -25937 -56821 -119249 -69172 -36541
21425c6541P4436L2877l0323m9897J1525j1101M2315M3293j5547K9550R4403p177
$$ -36541 37895 70772 40449 -9448 2077 -9024 33291 76584 61037 90587 184990 177813
21413A77813j55891j49782j7292p718J4685L9543l0881L5189O8916K8809l123
$$ 177813 21922 -127860 -145152 -152870 -138185 -98642 -129523 -94334 -25418 3391 268
21402B68o4834p138J6989O1676J2974r4966l0077Q5112Q2789J4076J1296m6431
$$ 268 -64566 -71704 -54715 6961 19935 -75031 -105108 -19996 62793 76869 88165 41734
21390D1734j08473K1464K1687k0349L8419m834j6650j4547J02672j1384j7359
$$ 41734 -66739 -45275 -23588 -43937 -5518 -10352 -27002 -41549 61123 49739 32380
21379C2380j7570R632j8789j159N479p702r900m0785k7687K1410N3074l2405j5661
$$ 32380 14810 24442 5653 4494 9973 2271 -7629 -48414 -76101 -54691 -1617 -34022 -49683
21366d9683j5807K1700N2673K0248J2094j0425L1741j601n9570K7214k0228R340
$$ -49683 -65490 -43790 8883 29131 41225 30800 62541 60940 1370 28584 8356 17696
21354A7696l4438K3805K1542n3096j9810l564j7127K2443P584O2168J6757o008
$$ 17696 -16742 7063 28605 -24491 -44301 -47865 -64992 -42549 -34965 27203 43960 37952
21342C7952M5689K5788o9120n9272j9905k833m3465k1694K84n0011O6144O7613
$$ 37952 83641 109429 40309 -18963 -38868 -41701 -85166 -106860 -106576 -156587 -90443 -22830
21330b2830l6956p9641k7691O5422L1257M3411N0852j4756J2781j5781p8699o8311
$$ -22830 -59786 -139427 -167118 -101696 -70439 -27028 23824 9068 21849 6068 -72631 -140942
21318a40942P423J5799j8175L8330O3336J3321m2574n1115j6068K3926L3402L5337
$$ -140942 -133519 -117720 -135895 -97565 -34229 -20908 -63482 -114597 -130665 -106739 -73337 -38000
21306c8000p2449o079J01135M5442o515m1430k5095M4177k8187K2501k0316p802
$$ -38000 -110449 -116528 -15393 30049 23534 -17896 -42991 1186 -27001 -4500 -24816 -32618
21294c2618j0943k2393P8490l4147J9928k2275j6371n1758l080N7474M4022k2612
$$ -32618 -43561 -65954 12536 -21611 -1683 -23958 -40329 -92087 -95167 -37693 6329 -16283
21282a6283j03781l9819J5662Q2889O1264O8206K1174m9707m2090M544o2295j6009
$$ -16283 -120064 -159883 -144221 -61332 -68 68138 89312 39605 -2485 2059 -60236 -76245
21270g6245J3735l9645r738K8093K1673p876j0175L5014M7362k376l6951q984
$$ -76245 -62510 -102155 -111893 -83800 -62127 -70003 -80178 -45164 2198 -178 -37129 -46113
21258d6113K4264r776m8411N4363L374P753j2408m3130j9336N896j8647j0173
$$ -46113 -21849 -31625 -80036 -25673 -22299 -14546 -26954 -70084 -89420 -83524 -102171 -112344
21246a12344O5631r2040m7101J7388K4986L1710N4948k8152o9943l5567J2469
$$ -112344 -46713 -138753 -185854 -168466 -143480 -111770 -56822 -84974 -154917 -190484 -178015
21235a78015k4129M9971K0889K7510N1011R779k2393n408K9220L145N7935m3464
$$ -178015 -202144 -152173 -131284 -103774 -52763 -42984 -65377 -70785 -41565 -38420 19515 -23949
21223b3949j576O4849p4906k4013O3235M3742r5098l8191Q4695J9086J409K217
$$ -23949 -25525 39324 -35582 -59595 3640 47382 -47716 -85907 -1212 17874 19283 21500
21211B1500R334j11606j889Q6047K6374p1264l2703j0739m0177j7019M3300M0598
$$ 21500 30834 -80772 -82661 3386 29760 -41504 -74207 -84946 -125123 -142142 -98842 -58244
21199e8244N3062k0780n6408K8229n1270m357M3505M1005J5570l3555l3466k5924
$$ -58244 -5182 -25962 -82370 -54141 -105411 -109768 -66263 -25258 -9688 -43243 -76709 -102633
21187a02633J7345l1966l4175O5102r150k2584L2955j3187p005p0973n226O8480
$$ -102633 -85288 -117254 -151429 -86327 -95477 -118061 -85106 -98293 -105298 -176271 -181497 -113017
21175a13017O2951m5611l6699RK3628j7007K1575M6506j7569M849L3775k8199
$$ -113017 -50066 -95677 -132376 -132367 -108739 -125746 -104171 -57665 -75234 -70385 -36610 -64809
21163f4809J6870Q8631L9232L0099O143k2799k4054L6299j1730n7123r8640n25
$$ -64809 -47939 40692 79924 110023 116166 93367 69313 105612 93882 36759 -61881 -62406
21151f2406j1108N3301j5705L706O3475L2725J111q7796k8950k8954n7855P2019
$$ -62406 -73514 -20213 -35918 -32212 31263 63988 65099 -22697 -51647 -80601 -138456 -66437
21139f6437O6909K2573m176N6427o6606p2395j1238k6974l2799r8610R2584N2501
$$ -66437 472 23045 18869 75296 8690 -63705 -74943 -101917 -134716 -233326 -140742 -88241
21127h8241j29p0512k4131K8739M5409j4310j0402J7303M5303L4703O9065k9486
$$ -88241 -88370 -158882 -183013 -154274 -108865 -123175 -133577 -116274 -70971 -36268 32797 3311
21115C311r0591p2713L4497K3371o121M4090J9102j7359J779r95K9445j3971l4966
$$ 3311 -87280 -159993 -125496 -102125 -108246 -64156 -45054 -62413 -60634 -61629 -32184 -46155 -81121
21102h1121K4822K4916q992L2564L0066k1882M7581j7226M344l1781j1341L933
$$ -81121 -56299 -31383 -40375 -7811 22255 373 47954 30728 35072 3291 -8050 -4117
21090d117o219N3046m1061n995O9900J3933k6243m5368o1173N2167O8540p4500
$$ -4117 -10336 42710 1649 -4346 65554 79487 53244 7876 -53297 -1130 67410 -7090
21078g090p5498k638m4821M4237K3669o5418J9062J1876l8105K1605N9565O1224
$$ -7090 -82588 -85226 -130047 -85810 -62141 -127559 -108497 -96621 -134726 -113121 -53556 7668
21066G668j7047l2896k3230P612k6513q5264K8212K5437j9770o7041J564M1500
$$ 7668 -9379 -42275 -65505 -57893 -84406 -169670 -141458 -116021 -135791 -202832 -201268 -159768
21054a59768Q6173K5594k1246K5272Q759l2613J4781L2903K1593K9855n3385K6015
$$ -159768 -73595 -48001 -69247 -43975 -35216 -67829 -53048 -20145 1448 31303 -22082 3933
21042C933n403l7422O436j7955m379O2033q802j0231j3456m3284q366k5107L7614
$$ 3933 -1470 -38892 -32456 -50411 -54790 7243 -1559 -11790 -25246 -68530 -76896 -102003 -64389
21029f4389N612L5247K1719O981N2097L5917q7606j6523L5738M3224p1298m6689
$$ -64389 -58777 -23530 -1811 5170 57267 93184 5578 -10945 24793 68017 -3281 -49970
21017d9970j6299J9908K2594L2235m1193o229M943k2072J2033j2773L6474K7400
$$ -49970 -66269 -46361 -23767 8468 -32725 -38954 -34011 -56083 -44050 -56823 -20349 7051
21005G051n4381K4911p9234m9124P9863J6277j3863L5316j5925j7419o364o77
$$ 7051 -47330 -22419 -101653 -150777 -70914 -54637 -68500 -33184 -49109 -66528 -72892 -73569
20993g3569J8095l0410N1957k0187J940m9607m6138J08891J05600L7525p021n5164
$$ -73569 -55474 -85884 -33927 -54114 -52174 -101781 -147919 -39028 66572 104097 97076 41912
20981D1912r6184Q215P395j7960K5325J6864J6755p0137M6555L0725j00670l1971
$$ 41912 -54272 -46057 -38662 -56622 -31297 -14433 2322 -67815 -21260 9465 -91205 -123176
20969a23176Q8976J0812p3528j0782O3511j9426k0302P9849P3890l7100j40849
$$ -123176 -34200 -23388 -96916 -107698 -44187 -63613 -83915 -4066 69824 32724 -108125
20958a08125k4034N6765Q3896l0175n9579k0605O2278j6051P9183O3921j4408
$$ -108125 -132159 -75394 8502 -21673 -81252 -101857 -39579 -55630 23553 87474 73066
20947G3066k3392l1817n7278p570n4088O4483K9941j359Q3976L340O4370m0820
$$ 73066 49674 17857 -39421 -46991 -101079 -36596 -6655 -8014 75962 79302 143672 102852
20935A02852L0257k6428l3403j27174n4928n942L4271P9018o5015o2313O6753
$$ 102852 133109 106681 73278 -53896 -108824 -114766 -80495 -1477 -66492 -128805 -62052
20924f2052L9794n0156o8509J8305q791P4772K1648o9228J2274J9057N5646P6643
$$ -62052 -22258 -72414 -140923 -122618 -131409 -56637 -34989 -104217 -91943 -72886 -17240 59403
20912E9403J3198k7544o4874k8522N5174L914K6063K6598O222L1967j6871k8664
$$ 59403 72601 45057 -19817 -48339 6835 10749 36812 63410 69632 101599 84728 56064
20900E6064n9180K0598m8761o926N8756L3681m4407o3354l9083J8658L6229o1734
$$ 56064 -3116 17482 -31279 -38205 20551 54232 9825 -53529 -92612 -73954 -37725 -99459
20888i9459l7663l304M038P4872L8731j3435M4365k8106r6519J3950K9608L4299
$$ -99459 -137122 -140426 -136388 -61516 -22785 -36220 8145 -19961 -116480 -102530 -72922 -38623
20876c8623L6915k309o670l5429m4352N3665L9887k9791l425M5142o2229m4683
$$ -38623 -1708 -4017 -10687 -46116 -90468 -36803 3084 -26707 -30132 15010 -47219 -91902
20864i1902m9627M1064J17817m164j9649K7944N5129K7490p3497j6790r7921o8790
$$ -91902 -141529 -100465 17352 13188 -6461 21483 76612 104102 30605 13815 -84106 -152896
20852a52896J6267P2312j4696k1811Q9206L0664q7553k7604n0318J0023N7940
$$ -152896 -136629 -64317 -79013 -100824 -11618 19046 -68507 -96111 -146429 -136406 -78466
20841g8466J25483m7043p8666K0048N3551k1821k9696J3130j3447J0572j0886
$$ -78466 47017 -26 -78692 -58644 -5093 -26914 -56610 -43480 -56927 -46355 -57241
20830e7241R431j8325K0713o1383j9813Q7825k9316R052J2600o308q6726J0338
$$ -57241 -47810 -66135 -45422 -106805 -126618 -38793 -68109 -59057 -46457 -52765 -139491 -129153
20818a29153l712M5115N4658M8887m2520Q158l9203K499P7861m822J223j06911
$$ -129153 -132865 -87750 -33092 15795 -26725 -18567 -57770 -55271 22590 17768 18991 -87920
20806h7920j00638k4026Q2397J8961n4406N5453J16064R2331m6749l9474K4936
$$ -87920 -188558 -212584 -130187 -111226 -165632 -110179 5885 98216 51467 11993 36929
20795C6929N5622P181j02236l0526M4082N7756m2300q0344O945K298O0490L4955
$$ 36929 92551 99732 -2504 -33030 11052 68808 26508 -53836 -46891 -44593 15897 50852
20783E0852p0891Q682K3892J7873J1370n9778n3222n620m8015l1569N9624K8283
$$ 50852 -20039 -11357 12535 30408 41778 -18000 -71222 -76842 -124857 -156426 -96802 -68519
20771f8519M4721J03583M6808o1277q6239M9017M4247l7181l097m1179J2976P5078
$$ -68519 -23798 79785 126593 65316 -20923 28094 72341 35160 32063 -9116 3860 78938
20759G8938J2860o0614m5079r926n509q0787J8029K9916L9129j487m8241o0299
$$ 78938 91798 31184 -13895 -23821 -29330 -110117 -92088 -62172 -23043 -24530 -72771 -133070
20747a33070M9886J20685j6297K2096q668o0790K1473Q5586k4542k1704k7262
$$ -133070 -83184 37501 21204 43300 34632 -26158 -4685 80901 56359 34655 7393
20736G393M1891Q773m9759N3626j4488K5805j8385j6903r732l7539K3922L6168
$$ 7393 49284 58057 8298 61924 47436 73241 54856 37953 28221 -9318 14604 50772
20724E0772j1152j0376N9828J9526j08783j1682n613K7472K3162n9j2670r4497
$$ 50772 39620 29244 89072 108598 -185 -11867 -17480 9992 33154 33095 20425 -74072
20712g4072l7901j920o895M0080J5534M7106L6232K2074O5234p200l7483j4012
$$ -74072 -111973 -113893 -120788 -80708 -65174 -18068 18164 40238 105472 98272 60789 46777
20700D6777k2490j1168n2564J8609L8393j3563l4897K415J3888J5966M535p87
$$ 46777 24287 13119 -39445 -20836 17557 3994 -30903 -28488 -14600 1366 5901 5114
20688E114Q129O751R6349K2989l5413q2035J3790K9591K8482j867M7639N4811
$$ 5114 13243 19994 116343 139332 103919 21884 35674 65265 93747 91880 139519 194330
20676A94330Q5547o3876j23789p2239k3900P5777L606k3918J2064N0504J4025
$$ 194330 279877 216001 92212 19973 -3927 71850 75456 51538 63602 114106 128131
20665A28131j9047N1004Q5668M4102L6861J43046J37634N5238R2638M4655L9139
$$ 128131 109084 160088 245756 289858 326719 469765 607399 662637 755275 799930 839069
20654H39069P3963R6875o0678j16670L424L6309m9311j39616k9547J8450R0667
$$ 839069 913032 1009907 949229 832559 835983 872292 822981 683365 653818 672268 762935
20643G62935J00526J09217O5543N600l6267o173n2523l9362m7542m8985q4840
$$ 762935 863461 972678 1038221 1043821 1007554 1001381 948858 909496 861954 812969 728129
20632G28129j39134m9719r7107K7752K968m9333M6473o45p4613k3035J2901q4416
$$ 728129 588995 539276 442169 469921 472889 423556 470029 469384 394771 371736 384637 300221
20620C00221j29697n3934J4275M6940m660j9039n2150l2540P5716k1408L6087
$$ 300221 170524 116590 130865 177805 173145 154106 101956 69416 145132 123724 159811
20609A59811Q5985N0913k4071n6931n0033j5992m0327n3028k0348K1308j3616
$$ 159811 245796 296709 272638 215707 165674 149682 109355 56327 35979 57287 43671
20598D3671K7920Q336l6370J8945J5713K8798M5564K5552Q057r6275q942n2796
$$ 43671 71591 79927 43557 62502 78215 107013 152577 178129 186186 89911 80969 28173
20586B8173K9569k787k8070k4949m7710M2315K4101q8489N1945O038K0599m1414
$$ 28173 57742 54955 26885 1936 -45774 -3459 20642 -67847 -15902 -9864 10735 -30679
20574c0679J2286M8246N79j4348K6952M4770l5417j892L8648r923j8084k8131
$$ -30679 -18393 29853 30432 16084 43036 87806 52389 50497 89145 79222 61138 33007
20562C3007R947O6232L8542Q9808M2580q896P3050N5483J5175k114K0541n627
$$ 33007 42954 109186 147728 237536 280116 271220 344270 399753 414928 412814 433355 427728
20550D27728j0801o5326m0122k4454k7228K6131J4218n350M6728O3643j4111r8357
$$ 427728 416927 351601 311479 287025 259797 285928 300146 294796 341524 405167 391056 292699
20538B92699k759O5304L8542L3201j9483p2964j09552k7455o7703L3830p13m5667
$$ 292699 289940 355244 393786 426987 407504 334540 224988 197533 129830 163660 162947 117280
20526A17280K866J9871K4246J1356p1754n9144l8113N8784Q7512o1307l6568J5391
$$ 117280 120146 140017 164263 175619 103865 44721 6608 65392 152904 91597 55029 70420
20514G0420k1326J1885J8231J36143L4026O762k7379r3587R804q271j12798Q994
$$ 70420 49094 60979 79210 215353 249379 256141 228762 135175 144979 136708 23910 32904
20502C2904N6858j8588P6553j4647k6742N6110M1441n262K3960o5804l8338k9062
$$ 32904 89762 71174 147727 133080 106338 162448 203889 198627 222587 156783 118445 89383
20490H9383j4386m8744m7379k8117M85j4026K7223N2238M8249q400l2976K6045
$$ 89383 74997 26253 -21126 -49243 -48758 -62784 -35561 16677 64926 56526 23550 49595
20478D9595L5745k6051N8227L1180k2327q0887r489N4933J6573n9965j9999l1832
$$ 49595 85340 59289 117516 148696 126369 45482 35993 90926 107499 47534 27535 -4297
20466d297k4144J3677K9201J0232l769k3397l8447j0604j1941k3358K6640N4776
$$ -4297 -28441 -14764 14437 24669 20900 -2497 -40944 -51548 -63489 -86847 -60207 -5431
20454e431J8316l0883O911R5294p3639r4262O9037M017j0792K1664p103k1975
$$ -5431 12885 -17998 -11087 84207 10568 -83694 -14657 -10640 -21432 232 -6871 -28846
20442b8846l3815N5882L0427M1040J5345p28N9478R587N8394J9112m0337o2262
$$ -28846 -62661 -6779 23648 64688 80033 79305 138783 148370 206764 225876 185539 123277
20430A23277j1081k544O425k1028J6558l7147j8806K6414m8457n1403k3180j3846
$$ 123277 112196 109652 116077 95049 111607 74460 55654 82068 33611 -17792 -40972 -54818
20418e4818K8360J3738m9571M6653N0197J9302j078m6721l0848N1645m8981m5206
$$ -54818 -26458 -12720 -62291 -15638 34559 53861 52783 6062 -24786 26859 -22122 -67328
20406f7328L1507L2252J8007j5944l3428k0369J5801N036J7472n7796n2607J6741
$$ -67328 -35821 -3569 14438 -1506 -34934 -55303 -39502 -34466 -16994 -74790 -127397 -110656
20394a10656L5275r059k2958O3260J4753j89j6749j5285o1085r916O1619m4708
$$ -110656 -75381 -84440 -107398 -44138 -29385 -29574 -46323 -61608 -122693 -132609 -70990 -115698
20382a15698K2276K5426K6953L4821L4062k5079P0953K8987n9465Q1470L8281
$$ -115698 -93422 -67996 -41043 -6222 27840 2761 73714 102701 43236 124706 162987
20371A62987r5529m4931N2016Q542K3953J8004p338J1271j2979l5153N842q27
$$ 162987 67458 22527 74543 83085 107038 125042 117704 128975 115996 80843 86685 85858
20359H5858M4961M4085K9107o7110o0342K1434j7828L5356N4287j0271K376J1774
$$ 85858 130819 174904 204011 136901 76559 97993 80165 115521 169808 159537 161913 173687
20347A73687M3248j2768l9961p1563R0432M0171o2887J7047k8198l899L915l7570
$$ 173687 216935 204167 164206 92643 183075 223246 160359 177406 149208 145309 149224 111654
20335A11654j3259L9989o5542K6375M1121o7420k5082J2434k318k6502P422o1157
$$ 111654 98395 138384 72842 99217 140338 72918 47836 60270 57952 31450 38872 -22285
20323b2285j7221R6189J45083k1505o0009k4619n5219O3273j5617r9440m5620
$$ -22285 -39506 56683 201766 180261 120252 95633 40414 103687 88070 -11370 -56990
20312e6990P0620R0690K1152J3474L6951n1817k6342P9840K2965m2111m2295q917
$$ -56990 13630 104320 125472 138946 175897 124080 97738 177578 200543 158432 116137 107220
20300A07220M1510j2370J0263K4846J3588L3310n6559P619j8117O331Q609J0745
$$ 107220 148730 136360 146623 171469 185057 218367 161808 169427 151310 157641 166250 176995
20288A76995n7626L6654Q630n0149n3490Q5065j218l2986L4279M0239K2907P2909
$$ 176995 119369 156023 164653 114504 61014 146079 144861 111875 146154 186393 209300 282209
20276B82209m5234l1935k9270k5755p8357M6498N3507L2214J9408L283L275l0167
$$ 282209 236975 205040 175770 150015 71658 118156 171663 203877 223285 226568 229843 199676
20264A99676N7485R3659K8115R681k7679P4928O9548N4045k8304M5907M6828l2724
$$ 199676 257161 350820 378935 388616 360937 435865 505413 559458 531154 577061 623889 591165
20252E91165p8148r0906r155o66J360M6211N4173k7793k0146Q8149o3590q2747
$$ 591165 513017 422111 412956 412290 413650 459861 514034 486241 466095 554244 490654 407907
20240D07907K2022N3390J379K1463J53630J07906j806K489K6577j4063M0323O2081
$$ 407907 429929 483319 484698 506161 659791 767697 765891 768380 794957 780894 821217 883298
20228H83298N1060J03524J29250J49088J10715l309p7122K8850k417p6362q8753
$$ 883298 934358 1037882 1167132 1316220 1426935 1423626 1346504 1375354 1372937 1296575 1207822
20217A207822J705Q6155m176J6474m7134J7731R5871N6187J09432L9861P1950
$$ 1207822 1209527 1295682 1291506 1307980 1260846 1278577 1374448 1430635 1540067 1579928 1651878
20206A651878N8329k9965p8400N6267J2002o6306j00297p0330k1056j04825j50035
$$ 1651878 1710207 1680242 1601842 1658109 1670111 1603805 1503508 1433178 1412122 1307297 1157262
20195A157262j00253P9011J0627j7377m316k44Q336N9938K894K1161o8899K7382
$$ 1157262 1057009 1136020 1146647 1129270 1124954 1124710 1133046 1192984 1195878 1217039 1148140 1175522
20183A175522K8303K6305l2590q397r887k1438L0376J9111L0121L685n3665J739
$$ 1175522 1203825 1230130 1197540 1189143 1179256 1157818 1188194 1207305 1237426 1241111 1187446 1189185
20171A189185P7367Q1306J55685M9911l352N4334N0260M3189k0947M7557P9908
$$ 1189185 1266552 1347858 1503543 1553454 1550102 1604436 1654696 1697885 1676938 1724495 1804403
20160A804403L1384m924k161J1120P0390L3892Q1669Q8666J06842j7550O2281
$$ 1804403 1835787 1830863 1828702 1839822 1910212 1944104 2025773 2114439 2221281 2203731 2266012
20149B266012J20110J89082K63000J82049J22454K37265K16947K12992K22880
$$ 2266012 2386122 2575204 2838204 3020253 3142707 3379972 3596919 3809911 4032791
20140D032791J95729J96844Q2656L9298J72965J51459J80528K08659K87659L91909
$$ 4032791 4228520 4425364 4508020 4547318 4720283 4871742 5052270 5260929 5548588 5940497
20130E940497M38966N93566O78569P17533P26810Q01472Q06612R66200J018524
$$ 5940497 6379463 6973029 7651598 8369131 9095941 9897413 10704025 11670225 12688749
20121A2688749J090076J174911J502511J826622K245400K832181L533984M537282
$$ 12688749 13778825 14953736 16456247 18282869 20528269 23360450 26894434 31431716
20113C1431716N732105P405151R411976J1953427J4591414J6853586J7812338
$$ 31431716 37163821 44568972 53980948 65934375 80525789 97379375 115191713
20106A15191713J6990670J4210955R133446K581292k468960m971485p060324j0516033
$$ 115191713 132182383 146393338 155526784 158108076 155639116 150667631 143607307 133091274
20098A33091274j2949761j1182342n495950J087699P020532J1438951J3734732
$$ 133091274 120141513 108959171 103463221 104550920 111571452 123010403 136745135
20091A36745135J3522519J0896962N670923j152867o545669r250555j1721494
$$ 136745135 150267654 161164616 166835539 165682672 159137003 149886448 138164954
20084A38164954j5747174j9205662j9034051j5542981j1280535p853056n701598
$$ 138164954 122417780 103212118 84178067 68635086 57354551 49501495 43799897
20077D3799897m351196l403299k753920k257663j833749j643773j286040j045834
$$ 43799897 39448701 36045402 33291482 31033819 29200070 27556297 26270257 25224423
20069B5224423q22311q70865p74420p67586r61544j018118j005781j034983j143846
$$ 25224423 24402112 23531247 22756827 21989241 21027697 20009579 19003798 17968815 16824969
20060A6824969j204747j050165r12054p83146p23382o79458o08752n45248n98546
$$ 16824969 15620222 14570057 13658003 12874857 12151475 11472017 10863265 10318017 9719471
20051I719471n43086n10547m91740n00006m69893m91705n70869m01582l91206
$$ 9719471 9176385 8665838 8174098 7674092 7204199 6712494 6141625 5740043 5348837
20042E348837l13085k14216l08984k60183l03290k62997j86193k11344j82767
$$ 5348837 5035752 4821536 4512552 4252369 3949079 3686082 3499889 3288545 3105778
20033C105778j30238j95676j56169q5570j30614o8965r8920j12330r8589j59721
$$ 3105778 2975540 2779864 2623695 2538125 2407511 2338546 2239626 2127296 2028707 1868986
20023A868986m1353k9658q5117p4478j12118j26602l9117r6837j19811j6004N103
$$ 1868986 1827633 1797975 1712858 1638380 1526262 1399660 1360543 1263706 1143895 1127891 1132994
20012A132994r240q3534l6835j24280j38283p986l2947m9933p3492k1062P8649
$$ 1132994 1123754 1040220 1003385 879105 740822 732836 699889 649956 576464 555402 634051
20001F34051P23o7319q2597K1442r146K1855M397J6826k0179j17408q3817l214
$$ 634051 634774 567455 484858 506300 497154 519009 523406 540232 520053 402645 318828 315614
19989C15614k9957N0133J07428J5078r889K1969m868K6822M885l3705k6692L0178
$$ 315614 285657 335790 443218 458296 448407 470376 465508 492330 497215 463510 436818 466996
19977D66996J9589K772l8792q4066K9943L1855k1374j6520J3295K4048N3162n5471
$$ 466996 486585 489357 450565 366499 396442 428297 406923 390403 403698 427746 480908 425437
19965D25437p9043l75K9197J4378L7893j4673l8582k2251r2708L2576J7306j237
$$ 425437 346394 346019 375216 389594 427487 412814 374232 351981 259273 291849 309155 307918
19953C07918k5054p1894l897N2643n5262k5290r286j8070M4337P8657o8433L7251
$$ 307918 282864 210970 207073 259716 204454 179164 169878 151808 196145 274802 206369 243620
19941B43620J9842K6868N0745m7653J8241J8107m5817m8107l7111JO8236M3342
$$ 243620 263462 290330 341075 293422 311663 329770 283953 235846 198735 198736 266972 310314
19929C10314l5610p873J4019L5024p6653j9181k1699r4838j9106L8056J5298j2248
$$ 310314 274704 266831 280850 315874 239221 220040 198341 103503 84397 122453 137751 125503
19917A25503K4530K7201q34P7250K9328o0366J8495k2440k677M0870O3498K9934
$$ 125503 150033 177234 176400 253650 282978 222612 241107 218667 215990 256860 320358 350292
19905C50292O8688l1503o4646J4177n1976m7500n883J7683l8381m6143o5476L4502
$$ 350292 418980 387477 322831 337008 285032 237532 231649 249332 210951 164808 99332 133834
19893A33834P6585n7509o4606Q423n9350J1901R9810j1128k9619J2302k8654l1559
$$ 133834 210419 152910 88304 96727 37377 49278 149088 137960 108341 120643 91989 60430
19881F0430k1817L8960J7662l8390m195J01319M5483q0165L8491j9482m6420K830
$$ 60430 38613 77573 95235 56845 52650 153969 199452 119287 157778 138296 91876 94706
19869I4706K0855n4229o1676M582J7158O7713j1670o5412N3252J5693P4050Q275
$$ 94706 115561 61332 -344 4238 21396 89109 77439 12027 65279 80972 155022 163297
19857A63297j6818j5156J7432N7879j01393n6360j5039l639k9002K6642o307K5580
$$ 163297 146479 131323 148755 206634 105241 48881 33842 30203 1201 27843 21536 47116
19845D7116O1713O8300n8538m3211j2675R149k2333R691k0133n7989n562R2250
$$ 47116 108829 177129 118591 75380 62705 71854 49521 59212 39079 -18910 -24472 67778
19833F7778L3678q6860k8092n054K6469o409N0599j3114o1543L5524L1309o0816
$$ 67778 101456 14596 -13496 -18550 7919 1510 52109 38995 -22548 12976 44285 -16531
19821a6531p4762k0685J7680M1555Q9181J17453o3010q3922j5744L8682M5333
$$ -16531 -91293 -111978 -94298 -52743 36438 153891 90881 6959 -8785 29897 75230
19810G5230M6770M0316j6106l8897J553M8140j7491J1550j370o1171o5919N4395
$$ 75230 122000 162316 146210 107313 108866 157006 139515 151065 149695 88524 22605 77000
19798G7000P4001L8512j7112o3854k126Q9735K4393L0965O0526j01089j11454
$$ 77000 151001 189513 172401 108547 106421 196156 220549 251514 312040 210951 99497
19787I9497n6650m0733j2403M478J8113N7440K2833l8577j9739l3659o4768N1227
$$ 99497 42847 2114 -10289 -5811 12302 69742 92575 53998 34259 600 -64168 -12941
19775a2941j9253M8937j279K612J8975l7224J5550M7460m586j8293n6327L7812
$$ -12941 -32194 16743 15464 18076 37051 -173 15377 62837 58251 39958 -16369 21443
19763B1443j696j5319k9698m0319j9184R0035M4685K5443K9485j6244j1059k6524
$$ 21443 19747 4428 -25270 -65589 -84773 5262 49947 75390 104875 88631 77572 51048
19751E1048k3082m6810K2713n315n6996L6484O7101m2167j42809j7435O7688N2229
$$ 51048 27966 -18844 3869 -1446 -58442 -21958 45143 2976 -139833 -157268 -89580 -37351
19739c7351L1871O040n0941Q173K5025L0471L4610J8672k3616J07183P1971m9617
$$ -37351 -5480 560 -50381 -42208 -17183 13288 47898 66570 42954 150137 222108 172491
19727A72491o1125M843N8702m700j29458k5586M7403L8385k001L6740P90j7278
$$ 172491 111366 116209 174911 170211 40753 15167 62570 100955 98954 135694 136484 119206
19715A19206k427l0612Q345n4048j9082p6376J0127J7353N7078Q685j01538k9371
$$ 119206 116779 86167 94512 40464 21382 -54994 -44867 -27514 29564 38249 -63289 -92660
19703i2660J08736M5297q3659j8718J8555m8729K4373O0876O4888J07827l6468
$$ -92660 16076 61373 -22286 -41004 -22449 -71178 -46805 14071 78959 186786 150318
19692A50318j21097o6991q471L6208Q8403J6955l8844N118M545N724L4062n6693
$$ 150318 29221 -37770 -46241 -10033 78370 95325 56481 61599 66144 71868 105930 49237
19680D9237k7368m6661J0243N1348k5366M0849m9222p8735J9171J22787k6704
$$ 49237 21869 -24792 -14549 36799 11433 52282 3060 -75675 -56504 66283 39579
19669C9579Q140J3673n0276n1659J3539m5170o1994K5256J38108J12003O466P497
$$ 39579 47719 61392 11116 -40543 -27004 -72174 -134168 -108912 29196 141199 147665 155162
19657A55162o4143q05j5804J7109O8013m8914m7501L227L2385J4885Q9610Q0915
$$ 155162 91019 90214 74410 91519 159532 110618 63117 66344 98729 113614 203224 284139
19645B84139m713n5987n4168j0259L0489j9261K2548J940j0066K8238O3561Q0082
$$ 284139 279426 223439 169271 159012 189501 170240 192788 194728 184662 212900 276461 356543
19633C56543N2388P2796N7071q759r226j1213J9289q4313m2323p9717k250m6097
$$ 356543 408931 481727 538798 530039 520813 509600 528889 444576 402253 322536 320286 274189
19621B74189J5777K5550M0025P5836J14115J04488L3955j2185j3893q7226j04379
$$ 274189 289966 315516 355541 431377 545492 649980 683935 671750 657857 570631 466252
19610D66252o9284r3211j4576M9601N6149j1965j06007p9617K3104K9063m391
$$ 466252 396968 303757 289181 338782 394931 382966 276959 197342 220446 249509 245118
19599B45118k5737q9139J5519o96L8846k2543J0793k8724L4512j0855j5907n040
$$ 245118 219381 130242 145761 145065 183911 161368 172161 143437 177949 167094 151187 146147
19587A46147L5459L1083M6078R6513j0517l3301l250k4367K2669K6876M7203p539
$$ 146147 181606 212689 258767 355280 344763 311462 308212 283845 306514 333390 380593 373054
19575C73054O5750O2155J7342O2484N8072K7690j16265j15177m3504k5444q342
$$ 373054 438804 500959 518301 580785 638857 666547 550282 435105 391601 366157 357815
19564C57815l2561J9014l4778K2636J9317Q3751O9053N5223P2398P3916P5411
$$ 357815 325254 344268 309490 332126 351443 435194 504247 559470 631868 705784 781195
19553G81195L1633J4028j4330K6430J08732O7853Q9676J50826K6854r6926n2095
$$ 781195 812828 826856 812526 838956 947688 1015541 1105217 1256043 1282897 1185971 1133876
19542A133876m6539n780n0705p4436k5795P928J200O7254n936O9567J13106N4888
$$ 1133876 1087337 1081557 1030852 956416 930621 938549 939749 1007003 1001067 1070634 1183740 1238628
19530A238628k3999j55648n4052q3012r2636j20055n6553p5625k9760j06768j09225
$$ 1238628 1214629 1058981 1004929 921917 829281 709226 652673 577048 547288 440520 331295
19519C31295K5533n0536p7116K5364O5908k9296m5621p6397l7252R3532N511o4145
$$ 331295 356828 306292 229176 254540 320448 291152 245531 169134 131882 225414 230925 166780
19507A66780Q8132j0198j15595l5149k0376L2522J5003J4183M8907M1564r510
$$ 166780 254912 244714 129119 93970 73594 106116 121119 135302 184209 225773 216263
19496B16263O0101K3256j9473m2365k8391L6402k5763k4423J8029J6186q7350
$$ 216263 276364 299620 280147 237782 209391 245793 220030 195607 213636 229822 142472
19485A42472q7276J8518K2060M2040n118R6634O5661j3521p7428O9035M9777m5054
$$ 142472 55196 73714 95774 137814 132696 229330 294991 281470 204042 273077 322854 277800
19473B77800l8039r0853m6349Q502m1717k1111N1169J3985j7507J3956J5157l1687
$$ 277800 239761 148908 102559 111061 69344 48233 99402 113387 95880 109836 124993 93306
19461I3306m149J449k8498J0834L2461K2109N2627k3170q8902m1751o2271M8069
$$ 93306 89157 90606 62108 72942 105403 127512 180139 156969 68067 26316 -35955 12114
19449A2114K6998p6550l8224M4064Q038R9669P9833L721o315p6780M702Q7300
$$ 12114 39112 -37438 -75662 -31598 -23560 76109 155942 159663 153348 76568 81270 168570
19437A68570J2797n6319k4589l1910r001r976K4269l2576J2953R877p8155k032
$$ 168570 181367 125048 100459 68549 59548 49572 73841 41265 54218 64095 -14060 -16092
19425a6092k609k7069k4643l4340M7121n589p1288N3991Q0006J1038p256l159
$$ -16092 -18701 -45770 -70413 -104753 -57632 -63221 -134509 -80518 -512 10526 3270 111
19413A11l4905m5551N6091L1253l6646j07862J8988J6438k7180j3182L9709R9434
$$ 111 -34794 -80345 -24254 6999 -29647 -137509 -118521 -102083 -129263 -142445 -102736 -3302
19401c302j4438r165n1905M1542O9420K1084k4000r782m522O7791J1898N630j7476
$$ -3302 -17740 -26905 -78810 -37268 32152 53236 29236 19454 14932 82723 94621 100251 82775
19388H2775J2103K940J5660j6804j4527P797o2498n8915k6308J6882P8230O2047
$$ 82775 94878 97818 113478 96674 82147 89944 27446 -31469 -57777 -40895 37335 99382
19376I9382j6175q6503J814L8095O3504l698L128J8074j0314P5253J9773j09441
$$ 99382 83207 -3296 -1482 36613 100117 96419 99547 117621 107307 182560 202333 92892
19364I2892m9244L5663Q3465N5736K1742j3594k4233p4562m2206P0106l1492q2947
$$ 92892 43648 79311 162776 218512 240254 226660 202427 127865 85659 155765 124273 41326
19352D1326k4893L441k266k9614k3837J4424R9157L0510J905m9496j4702N7369
$$ 41326 16433 19874 17608 -12006 -35843 -21419 77738 108248 110153 60657 45955 103324
19340A03324q1035o2813K0772Q611O2370j0175K4503J2794j6244k9240L0733R2824
$$ 103324 22289 -40524 -19752 -11141 51229 41054 65557 78351 62107 32867 63600 156424
19328A56424J0859k8389j37923J166J34360N0006N6998M0344j25583j07932j1829
$$ 156424 167283 138894 971 2137 136497 186503 243501 283845 158262 50330 38501
19317C8501M1068J203J5561q45l431P8668P6887p8367l5133N0793N619m6384M1634
$$ 38501 79569 80772 96333 95488 92057 170725 247612 169245 134112 184905 190524 144140 185774
19304A85774K0731M6173p2638p2438J5140J32054L2412n6319q0465j34429m3875
$$ 185774 206505 252678 180040 107602 122742 254796 287208 230889 150424 15995 -27880
19293b7880j4946j6877L0661K8773J15859K7193r4020l9641L8414M6566J00435
$$ -27880 -42826 -59703 -29042 -269 115590 142783 48763 9122 47536 94102 194537
19282A94537L1690j02094o2934m31N5480J3444M4615N3571J593M5145M2234l4737
$$ 194537 226227 124133 61199 60768 116248 129692 174307 227878 229471 274616 316850 282113
19270B82113P789l9226n3230K5681M3318J1097l6953o623P6124L8606q926L0968
$$ 282113 289902 250676 197446 223127 266445 277542 240589 233966 310090 348696 339770 370738
19258C70738Q609j3521L0040k3976R66J1550J5820j0033M4045p950q1623j9569
$$ 370738 379347 365826 395866 371890 372856 384406 400226 390193 434238 426288 344665 325096
19246C25096J7173L2265K7176J39876R1325L6312J18119Q0270L4355j6620p400
$$ 325096 342269 374534 401710 541586 632911 669223 787342 867612 901967 885347 877947
19235H77947r8177j04668k2742L257L2358M4993o1717L0600Q0645l29N2517J21732
$$ 877947 779770 675102 652360 655617 687975 732968 671251 701851 782496 782167 834684 956416
19223I56416l4932o1225p4878q309J560j49632p5223n4519M326J1270K199O1324
$$ 956416 921484 860259 785381 777072 778632 629000 553777 499258 503584 514854 517053 578377
19211E78377L9539p3177n9867k5845P0451O4766j2435k8908N6995O4582p9873
$$ 578377 617916 544739 484872 459027 529478 594244 581809 552901 609896 674478 594605
19200E94605M086R9439Q0494J3339J1020p856o90n8371j1843M401j3407R1238
$$ 594605 598691 698130 778624 791963 802983 795127 794437 736066 724223 728624 715217 806455
19188H06455O0575P9786R1992N4763O130R5471J21987M8163J1382O513l0570m4642
$$ 806455 867030 946816 1038808 1093571 1099701 1195172 1317159 1365322 1376704 1383217 1352647 1308005
19176A308005m7210k6816l7841k1587N63O3273Q3079P2342M6293R7077Q2527q663
$$ 1308005 1260795 1233979 1196138 1174551 1175114 1238387 1321466 1393808 1440101 1537178 1619705 1611042
19164A611042J7076k3623L1166J4338K5469j8996L0861k2173p045M3972K2866
$$ 1611042 1628118 1604495 1635661 1649999 1675468 1656472 1687333 1665160 1658115 1702087 1724953
19153A724953J21792R6724J42730J51549J43108J18866J70077K14546K51826J63356
$$ 1724953 1846745 1943469 2086199 2237748 2380856 2499722 2669799 2884345 3136171 3299527
19143C299527K37288K03588J94562K24790L90987M23753M22903N35227N43982
$$ 3299527 3536815 3740403 3934965 4159755 4550742 4974495 5397398 5932625 6476607
19134F476607O20584Q28663J047647J324209J618361J889469K246577K817202
$$ 6476607 7097191 7925854 8973501 10297710 11916071 13805540 16052117 18869319
19126A8869319L911922N295692P105160R322877J1826097J3893290J4219673J2002972
$$ 18869319 22781241 28076933 35182093 44504970 56331067 70224357 84444030 96447002
19118I6447002P129908j711160j0761549j6286546j5691784j0626820n435915
$$ 96447002 103576910 101865750 91104201 74817655 59125871 48499051 43063136
19111D3063136j402615J604469M156160O778482R574142J1852650J2255661J0188292
$$ 43063136 41660521 43264990 47421150 54199632 63773774 75626424 87882085 98070377
19103I8070377N501877k862726j1575372j7260169j7235640j2626069p967435
$$ 98070377 103572254 100709528 89134156 71873987 54638347 42012278 34044843
19096C4044843n014371l302579k437805j866242j470856j279181j017039q32568
$$ 34044843 29030472 25727893 23290088 21423846 19952990 18673809 17656770 16824202
19088A6824202p36680n07073m12649k16745j51151j10494n9016J14847J80881
$$ 16824202 16087522 15580449 15167800 14951055 14799904 14689410 14630394 14745241 14926122
19079A4926122J70801P7844M9519K58936M78577N82609Q74332J309252J725595
$$ 14926122 15096923 15174767 15224286 15483222 15961799 16544408 17418740 18727992 20453587
19070B0453587K163273L009395M221713N763931P724681J0082261J2834673J4604695
$$ 20453587 22616860 25626255 29847968 35611899 43336580 53418841 66253514 80858209
19062H0858209J4389308J1434542N393320m472370j3244019j7864326j5827877
$$ 80858209 95247517 106682059 112075379 107603009 94358990 76494664 60666787
19055F0666787j0152229m762850o87622K299339N013722P854060J0720275J2727769
$$ 60666787 50514558 45751708 45064086 47363425 52377147 60231207 70951482 83679251
19047H3679251J2561660R695408L900603n491570j4198992j9384306j7786834
$$ 83679251 96240911 105936319 109836922 104345352 90146360 70762054 52975220
19040E2975220j2323852p595905m844460l349516k493730j920109j664216j351942
$$ 52975220 40651368 33055463 28211003 24861487 22367757 20447648 18783432 17431490
19032A7431490j296674j263571r85526p41723n62783n06965m36550l71690l08398
$$ 17431490 16134816 14871245 13885719 13143996 12581213 12074248 11637698 11266008 10957610
19023A0957610l41222l90856l51588m18143n63231o27447n96065n96711n43155
$$ 10957610 10616388 10225532 9873944 9455801 8892570 8265123 7669058 7072347 6529192
19014F529192n26354m81596l40900l45924l22347k83468k15465k72590k61103
$$ 6529192 6002838 5521242 5180342 4834418 4512071 4228603 4013138 3740548 3479445
19005C479445j81807k26388k50763j59599k02895j88456p4791O537o4333j24557
$$ 3479445 3297638 3071250 2820487 2660888 2457993 2269537 2194746 2201283 2136950 2012393
18995B012393j70425m7285n8269m3202Q154p0688k08817k12147r2768J8060L0556
$$ 2012393 1841968 1794683 1736414 1693212 1701366 1630678 1421861 1209714 1116946 1135006 1165562
18984A165562j4279l8923j08928p4418p0871n9250j9857r8469n1782m7092o71
$$ 1165562 1151283 1112360 1003432 929014 858143 798893 779036 680567 628785 581693 581022
18973E81022j1157o2826l2061K2025L1358K46J1311n4700j34134Q541O23k3852
$$ 581022 569865 507039 474978 497003 528361 528607 539918 485218 351084 359625 360248 336396
18961C36396J5212L8131k7267n0278j7415o82n332o1786l1106L3672Q9719j2244
$$ 336396 351608 389739 362472 312194 294779 294097 288765 226979 195873 229545 319264 307020
18949C07020m7134q211N9929Q509n5483l5630N3490K9453o3205L1039N407k1747
$$ 307020 259886 251675 311604 320113 264630 229000 282490 311943 248738 279777 285184 263437
18937B63437P0227N618p4432P1718P4401N5338n7223l4882K49n3860l4125q5639
$$ 263437 333664 339282 264850 336568 410969 466307 409084 374202 374451 320591 286466 200827
18925B00827o4041L4788J982J5394O1862K8248Q052J1580J8329j05755o9005r7985
$$ 200827 136786 171574 173556 188950 250812 279060 287112 298692 317021 211266 142261 44276
18913D4276l1133J5300L3170R4645j4405q9145L3630j0626p9556M4238M5125Q537
$$ 44276 13143 28443 61613 156258 141853 52708 86338 75712 -3844 40394 85519 94056
18901I4056M0869k2869p4057Q0248N3950N1308k9742N069M3493j2658p701q065
$$ 94056 134925 112056 37999 118247 172197 223505 193763 198832 242325 229667 221966 213901
18889B13901N5679m9618m2753j2392M5786o9392j8546O5905J2885n9369j3513
$$ 213901 269580 219962 177209 164817 210603 141211 122665 188570 201455 142086 128573
18878A28573k573j9453M7484k7978k3209j662O9959K9567k729r84p5192l8950
$$ 128573 126000 106547 154031 126053 102844 101182 171141 200708 197979 196995 121803 82853
18866H2853L312j4573P1398M6311l9896n0367M7469L7482n3778k33J6173J9314
$$ 82853 86165 71592 142990 189301 149405 99038 146507 183989 130211 129978 146151 165465
18854A65465m0352L0308K7516m6822k3669l9702n4665j2965K9372L4241O9931
$$ 165465 125113 155421 182937 136115 112446 72744 18079 5114 34486 68727 138658
18843A38658L057J6795J13p0920k0356P6j2435p0911m6494K6252K5073P738j830
$$ 138658 141715 158510 158623 87703 67347 67423 54988 -15923 -62417 -36165 -11092 -3354 -5184
18830e184j5659M9209K3156L1251K7678K3438j5346j5087n0750K0213k3416k4172
$$ -5184 -20843 28366 51522 82773 110451 133889 118543 103456 52706 72919 49503 25331
18818B5331k8677J0361P171K548O9098m393o6197q0453L6561R8119N9958j3687
$$ 25331 -3346 7015 14186 16734 85832 81439 15242 -65211 -28650 69469 129427 115740
18806A15740n9255k9009J6927l2026O157J9858O3306L6561o0384o5056o6710K9222
$$ 115740 56485 27476 44403 12377 18534 38392 101698 138259 77875 12819 -53891 -24669
18794b4669K4862l8226M1421O4566j5257j18502K6360J01540L1902l0674j4502
$$ -24669 193 -38033 3388 67954 52697 -65805 -39445 62095 93997 63323 48821
18783D8821k2120J7298k431M1252J7015q6756K4124M5240J5875k4969J1835L7239
$$ 48821 26701 43999 41568 82820 99835 13079 37203 82443 98318 73349 85184 122423
18771A22423P0233K9300K7433J26654P1266J38766N2235O4635q2978k16857j42831
$$ 122423 192656 221956 249389 376043 447309 586075 638310 702945 619967 403110 260279
18760B60279r5719k1335M7638l9654n8337K0593J829k5031m3351k3049l0852l6553
$$ 260279 164560 143225 190863 151209 92872 113465 115294 90263 46912 23863 -6989 -43542
18748d3542J2196M4052N5610l5329n6559j3608O1881K1459R418p852l0542m0092
$$ -43542 -31346 12706 68316 32987 -23572 -37180 24701 46160 55578 47726 17184 -22908
18736b2908J3979P518K6024L6733n01p811j3248j8558n059K8799l099l7980q377
$$ -22908 -8929 -1411 24613 61346 60845 53034 39786 21228 16169 44968 41869 3889 -4488
18723d488k4202o0843r1861k379Q1901l3783k5153l7270N9235N5950M7991M0703
$$ -4488 -28690 -89533 -181394 -183773 -101872 -135655 -160808 -198078 -138843 -82893 -34902 5801
18711E801o0864K04K9288J0056J1813k7519k998K5527k0914k9076m6345m8926
$$ 5801 -55063 -54859 -25571 -15515 -3702 -31221 -34219 -8692 -29606 -58682 -105027 -153953
18699a53953P3933P5223k7014N5299j0283m5552m9717K3952l6696n821P4893M2219
$$ -153953 -80020 -4797 -31811 23488 13205 -32347 -82064 -58112 -94808 -100629 -25736 16483
18687A6483K3150K8689L0871j648L0319j10880n8208j6378k209o6287R868N8051
$$ 16483 39633 68322 99193 97545 127864 16984 -41224 -57602 -59811 -126098 -116230 -58179
18675e8179J8143K2728J12985m5674n5288j9416N0277K961J2970J967p7581k5357
$$ -58179 -40036 -17308 95677 50003 -5285 -24701 25576 28537 41507 43474 -34107 -59464
18663e9464k32K4586L6647p0459M28K0007k6533j693M2191J5041l0126k9694l5008
$$ -59464 -59696 -35110 1537 -68922 -68494 -48487 -75020 -76713 -34522 -19481 -49607 -79301 -114309
18650a14309o9382q531J03862R1642M9680L659L7841l1622J9292L4754N2675L5737
$$ -114309 -183691 -192222 -88360 3282 52962 56621 94462 62840 82132 116886 169561 205298
18638B05298R700O8522L1134k5967m4869m6555j14766l6191L0882Q844N3782O8606
$$ 205298 214998 283520 314654 288687 243818 197263 82497 46306 77188 86032 139814 208420
18626B08420R5637L8774L4333O5305j33p7032N074L7861p3697k6346n9454l6589
$$ 208420 304057 342831 377164 442469 442336 365304 370378 408239 334542 308196 248742 212153
18614B12153K6384p39n3353n7491J68175J24347O0439k6174p357P2892O611J3362
$$ 212153 238537 237798 184445 126954 295129 419476 479915 453741 446384 519276 525887 539249
18602E39249K9950J6214R0568J5686p7647j12566n6041j00469n438J168K6658
$$ 539249 569199 585413 675981 691667 614020 501454 445413 344944 339506 340674 367332
18591C67332k8987M29N8662R7463R8552Q2439K4783m1871p8497n9766r0639l1929
$$ 367332 338345 338774 397436 494899 593451 675890 700673 658802 580305 520539 429900 397971
18579C97971J158o9604q0075p3569j63377J0499O3630O4841l5355L369j6698o5025
$$ 397971 399129 329525 249450 175881 12504 23003 86633 151474 116119 119488 102790 37765
18567C7765J4362K6440k0193p9262m4875R5361O705N9239L8330j7381m0844O945
$$ 37765 52127 78567 58374 -20888 -65763 29598 36303 95542 133872 116491 75647 82592
18555H2592L3570n4254j5107m6168q972J23501O7882o417R0642Q3603K05J04485
$$ 82592 116162 61908 46801 633 -8339 115162 183044 176627 267269 350872 351077 455562
18543D55562J24373K8715o3207q7895q1267p0681q4303k0379J9140M8995O6932
$$ 455562 579935 608650 545443 457548 376281 305600 221297 200918 220058 269053 335985
18532C35985P4626m9223L3075P0203R2046L942o6413r2954q1947p3354n5741o7216
$$ 335985 410611 361388 394463 464666 556712 560654 494241 401287 319340 245986 190245 123029
18520A23029j64938k6647L6272J4207J7774M9990R47O226j1131k6910O149j8315
$$ 123029 -41909 -68556 -32284 -18077 -303 49687 50634 56860 45729 18819 24968 6653
18508F653q475J8554J864O29m090l5197O325Q0843Q3419r1368p9962m6742K1842
$$ 6653 -1822 16732 18596 19225 15135 -20062 -13737 67106 150525 59157 -20805 -67547 -45705
18495d5705P348J3492j367M1292P1341p937j1757j6673m1185k7199o1178j0574
$$ -45705 -38357 -24865 -26232 15060 86401 78464 66707 50034 8849 -18350 -79528 -90102
18483i0102Q2436n0342k5876L9662O5717n4678p9930M8294P7409J5010k4903m7210
$$ -90102 -7666 -58008 -83884 -44222 21495 -33183 -113113 -64819 12590 27600 2697 -44513
18471d4513L300L4724K2112m241j5296l3215L0357l4554K5583J6775k0191R6609
$$ -44513 -41213 -6489 15623 11382 -3914 -37129 -6772 -41326 -15743 1032 -19159 77450
18459G7450M2811m512j4952q4525m0334O488J6709J9396R842N7502N0624r7264
$$ 77450 120261 115749 100797 16272 -24062 -17574 -865 18531 28373 85875 136499 39235
18447C9235r0863K0437K4861o3199k7075j3440r867J7O0617K3309M4208k040j32
$$ 39235 -51628 -31191 -6330 -69529 -96604 -110044 -119911 -119894 -59277 -35968 8240 6200 6068
18434F068J7965k7396m231J5751J2311J267m2285l5439J3224O9943r3540M2467
$$ 6068 24033 -3363 -7594 8157 20468 21735 -20550 -55989 -42765 27178 -66362 -23895
18422b3895q792k3813M0641k2238J511m4915k356L7171J2613n6520L0363Q4434
$$ -23895 -32687 -56500 -15859 -38097 -36586 -81501 -83857 -46686 -34073 -90593 -60230 24204
18410B4204j4600o2761r469M4855K1651K0821J5402n2655m2181M9528K7486k5364
$$ 24204 9604 -53157 -62626 -17771 3880 24701 40103 -12552 -54733 -5205 22281 -3083
18398c083O813M9020N2846P9321N1670O5823J588p4796l0084J0879n3383o6872
$$ -3083 3730 52750 105596 184917 236587 302410 303998 229202 199118 209997 156614 89742
18386H9742q104L3645m063J1385m203l4303L7826J5395Q636N659j03303p7962
$$ 89742 81638 115283 111220 122605 118402 84099 121925 137320 145956 151615 48312 -29650
18374b9650R591k4353P7127P599m8403M7685O3493K932L0802k3384m7531L9040
$$ -29650 -20059 -44412 32715 40314 -8089 39596 103089 106021 136823 113439 65908 104948
18362A04948K3706P529j4950j7371k8107L693m8380k7107p831K3278L3355N921
$$ 104948 128654 136183 121233 103862 75755 79448 31068 3961 -3870 19408 52763 58684
18350E8684l0742k6058P7633n507N708K1321J6001l4317Q961K3767K853N3963
$$ 58684 27942 1884 79517 74010 79718 101039 117040 82723 91684 115451 118304 172267
18338A72267k7541j5394P7983Q9690P454m1669j0160k5872q0590J6821k8692P305
$$ 172267 144726 129332 207315 297005 304459 262790 252630 226758 146168 162989 134297 141602
18326A41602R326m0653l0937J6843k7901p2280l1027Q2478j787k9562j7748K4648
$$ 141602 150928 110275 79338 96181 68280 -4000 -35027 47451 45664 16102 -1646 23002
18314B3002m5980q8945o5554j5736J5734M1234P1631k0685j1676P1887O3421l564
$$ 23002 -22978 -111923 -177477 -193213 -177479 -136245 -64614 -85299 -96975 -25088 38333 34769
18302C4769k031o285k2820P336k8897m8280O4729K5176m0935j4058M0981K3895
$$ 34769 32738 26453 3633 10969 -17928 -66208 -1479 23697 -17238 -31296 9685 33580
18290C3580p3733q293j2103J9750L6141o9079n5055L0695n690m116l4996L3861
$$ 33580 -40153 -48446 -60549 -40799 -4658 -73737 -128792 -98097 -103787 -107903 -142899 -109038
18278a09038L5406L7694N0654O8873L2692k2666j10218m8390P4769N5566l5461
$$ -109038 -73632 -35938 14716 83589 116281 93615 -16603 -64993 9776 65342 29881
18267B9881l2358J4828J1836l4332N2415O991K847K6392J8829n5649j158K1019
$$ 29881 -2477 12351 24187 -10145 42270 49261 52108 78500 97329 41680 40522 61541
18255F1541k2271q8758j9313P513J7716M8472M8292p4395j11159J6171P7720O8325
$$ 61541 39270 -49488 -68801 -61288 -43572 4900 53192 -21203 -132362 -116191 -38471 29854
18243B9854N3041P7624L1808j7614n9876n9636l760M0301N8106R0049J1337j5117
$$ 29854 82895 160519 192327 174713 114837 55201 51441 91742 149848 239897 251234 236117
18231B36117L1804k0642n0653k3231K5670O4527n4046l6418n972l9275l7381k1479
$$ 236117 267921 247279 196626 173395 199065 263592 209546 173128 167156 127881 90500 69021
18219F9021M6165l8087k063p3300M1107Q8013J9030p0732q3400k1473N1061J62449
$$ 69021 115186 77099 75036 1736 42843 130856 149886 79154 -4246 -25719 25342 187791
18207A87791K830j30709J7795k471l4675M0374K2372O0349M6204Q1254O8428n6005
$$ 187791 190621 59912 77707 75236 40561 80935 103307 163656 209860 291114 359542 303537
18195C03537m1462M0166o6229J9790n9140K4522J5820n9847q8638j1592J0640
$$ 303537 262075 302241 236012 255802 196662 221184 237004 177157 88519 76927 87567
18184H7567J9773O6603k9645j6112j4070K9192Q4821l8121J2506M9075l4023J6263
$$ 87567 107340 173943 144298 128186 114116 143308 228129 190008 202514 251589 217566 233829
18172B33829M9664j3246o4283p826K3492K7082P9902j4698n9243R156O9883j910
$$ 233829 283493 270247 205964 198138 221630 248712 328614 313916 254673 263829 333712 331802
18160C31802k9427l0697l9403r356Q7173M8780K3967l3737J5135K4333L4980M5286
$$ 331802 302375 271678 232275 222919 310092 358872 382839 349102 364237 388570 423550 468836
18148D68836L1589K4980k8878M2290J47J11416O6949l9623N1128O4107Q2826p861
$$ 468836 500425 525405 496527 538817 538964 650380 717329 677706 728834 792941 875767 867906
18136H67906j0182M9845R7368L5376J03380J70823K46814J62304J88579L29195
$$ 867906 857724 907569 1004937 1040313 1143693 1314516 1561330 1723634 1912213 2241408
18126B241408L01736L47708L46640M60614N79032O69154Q44750J090183J278992
$$ 2241408 2543144 2890852 3237492 3698106 4277138 4946292 5791042 6881225 8160217
18117H160217J573539K148956K911239M033997N589660P498273R758550J3165612
$$ 8160217 9733756 11882712 14793951 18827948 24417608 31915881 41674431 54840043
18109E4840043J6088313J4225754R513572M644388q266859k5136387k3164240
$$ 54840043 70928356 85154110 94667682 99312070 91045211 65908824 42744584
18102D2744584j4233038p689391m359075k723510j911884j476246j192261q95615
$$ 42744584 28511546 20822155 16463080 13739570 11827686 10351440 9159179 8263564
18094H263564p26959n45955l48581k55001j55661j21582j85715j08957n266O2378
$$ 8263564 7536605 6990650 6642069 6387068 6231407 6109825 5924110 5815153 5809887 5872265
18084E872265J81553j7286k89392m03590l43815l80860l47745l56018l44860k95886
$$ 5872265 6053818 6036532 5747140 5343550 4999735 4618875 4271130 3915112 3570252 3274366
18074C274366k12389l13299k58778j39759j02310j29008j31096j33018n8493j49889
$$ 3274366 3061977 2748678 2489900 2350141 2247831 2118823 1987727 1854709 1796216 1646327
18064A646327l4243m6188j52731j04221k2264j01109j29199o8539l9208O7455
$$ 1646327 1612084 1565896 1413165 1308944 1286680 1185571 1056372 987833 948625 1016080
18054A016080j6883j27569p8104m2883K3797p2713l7354k1925l5829o0698P3107
$$ 1016080 999197 871628 793524 750641 774438 701725 664371 642446 606617 545919 619026
18043F19026j0111o1549l5374j1383M6092m0307q8592r0348r0322J10966J14607
$$ 619026 608915 547366 511992 500609 546701 506394 417802 327454 237132 348098 462705
18032D62705k8108M8180K7594j3564l8133n9648m5640n1602o8581J3686J1240
$$ 462705 434597 482777 510371 496807 458674 399026 353386 301784 233203 246889 258129
18021B58129J6457M2926J2840n2121N7332n8697p0823k9814P7687Q1440p0880
$$ 258129 274586 317512 330352 278231 335563 276866 206043 176229 253916 335356 264476
18010B64476p0025l9129J2213J13547M6294j846r5823J9331P0781n1550p5770
$$ 264476 194451 155322 167535 281082 327376 325530 229707 249038 319819 268269 192499
17999A92499o355M6879n1332m2438J15684J15403J964n3838m2857J2032l046J1647
$$ 192499 186144 233023 181691 139253 254937 370340 372304 318466 275609 287641 284595 296242
17987B96242N2153J7254m301l8889m7351N601k6630n1075o2508N6656J1340m5845
$$ 296242 348395 365649 361348 322459 275108 280709 254079 203004 140496 197152 208492 162647
17975A62647J2222L973m017n2955k7715K3096Q3847j4126j8884l5020q8965m7692
$$ 162647 174869 178842 174825 121870 94155 117251 201098 186972 168088 133068 44103 -3589
17963c589j01482N704L1638L2796j1154M2878N7413K8424O652j1926p990O1529
$$ -3589 -105071 -99367 -67729 -34933 -46087 -3209 54204 82628 89280 77354 69364 130893
17951A30893R0382k0561r1778O2651j2894k5008l3702q787N9497J6941o756k6652
$$ 130893 221275 200714 108936 171587 158693 133685 99983 91196 150693 167634 160878 134226
17939A34226J8354j103j4068m4070J3471J4229o919l5599j297j5203m9611l5619
$$ 134226 152580 151477 137409 93339 106810 121039 114120 78521 77224 62021 12410 -23209
17927b3209M2969J53728L6864m1052j28179p3643j07209L509J7335M0201J04541
$$ -23209 19760 173488 210352 169300 41121 -32522 -139731 -136222 -118887 -78686 25855
17916B5855J03786l949j26971k6612N8907L4507l7804j3267Q8364m864q7537j3984
$$ 25855 129641 125692 -1279 -27891 31016 65523 27719 14452 102816 97952 10415 -3569
17904c569O5858q157l6479M6148J3781m3961k5449j0008j0764q873r3549P9284
$$ -3569 62289 54132 17653 63801 77582 33621 8172 -1836 -12600 -21473 -115022 -35738
17892c5738j7499p83k3803J11756O3551l8650r2593l8412J0769m6274L3717N7373
$$ -35738 -53237 -54020 -77823 33933 97484 58834 -33759 -72171 -61402 -107676 -73959 -16586
17880a6586J4927N4208j6516m9893K8878N462M3381M1743k0414k8696o3066l9519
$$ -16586 -1659 52549 36033 -13860 15018 20480 63861 105604 85190 56494 -6572 -46091
17868d6091P9353P0927l6413j7404M0004k289q614o8175j4620J975j053r221K6371
$$ -46091 33262 104189 67776 50372 90376 88087 79473 11298 -3322 -1347 -2400 -11621 14750
17855A4750N0174P122Q159k0831j8927l2511M7465K1091k9342J2291L396l1324
$$ 14750 64924 72046 80205 59374 40447 7936 55401 76492 47150 59441 62837 31513
17843C1513r720m526l4047l7735p1509L5747J15910P6157k5248p7707J2835K1100
$$ 31513 21793 17267 -16780 -54515 -126024 -90277 25633 101790 76542 -1165 11670 32770
17831C2770j3618p1719k2166O7365K7677p793P6883L6354o4827L5658M5424o132
$$ 32770 19152 -52567 -74733 -7368 20309 12516 89399 125753 60926 96584 142008 135876
17819A35876p0057J365k5307k3889J6313K9030o1231N360n848r5555p1238N7901
$$ 135876 65819 67184 41877 17988 34301 63331 2100 7460 1612 -93943 -165181 -107280
17807a07280P4014K0638k0083L6117L5658k7275Q7641P4192k3150r7733l0381
$$ -107280 -33266 -12628 -32711 3406 39064 11789 99430 173622 150472 52739 22358
17796B2358P461M2627l723j2999k7723k8448K7818o1644K2920L489L8062l9453
$$ 22358 29819 72446 68723 55724 28001 -447 27371 -34273 -11353 -7864 30198 -9255
17784i255m7425k3307Q1971O5003J8121j7679k588J036k3176l5882K7905N1273
$$ -9255 -56680 -79987 1984 66987 85108 67429 64841 65877 42701 6819 34724 85997
17772H5997L0258j3427p2106J0033m400n5162J7183J5129j6864k83k1152j4118
$$ 85997 116255 102828 30722 40755 36355 -18807 -1624 13505 -3359 -3642 -24794 -38912
17760c8912o8705L1662N4035k5323L8685N859L9912N53j5290k6675k0015K0299
$$ -38912 -107617 -75955 -21920 -47243 -8558 -2699 37213 37766 22476 -4199 -24214 -3915
17748c915j2263j7618j376p5878o2923J0898N0811K3716j3982R2879P2727p6662
$$ -3915 -16178 -33796 -35172 -111050 -173973 -163075 -112264 -88548 -102530 -9651 63076 -13586
17736a3586k5991J5554m7598o7335R6092J05334n4334O87k5715r3801k6187K0235
$$ -13586 -39577 -24023 -71621 -138956 -42864 62470 8136 8823 -16892 -110693 -136880 -116645
17724a16645O49K1142n852o2569O00N4180R551P8132N3153L922j4713n6074J2091
$$ -116645 -115996 -94854 -100706 -163275 -162675 -108495 -98944 -20812 32341 36263 21550 -34524 -22433
17711b2433j9816j0314M3149L3090K3367j1889l6581J2485M8934k1618K1462O498
$$ -22433 -42249 -52563 -9414 23676 47043 35154 -1427 11058 59992 38374 59836 66334
17699F6334p2879l3882Q791P892L2372j5329j0706Q8658k2884p0492r737Q179
$$ 66334 -6545 -40427 -31636 -23744 8628 -6701 -17407 71251 48367 -22125 -31862 -23683
17687b3683m4529L8656L5494k573m5275o213P8675M8107k358K2002P0649L1423
$$ -23683 -68212 -29556 5938 3365 -41910 -48123 30552 78659 76301 98303 168952 200375
17675B00375M7543J13741J06880K7561M9464N0403N4605N7508J31204M7898p5140
$$ 200375 247918 361659 468539 496100 545564 595967 650572 708080 839284 887182 812042
17664H12042k8737j02726m7832l7495j13401m6236p6545o5285l5737o2466l5614
$$ 812042 783305 680579 632747 595252 481851 435615 359070 293785 258048 195582 159968
17653A59968J2200J8544k6976k3706l9821P1137P110k8655m7222q963Q252K6790
$$ 159968 172168 190712 163736 140030 100209 171346 178456 149801 102579 93616 101868 128658
17641A28658N9192m9689p9362J1360l7217j6838k0934L3722m1035P1004Q6185
$$ 128658 187850 138161 58799 70159 32942 16104 -4830 28892 -12143 58861 145046
17630A45046k1685m4898n7421k6823O7982K5627M2428N0866m1677P098N9575l6840
$$ 145046 123361 78463 21042 -5781 62201 87828 130256 181122 139445 146543 206118 169278
17618A69278O7597R3729N1852L2243K5108J37441Q8221m3630O4486P8882K4418
$$ 169278 236875 330604 382456 414699 439807 577248 665469 621839 686325 765207 789625
17607G89625n730q0410q0938j56996p8112l5686n0392q5248j04725j5308L1871
$$ 789625 783895 703485 622547 465551 387439 351753 301361 216113 111388 96080 127951
17596A27951p137K0026j9449n6480p970N7351l3051j2732J2921K0672l2047r6323
$$ 127951 120814 140840 121391 64911 56941 114292 81241 68509 81430 102102 70055 -26268
17584b6268j2638Q0435K4847j24717j6323P2532P6094p7453o5139o0353L1314
$$ -26268 -38906 41529 66376 -58341 -74664 -2132 73962 -3491 -68630 -128983 -97669
17573i7669O5681m2686N2657M8649J6266k4732P640K6260q990m5555j4039l3450
$$ -97669 -31988 -74674 -22017 26632 42898 18166 25806 52066 43076 -2479 -16518 -49968
17561d9968n7968k5757M623K3504J8748M1187K9270j4348q29m5200j9945N0934
$$ -49968 -107936 -133693 -129070 -105566 -86818 -45631 -16361 -30709 -31538 -76738 -96683 -45749
17549d5749J10259k414k6631n3896N8334L8839n7566m9476j6624k071Q024k2557
$$ -45749 64510 62096 35465 -18431 39903 78742 21176 -28300 -44924 -46995 -38971 -61528
17537f1528q9140K3646J21302O7537K7439K4923p3072L5379J6339Q126m4768o4402
$$ -61528 -150668 -127022 -5720 61817 89256 114179 41107 76486 92825 100951 56183 -8219
17525h219j5498J5473O7192q368k1128J7683p2n6284K350M8828J4169P996m0913
$$ -8219 -23717 -8244 58948 50580 29452 47135 47063 -9221 -6871 41957 56126 64122 23209
17512B3209l5216M6302R884K1119j8944j4281j4253n4248N4223O2194r14O41O1704
$$ 23209 -12007 34295 44179 65298 46354 32073 17820 -36428 17795 79989 79075 79716 141420
17499A41420m5463n2363l9656l3059L4873k6933l5432R7577N7921n8629o0451
$$ 141420 95957 43594 3938 -29121 5752 -21181 -56613 40964 98885 40256 -20195
17488b0195O113j6674m4284L9027K5956L8266M3586K8216K941L2452k2836n7575
$$ -20195 -14082 -30756 -75040 -36013 -10057 28209 71795 100011 102952 135404 112568 54993
17476E4993q317q1247n006L4321m1529M1446l0808j0313P8934k0190l5152O550
$$ 54993 46676 -34571 -39577 -5256 -46785 -5339 -36147 -46460 32474 12284 -22868 -16318
17464a6318L2511L2328k312l0897q2195K9642p6j255K9578Q012m4537m3192K402
$$ -16318 16193 48521 46209 15312 -66883 -37241 -37317 -38572 -8994 -982 -45519 -88711 -86309
17451h6309j8329N9929J45785Q507o575J500M9365O5409O5471N7332L2340L6367
$$ -86309 -104638 -44709 101076 109583 103008 104508 153873 219282 284753 342085 374425 410792
17439D10792P0568n1649j00369j37568o9192k0344j0602k9977k4713k9912N4964
$$ 410792 481360 429711 329342 191774 122582 102238 91636 61659 36946 7034 61998
17428F1998J717m4078M4582j7187k385L049L4797n2170j6569O59j0001N1494j7514
$$ 61998 63715 19637 64219 47032 44647 47696 82493 30323 13754 14413 4412 55906 38392
17415C8392k0793L6721P7494m082m5182r897P4786l3662p5044l3546k0213L0409
$$ 38392 17599 54320 131814 127732 82550 72653 147439 113777 38733 5187 -15026 15383
17403A5383L8750N5946L5875J475K7567n1072L5054L440p5087p3845J1500P413
$$ 15383 54133 110079 145954 147429 174996 123924 158978 162418 87331 13486 24986 32399
17391C2399m833p3408l4280l1372P5592M3241j0169M110K8370O54j6816l6431
$$ 32399 27566 -45842 -80122 -111494 -35902 7339 -2830 1280 29650 30304 13488 -22943
17379b2943L2975O353l2821R9734L124q0760k7511Q0603Q8199P661r742K1537
$$ -22943 10032 16385 -16436 83298 86422 5662 -21849 58754 146953 154614 144872 166409
17367A66409k9984K0592k0392j4672K416J2426J635Q212K0840k6942L1193J3317
$$ 166409 136425 157017 136625 121953 124369 136795 138430 146642 167482 140540 171733 185050
17355A85050j1671N3384R2099k6611p0138q457K9483M6575m0051p1370m2288Q4875
$$ 185050 173379 226763 318862 292251 222113 213656 243139 289714 249663 178293 136005 220880
17343B20880L4687j35533j07252N565Q4078P9660Q899M7892l0002n8214N0442
$$ 220880 255567 120034 12782 18347 102425 182085 190984 238876 208874 150660 201102
17332B01102N656j03385o0931K2390J9744K6911N7023K6921l7394J4889k7793
$$ 201102 206758 103373 42442 64832 84576 111487 168510 195431 158037 172926 145133
17321A45133k0013l010N3728J1724o194k5819M142M5436K320J01275J27259J25096
$$ 145133 125120 122110 175838 187562 181368 155549 159691 205127 207447 308722 435981 561077
17309E61077J17992J00593M2936K5004J3690n855j8649K324m5309j943o0386j01011
$$ 561077 679069 779662 822598 847602 861292 855437 836788 839112 793803 791860 731474 630463
17297F30463l8822l4273o4983j16839L9329J22307K0499m0442m6617L3138M2360
$$ 630463 591641 557368 492385 375546 414875 537182 557681 517239 470622 503760 546120
17286E46120K4933n468k5220L6837N8979m8989l8203l2010N7361L0777p7209j36361
$$ 546120 571053 565585 540365 577202 636181 587192 548989 516979 574340 605117 527908 391547
17274C91547p1750j0436J300K0051M7723R2102J3127m7607j4146q920o9398p862
$$ 391547 319797 309361 310661 330712 378435 470537 483664 436057 421911 412991 343593 335731
17262C35731P4496K540J9262Q6376O9307p0092n4033J07092O2859Q1251Q0444
$$ 335731 410227 412767 432029 518405 587712 517620 463587 570679 633538 714789 795233
17251G95233M1630N7737O9680L6470R4756q644J6629L778j04830j2305J5737k7426
$$ 795233 836863 894600 964280 1000750 1095506 1086862 1103491 1107269 1002439 990134 1005871 978445
17239I78445J4709k2999j10137q5598N525l7194K0579P4058O7678J39348P6441
$$ 978445 993154 970155 860018 774420 779945 742751 763330 837388 905066 1044414 1120855
17228A120855p692k1654L5819O2668O6194L8102K6675o6386j15570J6381p979
$$ 1120855 1113163 1091509 1127328 1189996 1256190 1294292 1320967 1254581 1139011 1155392 1147413
17217A147413j2505k6863m07p1978p72R1923J02579m0940o4448O0718L47O50O2471
$$ 1147413 1134908 1108045 1107638 1035660 1034888 1126811 1229390 1188450 1124002 1184720 1185067 1185717 1248188
17204A248188l3399M8144R8150M0359L3904Q6419J29733R7870O0004Q7926M0788
$$ 1248188 1214789 1262933 1361083 1401442 1435346 1521765 1651498 1749368 1809372 1897298 1938086
17193A938086L8017Q9888J27201J31601R1750O8382J24087J46902J62874K30888
$$ 1938086 1976103 2065991 2193192 2324793 2416543 2484925 2609012 2755914 2918788 3149676
17183C149676K95330K22690L95711M29317M67438N02392N30076O44762O75651
$$ 3149676 3445006 3667696 4063407 4492724 4960162 5462554 5992630 6637392 7313043
17174G313043Q18003J012346J111087J250423J517871J921639K490739L165885
$$ 7313043 8131046 9143392 10254479 11504902 13022773 14944412 17435151 20601036
17166B0601036M176422N440543O979692Q909145J1241053J3496878J4951467J5568989
$$ 20601036 24777458 30218001 37197693 46106838 57347891 70844769 85796236 101365225
17158A01365225J5217874J3204620J0077213O956430L835035r50770p770144j3426689
$$ 101365225 116583099 129787719 139864932 146821362 150656397 149705627 141935483 128508794
17150A28508794j5025840j4098914j3882714j4468338j3894790j1404151q362254
$$ 128508794 113482954 99384040 85501326 71032988 57138198 45734047 37371793
17143C7371793n753313l942963k775738k046993j492422j169555p91761n34202
$$ 37371793 31618480 27675517 24899779 22852786 21360364 20190809 19399048 18864846
17135A8864846n09487m90956l84393l56719l64699m45845m83648n28614n42639
$$ 18864846 18355359 17864403 17480010 17123291 16758592 16312747 15829099 15300485 14757846
17126A4757846n42708n22637l79861k84464l09858k29058m3976j3317J18031K29744
$$ 14757846 14215138 13692501 13312640 13028176 12718318 12489260 12445284 12431967 12549998 12779742
17116A2779742M31261O09512O81210Q61552J247163J658302K232354K896190L848528
$$ 12779742 13211003 13820515 14501725 15363277 16610440 18268742 20501096 23397286 27245814
17107B7245814N034727O679456Q708022J0894458J2895326J4223309J4602849
$$ 27245814 32280541 38959997 47668019 58562477 71457803 85681112 100283961
17100A00283961J4002207J1879703Q788684N766850K557723k127449q582494j3433945
$$ 100283961 114286168 126165871 134954555 140721405 143279128 141151679 132569185 119135240
17092A19135240j4521493j3548168j3261215j3705340j2867205j0384365p503418
$$ 119135240 104613747 91065579 77804364 64099024 51231819 40847454 33344036
17085C3344036n127007l437606k509214j773536j409040j023699p78490o37922
$$ 33344036 28217029 24779423 22270209 20496673 19087633 18063934 17285444 16647522
17077A6647522o13198n01963m74421m16150m51641n52700n49290o41989o98991
$$ 16647522 16034324 15532361 15057940 14641790 14190149 13637449 13088159 12446170 11747179
17068A1747179o88668p26767p42071p16101o46196o15115n73165m33887m14556
$$ 11747179 11058511 10331744 9589673 8873572 8227376 7612261 7039096 6605209 6190653
17059F190653l76534l94885l55137k89185k81880l11532k56650k14771j78524
$$ 6190653 5814119 5419234 5064097 4774912 4493032 4181500 3924850 3710079 3531555
17050C531555j96690k14311j39432j63419j80529j75294q7840r2893r4005o2965
$$ 3531555 3334865 3120554 2981122 2817703 2637174 2461880 2374040 2281147 2187142 2124177
17040B124177o5320r7471j06853j37873l5626j7846r4078r3586k5512j37450j05037
$$ 2124177 2058857 1961386 1854533 1716660 1681034 1663188 1569110 1475524 1450012 1312562 1207525
17029A207525o0391l2030l3374j28213m2816O7164j2958j7403j9055r9055j24549
$$ 1207525 1147134 1115104 1081730 953517 910701 977865 964907 947504 928449 829394 704845
17018G04845j59299m6912k4390L4066K2490m9911l2936r0689l0578Q4688N8415
$$ 704845 545546 498634 474244 508310 530800 480889 447953 357264 326686 411374 469789
17007D69789J2199k6364k9723q1140k2135n4892j4743p46l7754O0137m933p8326
$$ 469789 481988 455624 425901 344761 322626 267734 252991 252245 214491 274628 269695 191369
16995A91369O9356L0319j0767Q7041R2463k8472m4073K4919O4579L9708l7594
$$ 191369 260725 291044 280277 367318 459781 431309 387236 412155 476734 516442 478848
16984D78848L7249j5169j7811m4072j27642K1416K6328k2897L8139J7652L8977
$$ 478848 516097 500928 483117 439045 311403 332819 359147 336250 374389 392041 431018
16973D31018j797K1681J1543n25o1886J8961j2083m6508m5858J0545K4046m353
$$ 431018 429221 450902 462445 461920 400034 418995 406912 360404 314546 325091 349137 344784
16961C44784M1795j6061o3198m8504o8782j00363N4869L2052k6924l8133L749
$$ 344784 386579 370518 307320 258816 190034 89671 144540 176592 149668 111535 115284
16950A15284r560J03410j6879l3198J314J2610o000o849k1166Q832Q2389N5809
$$ 115284 105724 209134 192255 159057 160371 172981 166981 160132 138966 147798 230187 285996
16938B85996k7725k0150j0174q9973p130Q2630L7538j9824N8532M7043l3152M9442
$$ 285996 258271 238121 227947 137974 130844 213474 251012 231188 289720 336763 303611 353053
16926C53053j4384q7445k648J8591M32n4738M062p3962p9146l8308J6423k718
$$ 353053 338669 251224 248576 267167 267599 212861 216923 142961 63815 25507 41930 39212
16914C9212J06549l5770L3471j2260l5640n5648j8688O4510L6715N0056L0431
$$ 39212 145761 109991 143462 131202 95562 39914 21226 85736 122451 172507 202938
16903B02938q0351J6939n7608O0386m9980l5450J8109k8272j9017k0130n6637
$$ 202938 122587 139526 81918 142304 92324 56874 74983 46711 27694 7564 -49073
16892d9073J2680K9877N2834K0791o581J3990j258m6588K3668N7943j948l3330
$$ -49073 -36393 -6516 46318 67109 60528 74518 73260 26672 50340 108283 106335 73005
16880G3005k5132l3168k0858k5444M1921M5803L2269k8042q0742J3396J41167
$$ 73005 47873 14705 -6153 -31597 10324 56127 88396 60354 -20388 -6992 134175
16869A34175J5437L221L9539l9841j11272k6681J10781R0859q6530n5568m5388
$$ 134175 149612 152833 192372 152531 41259 14578 125359 216218 129688 74120 28732
16858B8732q589M942Q5026J401n3243n7258L5118O8856L2737q2521o4993K611
$$ 28732 20143 25085 110111 111512 58269 1011 36129 104985 137722 55201 -9792 -7181
16846g181J4209O9449O9761J0589l3814j8468l0039K4442M9284k6470m6652L9910
$$ -7181 7028 76477 146238 156827 123013 104545 74506 98948 148232 121762 75110 115020
16834A15020K9450j5012p547j4499J0143m8117j7176j3592k2296Q654J2735M0342
$$ 115020 144470 129458 121911 107412 117555 69438 52262 38670 16374 25028 37763 78105
16822G8105N1113n4863j4284m2498m1861L7754K4802k5393J1171N4877M5174l8511
$$ 78105 129218 74355 60071 17573 -24288 13466 38268 12875 24046 78923 124097 85586
16810H5586q4840n8425J2867m9517n369L0453K7811O9410N8460k2395k6173R3575
$$ 85586 746 -57679 -44812 -94329 -99698 -69245 -41434 27976 86436 64041 37868 131443
16798A31443P1841p2055Q236j484p8676k8217m3186m1287N939K0430J02365N8997
$$ 131443 203284 131229 139465 137981 59305 31088 -12098 -53385 -47446 -27016 75349 134346
16786A34346k40m1776o1751l0210L5909M1819J1712M1991K0040l9624K1298N1442
$$ 134346 134106 92330 30579 369 36278 78097 89809 131800 151840 112216 133514 184956
16774A84956j6m5671K3921M1728m7023l3117k5849M2905Q3957M194j5006J05017
$$ 184956 184940 139269 163190 204918 157895 124778 98929 141834 225791 229985 214979 319996
16762C19996L2664p7596o9151n9557l6888P8798O6893p8393l5215J18972J26430
$$ 319996 352660 275064 205913 146356 109468 188266 255159 176766 141551 260523 386953
16751C86953J4331K6626K886K0661m3125m6331o1356j7962j9273p6111o7344m0659
$$ 386953 401284 427910 430796 451457 408332 362001 300645 282683 263410 187299 119955 79296
16739G9296m569k1470o868P1022Q8244J15998J9928p8240l4563L0090J0920m4310
$$ 79296 74727 53257 46389 117411 205655 321653 341581 263341 228778 258868 269788 225478
16727B25478p4016n2987j4841k9915m0948Q922K0208o6339p179J09181N7753j5390
$$ 225478 151462 98475 83634 53719 12771 21693 41901 -24438 -31617 77564 135317 119927
16715A19927m2087j1724m9294j7812M0078L4456J6226K496K359j2761J1102l7883
$$ 119927 77840 66116 16822 -990 39088 73544 89770 92266 94625 81864 92966 55083
16703E5083m4349k9578J6766N0281l928j12855q436K3037N0401M6892j1650l1285
$$ 55083 10734 -18844 -2078 48203 44275 -68580 -77016 -53979 -3578 43314 31664 379
16691C79m0091o2933k3399M5426J8117l23j3415N621K6452l4700J2458K0439J3840
$$ 379 -39712 -102645 -126044 -80618 -62501 -62824 -76239 -70618 -44166 -78866 -66408 -45969 -32129
16678c2129p2060J3518L9729J2399K7857Q252L456Q9347M4234n5842o3967l0015
$$ -32129 -104189 -90671 -50942 -38543 -10686 -2434 1022 90369 134603 78761 14794 -15221
16666a5221N8909L7454l1762m2168n3783m4301P3774N5923L064k3324l8304L8659
$$ -15221 43688 81142 49380 7212 -46571 -90872 -17098 38825 41889 18565 -19739 18920
16654A8920M8760O7886N467j2268L9939L6370P3121n1121l3915l1122P2278J09200
$$ 18920 67680 135566 141033 128765 168704 205074 278195 227074 193159 162037 234315 343515
16642C43515J42824N9883J1277J20899k3325n2914Q2944O8386o0230p3215n1767
$$ 343515 486339 546222 557499 678398 655073 602159 685103 753489 693259 620044 568277
16631E68277p5501K0267q0693r2351j79717j20041J2490K7932r636K5169K401
$$ 568277 492776 513043 432350 339999 160282 40241 52731 80663 71027 96196 98597
16620I8597j0197k9679m0742N0108N2471k6460k6409K1917Q640l0141O0545k2711
$$ 98597 88400 58721 17979 68087 120558 94098 67689 89606 98246 68105 128650 105939
16608A05939j6260j0914o4728J4205K9882p6721l3328k1900N0635R4853K8200
$$ 105939 89679 78765 14037 28242 58124 -18597 -51925 -73825 -23190 71663 99863
16597I9863m3633k3551L9273j0566k2469L7194k6627L3309K4171J873N1915J07249
$$ 99863 56230 32679 71952 61386 38917 76111 49484 82793 106964 108837 160752 268001
$$ [...]
##END NTUPLES=NMR SPECTRUM
##END=
