##TITLE=Analysis number 313326
Compound Code mo 07698
Book Reference 458/4
Project Code adrs
Chemist Name stevem
##JCAMPDX= 6.0         $$ Bruker NMR JCAMP-DX V2.0
##DATA TYPE= NMR SPECTRUM
##DATA CLASS= NTUPLES
##ORIGIN= Bruker BioSpin GmbH
##OWNER= NMR
$$ XWIN-NMR		Version 3.5
$$ Mon Sep  5 12:57:57 2005 GMT Daylight Time (UT+1h)  MAYBRIDGE\NMR@NMR_250MHZ
##.OBSERVE FREQUENCY= 250.131544655141
##.OBSERVE NUCLEUS= ^1H
##.ACQUISITION MODE= SIMULTANEOUS (DQD)
##.ACQUISITION SCHEME= undefined
##.AVERAGES= 16
##.DIGITISER RES= 18
##SPECTROMETER/DATA SYSTEM= dpx250
##.PULSE SEQUENCE= zg30
##.SOLVENT NAME= CDCl3
##.SHIFT REFERENCE= (INTERNAL, CDCl3, 0, 16.4525)
##AUDIT TRAIL= $$ (NUMBER, WHEN, WHO, WHERE, WHAT)
$$ ##TITLE= Audit trail, XWIN-NMR		Version 3.5
$$ ##JCAMPDX= 5.01
$$ ##ORIGIN= Bruker BioSpin GmbH
$$ ##OWNER= NMR
$$ C:\u/data/dgb/nmr/ADRS/9030/pdata/1/auditp.txt
$$ ##AUDIT TRAIL=  $$ (NUMBER, WHEN, WHO, WHERE, WHAT)
(   1,<2005-09-05 12:57:20.58 +100>,<MAYBRIDGE\NMR>,<NMR_250MHZ>,
      <created by zg, POWCHK disabled, PULCHK disabled
       configuration hash MD5:
       62 19 C7 07 E1 42 D1 B7 37 6C 3D D0 77 39 F9 E6
       data hash MD5: 64K
       1F CF 9C 51 95 9E BF 46 18 45 FE B3 79 EA 9A 57>)
(   2,<2005-09-05 12:57:37.44 +100>,<MAYBRIDGE\NMR>,<NMR_250MHZ>,
      <Start of raw data processing
       ef LB = 0.3 FT_mod = 6 PKNL = 1 SI = 32K 
       data hash MD5: 32K
       B9 05 0F F9 77 B8 88 65 3E A9 B4 3A 27 DC E8 55>)
(   3,<2005-09-05 12:57:41.86 +100>,<MAYBRIDGE\NMR>,<NMR_250MHZ>,
      <apk 
       data hash MD5: 32K
       96 C2 B2 CD EA 42 DD 2E 36 18 E5 93 A4 3C 7C D4>)
(   4,<2005-09-05 12:57:42.64 +100>,<MAYBRIDGE\NMR>,<NMR_250MHZ>,
      <abs ABSG = 5 
       data hash MD5: 32K
       AA 67 7C 4A 22 22 A1 16 DA 00 AF 01 E0 C2 75 50>)
$$ ##END=
$$ 
$$ hash MD5
$$ 06 F1 58 22 94 57 27 C0 F9 6A 28 A4 40 3C 66 D1
##$RELAX= 
##$RELAX= 
##$RELAX= 
##$RELAX= 
##$RELAX= 
##$RELAX= 
##$RELAX= 
$$ Bruker specific parameters
$$ --------------------------
##$DU= <C:\u>
##$EXPNO= 9030
##$NAME= <ADRS>
##$PROCNO= 1
##$TYPE= <nmr>
##$USER= <dgb>
##$AMP= (0..31)
100 100 100 100 100 100 100 100 100 100 100 100 100 100 100 100 100 100 
100 100 100 100 100 100 100 100 100 100 100 100 100 100 
##$AQSEQ= 0
##$AQ_mod= 3
##$AUNM= <au_zg>
##$AUTOPOS= <18 >
##$BF1= 250.13
##$BF2= 250.13
##$BF3= 250.13
##$BF4= 250.13
##$BF5= 500.13
##$BF6= 500.13
##$BF7= 500.13
##$BF8= 500.13
##$BYTORDA= 1
##$CFDGTYP= 0
##$CFRGTYP= 5
##$CHEMSTR= <none>
##$CNST= (0..31)
1 1 145 1 1 1 1 1 1 1 1 1 1 1 1 1 1 1 1 1 1 1 1 1 1 1 1 1 1 1 1 1 
##$CPDPRG= <>
##$CPDPRG1= <>
##$CPDPRG2= <>
##$CPDPRG3= <>
##$CPDPRG4= <mlev>
##$CPDPRG5= <mlev>
##$CPDPRG6= <mlev>
##$CPDPRG7= <mlev>
##$CPDPRG8= <mlev>
##$CPDPRGB= <>
##$CPDPRGT= <>
##$D= (0..31)
0 1 0 0 0 0 0 0 0 0.06 0 0 0 0 0 0 0.0002 0 0 0 0 0 0 0 0 0 0 0 0 0 0 
0 
##$DATE= 1125921438
##$DBL= (0..7)
120 120 120 120 120 120 120 120 
##$DBP= (0..7)
150 150 150 150 150 150 150 150 
##$DBP07= 0
##$DBPNAM0= <>
##$DBPNAM1= <>
$$ [...]
##$SUBNAM7= <"">
##$SUBNAM8= <"">
##$SUBNAM9= <"">
##$SW= 20.6930455092707
##$SWIBOX= (0..15)
0 0 3 0 0 0 0 0 0 0 0 0 0 0 0 0 
##$SW_h= 5175.983436853
##$TD= 65536
##$TD0= 1
##$TE= 296.16
##$TE2= 300
##$TE3= 300
##$TEG= 300
##$TL= (0..7)
0 120 120 120 120 120 120 120 
##$TP= (0..7)
150 150 150 150 150 150 150 150 
##$TP07= 0
##$TPNAME0= <>
##$TPNAME1= <>
##$TPNAME2= <>
##$TPNAME3= <>
##$TPNAME4= <>
##$TPNAME5= <>
##$TPNAME6= <>
##$TPNAME7= <>
##$TPOAL= (0..7)
0.5 0.5 0.5 0.5 0.5 0.5 0.5 0.5 
##$TPOFFS= (0..7)
0 0 0 0 0 0 0 0 
##$TUNHIN= 0
##$TUNHOUT= 0
##$TUNXOUT= 0
##$USERA1= <user>
##$USERA2= <user>
##$USERA3= <user>
##$USERA4= <user>
##$USERA5= <user>
##$V9= 5
##$VALIST= <valist>
##$VCLIST= <CCCCCCCCCCCCCCC>
##$VD= 0
##$VDLIST= <DDDDDDDDDDDDDDD>
##$VPLIST= <PPPPPPPPPPPPPPP>
##$VTLIST= <TTTTTTTTTTTTTTT>
##$WBST= 1024
##$WBSW= 4
##$XGAIN= (0..3)
0 0 0 0 
##$XL= 0
##$YL= 0
##$YMAX_a= 249022
##$YMIN_a= -298400
##$ZGOPTNS= <>
##$ZL1= 120
##$ZL2= 120
##$ZL3= 120
##$ZL4= 120
##$ABSF1= 16.45251
##$ABSF2= -4.240662
##$ABSG= 5
##$ABSL= 3
##$ALPHA= 0
##$AQORDER= 0
##$ASSFAC= 0
##$ASSFACI= 0
##$ASSFACX= 0
##$ASSWID= 0
##$AUNMP= <proc_1d>
##$AZFE= 0.1
##$AZFW= 0.1
##$BCFW= 0
##$BC_mod= 0
##$BYTORDP= 0
##$COROFFS= 0
##$CY= 12.5
##$DATMOD= 1
##$DC= 0
##$DFILT= <>
##$DTYPP= 0
##$F1P= 14.0000005364418
##$F2P= -0.99999901652339
##$FCOR= 0.5
##$FTSIZE= 32768
##$FT_mod= 6
##$GAMMA= 0
##$GB= 0
##$INTBC= 1
##$INTSCL= 1
##$ISEN= 128
##$LB= 0.3
##$LEV0= 0
##$LPBIN= 0
##$MAXI= 10000
##$MC2= 0
##$MEAN= 0
##$ME_mod= 0
##$MI= 0
##$NCOEF= 0
##$NC_proc= -3
##$NLEV= 6
##$NOISF1= 0
##$NOISF2= 0
##$NSP= 0
##$NTH_PI= 0
##$NZP= 0
##$OFFSET= 16.45251
##$PC= 1
##$PHC0= -77.43468
##$PHC1= 7.339086
##$PH_mod= 1
##$PKNL= yes
##$PPARMOD= 0
##$PSCAL= 4
##$PSIGN= 0
##$REVERSE= no
##$SF= 250.130017378867
##$SI= 32768
##$SIGF1= 0
##$SIGF2= 0
##$SINO= 400
##$SIOLD= 32768
##$SREGLST= <1H.CDCl3>
##$SSB= 0
##$STSI= 32768
##$STSR= 0
##$SW_p= 5175.98343685301
##$SYMM= 0
##$S_DEV= 0
##$TDeff= 65536
##$TDoff= 0
##$TI= <Analysis number 999999
Compound Code 99
Book Reference 9
Project Code 9>
##$TILT= no
##$TM1= 0
##$TM2= 0
##$TOPLEV= 0
##$USERP1= <user>
##$USERP2= <user>
##$USERP3= <user>
##$USERP4= <user>
##$USERP5= <user>
##$WDW= 1
##$XDIM= 32768
##$YMAX_p= 383628205
##$YMIN_p= -491762
$$ End of Bruker specific parameters
$$ ---------------------------------
##NTUPLES= NMR SPECTRUM
##VAR_NAME=  FREQUENCY,     SPECTRUM/REAL,   SPECTRUM/IMAG
##SYMBOL=    X,             R,               I
##VAR_TYPE=  INDEPENDENT,   DEPENDENT,       DEPENDENT
##VAR_FORM=  AFFN,          ASDF,            ASDF
##VAR_DIM=   32768,         32768,           32768
##UNITS=     HZ,            ARBITRARY UNITS, ARBITRARY UNITS
##FACTOR=    0.157963299565203, 1,           1
##FIRST=     4115.26682076944, 0,            0
##LAST=      -1060.71661608357, 0,           0
##MIN=       -1060.71661608357, -491762,     0
##MAX=       4115.26682076944, 383628205,    0
$$ Real data points
##PAGE= N=1
##DATA TABLE= (X++(R..R)), XYDATA
$$ [...]
22854 -14252 -9960 -39200 -2305 54282 -22655 -65453 -8297 12699 14738 13319 -13781 -62394
22842 -62394 -58614 -22660 -57218 -126424 -61629 -19207 -15898 -15454 52947 53850 42250 33801 49112
22829 49112 23428 9823 -25174 -29152 -18441 -24933 -33793 -43841 -63740 -51736 -54953 -76905
22817 -76905 -89429 -103771 -83753 40404 38930 -2050 -47146 -66997 -93338 -71332 -96528 -139325
22805 -139325 -118297 -78188 -59402 -6999 -9395 -14565 -56616 -96662 -32029 4973 -32861 -75301
22793 -75301 -91504 -87764 -95324 -123826 -131902 -90904 -60816 -14833 -37133 2290 58 -43557
22781 -43557 -81782 -115424 -83410 -41098 -15474 47335 61287 72023 59776 26665 6834 -41335
22769 -41335 -45209 -15414 -34162 -78770 -55099 -59728 -44835 -29206 -54407 -39956 -51130 -93416
22757 -93416 -138126 -122537 -78522 -238 31529 64157 98760 141479 95892 14484 28365 38936
22745 38936 1596 19606 4160 10613 -8016 -18342 -47700 1762 32937 14362 -35090 -54085
22733 -54085 -64785 -102205 -77277 -33601 -4052 12289 13384 88507 102431 62743 16447 13479
22721 13479 76384 64901 95587 128767 44016 10992 37507 45193 79587 99978 82252 67729
22709 67729 28194 -50039 -25319 -1257 13231 5522 -1744 4355 21973 3369 40075 40253 8920
22696 8920 -1731 33892 36919 12692 -51870 -70642 -36315 -31065 6272 46393 -5343 13094
22684 13094 17694 -17025 -19630 -1673 26099 39491 46745 90602 46126 963 -22110 -27968
22672 -27968 12721 46255 70775 40176 -31743 -13256 -19045 -59656 -111359 -108514 -45503 -44449
22660 -44449 5133 73973 14692 24583 42468 40245 49371 28205 12159 -27617 46455 59080
22648 59080 40223 54075 109313 132580 87259 37497 -29035 -58210 -45343 -27343 13584 85939
22636 85939 57787 10061 -20136 -42004 2550 -1989 25180 -2378 6117 28804 -20259 42794
22624 42794 74655 33524 19181 42680 68069 47231 64908 137871 88307 -23195 -89438
22613 -89438 -58933 -40011 -34792 -11781 36635 76743 126421 119223 98923 86459 14210 -4770
22601 -4770 67946 -7863 -10629 29144 -32020 -100657 -48234 13241 -30333 20858 106721 85547
22589 85547 38733 -9039 13435 40707 -6674 50661 79643 73402 100921 39407 -24077 -45480
22577 -45480 2420 -19975 -34621 -25949 -279 77633 82074 67818 94156 102549 120744 71273
22565 71273 57176 84463 38457 -16504 -75934 -94970 -110105 -80564 -15296 -4836 24653 49643
22553 49643 19407 -3498 -45 31514 1544 52434 73832 12730 -7107 3549 -19303 4530
22541 4530 67853 76849 13772 -27645 37507 73585 43755 20991 67415 81505 25208 42762
22529 42762 59018 -1145 23668 -15446 -1688 -16386 33036 53296 46979 27086 26952 18818
22517 18818 -16094 -15409 -19495 -43301 -31789 -30597 -15089 5320 18929 46340 83254 76520 80026
22504 80026 2209 -44441 -27927 10432 43609 29909 -1269 55568 32416 8708 8969 4203
22492 4203 -38681 -40375 -19184 -8328 -16924 -28468 -18872 15312 6395 -39753 -32710 -12910 -29014
22479 -29014 -25527 -61100 -113607 -87197 -41662 -30010 -40043 -17682 -7817 22925 7843 -7387
22467 -7387 -28256 42476 41582 84591 89220 123491 121976 39728 45807 61643 39281 -460 -28335
22454 -28335 -73440 -54823 -52022 6751 54081 81765 131688 234113 359634 399862 444606
22443 444606 478963 425737 287052 228875 211890 130388 105418 68096 34972 55105 101409
22432 101409 99054 88588 70366 -10128 -17910 42628 120524 79145 3807 16120 12547 15016
22420 15016 -23559 -17294 8125 -39749 -98797 -31182 22906 28596 -7629 -27485 -18074 -8590
22408 -8590 5268 28839 8630 7290 -53203 -40001 35114 40006 32529 46906 64020 30284
22396 30284 53905 37604 -31383 -80616 -87248 -28323 -3817 34171 -21311 -67185 -40028 26381
22384 26381 14248 -36616 -12157 15860 27253 -1685 -9878 -76541 -120433 -53255 -11114 10774
22372 10774 56256 42699 35874 59964 -30371 -99200 -61947 4323 -3948 10439 -13555 -41640
22360 -41640 -5340 8967 16914 47521 16817 17499 -16088 -42574 -3294 14928 60787 92974
22348 92974 81210 42602 64564 75044 62027 17530 32047 15199 -8391 5628 -4433 -66092
22336 -66092 -84788 -58941 7706 39352 -2179 -17953 -48168 -8566 5129 -20161 -58325 -102242
22324 -102242 -98168 -64485 -15473 -28782 -38344 -9509 -18722 -29100 45378 57620 -24527 -15953
22312 -15953 23055 72764 78743 66104 34144 -27157 -123365 -85512 -23857 -44111 -56012 -71998
22300 -71998 -18347 -29430 -61590 -5063 57057 85636 56912 27537 65253 71928 83499 79237
22288 79237 65634 -6426 -3565 52275 72024 26845 -36727 -35901 -23265 -18563 -25415 31141 23919
22275 23919 87101 130335 154092 140568 116416 60248 -2342 -64848 -94917 -66818 -18599 20146
22263 20146 83954 128966 79994 24781 18069 56858 62961 36556 8497 44208 74758 73854
22251 73854 125739 167960 145569 118063 49226 -48119 -51542 -39180 -65943 -8887 16720 5179
22239 5179 -39807 22052 102141 128858 84209 27648 -1999 32894 80649 69395 90698 129831
22227 129831 82432 64470 24620 8959 45069 39089 43205 -17496 -29809 -27385 -43604 -12032
22215 -12032 23841 -22150 -55397 -32973 -44342 -32531 -82943 -94581 -77262 -28821 -45367 -60398
22203 -60398 20883 82640 84936 78700 75755 63375 12328 29136 43898 68040 59412 34393
22191 34393 -4287 27021 7343 -41939 -82078 -123608 -88675 -43242 23422 20159 34305 24413
22179 24413 33745 80794 107701 75484 42756 12896 -17683 -1289 -18105 -8070 6981 -47779
22167 -47779 -64672 -10739 -6696 -10878 -3103 15890 49814 24914 20410 103703 144485 84759
22155 84759 -5369 -48193 -46043 -13146 24199 56293 59241 43647 27488 27736 78614 103603
22143 103603 76289 53128 61711 73443 22868 92107 111042 98256 40778 59411 101578 80107
22131 80107 64328 69163 70975 59242 87360 39936 26650 34438 44104 46502 31763 47437 13926
22118 13926 69435 85556 107045 78458 66502 73259 60813 31156 -9470 -27623 -40499 -13689
22106 -13689 5139 7689 5454 48261 31108 16641 60510 33363 46474 56999 48967 -13820
22094 -13820 -83437 -147372 -95919 -78924 -56130 -40892 -16047 6116 -11181 -66180 -91862 -36027
22082 -36027 -33132 8546 -57702 -91161 -33806 -13798 -29880 -48447 -32849 29900 98410 121141
22070 121141 167089 176731 176323 138667 154286 143476 65970 105037 150315 94078 106078 174484
22058 174484 174967 112034 86281 75044 87125 57709 19322 27986 30613 -5771 4632 32080
22046 32080 53834 57607 63112 72493 86135 97691 52553 7107 17516 47910 57811 62592 90478
22033 90478 97715 98555 69333 80557 76801 48389 65881 96991 106008 66942 31376 -23783 -43275
22020 -43275 16841 81655 89859 52817 17183 53190 50971 37896 14195 103628 196959 296333
22008 296333 339349 351723 346624 310260 273449 264471 232049 225613 253956 291261 289791 231058
21996 231058 216617 177556 165689 116497 66160 83355 160275 165549 177729 236735 273281 283037
21984 283037 317225 321882 351486 447972 668077 826921 739362 594089 501419 434135 419263
21973 419263 406946 328668 285041 262767 211274 207307 222914 196335 159977 162947 242011 220616
21961 220616 230227 231904 225823 279077 331495 337817 307606 303836 256292 271266 262431 268674 314705
21948 314705 327403 278814 273396 248002 239426 263921 293803 311233 282682 322226 355471 410260
21936 410260 366319 375998 385997 405293 393550 404212 432378 451996 535115 552500 498437 509441
21924 509441 567194 589579 606256 681839 740973 710016 739729 756978 804633 890482 914663
21913 914663 916626 980571 1085685 1158135 1200118 1230200 1290816 1376840 1477212 1582991 1746256
21902 1746256 1940300 2180569 2451494 2760679 3117918 3492748 3964473 4488297 5066932
21893 5066932 5811571 6767662 8081162 9834936 12256538 15695793 20818816 28484686
21885 28484686 40009364 56854513 78169291 97317135 104176945 95503854 77443998
21878 77443998 57949141 41788130 30039014 21944679 16477901 12676556 9904220 7866547
21870 7866547 6350407 5231640 4373447 3694987 3157891 2711834 2375011 2081617 1877723
21861 1877723 1685583 1537261 1400138 1283011 1164815 1038028 995295 987933 914928 894926
21851 894926 823394 763527 678827 638233 644080 541869 458637 399829 338928 269621 288519
21840 288519 333869 337307 308431 282098 300919 350134 348501 290110 307197 338324 301285 200624
21828 200624 137717 144458 192087 153182 124633 123209 94583 73792 67396 103255 111933 130254
21816 130254 129103 152632 170960 94228 52361 9180 10267 3948 -18498 41930 81993 124624
21804 124624 148172 141597 97726 17962 30602 57297 70791 141194 180046 196248 160300 139170
21792 139170 109856 95457 102726 81101 37934 52657 119132 279623 353090 450591 504622
21781 504622 506158 461578 376327 272743 209608 132844 101457 50052 43460 21761 -16852 -28959
21769 -28959 -8884 22070 63534 47043 33038 34386 47488 109963 79816 6439 -19885 -3797
21757 -3797 -6988 8896 52922 -7312 -71066 -10012 38438 6123 -62291 -73410 -38395 13258
21745 13258 -14315 -64612 -29472 32481 11359 -36316 -62211 -73081 -41470 12921 -22609 -54916
21733 -54916 -71398 -91943 -103662 -81271 -84372 -79959 27678 53077 45648 54407 61416 16928
21721 16928 -40395 -69642 -56121 -34993 11772 -12211 -57778 -86400 -94490 -61381 -18829 -33705
21709 -33705 -16624 11259 -926 -78305 -132962 -110896 -79075 -121856 -134586 -143380 -103269 -63577
21697 -63577 -64921 -115722 -177856 -187722 -167476 -122500 -121139 -113493 -27600 103676 148893 76394
21685 76394 92214 87353 49498 20111 -1671 6931 13955 -41559 976 56003 100896 85919
21673 85919 66286 57999 75231 64236 57011 15345 -67418 -67869 -36620 -244 28076 88663
21661 88663 48768 14573 37887 57917 45479 48327 105527 85640 63161 78818 85977 81164
21649 81164 46371 73761 91261 70285 30143 46302 87568 83269 45416 -9313 -38440 30684
21637 30684 103570 141239 94736 82960 85383 45531 -10964 -35855 -36586 -24304 -49585 -36056
21625 -36056 -45818 -65607 -73357 -40702 -48605 -45783 -21796 -31872 -1871 -6631 -11622 2206 17891
21612 17891 20025 26861 35137 -1133 -29323 -20222 -47114 -28948 29936 52703 41229 -3164
21600 -3164 -5306 12211 -10719 -8320 -3368 8110 1480 -32073 -44431 13860 13959 -4495 -38164
21587 -38164 -94080 -64637 -11026 31723 -23189 5683 14676 -4901 34108 45417 -16381 -68391
21575 -68391 -120779 -90517 -9747 -1317 -2275 -20208 51142 48188 7744 -13199 -33959 -53449
21563 -53449 -38404 -37947 -1100 -30013 -47517 -92812 -77363 -75369 -83152 -43770 -19381 -37300
21551 -37300 -45250 -67830 -62348 2394 8964 -14220 -47859 -4216 17856 19222 18401 -691 2800
21538 2800 -32367 -39461 -93715 -74410 -7699 2146 32884 87549 117037 102073 113173 84224
21526 84224 -39234 -69517 -61873 -68504 -23994 27497 60805 69332 73944 107563 69583 36552
21514 36552 73123 67432 29731 -1920 -31338 -73236 4072 62880 131790 58265 -24530 6850
21502 6850 87199 95285 56890 14984 -43327 -9983 11366 -2696 -9153 -46496 -40318 -40126 -68491
21489 -68491 -80264 -43482 -40248 -33967 4354 10399 -18639 -18414 -48408 -89998 -116811 -148630 -115118
21476 -115118 -68520 -52478 -62714 -101426 -117122 -48619 -17918 -47955 -58816 -16375 262
21465 262 -39852 25847 43070 33130 22514 60546 56647 12849 -61157 -82161 -61221 -36907
21453 -36907 -32364 -27586 -39649 -25727 -4251 -20483 -6054 -54969 -69524 -48290 -40406 -21168
21441 -21168 -7021 -57071 -4099 58312 42318 -25664 -32748 11610 34909 7047 -104496 -109212
21429 -109212 -93275 -71996 -41343 -14974 2179 -14667 4765 -21212 -12119 17180 30678 8319
21417 8319 -36817 -16887 4765 11303 -62305 -92548 -69030 -98079 -104582 -76760 -20842 -14181
21405 -14181 -54416 -63806 -47896 -45290 -72516 -59382 -38549 -59956 -68200 4393 47343 32928
21393 32928 -73946 -51209 3592 -53223 -96965 -108174 -166671 -177627 -113110 12100 57026
21382 57026 54752 22366 15497 -27114 -75991 -75701 -49805 -12278 190 928 -53428 -41508 -25723
21369 -25723 21260 -3578 -3293 -315 -47710 -101138 -84464 -133756 -128927 -83555 -13689 14024
21357 14024 7904 -5415 -64801 -46633 5395 -4684 -31303 -37380 -57550 -35386 -45700 -12450
21345 -12450 20257 35588 76520 5199 -68535 -9078 55947 57352 42098 26236 48755 47901
21333 47901 55107 79621 46136 36216 71539 67314 16741 -5411 -33838 -12704 39958 9810
21321 9810 32279 31215 6483 6156 39864 40927 69440 131794 247035 351992 435734 538734
21309 538734 589779 578654 496012 307283 155027 46118 -62529 -61916 30992 41354 24776
21298 24776 56678 42630 11896 -33808 -51895 12872 9033 -27934 -4829 -13101 11739 23240
21286 23240 38138 18574 -107989 -165415 -165955 -116762 -72117 -40493 -35922 -108111 -113382 -28070
21274 -28070 19035 53711 19119 -52693 -15122 -9151 -44801 -11203 57547 32669 -23439 -52071
21262 -52071 -58528 -63498 -126028 -129441 -138056 -123551 -65194 -34021 -65640 -62109 -52516 -15260 12414
21249 12414 -24425 -27274 -96641 -137427 -100025 -71083 -56250 -58065 -35594 7288 28069 49127
21237 49127 76301 55316 11653 -2087 -19254 -2096 61228 63595 24490 47374 21941 -17021
21225 -17021 8252 39513 54450 21511 -54502 -21037 -25519 -2935 16294 14720 -31404 -13008
21213 -13008 15631 83543 89326 49006 564 18708 28143 2028 16137 -18189 -4224 44275
21201 44275 88225 84278 37852 5026 360 38013 365 -28520 -5972 3635 47763 55501
21189 55501 58540 40362 -4644 -70965 -65293 -69966 -101614 -67957 -49268 -31859 21410 88342
21177 88342 82485 35595 13982 -52582 -65779 -17224 7525 -3977 15117 33283 102632 64222
21165 64222 3736 28909 60018 26829 -25140 -47673 -69064 -42875 -39433 -47032 -81461 -81363 -58559
21152 -58559 -36699 -26984 -25135 -19295 -3022 -27205 -19736 51615 33662 -13235 -58655 -34590
21140 -34590 -21018 -43324 -54166 -100815 -72998 -61781 -37123 -17554 -71724 -81293 4953 -9811
21128 -9811 -28120 -95585 -80855 10759 19271 19998 9128 2166 -59307 -116757 -138976 -125674 -137780
21115 -137780 -73776 -47481 -4452 -23256 -1160 -76628 -81594 -26866 -10125 -16551 -16959 9003
21103 9003 15613 -4670 29589 27433 -31881 -29467 -26034 -29635 -58479 -78289 -58091 -37724 -36948
21090 -36948 -45858 -109338 -135875 -69912 -16195 49357 2436 -46504 -13753 3992 45445 40742
21078 40742 53397 57902 26734 -43525 13047 12068 -39986 -33647 -41926 -17884 -36382 -125885 -147406
21065 -147406 -89552 -49312 -10026 -8905 -67454 -91209 -72639 23385 96070 36903 17553 42917
21053 42917 60787 74476 25329 -28946 27974 112171 128686 170119 167525 120691 147543 147461
21041 147461 134024 124863 66102 -2459 33332 73938 104366 93621 27922 -35871 -44933 -38493
21029 -38493 12592 -30287 -83450 -94616 -78680 -28547 12780 12108 31201 -32748 -11948 -11791
21017 -11791 -28671 -8638 45590 52766 82628 74678 67570 89706 100713 72454 19078 12308
21005 12308 33044 26228 -16922 -24685 -16206 -5841 13233 -26899 -7955 -11232 -27669 15380
20993 15380 32124 -10001 -30881 -28496 -8574 5168 -47362 -67378 -82858 -130903 -116171 -77051
20981 -77051 -51999 -37418 31219 50005 10838 -4340 1925 -42285 -61720 -88104 -122994 -166354
20969 -166354 -114052 -73891 -79303 -28969 -31054 -63554 -67191 -30352 -16193 12398 62032 72758
20957 72758 15785 -53329 -11026 -13292 -36712 6658 71894 94635 70720 82830 99723 160260
20945 160260 112516 19133 -28092 -76244 -54029 -7638 23440 -15539 -29708 51715 41967 63346
20933 63346 118466 136897 125172 63671 -48704 -84044 -52832 -85222 -80810 -27214 28176 42410
20921 42410 39814 102474 79531 32624 20867 97431 160852 140729 102076 41290 -35883 -30435
20909 -30435 -75409 -65227 -64385 -80279 -67467 -85660 -71413 -45256 -48581 -29681 13091 44409
20897 44409 74044 58936 8739 29779 77036 88720 40672 -3258 -68490 -40358 -1977 -6227
20885 -6227 -3314 -55044 -81393 -84501 -38907 -36978 -73758 -76536 -10797 50144 5932 19590 -6237
20872 -6237 -5658 45000 58216 62961 15646 -18017 31130 26877 -9681 10467 13443 -44423 -41058
20859 -41058 -4942 23663 17801 -24176 -88846 -121252 -63581 -7937 -8517 -42467 -90709 -115771
20847 -115771 -170473 -133977 -54250 -69990 -30684 -25937 -81824 -50654 27061 23207 -10164 7713
20835 7713 21750 18742 -4200 -5562 -22285 -34564 -3468 1020 -7643 -56611 -87442 -62327 -46357
20822 -46357 -10210 -13919 -17837 -34589 -99073 -120555 -79896 -15079 910 -5287 30099 49610
20810 49610 6379 -42188 -46874 -28662 -53375 -56807 6639 55055 30942 20426 -11277 -53735
20798 -53735 -96664 -98287 -87693 -71142 -77335 -58425 -14613 25027 24019 3011 -24884 -12901
20786 -12901 32475 3598 1822 -26405 -58288 -91411 -103676 -31437 -25991 -20127 32152 47276
20774 47276 27535 -48996 -98466 -91462 -69964 -51113 -44109 7460 27966 10125 -31870 -48481
20762 -48481 -9024 29620 67499 86152 83291 44711 594 -39884 -72282 -102008 -72792 -56828
20750 -56828 -24775 -5789 -42162 -107471 -128891 -77484 -22545 -40143 -100206 -102844 -51240 -50547
20738 -50547 -65900 -51518 -13726 52884 65105 11719 -38504 -51857 -129 67562 2911 -21316
20726 -21316 -61058 -45817 -10015 29491 56608 -174 -17458 -16862 12284 18129 -24861 -62715
20714 -62715 -55521 5695 1231 -44147 -18983 15472 18123 -23875 -72916 -12633 66533 71942
20702 71942 78884 50936 99208 50342 5287 4488 -61638 -100331 -83089 -62112 -46259 -42711
20690 -42711 -46605 -22273 -14462 -41169 -31064 -29383 -6611 8451 -46004 -41016 -58299 -53499 -11171
20677 -11171 -32710 -46229 -45458 -81173 -75074 -71966 -50156 -76241 -108124 -79450 -75435 -42805 11183
20664 11183 36070 -4013 -1018 -27810 -72210 -86780 -77335 -32597 17114 47974 26281 7494
20652 7494 -33713 -92424 -128597 -113543 -94818 -69759 -92635 -114462 -169978 -144953 -105033 -13681
20640 -13681 35762 41928 -35514 -102035 -113559 -81934 2892 40737 55292 76778 33904 10257
20628 10257 -5785 -19079 -43190 -49740 -39892 -19200 -25024 -37187 -52856 -69481 -76675 -97064
20616 -97064 -98004 -101421 -95237 -64105 -1051 43770 26864 2824 -49510 -114143 -144650 -108014
20604 -108014 -70170 -30515 -33780 -44567 -6506 8567 11815 59478 124345 70418 1956 -56424
20592 -56424 -106555 -139856 -114000 -43357 -34386 -57396 -79190 -81431 -61619 -80987 -96505 -29484
20580 -29484 -28931 -52632 -87915 -89080 2012 24987 20696 23995 -31177 -64545 -60113 -67480 -21053
20567 -21053 -2462 -24908 -87867 -73381 -14761 55922 31720 29801 48809 42991 -6369 -22930
20555 -22930 32329 79870 54440 34982 -6188 -52210 -16868 44211 67750 28245 51714 99897
20543 99897 74261 282 -79492 -84877 -14314 -15536 -52830 335 -31368 -58366 -61100 -31255
20531 -31255 36539 51267 37349 36778 7800 -15782 -60394 -75722 -105890 -54401 -14138 -12792
20519 -12792 52256 110972 116097 103350 50094 23658 52658 21072 -68382 -103334 -77432 3802
20507 3802 8636 -17913 -8961 -3920 -26100 -5132 -13712 -76734 -44896 -72141 -76029 -50896 5939
20494 5939 19979 -118 -33764 -15934 -36993 -85847 -37433 -47240 -45052 -43084 -61690 -60450 -46622
20481 -46622 -30861 14721 46058 -5792 -11835 2604 -7949 5299 -12607 -22773 -45327 -35362
20469 -35362 -22801 17426 44114 76009 77810 75849 79862 4653 -38957 -9445 -13355 -2749
20457 -2749 43273 55886 49081 50128 44712 19177 -14397 -48870 -43841 -21727 -19948 -35891 -57602
20444 -57602 -22376 14583 20570 193 -30008 -102259 -97520 -37973 21074 41557 62355 45636
20432 45636 8027 47530 78345 42349 -18384 -33337 -44808 -6316 -30044 -40659 -66668 -22310
20420 -22310 4535 -17957 2077 39338 26078 -1589 -6907 -1394 17751 16109 30253 58625
20408 58625 49313 21651 29956 63459 -39504 -53694 -55080 -52001 -56246 17361 47834 23921
20396 23921 -17663 -35177 25771 54364 9276 -15551 -3656 -2876 18166 56970 37810 -26903
20384 -26903 -37405 -26697 -31895 -72011 -58248 -33144 -24290 -7852 -10070 -14613 932 20311
20372 20311 8332 -3617 38806 98737 115697 68758 15978 4719 -1148 19560 20185 59506
20360 59506 42448 43596 45240 42846 -19770 -23754 1148 2594 -36711 -43263 -62950 -31899 17143
20347 17143 5068 452 17685 -29195 1289 81563 45719 -17974 -59380 -9262 69311 38380
20335 38380 36857 -11725 3919 -9014 -51409 -51447 -54507 2819 39638 19510 11813 1215 22290
20322 22290 21651 32232 -46523 -53903 -64973 -32184 -31758 -44272 -11471 -1561 -18179 -52162 -106326
20309 -106326 -84878 -140044 -185990 -172659 -128762 -81341 30345 21368 -23159 -15846 -2195 -23086
20297 -23086 13053 47899 30885 34858 8736 -11465 -2718 36062 7125 35248 36203 24110
20285 24110 21537 -9760 -17633 -31205 -38654 -6805 -10371 -41874 -25824 -78616 -68056 -21515
20273 -21515 -54859 -94744 -38006 12527 32976 42312 -939 -13315 14181 48405 25858 -22765
20261 -22765 -6792 -18038 -36542 -66197 -41905 18225 -52704 -95000 -104201 -86063 -65597 -35566
20249 -35566 255 -22137 -37739 -35615 -35549 -44543 -61916 -69151 -59353 -60013 38718 57992 68638
20236 68638 68126 39047 -54205 -38927 51318 150875 121040 40120 67625 61531 -7959 -45601
20224 -45601 -72395 -59552 -40876 -71744 -105241 -35941 -1348 17677 -57053 -134219 -70834 -40099
20212 -40099 -32881 -44826 -45264 -63336 -91836 -43229 -40231 34871 40155 41978 72867 86451 54832
20199 54832 5467 -9363 -22107 -13303 -81768 -91897 -26051 -20469 -13194 65039 93230 44609
20187 44609 6837 -27220 -78253 -73412 -8006 139 -151 5804 17594 -2969 -12055 -6047 58013
20174 58013 56967 49175 32998 69312 30850 16454 51121 10938 -54762 -75876 -99355 -119941
20162 -119941 -100089 -106341 -90250 -71452 -5085 20200 65675 65514 37771 40133 37670 20785
20150 20785 -4806 -1186 18097 40360 25111 -39262 -66283 -68205 -51832 -65419 -64106 -65725
20138 -65725 -68887 -11952 76751 90410 79524 80266 44046 -20304 -24791 -40992 -16353 -69287
20126 -69287 -58584 -2548 1768 -81270 -163414 -160747 -110596 -45213 12829 -988 -925 -38578 3128
20113 3128 124405 150090 100937 56501 15327 3799 51770 -19393 -60828 -58517 -53257 -59541
20101 -59541 -73619 2163 41129 18433 3075 -42706 -36536 -26528 -61723 -100541 -43899 -56104
20089 -56104 -67146 -36233 -17037 27745 11232 22741 9608 221 5778 3300 -38510 -52528
20077 -52528 26129 43839 -3861 2452 37414 -12927 -15307 3139 -3652 24063 15836 -23661
20065 -23661 -15750 13638 -27550 -10906 -18041 -22970 -49210 -58497 -11704 37891 39614 28845 -23335
20052 -23335 -21736 15197 28502 -33358 -76680 -38737 12742 8161 -14020 3466 89182 106887
20040 106887 72377 40244 48762 98003 151687 153276 89185 79788 30096 12769 5038 14037
20028 14037 15272 67217 119425 80413 63478 54380 33503 7195 -4985 -5525 -21643 5949
20016 5949 43403 16903 -26277 -27798 -34284 -1313 43644 42779 57906 87894 71309 86062 92937
20003 92937 57933 40309 65463 41147 -44976 -70528 -17752 42990 61884 3452 -35164 -43509
19991 -43509 -49355 -25902 4494 64546 50611 -26888 -55424 -40271 -58791 -41006 -38288 -30806
19979 -30806 2823 -15563 14313 17348 15788 48893 52868 -2470 -18435 26266 81519 77605
19967 77605 75910 38153 28130 9683 35231 33755 -49624 -64198 -12481 -4925 -54765 -33755
19955 -33755 -66372 -55981 -79774 -84505 -56191 -26553 18518 -8630 -31443 -42324 -80767 -87033
19943 -87033 -55280 -33131 -1901 2409 -37661 -82547 -51572 26042 54845 76872 30908 -25461
19931 -25461 25448 43891 47003 48349 14550 -15923 30341 -3617 -28531 -55560 -72798 -48702
19919 -48702 18307 30002 -17183 -30613 21822 107382 82057 21761 -63652 -73319 -83206 -116491
19907 -116491 -104776 -51156 -27766 -49539 -90512 -60795 -15907 -6359 -23875 -41292 -84148 -50655
19895 -50655 -15250 8123 14229 -14437 10614 55609 -6981 -9321 2111 15304 1009 -59338
19883 -59338 -42120 -390 -49577 -68739 -20829 -16928 -41478 -255 11235 -47155 -86288 -124875
19871 -124875 -161310 -146024 -102167 -36425 47831 15480 -26780 -35013 -172 37323 90897 59478
19859 59478 35216 94538 52702 -16831 -34111 -63422 -59938 -13758 8038 875 -12597 -95380
19847 -95380 -123552 -78296 -33682 -61984 -27689 -13342 -5425 26671 22324 -30612 -21857 38884
19835 38884 51246 10753 -54569 -112422 -94116 -65562 -42924 -87015 -133264 -119137 -99570 -48295
19823 -48295 -56998 -74455 -26559 30273 24719 -5890 -50409 8197 -32276 -67459 -52534 -82283
19811 -82283 -113727 -84714 -24700 -43652 -78746 -50935 -38855 -59021 -48948 -70653 -48270 -36739
19799 -36739 -39831 -30289 17069 1799 5097 -2556 5868 30957 -19764 -111673 -147658 -127530 -81570
19786 -81570 -73066 -38389 -49445 -60019 -36943 -53227 -98112 -123543 -161797 -89545 -9955 -27835
19774 -27835 -60710 1505 -18423 -32389 -453 20484 20939 25706 106817 51021 269 -1138
19762 -1138 18806 1256 5777 33231 34703 35838 37819 -1547 2432 15850 12077 7129 -16610
19749 -16610 59138 122195 66446 65405 58787 -8624 -25743 13692 71927 82969 78321 44786
19737 44786 51756 19798 -3636 5471 82408 81669 20368 -15816 -24043 -49286 -101960 -151799 -147180
19724 -147180 -136889 -116923 -113033 -109741 -90834 -98128 -106936 -79518 -57813 -14213 -2182 6757
19712 6757 -3519 -2277 33093 -845 -33834 -38434 -12680 6261 1068 4313 8739 62439 82316
19699 82316 52977 16595 -20781 -16133 -47666 -61386 -56664 -49320 -7798 -32232 -81540 -136195
19687 -136195 -109086 -41525 -6772 -678 -25065 -8118 -1644 11496 42104 14336 -458 16934
19675 16934 39406 39107 29016 6835 -17769 -35124 -88307 -131539 -112181 -38907 -67497 -70225
19663 -70225 -62500 -58884 -63407 -120460 -108454 -68015 38159 66256 32797 -48639 -68072 -45603
19651 -45603 -55231 -90542 -126521 -96299 -68737 -69612 -77940 -119309 -65202 -11567 -65193 -32532
19639 -32532 41422 57056 8080 -48779 -55161 -65116 -44284 -41537 990 18882 32473 20049
19627 20049 13313 17683 35124 26596 24714 48054 20259 -20908 -29593 2460 20843 30297 29820
19614 29820 -13861 -49624 -22226 -18720 -54754 -84832 -66590 -15882 21682 36558 54101 63952
19602 63952 26750 70894 113019 45009 -640 32956 37103 -32893 -84140 -50164 -87154 -71606
19590 -71606 -45079 -44310 -64884 -98405 -123957 -134009 -88102 -52207 -30741 -23089 18007 52071
19578 52071 68902 788 34041 -9155 -37361 -88222 -146527 -200904 -95143 -48476 -92464
19567 -92464 -146030 -77947 11064 71488 116495 116272 119946 151633 166652 84023 -9850 -68539
19555 -68539 -68278 -61508 -52050 817 31746 50610 50218 -50072 -91687 -93063 -63847 -47959 -51188
19542 -51188 -58004 -73442 -43685 16077 54942 -11948 20134 62658 41583 44690 12752 3486
19530 3486 4672 20519 41163 5303 6722 2715 38024 32915 22109 15581 39887 20327 -8352
19517 -8352 18506 79623 102627 47023 31899 -9057 -22367 -39429 4003 32257 66643 84353
19505 84353 99835 90674 83041 35549 -54908 -63578 -95325 -84147 -85860 -86586 -80937 -99759 -78803
19492 -78803 -28649 10926 -363 -69817 -116937 -100659 -84099 -110762 -145812 -166243 -127221 -84199
19480 -84199 -38907 -37290 -51879 -25106 6019 -5096 29514 3726 -45893 -114752 -100740 -50512
19468 -50512 4354 -3904 22277 3541 33521 76917 103388 73069 -5306 -51334 -37318 29453
19456 29453 54682 43299 32304 35560 20542 -53029 -37624 -20025 -30624 -108932 -97435 -82403
19444 -82403 -33727 33634 29947 -8331 -23850 -3293 -7099 -25838 -64185 -77216 -4982 34970
19432 34970 46462 26236 78050 103443 55153 9822 23407 11777 16033 -4372 8952 11082
19420 11082 15714 19667 7629 29896 24450 3126 -42617 -56425 -57195 -79622 -48724 10167 34526
19407 34526 -3764 -16120 -54749 -38697 -39638 -64525 -99173 -50756 -62596 -88720 -6391 11356
19395 11356 -44250 -47010 -21828 -41402 -37596 8849 11310 -26654 -35491 -57227 -58714 -84383 -79847
19382 -79847 -2768 20283 65090 41832 -20468 -42400 -55057 -16893 -20904 -31782 -64077 -6542
19370 -6542 40316 82154 -26164 -79740 -46443 18358 13552 -29573 -60501 -36062 -24700 -51837
19358 -51837 -18765 62931 102239 58050 -7436 -44847 -16813 -18550 -3578 22967 32301 1613
19346 1613 11494 46016 45457 66649 51730 44099 109388 139626 140271 97433 84160 74595 46176
19333 46176 8968 -14266 -46108 -20529 13927 -2770 35291 48495 47676 59631 108715 68379
19321 68379 38363 47686 55003 36889 -7970 5827 6285 -18813 -31813 -14954 34339 39136 25693
19308 25693 45077 88844 86534 44684 2445 -5818 -17372 -57627 -58107 -18126 -26267 -10926 -59434
19295 -59434 -42795 -21683 -31769 -68503 -73729 -38513 -407 62605 105876 105981 77831 11
19283 11 -18310 -56267 -130586 -99671 1788 47377 69480 61006 -1876 -15839 -62355 -61017
19271 -61017 -13816 -718 24049 22200 -12538 -42610 -65004 -45408 21068 21919 14544 3069
19259 3069 -2869 -15347 14176 119621 151710 59468 45806 74164 28006 14945 16728 -513
19247 -513 -7384 -31142 -31873 -45453 -48738 -59093 -26599 -63667 -94737 -102508 -79992 -77000 -67490
19234 -67490 -50972 -22625 5779 -1131 7252 -5949 -20992 9548 18443 19141 41891 64459 72983
19221 72983 21450 20856 41343 90359 77201 50157 78508 102123 51730 80484 93606 113200
19209 113200 98486 88167 56410 56724 61335 87453 57460 34144 35825 40925 40457 36490 -37899
19196 -37899 -49462 -8497 20751 -59732 -87121 -77744 -77870 -78857 -53271 -117074 -157843 -91706 -33396
19183 -33396 -45886 -16717 41690 74411 88432 26622 21351 -23938 -78859 -29362 -4744 2306
19171 2306 -35913 -67585 -21079 -38570 -26075 11637 41774 49281 -39652 -76349 -30992 25937
19159 25937 56824 56706 32332 29356 50916 46803 45640 54479 37633 22582 -11988 3430 2593
19146 2593 -38256 -34560 -46279 -43382 -90997 -83660 -21565 52172 21468 -61618 -8489 85559
19134 85559 118222 131645 152469 149280 119969 89977 32219 33641 29651 -5354 -39486 12325
19122 12325 30129 4199 -25076 -47675 -10147 -29529 -15888 -13647 -26444 33653 33921 36794
19110 36794 87928 92851 90589 75317 41891 -2070 -70607 -39094 -17120 -19781 -26864 -20011 -26214
19097 -26214 -119574 -82094 -11714 -38492 -44770 -55395 -92325 -79347 -33860 -40037 -33676 -26436
19085 -26436 -9675 -5504 30173 50697 53198 78106 31101 2239 42040 81492 144843 152391
19073 152391 141253 128246 64457 54989 60514 25229 39520 82696 61235 -7779 -14033 13844
19061 13844 -1998 -22119 -22473 -34303 -56524 -121115 -75191 -23942 6489 25125 48509 22109
19049 22109 -29060 -46299 -51562 4073 1456 12106 31202 -39327 -44733 -12511 -31273 -47545
19037 -47545 -70326 -63902 -44179 -5933 -29657 -29581 -4937 1843 -8311 28103 34217 22354 20819
19024 20819 29474 48331 28427 23707 19738 58950 83653 105510 136940 117648 77523 76434
19012 76434 68226 61419 108677 92141 63494 88048 58589 46354 67755 -17463 -65031 -60644
19000 -60644 -53518 -67821 -60157 -23621 13341 22640 5743 -7844 8965 39264 62910 47156
18988 47156 -55322 -64938 -65728 -65769 -41778 -29932 29131 70478 85582 40795 -4336 -61632 -75594
18975 -75594 -28749 -37524 -4277 47795 52240 49445 77495 50475 -4206 5773 596 20980 15595
18962 15595 -4413 -39762 -53700 -29117 -4638 -17874 -20631 -11012 -63303 -49189 5810 9572
18950 9572 65400 55063 -14784 -6042 39026 66235 50785 19430 34216 56006 22852 -8565
18938 -8565 -44657 -77613 -15157 -15315 -19639 -26473 -22331 -40133 -27300 1499 16462 -26509 -53837
18925 -53837 -49563 44853 52715 108978 143035 36776 -6871 -11077 -5395 47574 4820 -29094
18913 -29094 -10835 40639 42612 -29763 -11387 1987 -24870 -65000 -35200 -29180 -55085 -33637
18901 -33637 -32810 -87988 -71067 -62169 -36854 -9315 -44112 -105214 -77955 -15017 9782 51446
18889 51446 101432 46121 49385 47055 -32692 -92860 -152841 -153326 -88850 -63369 -107483 -95784
18877 -95784 -93805 -102897 -33208 7158 21263 -5944 13782 26666 19467 11697 -47656 -96227
18865 -96227 -67445 -14241 61505 70050 31088 10380 29779 60114 12575 -1559 43774 67510
18853 67510 123192 145043 159787 139669 80846 84760 73553 75882 48313 14494 -20411 -61660
18841 -61660 -84180 -40611 -20577 26909 -23269 -35097 -47567 -24655 -40221 -83475 -138453 -97870
18829 -97870 -75713 -36376 8835 2483 1018 6839 -36511 -93001 -104912 -54254 -32064 -36844
18817 -36844 -65733 -13663 56547 32246 -7426 -87263 -148135 -166216 -67280 14251 16525 13576
18805 13576 51422 127848 61508 -13514 -13885 48399 76740 65860 75783 82739 73711 52762 21342
18792 21342 24325 60890 83251 38331 55966 80860 57589 84067 141213 142244 103535 100284
18780 100284 81711 95769 78557 43606 -14038 -28188 12044 13915 -28202 -34596 23331 127316
18768 127316 245254 417850 560718 574836 476897 394469 272315 176109 115343 62212 67670
18757 67670 54807 66240 75350 99708 14380 -37436 29475 50952 -31778 -19421 -56023 -28735
18745 -28735 -9268 18932 33587 31754 54010 39697 28794 14306 -13481 -37756 -59444 -53065
18733 -53065 -34258 -66483 -85375 6168 31686 8004 -9362 -45490 -58549 -88286 -59460 -67938
18721 -67938 -42601 -10774 -14908 -20755 -70551 -83928 -45630 -36288 14997 19765 26702 19153 -1339
18708 -1339 -4531 -10966 -45739 -53660 -20842 23392 53599 31689 -29933 -15621 -3315 20092
18696 20092 98232 163050 126309 79621 56946 40295 -21434 -24697 -5497 48037 52777 59068
18684 59068 36583 22732 38810 39355 47404 71164 71138 114193 91720 57735 19441 -33557 -32050
18671 -32050 20547 5094 69886 145528 113958 71707 66383 101542 110249 46947 3781 -12839
18659 -12839 -21082 -6299 53451 43752 22475 8170 32284 58125 22707 -47157 14811 93535
18647 93535 87305 36958 33298 12847 19262 85105 101875 79743 84736 5236 -55986 -61232 -20035
18634 -20035 -26909 -49246 -16562 -3851 37613 49396 71965 34405 17636 71417 85443 84088
18622 84088 69582 150100 185505 144087 60040 73215 45757 -4840 -2929 38074 51441 6200
18610 6200 34970 -4680 -29967 12081 11762 25445 4436 -26775 26549 71777 64033 64664 42238
18597 42238 86050 87323 114388 121094 165332 236262 315222 303845 320662 318932 294571 311160
18585 311160 304548 323321 298225 208612 174661 197254 168718 131424 105866 68227 66335 80039
18573 80039 37644 57204 101377 84330 5481 -4117 -24122 -67301 -18754 83348 79814 62717
18561 62717 42047 66011 41081 9196 -44945 -45218 -61820 -40594 12948 62089 80043 58492
18549 58492 45538 21398 3719 4084 -14561 10369 21763 19496 74659 96594 99994 54756
18537 54756 9717 31571 61490 69017 33011 32264 83345 141282 133825 105625 26536 -20170
18525 -20170 -28019 10430 76835 52714 22861 -36175 -55738 -78641 -13395 30598 32613 30919
18513 30919 8372 22559 27561 -1958 19471 4772 -67089 -138342 -114278 -54709 -1816 -18727
18501 -18727 -15654 -27498 -4828 17562 -19275 66482 119913 75996 787 25889 82201 36509
18489 36509 12277 16742 49939 68527 50035 -13175 -28308 -23368 31162 91607 46563 49603
18477 49603 36607 73217 50427 23951 47950 81085 66791 61699 37476 -44376 -56501 -46412
18465 -46412 -42854 -10980 61749 74506 77023 57066 86656 88723 32127 5348 15509 -730
18453 -730 -39677 -44249 -44348 -20245 -47665 -33557 -9053 11612 -13266 -26056 2397 13808 36573
18440 36573 9540 -9397 12492 69582 92831 20983 -58236 -97200 -56325 12248 66700 22986
18428 22986 1911 -15878 -22465 -32149 -15330 53889 105190 105699 55781 58774 46556 24266 58800
18415 58800 101126 134554 76885 52659 -976 2270 761 -66859 -42259 9070 3297 5820
18403 5820 15170 42102 70639 120781 94376 34476 11020 -15045 -74531 -70815 -37159 -18696
18391 -18696 9961 36514 45029 36604 7868 16341 -624 17089 -2682 1333 77283 58260
18379 58260 1948 -2846 19967 23054 37394 108741 121391 67873 37390 5377 -4643 -68295
18367 -68295 -67358 -4148 58892 92987 56183 29599 -13248 -20727 9083 2493 28697 87619
18355 87619 132350 112116 88699 90963 103276 150245 111115 24544 -48695 -37396 -9127 -25085
18343 -25085 -40186 -14262 619 54510 56389 41153 107055 65503 -38699 -72746 -61779 -44100
18331 -44100 -23792 1519 -11955 -85360 -70446 -47549 -34078 -15267 -23616 -54194 -47927 -21532
18319 -21532 -74146 -104955 -45189 -31387 -27351 31607 46622 -23303 -27501 -19093 9487 69109
18307 69109 55002 -12183 -14841 -46165 -53739 -39658 -37905 -18482 44033 105473 150760 243199
18295 243199 290015 275087 237617 135714 116944 123368 131261 84152 89451 106476 82704 115423
18283 115423 159350 188005 174799 164375 149202 124468 123344 79860 96137 93352 68543 66923
18271 66923 59953 43690 71715 10126 -7109 46197 20092 30388 28615 43024 94046 110051
18259 110051 99599 68404 70886 98194 106268 127964 92073 76976 118871 161495 98010 76990
18247 76990 47812 6681 -5031 -26091 -24980 -6790 31645 125774 158863 119806 91089 125954
18235 125954 140065 225680 296118 242845 165794 118857 121492 65617 85886 146252 154769 165875
18223 165875 157820 83297 -12438 -32167 -6182 21217 85456 141287 153787 177176 163242 140885
18211 140885 97705 160811 195340 258804 267275 259704 274885 205806 167984 205104 230700 214819
18199 214819 183254 173676 150260 157211 180779 165382 182159 174454 186397 124353 132188 150977
18187 150977 143415 164507 134997 81377 116072 143393 155359 165854 185879 198686 198365 203400
18175 203400 219529 274541 312920 310662 288466 287115 274604 276188 272868 224587 251134 260650
18163 260650 302096 305918 278136 274325 322289 346054 402503 419343 384569 373909 363499 394600
18151 394600 422359 432443 527167 576320 546095 507345 546506 587153 651345 693926 676093
18140 676093 707757 746041 773769 777957 801779 787246 756069 720562 767900 866024 963089 1025251
18128 1025251 1087128 1208332 1375510 1527452 1635911 1784023 2079564 2400938 2753618 3147729
18118 3147729 3653456 4309093 5259353 6619892 8571237 11524495 16495110 25137923 40771396
18109 40771396 67187023 98071132 110970150 97511427 71745285 47452366 30297834
18102 30297834 19779565 13545571 9822711 7433539 5752817 4497767 3596646 2973150
18094 2973150 2386653 1935287 1563085 1320404 1169526 1058717 1034482 979066 894309 795256
18084 795256 784319 818527 784457 811625 795968 710620 650284 626275 541169 533667 508239 505004
18072 505004 546614 574499 534728 498132 500877 532778 576215 599394 696966 700566 650695 671368
18060 671368 636297 656784 736574 835784 868773 997681 1087367 1205218 1276065 1289878 1292881
18049 1292881 1372135 1550349 1784463 1980967 2075177 2104367 2091415 2090671 2250245 2488780 2727479
18038 2727479 2875883 3098712 3479832 3972808 4670309 5643419 7027053 9185564 12405491
18029 12405491 17528601 26218968 40621295 59303342 72485054 72525385 64762454 58846288
18021 58846288 61218995 70996695 77085306 70207739 54579611 38363717 25904866 17627777
18013 17627777 12380781 9036406 6843654 5389514 4321808 3582704 3073739 2684192
18005 2684192 2380505 2095735 1838770 1675097 1587520 1529962 1498647 1451299 1331872 1229174
17995 1229174 1204539 1133433 1031616 909600 780710 750585 784198 805520 714792 567132
17985 567132 445501 389879 433343 433584 367828 255078 210723 244360 205037 202246 235738 207258
17973 207258 244622 308701 415055 511177 561713 519717 455034 429587 401410 363525 393596
17962 393596 408344 337858 277406 231496 164099 190298 175747 91556 20199 67413 116738
17951 116738 118638 150895 133698 50074 39644 73662 110198 139940 142129 106210 35547 76453
17939 76453 115834 69571 -22929 -52285 -41598 -23668 -51933 -97809 -100396 -33170 56223 79694
17927 79694 93168 105209 26878 1945 29217 24 -66940 -133368 -175184 -146802 -132109 2684
17915 2684 105269 194610 171179 119217 124497 107825 73309 14920 -26285 6095 86824 97198
17903 97198 71340 46661 44402 24427 -30693 -34700 35551 89852 103719 68160 34200 -38623
17891 -38623 -69528 -53569 -18072 2839 -544 -23173 -50511 -7484 24340 21516 6647 -18895
17879 -18895 -21611 -36926 -30706 -83604 -81537 -61365 -50506 -11806 -14117 14915 18496 41549 32269
17866 32269 1723 -19408 -42374 -68232 -67725 -81175 -86086 -35723 1220 5019 8665 1767 -24731
17853 -24731 -34868 -78760 -84557 -87553 -89266 -152001 -214860 -178019 -65652 -5115 -20791 -70155
17841 -70155 -62472 -25793 -49498 -76008 -92365 -118302 -173980 -185413 -123986 -73809 -73519 -101585
17829 -101585 -83546 -57782 17153 96756 74351 16616 27402 18238 51993 41058 1418 -18600
17817 -18600 3422 16239 -15295 17858 87671 103835 66509 76709 59550 54977 10272 -36536
17805 -36536 -56395 -48833 -51484 -50694 3541 -5692 -22605 2678 20614 74618 46587 -34565 -44837
17792 -44837 -20952 -32707 -52217 -289 13984 32344 40856 -14048 -2806 26875 16517 40581
17780 40581 21117 93664 106181 48477 -6187 18332 26969 -18854 -65357 -65788 -39677 -3177
17768 -3177 -44919 -24596 19942 32067 74352 138880 112841 67659 16811 -37057 -16323 -11614
17756 -11614 46879 81169 60820 81802 107376 37635 5223 -40232 -15030 9516 -26379 -74049
17744 -74049 -101262 -88092 -120322 -76313 -20797 -38349 -68873 -15715 10449 14 -71546 -113024
17732 -113024 -76905 -67771 -14006 -1599 13883 28518 25566 40610 31751 38524 13268 10187
17720 10187 40693 44960 121025 155166 175607 170664 112734 71667 79202 59933 9641 -11775
17708 -11775 -8559 7995 20363 16451 11683 25396 16738 -3750 4835 22154 30347 -38167 5161
17695 5161 17027 -48264 -15205 39894 19778 8507 23658 18072 92001 46930 33031 63753
17683 63753 29388 -44872 -86250 -95478 -30894 -7321 5872 -13919 -13337 12851 41754 35257
17671 35257 -44503 -31569 -37774 -26519 -4778 10389 15127 18861 58217 51970 11738 17179 -5534
17658 -5534 51834 77599 85984 74086 38006 -6491 -9470 -2918 -847 45167 97668 77925 33157
17645 33157 10961 22819 1676 -43758 -55248 -76202 -40220 -71031 -69694 -26803 3733 36896
17633 36896 26253 -17577 -47715 -45796 -19877 -21039 -38589 -68706 -63759 -40526 -937 -26668
17621 -26668 2603 57604 78021 92976 90590 77613 82270 65770 99687 47038 3469 16634
17609 16634 27846 34060 30391 68234 57999 19988 -9154 -7923 11392 1161 -30361 -17999
17597 -17999 -22285 -19507 -26056 -8910 13856 1594 8687 -18598 -66496 -115107 -78491 -60733
17585 -60733 -72232 -28605 32261 11984 26850 33310 9686 31191 100521 119776 109280 70381
17573 70381 91267 109076 111969 88994 126599 158724 118798 68144 60842 55620 30971 56939
17561 56939 152439 130330 164557 193086 156818 106729 28663 -36568 -14809 -29263 18857 -28914
17549 -28914 -77242 1823 4002 -12060 -33180 -8483 46430 21459 -52905 -35298 -20779 20941
17537 20941 38126 15697 -18384 -15829 601 3205 16969 20546 1740 -51209 -24866 -12111
17525 -12111 64115 40506 73689 97495 50002 70089 116439 109075 165596 158963 131587 106584
17513 106584 100918 160692 195395 211574 205117 176672 122945 85573 91275 44550 35316 40964
17501 40964 -14057 16166 45376 89478 91796 68045 67793 44670 61173 104472 109117 157287
17489 157287 104106 110890 179292 112866 102084 148737 203141 209836 141576 123886 146839 112319
17477 112319 129405 164282 174548 186501 159601 181390 230275 207226 212040 214975 177675 90300
17465 90300 46026 86247 184046 234738 243347 177057 184492 214487 275156 315451 383068 466796
17453 466796 564251 631777 606955 586186 581165 554553 578608 609705 582876 598491 701114
17442 701114 917875 1002297 950205 789321 656593 592186 555699 547661 492096 464687 407939
17431 407939 443416 477206 494680 486395 515888 547594 560399 607230 631427 651167 677954 699756
17419 699756 781183 848856 943520 1104471 1224912 1339031 1548243 1818751 2081404 2298943
17409 2298943 2433883 2564723 2772244 3075903 3428234 3775172 4143898 4659835 5439542
17400 5439542 6626695 8483151 11399787 16124868 23909085 35925814 51059394 64177497
17392 64177497 69738265 67374195 62709290 61740938 65836848 70069153 68013510 58102821
17384 58102821 44266015 31237033 21357331 14703630 10485214 7697329 5922782 4716871
17376 4716871 3884647 3337818 2998200 2716363 2382779 2125728 1934377 1792376 1679750
17367 1679750 1522434 1425697 1297801 1108453 892568 703367 632817 624176 567258 481331
17357 481331 388041 322964 278111 288813 320580 290466 263233 233288 205767 144472 148893 152613
17345 152613 163183 219724 235174 221510 152523 102275 39935 1089 -4910 56102 61561 72049
17333 72049 68922 46583 49413 77018 86945 68176 120682 120192 81028 78644 46341 -1323 14229
17320 14229 56229 62221 91425 136139 107832 117668 141803 88250 69137 3031 6721 61988
17308 61988 59733 72693 43967 26084 56492 29926 -1780 2442 10997 16088 -3362 -3846 -29025
17295 -29025 6537 18556 -1210 -9624 -10669 35972 57479 11062 26003 63214 71525 31771
17283 31771 45604 38300 48914 43508 22286 16824 54540 21615 49712 -21241 -36296 -15375
17271 -15375 20208 8932 41120 30752 47004 21694 -28114 -60644 -26453 -59642 -29880 -35035
17259 -35035 -70997 -47929 -28723 -10707 -69934 -72820 -53557 -52112 -37982 -20118 -42759 -52977
17247 -52977 -41618 -69604 -74432 -14539 17813 -4806 -45556 -33509 -19159 -12919 -20663 11377
17235 11377 7985 -713 8305 57638 114838 119550 139447 66722 18125 83505 114728 133787
17223 133787 86623 29387 21067 2271 -7363 32530 32526 3455 -48478 -67351 -69342 -33338 -32816
17210 -32816 -47915 -73669 -109773 -100788 -95311 -119665 -160886 -153301 -99504 -71375 -32103 -80178
17198 -80178 -70672 -40965 -44184 12154 35911 64952 46435 10271 -75095 -64405 6220 -8610
17186 -8610 20800 35040 27809 25197 72200 103320 116626 110100 24258 -4306 -3436 43578 68235
17173 68235 61506 39603 48718 31258 -50910 -38400 -40272 -44175 -66946 -106148 -111317 -53076 -23791
17160 -23791 -49474 -32261 17660 44944 43670 19215 -35205 -15052 -65092 -29574 -28211 -8908
17148 -8908 31565 91493 113921 58913 38615 -33221 -70326 -44591 -3559 19682 -6698 -57227
17136 -57227 -62793 -70225 -47080 15249 44805 8340 -62723 -135455 -175799 -150218 -83092 -51965
17124 -51965 -13516 22980 -3468 13059 7954 -14111 13532 -25466 -76098 -45406 32224 21158
17112 21158 -10965 -52363 -38263 -28752 -17643 46686 62307 65945 44101 59976 82842 80271
17100 80271 64583 25314 13784 -1478 2749 6274 -22837 -90267 -104525 -56073 -34645 -37949
17088 -37949 5691 -15921 -48697 -19453 -79541 -106554 -104814 -124607 -127904 -135184 -144805 -110577
17076 -110577 -20609 2695 -11018 -24423 -4904 51092 43254 -3608 -21863 -54010 -124242 -88722
17064 -88722 -55363 -51594 -98637 -94573 -111473 -48026 -57997 -83816 -30270 45850 58711 24172
17052 24172 6468 27972 25081 -888 -88412 -36691 16623 50075 26258 -32916 -74305 -32301
17040 -32301 -15639 5247 41921 27951 40067 67794 54110 61046 26683 -47845 -81352 -102849
17028 -102849 -102055 -7068 39921 37590 13522 -3226 -45321 54685 86401 39511 8094 -40458
17016 -40458 -61728 -83547 -90281 -46961 -3621 25115 20149 22195 9341 -20235 -51572 -102504
17004 -102504 -68950 -40990 -34421 -76390 -24643 3981 17647 22828 32838 46836 86785 113114
16992 113114 27348 -54376 -81578 -62511 -4980 40095 13375 -56626 -35087 16331 42842
16981 42842 52215 38349 16419 -44033 -76117 -77499 -37693 27899 24108 -1715 -18584 15213
16969 15213 42005 12398 -14868 -8944 62459 113184 169396 154947 64503 -24270 -76138 -63188
16957 -63188 6695 18521 -16923 -63719 -74986 -58143 -45604 8256 22754 10949 -5003 21620
16945 21620 68514 60337 8231 -23520 -93794 -122723 -105384 -68611 -36424 13820 18950 44523
16933 44523 95510 79714 68384 101433 143052 124220 85449 44855 -1037 14917 -3625 69299
16921 69299 66470 52840 56524 4718 -20984 -40555 -27826 -7177 26800 -21270 17398 -13923
16909 -13923 -502 29563 -16362 -53451 -5184 -12444 14100 33417 41042 69741 76579 74505
16897 74505 79580 50561 14941 28065 15132 -1061 26771 32421 -10604 22029 85826 91847
16885 91847 50966 26537 -62482 -52722 -18433 -42171 -61747 1355 8345 19375 13587 -5180
16873 -5180 -8623 21085 47472 7533 -6526 -34543 -59557 -105112 -132345 -20592 51401 53342
16861 53342 59852 40329 -32029 -41339 -15459 -45548 -47155 -12769 -35945 -75176 -86710 -93159
16849 -93159 -91066 -75316 -54629 -40753 -61491 -71724 -34093 -5992 -36270 13062 52528 50415
16837 50415 -25121 -89874 -114080 -59233 36769 32768 -40650 -31278 55378 40125 -5538 -15711
16825 -15711 16680 2655 2403 -52706 -61865 2685 33229 87426 85188 100429 126287 138191
16813 138191 222928 273748 341399 398666 398268 391676 351111 391755 364668 360060 288537 176209
16801 176209 142187 102503 96828 73140 118453 134844 79166 61172 21286 -27933 -17761 11584
16789 11584 6250 -30954 -62643 -44928 -58578 -60317 -59432 -44835 -32709 -85773 -71460 -41610
16777 -41610 26047 5215 -29305 -19881 -50038 -38428 -53501 -57007 -54663 -61502 -24004 16355
16765 16355 11061 16896 -47864 -70494 -43490 -28210 -74516 -78913 -105704 -130768 -86784 -33107
16753 -33107 23528 -530 -37242 -57408 -61893 30431 101836 103700 38717 -8257 45698 96499
16741 96499 -6122 -40544 -34315 -66825 -110973 -133282 -26666 24886 -37780 -59147 -2962
16730 -2962 -6692 -38867 -68541 -70714 -51316 -38219 -51867 -22458 -10129 -38133 -22785 -29296
16718 -29296 4915 51970 81718 89105 15959 32292 25919 21594 37947 42208 42257 62002 -3018
16705 -3018 -81928 -108104 -63694 -43946 -5160 9652 -6065 -19305 -52229 -80624 -84096 -92455
16693 -92455 -93521 -61547 -49686 -68164 -98167 -61980 -35224 -32340 -55345 -1248 58811 13092
16681 13092 -24337 26303 -7287 -29241 -21953 -22127 600 30657 48122 86872 37009 -58140
16669 -58140 -33813 -10127 -48592 -84617 -78902 -47118 -89926 -90170 -58148 13492 -362 -75974
16657 -75974 -127017 -103721 -100698 -61806 -44646 -12937 71068 89499 -21801 -54562 -18155 59831
16645 59831 29752 637 26635 43984 20479 42473 26675 22088 59684 57534 32170 -28290
16633 -28290 -50710 -57854 -35607 -22427 2028 45332 23694 -43779 222 -22208 -28179 -12991
16621 -12991 491 12179 -1058 -38713 -43766 -83985 -50935 -10372 -90656 -149178 -130949 -104963
16609 -104963 -84289 -47364 -58549 -101726 -101663 -32938 -16929 -57513 -94018 -110276 -127158 -98829
16597 -98829 -76592 -29493 35002 57814 -15502 -36940 -37190 -59196 -13295 -30719 -13024 -42228
16585 -42228 -82793 -115728 -136625 -75368 30509 25679 -57471 -69232 -67835 -80155 4233 92605
16573 92605 90729 100515 115366 55141 -385 -6804 -31682 -86019 -110399 -129372 -117467 -50647
16561 -50647 -34566 -47211 -43249 14404 30473 -4987 -49670 -56036 -15242 15390 -47655 -86698
16549 -86698 -50176 -65345 -90661 -142737 -118427 -82882 -71828 -103297 -107058 -134203 -127138 -71431
16537 -71431 -33620 10873 66431 77331 107306 99918 98493 109737 56667 -24487 -79053 -89518
16525 -89518 -80164 -46239 -12357 -28549 -69579 -100328 -24950 18987 6975 23472 16162 16651
16513 16651 38335 27551 24915 3918 -40009 -49035 -33870 -10232 -17112 -33336 -21213 25991
16501 25991 -6088 -79453 -122932 -98116 -56625 -31950 -53698 -35490 -16685 2111 -17071 -7288
16489 -7288 -5123 35079 63880 51492 -40466 -169933 -185724 -120488 -54598 -28516 -84837 -114063
16477 -114063 -59596 -37806 -35659 -15871 25771 36833 19019 -38155 -29432 -10445 23790 44657
16465 44657 31016 -36544 -16027 17784 22040 20450 2729 -11299 -85616 -54792 -25949 -71252
16453 -71252 -76097 -56884 -52202 -51828 -42697 -43359 -71255 -66037 -65960 -31238 -7823 -10892 -5872 26245
16439 26245 22129 -23616 -53159 54 -21380 -50305 -32869 -29002 -51083 -33945 22568 10167
16427 10167 -10393 51299 77595 60397 39171 36443 95968 77969 12539 -18250 -13666 142
16415 142 909 16511 33519 -11489 -28443 -7810 -4219 40252 55962 6243 39496 21096 14573
16402 14573 8023 -8026 44624 58161 79776 103142 121894 129339 72062 4208 9259 35941
16390 35941 25323 -7371 32648 69006 17047 -40918 -28596 26297 44523 4619 -32127 -73581
16378 -73581 -39811 4120 -20093 -101595 -154091 -163258 -158342 -99643 -64087 -89552 -85155 -38197
16366 -38197 4435 -53992 -27041 -36114 -36221 -45012 -66264 -71275 -35658 -31777 43122 39795 68368
16353 68368 79615 45603 -8858 -49194 -49002 -33064 -37060 -39317 -15163 21464 38533 346
16341 346 -61785 -90724 -24620 -29532 -3330 12061 -4003 3159 -2924 -43352 -24567 572 45214
16328 45214 39048 64108 103764 76476 -21329 -47365 -20455 3645 -58913 -86312 -75550 -61641
16316 -61641 -131674 -144991 -129622 -79438 -48477 -13119 19173 -35785 -89985 -80117 -49152 -6840
16304 -6840 -84736 -34034 -20305 -57156 -101438 -158578 -120907 -65735 -78624 -108569 -102568 -30414
16292 -30414 -8808 16163 93696 99441 15361 -22309 13951 52842 70004 83742 92928 47090
16280 47090 -19805 -21466 -11361 -4967 13661 30055 -18763 -15904 -19947 -70750 -40688 8129
16268 8129 34143 53069 41712 -27373 12383 1200 -54067 -61054 -94636 -39834 28585 77732
16256 77732 131294 155092 131060 164758 132464 37191 -6969 -9747 -1475 14974 66066 59293
16244 59293 -12897 -31167 34399 44373 53872 2676 -200 -13977 -125352 -171468 -58100 -2384
16232 -2384 -38279 -54259 -55576 -89066 -58363 -56110 -133595 -120424 -33125 25377 -17521 -27662
16220 -27662 -42997 -14712 40602 -8965 -51517 -31393 -12954 9565 14180 425 -24005 13144
16208 13144 32442 35368 29777 10285 5752 9971 -13287 1136 -21550 -97535 -99723 -79299 -48958
16195 -48958 21 49118 30328 15614 52430 48146 7105 -14063 -1080 29481 24514 59739
16183 59739 13162 -2197 33577 70094 88548 321 -16877 -38038 -42574 -57305 -86853 -63905
16171 -63905 -76699 -70768 -33369 -8386 -12367 35531 38258 60593 75205 49280 50391 3587
16159 3587 -74313 -83031 -42256 32672 -4319 -29373 -78359 -89557 -81442 -74108 -15141 -4611
16147 -4611 -74985 -62644 -25977 -49840 -43555 -25606 -76983 -47627 -27446 -28887 -36843 -60285
16135 -60285 -25725 -105135 -90519 -100749 -81854 -81612 -20094 11579 -55459 -62301 -62359 8115 12692
16122 12692 33680 53558 34162 -30637 -63255 -79709 -64907 -18196 7730 -78890 -138479 -123104
16110 -123104 -101425 -81372 -50130 -27473 -16772 13146 45578 44800 -690 -49658 -68039 -137240
16098 -137240 -146023 -105499 -76812 -74351 -43665 31185 35637 -40668 -24268 -38578 7395 4815
16086 4815 -33691 -16448 -30623 -11754 55619 110405 118469 96551 117125 75974 68666 25090
16074 25090 9308 2040 29115 61816 3014 18680 -9255 27406 -22461 -32461 -51145 -73616
16062 -73616 -127057 -61092 -17098 84685 51360 10465 -5929 8174 -3115 19655 -21099
16051 -21099 -13008 -60269 -33708 -36753 2333 31143 30038 9768 1931 32682 -32419 -71226
16039 -71226 -42682 -38109 -55780 -40540 34289 26560 -26255 -77590 -18349 -11198 -11780 10931 -34946
16026 -34946 -19212 -72209 -80046 -49710 -25199 -7936 14360 17496 20375 26625 -11274 -15125 -19487
16013 -19487 -16894 13166 22313 -14717 -17661 -94396 -152125 -195793 -203492 -128729 -54071 -26385
16001 -26385 27939 46998 35503 575 -1230 9041 -453 -235 -777 16693 41609 -41731 -99011
15988 -99011 -90566 -86069 -72622 -18962 17640 19598 7456 -61 6020 5101 -39899 -54347 -59961
15975 -59961 -52095 -54652 -67214 -57698 -84479 -69390 -32789 -30233 12250 42800 -5053 3055 23977
15962 23977 47201 4764 16659 53991 -10191 -58043 -62709 -39779 -21941 -4326 9633 -34682
15950 -34682 -49853 -8397 26289 37598 29862 36285 33192 -10042 -20550 -46422 -80839 -79219
15938 -79219 -18862 40122 -2606 -33343 -48447 -64415 -99641 -128271 -93365 -44556 -8712 -2798
15926 -2798 -54432 -73133 16616 55110 -11304 -41551 -102417 -179743 -164863 -27162 32545 7808
15914 7808 60571 116999 127838 93165 65664 43655 58409 56643 13427 50497 -11449 -43937
15902 -43937 -91275 -80391 -75428 -89862 -97028 -85142 -51458 -13575 1485 -7899 -26573 -58437
15890 -58437 -82336 -32092 -34117 -19701 -23408 45797 15845 30518 21620 9040 13889 11685 52583
15877 52583 27468 18572 28571 53056 5886 12664 1063 34760 74243 106106 90470 26028
15865 26028 -2650 32843 35168 6178 -17089 -3151 17518 20739 -27704 -37072 -67039 -79835
15853 -79835 -82574 -34479 -1769 3305 58956 70517 42585 6895 3552 -19557 9710 -8570
15841 -8570 -45517 -49580 -44822 -74468 -67116 -13660 -24024 22507 -421 27136 20735 34908 46671
15828 46671 41620 -18090 -38214 -14242 -20942 29646 22812 21419 -23433 -49839 -63396 -49729
15816 -49729 -93225 -92155 -58741 -11796 2269 32421 25639 -1838 -21654 -45858 -103378 -77720
15804 -77720 -54035 -34900 23055 20839 18275 44715 -22389 -60112 -34341 -28905 -85824 -65564
15792 -65564 -27679 -82759 -74404 -53914 -39236 49438 58837 74642 50632 19460 6563 39794
15780 39794 45191 32844 -10400 29709 88049 73763 58614 39540 -10792 -8993 3117 -47430
15768 -47430 -39802 -8338 31797 79899 88113 13920 -42532 -48809 -9784 51925 19914 -20465
15756 -20465 -59280 -55887 4150 60089 75052 9484 -30223 -38109 -55153 -21466 32312 3365
15744 3365 -5871 -12061 -55297 -22127 19817 14660 -10093 -15677 -28336 -17039 6769 37433 21368
15731 21368 -2708 -37639 -50812 -28164 7794 -9250 -36941 -20887 12529 57963 65533 1277
15719 1277 23472 6250 -47143 -84128 -28449 43827 -1804 -12404 -66828 -54520 -44264 -16977
15707 -16977 -23425 26964 40132 -54538 -69386 -45528 9058 47470 29752 2508 66567 101225
15695 101225 91588 80369 51880 43839 42548 28705 15958 44123 38137 -32634 -28404 31721
15683 31721 34621 30299 16598 47592 63411 29092 -1657 -22317 -44108 -88361 -72196 -35671
15671 -35671 -61196 -68195 -29463 11376 10220 5894 49333 19189 34039 11294 -11847 603
15659 603 22464 -3409 -64906 -84333 9977 37235 8872 39503 40960 99416 25773 -23382
15647 -23382 -12388 28776 6876 -50181 -31193 -17165 -55653 -60189 -64265 -71930 -29956 26107
15635 26107 45244 67117 124645 133228 79509 75709 31424 762 27035 43245 3500 -12831
15623 -12831 29546 50500 45047 -11412 -29960 22651 19405 -42381 -69019 -13961 33879 51761
15611 51761 30458 30006 10785 30429 49589 36799 37727 40462 71473 71350 10031 27766 36786
15598 36786 33405 25049 9686 -24816 -52902 -13116 7229 22006 25153 -12618 -30913 -1698
15586 -1698 14792 40186 73774 66930 91686 71379 63248 11190 -45790 -78210 -89964 -35375
15574 -35375 -6311 21958 81271 80751 18654 -49774 -65917 -40521 -21278 37680 81945 58664
15562 58664 34997 -829 449 -47926 -28892 -15351 28151 69460 54823 -23117 -39413 -87191
15550 -87191 -43652 22815 19012 44971 10751 -5355 -24299 -31829 -12957 -18712 28240 30580
15538 30580 21287 60605 76391 45647 44192 91680 112709 100172 22861 -13859 -52199 -86592
15526 -86592 -88332 -11107 27936 9281 32696 -4441 34712 56314 30917 54404 48796 12577
15514 12577 52244 71734 28200 -19438 -21924 39425 31651 15895 47101 80180 45852 30308
15502 30308 88165 106955 101134 79835 47140 19422 40465 72437 96352 98147 81209 59148
15490 59148 50888 -33639 -38189 -40558 -57375 -34707 5006 19115 -15230 -45190 -33476 -52994
15478 -52994 -63798 -53492 -36827 3862 52313 90268 48945 10851 -2332 -28880 -46532 -55185
15466 -55185 -54714 -45233 -32284 -20354 -17987 -40606 -32712 -71259 -120798 -103604 -89479 -94692 -30394
15453 -30394 -54624 -80528 -6487 89048 52035 -5095 -59058 -90389 -102856 -39530 -1358 -22810
15441 -22810 -3739 32607 19704 -6605 29269 89076 -5849 -48142 -42636 -40700 -31123 -18823
15429 -18823 -23362 -64700 -68039 -38355 -51717 -21648 -23124 -33246 -51211 -47655 -16473 21060
15417 21060 66622 96989 44807 19955 10477 44992 31031 -14069 -67452 -58997 -6851 30966
15405 30966 -2380 -14301 -45447 -50420 -18933 -1761 22982 30285 11725 17070 37990 49583
15393 49583 37095 14202 -33240 -62136 -65866 -25771 -60213 -87553 -90819 -73692 -85582 -54875
15381 -54875 15446 -13280 -42179 15389 29190 39840 52024 107757 45201 -9325 9575 24060
15369 24060 56528 41325 -10458 7940 -3986 -14467 -9117 -38290 -94862 -103956 -40368 -26087
15357 -26087 -22231 -2594 44251 30987 4412 -41248 -42496 -13683 24977 19430 39430 102843
15345 102843 69623 36116 -23705 -20184 -39309 -27810 -29688 -37941 39304 109731 105761 83325
15333 83325 64671 31564 -10644 1799 -5812 10104 27547 26623 32125 39344 31120 4688 -19362
15320 -19362 -10212 18955 8937 -3184 -38208 -37159 -15139 -39124 -49518 9639 -21808 -24861
15308 -24861 27037 78313 47237 24279 6254 7273 718 -19900 -7047 42455 111084 108036
15296 108036 82635 60680 79249 95103 11487 -67759 -57445 -12240 37967 -32948 -54809
15285 -54809 -57496 -62218 -11130 5763 31243 -4834 13078 34351 29064 32896 82030 86212 83543
15272 83543 -12290 -36587 11739 -29425 -49884 -28913 12344 43911 16081 5042 2356 36025
15260 36025 100353 108244 48913 42540 97973 73269 39776 29190 -34790 -35118 11351 14386 56637
15247 56637 106455 95445 52155 -12651 -33477 -57262 -57483 -52467 -4866 29701 96762 128258
15235 128258 89850 38436 32845 65532 24055 13879 -26419 -66496 -10109 12489 26848 32247
15223 32247 1509 20413 54731 41796 36880 58808 86938 112987 168757 128181 55550 -54543
15211 -54543 -49776 18943 50363 -23361 -50124 -44603 -37709 -16526 67554 64430 45629 78400
15199 78400 79952 80838 -8937 -13633 -12376 -73196 -108030 -97116 -47475 -35261 -51574 -39521 -807
15186 -807 -17358 -71659 -119284 -140251 -69321 -24073 12990 -6496 -18228 30755 103588 98492
15174 98492 67670 24731 29101 53226 81851 59438 57834 55432 11920 32973 25650 18771 17196
15161 17196 -4442 -8238 -41786 -100876 -84182 -5161 -4662 -18351 37584 42949 -19942 -6810
15149 -6810 -56864 49414 78389 44469 58004 36147 7430 -8062 -2168 21540 -13502 -31494
15137 -31494 6940 22841 3159 -11312 -49446 -89707 -93614 -46676 27617 14125 -39322 -25246
15125 -25246 -8664 3540 29859 -8075 -51653 8166 8476 14603 92600 56478 100406 102526
15113 102526 31759 13536 9922 7127 -8276 34464 -56897 -133011 -84992 -73847 -78271 -20637
15101 -20637 1912 2341 -3291 -30114 -25145 35907 31342 -15708 -33326 -22036 42450 63930 42064
15088 42064 17006 -17126 -27089 11301 52530 31296 24526 8177 -14564 -41993 26670 47364
15076 47364 -4465 40637 49565 42136 74624 121503 89374 101041 51600 45779 43776 57984
15064 57984 -13540 -27206 -27407 -43048 -36588 -5789 26285 5715 -61143 -100015 -75795 -37945
15052 -37945 -12581 -35721 -30571 -50020 -87685 -69012 -74423 -70927 -23165 66323 63229 59124 44967
15039 44967 35053 4154 -22346 -16611 27601 44424 89436 96105 95508 61415 20924 -13674 2579
15026 2579 -14326 -27640 -44752 -29632 -32127 -38764 -46120 -45634 -54583 -56605 -45024 -17465 4563
15013 4563 47672 40329 94601 74782 44554 38940 71821 121868 121428 106387 121540 213348 280147
15000 280147 255919 198886 155160 154748 81700 23238 -3592 9236 56290 40422 24619 28213
14988 28213 44185 2865 -10768 -27576 -29059 -51846 -56489 -64486 -65093 -55204 -97436 -98383 -103838
14975 -103838 -77121 -57771 -23219 -14140 -58224 -44746 -13851 36193 71732 82542 48890 -18651
14963 -18651 -18484 -2390 10328 -30035 -61422 -45386 -35338 -31530 26536 -4288 18758 -7821
14951 -7821 -11776 53773 49955 69482 59774 5263 -24810 -52687 -40716 -36767 -34778 -47474 -41150
14938 -41150 -33351 -53402 -62494 -53868 -56835 -108524 -72558 -11049 8136 82055 100577 66141
14926 66141 20367 4647 -25780 2965 12474 -28758 -35559 -30231 -36846 26905 44085 19844
14914 19844 -22520 -15111 -40250 -44049 -49391 -48157 -51446 -16155 -26631 -116282 -132165 -98888 -81800
14901 -81800 -67227 -29323 -63908 -111003 -86453 -57149 -49480 -17227 -13370 -4668 31618 5700
14889 5700 9902 22897 -6850 2723 32858 36676 -1906 -34379 -65640 -36193 -25123 -32441 -42337
14876 -42337 -11665 -44044 -90509 -23991 -23732 -39565 -49486 -81781 -9935 28374 19324 -9984
14864 -9984 -12275 -156 35622 -7596 -31326 -1595 9134 38699 5021 -11964 -17996 -82941
14852 -82941 -151309 -100933 -41306 -4589 -17073 54790 55398 77239 16241 -12176 -35076 -10966
14840 -10966 24007 54281 55139 32111 -1968 -30363 -58092 -84216 -59326 -22704 32381 24417
14828 24417 -18293 -64938 -86864 -75417 434 66085 30117 16916 23730 27238 30217 -3626
14816 -3626 -48964 -36752 4794 72546 36345 -6079 -10210 8147 44567 -47954 -36204 10922
14804 10922 -5141 937 -29439 -25781 -28007 591 -23150 -12233 11786 -20803 -5894 49309
14792 49309 53385 25659 1161 -2568 -8251 -7715 -12240 -8778 -27013 -29567 -36435 -50928 -47716 -48219
14778 -48219 -42910 -57632 -24395 2038 -58283 -64659 -54180 -21935 -31612 -322 46025 83900
14766 83900 67656 41332 31765 7195 -83385 -87067 -61104 -60899 -53330 1368 33371 17527 -100
14753 -100 24187 -1077 -17373 -19836 76132 90643 53488 66857 63003 -477 -35182 -32686 2359
14740 2359 31168 31835 41337 36123 41462 17622 5058 -704 5345 -35508 -25257 -12205 -25956
14727 -25956 -15440 -2436 -17868 -34034 -50705 -55976 -19887 -12080 -53419 -69319 -45709 -13576
14715 -13576 29798 44533 20462 -28731 8111 23776 31275 22192 -26139 -23717 -6434 37825
14703 37825 56468 69434 20035 -3197 45759 89410 103136 76679 104423 46807 39585 96670
14691 96670 119003 68461 6179 -49538 -24366 -27393 -58011 -2897 -17810 -4836 4601 74251
14679 74251 91969 43726 40109 35407 40091 26983 -1605 20971 13761 9984 21848 -16540 -84904
14666 -84904 -84476 14294 70410 59153 17467 -78441 -65534 9845 45383 77332 79213 94717
14654 94717 89803 89723 97596 108914 69725 40428 26883 35540 31576 32315 27886 40044 66132 88371
14640 88371 79520 -7456 -21907 -29056 9556 55504 30792 -23020 -71381 -100385 -60097 -3255
14628 -3255 23062 -9988 -67475 -89580 -64216 -27461 -21556 -9978 -27127 33970 70849 34821
14616 34821 3477 4310 -14807 -14015 -32025 -47266 -45306 -4701 42890 3175 -25909 -32666 3587
14603 3587 68399 130603 89962 34459 18751 21730 53280 66527 73731 29020 4950 18919
14591 18919 52831 41555 16363 10559 -8210 -21343 30084 99225 89922 52116 25063 38107
14579 38107 42880 28273 -7852 41360 58890 60643 66105 91433 55737 14113 28592 14155
14567 14155 -31132 -16287 39917 80404 21048 -38455 -34772 -17345 -2628 47351 94509 101881
14555 101881 93626 78321 2143 23911 60317 71763 45281 -33805 -61514 -44418 -36765 3469
14543 3469 -24861 -28694 -41430 29570 67879 46733 -24471 -60661 -50936 -70921 -103581 -101539
14531 -101539 -55945 4331 47283 48740 35395 17068 4037 41202 17044 -4037 -15606 -30740
14519 -30740 -50092 -22727 -45933 -43933 -53075 1673 14158 -91902 -135482 -90539 -11818 -11501
14507 -11501 -40773 -24344 -169 -16027 -48743 -29267 -43110 -51352 4754 11791 68043 78343
14495 78343 56885 43013 39600 10508 16714 30697 32977 43201 71790 108950 83835 14852
14483 14852 -21511 40856 107145 100960 85381 87835 18761 -2784 -22139 -44150 3524 33373
14471 33373 27234 17162 47009 71844 65614 43012 47017 34997 8314 -15686 -23853 -4505
14459 -4505 6206 6157 8527 31197 69286 48221 33891 21578 43313 110723 130937 102133 25538
14446 25538 26505 31020 12780 -24683 -31629 -56553 -77854 -66395 -19522 -50235 -16489 44349
14434 44349 103820 63507 31388 -13934 37447 39588 11304 2123 97178 99648 41267 6674
14422 6674 -13673 -61216 -35634 2057 518 -26696 59920 65207 10503 -64284 -62197 2014
14410 2014 41860 28167 -44401 -15544 17255 48480 51986 20983 20473 35139 835 13121
14398 13121 23610 44253 67706 124280 98670 63465 -44423 -108554 -66402 15805 27032
14387 27032 -264 48515 69917 19442 -9686 -6551 -20442 -50003 -12873 20968 13339 51476
14375 51476 54790 -11637 -56400 -46109 -45972 -34844 -26372 24529 7727 -31378 35 -1421 49131
14362 49131 45832 52874 30299 4562 53259 115683 127943 125507 73973 46824 76467 53704
14350 53704 56191 72578 109923 106230 52099 47229 29355 19462 23620 -32224 -78490 -155076 -144606
14337 -144606 -92808 -84653 -40907 -4061 -17690 -42473 -73132 -14297 3215 40266 17540 42376
14325 42376 54421 30639 16288 -24172 -45759 -59972 -108042 -104238 -68349 -7877 5341 -48344
14313 -48344 -51025 2976 -14528 -62389 -28155 -10386 -4876 47558 52147 -13213 -50919 -13173
14301 -13173 -10540 5404 48571 58829 27235 22065 35 -38010 -14100 37451 36643 17936
14289 17936 -33009 -72700 -11001 67561 43563 45493 53068 91235 120159 77020 67206 69586
14277 69586 45419 35788 64246 71298 28748 16611 -22734 -48543 -61031 -24589 58374 -21027
14265 -21027 -51512 -47600 -57127 -48548 -39086 -31004 -3471 24551 37829 34525 43821 40136 28630
14252 28630 18862 -19000 -28474 -16089 29515 45162 78337 36611 -40061 -88927 -87348 812
14240 812 31096 35354 87286 73464 38006 49846 81068 68562 57980 50266 28613 -5332
14228 -5332 -13843 -27213 25105 13431 25032 65344 63684 -16032 -85142 -93168 -59721 -23537
14216 -23537 22233 37395 16900 21202 72569 67323 69360 74435 16368 39877 72297 25959
14204 25959 19620 54075 80448 77998 43435 60014 9715 -99534 -63804 -1604 6933 35234
14192 35234 77035 105163 74020 39128 48128 27090 4441 -128 12286 12919 46122 6750
14180 6750 4487 -550 10810 28429 106624 77252 80282 59712 6489 -34304 -11078 -11562 16012
14167 16012 3804 -25253 -10554 14349 45964 29170 30884 6568 -24726 4164 66840 102941
14155 102941 88928 82727 32296 40961 47674 114431 76680 53316 42928 7764 -49830 -39971
14143 -39971 29148 -13853 -23796 -13508 34043 32379 29019 -40078 8474 78300 42540 -15784
14131 -15784 -48007 -67222 -80277 -3306 -10443 -28847 -31850 21158 68599 121353 90799 10419
14119 10419 -5711 -21425 8885 20842 93264 95907 20329 -51790 -50861 4036 -74528 -127563
14107 -127563 -103639 -6658 25031 5026 20424 18940 34004 50566 2273 55293 63294 12097
14095 12097 37985 26549 2364 59468 88615 69428 41112 29518 -73074 -77987 -32858 -31469
14083 -31469 -57660 580 29871 39255 30954 51168 88572 70102 70660 90480 93229 29341 -4037
14070 -4037 39917 41997 -3170 -3132 -6205 16799 -2958 -53436 -42587 -26415 -7353 26729 52584
14057 52584 55820 33486 25022 14739 -45107 -52715 36543 55320 48555 28941 -12136 6911
14045 6911 31535 59765 75042 83683 85757 19470 -57783 -51857 -33594 -6969 -26741 -1
14033 -1 36303 55584 94600 73350 89015 127764 111477 125713 103467 80348 44360 12027
14021 12027 -32796 -35491 -7541 60716 38088 11700 46961 56641 44663 10230 -9876 -11199
14009 -11199 6760 13589 11261 8353 33103 23808 -21772 -46068 -37283 -25153 -75117 -170022 -165180
13996 -165180 -79649 14992 56506 35239 31292 55204 35919 -19922 -68312 -12925 17734 35655
13984 35655 13613 -30200 -44612 -105455 -96136 -33262 15553 -15202 -40438 -11640 -63252 -94582
13972 -94582 -83611 -50289 -33209 55306 81394 35215 -6678 641 30003 69603 54924 42644
13960 42644 21857 2645 -11470 -14148 -35162 -112024 -79253 -34700 -15857 -3178 -23627 -31673
13948 -31673 -16468 -46577 -69735 -28964 19996 45855 5787 -45294 -27334 -28062 8897 46369
13936 46369 99485 77069 4852 12964 42476 89304 144818 79885 30863 38042 27498 9657
13924 9657 -10351 -3873 -1723 -36945 14085 25198 49533 71134 142495 141642 38856 1206
13912 1206 -1857 26677 15853 -11364 -4149 32644 75028 60601 88388 77747 53928 14905
13900 14905 -22343 -19792 68761 104862 56354 23105 29315 79676 106915 28520 -4460 42629
13888 42629 52087 80168 85340 113207 64084 23287 -470 3497 8042 8824 -606 11487 -1824
13875 -1824 25976 42488 37662 39703 29839 36394 20750 22727 17405 30283 48555 63604 -7356
13862 -7356 -35346 -33078 -50338 -66811 -71919 -56154 -39654 -3140 46675 48605 39776 4187 -4937
13849 -4937 408 8676 47383 62996 61698 117847 130815 115517 59342 -11505 -43456 42163
13837 42163 83378 77109 31694 -59819 -48903 -68718 -28367 41915 49292 40791 -24869 -83746
13825 -83746 -84880 -80120 -86015 -83392 -39596 -43840 -14737 4828 22827 25534 32048 73989 124356
13812 124356 92865 10249 -32861 -23121 -24938 -17550 -80438 -23940 76319 70725 6751 -21779
13800 -21779 -29193 -13272 -2618 -25492 6066 8342 29880 2805 21446 37094 51270 6313
13788 6313 -28692 7922 62024 41118 -4986 -13987 -20553 6638 -21535 -36639 -21102 -1732
13776 -1732 4387 -66686 -72108 -41220 14127 61908 64847 3724 8310 -1462 -22410 8074 23398
13763 23398 42120 46414 54402 43068 22402 34410 69732 3766 -12859 -46628 -21845 4044
13751 4044 91206 113218 16316 -66912 -22143 29352 56153 28037 -30707 -8406 -44093 -80147
13739 -80147 -104973 -113062 -48379 -5213 24009 18582 157 -8296 -61277 -31929 271 7274
13727 7274 -8166 -26074 -44874 -41538 8142 14411 58089 68413 61177 75846 97272 48698
13715 48698 21848 58315 90071 81130 32520 -5073 -9619 -7156 10207 63981 17963 -24243
13703 -24243 -28186 -20158 -5130 -7868 -62117 -59752 -7204 37651 34137 -28213 -28149 16494 14373
13690 14373 25106 61187 38451 30124 48865 35660 -28713 -78932 -47806 -31605 -21086 -28413
13678 -28413 -8751 18656 34057 416 -9973 12006 26663 79996 103325 75782 48745 50967
13666 50967 76749 54628 77061 113547 101493 74901 23771 14227 -13071 39949 100840 137580
13654 137580 104411 62907 30827 47991 102221 35703 -31342 -4785 51248 35689 18758
13643 18758 -11723 -39768 -76247 -46090 -6754 -29844 -17386 34010 54595 70069 70586 56418
13631 56418 55775 26168 11089 42035 19839 38569 65205 110613 125682 144214 135322 62565
13619 62565 44172 16338 44709 15821 27273 59631 93792 54268 23473 70389 92388 63685
13607 63685 6580 25856 95233 83394 35354 -21636 -49472 -38990 -5427 -9274 -41109 -62973
13595 -62973 -64285 -80910 19577 87363 88559 59155 43969 18048 26368 11304 3765 -48001
13583 -48001 -89169 -54808 18295 37045 35111 45032 42544 -3409 14740 61680 23601 -6459
13571 -6459 951 12469 -4859 20401 72893 91442 74279 61727 -16235 -1338 102889 123228
13559 123228 50595 44187 71059 82791 111730 145529 134250 52303 29251 87799 131193 112771
13547 112771 74271 60368 23706 56177 54353 25397 48487 6481 -25015 -32153 -12928 39809
13535 39809 49676 118839 166700 162428 141039 121077 142042 128845 89932 24759 15603 2195
13523 2195 79723 96826 73682 105451 76583 30239 37791 16933 -39347 -6485 41906 108800
13511 108800 140478 124777 167711 179230 130295 110687 96651 53810 16234 -9364 15347
13500 15347 89682 127700 79651 35778 9080 35818 59957 63132 70460 73412 50794 55664
13488 55664 87458 50892 72439 79389 80300 147128 195732 198086 152731 64793 41477 72281
13476 72281 63801 76332 76702 50777 52295 45539 3030 -449 3432 14798 52179 42904 56823
13463 56823 97183 110730 145669 149308 152029 152924 139062 86482 68573 89341 51496 54485 43407
13450 43407 4671 -23480 29177 18215 -20173 -91889 -66778 -23176 10045 52814 29515 33798
13438 33798 74879 108804 97461 81184 113147 94244 92112 128738 226932 283442 307873 404630
13426 404630 540184 714346 995487 1427304 1802272 1884872 1644932 1294699 891614 595392
13416 595392 441278 333906 252757 254849 221109 143388 121651 144638 133685 124984 95930
13405 95930 52201 85615 91445 40503 29999 73778 106681 89441 88546 51907 69424 41543
13393 41543 18417 32453 15754 39438 73257 89810 93980 57249 18657 45326 87677 96489
13381 96489 54318 49676 89352 73848 62119 13605 -6963 -4818 -3119 -11327 -22194 10821
13369 10821 64530 37342 27851 39510 87274 112009 97098 103088 112265 80335 50178 64209
13357 64209 76123 48287 13689 24184 -13219 2268 -1785 35868 125076 146506 73202 26598
13345 26598 51518 45817 7146 -13468 -5822 54251 22128 -2311 -22972 -5168 -19655 -10134
13333 -10134 35007 19304 48334 297 10963 52885 82840 88879 102105 84060 43837 17017
13321 17017 -21925 -17593 -41856 -19399 2723 11522 57474 32989 41620 77350 120307 103115
13309 103115 38313 6096 16195 33985 94830 121859 91892 90256 61348 32535 12197 17313
13297 17313 55668 71367 38875 83769 124903 111565 -15785 2767 73379 101058 104923 61459
13285 61459 71882 57579 40259 60768 71436 46898 76527 62279 54034 90769 53318 66478
13273 66478 67077 45973 40128 24794 8357 50204 65195 54109 44665 74652 83396 41812 51680
13260 51680 64761 70562 104878 105324 69613 59789 85139 48232 15445 32938 68469 83668
13248 83668 65581 111101 129238 112627 103006 104218 88646 119505 116538 96886 106982 133395
13236 133395 153173 191765 205553 207809 275017 283102 288770 341632 399901 391653 475658 604718
13224 604718 782446 1100865 1507145 1921537 2052482 1819562 1451668 1043370 730879 571941
13214 571941 445530 302531 204887 165310 143541 204586 220722 214952 166028 148480 135882
13203 135882 119120 99195 76075 5918 19600 119775 132311 128056 108840 83010 95368
13192 95368 41887 80404 120811 61037 -44909 -11618 27891 18041 12128 -17065 -42717 -89666
13180 -89666 -82643 -67979 -111726 -105718 -182607 -214733 -119415 -59021 -101251 -177094 -109076 138953
13168 138953 371474 571315 677034 687560 578323 457448 368415 320314 294914 280224
13158 280224 259978 242323 283733 353475 350274 294519 257266 258546 265425 294358 303861 274579
13146 274579 211195 172794 137498 107680 113271 203297 168637 160949 171167 112175 141598 176980
13134 176980 113939 88057 175186 276175 340029 347535 295446 302095 272825 321695 366958 380416
13122 380416 392371 395877 363382 360241 365436 332210 322034 326493 322870 325501 330815 365870 347838
13109 347838 337952 342838 412089 432460 456581 574519 726416 828524 768414 650154 591078
13098 591078 634994 653684 671139 675698 690719 608063 485299 372383 306064 269331 280082
13087 280082 320685 278185 264719 310726 399695 470131 483245 413281 335613 307561 267113
13076 267113 262420 304611 323091 366587 419535 482260 503388 442467 443209 413983 363239 373112
13064 373112 383318 413130 442748 470232 431686 445345 482184 449622 409316 422103 422952 482183
13052 482183 557804 602920 622374 610112 627820 608538 595472 552627 533955 551664 598652
13041 598652 636171 658252 663026 710358 796938 822274 819234 836006 853876 870884 852844 890934
13029 890934 971486 1047292 1099592 1120624 1103709 1163033 1226520 1290472 1403455 1416656 1406082
13018 1406082 1425850 1437806 1472929 1609776 1740336 1809175 1903719 2046384 2165757 2351519
13008 2351519 2535100 2652314 2714656 2769662 2925317 3102385 3273188 3556406 3988241 4395681
12998 4395681 4764219 5225346 5811537 6510812 7373162 8454142 9711571 11313167 13312096
12989 13312096 15667560 18419339 21713516 26054107 32154002 41084937 54962528 77741555
12981 77741555 116604649 181683052 273513989 358194288 383628205 337817253 256375330
12974 256375330 177604378 119042019 81280751 58221110 43851771 34129035 27121883
12967 27121883 21938029 17995351 14781156 11981106 9794401 8107430 6848497 5981812
12959 5981812 5241444 4626554 4130750 3746961 3413559 3113986 2909251 2625459 2370469
12950 2370469 2298588 2321306 2296958 2232312 2146952 2065642 1928874 1764887 1614848 1491358
12940 1491358 1412776 1394302 1273493 1222984 1211070 1138977 1029353 941807 908452 800435 768165
12929 768165 718550 674237 666791 673841 628313 658398 676822 684909 629436 595899 567490 462163
12917 462163 424364 415732 361396 366697 461620 494390 534182 540071 518984 555966 565402 524440
12905 524440 520614 531420 463741 397652 404061 437728 416194 435954 488111 522268 543899 617775
12893 617775 643163 623800 598604 594771 568865 529028 499365 464112 506374 670769 861552
12882 861552 896386 849386 782115 778552 832532 894990 890895 869846 790079 684174 560369
12871 560369 400242 325019 310490 318791 375809 484442 484993 493597 533846 467423 391355 447119
12859 447119 486191 473570 501866 548710 600106 634212 618825 618114 572900 486662 479715 525094
12847 525094 523369 480259 437679 386312 369992 366405 403504 441768 506512 562627 559453 573800
12835 573800 565979 522641 515379 512219 549662 539211 513789 517850 547074 626244 697840 701046
12823 701046 851641 965653 1054683 1044576 1008367 959988 895359 894722 897702 916363 953966 933382
12811 933382 898615 901190 928830 999612 1074878 1068451 1057034 1106601 1111857 1161433 1242643 1256028
12799 1256028 1249820 1289715 1316410 1397950 1484626 1598266 1662576 1723349 1728531 1716482 1867419
12788 1867419 2067267 2348313 2666905 3024135 3334797 3499886 3784356 4072569 4442654
12779 4442654 4867189 5330381 5913641 6612526 7484605 8605284 9967604 11578554 13477516
12770 13477516 15370662 17314697 19713340 23122602 28050747 35434912 46586771 64212697
12762 64212697 93101862 141223978 217870710 314280086 379558816 368301268 299323925
12755 299323925 216462023 147510511 99917473 69598439 50669550 38288464 29761705
12748 29761705 23791808 19557163 16587349 14283611 12216830 10332108 8708104 7435671
12740 7435671 6464947 5680102 5060590 4544101 4190222 3900308 3576301 3371123 3100669
12731 3100669 2786455 2560753 2301461 2058619 1910273 1784144 1689639 1558794 1536392 1472187
12721 1472187 1333249 1239631 1164274 1085390 1012510 975330 940463 896422 842153 816497 779615
12710 779615 731981 688220 695618 735056 690452 670853 605746 589160 575033 597419 582584 574580
12698 574580 543980 507230 524060 415299 409766 393844 345176 322283 306494 310364 273953 298710
12686 298710 292189 282406 291753 269148 288460 250507 237138 285192 272145 279553 294154 254319
12674 254319 325940 337521 262352 234603 244839 162686 160962 176611 184154 151690 164235 191955
12662 191955 187950 183103 221986 203390 161581 139098 162478 153402 162731 196475 177315 162194
12650 162194 137674 74733 103942 181753 260780 326162 351873 304823 257693 194635 164951
12639 164951 170490 186977 223132 250582 273931 318898 304973 247057 154318 65480 59113 92149
12627 92149 27730 13646 6240 -5632 71927 54419 22379 -54086 -17891 -42331 -102336 -70920
12615 -70920 3627 -15541 -83704 -92175 -144018 -200637 -133739 -58587 -88875 -138065 -73938 31034
12603 31034 124663 260980 324605 289921 240551 252864 206988 140535 79275 154148 156866 53341
12591 53341 1513 -2836 -18939 -59130 -57876 -8871 17086 28175 -36065 -62153 -87579 -93803
12579 -93803 -57139 -111021 -134252 -226065 -234103 -221219 -270822 -284525 -313473 -377792 -491762 -470099
12567 -470099 -308811 -16863 224052 309966 286755 296560 314616 343047 317708 282555 288657
12556 288657 238592 136874 134953 214348 294270 231280 136683 112972 123804 96640 115129
12545 115129 94878 74413 118260 98555 111203 205728 259235 291025 297396 279839 300348 339303
12533 339303 361748 450073 565653 789684 1127151 1509731 1877211 2053531 1853894 1418189
12523 1418189 1000935 696591 448630 307791 231191 229605 224250 170885 139675 141292 97971
12512 97971 64423 92631 102211 76208 38441 17918 -12266 8251 5574 -9891 33892 57975
12500 57975 20416 -17367 -5987 -1874 3173 3785 51415 114199 121823 127848 87152 67426 97714
12487 97714 63091 69125 49436 57385 53482 54508 65957 46399 88447 135771 145135 84876 58256
12474 58256 135375 127508 83156 122834 178413 180030 120329 74940 25003 -45580 -53242 -21577
12462 -21577 28991 33232 24212 -4105 -68430 -108876 -57007 -2069 -10408 -55145 -55165 -20334 -93263
12449 -93263 -87956 -122362 -229573 -247621 -197231 -115085 -30678 -25181 -63500 -32267 -10395 12084
12437 12084 3122 -1318 6271 27310 82382 62391 80741 111487 61590 45964 54694 73383
12425 73383 81062 93341 112985 53879 75821 1436 -22543 10245 48333 44770 38578 71371
12413 71371 80113 82614 86437 93999 71983 62234 57662 40722 56803 35697 6404 -8959 -41236
12400 -41236 -56525 -10284 72193 75338 59760 6503 4316 34419 66059 124448 96742 110123
12388 110123 139948 79495 29547 5007 -34591 -39655 41198 80351 60825 35716 50831 59048
12376 59048 94787 103362 32147 44343 51951 30673 32938 41223 18192 -23766 -35757 -41225 -39527
12363 -39527 -41168 -66215 -70263 8528 52474 15656 -25077 -25653 41988 95039 89292 81818 37864
12350 37864 22201 10600 -15916 -1222 87598 111124 40811 38122 -9727 -27625 -38988 -19605
12338 -19605 -36799 -38661 2004 -11779 14285 8640 -34740 -60702 -63573 -46315 40449 104171
12326 104171 91337 60159 15142 -20735 -57625 -102568 -90101 -17860 7802 -7912 -23960
12315 -23960 -29397 13849 -9653 -57719 -45019 7242 40098 57271 70989 108602 72132 49841
12303 49841 36533 28281 40822 37067 72648 131786 200339 168335 147445 182309 302777 442513
12291 442513 667235 1052719 1494123 1820198 1829637 1562218 1202869 830495 582055 368071
12281 368071 245590 207026 155567 77996 18915 31647 31198 40617 33345 37849 57098 51112
12269 51112 8627 -1837 -20368 -23541 -45782 -52351 -45325 -52978 -101346 -121886 -85972 -47697
12257 -47697 -39502 -66687 -26885 7109 -10887 -71306 -64216 -37510 -28527 -2335 -3150 -26751 -36083
12244 -36083 -31676 -35945 -15454 -19567 -6543 -68955 -40352 5791 -13194 -20308 28626 46122
12232 46122 17105 12978 31494 70356 51773 93055 91827 67193 59007 122337 86844 19332
12220 19332 -31594 -52379 -22064 23041 78404 90107 101578 94035 43381 -3865 8894 41751
12208 41751 77394 100810 87056 38945 -21033 -77104 -22752 33652 24416 21569 7630 44863
12196 44863 47314 43366 39827 35974 -45215 -57364 -44309 -58670 -68054 -75378 -68998 -53204 -26821
12183 -26821 6237 10572 36609 28783 17521 4839 -18782 12020 28738 17272 -17441 -59488
12171 -59488 -8431 -6766 22823 29474 -21520 -53420 -44567 -100042 -113620 -58166 18352 90213
12159 90213 93601 41983 29305 -23560 -2511 -49382 -101912 -140495 -139502 -131667 -96575 -89239 -73010
12146 -73010 -32515 -52949 -63056 -14665 -34704 -46591 -76067 -95378 -95451 -80142 10660 33657
12134 33657 2082 10336 -43929 -61111 -23758 17406 19377 -12300 -14243 2390 82525 6742
12122 6742 -30816 -7362 -62537 -80806 -52919 -11312 34961 -2992 -16249 11998 -4345 -73035
12110 -73035 -65303 -34910 -33831 -79492 -103506 -114751 -129171 -66265 -31365 -3731 25058 9497
12098 9497 -61710 -33272 -17546 -31703 20209 27988 -12917 -17297 -69039 -127859 -160824 -167289
12086 -167289 -110298 -88703 -23737 20796 7933 30115 25764 -32256 -86764 -62314 -57285 -21060
12074 -21060 26157 60861 3025 -53310 -35736 -12440 68837 95051 77361 72561 123533 127104
12062 127104 108945 96002 44515 -3331 5905 -7386 27599 -30565 -49176 -64214 -93689 -55695
12050 -55695 -15443 -58903 -17453 68227 31752 47052 51433 10473 32507 59588 68741 39297
12038 39297 30045 65456 75425 24856 621 1438 -20812 -14562 23386 44219 -3336 24930 24256
12025 24256 -12220 -10737 -24450 355 -9200 -26446 -70530 -53910 -26186 5704 -19570 -23010
12013 -23010 -33177 -40823 -35127 7292 49107 27678 70920 80549 60353 54010 64046 52026
12001 52026 28191 55657 64432 79685 57647 -10121 -49121 -97580 -142463 -168112 -107526 -57499
11989 -57499 -49688 -39482 5563 -41264 -61543 -45107 -40258 -12538 -5413 -14269 -28332 -16080
11977 -16080 11586 56499 18395 20159 23244 5428 -13380 -39987 -18585 26672 70828 89231
11965 89231 84435 24497 3674 13642 20729 -25845 -80151 -75240 -56073 -92666 -70001 -68513 -91702
11952 -91702 -101861 -97247 -92059 -89991 -50808 -16328 -39556 -61539 -109068 -84710 -122802 -79185
11940 -79185 -69835 -37209 -1409 4336 17075 8218 -25652 -54516 13123 17478 -26148 -22385 -30049
11927 -30049 -47210 -50862 -24746 -16463 7986 14360 -22200 -3994 -20515 38344 101756 91131
11915 91131 147189 156224 106398 69815 -28011 -70965 -33718 -39452 -66625 -77619 -43884 -5945
11903 -5945 14145 31895 73581 54591 54283 78753 33870 5373 11955 58029 57546 -16648 -46524
11890 -46524 -8304 21729 -17229 -2835 28291 22032 -35893 -78920 -26502 -574 15032 7070
11878 7070 -23239 -35313 -47355 -47656 -50983 -17026 -40339 -102637 -80888 -72759 -112105 -69406 -44036
11865 -44036 -101937 -113506 -61286 -18945 -8853 -54119 -69453 -17967 -9158 -34865 -59401 -43376
11853 -43376 -11021 -52053 -78881 -46929 -72142 -123460 -121457 -144172 -147120 -118405 -112901 -123368
11841 -123368 -92145 -75622 -68736 -37428 -13308 19078 12993 20310 48400 14035 -36531 -75733
11829 -75733 -104070 -106721 -91136 -47878 -14108 -12318 -18159 -38244 -47267 -11665 -44717 -98987
11817 -98987 -61406 -48359 -96165 -119245 -83087 -29871 4511 -14268 -90725 -90545 -46841 -57888
11805 -57888 -110077 -51991 -71812 -55245 -50168 -60781 -57325 -76748 -17836 -64318 -187845 -177150
11793 -177150 -117696 -98570 -53830 -10262 32683 7267 77897 15866 3006 -49285 -39672 -7439
11781 -7439 14964 27139 15039 31337 46533 -16677 -45131 -19821 -8743 -20320 -46817 -3655
11769 -3655 -33222 -67990 -85220 -82383 -66827 -95797 -50480 -89839 -92755 -82098 -76042 -72328 -72051
11756 -72051 -65710 -64129 -51276 -3258 829 -28790 -46159 -36468 -86581 -83893 -58569 20123 63415
11743 63415 45908 61465 47647 40544 25396 25319 37850 27771 -31623 -67899 -109763 -84852
11731 -84852 -73135 3209 57977 -6602 -36636 -48550 -68850 -62766 -82764 -63369 -33353 -37937
11719 -37937 9803 -15286 -23341 6447 -3660 -14256 -4721 -25160 -22122 -73301 -125517 -55721
11707 -55721 17343 46661 -17001 16310 -9745 -279 -27578 -29850 -36471 -24530 32763 105253
11695 105253 79090 43732 16006 26879 17089 22709 21719 -32310 -4898 -31731 -45858 -20535
11683 -20535 45132 113061 92724 43975 30985 -3540 7305 22652 47865 52622 22761 10183
11671 10183 33395 23167 28338 23828 20901 2427 -27342 -90122 -109285 -95107 -56825 -61879
11659 -61879 -38785 3166 -10112 -33229 -14480 32376 29352 52358 5795 -38046 15049 37821
11647 37821 31003 39952 28853 9368 -23598 -64929 -72698 -103916 -70883 -3057 4568 33790
11635 33790 60870 19985 5927 29494 39009 33750 46149 35045 -13375 -8518 3025 -42371
11623 -42371 -57001 -81198 -27811 44553 70489 68589 26903 13473 57579 128517 108439 55237
11611 55237 -25061 -83457 -85492 -62105 -60224 -45746 -63025 -26647 37578 32307 -31864 -58959
11599 -58959 -93459 -146049 -109432 -84692 -106636 -94222 -109046 -44974 -27250 -16578 -61440 -56515
11587 -56515 -12424 -61316 -44527 898 9338 -9244 -100175 -139702 -184165 -134096 -127100 -139883
11575 -139883 -69419 24896 50311 55206 -107 -1798 -34944 -48331 -5124 33632 47208 90406
11563 90406 85932 -15047 -53691 -68781 -103160 -70192 -48459 -35078 -69721 -69598 -37772 -53196
11551 -53196 -63304 -71374 -3515 41258 13755 -2375 67737 54567 47513 66027 58348 42558
11539 42558 78004 82092 82916 99309 85713 36042 20130 29000 48907 51056 -3962 -44515 -37281
11526 -37281 -32829 -9528 23185 24786 44394 59761 37517 -26144 20934 19307 33012 26661
11514 26661 -19630 26763 66957 57373 87110 89609 59261 30259 14847 10269 11057 -5625 76
11501 76 -16514 -24871 2530 57252 37579 -32346 -46662 -27193 -26132 -29771 -44725 -78018 -42839
11488 -42839 -77203 -82877 -72966 -88500 -21244 -47453 -60914 -70824 2068 -10800 13226 -8591
11476 -8591 7354 4926 -26302 -31772 -6117 64564 114933 102865 105632 123898 82203 27286
11464 27286 27262 29815 44864 3782 -5853 17970 30824 -25381 -76817 -28759 -5723 -59466 -20386
11451 -20386 -30586 -27171 -73315 -65218 -14140 4539 -15875 -5826 -422 -21353 19428 27690
11439 27690 6859 15408 10724 -24403 34286 -6986 -40776 -15147 49070 50596 8785 17692
11427 17692 105464 102047 78333 72755 6544 -13390 -6066 -3240 -38388 -48899 -45885 -60775 -50848
11414 -50848 -40933 23551 44537 -2594 -30260 -51478 -31920 -80858 -84220 -75327 -63667 -31933
11402 -31933 -26053 -20695 -66800 -104991 -82908 -57788 -56220 -22359 1635 -4514 -36777 -56708
11390 -56708 -66684 -104689 -111543 -76103 -89146 -34605 54172 20218 8473 5595 -42367 -3249
11378 -3249 38848 66092 61082 -11964 -17059 20316 19824 26310 40019 13914 -18954 -17963 -17337 28560
11364 28560 118900 74711 2394 34478 72493 106273 97411 104682 51548 58963 8062 -34556
11352 -34556 -43018 -61958 -10237 50535 1609 -38594 -23841 -32033 -9015 52292 11234 -39294
11340 -39294 -76611 -67970 -53983 -7424 20296 37104 57422 65284 39700 -9082 -43003 -22575
11328 -22575 -53457 -72636 -31868 -30877 -62776 -68478 -62790 -67392 -56372 -30355 -77156 -55917 41294
11315 41294 106518 129229 122670 139503 100199 -4014 -3364 -24708 -26911 -9994 -12331 -8032 24940
11302 24940 11407 13474 22205 65760 90901 101988 116144 156066 117941 87582 180077 184073
11290 184073 161251 124398 29627 20933 52264 24982 33056 -54599 -97337 -88054 -43930 -19980
11278 -19980 -77786 -88078 -81326 -84095 -109850 -137863 -112912 -118350 -99089 -122995 -87779 -57315
11266 -57315 -72346 -42832 -17721 -55953 -35647 -34476 -11146 -1000 -16276 -45718 -87015 -46343
11254 -46343 -17417 -31679 -36345 -11694 -42191 14945 16271 38113 57577 10197 28046 12369
11242 12369 28429 52960 35070 17131 -34276 -55808 -29164 -21807 -53670 -58583 -26969 10273
11230 10273 7872 -23275 -19962 66558 58720 -9093 -38589 -31182 7093 62741 69323 48491 18358
11217 18358 -43594 -38434 -2167 1632 11336 35651 61584 58069 28019 59056 38123 44829 28581
11204 28581 -25588 -39247 -52275 -74707 -90911 -60900 -20867 2963 -11480 -41729 -51767 -7955
11192 -7955 -14989 25142 77317 38706 28739 37988 -17089 -60141 -45945 -16382 4879 49314
11180 49314 76738 74144 -9634 -48174 -2038 11575 35788 54244 34315 71505 64372 61130
11168 61130 80528 57230 -26760 -59899 -19439 27699 38390 17727 -1785 1631 -56008 -33836
11156 -33836 -31789 -34096 -4836 -17770 -20050 -192 -46544 -91068 -82866 -59848 -33858 -15624
11144 -15624 5385 24859 32869 -41610 -92907 -89230 -114084 -81415 -5395 -23444 28455 67811
11132 67811 53050 -14063 1715 22323 34534 32874 52066 70977 53767 5649 -39799 -10228
11120 -10228 12412 4164 -2583 -24301 -2702 -16401 -35862 -35690 -83176 -86808 -54533 -97336 -90370
11107 -90370 -54191 -26067 -4746 49689 57840 2222 -64962 -11326 37388 -6413 7789 72928
11095 72928 71395 74087 90605 97792 69293 19402 22683 2275 49931 35582 -4643 14897
11083 14897 -24739 -24070 -2095 13532 11468 38636 21846 -37972 -9155 -70432 -43862 8465
11071 8465 -4103 -25091 -31627 -14589 3808 -4058 8122 377 44364 56220 15808 -62815
11059 -62815 -54958 -110518 -62740 -70655 -74529 9932 4350 7045 -28149 -8621 -20017 -35440 4492
11046 4492 -19493 -47177 -41644 -60994 -49935 -63354 -35342 -59960 -46714 -43063 -56426 -57967
11034 -57967 -43885 -60441 -50840 25884 59715 98521 85887 16978 -72843 -74480 -46691 -38361
11022 -38361 -8868 25351 21957 -25639 -82986 -62320 -7303 44361 30901 27061 50003 4872
11010 4872 10477 -32267 -28198 6674 41689 35986 41573 40027 51997 27162 48589 74887 88449
10997 88449 79339 100315 56209 17783 -13405 21903 38813 -34217 -89386 -50116 6867 49671
10985 49671 49618 59654 69990 61484 34161 -12380 -46857 -13862 -244 -14133 32401 94083
10973 94083 60765 71248 75159 137914 137021 131482 132574 182315 201079 109038 131808 167615 188148
10960 188148 221315 232484 213508 217608 240267 301879 386487 471512 466333 552609 657525 747851
10948 747851 833097 897770 956255 1118360 1283368 1381675 1432118 1411414 1349817 1292147 1171500
10937 1171500 1113615 1097877 999275 774524 629148 499308 454251 437382 400842 353073 230787
10926 230787 181818 152663 192965 222265 224349 165281 127754 187179 178843 161182 64339 42355
10914 42355 57290 1812 -42114 -10568 -43550 -94887 -74006 -39264 -66885 -55624 -62185 -34943
10902 -34943 1418 19178 -34163 -6554 16143 21505 80718 67396 64519 94064 91713 85275
10890 85275 33986 -29867 -39104 -40067 -33854 -7320 -44458 -64422 -45704 -22159 10712 -16575
10878 -16575 -42574 -22285 -48754 -48693 -19639 28857 40073 -17834 -44537 -35885 -15672 -18731 24020
10865 24020 7438 9075 17967 26694 35494 51737 51896 67647 80986 79543 59419 -29248 -3472
10852 -3472 57672 58395 18591 -95227 -168552 -161077 -58792 -17190 4519 -12627 -46885 -31482
10840 -31482 -54015 -84134 -56954 -59735 -98618 -117378 -81287 -66434 -45764 -23846 -25525 -8636
10828 -8636 -15966 13889 18769 23059 14492 -1042 16749 6182 -38887 -60483 -33751 -7291 61957
10815 61957 78038 29993 2381 -3791 -766 -11992 15193 20640 27223 -1232 -34222 -57585
10803 -57585 -71549 -41868 -26272 -7074 39693 54791 60381 9308 -36968 -56337 -55145 -55515
10791 -55515 -70689 -74613 -17352 46215 103605 53344 5180 -37 16268 43174 45069 24309
10779 24309 22357 21397 -23209 -3505 -19072 -6983 -10254 -45156 -26662 -7996 6839 4248 13734
10766 13734 19436 38051 10013 23649 1179 1397 -5094 -46700 -31170 10206 -14338 5459
10754 5459 5286 -18643 -61240 -100731 -110154 -67620 -40239 -28680 -23329 11027 10251 3188 51319
10741 51319 55116 7107 -66597 -36328 -52355 -35001 -35648 -3615 32745 75720 50512 14964
10729 14964 26989 1873 -4549 -33375 6996 106375 61285 2098 -25847 -57695 -96923 -80259
10717 -80259 -62002 -24503 -28981 -60573 -100305 -107288 -85122 -69930 -47324 -35967 -14186 -59571
10705 -59571 -89116 -101711 -78575 -88001 -93094 -61960 -1232 6846 3805 28869 65264 44576
10693 44576 24078 37765 90729 82935 59617 16105 -114 -12014 30420 34849 26888 8519
10681 8519 24980 27627 27550 -7669 23476 17219 -1430 20702 10106 -38429 -35796 2760 34114
10668 34114 19685 28091 -3301 -33967 -47522 -38161 -56652 -119142 -129784 -71164 -21348 31515
10656 31515 9113 -55413 -60892 -51839 -65708 -51856 -49897 -36282 -1057 2546 711 12715 20082
10643 20082 21850 -12210 -62556 -97115 -136614 -155969 -93835 -14990 50674 38860 11261 -17335
10631 -17335 -44977 -21493 -17634 -50704 -36007 25261 25295 -55093 -87581 -126606 -150768 -109478
10619 -109478 -55336 -28463 -120161 -106978 -91337 -28535 -9524 -50082 -66847 -49678 -43719 -28821
10607 -28821 4919 19009 -23692 4545 33546 32805 11539 -27495 -52109 -27750 -17319 -20346
10595 -20346 -56981 -40829 44855 56933 75 -40123 -59515 -104415 -91249 -11507 -4530 15676
10583 15676 30932 18761 37160 20011 -112 -19710 -45672 -21166 -50650 -36785 -50915 -28039
10571 -28039 -8226 -7247 58662 40970 72618 112149 68780 55843 68393 -25093 -61441 -57887
10559 -57887 -53804 -99034 -59555 -42394 612 56579 8832 11509 -6909 -29354 -45385 -49528
10547 -49528 -67378 -37884 18638 72810 36682 4438 20484 31501 8791 -32963 -93038 -92791
10535 -92791 -100712 -64737 13487 59717 45683 82027 83935 96956 71772 70902 64351 75701 49269
10522 49269 55863 -400 -83118 -71242 -67405 -64657 -32872 -44261 -45670 -5917 57572 34130
10510 34130 -17978 -14558 32422 49306 18778 2273 -17172 -47810 -41004 -15704 -37126 -42076
10498 -42076 -48547 -34762 -31277 4704 30872 47478 -18674 -26724 32809 61590 68398 103947
10486 103947 89891 44318 78935 97068 28248 -1441 -51809 -43603 -12174 12537 23245 6816
10474 6816 27506 58496 40534 -4864 -41718 -55364 -23891 28944 79731 77650 33265 -81
10462 -81 6813 10299 -51277 -108986 -72892 -18541 -36412 -67180 -14137 -3768 5619 -14159 -24933
10449 -24933 -40439 -71783 -86125 -101712 -91023 -84979 -58438 8579 36842 81196 41812 25976
10437 25976 16628 13378 8053 -3804 -45906 -19121 11102 38977 51042 10714 -27579 -25477
10425 -25477 -46993 -10400 90894 45786 -11809 9263 -14278 5466 98338 126094 126526 84955
10413 84955 696 -22517 -8718 -16703 2586 7437 16311 -25061 -66431 -57157 -49940 -53579 -32859
10400 -32859 14196 -22684 -39844 -49406 -69973 -90829 -93562 -83932 -60161 -50430 -99492 -47847
10388 -47847 -18193 -11727 -12634 41360 90016 88465 37 -65367 -101996 -118707 -89455 -93590 -100686
10375 -100686 -88629 -2219 16311 -13815 -32577 -64491 -45383 -12485 23511 -7802 -14317 -23679
10363 -23679 -56026 -18831 -8058 -7930 -12663 -11706 -42357 -60337 -46361 -18811 33180 3639 -92840
10350 -92840 -86738 -84783 -64063 -2441 29524 -17992 -38274 18634 -15488 -378 13626 45349
10338 45349 77905 44978 39838 23066 35626 -15657 -43487 -75845 -72073 -44773 -30969 -104778
10326 -104778 -33471 62868 59482 5337 6470 24852 67258 59705 -12120 6180 1393 1307 22113
10313 22113 3721 -29469 -47845 -13448 43807 67736 58177 4662 -7024 -17496 -36705 37856
10301 37856 14870 -24392 -30576 -28875 -49852 -22848 17129 45036 21775 20795 32450 96570
10289 96570 68860 24357 17139 46761 62042 12577 -12734 22157 83780 120102 60755 3307
10277 3307 -36844 -26437 -63291 -112077 -77883 -33246 19673 84833 108055 75449 47178 40969
10265 40969 -24495 8575 21509 -5205 1249 -25125 -67234 -30814 41120 59988 -51590 -85593
10253 -85593 -81208 -53029 -56430 -96632 -64628 -43429 8923 4976 -23420 -37312 -45736 -15869
10241 -15869 -1618 -39502 -44776 -39726 -24016 -20740 -11776 -28594 -37616 -6420 31460 -22196 -31495
10228 -31495 -9023 -38230 5561 27324 33017 28975 21950 -20324 -118820 -176574 -160818 -82361
10216 -82361 -14568 -44981 -57860 19744 96435 51429 -52961 -99483 -75483 -70026 -82171 -54286
10204 -54286 -73068 -46154 14596 37846 93353 83911 26575 -34425 -54088 -73452 -94952 -77675
10192 -77675 -55990 -55209 -33605 3573 17960 35613 49080 50003 77402 45384 6607 -4687
10180 -4687 -13688 -41491 -33235 -52201 -52377 -68381 -14214 -10111 34877 34807 49090 23208 -22187
10167 -22187 -46980 -60993 -57286 -23250 -30190 -15642 7565 -24589 -62838 4529 8219 -66059
10155 -66059 -70202 -73882 -33351 14729 33178 64341 81654 31319 -7230 20815 26807 3577
10143 3577 -38643 -38222 -9944 -65751 -44260 -35872 -51527 -75926 -37393 -14222 2151 -4808 -24198
10130 -24198 -7294 -42866 -116029 -158565 -103734 -140952 -184939 -143548 -69729 -21110 -8676 17732
10118 17732 11725 18864 10648 11980 32006 -6846 1715 31146 -40122 -58010 -84290 -55258 -28530
10105 -28530 -44303 -94466 -89057 -69384 -81215 -92275 -6625 -1136 -26472 41667 49660 14178
10093 14178 9894 22009 43358 56239 87157 72393 54852 941 219 15355 -6458 -46003
10081 -46003 -53035 -8256 22404 -18955 16363 7382 -33201 -40482 -41318 -27063 -46356 -6949 1733
10068 1733 -41062 -70111 -102525 -38266 65490 69360 96692 71333 -12810 -9995 20280 60264
10056 60264 23605 50139 51877 53133 17177 -24503 -41674 -59822 -67575 -13953 -19827 4060
10044 4060 -5338 -29373 -52261 -26122 23056 33213 -27226 -92335 -92931 -13288 -6415 -27907 -42417
10031 -42417 -13783 -18576 -72948 -84937 -40182 -34660 -66038 -107873 -97402 -93956 -56643 -67148
10019 -67148 -45184 -11011 -15737 -9107 -35832 -53247 -16677 -17769 -69690 428 77251 84265
10007 84265 44342 45098 71191 60878 -9878 -67584 -101399 -38254 -25750 -71456 -36680 -53166
9995 -53166 -49987 -25427 -35599 -18176 6035 -5135 -1951 27425 28339 25923 47382 111458 116140
9982 116140 18001 -71049 -99773 -129062 -92185 -37929 8563 26621 56311 48190 26474 64753
9970 64753 60361 51642 41410 47460 27535 -18588 -6415 -6480 4437 42548 37529 -9523 -36842
9957 -36842 -44711 -23911 -36798 -43166 32588 -18297 -66125 -38919 -38860 8183 44988 73114 144345
9944 144345 121750 27655 -5754 10240 37009 52412 25755 14692 21331 113672 158749 140529
9932 140529 117157 108917 57816 64039 94612 74925 64382 48827 37251 26618 30049 -21195
9920 -21195 16944 33008 40081 6477 -45964 -116959 -99510 -19217 -24427 -21729 17582 43146
9908 43146 40448 10307 27731 47227 60178 44602 65471 50689 77176 51732 -15140 3979
9896 3979 6072 65685 118222 143978 83161 26721 46612 101912 149257 88548 3760 -69794
9884 -69794 1628 58880 3667 4298 33630 -483 -29104 -1377 15366 -13013 -55681 -26855
9872 -26855 -16261 -4796 -9796 13085 27038 -5634 -23422 -11535 -45894 -39010 7538 -6906
9860 -6906 -736 16089 59893 98656 92087 35483 -217 37922 32025 31122 38365 33928 7229
9847 7229 44485 52277 10792 -346 -45853 -107134 -101919 -107110 -97946 -53056 -15767 32850 62284
9834 62284 38351 12920 -2148 -28436 -57288 -49543 -97377 -143516 -101728 -44994 -22926 -42016
9822 -42016 -67912 -72616 -56243 34667 57460 13228 34157 8746 -83662 -65087 -52946 -93921
9810 -93921 -74531 -20392 3581 -2799 -2804 -34418 39941 14293 -28851 -52131 -112649 -59675 -82790
9797 -82790 -89887 -137049 -93396 -43179 33412 54009 34071 -23200 -42856 16876 76839 106972
9785 106972 70093 25118 29821 49721 48413 46433 48706 65559 71118 80865 112360 102692 73620
9772 73620 49497 -23345 -17853 36960 75043 82940 80173 71901 34532 21155 7539 9350 -9329
9759 -9329 36230 84647 123745 91830 72283 82844 108832 12096 -16683 -5970 17630 42049
9747 42049 86245 97835 47356 35716 81305 122944 125128 67245 66234 85228 116765 94235
9735 94235 111828 119056 62892 4375 -48428 -67830 -33653 -38622 -26322 -19337 -47367 -31337
9723 -31337 -30255 20339 -7609 -33911 -75715 -132133 -135714 -161826 -155339 -103899 -58924 -30066
9711 -30066 -16275 -6103 -19745 -47145 -13355 -47237 -57512 -43079 -25431 -31422 -76598 -53333
9699 -53333 -11176 19770 25337 -21985 -8672 30888 2530 -20883 -2119 39357 12963 -20110
9687 -20110 17876 74756 43193 -9534 -71604 -72160 -15827 22638 55275 19972 -37869 -23853
9675 -23853 26427 40297 137 16323 47840 53086 61606 39978 -29159 -31016 -26877 6340 36773
9662 36773 3568 30515 56758 48542 52385 66392 126658 145895 104987 98321 61253 -850
9650 -850 45694 70889 64929 31112 -10897 -4601 6793 -25626 -24896 -69705 -78887 -19244 17452
9637 17452 -31696 -50441 -108380 -105988 -51327 3497 -15612 -39572 -42927 -42586 -20581 283 45917
9624 45917 78135 9716 -43565 12574 7381 -44670 -70391 -14045 54968 17376 -84188 -81069
9612 -81069 -30259 -4401 -1100 11447 43348 71163 23871 -23549 7927 39354 69434 36149
9600 36149 -599 -54780 -24647 -25995 -35131 10193 13542 -38604 -52457 -22158 -19777 -4728 51319
9587 51319 101899 65523 66220 54092 8358 -31627 -45853 3934 51953 -385 -5667 53598
9575 53598 27910 -5216 8631 26608 74580 80683 23222 34434 49981 74575 36602 2723
9563 2723 10765 4570 -29844 4532 28624 34731 66455 59531 105253 116674 125070 121320 88226
9550 88226 76678 29642 8898 29168 14325 64096 57428 63074 88225 110805 40194 -46869
9538 -46869 -94029 -66993 -42709 -45594 -9813 -49913 -75270 -7124 -49284 -81626 -8467 -12435
9526 -12435 11997 112242 135371 101395 103657 157430 183036 208433 174754 67956 22908 -4525
9514 -4525 -1699 24195 30895 -5243 -1270 -19648 -52807 -38106 234 -55302 -48226 -4872 31068
9501 31068 35871 2688 3951 -22378 -77960 -98302 -113079 -69336 4556 -38225 -28792 -20505 40398
9488 40398 67315 8834 -4635 16768 -23218 -4695 33211 21249 -3001 6701 79623 75046
9476 75046 43094 20194 -56652 -28443 -13852 21963 48935 39998 11379 -10106 -64849 -69230
9464 -69230 -92873 -23634 -26880 -47333 -24464 30201 22580 36290 19872 -20881 -47041 -61225
9452 -61225 -373 -17449 -8835 7700 -7188 -8107 -11318 7147 -19232 -25580 28178 -3325 -81148
9439 -81148 -81351 23839 57605 77788 58474 53293 45719 -5407 -335 -1289 -6587 -15533 -6062 21275
9425 21275 24266 26627 58072 36928 24684 10963 -13642 -25262 -5592 13282 14642 46457
9413 46457 42848 -6144 -26120 -3624 -2529 13933 51215 109044 108901 115687 36978 -12694 -4535
9400 -4535 18895 12824 -78741 -101192 -72425 26360 54535 44002 78802 128672 136729 131959 72313
9387 72313 33283 97428 79604 74229 75403 106100 92702 38609 -18465 13805 15304 -136
9375 -136 65437 94259 55785 -25290 -19484 18944 12627 71695 50459 48020 116721 82344 -207
9362 -207 -47998 -31660 24667 95418 34243 2602 78536 79031 89356 91581 66442 77001 89945
9349 89945 108679 66907 -34886 -26355 34427 -24720 -59561 5981 89321 135517 113292 76063
9337 76063 91334 130843 133875 109390 79122 89487 122344 150158 142354 92366 90265 87002 113290
9324 113290 164394 132245 99158 94431 54289 21232 1767 35267 98543 80140 107067 107311
9312 107311 57399 45145 45167 23702 32941 43283 -34384 -33177 103494 156097 128913 117176
9300 117176 81702 102130 85135 138734 177822 172339 155294 154232 173043 165081 135870 154743
9288 154743 193638 236113 208735 169741 149473 129703 184012 230220 196662 157504 154749 125851
9276 125851 76813 90384 105760 134336 207303 214343 168878 171958 130414 127643 101661 120154
9264 120154 155377 180561 153333 198251 246594 246558 209402 184589 168950 145980 106980 120072
9252 120072 167787 145484 111799 161786 201898 206009 197642 176158 188883 192937 192652 195662 211332
9239 211332 235853 208007 206890 242310 350903 394540 399251 345696 266894 237634 235801 228562
9227 228562 236599 260199 315641 294645 276202 296284 253911 219739 289032 336383 315420 304758
9215 304758 325769 367740 366589 289639 305031 339466 364473 383992 428450 420256 380069 409792
9203 409792 377690 410879 437744 436637 442881 405495 373794 456165 498509 445834 424385 442471
9191 442471 447510 472586 465054 484538 524665 547823 542431 492258 531188 592128 596236 606676
9179 606676 651689 737082 730260 731880 780157 820543 831588 849883 797436 773967 744122 731252
9167 731252 790939 862063 912537 942745 947891 991472 1016878 1093035 1130480 1214852 1250659 1270179
9155 1270179 1315970 1318277 1319400 1283164 1231474 1294738 1373041 1473180 1559533 1597692 1659733 1786280
9143 1786280 1869564 1939012 2075930 2143539 2259811 2406000 2527468 2610226 2768092 2941543
9133 2941543 3157056 3362382 3491316 3687548 3911698 4147111 4406057 4650901 4975885 5336391
9123 5336391 5690494 6052485 6418085 6813713 7296776 7850257 8440532 9131993 9865574 10587419
9113 10587419 11303575 12059102 12813276 13596903 14365378 15048369 15663620 16173834 16526361
9104 16526361 16696508 16773933 16692362 16492506 16129720 15620168 15036929 14349868 13558935 12793077
9094 12793077 12021151 11245891 10529007 9818140 9155798 8501254 7928225 7385856 6851112
9085 6851112 6353611 5989844 5590604 5199611 4853832 4537626 4234722 3939196 3755397 3582019
9075 3582019 3430825 3215142 3028495 2887888 2725828 2581413 2490768 2429328 2289348 2187122
9065 2187122 2070742 1939185 1832000 1774078 1707626 1650313 1636196 1619149 1552932 1462908 1395843
9054 1395843 1331261 1229618 1171639 1089531 1090332 1073986 980620 960096 958805 938261 901648 870734
9042 870734 806600 748883 703236 717383 660836 640129 649220 644733 610084 655230 653160 621914
9030 621914 614419 599353 610814 646803 647517 549649 526491 513341 473249 453087 446649 456116 477284
9017 477284 477740 484824 463346 455863 421687 463689 422121 365741 396586 393601 371749 448326 470043
9004 470043 440517 343588 318418 325522 333155 317971 344283 333333 353500 325772 299994 293803
8992 293803 314007 310675 300898 264851 204711 192681 164951 196629 245300 269006 292220 260264
8980 260264 168238 185833 250853 303735 335167 293164 236636 184952 150476 104706 124102 160761
8968 160761 211463 247671 227651 209092 164961 165126 228718 244855 225245 266422 257947 243493
8956 243493 241169 243334 254300 199841 165892 174068 198901 209195 204566 172856 205772 235975
8944 235975 206753 182670 147686 139925 129461 114102 140846 202993 210063 207872 211914 145559
8932 145559 130593 154674 184049 162659 164979 185640 149022 141527 152464 180081 191237 183557
8920 183557 114721 93029 93738 42652 29018 64427 56990 -10341 -31569 -26047 55718 166097
8908 166097 145311 123027 146767 168275 156754 182996 208399 149388 93780 68764 73145 108327
8896 108327 81065 78613 107059 123773 105996 59697 5922 43838 110460 159944 163595 171337
8884 171337 100247 67489 7910 9815 10309 37995 85094 111880 177342 232200 208641 177730
8872 177730 151563 143737 96256 81071 55488 49011 117711 98361 67966 53771 15639 26308
8860 26308 94592 91776 64248 46898 58319 67823 72881 80615 85639 62167 51317 26705 27282
8847 27282 51352 97234 101839 87001 64466 70571 22759 1697 44773 89317 57826 65290
8835 65290 62750 70385 83910 101598 29630 -1748 19071 67723 49683 23441 26785 78413
8823 78413 127097 166739 108416 30226 26380 20327 19058 41453 36296 34276 74078 102732 137642
8810 137642 94809 77778 59977 94487 108580 66391 65316 47925 54504 26586 26624 63089 94837
8797 94837 96153 109164 151501 139485 113096 64377 65173 33977 -21826 -8258 68500 150670
8785 150670 100509 80069 55811 17160 24640 10954 40590 56384 52888 15832 -7390 -22872
8773 -22872 -24698 -5347 33577 103244 113807 116008 62445 32433 53585 62228 8678 -2991
8761 -2991 22992 45296 38333 109158 120822 159125 155484 140979 116688 142645 190146 181658 166917
8748 166917 66323 41347 14399 37210 69095 71542 67236 58922 91324 107685 118699 143592
8736 143592 132799 61924 57360 72488 95496 84849 65536 25194 40845 44995 53422 30880
8724 30880 38308 41252 71365 100220 126018 197770 184998 156935 130721 134982 120091 111246 109583
8711 109583 123265 57036 21864 108883 143707 120591 107013 80371 116294 160725 221042 211986
8699 211986 201284 168217 119043 85221 94356 120808 110524 117125 101548 87521 67120 98894
8687 98894 155824 146055 144839 136212 164925 57899 13627 32320 76046 83447 57186 97499
8675 97499 143559 156931 125456 109244 151739 209235 187320 158725 188081 154074 119975 126967
8663 126967 123479 117752 122779 122850 157696 111093 96563 82267 64216 107623 110968 107915 166338
8650 166338 208126 181496 255325 275771 231394 228265 250302 255367 228619 204153 179888 270612
8638 270612 322003 308245 277874 209371 203372 261223 295078 247253 236166 204262 202139 199390
8626 199390 204887 221515 258563 334443 337779 287075 253463 256155 240144 244208 286764 330251
8614 330251 291144 383059 410250 428376 459604 517922 557832 532126 573262 603832 673365 732583
8602 732583 724555 780660 852901 956287 1025464 1118355 1248304 1323138 1333398 1444300 1556170
8591 1556170 1551542 1423353 1291428 1170630 1077875 976001 850198 757203 687040 618541 570248
8580 570248 518478 419771 346591 324981 303347 302772 327411 367496 335338 302834 274002 266277
8568 266277 291536 217570 214383 259343 300291 290481 260837 199250 244588 246906 173297 122823
8556 122823 94881 88750 153605 207642 206145 191357 208940 218109 216029 224907 186058 202918 188895
8543 188895 200402 198729 148166 104265 84895 82910 54536 37389 52496 61008 100855 151095
8531 151095 186915 160960 137548 104947 162183 206030 220538 218492 138781 46676 65612 102578
8519 102578 157019 167153 113416 120362 115968 144762 167207 182628 170503 131933 95216 111008
8507 111008 153250 164760 155553 105177 85984 130308 157598 180343 186419 146258 148204 116989
8495 116989 80611 43851 49323 108309 107567 107818 127569 115197 84480 40810 48096 38292 20752
8482 20752 19552 31185 100970 154571 169652 100686 -9725 -15183 6316 -56880 -60070 82932
8470 82932 144384 105214 96710 100561 61807 6262 6397 6450 29482 17138 13447 20005 75289 131478
8456 131478 82651 53156 31589 14688 26210 80547 110047 99214 46584 33097 45140 22322
8444 22322 18442 70611 88864 43580 31395 62626 25046 8934 64321 100411 80785 42431
8432 42431 27597 56926 87382 78828 125408 104083 67715 102939 153795 146247 53459 10674
8420 10674 -18872 -5460 -670 15498 28889 27173 6954 19106 64741 80299 92872 71523
8408 71523 76888 116231 147070 139861 117168 60718 1440 -7435 54502 57460 2890 -4457 19657
8395 19657 14316 24112 -20269 -21744 -17917 56562 103477 82118 38873 46631 47629 89194 25219
8382 25219 6921 -17172 -48703 -40921 28322 77089 96342 130478 114129 112244 92368 35367
8370 35367 -37042 44880 94675 16717 14284 30366 32075 8985 86 -11349 32112 17148
8358 17148 -17480 -23479 -2015 17745 36684 15965 19544 39001 71306 65291 41723 43417 77405
8345 77405 106114 108085 95959 65128 3494 15900 43432 39274 11330 -23896 33039 62463
8333 62463 32729 -54628 -52271 -32122 -6087 57905 35324 -45427 -40232 -17733 27642 2493
8321 2493 54927 92311 104033 136081 106951 72527 84776 127520 192618 208760 154611 126384
8309 126384 141641 162428 117994 34029 36604 97748 79585 30412 30367 70904 133794 109612
8297 109612 32781 23852 84324 75033 88575 90061 101122 116245 108453 45530 32885 60376
8285 60376 91680 75642 104863 93856 58968 -5002 -713 33369 47521 35401 18768 -20489
8273 -20489 -48826 -28144 21268 53639 41324 43317 78998 129107 81553 74197 51079 48710
8261 48710 72304 135878 146707 123090 89455 50927 34478 46434 -4450 -49040 -5186 -14164
8249 -14164 -11937 9339 41297 26470 5981 9085 21093 68419 65139 42035 61967 67495 63587
8236 63587 68534 87152 80404 50723 43295 91420 77998 60018 42168 24921 25743 -7070 -2382
8223 -2382 22042 63776 45114 17730 -10714 19461 16783 5308 -1222 -53153 6308 32292
8211 32292 7697 -57326 -68355 -74802 -44912 9555 3755 -37015 -18819 21156 42108 61489
8199 61489 63259 49749 29141 25499 15669 38684 121648 134239 88266 75622 54314 59711 117183
8186 117183 102386 94689 53421 24792 87737 188234 164872 96861 56243 24455 -23334 -8760
8174 -8760 11403 4435 -24205 -19346 -17202 9450 30519 27690 -4642 -19162 34766 62686 71435
8161 71435 82702 46685 66477 32764 24350 124136 177954 186580 174822 132824 35588 42418
8149 42418 51404 82266 98952 58406 14497 9464 51051 95372 81792 85743 40419 13100
8137 13100 35389 2810 -37038 393 70342 142590 105283 90425 58365 42158 21435 36789
8125 36789 50566 78960 32388 22428 27644 4791 39986 90334 84318 87291 80639 19130 -37535
8112 -37535 -43114 41930 41989 83944 93440 71960 12763 -31376 -79560 -62462 6395 36025 -11790
8099 -11790 24254 9242 42347 34950 19718 49829 101529 134794 104016 106535 131943 91515
8087 91515 137213 176004 119823 57449 76400 122523 136885 116883 85754 43857 18202 -20409
8075 -20409 -71226 -47941 -38715 -58060 461 21818 44554 108065 82871 86784 102629 79782
8063 79782 153619 133134 64394 87818 113525 104275 97667 94183 66581 72958 75702 27701 -27877
8050 -27877 17642 64881 64387 49665 107879 128648 111311 86569 45016 32743 2519 24791
8038 24791 91717 100436 34892 35198 63933 63653 91097 137594 149567 175871 147144 185453 255586
8025 255586 194683 104724 101201 105141 116716 178719 226064 247115 207300 167779 179389 170520
8013 170520 223963 239628 194799 188068 201767 241189 244838 221765 206238 216437 219940 232260
8001 232260 253686 299120 294542 304253 321630 308744 277144 284076 307449 277152 298037 323287
7989 323287 273917 217849 199211 210446 181670 126949 98843 110877 88427 95488 101520 94092
7977 94092 97169 126559 102856 156464 173727 157289 137325 140720 194558 223012 237183 286017
7965 286017 344652 384946 389387 361933 320906 330879 350221 351113 334594 335020 341951 360571 392990
7952 392990 402987 391979 328130 360218 338472 279045 281399 299323 325429 302476 230370 192111
7940 192111 206399 206374 206712 217384 212730 212269 231577 196423 186849 123522 145359 170645 196321
7927 196321 174656 135484 194600 197314 170399 160170 202627 221847 256495 254949 211389 239805
7915 239805 201795 152925 198274 177329 178253 190577 231699 274365 242696 235843 244431 262299
7903 262299 220592 204380 186416 118563 156659 131230 97301 48725 16243 50581 68991 57570
7891 57570 98402 103411 136426 114756 54869 5743 12634 19976 45458 25596 43463 115586
7879 115586 143937 89211 86226 146530 140544 66102 46945 77036 111612 152757 126701 53086
7867 53086 54446 45032 13946 -16638 -44051 5962 50217 65810 96342 97303 109747 130216 136201
7854 136201 141649 113582 97729 89688 49185 -30969 -15535 58056 77330 16138 58057 97769
7842 97769 89459 84450 56995 50125 67680 92145 127808 95979 71159 4569 -48758 -11537
7830 -11537 43644 67308 83028 90894 73035 4001 -42047 -35097 -34527 -23614 -33502 -58480 10909
7817 10909 43829 55728 98444 46914 -30187 -16058 -43787 11995 54290 31515 17381 43214
7805 43214 36559 -4713 16943 84319 41837 15395 18017 18667 -8643 -36339 -6682 17106 -57406
7792 -57406 -112351 -75081 -68102 -17675 -1621 18683 38609 48079 45457 54137 61818 11231 22578
7779 22578 -11643 -73533 -10462 24549 2164 -21278 -45978 -34498 -27201 -10886 65292 71568
7767 71568 30319 -13491 -40563 -83750 -40493 -33026 -27890 -3822 -10661 -40010 -35385 -8618 -38833
7754 -38833 -84593 -37565 -32489 -44370 -35947 -6505 -61689 -118720 -129835 -99569 -77464 -2894
7742 -2894 48587 32237 25696 93034 100778 79821 8067 -30925 -1724 25865 49512 19013
7730 19013 3312 -12215 -42135 -39580 -32363 -2515 -4439 -53453 -64228 -57831 -78054 -72840 -4478
7717 -4478 51511 62130 25662 9093 7811 -336 41085 104496 77295 -19131 -62937 -38551
7705 -38551 43886 91037 102089 86550 78591 20091 11300 8674 2084 3637 -27969 -11619 -12648
7692 -12648 -44246 -83002 -96778 -86767 -120862 -100956 -91694 -69583 -17233 -18591 -99612 -90193
7680 -90193 15629 -2972 -47 50524 109008 84696 21436 -23725 -16061 -45510 -32238 951
7668 951 3649 6999 -1438 87284 68530 -18289 -62691 -52690 -61539 -69784 -68323 -53274 -86750
7655 -86750 -88033 -55051 -50154 -82814 -114070 -150968 -125358 -38499 -60144 -118355 -103935 -69462
7643 -69462 -25764 -45524 -53995 -4852 -35201 -144665 -121002 -43167 -23966 -43095 -41114 -24733
7631 -24733 -37916 -46802 -24677 -27595 19293 24864 9627 2897 2700 1847 -9802 -14028 -46983 -37806
7617 -37806 -48293 -79331 -129290 -81763 -68051 -57872 -53590 -40035 -26628 -37564 -7642 -15186
7605 -15186 -11750 -39680 -54244 -74731 -48562 -24578 -21970 -56865 -75349 -22891 53277 53052 42244
7592 42244 -245 -96387 -137589 -103131 -49190 -46798 -16258 11299 14365 -5746 -57238 -89021
7580 -89021 -71918 10116 32056 54769 43106 48083 12659 -89923 -125813 -97052 -40249 -9569
7568 -9569 23950 47824 53300 85543 57206 55339 7608 3768 16123 6123 -36502 23200 6030
7555 6030 9333 40120 94996 145434 126204 34714 -16586 50499 44854 44642 49115 6868 -36527
7542 -36527 -40722 -51886 -60896 -34922 -27968 -64084 -29086 62706 50860 49487 34095 17419 4193
7529 4193 -34566 -47600 -22172 34786 43354 20502 69301 86246 133304 136913 91424 60186
7517 60186 11629 -33935 -37215 -51082 -41497 -21094 27559 43206 34061 54256 40138 -15500
7505 -15500 -19629 -50576 -74646 -115866 -92965 -60768 -19193 21273 44944 53192 102369 153623
7493 153623 132229 29621 -29523 -62970 -6407 28699 5851 3253 24508 -4276 11128 64923
7481 64923 47332 37439 28430 23639 22542 55065 58922 8163 39520 34989 29351 5707 -14932
7468 -14932 2273 -49976 -111755 -151006 -153909 -94788 -63581 -106808 -104842 -82536 -43052 -7719
7456 -7719 17466 -41750 -82973 -88892 -109428 -118070 -97134 -49872 -75384 -81332 -28968 15590 -69936
7443 -69936 -58459 28185 25803 -7979 -66761 -62795 1833 19552 21931 -18643 -12555 91784
7431 91784 122838 119053 53989 -40953 -74909 -45827 -23359 -13253 -37307 -12868 14769 24848
7419 24848 3101 44724 42662 74466 72632 25831 -57663 -82887 -19692 11968 2801 -4467 16230
7406 16230 -10731 -116225 -88787 -27775 1332 48149 49484 4895 -44319 -56946 -48741 -48174
7394 -48174 -57523 -92821 -95642 -99135 -90043 -73750 -61379 -69318 -43626 -43321 3233 18580 -7047
7381 -7047 -36915 -50256 -16958 57636 112572 111738 59501 27266 11520 4559 -19322 42240 53931
7368 53931 36242 76312 66346 97056 25078 -29369 -66842 -119091 -77255 -69467 -88171 -54515
7356 -54515 -1241 51610 8429 -5928 -18376 -29375 -28498 -33234 -22178 22276 11474 22130
7344 22130 22846 -64356 -80482 -49142 -77052 -42856 -73088 -53541 -43703 -18886 -44377 -68575
7332 -68575 -58280 -56040 -76331 -123819 -118709 -80710 -58173 -53532 -76981 -79895 -35881 3321 -20056
7319 -20056 -2065 1018 -29594 -39119 -34786 -9922 -29138 -36033 -56806 -76822 -76698 -33088 -26318
7306 -26318 -74957 -54202 -35033 12854 77505 23662 -16203 11203 15349 20612 22528 47644
7294 47644 48817 -15347 -47001 -43539 -38596 -6269 44013 51066 47688 -7434 -75944 -75345 -90152
7281 -90152 -128635 -132691 -156460 -135309 -102162 -62862 258 14999 -36679 -62221 -66052 -61333
7269 -61333 -20936 12279 33712 31277 45267 75687 104885 113102 95747 43720 -14560 -39561
7257 -39561 -34838 -12838 9463 17251 -1940 2030 -12411 16396 29462 75031 17597 -18907
7245 -18907 -39651 -70167 -75055 -105308 -107367 -86098 -61076 -65225 -49471 -41753 -2225 -25990 -41669
7232 -41669 21705 25498 -3434 -56245 -86604 -47994 -55319 -58826 3837 -61767 -112240 -83409
7220 -83409 -73540 -68962 -58224 23713 98444 171946 149395 98315 94673 91489 53220 9351 3017
7207 3017 42696 41106 -6952 -6708 4518 -24500 -26429 -47037 -47021 -26795 -11644 -18191 -86085 -106651
7193 -106651 -69627 -31614 -45928 -89775 -56490 -12225 17982 35032 14132 37872 40511 -2013
7181 -2013 -8283 4832 9670 8076 -22458 -37238 22031 17745 12439 34286 -33287 -60899 -85437
7168 -85437 -27135 -26118 6906 51025 76166 73138 17202 56421 61549 16213 -19378 -5961
7156 -5961 30214 6590 -25786 -47687 2884 8671 8807 -59695 -110069 -84183 -82435 -44719 7490
7143 7490 30234 61169 21127 53627 26288 -27167 -86645 -105476 -130489 -131942 -126555 -105868
7131 -105868 -77535 -57430 -58622 -40946 -40526 -16836 -34608 -10397 -12945 -12860 -84915 -122324 -49399
7118 -49399 -183 -44260 -82800 -99741 -74787 -85954 -93024 -45766 -2994 36435 61512 47703
7106 47703 13138 -28639 -26956 -38589 -70601 -33770 -1208 -55771 -41476 -13409 39744 71034
7094 71034 46104 -6944 -10243 -29213 152 4860 7756 2553 8253 51388 44921 34371 20172
7081 20172 42074 34673 -28290 -50458 -31611 -645 -30899 -32761 -37777 16912 46507 62883
7069 62883 64297 55286 9078 33634 -6531 -24677 -35155 506 -35743 -12010 40686 36007
7057 36007 -44313 -42200 15468 21611 17895 39076 39703 7177 2291 18076 32760 2461 8833
7044 8833 51412 88452 74511 5735 20245 5271 6224 -21536 -49098 -16067 -4443 -26451
7032 -26451 -58259 -73004 -42438 -45143 -38323 -3084 8441 -41319 -101664 -43162 11547 -51071
7020 -51071 -119517 -123916 -71441 -79727 -40106 -42533 -96971 -86182 -58366 -63173 -78439 -52377 -22693
7007 -22693 -52894 -60394 -52478 -107466 -158341 -141163 -77055 -10198 30890 3006 14146 15295
6995 15295 -1905 -6542 24742 456 -8828 -8637 -62374 -100507 -64763 -31662 6702 -54691 -101704
6982 -101704 -52119 -32511 -64578 -64625 -64228 -33036 -48489 -45583 -35286 -55504 -60230 -43722 -33644
6969 -33644 10407 93173 93203 70337 23527 -8134 -4577 13753 -41491 -38503 -70067 -58757 -20755
6956 -20755 10229 29065 -27468 -16200 -33040 -44592 -43109 -60530 -101574 -124386 -74356 -114328
6944 -114328 -171152 -130773 -56671 16057 36132 17106 19170 1600 66083 85868 39210 -18970
6932 -18970 -15119 -44408 -23822 -9731 4669 25903 9483 -39565 -45061 -21050 -44649 -77691
6920 -77691 -94372 -119944 -148166 -110519 -46022 -55747 -28588 -26185 -37383 -74125 -79356 -44433
6908 -44433 -8611 -6983 -6547 -61024 -48647 -89933 -81030 7495 18851 29272 16386 38996 39651
6895 39651 23012 -15434 -57130 -40939 -29752 -24433 -4023 -25920 -15151 32190 -3273 -20470
6883 -20470 -22678 -31835 -89774 -124039 -77699 -99593 -82923 -63672 -58307 -46181 -53811 -33432 -6872
6870 -6872 -2174 -25920 -33944 -59591 -34787 -19025 -35212 -54063 -95288 -87586 -40801 12951 9746
6857 9746 -1128 -27827 -23474 -17569 -78692 -65409 8436 -34683 -82056 -73953 -40019 -16196 -34654
6844 -34654 -72173 -37323 6690 41471 111258 98693 80186 45490 78334 54338 14754 28245
6832 28245 51758 56487 32980 1623 -7967 29692 83323 37413 -13695 -29229 12793 -13927
6820 -13927 -24140 -7862 20776 12398 38863 8295 23967 23508 46368 31517 30871 36160 85040
6807 85040 66775 33686 23085 134 19107 49452 32375 22037 61924 68841 29378 -533
6795 -533 3122 -26609 -41925 -58345 -41143 -88914 -68022 -44954 -9145 42626 60916 20152
6783 20152 19962 4053 -21292 -71095 -93532 -52513 1640 4506 -14066 -48292 -28251 -69324
6771 -69324 -117168 -114033 -4312 31760 21199 16391 -3127 -13247 -27394 -14972 18524 -17829
6759 -17829 -56683 -3586 41010 60406 74518 84592 69417 60721 63403 7400 -9938 40300
6747 40300 39882 92524 187343 243306 242749 251717 274304 278650 294965 253643 215633 194651 199655
6734 199655 232540 244091 217357 202848 168449 150401 204328 316239 376655 425832 524402
6723 524402 689348 920375 1200321 1634297 2349007 3401482 4763041 6082734 6470251
6714 6470251 5735430 4415894 3130064 2175672 1503130 1086779 785179 567236 393896
6705 393896 296445 271503 250911 204733 149792 49089 14749 42633 4391 -16143 10448
6694 10448 68385 153093 145293 118562 104629 94923 75226 115294 126218 84865 98059 92853
6682 92853 50572 7515 15890 31567 24234 35988 61433 56782 21005 39336 69832 34502
6670 34502 20789 59097 77305 92391 78824 58536 101761 90902 -680 -9468 -52469 -114707
6658 -114707 -147308 -79542 -17716 43413 29530 8140 -46119 -85018 -81505 -39709 -16860 -29862
6646 -29862 -24120 -8695 -28453 -97575 -126663 -106913 -189309 -181782 -182172 -203551 -228712 -182369 -117518
6633 -117518 -45570 21255 29128 -54616 -34922 6105 11596 -11155 15929 54221 -8595 -45037
6621 -45037 -55789 -20816 2696 -34114 -60702 -55799 -36536 5677 33938 43997 -5798 -56740
6609 -56740 -41756 -34190 -26728 -39387 -69311 -85599 -73938 -57047 -10307 38580 55809 48452
6597 48452 88591 92812 125325 142211 146916 115875 88887 52960 23096 -28016 7262 12281
6585 12281 2233 29669 17236 -52814 -53616 -57130 16049 82210 71137 54531 66698 81450
6573 81450 91202 113364 100044 34852 -32965 -44076 -46428 -96055 -65990 -8731 14855 -43305
6561 -43305 -133801 -121874 -16344 21727 3156 20376 -51305 -126122 -150804 -123792 -75952 -47368
6549 -47368 -21702 -46542 -92577 -109465 -94739 -55148 -36523 -38025 -93083 -85157 -98570 -141112
6537 -141112 -84732 -51811 -64269 -54631 -25262 -33650 -66337 -51715 -46745 -44049 -38826 -36071 5319
6524 5319 1023 -22121 27972 46223 32162 27058 -12553 -24675 -9133 17268 14361 8961 20586
6511 20586 -18559 -28159 24510 40811 37432 -11785 -55005 -42783 -34127 -278 -12962 -29327
6499 -29327 6968 -9661 30835 60743 48732 -5715 -24150 -22488 -28748 -54297 -48583 -25438
6487 -25438 -18516 -97 24335 71493 67137 26965 29672 21185 43823 60012 42649 60326 56361
6474 56361 57175 24704 7565 -10354 -4202 8041 -3087 1417 -22959 -54682 -76767 -29984 6593
6461 6593 22606 26810 411 29608 -5210 -4171 17615 53564 56958 48689 26539 6315 54617
6448 54617 74067 37937 18519 -9289 -38912 -28298 -2195 25375 67754 64004 75184 54628
6436 54628 26611 20153 30151 46105 57101 29831 24048 30280 57316 -20206 -43553 -16586 -1021
6423 -1021 56427 53487 -13190 -42331 -13109 -2133 61416 73622 11232 31565 42586 94753
6411 94753 75830 15201 -3279 13687 940 12404 11726 -20536 -39353 -9980 -28621 -57320
6399 -57320 -87774 -95260 -50156 -481 -3358 27099 45446 72217 58718 29181 41287 51045
6387 51045 33655 -39923 -51122 -21780 -26283 -42159 -47728 -27647 -29507 -33410 -48610 -32517 -23514
6374 -23514 -4702 23907 -6713 -99324 -80191 13448 10607 -18920 -62038 -1092 23591 6140
6362 6140 11843 44620 94643 82967 1221 -30802 -15912 26807 78450 100477 28907 7596
6350 7596 11028 -13867 18434 14817 46967 49385 86298 51586 77837 64250 40514 74896 80014
6337 80014 71354 74898 92840 64906 6485 3286 56523 88255 57907 42368 89599 72468
6325 72468 63593 28848 24772 2092 -12220 -28090 -75541 -51665 -5939 -22442 -78867 -121908
6313 -121908 -83386 5916 5400 18659 51776 31921 45927 27933 59929 84786 94894 64400
6301 64400 18698 4020 63842 82798 64366 -13052 -16632 -12328 8544 20822 29797 23948 15845
6288 15845 -11595 -11163 -6710 -19843 -50649 -89284 -82321 -42452 -43354 -26810 -54629 -96732 -60611
6275 -60611 -54183 -11639 61156 126932 94667 40757 17146 5077 66488 61134 2448 -10024
6263 -10024 9677 47463 31539 -32531 -75768 -78763 -60829 -15064 73 -53046 -86768 -90386
6251 -90386 -61373 -33111 -73544 -134807 -135536 -73172 -37768 -35083 -59668 -76672 -63414 -40577
6239 -40577 -38751 -53117 14682 68941 68092 34668 6734 -14875 48873 45282 32993 -3751 15395
6226 15395 11316 -11638 -21304 -51044 -38402 -22285 10447 37689 26149 4562 20871 25844
6214 25844 42386 -20877 -91292 -57352 -79767 -109001 -92578 -41492 6121 21695 7433 18434
6202 18434 64229 164766 162331 112704 97348 87571 82680 61437 13310 -48368 -78086 -56864
6190 -56864 -44788 -40784 -53186 -33906 -11402 -33466 -61256 -77539 -261 69946 12560 -29332
6178 -29332 -51040 -66666 -39390 3287 -10869 -30065 -27377 -33644 -23867 -19006 56 16639 -16006
6165 -16006 -73022 -94850 -14220 -3009 10810 69472 68878 87644 83472 115236 108391 45479 55154
6152 55154 32024 10379 -9212 -77277 -60613 36200 16889 -12019 16147 23917 10943 -3070
6140 -3070 -17434 -34285 -60278 -45256 -39171 -55732 -113376 -125254 -63572 -13676 -20135 -38015
6128 -38015 -53856 -90019 -69563 -48037 -22423 32000 32226 11516 21294 16478 -51034 -87942 -52069
6115 -52069 20041 66979 57038 20682 -517 20360 14435 26921 10527 36902 29837 5246
6103 5246 59514 69359 32139 -26384 -70543 -111161 -90341 -68197 -75466 -32451 10350 -27876
6091 -27876 12643 24772 40583 77836 126037 99421 125792 148319 119095 131953 118365 144707
6079 144707 119858 75491 119392 127972 122029 147234 112138 36340 37202 95326 100731 94665 34782
6066 34782 -17271 33801 63299 33330 8257 23237 56123 39615 -21937 -50618 -42936 -47169
6054 -47169 -32673 -10689 6345 -11287 -3759 -73851 -100229 -128280 -151149 -133575 -101957 -77986
6042 -77986 -46912 811 42794 -11810 -15854 51297 44889 12633 7996 -21786 15711 29537
6030 29537 3966 -38039 -47591 3286 49733 79297 104623 88997 78169 62269 41655 42964
6018 42964 38426 32196 9339 27275 60867 24613 -1777 4055 17034 -3437 -4199 15354 11366
6005 11366 -16733 -10684 -36254 -21981 -31278 -48217 -29655 -7309 -28418 -79947 -124390 -78579
5993 -78579 -96950 -84194 -42006 -4528 12505 -18658 3065 17886 -13013 -14021 -52208 -47206
5981 -47206 -21924 -33469 24994 -4790 55026 85138 30936 40455 5025 -83 -5601 12561
5969 12561 -42858 -27933 -47377 -63174 -65350 -56047 -64240 -89790 -102551 -93456 -61977 -48866 -28152
5956 -28152 13838 67569 34958 -13380 -43070 -83454 -123999 -46435 47464 90104 75654 64166
5944 64166 17263 -26094 -39754 -42140 -41065 -14630 -18079 -89886 -117268 -92733 -39138 -38649 -22682
5931 -22682 56332 65492 13408 -12493 -1431 22539 34251 13499 -38730 -53211 3808 2758
5919 2758 12178 5231 -21758 -39387 -80614 -143721 -170902 -171112 -163588 -103712 -67157 -63088 -12225
5906 -12225 -22527 -46179 -80408 -94765 -110217 -96247 -61135 -31793 -33620 -13946 -2067 -31187
5894 -31187 -55571 -53319 -8826 -6356 409 4844 -9614 -71353 -67141 -3424 -31790 -58240 18185
5881 18185 -708 -27222 -49374 -90177 -62243 -46295 -66782 -81154 -76261 -30393 -5969 4829
5869 4829 41377 -43623 -110587 -87384 -95912 -120665 -100848 -90859 -56347 -57558 -101030 -109340 -113896
5856 -113896 -48882 3174 11267 -12170 -35304 -21137 576 -3173 -49081 6165 -16265 -23688
5844 -23688 -64389 -63593 -2499 -34014 -237 78267 76575 77718 75126 21066 -28066 -38527 -35288
5831 -35288 -72386 -102417 -120328 -65400 -19709 -4304 -35610 -60038 9889 2247 -66387 -108861
5819 -108861 -119307 -57948 -61160 -72891 -56266 -93067 -112042 -89502 -74184 -54027 -29349 -54555
5807 -54555 -76177 -85573 -69617 -16171 -13860 11186 39060 -2196 7938 5132 27293 28455 2488
5794 2488 -9392 65669 84068 62025 24126 -17487 -26490 -40061 -21588 35209 93597 30707
5782 30707 -41815 -33667 -54533 -34784 6074 30092 12224 27057 47981 74681 84467 1902
5770 1902 -39912 -4796 39127 72368 15650 1501 12320 -43295 -6459 1543 -836 56909
5758 56909 61339 21659 -36778 -52144 -57979 -54013 -57000 -48000 12715 5521 10171 -18941 -69942
5745 -69942 -53902 -29419 -42482 -53694 -89263 -85605 -116510 -60301 9453 11372 39449 60819
5733 60819 79197 62476 9378 -41547 -92339 -145337 -154841 -132266 -122852 -103355 -37382 -74462
5721 -74462 -90974 -59524 -43781 26128 42993 -7288 23004 31608 25570 26960 22599 31320 27813
5708 27813 36009 -7883 -29493 -61328 -19872 6305 10984 15410 13768 17038 43163 86685 35065
5695 35065 8033 23993 55411 33382 -34686 -37861 -13568 -42648 -80085 -70868 -63679 -61065 -15525
5682 -15525 30812 70576 42021 -31763 -93110 -71375 6010 -1801 48192 53254 -8416 -45514
5670 -45514 -74542 -108176 -108809 -94052 -89864 -69193 -109045 -143530 -115561 -97070 -93933 -126326 -105512
5657 -105512 -93480 -40809 9694 50268 45277 34855 39622 10634 13704 -16230 -85902 -136139
5645 -136139 -157372 -120352 -84041 -64828 -37574 -59566 -35363 -26440 -13465 -28983 -53401 -40593
5633 -40593 -45358 -39153 -98049 -104103 -68512 -2269 7877 -7271 -25252 13154 71874 28752
5621 28752 -28484 -34349 11536 -20038 -642 25752 52218 21344 -40597 9734 49752 81162
5609 81162 57090 1624 -31785 14548 52733 -10415 -76019 -90639 -70197 -19628 -58285 -57617
5597 -57617 -22219 29435 54548 63350 24350 -2476 -25195 -44078 14652 51757 101756 140049
5585 140049 82686 51024 60221 36150 -36493 -40808 -13477 -10647 -38495 -53543 -47689 -39171 39849
5572 39849 72920 54702 55262 27428 -3178 -66129 -97933 -17426 28070 -6339 -20160 24530
5560 24530 97798 160430 110223 134331 96252 9696 -45606 -60305 -11761 -6556 -8798 -32063
5548 -32063 -12368 -22217 -28047 -71985 -61626 -15101 7296 7675 -37373 -43456 -103599 -110503 -109339
5535 -109339 -117416 -123037 -119409 -82454 -48996 -37538 -26724 33433 84513 55890 8872 12016
5523 12016 58398 35344 666 -9364 -562 55594 52598 -28795 -84734 -97298 -78623 -50363
5511 -50363 -9276 21302 -16588 -36148 -47450 -34844 19620 48868 23023 -32061 -31310 -70492
5499 -70492 -88425 -68345 -40254 -6628 -78880 -118962 -140707 -108896 -71038 -95775 -73262 -113068
5487 -113068 -126804 -167249 -123310 -109422 -128401 -82843 -83053 -126097 -76001 -57443 -19545 -21071
5475 -21071 3232 32772 -3816 -41407 -17895 63150 56118 -3185 -22424 -48674 -88297 -77365
5463 -77365 -77241 -46113 -1122 -14216 23158 16997 23218 6452 -27734 -61710 -79249 -65843 -63417
5450 -63417 -71485 -79187 -5481 -8118 21246 61037 41358 9337 46200 85001 70374 67740 41636
5437 41636 987 -62383 -65511 -2558 12187 -5056 16828 37955 85001 52810 -210 -14028
5425 -14028 20960 -13202 8209 50052 4848 7247 5525 31029 94099 99033 47030 23278
5413 23278 -3511 28718 19342 -40343 -22238 -6464 -15374 -3588 31037 33558 8978 21825
5401 21825 10452 -19352 -39325 -25321 -6124 20379 52734 -36542 -44632 -43879 11706 18364 -8025
5388 -8025 -9954 -25048 -20376 -18560 -40966 -90307 -108616 -92696 -72753 -20119 -6230 -24759 -57358
5375 -57358 -62630 -58092 -35597 -40930 -69062 -40551 -18161 -13752 -1364 14964 31247 -32884 -42519
5362 -42519 -25684 -16530 -38323 -35164 -82214 -55123 -7743 55533 60779 67049 55671 75545 95971
5349 95971 30663 -1545 35070 9929 20161 -24039 -50654 -82105 -19878 3173 -36088 -77120
5337 -77120 -73091 -30093 -20929 -45255 -53995 -36906 -16971 -55067 -79258 -67171 -92264 -68802
5325 -68802 -23157 27639 147830 144171 90577 75859 81468 59854 -6636 48780 88155 91119
5313 91119 81863 84881 44800 26358 25958 351 -97 35912 70395 104905 87107 80190 70192
5300 70192 50178 3448 -5254 7891 15884 41047 44549 36775 20976 86611 68009 39483 69662
5287 69662 54027 193 -83065 -99635 -171631 -220176 -133580 -39719 -22467 5545 861 -28017
5275 -28017 -24557 -44615 -61786 -44676 15127 52308 54917 21671 -14515 -15242 -12233 46480 80456
5262 80456 86148 98677 54186 -18289 -32974 28322 95796 65576 46934 45393 4988 39242
5250 39242 69602 60409 49810 -2111 10435 3528 -4857 17701 -50449 -70106 -3692 -13979
5238 -13979 -12676 -16466 -56303 -97797 -51217 21777 12074 -2998 -2493 18802 24398 -24671 -63091
5225 -63091 -34500 26898 37699 54561 28334 -51373 -77858 -86152 -139139 -188804 -178704 -85530
5213 -85530 -71162 -48458 -31439 -55562 -41304 -49636 -79573 -90179 -80082 -6622 18375 5735
5201 5735 18811 49924 30460 6986 -27157 -47686 -53818 -65686 -95094 -87768 -66119 -68694 -46576
5188 -46576 31682 70127 9358 -6631 -88996 -68491 -9222 11777 39090 20564 -39976 -49968
5176 -49968 -2819 52043 24422 -14137 -4983 -7888 -60140 -40566 -39546 -69072 -24216 7657
5164 7657 -13749 19658 26332 2831 -26490 -95243 -41461 -8105 14055 12322 33422 -4859
5152 -4859 -32454 -64139 -67675 -10935 -24533 -15691 -10303 11772 3628 1817 16582 42179 79322
5139 79322 80037 95170 68047 48006 10683 20178 62781 35136 38233 79565 50512 -1237 -56086
5126 -56086 -101279 -84018 -36112 -34902 -1346 30258 55470 67170 73014 89392 38720 20477
5114 20477 -6935 42218 26524 51993 38576 -21142 32162 81097 72729 47804 44232 16307
5102 16307 21752 41917 43166 12501 -8687 -588 -995 -37074 -65716 -54552 -37267 -56623 -94091
5089 -94091 -99131 -69569 -104445 -86800 -53918 -35839 12468 81133 49487 -48720 -70859 -82677
5077 -82677 -83216 -89736 -27953 32588 12886 -3990 -2039 -33205 -53970 -31192 -17850 -15618 -21398
5064 -21398 -1528 6802 -34621 -73474 -45564 -51356 1606 53364 75254 43654 15344 -50582
5052 -50582 -43942 -63665 -101149 -93476 -38890 -17481 -28344 -33662 -25687 -32723 -12806 -16090 -49604
5039 -49604 -20350 -24502 2617 34165 36188 2215 -5058 -1108 -27904 -34414 21514 85842 133620
5026 133620 60539 -10927 -1600 -66549 -51299 -17121 -17775 -7622 32053 30137 -9116 2333
5014 2333 58693 74109 122349 62650 14068 24173 29707 -2035 -19044 -18800 -20129 -89619 -129687
5001 -129687 -86870 -34683 -36147 25110 50483 67203 63437 65720 -17881 -18328 -47153 -1182 20414
4988 20414 31808 64391 73464 109781 93681 76928 44134 83280 86173 72720 54228 -6853
4976 -6853 -63248 -59366 -60788 -6259 -336 -6615 14939 10084 -42357 -95899 -91482 -51876 -2512
4963 -2512 35522 45559 -10679 -19609 -51986 -36644 -59559 -55123 -25837 -29204 -54540 -26018 -28917
4950 -28917 24322 50331 16894 -12785 -28552 -81988 -64045 5826 39330 44517 -11110 -60899
4938 -60899 -71034 -71632 -34065 15325 20742 -17474 -414 -26017 -34914 -19424 -4691 -65126 -108905
4925 -108905 -103875 -66802 -45109 -19299 -23171 13072 28833 -43253 -77376 -21950 15265 -1356
4913 -1356 -32165 10301 12948 -10122 25083 6569 -50480 -62552 -30839 3499 -14974 -66273
4901 -66273 -78511 -26803 -57508 -128197 -93012 -104931 -100890 -54194 -6040 18222 72581 42813
4889 42813 34638 57582 29949 5281 -11592 -3611 21526 -7608 -63309 -75545 -74346 -84857
4877 -84857 -38584 -24856 -16022 -37978 -56664 -62593 -48534 -43000 -14395 22186 41203 27370
4865 27370 62923 78463 54282 -6778 -59112 -127752 -134111 -112358 -81284 -48715 -46734 -94218
4853 -94218 -67308 -57345 -27576 -43493 -50259 -46284 -68654 -31437 -51229 -46265 2443 16699 -1793
4840 -1793 -34571 -42508 -56165 -14838 82342 93647 67304 76035 71183 11395 -21743 -31896 20869
4827 20869 13817 38884 63890 40324 2933 -18882 25825 21681 24850 8820 20883 43433
4815 43433 45158 46681 32857 -52090 -77885 -73189 -47905 -9792 9412 29872 47791 78861
4803 78861 92622 100317 80951 86476 52049 -5824 -20758 1332 27515 65668 104206 97454
4791 97454 17490 -11205 -1254 21119 36251 22565 -1507 29517 -8548 -33735 -45718 -60018
4779 -60018 -92167 -62238 6623 32434 52007 51460 14455 -32438 -39165 -89135 -113399 -83551
4767 -83551 -85479 -70248 -37141 -16612 -27679 -12474 16149 -9281 -31575 -30758 -12550 -29233
4755 -29233 -24033 16763 14963 -17792 4637 67796 79212 39390 -15653 -33936 -46311 -55841
4743 -55841 8763 20896 -3384 -6788 -52866 -34618 12540 -3301 10992 27913 9682 4353
4731 4353 -26645 -93384 -64783 14557 11875 -21398 -85606 -66286 -33690 -46573 -30729 -7464
4719 -7464 -4525 2260 -13597 -32939 -71047 -87988 -46582 10231 19356 -31351 -27252 24466 2871
4706 2871 14012 5703 7797 16342 41452 718 -16674 3362 25178 49808 45416 8399 -6161
4693 -6161 -1628 -14742 -33800 -57130 -48958 -34384 -57269 -92437 -94614 -118664 -59172 -43857 -134566
4680 -134566 -95082 -385 16644 21160 36434 -6015 -98805 -81134 -81379 -50783 -38959 -34397
4668 -34397 -41822 -22548 -52697 -2504 86406 144209 81489 1020 -50083 -51118 -36758 7709
4656 7709 52956 98171 143014 106753 42122 -15810 -22925 18014 27419 61766 56722 39618 -4989
4643 -4989 -12110 13094 -47238 -57390 8769 29639 51821 107305 92002 30998 22871 67759
4631 67759 18473 -37830 8689 23275 1394 26270 24678 -7722 9882 40413 58250 51521
4619 51521 19573 -7319 -34584 -29241 -30177 -42009 -75964 -109848 -92725 -56196 -49619 -21318 -20170
4606 -20170 -10057 36578 -40322 -109485 -59020 -22591 -673 -7600 20730 52866 28713 6128
4594 6128 4628 -5032 -13863 -5254 -30712 -34523 -31228 -46612 -25312 -3879 -3135 -12310 -49067 -13994
4580 -13994 1914 5580 14922 26408 -24548 -53945 -26689 -17970 -21143 -858 27221 36655 24610
4567 24610 -46002 -63945 -39510 -6276 45244 5982 49010 139319 99335 43514 51544 9639
4555 9639 -10511 5217 3747 -9540 -31250 21998 912 -18365 24831 59459 118936 152382
4543 152382 123611 88745 63133 46040 71036 73532 27705 -40587 -36171 -24660 2569 -24619
4531 -24619 -38193 -8193 276 -19901 16053 3607 22876 47831 51407 40722 34770 61953
4519 61953 64179 43829 -21540 -91026 -68386 -11869 27010 35393 -10029 -33226 -86264 -53359
4507 -53359 37539 94650 76560 61282 69726 31065 26802 4440 5666 -9632 -75597 -145739
4495 -145739 -118143 -28488 -20763 -20831 -6194 6855 26950 20258 -5288 9972 41946 -4510 -32
4482 -32 26853 37695 4498 -31816 3359 15364 -9474 -22390 -33250 -8910 -59939 -18729
4470 -18729 -38552 -17865 -25439 -14437 -7172 -14150 24309 82928 61702 53283 84897 75580 42629
4457 42629 23583 -25242 -4935 39034 9888 -16755 -77151 7917 36359 -1218 -994 -38701
4445 -38701 -74941 -61133 -36323 -6288 -39079 -10567 -31508 -79538 -84317 -82294 -76318 -55743
4433 -55743 -8212 14756 36128 3545 -42586 -80726 -22616 -29599 -82730 -95940 -104656 -92933
4421 -92933 -15395 26776 26507 15432 39705 70028 33419 -16496 -27959 -47565 -18800 -48076
4409 -48076 -34950 69458 57529 31571 -32432 -79885 -59713 -33639 -18312 6042 8497 43975
4397 43975 40312 -2474 -55375 -73893 1299 -32467 -12620 1460 -26256 -39807 46927 52115
4385 52115 45910 -28530 -84791 -55253 6393 7882 -2500 -20788 -44955 -72823 -54341 -32748
4373 -32748 -6179 -3778 6165 -19203 -625 -61850 -114248 -123622 -108588 -115334 -69838 -9642 -15118
4360 -15118 -77525 -66501 -35517 3120 20101 43823 8969 -77024 -82837 -136677 -116838 -66267
4348 -66267 -60516 -33303 -948 42326 -23246 -86033 -4049 45495 17475 4310 12240 -15114
4336 -15114 -45698 -82089 -115170 -76096 3544 26342 35273 51132 -11406 -22827 -43132 -54784
4324 -54784 -7715 65918 41263 35142 36664 57873 34790 -26047 13722 60010 42061 -5833
4312 -5833 -35199 -87944 -99217 -71782 -31885 -26112 -3759 15479 73390 35706 -23626 -3564
4300 -3564 94676 114467 44700 14338 11656 -34548 -13135 42577 33866 29373 -15258 -70495 -41017
4287 -41017 -57623 -32253 20450 -15491 1481 59371 98348 89472 23037 -75530 -21471 -13420
4275 -13420 12526 -2722 3934 5799 -7938 -13269 -16989 -40788 -43642 27592 83933 54278 38453
4262 38453 -31267 -57499 -1650 83743 75500 93704 60902 22368 51159 46638 -9785 -1688
4250 -1688 39376 79110 81479 87617 58402 3228 15460 119104 124565 70825 60556 74039
4238 74039 53589 76803 79185 107407 36843 38738 37367 9630 -12440 -16186 9512 47893 73354
4225 73354 94762 55466 74179 43121 -43866 -32789 45097 106819 71431 91853 64164 3924
4213 3924 -31899 -4616 6626 -14389 -3074 46856 23592 -21932 -29448 -26592 -60290 10321
4201 10321 31192 -19556 11854 16662 4365 17890 36535 946 -47941 -74604 -28564 42903
4189 42903 76729 55959 72162 99130 62052 -8097 33104 126533 105785 52337 19833 52327
4177 52327 61185 33453 6990 32973 44322 56197 50681 68840 34543 6592 -2425 40909
4165 40909 98351 102467 71680 -8715 -66301 -86031 -59727 -19831 2706 5266 23898 -2049
4153 -2049 -72261 -49579 31366 42849 32492 44121 67332 32109 64881 57144 -8187 15812
4141 15812 29071 -12094 -12818 601 13414 -4752 -17848 -66521 -96440 -82394 -83631 -25791
4129 -25791 1823 32957 38787 40425 75276 45827 -27096 -11733 -29726 -35817 -19479 -10913 -45563
4116 -45563 -49243 -58733 -96388 -70628 -8261 -50954 -24595 22137 -33072 -103768 -113437 -64462
4104 -64462 -11005 -70604 -34536 -13943 -14637 149 28847 -8976 -29898 -31386 16043 38608
4092 38608 25608 -7110 5294 55126 25535 -22306 -68361 -69335 6120 28989 26048 31677 25364
4079 25364 29975 2126 -7934 -15275 -33851 -40883 -8551 -5533 -29116 -65066 -41759 31609 46167
4066 46167 -17471 -5649 -33073 -42737 -6415 27289 34830 11048 18989 52002 65630 102368
4054 102368 97116 74673 51964 37024 36342 21942 -54146 -6928 58122 40458 -20402 -76789
4042 -76789 -71433 -48042 -77798 -113687 -95233 -87773 -32479 22222 16777 9061 46070 61674 78699
4029 78699 46158 16464 -3728 20555 46250 79117 104196 46580 24555 25305 11118 38191
4017 38191 6033 -15723 -9818 -5143 6893 28558 -7370 -86244 -63768 -67388 -88959 -104178
4005 -104178 -61857 69624 78575 90382 91551 38256 -4416 -71674 -51302 -48713 10946 16650
3993 16650 56963 41125 4610 -19164 15087 69082 44613 -11777 -9294 -25187 -14307 37672
3981 37672 7270 -11736 30609 49881 72458 77752 70070 49287 6104 -11722 15898 19856
3969 19856 -18439 -35205 23890 -19956 -128551 -111100 -38416 -8763 35166 88237 115219 83688
3957 83688 68324 44623 27957 22546 36309 -36151 -99930 -124080 -87885 -81675 -96246 -30958
3945 -30958 4069 -43386 -49858 -39346 -19489 25622 47969 4235 6147 27023 21471 36913
3933 36913 42368 -10753 -30112 -11170 -13492 -42462 -32097 -46185 -20361 52669 70430 78581
3921 78581 53643 16479 -12673 -4900 38183 41872 39710 -15804 -14659 -34599 -29160 -45628 -257
3908 -257 -3856 3403 52863 14028 -23354 -4481 19331 -9676 -17925 -19798 -52251 -75531 -47540
3895 -47540 -28698 -24691 227 -7113 -29961 -69648 -156343 -123229 -85545 -71377 -57994 -8305
3883 -8305 73682 54119 -10649 41178 63675 32484 26797 65182 47785 50695 49454 31483 38871
3870 38871 44124 40295 115538 70066 49504 59022 96101 44137 -36484 -68897 -17881 -17637 11911
3857 11911 79126 131873 99860 60908 25896 -9326 -14115 506 32176 43794 7176 24847
3845 24847 71621 91555 34376 -9360 -2173 -12704 -15284 12565 55194 138533 155615 68342
3833 68342 -20868 -67954 -72250 -39614 -27266 2733 61501 99446 71336 21717 33350 -5523
3821 -5523 -73699 -57953 -44352 -32679 -9927 -36305 -47225 -42190 -28901 -46667 -78816 -81546
3809 -81546 -47080 -49956 -5442 -6502 22382 79393 71662 1702 -31867 -18486 37022 39631 14060
3796 14060 47884 59052 -19443 -13769 128 4868 27791 46681 53658 75214 78107 38649 30223
3783 30223 51718 100280 107191 63177 56017 29602 -10796 -29627 -20744 -12733 -66354 -88233 -44872
3770 -44872 -32864 -101178 -93372 -31216 -24279 -51911 -37300 1915 30151 35386 -21985 -68826
3758 -68826 -97612 -38723 -4684 46049 30768 -2817 -14866 15492 57774 80706 14050 -1830
3746 -1830 -23972 9894 -8694 13070 17064 -8847 -6027 -63787 -99979 -136865 -127070 -93868 -86309
3733 -86309 -65683 -32234 -18512 -44055 -82484 -67472 -70856 -19833 -16114 4379 -18798 -68238
3721 -68238 -60309 -35762 -53605 -95428 -140063 -139042 -85047 -44036 -35420 3519 1775 -49716 -39179
3708 -39179 -60664 -97179 -144373 -148483 -118579 -90336 -99051 -89325 -99408 -164332 -154820 -125831 -74971
3695 -74971 -57117 -56465 -17331 -16130 -30494 -41459 -95244 -37757 -17747 12049 34510 10503
3683 10503 46640 -6750 -32711 -39411 -57325 -75834 -81427 -34631 -24535 -23840 -62564 -64304 -68327
3670 -68327 -62851 -8277 16150 35327 27570 2107 -61916 -80638 -26944 18315 45257 -15397
3658 -15397 -40695 -39646 -19343 34888 32467 -17166 -20353 -34003 -49105 -42957 -54287 -93015 -101511
3645 -101511 -47153 9254 3516 -25405 23096 -19496 -97877 -67096 -6652 27503 39357 -24497
3633 -24497 -64906 -67335 12283 60052 51444 29417 73897 75591 56975 28205 -8188 -6346 -18759
3620 -18759 -23625 -35763 -80459 -67067 -103677 -107818 -107967 -37063 -46697 -56925 -14649 14459 -32102
3607 -32102 -39907 -13799 -53160 -78366 -28796 15543 -95314 -175547 -137391 -119936 -90105 -83546
3595 -83546 -76106 -69881 -65779 -31010 -65238 -52515 -42286 -58174 -42454 -83037 -115717 -94724
3583 -94724 42915 62332 49101 10099 -17427 5952 -19557 -15364 -2763 16996 17136 44461
3571 44461 48036 65657 48388 33862 5489 -55002 -39677 -14969 15459 59900 38462 23513
3559 23513 21655 -32689 161 -30688 -65587 -37954 7928 3628 11073 16380 2564 -27567 12285
3546 12285 38401 -3018 -27268 -7676 276 -53077 -86258 -77663 -46612 -35862 -33544 33827
3534 33827 85529 27969 -40505 -21469 61144 64462 69626 56919 91165 94467 46723 24652
3522 24652 13638 18416 -303 16448 -12939 -8665 -6838 -44484 -77829 -82033 -95889 -75520 -37741
3509 -37741 33162 63092 82761 88531 88670 62916 25967 20802 14819 2834 21309 23692 -9777
3496 -9777 -11188 -11082 -8856 39738 47098 9338 -18874 -14176 -16642 -2874 16276 -12688 -16804 -46238
3482 -46238 -69813 -51127 37306 17919 48035 87332 95538 107849 69849 3051 6453 40252
3470 40252 71155 22852 18279 47577 82977 79349 76127 27849 -3690 -34636 -29332 22017 19988
3457 19988 -19533 -35693 -44896 -37340 -25386 -18564 -23559 -48498 -46623 -53682 -30101 -33870 -92513
3444 -92513 -108556 -21225 20657 -24623 772 -43559 -43806 -9607 50766 84924 89198 23571
3432 23571 -22992 1297 22561 -3991 -16567 -3178 26109 39175 32809 43475 25927 22242
3420 22242 83633 82811 94407 66181 38100 55639 37890 12483 4622 14793 -12274 -5210 -4986
3407 -4986 -33301 15021 12870 40142 56235 56478 29146 -39955 -78815 -25821 35146 71101 72316
3394 72316 55411 6177 -17353 -4733 -8874 -58955 -69428 -32090 4487 -17793 -37487 -55321
3382 -55321 -61584 -62327 4708 -25564 -48303 16222 -10081 -48342 -104394 -73820 -4288 38725
3370 38725 31787 -5384 -4063 11203 -35805 -14625 82042 24828 -5195 26138 39004 35169
3358 35169 24902 7969 18041 44334 24179 -62538 -54506 -37342 33453 50590 62226 23703
3346 23703 50563 57640 7161 -4810 38528 52112 52946 32343 -16821 -9956 28405 21830 1099
3333 1099 -42743 -83703 -68841 2489 -10406 8615 89158 83851 22959 -25659 -38631 -59119
3321 -59119 -20990 -10063 -16029 -2120 -1700 -6103 -16680 53751 108102 85352 69976 -1606 -78290
3308 -78290 -38573 50355 62129 -19730 -8121 44012 59132 55087 71819 29324 18759 27462
3296 27462 64430 64384 -23444 -70585 -30922 -4048 -7125 24260 42341 51185 73481 95024 125891
3283 125891 44463 -8452 20092 3211 -37923 -73447 -44937 -10934 -18512 -46415 -23301 10985
3271 10985 78819 90402 54296 15756 20456 62485 40609 34211 64450 83313 50755 66068
3259 66068 123575 123511 46485 20079 9115 23968 41460 44023 11723 7621 -2791 54663 56798
3246 56798 25554 -28618 -59958 -86841 -71429 -20265 -14658 -23450 2863 21074 8341 9308 7365
3233 7365 -36456 -78823 -52654 -23202 8691 62168 50749 -22635 -35468 -21366 -63920 -52888
3221 -52888 -18903 -33835 -55690 -23814 1761 -31279 -46820 -17315 13294 -10156 -11264 26572
3209 26572 37404 36245 72575 113854 89855 47672 39055 2737 29787 36813 30616 14604 -17359
3196 -17359 -21624 4740 -44222 -43185 -30132 -24808 32770 37115 21127 76708 81236 22095 -40787
3183 -40787 -36112 -38064 -42455 -6009 -7314 -30318 -45050 -56940 -58999 -81789 -64333 11530 36208
3170 36208 -27219 -71580 -42388 -26497 -6559 -15311 -10189 25301 17887 -13528 16985 55596
3158 55596 -33636 -72566 -34719 -16326 38058 11266 -46143 -41312 -49622 4279 48792 54940
3146 54940 24374 -13400 -37774 -19229 -26237 9235 6879 60452 91040 116568 62829 6116
3134 6116 1945 -74960 -104477 -108384 -55060 25092 18118 4807 59486 16098 -97811 -100135 -39019
3121 -39019 7986 22326 11347 5107 -16442 -79544 -82796 -49371 -45829 -54519 -54035 -51435 -48830
3108 -48830 -52050 -55973 -30810 -43654 31417 14854 -6049 65175 103410 125686 130755 68249
3096 68249 21098 -5865 -3271 43852 51904 31589 -47263 -70408 -59734 -63702 -52509 -11918
3084 -11918 44566 37860 2410 6269 -5590 -72380 -87874 -3192 2662 2154 87055 70527 32970
3071 32970 46045 41456 -3833 -14048 -9171 -39766 -87893 -75488 -72531 -43166 -115224 -70279
3059 -70279 -64139 -81120 -65271 -51835 -48532 -51792 -22434 -2656 -55327 -100027 -85714 -63347
3047 -63347 -33231 -8503 32779 32567 49855 80090 91453 76840 70938 41164 27818 -69824
3035 -69824 -72562 -17919 -30337 -26400 -26896 -581 -10906 -36266 -40455 -21175 9022 19393 -3522
3022 -3522 -21284 -41057 -39083 -53451 -59543 2152 1411 -9210 -11838 -79028 -127390 -124899 -78972
3009 -78972 -26489 -44895 -8798 -35563 -36895 6601 17153 22871 67528 72815 27433 23401 62883
2996 62883 83026 79276 27077 4925 -16214 27885 47490 17288 -13569 -23201 -32564 -45729
2984 -45729 -3052 34823 67783 3940 -52944 -41396 -41701 -57788 -20099 73762 100087 67069
2972 67069 70584 62535 80213 123394 62401 20427 -47637 -73332 -76218 -76407 -8331 46504 9255
2959 9255 36048 44438 40313 15619 26187 23195 -46884 -47458 -44197 -42726 -28972 -61579 -26803
2946 -26803 -55324 -130037 -88363 -14898 81141 74194 24345 -23610 -24690 -25580 -68687 -62213 -20824
2933 -20824 -41667 -48358 -17023 -705 4446 4349 51788 60904 44512 10788 36390 48862 -24939
2920 -24939 -18359 15484 25251 24276 96997 133767 166103 148032 147264 116694 56903 -10835 -8050
2907 -8050 6258 7884 -4361 6906 46462 9609 -12074 40669 93409 111754 65846 15319
2895 15319 -15912 -7161 18993 -8940 -18354 2595 32691 27011 13190 -11197 -15732 -24799 46571
2882 46571 75998 11501 -16745 -28583 -7855 -9040 22983 43941 70345 59774 9101 -48047
2870 -48047 -99000 -117104 -62879 -18103 -13055 43775 45460 70685 79215 5269 -51982 -81454
2858 -81454 -73215 -9924 -18047 -15977 15126 54219 -273 -12072 4504 22943 11646 -44966
2846 -44966 13677 97478 60722 15474 42532 48900 8610 -72302 -58265 23162 28645 24155
2834 24155 21853 -39196 -61497 -21909 25852 1077 -39078 -36745 -50635 -61947 -40299 -25704
2822 -25704 -35717 -54211 -15538 1104 10418 9501 23761 57137 40781 -4667 -16257 -4897
2810 -4897 10191 -2709 -60433 -5196 -9119 15014 6758 -26011 -40904 26459 78492 121947
2798 121947 68639 24697 43071 70514 106507 132466 44759 -9551 -11579 29223 -20658 17296
2786 17296 79265 94218 40746 12153 -52038 -92486 -56040 72927 73445 69136 67942 61844 62051
2773 62051 31634 30082 65551 54565 27741 -27495 -65802 -115730 -27936 -955 -51688 -46705
2761 -46705 -23801 -25643 39462 38767 -23281 -51344 -86482 -103283 -39089 -48114 -109612 -89381 -66445
2748 -66445 -61014 -37187 11677 -22749 -31340 -22282 -15919 11495 48975 4423 -18092 -15603 28837
2735 28837 32804 34501 17563 17552 69735 36927 -41920 -86199 -74614 -6373 36845 27674 29607
2722 29607 -8116 3459 11531 -18037 -4604 -6960 -37156 -27032 -1668 31331 -1778 -69263
2710 -69263 -41471 20892 49349 79903 114947 34268 -24875 -30914 17184 42167 44276 58609
2698 58609 60122 80523 -8750 -50485 -73953 -79861 -13523 31728 45244 -18399 -37171 -44812
2686 -44812 -66788 -58412 -16483 27331 1409 -24523 21459 41666 83115 103502 37801 28255
2674 28255 70976 107091 103440 82619 55851 66327 45443 39714 18729 -5495 -35839 -52427
2662 -52427 -35943 -28270 -7526 13424 81342 80998 103932 104923 73866 4067 -21695 675 -11363
2649 -11363 -8727 -16149 -19502 1594 -11717 3359 -10426 1399 51567 53516 94168 96347 43245
2636 43245 46190 79708 79009 21568 6680 32754 34543 78323 97133 75593 -1693 -26851 26150
2623 26150 72412 104323 107841 131043 134310 133432 145403 80791 29352 16639 -14617 16324 67443
2610 67443 45543 6161 19744 73144 57105 18675 15254 8793 6860 22556 31014 53200 37171
2597 37171 55221 73696 44890 16133 1793 366 9960 -12002 6670 -1886 63916 123735
2585 123735 108326 53853 -2436 -9366 -12849 -3970 -64415 -57690 -1987 56902 83969 50488
2573 50488 16799 12304 16662 -12573 -62217 -104899 -96967 -31764 -2598 -22824 10251 32008
2561 32008 36133 -42830 -37178 -39714 -54289 -54669 6012 24184 31080 41335 37219 34638 11951
2548 11951 7654 -77333 -89190 -52505 -97446 -48580 502 -17495 9012 -9659 25977 31651
2536 31651 -16490 -35757 -21474 77589 162946 115900 12261 1458 40242 29427 8907 5381
2524 5381 -12602 -28751 -69379 -39128 -13446 -78223 -133972 -95439 -18066 512 -12770 -19130
2512 -19130 -7572 32075 29455 -29744 -61748 -40096 -68132 -26931 33606 62221 86587 39969
2500 39969 -6764 9871 40881 51327 60637 39457 -7977 -27454 -21985 23014 65841 45244
2488 45244 12811 11287 19330 12638 28613 -14974 22096 106739 101951 153266 152104 84072 13117
2475 13117 -13214 12004 325 -64727 -62469 18826 56481 46154 27026 25355 18680 32304
2463 32304 15525 7716 42465 3271 -3913 -14326 -28053 10499 30426 -24501 -53320 -43595
2451 -43595 -32208 16168 48171 7684 -2826 15026 -14227 -14190 2621 -71266 -126701 -111859
2439 -111859 -40572 8995 59353 78459 121680 155145 130221 81088 64387 22914 -19585 -1882
2427 -1882 16646 70792 111858 56789 36579 79625 63076 -3621 -54949 17258 63370 61981
2415 61981 104627 96398 65625 58398 53787 96527 49676 -37060 -41338 -37070 -72752 4043 52104
2402 52104 48687 44432 2789 6109 9525 -5433 10841 -43860 -109740 -51911 -25608 -73934 -69391
$$ [...]
##END NTUPLES=NMR SPECTRUM
##END=
