##TITLE=Analysis number 312840
Compound Code mo 07699
Project Code qc-cat
Chemist Name fudan
##JCAMPDX= 6.0         $$ Bruker NMR JCAMP-DX V2.0
##DATA TYPE= NMR SPECTRUM
##DATA CLASS= NTUPLES
##ORIGIN= Bruker BioSpin GmbH
##OWNER= NMR
$$ XWIN-NMR		Version 3.5
$$ Mon Aug 15 15:14:45 2005 GMT Daylight Time (UT+1h)  MAYBRIDGE\NMR@NMR_250MHZ
##.OBSERVE FREQUENCY= 250.131544655141
##.OBSERVE NUCLEUS= ^1H
##.ACQUISITION MODE= SIMULTANEOUS (DQD)
##.ACQUISITION SCHEME= undefined
##.AVERAGES= 16
##.DIGITISER RES= 18
##SPECTROMETER/DATA SYSTEM= dpx250
##.PULSE SEQUENCE= zg30
##.SOLVENT NAME= DMSO
##.SHIFT REFERENCE= (INTERNAL, DMSO, 0, 16.522)
##AUDIT TRAIL= $$ (NUMBER, WHEN, WHO, WHERE, WHAT)
$$ ##TITLE= Audit trail, XWIN-NMR		Version 3.5
$$ ##JCAMPDX= 5.01
$$ ##ORIGIN= Bruker BioSpin GmbH
$$ ##OWNER= NMR
$$ C:\u/data/dgb/nmr/ADRS/7940/pdata/1/auditp.txt
$$ ##AUDIT TRAIL=  $$ (NUMBER, WHEN, WHO, WHERE, WHAT)
(   1,<2005-08-15 15:14:25.71 +100>,<MAYBRIDGE\NMR>,<NMR_250MHZ>,
      <created by zg, POWCHK disabled, PULCHK disabled
       configuration hash MD5:
       62 19 C7 07 E1 42 D1 B7 37 6C 3D D0 77 39 F9 E6
       data hash MD5: 64K
       E5 6E E2 60 EA B7 74 B7 68 80 F6 BE 56 36 FF 4D>)
(   2,<2005-08-15 15:14:37.12 +100>,<MAYBRIDGE\NMR>,<NMR_250MHZ>,
      <Start of raw data processing
       ef LB = 0.3 FT_mod = 6 PKNL = 1 SI = 32K 
       data hash MD5: 32K
       A7 FE 24 E5 54 A2 46 5C C7 5B E9 D3 DF F2 2C 2C>)
(   3,<2005-08-15 15:14:38.92 +100>,<MAYBRIDGE\NMR>,<NMR_250MHZ>,
      <apk 
       data hash MD5: 32K
       79 6D 8D 1A A6 0C 83 F1 B8 EF 3F 1D 37 94 09 A5>)
(   4,<2005-08-15 15:14:39.75 +100>,<MAYBRIDGE\NMR>,<NMR_250MHZ>,
      <abs ABSG = 5 
       data hash MD5: 32K
       22 B4 AF D4 4D F7 CF 7F 8D 4C 79 50 98 BE 8A 60>)
$$ ##END=
$$ 
$$ hash MD5
$$ F4 12 9B B7 9B E2 9D 78 B1 58 A4 D2 8C 3C A0 96
##$RELAX= 
##$RELAX= 
##$RELAX= 
##$RELAX= 
##$RELAX= 
##$RELAX= 
##$RELAX= 
$$ Bruker specific parameters
$$ --------------------------
##$DU= <C:\u>
##$EXPNO= 7940
##$NAME= <ADRS>
##$PROCNO= 1
##$TYPE= <nmr>
##$USER= <dgb>
##$AMP= (0..31)
100 100 100 100 100 100 100 100 100 100 100 100 100 100 100 100 100 100 
100 100 100 100 100 100 100 100 100 100 100 100 100 100 
##$AQSEQ= 0
##$AQ_mod= 3
##$AUNM= <au_zg>
##$AUTOPOS= <33 >
##$BF1= 250.13
##$BF2= 250.13
##$BF3= 250.13
##$BF4= 250.13
##$BF5= 500.13
##$BF6= 500.13
##$BF7= 500.13
##$BF8= 500.13
##$BYTORDA= 1
##$CFDGTYP= 0
##$CFRGTYP= 5
##$CHEMSTR= <none>
##$CNST= (0..31)
1 1 145 1 1 1 1 1 1 1 1 1 1 1 1 1 1 1 1 1 1 1 1 1 1 1 1 1 1 1 1 1 
##$CPDPRG= <>
##$CPDPRG1= <>
##$CPDPRG2= <>
##$CPDPRG3= <>
##$CPDPRG4= <mlev>
##$CPDPRG5= <mlev>
##$CPDPRG6= <mlev>
##$CPDPRG7= <mlev>
##$CPDPRG8= <mlev>
##$CPDPRGB= <>
##$CPDPRGT= <>
##$D= (0..31)
0 1 0 0 0 0 0 0 0 0.06 0 0 0 0 0 0 0.0002 0 0 0 0 0 0 0 0 0 0 0 0 0 0 
0 
##$DATE= 1124115264
##$DBL= (0..7)
120 120 120 120 120 120 120 120 
##$DBP= (0..7)
150 150 150 150 150 150 150 150 
##$DBP07= 0
##$DBPNAM0= <>
##$DBPNAM1= <>
##$DBPNAM2= <>
$$ [...]
##$SUBNAM6= <"">
##$SUBNAM7= <"">
##$SUBNAM8= <"">
##$SUBNAM9= <"">
##$SW= 20.6930455092707
##$SWIBOX= (0..15)
0 0 3 0 0 0 0 0 0 0 0 0 0 0 0 0 
##$SW_h= 5175.983436853
##$TD= 65536
##$TD0= 1
##$TE= 296.16
##$TE2= 300
##$TE3= 300
##$TEG= 300
##$TL= (0..7)
0 120 120 120 120 120 120 120 
##$TP= (0..7)
150 150 150 150 150 150 150 150 
##$TP07= 0
##$TPNAME0= <>
##$TPNAME1= <>
##$TPNAME2= <>
##$TPNAME3= <>
##$TPNAME4= <>
##$TPNAME5= <>
##$TPNAME6= <>
##$TPNAME7= <>
##$TPOAL= (0..7)
0.5 0.5 0.5 0.5 0.5 0.5 0.5 0.5 
##$TPOFFS= (0..7)
0 0 0 0 0 0 0 0 
##$TUNHIN= 0
##$TUNHOUT= 0
##$TUNXOUT= 0
##$USERA1= <user>
##$USERA2= <user>
##$USERA3= <user>
##$USERA4= <user>
##$USERA5= <user>
##$V9= 5
##$VALIST= <valist>
##$VCLIST= <CCCCCCCCCCCCCCC>
##$VD= 0
##$VDLIST= <DDDDDDDDDDDDDDD>
##$VPLIST= <PPPPPPPPPPPPPPP>
##$VTLIST= <TTTTTTTTTTTTTTT>
##$WBST= 1024
##$WBSW= 4
##$XGAIN= (0..3)
0 0 0 0 
##$XL= 0
##$YL= 0
##$YMAX_a= 504332
##$YMIN_a= -492219
##$ZGOPTNS= <>
##$ZL1= 120
##$ZL2= 120
##$ZL3= 120
##$ZL4= 120
##$ABSF1= 16.522
##$ABSF2= -4.171173
##$ABSG= 5
##$ABSL= 3
##$ALPHA= 0
##$AQORDER= 0
##$ASSFAC= 0
##$ASSFACI= 0
##$ASSFACX= 0
##$ASSWID= 0
##$AUNMP= <proc_1d>
##$AZFE= 0.1
##$AZFW= 0.1
##$BCFW= 0
##$BC_mod= 0
##$BYTORDP= 0
##$COROFFS= 0
##$CY= 12.5
##$DATMOD= 1
##$DC= 0
##$DFILT= <>
##$DTYPP= 0
##$F1P= 14.0000005364418
##$F2P= -0.99999901652339
##$FCOR= 0.5
##$FTSIZE= 32768
##$FT_mod= 6
##$GAMMA= 0
##$GB= 0
##$INTBC= 1
##$INTSCL= 1
##$ISEN= 128
##$LB= 0.3
##$LEV0= 0
##$LPBIN= 0
##$MAXI= 10000
##$MC2= 0
##$MEAN= 0
##$ME_mod= 0
##$MI= 0
##$NCOEF= 0
##$NC_proc= -2
##$NLEV= 6
##$NOISF1= 0
##$NOISF2= 0
##$NSP= 0
##$NTH_PI= 0
##$NZP= 0
##$OFFSET= 16.522
##$PC= 1
##$PHC0= -90.6531
##$PHC1= 4.618189
##$PH_mod= 1
##$PKNL= yes
##$PPARMOD= 0
##$PSCAL= 4
##$PSIGN= 0
##$REVERSE= no
##$SF= 250.13
##$SI= 32768
##$SIGF1= 0
##$SIGF2= 0
##$SINO= 400
##$SIOLD= 32768
##$SREGLST= <1H.DMSO>
##$SSB= 0
##$STSI= 32768
##$STSR= 0
##$SW_p= 5175.98343685301
##$SYMM= 0
##$S_DEV= 0
##$TDeff= 65536
##$TDoff= 0
##$TI= <Analysis number 999999
Compound Code 99
Book Reference 9
Project Code 9>
##$TILT= no
##$TM1= 0
##$TM2= 0
##$TOPLEV= 0
##$USERP1= <user>
##$USERP2= <user>
##$USERP3= <user>
##$USERP4= <user>
##$USERP5= <user>
##$WDW= 1
##$XDIM= 32768
##$YMAX_p= 382836690
##$YMIN_p= -35525
$$ End of Bruker specific parameters
$$ ---------------------------------
##NTUPLES= NMR SPECTRUM
##VAR_NAME=  FREQUENCY,     SPECTRUM/REAL,   SPECTRUM/IMAG
##SYMBOL=    X,             R,               I
##VAR_TYPE=  INDEPENDENT,   DEPENDENT,       DEPENDENT
##VAR_FORM=  AFFN,          ASDF,            ASDF
##VAR_DIM=   32768,         32768,           32768
##UNITS=     HZ,            ARBITRARY UNITS, ARBITRARY UNITS
##FACTOR=    0.157963299565203, 1,           1
##FIRST=     4132.6476996994, 0,             0
##LAST=      -1043.33573715361, 0,           0
##MIN=       -1043.33573715361, -35525,      0
##MAX=       4132.6476996994, 382836690,     0
$$ Real data points
##PAGE= N=1
##DATA TABLE= (X++(R..R)), XYDATA
$$ [...]
17362e429N380N731N3q455l811N744k927N39J037O580m091j1459l934P171O203
17347a668M852L239p873N658J2263K162o276p725L143M106M61n045r9M713r791
17332B120r447K087r76Q676o217L125K905q782r845j623q121Q080O988j256J626
17317a0660O139O01j440J24n242J218J2943K0320k375j1527R1n173q738o00N451
17302A132N095r576j2874N371J1643M475L636M928M048o098p388l79l388l1o402
17287e808L084M060L949J931o549m216L186L102j027r303p841M851M541Q356N970
17272H286j0300n512K220k613P942N755n914M437j405J250K831r640J287K734
17258A358j826m911K527o733N321J0757K83j0190q796k093L825L353J0690k47
$$ plain form
17362 -5429 -49 5682 5735 -2720 -6531 -787 -3714 -3175 -2138 4442 351 -11108 -15042 -7871 -1668
17347 -1668 3184 6423 -1450 4208 16471 18633 12357 4632 7775 11881 12342 7297 7198 11911 2120
17332 2120 -7327 -5240 -6216 2460 -3757 -632 2273 -6509 -16354 -17977 -26098 -18018 -11030 -12286 -10660
17317 -10660 -4521 -3920 -5360 -5236 -10478 -9260 3683 24003 21628 10101 10192 5019 -3719 -4319 1132
17302 1132 6227 -3349 -16223 -10852 791 5266 8902 13830 17878 11780 4392 4013 625 594 -5808
17287 -5808 -2724 1336 5285 7216 667 -3549 -363 2739 1712 -7591 -15432 -10581 -6040 2316 8286
17272 8286 -2014 -7526 -5306 -7919 23 5778 -136 4301 2896 4146 6977 -2663 -1376 1358
17258 1358 -468 -5379 -2852 -9585 -4264 6493 6776 -3414 -12210 -14303 -10478 -7125 3565 3318
17244C318r517K076k911j785K451N13m048N023J862l991k101r41L23L5r68N989
17228d672R24K414N31K624M389k937M997N256m926j3981q286m28J475J570R99
17213a0051Q185O348r4R530J5095j407j3525j1794QJ196K208j51k73p876O396
17198C795Q019J107J457Q021J169q167l927j0362k716Q501L281r720n725Q253
17184B986k346N675j244n014k964L695M00j311J129J147N85o049M306J915l410
17169e00Q279k786N032J735k936n93k657J586P270q47l225p037q650j479k860
17154i668R357K288r63L875n641Q81M56N715k456k008j670l856K777K997K853
17139D937J26l760K298M246j462K376k850l469k629R83n942n906K624O981K919
$$ plain form
17244 3318 -6199 -4123 -7034 -8819 -6368 -5855 -9903 -4880 -3018 -7009 -9110 -10051 -9728 -9693 -10661 -4672
17228 -4672 -3748 -1334 -803 1821 6210 3273 8270 13526 8600 -5381 -13667 -14095 -12620 -11050 -10051
17213 -10051 -1866 4482 4388 13918 29013 27606 14081 2287 2295 3491 5699 5548 5275 -2601 3795
17198 3795 11814 12921 14378 22399 23568 15401 11474 1112 -1604 6897 10178 458 -5267 2986
17184 2986 640 6315 5071 57 -2907 788 1188 -123 1006 2153 2738 -3311 995 2910 -500
17169 -500 7779 4993 10025 11760 8824 8231 5574 7160 14430 13583 10358 3321 -5329 -6808 -9668
17154 -9668 -311 1977 1014 4889 -752 129 585 6300 3844 1836 166 -3690 -913 2084 4937
17139 4937 5063 1303 3601 7847 6385 8761 5911 2442 -187 796 -5146 -11052 -8428 -1447 1472
17124A472O29p544q560k138J551P379L594n091j590O189M760k526O177P451n985
17109E768r278o62P650P455o197k714n806o592O514k277j39L344L540P512k34
17094G884m045r960l253J030k696l931K4j298r75J081R830M707K052j1818m386
17079a5754P962P902j668o174Q3N777m596M419P717p786L351l14l680O918K389
17064F546n320J369J055J987n494m611R78J339k752j1768J25P760k031o058P65
17049a6110Q267O848P205k956l503O246O039l865j3o604o350n856j592J45M149
17034g950O123R477K045m735m528o281p616q543P145O253J699k810J320J263Q059
17019I21R39j275k456q535J081k164M45J385k701k974N669J645j881Q318J544
$$ plain form
17124 1472 2101 -5443 -14003 -16141 -14590 -7211 -3617 -8708 -10298 -4109 651 -1875 4302 11753 5768
17109 5768 -3510 -4172 3478 10933 4736 2022 -3784 -10376 -3862 -6139 -6278 -2934 606 8118 7884
17094 7884 3839 -6121 -9374 -8344 -11040 -14971 -14947 -16245 -17220 -16139 -6309 -1602 450 -11368 -15754
17079 -15754 -7792 110 -1558 -7732 -7649 -1872 -6468 -2049 5668 -2118 1233 919 -2761 4157 6546
17064 6546 1226 2595 3650 5637 143 -4468 -3490 -2151 -4903 -16671 -16546 -8786 -10817 -16875 -16110
17049 -16110 -7843 -995 6210 3254 -249 5997 12036 8171 8158 1554 -4796 -10652 -12244 -12099 -7950
17034 -7950 -1827 7650 9695 4960 432 -5849 -13465 -22008 -14863 -8610 -6911 -9721 -8401 -7138 921
17019 921 1860 585 -1871 -10406 -9325 -11489 -11044 -9659 -12360 -15334 -9665 -8020 -9901 -1583 -39
17004c9j288K387M687J791m235J91L982l074M096K948m98l128r741L849l837P0
16988a839Q642M384k430k277j405j1281j0125N558J3349J964n834r88o45L259
16974C32q55j982N620P428p35J312j2255l538l555m571n092L744J5379P4j0157
16959h851K823N873R98J666J632q634j0650M008N294k857K550M096n209r17q83
16944i061L312j042K515m81L229J660l233L928P480q54k502k124K579J803k287
16929D922K803o191n702k683j091J619P085l558P68m892j549m700M619J0739J427
16914C616K228m95M37O12K568o764O851P058Q95p506l798L998q620m531J201l12
16898b562r60j024L917N448J4626q037j9619j65J0142L386j7534m62M757K84J2638
$$ plain form
17004 -39 -1327 1060 5747 7538 3303 3494 7476 4402 8498 11446 10948 7820 -1921 1928 -1909 -1839
16988 -1839 6803 11187 8757 6480 5075 -6206 -16331 -10773 2576 4540 -1294 -2282 -2927 332
16974 332 -523 -2505 3115 10543 9808 11120 -1135 -4673 -8228 -12799 -17891 -14147 1232 1306 -8851
16959 -8851 -6028 -155 843 2509 4141 -4493 -15143 -11135 -5841 -8698 -6148 -2052 -7261 -8178 -9061
16944 -9061 -5749 -6791 -4276 -4757 -1528 132 -3101 827 8307 7453 4951 2827 5406 7209 4922
16929 4922 7725 1534 -4168 -6851 -7942 -6323 762 -2796 -2028 -6920 -8469 -13169 -8550 2189 3616
16914 3616 5844 5349 5786 6398 8966 2202 9053 16111 17006 9500 5702 9700 1080 -3451 -2250 -2562
16898 -2562 -3522 -4546 -629 4819 19445 11408 -8211 -8376 1766 5152 -12382 -12844 -8087 -7803 4835
16883D835m043k768J473K285l562K121k077k195L15l531O786M013q737L273R324
16868G512j3207p114k521J899N700R315K571O348L562l946n918M030M177m894
16854G514r61P92l406j1244l897l587M517J908L026k839k218K338J939k553o098
16839a4769Q134P05M019L633N008N927m907r109o880l356L586J4649q557j778
16825c695J7208j410m012K835L466K222j3444r795J124q51o62M626J717M831M866
16810I026p764J26L241k985p394o776K64O387P283M095j304o487M145J800n612
16795a955m221j128n546o60J200J5K014O915l763r261l394O681R398L223m514
16780d996J768K482l079k006L385N182M402m178j990j691l750l397Q95K201N99
$$ plain form
16883 4835 792 -1976 -503 1782 -1780 341 -1736 -3931 -3616 -7147 -361 3652 -5085 -1812 7512
16868 7512 -5695 -12809 -15330 -13431 -7731 1584 4155 10503 14065 10119 4201 8231 12408 7514
16854 7514 6553 7345 3939 -7305 -11202 -14789 -10272 -8364 -5338 -8177 -10395 -8057 -6118 -8671 -14769
16839 -14769 -6635 -5930 -1911 1722 6730 12657 7750 -1359 -8239 -11595 -8009 6640 -1917 -3695
16825 -3695 13513 12103 8091 10926 14392 16614 3170 -6625 -5501 -6352 -7014 -2388 -671 4160 9026
16810 9026 1262 1388 4629 1644 -5750 -12526 -12262 -5875 1408 5503 4199 -2288 1857 3657 -1955
16795 -1955 -6176 -7304 -12850 -13510 -12310 -12295 -10281 -3366 -7129 -16390 -19784 -13103 -3705 -482 -4996
16780 -4996 -3228 -746 -3825 -5831 -2446 2736 7138 2960 970 -721 -4471 -7868 -6973 -4772 -4173
16765d173l420j0072j3977L631J1456O563Q207N282K038j992j2656m078k487N328
16751a0350K873N561N380M249k89l880k604j087K912O590N18p106M648L538p870
16736C083j1352J724J101J600j543M643j44k889L455O652O627o164p837M065k244
16721G77O442R052k562j1143o417j614j438r19K469j3641n440M542Q587N741J0540
16706D976O210N363q324r956J392R754O56k845K502K399j660Q318l766j0498n424
16691i03O173Q330R319P700p757m790M925q142j0936r042Q901l197p990p817M995
16676a0231J1993j238k320n407j881m476n44J203L113J3117l944n584J1547N083
16662A0431o216o590r688k985Q523j80m732p93N674O839J905m314O022K432j0346
$$ plain form
16765 -4173 -7593 -17665 -31642 -28011 -16555 -9992 -1785 3497 5535 3543 -9113 -13191 -15678 -10350
16751 -10350 -7477 -1916 3464 7713 7424 3544 940 -147 2765 9355 9873 2767 7415 10953 3083
16736 3083 -8269 -6545 -5444 -3844 -5387 -744 -888 -3777 -322 6330 12957 6793 -1044 3021 777
16721 777 7219 16271 13709 2566 -3851 -5465 -6903 -7822 -5353 -18994 -24434 -19892 -11305 -5564 4976
16706 4976 11186 16549 8225 -1731 -339 9415 10071 7226 9728 12127 10467 18785 15019 4521 -903
16691 -903 5270 13600 22919 30619 22862 18072 22997 14855 3919 -5123 3778 581 -7409 -15226 -10231
16676 -10231 1762 524 -1796 -7203 -9084 -13560 -14104 -12901 -9788 3329 -615 -6199 5348 10431
16662 10431 4215 -2375 -12063 -15048 -6525 -6705 -11437 -12230 -6556 283 2188 -2126 3896 6328 -4018
16647d018Q09j562R054R963m188j2431j977O98J031r159K514N397J2065J2659
16633B0855j5709j1355O010l321m915L170p274N032M218R14Q17O05p81j181m294
16618g209m124k03k751K901J289j740J924j801r241R143P495L95l583k153j357
16603a1015q58l004L661P516Q55K08n318k5j115r98M219L354j0603M304R725L618
16587D524L819J222m581j993J661J495l755n017o94O99M018Q030M09j2516j0921
16572a3600N338O655k087l50j3259p14J1137J929M194r89J672l276m497L791L811
16557b45K143M281j112n209m269o108r449P155n379O07J0946p33L215P18l441
16542f880N06M772L738P124M892o238o486J344n362K054M005P795k86J064J421
$$ plain form
16647 -4018 -3209 -4771 4283 14246 10058 -2373 -4350 -3652 -2621 -11780 -9266 -3869 8196 20855
16633 20855 5146 -6209 -199 -3520 -8435 -5265 -12539 -7507 -3289 -2375 -1558 -953 -1734 -2915 -7209
16618 -7209 -11333 -11536 -14287 -11386 -10097 -11837 -9913 -11714 -20955 -11812 -4317 -3922 -7505 -9658 -11015
16603 -11015 -11873 -14877 -11216 -3700 -2845 -2637 -7955 -7980 -9095 -10093 -5874 -2520 -13123 -8819 906 4524
16587 4524 8343 9565 4984 2991 4652 6147 2392 -2625 -3319 -2620 1398 9428 9837 -2679 -13600
16572 -13600 -8262 -1607 -3694 -4044 -17303 -18017 -6880 -4951 -757 -1746 -74 -3350 -7847 -4056 -245
16557 -245 1898 6179 5067 -142 -4411 -10519 -19968 -12813 -18192 -17585 -6639 -7372 -4157 -3439 -6880
16542 -6880 -6374 -1602 2136 9260 14152 7914 1428 2772 -2590 -536 3469 11264 10978 12042 13463
16527A3463K8m314j519M967N934m948p851n05n287N37j1173l811J0240J353j3973
16512a6859o089j465N293L63O231J3945O45k393n99k382K579J371K233p900o28
16497e655M735l857N450k252K767P859j005o703l329j867P045k718l868J0114
16483F716l622R29m102l370J709j499L426p480m220M223O777Q91q250j011P17
16468h166R211M328J965n595n309l595K504K370J027m421m949r824l923J2017
16454a2360K874M74j846L6j814O61J0107M740k136j3995O58O990o638o71J715
16439a1205j1219J738Q165R648P9m079o02J589j708r9o0R041J1774J2980o732
16424A9310j1604j3206m429M62J1538O732l199o602n078k445o686O333L794j411
$$ plain form
16527 13463 13491 9177 7658 12625 18559 13611 5760 5255 -32 505 -10668 -14479 -4239 -2886 -16859
16512 -16859 -22948 -24413 -19120 -18757 -12526 1419 2064 -329 -928 -3310 -731 640 2873 -5027 -5655
16497 -5655 -920 -4777 673 -1579 1188 9047 8042 1339 -1990 -3857 3188 470 -3398 6716
16483 6716 3094 4023 -79 -3449 -1740 -3239 187 -7293 -11513 -7290 -513 378 -7872 -8883 -8166
16468 -8166 1045 5373 7338 1743 -3566 -7161 -4657 -2287 -1260 -5681 -10630 -20454 -24377 -12360
16454 -12360 -9486 -9012 -10858 -10822 -12636 -11975 -1868 2872 736 -13259 -12601 -5611 -12249 -12920 -11205
16439 -11205 -22424 -20686 -12521 -2873 -2794 -6873 -7475 -5886 -7594 -7693 -7753 1288 13062 26042 19310
16424 19310 7706 -5500 -9929 -9467 2071 8803 5604 -998 -6076 -8521 -15207 -8874 -5080 -6491
16410f491L321o134k11J0951M398o994o910j029k278j478P411J0275L8n059K41
16395E1l790m279l765p33n889J593q90l786M641M856R665m867O41N589O116n520
16379c67J544K58j863r409P51O022l432L278P598j236m409L857j494K367L7n062
16363a560k797K385k707m358q497R59J246o228l311J40J2830q2R004Q028R30j421
16347D561l846o58R956M896k535p219j3692K822O290R55M587M066k719r121R42
16332g15j672K220O090M61L612J952k73M69n344o569k392M823L873k870O950M295
16316A4910K80p137o877l27j330j0855P484m216l946q32P187J740J131P84o791
16301h795O00O845J5314L232n317q292j098J2119o664j0718j272R122K001m349
$$ plain form
16410 -6491 -3170 -9304 -9515 1436 5834 -1160 -8070 -9099 -11377 -12855 -5444 4831 4869 -190 51
16395 51 -3739 -8018 -11783 -12516 -18405 -16812 -17702 -21488 -16847 -11991 -2326 -7193 -6552 -963 5153 -367
16379 -367 1177 1435 -428 -9837 -9086 -3064 -6496 -3218 4380 3144 -1265 2592 1098 3465 3502 -1560
16363 -1560 -4357 -1972 -4679 -9037 -17534 -16575 -15329 -21557 -24868 -24728 -11898 -11980 -2976 5052 5982 4561
16347 4561 715 57 10013 14909 12374 5155 -8537 -5715 575 1530 6117 10183 7464 -1657 -715
16332 -715 -2387 -167 5923 6384 9996 11948 11675 12144 6800 231 -2161 2662 6535 3665 10615 14910
16316 14910 15190 8053 1176 849 -481 -11336 -3852 -8068 -12014 -12846 -5659 -3919 -2788 -2004 -8795
16301 -8795 -8195 -1350 13964 17196 11879 3587 2489 14608 7944 -2774 -4046 5076 7077 2728
16287B728J316R365j946r615j058O134k30j031L580j741p619l229o025K612k451
16272i210l203J900M355L802j526L518K508N504k999o312l779J1072M518n430
16258D718o171Q536q636o258K277n30J535N671m335l443M945L333Q967R347o738
16243A3218l245m528m776q244Q578N996O717k213L111j579M206M495k51r181j4381
16228b077p647L699N982N385L440l458K562p166j615n515k556k789N125P413K960
16213C743N84M712j2518m0m309Q33q65N935N65p27l395R411Q102J471J750j0955
16197D297n769K865K195k514j373K485L575j388j071J203K84j497o933M42p15
16182c914o453J606J620l035k677K554K518J853N621M494n242k981l421k161n307
$$ plain form
16287 2728 4044 13409 11463 1848 790 6924 6694 5663 9243 7502 -117 -3346 -9371 -6759 -9210
16272 -9210 -12413 -10513 -6158 -2356 -3882 -364 2144 7648 4649 -1663 -5442 5630 10148 4718
16258 4718 -1453 7083 -1553 -7811 -5534 -6064 -4529 1142 -3193 -6636 -1691 1642 10609 19956 13218
16243 13218 9973 5445 669 -7575 1003 6999 13716 11503 14614 13035 17241 21736 21485 12304 -2077
16228 -2077 -9724 -6025 -43 5342 8782 5324 7886 720 -895 -6410 -8966 -11755 -6630 783 3743
16213 3743 4327 9039 -3479 -3519 -7828 -6995 -7860 -1925 -1360 -2087 -5482 3929 12031 13502 15252 4297
16197 4297 -1472 1393 3588 1074 -299 2186 5761 4373 3302 4505 4789 3292 -3641 -3199 -3914
16182 -3914 -10367 -8761 -7141 -10176 -12853 -10299 -7781 -5928 -307 4187 -1055 -4036 -7457 -9618 -14925
16167a4925j206M683R151M193L715k646j548n757o850k252L847o286k000L30N283
16152a2268K792o543j890R66Q124M076n803m481l697J1426R601P860m905K051
16138G309n997n950L955M585q56L420j328k525q559j0103k566M506N454P509M12
16123g34q129J772N277O650j281L286Q000k589p949j328o840p99P544O785K136
16108A1801j0374m06K572n428r585j854K283n3N574N611N867L66o502P578M812
16093A2262k265m805k914O156n604k722j654J3474J5262p949j4726j702n311m454
16079f952M952L960l065k683O414J523l928J910J77Q339m585q133q112M245N900
16064c8O901m039j2535n339o223Q708N943R468P653p316p688O006j837p249j622
$$ plain form
16167 -14925 -16131 -11448 -2297 1896 5611 2965 1417 -4340 -11190 -13442 -9595 -15881 -17881 -17551 -12268
16152 -12268 -9476 -16019 -17909 -16943 -8819 -4743 -10546 -15027 -18724 -7298 2303 10163 5258 7309
16138 7309 1312 -4638 -683 3902 3046 6466 5138 2613 -5946 -16049 -18615 -14109 -8655 -1146 -734
16123 -734 -8863 -7091 -1814 4836 3555 6841 14841 12252 4303 2975 -3865 -4664 2880 9665 11801
16108 11801 1427 1021 3593 -1835 -11420 -13274 -10991 -11044 -5470 141 6008 6374 -128 7450 12262
16093 12262 9997 5192 2278 8434 2830 108 -1546 11928 27190 19241 4515 2813 -2498 -6952
16079 -6952 -2000 1960 -1105 -3788 2626 4149 221 2131 2308 10647 6062 -2071 -10183 -5938 -38
16064 -38 6863 2824 -9711 -15050 -21273 -12565 -6622 2846 10499 3183 -4505 1501 -336 -7585 -9207
16049i207j20n05K029M627P592l536m629K821J744O338k242k20o156n829L676
16034c617K189k062O773J120o960k517N132P838N90l811J445Q172j242n078K58
16019H230m763k735m955k500M731P744J466j178k973l957N492J184l558q334j135
16004g241l657j0808O839R768k331j0568o74N187N076K334N249R521K976j97k639
15989H835j2971l213K880R317m834j4448n420M608Q03L638L45J539L601q611j438
15974a5369L607k184O238J5813N980p139q539j368M0O969M779o615n513l678j912
15959h891R363j516j988J62k030N192K984M570l521j809k864K157l72n149K774
15944i38l174K083l05M047o031m805j870O809P636r32l849M634N29K423l000o544
$$ plain form
16049 -9207 -9327 -9832 -7803 -3176 4416 880 -3749 -928 816 7154 4912 4692 -1464 -7293 -3617
16034 -3617 -1428 -3490 3283 4403 -2557 -5074 58 7896 8486 4675 6120 14292 13050 7972 8230
16019 8230 3467 732 -4223 -6723 -1992 5752 7218 6040 3067 -890 4602 5786 2228 -6106 -7241
16004 -7241 -10898 -21706 -14867 -5099 -7430 -17998 -18672 -13485 -8409 -6075 -826 8695 11671 11474 8835
15989 8835 -4136 -7349 -4469 4848 14 -14434 -19854 -15246 -14443 -10805 -10460 -8921 -5320 -13931 -15369
15974 -15369 -11762 -13946 -7708 8105 14085 6946 -1593 -2961 -2921 4048 8827 2212 -3301 -6979 -8891
15959 -8891 472 -1044 -3032 -2870 -4900 292 3276 7846 4325 2516 -348 1809 1437 -3712 -938
15944 -938 -4112 -2029 -2334 1713 -4318 -9123 -10993 -4184 3452 2520 -1329 3305 3834 6257 3257 -3287
15928c287L96o116P915N482J580k819j7912N9P230o3K464J172O395J4584M511
15913B1591q498q632j1346n967k067j402O803Q249k744r913K152O635m210O135
15899c214J505r10l915l767m777m866M322K811J012k532Q529k21k573Q80m377
15884a2093J897M163O754P928l918K243k19L353L877j366Q550j2988l590J081
15870E672o592n528p18L812l785j653O949o23m363n373J733q19J1010J2266J816
15855A3804M611k500j1151j1463K721p356m450M867N603k333j195L620J5846L006
15841A3630p497n558K585k406o833j674J546N655O755M339l671j4410j247L485
15827e301q224k953R022R391J386q957p240N76P971l189M294J485j1089l401m122
$$ plain form
15928 -3287 -2891 -9007 -1092 4390 5970 3151 -14761 -14702 -7472 -7535 -5071 -3899 2496 17080 21591
15913 21591 13093 4461 -6885 -12852 -14919 -16321 -9518 -1269 -4013 -13926 -11774 -5139 -9349 -3214
15899 -3214 -1709 -2619 -6534 -10301 -15078 -19944 -15622 -12811 -11799 -14331 -5802 -6023 -8596 -7716 -12093
15884 -12093 -10196 -6033 721 8649 4731 6974 6755 10108 13985 12619 21169 8181 4591 5672
15870 5672 -920 -6448 -7166 -3354 -7139 -8792 -1843 -2466 -6829 -12202 -10469 -11288 -278 11988 13804
15855 13804 18415 15915 4764 -6699 -3978 -11334 -15784 -10917 -5314 -7647 -8842 -5222 10624 13630
15841 13630 6133 575 3160 754 -6079 -7753 -6207 -552 6203 10542 6871 -7539 -8786 -5301
15827 -5301 -13525 -16478 -7456 1935 3321 -5636 -12876 -12300 -4329 -7518 -3224 -1739 -12828 -16229 -20351
15812b0351j975J2883J14q477J0012K614j61N197k056M835L829n322N062j1992
15798e788l367o29K084M935k012m196j597J1414L654k84n14l844J357J32j586
15783b41n765m699P318K819k338l670l750k059k129L670J432Q042N221j1717j1635
15768a9501L617K71j870K594J206M062L862o70K811M002k074k765K447J350n70
15753a228o728l985k009m691L691Q902M882N396k125Q316J176j0320j699J4682
15739A4260Q192J0727J0934j2656q405m580j1350j68k330p495l382J438m20K35
15725e000m378N595O429J217m102J1655R618p46j1188Q14L173j2503p516J661
15711e271L088Q086J451o765N280j764j0298n598o250J1329R057M846j0322j267
$$ plain form
15812 -20351 -22326 -9443 -9329 -17806 -7794 -5180 -5341 -144 -2200 2635 6464 1142 6204 -5788
15798 -5788 -9155 -9784 -7700 -2765 -4777 -8973 -10570 844 4498 4214 3700 -144 1213 1345 -241
15783 -241 -6006 -10705 -3387 -568 -2906 -6576 -10326 -12385 -14514 -10844 -9412 -1370 3851 -7866 -19501
15768 -19501 -15884 -15613 -17483 -14889 -13683 -9621 -5759 -6429 -3618 384 -1690 -4455 -2008 -658 -1228
15753 -1228 -7956 -11941 -13950 -18641 -14950 -6048 -1166 4230 2105 10421 11597 1277 -422 14260
15739 14260 22452 33179 44113 31457 23052 18472 7122 6954 4624 -2871 -6253 -4815 -5235 -5000
15725 -5000 -9378 -3783 2646 3863 -239 11416 21034 20288 9100 9914 13087 584 -6932 -5271
15711 -5271 -2183 5903 7354 589 5869 4105 -6193 -11791 -18041 -6712 2345 7191 -3131 -4398
15697d398J1738N643N101j2092p641N754K186P930q039k313R41j987r40k192K953
15682B644k162l90M24K240N8K095O35k216p816M02M112l53j498k906N227P77l217
15665a944p509O121J2086L206N280j530j215o296j1873k588K288n09M504P563
15651G584K940P080K782K818R66j0989r257j1129n894O992K730l500J1279O974
15637A1376j1290m022m7j0780K446L540N657k031Q7p450q811q663J990Q667M325
15622a5006l489L948J2038O171k823j914q36j0364l580j381n111k953J93L677
15608b1430p1j012K936l754K950N544Q452J2801P174n071p527l932l188K237j087
15593d978L626Q66n86L80J3109j449r965l124M92j342L58O512j392m013n449m617
$$ plain form
15697 -4398 7340 12983 18084 5992 -1649 4105 6291 14221 6182 3869 4810 2823 1883 -309 2644
15682 2644 482 92 516 2756 2814 4909 5544 3328 -4488 -4086 26 -327 -1825 -4731 496 1273 -1944
15665 -1944 -9453 -3332 8754 11960 17240 15710 14495 8199 -3674 -6262 -3974 -4483 21 7584
15651 7584 10524 17604 20386 23204 24170 13181 3924 -7205 -13099 -6107 -3377 -6877 4402 11376
15637 11376 86 -3936 -3983 -14763 -12317 -8777 -3120 -5151 -5064 -12514 -21325 -29988 -27998 -19331 -15006
15622 -15006 -18495 -14547 -2509 3662 839 -1075 -1911 -12275 -15855 -17236 -22347 -25300 -25107 -21430
15608 -21430 -21501 -22513 -19577 -23331 -20381 -14837 -6385 6416 13590 8519 992 -2940 -6128 -3891 -4978
15593 -4978 -1352 -486 -1072 -692 12417 10968 1003 -2121 -1629 -2971 -2613 3899 2507 -1506 -6955 -11572
15577a1572M68R80n63l723m113L111J1383P613K129j466p499l026R315K897j047
15562D887o53J929N407k387m434M042r543j5668OL267M592m261l127L565R635
15547b743o149k492J281L199M392N550j4569m072O312j619j66K212n492j596R997
15532e955K521o909j623M241M481J922k765r664k575O946M827M539K491J959P092
15517A1528r573j1653k5n503m651n846R91O692J4347k450n735n24K560J0475N517
15502F150n828m508M275j627k700j0357j631L670m332O663L272J767M468o312
15488g030K464M507m20p187l790J0272l185j211M067N392L090k524l266l764j775
15473d360m984k142J0462j079o588P465J119K904J249k967l571O604m675j675
$$ plain form
15577 -11572 -11104 -10124 -10687 -14410 -18523 -15412 -4029 3584 5713 4247 -3252 -6278 3037 5934 4887
15562 4887 4234 6163 11570 9183 4749 8791 -752 -16420 -16414 -13147 -8555 -12816 -15943 -12378 -2743
15547 -2743 -8892 -11384 -10103 -6904 -2512 3038 -11531 -15603 -9291 -10910 -11076 -8864 -14356 -15952 -5955
15532 -5955 -3434 -10343 -11966 -7725 -3244 -1322 -4087 -13751 -16326 -9380 -4553 -14 2477 4436 11528
15517 11528 1955 -9698 -9723 -15226 -19877 -25723 -24732 -18040 -3693 -6143 -11878 -12402 -9842 633 6150
15502 6150 322 -4186 89 -1538 -4238 -14595 -16226 -12556 -16888 -10225 -6953 -5186 -718 -7030
15488 -7030 -4566 -59 -479 -7666 -11456 -1184 -4369 -5580 -1513 3879 6969 4445 1179 -2585 -4360
15473 -4360 -9344 -11486 -1024 -2103 -8691 -1226 -107 2797 4046 1079 -2492 4112 -563 -2238
15459b238J3582k81m646m245n979m05J893j207o40j0262j3936L631Q387O641j896
15444a1601O285Q498L946j1419p944O33J726N377N940k493P702M17k423j516j930
15429A198pk332q63q722P20l434K354P628M391P537j278o525j689j20J798j402
15413g46O570J853L246m582q869J40J654k271j22o441p853M049K439K323n32r17
15397a0059j669o387m786P69O132K04l425m68n72K398m6O96N163P52J627J41j3729
15380b3259O587J1605O937r05p853j0626P118J428L4K919P57L972O032n191k697
15365c142J336M160l196M837n110m4J577m383Q28J0615J083m053K493N388o548
15350E841o528M640J597r204j2129N56Q747K621p513k97P407J196L49m142n726
$$ plain form
15459 -2238 11344 11063 6417 2172 -3807 -4212 -2319 -3526 -4166 -14428 -28364 -24733 -16346 -9705 -11601
15444 -11601 -5316 3182 7128 -4291 -12235 -11602 -9876 -4499 1441 -1052 6650 7067 4644 3128 1198
15429 1198 1191 -1141 -2004 -10726 -10006 -13440 -11086 -3458 933 8470 7192 667 -1022 -1142 656 -746
15413 -746 5824 7677 10923 6341 -2528 -2388 -734 -3005 -3127 -9568 -17421 -13372 -10933 -8610 -9142 -10059
15397 -10059 -11728 -18115 -22901 -22132 -16000 -15796 -19221 -19689 -20261 -17863 -17909 -17213 -12050 -11298 -9671 -9530 -23259
15380 -23259 -16672 -5067 1870 965 -6888 -17514 -10396 -8968 -8934 -6015 -5258 -1286 4746 -445 -3142
15365 -3142 -1806 2354 -842 3995 -1115 -1159 418 -3965 -3137 7478 8561 4508 7001 12389 5841
15350 5841 -687 3953 5550 -3654 -15783 -15227 -6480 -3859 -11372 -11669 -4262 -3066 -2717 -6859 -12585
15335a2585J496O062n653r27P532K712m660L755k59l038j871m50O757N920m637
15320A54q958J0153Q338K821o805o945p191j404J426R307o539K330k27k773m45
15305f758J1443M672l099K022j19m975k32J092K628m537n511n749k192N407l762
15290i670q41L348M601P438K820p214k273n327l749J901J429J0361j119p495J562
15275d228O331P506n134k179M866P01q488k264P18N20M299M623J882n926j371
15260A856l123J592m637M269J468K657O255n395o182k283Q025N743N142K573l711
15245A4249l286l69M41J412p041K694K295j427L69k416o460n79j0206l437L981
15230i780K858j667k45J0543M148l795n461k457m577l561O240J380m628M944M310
$$ plain form
15335 -12585 -11089 -5027 -10680 -11607 -4075 -1363 -6023 -2268 -2527 -5565 -7436 -7886 -1129 4791 154
15320 154 -8804 1349 9687 12508 5703 -1242 -8433 -9837 -8411 896 -5643 -3313 -3540 -6313 -6758
15305 -6758 4685 9357 6258 8280 8161 3186 2954 4046 6674 2137 -3374 -9123 -11315 -5908 -9670
15290 -9670 -10511 -7163 -2562 4876 7696 482 -1791 -7118 -10867 -8966 -7537 2824 1705 -5790 -4228
15275 -4228 2103 9609 4475 2296 7162 7863 -625 -2889 -2171 -1651 2648 7271 9153 3227 1856
15260 1856 -1267 325 -4312 -43 1425 4082 10337 4942 -1240 -3523 4502 10245 15387 17960 14249
15245 14249 10963 10594 11035 12447 5406 8100 10395 8968 9337 6921 461 -118 -10324 -13761 -9780
15230 -9780 -6922 -8589 -8834 1709 5857 2062 -3399 -5856 -10433 -13994 -7754 -6374 -11002 -6058 -1748
15215a748K27K79K222l355p360N650N337m818Q9L147n033J142K557M927j184k644
15199e65P73Q38P350N637o167m868O049jp707r8K642L017Q975R762O623j8858
15183A3402j6771p822m591N190L592R872J540o077j132n813L826M308J652j648
15169d72r801l916J2119K44n198j1308K512R858P408K840J72J681l930n741L163
15154c69N312J3217M20j1005m709m167k564m00R888N868L044n74q067n906O85
15139F73J82N214o073m984J046o77O326k175Q07J827M799N090o804j999q15p41
15123A696q175m193J2563L413o967l142K586K125q261k586M688K321p115k214
15109a3261O911l060k448j091j453j505n974L555P680P969k954J305O345L404
$$ plain form
15215 -1748 -1521 -1242 980 -2375 -9735 -4085 1252 -3566 -3477 -330 -5363 -4221 -1664 3263 2079 -565
15199 -565 208 1046 8396 14033 7866 2998 9047 9046 1339 1241 3883 6900 15875 25637 32260 13402
15183 13402 -3369 -11191 -15782 -10592 -7000 2872 4412 -1665 -2797 -8610 -4784 -476 1176 -472
15169 -472 -10273 -14189 -2070 -1826 -7024 -18332 -15820 -5962 1446 4286 4458 6139 2209 -3532 -369
15154 -369 4943 18160 18580 7575 2866 -1301 -3865 -4265 5623 11491 14535 13961 5894 -12 673
15139 673 855 6069 -4 -4988 -3942 -4619 1707 -468 339 2166 6965 12055 5251 3252 2437 1696
15123 1696 -6479 -10672 1891 5304 -1663 -4805 -2219 -94 -8355 -10941 -6253 -3932 -11047 -13261
15109 -13261 -6350 -9410 -11858 -12949 -14402 -15907 -21881 -18326 -10646 -2677 -5631 -4326 2019 5423
15095E423j3283j2105J59M999J0521J1082j642o457K290K23K791o492J157J277
15081e7n778q884l813M358L460k573Q959J0242j461J70k197j3131j2646M515L595
15066a5241k669J618R09j713N28n74R443J0658j306n941Q422M880r303r441o981
15051a6711Q645J0651o656k926K059J407P589K716p199L996L689l588q465n178
15037i971j192j655k30N356M65M947K30p117M249m086m45K839J2099o804n885
15022g200o114M064K450r55J16K924N878P90L583l220k106j748Q6M447j776j530
15006c11k551j848K182M033M537q66N91l797j0248J077L22r039K452k20j677L131
14990a2232Q031k83L970N06M266L450n305j059q12p088r577J949K21m379K355
$$ plain form
15095 5423 -7860 -19965 -19806 -14807 -4286 6796 5154 -1303 987 1210 4001 -2491 -1334 -57
15081 -57 -5835 -14719 -18532 -14174 -10714 -13287 -4328 5914 4453 4623 2426 -10705 -23351 -18836 -15241
15066 -15241 -17910 -16292 -15383 -17096 -16568 -17142 -7699 2959 1653 -4288 4134 9014 -289 -9730 -16711
15051 -16711 -8066 2585 -4071 -6997 -4938 -3531 4058 6774 -425 3571 7260 3672 -4793 -9971
15037 -9971 -11163 -12818 -13048 -7692 -7227 -2280 -2050 -9167 -4918 -9004 -9449 -6610 5489 -1315 -7200
15022 -7200 -13314 -9250 -6800 -7755 -7639 -4715 1163 1953 5536 2316 210 -1538 -1452 2995 1219 -311
15006 -311 -2862 -4710 -2528 1505 6042 5176 5767 1970 -8278 -7201 -6879 -15918 -13466 -13686 -15363 -12232
14990 -12232 -4201 -4484 -514 -8 4258 7708 2403 1344 532 -6556 -16133 -14184 -13963 -18342 -15987
14975a5987J907k122O40O141R369n763K342O417K324k362k657r018j70P899p85
14960a825o488K155J71q33N358M752m206q441P31n466o458L955M213N529M584
14945b269o181m871R275o6k706N482Q384M802K20j0987q888K476K0433l671j2790
14930a357n373K016L333n371l499O072J3061J687m151L466L288n69r151m836K767
14915A383R54j121K630M523R064J661p4j1805M22k098l204j081l469N958j00p063
14899c420m175j616n798J5371O129n802K908o491m926Q504K372L508l34o312j0140
14884a0222L072K724Q007M286j0862P641j023l734n59o176P84J912j096l512m2
14869h800N929K388Q30p112p087L216M906N895k104j432n806n830L864Q748N657
$$ plain form
14975 -15987 -14080 -16202 -15562 -9421 -52 -5815 -3473 2944 5268 2906 249 -8769 -8939 -1040 -1825
14960 -1825 -8313 -6158 -5987 -6820 -1462 3290 -916 -9357 -8626 -14092 -20550 -16595 -12382 -6853 -2269
14945 -2269 -8450 -13321 -4046 -4112 -6818 -1336 7048 11850 12070 1083 -7805 -5329 15104 11433 -1357
14930 -1357 -6730 -4714 -1381 -6752 -10251 -4179 8882 10569 6418 9884 13172 12603 3452 -1384 1383
14915 1383 2337 1216 3846 8369 17433 19094 19020 7215 7637 5539 2335 1254 -2215 3743 3643 -3420
14899 -3420 -7595 -9211 -15009 362 6491 689 3597 -2894 -7820 684 3056 6564 6230 -82 -10222
14884 -10222 -7150 -4426 3581 7867 -2995 4646 3623 -111 -670 -6846 -6062 -4150 -5246 -8758 -8800
14869 -8800 -2871 -483 347 -6765 -13852 -10636 -5730 165 -1939 -3371 -9177 -15007 -11143 -2395 3262
14854C262L787k993j713n226L937P956j807l337q647M210M852l274J237p892l029
14839h677J3423n084P320P050k697j0775n274J909n406k575L542j279K678J1953
14825F108k784J191n462j4734k851j56J609P47L691O524L278j2977k110Q330m507
14810a4103K402Q381n357m46R416k279m256j606O486m367n203O604R534N570n262
14795E514j0726K879K163J888M276p404r259q603J905J732m69J878J653P422L832
14780a319K649m729l060J563M175L451m905r00L730M41m167m895m085K569l226
14765a2708p020j925J0708N607k513L209M807m212n991O54N745O479K131n558
14751e87j519N53J639k551k864J150J627j79k820O933N545o673j1272j148J484
$$ plain form
14854 3262 7049 4056 2343 -2883 1054 9010 7203 3866 -4781 -571 4281 1007 2244 -5648 -8677
14839 -8677 4746 -338 6982 14032 11335 560 -4714 -2805 -8211 -10786 -7244 -8523 -5845 6108
14825 6108 3324 4515 -947 -15681 -18532 -18688 -17079 -16332 -12641 -6117 -2839 -15816 -17926 -9596 -14103
14810 -14103 -11701 -3320 -8677 -9123 293 -1986 -6242 -7848 -1362 -5729 -10932 -4328 5206 10776 5514
14795 5514 -5212 -2333 -170 1718 5994 -1410 -10669 -19272 -17367 -15635 -16104 -14226 -12573 -5151 -1319
14780 -1319 1330 -3399 -6459 -4896 -721 2730 -2175 -3075 655 1096 -3071 -7966 -12051 -9482 -12708
14765 -12708 -19728 -21653 -10945 -5338 -7851 -4642 165 -4047 -10038 -9384 -3639 2840 4971 -587
14751 -587 -2106 -1553 86 -2465 -5329 -4179 -2552 -2731 -5551 1382 6927 254 -11018 -12166 -10682
14736a0682R69J16l66K726J248m832o856O727Q594o005Q642L701l329J608M265
14721F526J033O37j0895j4816O583J0928m263q98K575P681M359J968q275j3424
14707a0281O014l472K856q20n631N723o48n957K098M688m61l390L891K430l719
14692f679M212M001l333j1782r306j235J2692R310j1932o411J0674M515J33l83
14678e524k937l541J353O116o611n231k684P411J1486j622n617L322P63J179N750
14663C613J2258l60o432o962M52M36o564j96j290j262k211O600M515p73j433p234
14647f843l378O126J745l9j371J152J923k627O67k984J18J1320O11k928o592K647
14631d53J964M302M230k514R03p002M740l514l726m006o35K887n626N781J4649
$$ plain form
14736 -10682 -9713 -9597 -9963 -7237 -5989 -10821 -17677 -10950 -2356 -8361 281 3982 653 2261 6526
14721 6526 7559 8196 -2699 -17515 -10932 -4 -4267 -5165 -2590 5091 9450 11418 3143 -10281
14707 -10281 -4267 -7739 -4883 -5703 -11334 -5611 -6259 -12216 -10118 -5430 -5891 -9281 -5390 -2960 -6679
14692 -6679 -2467 1534 -1799 -13581 -22887 -24122 -11430 -2120 -14052 -20463 -9789 -5274 -5141 -5524
14678 -5524 -8461 -12002 -10649 -4533 -11144 -16375 -19059 -11648 -162 -1784 -7401 -4079 -3316 -2137 3613
14663 3613 15871 15511 9079 2117 2569 3005 -3559 -3755 -5045 -6307 -8518 -1918 2597 1824 391 -6843
14647 -6843 -10221 -4095 -2350 -2389 -3760 -2608 -685 -3312 -2645 -5629 -5511 5809 6420 3492 -3100 -453
14631 -453 1511 5813 10043 7529 8432 1430 6170 2656 -1070 -5076 -5711 -2824 -8450 -2669 11980
14616A1980K394q078r150n877K883j691k576R767N310r636n23L441N94r51m363
14601f476r66O715j430Q38K524N210k010l379p718O660l113j3495J0232j262j0354
14586a8024k578k01J027L963N530Q266j130k185M152J240k734m077J981M792M946
14571D968m178j925Q754n792j5852m044k572K514J1192Q78j503n19n113n588P418
14556a1362N017O617M12n690l834L334K983q06K987P287O040j1698n935j1333
14542a5981K048R958J25j616M793O249M250q055p739R6L012L832rn47j43m728
14526d455J390n039j717Q836N421r346l958j162m157L137L557R619j710j921j826
14511c331o571j0152o728K491J2729Q109k82m219O409J1118l322j5112k201K102
$$ plain form
14616 11980 14374 6296 -2854 -8731 -5848 -7539 -10115 -348 4962 -4674 -5197 -1756 -1162 -2113 -6476
14601 -6476 -7442 -727 -2157 -1319 1205 6415 4405 1026 -6692 -32 -3145 -16640 -6408 -7670 -18024
14586 -18024 -20602 -20803 -19776 -15813 -10283 -2017 -3147 -5332 -1180 60 -2674 -6751 -4770 22 4968
14571 4968 790 -1135 7619 1827 -14025 -18069 -20641 -18127 -6935 -6057 -7560 -8079 -13192 -18780 -11362
14556 -11362 -6345 272 684 -5006 -8840 -5506 -2523 -3329 -342 6945 12985 1287 -4648 -15981
14542 -15981 -13933 -3975 -3850 -5466 -673 5576 9826 1771 -5968 -5872 -2860 972 963 416 273 -4455
14526 -4455 -3065 -8104 -9821 -985 4436 -4910 -8868 -10030 -14187 -11050 -7493 2126 416 -1505 -3331
14511 -3331 -9902 -20054 -26782 -24291 -11562 -3453 -3735 -7954 -1545 9573 6251 -8861 -11062 -8960
14497h960O011K371n492k199K312r1j24L974K222J415N211R701p973j7509J050
14482h081J0009k294L642L834k067n530J530P65k663o489k056O017o35l086q60
14467g964K578K348j376J570J24m31m285P70N535M778n152j1228q186L916J2596
14452d407J2643l274o381J226K745j055j1716M52Q487L210J648J27J542m906k595
14437b254k386n385L766M670L363J1469k355k362j674k370m162l073j5237k400
14423b0390K2910Q789l030n410K503k544J446K696j312N922r854K683M885J648
14409A0942j2102j0738o107p56K844R466K10j535R36n12J5446O997j006M209q294
14394A0000p213n169k074k580J775M166n685l3j420m657O61Q511R905O938n212
$$ plain form
14497 -8960 -2949 -578 -6070 -8269 -5957 -6048 -6172 -2198 24 1439 6650 16351 8378 -9131 -8081
14482 -8081 1928 -366 3276 7110 5043 -487 1043 1808 -855 -7344 -9400 -3383 -4018 -7104 -7964
14467 -7964 -5386 -3038 -4414 -2844 -2720 -3151 -7436 -6666 -1131 3647 -1505 -12733 -20919 -17003 -4407
14452 -4407 8236 4962 -1419 -193 2552 1497 -10219 -9767 -1280 1930 3578 3705 5247 341 -2254
14437 -2254 -4640 -10025 -6259 -1589 1774 13243 10888 8526 6852 4482 320 -2753 -17990 -20390
14423 -20390 2520 11309 8279 2869 5372 2828 4274 6970 5658 11580 1726 4409 9294 10942
14409 10942 -1160 -11898 -18005 -18761 -15917 -6451 -6241 -7776 -6840 -7352 8094 15091 14085 18294 10000
14394 10000 2787 -2382 -4456 -7036 -5261 -1095 -6780 -6813 -8233 -12890 -12229 -3718 6187 13125 7913
14379G913p983O380Q532j433n16Q180O77p429R73j189J31o303q945Q832R97n377
14363C440k680m33r273l785M148P082k325M134J358P996j157r029l026J191j120
14348c479o80n394r436L174J0792j573O593o90p15p95K147K653o492Q072N598
14333I775J109M952L879j8726j3494K95O943K651L787J653n502n444L759J067
14319c296K055K218O45N126J993J157M210q320j008K304O752l4j791k678l622
14304E711k000r45R38m84q915o717R002P743m63J688L937l913l219L01l260o01
14288a197L780n935N727P325K384N224J788p661p502k997l933j202M317K30l057
14273b709j0333K707L838n082M476K617m684O99K414K268J7O42O72k470O048K973
$$ plain form
14379 7913 -70 6310 14842 13409 12893 21073 21750 14321 15294 14105 14236 7933 -1012 7820 8817 3440
14363 3440 760 327 -8946 -12731 -8583 -1501 -3826 308 1666 9662 8505 -524 -3550 -2359 -3479
14348 -3479 -4159 -9553 -18989 -15815 -5023 -6596 -3 -693 -1408 -2203 -56 2597 -3895 4177 9775
14333 9775 10884 15836 19715 989 -12505 -12210 -5267 -2616 1171 2824 -2678 -8122 -4363 -3296
14319 -3296 -1241 977 1622 6748 8741 9898 14108 5788 4780 7084 13836 13802 12011 9333 5711
14304 5711 3711 2766 3704 3220 -5695 -12412 -3410 4333 3870 5558 9495 5582 2363 2664 -596 -1197
14288 -1197 2583 -3352 2375 9700 12084 17308 19096 11435 3933 936 -2997 -4199 118 348 -2709
14273 -2709 -13042 -10335 -6497 -11579 -7103 -4486 -9170 -8471 -6057 -3789 -3772 -3130 -2458 -4928 1120 4093
14257D093k089M658l531q092j955M786k943J790O792m699r653Q071R81n719J253
14242f257r69k178K442M075L712K970l965n131K311R022P99n074N524K702R308
14227A9291j843p298j0227m082L204Q757L234j447j6041q827R168L673k963m401
14213i802j393O178P894k610M029L073K461k51r029K45R000L964j1767q902N820
14198a090M23p534K543L357n930k567O118Q57n737P325n479J429L175O683M758
14183H331Q05K589o915q146L86J498k345j195P12k909k614k456O16L958P269k377
14167b793p148o284L587N063N65j1257N185J642K074J0011P638k873K243k74l066
14152D313l804l123j0578L1N548L427l007k549P872M624j664m732m337Q515Q806
$$ plain form
14257 4093 2004 6662 3131 -4961 -6916 -2130 -5073 -3283 3509 -1190 -10843 -2772 -1791 -7510 -6257
14242 -6257 -7226 -9404 -6962 -2887 825 3795 -170 -5301 -2990 6032 6831 1757 7281 9983 19291
14227 19291 17448 10150 -77 -4159 -955 7802 11036 9589 -6452 -15279 -6111 -2438 -5401 -9802
14213 -9802 -11195 -5017 2877 267 4296 7369 9830 9579 550 795 9795 13759 1992 -6910 -1090
14198 -1090 -667 -8201 -5658 -2301 -8231 -10798 -4680 -3823 -9560 -2235 -7714 -6285 -3110 3573 8331
14183 8331 9136 11725 4810 -3336 -2950 -1452 -3797 -4992 -4280 -7189 -9803 -12259 -11643 -7685 -416 -2793
14167 -2793 -9941 -16225 -12638 -7575 -7010 -18267 -13082 -11440 -9366 645 8283 5410 7653 7379 4313
14152 4313 509 -2614 -13192 -13161 -7613 -4186 -7193 -9742 -1870 2754 1090 -3642 -7979 536 9342
14137I342l298k595j150k712q82j027j0628O656o84m039L302Q325j0296J2724
14123C038J134p635m361J063M832j048J457q765J88j47r993M170J4492R615L878
14108A1918r979j2971J118N361k780k209O204M856j394n762q670L318R527p81
14094b244j831j210o94O34K501p689l195O003K662N444L557m588q855n711l238
14079a8454Q458O085l010o368M800M412O079j155l027l247l799l370j60Q446K205
14064b105N661J250n447n534k506n43k180Q71N057N027j214j967P22L585J14L587
14048D378L472k185k104L83p503m250n228j38K175M462k523R87N334o840m411
14033a3991N203j643R17r74j174j163l508j218L772k49P739N122L340L713m914
$$ plain form
14137 9342 6044 3449 2299 -413 -1295 -2322 -12950 -6294 -6978 -11017 -7715 610 -9686 3038
14123 3038 4172 -3463 -7824 -6761 -1929 -2977 -1520 -10285 -10097 -10244 -20237 -16067 -1575 8040 11918
14108 11918 1939 -11032 -9914 -4553 -7333 -9542 -3338 1518 124 -5638 -14308 -10990 -1463 -2244
14094 -2244 -4075 -5285 -5979 -5345 -2844 -10533 -13728 -7725 -5063 381 3938 -650 -9505 -15216 -18454
14079 -18454 -9996 -3911 -6921 -13289 -8489 -4077 2002 847 -2180 -5427 -9226 -12596 -12756 -4310 -2105
14064 -2105 3556 4806 -641 -6175 -8681 -9224 -11404 -10533 -5476 -449 -1663 -3630 -2908 677 791 4378
14048 4378 7850 5665 3561 3944 -3559 -7809 -13037 -13175 -11000 -6538 -9061 -8074 -2740 -9580 -13991
14033 -13991 -8788 -10431 -9514 -10488 -11662 -12825 -16333 -17551 -13779 -14028 -6289 -1167 2173 5886 972
14018I72r320m919K473K989P151J958j1223M695o04L58j671op81k706K754J33
14002g747l06k943m224K118j777m19P983Q948m802o714l669L291L307j490k267
13987a0711p603p005M262R065Q157Q680m80J483l754l22j974o661k553J1026R577
13972A1187P315n138k216p127N86l710j1073P589P745l396L23J087l338q192k994
13957a1352Q09O821N087r037q7m135o413p09l945L964J8980J3241J125n021l953
13942E375j989J2895L267m759n495p026l599L447L36j215kl830l979L0p28P43
13926f529J499j762M750K599k393m195N910O840m474p978L139L45J469O622k79
13911E563m702m834m812K489K630l869J637O127p402n079L174j364L051l381o019
$$ plain form
14018 972 -8348 -13267 -10794 -7805 -654 1304 -9919 -5224 -5828 -5470 -7141 -7147 -7928 -10634 -7880 -7747
14002 -7747 -8053 -10996 -15220 -13102 -14879 -15298 -7315 1633 -3169 -9883 -13552 -10261 -6954 -8444 -10711
13987 -10711 -18314 -25319 -21057 -11992 -3835 4845 4365 5848 2094 1772 -202 -6863 -9416 1610 11187
13972 11187 18502 13364 11148 4021 4607 897 -10176 -2587 5158 1762 2085 3172 -166 -8358 -11352
13957 -11352 -10543 -3722 1365 -7672 -7759 -11894 -18307 -19016 -22961 -18997 -17 13224 14349 9328 5375
13942 5375 3386 16281 19548 14789 9294 2268 -1331 2116 2452 1237 1235 -2595 -6574 -6544 -7272 -6529
13926 -6529 -5030 -6792 -2042 557 -1836 -6031 -121 6719 2245 -5733 -2594 -2249 -780 5842 5563
13911 5563 861 -3973 -8785 -6296 -3666 -7535 -5898 229 -7173 -12252 -9078 -10442 -7391 -10772 -16791
13896a6791o528r019J2026J2720O937N833N859j219p409o793l650N666j566M403
13882D69J64o743M561L31K617q97Q6O101m558o285r004P322m78P988O950P63l619
13865E768m759j525m485p01N959L690K380k369q81Q419m727m831K949L577o17
13850G847O175k617M576M576L501j437r297p405q846R86N22L459R05o425L649
13835A69M844J124m102m03N560K642K320J35k432N20k502j0781p493m902p236
13820b2537M761R691R539R279m505l230r355J667k480J578k30M758j618m630J455
13805e857K644L364J543N767O67p336r850K337M791P413k393p289j281L647P073
13790E240j47j586M99Q843n465n25o437m875O468l429L0N209J093K017K043j129
$$ plain form
13896 -16791 -23319 -32338 -20312 -7592 -655 5178 11037 9818 2409 -4384 -8034 -2368 -3934 469
13882 469 633 -6110 -1549 -1218 1399 502 588 6689 2131 -4154 -13158 -5836 -6314 1674 8624 9387 5768
13865 5768 1009 -516 -5001 -5702 257 3947 6327 3958 3077 11496 6769 1938 4887 8464 7847
13850 7847 14022 11405 15981 20557 24058 22621 13324 5919 -2927 -1941 -1419 2040 2945 -3480 169
13835 169 5013 6137 2035 1632 7192 9834 12154 12289 9857 10377 7875 -2906 -10399 -15301 -22537
13820 -22537 -17776 -8085 1454 10733 6228 2998 -6357 -4690 -7170 -5592 -5822 -1064 -2682 -7312 -5857
13805 -5857 -3213 151 1694 7461 8128 792 -9058 -6721 -1930 5483 3090 -4199 -5480 -1833 5240
13790 5240 5093 3507 4006 12849 7384 6859 422 -4453 2015 -1414 -1384 3825 4918 6935 8978 7849
13774G849o922o696j1931l584J3326P670j591j226J346p026l251L216N881l626
13760f565l269J010M540J982L452k298L43O31j900L732O276n709j0318n858M577
13745i374l88N232M320n43p866K287K002N988J3795j452p418m78Q7q49K737o071
13729B009p915m571K319K261n875Q341M214l344r02p066J1535N359j592q691N617
13714A699Q927L339j814M853k572N05p88j185l269j1418j2938k265M229O732M846
13699a119k228M3j180J880n063M546J235M443o345n687O238J3049q194j0426j249
13684a0057K182P285M281l425L128n063p42M858k084r936K653N183j399l870n062
13669a2068k868j368J2383J2766N86o922r373k63M289K307j655l650j0243R37
$$ plain form
13774 7849 927 -5769 -17700 -21284 -7958 -288 -1879 -3105 -1759 -8785 -12036 -8820 -2939 -6565
13760 -6565 -9834 -8824 -4284 -2302 1150 -1148 -805 -174 -2074 1658 7934 2225 -8093 -13951 -9374
13745 -9374 -9762 -4530 -210 -753 -8619 -6332 -4330 1658 15453 14001 6583 6105 6192 5343 8080 2009
13729 2009 -5906 -10477 -8158 -5897 -11772 -3431 783 -2561 -3463 -10529 1006 6365 4773 -3918 1699
13714 1699 10626 13965 12151 17004 14432 14937 14149 12964 9695 -1723 -14661 -16926 -12697 -5965 -1119
13699 -1119 -3347 -3304 -4484 -2604 -7667 -3121 -1886 2557 -3788 -9475 -3237 9812 1618 -8808 -10057
13684 -10057 -7875 -590 3691 266 3394 -1669 -2411 2447 363 -9573 -6920 -1737 -3136 -7006 -12068
13669 -12068 -14936 -16304 -3921 8845 9431 2509 -6864 -7127 -2838 -531 -2186 -5836 -16079 -15142
13655a5142J718O27l666k503K745O501P900J3349l513k477l495o005J157n013
13641g817k52K400K896R122o397m342L708P772N000n339p251m386O142R24n720
13626c540l36P66M941O997P671m401p325r424q466m27O720P851o250j430K350
13611d303j1536p044J5410J4242J128n169O320P058M411o447j6145m074J1263
13598E114L193r991n053P473L363Q275p213q083M263J043m917O27PK336J023l142
13582a682L312j504N40l803o707l103q012Q735R645O214l217l071k871P004n311
13567c831r636n603l468o65n403O727J3780M948P601n077m048M600J75p15l798
13552d413r904j534p07k988J4216J0955J0244k731p648j15P66N327m912l776K92
$$ plain form
13655 -15142 -13424 -12797 -16463 -18966 -16221 -9720 -1820 11529 8016 5539 2044 -3961 -2804 -7817
13641 -7817 -8069 -5669 -2773 6349 -48 -4390 -682 7090 12090 6751 -500 -4886 1256 2180 -3540
13626 -3540 -3876 -3110 1831 8828 16499 12098 4773 -4651 -13117 -13544 -6824 1027 -5223 -6653 -4303
13611 -4303 -15839 -22883 -7473 6769 7897 2728 9048 16106 20517 14070 -2075 -6149 5114
13598 5114 8307 -1684 -6737 736 4099 12374 5161 -2922 1341 2384 -2533 -1906 -1899 437 1460 -1682
13582 -1682 1630 126 666 -3137 -9844 -12947 -20959 -12224 -2579 3635 418 -2653 -5524 1480 -3831
13567 -3831 -13467 -19070 -22538 -23203 -28606 -21879 -8099 -3151 4450 -627 -4675 -75 100 -615 -4413
13552 -4413 -14317 -15851 -16558 -19546 -5330 5625 15869 13138 5490 5375 6141 11468 6556 2780 3072
13537C072m674k683j480r308Q544M144P082O197j783j076K489l926l971m374O004
13522D257J0436l798q761p869K11R855J596j1727K462m643j581J592J327K140
13508d503p03N03o702L1k519N684k824N642J4186L623q273l725j0758M143N483
13493g12M332L865M973K608k322j519j2639K857j717R51Q398q675o09K118j5167
13478a3258p702QN350J0831P994j176n309n611j053M689j939n367j724O354O866
13463a047p407p617M813R551m500J333p37o636P677l49R04J348m335J0327M896
13448H221K063L911M482j1884p309k557m156m895l751L809N240K644Nn28k375
13433g080j085N816p514q419P016J930j919M138K121l599k172l630n796j428l1
$$ plain form
13537 3072 -1602 -4285 -5765 -15073 -6529 -2385 4697 10894 9111 8035 10524 6598 2627 -1747 4257
13522 4257 14693 10895 2134 -5735 -5524 4331 5927 -5800 -3338 -7981 -9562 -7970 -6643 -4503
13508 -4503 -5206 -4703 -11405 -11374 -13893 -8209 -11033 -5391 8795 12418 4145 420 -10338 -6195 -712
13493 -712 3620 7485 12458 15066 12744 11225 -1414 1443 -274 677 9075 400 -209 1909 -13258
13478 -13258 -20960 -20952 -15602 -4771 3223 2047 -3262 -8873 -9926 -5237 -7176 -12543 -14267 -7913 -1047
13463 -1047 -8454 -16071 -11258 -1707 -6207 -4874 -5611 -12247 -4570 -4919 -4015 -2667 -7002 3325 8221
13448 8221 10284 14195 18677 6793 -516 -3073 -7229 -12124 -15875 -12066 -6826 -4182 -4177 -4705 -7080
13433 -7080 -8165 -2349 -9863 -18282 -11266 -9336 -11255 -7117 -4996 -8595 -10767 -14397 -20193 -21621 -21652
13418b1652J0035k49P460L858j601N820n648j723L314Q954o306j324K343k973
13404C08N569p46j572k183k502J865o239K853P540j511l792J920M144J394k055
13389D993J379n254q38M558N962N68q849m239k385n144o727M744P544K068J774
13374A54K094l05N296l478n105L361J773l334K976p182k332L598J831R27m09p43
13358h78n35Q923N322K102p431r027j175N130n73r127J68R82K340M043O445l814
13342B895p564k136l526k97O325q50L025j193m716k395K221O997j088m110P833
13327A421Q130J386mJ2141l451j4710j0256m174n279o67O028j912l445R677N133
13312A8P47p7O601j050j3791o526Q990K392n503m841M182K195m389n185Q666R1
$$ plain form
13418 -21652 -11617 -11866 -4406 -548 -2149 3671 -1977 -3700 -386 8568 2262 938 3281 308
13404 308 5877 5131 3559 1376 -1126 739 -5500 -2647 4893 3382 -410 1510 5654 7048 4993
13389 4993 6372 1118 280 4838 10800 11368 2519 -1720 -4105 -9249 -15976 -11232 -3688 -1620 154
13374 154 2248 1943 7239 3761 -1344 2017 3790 456 3432 -3750 -6082 -2484 -653 274 -135 -878
13358 -878 -1413 7510 12832 14934 7503 -1524 -2699 2431 1858 -7269 -7101 -6119 -3779 264 6709 2895
13342 2895 -4669 -6805 -10331 -10628 -4303 -5153 -2128 -3321 -8037 -10432 -8211 -1214 -2302 -6412 1421
13327 1421 9551 10937 10933 23074 19623 4913 -5343 -9517 -14796 -15463 -9435 -11347 -14792 -5115 18
13312 18 765 688 7289 6239 -7552 -14078 -5088 -2696 -8199 -13040 -8858 -6663 -11052 -16237 -7571 -7480
13296g480k136L402L763r27p5L072K357R946l131j5189q91R359O638o037n593
13281b922k354n024p549L841L577Q367J741L448N137p68q521o056l668R504o909
13266h156P31J48M509k906k285K058J601l66J079J118o246o57L668l17L532L276
13250G87M312k568J000m971l919q81n164n145M223O068K406j30Q77N909N407o407
13234A804o095n83K651J375o355K922o45r83o01j0666j320N329P642j419m988
13219a1932Q759K791K517o77p048j0219L68R291O237O030l70L251n415m904M20
13204i01o126K347l635j341J079P597O968Q233j301j1236o93O92P190P78o866
13189B785m661J087J013q154R30N521L110L781j355l719n447K48K704N158m006
$$ plain form
13296 -7480 -9616 -6214 -2451 -3378 -3453 -381 1976 11922 8791 -6398 -7289 2070 8708 2671 -2922
13281 -2922 -5276 -10300 -17849 -14008 -10431 -2064 -323 3125 8262 7494 -1027 -7083 -10751 -1247 -8156
13266 -8156 -7425 -7277 -2768 -5674 -7959 -5901 -4300 -4666 -3587 -2469 -8715 -9372 -5704 -6021 -2489 787
13250 787 5099 2531 3531 -1440 -5359 -6240 -11404 -16549 -12326 -6258 -3852 -3982 -3105 2804 8211 1804
13234 1804 -4291 -4874 -2223 -848 -7203 -4281 -4926 -5909 -6510 -17176 -18496 -13167 -5525 -6944 -11932
13219 -11932 -3173 -382 2135 1458 -5590 -15809 -15441 -6150 87 6117 5747 8998 3583 -1321 -901
13204 -901 -7027 -4680 -8315 -9656 -8577 -980 5988 14221 12920 1684 991 1683 8873 9651 2785
13189 2785 -1876 -789 224 -7930 -7000 -1479 1631 5412 4057 338 -5109 -4861 -2157 3001 -1005
13174a005l797k612k354R4o350o339R119R438L12N716K896p048n987N535J772
13159f10L58L085L182N25O211l173o644j4072p193Q841Q284J062K521l877p960
13144i460J082Q2n758n030L089K430j057l165j42M020O254k189l150J1639L678
13129B323k377n289L914J858l938m418p507K094k921m342j014M947J18k925o765
13114b6242k729N951J4467J217J062P176N314K64k122j323p77P51n504j294L897
13099A08j057r492l174R040N586p672K480k665j903M133O722J001m767o200J425
13084f435K601j0631j667n03Q132M599R000N257n244O65M273J79l859n928J522
13069A961K888N61l429j1691j22k527j639R864m503p133l503K898J1108Q42p034
$$ plain form
13174 -1005 -4802 -7414 -9768 -9674 -16024 -22363 -13244 -3806 -3494 2222 5118 -1930 -7917 -2382 -610
13159 -610 -252 2833 6015 6540 12751 9578 2934 -11138 -18331 -9490 -1206 -144 2377 -1500 -9460
13144 -9460 -8378 -8296 -14054 -19084 -15995 -13565 -14622 -17787 -17929 -13909 -7655 -9844 -12994 -1355 2323
13129 2323 -54 -5343 -1429 429 -3509 -7927 -15434 -13340 -16261 -20603 -21617 -16670 -16552 -19477 -26242
13114 -26242 -28971 -23020 -8553 -7336 -6274 902 6216 6480 4358 3035 2258 3009 -2495 -3789 108
13099 108 -949 -10441 -13615 -4575 1011 -6661 -4181 -6846 -8749 -4616 2106 3107 -1660 -7860 -6435
13084 -6435 -3834 -14465 -16132 -16635 -8503 -3904 5096 10353 5109 5774 10047 10226 6367 439 1961
13069 1961 4849 5410 1981 -9710 -9832 -12359 -13998 -4134 -8637 -15770 -19273 -16375 -5267 -4425 -11459
13054a1459Q46n31j231j83J107l4N20O78k496J187K432O65m190P79o095j055P994
13037a1066N405k027L43j981p973r688o21j102N342O781M955J4976n617n709Q19
13022g163M675k791Q26Q998K783O380K40M898m861q11M408j0047p448O889P050
13007A4026m361l328j121p123O161R892o29j1681n923n883N862r416k867L029
12993a3362J1668O389p920l178j013P60K999P098J93m447m770k660J3601k628
12979B730r053M655J227k295J605J0958n69O390m218l525Q251O43k941n979l340
12964D539p979K386J3025J65k065n187n519r202J03J1403l872m768J0824q637
12950d784j2214Q597R631l722k997J0016j064j456l576l628l157k947j041K062
$$ plain form
13054 -11459 -10613 -11144 -12375 -12558 -11451 -11485 -10965 -10287 -12783 -11596 -9164 -8499 -12689 -11910 -18005 -19060 -11066
13037 -11066 -5661 -7688 -7345 -9326 -17299 -26987 -27608 -28710 -23368 -16587 -11632 3344 -2273 -7982 -7163
13022 -7163 -2488 -5279 -4453 4545 7328 13708 13948 18846 13985 13174 17582 7535 87 6976 14026
13007 14026 9665 6337 5216 -1907 4254 14146 13517 1836 -4087 -9970 -4108 -13524 -16391 -13362
12993 -13362 -1694 4695 -3225 -6403 -7416 -6656 -3657 3441 3634 -813 -5583 -8243 5358 2730
12979 2730 -6323 -1668 -441 -2736 -1131 9827 9258 15648 11430 7905 16156 16799 13858 7879 4539
12964 4539 -3440 -1054 11971 12136 10071 4884 -635 -9837 -9734 1669 -2203 -6971 3853 -4784
12950 -4784 -16998 -8401 1230 -2492 -5489 4527 3463 2007 -1569 -5197 -8354 -11301 -12342 -10280
12936a0280L921p6J821L105l275j70o433k597L87J1291Q233k664p869p921N018
12921g509K408J937L372J4893p700O19P565O63m348n625m370j1861J751L004O899
12906A698n791l056P19o79N446o499P84n784J300J19M879N746r94m587j5512N901
12890a6310O365K809n086J618j129k388M948l284N51M760L786k212L311j969K402
12875a828r057P836P744O074n83n092k680j880N024l518m916p188K909N390Q26
12860i39k141P461K904o759r55k83M172K535k120m011M62J121J143K018J317q899
12844b974m642R120j63L009l24j2211j0760Q144J13J0706K829m557J791M144n863
12829a638K267k798o033J0701L565L54k181J087K578o088p935k248J4108M108
$$ plain form
12936 -10280 -6359 -6435 -4614 -1509 -4784 -4954 -11387 -13984 -13597 -2306 5927 3263 -4606 -12527 -7509
12921 -7509 -5101 -3164 208 15101 7401 8020 15585 16248 11900 6275 1905 -9956 -8205 -5201 1698
12906 1698 -4093 -7149 -6430 -7109 -1663 -8162 -7378 -13162 -11862 -11743 -6864 -1118 -2112 -6699 -22211 -16310
12890 -16310 -9945 -7136 -12222 -10604 -11733 -14121 -9173 -12457 -11906 -7146 -3360 -5572 -2261 -4230 -1828
12875 -1828 -10885 -3049 4695 10769 10186 5094 2414 534 5558 2040 -2876 -10064 -7155 -1765 -939
12860 -939 -3080 4381 7285 526 -429 -712 3460 5995 3875 -136 326 1447 2590 4608 5925 -2974
12844 -2974 -7616 1504 1341 4350 4026 -8185 -18945 -10801 -10688 18 2847 -1710 81 4225 -1638
12829 -1638 629 -2169 -8202 2499 6064 6418 4237 5324 7902 1814 -6121 -8369 5739 9847
12815I847m855O17n958l328L62o91k665L999r434o160J535L327O836n69L920K169
12799a048O652l265n432m441l327N886k801q005K703J577l772M947N352p254n40
12784a2768P868P365j266j819l865K139k644P426L391j686l31Q154K494k546j1639
12769B73Q370J3527j1686r342M41k280l771j0236K690J629p450J1994J0419L318
12755G896o661O623o53K928L80j338N030q463p365p79N109j551l793K315J222
12740I00O19j1339l617R850Q958j37l317n177q891j64Q228N830O441J511j27n819
12724C749J04K502n737n720l463M932l73J724k098m406k063J719m269J1615O212
12709D428N550n221n676p295p509K068J0616k486l803K85L338L191M248M168l734
$$ plain form
12815 9847 4992 5609 -349 -3677 -3315 -4006 -6671 -2672 -12106 -18266 -16731 -13404 -6568 -7137 -3217 -1048
12799 -1048 5604 2339 -3093 -7534 -10861 -4975 -7776 -15781 -13078 -11501 -15273 -10326 -4974 -12228 -12768
12784 -12768 -4900 2465 1199 -620 -4485 -2346 -4990 2436 5827 4141 3810 11964 14458 11912 273
12769 273 8643 22170 10484 1142 1583 -697 -4468 -14704 -12014 -10385 -17835 -5841 4578 7896
12755 7896 1235 7858 7205 10133 10513 9175 14205 5742 -1623 -2402 2707 1156 -2637 -322 900
12740 900 1519 -9820 -13437 -3587 5371 5234 1917 -3260 -12151 -12315 -4087 1743 8184 9695 9568 3749
12724 3749 3853 6355 618 -5102 -8565 -3633 -4006 -2282 -4380 -8786 -10849 -9130 -13399 -1784 4428
12709 4428 9978 4757 -919 -8214 -15723 -13655 -3039 -5525 -9328 -9043 -5705 -2514 1734 5902 2168
12694B168j172q350r85M327r20K999J0677j262m352l117p217J948m21j104m406
12679a1187L866Q572j533p627K022N79K864O312Po693q132J237K750N809N014
12664C860M201M514l531q799r401N75j491J95K652J622Q683O163J597P46j800
12649I786m739j1470J734L240j557J750N01J788O61K980q819O29N463l93j464
12634I0O787P43k698O401j900j4814k845J1717k587j208L138N592l586j666l190
12619b6k355L604n87j512K817l099n946J890p44R72j946k476m15O243L304J830
12603A554K136o387n98L574m941n419K545P33N921N451O830m743p080J56N118
12588D850K580l763o64J653R933O045m973o668j0388p71m025J312N907r920J275
$$ plain form
12694 2168 996 -7354 -8339 -4012 -4932 -1933 8744 7482 3130 13 -7204 -5256 -5677 -6781 -11187
12679 -11187 -7321 1251 -282 -7909 -5887 -5308 -2444 3868 3875 -2818 -10950 -9713 -6963 -1154 3860
12664 3860 8061 12575 9044 245 -9156 -8581 -10072 -9877 -7225 -5603 3080 9243 10840 11586 9786
12649 9786 5047 -6423 -4689 -1449 -3006 -1256 -755 1033 1694 4674 -4145 -3516 1947 1554 90
12634 90 6877 7620 4922 11323 9423 -5391 -8236 3481 894 -314 2824 8416 4830 3164 -26
12619 -26 -2381 1223 636 -876 1941 -1158 -7104 -5214 -5958 -4986 -6932 -9408 -9823 -3580 -276 1554
12603 1554 3690 -2697 -3295 279 -4662 -10081 -7536 -6803 -882 4569 11399 6656 -424 -268 4850
12588 4850 7430 3667 3003 4656 14589 20634 15661 8993 -1395 -2166 -6191 -4879 1028 -8892 -7617
12573g617J3350l430k77J537l476k1l149K274J3830k784j0172l106Q48m469L265
12558c397q13M533p082q612O433J796N61R116j523k840r698k641O906N208p97
12543b850R61l489l378Q632K789M294l454n675l512L092Q703O775o246n746o529
12528e633j4122l570J2174K717J1044n24Q344P206j358k785r413J839J1581K174
12514A9674j488m388k556p811k838M521K674l308j2093j626O221P790n646l759
12500d633O055k6L385m289j720j501K800O694n929o847j023K190J427O750r35
12485B398L943L033m311r59J603L525M780J588K19o353n447K177Q378R71n206
12470A0339n877N61K001k299M806p088K974N235L417o987j269m108n393n13k65
$$ plain form
12573 -7617 5733 2303 2026 3563 87 66 -3083 -809 13021 10237 65 -3041 -2193 -6662 -3397
12558 -3397 -4210 323 -6759 -15371 -8938 -7142 -6581 2535 1012 -1828 -11526 -14167 -7261 -2053 -2850
12543 -2850 -1889 -5378 -8756 -124 2665 6959 3505 -2170 -5682 -2590 6113 12888 6642 896 -5633
12528 -5633 -19755 -23325 -11151 -8434 2610 2086 10430 17636 16278 13493 4080 5919 17500 19674
12514 19674 18186 13798 11242 3431 593 5114 7788 4480 -7613 -9239 -3018 4772 -874 -4633
12500 -4633 1422 1396 4781 492 -1228 -2729 71 6765 836 -6011 -7034 -4844 -3417 3333 2398
12485 2398 6341 9374 5063 4104 5707 9232 14012 15600 15819 9466 4019 6196 14574 15545 10339
12470 10339 4462 5023 7024 4725 9531 2443 5417 10652 14069 7082 5813 1705 -3688 -4201 -4466
12455d466q284R59j532J1321J168N384N777L580K472m278n503l337P57R04r125
12440d203K643Q025L379l640O475N426L57l768r676l292p755r49m85l25o757J925
12424a2620R837m103M068Q727k16P77j790n049J27m352J685M430N023n165N276
12409F655O159l067r227m588M905N3r1Q845L699r96q730n857p24J2481n600K065
12393E982j121p781j146j893k541L213M190M303k178q195k632J645L61L43J871
12378e579N698r55r476J412K609n705q72Q085N13l987R047o0On75K23j278o247
12361g141J223L991l460P708Q645m973P08k78R38K899o808n835O258J0215j90
12346A3900l591n915l960K841J865l920j44m972P284J4013n912p978NJ150m28
$$ plain form
12455 -4466 -12750 -11791 -13323 -2002 -834 4550 10327 13907 16379 12101 6598 3261 4018 4922 -4203
12440 -4203 -1560 6465 9844 6204 12679 18105 18462 14694 5018 1726 -6029 -6978 -7463 -7788 -14545 -12620
12424 -12620 -2783 -6886 -2818 5909 5693 6470 4680 -369 -242 -4594 -2909 1521 6544 1379 6655
12409 6655 12814 9747 520 -4068 837 890 799 9644 13343 12347 3617 -2240 -2964 9517 3917 5982
12393 5982 4861 -2920 -4066 -5959 -8500 -5287 -1097 3206 1028 -7167 -9799 -8154 -7793 -7450 -5579
12378 -5579 119 -836 -10312 -8900 -6291 -11996 -12868 -4783 -4270 -8257 790 730 736 161 384 -894 -7141
12361 -7141 -5918 -1927 -5387 2321 10966 5993 6701 6423 7361 10260 3452 -2383 3875 14090 13900
12346 13900 10309 4394 434 3275 5140 1220 1076 -3896 3388 17401 11489 3511 3516 4666 4238
12331D238k41p10P35m647m715l301k477M751k556L860Q017K657j5608q046K412
12316a5631J31o47L230q0J2090l458M087l14p325P10K782K061O096o315m622N061
12300b144J0205n87L895m38j511m447q65M637m844M77M243j152n356p14o141j363
12284f105M145J356l086o399l560k999J376L893M639J877L685k445n465l23N784
12269c627N250O580j736m726K681K932R15K679m773l673J0910L708J601M70N514
12254B4705K962p564p052n299m361J908o68K474Q32n403l598K372K244K271j944
12239C879o851M777P449J045L772J801j318K178j0494p120j376r455j189J2062
12225h40L835k575k304l596L520j774k706q203k982M928N090J0034k219r810r225
$$ plain form
12331 4238 3997 3287 4022 -625 -5340 -8641 -11118 -6367 -8923 -5063 2954 5611 -9997 -18043 -15631
12316 -15631 -15500 -16147 -12917 -12997 -907 -4365 -278 -592 -7917 -7207 -4425 -2364 3732 -2583 -7205 -2144
12300 -2144 8061 7474 11369 10931 9420 4973 4108 8745 3901 4378 8621 7469 2113 1399 -4742 -6105
12284 -6105 -1960 -604 -3690 -10089 -13649 -16648 -15272 -11379 -6740 -4863 -1178 -3623 -9088 -9411 -3627
12269 -3627 1623 8203 6467 1741 4422 7354 8269 10948 6175 2502 13412 17120 18721 19191 24705
12254 24705 27667 20103 13051 7752 3391 5299 4631 7105 7937 2534 -1064 1308 3552 5823 3879
12239 3879 -2972 1805 9254 10299 14071 15872 14554 16732 6238 -882 -2258 -11713 -12902 -840
12225 -840 2995 420 -1884 -5480 -1960 -3734 -6440 -14643 -17625 -12697 -7607 2427 208 -9602 -18827
12210a8827J6952R178J517j606k815N647J4682M395j0236k356J970M17J46M155
12196B3219j59Q01K15j2369q594j52N651R056M602o480l569j522j268j2269p142
12181i980M762J0337K945J005N56O847n265p374j053J656K252j705j365P71N698
12166A0087J1439N55n204J072P892Q83n462q953j803L770k024n775om038m54K59
12150B238N839l65O70j876j099L656O90n22O64m851j771M426O85L212N837K356
12134A9789K98J696p821l289M69j319Q97n071P987O740n071M646R398L813M596
12119C7758j646p674j1660n062L470Q743N340k551O566L200q670n418j902k686
12105A7808j026p668j0786n28M202L373m917k736J0774j699R23J961l049K64J0018
$$ plain form
12210 -18827 -1875 7303 8820 7214 4399 10046 24728 29123 18887 16531 18501 18918 19064 23219
12196 23219 23060 23861 24076 11707 3113 2961 8612 17668 22270 15790 12221 10699 9431 -2838 -9980
12181 -9980 -5218 5119 8064 9069 9625 16472 11207 3833 2780 4436 6688 4983 3618 4389 10087
12166 10087 21526 22081 16877 17949 25841 26724 21262 12309 10506 14276 12252 6477 6471 2433 1979 2238
12150 2238 8077 7712 8382 6506 5407 9063 9753 9231 9895 5044 3273 7699 8384 11596 17433 19789
12134 19789 20087 21783 13962 10673 11142 9823 10720 5649 13636 20376 15305 19951 29349 33162 37758
12119 37758 36112 28438 16778 11716 15186 23929 29269 26718 33284 36484 27814 22396 20494 17808
12105 17808 16782 9114 -1672 -2200 2002 5375 458 -2278 8496 6797 7720 9681 6632 6896 16914
12090A6914L078Q37Q20K437L671o891j091n410j2001J672N6L499o080o339k91
12075e119r74k502j762J178R823J0070J0977L618o470j0219N410O140N253J755
12061B7178j530N855Q153j3868l822J216j0743L534L103R326J952p433N158K723
12047C0802j6764p054q5K088R348M38l25Q131J2503J3591J3762Q382M124q288
12033G0653r949j394J937Q161J021j323r53p27n628o073m362Q025P660o609j118
12018E9321N824K688o040q776O012p272j1516o456o799j95J7078M892k407M699
12004E1053m43k254J226J1137L404K634L968M600J620r30l236J542L04M07R52
11989G5984m728p46M877J1194J8054P430K523j220Q77k632QL435J2417K49m835
$$ plain form
12090 16914 19992 20829 21649 24086 27757 20866 19775 14365 2364 4036 4092 7591 1511 -4828 -5119
12075 -5119 -6093 -8595 -10357 -9179 644 10714 21691 25309 18839 8620 14030 20170 25423 27178
12061 27178 25648 31503 39656 25788 21966 23182 12439 15973 19076 28402 30354 22921 28079 30802
12047 30802 14038 6984 6899 8987 18335 18773 18448 26579 39082 52673 66435 74817 78941 70653
12033 70653 60704 59310 61247 69408 70429 69106 68153 67426 61798 55725 51363 59388 67048 60439 59321
12018 59321 65145 67833 61793 53017 59029 51757 40241 33785 26986 26791 43869 48761 46354 51053
12004 51053 50610 48356 49582 60719 64123 66757 70725 75325 76945 76015 72779 74321 74625 75032 75984
11989 75984 71256 70510 75387 86581 104635 112065 114588 113368 114245 111613 111621 115056 127473 127722 122887
11974A22887k701O069J3137Q161J351j1435M026J604M940M078J5960P778J962
11961A77817J3364J2758M252L777O273L37Q936J8476J8062J5324J6433J6271J1330
11948C23410K5079K3730J8884J6114L1312K4487L1917M4002L6796N1202M1730
11937F68663M3133N7604N9479N3881N9602Q3529J01905J19028J35430J50963J81574
11926A714791K21033K59896L11389L59433M36531N53593O83431Q46505J056086
11917F442688J320146J599936J883381K041071J904151J308518K86613q26486
11909A5960018j619067j937758j897412j686378j431780j185498r62842p84266
11901D455017o48994n30331m28587l58346k93995k41022k06434j79918j53548
$$ plain form
11974 122887 120186 126255 139392 147553 148904 137469 141495 143099 148039 152117 168077 175855 177817
11961 177817 191181 203939 208191 211968 218241 218578 227514 245990 264052 279376 295809 312080 323410
11948 323410 348489 372219 391103 407217 438529 463016 494933 538935 575731 626933 668663
11937 668663 711796 769400 828879 882760 942362 1025891 1127796 1246824 1382254 1533217 1714791
11926 1714791 1935824 2195720 2507109 2866542 3303073 3856666 4540097 5386602 6442688
11917 6442688 7762834 9362770 11246151 13287222 15191373 16499891 16786504 15960018
11909 15960018 14340951 12403193 10505781 8819403 7387623 6202125 5239283 4455017
11901 4455017 3806023 3275692 2847105 2488759 2194764 1953742 1747308 1567390 1413842
11892A413842j36626j11291r7267q8263p2637p3419n9174m9089m8566m4876m5477
11881E87157l6318k9356k0422l1657k9854k0055r487j9275j8039k5088k8943k5877
11869B92786r890j0146n744j7301j2852j920r499r215n482n664o688k037m227
11856A92121j1254j3939p184k59r319p115j603K451l903k192k170j2971k450n547
11842A14666r215o860L143l936o187o00P356N948m689n877J435K715m420p175
11828H6304o809q866L395M290N356J213l875r852n871K258L984K084n487q948
11814E9176Q159J5758m125j9134o020j024L514J633K971k029p77K14K873l971
11800E7218P426j0866p190O537L234r517r529q122K769R753n606l278J3644M808
$$ plain form
11892 1413842 1277216 1165925 1068658 980395 907758 834339 775165 726076 677510 632634 587157
11881 587157 550839 521483 501061 469404 439550 419495 410008 390733 372694 347606 318663 292786
11869 292786 282896 272750 267006 249705 236853 234933 225434 216219 210737 205073 198385 196348 192121
11856 192121 180867 166928 159744 159485 150166 143051 141448 143899 139996 137804 135634 122663 120213 114666
11842 114666 105451 98591 101734 97798 91611 91011 98367 104315 99626 93749 95184 97899 93479 86304
11828 86304 79495 70629 74024 78314 83670 84883 81008 71156 65285 67543 71527 73611 68124 59176
11814 59176 67335 83093 78968 59834 53814 52790 56304 57937 60908 58879 58102 58316 61189 57218
11800 57218 64644 53778 46588 53125 56359 46842 37313 29191 31960 41713 36107 32829 46473 51281
11786E1281K013O440o716K642O518p687l597K214m853j4439N624J2484o190j3320
11772C2414m07k792o960L254J7768O93o206j259n150O65m903J777O169j245M910
11757C8728l055j5202k338k331k705J2550P705l297R76N893M88p997r04Q65M282
11742C3658o2K504j2186p983k511N395N095R835J841K26j0555q569K759L695R269
11727C2411N483m940k163O828r732o7l301l434K168K943L109m949o576N751j84
11712B3347n580n881q411K291M680j3333k394Q237N621O2L305P800p9J147o865
11697A3947p819n870K732O210l481P642J457m537p611R136N406n004k982K89O668
11682A6183O654K622k640r06k53q636l294M911M017R601l573j2153K414L945M605
$$ plain form
11786 51281 53294 59734 53018 55660 62178 54491 50894 53108 48255 33816 39440 51924 45734 32414
11772 32414 32007 29215 22255 25509 43277 43970 37764 36505 31355 32020 27117 28894 35063 33818 38728
11757 38728 35673 20471 18133 15802 13097 25647 33352 30055 31031 36924 37412 29415 28511 29376 33658
11742 33658 33596 36100 23914 15931 13420 18815 23910 33745 35586 35812 25257 16688 19447 23142 32411
11727 32411 37894 32954 30791 37619 27887 27820 24519 21085 23253 26196 29305 24356 17780 23531 23347
11712 23347 17767 11886 3475 5766 10446 -2887 -5281 2956 8577 8639 11944 19744 19665 20812 13947
11697 13947 6128 258 2990 9200 5719 13361 14818 10281 2670 11806 17212 12208 9226 9515 16183
11682 16183 22837 25459 22819 21913 21660 13024 9730 14641 18658 28259 24686 12533 14947 18892 23497
11667B3497m004j0077J88j683o75L419l999r495N647P146L441l709p317k108m930
11652d659L608J0072N940k248k79j260j3878K435O687J596N298N053M421k925
11638A9861q375J315R328P909p682r942m327l314o694m30O103M457l54J778L103
11623A2736K348k220P162n040n997P3j52R326R138k604m392j750k927p041p60
11608G900n877K315N633R655m847L715l663j366j941K720K003o277r40J2626M283
11593B5939l566m467j216j514j3909O992J9166j17j2365o412j1393K428J0383
11580I949K284P76o550N200N853J3898k316m368m345n432m361k238j090J1373
11566A8633N141p925j1579l952q30M227J0117k779o736m449n054L868R710J869
$$ plain form
11667 23497 19493 9416 9604 7921 7246 10665 6666 -2829 2818 9964 13405 9696 2379 271 -4659
11652 -4659 -1051 9021 14961 12713 12434 11174 -2704 -269 6418 8014 13312 18365 22786 19861
11638 19861 11486 12801 22129 30038 22356 12414 8087 4773 -1921 -2351 3752 8209 7855 9633 12736
11623 12736 15084 12864 20026 14986 8989 9062 8910 18236 27374 24770 20378 18628 15701 8660 7900
11608 7900 2023 4338 9971 19626 14779 18494 14831 13465 11524 14244 16247 9970 9030 21656 25939
11593 25939 22373 17906 16690 15176 1267 8259 27425 27308 14943 8531 -2862 -434 9949
11580 9949 12233 13009 6459 11659 17512 31410 29094 24726 20381 14949 10588 8350 7260 18633
11566 18633 23774 15849 4270 318 -512 3715 13832 11053 4317 -132 -5186 -1318 8392 10261
11552A0261L84r674L361L202J700K127n125k449n017J1328j639q312J716J0267
11538A2130M559l158q033k497P141n612j998K537j290n702M637K097m806P371
11524G376p80P463J681o637K779k877J1331M442l455m799l782o608k293m162M067
11509C746O440N002Q06K18r087l356K080O248m056j356j455N887j900l449J115
11494F883L757L352J402m18j1380j361O778P771J69R16r367j492n998n720N998
11479A290J942j649j60l48L99M253O706K934p595k124J264K727Q188j0915j1568
11464d656N395J5553J2682J523r106j1660l105L209n034l395K012k477j845O79
11450b25J455M18l406P446P307l605P012M19q279m522M654m6M633L144l736M73
$$ plain form
11552 10261 10645 971 4332 7534 9234 11361 6236 3787 -1230 10098 8459 147 1863 12130
11538 12130 16689 13531 5498 3001 10142 4530 2532 5069 3779 -1923 2714 4811 5 7376
11524 7376 6596 14059 15740 9103 11882 9005 20336 24778 21323 16524 12742 6134 3841 -321 3746
11509 3746 10186 15188 15994 16212 7125 3769 5849 12097 8041 6685 5230 11117 9217 5768 6883
11494 6883 10640 13992 15394 14976 3596 2235 9013 16784 16953 17869 8502 7010 1012 -4708 1290
11479 1290 3232 1583 1423 1075 1474 5727 12433 15367 7772 5648 6912 9639 17827 6912 -4656
11464 -4656 739 16292 28974 30497 21391 9731 6626 9835 4801 1406 3418 941 -904 -225
11450 -225 1230 1648 -1758 5688 12995 9390 16402 16821 8542 4020 8674 8628 13261 16405 12669 13142
11434A3142l231P974R785j2508o505J188J0127m166p133O090o033r905o636Q102
11420B91Q569O211l440M999P489J958j2211p463j198M92M171N245k014m34O790
11405A9455l380k036o620J260L618l68l171n982P182M889o991n93L947Q527k009
11390A7728L860j503K061P421O330J874m340o273j3603o302R40M212N07m863o779
11375A270N630N002L387m961k346Q460M751k79J189l938m348N16q327k794O393
11360I605J358j65l596l667K540M483P70o755J474J5487M092j2693k450N483l590
11345A2376l56J34l055K01M026q158l253k760P697j795J101k120J0529P663R78
11330B3208j135r265n829j210j974r27L305J885o737J128J1009Q166K706o886
$$ plain form
11434 13142 9911 17885 27670 15162 8657 9845 19972 15806 8673 14763 8730 -1175 -7811 291
11420 291 8860 15071 11631 16630 24119 26077 13866 6403 5205 5697 9868 15113 13099 12665 19455
11405 19455 16075 14039 7419 8679 12297 11929 8758 2776 9958 14847 7856 7263 11210 19737 17728
11390 17728 21588 20085 22146 29567 35897 37771 33431 27158 13555 7253 8193 12405 12912 8049 1270
11375 1270 6900 11902 15289 10328 7982 16442 21193 20914 22103 18165 13817 14333 6006 3212 9605
11360 9605 10963 10798 7202 3535 6075 10558 11328 4573 6047 21534 25626 12933 10483 15966 12376
11345 12376 12020 12154 9099 9300 13326 5168 1915 -845 6852 5057 6158 4038 14567 22230 23208
11330 23208 22073 12808 6979 5769 3795 2868 6173 8058 1321 2449 13458 21624 24330 17444
11316A7444l779k549m420K060m419j952r444J66N957K396L586P471P72k694q196
11301B399O346O516L738K819l000M81k940L676l6K533n791p125M789J0277j546
11286B3136m224n395M94L744q72L335J949m430N22j1060J209J0540k295O79o265
11271A1067l016J442l7l067o740m862K147O559K545p70J030k461J0050K642k001
11256A4528k774p654p441N676N213k289l121O889J031M574q115K7j175j876j645
11241A848J2129J2380k593N318l764j4881j377P58J227M419R904J851q306n609
11227A3304O101l779n199J155L009o73n618k346L98J4631J713j0332n500o409
11213D55O900O816K085J866K125J040Q598K031j0179L37J224q647N63K198k623
$$ plain form
11316 17444 13665 11116 6696 8756 4337 2385 -7059 -6893 -936 1460 5046 12517 13289 10595 2399
11301 2399 8745 15261 18999 21818 18818 19299 16359 20035 19999 22532 16741 9616 14405 24682 23136
11286 23136 18912 13517 14011 17755 16883 20218 22167 17737 18259 7199 8408 18948 16653 17332 11067
11271 11067 8051 9493 9456 6389 -351 -5213 -3066 3493 6038 5268 6298 3837 13887 16529 14528
11256 14528 11754 4100 -3341 2335 7548 5259 2138 9027 10058 14632 6517 6544 5369 3493 1848
11241 1848 13977 26357 23764 29082 25318 10437 9060 9818 11045 15464 25368 27219 18913 13304
11227 13304 19405 15626 10427 11582 14591 13918 8300 5954 6352 20983 22696 12364 6864 455
11213 455 7355 14171 16256 18122 20247 21287 29885 31916 21737 22074 23298 14651 15214 17412 14789
11198A4789j411L277K350n493j19J0293k86M269n343k218j812j652p147K651J0816
11183B2964L419n834p310p82P186r35K062K016p402o41R135q176q425j102L643
11168I818P606J4465M147o824j359n056q798L036R479m914o749p24K17j599p843
11153D902m02L484O037Q026K397k205m634j755l684J194L960m653j0954p549K785
11138c051N555O892j402L467J0568o131j958N420O213j871j189m461P055M357
11124B9464K380L553l280l399P548J1018O45q713l829q322q016J686J4030P15
11110C5480o425q807k165M512j208k946j645L347L46O222K362l950J360j523j606
11095B3354P181J4667M314m826L730P708l665j898k02j0458J09M243P35R34k819
$$ plain form
11198 14789 13378 16655 19005 13512 13393 23686 23400 27669 22326 20108 18296 16644 9497 12148 22964
11183 22964 26383 20549 13239 12457 19643 18708 20770 22786 15384 14743 23878 15702 7277 6175 9818
11168 9818 17424 31889 36036 29212 27853 22797 13999 17035 26514 21600 14851 14127 14344 12745 4902
11153 4902 4500 7984 14021 22047 24444 22239 17605 15850 12166 13360 17320 12667 1713 -5836 -3051
11138 -3051 2504 9396 7994 11461 22029 15898 13940 19360 25573 23702 22513 18052 25107 29464
11124 29464 31844 35397 32117 28718 36266 47284 47929 39216 35387 27065 19049 20735 34765 35480
11110 35480 29055 20248 18083 22595 21387 18441 16796 20143 20489 26711 29073 25123 26483 24960 23354
11095 23354 30535 45202 49516 44690 48420 56128 52463 50565 50363 39905 40014 44257 44992 45926 43107
11080D3107N427J4326O87j1713J427Q966p34j4365j1209p462M380K790q101r734
11066A7792O165N684l421r60k15o237j255R42n446j706k29O6P08O251k765q613
11050F761K69K41K513J2646q48K024J4657J4464J2092K107P42Q340J2602J7003
11036A05613m618m799m6P385J939L760L097q557m797k884l728q612N496m487M469
11021H9231K846J3604k179r152r601j0660l836Q04Q235J3297n993l209L458R403
11007I6248N058m604N051J340n215p845j869O963K0283J0076l677J647R850L633
10993A36939R4Q006Q725P239P788J4011K2878L0437L6368M4001P1175J22936J72599
10980F83196K53223L09437K38567Q2332J50859K72053J63918j63188k88318j38038
$$ plain form
11080 43107 48534 62860 63547 51834 53261 62227 61493 47128 35919 28457 32837 35627 27526 17792
11066 17792 23957 29641 26220 25260 25045 18808 17553 18495 13049 11343 11114 11180 11888 18139 15374 6761
11050 6761 7030 7271 9784 22430 21582 23606 38263 52727 64819 66926 67668 76008 88610 105613
11036 105613 100995 96196 96150 103535 105474 109234 112331 103774 98977 96093 92365 83753 89249 84762 89231
11021 89231 92077 105681 103502 94350 84749 74089 70253 71057 79292 92589 86596 83387 86845 96248
11007 96248 101306 96702 101753 103093 97878 90033 88164 95127 115410 125486 121809 123456 133306 136939
10993 136939 137033 145039 153764 161003 168791 182802 205680 236117 272485 316486 387661 510597 683196
10980 683196 936419 1245856 1484423 1566755 1717614 1989667 2153585 1990397 1702079 1564041
10970A564041p1495k28143l29872k56053j62975j06144p7018n1355m7130k8425
10960B05431k0168k4850j0962j3113j3996j574n300j1489L95q936q635J795j0286
10947G8312o828j2492K010l167m987j324N747M73R048P286l162l465L806M913
10933G6170k924k174k279j0811r18J231Q09k387k15o19K465J3326N422o021q374
10918F2701n515m310M323P1r04p536n982K872K202j4404j750O830J1491r619k205
10903C8265L440Q644J749o945M665m046l848n258p24L515o644k3039j940J0528
10889A8362J660j0852j3705l826N165J0074M855l382M375J9145N368j3296Q82
10876B4825P384N981J6064L55m355R85N1O316R547L553K801K859K761N865r984
$$ plain form
10970 1564041 1492546 1264403 934531 678478 515503 409359 332341 280986 233856 205431
10960 205431 185263 160413 149451 136338 122342 120768 115468 103979 104374 95438 86803 88598 78312
10947 78312 71484 58992 61002 57835 52848 51524 57271 57744 66792 74078 70916 67451 71257 76170
10933 76170 73246 71072 68793 57982 57064 58295 59104 56717 56502 55883 58348 71674 77096 71075 62701
10918 62701 57186 52876 57199 57270 56366 48830 42848 45720 47922 33518 31768 38598 50089 40470 38265
10903 38265 41705 50349 52098 45153 49818 45772 41924 36666 35942 39457 32813 9774 7834 18362
10889 18362 20022 9170 -4535 -8361 -3196 6878 11733 8351 12726 31871 37239 23943 24825
10876 24825 32209 38190 54254 54609 50254 51239 51290 57606 67153 70706 73507 76366 79127 84992 75008
10861G5008r717k55J976q422l720O035K906R008N215R454M66M338K426m161l67
10846I0190o405M292J5702N627R084L845L907L583L283J980Q035J1985J3127K3073
10832A91308K8623K3798Q258N811L5644K9744J3888P319J1135P517P62k5232l9707
10819B98868l9772j5549j6698l0601m9056l1644k1969l963k875r488n112n944
10807F6197J042j060m560o981M721q844j2853p185o14o083l861K854N155m536
10793B3392m017K182P250j1801j600J7999J8919K760J1918J8758P999R490L648
10780A06897K3741K0878K751O464P518J2947J2187J0342k926O974O978m255r323
10767B01173L302p067k1678r638m944j9179k6753k9904j4371j375p80o943j1207
$$ plain form
10861 75008 65291 65036 67012 58590 54870 60905 63811 72819 78034 87488 87954 92292 94718 90557 90190
10846 90190 83785 88077 103779 109406 118490 122335 126242 129825 133108 135088 143123 155108 168235 191308
10832 191308 219931 243729 251987 257798 293442 323186 337074 344393 355528 363045 363807 338575 298868
10819 298868 259096 243547 226849 196248 147192 115548 93579 89616 86741 77253 72141 66197
10807 66197 67239 66179 61619 54638 59359 50515 37662 30477 29863 23780 19919 22773 27928 23392
10793 23392 19375 21557 28807 17006 15406 33405 52324 55084 67002 85760 93759 103249 106897
10780 106897 130638 151516 154267 160731 168249 181196 193383 203725 200799 207773 214751 210496 201173
10767 201173 204475 197408 175730 166092 161148 141969 115216 85312 70941 69566 68786 61843 50636
10754E0636m136J2171J1436Q173J006j841R805J29j8339q632M833q736j0155n882
10740D0468j383J580P216j577j8169k9593k2314q937J603K4310L3340Q693J5359
10727E0596N2144O9842M7791J386Q036K5155K9443R798m928p028n322l121r044
10714B64748k2416j4386j0260n578j6732k5764l0300l5606k3039j5953n068K4212
10702H3858P6733J35512R1916P1429J26928K11003J36479n768k7659L2828K6668
10691I59927p6934r7808p9496o4113n2705l5990l2703k1583o938o39J0691j1901
10679D89808l898L780J237n950n730J25J30Q465J2534M944L489m407R457J4178
10665E28162K0850L408k695M35P163J1986J0130J4441N764N104J5611J3012P587
$$ plain form
10754 50636 46500 58671 70107 78280 79286 77445 87250 87379 69040 60408 65241 56505 46350 40468
10740 40468 39085 40665 47881 46304 28135 -1458 -23772 -32709 -31106 -6796 26544 35237 50596
10727 50596 102740 172582 220373 221759 229795 254950 284393 294191 289263 282235 276913 273792 264748
10714 264748 242332 227946 217686 212108 195376 169612 139312 103706 80667 64714 59646 83858
10702 83858 160591 296103 388019 459448 586376 797379 933858 928090 900431 933259 959927
10691 959927 882993 785185 705689 641576 588871 552881 520178 498595 491657 491018 501709 489808
10679 489808 485910 489690 490927 484977 479247 479372 479502 487967 500501 505445 508934 504527 513984 528162
10665 528162 549012 552420 549725 550160 557323 569309 579439 593880 599644 604748 620359 633371 640958
10652F40958J8951J7025J6479K2653K2781K4659K5415L1674J7231J2262L1970
10641H82058L7015L2869K4866L0421L6530L6917M5955N2569N8305O2040N0830
10630A350375P3724P2446P8596Q1034Q2557R8476J19731J33186J50728J84942
10620B425795K27689K75242L48659M43775N58005O68284P03958O15206L73767
10611F640380P7993n5111j7330J05052K83873M84255P67588J085289J374953J490986
10601A2237928J211543N53784m7286k16260J1000M24596Q04468J057301J554419
10592A7591493K255826K746092K653826K102533J364059P56325Q05020J525173
10584C1800347K636298L808044N457158Q003581J1564244J6775932K5358700L8839508
$$ plain form
10652 640958 659909 676934 693413 716066 738847 763506 788921 820595 837826 850088 882058
10641 882058 919073 951942 976808 1007229 1043759 1080676 1126631 1179200 1237505 1299545 1350375
10630 1350375 1424099 1496545 1575141 1656175 1738732 1837208 1956939 2090125 2240853 2425795
10620 2425795 2653484 2928726 3277385 3721160 4279165 4947449 5651407 6266613 6640380
10611 6640380 6718373 6663262 6645932 6750984 7034857 7519112 8286700 9371989 10746942 12237928
10601 12237928 13449471 14003255 13955969 13739709 13750709 14175305 14979773 16037074 17591493
10592 17591493 19847319 22593411 25247237 27349770 28713829 29470154 30275174 31800347
10584 31800347 34436645 38244689 43701847 51705428 63269672 80045604 105404304 144243812
10576A44243812N3618859N5168186K5579274J0106509L9029035N0465999M625016
10569C82836690m9753268m5498939j4888249j6276484n3391764n7270657l8984756
10562A06772573k5317788j7519719j2759621r388823o792201n083936m148234
10555B5762251l388804k517495j920271j835226j659837j184254r34688j079277
10547A1242399j155797q99606o60937o96240p98965o89110n51377m80031m10389
10538D899947l36001k88705k60186k36118k27465k00597j67995j59261j41601
10529B882018j24736j07874j07458j15601j30739j22540r5948p9409p9954q5063
10519A832696p8363p7857o4677n2502m6608m4729m1479m9656l8274m7279m6492
$$ plain form
10576 144243812 197862671 253030857 278610131 288716640 327745675 378211674 382836690
10569 382836690 333083422 287584483 272696234 256419750 203027986 145757329 106772573
10562 106772573 81454785 63935066 51175445 41786622 34994421 29910485 25762251
10555 25762251 22373447 19855952 17935681 16100455 14440618 13256364 12321676 11242399
10547 11242399 10086602 9186996 8526059 7829819 7030854 6341744 5790367 5310336 4899947
10538 4899947 4563946 4275241 4015055 3778937 3551472 3350875 3182880 3023619 2882018
10529 2882018 2757282 2649408 2541950 2426349 2295610 2173070 2077122 1997713 1917759 1832696
10519 1832696 1754333 1676476 1611799 1559297 1512689 1467960 1426481 1376825 1338551 1291272 1244780
10508A244780m0641l0380k9824l4153l6900k8538l2818k6099k0980k9239j4472
10497I20736k3566l2457l3219j2165j3003k6203k5048j7471k5319k2706j5329
10486F74250r767j4278j9921j5300k0586j9511j1821l995j2535k784m794p580
10474E31378j3543r901o213p124j0658j5745j4163j9575j5727r999r441l116j261
10461C94912j275K045J379m585K898k25K39n876j0669R308K0945K7427O3397M3342
10447E43262o503m868Q6539Q9947k8016j00045l1342L5959j3347q3301n3696j5112
10435D19477j1358k7712j8535j1481j4608j6437k1433k4941j2002j7287j4689
10424B28994j366j0322k2248j1842o078K7563K4170m937j5050L9277R5777L9934
$$ plain form
10508 1244780 1204139 1173759 1143935 1109782 1072882 1044344 1011526 985427 964447 935208 920736
10497 920736 897170 864713 831494 819329 806326 780123 755075 737604 712285 689579 674250
10486 674250 664483 650205 630284 614984 594398 574887 563066 559071 546536 543752 538958 531378
10474 531378 517835 507934 501721 494597 483939 468194 454031 434456 418729 408730 399289 396173 394912
10461 394912 393637 395682 397061 392476 395374 395149 395388 389512 378843 388151 409096 436523 499920 543262
10447 543262 536759 531891 618430 708377 680361 580316 548974 584933 571586 488285 434589 419477
10435 419477 408119 380407 361872 350391 335783 319346 297913 272972 260970 243683 228994
10424 228994 227628 217306 195058 183216 177138 204701 228871 223934 208884 248161 343938 383872
10412C83872l148K518L0815J1165j0080j0708j5207j1750n651j9706k3397q186
10400C20537j6388j6982k2280k5701j1623p148J0O457L760O820o672r267L895
10387B25418L318R289m441j4086j7058J337q838k5936l2259j6803K837j7292l0511
10374G4975k3044j1682p654r197N072J1042J720q575p112R600J4518J7766R888
10361G7317J6460J6458J3805M942j862Q309M413J0521R882k13J592j449m524j669
10347A53982J297P57p625k92j845j774p164q133O816J539n909j2545m368j957
10333A12779N209O803l619o107N648q94m392k57n552n360n942J129K435n585j1946
10318H4349p903M112j759j1350m965J3700M603j4649j6421J4821M522q363m611
$$ plain form
10412 383872 380724 383242 414057 425222 415142 404434 389227 377477 371826 352120 328723 320537
10400 320537 304149 287167 264887 239186 227563 220415 220425 226882 230642 237462 230790 221523 225418
10387 225418 228736 238025 233584 219498 202440 203777 194939 169003 136744 119941 122778 105486 74975
10374 74975 51931 40249 32595 23398 28470 39512 41232 32657 25545 35145 49663 67429 77317
10361 77317 93777 110235 124040 128982 127120 135429 139842 150363 160245 160032 161624 160175 155651 153982
10347 153982 155279 156036 148411 148119 146274 144500 137336 129203 136019 137558 131649 119104 114736 112779
10333 112779 117988 124791 121172 115065 120713 119819 115427 115170 109618 104258 98316 99445 101880 96295 84349
10318 84349 76446 80558 78799 67449 62484 76184 80787 66138 49717 64538 69060 60697 56086
10305E6086j775j053r142o248j693J931N532M647q882n006N145J0024m446l334
10291D1786J221O551L066J1515J639o857n539L830j479q717k506J03K741R564
10277E6918j2473j041O445J166P83Q24n920m404M935N780J588K753O575K2487
10263H6416J3536m096j1475K063J266l266k643N428O663n334j3907p164L801N707
10249G6995j1320j5350j1398m69k762l682L710j3j502p209P911N459L595J3014
10235E6979l003j0458k647R052l328J668j743m327P111k815l986k151r172K201
10221C3381L434N821j294n360R417l373k358J194K524P2K454k326j2866k761R799
10206C7758J2342P406j025o640o880p89N182P026r09J850L050k006j491P572k390
$$ plain form
10305 56086 54311 53258 44116 37868 36175 38106 43638 48285 39403 34397 39542 49566 45120 41786
10291 41786 43007 49558 52624 64139 65778 58921 53382 57212 55733 47016 44510 44613 47354 56918
10277 56918 44445 43404 49849 51015 51798 52622 46702 42298 47233 53013 54601 57354 63929 86416
10263 86416 99952 95856 84381 86444 87710 84444 81801 87229 93892 88558 74651 67487 71288 76995
10249 76995 65675 50325 38927 38458 35696 32014 35724 35711 34209 27000 34911 40370 43965 56979
10235 56979 53976 43518 40871 49923 46595 48263 46520 42193 49304 46489 42503 40352 31180 33381
10221 33381 36815 42636 41342 35982 45399 42026 39668 40862 43386 43458 45912 43586 30720 27959 37758
10206 37758 50100 57506 56481 49841 42961 42172 47354 54380 53471 55321 58371 56365 54874 62446 60056
10191F0056j1829m804J0075K45l669R327J1690K942R890J4763K202j337J3216
10178A12767J6420J6326K4966K2140J5153K4965L2409O4817P9233J13168J92805
10167G15169K83035L11495K06233P6360J71349K85565J25377k13525k85078j27936
10157A548044q1511k55207l21055k20984j36779r6876p0096o4835n3373l5378
10147B11950k5973j5870j1156j1314n248r832j3507q721j0927j2957m284j677
10135H0484J442q522N22J550m314O380l413p973J318M840L182N60m994n242k208
10120F3612l753M87j0745n811l210k640K805p261j7788j0000p686m370n137Q24
10106a0673Q894K732n377M509O872P42j563O976L973N430K243P599R05k14l678
$$ plain form
10191 60056 48227 43423 53498 53743 50074 59401 71091 74033 83923 98686 100888 99551 112767
10178 112767 129187 145513 170479 192619 207772 232737 265146 329963 409196 522364 715169
10167 715169 998204 1309699 1515932 1592292 1763641 2049206 2174583 1961058 1675980 1548044
10157 1548044 1466533 1211326 890271 669287 532508 435632 365536 300701 247328 211950
10147 211950 185977 170107 158951 147637 142389 132557 119050 110329 99402 86445 82161 80484
10135 80484 81926 73404 73926 75476 71162 77542 74129 66156 67474 72314 75496 76056 71062 65820 63612
10120 63612 59859 60346 49601 43790 40580 37940 40745 33484 15696 5696 -1990 -6360 -11497 -10673
10106 -10673 -1779 953 -4424 85 6957 7699 6136 13112 17085 22515 24758 32357 33262 33048 29370
10091B9370l611K238P515m921o481O53m67R181p916p155M96N267m269L365J1112
10076C4377k927j3909n359K061N565J336P083N654M329n891K44K927n985J378
10062C0883k773j316p96j142K877k146J422n898j1599j0100j166J5520Q725O872
10048B9363P295q501k947j825p578K406N818K314r341o112Q490p93o18J457m841
10033A4587m887q757l475P019N176k191j811P53l200L636M920K135K508k633m518
10018I262k475O676R504J608N00J183q41M452m257m860l329N305N66r122q598
10003E574J610O213m494q149R71P098J2493L116r113Q97K110q953p9K126J022
9988A2442R72j245O155r011p095q1N149L074J0338R233j422m690R90k266q609
$$ plain form
10091 29370 25759 27997 35512 30591 24110 24763 24296 33477 25561 18406 18902 24169 19900 23265 34377
10076 34377 31450 17541 12182 14243 19808 21144 28227 33881 38210 32319 32563 35490 29505 30883
10062 30883 28110 26794 25998 24856 27733 25587 27009 21111 9512 -588 -1754 13766 22491 29363
10048 29363 36658 28157 25210 23385 15807 18213 24031 26345 17004 10892 19382 18589 17971 19428 14587
10033 14587 9700 943 -2532 4487 9663 7472 5661 6414 3214 6850 11770 13905 16413 13780 9262
10018 9262 6787 13463 22967 24575 25075 26258 25417 29869 25612 20752 17423 22728 23294 14172 5574
10003 5574 7184 13397 8903 754 1725 8823 21316 24432 15319 16216 18326 9373 9294 11420 12442
9988 12442 13414 12169 18324 9313 2218 2137 7286 10360 20698 29931 28509 23819 24809 22543 13934
9973A3934K380K068p246o53m312l671k334Q36L933m672l490M128p68O180O66k95
9957F684P941n56j5443j1232j611P92Q96O713J4090K539L75l27J691R498L628
9942B5678l194j532n425k61J361m31n290l647n56l878N61k98J59O720l433n557
9926I77l094K836N302O135O926M992l050m758j3511L214Q44O312Q75k077k662
9911I261o757q435L321J1460R344J69q665q684J98l728m591L202M230J0311K173
9896A2809l984q050L804m332K031q08k487j103L448J1248N23P16M015P07q112
9881A0425j2033R96k917j4500J56M709J0472P172J2022J470K871L023K888M805
9867C1559q949K285K272j0164o244r140r006K611Q468J311q284m371j0928l514
$$ plain form
9973 13934 16314 18382 11136 10483 6171 2500 166 1002 4935 263 -3227 901 133 6313 6979 6684
9957 6684 14625 14069 -1374 -12606 -14217 -13425 -12529 -5816 8274 10813 11188 10861 12552 22050 25678
9942 25678 22484 20952 15527 15266 16627 16196 10906 7259 6703 2825 3386 3088 3247 9967 6534 977
9926 977 -2117 719 6021 12156 19082 24074 21024 16266 2755 5969 6813 13125 14000 11923 9261
9911 9261 2504 -5931 -2610 8850 18194 18363 9698 1014 1212 -2516 -7107 -3905 325 10636 12809
9896 12809 8825 775 4579 247 2278 1470 -1017 -2120 1328 12576 13099 13815 17830 18537 10425
9881 10425 -1608 -612 -3529 -18029 -17873 -13164 -2692 4480 16502 17972 20843 23866 26754 31559
9867 31559 22610 24895 27167 17003 10759 1619 -7387 -4776 3692 5003 -3281 -7652 -18580 -22094
9853b2094L621R130l11n537L649N714L716K838n06K023P68k239N372L29k985o326
9837b838p382L300J219L230L208m975j003M340N481M297L091q744l611J902k520
9822a005k653l99k745O15O369J953j303q297J153J0989r52J201K483m156j147
9807B106R81m25n572k583m825N053P796L086J2377L730j430j2307j4839l596K319
9792h129j940j254J4006L367M15l29o901j434O532P62J012K424r152n910J14P75
9776e642j28L829P191j952M02j082J0374J3774N635L824J298p962k386n373p167
9761A4635j0285q570J04J426l95k521P528l051k690M91L835J0361P427L987n002
9746A7280j3596o045L44K02O651J651M448P91K139m526M420k517K104j871k041
$$ plain form
9853 -22094 -18473 -9343 -9654 -15191 -11542 -5828 -2112 726 220 2243 3011 772 6144 6473 3488 -2838
9837 -2838 -10220 -6920 -5701 -2471 737 -4238 -5241 -901 4580 8877 11968 3224 -387 1515 -1005
9822 -1005 -3658 -4057 -6802 -6187 182 2135 832 -7465 -6312 4677 3725 4926 7409 3253 2106
9807 2106 3087 2662 -2910 -5493 -10318 -5265 2531 5617 17994 21724 20294 7987 -6852 -10448 -8129
9792 -8129 -10069 -11323 2683 6050 6465 6136 -765 -2199 4333 5095 6107 8531 -621 -6531 -6417 -5642
9776 -5642 -5770 -1941 5250 3298 3700 2618 12992 26766 32401 36225 37523 29561 27175 21802 14635
9761 14635 4350 -4220 -4116 -2690 -3085 -5606 1922 -1129 -3819 -3328 507 10868 18295 22282 17280
9746 17280 3684 -2361 -2017 -1815 4836 6487 10935 11726 13865 9339 13759 11242 13346 11475 9434
9731I434O031j731k691M554j027j3672m47j59k900J7267J822q156l319k335N145
9716G816P751n508j561M53Q010N75q239r129J100L765j895l550k55m252R547N786
9700A0414j833O217J3157J369m990p436m065J85N260N415j0183l345P373j818
9686A5720P139j494l254O447N121P689k777n336n176o57R38lj015n375k759J0629
9670B5837P399N249J1747n32r55Q929J0339J4826P167m27O60J3263K0600J2893
9656A36995K2595K5352K7572M8179O7534R9122J43494K12029L51338N84520R34938
9645B653668J079766M02366r92735j099479o73219m02738k58758j68871j16880
9636D23120q0986o4475n4564l7451k4703l3730k0709p624q496j1365l725N65l84
$$ plain form
9731 9434 15465 13734 11043 15597 14570 898 451 292 -2608 14659 16481 8325 5006 2671 7816
9716 7816 15567 10059 8498 8951 16961 17536 9297 168 1268 5033 3138 -412 -667 -4919 4628 10414
9700 10414 8581 14798 27955 29324 24334 16898 12833 13018 18278 23693 13510 10165 17538 15720
9686 15720 22859 21365 18111 24558 29679 37368 34591 29255 24079 23422 24360 24357 23342 17967 15208 25837
9670 25837 33236 38485 50232 49700 48745 57674 68013 82839 90006 89579 90239 103502 124102 136995
9656 136995 159590 184942 212514 260693 328227 427349 570843 782872 1134210 1718730 2653668
9645 2653668 3733434 4135800 3143065 2043586 1370367 967629 708871 540000 423120
9636 423120 342134 277659 223095 185644 160941 127211 106502 98878 90382 79017 75292 75857 75473
9623G5473K869k763j5176m744q05o469N59n935n850o705m94k887P46N456l091
9608C0184j0098j612l985p066O063P137J877m898p279j304P742J171m59K032l639
9593A5866l845l542N316J347n149J3119J0133r390j2580L138q17j192j0232j398
9579G74K444k480k169n448n420L282N986L758J0563n45o23R19N635j893K491j941
9563A5333m354J323k897k922r54k065l175J52J873N185k384n188M947j506m317
9548i49o92P244p361k339o388K220K760r097M457J1019R566J489k870o180l8k259
9532E82l621N11K838o73m047j649m377l064N277J1134M61L317O31m583L14N293
9516H344R908N374r433j5802M387N591q32K603J058L917p327m997p960n701K04
$$ plain form
9623 75473 78342 75579 60403 55659 54854 48385 48944 43009 37159 30454 29960 27073 27819 33275 30184
9608 30184 20086 18474 14489 7423 13486 20623 22500 17602 10323 9019 16761 17932 17473 19505 15866
9593 15866 12021 8479 13795 15142 9993 23112 33245 23855 11275 14413 13596 12404 2172 774
9579 774 3218 738 -1431 -6879 -12299 -9017 -3031 727 11290 10745 10122 11041 16676 14783 17274 15333
9563 15333 10979 12302 9405 6483 5529 3464 289 441 2314 7499 5115 -73 4874 3368 -949
9548 -949 -1641 5603 -1758 -4097 -10485 -8265 -5505 -14602 -10145 874 10440 11929 9059 2879 2841 582
9532 582 -3039 -2528 310 -363 -4410 -6059 -10436 -13500 -8223 2911 3372 6689 7320 2737 3051 8344
9516 8344 18252 23626 14193 -1609 2778 8369 7537 10140 11198 15115 7788 2791 -5169 -10870 -10666
9501a0666M538L768J239K831P926K98R28N279o400j928r433r54Q483p35k312K930
9485E792J690k019j659L060P490J02n447k337J66j372J615K87K336L91K294P52
9469A3141n253q818Q016L177Q051k080O836k560j3738q759R283P671n690P72o01
9454I448k377J090K357o215l448k10n578n367R14J019L533p60O235M596J0524
9439A5761L467r530m483n450M32n506p887J653J021M224n65J709j470k236N451
9424c409k31J607q9J21M309j643m091N029J015k811J1888Q543j1453l183R244
9409A4846K535J168M259M074M53L897m48r761o204q969j2940n784N950Q840J043
9394B959Q258j296q589m803l631L853P006j394J62R23j328m994K358k421o042
$$ plain form
9501 -10666 -6128 -2360 -1121 1710 9636 9934 10862 16141 9741 7813 -1620 -2574 5909 5174 2862 5792
9485 5792 7482 5463 3804 6864 14354 14456 9009 6672 6838 5466 7081 7368 9704 10095 12389 13141
9469 13141 7888 -930 7086 10263 18314 16234 23070 20510 6772 -1987 7296 14967 9277 10049 9448
9454 9448 7071 8161 10518 4303 855 645 -4933 -10300 -9386 -8367 -4834 -5594 641 5237 15761
9439 15761 19228 9698 5215 -235 197 -5309 -13196 -11543 -10522 -6298 -6863 -5154 -6624 -8860 -3409
9424 -3409 -3640 -2033 -2122 -2001 2308 665 -3426 1603 2618 -193 11695 20238 8785 5602 14846
9409 14846 17381 18549 22808 26882 27335 31232 30784 21023 14819 5850 -7090 -12874 -6924 1916 2959
9394 2959 11217 9921 1332 -3471 -7102 -3249 3757 2363 2525 3448 2120 -2874 -516 -2937 -8979
9379h979L943k204L434P809j978K338k386L065M84j2789j145k731j784P533L385
9364b005n266L22M677M292M542N925M367p407K004J064n116L243P686m22j0441
9349G465r78J422J574r44o299m870r597j804O213K536J497p68k344R514O508J0586
9333A9711J296j4319r647q419J2553K945m138m548R40L060n209p26O948M529K57
9318E233n242N125J1839P08r709n789J031j119n820q79O292O181j265r344L60
9303b398K170L536N756q016n236p304l502K101N619M526K228O715q759m866P736
9288C06J017K32J389o710p189M018K022l091o421N928P025O04J173P24n970J809
9272c134K316J690k313L28n250p431o01q01K32J3123K938p662R228L722l966N076
$$ plain form
9379 -8979 -5036 -7240 -3806 4003 2025 4363 1977 5042 5526 -7263 -8408 -11139 -12923 -5390 -2005
9364 -2005 -7271 -6949 -2272 2020 6562 12487 16854 9447 11451 12515 7399 10642 18328 17906 7465
9349 7465 6487 7909 9483 8539 2240 -2630 -12227 -14031 -7818 -5282 -3785 -4553 -6897 2617 9125 19711
9333 19711 21007 6688 -2959 -11378 1175 4120 -18 -4566 -3626 -566 -5775 -6501 447 4976 5233
9318 5233 -9 5116 16955 17663 7954 2165 3196 2077 -3743 -4622 1670 7851 6586 -2758 -2398
9303 -2398 -228 3308 9064 1048 -4188 -11492 -14994 -12893 -7274 -2748 -520 6195 -2564 -7430 306
9288 306 1323 1555 2944 -3766 -10955 -6937 -4915 -8006 -14427 -8499 -1474 -870 303 1027 -4943 -3134
9272 -3134 -818 872 -1441 -1113 -6363 -13794 -14395 -15196 -14964 -1841 1097 -6565 2663 6385 2419 7495
9256G495P06M4R40l864L678n358o375M47M143O302L79O7M572J061N903o897n543
9239G700J34p97j484J541Q783Q496O37n253j5724j1018n18M880M017N083o56j3101
9223g280K121L260N394K78K004n365k590N806P972K802j996k834m436n102P17
9208G51p718q149L104J4330K373q556q080K454O312M581j16K07O334L776j15J239
9192A2727m707q882j0605o143l298R724N395J3970J2621r912r756j273r21J401
9178C41Q272k739M386j762p360l337N180o95n188K179m66Q891p05m325l490P128
9162F310P130J0795m748q76m977j4392o390Q129k500M605n654k307K371n29q042
9147a1075P858R141M413n25O849M963j1429r218o635m717Q271O417o544j4940
$$ plain form
9256 7495 8201 8245 9185 5321 8999 3641 -2734 -2287 1856 8158 8537 8604 13176 14237 20140 13243 7700
9239 7700 7834 7037 5553 7094 15877 24373 25010 19757 4033 -6985 -7503 -2623 1394 6477 5821 -7280
9223 -7280 -5159 -1899 3495 3773 5777 412 -2178 3628 11600 14402 12406 9572 5136 34 751
9208 751 -6967 -15116 -12012 2318 4691 -3865 -11945 -9491 -3179 1402 1286 1493 7827 11603 11488 12727
9192 12727 8020 -862 -11467 -17610 -20908 -11184 -5789 8181 20802 10890 1134 -139 -1060 341
9178 341 8613 5874 10260 8498 1138 -2199 2981 2286 -2902 -723 -1189 7702 6997 2672 -818 6310
9162 6310 13440 24235 19487 18611 13634 -758 -7148 981 -1519 3086 -2568 -4875 -2504 -3033 -11075
9147 -11075 -3217 5924 10337 9812 16661 21624 10195 977 -5658 -10375 -2104 4313 -2231 -17171
9133a7171m913Q040O564J173k735M795N794j0N55l440m285J3632J6673K3665J8791
9118F7128k621j7671j7417k639j5839o693k993K228P627n09l141p111o385P046
9104A010p1M032N691m43l102o573m274N231J315l922k78k060N12K549r76M628
9088C269O258J573l959J978N345r625n391O203K392J767R363J4259R421R485n514
9073D6824j3765j9773n130q409P587K346Q44K117Q58q539n472q134l821P598N170
9058C01p352N374P684M967Q957n919n343o244n281J1460M79j0522q054O068J1949
9043H524k042n206O32m579o23K167k544L474M288m772n820K085M24m979l451J3137
9027G15J632p466j0833K196j196K529j194Q417K02M509O216j2801o49K666l72
$$ plain form
9133 -17171 -22084 -14044 -7480 -6307 -9042 -4247 1547 1537 2092 -1348 -5633 7999 24672 48337 67128
9118 67128 64507 46836 29419 26780 10941 4248 1255 3483 11110 10601 7460 349 -6036 1010
9104 1010 939 4971 10662 10219 7117 544 -3730 1501 2816 -1106 -1384 -3444 -2932 -383 -1359 3269
9088 3269 9527 11100 7141 9119 14464 4839 -552 5651 8043 9810 19173 33432 42853 52338 46824
9073 46824 33059 13286 8156 -253 7334 9680 10524 12641 13499 4960 -512 -8646 -12467 -4869 301
9058 301 -7051 -1677 6007 10974 19931 14012 8669 2425 -2856 8604 9083 -1439 -9493 -3425 8524
9043 8524 6482 1276 1908 -2671 -3294 -1127 -3671 -197 4091 -681 -6501 -4416 -3992 -8971 -12422 715
9027 715 2347 -5119 -15952 -13756 -14952 -12423 -13617 -5200 -4998 -489 5727 -7074 -7723 -5057 -5429
9012e429L902Q379n296k538M025p69k644k421j635n073k039K248M400L983K915
8997B008l134J95l530k93m598J658Q968m174l654l533p291M253J4380J1967k457
8982A0765J834k578n564o703R52R007R96k085m776q42n23j846l784J1054J880
8967G787k515q390P08j223j613P769j408l417N255j482j1008J805M096L147N297
8952D808N948m620o792J681L482l211o077k545M079K018q9L782n252m8N169K128
8936D461l955m417J194M24J300j571J877k890P612J0729L111j0328m047m221K79
8921d42M239M843K288J057l221m30k26J092m61J181L102m38L220j561l367j0479
8905C97l719k296m71l287N124L394m720j2832r445O671Q871J0573l979k318N229
$$ plain form
9012 -5429 -1527 6852 1556 -982 3043 2274 -370 -2791 -4426 -9499 -11538 -9290 -4890 -907 2008
8997 2008 -1126 -931 -4461 -4754 -9352 -7694 1274 -2900 -6554 -10087 -17378 -13125 1255 13222 10765
8982 10765 12599 10021 4457 -2246 -1294 7713 8709 6624 1848 1006 483 -1363 -5147 5907 7787
8967 7787 5272 -3118 -2410 -3633 -5246 2523 1115 -2302 2953 1471 -9537 -7732 -3636 -489 4808
8952 4808 10756 6136 -656 1025 4507 1296 -4781 -7326 -3247 -1229 -1318 2464 -2788 -2836 2333 4461
8936 4461 506 -3911 -2717 -2293 -993 -2564 -687 -3577 4035 14764 17875 7547 3500 -721 -442
8921 -442 3797 8640 10928 11985 8764 8334 8108 9200 8739 9920 13022 12584 15804 14243 10876 397
8905 397 -3322 -5618 -6089 -9376 -4252 -858 -5578 -18410 -27855 -21184 -12313 -1740 -5719 -8037 -2808
8890b808J1271J811l110j3594o504O187m822k919M475J8179R783j598j4939o811
8876e399n452M333L097K67J4810P711K795n89k754O60r60j885k697q237j102m597
8860Ar259N559N88l347K504J1018K805k539r47k755j0972o06N84M397O64k075
8844d380M52m972J0885J4329N463J308L95p970p981j093N865n879J67m678O762
8829H673l007m456r52P137j595j0370J020k871Q541L3O09j322p171k014n669k525
8813a5939M019J0227q364n640J739J1408J2008J44o213p359L276l690j313L250
8799b447J814K957J499m503o064K949M939O021O558j252n992k152P560J1609p27
8784B2769Ll190o676n758j936J2773p23M093k745n982J01m316L314j029p648r979
$$ plain form
8890 -2808 8463 10274 7164 -6430 -12934 -6747 -11569 -14488 -10013 8166 17949 16351 1412 -5399
8876 -5399 -10851 -6518 -3421 -3154 11656 19367 22162 21573 18819 19479 18519 16634 13937 5700 4598 1
8860 1 -9258 -3699 -3111 -6458 -3954 7064 9869 7330 6383 3628 -7344 -7950 -7366 -2969 -2305 -4380
8844 -4380 -3928 -8900 1985 16314 21777 23085 23480 15510 7529 6436 12301 6422 6589 1911 8673
8829 8673 5666 1210 258 7395 5800 -4570 -3550 -6421 2120 2153 2762 1440 -5731 -7745 -13414 -15939
8813 -15939 -11920 -1693 -10057 -15697 -13958 -2550 9458 9602 3389 -3970 -694 -4384 -5697 -2447
8799 -2447 -633 2324 3823 -680 -6744 -3795 1144 7165 13723 12471 6479 4327 11887 23496 22769
8784 22769 22772 19582 12906 7148 5212 17985 17262 21355 18610 12628 12729 8413 11727 10698 3050 -6929
8768f929m623K93K764M935L324J366L920L58M612M874o439k806n47R53m033O04
8752B626p462k774J4645j857p179n950k215O684K53L623O773j1308O1j712k659
8737h451N966k376q538J606M868O465N83j889K218J854L121M318m455j646K367
8722F011q749l22m43j4561l241Q401J0606o366m697J892O018J7523l277L442R481
8707B1718J726m397m672k278p552j32J736L936K816l256n604l299N012J2642J905
8692B0301j0226j4084p17L762K11j0929l383N582R725J0503O609n57M39n748k944
8677H544r396j661o810q774J8881N730l764J526O557j650j490n441n297j736n66
8662e347J853n425J1584Q292n834k413n6m897r138K767J578o365Q20R032P657
$$ plain form
8768 -6929 -11552 -11259 -8495 -3560 -236 1130 5050 5408 10020 14894 8455 5649 5102 6055 2022 2626
8752 2626 -4836 -7610 7035 5178 -2001 -7951 -10166 -3482 -3229 394 7167 -4141 -4080 -5792 -8451
8737 -8451 -2485 -4861 -13399 -11793 -6925 -460 123 -1766 452 2306 5427 9745 5290 3644 6011
8722 6011 -2738 -3060 -3503 -18064 -21305 -12904 -2298 -8664 -13361 -11469 -5451 12072 8795 12237 21718
8707 21718 23444 19047 14375 12097 4545 4413 6149 10085 12901 9645 4041 742 5754 18396 20301
8692 20301 10075 -4009 -4726 -964 -753 -11682 -15065 -9483 242 10745 17354 16797 17236 11488 8544
8677 8544 -852 -2513 -9323 -18097 784 6514 2750 4276 10833 9183 7693 2252 -3045 -4781 -5347
8662 -5347 -3494 -8919 2665 10957 5123 2710 2654 -2243 -11381 -8614 -7036 -13401 -12581 -3549 4108
8647D108j051R20l660k488J869R456o754j0308N236P793L114J2642q07k539j027
8632A6504p497k956k22L648o306n244L992J3711q086j0407O947J3090R666K735
8618B9575o331p522l986j807k339J547R71k236N01J947N12J0727L205o136j634
8603A6994L219M635n054j0287l827K404J204J2612J858k109k187k754m400j549
8589A0759R911L019m241q321q954L623Q560k739O837J837J663M217m410K132O007
8574B9900J0768J2535M28j3577j0454J152J3220l187j917p880r161p77M667L192
8560B8909Q75m154N777M670k290p538R483J6807k70L326n361l58O471M310J7388
8545G8045J0960J1558M983L652P571L381N917O274p980j7037j5147j4552k434
$$ plain form
8647 4108 3057 3977 317 -2171 -302 9154 2400 -7908 -2672 5121 8235 20877 20070 17531 16504
8632 16504 9007 6051 5829 9477 3171 -2073 1919 15630 7544 -2863 4084 17174 26840 29575
8618 29575 23244 15722 11736 9929 7590 9137 10108 7872 8373 10320 10832 21559 24764 18628 16994
8603 16994 20213 24848 19794 9507 5680 8084 9288 21900 23758 21649 19462 16708 12308 10759
8589 10759 20670 23689 19448 11127 2173 5796 14356 11617 18454 20291 21954 26171 21761 23893 29900
8574 29900 40668 53203 53631 40054 29600 30752 43972 40785 38868 30988 21827 21050 25717 28909
8560 28909 29784 25630 31407 36077 33787 26249 35732 52539 52269 55595 50234 49876 56347 60657 78045
8545 78045 89005 100563 105546 109198 116769 120150 126067 132341 124361 107324 92177 77625 75191
8532G5191p448j7616l492J591K209n219K094o68o078m168n617n763j533O985K463
8517C2931m499p716j085J140j522m750N766Q458r003p161j2474l218O293Q088
8503A1248N833l064m959j744l640j621l719K571O87K475j12r641n995Q565O084
8488B968J815p044m518R796J1037M218J063n647n705K233n773N518n221j1558
8474f818R910J4361M27m282J480m841p76M225Nl205l219j0753l81R987l659N16
8458B977P647m568j2968j055L776M877L287K905k182k286R805k749m257L178O906
8443A5293R95L018K599K19O988N279r392j2314J896O693N80l325K139o839l318
8428A0511m889l711K315k776K936M338K219J858J713n250m728k541N314O316r534
$$ plain form
8532 75191 67743 50127 46635 48226 50435 45216 47310 46642 40564 36396 30779 25016 23483 30468 32931
8517 32931 28432 20716 19631 20771 19249 14499 20265 28723 19720 12559 85 -3133 3160 11248
8503 11248 17081 14017 9058 7314 3674 2053 -1666 905 1592 4067 3955 -5686 -11681 -3116 2968
8488 2968 4783 -2261 -6779 3017 14054 18272 19335 13688 7983 10216 4443 9961 4740 -6818
8474 -6818 3092 17453 17880 13598 15078 10237 9461 13686 13691 10486 7267 -3486 -3867 6120 2461 2977
8458 2977 10624 6056 -6912 -7967 -4191 686 3973 6878 4696 2410 12215 9466 5209 8387 15293
8443 15293 16288 19306 21905 22124 29112 34391 24999 12685 14581 21274 21854 18529 20668 13829 10511
8428 10511 5622 1911 4226 1450 4386 8724 10943 12801 14514 9264 4536 1995 7309 13625 4091
8413D091m171q603r31Q388Q04L408p241r976J258K0M388J1722J025r127J240p16
8397d421P558P072p056j0731N680j274k237L204M579m268l061m50K685J3622k271
8382H631l629L924O595R245m238j1219l718k684l254M139K037M008j746o396M18
8367B113j597k299o614M989L837M268j361l771L510L189M185J405n139K493n174
8352D034p474O245J141m471l202l5J5042M833n507p356J984N887j935p673Q814
8337A0327J4609J7302J2999n18j1106k0710m823m125M750M051R41n817r077o148
8323B655o094K467r75n9k820j06N10J276n578L7N652J1332M12L786Q895j091m857
8306A5442p532O140m52o850o619j55L07rO401Q265k169o59q687J0306J0045N295
$$ plain form
8413 4091 -80 -8683 -9614 -1226 -422 2986 -4255 -14231 -12973 -12953 -8565 3157 4182 -4945 -3705 -4421
8397 -4421 3137 10209 3153 -7578 -1898 -3172 -5409 -2205 2374 -1894 -4955 -5405 -2720 10902 8631
8382 8631 5002 8926 15521 24766 20528 9309 5591 2907 -347 3792 5829 9837 8091 1695 2113
8367 2113 516 -1783 -8397 -3408 429 4697 3336 -435 3075 6264 10449 11854 6715 9208 4034
8352 4034 -3440 2805 3946 -525 -3727 -3762 11280 16113 10606 3250 5234 11121 9186 1513 10327
8337 10327 24936 42238 55237 54719 43613 22903 18080 13955 18705 22756 23697 17880 8803 2655
8323 2655 -3439 -972 -1947 -2006 -4826 -4932 -4422 -3146 -8724 -8687 -3035 8297 8709 12495 21390 20299 15442
8306 15442 7910 14050 13598 6748 129 -26 281 272 6673 14938 12769 12110 3423 13729 23774 29069
8290B9069k829j3522q468m609q322o090o90K477o355l316P597R816N643O174N650
8275A2225l383M39J906L218k904j789M290J493j0312n179P301m880K678o409l765
8260e071P49J599q648m078K969R597J3246l424n657O807M248n080k629M42m792
8245B78P635l681k876l72m905m966P13P733j448m256m748O346N664J1102kK015
8229A4232j617j111k405k483O986N526j0193J426J1074j0990j5809N53q561n662
8215a9034n466j015Q703J1547o205n59J30R924J035M723r277m442O466J4631M026
8200A5187r614j0682k483L852N477K799Q961n037r557m679J605L494K634J258
8186C215m88l658j1065l003N969J462J698O052M255J0916m198n58j0754n560N213
$$ plain form
8290 29069 26240 12718 4250 -359 -8681 -14771 -15461 -12984 -19339 -22655 -15058 -5242 401 6575 12225
8275 12225 8842 9281 11187 14405 11501 9712 14002 15495 5183 4 7305 2425 5103 -1306 -5071
8260 -5071 -4322 -2723 -11371 -15449 -12480 -2883 10363 6939 1282 8089 12337 7257 4628 5070 278
8245 278 7913 4232 1356 984 -3921 -8887 -8174 -441 -1889 -6145 -10893 -4547 1117 12219 12217 14232
8229 14232 12615 11504 9099 6616 13602 19128 8935 10361 21435 10445 -5364 -4811 -13372 -19034
8215 -19034 -24500 -25515 -16812 -5265 -11470 -12029 -11899 -1975 -940 3783 -5494 -9936 -3470 11161 15187
8200 15187 5573 -5109 -7592 -3740 1737 4536 13497 8460 -1097 -5776 -4171 -677 1957 3215
8186 3215 2727 -931 -11996 -14999 -9030 -7568 -5870 182 4437 15353 11155 10597 -157 -5717 -504
8171e04J0535j839o216n023N47P632k013L718m577j7034k774k40N189K936m473
8156a4136k180O443J3862O036K372n885r158l231l629j792O120N992K155P49M471
8141H189r628j0779R042Q260L915j0249j58m205j658J055n057l524J948N866P051
8126F8M793K031m423M773j138L717l053o414k930M04r063K714R878N121j5023
8111h545q257L968J0250N63R90L566R407n674L106N56q175n161k326N698L748
8096C714K057R41N756r03l200K073m552q334L29r78l795n399J604j615Q51L027
8080h424M250m942j968J3511n017n613k53O573k03l667L117N990j448j191j813
8065a098K211J3464m999j1741p7r560n277J1297j303L924L857O730M68K390r057
$$ plain form
8171 -504 10031 8192 1976 -3047 -2500 5132 3119 6837 2260 -14774 -17548 -17788 -12599 -9663 -14136
8156 -14136 -16316 -9873 3989 10025 12397 6512 -2646 -5877 -9506 -11298 -5178 814 2969 3718 8189
8141 8189 -1439 -12218 -3176 5084 8999 -1250 -1408 -5613 -7271 -6216 -11273 -14797 -12849 -6983 68
8126 68 4861 6892 2469 7242 6104 9821 6768 354 -2576 -2172 -11235 -8521 1357 6478 -8545
8111 -8545 -16802 -12834 -2584 -2021 -1031 2535 11942 6268 9374 9930 1755 -3406 -5732 -34 3714
8096 3714 5771 6712 12468 11565 8365 10438 5886 -2448 -2119 -3097 -6892 -12291 -10687 -12302 -11451 -8424
8080 -8424 -4174 -9116 -11084 2427 -2590 -8203 -8456 -1883 -2086 -5753 -2636 3354 1906 715 -1098
8065 -1098 1113 14577 9578 -2163 -2240 -11800 -17077 -5780 -7083 -3159 698 7428 7896 10286 1229
8050A229n899k90J767M607N552n947K941K404p979k4j993R122N559r32n670o513
8034b066M859m370L42L125K724p83p786L296K259l187k190P807J2665j012k652
8019A3031r618m589k041l83L822N71L812P78m886p533K58Q802j64m157l762l840
8003i899J148M894r40j991P663N118k576J48j84k818M780q361M924L713q479r896
7987a2756k044M457J0280Q631k855M487M73p117m721p83L545J1224O70K213l117
7972A2587n164L343j707j049o427L164L891J293M505K21l616m545o935P12M934
7957E207N752o453q872j042J1765P880j228j234m368j96O92L285n99J060P538
7942A9187r254j1374j219P426N728L045l072k239p239m210JK827K021N153N229
$$ plain form
8050 1229 -4670 -4960 -3193 1414 6966 1019 3960 6364 -1615 -1639 -3632 5490 11049 10117 4447 -2066
8034 -2066 2793 -1577 -1235 1890 4614 3831 -3955 -659 1600 -1587 -3777 4030 16695 15683 13031
8019 13031 3413 -1176 -3217 -3600 222 793 4605 5383 497 -7036 -6778 2024 1860 -2297 -6059 -9899
8003 -9899 -8751 -3857 -4797 -6788 875 5993 3417 3565 3381 563 5343 -3018 1906 5619 -2860 -12756
7987 -12756 -14800 -10343 -63 8568 5713 10200 10673 3556 -1165 -1948 1597 12821 13491 15704 12587
7972 12587 7423 10766 9059 8010 1583 4747 8638 9931 14436 14657 11041 6496 -439 273 5207
7957 5207 10959 4506 -4366 -5408 6357 14237 13009 11775 7407 7211 7903 11188 10589 11649 19187
7942 19187 9933 -1441 -2660 4766 10494 13539 10467 8228 989 -3221 -3220 -393 1628 6781 12010
7927A2010m344m283j33L2O617m244p784J974P960L8q815j949J0651O089L274l097
7911A3996m138J386l816L82n893n678m123K580J0517R009J362P978O3m104j1719
7896G802j432O64j26l717j570q2J36J486m808l458J031J1763k663n798m382r470
7880a4624l230J1315Q179J995k401j3042M248Q685J2166N133k330k740m065k675
7866F614m219K745q657J137j313O572R17J466P380K66L556k793j1651m311j301
7851c592Q3J619K842j980k937M33K034p38j438M2j712Q88J917P2n68L518l543
7834c060j527R200N498n338K291L229j1421p666m387O712R075r750k923j919J70
7819a1816M761Q065k418P850J2107k705q372k445o285L889M202Q03p201o446K557
$$ plain form
7927 12010 7666 3383 3250 3282 9899 5655 -2129 -155 7805 7843 -972 -2921 7730 13819 17093 13996
7911 13996 9858 11244 7428 7810 1917 -3761 -7884 -5304 5213 14222 15584 23562 23625 19521 7802
7896 7802 6370 7034 6908 3191 1621 1539 1675 3161 -1647 -5105 -4074 7689 5026 -772 -5154 -14624
7880 -14624 -17854 -6539 1640 3635 1234 -11808 -7560 1125 13291 18424 16094 13354 9289 6614
7866 6614 2395 5140 -3517 -2380 -3693 2879 3796 5262 12642 12908 16464 13671 2020 -2291 -3592
7851 -3592 -3509 -1890 952 -1028 -3965 -3532 -1498 -2236 -3674 -3632 -5344 -4456 -2539 -2467 -3035 483 -3060
7834 -3060 -4587 4613 10111 4773 7064 10293 -1128 -8794 -13181 -6469 2606 -7144 -10067 -11986 -11816
7819 -11816 -7055 1010 -1408 6442 18549 15844 7472 5027 -1258 2631 6833 7636 435 -6011 -3454
7804c454L405P936n460K678L266r508j5081L494J041M189Q857N103N78k13m183
7789B648k8J40n132J1540k406l882l842O454K328q873m857m353k350J0483J2814
7774A0684o775k20l74J028m383k490m32r954L858Q711m207l112k43k076m239O183
7758h041J1151r57n62k6j195n103Q01K984l62k006O09K53k622o057k506P503L425
7741b711M970N087L539k66p367j4024J525L217J646K284K682j975j735O365N528
7726H765j822l523o23o899n185j356R770J957R16k886O71Q78k104l129k148p495
7710a4213J632J2135N927j553j809m81K869j391l466k23L956k399M702o708L699
7695B677m22k865L062l915k586m167l181K304J635j1586m069J1556J4745K802
$$ plain form
7804 -3454 -49 7887 2427 5105 8371 -1137 -16218 -12724 -11683 -7494 1363 6466 7044 6831 2648
7789 2648 2620 2760 -2372 9168 6762 2880 -962 5492 7820 -1053 -5910 -10263 -12613 -2130 10684
7774 10684 3909 3689 3315 4343 -40 -2530 -2962 -12916 -9058 -347 -4554 -7666 -7909 -9985 -14224 -8041
7758 -8041 3110 2153 1591 1565 370 -4733 -3932 -948 -1310 -3316 -2707 -2454 -5076 -11133 -13639 -6136 -2711
7741 -2711 2259 7346 10885 10619 3252 -10772 -9247 -6030 -4384 -2100 582 -1393 -3128 3237 8765
7726 8765 6943 3420 2797 -4102 -9287 -10643 -873 1084 2000 -886 -215 663 -1441 -4570 -6718 -14213
7710 -14213 -12581 -446 5481 3928 2119 1638 4507 3116 -350 -573 3383 984 5686 -1022 2677
7695 2677 2255 -610 2452 -1463 -4049 -8216 -11397 -9093 -7458 -19044 -23113 -11557 3188 5990
7681E990n744j735R202P441p582j589l796m848M126m131k3r828j0971q30R207
7666a5111J1446K889J1260n327p503j0819j29k824n434M883L480P750Q023M429
7652G013k032l292l119L238k803K538j512j261P58m497N69K381K407j120P485
7637F753Q523k402k268p311l642M387Q809K544Q52q931j4150P47J672J2770M257
7622A2610r562j783M002o307r332j656M125N660P629r226N099M543N012M895J294
7607A7003l839o425k061j863J071l953n059k201N348P366o484p350L326O330p59
7592D50n483j0968J0393O035K182L05m134L803K187P09j0015N40l646m732m412
7577a6786O11J0958P091p546p931l359J714N567P069m386m534J0750L494L726
$$ plain form
7681 5990 246 -1489 7713 15154 7572 5983 2187 -2661 1465 -2666 -2689 -12517 -23488 -24318 -15111
7666 -15111 -3665 -776 10484 5157 -2346 -13165 -13294 -16118 -21552 -16669 -13189 -5439 2584 7013
7652 7013 4981 1689 -1430 1808 -995 1543 31 -1230 -472 -4969 -4400 -2019 388 -732 6753
7637 6753 15276 12874 10606 3295 -347 4040 12849 15393 16245 7314 -6836 -6089 -4417 8353 12610
7622 12610 3048 1265 5267 -1040 -10372 -12028 -7903 -2243 5386 -3840 1259 5802 10814 15709 17003
7607 17003 13164 6739 4678 2815 3886 -67 -5126 -7327 -1979 5387 -1097 -8447 -5121 1209 450
7592 450 -5033 -16001 -5608 427 2609 2914 -1220 2583 4770 5479 -4536 -3996 -7642 -12374 -16786
7577 -16786 -16175 -5217 1874 -5672 -13603 -16962 -15248 -9681 -2612 -6998 -11532 -782 2712 6438
7563F438J312j192k883P46j867r318J014j285n701K474N167N445j281Q81K172
7548B122K725J707l682L773o774m117m806J416n696K851N48r62p30K08R145J0021
7532G749R378r070j0250p04O159j033j1353j658k008N03k654R908J1515j323O46
7517E805j104r481n564L748K929O959M381l664o314k065n044N303J55m100P59
7502g297J070Q75n462N846l634L204L012M187m854k973N243k58K410O231r813
7487b213j171M821L297k564L678o758n107k09k545J588R650M547K337k677q085
7472a411n175q394m733N544R964J221k582p066l848r990M505K0502J0723M130
7458A3390l912n430Q38k08R05o463l67J703n127r178J636K806P98O48n389L221
$$ plain form
7563 6438 7750 6558 3675 4421 2554 -6764 -5750 -7035 -12736 -10262 -5095 350 -931 -50 2122
7548 2122 4847 6554 2872 6645 -129 -4246 -9052 -7636 -13332 -10481 -9933 -10895 -11625 -11417 -2272 7749
7532 7749 17127 8057 -2193 -2897 3262 2229 -9124 -10782 -12790 -12287 -14941 -5033 6482 5159 5805
7517 5805 4701 -4780 -10344 -6596 -3667 3292 7673 4009 -2305 -4370 -9414 -4111 -3956 -8056 -7297
7502 -7297 -6227 -5352 -10814 -4968 -8602 -5398 -2386 1801 -3053 -6026 -783 -1041 1369 7600 -2213
7487 -2213 -3384 1437 4734 2170 5848 -910 -6017 -6226 -8771 -7183 2467 7014 9351 6674 -1411
7472 -1411 -6586 -14980 -19713 -14169 -4205 -2984 -5566 -12632 -16480 -26470 -21965 -1463 9260 13390
7458 13390 9478 4048 4886 4678 5583 -880 -1247 456 -4671 -13849 -12213 -9407 -8609 -7961 -13350 -10129
7442a0129o578J593L307M423P538m438O72R649j639R608j035J05o399o140k2P017
7426G532l0j512j1157n259j055k382Q36j393P367J911o547K565L502J0226Q515
7411A3119j604m365p527n753K282K442n766l322K055J845L337O105j709J0421
7397A1560Q114o945n742M664O206o293j1246L434R79l191k703J620j697m714J032
7382d922P263m477k574j232P910L066K610j3539j0826L640L64K578J6187K667
7368H715n228n261M139k0o498l375m790L348J2590l591q797j723p56l226R049
7353e424l56n671N229J1536K630o848j2389o61R269P585r18m895o775l274P532
7338c430O317p867m087P65K127J675l640l251L983j85j316L573J3008k018p241
$$ plain form
7442 -10129 -16707 -15114 -11807 -7384 154 -4284 -3612 6037 4398 14006 12971 13076 6677 537 515 7532
7426 7532 7502 5990 -5167 -10426 -11481 -13863 -13027 -14420 -7053 -5142 -11689 -9124 -5622 4604 13119
7411 13119 11515 7150 -377 -6130 -3848 -1406 -7172 -10494 -8439 -6594 -3257 2848 1139 11560
7397 11560 19674 12729 6987 11651 17857 11564 318 3752 4731 1540 -1163 457 -1240 -5954 -4922
7382 -4922 2341 -2136 -4710 -5942 1968 5034 7644 -5895 -16721 -13081 -12717 -10139 6048 8715
7368 8715 3487 -1774 2365 2345 -4153 -7528 -12318 -8970 3620 29 -8768 -10491 -11247 -14473 -5424
7353 -5424 -5780 -11451 -6222 5314 7944 1096 -11293 -11954 -2685 4900 3982 -913 -7688 -10962 -3430
7338 -3430 2887 -4980 -9067 -8302 -6175 -4500 -8140 -11391 -7408 -7593 -8909 -5336 7672 5654 -1587
7323a587O02M813R456q138j5474k802l637p80J3758J0483l382N324N832r092j2524
7308g148o070j4693L164J0693P399O243K981k430k979J574k813o651j912M387
7294h255O893L014r5l27j142K314k197n412K250J573m25o030j150M201J4169M925
7278A4306o27j3998j3679J433R82K061P983N123l070p509j604M636J0893M436
7264A1366q755J135j875r89o41j841l802R86k484o104n96L231k287j219R921L290
7248f64K008R548o507j60N879K320j01k289m929j2474K976K262k056L295J302
7233D10J560M175L164J758l152l447j063N464k136n080m788j286k624M038O217
7218C210o714j904N125M362j844k4K468n088p687L655L237k601j4137P037P484
$$ plain form
7323 -1587 -985 3828 13284 5146 -10328 -13130 -16767 -17547 -3789 6694 3312 8636 14468 5376 -7148
7308 -7148 -13218 -27911 -24747 -14054 -6655 -412 2569 139 -2840 -1266 -4079 -10730 -12642 -8255
7294 -8255 -1362 1652 1557 1230 88 2402 205 -5207 -2957 -1384 -1809 -7839 -8989 -4788 9381 14306
7278 14306 13679 -319 -13998 -12565 -11583 -9522 -1539 3584 514 -6995 -8599 -3963 6930 11366
7264 11366 2611 3746 1871 882 241 -1600 -5402 -4416 -6900 -13004 -13600 -10369 -12656 -13875 -3954 -664
7248 -664 1344 10892 4385 4225 10104 12424 12323 10034 5105 -7369 -4393 -2131 -4187 -892 410
7233 410 1970 6145 9309 11067 7915 4468 3405 8869 6733 1653 -3135 -4421 -7045 -3007 3210
7218 3210 -3504 -5408 -283 4079 2235 2211 4679 -409 -8096 -4441 -1204 -3805 -17942 -10905 -3421
7203c421k161R89r780N052J181k098k602M221P454m960M359n044r987L234R339
7188d224p88q989o763j323N84P76P362k545N348P464l358k882r3l719J63K299
7172a0688L498K367K446J4244L805k578l998q481k038L003J121Q81j0877l455
7158a0750n446j801j64m129M566R490k107M581j795r65N038R234L383p503j4439
7143a2807l546m163K560J1407O702Q38l148k957O493K624o034p949k473m175l661
7128b0289J342N030O774Q233q08l006p811R633M893m093m407j557J058j919l523
7113a0450O26j56O322J4667J829l019l469j145l239p316M507L104O346R98r537
7098F8m429m171L62K886j993M870M548n577j0132o339N318J5076L768Q64J947
$$ plain form
7203 -3421 -5582 -4593 -14373 -9321 -8140 -10238 -12840 -8619 -1165 -6125 -1766 -6810 -16797 -13563 -4224
7188 -4224 -5012 -14001 -20764 -22087 -21503 -20727 -13365 -15910 -10562 -3098 -6456 -9338 -9431 -13150 -12987 -10688
7172 -10688 -7190 -4823 -2377 11867 15672 13094 9096 615 -1423 1580 2701 3582 -7295 -10750
7158 -10750 -16196 -17997 -18161 -22290 -17724 -8234 -10341 -5760 -7555 -8520 -3482 5752 9135 1632 -12807
7143 -12807 -16353 -20516 -17956 -6549 153 991 -2157 -5114 1379 4003 -2031 -9980 -12453 -16628 -20289
7128 -20289 -18947 -13917 -7143 1090 282 -2724 -10535 -902 3991 -102 -4509 -6066 -5008 -6927 -10450
7113 -10450 -9824 -9980 -3658 11009 12838 9819 6350 5205 1966 -5350 -843 2261 8607 9605 68
7098 68 -4361 -8532 -8170 -5284 -7277 -2407 2141 -3436 -13568 -19907 -14589 487 4255 5119 7066
7083G066k018n220r52N067p270k931J111m487n800N428K72K356K624K422l39k398
7067e069N081J140k307L896O577K248q449j0152l46L088n315j1020j838P774K834
7052a1858K683j63L441r93p234N854L943n384q38k14m003k599L866J1206J0023
7037G730K769j405q90o63m799j4428j973L651P481P649j401n027L80j560K591
7022A05L311M720K596j585m417K177P098l125o241M36j409q626j5683q330K580
7007b6393J7515Q957K324O425O761J486P35m622L773m108j4884j1883j950l087
6993a8951O082L729J112R01p786m623Q795R252O707l159j1675M489P689O9m028
6978a397Q20n984o29R961M824p260M362M412p848j4676j076N399J905Q239J7122
$$ plain form
7083 7066 5048 -172 -1124 3943 -3327 -6258 -5147 -9634 -15434 -10006 -9734 -7378 -4754 -2332 -2671 -5069
7067 -5069 12 1152 -1155 2741 9318 11566 3117 -7035 -7381 -4293 -9608 -20628 -22466 -14692 -11858
7052 -11858 -9175 -9338 -5897 -6890 -14124 -8270 -4327 -9711 -10549 -10763 -14766 -17365 -13499 -2293 7730
7037 7730 10499 9094 8204 7541 2742 -11686 -13659 -10008 -2527 5122 3721 -1306 -926 -2486 105
7022 105 3416 8136 10732 9147 4730 6907 14005 10880 4639 5075 3666 -4960 -20643 -28973 -26393
7007 -26393 -8878 79 2403 8828 15589 17075 17810 13188 16961 12853 -2031 -13914 -15864 -18951
6993 -18951 -12869 -9140 -8028 -7127 -14913 -19536 -10741 -1489 5218 2059 -9616 -5127 2562 2631 -1397
6978 -1397 -577 -6561 -7190 2771 7595 335 4697 9109 1261 -13415 -14491 -9092 -7187 1052 18174
6963A8174k24j7567n896Q455J443p326L34L849j458p36k589l753M80R37O772K752
6947C647m309N58j827n41n018J204k276o078L627P40m055q28Q41J22N253M303
6931d637M718J617N404j371m103j196m670L371N403R078O943m711p33o420o324
6916B369N563J908j1011j822J3099K363p267k400M289N04q908j960N444J199L908
6901G278l088q552N531J1778O79j2698n334l394q91K973K481j0847m76O024m255
6886a2791m71P100J1050M517m172l349o979p159j796N448O586R461mm388j073
6871A980K373r246m941J3869M409l301p250N126M686Q58j313n742p026j921j148
6856h587M54j062J472N653L32k887m247P034j362pk708n816M723L083j295N950
$$ plain form
6963 18174 17950 383 -5513 2942 4385 -2941 -2607 1242 -216 -952 -3541 -7294 -6814 -5877 895 3647
6947 3647 -662 -104 -1931 -2472 -7490 -6286 -8562 -14640 -11013 -10273 -14328 -15156 -14315 -14193 -8940 -4637
6931 -4637 81 1698 7102 5731 1628 432 -4238 -867 4536 13614 20557 15846 15113 8693 2369
6916 2369 7932 9840 -1171 -2993 10106 12469 5202 2802 7091 7595 -1313 -3273 2171 3370 7278
6901 7278 4190 -4362 1169 12947 13626 928 -4406 -7800 -8691 -5718 -3237 -14084 -14560 -8536 -12791
6886 -12791 -13262 -6162 4888 9405 5233 1884 -5095 -12254 -14050 -8602 -2016 7445 7441 3053 1980
6871 1980 4353 -4893 -9834 4035 8444 5143 -2107 3019 7705 8563 7250 1508 -5518 -7439 -8587
6856 -8587 -8133 -9195 -7723 -2070 -1738 -4625 -8872 -1838 -3200 -3207 -5915 -11731 -7008 -3925 -5220 730
6840G30P617m066n503m115q01p655q05K369o74O444M007R805M101J814k68l435
6824I565l135k133K279N706p024O6p676p896J0131L470k124L214l214J097P180
6809I506M366j2434K394o656l058J459N010l95p256K988K955r814M765R85L164
6794b021N196m506J212j4049n607M303J989J186k663L583M589M795R509J134K105
6779A0755l563m312n371L558j115k751k370l058J3131J0607n132n548j0464K797
6765b836m411L197j429m374L543N100k050M654k877M228M492j489J171m391K612
6750E140K870r719j3634K632M281N694l32n100J97O05J2782k113j467L778o835
6735a221k225k812P597J95K565O527J841q456j763k315L138M864K551m139j868
$$ plain form
6840 730 8347 4281 -1222 -5337 -6138 -13793 -14598 -12229 -12903 -6459 -2452 7353 11454 13268 13000 9565
6824 9565 6430 4297 6576 12282 5258 5324 -2352 -10248 -117 3353 1229 4443 1229 2326 9506
6809 9506 13872 1438 3832 -2824 -5882 -4423 587 192 -7064 -4076 -1121 -10935 -6170 -5185 -2021
6794 -2021 3175 -1331 -119 -14168 -19775 -15472 -13483 -12297 -14960 -11377 -6788 -1993 7516 8650 10755
6779 10755 7192 2880 -2491 1067 -48 -2799 -5169 -8227 4904 15511 10379 4831 -5633 -2836
6765 -2836 -7247 -4050 -5479 -9853 -6310 -1210 -3260 1394 -1483 2745 7237 5748 6919 2528 5140
6750 5140 8010 -1709 -15343 -12711 -8430 -2736 -3068 -8168 -7971 -7366 5416 3303 1836 5614 -1221
6735 -1221 -3446 -6258 1339 1534 4099 10626 12467 4011 2248 -67 3071 7935 10486 6347 4479
6720D479r336j913M950P810P51K165R393n174j3843L095K168n265n784Q216J850
6705C562r280L228l2P616m066l450l492K683R115p401j1463R80J0910N995n146
6690b41p354M400J1559K737j3669k362r95N276J460P87o041M136O79R33M463j4748
6674h980p826k647M485R049J0349k026r788N990J2301p917o537N209K131o034
6660b241K276O090L361m030Q02j197K271o611J755N686j954o975q3J696l433m017
6644f604Q619K051j1495n14J0749M452k485m822Q932n58m186m919K461P753m977
6629D457l172n647N535j929L358O258o652M910J440l75r319o305j982k78j0827
6614b0528p476J5813R089L179j330Q16l866j021m694m078j989l189Q860O572k786
$$ plain form
6720 4479 -4857 -6770 -1820 5990 6741 8906 18299 13125 -718 2377 4545 -720 -6504 1712 3562
6705 3562 -5718 -2490 -2522 5094 1028 -2422 -5914 -3231 5884 -1517 -12980 -12000 -1090 4905 -241
6690 -241 -7595 -3195 8364 11101 -2568 -4930 -5925 -649 811 1598 -4443 -307 372 1305 5768 -8980
6674 -8980 -16806 -19453 -14968 -5919 4430 2404 -7384 -1394 10907 2990 -3547 1662 3793 -2241
6660 -2241 35 6125 9486 5456 6258 5061 7332 721 2476 8162 6208 -767 -850 846 -2587 -6604
6644 -6604 2015 4066 -7429 -7943 2806 7258 4773 -49 8883 8325 4139 -780 1681 9434 4457
6629 4457 1285 -4362 1173 -756 2602 8860 2208 7118 8558 8183 -1136 -7441 -9423 -9701 -20528
6614 -20528 -28004 -12191 -3102 77 -1253 -437 -4303 -5324 -10018 -14096 -16085 -19274 -10414 -3842 -6628
6599f628r571M146J0747J192P394M139N075m837j2482j829K116L924O562j651
6585H297l98j183k640M745l135N806j8J441k942l955k006o600J89J787L935k463
6569H60q67k303L839m267p49o753n451O637O895K518j959P833J688J507J216J330
6553A1974k673r01M848Q31p357K064N178M878K64l687l446k906R91j718m831j065
6537B444m130K917K326j834l399k829K053P195L167n198j666J745j227k432M364
6522C496P11p166k340m47j237N358L973o144q846M210J1225k30n086L062J244
6507A783K099N4p405n485Q176P869m183j029M525j108P334Q19p354j5037J151
6492g791L483l055k477K555O814R684J445r996l112m273K276P895Q241k062k492
$$ plain form
6599 -6628 -16199 -12053 -1306 -114 7280 11419 16494 11657 -825 -2654 -538 3386 9948 8297
6585 8297 7899 6716 4076 8821 5686 11492 11474 12915 9973 6018 4012 -2588 -2399 -612 3323 860
6569 860 -7 -2310 1529 -2738 -3487 -10240 -15691 -9054 -2159 359 -1600 6233 7921 9428 10644 11974
6553 11974 9301 8400 13248 14079 6722 8786 13964 18842 19106 15419 11973 9067 10058 8340 3509 2444
6537 2444 -1686 1231 3557 1723 -1676 -4505 -2452 4743 7910 2712 1046 2791 1564 -868 3496
6522 3496 4207 -2959 -5299 -5746 -6983 -1625 2348 -3796 -12642 -8432 2793 2563 -2523 539 1783
6507 1783 3882 3936 -3469 -8954 -778 7091 2908 1879 6404 5296 12630 13449 6095 -8942 -7791
6492 -7791 -4308 -7363 -9840 -7285 -471 9213 10658 662 -2450 -6723 -4447 3448 11689 9627 7135
6477G135p792J270p05K650k827l887Q930N232q256m679J478l407MJ45M770k012
6461a951r37K906m129j688K960J636Q380p23m763k847M671j1282j2221L495Q219
6446h274N421K14J567L208l008q82J1875P716j132n392p898l744M490R455P424
6431B1040R22J826p870o110J81P057r359m935J773L453j1970p124P133N956j17
6416A856J590J0644M956j2353m901M708K485o573m963n084n04P035M722Q05N746
6401A0169j279j0800K682n543j42k74M377Q894Q38j910M939R138l739j0174q087
6386i11R16L087m018O468K101j228l461N180P403j393q377m719q044k230j654
6371a0880P816M314N722P076o405j0989n094J626R108K471L99P98p0o263n169
$$ plain form
6477 7135 -657 613 -92 2558 -269 -4156 4774 10006 1750 -2929 -1451 -4858 -4854 -4709 61 -1951
6461 -1951 -2888 18 -4111 -5799 -2839 -1203 7177 6454 1691 -1156 3515 -7767 -19988 -16493 -8274
6446 -8274 -2853 -2639 -1072 2136 -872 -1754 10121 17837 16705 11313 3415 -329 4161 13616 21040
6431 21040 21962 23788 15918 9808 9989 17046 7687 2752 4525 7978 -3992 -11116 -3983 1973 1856
6416 1856 3446 14090 19046 6693 1792 6500 8985 2412 -2551 -7635 -8139 -1104 3618 4423 10169
6401 10169 8890 -1910 772 -4771 -4913 -5187 -810 8084 8922 7012 11951 21089 17350 7176 -911
6386 -911 5 3092 -926 5542 7643 6415 2954 8134 15537 14144 5767 1048 -6996 -9226 -10880
6371 -10880 -3064 1250 6972 14048 7643 -3346 -8440 -6814 2294 4765 5164 5962 5892 -371 -5540
6356e540l528k31J3853L288p518n556l810K867J1098P085r913j2731L758M234
6342b644K758M869J473p117n046o7O426l205l702J749N217O897j0272j0920o511
6327b0095O093J1498R591N999N127n232p735o046l702o493L092K948K98K488J765
6312d04P786m58q577q433m586o03N641P211j747L062K1p208n7N967k110k239j510
6295h244m927N358J0197m939k137j068m496M186J423m032R367j984r687m396k85
6280a5664N622j2O198j196l051q818J0898K56j727M53M052L943k816j637j188
6265d687J873Q744m444P892J520n818m432M448M804j952p725m453Q964Q981M926
6250A8641o274j0398k081j2424k920J1258J934k868L437m473P40K865L487K455
$$ plain form
6356 -5540 -9068 -9299 4554 7842 324 -5232 -9042 -6175 4923 12008 2095 -10636 -6878 -2644
6342 -2644 114 4983 6456 -661 -5707 -5774 652 -2553 -6255 -4506 711 7608 -2664 -13584 -20095
6327 -20095 -14002 -2504 7087 13086 18213 12981 5246 -800 -4502 -10995 -7903 -4955 -4657 -2169 -404
6312 -404 7382 6924 -1653 -10086 -14672 -15275 -9634 -2423 -4170 -1108 -1087 -8295 -8352 -2385 -4495 -6734 -8244
6295 -8244 -13171 -7813 2384 -2555 -4692 -5760 -10256 -6070 -4647 -8679 688 -1296 -10983 -15379 -15664
6280 -15664 -10042 -10054 -3856 -5052 -8103 -16921 -6023 -5767 -7494 -7041 -2989 954 -1862 -3499 -4687
6265 -4687 -2814 5930 1486 9378 10898 5080 648 5096 9900 7948 223 -4230 4734 13715 18641
6250 18641 12367 1969 -112 -12536 -15456 -4198 -2264 -5132 -1695 -6168 -5428 -2563 924 3379
6236C379K634l221n095n82k022l498M515l285m681J1820K649j061m848p302N248
6221e350Q109n989q821o98k227K222L489L463j398M128P953J850n184l015P061
6206E593n267m405J639k256k661m48l356k36K238M49L105J2966L687k070j15K934
6190A1797o601j77O53J194L224K982j183M354p69j836R3J909m636n986P073L266
6174A5357j4730j1758l815J117P115O483l785O887j514P968O247J001L429N180
6160B5182o519k2357k475q862p518J5104Q224n621l224K433J637m292K026K422
6146c840L310J471M227l653n175m970L308J0868J0885r654l787o903n475O507
6132b881l41L187K42M0K714K314k624K867l777l202o282n692J590O96R78m397
$$ plain form
6236 3379 6013 2792 -2303 -2885 -4907 -8405 -3890 -7175 -11856 -36 2613 1552 -3296 -10598 -5350
6221 -5350 2759 -3230 -12051 -12749 -14976 -12754 -9265 -5802 -7200 -3072 4881 6731 1547 -1468 5593
6206 5593 326 -4079 -2440 -4696 -7357 -7805 -11161 -11397 -9159 -8710 -5605 7361 11048 8978 8863 11797
6190 11797 5196 5019 5672 6866 10090 13072 11889 16243 15474 13638 13731 15640 11004 5018 12091 15357
6174 15357 627 -11131 -14946 -13829 -6714 -231 -4016 2871 1357 9325 15572 16573 20002 25182
6160 25182 18663 -3694 -6169 -15031 -22549 -7445 779 -4842 -8066 -5633 -3996 -8288 -6262 -3840
6146 -3840 -530 941 5168 1515 -3660 -8630 -5322 5546 16431 6777 2990 -3913 -9388 -2881
6132 -2881 -3222 -35 207 247 2961 5275 2651 5518 1741 -1461 -7743 -13435 -11845 -11149 -10171 -14568
6116a4568j907M609N841L095m172J0142l158j3830o736N226P414P3K241k410P940
6101b00N418k343K6l637p523r367P796R419o180m81O845k947J127R089k846m189
6085Gn256L246J714O89j757j427j683l425K322R379l607m218M449K794k684j268
6069g25j0682n233L731L788p232M96O472N437L491N648P500L650j3474j0440p749
6054a5322J041N798O435q38P994p572m834J954K337n530k242Q61J363o07j60L736
6038e586J850J632j764o30k501Q287l926l002n06K820L144K363K947n754M556
6023C930L669n915n972m352K915P40M662L012m665O128m675o693n556K893O356
6008c523J241l406P285r35q51L905M427k628o27K060m000n869K740p19l488l7
$$ plain form
6116 -14568 -16475 -11866 -6025 -2930 -7102 3040 -118 -13948 -20684 -15458 -8044 -7971 -5730 -8140 -200
6101 -200 5218 2875 2901 -736 -8259 -17626 -9830 -411 -6591 -7072 -227 -3174 -2047 7042 4196 7
6085 7 -5249 -2003 -289 400 -1357 -2784 -4467 -7892 -5570 3809 202 -4016 433 3227 543 -725
6069 -725 -11407 -16640 -12909 -9121 -16353 -15857 -9385 -3948 -457 5191 12691 16341 2867 -7573 -15322
6054 -15322 -14281 -8483 -2048 -2886 5108 -2464 -7298 -5344 -3007 -8537 -10779 -9918 -8555 -9162 -9322 -5586
6038 -5586 -3736 -2104 -3868 -4498 -6999 1288 -2638 -5640 -6146 -3326 -182 2181 5128 -626 3930
6023 3930 7599 1684 -4288 -8640 -5725 -4985 -323 2689 -1976 4152 -523 -7216 -12772 -9879 -3523
6008 -3523 -2282 -5688 1597 662 -189 3716 8143 5515 4888 6948 2948 -2921 -181 -900 -4388 -4425
5992d425r864L118O639Q196r060K625l107m407m083K85J2757J1402L163m84p112
5977E643m012o138k463q20K656J2367M575l563j0128n779M402O169N815l053P54
5962F425K174o460k542l953n11j0067q06R199O189l4l107j718j760o208q99J792
5946a2286Q232O87K944K080m088k319j2197j879N605P834o609j684k642K339K071
5931a1912Q23l960n096R563O786p042n967L132J6575J1060r363q192m921j214
5917i728O427N074M559K552j83q720p29j081r388m289J1330J3185p128m078M322
5902B125K182k853j4122L97N765L016o111M525R621J321k981J051j476Q540n990
5887E010n667N617P92q634p37M549n100j0817j523N59L184J7544J0139O404q914
$$ plain form
5992 -4425 -14289 -11171 -4532 3664 -5396 -2771 -5878 -10285 -14368 -14083 -1326 10076 13239 12755 5643
5977 5643 1631 -4507 -6970 -7790 -5134 7233 11808 8245 -1883 -7662 -3260 2909 8724 5671 6425
5962 6425 8599 2139 -403 -4356 -4867 -14934 -15740 -6541 -352 -386 -3493 -5211 -6971 -13179 -14078 -12286
5946 -12286 -4054 -3367 -423 1657 -2431 -4750 -16947 -18826 -13221 -5387 -11996 -13680 -16322 -13983 -11912
5931 -11912 -11089 -15049 -20145 -10582 -3796 -10838 -16805 -13673 2902 13962 4599 -3593 -8514 -9728
5917 -9728 -3301 1773 6332 8884 8701 -19 -748 -1829 -11217 -15506 -4176 9009 1881 -2197 2125
5902 2125 4307 1454 -12668 -12271 -6506 -3490 -9601 -5076 4545 5866 2885 3936 2460 11000 5010
5887 5010 -657 4960 5752 -2882 -3619 930 -4170 -14987 -16510 -15951 -12767 4777 14916 21320 12406
5872A2406r504M927R0j0078o966M884J105p176L539J695k173j1715k175K652J862
5857a6627K560K485n911l144O960q20Q183N676K945l67q684k786M45P547O738
5842E200N927P331j4169j1925O151M752K688k759j994m585p242L245k874o117
5828a6371N291O193K429m690k36k106M868J3274l057k927O377q623j2207n206
5814a6991j838l286N989Q644j140O446K164n205O68M558J609k577m602p320k896
5799a5777K641J227P269J249P17K752J639r256r175J698J614Q498J0202o116j0466
5784a1284j820L969O939M839l71O23P08j674K400L942o851k537O000l167o177
5769d461m114Q72L469K953j85K76o756m720l136j5l638R774P154R516j807k007
$$ plain form
5872 12406 2902 7829 7919 -2159 -9125 -4241 -3136 -10312 -6773 -5078 -7251 -18966 -21141 -18489 -16627
5857 -16627 -14067 -11582 -17493 -20637 -13677 -14497 -6314 -638 2307 1940 -6744 -9530 -9085 -1538 5200
5842 5200 11127 18458 4289 -7636 -1485 3267 5955 3196 1202 -3383 -10625 -7380 -10254 -16371
5828 -16371 -11080 -4887 -2458 -7148 -7384 -9490 -4622 8652 5595 2668 9045 422 -11785 -16991
5814 -16991 -18829 -22115 -16126 -7482 -8622 -2176 -12 -5217 -4549 9 1618 -959 -5561 -12881 -15777
5799 -15777 -13136 -11909 -4640 -3391 -2674 78 1717 -7539 -16714 -15016 -13402 -4904 5298 -818 -11284
5784 -11284 -13104 -9135 -2196 2643 2272 2895 3603 1929 4329 8271 1420 -1117 4883 1716 -4461
5769 -4461 -8575 -7703 -4234 -1281 -1466 -1190 -7946 -12666 -15802 -15817 -19455 -9681 -2527 6989 5182 3175
5753C175O735K60l34o681j843L221O652j339m749p591j271l314o590P757J4666
5738H754M235j468l294M839N461j0074j471j0362l340Q281M625J737L279K423
5724A3625n800n880k597l287N313J542o690j051M839Q005M091q574p63n959K466
5709g20N976M612L850p801m885k659q11Q2q311o56P245o7n27l05M449k245M145
5692A372m520m049L21L482N06l820O252N523j968j2000K695O162M803N210n196
5677D773k409q92p215M773k196j2582L265R550J038n7N193j507m806J17P888L955
5661H888Q415L247k683p34L136p239n937j0324J193k095l06N283J318J729k069
5646A822r952l206p664M608R575O873j134m710K484m077Q803O211q505L283K818
$$ plain form
5753 3175 9910 10170 9836 3155 1312 4533 11185 9846 5097 -2494 -3765 -7079 -13669 -5912 8754
5738 8754 12989 11521 8227 13066 18527 8453 6982 -3380 -6720 1561 6186 7923 11202 13625
5724 13625 7825 1945 -652 -3939 1374 2916 -3774 -4825 14 8019 12110 3536 2773 -3186 -720
5709 -720 5256 9868 13718 5917 1032 -1627 -2438 -2356 -10667 -11323 -4078 -4145 -4672 -4977 -528 -2773 1372
5692 1372 -3148 -7197 -6876 -3394 -2888 -6708 -456 5067 3099 -8901 -6206 -44 4759 9969 4773
5677 4773 2364 1472 -5743 -970 -3166 -15748 -12483 -2933 -1895 -1952 3241 1734 -3072 -2955 4933 8888
5661 8888 17303 20550 17867 17133 20269 13030 7093 -3231 -2038 -4133 -4439 844 2162 3891 1822
5646 1822 -8130 -11336 -19000 -14392 -4817 2056 922 -3788 -1304 -5381 3422 9633 1128 4411 7229
5631G229j492K639r398k608M715R029k985m469j1255r33k68M869J0879J0008k108
5616A3852p406p851m858l551J853L042m141k244J6262l85o723n987J751O550k26
5601f2J112M454m872o740O60J2083P437o138n252k676J0585P822p667r348l851
5586b453r101o790l392Q506J202K657M395J185m786n742L18k42m584M843N879
5571h105P099N099M17k42K624m365p337l95l520Q623J2502j880o374J0365j854
5556A2657J227j632j7256p336J366L386J307L601q66p77L852r05M820K967o89
5541E722J154m142j3087k750K811J669l721J0898J583l714l483J197K855P995
5527D987m13o340k093r02q779j453K864J0838o75J236M134O22j037n367r855j875
$$ plain form
5631 7229 5737 8376 -1022 -3630 1085 10114 7129 2660 -8595 -9528 -9796 -4927 5952 15960 13852
5616 13852 6446 -1405 -6263 -9814 -7961 -4919 -9060 -11304 4958 4573 -2150 -8137 -6386 164 -62
5601 -62 1050 5504 632 -6108 -5448 6635 14072 7934 2682 6 10591 18413 10746 1398 -2453
5586 -2453 -11554 -18344 -21736 -13230 -12028 -9371 -4976 -3791 -8577 -14319 -14001 -14243 -18827 -13984 -8105
5571 -8105 -1006 4093 4510 4268 6892 2527 -4810 -5205 -8725 -102 12400 10520 4146 14511 12657
5556 12657 13884 12252 -5004 -12340 -10974 -7588 -6281 -2680 -3546 -4323 -471 -1376 3444 6411 5722
5541 5722 6876 2734 -10353 -13103 -10292 -8623 -12344 -1446 137 -3577 -7060 -5863 -3008 4987
5527 4987 4574 -1766 -3859 -4761 -13540 -14993 -12129 -1291 -1966 -730 3404 4026 2989 -2378 -12233 -14108
5511a4108l399l639M847P823l885k178J278o613n078k102j188M055K017K81R44
5496b0945L751J1868P643k235j0784j956P80K450q11j359m266K636J1346J8000
5482A6118M342l266k004o897p625K831l961m853M877M709k295k594j317Q44k229
5467c320K107J989P433n630l370q849k28M591K391o205J158p03P474N140o15n220
5451a857l296o212j025o46L154J1222M792J802n221p525n258K187J98m28M664
5436c449J0715k785k816L362N405j2886r729k217K202o00j121L292k385J3090
5422G8J609l292n041Q811k01n318r659K312n766j1257J0740J2979J2359l957l222
5407A175J888R48o409R293Q058n244J198j296j903j057n621j574o201m207J0481
$$ plain form
5511 -14108 -17507 -21146 -16299 -8476 -12361 -14539 -13261 -19874 -24952 -27054 -28242 -24187 -22170 -21889 -20945
5496 -20945 -17194 -5326 2317 82 -10702 -12658 -11878 -9428 -10239 -11598 -15864 -13228 -1882 16118
5482 16118 20460 17194 15190 8293 668 3499 -462 -5315 -438 4271 1976 -618 -1935 -1091 -3320
5467 -3320 -1213 776 8209 2579 -791 -9640 -9868 -5277 -2886 -9091 -7933 -8636 -1162 3978 3363 -1857
5451 -1857 -5153 -11365 -12390 -13036 -9882 1340 6132 7934 2713 -4812 -10070 -7883 -7685 -8113 -3449
5436 -3449 7266 4481 1665 5027 10432 -2454 -12183 -14400 -12198 -12798 -13919 -10627 -13012 78
5422 78 1687 -1605 -6646 2165 1964 -3354 -13013 -10701 -16467 -27724 -16984 -4005 8354 4397 1175
5407 1175 3063 4011 -2398 6895 14953 9709 10907 9611 7708 6651 1030 -544 -6745 -10952 -471
5392d71O155j017l53r749M175Q384P02Q418j0880O52j240K378L545m34n148P525
5376A2642p253n210K411k15l023m07J324J21j715K550K43J509p279n020R64M450
5360c908O251j090L823J325j2561q93J0761N237L447k742q585N71K509m851Q817
5345H111M337r197l344J0310J063m021m715L345n214l492P461l074j5744k716
5331a6890L476M714M702K630k546k678N654J268j03K255r54R13J229k891j0611
5316i832q131K708J2698J0100J015j5431n749M880J512Q91J625j707n145k789
5302a3355Q52K523l00r82O359j799Q209l071J957R58l623n46p749J156R372k38
5286b77j592L625J99m11K291l615p769P932O550k863q67M141r63m49p882l343
$$ plain form
5392 -471 5684 4667 4314 -5435 -1260 7124 7826 16244 5364 6016 4776 7154 10699 10265 5117 12642
5376 12642 5389 179 2590 2375 -648 -1055 269 390 -1325 1225 1468 2977 -4302 -9322 -8358 -3908
5360 -3908 2343 1253 5076 6401 -6160 -7053 3708 8945 12392 9650 1065 1636 4145 -706 8111
5345 8111 12448 3251 -93 10217 11280 7259 2544 5889 675 -2817 4644 1570 -14174 -16890
5331 -16890 -13414 -8700 -3998 -1368 -3914 -6592 -938 330 227 2482 1528 2441 3670 779 -9832
5316 -9832 -17963 -15255 -2557 7543 8558 -6873 -12622 -7742 -6230 -5339 -3714 -5421 -10566 -13355
5302 -13355 -12503 -9980 -10280 -11262 -4903 -6702 1507 -1564 393 1351 -2272 -2818 -10567 -9411 -39 -277
5286 -277 -1869 1756 1955 1544 3835 220 -7549 383 6933 4070 3203 7344 6381 5932 -1950 -5293
5270e293K716K190O775N592k048j1349n180Q716N346l028M96P137j759l658n92
5255F061l101p810J047L509J807p117n808L375O367N057N40j412K779P843r747
5240C390p339M817k274k177o571R650l944k097K162J788R33K294q47p38n564R064
5224B547N056Q743L092n105j3968k235P838k527N063K429j014l13J27k49n179
5209D305n209K645k021J751L342n29K287J883l245k699L894n274n423M270Qm223
5193d238l320K255J542M208m554j3463j612N101J0219M871j860m961j289K415
5179d686O077k881r538k16K457l606O267K67K350O19N373P4j216q784j267K859
5163e851j737L390k149L768L354J024K346O258q638j9008m585l95P044J768j825
$$ plain form
5270 -5293 -2577 -387 6388 11980 9932 -1417 -6597 2119 7465 4437 4933 12070 10311 6653 6061
5255 6061 2960 -4850 -3803 -294 1513 -5604 -11412 -8037 -1670 3387 3927 2515 5294 13137 3390
5240 3390 -3949 868 -1406 -3583 -10154 -504 -4448 -6545 -4383 -2595 -1662 632 -215 -953 -6517 2547
5224 2547 7603 16346 19438 14333 365 -1870 5968 3441 8504 10933 9919 9606 9733 9484 4305
5209 4305 -904 1741 -280 1471 4813 4284 6571 8454 5209 2510 6404 1130 -4293 -23 -15 -4238
5193 -4238 -7558 -5303 -3761 447 -4107 -17570 -19182 -14081 -3862 1009 -851 -5812 -7101 -4686
5179 -4686 1391 -1490 -11028 -11244 -8787 -12393 -6126 -5859 -3509 -2890 2483 2557 1341 -7443 -8710 -5851
5163 -5851 -7588 -4198 -6347 -2579 775 1799 4145 10403 1765 -17243 -21828 -22223 -15179 -13411 -15236
5148a5236m10P068J161l600O107n514P74M981L403j766k709m445P01P197m827
5133g115O03l79M108P710j484Q021j911j997o065l624j956K823L04N903M79j680
5117C740O747M342m459O168N481p136m685k987j105m350m648J858O13j275J4362
5102A2666k235j1877l62j101j153J0890N384r903n257l312m313l238J2049Q25
5088i37l261q010J99N292N008L28k310J76K924j133k638J940N031k361J399O705
5072H352K927j2100k343N489l868j4512n818L019J525n675j67M471N461J0864
5058b375K027k217m81o48K559q44n332p627K542J335j1849J358J6992O902k628
5043b86Q94l650k165R060L677j080r696J138K768j529m500M29L716M263o94J160
$$ plain form
5148 -15236 -15646 -8578 -7417 -11017 -4910 -10424 -9650 -4669 -1266 -3032 -5741 -10186 -9485 -2288 -7115
5133 -7115 -6512 -6891 -2783 4927 3443 11464 9553 7556 1491 -2133 -4089 -1266 -962 4941 5420 3740
5117 3740 10487 14829 10370 16538 22019 14883 10198 7211 6106 1756 -2892 -1034 -421 -1696 12666
5102 12666 10431 -1446 -1808 -2909 -4062 6828 12212 2309 -2948 -6260 -10573 -13811 -1762 -937
5088 -937 -4198 -12208 -12009 -6717 -1709 -1381 -3691 -3515 -591 -1724 -4362 -2422 2609 248 1647 8352
5072 8352 11279 -821 -3164 2325 -1543 -16055 -21873 -18854 -17329 -23004 -23171 -18700 -13239 -2375
5058 -2375 -348 -2565 -3046 -3694 -1135 -1979 -7311 -14938 -12396 -11061 -22910 -21552 -4560 2342 -286
5043 -286 608 -3042 -5207 3853 7530 6450 -3246 -2108 660 -869 -5369 -4940 -1224 3039 2345 3505
5027C505q929l06J2543o878n750N319M154Q078l514n519L571k849n311m711O546
5012e1l742Q81Q81K455P985l389j714K997l172J214m727Q35j923K206j429o51
4996a344l447J481J372N48q32o775l64n864j241N204J920m99k70M357N545J99
4980a0L398j936o860J1709L06J081K907k193k077k411n801k562K906J763J735
4965A955M71J062j3500l257J434m35M402Q756O316M595j492m056j4840j0185n949
4950b4723J3403J1299K878m826j0276N233M750J013o139k832L717J4847J970p154
4936C160n365j2775K734L770k691O863k568J625J952N302q88Q08J416K963N646
4921A1952j0175p908j722K709k157j0061k286J2419J3581n348r494l036L511Q391
$$ plain form
5027 3505 -5424 -5730 6813 -65 -5815 -496 3658 11736 8222 2703 6274 3425 -1886 -6597 -51
5012 -51 -3793 -2912 -2031 424 8409 5020 3306 6303 3131 4345 -382 453 -1470 736 -693 -1344
4996 -1344 -4791 -3310 -1938 -1390 -2222 -8997 -9361 -15225 -16466 -11262 -9342 -9841 -10111 -5754 -209 -10
4980 -10 3388 1452 -5408 6301 6607 7688 10595 8402 6325 3914 -1887 -4449 -1543 220 1955
4965 1955 2426 3488 -10012 -13269 -11835 -12270 -7868 888 7204 11799 10307 6251 -8589 -18774 -24723
4950 -24723 -11320 -21 2857 -1969 -12245 -7012 -2262 -1249 -7388 -10220 -6503 8344 10314 3160
4936 3160 -2205 -14980 -12246 -8476 -11167 -4304 -6872 -5247 -3295 2007 1119 1927 3343 6306 11952
4921 11952 1777 -6131 -7853 -5144 -7301 -17362 -19648 -7229 6352 1004 -8490 -11526 -8015 376
4907C76K912j83q638L113j336l093J576O318N159j944O5O47j201n761N952P658
4891A1620O1K065Q02n176j396q622J558k674m993J104l109l783m74L677M722Q492
4875C874l382n048l87L185l19p36L803K583L877p131K06k298o74j761n419j654
4859a1281R808Q07m359m419J133R158J82o693K97J1935O950j51k972j1022r469
4844a0096n38P072J842l266j3224l495Q222P917M78k304K152n08m133R891L253
4829C263j2149N417O571m027K411O449K70m688o190P17j719r2P881L81M287m491
4813D291j0829m184o30j839N916Q317K21n767K68l676n651J191K795L883K511
4798c183O590L045n134M175N97p97m353m236j1029l947M901L621K99K013m153
$$ plain form
4907 376 3288 3105 -5533 -2420 -3756 -6849 -5273 1045 6204 4260 4325 4972 3771 -1990 3962 11620
4891 11620 11681 13746 14548 9372 7976 -646 912 -1762 -6755 -5651 -8760 -12543 -13017 -9340 -4618 3874
4875 3874 492 -4556 -4943 -1758 -2077 -2813 990 3573 7450 319 525 -1773 -2447 -4208 -9627 -11281
4859 -11281 -1473 -666 -5025 -9444 -8311 847 1029 -5664 -5367 6568 13518 13367 10395 -627 -10096
4844 -10096 -10634 -3562 -1720 -4986 -18210 -21705 -13483 -5566 -5088 -7392 -5240 -5748 -9881 10 3263
4829 3263 -8886 -3469 3102 -925 1486 7935 8205 3517 -2673 -1956 -3675 -3767 4114 4495 8782 4291
4813 4291 -6538 -10722 -11352 -13191 -7275 1042 1263 -4504 -4236 -7912 -13563 -12372 -9577 -5694 -3183
4798 -3183 3407 6452 1318 5493 6090 5293 940 -3296 -14325 -18272 -13371 -9750 -9451 -7438 -11591
4783a1591L640J0035K042K497l491j0145Q86O41m16N193J428j0838q47N905m715
4768i776l656N759J3979N202p668o798J184p579K22j340Q81N862L504N651K265
4753G692L581o025J212M201M198N835q934q285L873m562L405o487n91k01O68K433
4737B013P462L995O871k092m783n24L59j890p099n18K336J765l039m136j822N7
4721a045K415m43m908l000P840l753q22k595O895J3007J910n10k895j8789q256
4706a4949J522J325M007q108N50J1583M785n777k561J1467k170N614k137k426
4692B725k467n822p56R18m565M883L502l001j535M691P558R74J527o814r256N669
4676a769R9R584j406j587j2175K925J3403K46j188L304k123o811m500P525Q004
$$ plain form
4783 -11591 -7951 2084 4126 6623 3132 -7013 -6127 -5486 -5902 -709 719 -10119 -10966 -5061 -9776
4768 -9776 -13432 -7673 6306 11508 3840 -2958 -1774 -9353 -9131 -10471 -9590 -3728 -224 5427 7692
4753 7692 11273 5248 6460 10661 14859 20694 11760 3475 7348 2786 6191 -296 -887 -1088 -420 2013
4737 2013 9475 13470 20341 18249 13466 12942 13301 11411 4312 3794 6130 7895 4856 720 -1102 -1045
4721 -1045 1370 927 -3981 -6981 859 -2894 -3716 -6311 584 13591 15501 14991 12096 -6693 -14949
4706 -14949 -13427 -12102 -8095 -16203 -15653 -4070 715 -5062 -7623 3844 1674 7288 5151 2725
4692 2725 258 -5564 -6320 -5402 -9967 -5084 -1582 -4583 -6118 -1427 6131 7105 8632 1818 -7438 -1769
4676 -1769 -1670 7914 6508 4921 -7254 -4329 9074 9320 8132 11436 9313 2502 -1998 5527 13531
4661A3531l842j2743o484P400m609k846P349j109j57Q348l962p719k591Q538Q617
4646G721O186n298p926n361O849M17M72m427k137N066k343J296Q250j689l767
4631C309J1465j755o474p283n390K649Q407j0024j0436J672J5196J4086j693j429
4617A2300j125q038M166m993m738r008P49M259L920k63Q585O639L278m748j0860
4602A23p911L153K806N109K092l429r766J113Q606l326q101l89P962J4243o030
4587F255k919o426q71R456J25k893J1374K015j933k29N375p426j4334l991O909
4572D87K211r104N525O697J691L914k801j715L687k378r361K750j264K40l036
4557b457L718J2045K89l89j695r019l212p233r957O258R592m60L302q166q150
$$ plain form
4661 13531 9689 -3054 -9538 -2138 -6747 -9593 -2244 -3353 -3510 4838 876 -6843 -9434 -896 7721
4646 7721 13907 8609 683 -4678 2171 2588 3060 -1367 -3504 1562 -781 515 8765 7076 3309
4631 3309 14774 13019 6545 -738 -6128 -3479 4928 -5096 -15532 -13860 1336 15422 13729 12300
4617 12300 11175 3137 7303 2310 -2428 -11436 -10687 -6428 -2508 -2771 5814 12453 15731 10983 123
4602 123 -7788 -4635 -1829 3280 5372 1943 -7823 -6710 1896 -1430 -9531 -9920 -1958 12285 6255
4587 6255 3336 -3090 -3961 5495 5620 2727 14101 16116 14183 13954 19329 11903 -2431 -6422 487
4572 487 2698 -6406 -881 5816 7507 11421 8620 6905 10592 8214 -1147 1603 339 579 -2457
4557 -2457 1261 13306 13595 13206 11511 2492 -720 -7953 -17910 -11652 -2060 -2520 782 -7384 -15534
4542a5534l01N339J2055J0576K871m999o280l931J3684m18p584R73O397j1751
4528A097j2832L137l072j279J378o218N374J0476L607K007j489J825j440N423
4514G994k166k05m837O90m711l132M775N17k882n626K569M202m128N731J347J829
4498A967m90k037M042P92o291n27j25o545Q976Q993r227j2430l748N116J78m585
4482a5941Q894K215o119l845k908J6364J1876o873M847k836q603q75J304l72N670
4467B798k55O868k141k681L470k418l433K68L847k153n864o545m418J621M19P014
4451c603J0004J552p40L536n786o654k396K136K017j668m634q103Q033J611j527
4436f222J660O653M348K905p39J646P885p672m684n417o573P89l959K579L352
$$ plain form
4542 -15534 -15835 -10496 1559 12135 15006 10007 3727 -204 13480 13062 5478 6451 12848 1097
4528 1097 -11735 -8598 -11670 -12949 -11571 -17789 -12415 -1939 1668 3675 2186 4011 2571 7994
4514 7994 5828 5623 786 1476 -3235 -6367 -1592 -1075 -3957 -9583 -7014 -2812 -6940 -1209 138 1967
4498 1967 1477 -560 3482 4274 -2017 -2544 -2669 -9214 -238 8755 -472 -12902 -16650 -11534 -11356 -15941
4482 -15941 -7047 -4832 -10951 -14796 -17704 -1340 10536 3663 8510 5674 -2929 -3804 -2500 -2872 2798
4467 2798 2543 9411 7270 4589 8059 5641 2208 2476 6323 4170 -1694 -8239 -12657 -11036 -10617 -3603
4451 -3603 6401 7953 7213 10749 4963 -1691 -4087 -1951 66 -1602 -6236 -14339 -6306 -4695 -6222
4436 -6222 -4562 2091 6439 9344 8605 10251 18136 10464 5780 363 -6210 -5421 -9380 -6801 -3449
4421c449N912m146q078J673P199R919n455j3129l329N9q95K948P94K129N445K195
4405b08K791P583p988N952j884j095J023r879k090K829N227P571J461q422M347
4390G218L960j511p229m095K927L115m72j455q053o945N390L867R25L812K82k608
4374h72m642O207O578l919P267l889J97R55k503m977Q079M646N920J72L051L442
4358B5712J922N32p777r497q607l161n083k326j271m263J0859m263j1101J802
4344a6522L201p79P847J0763R90J380l686j015m854R00m114n325Q537P014o677
4329b340m066N728J69n382K916p234k660O212K899j319M293J731k570o95j592
4314c910l431k297P129R906Q050p431p801J717P114P640p002r720N44N58M765
$$ plain form
4421 -3449 2463 -1683 -9761 -8088 -889 9030 3575 -9554 -12883 -12824 -13719 -10771 -9977 -7848 -2403 -208
4405 -208 2583 10166 2178 8130 6246 5151 6174 -3705 -5795 -2966 2261 9832 11293 2871 7218
4390 7218 11178 9667 2438 -1657 1270 4385 3913 2458 -5595 -12540 -7150 -3283 -2358 1454 1736 -872
4374 -872 -5514 693 7271 3352 10619 6730 6927 7882 5379 402 8481 13127 19047 19219 22270 25712
4358 25712 27634 28166 20389 10892 2285 -876 -5959 -8285 -9556 -13819 -2960 -7223 -18324 -16522
4344 -16522 -13321 -14100 -6253 4510 5500 6880 3194 2179 -2675 -1775 -5889 -11214 -2677 4337 -2340
4329 -2340 -6406 -678 -509 -5891 -2975 -10209 -12869 -6657 -3758 -5077 -784 947 -1623 -2318 -3910
4314 -3910 -7341 -9638 -2509 7397 15447 8016 215 1932 9046 16686 9684 -36 508 1066 5831
4299E831N130q746n766K157Q597n370o154Q61L945j659l92m936l165K047m226
4284a1846K44L061J0523L615l896j650K559k007q961j999L870L617P32o49K07
4269b580N30M591P33j605j42M432n088k500L073m30L338o914r129M903J1589R108
4253A3909L399p662o762k855P446n358n299l007L292N22J676j1447k534N413L742
4238e525J0451P42p584k878M751J946J101L021j1503j3305N86J0059p253j127
4224a6518M113L598l223J455P561q493m744J2266Q481k818p829M476K492M233
4210E050K096m339q891j165O323N021K715o074L796J519p820K913o81j0954l330
4195a3821O121J0560O038q843j0326rO290K718m508J1140J494K137J763j61o473
$$ plain form
4299 5831 10961 2215 -3551 -1394 7203 1833 -4321 -3460 485 -1174 -1566 -6502 -9667 -7620 -11846
4284 -11846 -11602 -8541 1982 5597 1701 51 2610 603 -8358 -10357 -6487 -2870 -2138 -2787 -2580
4269 -2580 -2050 2541 3274 1669 1527 5959 871 -1629 1444 1014 4352 -2562 -11691 -6788 4801 13909
4253 13909 17308 9646 2884 29 7475 2117 -3182 -6189 -2897 -2375 -699 -12146 -14680 -9267 -5525
4238 -5525 4926 5668 -1916 -4794 -43 1903 3004 6025 -5478 -18783 -18197 -8138 -15391 -16518
4224 -16518 -12405 -8807 -12030 -10575 -3014 -11507 -16251 -3985 4496 1678 -6151 -1675 817 5050
4210 5050 7146 2807 -6084 -7249 -926 4095 6810 736 4532 6051 -1769 1144 463 -10491 -13821
4195 -13821 -7700 2860 8898 55 -10271 -10280 -3990 -1272 -5780 5360 6854 8991 10754 10593 4120
4180D120m731Q886o079l577L965M753p953n135K947k071o908L279J0772j3425
4166a1157K161O353n317q015L873P772J950l09o952O583p171K049M334m188n78
4151h612M303Q092j0247l150Q456O952N226K94j0578j242O22n560K553K594p119
4136g416J605J918j920L106k8j502M919L434L224n368o008K028n71J1197O999
4121A5617o419j738o074o929o443J972L87N569N041o529m110K820n410L423R412
4106E89J454K733J486J621o23J086q91k332j584j275m132n63N409j37K55N32n69
4089C059l545j736j852K679K460N687k16o796j0818k072P351P537k861m495J050
4074d568K176L494k010o232q862K305J0675M416m500k984J990j935M881o68L317
$$ plain form
4180 4120 -611 8275 2196 -1381 2584 7337 -616 -5751 -2804 -4875 -11783 -8504 2268 -11157
4166 -11157 -8996 -2643 -7960 -15975 -12102 -4330 -2380 -2689 -9641 -3058 -10229 -8180 -3846 -8034 -8612
4151 -8612 -4309 3783 -6464 -9614 -1158 5794 11020 11314 736 -506 116 -5444 -2891 -297 -7416
4136 -7416 -5811 -3893 -5813 -2707 -2735 -4237 682 4116 7340 1972 -4036 -2008 -2579 8618 15617
4121 15617 9198 7460 1386 -5543 -11986 -10014 -9627 -4058 983 -5546 -9656 -6836 -12246 -8823 589
4106 589 2043 4776 6262 7883 7260 8346 7455 5123 3539 2264 -1868 -2431 2978 2841 3096 3628 3059
4089 3059 -486 -2222 -4074 -1395 1065 6752 6536 -260 -11078 -13150 -5799 1738 -1123 -5618 -4568
4074 -4568 -2392 1102 -908 -7140 -16002 -13697 -3022 1394 -3106 -6090 -4100 -6035 -1154 -1822 1495
4059A495n028Q379L689j446j924k301q582J422L941K72l923k750N307P97k949
4044c601l442M411J348K782l859k549R62j190J3896P613o48p444n476k001r060
4029h258p747L520O580r14M963n690l913l7m676R964n61n241m224K357j084M105
4013a0856M839n087j801K868J931l94Q399O541j981n173m094J601j402n669Q821
3998a457K068m781o345o070K216M067l857O581O428P528Q133N410p918q447j95
3983C361k801j5034l718J0909J6943j446p426N417m134j3O460n901L583n688m954
3968d442Q378J867N948J856K956m042l222j0685r205r300P143J3922M153k020
3954C307l101n35O101K998M72M42L009J470k459K406m128j2596j7608l478Q690
$$ plain form
4059 1495 -3533 4846 8535 7089 5165 2864 -5718 -4296 -355 -83 -4006 -6756 -1449 -652 -3601
4044 -3601 -7043 -2632 -1284 1498 -2361 -4910 -3948 -5138 8758 16371 15723 8279 2803 802 -8258
4029 -8258 -16005 -12485 -5905 -6819 -1856 -7546 -11459 -11496 -16172 -6208 -6769 -12010 -16234 -13877 -14961 -10856
4013 -10856 -6017 -11104 -12905 -10037 -8106 -8500 -101 6440 4459 -714 -4808 -3207 -4609 -10278 -1457
3998 -1457 611 -4170 -10515 -16585 -14369 -10302 -14159 -7578 -1150 6378 14511 19921 12003 3556 3361
3983 3361 560 -14474 -18192 -7283 9660 8214 788 6205 2071 2058 8518 2617 6200 512 -4442
3968 -4442 3936 5803 11751 13607 16563 12521 9299 -1386 -10591 -19891 -12748 1174 5327 3307
3954 3307 206 -329 5772 8770 9242 9684 12693 14163 11704 14110 9982 -2614 -20222 -23700 -15010
3939a5010J1528J2219l552p923o045j332J633K736N090M592p404l638O136J575
3925F05o289m946J009Q677N898P314L44q739m575O430N60m688J624Q301l445K589
3909A0669l77l460j606l20N727l717j0290p257J0909N314l089R243K538j350j469
3894A1465m740N057m113j2833L235l414r584O634J4680k501l292L188N429l132
3880F079m229k207n775r416J794m059M187J974N768L476M619k978l327m210n734
3865a4038J27Q764P781L256l71J01p139p343k600P019L207l646L467L221p322
3850e516o401M013O444J2021j831p658m385L977P334q029p294k268M692M215N785
3835E099j124j228M567J439j3276J230K921M090p753r187M687j884o557M441J2423
$$ plain form
3939 -15010 -3482 8737 5185 -2738 -8783 -10115 -8482 -5746 -656 3936 -3468 -7106 -970 605
3925 605 -5684 -10630 -9621 -944 4954 12268 12612 3873 -702 5728 6288 1600 3224 11525 8080 10669
3909 10669 10292 6832 5226 4906 10633 6916 -3374 -10631 278 5592 2503 11746 14284 12934 11465
3894 11465 6725 11782 7669 -5164 -1929 -5343 -14927 -8293 6387 3886 594 3782 9211 6079
3880 6079 1850 -357 -6132 -15548 -13754 -17813 -13626 -11652 -5884 -2408 2211 -767 -4094 -8304 -14038
3865 -14038 -13911 -5147 2634 5890 5519 5620 -1519 -8862 -11462 -4443 -1236 -4882 -1415 1806 -5516
3850 -5516 -11917 -7904 -1460 10561 8730 1072 -3313 664 7998 -31 -7325 -9593 -4901 -686 5099
3835 5099 3975 2747 7314 8753 -4523 -3293 -372 3718 -4035 -13222 -8535 -10419 -16976 -12535 -112
3820a12N064q219l140M710k868K8M552q662j924O305M286M690o489p048j261p70
3804a0858P875J042N80J2240q271j3352j326L362R844q96n257k234K989k729K528
3789d463L273k012K156M972l531J965J369L095l768j220j141m502p130R676J767
3774E06J688J304k936m7o027p152L827J2201L786L769l749n804m96j1236J491
3759h875j801k677Q501J833k501M771j995O797R618j1654o621n246J664O727j791
3744c250K99P181j367J106k202J903j99j179M920J607l902K895m584M532k514
3729E246K475K058n413J328j0481j3263R435r09K392P522N747M352M303J054p382
3714H464m327k670J682K207K638n926p616K978N811n10q429n699L784P881M865
$$ plain form
3820 -112 4952 -3267 -6407 -1697 -4565 -4537 15 -8647 -10571 -4266 20 4710 -1779 -8827 -10088 -10858
3804 -10858 -2983 -1941 -1361 10879 2608 -10744 -12070 -8708 1136 240 -5017 -7251 -4262 -6991 -4463
3789 -4463 -1190 -3202 -1046 3926 395 2360 3729 6824 3056 1836 695 -3807 -10937 -1261 506
3774 506 2194 3498 562 515 -5512 -12664 -8837 3364 7150 10919 7170 1366 870 -10366 -8875
3759 -8875 -10676 -13353 -4852 -3019 -5520 -749 -2744 4053 13671 2017 -4604 -9850 -8186 -1459 -3250
3744 -3250 -2951 4230 2863 3969 1767 3670 3471 2292 7212 8819 4917 7812 3228 7760 5246
3729 5246 7721 9779 4366 5694 -4787 -18050 -8615 -9524 -7132 390 6137 10489 14792 15846 8464
3714 8464 4137 1467 3149 5356 7994 2068 -5548 -2570 3241 2731 -5698 -11397 -7613 268 5133
3699E133R789k049q346J866o368j1309K410M449R21K1j24M922j0194M910N301
3684A332L191j702Q10n748P09L789o941n12O451J226l859q731J889L928l76k457
3668g001J947P664j388q135r522J0321L41o57Q482n492p470L172J027L896K196
3653f19P531k962o18l182m732m61k373k299Q219Q310O462M56k477M239k610k019
$$ plain form
3699 5133 14922 12873 4527 6393 25 -11284 -8874 -4425 -3504 -3483 -3607 1315 -8879 -3969 1332
3684 1332 4523 2821 3631 -2117 -1408 2381 -4560 -5072 1379 2605 -1254 -9985 -8096 -4168 -4544 -7001
3668 -7001 -5054 2610 1222 -6913 -16435 -6114 -5773 -6430 2052 -3440 -10910 -7738 -6711 -2815 -619
3653 -619 6912 3950 3332 150 -4582 -5043 -7416 -9715 -1496 6814 13276 13732 11255 15494 12884 10865
$$ [...]
##END NTUPLES=NMR SPECTRUM
##END=
