##TITLE=Analysis number 322395
Compound Code ac 35920
Project Code adrs
Chemist Name cuschem
##JCAMPDX= 6.0         $$ Bruker NMR JCAMP-DX V2.0
##DATA TYPE= NMR SPECTRUM
##DATA CLASS= NTUPLES
##ORIGIN= Bruker BioSpin GmbH
##OWNER= nmr
$$ XWIN-NMR		Version 3.5
$$ Mon Sep 25 09:47:01 2006 GMT Daylight Time (UT+1h)  MAYBRIDGE\nmr@NMR_250MHZ
##.OBSERVE FREQUENCY= 250.131544655141
##.OBSERVE NUCLEUS= ^1H
##.ACQUISITION MODE= SIMULTANEOUS (DQD)
##.ACQUISITION SCHEME= undefined
##.AVERAGES= 16
##.DIGITISER RES= 18
##SPECTROMETER/DATA SYSTEM= dpx250
##.PULSE SEQUENCE= zg30
##.SOLVENT NAME= DMSO
##.SHIFT REFERENCE= (INTERNAL, DMSO, 0, 16.522)
##AUDIT TRAIL= $$ (NUMBER, WHEN, WHO, WHERE, WHAT)
$$ ##TITLE= Audit trail, XWIN-NMR		Version 3.5
$$ ##JCAMPDX= 5.01
$$ ##ORIGIN= Bruker BioSpin GmbH
$$ ##OWNER= nmr
$$ C:\u/data/dgb/nmr/ADRS/1250/pdata/1/auditp.txt
$$ ##AUDIT TRAIL=  $$ (NUMBER, WHEN, WHO, WHERE, WHAT)
(   1,<2006-09-25 09:46:33.39 +100>,<MAYBRIDGE\nmr>,<NMR_250MHZ>,
      <created by zg, POWCHK disabled, PULCHK disabled
       configuration hash MD5:
       E2 DF 36 D8 04 B2 41 60 5A D7 A3 38 5A 4B D0 FE
       data hash MD5: 64K
       A4 63 74 F4 12 76 93 85 56 88 66 C6 3A AD D3 03>)
(   2,<2006-09-25 09:46:49.82 +100>,<MAYBRIDGE\nmr>,<NMR_250MHZ>,
      <Start of raw data processing
       ef LB = 0.3 FT_mod = 6 PKNL = 1 SI = 32K 
       data hash MD5: 32K
       33 57 7C 59 3B 10 C4 EA AD DF 56 53 26 E2 95 7F>)
(   3,<2006-09-25 09:46:51.42 +100>,<MAYBRIDGE\nmr>,<NMR_250MHZ>,
      <apk 
       data hash MD5: 32K
       DF 30 53 EF 56 F9 3A ED C2 B9 FE 60 2B 37 9C 5A>)
(   4,<2006-09-25 09:46:52.17 +100>,<MAYBRIDGE\nmr>,<NMR_250MHZ>,
      <abs ABSG = 5 
       data hash MD5: 32K
       2F D6 00 56 12 79 B6 1A 1E 17 95 F1 5C 0B D6 9B>)
$$ ##END=
$$ 
$$ hash MD5
$$ 87 95 9A 3B 4D 21 EF 93 AF E9 5B 55 77 C3 6C 77
##$RELAX= 
##$RELAX= 
##$RELAX= 
##$RELAX= 
##$RELAX= 
##$RELAX= 
##$RELAX= 
$$ Bruker specific parameters
$$ --------------------------
##$DU= <C:\u>
##$EXPNO= 1250
##$NAME= <ADRS>
##$PROCNO= 1
##$TYPE= <nmr>
##$USER= <dgb>
##$AMP= (0..31)
100 100 100 100 100 100 100 100 100 100 100 100 100 100 100 100 100 100 
100 100 100 100 100 100 100 100 100 100 100 100 100 100 
##$AQSEQ= 0
##$AQ_mod= 3
##$AUNM= <au_zg>
##$AUTOPOS= <13 >
##$BF1= 250.13
##$BF2= 250.13
##$BF3= 250.13
##$BF4= 250.13
##$BF5= 500.13
##$BF6= 500.13
##$BF7= 500.13
##$BF8= 500.13
##$BYTORDA= 1
##$CFDGTYP= 0
##$CFRGTYP= 5
##$CHEMSTR= <none>
##$CNST= (0..31)
1 1 145 1 1 1 1 1 1 1 1 1 1 1 1 1 1 1 1 1 1 1 1 1 1 1 1 1 1 1 1 1 
##$CPDPRG= <>
##$CPDPRG1= <>
##$CPDPRG2= <>
##$CPDPRG3= <>
##$CPDPRG4= <mlev>
##$CPDPRG5= <mlev>
##$CPDPRG6= <mlev>
##$CPDPRG7= <mlev>
##$CPDPRG8= <mlev>
##$CPDPRGB= <>
##$CPDPRGT= <>
##$D= (0..31)
0 1 0 0 0 0 0 0 0 0.06 0 0 0 0 0 0 0.0002 0 0 0 0 0 0 0 0 0 0 0 0 0 0 
0 
##$DATE= 1159173991
##$DBL= (0..7)
120 120 120 120 120 120 120 120 
##$DBP= (0..7)
150 150 150 150 150 150 150 150 
##$DBP07= 0
##$DBPNAM0= <>
##$DBPNAM1= <>
##$DBPNAM2= <>
$$ [...]
##$SUBNAM6= <"">
##$SUBNAM7= <"">
##$SUBNAM8= <"">
##$SUBNAM9= <"">
##$SW= 20.6930455092707
##$SWIBOX= (0..15)
0 0 3 0 0 0 0 0 0 0 0 0 0 0 0 0 
##$SW_h= 5175.983436853
##$TD= 65536
##$TD0= 1
##$TE= 295.16
##$TE2= 300
##$TE3= 300
##$TEG= 300
##$TL= (0..7)
0 120 120 120 120 120 120 120 
##$TP= (0..7)
150 150 150 150 150 150 150 150 
##$TP07= 0
##$TPNAME0= <>
##$TPNAME1= <>
##$TPNAME2= <>
##$TPNAME3= <>
##$TPNAME4= <>
##$TPNAME5= <>
##$TPNAME6= <>
##$TPNAME7= <>
##$TPOAL= (0..7)
0.5 0.5 0.5 0.5 0.5 0.5 0.5 0.5 
##$TPOFFS= (0..7)
0 0 0 0 0 0 0 0 
##$TUNHIN= 0
##$TUNHOUT= 0
##$TUNXOUT= 0
##$USERA1= <user>
##$USERA2= <user>
##$USERA3= <user>
##$USERA4= <user>
##$USERA5= <user>
##$V9= 5
##$VALIST= <valist>
##$VCLIST= <CCCCCCCCCCCCCCC>
##$VD= 0
##$VDLIST= <DDDDDDDDDDDDDDD>
##$VPLIST= <PPPPPPPPPPPPPPP>
##$VTLIST= <TTTTTTTTTTTTTTT>
##$WBST= 1024
##$WBSW= 4
##$XGAIN= (0..3)
0 0 0 0 
##$XL= 0
##$YL= 0
##$YMAX_a= 495479
##$YMIN_a= -547253
##$ZGOPTNS= <>
##$ZL1= 120
##$ZL2= 120
##$ZL3= 120
##$ZL4= 120
##$ABSF1= 16.522
##$ABSF2= -4.171173
##$ABSG= 5
##$ABSL= 3
##$ALPHA= 0
##$AQORDER= 0
##$ASSFAC= 0
##$ASSFACI= 0
##$ASSFACX= 0
##$ASSWID= 0
##$AUNMP= <proc_1d>
##$AZFE= 0.1
##$AZFW= 0.1
##$BCFW= 0
##$BC_mod= 0
##$BYTORDP= 0
##$COROFFS= 0
##$CY= 12.5
##$DATMOD= 1
##$DC= 0
##$DFILT= <>
##$DTYPP= 0
##$F1P= 14.0000005364418
##$F2P= -0.99999901652339
##$FCOR= 0.5
##$FTSIZE= 32768
##$FT_mod= 6
##$GAMMA= 0
##$GB= 0
##$INTBC= 1
##$INTSCL= 1
##$ISEN= 128
##$LB= 0.3
##$LEV0= 0
##$LPBIN= 0
##$MAXI= 10000
##$MC2= 0
##$MEAN= 0
##$ME_mod= 0
##$MI= 0
##$NCOEF= 0
##$NC_proc= -3
##$NLEV= 6
##$NOISF1= 0
##$NOISF2= 0
##$NSP= 0
##$NTH_PI= 0
##$NZP= 0
##$OFFSET= 16.522
##$PC= 1
##$PHC0= 137.3957
##$PHC1= 7.245759
##$PH_mod= 1
##$PKNL= yes
##$PPARMOD= 0
##$PSCAL= 4
##$PSIGN= 0
##$REVERSE= no
##$SF= 250.13
##$SI= 32768
##$SIGF1= 0
##$SIGF2= 0
##$SINO= 400
##$SIOLD= 32768
##$SREGLST= <1H.DMSO>
##$SSB= 0
##$STSI= 32768
##$STSR= 0
##$SW_p= 5175.98343685301
##$SYMM= 0
##$S_DEV= 0
##$TDeff= 65536
##$TDoff= 0
##$TI= <Analysis number 999999
Compound Code 99
Book Reference 9
Project Code 9>
##$TILT= no
##$TM1= 0
##$TM2= 0
##$TOPLEV= 0
##$USERP1= <user>
##$USERP2= <user>
##$USERP3= <user>
##$USERP4= <user>
##$USERP5= <user>
##$WDW= 1
##$XDIM= 32768
##$YMAX_p= 291825408
##$YMIN_p= -94216
$$ End of Bruker specific parameters
$$ ---------------------------------
##NTUPLES= NMR SPECTRUM
##VAR_NAME=  FREQUENCY,     SPECTRUM/REAL,   SPECTRUM/IMAG
##SYMBOL=    X,             R,               I
##VAR_TYPE=  INDEPENDENT,   DEPENDENT,       DEPENDENT
##VAR_FORM=  AFFN,          ASDF,            ASDF
##VAR_DIM=   32768,         32768,           32768
##UNITS=     HZ,            ARBITRARY UNITS, ARBITRARY UNITS
##FACTOR=    0.157963299565203, 1,           1
##FIRST=     4132.6476996994, 0,             0
##LAST=      -1043.33573715361, 0,           0
##MIN=       -1043.33573715361, -94216,      0
##MAX=       4132.6476996994, 291825408,     0
$$ Real data points
##PAGE= N=1
##DATA TABLE= (X++(R..R)), XYDATA
$$ [...]
$$ plain form
18541 41601632 36989566 30755671 24572680 19585504 15897589 13229020 11261424 9826315
18533 9826315 8727314 7854220 7168281 6631241 6186961 5828598 5522180 5263101 5007843
18524 5007843 4768099 4534648 4345927 4196164 4052012 3890732 3754373 3632614 3515933
18515 3515933 3435832 3369711 3282497 3217412 3128076 3069338 3029761 2968342 2892659 2817024 2714913
18504 2714913 2619864 2532665 2441054 2357431 2246824 2150024 2102586 2049051 1991332 1943341 1907425
18493 1907425 1859009 1837744 1798221 1763480 1767717 1737488 1694590 1679541 1669176 1627604 1627565 1625209
18481 1625209 1591052 1548492 1515585 1482717 1476670 1478056 1478399 1476997 1482197 1466867 1454236 1467405
18469 1467405 1489084 1491075 1495935 1523626 1532425 1532965 1533497 1545646 1555789 1580713 1630495 1691773 1772021
$$ packed form
18541D1601632m612066o233895o182991m987176l687915k668569j967596j435109
18533I826315j099001q73094o85939n37040m44280l58363l06418k59079k55258
18524E007843k39744k33451j88721j49763j44152j61280j36359j21759j16681
18515C515933q0101o6121q7214o5085q9336n8738l9577o1419p5683p5635j02111
18504B714913r5049q7199r1611q3623j10607r6800m7438n3535n7719m7991l5916
18493A907425m8416k1265l9523l4741M237l0229m2898j5049j0365m1572l9k356
18481A625209l4157m2560l2907l2868o047J386L43j402N200j5330j2631J3169
18469A467405K1679J991M860K7691Q799N40N32J2149J0143K4924M9782O1278Q0248
$$ plain form
18456 1772021 1840875 1935679 2043409 2143712 2233704 2316327 2393217 2467027 2538438 2595814 2659222
18445 2659222 2745644 2841460 2976966 3148319 3370525 3627660 3874757 4127186 4462603 4926507
18435 4926507 5516652 6201641 6996550 7938585 9074067 10438532 12100200 14143092 16725034
18426 16725034 20123904 24739581 31202986 40671226 55103505 77560599 108894181 139002088
18418 139002088 154901925 163408988 176929696 195082165 208912932 205410642 175428979
18411 175428979 133582649 99630443 76620403 60972236 49862594 41776694 35832992
18404 35832992 31437710 28102440 25423483 23223615 21499220 20193068 19148135 18215636
18396 18215636 17292480 16342662 15397660 14558945 13839606 13205555 12612275 12031222 11472617
$$ packed form
18456A772021O8854R4804J07730J00303Q9992Q2623P6890P3810P1411N7376O3408
18445B659222Q6422R5816J35506J71353K22206K57135K47097K52429L35417M63904
18435D926507N90145O84989P94909R42035J135482J364465J661668K042892K581942
18426A6725034L398870M615677O463405R468240J4432279K2457094L1333582L0107907
18418A39002088J5899837Q507063J3520708J8152469J3830767l502290k9981663
18411A75428979m1846330l3952206k3010040j5648167j1109642q085900n943702
18404C5832992m395282l335270k678957k199868j724395j306152j044933r32499
18396A8215636r23156r49818r45002q38715p19339o34051n93280n81053n58605
$$ plain form
18387 11472617 10937225 10433414 9928675 9460990 9008184 8598686 8223435 7902402 7645605
18378 7645605 7416694 7161853 6958342 6772099 6599112 6428165 6220484 6010696 5817081
18369 5817081 5643021 5516142 5391120 5242498 5085764 4924275 4794500 4663881 4522669
18360 4522669 4395845 4286555 4167322 4042487 3938779 3828859 3730035 3668376 3566253 3460095
18350 3460095 3363402 3280296 3216533 3144940 3074405 2985853 2896627 2788798 2673406 2597495 2543655
18339 2543655 2487943 2422433 2353776 2287119 2220920 2157201 2109751 2095529 2055556 1985648 1920601
18328 1920601 1869852 1821848 1801991 1753123 1677294 1634898 1578784 1539353 1506174 1473787 1431947
18317 1431947 1405855 1386959 1358956 1318178 1293747 1254492 1198235 1158453 1142412 1116993 1085996
$$ packed form
18387A1472617n35392n03811n04739m67685m52806m09498l75251l21033k56797
18378G645605k28911k54841k03511j86243j72987j70947k07681k09788j93615
18369E817081j74060j26879j25022j48622j56734j61489j29775j30619j41212
18360D522669j26824j09290j19233j24835j03708j09920r8824o1659j02123j06158
18350C460095r6693q3106o3763p1593p0535q8552q9226j07829j15392p5911n3840
18339B543655n5712o5510o8657o6657o6199o3719m7450j4222l9973o9908o5047
18328A920601n0749m8004j9857m8868p5829m2396n6114l9431l3179l2387m1840
18317A431947k6092j8896k8003m0778k4431l9255n6257l9782j6041k5419l0997
$$ plain form
18306 1085996 1086996 1052440 1024662 1009768 996486 988072 984829 991986 998104 1000687 1015290 1031611
18294 1031611 1017580 1022496 1031175 1022348 1018014 1029459 1012578 972838 895548 829607 793080 769195
18282 769195 744973 695831 676837 642461 613896 582273 575660 557044 511671 504416 502729 486962
18270 486962 456356 420698 414736 395414 382855 367431 374017 373734 379909 385556 357229 313856 298482
18257 298482 309732 303406 295183 274879 252806 259502 258867 262761 258916 248016 242991 234556 222089
18244 222089 232573 230057 247237 254942 251501 250904 235034 254551 251986 230536 224766 229125 224607
18231 224607 200381 199400 207650 224540 242417 262952 252701 244552 248356 243569 246556 236308 217024
18218 217024 199115 199380 215366 203958 185330 174003 171916 169556 182531 186917 174764 158704
$$ packed form
18306A085996J000l4556k7778j4894j3282q414l243P157O118K583J4603J6321
18294A031611j4031M916Q679q827m334J1445j6881l9740p7290o5941l6527k3885
18282G69195k4222m9142j8994l4376k8565l1623o613j8616m5373p255j687j5767
18270D86962l0606l5658n962j9322j2559j5424O586k83O175N647k8327m3373j5374
18257B98482J1250o326q223k0304k2073O696o35L894l845j0900n025q435j2467
18244B22089J0484k516J7180P705l441n97j5870J9517k565k1450n770M359m518
18231B24607k4226r81Q250J6890J7877K0535j0251q149L804m787K987j0248j9284
18218B17024j7909K65J5986j1408j8628j1327k087k360J2975M386j2153j6060
$$ plain form
18206 158704 153055 145500 159222 175464 196244 212868 210999 206246 193919 193174 195720 161019 127403
18193 127403 141698 119330 106397 129471 160855 156375 153310 178501 207753 179320 144556 151003
18181 151003 172692 149671 129376 118734 107686 107060 116978 122008 114883 110798 96857 109381 114220
18168 114220 105925 112426 105781 86574 90371 101143 103337 117547 127722 117619 106718 112757 99204
18155 99204 109622 108557 79130 73877 84803 91827 92688 101860 104525 105337 90908 78485 79043 85267
18141 85267 104218 118360 106478 89130 66099 30417 11173 3886 16957 55177 71996 63899
18129 63899 60507 65322 70247 73620 71129 69651 67055 96798 107212 93814 76968 60865 38435
18116 38435 31169 49589 56658 63759 59200 39159 34855 22558 34993 25912 13647 32719 50933
$$ packed form
18206A58704n649p555J3722J6242K0780J6624j869m753j2327p45K546l4701l3616
18193A27403J4295k2368j2933K3074L1384m480l065K5191K9252k8433l4764O447
18181A51003K1689k3021k0295j0642j1048o26R918N030p125m085j3941J2524M839
18168A14220q295O501o645j9207L797J0772K194J4210J0175j0103j0901O039j3553
18155I9204J0418j065k9427n253J0926P024Q61R172K665Q12j4429j2423N58O224
18141H5267J8951J4142j1882j7348k3031l5682j9244p287J3071L8220J6819q097
18129F3899l392M815M925L373k491j478k596K9743J0414j3398j6846j6103k2430
18116C8435p266J8420P069P101m559k0041m304j2297J2435r081j2265J9072J8214
$$ plain form
18103 50933 60129 67575 67834 84276 105166 136849 151030 172955 185087 190622 184229 154358 178963
18090 178963 177051 153968 125321 105367 94666 80658 74052 70530 85744 100011 62109 31194
18078 31194 52688 81930 98238 88898 67683 69370 73304 98622 113756 119563 108655 106385 125420
18065 125420 109409 91846 86841 84814 87916 78611 80097 85381 84826 86437 72572 67984 109555
18052 109555 121838 95521 80676 98144 97025 92421 116919 150767 171988 195174 233974 273156
18040 273156 268616 271630 287462 271339 271715 275278 243412 219498 204055 171533 151836 108546
18028 108546 101522 88387 82540 75716 71121 69528 88031 79543 66196 44461 43898 56146 67600
18015 67600 63193 58634 51584 52927 40461 54818 71708 61410 35057 31769 41707 46019 53868
$$ packed form
18103E0933R196P446K59J6442K0890L1683J4181K1925J2132N535o393k9871K4605
18090A78963j912k3083k8647j9954j0701j4008o606l522J5214J4267l7902l0915
18078C1194K1494K9242J6308r340k1215J687L934K5318J5134N807j0908k270J9035
18065A25420j6011j7563n005k027L102r305J486N284n55J611j3865m588M1571
18052A09555J2283k6317j4845J7468j119m604K4498L3848K1221K3186L8800L9182
18040B73156m540L014J5832j6123L76L563l1866k3914j5443l2522j9697m3290
18028A08546p024j3135n847o824m595j593J8503q488j3347k1735n63J2248J1454
18015F7600m407m559p050J343j2466J4357J6890j0298k6353l288R938M312P849
$$ plain form
18002 53868 45569 42051 45380 41872 11111 10667 28499 31031 21915 23009 67669 104990 98689 109007
17988 109007 120395 122826 126566 135670 141653 125560 93007 62438 70147 89249 89706 54177 43258
17975 43258 76451 75302 48600 32230 41904 50049 79193 82427 73749 63502 67982 46909 34501
17962 34501 28107 16555 28689 23558 26842 61525 70351 42602 50093 66232 69462 74332 76091
17949 76091 75946 53585 23538 30072 51657 56933 69632 73457 68256 68923 103735 120984 119354
17936 119354 119682 122943 118567 99431 87195 68948 49985 54726 60630 55264 49659 58029 49357
17923 49357 35462 30024 21818 592 1014 35007 77878 98612 70348 36337 21169 13998 -14467
17910 -14467 -9572 15753 39612 34809 14371 1530 5456 8341 13013 17801 14798 6828 -4723
$$ packed form
18002E3868q299l518L329l508l0761m44J7832K532r116J094M4660L7321o301J0318
17988A09007J1388K431L740R104N983j6093l2553l0569P709J9102M57l5529j0919
17975D3258L3193j149k6702j6370R674Q145K9144L234q678j0247M480k1073j2408
17962C4501o394j1552J2134n131L284L4683Q826k7749P491J6139L230M870J759
17949G6091j45k2361l0047O534K1585N276J2699L825n201O67L4812J7249j630
17936A19354L28L261m376j9136j2236j8247j8963M741N904n366n605Q370q672
17923D9357j3895n438q206k1226M22L3993M2871K0734k8264l4011j5168p171k8465
17910a4467M895K5325K3859m803k0438j2841L926K885M672M788l003p970j1551
$$ plain form
17897 -4723 10883 -394 -10659 -22973 -33102 -41440 -23370 -13568 -35548 -48418 -46631 -5900
17885 -5900 -7983 -8766 -24516 -18967 -26079 -20769 -19586 13336 41960 32053 23331 720 3351 34203
17871 34203 58885 72392 53974 34125 26655 27053 17362 -6013 -19901 -13550 17409 42510 22080
17858 22080 23828 19236 28367 30724 37646 39996 26529 10921 -18092 -16609 -21576 -36211 -29376
17845 -29376 -30530 -18086 -16753 -21946 -27987 -6971 25324 26427 19444 49432 51958 34084 18442
17832 18442 -3958 887 9370 8539 5169 3852 12698 58174 64704 50534 29173 16427 13489
17819 13489 -7837 -15036 4387 1466 -22896 -26637 -13708 -9428 17225 44984 48735 39461 24162
17806 24162 28733 7899 -16611 -7674 23153 37078 38228 48069 32179 12806 8104 15091 -35
$$ packed form
17897d723J5606j1277j0265j2314j0129q338J8070R802k1980j2870J787M0731
17885e900k083p83j5750N549p112N310J183L2922K8624r907q722k2611K631L0852
17871C4203K4682J3507j8418j9849p470L98r691k3375j3888O351L0959K5101k0430
17858B2080J748m592R131K357O922K350j3467j5608k9013J483m967j4635O835
17845b9376j154J2444J333n193o041K1016L2295J103o983K9988K526j7874j5642
17832A8442k2400M845Q483q31l370j317Q846M5476O530j4170k1361j2746k938
17819A3489k1326p199J9423k921k4362l741J2929M280K6653K7759L751r274j5299
17806B4162M571k0834k4510Q937L0827J3925J150R841j5890j9373m702O987j5126
$$ plain form
17793 -35 10975 1960 -18938 -25993 -26354 -32850 -29536 -19528 -2704 -12495 -9000 7790 -1863 566
17779 566 2809 -15972 -16496 -6051 10471 16060 19042 15892 27419 24080 13524 -7085 -13624 -12019
17765 -12019 -16477 -13887 -13123 -13188 -23168 -11809 11653 16130 19134 -1892 11475 12961 18885 22465
17751 22465 29694 33594 20274 24113 26754 6902 -13766 -15416 834 -2001 763 3369 -8771
17738 -8771 5871 12425 -1373 5328 -4690 5871 42901 53357 27905 24097 14855 -596 2318
17725 2318 6787 9849 -3296 -8876 -3288 7697 16893 10784 -8748 -5089 -11887 -7832 12715 18508
17711 18508 21952 47654 41162 24819 11867 5826 503 2431 18978 36427 13221 -24783 -40577
17698 -40577 -27603 -25312 -17696 -29300 -44209 -29652 -21344 -9814 -6319 -6234 -15435 -34110 -16086
$$ packed form
17793c5J1010r015k0898p055l61o496L314J0008J6824r791L495J6790r653K429
17779E66K243j8781n24J0445J6522N589K982l150J1527l339j0556k0609o539J605
17765a2019m458K590P64o5r980J1359K3462M477L004k1026J3367J486N924L580
17751B2465P229L900j3320L839K641j9852k0668j650J6250k835K764K606j2140
17738h771J4642O554j3798O701j0018J0561L7030J0456k5452l808r242j5451K914
17725B318M469L062j3145n580N588J0985R196o109j9532L659o798M055K0547N793
17711A8508L444K5702o492j6343j2952o041n323J928J6547J7449k3206l8004j5794
17698d0577J2974K291P616j1604j4909J4557Q308J1530L495Q5r201j8675J8024
$$ plain form
17685 -16086 22094 25849 24269 25586 21582 29281 47195 57405 44604 19726 11920 36660 39300
17672 39300 20196 11300 8316 30861 37493 34463 12057 -1420 21681 37284 20881 584
17660 584 -26095 -48078 -25343 -6583 7482 13947 12813 -23515 -24150 8246 2727 6974 1215
17647 1215 14318 18073 24694 34395 36543 24290 25256 -1971 -5602 -11170 -6850 7598 -4561 -19062
17633 -19062 -9039 2 32819 50935 28422 33415 31840 22943 32827 27488 15344 18848 14656
17620 14656 24992 34987 28554 16733 2548 3034 15869 31086 43465 25187 12084 -10008
17608 -10008 -4154 40313 60891 37645 47114 46019 60087 38994 22971 11273 8037 9555 10516
17595 10516 26759 61522 49157 9228 3642 17476 21472 27159 16057 -1921 -12795 -16584
$$ packed form
17685a6086L8180L755j580J317m004P699J7914J0210j2801k4878p806K4740K640
17672C9300j9104q896k984K2545O632l030k2406j3477K3101J5603j6403k0297
17660E84k6679k1983K2735J8760J4065O465j134l6328o35L2396n519M247n759
17647A215J3103L755O621R701K148j2253R66k7227l631n568M320J4448j2159j4501
17633a9062J0023R041L2817J8116k2513M993j575q897R884n339j2144L504m192
17620A4656J0336R995o433j1821j4185M86J2835J5217J2379j8278j3103k2092
17608a0008N854M4467K0578k3246R469j095J4068k1093j6023j1698l236J518R61
17595A0516J6243L4763j2365l9929n586J3834L996N687j1102j7978j0874l789
$$ plain form
17583 -16584 -20996 -28958 3834 8103 13768 1657 3252 35060 43501 49071 16132 17845 22444
17570 22444 7606 8890 -8777 4373 25345 34076 26321 11943 12389 8674 17847 34226 37652
17557 37652 19449 1849 5949 22636 14767 8210 22176 6619 -8232 -10540 -14956 -20557 -13635
17544 -13635 -13881 -10769 -15368 -26856 -34354 -8405 13398 19115 22806 23187 10668 20704 32970
17531 32970 9982 91 11213 20470 -3457 12142 6787 -18771 -10589 23172 21373 19629 24001
17518 24001 11543 8074 12851 -1438 -14425 10240 16322 28506 37314 27343 21550 23821 36097
17505 36097 18814 23555 54950 70285 85473 98984 129952 155450 155536 157719 141145 137429 159457
17492 159457 151248 132101 130303 118511 138195 126475 96411 99616 120251 148884 150962 156289
$$ packed form
17583a6584m412p962L2792M269N665j2111J595L1808Q441N570l2939J713M599
17570B2444j4838J284j7667J3150K0972Q731p755j4378M46l715R173J6379L426
17557C7652j8203j7600M100J6687p869o557J3966j5557j4851k308m416n601O922
17544a3635k46L112m599j1488p498K5949K1803N717L691L81j2519J0036J2266
17531C2970k2988r891J1122R257k3927J5599n355k5558Q182L3761j799j744M372
17518B4001j2458l469M777j4289j2987K4665O082J2184Q808r971n793K271J2276
17505C6097j7283M741L1395J5335J5188J3511L0968K5498Q6K183j6574l716K2028
17492A59457q209j9147j798j1792J9684j1720l0064L205K0635K8633K078N327
$$ plain form
17480 156289 146383 115523 93639 81333 79015 80140 78437 81128 84934 102117 100566 63483 37239
17467 37239 47270 80124 83279 93199 111563 128463 127715 129214 149846 148332 165777 189806 220652
17454 220652 240737 244322 244559 254817 267326 280861 286155 280292 294026 311041 311332 313507 317932
17441 317932 318041 317782 308915 306484 311564 301607 282527 256354 247586 243520 238325 236982 226317 228395
17427 228395 233653 217481 183294 161675 126742 105432 104138 103543 94504 65742 50504 48355 51167
17414 51167 65097 69272 66908 42666 37809 49261 61198 70667 61127 39252 43413 35650 25061
17401 25061 23026 31522 44768 53542 29423 12499 34024 48160 47326 33631 10876 -2024 20987
17388 20987 49690 69758 62348 51604 62924 49888 45865 56500 48073 60388 67377 74061 61969
$$ packed form
17480A56289r906l0860k1884j2306k318J125j703K691L806J7183j551l7083k6244
17467C7239J0031L2854L155R920J8364J6900p48J499K0632j514J7445K4029L0846
17454B20652K0085L585K37J0258J2509J3535N294n863J3734J7015K91K175M425
17441C17932J09k59q867k431N080r957j9080k6173q768m066n195j343j0665K078
17427B28395N258j6172l4187k1619l4933k1310j294n95r039k8762j5238k149K812
17414E1167J3930M175k364k4242m857J1452J1937R469r540k1875M161p763j0589
17401B5061k035Q496J3246Q774k4119j6924K1525J4136q34j3695k2755j2900K3011
17388B0987K8703K0068p410j0744J1320j3036m023J0635q427J2315O989O684j2092
$$ plain form
17375 61969 47462 54620 68607 69796 69415 45577 48057 35410 46912 66698 56707 47579 45460
17362 45460 24978 -2456 8753 4211 39 -3221 15843 27454 26714 13909 5007 16142 41204
17349 41204 47391 55243 32926 31191 23052 40318 65351 62737 48978 34967 -6580 -8794 5829
17336 5829 33952 56449 66979 52706 39243 59075 60811 50471 43016 41988 24131 16517 9975
17323 9975 1179 -199 -2236 -10684 -2177 -2158 -22791 -29695 -16399 -6377 15502 14793 11139 1345
17309 1345 -7439 -4813 -5677 -3788 -2096 8207 32524 36178 34393 28651 45838 72151 78347 46489
17295 46489 10472 25814 18695 -4668 -7109 14854 21836 34908 42558 52826 57187 64977 47183
17282 47183 67646 55568 36766 18991 40525 34983 11339 25159 30400 21926 20948 -1557 4490
$$ packed form
17375F1969j4507P158J3987J189l81k3838K480j2647J1502J9786r991r128k119
17362D5460k0482k7434J1209m542m172l260J9064J1611p40j2805q902J1135K5062
17349D1204O187P852k2317j735q139J7266K5033k614j3759j4011m1547k214J4623
17336E829K8123K2497J0530j4273j3463J9832J736j0340p455j028j7857p614o542
17323I975q796j378k037q448Q507J9k0633o904J3296J0022K1879p09l654r794
17309A345q784K626q64J889J692J0303K4317L654j785n742J7187K6313O196l1858
17295D6489l6017J5342p119k3363k441K1963O982J3072P650J0268M361P790j7794
17282D7183K0463j2078j8802j7775K1534n542k3644J3820N241q474r78k2505O047
$$ plain form
17269 4490 35516 48989 22613 14365 19707 7673 25753 32119 49471 57349 66665 65283 56994
17256 56994 43996 35750 12635 22090 29153 39098 50938 50583 39352 40047 14687 -8638 -3023
17243 -3023 7887 -2092 22010 41042 24271 11088 -3063 -12853 8091 37354 46635 50954 51897
17230 51897 44588 45501 45008 47650 40955 58593 74159 79874 54519 24692 39780 44172 33880
17217 33880 35972 36625 45132 47054 60342 75093 70662 45164 35908 40749 71840 81546 89681 95677
17203 95677 97559 85102 66174 63486 76712 64123 64443 92762 113381 130252 124460 109366 70231
17190 70231 45176 27822 38808 48377 60463 78987 78976 51423 37874 41424 52483 69120 71689
17177 71689 90197 83738 75475 64921 58289 88708 84673 50048 47566 63570 64404 50135 22854
$$ packed form
17269D490L1026J3473k6376q248N342j2034J8080O366J7352P878R316j382q289
17256E6994j2998q246k3115R455P063R945J1840l55j1231O95k5360k3325N615
17243c023J0910r979K4102J9032j6771j3183j4151r790K0944K9263R281M319R43
17230E1897p309R13m93K642o695J7638J5566N715k5355k9827J5088M392j0292
17217C3880K092O53Q507J922J3288J4751m431k5498r256M841L1091R706Q135N996
17203I5677J882j2457j8928k688J3226j2589L20K8319K0619J6871n792j5094l9135
17190G0231k5055j7354J0986R569J2086J8524j1k7553j3549L550J1059J6637K569
17177G1689J8508o459q263j0554o632L0419m035l4625k482J6004Q34j4269k7281
$$ plain form
17164 22854 16647 25739 34596 46198 40773 43245 52910 60102 66082 59243 58295 39919 40503 36951
17150 36951 39843 50961 40822 45334 52664 61636 75600 64327 60088 68964 62195 57389 40015
17137 40015 29980 28977 31900 33978 31184 34388 41525 61791 76807 51409 49326 59296 65672
17124 65672 60562 76159 98588 103726 91779 74167 78585 80194 91718 93562 95396 99619 79510
17111 79510 82790 105137 106377 118818 153677 148619 126498 120493 110387 98575 112442 106222 125391
17098 125391 125608 138949 149526 123043 127235 121043 98191 132579 170446 179386 169839 160617 158869
17085 158869 167918 186198 213213 235040 236206 251682 241512 213099 234604 257545 263270 240360
17073 240360 247763 258178 261172 254625 267766 268025 281832 298463 298594 299019 286292 275744 274983 282003
$$ packed form
17164B2854o207R092Q857J1602n425K472R665P192N980o839r48j8376N84l552
17150C6951K892J1118j0139M512P330Q972J3964j1273m239Q876o769m806j7374
17137D0015j0035j003K923K078k794L204P137K0266J5016k5398k083R970O376
17124F5672n110J5597K2429N138j1947j7612M418J609J1524J844J834M223k0109
17111G9510L280K2347J240J2441L4859n058k2121o005j0106j1812J3867o220J9169
17098A25391K17J3341J0577k6483M192o192k2852L4388L7867Q940r547r222j748
17085A58869R049J8280K7015K1827J166J5476j0170k8413K1505K2941N725k2910
17073B40360P403J0415K994o547J3141K59J3807J6631J31M25j2727j0548p61P020
$$ plain form
17059 282003 295528 290848 272818 254865 252700 243438 236346 229835 245557 256321 260806 275026 279644
17046 279644 296288 293474 288295 306706 294043 303450 322075 331755 323316 335912 356972 371319
17034 371319 378052 391946 417144 433500 457641 478213 485892 496595 506317 537057 566459 560362
17022 560362 565474 584878 633430 663182 674039 701403 757182 796847 846026 904520 951603 1003856
17010 1003856 1066195 1155540 1270438 1393513 1520814 1632779 1748482 1918462 2108561 2370082
17000 2370082 2732962 3194991 3832949 4713658 5910561 7583526 9699070 11931604 13743969
16991 13743969 15077162 16374021 17750550 18870711 19239498 18524079 17104548 15969249
16983 15969249 15761802 16694947 18950858 22498597 26520407 29679852 31797667 33806089
$$ packed form
17059B82003J3525m680j8030j7953k165r262p092o511J5722J0764M485J4220M618
17046B79644J6644k814n179J8411j2663R407J8625R680q439J2596K1060J4347
17034C71319O733J3894K5198J6356K4141K0572P679J0703R722L0740K9402o097
17022E60362N112J9404M8552K9752J0857K7364N5779L9665M9179N8494M7083N2253
17010A003856O2339Q9345J14898J23075J27301J11965J15703J69980J90099K61521
17000B370082L62880M62029O37958Q80709J196903J672965K115544K232534J812365
16991A3743969J333193J296859J376529J120161L68787p15419j419531j135299
16983A5969249k07447R33145K255911L547739M021810L159445K117815K008422
$$ plain form
16975 33806089 36025792 37794043 37812888 35060295 30269917 25430745 21688526 19109745
16967 19109745 17501031 16690264 16578187 17216024 18687844 21097945 24480889 28639246
16959 28639246 33128926 37528736 41546691 44995366 47854851 49779231 50281432 49201018
16951 49201018 46982254 44621588 43247616 43602073 45702150 48912587 52482128 55942630
16943 55942630 59272696 62386196 64920164 66326749 66432185 65584827 63977407 61386131
16935 61386131 58353779 56187157 55211975 54389985 52094679 47233759 40611407 34308814
16927 34308814 29503633 26223251 24140629 22947592 22282343 21721628 21072359 20548789 20229162
16918 20229162 19916674 19202180 17812778 15944863 14104083 12599963 11429989 10465938
$$ packed form
16975C3806089K219703J768251J8845k752593m790378m839172l742219k578781
16967A9109745j608714q10767j12077O37837J471820K410101L382944M158357
16959B8639246M489680M399810M017955L448675K859485J924380N02201j080414
16951D9201018k218764k360666j373972L54457K100077L210437L569541L460502
16943E5942630L330066L113500K533968J406585J05436q47358j607420k591276
16935F1386131l032352k166622r75182q21990k295306m860920o622352o302593
16927C4308814m805181l280382k082622j193037o65249n60715o49269n23570l19627
16918B0229162l12488p14494j389402j867915j840780j504120j169974r64051
$$ plain form
16910 10465938 9684752 9068146 8555594 8126424 7747305 7401591 7098630 6846973 6634511
16901 6634511 6424036 6182039 5974039 5778337 5579563 5386170 5231963 5020887 4830213
16892 4830213 4675027 4547956 4383842 4220429 4087515 3962602 3879361 3791207 3672350 3563658
16882 3563658 3461714 3365135 3295770 3196732 3105822 3025770 2945544 2868129 2816341 2741362 2667109
16871 2667109 2592143 2516401 2450306 2407607 2346189 2271257 2208065 2153057 2107889 2083911 2031850
16860 2031850 1972836 1907233 1861344 1804094 1762950 1722743 1672120 1627341 1588548 1543422 1466425
16849 1466425 1441302 1411925 1388248 1337340 1304893 1258631 1217985 1182985 1170013 1133570 1107727
16838 1107727 1084248 1085963 1069467 1031508 1000616 964928 944536 949561 932668 904930 888954 885777
$$ packed form
16910A0465938p81186o16606n12552m29170l79119l45714l02961k51657k12462
16901F634511k10475k41997k08000j95702j98774j93393j54207k11076j90674
16892D830213j55186j27071j64114j63413j32914j24913q3241q8154j18857j08692
16882C563658j01944r6579o9365r9038r0910q0052q0226p7415n1788p4979p4253
16871B667109p4966p5742o6095m2699o1418p4932o3192n5008m5168k3978n2061
16860B031850n9014o5603m5889n7250m1144m0207n0623m4779l8793m5126p6997
16849A466425k5123k9377k3677n0908l2447m6262m0646l5000j2972l6443k5843
16838A107727k3479J715j6496l7959l0892l5688k0392N025j6893k7738j5976l177
$$ plain form
16826 885777 870201 852642 821958 808901 804773 788259 769548 765073 756048 738275 734209 706201
16814 706201 678607 646865 626487 617031 626462 607158 579752 573321 561159 530458 526582 514792
16802 514792 494952 478663 460896 427689 406066 393856 396564 401566 403215 401728 394625 376356
16790 376356 354477 377438 356874 345041 335751 302304 291497 311569 308616 295124 254896 235863
16778 235863 239258 266613 271531 258938 281676 267224 247168 238442 257538 260590 244988 228441
16766 228441 229642 211110 230960 271973 290351 280899 266061 239738 241474 261417 249479 250582
16754 250582 267562 264267 251945 239111 246984 239090 242169 236213 236301 236336 227185 232695 250403 240259
16740 240259 233336 232880 200583 183082 181074 196571 200985 191841 166628 150380 137242 167551 185668
$$ packed form
16826H85777j5576j7559l0684j3057m128j6514j8711m475r025j7773m066k8008
16814G06201k7594l1742k0378r456R431j9304k7406o431j2162l0701l876j1790
16802E14792j9840j6289j7767l3207k1623j2210K708N002J649j487p103j8269
16790C76356k1879K2961k0564j1833r290l3447j0807K0072k953j3492m0228j9033
16778B35863L395K7355M918j2593K2738j4452k0056q726J9096L052j5602j6547
16766B28441J201j8532J9850M1013J8378r452j4838k6323J736J9943j1938J103
16754B50582J6980l295j2322j2834P873p894L079n956Q8L5r151N510J7708j0144
16740B40259o923m56l2297j7501k008J5497M414r144k5213j6248j3138L0309J8117
$$ plain form
16727 185668 195662 185844 185335 192607 165579 123263 122193 153667 174460 165616 167998 170211 161665
16714 161665 122223 107617 103411 107794 134486 163305 133996 105495 92132 112333 109926 107970
16702 107970 78271 54583 68516 90334 93757 74898 78394 79139 78090 61503 87124 77372 65479
16689 65479 57344 83096 109755 125662 123524 128244 142255 125919 96746 107222 105381 97735 56719
16676 56719 44151 61706 76700 79151 74984 84842 98967 104190 101776 82123 65066 62375 77899
16663 77899 92946 90047 78175 67055 66912 89085 96833 87732 78866 75253 79176 71557 78434 55152
16649 55152 38990 31651 37844 52542 46572 30828 34386 54853 41227 51005 45866 32554 25058
16636 25058 29941 3454 -4228 -13781 -12656 626 6765 11125 -1793 6426 8605 2637 -26919
$$ packed form
16727A85668R994r818n09P272k7028m2316j070L1474K0793q844K382K213q546
16714A61665l9442j4606m206M383K6692K8819k9309k8501j3363K0201k407j956
16702A07970k9699k3688J3933K1818L423j8859L496P45j049j6587K5621r752j1893
16689F5479q135K5752K6659J5907k138M720J4011j6336k9173J0476j841p646m1016
16676E6719j2568J7555J4994K451m167R858J4125N223k414j9653j7057k691J5524
16663G7899J5047k899j1872j1120j43K2173P748r101q866l613L923p619O877k3282
16649E5152j6162p339O193J4698n970j5744L558K0467j3626R778n139j3312p496
16636B5058M883k6487p682r553J125J3282O139M360j2918Q219K179n968k9556
$$ plain form
16623 -26919 -17166 -6933 -783 -10047 -2458 15744 -3975 -12736 13268 24595 17742 23100 29973
16610 29973 23695 31568 45208 38744 25258 18277 29077 35660 16254 19494 27382 33632 23938
16597 23938 26884 25854 38740 48481 42350 51251 67908 54382 38600 20783 37940 46369 54717
16584 54717 71346 49877 34033 24221 11684 11076 27790 56827 59267 52792 61379 48302 38907
16571 38907 47694 44225 44649 41558 32640 27446 36815 35322 46250 61058 55845 37534 30166 20703
16557 20703 9775 20960 36033 31303 3452 11419 25092 -5840 -7642 7739 6592 15148 24579
16544 24579 42396 45423 61373 55408 36342 30400 8122 -9475 -10621 -6306 7481 1427 16103
16531 16103 1448 -14215 -3546 2110 -2210 -22356 -20301 -11117 -8856 -4107 832 10822 16531
$$ packed form
16623b6919R753J0233O150r264P589J8202j9719q761K6004J1327o853N358O873
16610B9973o278P873J3640o464j3486o981J0800O583j9406L240P888O250r694
16597B3938K946j030J2886R741o131Q901J6657j3526j5782j7817J7157Q429Q348
16584E4717J6629k1469j5844r812j2537o08J6714K9037K440o475Q587j3077r395
16571C8907Q787l469M24l091q918n194R369j493J0928J4808n213j8311p368r463
16557B0703j0928J1185J5073m730k7851P967J3673l0932j802J5381j147Q556R431
16544B4579J7817L027J5950n965j9066n942k2278j7597j146M315J3787o054J4676
16531A6103j4655j5663J0669N656m320k0146K055R184K261M749M939R990N709
$$ plain form
16518 16531 50674 63397 43883 27604 29954 46484 24118 8071 10119 17262 14556 16719 12985
16505 12985 -7817 -15689 -25504 -21681 -42449 -35351 -3533 -5272 -24278 1295 15496 16052 19767
16492 19767 8709 3034 7601 43620 61573 56731 48346 57130 49133 42984 33551 37532 58489
16479 58489 66470 79919 123006 146050 147370 165565 183967 165489 164079 157296 151418 149509 153052
16466 153052 171081 207878 203607 211073 230193 239804 247060 260069 249991 238712 228786 238724 253200
16453 253200 262085 287405 295953 289162 307914 308547 305734 281764 281200 270249 261438 263418 261119 279788
16439 279788 289054 322981 323036 295537 269934 244925 220851 194103 178227 173758 178055 189922 196472
16426 196472 180762 179257 181248 155492 165047 163750 172283 177133 170924 146451 127993 147703 153078
$$ packed form
16518A6531L4143J2723j9514j6279K350J6530k2366j6047K048P143k706K163l734
16505A2985k0802p872r815L823k0768P098L1818j739j9006K5573J4201N56L715
16492A9767j1058n675M567L6019J7953m842q385Q784p997o149r433L981K0957
16479E8489P981J3449M3087K3044J320J8195J8402j8478j410o783n878j909L543
16466A53052J8029L6797m271P466J9120R611P256J3009j0078j1279r926R938J4476
16453B53200Q885K5320Q548o791J8752O33k813k3970n64j0951q811J980k299J8669
16439B79788R266L3927N5k7499k5603k5009k4074k6748j5876m469M297J1867O550
16426A96472j5710j505J991k5756R555j297Q533M850o209k4473j8458J9710N375
$$ plain form
16413 153078 145769 150911 153220 141827 142289 160363 149809 134024 105351 108551 88949 54894 33843
16400 33843 40530 56483 73111 53454 45286 56172 51526 35448 23400 36194 42612 33957 28679
16387 28679 19891 13396 -1566 13734 13364 731 -9967 1089 18568 27457 31654 38930 25899
16374 25899 31919 46456 39035 25345 11720 -11888 -4257 15560 42689 60342 35507 32904
16362 32904 6261 12141 30517 50661 50969 43829 57407 48528 15243 24730 44026 44168 43044
16349 43044 32730 36595 29516 26036 14810 6643 13474 28167 15946 22164 34885 22440 6062
16336 6062 7685 16540 26535 27407 7031 -9847 -1230 9706 -9746 -2187 -6956 26928 39912
16323 39912 28195 19913 14737 27627 28935 4572 -4300 5534 15442 16129 223 -733 10252 14698
$$ packed form
16413A53078p309N142K309j1393M62J8074j0554j5785k8673L200j9602l4055k1051
16400C3843O687J5953J6628j9657q168J0886m646j6078j2048J2794O418q655n278
16387B8679q788o495j4962J5300l70j2633j0698J1056J7479Q889M197P276j3031
16374B5899O020J4537p421j3690j3625k3608P631J9817K7129J7653k4835k603
16362C2904k6643N880J8376K0144L08p140J3578q879l3285R487J9296J42j124
16349D3044j0314L865p079l480j1226q167O831J4693j2221O218J2721j2445j6378
16336F062J623Q855R995Q72k0376j6878Q617J0936j9452P559m769L3884J2984
16323C9912j1717q282n176J2890J308k4363q872R834R908O87j5906r56J0985M446
$$ plain form
16309 14698 3797 9447 1770 -17253 -32873 -39937 -22925 9217 23890 7342 -21460 -44201
16297 -44201 -38563 -29910 -21843 -21677 -18680 -28595 -33627 -35720 -22556 -13578 -3776 -2516 -11336 -17133
16283 -17133 -25349 -40370 -29557 -25660 -18376 -18076 -40244 -24503 5014 -5446 9588 3587 2606
16270 2606 -4603 -2301 16709 15478 -6870 -22229 -20544 -3107 11433 11687 6656 8199 3642 -13694
16256 -13694 -24242 -34092 -12354 -217 -17984 -20846 -12937 3389 12155 12700 13568 8673 10604 28024
16242 28024 41168 56489 43559 11753 517 -9676 -9779 -5738 -4900 -951 -20073 -30544 -24902
16229 -24902 -18427 9971 26643 5894 807 -15132 -41925 -58832 -31984 -8357 12833 17345
16217 17345 -17521 -46953 -55979 -41063 -45022 -49844 -41483 -25391 5639 18534 35914 12790
$$ packed form
16309A4698j0901N650p677j9023j5620p064J7012L2142J4673j6548k8802k2741
16297d4201N638Q653Q067J66K997r915n032k093J3164Q978R802J260q820n797
16283a7133q216j5021J0813L897P284L00k2168J5741K9517j0460J5034o001r81
16270B606p209K302J9010j231k2348j5359J685J7437J4540K54n031J543m557j7336
16256a3694j0548r850K1738J2137j7767k862P909J6326Q766N45Q68m895J931J7420
16242B8024J3144J5321j2930l1806j1236j0193j03M041Q38L949j9122j0471N642
16229b4902O475K8398J6672k0749n087j5939k6793j6907K6848K3627K1190M512
16217A7345l4866k9432r026J4916l959m822Q361J6092L1030J2895J7380k3124
$$ plain form
16205 12790 -28265 -26728 -22852 -17014 -12633 -14002 -7187 -26884 -42811 -22673 -23172 -13662 10365
16192 10365 16683 13858 -9329 8857 21652 20503 2914 -6854 -1345 31106 45574 32244 20609
16179 20609 12982 18860 22631 4127 -7320 -16264 -28652 -13880 -8019 -3305 -4075 -8409 -20581
16166 -20581 -43042 -9952 10591 15998 15226 5362 -12580 -17676 -24851 -32355 -36841 -34170 -37416 -41845
16152 -41845 -62844 -32930 -438 9288 4369 12068 14227 -11990 -15719 -27563 -15368 -22383 -34156
16139 -34156 -24294 -11651 -14381 -25050 -31884 -37432 -29634 -34453 -38122 -27017 -13068 -12547 -16181 -7530
16125 -7530 -15286 -17904 -30911 -22094 -12242 -31779 -34725 -9855 388 -9349 -2031 -16859 -9343
16112 -9343 -17569 -13349 -36917 -57343 -22849 -22735 -29457 -33032 -22038 -11566 21751 32622 28216
$$ packed form
16205A2790m1055J537L876N838M381j369O815j9697j5927K0138m99R510K4027
16192A0365O318k825k3187J8186J2795j149j7589r768N509L2451J4468j3330j1635
16179B0609p627N878L771j8504j1447q944j2388J4772N861M714p70m334j2172
16166b0581k2461L3090K0543N407p72r864j7942n096p175p504m486K671l246m429
16152d1845k0999K9914L2492R726m919P699K159k6217l729j1844J2195p015j1773
16139c4156R862J2643k730j0669o834n548P798m819l669J1105J3949N21l634Q651
16125g530p756k618j3007Q817R852j9537k946K4870J0243r737P318j4828P516
16112i343q226M220k3568k0426L4494J14o722l575J0994J0472L3317J0871m406
$$ plain form
16099 28216 21301 -6331 -16137 -21898 -4063 608 7699 14576 23540 22464 16443 9114 10860 6661
16085 6661 -12366 -31750 -35469 -17526 -16719 -36130 -35717 -13476 8742 13853 2381 -3421 -7548
16072 -7548 -2884 4189 4568 4856 4244 6922 14464 37732 34850 811 -44839 -57315 -42930 -27151
16058 -27151 -18139 -15722 -22185 11802 42136 51711 57933 48435 17090 -898 -19413 -32441 -12145
16045 -12145 -6155 -11119 -16298 -33780 -30112 -10409 9574 -6389 -32053 -50261 -37924 -30772 -15892
16032 -15892 -23539 -17409 -1743 4248 3010 -712 18694 22335 75 -14182 -3774 -8608 -17024
16019 -17024 -18157 -17548 -3071 -6463 -1805 -16190 -36970 -40090 -36357 -35333 -32763 -9937 -3377 -12867
16005 -12867 -36155 -30383 -45805 -28143 6009 5378 3377 -922 -1960 -8523 -10464 8819 13516
$$ packed form
16099B8216o915k7632r806n761J7835M671P091O877Q964j076o021p329J746m199
16085F661j9027j9384l719J7943Q07j9411M13K2241K2218N111j1472n802m127
16072g548M664P073L79K88o12K678P542K3268k882l4039m5650j2476J4385J5779
16058b7151R012K417o463L3987L0334R575O222r498l1345j7988j8515j3028K0296
16045a2145N990m964n179j7482L668J9703J9983j5963k5664j8208J2337P152J4880
16032a5892p647O130J5666N991j238l722J9406L641k2260j4257J0408m834q416
16019a7024j133O09J4477l392M658j4385k0780l120L733J024K570K2826O560r490
16005a2867k3288N772j5422J7662L4152o31k001m299j038o563j941J9283M697
$$ plain form
15992 13516 10643 13678 28697 22742 15168 8203 5505 6443 8781 26193 20505 5774 -8662 -17410
15978 -17410 -19290 -24528 -39611 -20818 -9934 -15801 -28026 -23955 -4125 -8303 -8319 -8644 -25795 -34002
15964 -34002 -15048 -5752 -273 -23688 -14176 -3654 -15357 -10840 -5605 -7447 -8972 -8542 -20646
15951 -20646 -37308 -49509 -47478 -15388 -4977 10648 5430 -14091 -23789 -12218 -6168 5279
15939 5279 33989 31274 26857 21846 9955 -10835 -8611 -20952 -21806 -35424 -25427 11423 20806
15926 20806 8725 603 -8789 -13005 -7721 17218 16589 4951 1805 6199 -7238 -24292 -26227
15913 -26227 -4859 -9506 -26116 -36761 -15531 -11087 -31066 -39549 -37272 -19198 -22828 -22246 -15870
15900 -15870 -17195 -36512 -39947 -47324 -60340 -48851 -25310 13 7705 1217 -27899 -28090 -32412
$$ packed form
15992A3516k873L035J5019n955p574o965k698R38K338J7412n688j4731j4436q748
15978a7410j880n238j5083J8793J0884n867j2225M071J9830m178j6l25j7151q207
15964c4002J8954R296N479k3415R512J0522j1703M517N235j842j525M30j2104
15951b0646j6662j2201K031L2090J0411J5625n218j9521r698J1571O050J1447
15939E279K8710k715m417n011j1891k0790K224j2341q54j3618R997L6850R383
15926B0806j2081q122r392m216N284K4939o29j1638l146M394j3437j7054j935
15913b6227K1368m647j6610j0645K1230M444j9979q483K277J8074l630N82O376
15900a5870j325j9317l435p377j3016J1489K3541K5323P692o488k9116j91m322
$$ plain form
15887 -32412 -16250 -14997 -10984 -4370 9016 32036 21772 2258 -7656 5063 3382 5616 1936
15874 1936 4684 16863 24197 26988 15479 -5518 -30525 -36664 -36747 -40801 -51162 -26784 -6097
15861 -6097 2073 1556 -9018 11895 21138 7019 5753 -11084 -30113 -41979 -24149 -16035 -3528
15848 -3528 -7446 -1058 33920 10126 -10587 -13085 12773 20286 13672 -13683 -59104 -66675 -51072
15835 -51072 -50394 -36744 -17196 -20735 -8475 -8727 -12003 -27496 -39781 -26866 -26230 -40406 -44847
15822 -44847 -27039 -24552 -20761 -29794 -28806 -31569 -14940 -1518 -14944 -13947 15788 27691 19736
15809 19736 -9823 -32945 -37004 -43873 -40839 -24979 -11025 -4510 -6212 -8701 -10593 -2518 26492
15796 26492 37478 28125 13147 14920 14122 7021 -7281 1082 1284 11053 29056 9011 -11660
$$ packed form
15887c2412J6162J253M013O614J3386K3020j0264j9514r914J2719j681K234l680
15874A936K748J2179P334K791j1509k0997k5007o139q3m054j0361K4378K0687
15861f097Q170n17j0574K0913R243j4119j266j6837j9029j1866J7830Q114J2507
15848c528l918O388L4978k3794k0713k498K5858P513o614k7355m5421p571J5603
15835e1072O78J3650J9548l539J2260k52l276j5493j2285J2915O36j4176m441
15822d4847J7808K487L791r033R88k763J6629J3422j3426R97K9735J1903p955
15809A9736k9559k3122m059o869L034J5860J3954O515j702k489j892Q075K9010
15796B6492J0986r353j4978J773p98p101j4302Q363K02R769J8003k0045k0671
$$ plain form
15783 -11660 -17223 -17551 -12515 11161 26296 31563 24139 12799 872 -17929 -38574 -6747 27517
15770 27517 18532 -8688 -21808 -10973 6939 2745 -14884 -968 22640 24922 39628 33180
15758 33180 27603 2782 5375 12282 22043 13480 11325 -2248 -13292 -33855 -23206 -17262 -25404
15745 -25404 -8701 5322 -11787 -15559 6501 28096 30089 46224 39215 21941 7052 -7060
15733 -7060 -2390 -5680 -44160 -44247 -24981 -30754 -14680 -7567 -25778 -30357 -956 -7162 -6567 10395
15719 10395 8684 -11895 -15550 -7425 13108 30400 36635 45569 31723 35620 23528 -5356 7410
15706 7410 16395 -8622 -32442 -31274 -16255 -11982 -619 600 -13492 -6925 9948 3066 7268
15693 7268 -7544 16815 7689 -12878 -23 -2574 -4602 -4591 7460 25478 11381 1965 -5992
$$ packed form
15783a1660n563l28N036K3676J5135N267p424j1340j1927j8801k0645L1827L4264
15770B7517q985k7220j3120J0835J7912m194j7629J3916K3608K282J4706o448
15758C3180n577k4821K593O907R761q563k155j3573j1044k0563J0649N944q142
15745b5404J6703J4023j7109l772K2060K1595J993J6135p009j7274j4889j4112
15733g060M670l290l8480q7J9266n773J6074P113j8211m579K9401o206N95J6962
15719A0395j711k0579l655Q125K0533J7292O235Q934j3846L897j2092k8884J2766
15706G410Q985k5017k3820J168J5019M273J1363J219j4092O567J6873o882M202
15693G268j4812K4359r126k0567J2855k551k028J1J2051J8018j4097r416p957
$$ plain form
15680 -5992 -2037 -5955 -4615 -3339 -8031 -19738 -25968 -37901 -5005 -6633 -31099 -32099 -17143
15667 -17143 -18672 -21762 -29425 -37161 -40559 -25947 -12736 2305 -14688 -17686 1404 5657 12645
15654 12645 21965 30149 26596 15724 -14344 -9855 -13923 968 16315 24747 33883 56451 50887
15641 50887 35046 20382 18188 39018 65220 40730 24434 19619 12430 -20187 -28780 -30103 -16925
15628 -16925 -18633 -13212 -21387 -30429 -29524 7452 -5804 -14243 -7857 -799 -9178 -30251 -48505 -31918
15614 -31918 -21427 -15016 -10250 -159 -16760 -19482 -23321 -21907 4513 -2547 -9477 7461 8465
15601 8465 25591 28000 19735 -433 -7103 -19840 -30576 -15033 -16777 -10926 1169 1490 -25836
15588 -25836 -39980 -48784 -42238 -46368 -43876 -43516 -55547 -35276 -26434 -35255 -31960 -2276 -1823 6787
$$ packed form
15680e992L955l918J340J276m692j1707o230j1933L2896j628k4466j000J4956
15667a7143j529l090p663p736l398J4612J3211J5041j6993k998J9090M253O988
15654A2645R320Q184l553j0872l0068M489m068J4891J5347Q432R136K2568n564
15641E0887j5841j4664k194K0830K6202k4490j6296m815p189l2617q593j323J3178
15628a6925j708N421q175r042R05L6976j3256q439O386P058q379k1073j8254J6587
15614c1918J0491O411M766J0091j6601k722l839J414K6420p060o930J6938J004
15601H465J7126K409q265k0168o670j2737j0736J5543j744N851J2095L21k7326
15588b5836j4144q804O546m130K492L60j2031K0271Q842q821L295K9684M53Q610
$$ plain form
15574 6787 8853 -9832 -16685 -29137 -21022 -17535 -5714 -24876 -39182 -38458 -49355 -39407 -6688
15561 -6688 5860 15086 7691 -5861 -8412 -8767 -17625 -4018 19800 21836 -8702 -25752 -24785 -23704
15547 -23704 -37653 -45891 -36521 -17532 -25564 -27806 -15947 -6674 -4733 -3713 -3556 -13535 -7920 -6424
15533 -6424 -11887 8236 10784 13146 -2310 4358 -4317 -19119 -19927 -6660 -5759 4100 -11751 -20732
15519 -20732 -22130 -4664 9970 -1699 -16611 17654 46226 51198 47837 21129 -7076 -8705
15507 -8705 -8728 11265 18005 9400 13381 13388 34366 32673 21740 19975 6253 -12931 -21833 -18348 -28996
15492 -28996 -24501 -25198 -30749 -21019 19661 39437 43301 75708 87638 75346 47276 39558 47003
15479 47003 23887 17669 13410 13498 11048 -4812 359 24434 29991 14753 17612 7674 15763 25931
$$ packed form
15574F787K066j8685o853j2452Q115L487J1821j9162j4306P24j0897R948L2719
15561f688J2548R226p395j3552k551l55q858J3607K3818K036l0538j7050R67J081
15547b3704j3949q238R370J8989q032k242J1859R273J941J020J57r979N615J496
15533f424n463K0123K548K362j5456O668q675j4802q08J3267R01R859j5851q981
15519b0732j398J7466J4634j1669j4912L4265K8572M972l361k6708k8205j629
15507h705k3J9993O740q605L981PK0978j693j0933j765j3722j9184q902L485j0648
15492b8996M495o97n551R730M0680J9776L864L2407J1930j2292k8070p718P445
15479D7003k3116o218m259Q8k450j5860N171K4075N557j5238K859r938Q089J0168
$$ plain form
15465 25931 15452 14737 5729 -12577 -21654 -5912 5757 2486 253 -11502 -29455 -36729 -17915
15452 -17915 -6711 13589 5957 7677 15155 28607 9797 -7001 -12213 -29552 -37767 -28846 -3606
15439 -3606 -4222 -17541 -13775 -20195 -17912 -221 13334 17614 -11705 -1557 13083 11634 20122
15426 20122 -1606 -15207 -17296 -15385 -17338 -31145 -40966 -21090 -24582 -5888 14450 10493 13347
15413 13347 15495 14134 -4777 -5632 -6636 -15586 -166 -10744 703 -3615 -25369 -34005 -15472
15400 -15472 -2943 15123 -3845 -35312 -33100 -7188 -16332 -33118 -43013 -28261 -38507 -39128 -14061
15387 -14061 -118 -23314 -56804 -44895 -23330 13838 34998 43978 24960 12304 12436 -26940
15375 -26940 -72399 -80880 -77376 -43970 -5046 -4100 -15347 -18631 -30876 -45897 -28729 -3778 1922
$$ packed form
15465B5931j0479p15r008j8306r077J5742J1669l271k233j1755j7953p274J8814
15452a7915J1204K0300p632J720P478J3452j8810j6798n212j7339q215Q921K5240
15439c606o16j3319L766o420K283J7691J3555M280k9319J0148J4640j449Q488
15426B0122k1728j3601k089J911j953j3807r821J9876l492J8694K0338l957K854
15413A3347K148j361j8911q55j004q950J5420j0578J1447m318k1754q636J8533
15400a5472J2529J8066j8968l1467K212K5912r144j6786r895J4752j0246o21K5067
15387a4061J3943k3196l3490J1909K1565L7168K1160Q980j9018j2656J32l9376
15375b6940m5459q481L504L3406L8924R46j1247l284j2245j5021J7168K4951N700
$$ plain form
15362 1922 -6443 -12828 -22230 -25748 -27010 -8880 3623 -12475 -46055 -68393 -49955 -36307 -30001
15349 -30001 -26023 -6009 -1105 -5324 140 8397 10298 12002 -340 -19369 -26748 -33219 -12288
15336 -12288 -5869 8463 21144 15019 10567 9180 4219 5876 3240 -10474 -33096 -13460 3529
15323 3529 -13505 -27848 -22964 404 11698 -7365 3938 5476 8841 6479 -24225 -10862 2632
15310 2632 17244 17637 7366 7325 6226 7916 -5834 -25258 -14593 -4328 -16460 -3128 -21935
15297 -21935 -36992 -25046 4837 9863 -13350 -3778 -4733 -6460 -6729 -8231 -11996 -850 -9814 -12737
15283 -12737 -28350 -15788 8963 14587 13247 8541 -10765 -4274 3511 -26294 -26653 -26852 -18940 -8770
15269 -8770 -368 -3355 -459 -25982 -24470 -21778 -38925 -48346 -66003 -52662 -45447 -34158 -33901 -19236
$$ packed form
15362A922q365o385r402l518j262J8130J2503j6098l3580k2338J8438J3648O306
15349c0001L978K0014M904m219N464Q257J901J704j2342j9029p379o471K0931
15336a2288O419J4332J2681o125m452j387m961J657k636j3714k2622J9636J6989
15323C529j7034j4343M884K3368J1294j9063J1303J538L365k362l0704J3363J3494
15310B632J4612L93j0271m1j099J690j3750j9424J0665J0265j2132J3332j8807
15297b1935j5057J1946K9883N026k3213R572r55j727k69j502l765J1146q964k923
15283a2737j5613J2562K4751N624j340m706j9306O491P785k9805l59j99P912J0170
15269h770Q402k987K896k5523J512K692j7147r421j7657J3341P215J1289K57J4665
$$ plain form
15255 -19236 -14683 -20946 -31466 -44208 -46662 -62663 -59394 -19917 -16135 -18015 -15762 -22121 -31062
15242 -31062 -33879 -27276 -31092 -25255 380 -7786 -17844 -21175 -8861 14851 34014 6656 -19963
15229 -19963 -15507 -32455 -40971 -19209 2945 5422 -539 25728 27472 14830 -8418 -22861 -17939
15216 -17939 163 14382 17764 20933 19018 -1208 -6023 -10043 -13707 -13525 -26290 -33028 -27026 1395
15202 1395 -2190 -531 8583 19648 15446 -156 -8790 -15410 -23957 -23244 -19373 -8445 -4844 -25164
15188 -25164 -38439 -42147 -46865 -38011 -37851 -20675 -16243 4873 10634 -19570 -22724 -4101 -6230
15175 -6230 -23325 -9552 -14014 -5675 8427 -2933 -16392 -14063 -2671 -2704 -21992 1154 19657
15162 19657 -5704 -24565 -31368 -23012 -42979 -43736 -21743 -38645 -24182 -14657 -2260 752 10528
$$ packed form
15255a9236M553o263j0520j2742k454j6001L269L9477L782j880K253o359q941
15242c1062k817O603l816N837K5635q166j0058l331J2314K3712J9163k7358k6619
15229a9963M456j6948q516K1762K2154K477n961K6267J744j2642k3248j4443M922
15216a7939J8102J4219L382L169j915k0226m815m020l664J82j2765o738O002K8421
15202A395l585J659R114J1065m202j5602q634o620q547P13L871J0928L601k0320
15188b5164j3275l708m718Q854J60J7176M432K1116N761l0204l154J8623k129
15175f230j7095J3773m462Q339J4102j1360j3459K329J1392l3j9288K3146J8503
15162A9657k5361j8861o803Q356j9967p57K1993j6902J4463R525J2397L012R776
$$ plain form
15149 10528 2998 10408 4229 25431 14324 -17931 -8413 1730 28743 34325 24575 3737 12631
15136 12631 375 -3973 830 10661 29116 47837 40466 15326 28095 10556 -9993 -25458
15124 -25458 -14093 1852 1886 18029 3088 -16532 -26297 -35624 -27089 -12211 -15446 -15492 -9265 -4168
15110 -4168 -11198 -3748 -18221 -28133 -13383 2314 15194 14311 -16653 -9220 -6380 30413 8575
15097 8575 -36829 -24878 -11271 -7679 3450 10497 -7013 -29775 -13714 -29463 -51505 -29483
15085 -29483 -33659 -53733 -52203 -23652 -13987 -10462 -21862 -24781 -16593 11388 -11245 -42387 -46488
15072 -46488 -6191 17940 11575 4217 10901 12828 5730 15289 7783 3134 -15103 -11595 -12601 -1347
15058 -1347 22351 35586 30775 10439 -1997 -3294 -12778 -7419 934 6593 17619 15312 14889 15343
$$ packed form
15149A0528p530P410o179K1202j1107l2255R518J0143K7013N582r750k0838Q894
15136A2631j2256m348M803R831J8455J8721p371k5140J2769j7539k0549j5465
15124b5458J1365J5945L4J6143j4941j9620r765r327Q535J4878l235m6O227N097
15110d168p030P450j4473r912J4750J5697J2880q83l0964P433K840L6793k1838
15097H575m5404J1951J3607L592J1129P047j7510k2762J6061j5749k2042K2022
15085b9483m176k0074J530K8551R665L525j1400k919Q188K7981k2633l1142m101
15072d6488M0297K4131o365p358O684J927p098R559p506m649j8237L508j006J1254
15058a347K3698J3235m811k0336j2436j297r484N359Q353N659J1026k307m23M54
$$ plain form
15044 15343 21452 17186 24541 36162 37045 30558 -14392 -27165 -25510 -30513 -11010 15137 14031
15031 14031 19057 272 -34909 -33826 -38579 -39711 -29741 -26894 -33811 -37459 -33880 -33690 -26712 -19651
15017 -19651 -28331 -45617 -54980 -39388 -12569 -16994 -26701 -30507 -21370 -3607 10716 -12790 -13277
15004 -13277 -22616 -33994 -34021 -33467 -46635 -50353 -43416 -25365 -21071 -12169 -12524 -11225 17903 24863
14990 24863 18231 13415 11511 580 -13652 -26877 -26270 113 -28314 -51233 -29882 -13856 -24308
14977 -24308 -30699 -21961 -28619 -23578 -42899 -54469 -30489 -18355 -28446 -4203 -31054 -53374
14965 -53374 -68174 -57341 -16434 -7220 -25928 -35518 -21553 547 -5863 -21015 -15074 -6524 6292
14952 6292 15114 4194 4997 16666 46171 36460 3676 -17142 -14475 81 -3920 5921 935
$$ packed form
15044A5343O109m266P355J1621Q83o487m4950j2773J655n003J9503K6147j106
15031A4031N026j8785l5181J083m753j132R970K847o917l648L579J90O978P061
15017a9651q680j7286r363J5592K6819m425r707l806R137J7763J4323k3506m87
15004a3277r339j1378k7N54j3168l718O937J8051M294Q902l55J299K9128O960
14990B4863o632m816j904j0931j4232j3225O07K6383k8427k2919K1351J6026j0452
14977b4308o391Q738o658N041j9321j1570K3980J2134j0091K4243k6851k2320
14965e3374j4800J0833M0907R214j8708r590J3965K2100o410j5152N941Q550J2816
14952F292Q822j0920Q03J1669K9505r711l2784k0818K667J4556m001R841m986
$$ plain form
14939 935 6494 -4472 -18259 -7416 8939 -8919 -9569 -8397 -5930 502 11118 26427 24738
14926 24738 6437 -30276 -33728 -32366 -48174 -34567 -36269 -27629 -16457 -6184 16973 3133
14914 3133 -20377 -24259 -36875 -37428 -7092 18096 28039 21147 24397 20979 23418 20566 10580 -25
14900 -25 -8328 -1000 -4850 -24091 -29199 -20821 -35133 -66570 -39730 -15295 -15677 -12216 -8411 -5687
14886 -5687 -2017 -25973 -20615 7901 -1735 12358 -15347 -19146 -10659 3342 -460 7828 -209
14873 -209 6755 12415 -9033 -713 11084 594 -6846 -15168 -34475 -46985 -41182 -33309 -1228
14860 -1228 11803 1546 -1372 -2431 -32275 -48742 -10211 -303 -15507 -5493 -10234 -6430 1118
14847 1118 7429 -6170 -2139 19318 16538 21150 15045 -9858 -21264 -4639 11087 10553 22770
$$ packed form
14939I35N559j0966j3787J0843J6355j7858o50J172K467O432J0616J5309j689
14926B4738j8301l6713l452J362j5808J3607j702Q640J1172J0273K3157j3840
14914C133k3510l882j2616n53L0336K5188R943o892L250l418K439k852r986j0605
14900b5q303P328l850j9241n108Q378j4312l1437K6840K4435l82L461L805K724
14886e687L670k3956N358K8516r636J4093k7705l799Q487J4001l802Q288q037
14873b09O964N660k1448Q320J1797j0490p440q322j9307j2510N803P873L2081
14860a228J3031j0257k918j059k9844j6467L8531R908j5204J0014m741L804P548
14847A118O311j3599M031K1457k780M612o105k4903j1406J6625J5726n34J2217
$$ plain form
14834 22770 27628 2674 -21059 -14325 -13680 -16293 -24572 -15534 -7846 -6101 -1411 10023 3426 -4887
14820 -4887 -2362 10958 29301 31282 22133 758 12779 16425 8251 -25238 -7861 -2141 -16541
14807 -16541 -31590 -31234 -23818 -13435 -6556 7821 24191 5874 -421 16247 28131 16831 10597
14794 10597 2736 -8931 -4553 20259 20734 15319 1236 -2709 7034 26305 26096 24980 16993 -1454
14780 -1454 620 13611 22993 26973 17649 20798 23007 -1659 -19674 -18747 -3223 -1585 19862 2024
14766 2024 -25111 -31241 -38087 -19279 -13768 -12374 4204 -7262 -14000 -287 5133 8640 -938
14753 -938 -14279 2292 11874 9251 -3832 -5204 -11315 -125 23760 50119 32714 29245 24031
14740 24031 14075 20750 27137 15367 4276 10522 12867 6116 5185 4670 -2000 -20714 -21260 -21348 -14022
$$ packed form
14834B2770M858k4954k3733O734O45k613q279R038P688J745M690J1434o597q313
14820d887K525J3320J8343J981r149k1375J2021L646q174l3489J7377N720j4400
14807a6541j5049L56P416J0383O879J4377J6370j8317o295J6668J1884j1300o234
14794A0597p861j1667M378K4812M75n415j4083l945R743J9271k09j116p987j8447
14780a454K074J2991R382L980r324L149K209k4666j8015R27J5524J638K1447j7838
14766B024k7135o130o846J8808N511J394J6578j1466o738J3713N420L507r578
14753i38j3341J6571R582k623j3083j372o111J1190K3885K6359j7405l469n214
14740B4031r956O675O387j1770j1091O246K345o751r31n15o670j8714n46q8P326
$$ plain form
14725 -14022 -2782 4526 1237 -19732 -27459 -24627 -26980 -20954 -30182 -17933 -14494 -14659 -20163 -30112
14711 -30112 -49893 -59562 -37544 -35726 -32399 -31163 -19088 -7432 -16618 -16381 -44154 -42759 -39783
14698 -39783 -37348 -24853 -11729 -8227 4347 15797 18979 -4330 -23680 -30957 -32842 -43744 -22467
14685 -22467 -3655 -20901 -2429 29325 28943 41656 35289 21427 20102 3101 281 -13843 3479
14672 3479 13907 9350 1206 5635 -19084 -42375 -35082 -3607 1856 14226 11242 2629 5809
14659 5809 20611 23048 2045 -9566 -15505 -9205 -15276 7361 21191 22765 31632 20327 12803
14646 12803 17508 15617 16769 11805 6373 30675 38153 18414 15432 -2285 -22539 -20378 -6676
14633 -6676 -10186 -4664 -10110 -7593 5978 -12651 -30677 -25215 -12927 -11325 -5615 2559 21544
$$ packed form
14725a4022J1240P308l289k0969p727K832k353O026r228J2249L439j65n504r949
14711c0112j9781r669K2018J818L327J236J2075J1656r186K37k7773J395K976
14698c9783K435J2495J3124L502J2574J1450L182k3309j9350p277j885j0902K1277
14685b2467J8812j7246J8472L1754l82J2713o367j3862j325j7001k820j4124J7322
14672C479J0428m557q144M429k4719k3291P293L1475N463J2370k984q613L180
14659E809J4802K437k1003j1611n939O300o071K2637J3830J574Q867j1305p524
14646A2803M705j891J152m964n432K4302P478j9739k982j7717k0254K161J3702
14633f676l510N522n446K517J3571j8629j8026N462J2288J602N710Q174J8985
$$ plain form
14620 21544 24759 2847 -5274 -27545 -15043 -11525 -29485 -27390 -21581 -17227 -36549 -60439 -67501
14607 -67501 -53791 -69175 -75864 -50174 -34681 -49161 -54210 -53373 -54055 -39334 -35560 -38118 -33140
14594 -33140 -40097 -45043 -26162 -17531 -18084 -15439 -8444 -16718 -21412 -7674 -13713 -4898 816 12575
14580 12575 22957 10213 9137 15743 4754 -7882 11653 29375 21601 14321 -7500 -35976
14568 -35976 -37052 -34706 -47850 -50184 -57669 -45186 -34416 -29174 -18293 -7477 1986 11573 19919
14555 19919 6701 -7301 -12492 -21124 -34207 -36493 -40171 -53790 -34058 -22559 -30745 -34992 -25654
14542 -25654 -26451 -22913 -17433 -16838 -10078 -6617 -366 -10067 -22008 -17700 -27418 -38706 -8989 -33074
14528 -33074 -33425 -8147 -497 1223 10196 9284 16126 -29171 -47284 -43533 -24433 -4734 1618 2251
$$ packed form
14620B1544L215k1912q121k2271J2502L518j7960K095N809M354j9322k3890p062
14607f7501J3710j5384o689K5690J5493j4480n049Q37o82J4721L774k558M978
14594c3140o957m946J8881Q631n53K645O995q274m694J3738o039Q815N714J1759
14580A2575J0382j2744j076O606j0989j2636J9535J7722p774p280k1821k8476
14568c5976j076K346j3144k334p485J2483J0770N242J0881J0816R463R587Q346
14555A9919j3218j4002n191q632j3083k286l678j3619J9732J1499q186m247R338
14542b5654p97L538N480N95O760L461O251r701j1941M308r718j1288K9717k4085
14528c3074l51K5278P650J720Q973r12O842m5297j8113L751J9100J9699O352O33
$$ plain form
14514 2251 -15483 -27435 -27438 -54606 -50218 -43659 -31018 -16010 -13184 -8969 -4766 -4758 -11226 -18700 -10852
14499 -10852 -20074 -1960 8445 -3610 -18363 -19069 -9769 12608 31207 14047 -23348 -37983
14487 -37983 -49539 -56426 -31987 -34866 -19096 -14442 -17186 -16681 -32294 -19683 -7805 11229 10318
14474 10318 20491 20209 130 1703 29601 32104 14479 -5937 -19381 -31941 -38084 -17645 4462
14461 4462 16641 -1525 16423 40393 39463 28409 21599 7193 -4141 -24082 -14864 -12919 2357
14448 2357 -4492 -23143 -21114 -20667 -24187 -12770 8316 4315 1182 -1884 1462 16091 22356 16518
14434 16518 -4352 -22939 -26668 -25671 -20527 -8952 -17424 -16381 11598 28860 16462 10239 -1084
14421 -1084 -27106 -42294 -39311 -28161 -79 4385 -13762 -25492 -8591 -1594 5873 -6362 -23319
$$ packed form
14514B251j7734j1952lk7168M388O559J2641J5008K826M215M203Qo468p474P848
14499a0852r222J8114J0405j2055j4753p06R300K2377J8599j7160l7395j4635
14487c7983j1556o887K4439k879J5770M654k744N05j5613J2611J1878J9034r11
14474A0318J0173k82k0079J573K7898K503j7625k0416j3444j2560o143K0439K2107
14461D462J2179j8166J7948K3970r30j1054o810j4406j1334j9941R218J945J5276
14448B357o849j8651K029M47l520J1417K1086m001l133l066L346J4629O265n838
14434A6518k0870j8587l729R97N144J1575q472J043K7979J7262j2398o223j1323
14421a084k6022j5188K983J1150K8082M464j8147j1730J6901O997P467j2235j6957
$$ plain form
14408 -23319 -23776 -8927 -31870 -33481 -28478 -32827 -21413 -14449 -10362 -1844 -10138 -4841 15961 31126
14394 31126 24702 104 -3635 -2791 1505 6377 9093 2420 -14995 -10391 7790 16394 -4235 -19521
14380 -19521 -30256 -16681 -5536 -5996 -7689 -14973 -13242 -14281 -12685 9198 6536 -8038 6558
14367 6558 -6597 -16618 -6974 -27436 -35219 -32229 -44000 -46472 -52176 -67633 -85535 -73692 -50227
14354 -50227 -34688 -23822 -16652 -20510 -27244 -37856 -43947 -50215 -38259 -27727 -27389 -44550 -64230
14341 -64230 -34423 -28382 -8450 -5763 -15301 -35208 -44194 -54659 -34680 -22486 -24719 -35877 -18841
14328 -18841 -30168 -28374 12698 2974 -3801 4593 3685 8704 8783 7996 17426 -6472 2968 5701 -6881
14313 -6881 8040 18984 768 -5320 -8474 11414 32357 43757 39898 35082 17815 278 6285
$$ packed form
14408b3319m57J4849k2943j611N003m349J1414O964M087Q518q294N297K0802J5165
14394C1126o424k4598l739Q44M296M872K716o673j7415M604J8181Q604k0629j5286
14380a9521j0735J3575J1145m60j693p284J731j039J596K1883k662j4574J4596
14367F558j3155j0021R644k0462p783K990j1771k472n704j5457j7902J1843K3465
14354e0227J5539J0866P170l858o734j0612o091o268J1956J0532L38j7161j9680
14341f4230K9807O041J9932K687r538j9907q986j0465J9979J2194k233j1158J7036
14328a8841j1327J794M1072r724o775Q394r08N019P9p87R430k3898R440K733j2582
14313f881J4921J0944j8216o088l154J9888K0943J1400l859m816j7267j7537O007
$$ plain form
14300 6285 -1708 -17912 -27610 -5286 13704 18297 13737 4075 -9996 -37039 -53169 -66299 -48614
14287 -48614 -41368 -31953 -25920 -40581 -47110 -26197 -16181 -21475 -12823 22500 38360 2069 889
14274 889 -17774 -24765 -28804 -21922 -13352 -21325 -23708 -16575 4207 26506 20009 2790 -828 2850
14260 2850 -3770 20442 29872 12598 -2238 -6572 -11335 213 7431 -5233 23476 46709 28362
14247 28362 6574 -13541 -26121 -4051 18043 23558 3096 -11370 -16441 532 184 10562
14235 10562 -6311 -33317 -32479 -27003 -27897 -18104 -22406 -4594 -501 -3752 -9701 -14406 -23343 -41437
14221 -41437 -1757 23314 27253 14750 7599 1906 9140 -2508 3677 19370 6857 -2035 -19289
14208 -19289 2503 4888 -12644 -14164 -17856 -3219 2643 -12984 -23266 -3932 2675 11861 5358
$$ packed form
14300F285p993j6204r698K2324J8990M593m560r662j4071k7043j6130j3130J7685
14287d8614P246R415O033j4661o529K0913J0016n294Q652L5323J5860l6291j180
14274H89j8663o991m039O882Q570p973k383P133K0782K2299o497j7219l618L678
14260B850o620K4212R430j7274j4836m334m763J1548P218j2664K8709K3233j8347
14247B8362k1788k0115j2580K2070K2094N515k0462j4466n071J6973l48J0378
14235A0562j6873k7006Q38N476q94R793m302J7812M093l251n949m705q937j8094
14221d1437L9680K5071L939j2503p151n693P234j1648O185J5693j2513q892j7254
14208a9289K1792K385j7532j520l692J4637N862j5627j0282J9334O607R186o503
$$ plain form
14195 5358 -7680 -10504 -32680 -45236 -75688 -68446 -25560 -18978 -23700 1020 1018 -25124 -26926 -12484
14181 -12484 -4275 -4554 435 -5642 -4776 16368 10964 6812 -16190 -42916 -33584 -25371 -4810 30
14167 30 -4211 12976 -42 -12248 -25047 -25876 -13994 926 1500 1146 -4732 -4719 9772 8268 -2881
14152 -2881 -3914 -742 -13466 -38760 -18197 -1710 4075 -11701 -34840 -54374 -55758 -28419 -11026
14139 -11026 -23108 -14895 -17865 -13906 -4702 -7900 -17163 -26934 -46242 -20045 -41189 -60831 -51894
14126 -51894 -57672 -35281 -20565 -32665 -36891 -31715 -27974 -42080 -40694 -36997 -1324 -7555 -39777
14113 -39777 -31345 -11607 9927 15432 -9033 -12630 -15740 -11304 -10655 -28909 -50450 -52693 -32166
14100 -32166 -14796 -29702 -29422 -3521 11123 7943 5894 6456 20304 -4877 -35037 -54962 -25463
$$ packed form
14195E358j3038k824k2176j2556l0452P242M2886O582m722K4720kk6142j802J4442
14181a2484Q209k79M989o077Q66K1144n404m152k3002k6726R332Q213K0561M840
14167C0m241J7187j3018j2206j2799q29J1882J4920N74l54n878J3J4491j504j1149
14152b881j033L172j2724k5294K0563J6487N785j5776k3139j9534j384K7339J7393
14139a1026j2082Q213k970L959R204l198r263r771j9308K6197k1144j9642Q937
14126e1894n778K2391J4716j2100m226N176L741j4106J386L697L5673o231l2222
14113c9777Q432J9738K1534N505k4465l597l110M436O49j8254k1541k243K0527
14100c2166J7370j4906K80K5901J4644l180k049N62J3848k5181l0160j9925K9499
$$ plain form
14087 -25463 -5462 -5786 -824 11583 4560 10541 -3418 1029 -14969 -17383 -16357 -2582 1427
14074 1427 -8013 -6681 -5141 -6076 -7505 -33992 -28478 -28603 -37230 -47898 -38798 -35656 -38944 -34882 -39728
14059 -39728 -32414 -52474 -29572 -18422 -13762 -587 -12419 -23075 -19797 -9804 -17613 -35657 -19986
14046 -19986 -4158 -5985 -16343 -14171 3805 1421 -20312 -30875 -38741 -39744 -44435 -38790 1917
14033 1917 16999 5111 1339 24731 33484 21204 -3224 -12985 -4732 -13911 -21430 -28340 -22216
14020 -22216 -26196 -23858 -14949 -21355 -4317 -994 2006 15555 -1798 -27864 -30707 -30205 -33683 -44941
14006 -44941 -26369 949 11244 -1831 -25735 -22264 -24475 -38969 -48953 -53541 -52275 -17519 21693
13993 21693 18004 9872 -10444 -19852 -6835 -10469 -40697 -47497 -16626 9187 -13948 -28598 -35342
$$ packed form
14087b5463K0001l24M962J2407p023N981j3959M447j5998k414J026J3775M009
14074A427r440J332J540r35j429k6487N514j25q627j0668R100L142l288M062m846
14059c9728P314k0060K2902J1150M660J3175j1832j0656L278R993p809j8044J5671
14046a9986J5828j827j0358K172J7976k384k1733j0563p866j003m691N645M0707
14033A917J5082j1888l772K3392Q753j2280k4428r761Q253r179p519o910O124
14020b2216l980K338Q909o406J7038L323L000J3549j7353k6066k843N02l478j1258
14006d4941J8572K7318J0295j3075k3904L471k211j4494r984m588J266L4756L9212
13993B1693l689q132k0316r408J3017l634l0228o800L0871K5813k3135j4650o744
$$ plain form
13980 -35342 -47872 -38251 -36801 -7319 11944 7158 -13950 1190 8376 3184 31008 29542 13471
13967 13471 13790 4840 -2194 6137 10636 11034 -3571 -9395 -2058 -22061 -6000 4020 3931 -8605
13953 -8605 -12517 -9576 1085 -2546 -6905 -6025 -10939 -21402 -31629 -14325 -10159 -14187 -9264 -22210
13939 -22210 -30727 -31103 -30449 3186 19001 -8590 -44836 -57987 -35572 -37228 -20834 -349 8769
13926 8769 19920 4870 -8884 -11334 -7649 -23905 -39736 -39478 -27609 -18632 3249 13801 1201
13913 1201 -6430 -14963 -27203 -34574 -31545 -29495 -25745 -18771 2259 -15362 -43412 -49469 -24916
13900 -24916 -28396 -18217 2451 1882 -10929 11942 -8256 -13325 8215 11217 -5180 -10578 1625
13887 1625 16852 17295 -4143 -10557 -1690 -13321 -5889 6502 8081 -5162 -31825 -27374 1386
$$ packed form
13980c5342j2530R621J450K9482J9263m786k1108J5140P186n192K7824j466j6071
13967A3471L19q950p034Q331M499L98j4605n824P337k0003J6061J0020q9j2536
13953h605l912K941J0661l631m359Q80m914j0463j0227J7304M166m028M923j2946
13939b2210q517l76O54L3635J5815k7591l6246j3151K2415j656J6394K0485R118
13926H769J1151j5050j3754k450L685j6256j5831K58J1869Q977K1881J0552j2600
13913A201p631q533j2240p371L029K050L750O974K1030j7621k8050o057K4553
13900b4916l480J0179K0668n69j2811K2871k0198n069K1540L002j6397n398J2203
13887A625J5227M43k1438o414Q867j1631P432J2391J579j3243k6663M451K8760
$$ plain form
13874 1386 -1781 -8892 1838 9942 16478 7431 5016 -3094 -11172 -18778 -18941 4868 283 -3176
13860 -3176 2456 6865 -2583 -12481 -25634 -22489 -19750 -4925 -846 593 8520 -1251 -3303 16250
13846 16250 27971 33877 30264 49536 45958 30841 10266 7554 16899 37485 40906 14769 -1384
13833 -1384 -14761 694 535 -31629 -43512 -54316 -51422 -35351 -28762 -29861 -25454 -39616 -42023
13820 -42023 -36800 -10082 -6556 3109 3284 -6740 -5459 -7729 -1360 -9854 14001 25335 7074
13807 7074 8875 4059 -1660 -16774 -33381 -38026 -39714 -26240 -29302 -35102 -31619 -47008 -30705
13794 -30705 -31274 -30576 -21092 -5726 -10994 -18891 -21352 -14990 3104 1682 2631 -332 1077 7824 -3636
13779 -3636 -1130 -5488 -13153 -8757 -304 3600 17588 10837 8659 -20391 -13764 -12726 -27822 -45401
$$ packed form
13874A386l167p111J0730Q104O536r047k415q110q078p606j63K3809m585l459
13860c176N632M409r448r898j3153L145K739J4825M079J439P927r771k052J9553
13846A6250J1721N906l613J9272l578j5117k0575k712R345K0586L421k6137j6153
13833a384j3377J5455j59l2164j1883j0804K894J6071O589j099M407j4162k407
13820d2023N223K6718L526R665J75j0024J281k270O369q494K3855J1334j8261
13807G074J801m816n719j5114j6607m645j688J3474l062n800L483j5389J6303
13794c0705n69O98R484J5366n268p897k461O362J8094j422R49k963J409O747j1460
13779c636K506m358p665M396Q453L904J3988o751k178k9050O627J038j5096j7579
$$ plain form
13765 -45401 -43331 -41508 -51033 -48935 -42831 -34211 -8436 -7601 -16364 -32724 -55197 -44249 -25503
13752 -25503 1897 -1089 -26414 -9144 19515 -1039 -6941 -3526 1492 8952 14440 -14705 -18280
13739 -18280 -9048 -2849 4936 -13763 -44671 -57568 -49786 -55458 -42442 -28664 -44475 -35809 -19409
13726 -19409 -13084 -9343 -14849 -56739 -49224 -22528 -14404 -5163 -848 -6460 -44492 -50462 -39726
13713 -39726 -27618 -10307 -4327 -32437 -25538 -17679 -26869 -28302 -23917 -42501 -29484 -24747 -25507
13700 -25507 -16954 -21839 -9691 -28011 -32446 -14645 -17763 -9798 10840 12465 17532 7252 3678
13687 3678 -19198 -26085 -26603 -19101 -12636 -19528 -25650 -33163 -43771 -40706 -41383 -20850 -16487 -6390
13673 -6390 -17642 -36787 -44767 -31464 -61923 -70444 -42711 -31630 -36397 -11346 5681 -18113
$$ packed form
13765d5401K070J823r525K098O104Q620K5775Q35q763j6360k2473J0948J8746
13752b5503K7400k986k5325J7270K8659k0554n902L415N018P460N488k9145l575
13739a8280R232O199P785j8699l0908j2897P782n672J3016J3778j5811Q666J6400
13726a9409O325L741n506m1890P515K6696Q124R241M315n612l8032n970J0736
13713c9726J2108J7311N980k8110O899P859r190j433M385j8584J3017M737p60
13700b5507Q553m885J2148j8320m435J7801l118P965K0638J625N067j0280l574
13687C678k2876o887n18P502O465o892o122p513j0608L065o77K0533M363J0097
13673f390j1252j9145p980J3303l0459q521K7733J1081m767K5051J7027k3794
$$ plain form
13661 -18113 -14855 1778 12900 22199 17019 13051 -18277 -32456 -2059 1702 733 19453 4445
13648 4445 -4110 -4576 -7733 -4802 15479 12046 -8963 -4979 -770 1090 -9125 -8603 3247 -17336
13634 -17336 -28303 -26750 -29337 -17036 -21658 -8581 -16 -1941 -11201 5154 558 -3821 -35698
13621 -35698 -15215 -8506 -865 9984 7434 14353 -13273 -11959 -2449 -7489 -11171 -9022 -9597 -20233
13607 -20233 -25259 -38130 -29957 -15256 -13602 -11142 -15118 -25903 -38764 -38800 -14575 -6790 -21398
13594 -21398 -42716 -31643 -23984 -23817 -25103 -41502 -54431 -48375 -20425 -3087 -16532 -22099 -9921
13581 -9921 -9234 -6510 -15392 -49495 -55160 -18890 5031 -5546 19281 41323 12984 20422 33841
13568 33841 39456 60385 76026 59876 78948 70328 59759 48025 42554 48338 22092 -9594
$$ packed form
13661a8113L258J6633J1122R299n180l968l1328j4179L0397L761r69J8720j5008
13648D445q555m66l157K931K0281l433k1009L984M209J860j0215N22J1850k0583
13634a7336j0967J553k587J2301m622J3077Q565j925r260J6355m596m379l1877
13621c5698K0483O709P641J0849k550O919k7626J314R510n040l682K149n75j0636
13607b0233n026j2871Q173J4701J654K460l976j0785j2861l6K4225P785j4608
13594b1398k1318J1073P659J67j286j6399j2929O056K7950J7338j3445n567J2178
13581i921O87K724q882l4103n665L6270K3921j0577K4827K2042k8339P438J3419
13568C3841N615K0929J5641j6150J9072q620j0569j1734n471N784k6246l1686
$$ plain form
13556 -9594 21267 16234 15051 25394 32078 37251 45876 36468 44664 44091 25746 29910 50518 65397
13542 65397 44501 33641 25687 15065 28144 59550 91314 127514 158712 150150 169133 174142
13530 174142 204879 238516 238897 179864 112001 85009 76744 52108 42426 44150 30369 23563 30698
13517 30698 8954 1844 23365 38767 57550 65232 49503 51217 57852 55859 49567 37698 26050
13504 26050 59606 104978 106262 83319 84883 81598 104244 110703 111027 88635 76553 54272 57778
13491 57778 46627 30457 6695 1650 -5115 -476 41672 56489 50615 43644 16410 21789 23210
13478 23210 -3256 -3503 8163 26 6464 17550 -4764 -33188 -34443 -29546 -2854 20303 35520
13465 35520 35490 38377 47809 40560 33505 25429 33924 47517 31462 7139 1386 20127 45291 35335
$$ packed form
13556i594L0861n033j183J0343O684N173Q625r408Q196n73j8345M164K0608J4879
13542F5397k0896j0860p954j0622J3079L1406L1764L6200L1198q562J8983N009
13530A74142L0737L3637L81n9033o7863k6992q265k4636r682J724j3781o806P135
13517C0698k1744p110K1521J5402J8783P682j5729J714O635j993o292j1869j1648
13504B6050L3556M5372J284k2943J564l285K2646O459L24k2392j2082k2281L506
13491E7778j1151j6170k3762n045o765M639M2148J4817n874o971k7234N379J421
13478B3210k6466k47J1666q137O438J1086k2314k8424j255M897K6692K3157J5217
13465C5520l0K887R432p249p055q076Q495J3593j6055k4323n753J8741K5164r956
$$ plain form
13451 35335 24540 27775 28226 15911 23516 39603 39880 23248 17889 29852 34188 40988 26574
13438 26574 24576 296 20809 30898 1559 -16473 -27545 284 32285 25198 14582 24858
13426 24858 20983 19147 7837 8743 21849 11727 -4129 -3227 -14602 -45814 -52218 -49698 -40956
13413 -40956 -49048 -38039 -21481 -9589 22523 20260 4592 9416 1702 4047 18588 21850 5685
13400 5685 -24467 -15362 -6175 -35395 -42890 -16798 -1348 14609 5604 9112 12668 740 11606
13387 11606 16929 10653 12942 6977 12051 -11740 -20897 -12197 -16005 -21515 -35864 -9350 2105
13374 2105 11819 16601 13350 -7758 -16013 -7712 -14939 -27047 -37969 -10432 1351 -1284 -7693
13361 -7693 8356 -12207 -9311 21369 36227 32829 26189 7730 -4742 -8137 -21617 -12745 -949
$$ packed form
13451C5335j0795L235M51j2315P605J6087K77j6632n359J1963M336O800j4414
13438B6574j998k4280K0513J0089k9339j8032j1072K7829L2001p087j0616J0276
13426B4858l875j836j1310R06J3106j0122j5856R02j1375l1212o404K520Q742
13413d0956q092J1009J6558J1892L2112k263j5668M824p714K345J4541L262j6165
13400E685l0152R105R187k9220p495K6092J5450J5957r005L508L556j1928J0866
13387A1606N323o276K289n965N074k3791r157Q700l808n510j4349K6514J1455
13374B105R714M782l251k1108q255Q301p227j2108j0922K7537J1783k635o409
13361g693J6049k0563K896L0680J4858l398o640j8459j2472l395j3480Q872J1796
$$ plain form
13348 -949 10081 15239 10403 23506 22498 10765 22007 24920 48616 44324 37659 22777 3056
13335 3056 6458 -5298 -14461 -1302 20131 34388 26498 17912 6537 6139 -8405 -17483 -3799
13322 -3799 7243 8110 5459 33416 52805 33429 34622 20732 -1548 2415 -5206 3642 22966
13309 22966 27478 -3164 -5285 18424 48847 44259 18966 16140 9680 18737 34248 35552 20700
13296 20700 1499 -3757 -7023 13793 6518 15430 10663 23783 42299 20043 5167 -613 13525
13283 13525 36278 18423 26607 40976 36720 18468 12874 9806 9535 -4352 -697 -4344 1215
13270 1215 9770 16501 33414 36349 41791 40457 35425 48991 35175 32324 27867 32563 27244 19296
13256 19296 19621 20804 -6667 -20979 -37448 -20590 7634 5701 13774 24522 41773 31692 34253
$$ packed form
13348i49J1030N158m836J3103j008j1733J1242K913K3696m292o665j4882j9721
13335C056L402j1756r163J3159K1433J4257p890q586j1375l98j4544r078J3684
13322c799J1042Q67k651K7957J9389j9376J193j3890k2280L963p621Q848J9324
13309B2966M512l0642k121K3709L0423m588k5293k826o460R057J5511J304j4852
13296B0700j9201n256l266K0816p275Q912m767J3120J8516k2256j4876n780J4138
13283A3525K2753j7855Q184J4369m256j8252n594l068k71j3887L655l647N559
13270A215Q555O731J6913K935N442j334n032J3566j3816k851m457M696n319p948
13256A9296L25J183k7471j4312j6469J6858K8224j933Q073J0748J7251j0081K561
$$ plain form
13243 34253 42601 45516 46051 68273 77965 84148 75396 49947 45696 34607 20111 10265 11009 11792
13229 11792 23073 4397 3559 20414 15363 -12482 -23134 -17575 -2115 881 3700 38106 52251
13216 52251 54160 37851 23040 14239 15290 17707 15445 3829 -9360 -21582 -29068 -19401 1863
13203 1863 27917 38704 49407 31269 41424 34708 14081 19833 32116 32461 21069 30028 31935
13190 31935 19478 5564 1503 36489 50524 27834 15029 20350 22532 35946 44248 17172
13178 17172 2581 5191 21359 12953 1970 -10389 -15337 -2576 16771 16721 8787 14067 10310
13165 10310 13258 41011 30749 41275 65787 51826 20593 32775 44840 55327 66901 46121
13153 46121 2918 -8192 20222 42950 35959 24813 26813 30054 40669 30779 17860 21801 18654
$$ packed form
13243C4253Q348K915N35K2222R692O183q752k5449m251j1089j4496r846P44P83
13229A1792J1281j8676q38J6855n051k7845j0652N559J5460K996K819L4406J4145
13216E2251J909j6309j4811q801J051K417k262j1616j3189j2222p486R667K1264
13203A863K6054J0787J0703j8138J0155o716k0627N752J2283L45j1392Q959J907
13190C1935j2457j3914m061L4986J4035k2690j2805N321K182J3414Q302k7076
13178A7172j4591K610J6168q406j0983j2359m948J2761J9347n0p934N280l757
13165A0310K948K7753j0262J0526K4512j3961l1233J2182J2065J0487J1574k0780
13153D6121m3203j1110K8414K2728o991j1146K000L241J0615r890j2919L941l147
$$ plain form
13140 18654 21937 19965 31451 16544 5064 -2255 -18950 -968 11040 23471 29307 58740
13128 58740 66978 56727 67308 70862 100574 136823 140649 148517 164126 205931 241283 300892
13116 300892 355943 441304 567830 728545 895334 996399 1085505 1198215 1284434 1332871
13106 1332871 1334892 1252771 1128768 935408 759802 617264 524190 458507 399259 346053 308362
13095 308362 265834 262627 255217 245453 239567 213117 197300 174179 160571 148087 151389 140592
13083 140592 135802 146844 138841 124777 115014 109583 111469 114144 128045 143584 130348 142780 156012
13070 156012 159742 178710 183693 191174 209165 237825 262884 299577 352949 434318 543468 665617
13058 665617 837206 1004953 1149386 1242453 1307644 1406392 1438607 1419058 1285565 1071340
$$ packed form
13140A8654L283j972J1486j4907j1480p319j6695J7982J2008J2431N836K9433
13128E8740Q238j0251J0581L554K9712L6249L826P868J5609M1805L5352N9609
13116C00892N5051Q5361J26526J60715J66789J01065Q9106J12710Q6219M8437
13106A332871K021q2121j24003j93360j75606j42538r3074o5683n9248n3206l7691
13095C08362m2528l207p410r764n886k6450j5817k3121j3608j2484L302j0797
13083A40592m790J1042q003j4064r763n431J886K675J3901J5539j3236J2432J3232
13070A56012L730J8968M983P481J7991K8660K5059L6693N3372Q1369J09150J22149
13058F65617J71589J67747J44433R3067O5191R8748L2215j9549j33493k14225
$$ plain form
13048 1071340 865389 693463 579504 513253 462255 421864 381061 342885 297985 286662 260494
13037 260494 238123 213319 182496 156084 144788 146870 145915 138968 137280 122951 139606 151395
13025 151395 150769 117553 119089 112735 120026 115884 117483 145056 123384 118858 110186 95588 85637
13012 85637 96189 117965 112776 91298 92476 120493 115184 87133 87276 96668 94638 98213 96829
12999 96829 90268 94553 90646 97248 89416 85982 102595 105677 120355 140643 143292 130290 111960
12986 111960 93490 74408 72745 85527 77604 75337 83632 84656 94584 100217 116134 104644 98953
12973 98953 114815 139123 136407 90701 66145 79238 93579 86218 74955 85598 101014 107805
12961 107805 96150 102511 118048 105607 91061 76315 80645 86584 93505 51170 33801 52196
$$ packed form
13048A071340k05951j71926j13959o6251n0998m0391m0803l8176m4900j1323k6168
13037B60494k2371k4804l0823k6412j1296K082r55o947j688j4329J6655J1789
13025A51395o26l3216J536o354P291m142J599K7573k1672m526q672j4598r951
13012H5637J0552K1776n189k1478J178K8017n309k8051J43R392k030L575j384
12999I6829o561M285l907O602p832l434J6613L082J4678K0288K649j3002j8330
12986A11960j8470j9082j663J2782p923k267Q295J024R928N633J5917j1490n691
12973I8953J5862K4308k716m5706k4556J3093J4341p361j1263J0643J5416O791
12961A07805j1655O361J5537j2441j4546j4746M330N939O921m2335j7369J8395
$$ plain form
12949 52196 45643 43736 37609 39319 30587 19389 25488 43023 60212 68834 76467 83957 84505 92226
12935 92226 103739 96080 85970 88061 95808 86552 67130 61221 68782 80155 109840 145528 147023
12922 147023 148614 157548 141006 149817 152044 179730 208665 238415 243790 255723 252754 235158 244964
12909 244964 282622 295820 292560 276339 257879 230591 209926 185204 190087 197741 173857 170423
12897 170423 180576 173806 173445 194347 194957 195152 188429 165628 161100 181417 169337 158901 167225
12884 167225 176108 159975 135934 159484 187246 190082 180836 167812 169951 160077 140666 124115
12872 124115 127878 148205 157245 141714 151273 168334 177529 178589 177715 199483 209324 215448 218064
12859 218064 237835 251913 267368 261766 282877 308075 295079 277052 266911 244809 212538 195117
$$ packed form
12949E2196o553j907o127J710q732j1198O099J7535J7189Q622P633P490N48P721
12935I2226J1513p659j0110K091P747r256j9422n909P561J1373K9685L5688J495
12922A47023J591Q934j6542Q811K227K7686K8935K9750N375J1933k969j7596R806
12909B44964L7658J3198l260j6221j8460k7288k0665k4722M883P654k3884l434
12897A70423J0153o770l61K0902O10J95o723k2801m528K0317j2080j0436Q324
12884A67225Q883j6133k4041K3550K7762K836r246j3024K139r874j9411j6551
12872A24115L763K0327R040j5531R559J7061R195J060q74K1768R841O124K616
12859B18064J9771J4078J5455n602K1111K5198j2996j8027j0141k2102l2271j7421
$$ plain form
12847 195117 180434 160405 143058 152245 156926 186891 207886 226290 241385 249986 255367 246717
12835 246717 232461 239740 214342 210179 213466 184639 166319 165364 185349 207440 183644 169645
12823 169645 189311 219230 221438 199083 193666 200767 241273 236330 214770 230417 255737 256608 240280
12810 240280 224702 213499 214610 199304 198343 210552 234861 254981 276043 269659 257404 272269
12798 272269 301920 323515 319870 320623 349062 359721 375209 393717 392456 413006 460770 519018
12786 519018 550862 555024 573273 608470 619783 598072 565815 561646 564683 539979 493488 443681
12774 443681 433442 404432 390970 403002 418525 433247 461616 464242 475717 477842 506850 532927
12762 532927 560876 567122 599089 640746 674300 676463 671484 652826 655923 694803 731645 734601
$$ packed form
12847A95117j4683k0029j7347R187M681K9965K0995J8404J5095Q601N381q650
12835B46717j4256P279k5398m163L287k8827j8320r55J9985K2091k3796j3999
12823A69645J9666K9919K208k2355n417P101M0506m943k1560J5647K5320Q71j6328
12810B40280j5578j1203J111j5306r61J2209K4309K0120K1062o384j2255J4865
12798B72269K9651K1595l645P53K8439J0659J5488J8508j261K0550M7764N8248
12786E19018L1844M162J8249L5197J1313k1711l2257m169L037k4704m6491m9807
12774D43681j0239k9010j3462J2032J5523J4722K8369K626J1475K125K9008K6077
12762E32927K7949O246L1967M1657L3554K163m979j8658L097L8880L6842K956
$$ plain form
12750 734601 734376 715273 708440 738544 737131 746479 755452 797899 818713 826517 827951 859955 898292
12737 898292 930172 966550 1028037 1057057 1084117 1104786 1119853 1150425 1207074 1217702 1211924 1185723
12725 1185723 1171503 1135363 1102647 1069143 1053962 1068078 1115381 1131191 1099296 1087639 1109126
12714 1109126 1159143 1213002 1280129 1334392 1396306 1453167 1513031 1561435 1636000 1711243 1761063
12703 1761063 1830477 1914392 1980747 2026848 2092783 2182930 2293354 2411859 2535947 2643470
12693 2643470 2762249 2877411 3024403 3186373 3355312 3546030 3745804 3922498 4147362
12684 4147362 4398685 4670190 4966620 5283370 5613544 6007736 6488391 7032726 7652290
12675 7652290 8404695 9279471 10308922 11574044 13013115 14685239 16637570 18891926
$$ packed form
12750G34601k25j9103o833L0104j413R348Q973M2447K0814P804J434L2004L8337
12737H98292L1880L6378O1487K9020K7060K0669J5067L0572N6649J0628n778k6201
12725A185723j4220l6140l2716l3504j5181J4116M7303J5810l1895j1657K1487
12714A109126N0017N3859O7127N4263O1914N6861N9864M8404P4565P5243M9820
12703A761063O9414Q3915O6355M6101O5935R0147J10424J18505J24088J07523
12693B643470J18779J15162J46992J61970J68939J90718J99774J76694K24864
12684D147362K51323K71505K96430L16750L30174L94192M80655N44335O19564
12675G652290P52405Q74776J029451J265122J439071J672124J952331K254356
$$ plain form
12667 18891926 21599287 24999190 29312460 34804299 41969432 51561484 64852840 83595264
12659 83595264 109317219 141295172 174185546 201893009 222808495 239934524 255670319
12652 255670319 266110132 263093195 241939366 206936064 167966338 134268031 108492451
12645 108492451 89386140 75169358 64493401 56395044 50231284 45481160 41768952
12638 41768952 38843422 36422056 34398121 32640212 31058952 29602798 28278894 27080811
12630 27080811 26039464 25149472 24377076 23718925 23133020 22667808 22302417 22007524 21838989
12621 21838989 21871523 22130552 22658619 23461488 24516439 25801777 27374072 29413562 32094473
12612 32094473 35582378 40128436 46121966 54404896 66401253 84245061 110607733 146756121
$$ packed form
12667A8891926K707361L399903M313270N491839P165133R592052J3291356J8742424
12659H3595264K5721955L1977953L2890374K7707463K0915486J7126029J5735795
12652B55670319J0439813l016937k1153829l5003302l8969726l3698307k5775580
12645A08492451j9106311j4216782j0675957q098357o163760m750124l712208
12638D1768952k925530k421366k023935j757909j581260j456154j323904j198083
12630B7080811j041347q89992p72396o58151n85905m65212l65391k94893j68535
12621B1838989L2534K59029N28067Q02869J054951J285338J572295K039490K680911
12612C2094473L487905M546058N993530Q282930J1996357J7843808K6362672L6148388
$$ plain form
12604 146756121 186851850 218249279 237494929 254204757 273761831 290322280 291825408
12597 291825408 267935242 223218029 175894309 138129585 110892397 91341753 77030802
12590 77030802 66339210 58224716 52025025 47259837 43556615 40597352 38132808 35996854
12582 35996854 34078978 32300919 30619707 28982690 27452611 26091936 24902015 23826496
12574 23826496 22798059 21815066 20882556 19965047 19106589 18276551 17500242 16782756 16135222
12565 16135222 15537683 15000780 14513584 14091159 13733385 13354085 12961967 12603651 12273809
12556 12273809 11959838 11648440 11366196 11087250 10831309 10585319 10324205 10032516 9733316
12547 9733316 9423894 9143963 8899977 8650607 8412179 8210896 7987918 7776361 7590845
$$ packed form
12604A46756121M0095729L1397429J9245650J6709828J9557074J6560449J503128
12597B91825408k3890166m4717213m7323720l7764724k7237188j9550644j4310951
12590G7030802j0691592q114494o199691m765188l703222k959263k464544k135954
12582C5996854j917876j778059j681212j637017j530079j360675j189921j075519
12574B3826496j028437r82993r32510r17509q58458q30038p76309p17486o47534
12565A6135222n97539n36903m87196m22425l57774l79300l92118l58316l29842
12556A2273809l13971l11398k82244k78946k55941k45990k61114k91689k99200
12547I733316l09422k79931k43986k49370k38428k01283k22978k11557j85516
$$ plain form
12538 7590845 7448551 7299119 7148534 7016956 6878878 6758431 6649495 6568789 6497315 6448803
12528 6448803 6432004 6491334 6600245 6650867 6575723 6491113 6442155 6443697 6405423 6152838 5721330
12517 5721330 5262578 4916339 4658033 4437328 4239071 4053740 3908796 3822934 3723447 3578550
12507 3578550 3481130 3393541 3300759 3207811 3123819 3054608 2999294 2955720 2897652 2819869 2725337
12496 2725337 2650592 2593654 2528913 2455674 2391699 2351782 2312380 2262026 2217071 2199669 2184127
12485 2184127 2151787 2128311 2116394 2094139 2053592 2015369 2014988 2019511 2044575 2050640 2031479 2033901
12473 2033901 2009440 1947978 1891829 1842481 1787712 1713340 1676361 1646265 1622787 1567192 1488519
12462 1488519 1435147 1402545 1386251 1343919 1272915 1239617 1211304 1183483 1144257 1107329 1066947
$$ packed form
12538G590845j42294j49432j50585j31578j38078j20447j08936q0706p1474m8512
12528F448803j6799N9330J08911N0622p5144q4610m8958J542l8274k52585m31508
12517E721330m58752l46239k58306k20705j98257j85331j44944q5862r9487j44897
12507C578550r7420q7589r2782r2948q3992o9211n5314m3574n8068p7783r4532
12496B725337p4745n6938o4741p3239o3975l9917l9402n0354m4955j7402j5542
12485B184127l2340k3476j1917k2255m0547l8223l81M523K5064O065j9161K422
12473B033901k4461o1462n6149m9348n4769p4372l6979l0096k3478n5595p8673
12462A488519n3372l2602j6294m2332p1004l3298k8313k7821l9226l6928m0382
$$ plain form
12451 1066947 1048820 1044005 1020146 1001681 1002659 993620 938880 888106 849620 833778 831760 821279
12439 821279 795714 767741 771483 773182 778052 774373 762412 760869 738910 731025 714750 699245 690281
12426 690281 697175 678554 665412 677190 695415 701028 700104 699687 690852 670868 638187 638473 645287
12413 645287 679456 681651 682373 706372 692720 692676 697863 670532 628861 632201 631792 608056 587587
12400 587587 576920 593948 595712 603296 642126 634376 585114 558691 565804 565798 572708 567776 551968
12387 551968 525282 493286 479243 490258 503942 482533 445576 430554 431187 436429 446583 419995
12375 419995 402202 402620 417338 441282 434780 438975 413250 388182 399503 408238 371515 334906
12363 334906 344803 341337 335448 345733 353247 337328 337166 344819 346770 337176 346532 350333 351003 346094
$$ packed form
12451A066947j8127m815k3859j8465R78r039n4740n0774l8486j5842k018j0481
12439H21279k5565k7973L742J699M870l679j1961j543k1959p885j6275j5505q964
12426F90281O894j8621j3142J1778J8225N613r24m17q835j9984l2681K86O814
12413F45287L4169K195P22K3999j3652m4N187k7331m1671L340m09k3736k0469
12400E87587j0667J7028J764P584L8830p750m9262k6423P113oO910m932j5808
12387E51968k6686l1996j4043J1015J3684k1409l6957j5022O33N242J0154k6588
12375D19995j7793M18J4718K3944o502M195k5725k5068J1321Q735l6723l6609
12363C34906R897l466n889J0285P514j5919j62P653J951r594R356L801O70m909
$$ plain form
12349 346094 321649 311442 309668 291522 311403 336721 340569 319420 291780 276793 253620 229060
12337 229060 247062 271416 284897 281060 280467 269557 256452 293099 311096 306667 286584 273578
12325 273578 257528 233700 224680 234209 250956 250591 253446 258038 264609 237896 209351 209423 232004
12312 232004 230675 220637 227850 223559 233751 219179 203679 212826 230926 260945 280674 289809
12300 289809 289969 318034 345312 357557 373516 410582 441944 447317 460037 474465 476696 463404
12288 463404 411291 357244 324150 282107 237048 226590 212080 221701 231477 224513 207571 189593
12276 189593 188044 193776 178013 184984 187811 191945 181711 167216 149891 160309 177447 195998
12264 195998 178905 159179 149710 157846 153903 143314 135691 163863 190331 181141 161615 127307
$$ packed form
12349C46094k4445j0207j774j8146J9881K5318L848k1149k7640j4987k3173k4560
12337B29060J8002K4354J3481l837n93j0910j3105L6647J7997m429k0083j3006
12325B73578j6050k3828r020R529J6747l65K855M592O571k6713k8545P2K2581
12312B32004j329j0038P213m291J0192j4572j5500R147J8100L0019J9729R135
12300B89809J60K8065K7278J2245J5959L7066L1362N373J2720J4428K231j3292
12288D63404n2113n4047l3094m2043m5059j0458j4510R621R776o964j6942j7978
12276A89593j549N732j5763O971K827M134j0234j4495j7325J0418J7138J8551
12264A95998j7093j9726r469Q136l943j0589p623K8172K6468r190j9526l4308
$$ plain form
12252 127307 128429 136843 134719 145691 164118 181431 170239 174963 190155 162775 146350 144586
12240 144586 132992 122183 137180 161586 178513 187917 161291 167013 162512 150159 153547 154887
12228 154887 138820 118563 125971 135178 124663 103614 100470 95182 93850 118901 135049 114514
12216 114514 120018 125748 133706 115882 140662 159883 144169 133804 166319 158497 166181 196783
12204 196783 212276 189301 197580 256499 324200 396889 447712 550988 683602 817104 959622
12193 959622 1073799 1169556 1253188 1332365 1379144 1330442 1218470 1086568 936188 777397
12183 777397 648136 563174 531112 490594 462404 432780 389985 364019 359100 382752 397896
12172 397896 377617 348320 339006 337722 324643 304612 293341 292130 282455 280595 276895 277104 277715
$$ packed form
12252A27307J122Q414k124J0972J8427J7313j1192M724J5192k7380j6425j764
12240A44586j1594j0809J4997K4406J6927R404k6626N722m501j2353L388J340
12228A54887j6067k0257P408R207j0515k1049l144n288j332K5051J6148k0535
12216A14514N504N730P958j7824K4780J9221j5714j0365L2515p822P684L0602
12204A96783J5493k2975Q279N8919O7701P2689N0823J03276J32614J33502J42518
12193I59622J14177R5757Q3632P9177M6779m8702j11972j31902j50380j58791
12183G77397j29261q4962l2062m0518k8190k9624m2795k5966m919K3652J5144
12172C97896k0279k9297r314j284j3079k0031j1271j211r675j860l700K09O11
$$ plain form
12159 277715 276648 292487 316111 324468 317727 335048 362557 376994 383134 381633 386953 423162 469648
12146 469648 556547 659489 807340 975677 1124578 1216953 1292106 1369811 1438597 1468120 1399634
12135 1399634 1212051 1009640 843901 716263 598246 505019 448732 408001 363426 361135
12125 361135 384708 390652 378355 358219 365238 376681 379932 362977 329573 330436 328344 351622 372550
12112 372550 369352 350329 333858 358261 375340 354773 315146 266378 261417 240801 234994 232219
12100 232219 228101 230546 229223 221647 228832 222008 212017 225842 234419 238470 220385 194432 195728
12087 195728 204514 209274 192501 186324 213356 254490 289371 298036 312995 329400 319488 319741 304089
12074 304089 275844 264485 261291 280397 299066 314574 324906 299117 295796 322925 333479 349421
$$ packed form
12159B77715j067J5839K3624Q357o741J7321K7509J4437O140j501N320L6209M6486
12146D69648Q6899J02942J47851J68337J48901R2375P5153P7705O8786K9523o8486
12135A399634j87583k02411j65739j27638j18017r3227n6287m0731m4575k291
12125C61135K3573N944j2297k0136P019J1443L251j6955l3404Q63k092K3278K0928
12112C72550l198j9023j6471K4403J7079k0567l9627m8768m961k0616n807k775
12100B32219m118K445j323p576P185o824r991J3825Q577M051j8085k5953J296
12087A95728Q786M760j6773o177K7032M1134L4881Q665J4959J6405r912K53j5652
12074C04089k8245j1359l194J9106J8669J5508J0332k5789l321K7129J0554J5942
$$ plain form
12062 349421 335075 286258 264355 264726 258331 243602 232764 220426 223708 229800 256284 266785
12050 266785 246080 227433 249666 252988 257746 237510 205408 183547 176160 170451 165021 169757 187484
12037 187484 227031 257671 270001 267073 283907 336235 367055 346745 326058 281107 249031 243254
12025 243254 244938 255599 261799 256316 243051 262102 272626 264028 257123 235616 211252 180513
12013 180513 175606 176771 177975 196262 198053 195543 197289 206830 219863 208277 208812 207366 205087 204078
11999 204078 206651 209994 199988 200625 201040 220733 241972 248054 249873 233543 234422 256637 278823
11986 278823 293945 275087 251790 249191 255380 288359 316539 313654 282183 290342 286748 306734
11974 306734 331284 343003 360463 363736 353790 344385 350386 371446 378508 407622 441379 468444
$$ packed form
12062C49421j4346m8817k1903L71o395j4729j0838j2338L282O092K6484J0501
12050B66785k0705j8647K2233L322M758k0236l2102k1861p387n709n430M736J7727
12037A87484L9547L0640J2330k928J6834N2328L0820k0310k0687m4951l2076n777
12025B43254J684J0661O200n483j3265J9051J0524q598o905k1507k4364l0739
12013A80513m907J165J204J8287J791k510J746R541J3033j1586N35j446k279j009
11999B04078K573L343j0006O37M15J9693K1239O082J819j6330Q79K2215K2186
11986B78823J5122j8858k3297k599O189L2979K8180k885l1471Q159l594J9986
11974C06734K4550J1719J7460L273r946r405O001K1060P062K9114L3757K7065
$$ plain form
11962 468444 491988 504682 522048 564751 611376 625638 663099 699969 723955 741128 780726
11951 780726 836896 902346 962494 1023457 1101875 1197422 1286149 1371918 1496180 1633841 1799144
11940 1799144 1957326 2190328 2495446 2830566 3233869 3698548 4259360 4918113 5809331
11931 5809331 6983825 8545902 10643213 13626751 18071511 24846556 35218340 49175772
11923 49175772 61935274 67980045 71562069 78020834 86442275 92576733 90635173 75743575
11915 75743575 56251073 41563194 31897952 25364913 20722568 17345448 14860256 13021678
11907 13021678 11645113 10589526 9759503 9115178 8634998 8246313 7847547 7428423 7010625
11898 7010625 6627018 6287346 5975948 5704827 5456489 5233136 5008048 4786140 4544134
$$ packed form
11962D68444K3544J2694J7366M2703M6625J4262L7461L6870K3986J7173L9598
11951G80726N6170O5450O0148O0963P8418R5547Q8727Q5769J24262J37661J65303
11940A799144J58182K33002L05118L35120M03303M64679N60812O58753Q91218
11931E809331J174494J562077K097311K983538M444760O775045J0371784J3957432
11923D9175772J2759502O044771L582024O458765Q421441O134458j941560j4891598
11915G5743575j9492502j4687879r665242o533039m642345l377120k485192j838578
11907A3021678j376565j055587q30023o44325m80180l88685l98766m19124m17798
11898G010625l83607l39672l11398k71121k48338k23353k25088k21908k42006
$$ plain form
11889 4544134 4312129 4139262 3959828 3775726 3622370 3506481 3406872 3294222 3193848 3080362
11879 3080362 2982354 2924820 2846187 2757523 2665137 2578192 2490809 2434679 2363913 2292841 2239836
11868 2239836 2183108 2126455 2066924 2016203 1957148 1896019 1854509 1801144 1734723 1683023 1645259
11857 1645259 1590302 1550689 1536401 1504718 1476835 1446244 1409644 1374860 1326860 1275912 1238825
11846 1238825 1199383 1158709 1118282 1093615 1052680 1021439 994274 961675 958683 941137 937521 896913
11834 896913 849957 851345 829607 796697 793185 784001 746732 715486 693276 682983 697262 673623
11822 673623 658478 639834 634372 624545 621850 610591 565197 533804 537848 543613 552727 541588 529961
11809 529961 512856 472108 461830 436822 443166 442024 445087 445266 476446 501195 480871 468503
$$ packed form
11889D544134k32005j72867j79434j84102j53356j15889r9609j12650j00374j13486
11879C080362r8008n7534p8633q8664r2386q6945q7383n6130p0766p1072n3005
11868B239836n6728n6653n9531n0721n9055o1129m1510n3365o6421n1700l7764
11857A645259n4957l9613j4288l1683k7883l0591l6600l4784m8000n0948l7087
11846A238825l9442m0674m0427k4667m0935l1241k7165l2599k992j7546l616m0608
11834H96913m6956J388k1738l2910l512r184l7269l1246k2210j0293J4279k3639
11822F73623j5145j8644n462r827k695j1259m5394l1393M044N765R114j1139j1627
11809E29961j7105m0748j0278k5008O344j142L063J79L1180K4749k0324j2368
$$ plain form
11797 468503 465723 475472 501476 509895 517633 501590 470934 443697 426662 409815 384186 358842
11785 358842 335295 309435 288744 284914 272851 268285 255528 249164 248755 231897 229221 256727 256878
11772 256878 253982 233238 222915 233740 208835 185746 186119 174318 187950 182646 170263 167657
11760 167657 180281 198998 214859 213184 172780 147199 126740 107379 108281 122084 140733 132076
11748 132076 119848 120416 111976 128031 117306 113368 102029 103005 128871 134262 139059 132110 134449
11735 134449 158054 166122 153212 143393 139855 144103 147537 158457 171326 185387 172091 141738
11723 141738 133196 147833 140896 143123 136326 126670 111025 106946 102421 111711 121628 111844 98501
11710 98501 101844 120505 130749 136148 118412 96530 101878 116581 147332 160265 144474 125986
$$ packed form
11797D68503k780R749K6004Q419P738j6043l0656k7237j7035j6847k5629k5344
11785C58842k3547k5860k0691l830j2063m566j2757o364m09j6858k676K7506J51
11772B56878k896k0744j0323J0825k4905k3089L73j1801J3632n304j2383k606
11760A67657J2624J8717J5861j675m0404k5581k0459j9361R02J3803J8649q657
11748A32076j2228N68q440J6055j0725l938j1339R76K5866N391M797o949K339
11735A34449K3605Q068j2910r819l538M248L434J0920J2869J4061j3296l0353
11723A41738q542J4637o937K227o797r656j5645m079m525R290R917r784j3343
11710I8501L343J8661J0244N399j7736k1882N348J4703L0751J2933j5791j8488
$$ plain form
11698 125986 117258 110210 94352 80699 73722 82078 100368 92068 75412 82555 85977 85188 94843
11685 94843 116088 117554 111829 96597 88809 92322 86070 98450 93899 87574 87103 94054 92476 117280
11671 117280 118559 95664 78825 69940 65289 71824 61031 77769 86606 78253 87425 86279 79499
11658 79499 71565 47161 58620 85193 87570 68512 61467 70759 83404 76267 48800 54644 52755
11645 52755 71294 90881 84923 74612 69236 61136 65967 75001 87884 90661 110835 89662 99865
11632 99865 99394 90554 96557 109898 128989 132982 102244 70284 63612 61613 59035 60371 71955
11619 71955 61680 40446 42254 43584 38437 12213 7679 22831 17992 19342 47961 66441 53029
11606 53029 12058 6326 13509 23222 19588 18816 8987 16487 14553 23140 42895 54929 83516 69279
$$ packed form
11698A25986q728p048j5858j3653o977Q356J8290q300j6656P143L422p89R655
11685I4843K1245J466n725j5232p788L513o252J2380m551o325m71O951j578K4804
11671A17280J279k2895j6839q885m651O535j0793J6738Q837q353R172j146o780
11658G9499p934k4404J1459K6573K377j9058p045R292J2645p137k7467N844j889
11645E2755J8539J9587n958j0311n376q100M831R034J2883K777K0174k1173J0203
11632I9865m71q840O003J3341J9091L993l0738l1960o672j999k578J336J1584
11619G1955j0275k1234J808J330n147k6224m534J5152m839J350K8619J8480j3412
11606E3029m0971n732P183R713l634p72r829P500j934Q587J9755J2034K8587j4237
$$ plain form
11592 69279 60600 72724 71756 64435 55337 68263 83531 86819 62120 38316 30935 31225 58377
11579 58377 80463 84030 80939 74670 73626 61274 44666 59627 64795 71117 56726 52496 39450
11566 39450 33688 39502 44140 24608 36641 69704 77646 78569 70958 55531 62178 57584 48347 46396
11552 46396 61641 71593 47578 39253 26044 22555 6671 8363 29176 60258 48740 36967
11540 36967 31001 40553 48893 53444 64611 37453 17096 36542 38728 44388 68334 58562 57695
11527 57695 55540 49146 46409 15066 13998 33918 30447 33149 47886 33126 20169 15446 46927
11514 46927 59245 46694 61272 61696 65017 52224 47325 45835 34061 30899 32702 48567 68581
11501 68581 54860 36875 21142 12929 33818 46119 72666 63424 46004 22583 22623 17478 18478
$$ packed form
11592F9279q679J2124r68p321r098J2926J5268L288k4699k3804p381K90K7152
11579E8377K2086L567l091o269j044j2352j6608J4961N168O322j4391m230j3046
11566C9450n762N814M638j9532J2033L3063P942R23p611j5427O647m594r237j951
11552D6396J5245R952k4015q325j3209l489j5884J692K0813L1082j1518j1773
11540C6967n966R552Q340M551J1167k7158k0357J9446K186N660K3946r772q67
11527E7695k155o394k737l1343j068J9920l471K702J4737j4760j2957m723L1481
11514D6927J2318j2551J4578M24L321j2793m899j490j1774l162J803J5865K0014
11501F8581j3721j7985j5733q213K0889J2301K6547r242j7420k3421M0n145J000
$$ plain form
11488 18478 30019 54325 47887 49669 35400 23367 21548 21962 10613 -4611 1198 12093 21768
11475 21768 19415 25640 23464 26123 32722 25738 18318 2045 -886 1110 5377 4081 2800 26631
11461 26631 40428 41876 32318 49165 63220 47044 36574 27937 -1581 -10727 -9407 4283 18692
11448 18692 63609 66399 65999 35980 29927 35211 17835 8327 31123 54648 40783 30932 55034
11435 55034 52987 27245 30493 22479 26197 12391 1900 9387 19499 37559 28359 24333 23333
11422 23333 15941 2893 -18217 -17686 -9294 5571 1698 6550 5491 2161 4858 7179 13476 -3066
11408 -3066 -309 23565 48882 60861 73699 84915 65518 58179 43151 39375 38775 59145 50528
11395 50528 33250 19988 18083 40908 38592 52581 40875 20805 8896 9928 31845 55404
$$ packed form
11488A8478J1541K4306o438J782j4269j2033j819M14j1349j5224N809J0895R675
11475B1768k353O225k176K659O599o984p420j6273k931J996M267j296j281K3831
11461B6631J3797J448r558J6847J4055j6176j0470q637k9518r146J320J3690J4409
11448A8692M4917K790m00l0019o053N284j7376r508K2796K3525j3865r851K4102
11435E5034k047k5742L248q014L718j3806j0491P487J0112J8060r200m026j000
11422B3333p392j3048k1110N31Q392J4865l873M852j059l330K697K321O297j6542
11408c066K757K3874K5317J1979J2838J1216j9397p339j5028l776o00K0370q617
11395E0528j7278j3262j905K2825k316J3989j1706k0070j1909J032K1917K3559
$$ plain form
11383 55404 30892 28709 21794 7508 -5086 -5910 25584 11816 22583 34494 34074 38141 17911
11370 17911 22140 1808 -2271 17734 34868 35835 33043 36493 30417 11724 -11094 -1259 -7270
11357 -7270 -27606 -5393 22035 19566 30169 34182 25612 44305 53953 61778 48587 41087 26899
11344 26899 14144 14620 16167 24476 29595 32939 47494 50584 43031 37853 22118 19174 13860 16802
11330 16802 20816 30405 33020 45484 57456 56446 29409 746 10684 2275 -26005 -12119 -7373
11317 -7373 33520 37320 57401 44451 33702 40942 35307 25004 25073 14515 32394 38208 31042
11304 31042 37010 29099 8203 -8896 -21239 -3344 7623 7673 17891 39197 34140 36128 64809
11291 64809 32987 4270 3222 15570 37232 16884 7467 12225 14971 15980 34118 39542 47855
$$ packed form
11383E5404k4512k183o915j4286j2594q24L1494j3768J0767J1911m20M067k0230
11370A7911M229k0332m079K0005J7134R67k792L450o076j8693k2818R835o011
11357g270k0336K2213K7428k469J0603M013q570J8693R648P825j3191p500j4188
11344B6899j2755M76J547Q309N119L344J4555L090p553n178j5735k944n314K942
11330A6802M014R589K615J2464J1972j010k7037k8663R938q409k8280J3886M746
11317g373M0893L800K0081j2950j0749P240n635j0303O9j0558J7879N814p166
11304C1042N968p911k0896j7099j2343J7895J0967N0J0218K1306n057J988K8681
11291F4809l1822k8717j048J2348K1662k0348r417M758K746J009J8138N424Q313
$$ plain form
11278 47855 62752 81572 76632 66419 73300 79650 85642 76062 61511 36213 13767 36446 64050
11265 64050 73075 43761 -4731 -15459 -1126 12820 19848 -7303 -6796 6093 -13214 -8114 10278
11252 10278 20887 35119 42481 35665 25921 18669 20539 -10522 -21896 -37397 -27021 -32309 -10726
11239 -10726 20105 26377 13420 -13806 16982 38408 44669 52310 51437 18107 1034 -26508 -23938
11226 -23938 -14268 -11191 -11922 -8990 16791 27550 17173 8617 13383 48179 33200 36259 43080
11213 43080 40832 29085 38923 31747 15020 11955 26106 30402 12555 16902 46259 52702 24313
11200 24313 11976 -11837 -23869 -13771 13774 13233 -12880 -27267 1302 16875 25861 39324
11188 39324 45109 25860 23372 26233 13404 21945 23122 8704 12242 35498 33572 11501 22318
$$ packed form
11278D7855J4897J8820m940j0213O881O350N992r580j4551k5298k2446K2679K7604
11265F4050R025k9314m8492j0728J4333J3946P028k7151N07J2889j9307N100J8392
11252A0278J0609J4232P362o816r744p252J870l1061j1374j5501J0376n288K1583
11239a0726L0831O272j2957k7226L0788K1426O261P641q73l3330j7073k7542K570
11226b3938R670L077p31K932K5781J0759j0377q556M766L4796j4979L059O821
11213D3080k248j1747R838p176j6727l065J4151M296j7847M347K9357O443k8389
11200B4313j2337k3813j2032J0098K7545n41k6113j4387K8569J5573Q986J3463
11188C9324N785j9249k488K861j2829Q541J177j4418L538K3256j926k2071J0817
$$ plain form
11175 22318 31638 43374 35438 26621 24185 16415 -3076 17659 31499 24939 3510 -24419 -28826
11162 -28826 -2728 12719 38326 41674 30074 20927 21456 28460 23449 27995 32015 30872 8480
11149 8480 16698 13883 4892 22901 37424 41015 9635 -9013 29045 37430 21959 19933 31912
11136 31912 36849 27920 28899 25489 33142 32555 37589 46816 32636 20888 19044 8166 9329 13040
11122 13040 23455 15499 16522 34666 29396 1045 -4464 1043 7659 9556 -9741 -15210 -19634
11109 -19634 -10307 13944 19542 17553 13130 14146 16811 25970 33192 39019 11542 19897 42765 37073
11095 37073 30842 34011 19527 18274 10398 9502 8426 1971 1378 12752 28486 33721 42920 28815
11081 28815 19913 40801 53061 41534 44470 28792 26085 29429 58993 54173 33862 35780 31657
$$ packed form
11175B2318R320J1736p936q817k436p770j9491K0735J3840o560k1429k7929m407
11162b8826K6098J5447K5607L348j1600r147N29P004n011M546M020j143k2392
11149H480Q218k815q991J8009J4523L591l1380j8648L8058Q385j5471k026J1979
11136C1912M937q929R79l410P653n87N034R227j4180j1748j844j0878J163L711
11122A3040J0415p956J023J8144n270k8351n509N507O616J897j9297n469m424
11109a9634R327K4251N598j989m423J016K665R159P222N827k7477Q355K2868n692
11095C7073o231L169j4484j253p876q96j076o455n93J1374J5734N235R199j4105
11081B8815q902K0888J2260j1527K936j5678k707L344K9564m820k0311J918m123
$$ plain form
11068 31657 15208 923 15327 49446 53207 19792 10217 8000 13054 16373 31765 11431 11699
11055 11699 29517 31851 21628 11121 25795 26498 23495 36509 45662 37055 28669 39883 57438
11042 57438 65889 59973 54875 61622 73434 86538 81525 71729 89277 88147 85505 81440 88323 86828
11028 86828 92325 107485 126268 127294 125834 118839 134645 155212 157698 149291 126102 126814 148639
11015 148639 156375 148809 146915 132471 142578 139727 100009 87388 114506 126543 118754 112291 112693
11002 112693 108649 110418 97253 103533 119436 141317 143322 126426 98046 86810 78414 88380 116697
10989 116697 129918 132733 115397 81992 53689 54461 60626 49287 18904 36673 46973 22758
10977 22758 22486 43991 48071 41081 59718 58163 67876 61356 29956 6970 17778 22092 12194
$$ packed form
11068C1657j6449j4285J4404L4119L761l3415r575k217N054L319J5392k0334K68
11055A1699J7818K334j0223j0507J4674P03l003J3014R153q607q386J1214J7555
11042E7438Q451n916n098O747J1812J3104n013r796J7548j130k642m065O883j495
11028H6828N497J5160J8783J026j460o995J5806K0567K486q407k3189P12K1825
11015A48639P736p566j894j4444J0107k851l9718j2621K7118J2037p789o463M02
11002A12693m044J769j3165O280J5903K1881K005j6896k8380j1236q396R966K8317
10989A16697J3221K815j7336l3405k8303P72O165j1339l0383J7769J0300k4215
10977B2758k72K1505M080o990J8637j555R713o520l1400k2986J0808M314r898
$$ plain form
10964 12194 4809 28265 56079 75769 79258 77527 66778 47358 15380 -13092 -14576 -14745 -11945
10951 -11945 -9351 -5537 -7247 9252 8165 1062 8311 13953 25720 33908 25617 11793 15105 -1521
10937 -1521 3735 -441 12095 13822 26374 21908 45145 48924 35594 17235 29948 27017 3872
10924 3872 -12281 -18298 -4943 12105 -764 15442 23753 25067 28839 15574 39606 67219 80100
10911 80100 78036 85168 77090 49141 61322 59148 33994 24169 12727 11016 12909 22599 11866
10898 11866 -13678 -22233 -6783 -14248 8242 25373 35553 43022 20657 9442 27279 23557
10886 23557 -2169 -53 -10107 3982 15543 -6965 -8351 -4883 -3019 -7988 11543 24835 7113
10873 7113 -9813 -6210 4613 29250 28607 12401 3931 2243 -13145 -21396 -49617 -43246 -7366
$$ packed form
10964A2194p385K3456K7814J9690L489j731j0749j9420l1978k8472j484j69K800
10951a1945K594L814j710J6499j087p103P249N642J1767Q188q291j3824L312j6626
10937a521N256m176J2536J727J2552m466K3237L779j3330j8359J2713k931k3145
10924C872j6153o017J3355J7048j2869J6206Q311J314L772j3265K4032K7613J2881
10911H0100k064P132q078k7949J2181k174k5154r825j1442j711J893R690j0733
10898A1866k5544q555J5450p465K2490J7131J0180P469k2365j1215J7837l722
10886B3557k5726K116j0054J4089J1561k2508j386L468J864m969J9531J3292j7722
10873G113j6926L603J0823K4637o43j6206q470j688j5388q251k8221O371L5880
$$ plain form
10860 -7366 -6376 5955 7905 -5583 -24886 -3994 11404 1537 18616 31744 27984 34100 20923
10847 20923 2908 -8192 1218 33205 55876 40301 8907 11739 7817 22903 40654 27338
10835 27338 24095 24459 30823 30335 10024 31253 47181 38490 39069 52357 74178 71131 38781 14999
10821 14999 25480 49406 39676 24753 12963 -1629 15098 -321 6724 21109 36810 2496
10809 2496 -8162 853 40365 31358 8610 11887 18594 23520 22324 14267 18279 7747 26961
10796 26961 25094 21699 31656 -2198 -36382 -30971 -18507 -1229 8523 12410 23663 34170 31390
10783 31390 23146 17708 19830 26852 17617 4971 -6484 -16009 -5007 27741 42902 56821 61714
10770 61714 63284 49766 57800 68388 80290 66340 46783 28619 28025 41344 50171 64148 62968
$$ packed form
10860g366R90J2331J950j3488j9303K0892J5398r867J7079J3128l760O116j3177
10847B0923j8015j1100R410L1987K2671j5575l1394K832l922J5086J7751j3316
10835B7338l243L64O364m88k0311K1229J5928q691N79J3288K1821l047l2350k3782
10821A4999J0481K3926r730j4923j1790j4592J6727j5419P045J4385J5701l4314
10809B496j0658R015L9512r007k2748L277O707M926j196q057M012j0532J9214
10796B6961j867l395R957l3854l4184N411J2464J7278R752L887J1253J0507k780
10783C1390q244n438K122P022r235j2646j1455r525J1002L2748J5161J3919M893
10770F1714J570j3518Q034J0588J1902j3950j9557j8164n94J3319Q827J3977j180
$$ plain form
10757 62968 57377 31753 15770 6779 -3113 -11422 -8127 2287 7118 7606 16355 40804 46295 48484
10743 48484 36454 53757 44092 34892 13753 4653 34575 59424 62836 62661 62086 61153 65306 67340
10729 67340 82551 70000 51439 53870 50675 60628 57626 55713 58779 51408 40613 52745 63871
10716 63871 70770 59903 56807 80472 70073 76866 91171 88756 52244 32963 44468 66858
10704 66858 70848 72114 52570 33148 50417 84098 92310 71866 72717 73717 62410 54698 62379
10691 62379 64469 99369 108831 103442 90920 97544 102484 110753 100230 100656 87530 66847 81156
10678 81156 99437 97680 83676 58802 51790 66681 77386 65988 59772 67833 66825 64943 70335
10665 70335 76691 79094 106372 114862 100633 102795 104387 101597 111316 116188 152275 161443 151376
$$ packed form
10757F2968n591k5624j5983q991r892q309L295J0414M831M88Q749K4449N491K189
10743D8484j2030J7303r665r200k1139r100K9922K4849L412j75n75r33M153K034
10729F7340J5211j2551j8561K431l195R953l002j913L066p371j0795J2132J1126
10716F3871O899j0867l096K3665j0399O793J4305k415l6512j9281J1505K2390
10704F6858L990J266j9544j9422J7269L3681Q212k0444Q51J000j1307p712P681
10691F2379K090L4900R462n389j2522O624M940Q269j0523M26j3126k0683J4309
10678H1156J8281j757j4004k4874p012J4891J0705j1398o216Q061j008j882N392
10665G0335O356K403K7278Q490j4229K162J592k790R719M872L6087R168j0067
$$ plain form
10652 151376 112925 85540 93206 85991 72286 93882 116371 131175 145304 155756 167124 182465
10640 182465 195603 203119 225452 228390 191753 187101 231293 257240 252919 246999 262299 311418
10628 311418 363833 399663 447268 498352 569188 637029 688565 747751 862185 1006020 1133203
10617 1133203 1296125 1560130 1900808 2299249 2810104 3487218 4277697 5073506 5809062
10608 5809062 6499890 7178267 7812210 8336528 8705032 8957357 9286108 9891128 10865774
10599 10865774 12081134 13294688 14358830 15378383 16418624 17396949 18006670 18054798 17727897
10590 17727897 17451549 17670870 18517947 19736193 20941908 21947046 22880500 23794884 24423783
10581 24423783 24400223 23493006 21941748 20357956 19287606 18836854 18786535 18827290 18855527
$$ packed form
10652A51376l8451k7385P666p215j3705K1596K2489J4804J4129J0452J1368J5341
10640A82465J3138P516K2333K938l6637m652M4192K5947m321n920J5300M9119
10628C11418N2415L5830M7605N1084P0836O7841N1536N9186J14434J43835J27183
10617A133203J62922K64005L40678L98441N10855O77114P90479P95809P35556
10608E809062O90828O78377O33943N24318L68504K52325L28751O05020R74646
10599A0865774J215360J213554J064142J019553J040241R78325O09721M8128l26901
10590A7727897k76348K19321Q47077J218246J205715J005138R33454R14384O28899
10581B4423783k3560r07217j551258j583792j070350m50752n0319M0755K8237
$$ plain form
10572 18855527 18889921 18940959 18830058 18304829 17180627 15639443 14132136 12977005 12235193
10563 12235193 11759852 11370432 11040114 10750618 10445711 10054170 9479465 8684512 7715420
10554 7715420 6787209 5978879 5285567 4730238 4306057 3954148 3656876 3400674 3207059
10545 3207059 3035411 2897880 2774078 2664946 2584926 2507257 2403168 2292900 2199334 2136812
10535 2136812 2045560 1950068 1876638 1836290 1797627 1749781 1689039 1635215 1590568 1540555 1504480
10524 1504480 1443591 1413837 1398983 1360089 1316479 1276701 1255882 1205559 1173704 1130404 1100994
10513 1100994 1061390 1045696 1035530 1015542 987874 965476 946794 915978 883611 853469 827919
10502 827919 813091 806437 786669 761123 720191 672813 684868 694045 690206 669548 622662 595323
$$ packed form
10572A8855527L4394N1038j10901n25229j124202j541184j507307j155131p41812
10563A2235193m75341l89420l30318k89496l04907l91541n74705p94953r69092
10554G715420r28211q08330o93312n55329m24181l51909k97272k56202j93615
10545C207059j71648j37531j23802j09132q0020p7669j04089j10268r3566o2522
10535B136812r1252r5492p3430m0348l8663m7846o0742n3824m4647n0013l6075
10524A504480o0889k9754j4854l8894m3610l9778k0819n0323l1855m3300k9410
10513A100994l9604j5694j0166j9988k7668k2398j8682l0816l2367l0142k5550
10502H27919j4828o654j9768k5546m0932m7378J2055R177l839k0658m6886k7339
$$ plain form
10490 595323 584140 570207 574419 569467 536228 533690 515106 485541 467573 473599 490031 493001
10478 493001 491361 453884 440122 415498 414706 424614 425323 403770 401715 408093 376854 335312 318119
10465 318119 341713 342649 323636 328617 333223 332080 332432 336361 347975 333012 281406 231145 222145
10452 222145 220008 256324 256302 237934 236615 237566 232745 218482 215289 224603 237524 231118 220878 197257
10438 197257 172516 168661 176377 167286 155550 160851 169888 172486 145613 151300 159790 146383 115517
10425 115517 107748 131066 167673 144687 123773 116269 106329 106484 108312 116346 126286 105873 87244
10412 87244 71742 76440 91337 83092 89325 71599 65859 67530 90684 108669 107090 101850 118891
10399 118891 121348 117695 99667 108773 104261 91732 80750 67300 73904 80779 87779 94809 108964
$$ packed form
10490E95323j1183j3933M212m952l3239k538j8584k9565j7968O026J6432K970
10478D93001j640l7477j3762k4624p92R908P09k1553k055O378l1239m1542j7193
10465C18119K3594R36j9013M981M606j143L52L929J1614j4963n1606n0261r000
10452B22145k137L6316k2j8368j319R51m821j4263l193R314J2921o406j0240k3621
10438A97257k4741l855P716r091j1736N301R037K598k6873N687Q490j3407l0866
10425A15517p769K3318L6607k2986k0914p504r940J55J828Q034R940k0413j8629
10412H7244j5502M698J4897q245O233j7726n740J671K3154J7985j579n240J7041
10399A18891K457l653j8028R106m512j2529j0982j3450O604O875P000P030J4155
$$ plain form
10386 108964 122660 109453 100397 97259 75519 56821 76069 94697 101851 88583 87219 84206
10374 84206 84362 56866 31914 40715 64482 67418 85837 86166 76742 55302 54823 64285 70687 47423
10360 47423 18025 6776 9077 23073 30679 33909 22595 33272 48062 35731 10207 11143 40263
10347 40263 51436 41945 40485 27102 14912 7540 28711 36687 28311 13811 20561 34807 35358
10334 35358 41854 62245 58002 62095 77140 63798 43311 28128 19839 38286 35869 23976 23114
10321 23114 22056 31703 35531 18797 11015 18151 13119 37187 31684 11036 -2000 212 25755
10308 25755 32135 38086 30270 28854 46220 78631 72669 71055 47865 43693 46567 31034 1274
10295 1274 -18414 8181 16807 19264 21050 4665 9258 39380 49539 22849 4419 4259 -11022
$$ packed form
10386A08964J3696j3207r056l138k1740j8698J9248J8628P154j3268j364l013
10374H4206J56k7496k4952Q801K3767K936J8419L29r424k1440m79R462O402k3264
10360D7423k9398j1249K301J3996P606L230j1314J0677J4790j2331k5524R36K9120
10347D0263J1173r491j460j3383j2190p372K1171P976q376j4500O750J4246N51
10334C5358O496K0391m243M093J5045j3342k0487j5183q289J8447k417j1893q62
10321B3114j058R647L828j6734p782P136n032K4068n503k0648j3036K212K5543
10308B5755O380N951p816j416J7366L2411n962j614k3190m172K874j5533k9760
10295A274j9688K6595Q626K457J786j6385M593L0122J0159k6690j8430j60j5281
$$ plain form
10282 -11022 -5555 16775 16632 25731 9956 7870 10805 13503 17408 17228 -2049 -9858 -17025 -10251
10268 -10251 17865 23118 -2019 -9911 -14881 -2626 -4125 -1057 5644 5733 20107 43131 52305 53068
10254 53068 37627 47972 55868 38191 30721 5014 6509 22719 7186 -17452 -35817 -22224
10242 -22224 -14029 -6912 -3914 -9516 -3413 -2316 -18787 -17494 9080 48640 42583 36017 16288
10229 16288 -9404 -144 18263 47090 33043 24407 23098 2640 8065 15521 12639 8417 14230
10216 14230 10000 29265 40563 40450 34252 16744 -14332 10798 18012 21129 25941 20015 28278
10203 28278 15156 -17128 -26770 3807 11654 -1407 -10407 2261 -11154 -12997 -1524 5043 -2874
10190 -2874 -3984 -4625 7877 46955 50990 50398 51830 49183 64381 69711 28747 16051 28370 17498
$$ packed form
10282a1022N467K2330j43R099j5775k086K935K698L905j80j9277p809p167O774
10268a0251K8116N253k5137p892m970J2255j499L068O701Q9J4374K3024R174P63
10254E3068j5441J0345P896j7677p470k5707J495J6210j5533k4638j8365J3593
10242b2224Q195P117K998n602O103J097j6471J293K6574L9560o057o566j9729
10229A6288k5692R260J8407K8827j4047q636j309k0458N425P456k882m222N813
10216A4230m230J9265J1298j13o198j7508l1076K5130P214L117M812n926Q263
10203B8278j3122l2284r642L0577P847j3061r000J2668j3415j843J1473O567p917
10190b874j110o41J2502L9078M035n92J432k647J5198N330m0964j2696J2319j0872
$$ plain form
10176 17498 18911 35901 65196 78764 46512 53668 73351 79646 69620 75647 92928 84969 67150
10163 67150 64779 91020 76011 84583 82462 86632 108986 126192 119734 102893 114425 159915 183583
10150 183583 181927 144442 133976 146925 138164 139485 162763 162928 152246 149335 147080 132935 122180
10137 122180 126337 124843 108004 99961 117855 143173 102735 73438 56341 58682 79065 81776
10125 81776 54144 60164 89586 112509 104195 85640 75007 56625 57490 60260 50074 37174 24996
10112 24996 45434 51383 49883 59537 49618 38758 27281 27522 16914 22354 41999 48144 34095
10099 34095 16323 11646 12789 19015 40962 51746 36090 25094 29621 23577 46811 30152 26652
10086 26652 53994 64405 53135 35716 23687 17811 4286 17541 22605 41383 47612 15353
$$ packed form
10176A7498J413J6990K9295J3568l2252P156J9683O295j0026O027J7281p959j7819
10163F7150k371K6241j5009Q572k121M170K2354J7206o458j6841J1532M5490K3668
10150A83583j656l7485j0466J2949q761J321K3278J65j0682k911k255j4145j0755
10137A22180M157j494j6839q043J7894K5318m0438k9297j7097K341K0383K711
10125H1776k7632O020K9422K2923q314j8555j0633j8382Q65K770j0186j2900j2178
10112B4996K0438N949j500R654r919j0860j1477K41j0608N440J9645O145j4049
10099C4095j7772m677J143O226K1947J0784j5656j0996M527o044K3234j6659l500
10086B6652K7342J0411j1270j7419j2029n876j3525J3255N064J8778O229l2259
$$ plain form
10074 15353 6463 17809 22005 6455 25639 27559 38757 29493 29436 26863 24283 23878 1186 -19112
10060 -19112 -11444 11304 1835 284 -17096 -5490 6234 -9331 -1984 29 6437 20307 23000
10047 23000 37585 43322 35189 19876 22352 36132 26876 19704 4430 -5458 -23354 -11205 -789
10034 -789 12615 6344 1882 9265 37814 58897 30274 26899 18007 -3424 -13506 -1393 7091
10021 7091 23436 45976 34876 44684 49097 31506 9948 -1732 -12567 3810 23716 33448
10009 33448 31598 4664 -17152 5187 -7 -7544 10771 23065 19244 43314 55841 50700 48731
9996 48731 27401 22325 23949 35287 40016 43957 38069 13906 11800 25313 27216 32323 20017
9983 20017 5645 -7795 -7007 -5423 -9692 -26288 -45244 -34236 -1321 32607 47545 36098 34911
$$ packed form
10074A5353q890J1346M196j5550J9184J920J1198r264n7k573k580m05k2692k0298
10060a9112P668K2748r469j551j7380J1606J1724j5565P347K013O408J3870K693
10047B3000J4585N737q133j5313K476J3780r256p172j5274r888j7896J2149J0416
10034g89J3404o271m462P383K8549K1083k8623l375q892k1431j0082J2113Q484
10021G091J6345K2540j1100R808M413j7591k1558j1680j0835J6377J9906R732
10009C3448j850k6934k1816K2339n194p537J8315J2294l821K4070J2527n141j969
9996D8731k1330n076J624J1338M729L941n888k4163k106J3513J903N107j2306
9983B0017j4372j3440P88J584m269j6596j8956J1008L2915L3928J4938j1447j187
$$ plain form
9970 34911 7316 2072 17495 29183 29167 15186 6957 10618 20057 13745 8232 -1981 -10304 -3012
9956 -3012 140 -11341 -17235 -2211 2608 9485 9662 18544 26459 58621 55038 13944 35477 43835
9942 43835 51843 48800 45191 32463 22658 34252 41426 34303 37779 52063 16373 -7081 6562
9929 6562 30237 28714 21916 30616 25144 23262 7858 3546 10497 68 -138 10489 14859 4128
9915 4128 14023 27199 19697 13376 15487 24208 47711 24965 9879 5850 -3475 1131 8960 17210
9901 17210 26784 38822 31174 33774 21797 6333 5017 20424 25208 22106 2892 3839 32758
9888 32758 27478 24533 22477 1357 4271 15014 6169 2625 21420 15910 9319 6255 27193 30346
9874 30346 28780 39651 9804 6228 18114 14488 31406 35661 22355 6379 -4793 -304 13916
$$ packed form
9970C4911k7595n244J5423J1688j6j3981q229L661R439o312n513j0213q323P292
9956c012L152j1481n894J5024M819O877J77Q882P915L2162l583m1094K1533Q358
9942D3835Q008l043l609j2728r805J1594P174p123L476J4284l5690k3454J3643
9929F562K3675j523o798Q700n472j882j5404m312O951j0429k06J0627M370j0731
9915D128R895J3176p502o321K111Q721K3503k2746j5086m029r325M606P829Q250
9901A7210R574J2038p648K600j1977j5464j316J5407M784l102j9214R47K8919
9888C2758n280k945k056k1120K914J0743q845l544J8795n510o591l064K0938L153
9874C0346j566J0871k9847l576J1886l626J6918M255j3306j5976j1172M489J4220
$$ plain form
9861 13916 18139 15827 2474 146 -4255 874 -1425 17421 31851 42161 43512 23114 9960
9848 9960 32430 34044 37122 29616 27891 49926 34867 -40 -24487 -23203 -9904 -14864 -8952
9835 -8952 -27127 -4835 11866 -3412 -6874 -381 10229 28328 11761 -9213 -16593 2800 -1562
9822 -1562 12789 19133 -505 -19136 -25170 -24516 -5287 -11758 -11294 -23335 -23057 -21588 -23843 11942
9808 11942 37187 18566 23932 44189 53405 36413 37923 37406 5913 -12337 6363 14727 17313
9795 17313 -5089 -19932 1095 17593 17780 18991 3612 4645 -5949 -8355 15917 34884 6889
9782 6889 -1940 9642 -1860 -27515 -20822 10439 16517 -19120 -20623 -1553 4830 2460 5851
9769 5851 17377 9562 -676 6288 -8521 -15980 -8611 -17446 -22515 -4755 -10863 -5816 -25536 -10713
$$ packed form
9861A3916M223k312j3353k328m401N129k299J8846J4430J0310J351k0398j3154
9848I960K2470J614L078p506j725K2035j5059l4907k4447J284J3299m960N912
9835h952j8175K2292J6701j5278l462O493J0610J8099j6567k0974p380J9393m362
9822a562J4351O344j9638j8631o034O54J9229o471M64j2041K78J469k255L5785
9808A1942K5245j8621N366K0257R216j6992J510n17l1493j8250J8700Q364K586
9795A7313k2402j4843K1027J6498J87J211j5379J033j0594k406K4272J8967k7995
9782F889q829J1582j1502k5655O693L1261O078l5637j503J9070O383k370L391
9769E851J1526p815j0238O964j4809p459P369q835n069J7760o108N047j9720J4823
$$ plain form
9755 -10713 2347 -17824 -5036 11404 37094 -620 -8632 -2806 -2547 -10470 -4826 14073 46752
9742 46752 41233 13400 -5037 -1664 21827 30041 32648 19525 20232 26799 25187 37331 12850
9729 12850 -9418 -10878 -10323 -7357 -12687 557 5741 11806 4631 10262 23298 9233 8990 15227
9715 15227 40243 50609 37745 38408 21536 15183 12568 869 2940 11655 12370 16626 17646 24419
9701 24419 7838 8150 15705 26578 12550 904 -12299 -20562 -14966 -3880 2313 5383 8463
9688 8463 -3952 6710 10803 -1006 5133 7856 7523 13335 33601 23001 15072 -10237 -25012
9675 -25012 -19508 -7122 16994 16739 -4231 5814 1571 3514 -15031 -44420 -22026 -8572 -10812
9662 -10812 13244 4565 -8919 4685 4166 -2162 -7019 1530 -199 -8889 11003 30822 35329 21854
$$ packed form
9755a0713J3060k0171J2788J6440K5690l7714q012N826K59p923N644J8899L2679
9742D6752n519k7833j8437L373K3491Q214K607j3123P07O567j612J2144k4481
9729A2850k2268j460N55K966n330J3244N184O065p175N631J3036j4065k43O237
9715A5227K5016J0366j2864O63j6872o353k615j1699K071Q715P15M256J020O773
9701B4419j6581L12P555J0873j4028j1646j3203q263N596J1086O193L070L080
9688H463j2415J0662M093j1809O139K723l33N812K0266j0600p929k5309j4775
9675b5012N504J2386K4116k55k0970J0045m243J943j8545k9389K2394J3454k240
9662a0812K4056q679j3484J3604n19o328m857Q549j729q690J9892J9819M507j3475
$$ plain form
9648 21854 -163 3057 32560 48946 41649 11666 -690 -19006 -35789 -22971 -2734 -13396
9636 -13396 1977 5084 10790 16184 2023 -13680 -17365 -23804 -4728 7302 13994 18289 21757
9623 21757 31085 17964 33707 27401 17025 10656 -15282 -13582 5059 16471 11390 -3261 -19805
9610 -19805 -21519 6805 33496 38057 40226 16243 25015 35076 25693 24594 31582 35055 12551
9597 12551 -22277 -40155 -33800 -20550 -203 8385 -4614 -206 10921 26100 16031 3772
9585 3772 12280 -891 -14990 6126 15625 22768 13542 14027 2906 9578 12374 -10291 9327 4759
9571 4759 -8505 -24049 -21492 -9777 -325 748 -14557 1157 16813 13005 3617 14755 12601
9558 12601 -17976 -18498 -14550 -16711 -27181 -19733 -21385 -39965 -48829 -35724 -8089 14657 -2683
$$ packed form
9648B1854k2017L220K9503J6386p297k9983j2356j8316j6783J2818K0237j0662
9636a3396J5373L107N706N394j4161j5703l685o439J9076J2030O692M295L468
9623B1757R328j3121J5743o306j0376o369k5938J700J8641J1412n081j4651j6544
9610a9805j714K8324K6691M561K169k3983Q772J0061r383j099O988L473k2504
9597A2551l4828j7878O355J3250K0347Q588j2999M408J1127J5179j0069j2259
9585C772Q508j3171j4099K1116R499P143r226M85j1121O672K796k2665J9618m568
9571D759j3264j5544K557J1715R452J073j5305J5714J5656l808r388J1138k154
9558A2601l0577n22L948k161j0470P448j652j8580q864J3105K7635K2746j7340
$$ plain form
9545 -2683 11827 12153 8584 14685 22471 21892 19847 30274 44085 38312 5306 24057 47684 45559
9531 45559 37575 9827 16015 13453 20715 1450 -25383 -4952 12382 5578 -3535 3359 -21859
9518 -21859 -41880 -25629 -15821 -19376 -10426 -14627 1517 7198 8817 8284 -12635 -20296 -13318 -15001
9504 -15001 -26305 -20258 -46440 -53951 -23779 -14326 -4534 -6661 -13249 4314 145 -5350 5852
9491 5852 -14673 -20005 -26693 -5331 -351 -12763 -4575 14422 766 -8528 -5228 -2969 7053
9478 7053 20942 40974 16291 -14442 -15497 10718 17942 39670 32461 13404 -1518 1638 5697
9465 5697 30736 7879 -1569 -5533 2441 -8548 -18771 7325 15383 41799 31907 24347 7279
9452 7279 -9732 -8712 -1954 11946 8236 -10477 -39249 -26296 8574 12448 10683 15808 42011
$$ packed form
9545b683J4510L26l569O101P786n79k045J0427J3811n773l3006J8751K3627k125
9531D5559p984k7748O188k562P262j9265k6833K0431J7334o804r113O894k5218
9518b1859k0021J6251R808l555Q950m201J6144N681J619n33k0919p661O978j683
9504a5001j1304O047k6182p511L0172R453R792k127o588J7563m169n495J1202
9491E852k0525n332o688K1362M980j2412Q188J8997j3656r294L300K259J0022
9478G053J3889K0032k4683l0733j055K6215P224K1728p209j9057j4922L156M059
9465E697K5039k2857r448l964P974j0989j0223K6096Q058K6416r892p560j7068
9452G279j7011J020O758J3900l710j8713k8772J2953L4870L874j765N125K6203
$$ plain form
9439 42011 36199 15158 7413 14494 -3206 9486 28962 15262 976 12732 -3722 -19529
9427 -19529 -13880 13252 14921 -9679 -13298 14855 31795 41911 44787 34416 437 -26775 -21121
9414 -21121 -13197 11220 29789 20211 10634 24828 34729 39405 36978 14373 1243 -22227 -40677
9401 -40677 -20315 7015 34573 22113 6544 2204 17595 27641 31255 19678 -2607 11559
9389 11559 30050 24078 19543 9367 32307 25908 13639 14053 31538 13742 -4204 14692 47984
9376 47984 29973 5977 15933 22015 25500 15948 4442 19141 -8151 -15312 -14635 3165 32920
9363 32920 22009 20586 15133 19140 16756 -22232 -43541 -37875 -9647 -12903 -40869 -26514 -18538
9350 -18538 1574 -2107 3829 -7398 -11018 -16045 -16587 6503 38995 20565 15208 28982 62873
$$ packed form
9439D2011n812k1041p745P081j7700J2692J9476j3700j4286J1756j6454j5807
9427a9529N649K7132J669k4600l619K8153J6940J0116K876j0371l3979k7212N654
9414b1121P924K4417J8569r578r577J4194R901M676k427k2605j3130k3470j8450
9401d0677K0362K7330K7558j2460j5569m340J5391J0046L614j1577k2285J4166
9389A1559J8491n972m535j0176K2940o399j2269M14J7485j7796j7946J8896L3292
9376D7984j8011k3996R956O082L485r552j1506J4699k7292p161O77J7800K9755
9363C2920j0911j423n453M007k384l8988k1309N666K8228l256k7966J4355P976
9350a8538K0112l681N936j1227l620n027n42K3090L2492j8430n357J3774L3891
$$ plain form
9337 62873 66613 53930 16824 9850 27802 24413 30216 31750 10092 -20479 -25581 -9792 9895
9324 9895 27124 19694 24504 45699 32578 15280 6913 35781 30019 19238 30270 35088 29281
9311 29281 -18379 -39376 -22798 351 8953 11343 6514 11511 8375 2688 11897 -2202 -12951
9298 -12951 -3794 23734 25878 23157 23672 24776 14138 -21161 -31442 -21258 14812 25286 23868
9285 23868 13964 1746 6490 1605 -7278 -23271 -1104 3583 2261 7580 28832 26343 19606 25580
9271 25580 -5992 4162 19249 18749 15321 34815 29208 10395 -5138 -18466 -33091 -35685 -28607
9258 -28607 -15319 23433 25161 -1130 -29547 -28042 -6538 -8861 -7207 -2763 -5005 5203 33080
9245 33080 23790 13610 18496 17876 15225 6220 13733 7299 23430 29930 19945 -4968 -16808 -19362
$$ packed form
9337F2873L740j2683l7106o974J7952l389N803J534k1658l0571n102J5789J9687
9324I895J7229p430M810K1195j3121j7298q367K8868n762j0781J1032M818n807
9311B9281m7660k0997J6578K3149Q602K390m829M997l136n687R209j4099j0749
9298a2951R157K7528K144k721N15J104j0638l5299j0281J0184L6070J0474j418
9285B3868r904j2218M744m885q883j5993K2167M687j322N319K1252k489o737N974
9271B5580l1572J0154J5087n00l428J9494n607j8813j5533j3328j4625k594P078
9258b8607J3288L8752J728k6291k8417J505K1504k323J654M444k242J0208K7877
9245C3080r290j0180M886o20k651r005P513o434J6131O500r985k4913j1840k554
$$ plain form
9231 -19362 -23130 -1980 13559 400 -3424 -4468 4089 -9546 14983 36203 32966 18458 31793
9218 31793 16769 8803 8402 14944 14377 11594 -4952 -25906 -9723 415 7755 -9775 -23391
9205 -23391 -16008 -17231 -3803 5810 842 -10166 -12556 -24034 -22150 -31712 -30619 -40028 -36265 -26949
9191 -26949 -39606 -23987 -14159 -875 -8399 -8084 879 -8916 -1408 13365 8704 -8338 -18196 -20965
9177 -20965 -11708 15331 10541 -5760 -8481 2185 -12154 -12844 -16073 -4028 -14670 -15604 1728
9164 1728 -5831 -809 5079 9826 11000 -6843 -11850 -4958 -4907 2008 8707 4291 3298 -7240 -11161
9149 -11161 -19696 -29596 -23201 -21331 -15367 -19405 1257 11207 25962 36640 35233 25634 55299 38498
9135 38498 22629 33331 28788 6989 -2687 -3984 -9893 -23960 -1373 14394 4169 4397 -16529
$$ packed form
9231a9362l768K1150J5539j3159l824j044Q557j3635K4529K1220l237j4508J3335
9218C1793j5024p966m01O542n67k783j6546k0954J6183J0138P340j7530j3616
9205b3391P383j223J3428R613m968j1008k390j1478J884r562J093r409L763R316
9191b6949j2657J5619R828J3284p524L15Q963r795P508J4773m661j7042r858k769
9177b0965R257K7039m790j6301k721J0666j4339o90l229J2045j0642r34J7332
9164A728p559N022N888M747J174j7843n007O892N1O915O699m416r93j0538l921
9149a1161q535r900O395J870N964m038K0662R950J4755J0678j407r599K9665j6801
9135C8498j5869J0702m543k1799r676j297n909j4067K2587J5767j0225K28k0926
$$ plain form
9122 -16529 -4357 1626 -10178 -14956 2998 5931 -15321 -31731 -48440 -43385 -38078 -57236 -50877
9109 -50877 -38167 -22815 -1685 7156 -2308 -26607 -39143 -33628 -9002 17376 19494 11622 -7744
9096 -7744 -22415 -30152 -33160 -23528 -4620 -725 19009 3395 14020 15341 6771 2499 -28027
9083 -28027 -15355 5406 7738 -2896 11886 25078 30435 7328 4922 2379 5795 6449 -1473
9070 -1473 -6323 15885 24896 13643 10326 12494 25818 43805 54832 20361 3755 -9243 -5966
9057 -5966 10464 27748 21406 -1046 -29700 -49460 -61004 -43737 -14085 6277 9238 9411 11933
9044 11933 5121 26281 27818 18156 -10804 -26458 -20814 7934 11491 12827 10712 -221 9253
9031 9253 -2908 3018 15172 21935 21402 17924 30275 28748 -8135 -10320 -6493 -12455 -14779 -28019
$$ packed form
9122a6529J2172N983j1804m778J7954K933k1252j6410j6709N055N307j9158O359
9109e0877J2710J5352K1130Q841r464k4299j2536N515K4626K6378K118p872j9366
9096g744j4671p737l008R632J8908L895J9734j5614J0625J321q570m272l0526
9083b8027J2672K0761K332j0634J4782J3192N357k3107k406k543L416O54p922
9070a473m850K2208R011j1253l317K168J3324J7987J1027l4471j6606j2998L277
9057e966J6430J7284o342k2452k8654j9760j1544J7267K9652K0362K961J73K522
9044A1933o812K1160J537r662k8960j5654N644K8748L557J336k115j0933R474
9031I253j2161N926J2154O763n33l478J2351j527l6883k185L827n962k324j3240
$$ plain form
9017 -28019 -43120 -42813 -46103 -57343 -48983 -38734 -16164 3634 -6275 -4234 -4110 -2320 4462 -10420
9003 -10420 488 19227 33147 38589 45226 20254 14806 20267 8063 5022 3818 13264 10307
8990 10307 -20852 -9542 35320 30132 12668 11701 -6189 -27076 -7293 -4059 -15616 -19347 -12073
8977 -12073 -18227 -47616 -31110 -37388 -41645 -44316 -43587 -27069 -38940 -22875 -18974 -22456 -497
8964 -497 13805 3548 11032 1470 -16160 -25718 -37570 -28586 -51359 -45875 -12478 -479 30959
8951 30959 41998 8235 35280 58355 33118 25499 14782 -3301 -15735 -46210 -37902 -10671
8939 -10671 -16904 -27931 -22560 -31667 -26942 -32564 -6572 15938 5415 1573 629 8520 -4728 -8334
8925 -8334 5939 -1058 -9439 -8676 -7520 16096 44679 39154 14677 7211 13000 3583 6622 15470
$$ packed form
9017b8019j5101L07l290j1240Q360J0249K2570J9798r909K041J24J790O782j4882
9003a0420J0908J8739J3920N442O637k4972n448N461j2204l041j204R446k957
8990A0307l1159J1310M4862n188j7464r67j7890k0887J9783L234j1557l731P274
8977a2073o154k9389J6506o278m257k671P29J6518j1871J6065L901l482K1959
8964d97J4302j0257P484r562j7630r558j1852Q984k2773N484L3397J1999L1438
8951C0959J1039l3763K7045K3075k5237p619j0717j8083j2434l0475Q308K7231
8939a0671o233j1027N371r107M725n622K5992K2510j0523l842r44P891j3248l606
8925h334J4273o997q381P63J156K3616K8583n525k4477p466N789r417L039Q848
$$ plain form
8911 15470 9653 -5089 -23038 -6043 6633 -6163 -14429 -11327 -6223 5511 7070 13050 22112
8898 22112 3639 -895 1579 6008 12283 30398 32561 31084 12499 -1930 797 16535 12496
8885 12496 -3973 -10731 3759 8660 6864 9490 -4309 -2188 -10892 -22647 -19559 -35239 -31966
8872 -31966 -13513 -4808 -6801 2830 -12474 -25772 -14890 529 -8718 -11418 -25583 -15515 -7569
8859 -7569 -13997 -14001 -7450 7898 11672 7342 2542 1248 -12357 -12309 -43 -12052 -5307 -1390 -17393
8844 -17393 -41676 -46608 -45383 -45554 -41448 -32497 -28335 -25456 -13326 -6071 -30727 -61827 -41320 -29666
8830 -29666 -18608 7298 4568 3721 26115 12571 16379 26013 6254 -3548 -1206 -3477 11037
8817 11037 3378 -8167 -26246 -21927 -6859 -8786 -18758 -21688 -8091 234 -1576 -9536 -10117 8086
$$ packed form
8911A5470n817j4742j7949J6995J2676j2796q266L102N104J1734J559N980R062
8898B2112j8473m534K474M429O275J8115K163j477j8585j4429K727J5738m039
8885A2496j6469o758J4490M901j796K626j3799K121q704j1755L088j5680L273
8872c1966J8453Q705j993R631j5304j3298J0882J5419r247k700j4165J0068P946
8859g569o428mO551J5348L774m330m800j294j3605M8J2266j2009O745L917j6003
8844a7393k4283m932J225j71M106Q951M162K879J2130P255k4656l1100K0507J1654
8830b9666J1058K5906k730q47K2394j3544L808R634j9759r802K342k271J4514
8817A1037p659j1545j8079M319J5068j927r972k930J3597Q325j810p960n81J8203
$$ plain form
8803 8086 34710 32495 21749 16236 25696 38788 48191 17096 18667 35742 23412 -2284 11011
8790 11011 15048 23176 20344 7233 13772 27091 20087 12535 9509 16501 25545 18796 1982 2353
8776 2353 17045 21925 37466 50203 35921 15292 -1835 -8968 -14098 12260 -10721 -15161 -7523
8763 -7523 4460 -14609 -16481 -10291 3601 14279 14313 3412 -15105 -25816 -25595 3621 24649
8750 24649 26484 23719 10893 10831 11430 3745 -9425 -29142 -37855 -51188 -52973 -36342 -42314 -56364
8736 -56364 -44410 -14881 740 411 -4653 -11582 -7576 -12502 -30620 -15020 6720 2375 662
8723 662 1655 -15543 -2344 27575 44475 32573 18552 13283 13455 6336 18059 17297 11596 8592
8709 8592 -6205 -25478 -4937 -6213 17456 32463 -919 -10437 -10793 -20422 -29731 2469 23370
$$ packed form
8803H086K6624k215j0746n513R460J3092R403l1095J571J7075j2330k5696J3295
8790A1011M037Q128k832j3111O539J3319p004p552l026O992R044o749j6814L71
8776B353J4692M880J5541J2737j4282k0629j7127p133n130K6358k2981m440P638
8763g523J1983j9069j872O190J3892J0678L4j0901j8517j0711K21K9216K1028
8750B4649J835k765j2826o2N99p685j3170j9717q713j3333j785J6631n972j4050
8736e6364J1954K9529J5621l29n064o929M006m926j8118J5600K1740m345j713
8723F62R93j7198J3199K9919J6900j1902j4021n269J72p119J1723p62n701l004
8709H592j4797j9273K0541j276K3669J5007l3382r518l56r629r309L2200K0901
$$ plain form
8696 23370 1088 -16450 -32611 -15514 -14262 -5108 16755 10731 5422 3137 -6889 3070 30795
8683 30795 46362 58418 41236 10685 -19652 -16848 -29782 -29920 -12465 -20433 -3613 16335 33758
8670 33758 13495 -4159 8620 17469 -13395 -23004 -27165 -14665 -3703 -25368 -29025 7471 -3024
8657 -3024 -20314 -16204 2729 -9139 -9053 -6629 8104 12708 7230 -4063 -5878 8445 17084 19835
8643 19835 44041 32373 15708 13286 198 -14392 -20485 12677 20290 33152 38086 25882 28024
8630 28024 28678 20489 33482 20219 21167 20078 15355 12704 10395 18554 55320 68442 59858 25786
8616 25786 -27738 -43341 -51087 -29089 -1385 15963 17822 21866 15545 -5355 957 -2163 -5983
8603 -5983 -5354 -16462 -34924 -30954 -34799 -22738 -8355 6103 26436 24281 5272 4866 -1183 -1294
$$ packed form
8696B3370k2282j7538j6161J7097J252R154K1863o024n309k285j0026R959K7725
8683C0795J5567J2056j7182l0551l0337K804j2934j38J7455p968J6820J9948J7423
8670C3758k0263j7654J2779Q849l0864r609m161J2500J0962k1665l657L6496j0495
8657c024j7290M110J8933j1868Q6K424J4733M604n478j1293j815J4323Q639K751
8643A9835K4206j1668j6665k422j3088j4590o093L3162P613J2862M934j2204K142
8630B8024O54q189J2993j3263R48j089m723k651k309Q159L6766J3122q584l4072
8616B5786n3524j5603p746K1998K7704J7348J859M044o321k0900O312l120l820
8603e983O29j1108j8462L970l845J2061J4383J4458K0333k155j9009m06o049j11
$$ plain form
8589 -1294 -26664 -32985 -10333 20677 23720 45561 50127 41898 35979 29672 25705 8100 39541
8576 39541 54513 54089 63710 65449 44369 45982 64250 56301 57209 66687 46620 37905 53965 59211
8562 59211 41212 27845 12232 1486 12898 35922 43168 25282 20993 9469 13617 30469
8550 30469 22206 718 -8233 3698 18146 9935 120 9304 17763 17303 14465 9446 -3386 -15835
8536 -15835 -10754 -7983 -12516 -14605 -6397 -15123 -10161 3501 36718 32521 30304 18563 -18140 -7447
8522 -7447 1911 -1429 5684 24273 13855 9741 24296 16998 -10516 -30276 -36389 -16102 -10844
8509 -10844 12175 31837 25405 12388 23581 47082 45166 34288 61031 95461 117790 114875
8497 114875 98417 95241 77879 59662 39030 41131 40359 31161 22972 11324 17582 42005 33073
$$ packed form
8589a294k5370o321K2652L1010L043K1841M566q229n919o307l967j7605L1441
8576C9541J4972m24R621J739k1080J613J8268p949R08R478k0067q715J6060N246
8562E9211j7999j3367j5613j0746J1412K3024P246j7886m289j1524M148J6852
8550C0469q263k1488q951J1931J4448q211r815R184Q459m60k838n019j2832j2449
8536a5835N081K771m533k089Q208q726M962J3662L3217m197k217j1741l6703J0693
8522g447R358l340P113J8589j0418m114J4555p298k7514j9760o113K0287N258
8509a0844K3019J9662o432j3017J1193K3501j916j0878K6743L4430K2329k915
8497A14875j6458l176j7362j8217k0632K101p72r198q189j1648O258K4423q932
$$ plain form
8484 33073 23743 38139 35937 42529 45902 52199 54097 38273 64478 70926 40898 24684 25828
8471 25828 13251 32165 17340 -1354 -7936 13791 25429 23577 23559 31604 14688 9570 33795
8458 33795 35304 20437 36665 72496 70236 39816 36380 40703 35623 63433 81411 74755 66198
8445 66198 53680 53055 61077 69270 56957 54427 45096 39613 47780 67990 56196 26691 13504
8432 13504 26598 27930 12760 12059 36931 40182 29068 22255 387 -4945 13942 -5826 -22966
8419 -22966 -25970 -17801 -5735 13897 8068 14449 20855 19156 18578 22241 17238 1799 -11903 -6438
8405 -6438 -15942 -10123 3691 32971 30929 8367 -19049 -20186 -1405 -9797 26763 18526 13155
8392 13155 -3938 -7664 2548 2468 17699 25235 22348 27562 19985 7570 4837 -13728 -23040 -27288
$$ packed form
8484C3073r330J4396k202O592L373O297J898j5824K6205O448l0028j6214J144
8471B5828j2577J8914j4825j8694o582K1727J1638j852j8Q045j6916n118K4225
8458C3795J509j4867J6228L5831k260l0420l436M323n080K7810J7978o656q557
8445F6198j2518o25Q022Q193j2313k530r331n483Q167K0210j1794k9505j3187
8432A3504J3094J332j5170p01K4872L251j1114o813k1868n332J8887j9768j7140
8419b2966l004Q169J2066J9632n829O381O406j699n78L663n003j5439j3702N465
8405f438r504N819J3814K9280k042k2562k7416j137J8781q392L6560q237n371
8392A3155j7093l726J0212q0J5231P536k887N214p577j2415k733j8565r312m248
$$ plain form
8378 -27288 -25363 -13052 10666 -4348 -10907 16730 41092 26893 10207 7148 17651 22108 -11008
8365 -11008 -21385 10635 1219 -15989 1534 4162 17503 38437 44539 46950 42093 65663 67859
8352 67859 53280 45723 51762 45901 59084 67233 50490 73035 98261 144545 199460 233867 231959
8339 231959 238167 292379 323749 325274 313154 231072 155550 104202 82536 57937 23119 14492
8327 14492 43946 71225 64581 63108 69019 48236 45513 43903 37840 37790 30978 46613 69981 93812
8313 93812 92445 94389 76416 66833 42990 52462 79762 60678 52223 71546 83502 106823 132475
8300 132475 182936 255538 357610 446811 465232 487699 545175 641358 688803 627542 470782
8289 470782 311371 211362 184188 155053 135682 100420 91634 95411 77269 58161 52509 66515
$$ packed form
8378b7288J925J2311K3718j5014o559K7637K4362j4199j6686l059J0503M457l3116
8365a1008j0377L2020r416j7208J7523K628J3341K0934O102K411m857K3570K196
8352F7859j4579p557O039n861J3183Q149j6743K2545K5226M6284N4915L4407j908
8339B31959O208N4212L1370J525j2120q2082p5522n1348k1666k4599l4818q627
8327A4492K9454K7279o644j473N911k0783k723j610o063n0o812J5635K3368K3831
8313I3812j367J944j7973r583k3843R472K7300j9084q455J9323J1956K3321K5652
8300A32475N0461P2602J02072Q9201J8421K2467N7476R6183M7445o1261j56760
8289D70782j59411j00009k7174k9135j9371l5262q786L777j8142j9108n652J4006
$$ plain form
8277 66515 75889 78077 88400 80696 53868 62900 72921 69299 78048 61451 62031 59103 55751 48306
8263 48306 36511 46315 39491 41430 57410 85587 88414 81609 123879 173905 202773 241145 257358
8250 257358 278770 309865 328799 328664 251088 161483 123757 90336 55105 38695 15777 35166
8238 35166 64666 86103 69753 59007 56307 56465 48114 49962 20578 13801 24610 18087 11026
8225 11026 -13906 -17003 2706 1076 25654 47311 54825 40696 20636 21941 13731 1586 4262
8212 4262 30583 36883 35414 34989 35237 28730 25791 12165 4000 11793 6001 14721 35768 27056 11196
8197 11196 13173 16760 13678 17311 3582 11376 -3626 -24858 -30011 -27306 -41033 -47833 -48689 -31368
8183 -31368 -41175 -26896 -25136 -22463 -5973 533 -7198 -14515 -2956 11579 24411 51991 57981
$$ packed form
8277F6515R374K188J0323p704k6828R032J0021l622Q749j6597N80k928l352p445
8263D8306j1795R804o824J939J5980K8177K827o805M2270N0026K8868L8372J6213
8250B57358K1412L1095J8934j35p7576q9605l7726l3421l5231j6410k2918J9389
8238C5166K9500K1437j6350j0746k700J58q351J848k9384o777J0809o523p061
8225A1026k4932l097J9709j630K4578K1657P514j4129k0060J305q210j2145K676
8212D262K6321O300j469m25K48o507k939j3626q165P793n792Q720K1047q712j5860
8197A1196J977L587l082L633j3729P794j5002k1232n153K705j3727o800q56J7321
8183c1368r807J4279J760K673J6490O506p731p317J1559J4535J2832K7580N990
$$ plain form
8170 57981 34639 20846 17059 3010 1803 1147 4635 21609 42478 13628 -21840 -25216 -34501
8157 -34501 -23025 -16229 -16238 -10467 -16535 -9692 -10093 16985 26699 -4766 -29147 -53388 -37619 -29044
8143 -29044 -13281 29231 11321 -13066 -11150 -8827 8989 37729 45894 54093 54827 53338 38498
8130 38498 40227 32491 8743 -7982 -13510 -10486 7179 23805 25671 16578 22387 30705 18956
8117 18956 3276 -18276 -6211 9629 -13296 -12684 7513 9686 -1450 -21132 -31969 -12387
8105 -12387 -18120 -6656 18210 22948 38789 26583 11425 11342 22014 29911 17682 8041 4165
8092 4165 -3514 -26329 -33843 -8332 -17619 -29356 -33053 -22991 -24605 -9213 -7696 -2978 -2263 2363
8078 2363 -13809 -12931 4937 2749 4088 -293 9534 -617 -10325 -21905 -27419 -17192 -3059 -8388
$$ packed form
8170E7981k3342j3793l787j4049j207o56L488J6974K0869k8850l5468l376r285
8157c4501J1476O796rN771o068O843m01K7078R714l1465k4381k4241J5769Q575
8143b9044J5763M2512j7910k4387J916K323J7816K8740Q165Q199P34j489j4840
8130C8498J729p736k3748j6725n528L024J7665J6626J866r093N809Q318j1749
8117A8956j5680k1552J2065J5840k2925O12K0197K173j1136j9682j0837J9582
8105a2387n733J1464K4866M738J5841j2206j5158q3J0672P897j2229r641l876
8092D165p679k2815p514K5511r287j1737l697J0062j614J5392J517M718P15M626
8078B363j6172Q78J7868k188J339m381R827j0151r708j1580n514J0227J4133n329
$$ plain form
8064 -8388 -11399 -5392 31043 54488 64659 50982 28197 -12669 -48588 -50677 -47606 -43401 -63909
8051 -63909 -59164 -34717 -27002 -5760 10708 1355 5870 6075 -5387 -13370 -1725 10070 -5153
8038 -5153 -18984 -13168 -2276 -6804 12219 6298 578 3387 17778 24120 -5427 -29733 -21691
8025 -21691 1021 8886 1993 -8193 367 16604 10701 -7941 -1188 5897 -9830 -24290 -34374
8012 -34374 -31937 -23324 -28289 -27261 -24107 -13092 5005 -731 10537 27739 15303 6763 -16081
7999 -16081 -33977 -10360 6819 956 -8006 -2020 10380 16014 33265 47525 31552 37825 23819
7986 23819 28160 26492 14077 14288 19307 25731 14822 16293 5236 7576 25410 37979 51352
7973 51352 43329 18764 17560 15816 19821 26326 30633 4483 -6270 -7413 -6094 -10640 -9499 -22908
$$ packed form
8064h388l011O007L6435K3445J0171j3677k2785m0866l5919k089L071M205k0508
8051f3909M745K4447P715K1242J6468r353M515K05j1462p983J1645J1795j5223
8038e153j3831N816J0892m528J9023n921n720K809J4391O342k9547k4306Q042
8025b1691K2712P865o893j0186Q560J6237n903j8642O753P085j5727j4460j0084
8012c4374K437Q613m965J028L154J1015J8097n736J1268J7202j2436q540k2844
7999a6081j7896K3617J7179n863q962N986J2400N634J7251J4260j5973O273j4006
7986B3819M341j668j2415K11N019O424j0909J471j1057K340J7834J2569J3373
7973E1352q023k4565j204j744M005O505M307k6150j0753j143J319m546J141j3409
$$ plain form
7959 -22908 -10690 246 6063 27668 5497 2017 -3880 -5559 -24927 -35881 -32283 -24242 -18008
7946 -18008 -34035 -31500 -8460 -37120 -32311 -4664 5482 416 7534 14453 27656 6321 3238
7933 3238 3195 28836 45464 18928 1705 20214 24800 20354 3031 7330 -6459 -20184 -14996
7920 -14996 -15698 -25775 -34029 -42059 -7311 -5731 8358 -24256 -30184 -14437 -3233 -3473 13868
7907 13868 37251 11816 9610 425 20425 10676 -11067 1671 42283 50531 45928 24316 38892
7894 38892 44702 37161 16455 -19759 -12424 6465 17643 28602 29066 3590 -12546 4468 23355
7881 23355 7184 -17554 -13333 -13471 -15165 -7612 -912 -19543 -12407 -6373 -19712 -5244 20192
7868 20192 20511 12911 -2160 -2780 7521 17571 22891 13229 18342 12756 -2758 1611 9953 18571
$$ packed form
7959b2908J2218J0936N817K1605k2171l480n897j679j9368j0954L598Q041O234
7946a8008j6027K535K3040k8660M809K7647J0146n066P118O919J3203k1335l083
7933C238m3K5641J6628k6536j7223J8509M586m446j7323M299j3789j3725N188
7920a4996p02j0077q254q030L4748J580J4089l2614n928J5747J1204k40J7341
7907A3868K3383k5435k206r185K0000r749k1743J2738M0612Q248m603k1612J4576
7894C8892N810p541k0706l6214P335J8889J1178J0959M64k5476j6136J7014J8887
7881B3355j6171k4738M221j38j694P553O700j8631P136O034j3339J4468K5436
7868B0192L19p600j5071o20J0301J0050N320r662N113n586j5514M369Q342Q618
$$ plain form
7854 18571 21892 22408 13294 25880 30381 23122 13559 -1589 11494 26594 1197 -4015 -11159 -34007
7840 -34007 -30054 4140 4757 -9515 -17021 -12441 2700 10363 19429 34952 37972 4248 -14725
7827 -14725 16620 22709 15162 40270 43399 32641 15814 13693 -6351 -25635 -35183 -33749 -26801
7814 -26801 -35660 -11501 10687 21671 17664 12453 24268 10106 12500 -17461 -36996 -28263 -21367
7801 -21367 -1447 10929 -11279 -31301 -10899 13318 -6524 -23767 -15707 -9305 -1810 9135
7789 9135 17129 16597 14710 6243 -16260 -22235 -4975 -4798 11332 20351 30303 23431 28427 -2099
7775 -2099 -22116 -20868 -14330 -25470 -4839 11165 7431 13965 4825 -11690 -22407 -46349 -42827
7762 -42827 -33298 -23513 4577 -1028 -5814 12800 2331 18670 10995 -3123 -10241 -17804 -19217
$$ packed form
7854A8571L321N16r114J2586M501p259r563j5148J3083J5100k5397n212p144k2848
7840c4007L953L4194O17j4272p506M580J5141P663R066J5523L020l3724j8973
7827a4725L1345O089p547K5108L129j0758j6827k121k0044j9284r548J434O948
7814b6801q859K4159K2188J0984m007n211J1815j4162K394k9961j9535Q733O896
7801b1367J9920J2376k2208k0022K0402K4217j9842j7243Q060O402P495J0945
7789I135P994n32j887q467k2503n975J7260J77J6130R019R952o872M996l0526
7775b099k0017J248O538j1140K0631J6004l734O534r140j6515j0717k3942L522
7762d2827R529R785K8090n605m786J8614j0469J6339p675j4118p118p563j413
$$ plain form
7749 -19217 -41137 -24227 7118 20267 -1077 8378 -411 -15542 -18281 5514 20683 28774 17089
7736 17089 31463 42295 37494 6054 -29287 -20420 -1544 -25921 -51264 -54793 -59020 -69283 -46729
7723 -46729 -16745 66 -5624 -8161 -6430 -6896 -9662 -16066 -14966 -1373 7732 10619 9093 7110
7709 7110 7140 -10347 -15860 -13230 -9405 12091 35897 45345 21085 -14519 -36806 -17246 -7696 16121
7695 16121 10947 -5801 -1 17222 25118 9418 -17822 -23790 -22618 1142 11829 -24825 -52224
7682 -52224 -39236 -18106 -2439 -21902 -1207 17884 20461 2847 1257 -3849 -7520 -2872 -2086
7669 -2086 -17746 -29736 -38508 -15738 3999 18822 9659 -558 9536 4250 -16880 -12482 -18787
7656 -18787 -19005 -27896 -17183 -1171 -22598 -25212 -15206 2880 14552 30946 31181 19674 29044
$$ packed form
7749a9217k1920J6910L1345J3149k1344R455q789j5131k739K3795J5169Q091j1685
7736A7089J4374J0832m801l1440l5341Q867J8876k4377k5343l529m227j0263K2554
7723d6729K9984J6811n690k537J731m66k766o404J100J3593R105K887j526j983
7709G110L0j7487n513K630L825K1496K3806R448k4260l5604k2287J9560R550K3817
7695A6121n174j6748N800J7223P896j5700k7240n968J172K3760J0687l6654k7399
7682e2224J2988K1130J5667j9463K0695J9091K577j7614j590n106l671M648P86
7669b086j5660j1990q772K2770J9737J4823r163j0217J0094n286k1130M398o305
7656a8787k18q891J0713J6012k1427k614J0006J8086J1672J6394K35j1507R370
$$ plain form
7643 29044 30517 8718 2396 4906 -7565 -16405 -16848 -13373 -34349 -48807 -34527 998 -2069
7630 -2069 -10832 -5124 -13015 -4568 -17574 -23516 5238 16618 5734 -14224 -5680 5724 -6619
7617 -6619 -36543 -55794 -38794 -2625 -2210 6489 8032 -4589 -2821 -10035 -17979 -3353 -1616 -14067
7603 -14067 -16060 -4246 1412 -34310 -39113 -30005 -20822 -17289 -7096 -10180 -55143 -33088 19706
7590 19706 21878 23157 23449 12026 -3117 -24633 -30109 -30508 777 1172 -725 16111 -14844 -7427
7576 -7427 24794 -3196 -13769 -6449 2357 -2069 12056 7116 -13225 3133 3214 13630 15919 16743
7562 16743 27663 12119 13710 3804 -15620 -345 4528 13432 43589 37773 34029 13785 -1530
7549 -1530 -7089 -3251 -2748 -5967 -33739 -25582 -12971 -24771 -33540 -30029 -18138 -1314 13483 23102
$$ packed form
7643B9044J473k1799o322K510j2471q840m43L475k0976j4458J4280L5525l067
7630b069q763N708p891Q447j3006n942K8754J1380j0884j9958Q544J1404j2343
7617f619k9924j9251J7000L6169M15Q699J543j2621J768p214p944J4626J737j2451
7603a4067j993J1814N658l5722m803R108R183L533J0193l084m4963K2055N2794
7590A9706K172J279K92j1423j5143k1516n476l99L1285L95j897J6836l0955P417
7576g427L2221k7990j0573P320Q806m426J4125m940k0341J6358Q1J0416K289Q24
7562A6743J0920j5544J591r906j9424J5275M873Q904L0157n816l744k0244j5315
7549a530n559L838N03l219k7772Q157J2611j1800q769L511J1891J6824J4797R619
$$ plain form
7535 23102 26810 15160 6495 6105 5481 10332 -4597 -6062 2612 11348 9421 9047 -6302 -14545 -16513
7520 -16513 -15863 6344 -2172 -3082 9342 -6979 -28937 -44200 -63085 -47935 -14284 15478 24695
7507 24695 14599 -2513 16875 14672 -617 -14618 -12503 -1670 28053 36788 32422 27852 24654
7494 24654 -4204 -11714 29760 38175 21610 4245 -5077 2143 -2878 676 3435 11495 1926 -23010
7480 -23010 -32822 2094 2202 6262 11041 5633 2668 -31561 -34327 -14522 31287 55014 57402 62267
7466 62267 45062 -2960 -16852 18760 34975 19881 13806 -2227 -24820 -29517 -17605 -8781
7454 -8781 12028 10631 898 1305 -3900 2122 -2995 15186 7137 3113 -18070 -18696 -23083 -27345 -41333
7439 -41333 -37524 -11020 -16224 -25159 -27593 -34469 -15928 -8653 -5536 -18092 -17295 -21230 -24340 -11749
$$ packed form
7535B3102L708j1650q665l90o24M851j4929j465Q674Q736j927l74j5349q243j968
7520a6513O50K2207q516r10J2424j6321k1958j5263j8885J5150L3651K9762R217
7507B4695j0096j7112J9388k203j5289j4001K115J0833K9723Q735m366m570l198
7494B4654k8858p510M1474Q415j6565j7365r322P220n021L554K759Q060r569k4936
7480b3010r812L4916J08M060M779n408k965l4229k766J9805M5809K3727K388M865
7466F2267j7205m8022j3892L5612J6215j5094o075j6033k2593m697J1912Q824
7454h781K0809j397r733M07n205O022n117J8181q049m024k1183o26m387m262j3988
7439d1333L809K6504n204q935k434o876J8541P275L117j2556P97l935l110J2591
$$ plain form
7425 -11749 7356 -7335 -29555 -26166 -26135 1086 -3752 16752 19577 26925 36732 44579 27390 1471
7411 1471 -16379 -31706 -33893 -37105 -22152 -23184 -15542 -3895 -5084 -25477 -10974 -3481 -10372
7398 -10372 -17600 -5639 -7110 -30776 -28877 -15620 -12285 -16600 -9698 4841 10377 -3495 3146
7385 3146 26462 -7159 -23929 -30375 -33523 -42990 -36496 -26113 -28348 -15746 14057 11143 7456
7372 7456 -4804 -5540 -8425 -8278 -12286 6608 3654 22240 25066 22821 8281 -3701 -27132 -35087
7358 -35087 -11706 -15653 -37781 -24846 -9004 8423 12565 7622 -4406 14966 11631 16317 11461
7345 11461 3092 3692 2623 12812 32363 4418 107 21031 25547 2099 -9366 -14509 -30352
7332 -30352 -17507 -19127 -19353 5580 19938 13890 9754 177 -1717 -5770 16191 3456 -3688 12814
$$ packed form
7425a1749J9105j4691k2220L389L1K7221m838K0504K825P348R807P847j7189k5919
7411A471j7850j5327k187l212J4953j032P642J1647j189k0393J4503P493o891
7398a0372p228J1961j471k3666J899J3257L335m315O902J4539N536j3872O641
7385C146K3316l3621j6770o446l148r467O494J0383k235J2602K9803k914l687
7372G456j2260p36k885J47m008J8894k954J8586K826k245j4540j1982k3431p955
7358c5087K3381l947k2128J2935J5842J7427M142m943j2028J9372l335M686m856
7345A1461q369O00j069J0189J9551k7945m311K0924M516k3448j1465n143j5843
7332c0352J2845j620k26K4933J4358o048m136r577j894m053K1961j2735p144J6502
$$ plain form
7318 12814 21666 15577 -1531 -13939 -20625 -32143 -32932 -34491 -3532 11616 17753 20921 10258
7305 10258 12338 -7227 -25011 -21182 -11780 -689 5836 9757 -15398 -27608 -45833 -37909 -28545
7292 -28545 -19690 -30776 -11748 13207 20818 27573 36675 13205 13632 9812 10295 12930 8336 -8562
7278 -8562 3524 28728 9670 -13967 -15101 3004 27614 31912 12679 4395 12253 -114 -832
7265 -832 20057 18115 -3800 -41925 -52002 -36940 -12724 4048 5708 -5303 -24358 -11263 -6557
7252 -6557 -15433 -23365 -27790 -38890 -22885 -21097 -25296 -20571 -6521 -2646 7369 24162 29765 2432
7238 2432 4889 34864 26739 -7232 -12677 8904 12532 5890 -8384 -21941 -26959 -28482 -7461
7225 -7461 4243 3688 -6908 -4810 5209 10437 17928 18618 20624 20265 9134 -9278 -12754 10253
$$ packed form
7318A2814Q852o089j7108j2408o686j1518p89j559L0959J5148O137L168j0663
7305A0258K080j9565j7784L829R402J1091O525L921k5155j2210j8225P924R364
7292b8545Q855j1086J9028K4955P611O755R102k3470M27l820M83K635m594j6898
7278h562J2086K5204j9058k3637j134J8105K4610M298j9233q284P858j2367p18
7265h32K0889j942k1915l8125j0077J5062K4216J6772J660j1011j9055J3095M706
7252f557q876p932m425j1100J6005J788m199M725J4050L875J0015J6793N603k7333
7238B432K457K9975q125l3971n445K1581L628o642j4274j3557n018j523K1021
7225g461J1704n55j0596K098J0019N228P491O90K006l59j1131j8412l476K3007
$$ plain form
7211 10253 -2817 -14452 -4353 -13670 -26824 -30897 -29910 -8526 10029 22510 15465 3292 -4298
7198 -4298 1507 3165 -15953 -38100 -34780 -13364 3788 10188 228 -11386 4340 22785 37734
7185 37734 799 -14649 -4022 2470 21171 23708 20897 -8265 -15969 -26081 -36400 -20891 12970
7172 12970 18624 -2048 12481 11059 21123 3757 -25315 -836 11033 18846 18118 6673 264
7159 264 25034 31920 16954 -26075 -43844 -37810 -44505 -51970 -15603 12636 10439 -10804 -14377
7146 -14377 -8867 -12830 -18613 -8263 -13813 -10665 -10060 -24621 -41217 -34694 -23083 -2415 -11135 -31043
7132 -31043 -21186 -6659 -5015 -21690 -5842 8435 5661 -19590 -39998 -17929 -13751 8315 17792
7119 17792 4413 -10430 -31764 -4165 23174 44142 25218 9736 3171 -2821 12450 16505
$$ packed form
7211A0253j3070j1635J0099r317j3154m073R87K1384J8555J2481p045j2173p590
7198d298N805J658j9118k2147L320K1416J7152O400r960j1614J5726J8445J4949
7185C7734l6935j5448J0627O492J8701K537k811k9162p704j0112j0319J5509L3861
7172A2970N654k0672J4529j422J0064j7366k9072K4479J1869P813p28j1445o409
7159B64K4770O886j4966m3029j7769O034o695p465L6367K8239k197k1243l573
7146a4377N510l963n783J0350n550L148O05j4561j6596O523J1611K0668q720j9908
7132c1043R857J4527J644j6675J5848J4277k774k5251k0408K2069M178K2066R477
7119A7792j3379j4843k1334K7599K7339K0968j8924j5482o565n992J5271M055
$$ plain form
7107 16505 21186 43171 19954 13426 -867 1860 -5985 -13726 -7427 -9729 -2045 18615 21660 29853
7093 29853 17476 33083 35220 44758 52923 36001 23284 18951 32396 16166 4605 21246 36514
7080 36514 27487 12409 3711 8448 -9722 -6170 6220 -16182 -10402 20238 29898 40773 35168
7067 35168 15670 2868 13452 29150 13365 6092 21816 8898 247 -11899 -21257 -19010 -25255
7054 -25255 -15066 8863 12856 -7 4496 17756 10702 -11986 -18984 -23192 -4099 -12051 -30923
7041 -30923 -41112 -29692 -29947 -34291 -22415 -29520 -53659 -53028 -47488 -27542 -20520 -3846 -7985 9325
7027 9325 18388 17109 6461 -10164 -23635 -11582 -13903 -34565 -35185 -17658 20067 21602 18843
7014 18843 20253 25901 24295 18134 2033 -9202 -41216 -27335 -4695 2860 -24906 -37602 -33553
$$ packed form
7107A6505M681K1985k3217o528j4293K727p845p741O299k302P684K0660L045Q193
7093B9853j2377J5607K137R538Q165j6922j2717m333J3445j6230j1561J6641J5268
7080C6514r027j5078q698M737j8170L552J2390k2402N780L0640R660J0875n605
7067C5168j9498j2802J0584J5698j5785p273J5724j2918q651j2146r358K247o245
7054b5255J0189K3929L993j2863M503J3260p054k2688o998m208J9093p952j8872
7041c0923j0189J1420k55m344J1876p105k4139O31N540J9946P022J6674m139J7310
7027I325R063j279j0648j6625j3471J2053k321k0662o20J7527L7725J535k759
7014A8843J410N648j606o161j6101j1235l2014J3881K2640P555k7766j2696M049
$$ plain form
7001 -33553 -17784 -15168 -21464 -18060 -16905 -34557 -50297 -51405 -30579 -34925 -30161 -6832 7622
6988 7622 18909 -7026 -46163 -42587 -6447 -8892 -11560 -19535 -10670 -16136 -25750 -37941 -52512
6975 -52512 -41120 -35807 -28433 -12293 -14151 -4211 -10862 -11095 -1797 -5398 -21243 -20301 -12080 -11834 -9242
6960 -9242 -6540 4381 -1828 2513 -7996 -38189 -34570 -20994 -20514 -12018 -34245 -41948 -29126 -32458
6946 -32458 -43975 -37853 -13708 -3554 -13630 -1102 5525 -8304 1277 -2573 -1581 -10318 -29572
6933 -29572 -34505 -37452 -16490 -10943 -29203 -16853 -532 20040 45647 53556 49514 42114 20837
6920 20837 -1847 -21219 -23280 -981 -7576 -5871 -20294 -33192 -33059 -29630 -22939 3313 5246
6907 5246 -12281 -3376 10556 9263 -4061 -1804 2163 2656 -9487 -32361 -27833 -23493 -5169 -12
$$ packed form
7001c3553J5769K616o296L404J155j7652j5740j108K0826m346M764K3329J4454
6988G622J1287k5935l9137L576L6140k445k668p975Q865n466r614j2191j4571
6975e2512J1392N313P374J6140j858R940o651k33R298l601j5845R42Q221K46K592
6960i242K702J0921o209M341j0509l0193L619J3576M80Q496k2227p703J2822l332
6946c2458j1517O122K4145J0154j0076J2528O627j3829R581l850R92q737j9254
6933b9572m933k947K0962N547j8260J2350J6321K0572K5607P909m042p400k1277
6920B0837k2684j9372k061K2299o595J705j4423j2898J33L429O691K6252J933
6907E246j7527Q905J3932j293j3324K257L967M93j2143k2874M528M340J8324N157
$$ plain form
6893 -12 5468 8661 4503 -14198 -16334 -41183 -36420 1380 2555 -18938 -35964 -35087 -30922 -17842
6879 -17842 -17455 -22697 -48 13290 3319 -10820 -9179 -5160 -13139 -7765 -6623 -4131 20173 28353
6865 28353 43600 35586 14225 -7942 -8064 18502 13729 -1563 21439 33571 22224 20973 20337
6852 20337 7764 -8758 -15557 -9546 -9729 -16651 -23089 -12660 15754 35023 51862 57232 33689
6839 33689 25387 40927 47066 48000 35470 22528 2787 -24707 -2595 -3607 -28262 -32929 -21308
6826 -21308 -7664 229 6094 -8779 -37568 -30568 -27483 -26518 -32215 -25292 536 8760 16665 -7971
6812 -7971 -28001 -40049 -54038 -41639 -24980 -16203 -15128 -3753 562 5759 18047 12786 8759
6799 8759 27930 49117 44139 23315 23895 2113 -6494 91 3529 -12387 7539 37506 23825
$$ packed form
6893a2N480L193m158j8701k136k4849M763L7800J175k1493j7026Q77M165J3080
6879a7842L87n242K2649J3338r971j4139J641M019p979N374J142K492K4304Q180
6865B8353J5247q014k1361k2167j22K6566m773j5292K3002J2132j1347j251o36
6852B0337j2573j6522o799O011j83o922o438J0429K8414J9269J6839N370k3543
6839C3689q302J5540O139R34j2530j2942j9741k7494K2112j012k4655m667J1621
6826b1308J3644P893N865j4873k8789P000L085R65n697O923K5828Q224P905k4636
6812g971k0030j2048j3989J2399J6659Q777J075J1375M315N197J2288n261m027
6799H759J9171K1187m978k0824N80k1782q607O585L438j5916J9926K9967j3681
$$ plain form
6786 23825 12871 27782 16228 -25773 -39113 -35904 -17049 -19306 -34468 -40064 -21793 -20597 -13413
6773 -13413 6504 -21 -2392 -14993 -25240 -28747 -44126 -20103 -7460 -12952 -12236 -6262 -20923
6760 -20923 -28813 -24123 -3897 -3636 -3070 -13175 -28143 -47175 -80663 -94216 -84197 -54048 -19387
6747 -19387 -10535 -7263 -1388 15593 20390 31052 34881 33162 35218 27092 2056 -17540 -31365
6734 -31365 -14189 -26312 -26690 -31957 -32720 -27296 -5905 -17052 -22591 -31259 -56362 -34828 -19938
6721 -19938 9645 26265 -6221 -10189 -12652 -22474 -10245 9787 17995 21271 13472 32076 26419
6708 26419 -847 -6374 -774 -168 2978 -11794 -14209 13041 2305 1792 9884 1942 -18491 -28784
6694 -28784 -28006 -4282 -6442 12966 27844 17492 6449 3084 4671 1035 10081 -4066 -8261
$$ packed form
6786B3825j0954J4911j1554m2001j3340L209J8855k257j5162n596J8271J196P184
6773a3413J9917o525k371j2601j0247l507j5379K4023J2643n492P16N974j4661
6760b0923p890M690K0226K61N66j0105j4968j9032l3488j3553J0019L0149L4661
6747a9387Q852L272N875J6981M797J0662L829j719K056q126k5036j9596j3825
6734c1365J7176j2123l78n267p63N424K1391j1147n539q668k5103K1534J4890
6721a9938K9583J6620l2486l968k463r822J2229K0032Q208L276p799J8604n657
6708B6419k7266n527N600O06L146j4772k415K7250j0736n13Q092p942k0433j0293
6694b8784P78K3724k160J9408J4878j0352j1043l365J587l636R046j4147m195
$$ plain form
6681 -8261 300 14620 13298 -736 -4363 14832 35018 29073 22812 -13510 -40972 -41107 -35362 -40847
6667 -40847 -24437 -6260 15963 9663 -1370 3306 2713 -4620 -4111 -15456 -20392 -685 18649
6654 18649 12160 -6839 -15904 -29100 -18496 -11571 -10501 -6732 10519 4106 -4963 -22325 -17339
6641 -17339 -17386 -3273 -3804 -19234 -18171 -14774 -28168 -19463 -18939 -32080 -44060 -53555 -51192 -29704
6627 -29704 1510 -5503 -18756 -20464 -5045 4371 -13196 -30632 -6090 15622 15753 10465 4629
6614 4629 9174 31426 33649 21130 -5709 -4094 206 7164 -3776 -2517 4543 -2048 -6378 -18238
6600 -18238 -9715 -4819 -12593 -13115 -22873 -21607 2344 7208 14048 4065 8530 17457 -7639 -5004
6586 -5004 18611 24807 -3108 -5990 18192 6604 2315 -12790 -26585 -26201 -7741 -14230 -13755 -8380
$$ packed form
6681h261Q561J4320j322j4034l627J9195K0186n945o261l6322k7462j35N745n485
6667d0847J6410J8177K2223o300j1033M676n93p333N09j1345m936J9707J9334
6654A8649o489j8999r065j3196J0604O925J070L769J7251o413r069j7362M986
6641a7339m7J4113n31j5430J063L397j3394Q705N24j3141j1980r495K363K1488
6627b9704L1214p013j3253j708J5419R416j7567j7436K4542K1712J31n288n836
6614D629M545K2252K223j2519k6839J615M300O958j0940J259P060o591m330j1860
6600a8238Q523M896p774n22r758J266K3951M864O840r983M465Q927k5096K635
6586e004K3615O196k7915k882K4182j1588m289j5105j3795L84J8460o489M75N375
$$ plain form
6572 -8380 -5774 -6846 12778 -2223 -25174 -20829 5413 24063 29517 32123 16087 1693 -12727
6559 -12727 -2917 11289 26892 24398 20592 16061 -12709 -26711 -47173 -37631 -43409 -55656 -45562
6546 -45562 -39922 -15537 -6696 -869 -4590 -2011 24971 42343 23808 4693 5643 8115 -4908
6533 -4908 -3985 -8454 2503 18192 6840 17187 31785 28504 13809 -13086 -46721 -53235 -20742
$$ packed form
6572h380K606j072J9624j5001k2951M345K6242J8650N454K606j6036j4394j4420
6559a2727R810J4206J5603k494l806m531k8770j4002k0462R542n778j2247J0094
6546d5562N640K4385Q841N827l721K579K6982J7372j8535j9115R50K472j3023
6533d908R23m469J0957J5689j1352J0347J4598l281j4695k6895l3635o514L2493
$$ [...]
##END NTUPLES=NMR SPECTRUM
##END=
