##TITLE=Analysis number 321868
Compound Code cc 02102
Book Reference a
Project Code adrs
Chemist Name tau-chem
##JCAMPDX= 6.0         $$ Bruker NMR JCAMP-DX V2.0
##DATA TYPE= NMR SPECTRUM
##DATA CLASS= NTUPLES
##ORIGIN= Bruker BioSpin GmbH
##OWNER= nmr
$$ XWIN-NMR		Version 3.5
$$ Fri Sep  1 10:27:08 2006 GMT Daylight Time (UT+1h)  MAYBRIDGE\nmr@NMR_250MHZ
##.OBSERVE FREQUENCY= 250.131544655141
##.OBSERVE NUCLEUS= ^1H
##.ACQUISITION MODE= SIMULTANEOUS (DQD)
##.ACQUISITION SCHEME= undefined
##.AVERAGES= 16
##.DIGITISER RES= 18
##SPECTROMETER/DATA SYSTEM= dpx250
##.PULSE SEQUENCE= zg30
##.SOLVENT NAME= CDCl3
##.SHIFT REFERENCE= (INTERNAL, CDCl3, 0, 16.522)
##AUDIT TRAIL= $$ (NUMBER, WHEN, WHO, WHERE, WHAT)
$$ ##TITLE= Audit trail, XWIN-NMR		Version 3.5
$$ ##JCAMPDX= 5.01
$$ ##ORIGIN= Bruker BioSpin GmbH
$$ ##OWNER= nmr
$$ C:\u/data/dgb/nmr/ADRS/60/pdata/1/auditp.txt
$$ ##AUDIT TRAIL=  $$ (NUMBER, WHEN, WHO, WHERE, WHAT)
(   1,<2006-09-01 10:26:43.22 +100>,<MAYBRIDGE\nmr>,<NMR_250MHZ>,
      <created by zg, POWCHK disabled, PULCHK disabled
       configuration hash MD5:
       E2 DF 36 D8 04 B2 41 60 5A D7 A3 38 5A 4B D0 FE
       data hash MD5: 64K
       89 6C 74 05 F9 78 C1 56 73 87 30 75 5B 9E B1 2D>)
(   2,<2006-09-01 10:26:56.97 +100>,<MAYBRIDGE\nmr>,<NMR_250MHZ>,
      <Start of raw data processing
       ef LB = 0.3 FT_mod = 6 PKNL = 1 SI = 32K 
       data hash MD5: 32K
       39 03 CE 55 96 70 68 13 C2 A6 96 40 D7 47 64 F2>)
(   3,<2006-09-01 10:26:58.88 +100>,<MAYBRIDGE\nmr>,<NMR_250MHZ>,
      <apk 
       data hash MD5: 32K
       27 42 19 43 79 93 11 22 9B BF 94 CB 52 F0 3E 57>)
(   4,<2006-09-01 10:27:00.10 +100>,<MAYBRIDGE\nmr>,<NMR_250MHZ>,
      <abs ABSG = 5 
       data hash MD5: 32K
       3C 43 AE F2 DA 42 D2 93 75 D7 1E 29 D8 E5 91 F5>)
$$ ##END=
$$ 
$$ hash MD5
$$ C7 4A 5E FE ED FC D4 DD 8C E6 09 51 B9 49 29 B9
##$RELAX= 
##$RELAX= 
##$RELAX= 
##$RELAX= 
##$RELAX= 
##$RELAX= 
##$RELAX= 
$$ Bruker specific parameters
$$ --------------------------
##$DU= <C:\u>
##$EXPNO= 60
##$NAME= <ADRS>
##$PROCNO= 1
##$TYPE= <nmr>
##$USER= <dgb>
##$AMP= (0..31)
100 100 100 100 100 100 100 100 100 100 100 100 100 100 100 100 100 100 
100 100 100 100 100 100 100 100 100 100 100 100 100 100 
##$AQSEQ= 0
##$AQ_mod= 3
##$AUNM= <au_zg>
##$AUTOPOS= <9 >
##$BF1= 250.13
##$BF2= 250.13
##$BF3= 250.13
##$BF4= 250.13
##$BF5= 500.13
##$BF6= 500.13
##$BF7= 500.13
##$BF8= 500.13
##$BYTORDA= 1
##$CFDGTYP= 0
##$CFRGTYP= 5
##$CHEMSTR= <none>
##$CNST= (0..31)
1 1 145 1 1 1 1 1 1 1 1 1 1 1 1 1 1 1 1 1 1 1 1 1 1 1 1 1 1 1 1 1 
##$CPDPRG= <>
##$CPDPRG1= <>
##$CPDPRG2= <>
##$CPDPRG3= <>
##$CPDPRG4= <mlev>
##$CPDPRG5= <mlev>
##$CPDPRG6= <mlev>
##$CPDPRG7= <mlev>
##$CPDPRG8= <mlev>
##$CPDPRGB= <>
##$CPDPRGT= <>
##$D= (0..31)
0 1 0 0 0 0 0 0 0 0.06 0 0 0 0 0 0 0.0002 0 0 0 0 0 0 0 0 0 0 0 0 0 0 
0 
##$DATE= 1157102800
##$DBL= (0..7)
120 120 120 120 120 120 120 120 
##$DBP= (0..7)
150 150 150 150 150 150 150 150 
##$DBP07= 0
##$DBPNAM0= <>
##$DBPNAM1= <>
$$ [...]
##$SUBNAM7= <"">
##$SUBNAM8= <"">
##$SUBNAM9= <"">
##$SW= 20.6930455092707
##$SWIBOX= (0..15)
0 0 3 0 0 0 0 0 0 0 0 0 0 0 0 0 
##$SW_h= 5175.983436853
##$TD= 65536
##$TD0= 1
##$TE= 296.16
##$TE2= 300
##$TE3= 300
##$TEG= 300
##$TL= (0..7)
0 120 120 120 120 120 120 120 
##$TP= (0..7)
150 150 150 150 150 150 150 150 
##$TP07= 0
##$TPNAME0= <>
##$TPNAME1= <>
##$TPNAME2= <>
##$TPNAME3= <>
##$TPNAME4= <>
##$TPNAME5= <>
##$TPNAME6= <>
##$TPNAME7= <>
##$TPOAL= (0..7)
0.5 0.5 0.5 0.5 0.5 0.5 0.5 0.5 
##$TPOFFS= (0..7)
0 0 0 0 0 0 0 0 
##$TUNHIN= 0
##$TUNHOUT= 0
##$TUNXOUT= 0
##$USERA1= <user>
##$USERA2= <user>
##$USERA3= <user>
##$USERA4= <user>
##$USERA5= <user>
##$V9= 5
##$VALIST= <valist>
##$VCLIST= <CCCCCCCCCCCCCCC>
##$VD= 0
##$VDLIST= <DDDDDDDDDDDDDDD>
##$VPLIST= <PPPPPPPPPPPPPPP>
##$VTLIST= <TTTTTTTTTTTTTTT>
##$WBST= 1024
##$WBSW= 4
##$XGAIN= (0..3)
0 0 0 0 
##$XL= 0
##$YL= 0
##$YMAX_a= 517186
##$YMIN_a= -604140
##$ZGOPTNS= <>
##$ZL1= 120
##$ZL2= 120
##$ZL3= 120
##$ZL4= 120
##$ABSF1= 16.522
##$ABSF2= -4.171173
##$ABSG= 5
##$ABSL= 3
##$ALPHA= 0
##$AQORDER= 0
##$ASSFAC= 0
##$ASSFACI= 0
##$ASSFACX= 0
##$ASSWID= 0
##$AUNMP= <proc_1d>
##$AZFE= 0.1
##$AZFW= 0.1
##$BCFW= 0
##$BC_mod= 0
##$BYTORDP= 0
##$COROFFS= 0
##$CY= 12.5
##$DATMOD= 1
##$DC= 0
##$DFILT= <>
##$DTYPP= 0
##$F1P= 14.0000005364418
##$F2P= -0.99999901652339
##$FCOR= 0.5
##$FTSIZE= 32768
##$FT_mod= 6
##$GAMMA= 0
##$GB= 0
##$INTBC= 1
##$INTSCL= 1
##$ISEN= 128
##$LB= 0.3
##$LEV0= 0
##$LPBIN= 0
##$MAXI= 10000
##$MC2= 0
##$MEAN= 0
##$ME_mod= 0
##$MI= 0
##$NCOEF= 0
##$NC_proc= -4
##$NLEV= 6
##$NOISF1= 0
##$NOISF2= 0
##$NSP= 0
##$NTH_PI= 0
##$NZP= 0
##$OFFSET= 16.522
##$PC= 1
##$PHC0= 144.3049
##$PHC1= 13.42903
##$PH_mod= 1
##$PKNL= yes
##$PPARMOD= 0
##$PSCAL= 4
##$PSIGN= 0
##$REVERSE= no
##$SF= 250.13
##$SI= 32768
##$SIGF1= 0
##$SIGF2= 0
##$SINO= 400
##$SIOLD= 32768
##$SREGLST= <1H.CDCl3>
##$SSB= 0
##$STSI= 32768
##$STSR= 0
##$SW_p= 5175.98343685301
##$SYMM= 0
##$S_DEV= 0
##$TDeff= 65536
##$TDoff= 0
##$TI= <Analysis number 999999
Compound Code 99
Book Reference 9
Project Code 9>
##$TILT= no
##$TM1= 0
##$TM2= 0
##$TOPLEV= 0
##$USERP1= <user>
##$USERP2= <user>
##$USERP3= <user>
##$USERP4= <user>
##$USERP5= <user>
##$WDW= 1
##$XDIM= 32768
##$YMAX_p= 475673241
##$YMIN_p= -764183
$$ End of Bruker specific parameters
$$ ---------------------------------
##NTUPLES= NMR SPECTRUM
##VAR_NAME=  FREQUENCY,     SPECTRUM/REAL,   SPECTRUM/IMAG
##SYMBOL=    X,             R,               I
##VAR_TYPE=  INDEPENDENT,   DEPENDENT,       DEPENDENT
##VAR_FORM=  AFFN,          ASDF,            ASDF
##VAR_DIM=   32768,         32768,           32768
##UNITS=     HZ,            ARBITRARY UNITS, ARBITRARY UNITS
##FACTOR=    0.157963299565203, 1,           1
##FIRST=     4132.6476996994, 0,             0
##LAST=      -1043.33573715361, 0,           0
##MIN=       -1043.33573715361, -764183,     0
##MAX=       4132.6476996994, 475673241,     0
$$ Real data points
##PAGE= N=1
##DATA TABLE= (X++(R..R)), XYDATA
$$ [...]
25381h1220J9954M3586M7569j364l78K2024j5939r205M7005J7624l2184n5l2756
25368B4661k1616j9387l9533k7368L6549j9970K8678O5014j5741k4004K3133N6635
25356F7051j3203l8284o4887j384J3976L3321k334m4294n1691k3909k2466O096
25344a42008K5014J5440O044N6576K6694m8928r03J4261L0999M3357l6653k5409
25332c5516J0760p86j173k2379n693k3814L234J0702K4837j1724K4123K2878j3318
25319a7869l9021L4565N088k2719M700j848R317N951K0236N3947J2526j9828R452
25306E4497M0447L6611j1397l2336j4855l4342m9367M8400n711p7354l1892M4087
25294c3212L5549n2812k3758N087K6817K453L3929j1374J0801K7847l5493p263
$$ y = [-81220, -61266, -17680, 29889, 28525, 28147, 50171, 34232, 25027, 72032, 89656, 57472, 57417, 24661, 3045, -16342, -55875, -83243, -46694, -66664, -37986, 27028, 11287, -12717, 10416, 67051, 53848, 15564, -49323, -50707, -36731, -3410, -5744, -50038, -101729, -125638, -148104, -142008, -116994, -101554, -95510, -38934, -12240, -61168, -62071, -47810, -16811, 26546, -10107, -35516, -24756, -25542, -26715, -49094, -54787, -78601, -75367, -64665, -39828, -51552, -27429, -4551, -17869, -56890, -22325, -17237, -39956, -35256, -37104, -27787, -21836, -1600, 52347, 64873, 45045, 54497, 94944, 131555, 120158, 87822, 72967, 38625, -10742, 37658, 31947, -45407, -77299, -33212, 2337, -50475, -74233, -69146, -42329, -39876, -5947, -17321, -6520, 21327, -14166, -21429]
25282b1429O6022k1179J9644k9585O402J481j3927j4420M7110J3508m1983O290
25270A7934M5189m8471k7396L6390P5881l3039k5510l7111m8047j9864L9188O180
25258a8676M7241L2934k8797J6599k3930l8837J2243N6148N9808J3041n8273k1822
25246D7679n576j2446m380O2035L6373n9555m0849M6576q13l9837j2907N9167
25234G5467Q414n5740k7589j8425j7747M0013l7104J0489L4227J0154P595K7503
25222E7257O769k5992J886O750m4877k7872N0806L3194P230o5274m3531M1156
25210b498P493O81k510P3510M4822j1051m0169n8636r5699m700N1061L577M4525
25197A0406j7827J9834N7823q689k5680j002r545r029R877m2408j7185L3114J1151
$$ y = [-21429, 44593, 23414, 43058, 13473, 19875, 21356, 7429, -6991, 40119, 53627, 11644, 17934, 63123, 14652, -12744, 23646, 99527, 66488, 40978, 3867, -44180, -64044, -24856, -18676, 28565, 61499, 32702, 49301, 25371, -13466, -1223, 54925, 114733, 127774, 69501, 47679, 42103, 29657, 25277, 87312, 123685, 64130, 23281, 69857, 69044, 29207, 16300, 75467, 83881, 28141, 552, -17873, -35620, 4393, -32711, -22222, 12005, 22159, 29754, 57257, 64026, 38034, 39920, 46670, 1793, -26079, 24727, 57921, 65151, -123, -43654, -2498, 4995, 5676, 3166, 76676, 121498, 110447, 70278, 11642, -84057, -88757, -37696, -34119, 10406, -7421, 12413, 70236, 61547, 35867, 34865, 25320, 16291, 26168, -16240, -33425, -311, 10840]
25184A0840m3321l4164m401R2864O4907m8699n752l6732j3622K9271J8227L4240
25172F3658n803J950k4958k9921j0391M210j8485j2024J0607n324n3397k9566
25160a09444O1109N781k800O028K369L5860l3395l1812L2884R169k4770J04124
25148E5103O9104j1450J0941r185l2796m6812k0767K208q008j4343R70J4145L7633
25135D6743j9021J2896j3445j1976r215l3047q0211J9695N1212K8517J1265j8815
25123a5402K2295O5635L3914K5433m2778n9134m5409j6333L223m4859q97J0228
25111f4084M9607M2739L6226l6966l7050m1324j5777P1176L6747J1541L659l9439
25099A7055p4671O162J6327n1103j1318J1870J6157J7219J0730p89L9070K7642
$$ y = [10840, -32481, -66645, -71046, 21818, 86725, 38026, 32274, -4458, -18080, 11191, 29418, 63658, 57855, 59805, 34847, 4926, -5465, -1255, -19740, -31764, -21157, -26481, -79878, -109444, -48335, -42554, -45354, -39326, -36957, -1097, -34492, -66304, -33420, -24251, -49021, 55103, 124207, 112757, 123698, 114513, 81717, 34905, 14138, 16346, 8338, -6005, -5035, 9110, 46743, 27722, 40618, 27173, 15197, 5982, -27065, -107276, -87581, -36369, -7852, 3413, -15402, 6893, 72528, 106442, 131875, 89097, 29963, -15446, -31779, -28556, -73415, -74312, -64084, -14477, 28262, 64488, 27522, -9528, -50852, -66629, 4547, 41294, 52835, 56494, 17055, -57616, -51454, -35127, -86230, -97548, -85678, -69521, -52302, -41572, -42361, -3291, 24351]
25087B4351l683n534K8752J2363n7709j1182l1814r855K2886O3309K8580n4970
25075E494j5500m703q379K7611M7335k6540j9935J0183L0907k4132m2747j8407
25063c8813O4358J493m9804K8563J256j3388P0861M0387n6337l9407l4605K9531
25051D095m3460J516l5513N6936O2764k196L428o2434j385L0602J9386j833o515
25038B5391l6361J7682o026l7158N978N2303j6720k3901R411L282L285O7358L0658
25025I5182j7383n7643j0260m37J7595m4435j6528P006L9604j7114j866j6132
25013b2411j5321m4071J4763N9798k4888n2683l984Q9552L7773n3813L0703J9032
25001C4450J9889j4245n152o3729q417J8834N4630r029m9764o379L0423l5007
$$ y = [24351, 20668, 15134, 43886, 56249, -1460, -12642, -44456, -54311, -31425, 31884, 60464, 5494, -10006, -14709, -23088, 4523, 51858, 25318, 5383, 15566, 46473, 22341, -20406, -38813, 25545, 27038, -22766, 5797, 7053, -6335, 64526, 104913, 48576, 9169, -25436, 4095, -39365, -37849, -73362, -16426, 46338, 44142, 47570, -14864, -16249, 14353, 33739, 31906, 25391, -10970, 6712, 686, -36472, -30494, 21809, 5089, -18812, -9401, -6119, -2834, 64524, 95182, 77799, 20156, 9896, 9459, 27054, -17381, -33909, -26903, 12701, -4413, -6279, -22411, -37732, -81803, -67040, -7242, -32130, -84813, -88797, 755, 38528, -15285, 15418, 34450, 54339, 40094, 34942, -28787, -37204, -18370, 36260, 27231, -22533, -28912, 1511, -33496]
24989c3496l3681K1991O5046K0351o070m0781n3938m1385J03743O9830m253j0882
24977E6475j0574j2326m4640k6229K7331k804J5023R608n857J473J3831J9116
24965D0427l7281j3796K2635j0325m1644J7663O7596n614L3638M7607j719k5721
24953I3466j7013L2362J6749o3384k0541k2849j0959m9714j8752L1116l7354l452
24941g0325M2408K6713j799L1610k7302l9988L462J0818o947J3632P109J2978
24929B369N5359m436n6400l7283L1091M6628K788j9678k4986k8236K5194j2397
24917a9987j7391p218K7585L9014J6904j5131m3517l5244O2149J4075O89j838
24905B0090N0964O9838n2003j6704J776n5486l2052K0811p860k0159L9728q988
$$ y = [-33496, -67177, -45186, 19860, 40211, 34141, -6640, -60578, -101963, 1780, 71610, 67357, 56475, 45901, 33575, -11065, -37294, -9963, -12767, 2256, 11864, 6007, 7480, 21311, 40427, 3146, -10650, 11985, 1660, -39984, -22321, 45275, 39661, 73299, 120906, 119187, 93466, 76453, 108815, 125564, 62180, 41639, 18790, 7831, -41883, -60635, -29519, -66873, -70325, -27917, -1204, -3003, 28607, 1305, -38683, -35221, -24403, -31350, -17718, -10609, 2369, 57728, 53292, -3108, -40391, -9300, 37328, 40116, 20438, -4548, -32784, -7590, -19987, -37378, -44596, -17011, 22003, 38907, 23776, -19741, -54985, 7164, 21239, 21928, 20090, 71054, 140892, 88889, 72185, 73961, 18475, -13577, 7234, -626, -20785, 18943, 9955]
24893I955J919k8232n792L9237k473J260n4575K86K9399N1307N6822j3750k4069
24880F1294o6850r1429N422P8698j162l1399j4882k714L9410L2410J0655K2134
24868D1587j6532j120n3034j8133N3582j7531K0146O6672K4085l3621l5631k421
24856B8049n563l8628j3352q960O5748M1606n940j5233j9885m5582l1141J1839
24844c7042j2703K3277N582K1934M798J3446n1856k0221P4536Q286N330L0675
24832F6042l1074n79m6182L8671M935M212R32l0374M1086k6104q1165l5127j9552
24819a14279M8866O8399l1028l5703L4628K475K5714K7573K3401J6392k3541L503
24807D6400k8927j7757j2237o606N1525M5646k2842p9239l3567j2364J9672K8742
$$ y = [9955, 11874, -16358, -22150, 17087, 14614, 15874, -38701, -38415, -9016, 42291, 99113, 85363, 61294, -5556, -96985, -91563, -12865, -14027, -45426, -60308, -63022, -23612, 8798, 19453, 41587, 25055, 23935, -29099, -47232, 6350, -11181, 8965, 75637, 99722, 66101, 30470, 28049, 22486, -16142, -29494, -38454, 27294, 68900, 62960, 47727, 27842, -17740, -48881, -37042, -49745, -26468, -20886, 1048, 5846, 19292, -32564, -52785, 21751, 30037, 35367, 66042, 34968, 34389, -11793, 26878, 31813, 36025, 36957, 6583, 47669, 21565, -59600, -94727, -114279, -65413, 2986, -28042, -63745, -29117, -26642, -928, 26645, 50046, 66438, 42897, 46400, 17473, -284, -12521, -19127, 32398, 78044, 55202, -24037, -57604, -69968, -50296, -21554]
24795b1554l29k6259l3946k1843O9180K9031j6767m7578J5669M3002J4500l2587
24783b9481j8252o294j0397n398J2613J3050l0162O2753N279j8405m8366q377
24771h1437M3810j338P008n7605J9195J01389M9182j5318k7061k7114j4814l9765
24759d3868L6830M594j2820N0016K2210k5345m2802L0582O2342N876r9646k5772
24747c7803j2862P565l266M2625J7666j1799J655k1128j834j6076m5826L4664
24735d6419J5934j9200L9863L8570k7006Q399k900n0634j4504n5041J1518O87
24723a00733K3736L5529J9540l2966J2545L5104k4094k1323N1328L0795j6484
24712A2977m4781M1627m749j6940l6405k0433j6309J3132k1946J8001N7062J9831
$$ y = [-21554, -21883, -48142, -82088, -103931, -34751, -5720, -22487, -70065, -54396, -11394, 3106, -29481, -47733, -54027, -64424, -69822, -57209, -44159, -74321, -11568, -6289, -24694, -73060, -81437, -37627, -38965, -31957, -89562, -70367, 31022, 80204, 64886, 37825, 10711, -4103, -43868, -7038, -2444, -15264, 34752, 56962, 31617, -11185, 19397, 81739, 87615, -12031, -37803, -50665, -43100, -46366, -3741, 13925, 2126, 3781, -17347, -19181, -35257, -81083, -46419, -30485, -49685, -9822, 28748, 1742, 10141, 7241, -43393, -57897, -112938, -101420, -100733, -76997, -41468, -21928, -54894, -42349, -7245, -31339, -52662, -1334, 29461, 12977, -31804, 9823, 5074, -11866, -48271, -68704, -85013, -71881, -93827, -75826, -18764, 1067]
24700A067L6749J2360j0578Q610k8097K3639k1359n5673j9731K8810J8534L6932
24688C1263k805j3980j5436j6979K168K0604r301L4612J4499n9963Q279N1596
24676D4557N0184K4039n0827o3715l3756O20P8282l699m3214n2791N0999j4050
24664a3371k0953K5770L8670O032J9340K880L9753J9672n2492l6658L4638j3751
24652D9530q9503l0838J5157M6144j3385J9268N2236p257m2292p313K0059k2340
24640a0534M102R564L1190l5760j67J5463m2423l9123p680R638l4711j4849M3239
24627g2051P4094M4910j3478k7065n1377j8525m6811M217M4234P5732N3549K212
24615F9641n7201m6041M7248K1406O0292j5095j0610l554k3293j1348j2033K0339
$$ y = [1067, 37816, 50176, 39598, 48208, 20111, 43750, 22391, -33282, -53013, -24203, -5669, 31263, 28458, 14478, -958, -17937, -15769, 4835, -4466, 30146, 44645, -15318, -7039, 44557, 94741, 118780, 67953, 4238, -29518, -28898, 49384, 45685, 2471, -50320, 679, -13371, -34324, -8554, 30116, 36148, 55488, 58368, 98121, 117793, 65301, 28643, 63281, 49530, -39973, -70811, -55654, -9510, -22895, -3627, 48609, 41352, -940, -8253, 11806, -10534, -6432, 3132, 34322, -1438, -1605, 13858, -28565, -67688, -75368, -65730, -100441, -115290, -72051, 2043, 46953, 33475, 6410, -44967, -63492, -110303, -106086, -61852, 13880, 67429, 69641, 12440, -33601, 13647, 35053, 95345, 80250, 69640, 66086, 42793, 31445, 19412, 39751]
24603C9751o619m9843m8638J9874O195k5918M3540J9272J3544L841n4842m5640
24591h5483M5444K036J5046k2787M2849J8277k5575l6230J5106m121L9139K8890
24579C2591n1362K2797j39L1174j9950o4242J7498K9505N9671m403l0348K5220
24567D8012P326n859k888o909n577r027K514n2775K959o649l2850L2280j4182
24554d3625l8643M0202J3746j5166P2369K5510O571P388n734l4865p9356k9601
24542h1204L2735q50J7329J4526l7073J5435P2274K5223O0005N780l280l1687
24530H9213j0851k6538m9197m9545K4252N3277O559j744M347k0571r483P837J2043
24517B9599J2984k1034n444J581P585l0128J9452Q059l8960l2047m9689l0239
$$ y = [39751, 33132, -16711, -65349, -45475, -39280, -65198, -21658, -2386, 11158, 14999, -39843, -85483, -40039, -38003, -22957, -45744, -2895, 15382, -10193, -46423, -31317, -35438, 3701, 32591, -18771, 4026, 3887, 35061, 15111, -49131, -31633, -2128, 57543, 53140, 22792, 48012, 55338, 49479, 46591, 39682, 34105, 25078, 27592, -25183, -22224, -28873, -61723, -29443, -43625, -82268, -42066, -28320, -43486, 28883, 54393, 60964, 68352, 62618, 27753, -51603, -81204, -48469, -49319, -31990, -17464, -54537, -39102, 33172, 58395, 118400, 124180, 120900, 89213, 78362, 51824, 2627, -46918, -22666, 30611, 37170, 35426, 39773, 19202, 9719, 17556, 29599, 42583, 21549, 16105, 17686, 25271, -4857, 14595, 22654, -16306, -48353, -98042, -128281]
24505a28281l0797O3307P2934J7371n0663k3239K7886j4844l8021m028O6764L7913
24493c698l2165o1152l2007L7526L5077M227R0208J5923n491l2361L071J6913
24481C6071j2275m7101R549R031N284m4472J0408l668J7788J4696J7995j2642
24469F64K3295q079l2169R827J588r834L0709l4869J6164L3120n8167J19K2337
24456e295o367J8635K3189j8194n2708p4402K812P7554K0889j8638M8021J7001
24444C2497k4771l1485l2764N0795K0921M883K4760k6992l903K1982j8263q8942
24432g1282r495R965M1341j0338j6610m4968J2742M5021Q6323M338r995n9745
24420b2703J8222K0982n0997Q90l314M1813J9774J1056J4171L0978l7067K6758
$$ y = [-128281, -159078, -95771, -22837, -5466, -56129, -79368, -51482, -66326, -104347, -108375, -41611, -3698, -35863, -97015, -129022, -91496, -56419, -52192, 38016, 53939, 48448, 16087, 19158, 36071, 23796, -23305, -13756, -4725, 559, -43913, -33505, -37173, -19385, -4689, 13306, 664, 23959, 15880, -16289, -6462, -4874, -14708, 16001, -18868, -2704, 30416, -27751, -27632, -5295, -11662, 6973, 30162, 11968, -40740, -115142, -112330, -34776, -13887, -32525, 15496, 32497, 7726, -23759, -56523, -5728, 15193, 20076, 44836, 17844, 13941, 35923, 17660, -71282, -80777, -70812, -29471, -39809, -56419, -101387, -88645, -43624, 42699, 47037, 37042, -22703, -4481, 16501, -34496, -33606, -36920, 4893, 24667, 35723, 49894, 80872, 43805, 70563]
24408G0563J4905R728k8082j5658j7271k7363m1761O0990J9441n4078q4067L974
24396h8679J3608K4193J0540K7725O664K2149M0409K734K8349P6249l0380r3528
24384D0033Q353k6272M4944l1783m6923o2304j5005J1356J2215J6732N7875J9836
24372B9057j612J365k1963q39r007J3200L4220J4362R828O223J6641k9654j7571
24359D4250m8725j2712p53K5118N492K9853K5069k0279N139R298l5077k9540J1499
24346H632J2435l793p09m4893p8976J3767P7990K8258n0470o369J6547j2049j763
24333d1393J068J6316N8498M804m5917j3852K8769O556l8432o3781M2971M3670
24321g23K3188j0530j6186O695j1780j3633N988m8311L2782L3826k1316P149K1865
$$ y = [70563, 85468, 95196, 67114, 51456, 34185, 6822, -34939, 26051, 45492, -8586, -92653, -88679, -75071, -50878, -40338, -12613, -5949, 16200, 56609, 59343, 87692, 163941, 133561, 40033, 48386, 22114, 67058, 35275, -11648, -73952, -88957, -77601, -65386, -48654, 9221, 29057, 27445, 28810, 6847, 6008, -2999, 10201, 44421, 58783, 68611, 74834, 91475, 61821, 44250, -4475, -17187, -17940, 7178, 12670, 42523, 67592, 47313, 52452, 61750, 26673, -2867, 8632, 21067, 17274, 16565, -28328, -107304, -93537, -15547, 12711, -37759, -44128, -27581, -39630, -41393, -40325, -24009, 34489, 39293, -6624, -20476, 8293, 14849, -23583, -87364, -44393, -723, 22465, 11935, -4251, 2444, -9336, -22969, -16981, -65292, -32510, 1316, -20000, -12851, 9014]
24308I014n4573m0980k9K4065K5212J7563M442j6326K4526L0634k934l6211k1590
24295c7187j2078l2443J2537M9808j7008J8989n071r45k7019O844K5124J1503
24283f946k3749k6232O1991M2278k4162L1223L4100K0166o2247m7209M2419N1532
24271I3164k53k8545j0000K7732L7143q400n2234K9710J1571m1627n0522k5863
24259a8124m191N3470o061K3698q639k4317k2115j3680L5936k580m7805M118j935
24246c2225L5662m9612m498K6378K847J6165j0977J6328O3859j3584q1065j1950
24234d2672M3906k3566k8551L3162j6040k9829L721M3317r305K180L0182J8398
24222B4903j9081j6231K2141L1235R772j6297l2102n3339J0132L0870L6589K69
$$ y = [9014, -45559, -86539, -86568, -62503, -37291, -19728, -15286, -31612, -7086, 23548, 20614, -15597, -37187, -49265, -81708, -69171, -19363, -36371, -17382, -22453, -23398, -50417, -43573, -18449, -6946, -30695, -56927, 5064, 47342, 23180, 54403, 88503, 108669, 46422, -787, 41632, 93164, 92911, 64366, 54366, 82098, 119241, 110841, 58607, 88317, 99888, 58261, 7739, -18124, -22315, 31155, 25094, 48792, 40153, 15836, -6279, -19959, 15977, 13397, -34408, -30290, -32225, 3437, -46175, -50673, -24295, -21448, -5283, -16260, 68, 63927, 50343, -30722, -42672, 1234, -22332, -50883, -17721, -33761, -63590, -59869, -16552, -25857, -23677, 6505, 24903, 5822, -10409, 11732, 42967, 52739, 36442, 4340, -48999, -38867, -7997, 28592, 28861]
24210B8861m9834j5034K455p741o672m998m264k1981k862M4351L3372P0M0648
24197C6371o525m9829j2961O60j6151k779k705J1619P615k9301P295p296J5712
24184d8275l5294j7850L9157O2635j9493k5602J9022J7605k8661K9903L3894j9591
24172G450p067M1052M2181l0459l9818j4069n1009k717j0213q133M4390l4040
24160f2452m863K6658M2315K3989K9575n180k4678K0259k5821k2414k0386P715
24148a5283J8501J45M9480r574J6831K7591J6408r0870k5330J5977J3072j4224
24136B724j725l727o0269k9825O0595P3139L4240k9487j3984j6854K9905k0426
24124B4306m7270j3897J9085J1884l3284j3344J7188R250O1134O491k3733n484
$$ y = [28861, -20973, -36007, -33552, -41293, -47965, -52963, -57227, -79208, -82070, -37719, -4347, -4277, 36371, 29846, -19983, -32944, -32284, -48435, -51214, -53919, -42300, -34685, -63986, -56691, -63987, -48275, -83569, -101419, -62262, 373, -19120, -44722, -25700, -8095, -36756, -6853, 27041, 7450, 383, 41435, 83616, 53157, 13339, -730, -51739, -54456, -64669, -72802, -28412, -62452, -67315, -40657, 1658, 25647, 55222, 50042, 25364, 45623, 19802, -2612, -22998, -15283, 3218, 3363, 52843, 43269, 60100, 87691, 104099, 13229, -12101, 3876, 16948, 2724, 999, -2728, -62997, -92822, -32227, 40912, 75152, 45665, 31681, 14827, 44732, 24306, -22964, -36861, -17776, -5892, -39176, -52520, -35332, -26082, 35052, 41543, 17810, 12326]
24112A2326l5021j4587J2015K8121l8072k1335K8231K5791o7445j3393J8689N2341
24100a2339p904l050L954J2366N084R064r003l2819M2766K4498n7410m3462J1589
24087e6666J05413L7824k5153m4882k8441k8067p286L3534M561J4393O188k7229
24075a5811J4488O280R965o449j0684m043j5644q033O7714J0737p391l2212m4194
24062c5277j6542K5007L8570M5195p9449l8131P3261j4967l0671j3895K9140q803
24050b6562k9401K6557j0950m6704O289K4255K2375L3111p97o371l147n9555j3725
24037h4625L0746M0709K5298k2969n6721l9241k7821N8995L9719k6824K274J2782
24025d7678j6359m6342J5099K8137P8244M1834p961j8618L6780K2992j1098j1913
$$ y = [12326, -22695, -37282, -25267, 2854, -35218, -56553, -28322, -2531, -69976, -83369, -64680, -12339, -20243, -23293, -19339, -6973, -1889, 7175, -1828, -34647, 8119, 32617, -24793, -68255, -56666, 48747, 86571, 61418, 16536, -11905, -39972, -47258, -13724, -9163, 5230, 11418, -15811, -1323, 4957, 14922, 8473, -2211, -6254, -21898, -29931, 37783, 48520, 41129, 8917, -35277, -51819, -26812, 11758, 56953, -22496, -60627, 12634, -2333, -33004, -46899, -17759, -26562, -55963, -29406, -40356, -87060, -80771, -56516, -34141, -1030, -1827, -8198, -11345, -70900, -84625, -53879, -13170, 12128, -10841, -67562, -106803, -134624, -75629, -35910, -62734, -60460, -47678, -64037, -110379, -95280, -67143, 11101, 52935, 44974, 26356, 63136, 86128, 75030, 63117]
24013F3117l6321l8864K5310R446j6010J1063Q641l1036L189p19J3448n944j8211
24000a2891L9024j3385n1097O25N5882j94l1329o838L6535m1437o6436L1424K0172
23987c9945K940O2811k1633k2887k8066J2371K0536J6238N2827j4211m6017J0670
23975E634Q671j483j5771j3569K2681p213K625n752o9433o5550M6093N1696l0884
23962g2255K4968o441k1331L3932O9816J5617Q83Q997j6171M9498m9690o3484
23950b5661J5969O3278o876l1700k4515j4448m8051N232L9162L6531J2645J951
23938B3517J1112l7552l6885k5117l5944O0985m118K7115M0433M858l2327M304
23926C81O509L5907p666p3011j6098J7424L5384j3043n563K9466m451n492j5808
$$ y = [63117, 26796, -12068, 13242, 22688, 6678, 17741, 26382, -4654, -1465, -2184, 11264, 5320, -12891, 26133, 12748, -38349, -37724, 18158, 17964, -13365, -20203, 16332, -25105, -91541, -60117, -39945, -37005, 25806, 4173, -18714, -46780, -34409, -13873, 2365, 55192, 40981, -5036, 5634, 14305, 12822, -2949, -16518, 6163, -1050, 1575, -4177, -73610, -139160, -93067, -41371, -72255, -47287, -53728, -75059, -41127, 28689, 44306, 45189, 54186, 38015, 87513, 37823, -25661, -9692, 53586, 46710, 15010, -9505, -23953, -72004, -66772, -27610, 8921, 21566, 23517, 34629, -2923, -39808, -64925, -100869, -39884, -44002, -16887, 23546, 28404, -3923, 381, 6890, 42797, 35131, -37880, -53978, -36554, -1170, -14213, -19776, 9690, 5239, -253, -16061]
23913a6061j127K0545K1550o2232J6988L376J646J4731R3886m1092o6348k6431
23901d0569q889K2683J9456m689L4895k4846J2022J9295q627p879q549L72p020
23888b345j3932K0549J5229J4754k2130J3407j9825j4895J1056j1713K9358l1653
23876a2140j3311K1398K3348M0494K4949l8301l986K7201k0038n2950j2221l5292
23864e0849J6185J1427n0537L8711J3261q114n7290m3354j9993N0911M8181k0529
23852g1990j2035M2311M2693L44M6721j8433j7399P76k4062k7580m4094N257L6697
23839d0794j1647j1349K6947J3669K156n0456l9840m8953j5141O4226N5926J9014
23827c6242K1038l8607K5810M4051O4433k4797N9M8934K7923j6100j6343n6072
$$ y = [-16061, -17188, 3357, 24907, -37325, -20337, -16961, -15315, -584, 93302, 52210, -14138, -40569, -49458, -26775, -7319, -12008, 22887, -1959, 10063, 29358, 20731, 12852, 4303, 4675, -2345, -16277, 4272, 19501, 34255, 12125, 25532, 5707, -9188, 1868, -9845, 19513, -12140, -25451, -4053, 19295, 59789, 84738, 46437, 42451, 69652, 49614, -3336, -15557, -50849, -34664, -23237, -73774, -35063, -21802, -29916, -87206, -130560, -150553, -99642, -51461, -71990, -84025, -41714, 979, 1323, 48044, 29611, 12212, 12988, -11074, -38654, -82748, -77491, -40794, -52441, -63790, -36843, -23174, -21018, -71474, -111314, -160267, -175408, -111182, -55256, -36242, -15204, -53811, -28001, 16050, 80483, 55686, 55745, 104679, 132602, 116502, 100159, 44087]
23815D4087j3537J2086K2601j2079k0395k1883L1270k6270J3684L7887q897k9068
23803B9486n0396q053M6986L7085k3822K1722j7498m1641k3765O223J690K7621
23791E638n462m1898j2298j2541k7149K8535R5802K6876m3079k5805M772J73n001
23778a1437l4901P753M4699P509r665q159L6201M0875K1908j4329j11657l1420
23766f2623L865M7570O577K2678j1565R55K0513k0083o1197J9794M1378Q719m5807
23753b9226l9646K46r465M3823J7259K7033J5414j9458j1280j7890j609L6934
23741A2135M7556m2894m5089l7248M9178Q3501k7777j6904k3975l6329m845J5199
23729b7492J7891j290j051k5851j4640O7179M9804J5611l8266q2771m1095P627
$$ y = [44087, 30550, 42636, 65237, 53158, 32763, 10880, 42150, 15880, 29564, 67451, 58554, 29486, -20910, -28963, 18023, 55108, 31286, 53008, 35510, -6131, -29896, -23673, -21983, 5638, 176, -41722, -54020, -66561, -93710, -65175, 30627, 57503, 14424, -11381, -6609, -6436, -11437, -46338, -38585, 6114, 13623, 3958, -4201, 32000, 72875, 94783, 80454, -31203, -62623, -58758, -11188, -4611, 18067, 6502, 7457, 27970, 7887, -53310, -33516, 7862, 16581, -29226, -68872, -68626, -78091, -34268, -17009, 10024, 25438, 5980, -5300, -23190, -24799, 12135, 59691, 16797, -28292, -65540, -16362, 67139, 39362, 22458, -1517, -37846, -42691, -27492, -9601, -10891, -11942, -37793, -52433, 14746, 64550, 80161, 41895, -40876, -81971, -74344]
23717g4344K0827Q2395L2408L7807m0047L084K098r948n4281l5352m261K4177
23705a5437q654P358K9726L3294r49k0499j05429p1792M4009j9741R694N3344
23693f5076Q4121j8827m5905l2324p862N5881q599l720j3613L2807L3103N1254
23681F1240J467n1476m1356J7285K6435K246K2508j1875k6179l4484L9836M8264
23669E3911j2763l2127j7538K5059k4286J1366L9213J684j3242M5694N0620k7657
23657I9934K3216K8021r4589n8958L7463K7656k6572n1133k7620M4397j5842o4699
23645g8726k0615k261j9319L8639Q7357O4608m839k5111m598N877K1017k2451
23633C9578o1184M3559L8812j5415p782M173l7006q745J9598Q702N0663j6378
$$ y = [-74344, -53517, 28878, 61286, 99093, 59046, 62130, 64228, 54280, -1, -35353, -39614, -15437, -24091, -16733, 12993, 46287, 45338, 24839, -80590, -152382, -108373, -128114, -118420, -65076, 19045, 218, -45687, -78011, -85873, -29992, -38591, -42311, -55924, -23117, 9986, 61240, 62707, 11231, -30125, -12840, 13595, 15841, 38349, 26474, 295, -34189, 5647, 53911, 41148, 9021, -8517, 16542, -7744, 3622, 42835, 44519, 31277, 76971, 127591, 99934, 123150, 151171, 56582, -2376, 35087, 62743, 36171, -14962, -42582, 1815, -14027, -78726, -99341, -101602, -120921, -82282, 5075, 69683, 64844, 39733, 35135, 41012, 62029, 39578, -21606, 21953, 60765, 45350, 37568, 41741, 4735, -4010, 15588, 24290, 74953, 58575]
23621E8575j6062O6353o0276o2289P940k3103n4091R299K2691k0299k7662M0159
23609e8765P1344N8876N537l6298n1741k2234j4218M78m615P219j6226O19L4371
23596b5653L1411K7233M504j1835n937J7003n9306l4919M7583M3667o3289l5273
23584f4811J2156J7096l2579K587J78K9367J1906j9520m0068K4360O3338N89j7479
23571a2880k7319l5781k0159k4791L0211J02984J0857q710K1689m1330j0396k783
23559a8408l8354M6868L9041J9608J7345l9368K1519m5636J1972k7374j7884L0472
23547a99k0011q750K4617L3611j3198j1209m3054p417j4102K3821P5676M8189
23535H7974k7998l6213K2941l0434J4457l674o3739k5992J2473L0093N900j7176
$$ y = [58575, 42513, 108866, 48590, -13699, -5759, -28862, -82953, -73654, -50963, -71262, -98924, -58765, 12579, 71455, 76992, 40694, -11047, -33281, -47499, -47021, -51636, -44417, -60643, -60024, -25653, 5758, 32991, 37495, 25660, 19723, 36726, -22580, -57499, -9916, 33751, -29538, -64811, -52655, -35559, -68138, -65551, -65373, -36006, -24100, -43620, -83688, -59328, 4010, 4599, -12880, -40199, -75980, -96139, -120930, -90719, 12265, 23122, 14412, 36101, -5229, -15625, -18408, -56762, -9894, 29147, 48755, 66100, 26732, 48251, 2615, 14587, -12787, -30671, -199, -20210, -28960, -4343, 29268, 16070, 4861, -38193, -45610, -59712, -35891, 39785, 87974, 59976, 23763, 46704, 16270, 30727, 27053, -36686, -62678, -50205, -20112, -14212, -31388]
23523c1388O88l7636L5381K0308J464k8495l0289K2654P478L9847M6229K91n8070
23510a1538j0853O3380K2298k2858l3817o9j4616P330j7119M3229M0406K2380
23498H8153m4655m3663m7354k3512L6324n246k2824L0124K6889l2663J5566K5372
23486B511L2450M460J9543l9070M639n1617k344L9031L1915n3451n8447q6675
23474a57055O0769Q2392k4949l3792Q491K1900L7501p809m5140j8081K5834M5964
23462c975M0460J6075j8675r223K055l597k9818m7470j2509j764J2999j1997O523
23449f0916O2334L4419N930k433j5797K461L3557L7457q5641o0436l45O8811M6353
23436F5754M4413L9559j1340m4109k8673j7629L9072j5284j1061J1950j6988O208
$$ y = [-31388, -30700, -68336, -32955, -12647, -11183, -39678, -69967, -47313, -39835, 12, 46241, 46532, -11538, -22391, 40989, 63287, 40429, 6612, 6543, -8073, -743, -17862, 25367, 65773, 88153, 43498, -165, -47519, -71031, -34707, -39953, -62777, -32653, -5764, -38427, -22861, 2511, 34961, 39421, 58964, 19894, 24533, -27084, -29428, 9603, 41518, -11933, -70380, -157055, -96286, -13894, -38843, -72635, -64144, -42244, -4743, -12552, -57692, -75773, -49939, -3975, 36485, 52560, 33885, 24662, 26717, 23120, -6698, -54168, -66677, -68441, -55442, -67439, -60916, 1418, 35837, 41767, 39334, 23537, 25998, 59555, 97012, 11371, -49065, -49410, 19401, 65754, 110167, 149726, 138386, 94277, 65604, 47975, 87047, 71763, 60702, 72652, 55664, 61872]
23424F1872l3517j04111K1887J06821l6848k6889n802j4447l6207j9444M7946
23413c8739J4783k2071N417K3145j5596m4518J097P4990L3992j2368r358N1658
23401F2432L9688o0961m9999j4771j9329M0198M3517n0538k9642n8299O720J5572
23389g5412n543m722l674L5115M0565o511m4002l0445J69K9931L9917q2152n8410
23376a65174O2700K5018k8611M6409L0475J5725L7562j4343k0553q734m7573k2542
23364h9641m309R312r085K4471L5931L6896l9226m2524j7276O2348M7345K8167
23352D2409L1057k2537n5472K8682r99K5082P474p2493n5206l534M5594M9010
23340A9067N8978k8644j7416o790j8074j9764k2347n382J1394L4280o416R783
$$ y = [61872, 28355, -75756, -53869, 52952, 16104, -10785, -16587, -31034, -67241, -86685, -38739, -23956, -46027, -40610, -17465, -33061, -77579, -76482, -1492, 32500, 20132, 10774, 62432, 102120, 41159, -8840, -23611, -42940, -2742, 40775, -9763, -39405, -97704, -90984, -75412, -80955, -85677, -89351, -54236, -13671, -20182, -64184, -94629, -94460, -64529, -24612, -106764, -165174, -102474, -77456, -106067, -59658, -29183, -13458, 24104, 9761, -10792, -19526, -67099, -89641, -93950, -84638, -93723, -69252, -33321, 3575, -35651, -78175, -95451, -33103, 14242, 42409, 73466, 50929, -4543, 24139, 23140, 48222, 55696, -16797, -72003, -75537, -29943, 19067, 78045, 49401, 31985, 25195, 7121, -12643, -34990, -40372, -28978, 5302, -1114, 8669]
23328H669Q92L5636n154j1080j0831K7682L1455N166p203j0170L636K0955l6881
23315E2772l9433K8749K3155o8400p7289j4653J5824N3653M382r505J1556m318
23303b3507L266L0824R613K0751L4396P938k6071m9799l0841k5751N9383p397
23291B805O362j7524o1371k7919P1755j2214k4856K4080k4233p1140O021M0719
23279h7515k7005L3354j9738L4741N0382K8714p234L4860L1582o7655p4224K5407
23267d4331J9222J9141P565M4289j5079l2662J0614L0809R853o165o0830n2297
23255f9871l5007k3453K1698J7376J4995P494j521L4742J1589n9967K4954J7403
23243c9568M2149K4241J8278M1317P697l2664l7419k8578M3520M4658l7043l5239
$$ y = [8669, 9561, 45197, 40043, 28963, 18132, 45814, 77269, 82435, 75232, 65062, 68698, 89653, 52772, 13339, 42088, 65243, -3157, -80446, -95099, -79275, -25622, -21240, -30745, -19189, -23507, -20241, 10583, 20196, 40947, 75343, 83281, 57210, 7411, -23430, -49181, 10202, 2805, 9167, -8357, -69728, -97647, -25892, -38106, -62962, -38882, -63115, -134255, -128234, -87515, -114520, -81166, -100904, -66163, -15781, 12933, 5699, 40559, 72141, 4486, -69738, -44331, -25109, -5968, 1597, 45886, 30807, -1855, 8759, 39568, 49421, 43256, -17574, -69871, -104878, -128331, -106633, -89257, -74262, -66768, -68289, -33547, -21958, -81925, -56971, -39568, 2581, 26822, 45100, 86417, 94114, 61450, 24031, -4547, 38973, 83631, 46588, 11349]
23231A1349J1375K6006M989o082j9050J8489l166J4016P242o6576j8036K1642
23219B198M9073M1713n7869p8049j4077L0973L239k1724j9359J9959J6528K4875
23207b520j2578L920J8259L988j3389j0678M1573M2031N7596J1488l9017o3050
23195C7623l3607K7045L8666k3041m6636p6224L026M4064l8293k7122J0181q184
23183i2502j4788k6402L3957r615K8666L0880j9003M559k560o0523J4560P3678
23171c9093M9726N3207k3452o9133j2627j9283M3038L9371m9729m8660O7778M4779
23159C5922m3853k9264k2189k9130o870M8206k8326j5541J0354j8915M2709R99
23147e5898o1747k8363l4289J1532O8575M9603L832M8743j371l2046L1470J5271
$$ y = [11349, 22724, 48730, 53719, 47637, 28587, 47076, 43910, 57926, 65168, -1408, -19444, 2198, 51271, 92984, 35115, -42934, -57011, -26038, -22799, -44523, -63882, -43923, -27395, -2520, -15098, -11178, 7081, 11069, -2320, -12998, 28575, 70606, 128202, 139690, 100673, 37623, 4016, 31061, 69727, 46686, 50, -76174, -73148, -29084, -67377, -94499, -84318, -92502, -107290, -133692, -99735, -109350, -80684, -49804, -68807, -64248, -66808, -127331, -112771, -39093, 10633, 63840, 40388, -28745, -41372, -60655, -17617, 21754, -27975, -76635, -8857, 35922, -7931, -37195, -59384, -88514, -95384, -47178, -75504, -91045, -80691, -99606, -56897, -55898, -117645, -146008, -180297, -168765, -100190, -50587, -46755, 1988, 617, -31429, 41, 15312]
23135A5312l0318l8876j4715R443J1759K2656M6717L1896k4125l4461q2873J5045
23123g2540L9780K2340j3756J6959J1726m597k0741j3235J8194O7645L3823K4331
23111A09929n176k8650j5667p4258m341K6108o516j6878j5786K1368m718J4718
23099A33l295K0997M661K7142n7022k0395j6126o2566k9455P735N8986K7072j42
23086d2275K3580K3060O840m5907j6545p643N740O6495M5525l3309m4594m7766
23074f6799k7654n346K437M3945P5469Q111o4402j2301l3286m0858k822J8382
23062a05124P5268J1318K4462N3886L1431n1614m6973m7521L1896L4480m8817
23051c7308K2641O946m5498J9852O0979K4805P525l2100j6360N411J6195J162
$$ y = [15312, -15006, -53882, -68597, -59154, -47395, -24739, 21978, 53874, 29749, -4712, -87585, -72540, -32760, -10420, -24176, -7217, 4509, -88, -20829, -34064, -15870, 51775, 85598, 109929, 104753, 76103, 60436, -13822, -18163, 7945, 1429, -15449, -31235, -9867, -14585, 133, -3162, 17835, 22496, 49638, -7384, -27779, -43905, -106471, -135926, -128191, -69205, -42133, -42275, -18695, 4365, 11205, -34702, -51247, -58890, -53150, 13345, 58870, 25561, -19033, -66799, -94453, -99799, -97362, -53417, 22052, 30163, -34239, -46540, -79826, -120684, -123506, -105124, -29856, -18538, 5924, 59810, 91241, 39627, -7346, -54867, -22971, 11509, -37308, -14667, -7721, -53219, -33367, 27612, 52417, 59942, 27842, 11482, 16893, 33088, 34250]
23039C4250k984o4181r681L720K1446K3539L4476J4400m6355n3613p473L9619
23027a2837L4319m0475N632k0697k8286n1492J2582M8210o842l87n1359J5169
23015i6463M8253P3256K5191K3474L2147q677j4752n6799n7614k8977m0662P958
23003i3665K5723L5522n2111k9507L2738K6889m0647j78j7955L2425Q204K257
22991g0305R531J8312K4675L5753l882L2187k1919k4331m39K5100m3631k4516
22979d3465J9846P5952k3866p9168K5576N9327K3906l9283l9218J9212R696q28
22967G687l3675k6928q6237m0695O3001M6328J5576L4422K6322M0747l311l4712
22955H525n3632K3152K835n4128m379M4753Q4563L0173m4149l3572L0720l2858
$$ y = [34250, 31266, -32915, -42596, -38876, -17430, 6109, 40585, 54985, 8630, -44983, -52456, -12837, 21482, -18993, -13361, -34058, -62344, -113836, -101254, -53044, -59886, -60273, -111632, -96463, -48210, 25046, 50237, 73711, 105858, 97181, 82429, 25630, -31984, -60961, -101623, -93665, -67942, -32420, -84531, -114038, -81300, -54411, -95058, -95236, -113191, -80766, -72562, -70305, -60774, -42462, -17787, 17966, 14084, 46271, 24352, 21, -418, 24682, -18949, -43465, -23619, 52333, 28467, -50701, -25125, 34202, 58108, 18825, -20393, -1181, 8515, 7687, -25988, -52916, -139153, -179848, -116847, -70519, -54943, -20521, 5801, 46548, 43237, 8525, -45107, -21955, -19120, -73248, -77627, -32874, 51689, 81862, 37713, 4141, 34861, 2003]
22943B003k4744m6887k1796J193k7887l955P2052O7417j6402j4213p635K3129
22931B275N0556k635n1239k800L3668L8165k8948j6296L8281L3353k9267p0794
22919e681p7547m2405J5639O2742K6482k9972k8838k730L4316K5124j3413k269
22907c8552n391k8175l9172j7581L8290P1945N3142k2900l7540N6868K0995p4137
22895b2208m6451P5086L8546n7655m2928l42K9157N5324L498p646j6381j9226
22883a1226L2733O974o7275n0436J3599l7948k0247N9775L237M1941M0480r637
22871A970r0418K5404M9588K6105K5379k7469J834L0649N05k526l7157J3168L7376
22858E4408Q719j3866L881j4908p8784m6047l6246J7763K9936j6539L136m656
$$ y = [2003, -22741, -69628, -91424, -90231, -118118, -122073, -50021, 17396, 994, -13219, -20854, 2275, 52831, 50196, -1043, -3843, 29825, 67990, 39042, 22746, 61027, 94380, 65113, -5681, -83228, -125633, -109994, -47252, -20770, -50742, -79580, -82310, -47994, -22870, -36283, -38552, -43943, -72118, -111290, -128871, -90581, -18636, 34506, 11606, -25934, 30934, 51929, -22208, -68659, 6427, 44973, -12682, -55610, -55952, -26795, 28529, 32027, 24381, 8000, -11226, 21507, 28481, -38794, -89230, -75631, -113579, -133826, -74051, -70814, -28873, 11607, 1970, -88448, -63044, -13456, 12649, 38028, 10559, 12393, 43042, 43547, 41021, 3864, 17032, 54408, 63127, 49261, 53142, 38234, -40550, -86597, -122843, -105080, -75144, -91683, -88547, -93203]
22846i3203Q5077L2542K4497K381n5744o3210J1328K6697M7087J9438j9010n19
22834A7361K622k9058K873j5865K7696l8715k3868m460l1929L8635J8804M5365
22822I461l2267o1812M1422P4682m3416m2135L6036J8970j439Q826J6792m5022
22810a9902k6431l5048K2037M6775n963J5294Q417k8347l7415k4984N5255J0657
22798a9655o4341K2965K5024k543J3168k4650n68J1268K2753M0608L5216k283
22786E6962k0875j8365k0164K1567l9632j2691J2514M5036J121m72j2555L4344
22774D6790K1361L103o0008L1085J73o2705k4965K9634O3656J0985J8750l5926
22762D1933m6986R176M0775m2315l3714k415j775k8564M0084M1754r138o1844
$$ y = [-93203, -8126, 24416, 48913, 51294, -4450, -67660, -56332, -29635, 17452, 36890, 17880, 17361, 19983, -9075, -6202, -22067, 5629, -33086, -56954, -61414, -93343, -54708, -35904, 9461, -22806, -84618, -43196, 31486, -11930, -54065, -18029, 941, -498, 8328, 25120, -19902, -46333, -81381, -59344, -12569, -18532, -3238, 5179, -23168, -60583, -85567, -30312, -19655, -83996, -61031, -36007, -38550, -25382, -50032, -50600, -39332, -16579, 24029, 59245, 56962, 36087, 17722, -2442, 19125, -20507, -33198, -20684, 24352, 25473, 25001, 12446, 46790, 68151, 71254, 11246, 42331, 42504, -20201, -45166, -15532, 48124, 59109, 77859, 41933, -5053, 4123, 44898, 2583, -31131, -33546, -35321, -63885, -23801, 17953, 8815, -53029]
22750e3029j8824L8102k0257q38M2358P9406P9899K2406n9627l9078k9985p1602
22738c1069m4658K3886L2693N4894k5303M3665O7899l3088j8384J4914J1506n3649
22726D3306n0147K7433k5925j7113j976j0096n967n09L9395J0109l5046K2945
22714c591K2289j9423n783j8578M010K1987M1722m3816j2337p043r824L5193k9574
22701b4768n897R89j8889J3991l0142K8380R007K1860L12m5911n785J4209M2930
22688B86O2926N9073l3595j5132L2415l626n0034o1033n2667J8918N8442M8193
22676F4166J2448L3499o5638m4778L8705P0010m5925m7918M3114r179o5015j8270
22664c4781K5285O433k7576l5004m4212p951N5176L9749k8266N291Q0449K7136
$$ y = [-53029, -71853, -33751, -54008, -54846, -12488, 66918, 146817, 169223, 109596, 70518, 40533, -31069, -75727, -51841, -19148, 35746, 10443, 54108, 122007, 88919, 70535, 85449, 96955, 43306, -6841, 20592, -5333, -22446, -24422, -34518, -40485, -40994, -1599, 8510, -26536, -3591, 18698, -725, -6508, -25086, -21076, 911, 42633, -1183, -13520, -20563, -30387, 4806, -24768, -30665, -29676, -48565, -34574, -64716, -36336, -27329, -5469, -5157, -51068, -56853, -42644, 286, 63212, 122285, 88690, 73558, 105973, 102347, 52313, -8720, -61387, -42469, 15973, 64166, 76614, 110113, 44475, -303, 38402, 108412, 62487, 14569, 57683, 48504, -16511, -34781, -9496, -3063, -30639, -65643, -109855, -117806, -62630, -22881, -51147, -45856, 34593, 61729]
22652F1729j7828m837l3349j4862q225m5567J6494P8563J3352J2135K9336m4461
22640D2480j1305k1437k8568M2094R517P814q82n9665j8629M1409O674k503k2339
22627a5340j7756J539M4318J3657k1018k3404j4598k425l1197J8177Q0545R404
22615D1902m0829J034L8182K3602l3344n298L6101N4297j3434m8493l1607m5197
22603b3084n6298L5615N9669P9799k0261k6640n4414r399P186J5498J788Q381
22591A7840J4873j2116L5067L7000m7041p5091k2032j3889n856k3995L7203N0046
22579g991k883N0263k0423K4967K1657k8159j9501o0559j7289K9376P089O6341
22567D2888L7519o1751m8947L3875O8306J8427p677k4794k5712l4826k5667K4081
$$ y = [61729, 43901, 39064, 5715, -9147, -17372, -62939, -46445, 32118, 45470, 57605, 86941, 42480, 31175, 9738, -18830, 23264, 32781, 40595, 39713, -19952, -38581, 2828, 9502, 6999, -15340, -33096, -31557, 12761, 26418, 5400, -18004, -32602, -35027, -66224, -48047, 32498, 41902, 1073, 2107, 40289, 63891, 30547, 25249, 61350, 115647, 102213, 53720, 22113, -23084, -79382, -43767, 15902, 95701, 75440, 48800, -5614, -15013, -7827, 7671, 9459, 17840, 32713, 20597, 55664, 92664, 45623, -29468, -51500, -65389, -71245, -95240, -58037, -7991, -10874, 39389, 18966, 43933, 65590, 37431, 17930, -42629, -59918, -30542, -23453, 42888, 80407, 18656, -30291, 3584, 71890, 90317, 82640, 57846, 32134, -2692, -28359, -4278]
22555d278K8666J1585n46J8155k9981k4822J588P705k9609k097l559o315J9145
22542a4363j2273J769L322l3853n7258K4820L0405K683L4379j1924l677j7702
22530e3672o860P413K5219M2518J8763k8472J7801j14j9867O980m780O459l8296
22517b6908j0993k4424n205M7378o034l966l3627k4081q130J1315J3118Q3083
22505A1526K983k7271O412K7253L7466l0724l5995l075R814J4151J7781M6214
22493G6535o186m8994J7244k1922n250j0082n245k1271k5105L5471M7834j4005
22481A9024k0922L7746j2174n5384M6913k7925o8898l5873K2305K5395K887K6946
22469c9960J2761L8971K6687j1648k4165p838K2248p4258k2854J5922J2127L9508
$$ y = [-4278, 24388, 35973, 35427, 53582, 23601, -1221, 367, 8072, -21537, -23634, -27193, -33508, -14363, -26636, -24867, -21545, -55398, -112656, -87836, -57431, -54748, -20369, -32293, -35970, -53672, -60532, -53119, -27900, 14618, 33381, 4909, 22710, 22596, 2729, 9709, 4929, 11388, -26908, -37901, -62325, -67530, -20152, -26186, -30152, -63779, -87860, -95990, -84675, -71557, 11526, 14509, -12762, -6350, 20903, 58369, 27645, -8350, -11425, -1611, 12540, 30321, 76535, 70349, 21355, 38599, 16677, 11427, 1345, -3900, -25171, -50276, -14805, 33029, 19024, -1898, 35848, 23674, -31710, 15203, -12722, -81620, -117493, -95188, -69793, -66906, -39960, -27199, 11772, 38459, 26811, 2646, -5192, 17056, -57202, -80056, -64134, -52007, -12499]
22457a2499N9095J4926J905K660n3818j4618N7873p276J0172k9985m6321k092
22445a9978j4663k163J0241K1922K0543j3580p8524m7391k241L0249K3917m0493
22433a12161m4665M8086L0166O2810L7453j8692q070p0126O486R3314K2902K0352
22421F7855n764l7751l1046L643r261l5409N2056N484j9182K2818j6203K746l2574
22408c2588k6551K7316J1115l6145k6328L8101J12400N9161j7618l9353l6862
22397C2648J4885J4274o3769j2018o2805m3188K6781L1395M3342J3239k6181L926
22385b7471l882J3784M8220k0408L6800k2043l5698j9267o758j1741N910j4729
22373e7283K9862L4754n603o555K1112k2648J831k4487k6830O618J6025J3869
$$ y = [-12499, 46596, 61522, 63427, 66087, 12269, -2349, 55524, 48248, 58420, 28435, -17886, -19978, -34641, -36804, -26563, -4641, 15902, 2322, -76202, -123593, -125834, -95585, -71668, -112161, -156826, -108740, -78574, -15764, 21689, 2997, -5073, -75199, -68713, 24601, 47503, 67855, 62091, 24340, -6706, -3063, -12324, -47733, 4323, 9807, -9375, 13443, -2760, -14, -32588, -59139, -31823, -20708, -56853, -83181, -45080, 67320, 126481, 108863, 69510, 32648, 47533, 61807, -1962, -13980, -76785, -119973, -93192, -61797, -18455, -5216, -31397, -27471, -31353, -17569, 30651, 10243, 47043, 25000, -10698, -29965, -36723, -48464, -42554, -57283, -27421, 7333, 1730, -4825, 16287, -6361, -4530, -29017, -55847, -49229, -33204, -19335]
22361a9335N60K8194k585M0471j2504j2224l1181l291K4968j4264k1382J4756
22349g817J0229L5258m0554K2840j478J9949l907o8980L6588K9921l2680l4429
22337c5060m973K355j8069J1515K1489N0622K5662R609k5311o667J1096L5250
22325G7518M9507J24597K5818m4742k0683o9134o8811o7094j6840M167k3688n4440
22313h3825J2607P8886L6775l9778l8306J3485L6213p635j8472k3786K0493P8414
22301F5071k716j5444K3513n050p849k4047J0958k3362l4829J6331Q6131o0484
22289B8223l9591M0395l5067r6750L0295K1384N073N9N9769k775n8439k1374J6837
22276e1961p574j3646J8753O5424J8148j8848j2116j7251n7077K5967K8356l646
$$ y = [-19335, -18775, 9419, 6834, 47305, 34801, 22577, -8604, -11895, 13073, -1191, -22573, -7817, 2412, 37670, -2884, 19956, 18478, 38427, 34520, -34460, 2128, 32049, -631, -35060, -40033, -37678, -55747, -44232, -22743, 27879, 53541, 63150, 37839, 31172, 42268, 77518, 127025, 251622, 277440, 232698, 212015, 142881, 74070, 6976, -9864, -5697, -29385, -83825, -71218, 7668, 44443, 4665, -33641, -20156, 16057, 8422, -10050, -33836, -13343, 65071, 62355, 46911, 70424, 65374, 57525, 33478, 44436, 21074, -13755, 2576, 88707, 28223, -11368, 29027, -6040, -102790, -72495, -51111, -46038, -45979, 13790, 11015, -47424, -68798, -51961, -59535, -73181, -54428, 10996, 29144, 10296, -1820, -19071, -76148, -50181, -21825, -25471]
22264b5471l4169J1639J1667r736Q212J6179R625L5669n082k4435k2840m958j8499
22251e2199n2640L7915L4328K468l7541k4305M605J9804K4050K1954q326l5514
22239f5401J2142j0221m0403K3489K2022K9721M3582k4914m4251k0427M1467J5608
22227a7586j4785m2019N82N957K4021J5622K1830j5160k3778r031K2950J3620
22215a7777j61K7399p992m7056L3830K1902n813j0709j0753j485L9377K4776J852
22202D7390M6314o9457j02183L0300K894k7167m6353J5655N7101J6039j0932J8540
22190b1859J1599J1619L1415M4796J779l6246n0091k1382K9550L2869j6332l8099
22178b0382l1294p491m5306J1505L1500K1479n0030L1899L0517J6833K933L6064
$$ y = [-25471, -59640, -48001, -36334, -46070, -37858, -21679, -12054, 23615, 18533, -5902, -28742, -33700, -52199, -104839, -66924, -32596, -30128, -67669, -91974, -87369, -67565, -43515, -21561, -29887, -65401, -53259, -63480, -103883, -80394, -58372, -28651, 14931, -9983, -54234, -74661, -33194, -17586, -32371, -74390, -73808, -67851, -43830, -28208, -6378, -21538, -45316, -54347, -31397, -17777, -17938, 9461, 1469, -45587, -11757, 10145, 4332, -6377, -17130, -18615, 20762, 45538, 47390, 93704, 24247, -77936, -47636, -44742, -71909, -118262, -102607, -45506, -29467, -40399, -21859, -10260, 1359, 32774, 77570, 79349, 43103, -6988, -28370, 1180, 34049, 17717, -20382, -51676, -59167, -104473, -92968, -61468, -39989, -90019, -58120, -27603, -10770, -7837, 28227]
22166B8227j4144q077P203l7774n9666q14p804N7209L0185k7990j9910J4077k6446
22153f5724p394J2621J2007j5823O308P723p918l2781k6461K0838L0730K6926
22141c8948L9384k4534J8125l031K913N3416J8599n779n035m9014J6314k0557
22129A853r543K5198J8272l8871K9651P1680j071p8507l7005K9915P327j7824
22117A075k4904k3286L3841j7152l3560l4891r930j6409J2159L5945K6698l0958
22105h1372J4360k8447L5498P0531j406k3638L772J0092j6038j417K7830k1154
22093a1389j7005J6612o5206n509m875J7887k1916O9178Q363k3042n654K047K5366
22080a5143l6764l0511K1337l6706n604J6341m494k6459J6111J13336K2311p9292
$$ y = [28227, 14083, 6006, 13209, -24565, -84231, -85045, -92849, -35640, -5455, -33445, -53355, -39278, -65724, -73118, -60497, -48490, -64313, -58005, -50282, -58200, -90981, -117442, -96604, -65874, -38948, 436, -24098, -5973, -9004, -6091, 47325, 65924, 60145, 55110, 6096, 22410, 1853, -7690, 17508, 35780, -3091, 26560, 98240, 97169, 18662, -18343, 11572, 18899, 1075, -23829, -47115, -13274, -30426, -63986, -98877, -108807, -125216, -113057, -77112, -50414, -81372, -67012, -95459, -59961, 10570, 9164, -14474, -10702, -610, -16648, -18065, 9765, -11389, -28394, -11782, -76988, -82497, -87372, -69485, -91401, -22223, -13860, -36902, -42556, -40509, -15143, -51907, -82418, -61081, -97787, -103391, -87050, -91544, -118003, -101892, 11444, 33755, -45537]
22068d5537m5145J5826K0520J7666J2689K2188K6664J3284j0410p9367j8209N1605
22056a8226O7235l2030k5131R056Q552l1540l1301n3651l4794L0882O6549L8727
22044e672l8932r474L3437J8392m3916k2744R2872L9955N72K5797J9603n6364
22032E3526k3734J9632P737J4902k1744j6520M1358J8630r2520o8474j3044k5210
22020a05461K7661K4345j3554l0209K1315N5720K8206p076j1615m7463k701N2817
22008h015o838l8762L815K2811j5201j1404L984K3339L2648p2337l1464N0321
21996d7103P4139m587J4138k5774m296M925k1564j3101j0807K1016L8847p103
21984A8730r329k8816n6302O253J225j0884k7814L2559K2942L3339Q634r269j6830
$$ y = [-45537, -90682, -74856, -54336, -36670, -23981, -1793, 24871, 38155, 27745, -51622, -69831, -18226, 49009, 16979, -8152, 904, 9456, -22084, -53385, -107036, -141830, -110948, -44399, -5672, -44604, -54078, -20641, -2249, -46165, -68909, 23963, 63918, 64490, 90287, 109890, 53526, 29792, 49424, 57161, 72063, 50319, 33799, 75157, 93787, 1267, -67207, -80251, -105461, -77800, -53455, -67009, -97218, -75903, -20183, 8023, 947, -10668, -58131, -60832, -8015, -14853, -53615, -49800, -26989, -42190, -53594, -49610, -26271, 6377, -65960, -97424, -47103, 27036, 22449, 36587, 10813, 6517, 11442, -10122, -23223, -34030, -13014, 25833, 18730, 9401, -19415, -75717, -69464, -68239, -79123, -106937, -74378, -51436, -18097, -9463, -18732, -35562]
21971c5562J3894K6528L115J5295L9838j4300p4772l9879J7112L7776l6929N1573
21959C689O2588M5871l5061m6250J0712o1053k6983J3807K6035O3940K1413L074
21947H1782m2528j4730L0073M0916n7488k5453N6K3363L0436J1062J692k0414
21935E8767l5009k7825m1510p700L8601R179m3422l2745J9645J8021J8940J0273
21923a4785j3315L098k890L1798N3021q42p700m4576k5510J9371N3650K9409k1309
21910E9420m4512p724K8032r991k2477M2409N006q7865k2152M0066j2592o6198
21898i8578l5932J07145L4501K0256m4528n3682p848O8242M0323m7737j0528j0460
21886c8826L9228K954k5390J8542Q122J8811L1646l9964j7430r5283j6727K5160
$$ y = [-35562, -21668, 4860, 7975, 23270, 63108, 48808, -25964, -65843, -48731, -10955, -47884, 3689, 66277, 112148, 77087, 30837, 41549, -19504, -46487, -32680, -6645, 57295, 78708, 81782, 39254, 24524, 54597, 95513, 38025, 12572, 12628, 35991, 66427, 77489, 79181, 58767, 23758, -4067, -45577, -53277, -14676, -5497, -48919, -81664, -62019, -43998, -25058, -14785, -28100, -25002, -27892, 3906, 56927, 56085, 48385, 3809, -21701, -2330, 51320, 80729, 59420, 14908, 7184, 35216, 25225, 2748, 45157, 50163, -37702, -59854, -19788, -32380, -98578, -134510, -27365, 7136, 27392, -17136, -70818, -78666, -10424, 29899, -17838, -28366, -38826, 402, 3356, -22034, -3492, 4630, 23441, 55087, 15123, -2307, -97590, -114317, -89157]
21874h9157Q868K9379q1571L957L1606M2014K8894K2849M3086q697p327p1603
21862d7702k9054N743L9528k7797J057M0186m540m1973J8232j9682Q51o2345P1727
21849e5769K2068J2221K6274j4649l1828m8257M907k0664L8950L8297j777M4613
21837A4386N6095K9324N505K7813k4134J2867M4547L1615m1253o7624n6765n232
21825B7144l1858K0202K0357J568J7189j026m6723m5039K5164m830j7881J2543
21813b3190J4685K5146J8274l1084o1361k0069M132J8055N3124L272j7083k9126
21801d5225L1928k611M1705J6803j12j4830n5121m6340k909K4653k2090K8378
21789d5771K1408K4418P706K6009j718l8991j2119j0866l8055l6631m3440L2529
$$ y = [-89157, -80289, -50910, -132481, -128524, -96918, -54904, -26010, -3161, 39925, 31228, 23901, -47702, -76756, -71013, -31485, -59282, -58225, -18039, -22579, -64552, -46320, -66002, -65151, -127496, -55769, -33701, -21480, 4794, -9855, -41683, -89940, -85033, -105697, -66747, -28450, -30227, 14386, 70481, 99805, 105310, 133123, 108989, 121856, 166403, 198018, 156765, 89141, 32376, 27144, -4714, 15488, 35845, 37413, 54602, 53576, 6853, -38186, -13022, -17852, -35733, -23190, -8505, 16641, 34915, 3831, -57530, -77599, -73467, -55412, -2288, 984, -16099, -45225, -13297, -15908, 25797, 42600, 42488, 27658, -27463, -73803, -76712, -52059, -74149, -45771, -24363, 55, 7761, 33770, 32052, -6939, -19058, -29924, -67979, -104610, -148050, -115521]
21777a15521R7334k1555k6658N8151M0626l8963n0735K4312J8721J8314m6686
21766d2660P387M09K8480J9829N1862l7648o2018L7351K2405k3818J3882j8377
21754b916j3122r94l9215m6279P589O2586O8388J3188k7250m0085l417k8503K0698
21741b9332J6917J5723Q622M728J528m7237m0482K484J5528J5554p293k3739Q878
21728e8121J5620k8165K0275K4738o8993L015J6090K9277j227J7493M3801k0541
21716f738K3071L1570O7077K2662o8197j9192n191O524l9918K5060j429k6044
21704I255o4462k745n039K7680L4658M513K2478m0893m9334j0872j1549L0210
21692e6100P0496K6806J921j8524m0646k2465M1021P5372K9476j9881j2612r477
$$ y = [-115521, -18187, -39742, -66400, -8249, 32377, -6586, -57321, -33009, -14288, 4026, -42660, -35273, -34864, -6384, 13445, 65307, 27659, -34359, 2992, 25397, 1579, 15461, -2916, -16038, -17032, -56247, -102526, -94937, -32351, 36037, 49225, 21975, -18110, -21527, -50030, -29332, -12415, 3308, 11930, 16658, 18186, -29051, -69533, -67049, -51521, -35967, -43260, -66999, -58121, -42501, -70666, -50391, -25653, -94646, -91631, -75541, -46264, -47491, -29998, 13803, -6738, 16333, 47903, 114980, 137642, 69445, 50253, 45062, 51586, 11668, 36728, 35299, 9255, -55207, -57952, -62991, -35311, -653, 3860, 26338, -14555, -63889, -74761, -86310, -56100, 14396, 41202, 43123, 24599, -16047, -38512, 2509, 77881, 107357, 87476, 74864, 65387]
21680F5387o519k0841M718n5041j924J2190k2931N6324L8742j6267n9657l1129
21668c6948M4345k9950l8955N675O5675N5282k5967m3555L577K4514p6675j7988
21656g0970l6736K7103N7786j6205L7102L103j5309J6289N898j1813J2120k3319
21644a4951p053N5024L5335j265n5232j9375l2111J3051l14P946r408K5593J356
21631a404J4051n1928J7939K799L2934M1177J4517k6839j9719o1941N529J5510
21619a7375J4217p367j3283k7320k5102N0728n093l8560m2777l0421N4964L4503
21607e2886j4752J7781M6003p264K8162L9899J4082P540J2490m5496n8369k2752
21595c5562m68k0775N621k4362L3126P4261M2826p4529k3461P3421M167j4479
$$ y = [65387, 58868, 38027, 42745, -12296, -14220, -2030, -24961, 31363, 70105, 53838, -5819, -36948, 7397, -22553, -61508, -55833, 9842, 65124, 39157, -4398, -821, 23693, -52982, -70970, -107706, -80603, -22817, -39022, -1920, 1183, -14126, 2163, 8061, -3752, 8368, -14951, -22004, 33020, 68355, 67090, 11858, -7517, -39628, -26577, -26891, -18945, -28353, -2760, -1404, 12647, -39281, -21342, -18543, 14391, 55568, 70085, 43246, 23527, -38414, -32885, -17375, -3158, -10525, -23808, -51128, -76230, -25502, -30595, -69155, -111932, -142353, -87389, -52886, -67638, -49857, -3854, -11118, 17044, 56943, 71025, 78565, 91055, 45559, -12810, -35562, -36030, -56805, -51184, -75546, -42420, 31841, 74667, 138, -23323, 50098, 54265, 39786]
21583C9786j313J0037n744O1J7301J0640n8009l4775J6597q560j2293M6861N7788
21570G8377l8809k9404p429m9591J6127j3033q726J9426R198K7920J7350j5851
21558E555L8651J6669J408p7146j3429R802j2892k3728j8840J2159K1785N6298
21546A6292k4852o9482J1651k2606K344M6098J8968k1038M6876J1892n553m221
21534F369r6097m4746K9460O5108M4522P786k6661j591j8135j2823J3978l0268
21522f3098k9651N008K2528J7689L9671l9932L0506L0393l7370k4774n351M0975
21510a3406M9078J59j4367j9392j2105J7253N1483m7121j03940k433L1139L1285
21498c2367R58L144j8682K9382q2q232k613j1197j5374K4626J7951J2771j4616
$$ y = [39786, 38473, 48510, 42766, 42827, 60128, 70768, 12759, -22016, -5419, -13979, -26272, 20589, 78377, 39568, 10164, 2735, -46856, -30729, -43762, -52488, -33062, -23864, 4056, 21406, 5555, 44206, 60875, 62283, -14863, -28292, -18490, -31382, -55110, -73950, -61791, -40006, 16292, -8560, -78042, -66391, -88997, -86653, -40555, -21587, -42625, 4251, 16143, 10590, 6369, -89728, -134474, -105014, -39906, 4616, 12402, -14259, -15850, -33985, -46808, -32830, -63098, -92749, -87741, -65213, -47524, -7853, -47785, -17279, 13114, -24256, -49030, -54381, -13406, 35672, 35831, 21464, 2072, -10033, 7220, 58703, 11582, -92358, -94791, -63652, -32367, -31409, -28265, -46947, -17565, -17647, -25879, -28492, -39689, -55063, -30437, -12486, 285, -14331]
21485a4331r0117j1701K6290J8373p923k758J5763L4899o819m94k6788p565M4912
21472b8259R55k5299k0798K6591q381L1189j2288M0215p103n3905n0957K0283
21460h7757L6887j0297j0608k2445M7537M3212K5738L981j5399k2939L4855M79
21448B3244k9390r569j0591j2625k0741n8874l7029M6276L9892N6437M8523l2966
21436B587l9524k6821m5396m6875L597P1333M9416Q322J4238j5557k4844J7845
21424c1679K3321k2417L2387o809L5006L097m8720L322l1390l4283K9522Q9053
21412D0410M3584J83l8316N865L4478o2834o8331K2863J7740k7772r858J3069
21400b8919p22l2920m1274M780K7088J7491L2335l1903Q103J7134M7476o979l0893
$$ y = [-14331, -104448, -116149, -89859, -71486, -79409, -82167, -66404, -31505, -38324, -38818, -65606, -73171, -28259, -27304, -52603, -73401, -46810, -55191, -24002, -36290, 3925, -3178, -57083, -108040, -87757, -50870, -61167, -71775, -94220, -46683, -3471, 22267, 26248, 10849, -12090, 22765, 23244, -6146, -15715, -26306, -38931, -59672, -118546, -155575, -109299, -69407, -12970, 35553, 2587, -36937, -63758, -109154, -156029, -152432, -81099, -31683, -23361, -9123, -24680, -49524, -31679, -8358, -30775, 1612, -5197, 29809, 32906, -15814, -12492, -43882, -78165, -48643, 40410, 83994, 84177, 45861, 51726, 86204, 23370, -44961, -22098, -4358, -32130, -41988, -28919, -29641, -62561, -103835, -99055, -71967, -54476, -22141, -54044, -45941, -28807, 18669, 11690, -19203]
21387a9203r43N6707J0617m2167j573P721q29k0879k6727m338n080p278J9880
21374c4092K9949M2618p9023n6315M0805j0151J3739l3489O206k1174k0718P4338
21362d7307L769l1167m901J7655j150J8693J0515j6576k8388l2284L5075M5959
21350c0107J8434k635k2083k0720m2077P065K8216L8816L3538k1633K846j3605
21338b3945n496O852M0570K6534P2202l747o9079j08878L8186J2581K1142P964
21326A4886k7223l4091o710Q346m1606l772M188j5634p889L9492R998K6110l2113
21313f6018l7214L0798N8551p046J3364n879O446J4139R416j5709j5700J9302
21301D450j8757j0932R882N1230P414q4415k0087K2808k6395J380J023k1897o941
$$ y = [-19203, -20146, 36561, 47178, 5011, 3438, 11159, 10330, -10549, -37276, -41614, -46694, -53972, -34092, -4143, 38475, -40548, -96863, -56058, -66209, -52470, -85959, -79753, -100927, -121645, -47307, -43538, -74705, -79606, -61951, -63101, -44408, -33893, -50469, -78857, -111141, -76066, -30107, -11673, -14308, -36391, -57111, -99188, -92123, -63907, -25091, 8447, -13186, -10340, -23945, -29441, -22589, 17981, 44515, 116717, 112970, 43891, -64987, -26801, -14220, 6922, 14886, -12337, -46428, -53138, -44792, -86398, -90170, -85982, -101616, -109505, -70013, -60015, -33905, -66018, -103232, -72434, -13883, -20929, -7565, -13444, -6998, 7141, 16557, 848, -14852, 4450, -14307, -25239, -15357, 35873, 43287, -41128, -61215, -38407, -64802, -63422, -62399, -84296, -91237]
21288i1237L6941O337o688j1378O3558M6399Q313k506l6715J7944L563k3311j4967
21275c747m6857j8660K8944L0408J6382P93l8953j969l0902K5937P317l616j1301
21262d6224l4418L0422N3954M3214k8297J6248k7377k7346Q067q150k9977l0805
21250h0689m557J2647K3891l7226O423M2002J1509p769O5247J793j1107l2612
21238a0448j5050K0670J0514q436j1173l2137l4200L7800M9556l3615M289k1522
21226d3752m3603N3436O5904J5678l6245M187l6735k109L6810K7619J4852k515
21214E3527l2437m5615j1505k5401j5665j1549K0968l3908l7441K7069R8864L7956
21202B4863k9547q078J6008J8642k2459j5336o2741m4852J8411L9105J6175J2178
$$ y = [-91237, -54296, -47959, -54647, -66025, -2467, 43932, 52245, 49739, 13024, 30968, 34531, 11220, -3747, -50604, -69264, -40320, -9912, 6470, 7263, -31690, -33659, -64561, -38624, -31307, -34923, -46224, -80642, -50220, 3734, 46948, 18651, 34899, 7522, -19824, -11757, -19907, -49884, -80689, -85246, -72599, -48708, -85934, -79511, -37509, -26000, -33769, 31478, 33271, 22164, -10448, -25498, -4828, 5686, -2750, -13923, -46060, -80260, -42460, 7096, -26519, -22230, -43752, -87355, -33919, 31985, 47663, 11418, 15605, -21130, -23239, 13571, 41190, 56042, 53527, 21090, -24525, -36030, -61431, -77096, -88645, -67677, -101585, -139026, -111957, -13093, 24863, -4684, -12762, 3246, 21888, -571, -15907, -78648, -123500, -105089, -65984, -49809, -37631]
21190c7631j3567l6378K6803L6392o837j5082k0181j8173k091O6403N462j6790
21178c1670K6811k1291l8058K2161M960m5394l810M7525M4969j2090j2593k0658
21166c9138K7767p3463j2884L6767M6258M3837l2520k5113K5770k5200m6131o338
21154h0388J5331k2156o6199R2186N4600m6168m62K7880N149K4196K8310m0547
21142h268K444l6576r30J6r455M4012P297p329j026L3081Q893j0349k023m709
21128A5078l6330l71j0815J1825K6166o4161o655J5465m8250n0537M2413N0232
21116e5940K2637J3776K7891J9370K3034l6684p3750k0904J1334N9532L5493K5505
21104E1294l3768r955k4915n3590O2519J0102m8821m1026n6713L8544O5670N4699
$$ y = [-37631, -51198, -87576, -60773, -24381, -31218, -46300, -66481, -84654, -86745, -20342, -14880, -31670, -4859, -26150, -64208, -42047, -37087, -82481, -86291, -38766, 6203, -5887, -18480, -39138, -11371, -84834, -97718, -60951, -14693, 29144, -3376, -28489, -2719, -27919, -74050, -80388, -65057, -87213, -153412, -61226, -6626, -52794, -53256, -25376, -20227, 3969, 32279, -8268, -5824, -42400, -43330, -43314, -52769, -8757, -1460, -8789, -9815, 23266, 32159, 21810, 19787, 15078, -21252, -21623, -32438, -20613, 5553, -58608, -65263, -49798, -98048, -148585, -106172, -55940, -33303, -19527, 8364, 27734, 50768, 14084, -59666, -80570, -69236, -9704, 25789, 51294, 17526, 7571, -17344, -70934, -8415, 1687, -47134, -88160, -144873, -106329, -40659, 14040]
21092A4040Q055q3770J0958j1658R432k8495K3984j6254K5691M9161J4375k7042
21080a1523k4163j3009l4635J2683J3250K1917J6967L7699r404J800L5628q919
21068C8291k7678P606j0827l039l0846n0330M8844K8832J6169k3415k3442k6790
21056e6625R497k7843j3984K4953l450l1149q567R768k5795L3914J114K3188K6203
21043c8776o4391N511J4057N4486O4922n988j6104R735j9047M0236J8329k9665
21031C3305q936M7266J5767j2204o6832j2639Q922l3425J4661P530J5603j3752
21019d734k6k8380N418j7889l808J6047j2594L9965j0515K1646o540K7370J5450
21006D1410l2202J135M049l7979n0082l0419N0712L6489o308n044k360J3054J4410
$$ y = [14040, 22095, -61675, -50717, -62375, -52943, -81438, -57454, -73708, -48017, 1144, 15519, -11523, -35686, -48695, -83330, -70647, -57397, -35480, -18513, 19186, 9782, 11582, 47210, 38291, 10613, 18219, 7392, 4353, -26493, -76823, -27979, 853, 17022, -6393, -29835, -56625, -47128, -74971, -88955, -64002, -67452, -98601, -107168, -97400, -123195, -89281, -88167, -64979, -38776, -103167, -97656, -83599, -29113, 35809, 29821, 13717, 23452, 4405, 44641, 62970, 33305, 24369, 71635, 87402, 75198, 8366, -4273, 4649, -28776, -14115, -6585, 9018, -4734, -4760, -33140, -27722, -45611, -49419, -33372, -45966, -6001, -16516, 5130, -1410, 25960, 41410, 9208, 10343, 14392, -23587, -73669, -104088, -53376, -16887, -23195, -28239, -30599, -17545, -3135]
20993c135j8496k8522K8862K4180J3710k5797l7469n5242j4537J1528O8608J6855
20981a9455m265j8055K0429m6494k3943L2410J7260j0874r01L7779K535j0920
20969b4494k3314j0032l2481M0664j4973L872M5905L1683K8852o2785k5065j0043
20957e2211K13m7323K5026K3817k4137k4342K5335j318N850J773K402l835j714
20944g0464l1248p70M2856M1285L6075J0229M0268m8775j47261n1192L155k652
20932a78494P1834L4192J1371m3249J8654J772K0525J5566k4943l3784K7674m552
20920h3434j5428J2664k902l772L062J3964K0225j5807K2642J3090k1797P262
20908e0231m0829L9391K8605K4812K377n7687k3022K0853M0989J6530K7983k2158
$$ y = [-3135, -21631, -50153, -21291, 2889, 16599, -9198, -46667, -101909, -116446, -104918, -36310, -19455, -23720, -41775, -21346, -67840, -91783, -59373, -42113, -52987, -53888, -16109, -13574, -24494, -47808, -57840, -90321, -49657, -64630, -60758, -14853, 16830, 45682, -17103, -42168, -52211, -51998, -99321, -74295, -50478, -74615, -98957, -73622, -74940, -69090, -67317, -64915, -68750, -70464, -101712, -102482, -59626, -18341, 17734, 27963, 68231, 19456, -127805, -178997, -175842, -178494, -106660, -72468, -61097, -104346, -85692, -83920, -63395, -47829, -72772, -106556, -78882, -83434, -98862, -86198, -89100, -92872, -89810, -75846, -55621, -71428, -48786, -35696, -57493, -50231, -91060, -51669, -23064, 1748, 4125, -53562, -76584, -55731, -14742, 1788, 29771, 7613]
20896G613j4228l9747k2670K2338P4333L6181J6364k5296l5700m3916m9579K0044
20884e4263L2055L137J4061j5108j7792K0854j0867k3383L1981O566j7951N523
20872b5187J608M6007M728j6578o749L043M1410j1094m2785l5878O63l5997J2609
20859f4200N7743m251l3847N7072M5635K2157j931l5812l7892m4353O574r471
20847d2576l0142j3146n371k7655N3242J7596L9638M5018k365k2632k4632o0595
20835g3620q907N6987O6711j1254J1750o090o2709l2820P3549J3765m2375j5212
20823c0225M3945K6417m5802k2709Ok6925p462L6225N941m379m1938K744O0133
20810d029L8458K9865q212l7415n5450k4446N103j2249L0539N5751l455O969L815
$$ y = [7613, -6615, -46362, -69032, -46694, 27639, 63820, 80184, 54888, 19188, -24728, -74307, -54263, -22208, -19071, -5010, -20118, -37910, -17056, -27923, -51306, -19325, -12759, -30710, -25187, -23579, 22428, 27156, 10578, 3829, 6872, 48282, 37188, -5597, -41475, -40812, -76809, -64200, -6457, -10708, -44555, 12517, 58152, 80309, 78378, 42566, 4674, -39679, -33105, -42576, -72718, -85864, -91235, -118890, -65648, -48052, -8414, 36604, 34239, 11607, -13025, -73620, -82527, -25540, 41171, 29917, 41667, 35577, -27132, -59952, 13597, 27362, -15013, -30225, 13720, 40137, -5665, -28374, -28368, -55293, -62755, -26530, -20589, -24968, -66906, -64162, -4029, 34429, 64294, 56082, 18667, -36783, -61229, -56126, -68375, -37836, 17915, 14460, 21429, 25244]
20797B5244L5936O3626m9792q0485l9447j040J9148J0950n7000L136M9321R250
20785a1153k5221k8989p166L6559J5677j3799l609K9103j7675K9265j7678j4440
20773b9126K1003M1059m8239J690k4874m1047j7261k865K9963J3499L8870l0131
20761d7459k2032M0607J8450L502J5725P631j4169j0158m3515j0694L5894Q42
20749b5376N840j1646L7536L2391k857l0012Q615N0473J0139J2556l4082Q431
20737F2008j166o8691j6123K378L0737o1979l8596Q001n0189j6365Q1830J22471
20725E4316N1491J2361j6985l3789p964p627l899j8444l9731l5092N2716L9953
20713D7306j7221N386K423Q210j3367m2368j4518k6879k1792L2466K42K32n8167
$$ y = [25244, 61180, 124806, 75014, -5471, -44918, -45958, -26810, -15860, -72860, -69724, -20403, -11153, -36374, -65363, -72529, -35970, -20293, -34092, -37701, -8598, -26273, 2992, -14686, -29126, -8123, 32936, -15303, -13613, -38487, -79534, -96795, -99660, -69697, -56198, -17328, -47459, -69491, -28884, -10434, -6932, 8793, 16424, 2255, -7903, -51418, -62112, -26218, -25376, -19536, -31182, 6354, 38745, 35888, 5876, 14491, 64964, 75103, 87659, 53577, 62008, 60842, -7849, -23972, -21594, 9143, -52836, -91432, -83431, -133620, -149985, -68155, 54316, 105807, 118168, 101183, 67394, 59430, 51803, 47904, 29460, -10271, -45363, 7353, 47306, 30085, 35471, 37894, 46104, 32737, -9631, -24149, -51028, -72820, -40354, -40112, -39880, -98047]
20700i8047K9381N2531L0056n668K2174m876k6558Q134j0041p478P942M6346k6271
20687A7625m2265n6365J7044J2264K6123o268q499l0166q820n502m4090j8754
20675a47673R0206J5038J4902o7021K7608Q0596M4243j8724j8383l4545n5320
20664f9073o5128o981J6146L4536N9268R236j4489L320L2298L4727m4645o1344
20652g2129o3527p74Q7216M3580k9868Q1318K4009k4982j2143m4125n1321J4045
20640d8701J4473J3475K1915R927l1125k3287n7885j7254M8227Q4601L2084K330
20628D8780n551l5331j4686L1041M3934J4259l1192n8272L6099l9861l4463r730
20616e4973K0545L2837l0257K4547P6756K0772n8591q2353m673j6795J4755N8156
$$ y = [-98047, -68666, -16135, 13921, 8253, 30427, 25551, -1007, 7127, -2914, -10392, -2450, 43896, 17625, -24640, -81005, -63961, -51697, -25574, -31842, -40341, -70507, -79327, -84829, -128919, -147673, -57467, -42429, -27527, -94548, -66940, 13656, 57899, 39175, 20792, -13753, -69073, -134201, -141182, -125036, -90500, -31232, -21996, -36485, -33165, -867, 33860, -10785, -72129, -135656, -136430, -49214, -5634, -35502, 45816, 69825, 44843, 32700, -11425, -62746, -48701, -34228, -20753, 1162, 11089, -20036, -43323, -101208, -118462, -70235, 14366, 46450, 48780, 43229, 7898, -6788, 24253, 68187, 82446, 51254, -7018, 29081, -10780, -45243, -54973, -34428, -1591, -31848, -7301, 69455, 90227, 31636, -50717, -55390, -72185, -57430, 726]
20604G26M1803k0402p8335j2385J6296J4347k1985J6054K9447k5976l9593j666
20592h1669K8753J1416N2050K4659j694K3693J3608m5169n9209k1194o458K52
20580f0962j1944p713k3966M522L5770j152P250K1254q006J7834K9188l353q7537
20567h8815q706M9946J5162P383J0998J8535M554L6019k1503o4195m1882j2809
20555i5313j6126M8032r96K3923J7460M1333M4056M2120k5865l2740J5326Q958
20543G0168l4700o7478k1021j4224R041J4462k295j9093J3293K0949J7877l9018
20531e2039N247l6535k2305N0545O380r243J5491M4706J3131p668m976j2425l830
20518a3521l9036R716L4232K1147K703r6943k1022P8128j5431k3772J9736L3063
$$ y = [726, 42529, 22127, -56208, -68593, -52297, -37950, -59935, -43881, -14434, -40410, -80003, -81669, -52916, -41500, 10550, 35209, 33515, 57208, 70816, 25647, -33562, -54756, -61214, -60962, -72906, -80619, -104585, -100063, -64293, -65445, -58195, -36941, -44947, -27113, 2075, -1278, -88815, -97521, -47575, -32413, -25030, -14032, 4503, 9057, 45076, 23573, -40622, -82504, -95313, -111439, -63407, -64403, -40480, -23020, 18313, 62369, 104489, 78624, 45884, 61210, 70168, 35468, -32010, -53031, -67255, -58214, -43752, -46047, -65140, -51847, -30898, -13021, -52039, -46792, -83327, -105632, -55087, -48707, -57950, -42459, 2247, 15378, 7710, 2734, -9691, -13521, -52557, -42841, -8609, 12538, 15241, -81702, -102724, -24596, -40027, -63799, -44063, -11000]
20506a1000P6715k5338l2694p2012K9402j4697k8454P572K9851M112R811l8960
20494f5692K4552L9654J6930J3015j810K4964j2208q3817K5347M7595N0375L1669
20482A10574o0336m0121M6653J8228m1792J2885K2875q285m7855o0051j535Q6760
20470C8000j2361k7141M4600j1086l4515N22J2190J9326j1233n4115l845P573
20458c2085L7427R83m926l986O4817J0602k7298o1858L113o306L904j7806k6689
20445f0108N1712K8596l450j593j5241K7360M1636k915j8259k7501l3815J5688
20433B110k7088N3103O6455Q885J9589n0696l9042j06687K8960L2007j3850L8179
20421A1925J9505k706j4225m1716q04O6198r779K1418l01k0630j4616J1137J4606
$$ y = [-11000, 65715, 40377, 7683, -64329, -34927, -49624, -78078, -70506, -40655, -36543, -26732, -65692, -41140, -1486, 15444, 28459, 26649, 51613, 39405, -44412, -19065, 28530, 78905, 110574, 50238, 10117, 56770, 74998, 33206, 46091, 68966, 60681, 12826, -47225, -48760, 38000, 25639, -1502, 43098, 32012, -2503, -1981, 10209, 29535, 18302, -35813, -39658, -32085, 5342, 6325, 1399, -2587, 62230, 72832, 45534, -16324, -13211, -19517, -15613, -33419, -60108, -8396, 20200, 16750, 15157, -84, 27276, 68912, 65997, 47738, 20237, -13578, 2110, -24978, 28125, 94580, 103465, 123054, 72358, 33316, -73371, -44411, -12404, -26254, 11925, 31430, 28724, 14499, -27217, -28021, 38177, 28398, 49816, 49515, 28885, 14269, 25406, 40012]
20408D0012j938K3826o5971m2536J3286j2300O712J2754P1473O195q3893l6836
20396f9216L8161j5122J05k699L0032m861k271J6485N3344K8386K9546J5083j4391
20383A02582J0651L3369j9073m2404o7769o756k5882j0484k1142J2699J280j4235
20371d7164L8000P221R432O45l09M774J7084k2347j7569K9537k079P296N0548
20358G5069j371k3773k1891Q514r31k9424M940r443J3287j2656K0509Q483l8231
20345f918q462k0999K3591K9967j4655p828M8090l1910k5705n722J8840o508L8588
20332C0369J8052J148l612o9105o0040j7943l4829J7964J21950M4654J4337k2610
20320D0335K7181K9486k5616l5689J7901Q8023N27m2259j0514j01253k2414N0482
$$ y = [40012, 38074, 61900, -4071, -46607, -33321, -45621, -38909, -26155, 45318, 51513, -32380, -69216, -31055, -46177, -46072, -48771, -18739, -23600, -25871, -9386, 43958, 72344, 101890, 116973, 102582, 113233, 146602, 127529, 85125, 17356, 10600, -15282, -25766, -46908, -34209, -32929, -47164, -9164, -1943, 7489, 8134, 7825, 12599, 29683, 7336, -10233, 19304, 17225, 24521, 75069, 73698, 49925, 28034, 36548, 35617, 6193, 11133, 1690, 14977, 2321, 22830, 31313, -6918, -15380, -36379, -12788, 17179, 2524, -5304, 42786, 10876, -14829, -20551, -1711, -8219, 30369, 48421, 49569, 45957, -23148, -83188, -101131, -135960, -117996, 3954, 48608, 62945, 40335, 67516, 97002, 71386, 35697, 53598, 141621, 142148, 99889, 89375, -11878, -34292, 16190]
20308A6190O6215J4682K9311K5639M2675j5294m0409q2770K101J1617J7725L2538
20296A20220K4371J6126j648m0438J5834k211l5391j9884K6791K8654J5323J0889
20284A58636L2243l0550k9508N4059K8774m7460L1588O3940K5608N3192J71419
20273E11941K75281L05833L87892L55463J08995n1849J0590K12613K28390N6366
20263B401515j69100r4675R8979J68051j11678k49379N8142J43968N1487k20010
20253B077300n02608l51196j23091j00249j16132j62552l0145n9517n9733n254
20243E66823q2338n3981m4337k4801l8688N531M4524K2096J9594n889k1247K0299
20231D07586N144p423j9347k973m0811l6152M6042j4155o4774J009M853q009J9213
$$ y = [16190, 82405, 97087, 126398, 152037, 194712, 179418, 139009, 56239, 58340, 69957, 87682, 120220, 144591, 160717, 159069, 118631, 134465, 132254, 96863, 76979, 103770, 132424, 147747, 158636, 190879, 160329, 130821, 184880, 213654, 166194, 197782, 261722, 287330, 340522, 511941, 787222, 1093055, 1480947, 1836410, 1945405, 1893556, 1904146, 2116759, 2345149, 2401515, 2232415, 2137740, 2236719, 2404770, 2293092, 2043713, 2101855, 2245823, 2297310, 2077300, 1574692, 1223496, 1100405, 1000156, 884024, 721472, 691327, 631810, 572077, 566823, 484485, 430504, 386167, 361366, 322678, 328209, 372733, 394829, 414423, 408534, 387287, 407586, 412730, 405307, 385960, 382987, 342176, 306024, 352066, 337911, 273137, 274146, 278999, 270990, 290203]
20218B90203l2659J0605l2358k5932J6061Q350j8263n7806p5916j5908K0819o240
20206H0956M1756L821k8500K7598L7322J9684p613J5521m2828m3007P0735J3736
20194A89181N183q114j5522l2155j0689J6944L0242L9201p60m5919j8833j379
20182A47380k2453o1692j8940k621j1673j2750P974J1858j847L9817L2560M7718
20170A55331n0576J5044K2675J1543k0843L593J5865k5819N2557j3457L090j8056
20158A50947n9966N258K2383N0489M6987o1786l3771K0796J347k1318R99j7478
20146A04887o215l2404k9911O9067M217L4934M4743n9300j8114n6364k3870L5344
20134F7014N4526m691n630k0037n325m4647p880l896k210K6482K4274k4918p9849
$$ y = [290203, 257544, 268149, 235791, 209859, 225920, 234270, 216007, 158201, 82285, 66377, 87196, 80956, 122712, 126533, 98033, 125631, 162953, 182637, 175024, 190545, 147717, 104710, 175445, 189181, 194364, 186250, 170728, 138573, 127884, 144828, 175070, 214271, 213511, 167592, 148759, 147380, 124927, 63235, 44295, 41674, 30001, 17251, 25225, 37083, 35236, 75053, 107613, 155331, 104755, 119799, 142474, 154017, 133174, 136767, 152632, 126813, 179370, 165913, 169003, 150947, 90981, 96239, 118622, 169111, 216098, 154312, 120541, 141337, 142684, 121366, 122365, 104887, 98672, 66268, 36357, 105424, 109641, 144575, 189318, 130018, 111904, 55540, 31670, 67014, 121540, 116849, 111219, 91182, 85857, 41210, 33330, 29434, 27224, 53706, 77980, 53062, -26787]
20121b6787j2725O4294N3921k2128o2434q9516M8043K5763L5063j4624j5901k7078
20109d4109L5562N7777k2041l6154P257j3572K3230L0175p060j6105O9942J8745
20097A03647l751j3635r366k726j9132j8367Q678l575j7138j7814j9105K3612
20085A1328j8245j8750N9066K2143n36m8766R3682L9069j4153k7947K1948M3818
20073A62657k9250m7654j7168J4274K5576l3104q541L7892k8953j3789L3159M2730
20061A37829J1525P030p9219j4570K2226n807l7141N4687N5116r0617m4983L6072
20049E2148J5609L878q445p702L9970K3396j1121l5915p301R447l6217J7634L502
20036E8883j3775K358M4631l5512L123J5148j656l2465J9757L6587k657j4940
$$ y = [-26787, -39512, 24782, 78703, 56575, -5859, -95375, -47332, -21569, 13494, -1130, -17031, -44109, -8547, 49230, 27189, -8965, -1708, -15280, 7950, 38125, 31065, 14960, 84902, 103647, 99896, 86261, 76895, 74169, 55037, 36670, 45348, 41773, 24635, 6821, -12284, 11328, -6917, -25667, 33399, 55542, 55006, 6240, 99922, 138991, 124838, 96891, 118839, 162657, 133407, 85753, 68585, 82859, 108435, 75331, 66790, 104682, 75729, 61940, 95099, 137829, 149354, 156384, 77165, 62595, 84821, 79014, 41873, 96560, 151676, 61059, 16076, 52148, 67757, 71635, 63190, 55488, 95458, 118854, 107733, 71818, 64517, 73964, 37747, 55381, 58883, 45108, 47466, 92097, 56585, 59708, 74856, 73200, 40735, 60492, 97079, 94422, 79482]
20024G9482N4726j5284k4360k006k8022j045n66m2533o0800J4051K4192j4879
20012a7044M6754j2234N2904Q163n5322k6307N6699q321k222m2559k7255L7344
20000A0600J2042j2773J3787P8627N4179m3986m5523l2812J4345O2798O9955m784
19988A76455m8258j0832j4506m0183k5530j2605L1411L928L4893q176J7101m6114
19976E7584n5771L9519K1648m4853M1311N0969k3276n0298l8420L1043l866J0417
19964C6007M6559J7968q396l2130K9724l2231q3057M2781j1609l3061K5028L5806
19952C3389j4778k3777j6912J7463M6440M0278m1774P1637J26661k973q6551p2582
19940G6521N396R028j2558q525l382K8717K3600O1836o276m5937j4099k0413l5700
$$ y = [79482, 134208, 118924, 94564, 92558, 64536, 63491, 62925, 20392, -40408, -26357, -2165, -17044, 29710, 17476, 70380, 78543, 23221, -3086, 53613, 45292, 43070, 511, -26744, 10600, 22642, 9869, 23656, 102283, 156462, 112476, 66953, 34141, 48486, 111284, 181239, 176455, 128197, 117365, 102859, 62676, 37146, 24541, 55952, 59880, 94773, 86597, 103698, 57584, 1813, 41332, 62980, 18127, 59438, 110407, 87131, 36833, -1587, 29456, 25590, 36007, 82566, 100534, 92138, 60008, 89732, 57501, -25556, 17225, 5616, -27445, -2417, 33389, 18611, -5166, -22078, -4615, 41825, 82103, 40329, 111966, 238627, 235654, 149103, 76521, 81917, 90945, 78387, 69862, 66480, 95197, 118797, 180633, 174357, 128420, 114321, 93908, 58208]
19927E8208L076M8124L1776m4299m3662L009k8547J0824M6187m1696k0686J5237
19915C7551k5238n5824K7809Q7720P5735O9586K167o8082k8687j6331L4494K5287
19903A66187l1584k1972l2188J5929M3795J1634k1566K4866o167n2456k5815K3343
19891I4006l511r839r933k5794k4881k2623P538M6719L2225R4j6232M7607n153
19878A10223j2660j9580K7523N166J6965K1932o086p502Q995k2507L9875K0718
19866A83062K7167J8923O1593J3758L4421O816N715O145Q9934R1495P642j3272
19854E33399k2113K7700L8517l1679j3649o8282J0888l7306L073k8918m2332m4975
19842C24323k1996J7392j8475j276k1756K0134K992o2112j9250j0318j2193j8255
$$ y = [58208, 61284, 109408, 141184, 96885, 53223, 56232, 27685, 38509, 84696, 43000, 22314, 37551, 12313, -43511, -15702, 72018, 147753, 217339, 219506, 151424, 122737, 106406, 140900, 166187, 134603, 112631, 80443, 96372, 140167, 151801, 130235, 155101, 148934, 96478, 70663, 94006, 90495, 80656, 70723, 44929, 20048, -2575, 4963, 51682, 83907, 84001, 67769, 115376, 110223, 97563, 77983, 105506, 110672, 127637, 149569, 143483, 135981, 144976, 122469, 162344, 183062, 210229, 229152, 290745, 304503, 338924, 345740, 351455, 357600, 447534, 539029, 546671, 533399, 511286, 538986, 577503, 545824, 532175, 463893, 474781, 437475, 440548, 411630, 369298, 324323, 302327, 319719, 301244, 299968, 278212, 298346, 301338, 239226, 219976, 209658, 197465, 179210]
19830A79210O971n7683r2495L8399L5338k0684r2864M5673O8859j4030K6448n3594
19818F9548r178k1123m9246p6756J962Q091l871j1315n7583j5282r259m9093p5245
19805b98350q6665p2756o2676p4717m1499R0694J14366j6290l2598L1323P5204
19794c73964Q2982j5547K1466J74096J96977K9993j2363N0148J18026K16458J16551
19783F04823J2712N3299R499J1576k8162k8191J8695K5922L6741J6316n7320m1851
19771F34059k7937j6799K390N765k4517j1975k4327l4467O2758O4209k0338k7783
19759E81038j0111J7379M1316l7916k6282n1741Q0670N1521j1555L5612L11L3158
19747G03400L839M3190M0476K496N4915O9695J01192J07000N3569j5156K5671
$$ y = [179210, 186181, 128498, 36003, 74402, 109740, 89056, -3808, 41865, 110724, 96694, 123142, 69548, 60370, 39247, -9999, -86755, -84793, -76702, -80573, -91888, -149471, -164753, -174012, -223105, -298350, -385015, -457771, -520447, -595164, -636663, -545969, -431603, -447893, -480491, -449168, -373964, -290982, -306529, -285063, -110967, 86010, 116003, 103640, 153788, 271814, 488272, 604823, 617535, 670834, 680333, 691909, 663747, 635556, 654251, 680173, 716914, 733230, 675910, 634059, 606122, 589323, 591713, 597478, 572961, 560986, 536659, 502192, 564950, 629159, 608821, 581038, 570927, 588306, 629622, 591706, 565424, 513683, 594353, 645874, 634319, 669931, 670242, 703400, 707239, 750429, 790905, 793401, 848316, 918011, 1019203, 1126203, 1179772, 1164616, 1190287]
19736A190287M4585L0969k391K0592L0352K6789j683k337n407o4151J8270l0173
19724A255702j1713j9913L3175M1347p5736n2506j4061J523M3529j5940m9604
19713A135803j3322J8744k831M2021O9733o125L647j6135J5485n905j5864o276
19701A218975k5210O908N9448M3094k4145p0374p988M0390R2176L3996r305L2396
19689A390361J5236k2104o337J0060J7773O3829M2813J9277j7629j6236N5619
19678A552662k2178k0083O3292Q3634K3361J5L3567p481N9064M7140O3274O4011
19666A940278j8201M183L9622N5826R2581O9669R1239P7387L9355N5448P7662
19655B525049J20720J36991J63246K11797K16199J88052L29958N00254M64577
$$ y = [1190287, 1234872, 1265841, 1263450, 1284042, 1314394, 1341183, 1339500, 1337163, 1331756, 1267605, 1285875, 1255702, 1243989, 1224076, 1257251, 1298598, 1222862, 1170356, 1156295, 1157818, 1201347, 1185407, 1135803, 1122481, 1141225, 1138394, 1180415, 1250148, 1244023, 1247670, 1231535, 1247020, 1241115, 1225251, 1218975, 1193765, 1200673, 1260121, 1303215, 1279070, 1208696, 1200708, 1241098, 1333274, 1367270, 1357965, 1390361, 1405597, 1383493, 1377156, 1387216, 1404989, 1468818, 1511631, 1530908, 1513279, 1497043, 1552662, 1530484, 1510401, 1573693, 1657327, 1680688, 1680703, 1714270, 1706789, 1765853, 1812993, 1876267, 1940278, 1922077, 1926260, 1965882, 2021708, 2114289, 2183958, 2275197, 2352584, 2391939, 2447387, 2525049, 2645769, 2782760, 2946006, 3157803, 3374002, 3562054, 3892012, 4392266, 4856843]
19646D856843M18202K75727M4826K58703M46874N47426M70854L42960O61962Q21327
19636I145704P50004L10638K8122M62262Q24123Q95718N20366K42922Q39092J260604
19626A5279555J367510J240834J257562K137040L094189L723558M464910N753849
19618C8319007Q941039J4466243K4072850M0130787O0416829O8185398O0173041
19611C14705194K9534588k5598415j911689L5149674M1895832K7738944k3184896
19604C98329232j0601530K1262300K6668524q995425m7865867q786762J8968612
19597C88979084J5940594k0781829q4317357p1708077m2366028k7840815k0208776
19590A37696796j5271686j2042168r957313q452248p155429n766894m855781m294001
$$ y = [4856843, 5275045, 5550772, 5595598, 5854301, 6301175, 6848601, 7319455, 7662415, 8324377, 9145704, 9895708, 10206346, 10234468, 10696730, 11520853, 12416571, 12936937, 13179859, 14018951, 15279555, 16647065, 17887899, 19145461, 21282501, 24376690, 28100248, 32565158, 38319007, 47260046, 61726289, 85799139, 125929926, 186346755, 254532153, 314705194, 344239782, 318641367, 316729678, 351879352, 393775184, 421514128, 398329232, 387727702, 408990002, 435658526, 426663101, 378797234, 370010472, 388979084, 404919678, 384137849, 299820492, 228112415, 185746387, 157905572, 137696796, 122425110, 110382942, 100425629, 91973381, 84817952, 79051058, 74195277, 69901276]
19582F9901276l822860l565321l176824k832288k429029k105713j897512k175192
19574D7896537k305227j730806j344167j277816j542466j849859j537565j154395
19566C5154236j027333j301520j467862j217763j023842r35017j110994j399053
19558B5670852j256550j065775j002975r17996p77923p30626o88426o30008o30651
19549A7969922n90367n93900n48396m35256m40955m85719m96924m52074m07036
19540A3519295l20158l73564m33327l10808l00193l12528l05879k72940k59911
19531A0629987j91381j73145k73243k87216k44550k03047j79601k34215k60141
19522H583448k27345j67772j20446j91422k57418j76535j73193k78465j89130
$$ y = [69901276, 66078416, 62513095, 59336271, 56503983, 54074954, 51969241, 50071729, 47896537, 45591310, 43860504, 42516337, 41238521, 39696055, 37846196, 36308631, 35154236, 34126903, 32825383, 31357521, 30139758, 29115916, 28180899, 27069905, 25670852, 24414302, 23348527, 22345552, 21427556, 20649633, 19919007, 19230581, 18600573, 17969922, 17379555, 16785655, 16237259, 15802003, 15361048, 14875329, 14378405, 13926331, 13519295, 13199137, 12825573, 12392246, 12081438, 11781245, 11468717, 11162838, 10889898, 10629987, 10438606, 10265461, 9992218, 9705002, 9460452, 9257405, 9077804, 8843589, 8583448, 8356103, 8188331, 8067885, 7876463, 7619045, 7442510, 7269317, 6990852, 6801722]
19513F801722k41183k25412j99755j58188j57477j61774j46201j25185j08556
19504E277991j21716j85093j81006j52098p4508j20092j26390j50592j39888j47077
19494C879531n9888q7168r7287j47485j36517j28303j31112k83677k67751o3631
19484B476712n3872r8239j84168k31383j54548n6172j03633k50774k02634n6010
19474A085279L9029K6j79752j95075j04066K5876j1801l7460J9621k2556j02550
19463E16571q5530l4670j791N1750m5598K660M0485M6898J6382j6656l5508o760
19451D48233N4375Q9984o332q0978p3163J923L3901M1370p685l5963q635l700
19439D53330j3817r4698n065M9491Q455j17382j25493p6802p273m9665j9306M452
$$ y = [6801722, 6560539, 6335127, 6135372, 5977184, 5819707, 5657933, 5511732, 5386547, 5277991, 5156275, 4971182, 4790176, 4638078, 4563570, 4443478, 4317088, 4166496, 4026608, 3879531, 3819643, 3732475, 3635188, 3487703, 3351186, 3222883, 3091771, 2808094, 2540343, 2476712, 2422840, 2324601, 2140433, 1909050, 1754502, 1698330, 1594697, 1343923, 1141289, 1085279, 1124308, 1124334, 944582, 749507, 645441, 671317, 659516, 622056, 641677, 619121, 516571, 431041, 396371, 394580, 446330, 400732, 403392, 443877, 490775, 507157, 490501, 454993, 448233, 502608, 592592, 586260, 505282, 432119, 434042, 467943, 509313, 501628, 465665, 457030, 453330, 439513, 344815, 339750, 389241, 397696, 280314, 154821, 78019, 70746, 21081, 1775, 6227]
19427F227n0925p6683K7327J34104J61937P2603K1418j0020J15361J21925J39615
19416F62889J32060J9150N7857P0792J02601P5549J2901J8424Q2783J09771R703
19405A354480p5518q8591k4913l2342L8K6437n0410m844k5072j9755O7J610l0091
19392A031096L5855N0379J02676J85358J45752L3514j40215j27953J9515O0099
19382A396076R1564P5084J9717k43152j96004p3583j19274r5442j02486m0545
19372G11955m4023k8699L4399J681j730o431L4505n5416o8155j2254l2965r110
19360E23757q0435l3609q452j783J6824K7627k7616n4800l2203j8999O269L0405
19348C46985L4364J8182L214R18J9958J2290l5778r0426k6731J0099N140k5288
$$ y = [6227, -44698, -121381, -94054, 40050, 201987, 274590, 296008, 285988, 401349, 523274, 662889, 794949, 814099, 871956, 942748, 1045349, 1120898, 1133799, 1152223, 1235006, 1344777, 1354480, 1278962, 1190371, 1165458, 1133116, 1133154, 1159591, 1109181, 1104337, 1079265, 1059510, 1059577, 1061187, 1031096, 1066951, 1117330, 1220006, 1405364, 1551116, 1584630, 1444415, 1316462, 1335977, 1396076, 1487640, 1562724, 1582441, 1339289, 1143285, 1069702, 950428, 854986, 752500, 711955, 667932, 639233, 673632, 675313, 673583, 667152, 701657, 646241, 578086, 565832, 532867, 523757, 443322, 409713, 401261, 399478, 416302, 443929, 416313, 361513, 329310, 310311, 316580, 346985, 381349, 399531, 402745, 403663, 423621, 435911, 400133, 309707, 282976, 293075, 298215, 272927]
19336B72927k0299L7046J4977l7846k0554j2398K2765K6917j3746q3032k9425
19325A57332J3047k1620l2533L257n3543l035L7701L7987j2922j492J4862J5222
19313A54263Q218j6284n248K646l6725l1296j2217K0554K1275n6491k6245N434
19301B7884Q955j5696M771P631L0051M1808q4988n3861j1772k0978p576J7266
19289e6505N15M0402J7385K5258P8877M4706m1087p589m9550j3270L1874M281
19277G5297M5726Q842m9770K8275K7258l6716n2547o0278L343L3165P6388J2448
19265A11431j0457n9144n7867K1178K7323J7969K2866L7970l1181l5868J7043
19254F1263O5371L5479m5083l8899n6054l0475O9275M0801J942j0602j4118Q474
$$ y = [272927, 252628, 289674, 304651, 266805, 246251, 233853, 256618, 283535, 269789, 186757, 157332, 170379, 148759, 116226, 119483, 65940, 62905, 100606, 138593, 125671, 124179, 139041, 154263, 162481, 146197, 140949, 143595, 106870, 75574, 63357, 83911, 105186, 48695, 22450, 27884, 36839, 21143, 25914, 33545, 63596, 105404, 20416, -33445, -45217, -66195, -73771, -56505, -55990, -15588, 1797, 27055, 105932, 150638, 109551, 101962, 52412, 39142, 71016, 75297, 121023, 129865, 80095, 108370, 135628, 98912, 46365, -13913, -10570, 22595, 98983, 111431, 100974, 41830, -16037, 5141, 32464, 50433, 73299, 111269, 80088, 44220, 61263, 126634, 162113, 117030, 78131, 22077, -8398, 60877, 101678, 103620, 93018, 78900, 87374]
19242H7374q2327l406L3629J0728q886r997L2095L4753j9148k6042K1084r284
19230F0573m6264L4235O1019j7132p2261l8352k7824P1371M6390K1080L543l0682
19218F5696O687p95l3545J4549K7785m0280K3105L6290N435p1603p049Q1256l4371
19205G3160l5391j5418j9056L3777n055J8331l2525l9871J6455J3731L758O6942
19193G8838N2775k329j2320j7286n5634q343k793n1305J4074J8626L260j0513
19181G050K906K7855L9418J0094k5663K226j3357M1359O4012P0125l8107o8204
19169A19714j8704j4588L9647K7461j8134J0963M5944Q1297P3970O365J15225
19158D69160K36779L00844L41543K76041J73672j96245l72238j78915p4419L7423
$$ y = [87374, 5047, 1641, 35270, 45998, 37112, 27115, 59210, 93963, 74815, 48773, 69857, 60573, 14309, 48544, 109563, 92431, 20170, -18182, -46006, 25365, 71755, 92835, 96378, 65696, 72383, 71588, 38043, 52592, 80377, 40097, 63202, 99492, 104927, 33324, 26275, 107531, 73160, 37769, 22351, 3295, 37072, 32017, 50348, 17823, -22048, -5593, 8138, 11896, 78838, 131613, 129284, 116964, 99678, 44044, 35701, 32908, -18397, -4323, 14303, 17563, 7050, 9956, 37811, 77229, 87323, 61660, 63886, 50529, 91888, 155900, 226025, 187918, 119714, 101010, 86422, 126069, 153530, 135396, 146359, 192303, 273600, 347570, 353935, 469160, 705939, 1006783, 1348326, 1624367, 1798039, 1601794, 1229556, 1050641, 976222, 1013645]
19148A013645J62142K92660M54244M19396L15437L7225j22187j62793m87044m96895
19138A425830k03236o9521L6774J62021K71714K57665J49106k25560m77533l35013
19128I92247j73710r4767j00885r6694m8763j6849j0843o8709o4599l9367l2016
19117B45045j387K6327l3039J6385M5310K2242j7575r346O458k4456J6962K5570
19105C18496q7390n3382L7165j7085m2699J0823k1617k7425Q961k2813m099J9074
19093A18009J862K7892M3514K0799L1281n3481p5071p7259O9655N3159l9599k2244
19081I8517o1300l9321R2096K8877K6752K1634J8997K4663o5038m7488j8815k1395
19069E8179j8801K732k5964J1958K4790j136L4079L3330k7991L44J9616l4282
$$ y = [1013645, 1175787, 1468447, 1922691, 2342087, 2657524, 2694749, 2572562, 2409769, 1922725, 1425830, 1222594, 1153073, 1189847, 1351868, 1623582, 1881247, 2030353, 1804793, 1327260, 992247, 818537, 723770, 622885, 526191, 477428, 460579, 449736, 381027, 316428, 277061, 245045, 243658, 269985, 236946, 253331, 298641, 320883, 303308, 293962, 300420, 275964, 292926, 318496, 231106, 177724, 214889, 197804, 155105, 165928, 144311, 116886, 125847, 103034, 98935, 118009, 119871, 147763, 191277, 212076, 243357, 189876, 114805, 37546, 107201, 160360, 120761, 98517, 37217, -2104, 89992, 118869, 145621, 167255, 186252, 210915, 145877, 98389, 79574, 58179, 39378, 42110, 16146, 28104, 52894, 51758, 85837, 119167, 91176, 91520, 111136, 76854]
19057G6854l1063J4819J1226K4075j8046Q846K1882L2198l4201L5075K8510n8018
19045A12157n1092j9483l150L3084J6182k2458m0241L9799L4362J6128m3528j0135
19033F1625Q743J7899J4651j9324r689k6963j5160L1333k5874j9431K4702l0406
19021A2106o3154P036N6881K0362j4085M8547l240O825k0878R602m1270J4386
19009C3118N3142N6749m1199m4985j5703M4222M7852o624J1054k1947j5920j0746
18997H9013j5430J9332J774m7285n1266L5500K0324J3219k3934n222j9620J041
18985A7446j2837l7469J9226L5248j4066r059m6470l5131K0801J6080N9167K8404
18973D1340O4204J7123j7809l7457j7567N8355N5136O196m4082q472J6406K9868
$$ y = [76854, 45791, 60610, 71836, 95911, 77865, 86711, 108593, 140791, 106590, 141665, 170175, 112157, 61065, 41582, 38432, 71516, 87698, 65240, 24999, 64798, 99160, 115288, 71760, 61625, 70368, 88267, 102918, 83594, 73905, 46942, 31782, 63115, 37241, 17810, 42512, 12106, -51048, -44012, 12869, 33231, 19146, 67693, 64453, 71278, 50400, 60002, 18732, 33118, 86260, 143009, 101810, 56825, 41122, 85344, 133196, 126572, 137626, 115679, 99759, 89013, 73583, 92915, 94689, 47404, -3862, 31638, 51962, 65181, 41247, 36025, 16405, 17446, 4609, -32860, -13634, 21614, 7548, -1511, -47981, -83112, -62311, -46231, 12936, 41340, 105544, 122667, 104858, 67401, 49834, 108189, 163325, 169521, 125439, 116967, 133373, 163241]
18961A63241L1518r628K7433j6470J6396L2891r692K1550M7924M5195J33516J60577
18949F44451J51900K50502K94007L02041J77516j13252j4875J90986K32886J72607
18939B288769m0806n5162Q7471J59438o3048k80741q8521J21697J28191j31228
18929B126060m42210m09201k17779j45719j01439j07208k6190k6768l8530m6427
18919E64589l5714n3409j8082m0630j0436J6204O74l8557J0845K1915j1308p8852
18907C27239L9990O3840J3363J9202l3321K4725J8225L7794j4758j4465j9730
18896D62104Q875P9470R1246J19864J97941K62081L97618O76799Q61767Q39868
18886C997633N26041l21028l54246L04885N41322N85056j0264o36643j04245M41743
$$ y = [163241, 194759, 185131, 212564, 196094, 212490, 245381, 235689, 257239, 305163, 350358, 483874, 644451, 796351, 1046853, 1340860, 1642901, 1820417, 1707165, 1692290, 1883276, 2116162, 2288769, 2247963, 2192801, 2280272, 2439710, 2376662, 2095921, 2007400, 2129097, 2257288, 2126060, 1683850, 1274649, 1056870, 911151, 809712, 702504, 676314, 649546, 611016, 564589, 528875, 475466, 457384, 416754, 406318, 422522, 423196, 384639, 395484, 417399, 406091, 327239, 367229, 431069, 444432, 463634, 430313, 455038, 473263, 511057, 496299, 481834, 462104, 470979, 550449, 641695, 761559, 959500, 1221581, 1619199, 2295998, 3157765, 3997633, 4523674, 4202646, 3848400, 4153285, 4694607, 5279663, 5269399, 4632756, 4528511, 4970254]
18876D970254M30117J92721m92246m51694J63654L36756K26824m88992j101852
18867C785542q04958m48003l35864k18205j08154q4938q0055j53063j27556m2650
18857A382096k3180o3074j14355o1293r5489p4441k0872m4137q6933k8784m2967
18846G26571J8099j40l3274K6543Q774K5669l4691m446m6416j10396m3710q388
18834E24195L9796l8782m0445n8262m1331j234L9970K6116M91j3233n6270m6233
18822C34778n289j6933k6315k6260k5884M1044J6282M314P2968O3304j8046n593
18810D08370p1190j9630l575l7971J3651k645L0553K2248M756J1650L025o2525
18798B96717j9761j2878j8444j4908j111K3238M544k445P6796R6087J1430K7874
$$ y = [4970254, 5400371, 5593092, 5100846, 4649152, 4812806, 5149562, 5376386, 4887394, 3785542, 2980584, 2532581, 2196717, 1978512, 1870358, 1785420, 1705365, 1552302, 1424746, 1382096, 1358916, 1295842, 1181487, 1120194, 1024705, 950264, 929392, 885255, 798322, 769538, 726571, 744670, 744530, 711256, 737799, 746573, 772242, 737551, 733105, 686689, 576293, 532583, 524195, 563991, 525209, 484764, 426502, 385171, 383937, 423907, 450023, 450514, 437281, 381011, 334778, 329489, 312556, 286241, 259981, 234097, 275141, 291423, 295737, 368705, 432009, 413963, 408370, 337180, 317550, 313975, 276004, 289655, 287010, 317563, 339811, 344567, 356217, 359242, 296717, 276956, 264078, 245634, 230726, 229615, 252853, 257397, 254952, 331748, 427835, 439265, 467139]
18786D67139P1978P2692L5569J1433o016N375n7984m2777m3038n5730m6440l7804
18774C74397k6939m6144m4437q966j2911l8451O873P7130P6640R6985Q4127L6004
18762E74308o4229q2712r8057l8796R3519N0876k6837l3818k1106n9959K6914
18751C20103O003j5180J4941M1222M6004n0800k588j824K5281P4718K8751K8840
18739E15471K7374l3428k3994k1844o066J8759K6989l3605p2344L5764l1230n2617
18727C49229n5124l3848l9494k622m634K196O2131j6367j14590J9657K9965l2909
18715A63590j254l6480p523J0138l5669m7251K2861Q506m940j5224l0491n9276
18703c3013l3656J053J165l3580J2716n3238k3937r1815q6102j23345j13201K6401
$$ y = [467139, 539117, 611809, 647378, 658811, 652795, 658170, 600186, 557409, 514371, 458641, 412201, 374397, 347458, 301314, 256877, 247911, 235000, 196549, 203422, 280552, 357192, 454177, 538304, 574308, 510079, 427367, 329310, 290514, 384033, 434909, 408072, 374254, 353148, 293189, 320103, 326106, 310926, 325867, 367089, 413093, 362293, 359705, 357881, 383162, 457880, 486631, 515471, 542845, 509417, 485423, 463579, 457513, 476272, 503261, 469656, 397312, 433076, 401846, 349229, 294105, 260257, 220763, 218141, 213507, 215703, 277834, 261467, 146877, 166534, 196499, 163590, 162336, 125856, 118333, 128471, 92802, 45551, 68412, 76918, 71978, 56754, 26263, -33013, -66669, -65616, -64451, -98031, -85315, -138553, -162490, -254305, -340407, -463752, -576953, -550552]
18691e50552K44J11175K17289J29685k6822j18045o2537q7624j04674r5220O842
18680e80239R8842J96441J20269K06477J79552O7980l7175m7098j9190n7902r2982
18669C4975m9047J11847K10992J06123N2828k2336k3267r626N2928K9335O273
18658E01025J1833k5049j129j0730R165L671n434k3546j0901k581l6763m1943
18646C67618P20K0960O2599P2149K0386l2175j8208j3717N4851M7470n6790l3124
18634D92739P164R3075P5401K8547N0951R3226Q5428j4844o115l5275n1446j0336
18622H08515P3877Q4432R2656R7964N0067M0155J1647j8357j02811m6867j1106
18611A080172l9901k6098R1169R8820K5069Q980n1227m9113n7383o8944O8926
$$ y = [-550552, -550308, -439133, -221844, -92159, -118981, -237026, -299563, -387187, -491861, -587081, -580239, -481397, -284956, -164687, 41790, 221342, 289322, 252147, 205049, 185859, 127957, 34975, -14072, 97775, 308767, 414890, 467718, 445382, 422115, 412489, 465417, 494752, 501025, 512858, 487809, 486680, 475950, 485115, 488786, 483352, 459806, 448905, 446324, 409561, 367618, 368338, 389298, 451897, 524046, 544432, 512257, 494049, 480332, 535183, 582653, 525863, 492739, 499903, 592978, 668379, 696926, 747877, 841103, 926531, 911687, 905572, 870297, 818851, 808515, 882392, 966824, 1059480, 1157444, 1207511, 1247666, 1259313, 1240956, 1138145, 1091278, 1080172, 1040271, 1014173, 1105342, 1204162, 1229231, 1238211, 1186984, 1137871, 1080488, 1011544, 1080470]
18600A080470L3416l8195L5107p7310p5830J740K7566N5434R980L623n290j1688
18588A039023k1097N6000N1307O8228J3102J3790j5085l6446n1451R68K1436L5939
18576A175714P730L1089L4089J1414j963M3568M1525P6078K8863m5860l7202N8277
18564A423322M4788j0145j4866j3284J6549M0957R0412J04240L7365n079N0049
18553A764308P4155P9922K7832O916J42992J79341K23574K88953M00469L56411
18543C544873K59214n4579k89704j02918k978O0135K23414M74304N21162N91748
18533E224671N94686L06696J19128K0862k77126j90343J16553L83852O60999Q84712
18523G844690J096943J227574R35835J95049n65027k01195M56366Q23911J188608
$$ y = [1080470, 1113886, 1075691, 1110798, 1033488, 957658, 959398, 986964, 1042398, 1052378, 1056001, 1050711, 1039023, 1017926, 1073926, 1125233, 1193461, 1206563, 1220353, 1205268, 1168822, 1117371, 1118339, 1139775, 1175714, 1183444, 1214533, 1248622, 1260036, 1258073, 1301641, 1343166, 1419244, 1448107, 1402247, 1365045, 1423322, 1468110, 1457965, 1443099, 1429815, 1446364, 1487321, 1577733, 1681973, 1719338, 1714259, 1764308, 1838463, 1918385, 1946217, 1953133, 2096125, 2275466, 2499040, 2787993, 3188462, 3544873, 3804087, 3749508, 3459804, 3356886, 3353908, 3414043, 3637457, 4111761, 4632923, 5224671, 5819357, 6126053, 6245181, 6266043, 5988917, 5798574, 5915127, 6298979, 6959978, 7844690, 8941633, 10169207, 11105042, 11300091, 10735064, 10533869, 10990235, 11814146, 13002754]
18514A3002754J665820K139700K721111L290591L470655M169152N959383R022557
18506D5441723J5006666K6695307M5006472O1682299N8652167M1768008j6970828
18499B77281814o5258427m0609081j4750360L595119K3969062M9558836P1669358
18492C05456321P8305898P4899227J7011795k0730561k2000493p6645680q0407738
18485B75888769m4273008k0761163k792931J8547884M0460085M6536288L3683953
18478C47289877n645697p3638548o6400115l8051785k3786572j6500111j2272299
18471A10994750r610663p678992o720406n641123m982911n567772n201765l701508
18463F1889610k549083j991288j946079k431842k156360j789835k095441k607137
$$ y = [13002754, 14668574, 16808274, 19529385, 22819976, 26290631, 30459783, 36419166, 45441723, 60448389, 87143696, 132150168, 193832467, 252484634, 294252642, 277281814, 212023387, 171414306, 156663946, 160259065, 184228127, 233786963, 305456321, 383762219, 458661446, 475673241, 454942680, 432942187, 356296507, 275888769, 231615761, 210854598, 208061667, 226609551, 267069636, 313605924, 347289877, 341644180, 268005632, 201605517, 163553732, 139767160, 123267049, 110994750, 101384087, 93705095, 86984689, 81343566, 76360655, 70792883, 65591118, 61889610, 59340527, 57349239, 55403160, 52971318, 50814958, 49025123, 46929682, 44322545]
18455D4322545k691728k480863k053336j794416j490220j181726q55691o29297
18447C1145268n16231o55652j065737j076953j079607j329390j217354j060391
18439B3143953q48118p09625n82750l62561l36978m75338q38130j015313p92327
18430A7182813o74100o37880n92426m94161m16070l59362l73348l81831l37940
18421A2915695l26178l79683l57441l17453k74887k78030k64865l03669k53863
18412A0159626k01742k09388k20553j81319k12302k43730j91328k71593k86604
18403H141067k07035j92878k37317k20949j91601k01781k20344k13501j89121
18394F266540j34484j45095j62710j92058k08405j72736j46380j24882j52720
$$ y = [44322545, 41630817, 39149954, 37096618, 35302202, 33811982, 32630256, 31774565, 31145268, 30629037, 29973385, 28907648, 27830695, 26751088, 25421698, 24204344, 23143953, 22295835, 21586210, 21003460, 20640899, 20303921, 19828583, 18990453, 17975140, 17182813, 16508713, 15870833, 15278407, 14784246, 14368176, 14008814, 13635466, 13253635, 12915695, 12589517, 12209834, 11852393, 11534940, 11260053, 10982023, 10717158, 10413489, 10159626, 9957884, 9748496, 9527943, 9346624, 9134322, 8890592, 8699264, 8427671, 8141067, 7934032, 7741154, 7503837, 7282888, 7091287, 6889506, 6669162, 6455661, 6266540, 6132056, 5986961, 5824251, 5632193, 5423788, 5251052, 5104672, 4979790, 4827070]
18385D827070j24615j58767j16364j09572j64834j24426q4033j24552j46501l01538
18375C371868j96114j30394n8098p3201j33360o0218q5587j28822k22934j80815
18365B102325j69304j74025j45925j57431m3392m543q372k5764o0969j06970o1097
18354A144533j21629k21686j30664N206M99N975q437R106L1338K775m5139n4517
18342F17360p5211l4451k2782k7975J0202P0915L3513o475K7208P7895k5641n8650
18330E85908r6546j08753o826K5180J0660n302r927p113L2003k754k2413j02797
18318B91320r1252m2959l5580j9302P3338N6995J65147J75844L5850l7436q9975
18307D81990p3027m9098m7181j7780J46529K39505K39246J14597R6195P401p1968
$$ y = [4827070, 4702455, 4543688, 4427324, 4317752, 4152918, 4028492, 3944459, 3819907, 3673406, 3371868, 3175754, 3045360, 2987262, 2914061, 2780701, 2720483, 2634896, 2506074, 2283140, 2102325, 1933021, 1758996, 1613071, 1455640, 1412248, 1407705, 1399333, 1373569, 1312600, 1205630, 1144533, 1022904, 801218, 670554, 675760, 676259, 682234, 673797, 682903, 714241, 717016, 671877, 617360, 542149, 507698, 484916, 456941, 467143, 538058, 571571, 565096, 592304, 670199, 644558, 585908, 489362, 380609, 373783, 398963, 409623, 404321, 394394, 387281, 419284, 416530, 394117, 291320, 200068, 157109, 121529, 102227, 175565, 232560, 397707, 573551, 609401, 571965, 481990, 408963, 359865, 312684, 294904, 441433, 680938, 920184, 1034781, 1130976, 1138377, 1066409]
18296A066409j04209o8407j00890n1857N801J36177K04212K37295Q4718j40542
18286A268707q0981l5962m0836o5002k1351j1574q1083m2175m5321O4764K9406
18275I38592o1965j4290q566K598J9677m89k7224m0244j5293o8463k5174n1676
18263F47483p599O9487P5408N7873l9910q7330m4398m2206l0711P678m9643l6959
18251E19173J5604K6574J1779m3765Q959M1800r070j6492j6448k682j2889m5008
18239D77535k2899N4582k2604k7709K4762R5183k9254n7987n9962J9687o226r050
18227D36058M1569M0350l0297n0866q6709m0515j6783M3339J8108K4984J0778
18216C90016J1275j0839K8852q7270n3748N5973L2936m4619k9734j8910k4775
$$ y = [1066409, 962200, 893793, 792903, 741046, 746847, 883024, 1087236, 1324531, 1409249, 1268707, 1187726, 1151764, 1110928, 1045926, 1024575, 1013001, 931918, 889743, 844422, 909186, 938592, 876627, 862337, 853771, 856369, 876046, 875557, 848333, 808089, 792796, 724333, 699159, 647483, 639884, 709371, 784779, 842652, 802742, 715412, 671014, 628808, 598097, 605775, 556132, 519173, 534777, 561351, 573130, 529365, 538324, 580124, 571054, 554562, 538114, 535432, 522543, 477535, 454636, 509218, 486614, 458905, 483667, 578850, 549596, 491609, 431647, 451334, 445108, 436058, 477627, 517977, 487680, 436814, 350105, 309590, 292807, 336146, 354254, 379238, 390016, 401291, 390452, 419304, 332034, 278286, 334259, 367195, 322576, 292842, 273932, 249157]
18205B49157n4518J3610J4093M5025M701n1253J3694J5750O0163M0206k2984m8837
18193B78807J7697N335m5595k3281L675n1172k0940K1696K7881m2025k9863M166
18181A46381O0107M1907r20J7132J8906m652r0980l2264K0062P472k4407k2889
18169A35855k1412J8443M3506l808k681k4730j2736O9585L7939m6186o412J6599
18157B03962L3648k908k2519J8174l331m704K7286M3420O1713r428r223k161J7007
18144C50936K7958j9795l6602k3027o556K833P890J1303L7767O6797J623j4416
18132D06711J0757M4537L2465O7100P7673N5268o088L1616P2003J08021J20614
18121A020677J38158J66869J01304J32973K81475L38653M43183O05097P76734
$$ y = [249157, 194639, 208249, 222342, 267367, 272068, 220815, 234509, 250259, 310422, 350628, 327644, 278807, 296504, 301839, 256244, 232963, 236638, 185466, 164526, 186222, 214103, 172078, 142215, 146381, 206488, 248395, 247475, 264607, 283513, 278861, 187881, 155617, 175679, 183151, 158744, 135855, 114443, 132886, 176392, 172584, 169903, 145173, 132437, 202022, 239961, 193775, 187363, 203962, 237610, 234702, 212183, 230357, 227026, 222322, 249608, 293028, 354741, 345313, 336090, 333929, 350936, 378894, 359099, 322497, 299470, 292914, 295747, 303637, 314940, 352707, 419504, 421127, 406711, 417468, 462005, 494470, 561570, 639243, 694511, 688423, 720039, 792042, 900063, 1020677, 1158835, 1325704, 1427008, 1559981, 1841456, 2180109, 2623292, 3228389, 4005123]
18112D005123J080041J786274K940007N157487R044580J3861741J4942646J1525031
18104F4342930R06975j7488988j5319521q220441m862515l285206k446834j962486
18096A1663914j554135j200337r33024p55931o14151n14727m07679l27711l00147
18087E056072k89262k65846k73900k37993j95494k34357j95549j71114j88717
18078C003840j24712q7245j30586q6110q2306q0955o3492m9072q6449o5451k4866
18067B122596q3801r0399p0483q7500n2534l6225o9419P034r608r0960r3718n1307
18055A393676o1426m8229q6817o5752L9758L326j6860J2920j1537L396m3670q6734
18043A032051n3230j5099J8657l7939p8748r588K90k6513k6207K7928J1823r0473
$$ y = [4005123, 5085164, 6871438, 9811445, 14968932, 24013512, 37875253, 52817899, 64342930, 65249905, 47760917, 32441396, 24220955, 19358440, 16073234, 13626400, 11663914, 10109779, 8909442, 7976418, 7220487, 6606336, 6091609, 5683930, 5356219, 5056072, 4766810, 4500964, 4227064, 3989071, 3793577, 3559220, 3363671, 3192557, 3003840, 2879128, 2791883, 2661297, 2575187, 2492881, 2411926, 2348434, 2299362, 2212913, 2147462, 2122596, 2038795, 1948396, 1877913, 1790413, 1737879, 1701654, 1632235, 1639269, 1629661, 1538701, 1444983, 1393676, 1332250, 1284021, 1197204, 1131452, 1171210, 1174536, 1157676, 1170596, 1159059, 1162455, 1118785, 1032051, 978821, 963722, 982379, 944440, 865692, 856104, 856394, 829881, 803674, 831602, 843425, 752952]
18031G52952o0967q926m1185j099L2487L673k1084j8716k8470o741p7417m3509
18019D80998J8526k1774n3281J1219L4547l0579R92K2242k8142l445l0974n795
18007C94534k9925L769P2325Q527j1893q200r598R509q975k0190p9482l5933Q454
17994B92922R973j4487l5831r62L6965J2592k6861J9582m452o2448l8218L2947
17982B21722O8854K6588q4505j7881j3531k1804K8680q610j9894K4443K7839J9234
17970B51135j6594m2894k9115q273L5260j693p973k8696j4403K9102N1675M2524
17958B60055O601p0184o5879N6097N0729N311l4658k8563l101M0138J8831k8039
17946B07338k6198j9599P384N2712O0778O5572J23779J56234K24564L83792L86622
$$ y = [752952, 691985, 683059, 641874, 640775, 673262, 676935, 655851, 637135, 608665, 601924, 524507, 480998, 499524, 477750, 424469, 435688, 470235, 439656, 440648, 462890, 434748, 431303, 400329, 394534, 364609, 368378, 440703, 449230, 437337, 429137, 419539, 429048, 420073, 399883, 320401, 284468, 292922, 302895, 288408, 252577, 251615, 288580, 301172, 274311, 293893, 289441, 226993, 188775, 221722, 290576, 317164, 232659, 214778, 201247, 179443, 208123, 199513, 179619, 204062, 231901, 251135, 234541, 191647, 162532, 154259, 189519, 187826, 179853, 151157, 136754, 165856, 217531, 260055, 266656, 196472, 130593, 186690, 237419, 242730, 208072, 179509, 176408, 216546, 235377, 207338, 181140, 161541, 168925, 221637, 282415, 347987, 471766, 628000, 852564, 1236356, 1622978]
17935A622978L10020J01551j82767l2663J79405K19877M7923l63006l88561p5261
17925A439496J77470L35381K88560J45322j93051k42205N5023J06213Q5222j06639
17915B090792l92522l15059k12919j18900j24386q3416p2269n1713m3006m4292
17905F32310m5315m4657n8380P433J9952K3315Q194m1927p0496n2476l5782m8059
17893B94112j1501K6175M5089m7212j0556Q473q753M9984K2413m8305l8787j5363
17881B65769m3722N986J9297K1139k6824j8066j3000k3749m293M5978j0033j3881
17869B04601k2853J6706L2256m7279k7916J3902J5389k3514j5538M2194N1317
17858B39265k058p2233n8605L4163Q832j1756O4325Q7146l2917N168O0096M1918
$$ y = [1622978, 1932998, 2034549, 1851782, 1819119, 1998524, 2218401, 2266324, 1903318, 1514757, 1439496, 1616966, 1952347, 2240907, 2386229, 2193178, 1950973, 2005996, 2112209, 2197431, 2090792, 1698270, 1383211, 1170292, 1051392, 927006, 843590, 771321, 719608, 676602, 632310, 586995, 542338, 483958, 491391, 511343, 534658, 542852, 500925, 430429, 377953, 342171, 294112, 282611, 308786, 353875, 306663, 296107, 304580, 295827, 345811, 368224, 319919, 281132, 265769, 222047, 228033, 247330, 268469, 241645, 223579, 210579, 186830, 182537, 228515, 218482, 204601, 181748, 198454, 230710, 183431, 155515, 169417, 184806, 161292, 145754, 187948, 239265, 237207, 164974, 106369, 140532, 149364, 137608, 201933, 289079, 256162, 261330, 321426, 363344]
17846C63344O955M6926P6683N5262J78718L38727K91883K78284J38353k40391
17836A534744k60963j74728o3235R1844J78087L05284M23568M99689K94519l0429
17826B798380p2223l46651n58704m09145j82522P594M4352J51089K63620K15702
17816A911492R8367k30352l92399l22761k13584n7483n2474n3500m8419j8234
17806F20653p4544j26977p6156N248l2580K555k3614M3753L1157p4565k8424L3710
17794C00216K2905j9241K786j0746q0158r5253J729P0200K9868n5672n5904q129
17782A02601l8426L962N4831O4610j3997l4194k4861N7433m451k7643o683n707
17770A27475j7475k7314O882L6821L3562o9513J594m66Q011M0807L3710N458m046
$$ y = [363344, 370299, 417225, 493908, 549170, 727888, 1066615, 1358498, 1636782, 1775135, 1534744, 1273781, 1099053, 1035818, 1127662, 1305749, 1611033, 2034601, 2534290, 2828809, 2798380, 2726157, 2379506, 1820802, 1411657, 1229135, 1236729, 1281081, 1432170, 1695790, 1911492, 2009859, 1779507, 1387108, 1064347, 850763, 793280, 740806, 687306, 638887, 620653, 546109, 419132, 342976, 348224, 315644, 318199, 294585, 338338, 369495, 294930, 266506, 300216, 323121, 303880, 306666, 295920, 215762, 120509, 122238, 192438, 222306, 166634, 110730, 102601, 64175, 68137, 122968, 187578, 173581, 139387, 114526, 171959, 167508, 139865, 133182, 127475, 110000, 82686, 89568, 126389, 159951, 90438, 92032, 91566, 99577, 140384, 174094, 179552, 175506]
17757A75506k4999p639M0114j504m482n0519k0715j6775J7228M0082K9987j7837
17745A58447k4014M5075L950p6532k3170j0969o12n224m8676L7306L1718K7657
17733A14956j8377J2399o3446m5408j3320J2913L0751L1164N0602n1557m7601
17722A3076q109L6560j5673j0038L55Q2801R706q2210q2881r408K8593P4606K2273
17709E9651o5826l6118M6028j1529m4632R445N3395L7385m2053O581m2622j3700
17697d3995N852P9014R344L9728L6318m3856q445M7657k4057o6832o0319N039
17685b4552o042M503j5905l2177m8523K0714L3956K8269M5232M395o3089L1335
17673b1884K6291L1476N2666L5942O4266m3243j01730m1382P02L8139L5396J6113
$$ y = [175506, 150507, 142868, 182982, 181478, 176996, 126477, 105762, 88987, 106215, 146297, 176284, 158447, 134433, 179508, 183458, 106926, 83756, 72787, 72175, 66951, 18275, 55581, 87299, 114956, 96579, 108978, 45532, 124, -13196, -283, 30468, 61632, 112234, 60677, 13076, 4967, 41527, 25854, 15816, 16171, 98972, 108678, 26468, -56413, -65821, -37228, 37378, 59651, -6175, -42293, 3735, -7794, -52426, -42981, 10414, 47799, 5746, 12327, -30295, -43995, -38143, 40871, 50215, 89943, 126261, 82405, 73960, 121617, 97560, 30728, -29591, -24552, -30594, -26091, -41996, -74173, -122696, -101982, -68026, -39757, 5475, 9870, -53219, -21884, 4407, 35883, 88549, 124491, 188757, 145514, 43784, 2402, 3104, 41243, 76639, 92752]
17661I2752p612J2320l1958j8956j2609L077j9502N6810L9542l6708o8335m6913
17649c8092j8270j7066K5143j3075o195L0363L3926m4830l1213K461L3016K3205
17637b0627J6862O018l2633l5846l5448M2826R02J7843K0591R371L7571l2337
17625d907K8413l8141m3084K1526K2545K6257K7904O2093J2384K560P4989M3045
17613B35584N0936J2022l7046m4293K9000J5752J4483o522K6388M9875K0175j3455
17601C52899L1208q613l3071J9322m3502l5226k5186j7049j0641p6517j3652j6725
17589A23247l6418O98M62m1888q352O1403L710n4349n4643J6033P9048J5664o5084
17576C9531r1534K6525L1283j7260m1667q7368K7804J2934j6634m6971O5456j2289
$$ y = [92752, 85140, 97460, 65502, 46546, 33937, 37014, 17512, 74322, 113864, 77156, 8821, -38092, -56362, -73428, -48285, -61360, -67555, -37192, -3266, -48096, -79309, -76848, -43832, -20627, -3765, 2253, -30380, -66226, -101674, -58848, -57946, -40103, -19512, -10141, 27430, -4907, 23506, -14635, -57719, -36193, -13648, 12609, 40513, 102606, 114990, 117550, 192539, 235584, 286520, 298542, 261496, 217203, 246203, 261955, 276438, 269916, 296304, 346179, 366354, 352899, 384107, 375494, 342423, 361745, 318243, 283017, 257831, 240782, 230141, 153624, 139972, 123247, 86829, 87527, 87989, 46101, 37749, 99152, 102862, 48513, -6130, 9903, 88951, 104615, 39531, -52003, -25478, 5805, -11455, -53122, -140490, -112686, -99752, -116386, -163357, -97901, -110190]
17564a10190n2559m0107l6092n7223k8673L635k8m8885r4081j40485p2599p6643
17552g53930j0253J1643J64951K1813k05j7263M6621K18432J33650n095j00849
17541b90485q5915l1571N3011R4648J57592K5925M5547J43001J52805J38429R5064
17530D98051M0551k0607J0597m602n5327m61m1380K0563L612l3878m2518m5381
17518C29220r379j0671j8825P678r442L3787Q3176P0108k8167k1744k7212n1118
17506C47411K969j9827K7737M9029L717m030m25N9010J22451K8701j2466k6440
17494E77837M7487Q1623N9653P6715O1530J1756J1494j1001M9944L4006l5882
17483I65162R378J7971m3021m6422K991Q7536M1316j6862J6629M7711J01000L1195
$$ y = [-110190, -162749, -202856, -238948, -296171, -324844, -321209, -321237, -370122, -464203, -604688, -677287, -753930, -764183, -752540, -587589, -565776, -565981, -583244, -536623, -318191, -184541, -189636, -290485, -376400, -407971, -354960, -260312, -102720, -76795, -31248, 111753, 264558, 402987, 498051, 538602, 517995, 528592, 523990, 468663, 468202, 426822, 447385, 450997, 417119, 374601, 329220, 319841, 309170, 290345, 298023, 288581, 322368, 405544, 475652, 447485, 425741, 398529, 347411, 350380, 330553, 358290, 407319, 411036, 407006, 406581, 465591, 588042, 616743, 604277, 577837, 625324, 706947, 766600, 843315, 904845, 916601, 928095, 917094, 967038, 1001044, 965162, 974540, 992511, 949490, 903068, 906059, 993595, 1034911, 1018049, 1034678, 1082389, 1183389, 1214584]
17471A214584J0105p662l7172m0467j9928n0199l9838k9711J2007l8435K487q605
17459I67166j8938m363k9861Q0954N5640j6063j4894K343n5696n3411K6994J0450
17447I50321n3215n271N3188J23M2030K5581Q6850J55788P1551J01l3691q1998
17435A211358n7332n9151k1246M3616K2654K6100p059m9095k7388K2065L1598
17424A136120M865N6078j7258k2698N0526P2815N0760M0490L512m410M6823P6657
17412A494280P1570M2927K5753J5560L8310Q8657Q0543K6939J05675J19330O2410
17401B171954P8370J49723J43410K75571K85027M24218N18363M83038M91714K69184
17391E290572P4237K78780M00153M09579J82487n7834J58245M88949O56660Q35200
$$ y = [1214584, 1224689, 1217027, 1179855, 1139388, 1119460, 1069261, 1029423, 999712, 1011719, 973284, 975771, 967166, 948228, 943865, 914004, 994958, 1050598, 1034535, 1019641, 1021984, 966288, 912877, 939871, 950321, 897106, 891835, 945023, 945146, 987176, 1012757, 1099607, 1255395, 1326946, 1327047, 1293356, 1211358, 1154026, 1094875, 1073629, 1117245, 1139899, 1165999, 1158940, 1109845, 1082457, 1104522, 1136120, 1140985, 1197063, 1179805, 1157107, 1207633, 1280448, 1331208, 1371698, 1375210, 1370800, 1417623, 1494280, 1565850, 1608777, 1634530, 1650090, 1688400, 1777057, 1857600, 1884539, 1990214, 2109544, 2171954, 2250324, 2400047, 2543457, 2819028, 3104055, 3528273, 4046636, 4529674, 5021388, 5290572, 5364809, 5643589, 6043742, 6453321, 6635808, 6577974, 6736219, 7225168, 7881828, 8717028]
17381H717028J120350J023383P52375O89295Q58967J218601J577260J706414J938877
17372A9602550K569921L536063M979257P129171J0467659J6846939K8169088M6318636
17364A39619284O5626337O7180545N6280353J0424861l1431016O155431L2574702
17357C46430497K9634217p924937o7982257m7096371n123723K8349542M8456086
17350C24743054M6860546L0596596k7203600l0240102J2175302K3360283J0536298
17343C90828377n0258406q4422997n4962571l2927715k3108272j7725129j3898009
17336A13525278j1252415r143700p567250o196956m898371m378531m040354l283624
17328F2764077k595988k301316k448618k993740k977138k449595k036076j862000
$$ y = [8717028, 9837378, 10860761, 11613136, 12302431, 13161398, 14379999, 15957259, 17663673, 19602550, 22172471, 25708534, 30687791, 37816962, 48284621, 65131560, 93300648, 139619284, 205245621, 272426166, 328706519, 339131380, 307700364, 313855795, 346430497, 376064714, 368139777, 300157520, 253061149, 247937426, 276286968, 324743054, 371603600, 402200196, 374996596, 344756494, 356931796, 380292079, 390828377, 340569971, 256146974, 201184403, 168256688, 145148416, 127423287, 113525278, 102272863, 93129163, 85561913, 79364957, 74466586, 70088055, 66047701, 62764077, 60168089, 57866773, 55418155, 52424415, 49447277, 46997682, 44961606, 43099606]
17320D3099606j870082k005845j696903j319203j073498q77291p73091r04720
17312C2578973j249145j144816r40012q64517r34943j254320j368474j098134
17304B3724612r88217r04960q20008p37183o73065o83207o82408o15176n44904
17295A7075484m41591m44565m46967m31513m41941m32819m06616l56298m01437
17286A3271737l16457l08449l64976l09228k69538k79368k65806k48661k20355
17277A0688899j82263j83032j83196k44183k75132k40876k94825k59472k08432
17268H617488j90030k09121k80564k93860j45289j98103k34848j77329j55010
17259F733334j96528j57557j53943j78197j55185k02684j61840j59750j37659
$$ y = [43099606, 41229524, 39223679, 37526776, 36207573, 35134075, 34256784, 33483693, 32578973, 31329828, 30185012, 29245000, 28380483, 27445540, 26191220, 24822746, 23724612, 22736395, 21831435, 21011427, 20274244, 19601179, 18917972, 18235564, 17620388, 17075484, 16633893, 16189328, 15742361, 15310848, 14868907, 14436088, 14029472, 13673174, 13271737, 12955280, 12646831, 12281855, 11972627, 11703089, 11423721, 11157915, 10909254, 10688899, 10506636, 10323604, 10140408, 9896225, 9621093, 9380217, 9085392, 8825920, 8617488, 8427458, 8218337, 7937773, 7643913, 7498624, 7300521, 7065673, 6888344, 6733334, 6536806, 6379249, 6225306, 6047109, 5891924, 5689240, 5527400, 5367650, 5229991]
17250E229991j16209q1971j90970j47694j72376j79386j24527p4817r4295j53312
17240C894434j01366j00605j90469k43288j96321o5649q1867j76188k47374k11014
17230B280293o8475n0053l5155m5251q4121j35515k29782j59089n6101l8482j07909
17219A270360j83970q9258l1632m173m5526p2099m2922j4766j7319J1974K270
17208G82939J9686J9410k035J6040l1988o0860m6655l043M5J531l1135q9723m6486
17195E27726k1107J3851N2065J0363L1131N5518M7019m3470m288m0836o7043l6037
17183E24892L34o6987j02001n046j7522p4389k1208K6058N5059P7444R7609J28175
17171F22418K4275k7144M9471J17158K25554O1495j33413q1395N77O5710J11511
$$ y = [5229991, 5113782, 5031811, 4840841, 4693147, 4520771, 4341385, 4216858, 4142041, 4047746, 3894434, 3793068, 3692463, 3501994, 3258706, 3062385, 2996736, 2914869, 2738681, 2491307, 2280293, 2211818, 2161765, 2126610, 2081359, 1997238, 1861723, 1631941, 1472852, 1416751, 1378269, 1270360, 1086390, 997132, 965500, 961327, 915801, 843702, 800780, 786014, 768695, 780669, 782939, 802625, 822035, 820000, 836040, 804052, 743192, 696537, 693494, 693539, 695070, 663935, 574212, 527726, 506619, 520470, 572535, 582898, 614029, 669547, 716566, 673096, 668808, 627972, 560929, 524892, 525226, 458239, 356238, 351192, 333670, 259281, 238073, 264131, 319190, 396634, 494243, 622418, 646693, 619549, 669020, 786178, 1011732, 1073227, 939814, 858419, 858996, 924706, 1036217]
17160A036217J34625J30118l7324j5702O3351J18264R2115K395j29339k7134k5477
17149A342109m1097o3778q7353j0365L1910n8119K416Q651j9641M381k8084p1361
17137A009669P979R7420R7552M2425J13951J46588K72344N32338O77537P39427
17127C737230O26011J17283q41466p86905l61214j78635n7763J24576M08700O49723
17117C437540P39137O38876K5950r28131q83230m71926k63194j41615o9260J13401
17107B197548L60506N61181P82250O31488L17490n62451r22280n70838l03700
17098B491194q1120Q0629K73758N56312P05496N50871J95973p28988r57920o16974
17088B469231l66486k17667j59793j42388j54042j25994p1454l7569j4258o2035
$$ y = [1036217, 1170842, 1300960, 1263636, 1247934, 1311285, 1429549, 1521664, 1524059, 1394720, 1367586, 1342109, 1301012, 1237234, 1149881, 1139516, 1171426, 1113307, 1115723, 1124374, 1104733, 1109114, 1081030, 1009669, 1017648, 1115068, 1212620, 1255045, 1368996, 1515584, 1787928, 2320266, 2997803, 3737230, 4363241, 4480524, 3639058, 2852153, 2490939, 2312304, 2254541, 2379117, 2787817, 3437540, 4176677, 4815553, 4841503, 3913372, 3030142, 2558216, 2295022, 2153407, 2084147, 2197548, 2558054, 3119235, 3901485, 4532973, 4850463, 4288012, 3365732, 2794894, 2491194, 2410074, 2490703, 2764461, 3320773, 4026269, 4577140, 4773113, 4044125, 3086205, 2469231, 2102745, 1885078, 1725285, 1582897, 1428855, 1302861, 1231407, 1193838, 1179580, 1117545]
17078A117545j30859r1099j2812q933p457k850J5941k0998p6388q3166M063l7919
17066F65068n7173j0515q755p1729K6447P9243J8759k6758j4928L3673m0052p6766
17054E16514n6125L3761L2415k7006k0155k0235r6197K7203N7492O748P2341J07858
17042F34614J65822J39011J32117P1650j42165j49361m5402M1698J29127J25596
17032A102707N7668k51901k03934j34007j18555o3578Q381J8735L0101q076q2880
17021C54661p2889K1183J1120Q130k4018j1300l6369o538L9651J3272L4410J6782
17009C48095l2070J322p794J1311m3231p4148J7727M478j5381k8975l5625l6067
16997A09642R1928O6235O0474j2289K3172k1105m9984o4594l0215q91L5864j6623
$$ y = [1117545, 986686, 895587, 882775, 873842, 866385, 863535, 879476, 858478, 782090, 698924, 702987, 665068, 607895, 597380, 588625, 516896, 543343, 622586, 641345, 614587, 599659, 633332, 593280, 516514, 460389, 494150, 526565, 499559, 479404, 459169, 362972, 390175, 447667, 454415, 526756, 634614, 800436, 939447, 1071564, 1143214, 1001049, 851688, 806286, 847984, 977111, 1102707, 1160375, 908474, 704540, 570533, 451978, 388400, 396781, 415516, 445617, 437541, 354661, 281772, 302955, 314075, 322205, 298187, 286887, 250518, 243980, 283631, 296903, 331313, 348095, 316025, 317347, 309553, 320864, 277633, 203485, 221212, 225690, 210309, 181334, 145709, 109642, 201570, 267805, 328279, 315990, 339162, 318057, 268073, 203479, 173264, 172373, 208237, 191614]
16985A91614m2528k6202Q2689O4439O451l5830j5198j4652j7763l5962q757m8030
16973A00271J5948M8748j187O86R383N6771M4524j5010q2569p1439J0316M2961
16961A59403j4366L5202Q564M093P888K7130L5061o2333p4651J4102K2158j9732
16949A42519j5447o511N4547O517j1781K1393m7211l4513M224n2238k6630l38
16937C4531K1995M59R019J5932l3362J2308L5286L3871K1592M5355K0107q2390
16925A34703m3462J2931J9706n32p3319Q174P5502N1202q14l7746K5626K5426
16913A97397P368k4706k5733L536Q54l912M4400L6102j2817J9364j5485j6533
16901B09835l9968k4398l9385J529P2527l387m7159K632k7166j3213K4697O328
$$ y = [191614, 149086, 122884, 205573, 270012, 276463, 240633, 225435, 210783, 193020, 157058, 148301, 100271, 116219, 164967, 163780, 164466, 173849, 230620, 275144, 260134, 177565, 106126, 116442, 159403, 145037, 180239, 188803, 192896, 200784, 227914, 262975, 200642, 125991, 140093, 162251, 142519, 127072, 120561, 175108, 181625, 169844, 191237, 144026, 109513, 113737, 61499, 34869, 34531, 56526, 56985, 66004, 81936, 48574, 60882, 96168, 130039, 151631, 196986, 217093, 134703, 91241, 104172, 123878, 123346, 50027, 58201, 133703, 184905, 184091, 146345, 171971, 197397, 204765, 180059, 154326, 157862, 158716, 154804, 199204, 235306, 222489, 241853, 226368, 209835, 169867, 145469, 106084, 107613, 180140, 176753, 129594, 132226, 105060, 91847, 116544, 122872]
16889A22872k208n9661l8348n852J0430j1898L8288k3384L14j7158L526N5102
16877G2023K7323r335O608j9376o315k9056j2653J7985K9908m2157M2670K9162
16865A06787n888J672r719M7003K8877J959K0034p535j6818r1185M515L997L24
16852H4023m1198M8392J9500j1654N8765K8062m8975J3350j9107l3196j3660j5714
16840F8588R263j6117q638j5770L1J7814k0077j7159r299L7887J8867L0496K1616
16827A17502l6903o3229M7705R0379K8852m1287k1592J4815k3653J2234R0089
16816B14912L1994k7649n157m3117M2342P8328M5758M5950J6277k0993J8210M4443
16804D41298j9258o4345n5460m5053J5063J7837k5847l2855L5814M789K1j2973
$$ y = [122872, 120664, 61003, 22655, 16803, 27233, 15335, 53623, 30239, 30553, 13395, 16921, 72023, 99346, 90011, 96619, 77243, 70928, 41872, 29219, 47204, 77112, 34955, 77625, 106787, 100899, 102571, 92852, 139855, 168732, 170691, 190725, 183190, 166372, 75187, 79702, 83699, 84023, 42825, 91217, 110717, 99063, 157828, 185890, 136915, 150265, 131158, 97962, 84302, 68588, 77851, 61734, 53096, 37326, 37357, 55171, 35094, 17935, 8636, 46523, 65390, 95886, 117502, 80599, 17370, 65075, 155454, 184306, 143019, 121427, 136242, 112589, 124823, 214912, 246906, 219257, 214100, 170983, 213325, 291653, 337411, 383361, 399638, 378645, 396855, 441298, 422040, 357695, 302235, 257182, 272245, 290082, 264235, 231380, 267194, 271983, 272004, 259031]
16792B59031k3167L4876Q1389P4453R6051J10544K03083K66582L41183L51145
16782A795170K85955n2928r9796M4908J51642L5423k21061l62312r9392R5005
16772A572614J93110K59897K60290P6628j89869j2852O5808M7453q0485l86149
16762A806445l90167l05184j67487j04458o6930m003o1441l0673n0091k0003P951
16751F13959q7997n5615l6173k0260K6523r540l1996j9717m6084J4233K0304J0528
16739C78165n3241m7338m2870j2914k6693N0252N6864j1595n2849p759K2099q867
16727B43254N764O472K4935J7754o2271l6792n8085o1782nK2091L5853K9319p61
16714A65746N862K6195K4461J7716m5101m942J6369K6325r142K485j2342k5096
$$ y = [259031, 235864, 270740, 352129, 426582, 522633, 633177, 836260, 1102842, 1444025, 1795170, 2081125, 2028197, 1928401, 1973309, 2124951, 2160374, 1939313, 1577001, 1477609, 1572614, 1765724, 2025621, 2285911, 2362539, 2172670, 2159818, 2225626, 2273079, 2192594, 1806445, 1416278, 1111094, 943607, 839149, 772219, 768216, 706775, 676102, 626011, 606008, 613959, 525962, 470347, 434174, 413914, 440437, 430897, 398901, 379184, 333100, 347333, 367637, 378165, 324924, 277586, 234716, 221802, 195109, 245361, 302225, 290630, 237781, 230022, 252121, 243254, 249018, 255490, 280425, 298179, 235908, 199116, 141031, 79249, 79244, 101335, 137188, 166507, 165746, 171608, 197803, 222264, 239980, 194879, 189937, 206306, 232631, 223489, 225974, 213632, 188536]
16702A88536l7168l5502q897n4340k0319P3648M6481M7628k005K2735j0780m2616
16690A67401J8562l2581J000K2701M6948L7723k327m6420l0958l2639o7933k012
16678G9465M278l3198m2058K8931O0868K5090l1706n2916k6611J9721J8564N1846
16666A02274J7165K1362N1566n9549o7282k1180P4060J9129q9155l5695O4870
16655G7565M4707l9362M3329O331r0210J364N2500J9994O152l7089k7501j8123
16643C9657k3504p842N4618J0904k3650P9357j7880q3574L7721K2577N527j7771
16631G6140L127m011J2972K1625N0709K169n5978l2129J8851L4316n333j20373
16619B085k4238L3951J6905J2541K5560l6797j9342J0585N0738L0020J9793L2387
$$ y = [188536, 151368, 115866, 106969, 52629, 32310, 105958, 152439, 200067, 198062, 220797, 210017, 167401, 185963, 153382, 154382, 177083, 224031, 261754, 259427, 213007, 182049, 149410, 81477, 79465, 83743, 50545, 8487, 37418, 98286, 123376, 91670, 38754, 12143, 31864, 50428, 102274, 119439, 140801, 192367, 132818, 65536, 44356, 118416, 137545, 48390, 12695, 77565, 122272, 82910, 126239, 132570, 42360, 43724, 96224, 116218, 122370, 85281, 57780, 39657, 16153, 8311, 62929, 73833, 50183, 129540, 111660, 28086, 65807, 88384, 93911, 76140, 79267, 75256, 88228, 109853, 160562, 162731, 106753, 74624, 93475, 127791, 122458, 2085, -22153, 11798, 28703, 41244, 66804, 30007, 10665, 21250, 71988, 102008, 121801, 154188]
16607A54188K5330l0604k2599K5518l3709J5679R9035N8524J4267L98k1068o0708
16595B24251o3863k4108J2669r61P762Q779k5772k2648j628p749k8552L9970j4226
16582A03924r036K9747k2928m9538N905M7425J3630p922K8032L1558k1067J1851
16570A61581n1218m7976M2511l9297J4611K1301q022o6667k0620M9156K5736M01
16558H1497J9055N9838L0519K7023J5360n3464k5986K7262L1956m8691m3861j315
16546A19193L908m6152P113P312M9595L5060L7021J4944o7914l8712K5798K4452
16534A71618j4605j1336M1354J7143m273l0238j7827k1057N918J0421m3172J8521
16522A22467M409j4532k6468r343M512k7638j6805m748Q1533K1738j2424j357
$$ y = [154188, 179518, 148914, 126315, 151833, 118124, 133803, 232838, 291362, 305629, 306027, 284959, 224251, 160388, 136280, 148949, 147988, 155750, 164529, 138757, 116109, 114481, 106732, 78180, 118150, 103924, 94888, 124635, 101707, 52169, 58074, 105499, 119129, 111207, 139239, 170797, 149730, 161581, 110363, 62387, 104898, 65601, 80212, 101513, 93491, 26824, 6204, 55360, 81096, 81497, 100552, 160390, 190909, 217932, 233292, 179828, 153842, 181104, 213060, 164369, 120508, 119193, 123101, 76949, 84062, 91374, 140969, 176029, 213050, 227994, 160080, 121368, 147166, 171618, 157013, 145677, 187031, 204174, 199901, 169663, 151836, 130779, 136697, 147118, 103946, 122467, 126876, 112344, 85876, 76533, 81045, 53407, 36602, 31854, 113387, 135125, 122701, 121344]
16510A21344K3942j5635k7570J4710m2205k6363k353P324J6263M2123k742q954
16498I9884l7039K3882J0472l4403j3743j5204L5707M2001k358k7228k3977R875
16486F7869o8396J0824j7571M8038o17L590L9407K7393j4734J2598L5773p923
16474A36251l0374J1032l137q63K2949o590J1589k3991o810m0820M619N1850j1200
16461A14505l5628N6631O497K0035m4437q246m5257n0454k1174J3573O6493M0694
16449A13232j0864l8125k7360k5278L2659L0090o285j3366J7320j9782j0919J7022
16437E8344n8454L4160L6120R659j6887k784n173k0151l3085L0435K4929j360
16425E5753l4429K5214N5832Q993J6335O13n7134K1291K1277K5910N712J6182
$$ y = [121344, 145286, 129651, 102081, 116791, 74586, 48223, 45870, 53194, 69457, 111580, 108838, 99884, 62845, 86727, 97199, 62796, 49053, 33849, 69556, 111557, 109199, 81971, 57994, 67869, -527, 10297, -7274, 40764, 40147, 43737, 83144, 110537, 95803, 108401, 144174, 136251, 105877, 116909, 113772, 112909, 135858, 129268, 140857, 116866, 110056, 69236, 73855, 125705, 114505, 78877, 135508, 142005, 162040, 117603, 109357, 64100, 13646, -7528, 6045, 72538, 113232, 102368, 64243, 36883, 11605, 44264, 74354, 68069, 54703, 72023, 52241, 41322, 58344, -110, 34050, 70170, 79829, 62942, 60158, 54985, 34834, 1749, 32184, 57113, 55753, 21324, 46538, 102370, 111363, 127698, 128311, 71177, 92468, 113745, 139655, 145367, 161549]
16413A61549j178m1193l8290n6034j6548j0464L4024K0789j9408k0588j4929l169
16401e439N2775J0715N561j4190K4342N3161O373p8327n9933j4261M7778J8860
16389D7415n1946n636J5668L8970p196m5289l0809L266K1509M499k5766j490M5314
16376H509L4821k9692P738k5818K8986k366l5517L5291k5790l4372J0122K1783
16364f305j9836m2837J6669M1501l942K2909l2532O743M2269J7066L9074l1694
16352D9085l3819k2232M0859L7608J8980L4168m071p9140m2032j8507L6172L963
16340B1034J6380K4038l5986K491O657M2760l831m0637k0884M368J7445J6439
16328E0274N258P98K0365L9755k4054k4863k2558l073j1089K2554k8629o8836
$$ y = [161549, 160371, 119178, 80888, 24854, 8306, -2158, 31866, 52655, 33247, 12659, -2270, -5439, 47336, 58051, 63612, 49422, 73764, 126925, 133298, 54971, -4962, -19223, 28555, 47415, -4531, -10167, 5501, 44471, 37275, -8014, -38823, -35557, -14048, -9549, -35315, -36805, 8509, 43330, 13638, 21376, -4442, 24544, 22178, -13339, 21952, -3838, -38210, -28088, -6305, -26141, -68978, -52309, -10808, -14750, 8159, -24373, -17630, 24639, 41705, 80779, 49085, 15266, -6966, 33893, 71501, 90481, 124649, 120578, 41438, -594, -19101, 17071, 21034, 37414, 61452, 25466, 27957, 34614, 77374, 73543, 32906, 12022, 16390, 33835, 50274, 55532, 56330, 76695, 116450, 92396, 67533, 44975, 41902, 30813, 53367, 24738, -44098]
16316d4098L8387J01051k0559j6548j085R327N6112N623p8767o1282M5927N1260
16304H5348m897k5440p721k000L5891j9176l988j6060j4024j2052K3516M5890
16292H5287l8396j1766k9550k0154N8684N3278m7969R130J9638m0831q5107J3834
16280c3922O1505k127N552j968J1094m3635l915m005m528J8232J2912L930M3716
16267F2841O2629K859l7335l6411P690R835J1595k2020j9477K2248O7655L8391
16255A70500J1977O5087J5649j20277p2406p99J8127K2999K1270K329J8236K9248
16243A81940q022q0096l1598M7598N2470n6128n6580j7319N5876k0657J4662n264
16231G6882J8066J3002l9908k9392l1566K2854J5607k1347K2123N1395p781j8630
$$ y = [-44098, -5711, 95340, 74781, 58233, 57148, 66475, 122587, 128210, 49443, -11839, 34088, 85348, 80451, 55011, 47290, 45290, 81181, 62005, 58017, 41957, 27933, 15881, 39397, 85287, 46891, 35125, 5575, -14579, 44105, 97383, 49414, 58544, 78182, 37351, -47756, -33922, 27583, 25456, 31008, 29040, 40134, -3501, -7416, -11421, -15949, 2283, 15195, 19125, 62841, 125470, 128329, 90994, 54583, 62273, 72108, 83703, 61683, 42206, 64454, 132109, 170500, 182477, 247564, 263213, 142936, 70530, 69731, 87858, 110857, 132127, 134456, 152692, 181940, 173918, 93822, 62224, 109822, 162292, 106164, 49584, 32265, 88141, 67484, 82146, 76882, 94948, 107950, 68042, 38650, 7084, 29938, 45545, 24198, 46321, 97716, 89935, 71305]
16219G1305j7936j8816j2687m5288j8423K4156L4300N679M9184M4883L6302k4061
16207A28598l0644n7013j5337Q822k9200J7891O0187J0849K2819j1763l7240q8556
16195b0587r786J8827K7382O9205j5009o3126j3521K5204K1631j5226N5551M337
16183H4882k5104j7580M446J127n1474k3359P136J893N8285n584o872K6254l708
16170E0342O509K6995K4956j5233j8379m1874n8858k0179M5100P1095o02L0550
16158A00422O8133m8063M6448J8287k0776j0266n3718m1542P8143L265l2025Q527
16146A16835j0448j3238k1974J8105l6189k312L0973l4299j4742K9404M119J0900
16134G7134n840m9831M4767j937j0577l6965n1888j9560L6278K7376Q825m613
$$ y = [71305, 53369, 34553, 21866, -23422, -41845, -17689, 16611, 22290, 71474, 116357, 152659, 128598, 97954, 40941, 25604, 34426, 5226, 23117, 83304, 94153, 116972, 105209, 67969, -20587, -30373, -11546, 15836, 85041, 70032, 6906, -6615, 18589, 40220, 24994, 80545, 84882, 59778, 42198, 46644, 47771, -3703, -27062, -19926, -18033, 40252, 34668, 27796, 54050, 50342, 56851, 83846, 108802, 93569, 75190, 33316, -25542, -45721, -621, 70474, 69872, 100422, 168555, 120492, 166940, 185227, 164451, 154185, 100467, 58925, 137068, 140333, 108308, 116835, 106387, 93149, 71175, 89280, 53091, 50779, 81752, 47453, 32711, 62115, 66234, 77134, 71294, 21463, 66230, 64293, 53716, 16751, -35137, -54697, -18419, 8957, 17782, 13169]
16122A3169J0490J5161K4866L1027m1403q345j1435j5518p6860K3597J2205K6504
16110C458M713n5627m6809J7489r96J910O7235L8824k5755q276j898j5509N5101
16097C3860N064p7956j019R941j9385m210J2353M9202J6071k5756m010K9616M771
16084B8542L9024k6376o970N0070k1642o1622k2167j9013q2723K0522N1716R211
16072d1428K2473l4744R023L2855M2995k5480o5994K7830Q870k1753o891L4599
16060a7645L4110J9138l6547k6490R245L3002j2495l0446j6594K9372N4540J4007
16048E3197n7266K5645N9904N5643J6161k4555n8763j094K2991K4712Q140l1713
16036I3002n6355q4500j0959l2798J7249L9957R936O738L9487K808k7212m3330
$$ y = [13169, 23659, 38820, 63686, 94713, 53310, 44965, 33530, 18012, -58848, -35251, -23046, 3458, 8171, -47456, -94265, -76776, -77772, -75862, -8627, 30197, 4442, -3834, -5732, -21241, 33860, 38924, -39032, -40051, -30110, -49495, -53705, -41352, 7850, 23921, -1835, -5845, 23771, 28542, 67566, 41190, 34220, 84290, 62648, 1026, -21141, -40154, -122877, -102355, -50639, -41428, -18955, -53699, -44676, -11821, 31174, 5694, -60300, -32470, -23600, -45353, -52244, -17645, 16465, 35603, -944, -27434, -18189, 14813, 2318, -28128, -44722, -15350, 39190, 53197, -4069, 21576, 81480, 137123, 153284, 128729, 69966, 68872, 91863, 116575, 124715, 93002, 36647, -47853, -58812, -91610, -74361, -34404, -24468, -17730, 21757, 24565, -2647, -45977]
16024d5977M1199L4230j5514j3041l0186j2515n645k1866P502K5854j635L3243
16012d351l2649J4942L5433M2021j3974k9815j2220L6524N1565J0197O70j1544
16000H6799l3373l6395l5934p1704L2739O4910j3597Q631J2704j4591m319M935
15988H05n8905j1012J754l858J9549J3483M9580J9116m2933k369N8305O8756l7850
15975G4421k8382l6717K1860N1510p864m7j6403K7782k4899Q360J4572Q117l7492
15962E4818n3748j9003k668M2823K8955K597j6201K1095N6322p7642m5358m2628
15950e0638J5424J8120k9255L0688O2068J5194k5641n2529j1191k966L6098L4511
15938C9883k1190j0370J2643m4294O6735J7246L1988L0367m0493l1995k0707n197
$$ y = [-45977, -4778, 29452, 13938, 897, -29289, -41804, -47449, -69315, -61813, -35959, -37594, -4351, -37000, -22058, 13375, 55396, 41422, 11607, -613, 35911, 87476, 97673, 98343, 86799, 53426, 17031, -18903, -90607, -57868, 7042, -6555, 2076, 14780, 189, -4130, 805, -58100, -69112, -67358, -71216, -51667, -38184, 11396, 30512, -12421, -14790, 43515, 112271, 74421, 46039, 9322, 31182, 82692, 74828, 74781, 58378, 86160, 61261, 69621, 84193, 92310, 54818, 1070, -17933, -20601, 22222, 51177, 53774, 37573, 58668, 114990, 37348, -8010, -50638, -35214, -17094, -46349, -15661, 46407, 61601, 35960, -16569, -27760, -30726, 5372, 39883, 18693, 8323, 20966, -23328, 43407, 60653, 92641, 123008, 82515, 50520, 29813, 24616]
15926B4616J0707r422l2859l5155N0500J4072j5184K598M185k005O5537K9639
15914A07229m6904l3490l1509l4308j5587k2155Q0089P611l4134l2624j9180J1666
15902f3296K2466Q2483K2373L8088l3621n3059j7796K8819m8145j1287J2470L3357
15890A2852M6404j1759m4728L7636L2564m4291k3201m0655p375L227L8468L2590
15878C1732J9485N746L7977j2729o5364m0498Q315L9215R635L238k0261j2458
15866D033K6382L0983L341L8364J7217m816j6888o1752n2212k8423j1991m8533
15854a04295L4541M5307J4616K5833p405p886l6872p907r494m1731M3277J5283
15842c6733k9231J034L8161O0737k182m2513p0565K1922L5569N3889K8134k1305
$$ y = [24616, 35323, 25901, -6958, -42113, 8387, 22459, 7275, 9873, 14058, 12053, 77590, 107229, 60325, 26835, -4674, -38982, -54569, -76724, 3365, 10976, -23158, -55782, -74962, -63296, -40830, 41653, 64026, 102114, 68493, 15434, -2362, 26457, -21688, -32975, -20505, 12852, 59256, 47497, 2769, 40405, 72969, 28678, 5477, -35178, -42553, -39326, -858, 31732, 51217, 56963, 94940, 82211, 16847, -23651, -15336, 23879, 33514, 36752, 16491, 4033, 30415, 61398, 64739, 103103, 120320, 115504, 98616, 36864, -15348, -43771, -55762, -104295, -69754, -24447, -9831, 16002, 8597, 711, -36161, -44068, -53562, -95293, -52016, -36733, -65964, -64930, -26769, 33968, 31786, -10727, -81292, -59370, -23801, 30088, 58222, 36917]
15830C6917j6496M770n738n1500m4881Q639O9031j790l8933k571L0004L0518N1579
15817F9549m5068M975j5324J6455O891J1672n1587j7765K1118J3562O8100K3495
15805A06073j1803k7716J8890J0623n9576j3376J4002M907q673j4855M8859n402
15793F1953m1032l2946L5994l5738Q286j53L305j4873J6884K624j5696R027M2103
15780C9738R070L0661M7635L987j5470n0133m5066J3378O1122Q690m6589p5902
15768a8879l6794N773L3896L5414J8602m3140m5839j7600J3739Q035p058N4441
15756E90O7071L8555o935j1348l0551m6825o1221m2139L5629J03873M1779l4278
15744E4200j1190n8375l6378n7447p885O9291L3735j8790n38k9806l1564J4011
$$ y = [36917, 20421, 25191, 19453, -32047, -76928, -68289, 742, -1048, -39981, -42552, -12548, 17970, 69549, 24481, 29456, 14132, 30587, 37478, 49150, -2437, -20202, 916, 14478, 82578, 106073, 94270, 66554, 85444, 96067, 36491, 23115, 37117, 42024, 33351, 18496, 67355, 61953, 20921, -12025, 23969, -11769, -3483, -3636, -331, -15204, 1680, 4304, -11392, -2365, 39738, 48808, 79469, 127104, 131091, 115621, 65488, 20422, 33800, 94922, 103612, 57023, -18879, -55673, -49900, -16004, 19410, 38012, -5128, -50967, -68567, -54828, -46793, -53851, 590, 67661, 106216, 99281, 87933, 57382, 10557, -50664, -92803, -57174, 46699, 88478, 54200, 43010, -15365, -51743, -109190, -117075, -47784, -14049, -32839, -33377, -63183, -94747, -80736]
15732h0736J9826k2672L2381K8837j1018o281m1921J6012j8392n187O2698K3788
15720b665o307K4917P1883K0063m6801n2522l7067J937l3289l1487K1991r87R229
15707f1105p414p721N2161O1517l3413j2099n025K4071j7021p912j2303k2409
15695d8673j5369L0984N4523M0291j5530m3098L2674L2678j0178k0460J7192m2845
15683A2189l8914j7906N4147M0570M975O266K4352l0219k6585l71Q680k0496m9137
15670c2449k1134k1948M2184M1554J2670k8657L7785j6551l3845m4942M3321N7372
15658C5360j2239k7110o9109J5918K4494M44J2625l2028j5033K7940k3604k9092
15646i1434N4064J2809o0834P5239N5432L0384n3499l0161l1037O985m230N8396
$$ y = [-80736, -60910, -83582, -51201, -22364, -33382, -39663, -81584, -65572, -83964, -89151, -26453, -2665, -8972, 15945, 87828, 107891, 61090, 8568, -28499, -26562, -59851, -91338, -69347, -70334, -61105, -68519, -76240, -24079, 37438, 4025, -8074, -13099, 10972, -6049, -13961, -26264, -48673, -64042, -33058, 21465, 61756, 46226, 3128, 35802, 68480, 58302, 37842, 55034, 12189, -26725, -44631, 9516, 50086, 55061, 61327, 85679, 55460, 28875, 28504, 37184, 16688, -32449, -53583, -75531, -33347, 8207, 20877, -7780, 30005, 13454, -20391, -65333, -22012, 35360, 23121, -3989, -73098, -57180, -32686, -32242, -19617, -51645, -66678, -38738, -62342, -91434, -37370, -24561, -85395, -10156, 45276, 75660, 22161, -8000, -39037, -32052, -36282, 22114]
15634B2114m931j0663j3175N753N0541J4397Q292l350L7297N5270m2559o4250
15622E4736k8502N5668N5194K5057p0240q3076L897O1883M4812n8890o970j7462
15610C6107p4027J8388K8418n054M0165N0736N5532j2810n1871p0216k3735l4440
15598d2807N2794J7819k7869j3481J5698R210j9747R255J2506m0842J7497J1338
15586A371k2290K0678p424j0531m4116L6638J712k2363K6405K6103K6710K0861
15574E3754j3851k1246l6966M2038K6463m4930k8856q064k6340K6223N0875o2311
15562d3211Q313K5810j8299K6709K1058m5861l3591K3447L3951K8566o1128p5788
15550a10024R814j9974m5102J8519m3940J4466O6233O7458O4307O1761o1212n6054
$$ y = [22114, 17183, 6520, -6655, -902, 49639, 64036, 72328, 68978, 106275, 161545, 118986, 54736, 26234, 81902, 137096, 162153, 91913, 8837, 12734, 74617, 119429, 60539, 53569, 36107, -37920, -19532, 8886, 3832, 43997, 94733, 150265, 137455, 85584, 15368, -8367, -42807, 9987, 27806, -63, -13544, 2154, 11364, -8383, 872, 13378, -27464, -9967, 1371, -20919, -241, -7665, -18196, -62312, -25674, -23962, -46325, -19920, 6183, 32893, 53754, 39903, 18657, -18309, 23729, 50192, 5262, -23594, -31658, -57998, -31775, 19100, -43211, -34898, -9088, -27387, -678, 20380, -25481, -59072, -35625, -1674, 26892, -34236, -110024, -100210, -120184, -165286, -146767, -190707, -176241, -110008, -42550, 21757, 83518, 22306, -33748]
15538c3748L8458k5057K9674O5660K8595m9243p3044K987J9500m1868J3744Q2086
15526E7744M6505j1037n2452k4224k0280m3344J5034J5626J7959k8367J0010r669
15514b6495p2985k659O6053q364p007l3069O4219M8224k1897P044n2117j8522
15502e7575N119j3647K1636p914K4052L8486K6909l4086m683k7999n718J4420
15490b1000K389J129j0925l3040J7828J8040J6219N9634m8364l9875l1791l131
15478g2887L2872J0602K9177n301j0592j7831J8375L0972k2581N480K025N812
15466F123K8061j7624l4665J0837M5186j8058q596Q532n2276m2435j2352M5326
15454d1941P1186j6j3577P404l1015o8213j1052M4455o737K3087K8028L7543l8929
$$ y = [-33748, 4710, -20347, 9327, 74987, 103582, 54339, -18705, -15718, 3782, -38086, -24342, 57744, 104249, 93212, 40760, 16536, -3744, -47088, -32054, -16428, 1531, -26836, -16826, -26495, -99480, -102139, -36086, -44450, -51457, -84526, -20307, 27917, 6020, 13064, -39053, -57575, -52456, -66103, -44467, -52381, -28329, 10157, 37066, 2980, -1703, -29702, -35420, -21000, -18611, -17482, -28407, -61447, -43619, -25579, -9360, 50274, 1910, -37965, -69756, -72887, -40015, -29413, -236, -5537, -16129, -33960, -15585, 15387, -7194, -1714, 311, 6123, 34184, 16560, -18105, -7268, 37918, 19860, 11264, 19796, -32480, -74915, -87267, -41941, 29245, 29229, 15652, 23056, -7959, -76172, -87224, -42769, -49506, -26419, 1609, 39152, 223]
15441B23o4603L4657N4772l7023j53N8746M7786L1540k7121l045l3460n9163k9806
15428b6650J2793q506L150n077k0833n929L5094K1122n8114j7050m449J8966M4396
15415a1087o737o979L5915j2370O1097j2724K371r92J5788l7736l6582j2926j6331
15402c9293m6138l4841J0186L9282N681K704O658M3990j8014q730j3122n7787
15390a09424J426J0370L5778L1686j2318Q375m1929m1512L7369O2034P525j3803
15378b4423k2082J430m8607l6382k0236M8407N6761O5187k7667n5549M6365L5783
15366A8987p4453k9964M9662L5194L6725o7085k6733N0793N1698j2221l563j6605
15354A2435l6140M3223k232j2147L651k1318P544L5404j8148J1493n7658K148
$$ y = [223, -64380, -29723, 25049, -11974, -12127, 46619, 94405, 125945, 98824, 95779, 62319, 3156, -26650, -13857, -22363, -19213, -24290, -45123, -51052, -15958, 5164, -52950, -70000, -74449, -55483, -11087, -17824, -24803, 11112, -1258, 59839, 47115, 49486, 48494, 64282, 26546, -10036, -22962, -39293, -85431, -120272, -110086, -70804, -65123, -62419, -55761, -11771, -29785, -38515, -51637, -109424, -107998, -97628, -61850, -30164, -42482, -34107, -76036, -117548, -80179, -18145, -10620, -24423, -46505, -45075, -93682, -130064, -150300, -101893, -45132, 20055, -7612, -63161, -16796, 18987, -55466, -85430, -35768, -574, 36151, -30934, -57667, -6874, 44824, 32603, 29040, 12435, -23705, 19518, 17286, 5139, 8790, -12528, -4984, 30420, 12272, 23765, -33893, -31745]
15342c1745O649L1824O6358K4812k8025j5101k8977k6765N393K1386K2779K4785
15330G3373l5391k9508M4335j1954p8199n2897k2414J761J3492M8336k453j7277
15318f8796k8334J0314P213K7148K5643j8066M5929K556o9960l0071L6256k5476
15306h5644m475J0311Q789L033j8299K6202L4593J3429m745N670j4727k6858N694
15293d7027J0821n58n2657o6514N780J7291O1569J9187m0865l6681Q4943R34R334
15280c4443K5261J5021J7509J0368j6517L9527J7982l1802K320j267K1949j7560
15268D8348j3901j7721K3205J6726L180m55o8342n2318l582P35M3436N1379l9462
15255h772m0662J1909J6920N1088L135L49j2728j7573N4844o443r714o6280k4441
$$ y = [-31745, -25096, 6728, 73086, 97898, 69873, 54772, 25795, -970, 4423, 25809, 48588, 73373, 37982, 8474, 52809, 40855, -37344, -90241, -112655, -110894, -97402, -49066, -51519, -68796, -97130, -86816, -79603, -52455, -26812, -44878, 1051, 3607, -66353, -96424, -60168, -85644, -90119, -79808, -71019, -67986, -86285, -60083, -25490, -12061, -16806, -11136, -25863, -52721, -47027, -36206, -36764, -89421, -155935, -150155, -132864, -71295, -52108, -92973, -129654, -44711, -43777, -34443, -9182, 5839, 23348, 33716, 17199, 56726, 74708, 42906, 45226, 43959, 65908, 48348, 34447, 16726, 39931, 56657, 59837, 59382, -8960, -61278, -64860, -64125, -20689, 30690, -8772, -49434, -37525, -20605, 30483, 33618, 33967, 21239, 3666, 58510, 52067, 42353, -23927, -48368]
15242d8368L7235L497k783L3775Q5206k4320r1286k53J2164O988k3351Q562N3585
15229E0651k5394k7201K1727j1494L709L414j2383j2664k218j7275j3385j1017
15217e3530k4937r418P817j4489j559N2350k5923Q735P4151j7729j4388l82j3734
15204c3036L3746M982L5507k27r1807m2831M6438P8327k4645o6652k4897j0113
15192i5208j7242J254M4438M0010j924M048m0253L2819L0852L1541p7206m2642
15180h9513L6995N0046l3517j00L2738J0552l6871K2829l1673j4891r87j145K4045
15167c1492k5065k2917J5523Q370j4447J7457j37K1935J8123M4123j7203J0772
15155B5042k8788m2590k1821K6769K1658l469k9531M8819K2097j106J3196k5716
$$ y = [-48368, -11133, -7636, -10419, 23356, 108562, 84242, -7044, -7297, 4867, 11855, -11496, -2934, 50651, 25257, -1944, 19783, 8289, 11998, 15412, 3029, -9635, -11853, -29128, -42513, -53530, -78467, -87885, -80068, -94557, -96116, -43766, -69689, -60954, 13197, -4532, -18920, -19302, -33036, 710, 5692, 41199, 40972, -50835, -93666, -47228, 31099, 6454, -60198, -85095, -95208, -112450, -111196, -66758, -26748, -28672, -24624, -64877, -32058, -1206, 30335, -46871, -89513, -52518, -2472, -35989, -36089, -3351, 7201, -29670, -6841, -38514, -53405, -54392, -55537, -31492, -56557, -79474, -63951, -55581, -70028, -52571, -52708, -30773, -12650, 31473, 14270, 25042, -3746, -46336, -68157, -41388, -19730, -23199, -52730, -3911, 18186, 17080, 30276, 4560]
15143D560j3143j0825j1335K1312J4307j1629J605n3379k0035J4060n1301p750
15131a23553q901o855o213j602L1693J3052M8150Q8439J4387l9742J9438k8394
15119a01k8181K3589J2962k8589l1462l137J8537K1329k0230k5859J9905M4874
15107C637n853k7023l8797N925r418k1832J1377L2387M4543P1319K3669M075l5388
15094E8621j2249m067n5o8910n6113q347P9952K6260R572m3229J5517J8092k0154
15081e110J0893j7136n4077l719K7819k389j0471K5601j3185m0640M1957Q6358
15069D5901k1335j4628o162L5681Q482l2343j1909P594n1953k8144q628O7686
15057i758M9297o154k0627k9512l6486r865R280L8431k7912k1643l2963L3129
$$ y = [4560, -8583, -19408, -30743, -9431, 4876, -6753, -5148, -58527, -78562, -64502, -115803, -123553, -132454, -139309, -145522, -147124, -115431, -102379, -54229, 34210, 48597, 8855, 28293, -101, -28282, -4693, 8269, -20320, -51782, -54919, -36382, -15053, -35283, -61142, -41237, 3637, -2216, -29239, -68036, -62111, -71529, -93361, -81984, -49597, -5054, 66265, 89934, 94009, 58621, 46372, 42305, 42250, -26660, -82773, -91120, -11168, 15092, 24664, -18565, -3048, 15044, -5110, 5783, -11353, -65430, -69149, -41330, -43719, -54190, -28589, -41774, -82414, -40457, 45901, 24566, 9938, 3776, 39457, 47939, 15596, 3687, 11281, -40672, -68816, -77444, -9758, 39539, 33385, 12758, -16754, -53240, -63105, -53825, -15394, -43306, -64949, -97912, -64783]
15045f4783O4967j2596L5573P5654K7793p9270m7270m7612n7053J5985M3090n31
15033d6053J5504J2385J6662P4608j7590p1699q004j804J2870K0614k0508j3595
15021b6610N9464M958o6188n7866L5256L7359J2554n9314J743O4576P0926m9637
15009B7221J4186N156m1277k3916l1414J0220K8023P601J498O1716j7468j7539
14997B4007k7096M2081L3736J0097p434k1509k1590K3699J8673J8492m9670j1023
14985C2463j1718J7411k9443J2428J821o7395J918K9938Q548J8821m216K7707
14973C8283j9266j8857l0498k8519J5693M1259K1113l8082o53P121L3369M181
14961B5144j9066M547N0735k7419k8297l2565M266l5695j8563K4000N6424L7658
$$ y = [-64783, 184, -12412, 23161, 98815, 126608, 47338, 68, -47544, -104597, -88612, -45522, -46053, -30549, -18164, -1502, 73106, 55516, -16183, -24187, -25991, -13121, 7493, -13015, -26610, 32854, 37812, -28376, -86242, -50986, -13627, -1073, -60387, -58644, 5932, 76858, 27221, 41407, 46563, 5286, -18630, -50044, -39824, -11801, -4200, -2702, 59014, 41546, 24007, -3089, 38992, 72728, 82825, 75391, 53882, 32292, 55991, 74664, 93156, 43486, 32463, 20745, 38156, 8713, 21141, 22962, -44433, -42515, -12577, -4029, 14792, 10576, 38283, 19017, 160, -30338, -58857, -43164, -1905, 19208, -18874, -19527, -12406, 20963, 25144, 6078, 10625, 61360, 33941, 5644, -26921, -22655, -58350, -76913, -52913, 3511, 41169]
14949D1169k3301l8108K2485m9845o311k0056K831P668N7437j2759L923Q426P723
14936A282L8462j3042m2192l6060K8517k5713k4856J1340K5734J301O289l762
14924c2700k3638k7825J773K4086L675O155N9740J1177J4110j6338o3971R32N454
14911c7370j5814L336N2543M6620k2857j2674K5709j1773p607J331l848q488K0180
14898B9288j66m3974K9075q276m4006O843J3495J3138N0906M4946k1006m240J5478
14885H1501n2790L5252O8959N2099J6761m8342m8582N3216J5618o187j2485M0827
14873A95847N9614j1465l5085j6881j7639m7907l6130L3244k8584n8700k7862
14862H452l2968P980M5868L7430K1966k5233L3753N4445j7192M4490L5182M3565
$$ y = [41169, 17868, -20240, 2245, -47600, -53911, -73967, -71136, -63468, -6031, -18790, -14867, -6441, 1282, 39744, 26702, -15490, -51550, -23033, -48746, -73602, -62262, -36528, -35227, -28938, -32700, -56338, -84163, -82390, -58304, -54629, -48474, 11266, 22443, 36553, 20215, -43756, -42824, -37370, -53184, -49848, 2695, 49315, 26458, 13784, 39493, 27720, 20113, 21444, 17596, 9108, 29288, 29122, -14852, 14223, 5947, -38059, -31216, -17721, -4583, 46323, 91269, 70263, 66023, 81501, 28711, 63963, 132922, 185021, 201782, 153440, 104858, 158074, 173692, 167505, 155020, 195847, 255461, 243996, 208911, 192030, 174391, 126484, 90354, 123598, 95014, 36314, 8452, -24516, -16536, 29332, 66762, 88728, 63495, 97248, 151693, 134501, 178991, 214173, 257738]
14850B57738L1426n0248j1055k7152l266R136j1632l2190m032m2090k1643q3010
14838A1982r042j067k6261R892J4562J4764m9776o088M2792k2495k0084l1545
14826g2366M6849J05738M152K75l3990k0047M2835L6549L1787k6844m9904k5929
14814C9105j4444L163N7696P213m4464o6616K4774O59n8839n6741k2622K4116
14802a07000m774J0062N4580P380O912o9730R932M6880L8634j0697J244r610M1400
14789A5213J118K614O151k1190o0939o8931n056L0559O1766K3472j4356J7598
14777a1981r520j2931J0598L8112N3604O4788K2642j9906n6355n6054l5319L8804
14765B6482R383k3081n0872n4834l8992L2118o009j735L5401L3349J3586m19j8177
$$ y = [257738, 289164, 238916, 227861, 200709, 197443, 206579, 194947, 162757, 158725, 116635, 94992, 11982, 2940, 1873, -24388, -14496, 66, 14830, -34946, -41034, 1758, -20737, -40821, -72366, -25517, 80221, 84373, 84648, 50658, 30611, 73446, 109995, 141782, 114938, 65034, 39105, 24661, 27824, 85520, 92733, 48269, -18347, 6427, 7086, -51753, -108494, -131116, -107000, -111774, -101712, -47132, -39752, -32840, -102570, -92638, -45758, -7124, -17821, -16577, -26187, 15213, 16331, 18945, 25096, 3906, -57033, -125964, -131020, -100461, -38695, -15223, -29579, -11981, -21501, -34432, -23834, 14278, 67882, 132670, 155312, 135406, 79051, 22997, -12322, 26482, 35865, 12784, -38088, -92922, -131914, -99796, -105805, -107540, -72139, -38790, -25204, -25623, -43800]
14752d3800K2067l6395K1715J337K1271J2686j1949n971K5026L665K8181l3502
14740D331n3034J4458Q4078O3906k0393o1873j6627m108j0458j8077J0320J7499
14728A0022P052R740M793N8376m7237o2489p996K4087K1293j7334L5038m1635
14716f290j6749j8168L4404J2601m4130j4484N572l0359J365o6J2163K476k639
14703f4304L5621Q9403J8933j4023n4624m0550j1018p579Q377J9790j2448j0606
14691d3028L3397K1864k3864L7636K1414j3177o4886K2530J3652j827J7324J4712
14679C5747J8048M0q53K7612K6227J945l9342l4976J5010l5200l827n2775J3814
14666b8530M910R30N4162M7396l4314j8555J6673J8434j2604j2009j5124j6618
$$ y = [-43800, -21733, -58128, -36413, -35076, -13805, -1119, -13068, -19039, 5987, 9652, 37833, 4331, -48703, -34245, 49833, 113739, 93346, 31473, 14846, 10738, 280, -17797, -7477, 10022, 17074, 26814, 31607, 89983, 42746, -19743, -27739, -3652, 17641, 307, 35345, -6290, -23039, -41207, -6803, 5798, -38332, -52816, -47244, -77603, -76238, -76304, -64141, -61665, -64304, -28683, 60720, 79653, 65630, 11006, -29544, -40562, -48141, -39764, -19974, -32422, -43028, -9631, 12233, -11631, 26005, 47419, 34242, -30644, -8114, 5538, 3711, 21035, 35747, 53795, 53835, 52982, 80594, 106821, 108766, 69424, 34448, 49458, 14258, 10431, -42344, -28530, -23620, -22690, 31472, 78868, 44554, 25999, 42672, 61106, 48502, 36493, 21369, 4751]
14654D751q671j7613N61J9922L2616N0857M8231m2401j5062J5610l64k2662j0449
14641E5326m623K0158P1k9824J1903k0741k3985N210J1382L7545j7891p7958K246
14628c1181n428j7121L3946j7213M6661k1632L5476L6652n7518k7822J3689K9036
14616A7545J9460l6920k0715L9622l6899o2911L7296K7655J3992l947o9241L8871
14604c6192K9475m262J2405K1699J4590m6965k2336K9849j0955K9671L480l7585
14592a7126N4522K0054p125j6780k0780J1326M995K1994L8477m7942l1891k2637
14580a2913M0184J7302J7561l7985m1484J2392M7833Q157l4316m4922J0366N3826
14568C6001j5286k8675M6006L1285M526m5570m2006R757o315J7883m9702j5086
$$ y = [4751, -3920, -21533, -20972, -1050, 31566, 82423, 130654, 88253, 73191, 88801, 88437, 65775, 55326, 50703, 70861, 70932, 41108, 53011, 32270, 8285, 13495, 24877, 62422, 44531, -33427, -31181, -36609, -53730, -19784, -36997, 9664, -11968, 23508, 60160, 2642, -25180, -11491, 17545, 37005, 85, -20630, 18992, -17907, -80818, -43522, -15867, -1875, -5822, -75063, -36192, -6717, -10979, 1426, 23125, 37715, -9250, -31586, -1737, -12692, 16979, 20459, -17126, 37396, 57450, 50325, 33545, 12765, 24091, 29086, 51080, 89557, 41615, 9724, -12913, 27271, 44573, 62134, 24149, -17335, -4943, 42890, 51047, 16731, -28191, -17825, 36001, 20715, -7960, 38046, 69331, 73857, 28287, -13719, -3962, -10277, 7606, -42096, -57182]
14556e7182r887m386L584L1200L1697k642J68K3120l0239O293K1297m836j4640
14543f453J4824j1017l4122l3073m3211Q706p73j4743K1257L9123n983m3446Q74
14530a08037L8060J8221R47M5480m6732K8904L0344p864J0653k5176m5433L762
14518e6871L2623L4914k8033L0977M2108Q575m0850r3419K1650m793M950k3529
14506g1698K7926M5544l098o2963k992M7606l8228j4238l0786K2664J9072J0312
14494e0879N816K9901K2581l7747J3404J1373N3554J5782J7059q831K350M4444
14482A18807p5001k2930O112O26o4580n1814K4023L0316L8709K2491k790k5307
14470a338j7812N0799l6817L3885K2080j4166k1287n8794N0867q384J2346K1255
$$ y = [-57182, -67069, -71455, -67871, -36671, -4974, -7616, -7448, 15672, -14567, -8274, 13023, 8187, -6453, 8371, -2646, -36768, -69841, -113052, -104346, -105119, -119862, -98605, -59482, -65465, -108911, -108037, -69977, -51756, -50809, -5329, -52061, -23157, 7187, -677, 9976, -15200, -60633, -56871, -24248, 10666, -17367, 13610, 55718, 64293, 23443, -69976, -48326, -53119, -48169, -71698, -43772, 1772, -1326, -64289, -67281, -19675, -57903, -72141, -102927, -80263, -61191, -50879, -45063, -15162, 7419, -30328, -16924, -5551, 48003, 63785, 80844, 72013, 74363, 118807, 43806, 20876, 26988, 27614, -36966, -88780, -64757, -34441, 4268, 26759, 23969, -1338, -19150, 31649, -5168, 28717, 50797, 36631, 15344, -43450, 7417, -967, 11379, 32634]
14458C2634j5282k6752k7980J7842N1862L6256j5845r0965n5863M4792P52M4413
14446d136L8482r720l0613R639R700L7471m9536m0622J686k1339J8564Q4387L7509
14433H1472k9361m5449l225L7048M1779j4344m1945k9046l3203J3916N222N0651
14421C3515O0402K1269n2418m6437K810P273L7474L3793j4611m2133m6120J0311
14409E128j6215k2865K2301J5594K9476k3880K1090k8224l6636K5432K4410J8459
14397C4070l9103k0063L6537n570r6236M6796N0421L9147m4006M5143N7892k1222
14385H3806m5347K0450J3689n5425l7249N9378J3585L317J1670K5093l9465L400
14373E6902Q799n2848l8197K7692k3357l8414M4630L4675l444J581r493K8754
$$ y = [32634, 17352, -9400, -37380, -19538, 32324, 68580, 52735, -38230, -94093, -49301, -48549, -4136, 34346, 24626, -5987, 3652, 13352, 50823, 1287, -39335, -37649, -58988, -40424, 43963, 81472, 52111, 6662, 3437, 40485, 82264, 67920, 25975, -3071, -36274, -22358, -17136, 33515, 93917, 115186, 62768, 16331, 19141, 26414, 63888, 97681, 83070, 40937, -5183, 5128, -11087, -33952, -11651, 3943, 33419, 9539, 30629, 2405, -34231, -8799, 15611, 34070, -5033, -25096, 11441, 5871, -90365, -43569, 6852, 45999, 1993, 47136, 105028, 83806, 38459, 58909, 72598, 17173, -20076, 39302, 52887, 56204, 67874, 92967, 53502, 56902, 65701, 12853, -25344, 2348, -21009, -59423, -14793, 19882, 16438, 18019, 8526, 37280]
14361C7280k0168l7808M4051K0121k8152m6255n240j992q27k1511k0452J6529
14349f4424J4542o714j4336O1493K970k2815q522J4729R346j8652N745m9807j2319
14336h8764N385K2918L1281J057o4385J9604Q369N8666L3416O920l1490l6397
14324c3420J6817K2839l4974l2005j7655K7845N2502k5424k601k300J5426L1909
14312A8959N2518K0656m0529m266n81n0781l6790l0863l2255Q132j9360N3923
14300f1237L8686L5997N6919q443L3119p6869k1522p475m0040l8142K0598n156
14288g3565k3922j6327J1753K5061J5743j0205K5650j7504j2529J6208K7433N4240
14276B2036P009o9863M375k4235j7269j377J2461j2130l92L9319K1111l7186J9993
$$ y = [37280, 17112, -20696, 23355, 43476, 15324, -30931, -36171, -38163, -38990, -60501, -80953, -64424, -49882, -56596, -70932, -9439, -6469, -29284, -37806, -23077, -13731, -32383, -26638, -76445, -88764, -83379, -60461, -29180, -28123, -92508, -72904, -64535, -5869, 27547, 34467, 2977, -33420, -16603, 6236, -28738, -60743, -78398, -50553, 1949, -23475, -26076, -28376, -12950, 18959, 71477, 92133, 51604, 47338, 46757, -4024, -40814, -71677, -103932, -95800, -115160, -61237, -22551, 13446, 70365, 61922, 95041, 18172, -3350, -10825, -50865, -89007, -68409, -73565, -97487, -113814, -102061, -77000, -61257, -71462, -45812, -63316, -75845, -59637, -32204, 22036, 29045, -40818, -36443, -60678, -77947, -79324, -66863, -78993, -79385, -40066, -18955, -56141, -36148]
14263c6148L4477k4813j4024l1220K0979j48k1847K7352N4098o2555q0918K0084
14251a14683K1419N6189n8879L4570J0474k2475j185O3768n292j5132P011L0197
14239E982J3604K5330K1491l5468l488L5949m0718l2996k5174j9j5843l9492j5683
14226a06525O2658P7779R078M695O005m0458m1071k8360k2187J1382m7408K0535
14214i3877k5563O1981Q7653J5739n281Q463R199o1327p7725J253P7966K5279
14202B3760j2949N165P971k702J2378n0719k807k0317j4257K5183j3082J5871
14190b6505M3698L3816O0998K0726l1091m3433l3744K6561K1965k2993k9306M400
14178B5092j6489m3048J9284J5181m107j5787J067O018q984P596k5354k6379J2903
$$ y = [-36148, -1671, -26484, -40508, -71728, -50749, -50897, -72744, -45392, 8706, -53849, -134767, -114683, -93264, -37075, -95954, -61384, -50910, -73385, -74570, -10802, -16094, -31226, -24215, 5982, 19586, 44916, 66407, 30939, 27451, 63400, 22682, -10314, -35488, -35507, -51350, -90842, -106525, -43867, 33912, 42990, 47685, 53690, 13232, -27839, -56199, -78386, -67004, -114412, -93877, -119440, -57459, 30194, 45933, 40652, 49115, 58314, -3013, -80738, -79485, -1519, 23760, 10811, 15976, 23947, 21245, 33623, -17096, -19903, -40220, -54477, -29294, -42376, -26505, 17193, 51009, 112007, 132733, 101642, 58209, 24465, 51026, 72991, 49998, 20692, 25092, 8603, -34445, -15161, 20, -4087, -19874, -18807, -12789, -21773, -14177, -39531, -65910, -53007]
14165e3007N1108j9547j665j6383L3157J4396p2183l9071N1157R3800N050l5493
14153A1319k0614J0379k1599l4215J7247J2833L1198l2813L5021O0854o5908j4807
14141a1105j9384M945K0753l0394N460K7694q254L1764O2332J6295m4597m3147
14129A2362n1011l1804O38J1327k3430J4613L807Q257j3030j793O1163j2382l794
$$ y = [-53007, -1899, -21446, -23111, -39494, -6337, 8059, -64124, -103195, -52038, 41762, 46812, 11319, -9295, 1084, -20515, -54730, -37483, -24650, 6548, -26265, 8756, 69610, 3702, -11105, -30489, -25544, -4791, -35185, -29725, -2031, -10285, 21479, 83811, 100106, 55509, 12362, -38649, -70453, -69815, -58488, -81918, -67305, -63498, -55241, -68271, -70064, -8901, -21283, -25077]
$$ [...]
##END NTUPLES=NMR SPECTRUM
##END=
