##TITLE=Analysis number 322118
Compound Code cc 09402
Book Reference 470/99
Project Code adrs
Chemist Name mikem
##JCAMPDX= 6.0         $$ Bruker NMR JCAMP-DX V2.0
##DATA TYPE= NMR SPECTRUM
##DATA CLASS= NTUPLES
##ORIGIN= Bruker BioSpin GmbH
##OWNER= nmr
$$ XWIN-NMR		Version 3.5
$$ Wed Sep 13 11:13:20 2006 GMT Daylight Time (UT+1h)  MAYBRIDGE\nmr@NMR_250MHZ
##.OBSERVE FREQUENCY= 250.131544655141
##.OBSERVE NUCLEUS= ^1H
##.ACQUISITION MODE= SIMULTANEOUS (DQD)
##.ACQUISITION SCHEME= undefined
##.AVERAGES= 16
##.DIGITISER RES= 18
##SPECTROMETER/DATA SYSTEM= dpx250
##.PULSE SEQUENCE= zg30
##.SOLVENT NAME= CDCl3
##.SHIFT REFERENCE= (INTERNAL, CDCl3, 0, 16.4515)
##AUDIT TRAIL= $$ (NUMBER, WHEN, WHO, WHERE, WHAT)
$$ ##TITLE= Audit trail, XWIN-NMR		Version 3.5
$$ ##JCAMPDX= 5.01
$$ ##ORIGIN= Bruker BioSpin GmbH
$$ ##OWNER= nmr
$$ C:\u/data/dgb/nmr/ADRS/690/pdata/1/auditp.txt
$$ ##AUDIT TRAIL=  $$ (NUMBER, WHEN, WHO, WHERE, WHAT)
(   1,<2006-09-13 11:12:58.14 +100>,<MAYBRIDGE\nmr>,<NMR_250MHZ>,
      <created by zg, POWCHK disabled, PULCHK disabled
       configuration hash MD5:
       E2 DF 36 D8 04 B2 41 60 5A D7 A3 38 5A 4B D0 FE
       data hash MD5: 64K
       8E 3B 71 99 60 E5 DD FD 44 03 57 EC AC CA BD 1F>)
(   2,<2006-09-13 11:13:11.50 +100>,<MAYBRIDGE\nmr>,<NMR_250MHZ>,
      <Start of raw data processing
       ef LB = 0.3 FT_mod = 6 PKNL = 1 SI = 32K 
       data hash MD5: 32K
       37 D9 CB E0 93 3A 91 6A 4B CC 00 56 03 38 7A B3>)
(   3,<2006-09-13 11:13:13.21 +100>,<MAYBRIDGE\nmr>,<NMR_250MHZ>,
      <apk 
       data hash MD5: 32K
       58 81 89 B9 5F E6 42 2B 6C 30 0C B5 8D 4C 1D B9>)
(   4,<2006-09-13 11:13:13.96 +100>,<MAYBRIDGE\nmr>,<NMR_250MHZ>,
      <abs ABSG = 5 
       data hash MD5: 32K
       B1 C3 2B 4A 44 B1 80 2A 26 2F C8 9E 09 E6 41 97>)
$$ ##END=
$$ 
$$ hash MD5
$$ A6 3A 59 D8 82 17 B9 3D E3 27 6A BA BB 00 2B 48
##$RELAX= 
##$RELAX= 
##$RELAX= 
##$RELAX= 
##$RELAX= 
##$RELAX= 
##$RELAX= 
$$ Bruker specific parameters
$$ --------------------------
##$DU= <C:\u>
##$EXPNO= 690
##$NAME= <ADRS>
##$PROCNO= 1
##$TYPE= <nmr>
##$USER= <dgb>
##$AMP= (0..31)
100 100 100 100 100 100 100 100 100 100 100 100 100 100 100 100 100 100 
100 100 100 100 100 100 100 100 100 100 100 100 100 100 
##$AQSEQ= 0
##$AQ_mod= 3
##$AUNM= <au_zg>
##$AUTOPOS= <19 >
##$BF1= 250.13
##$BF2= 250.13
##$BF3= 250.13
##$BF4= 250.13
##$BF5= 500.13
##$BF6= 500.13
##$BF7= 500.13
##$BF8= 500.13
##$BYTORDA= 1
##$CFDGTYP= 0
##$CFRGTYP= 5
##$CHEMSTR= <none>
##$CNST= (0..31)
1 1 145 1 1 1 1 1 1 1 1 1 1 1 1 1 1 1 1 1 1 1 1 1 1 1 1 1 1 1 1 1 
##$CPDPRG= <>
##$CPDPRG1= <>
##$CPDPRG2= <>
##$CPDPRG3= <>
##$CPDPRG4= <mlev>
##$CPDPRG5= <mlev>
##$CPDPRG6= <mlev>
##$CPDPRG7= <mlev>
##$CPDPRG8= <mlev>
##$CPDPRGB= <>
##$CPDPRGT= <>
##$D= (0..31)
0 1 0 0 0 0 0 0 0 0.06 0 0 0 0 0 0 0.0002 0 0 0 0 0 0 0 0 0 0 0 0 0 0 
0 
##$DATE= 1158142376
##$DBL= (0..7)
120 120 120 120 120 120 120 120 
##$DBP= (0..7)
150 150 150 150 150 150 150 150 
##$DBP07= 0
##$DBPNAM0= <>
##$DBPNAM1= <>
$$ [...]
##$SUBNAM7= <"">
##$SUBNAM8= <"">
##$SUBNAM9= <"">
##$SW= 20.6930455092707
##$SWIBOX= (0..15)
0 0 3 0 0 0 0 0 0 0 0 0 0 0 0 0 
##$SW_h= 5175.983436853
##$TD= 65536
##$TD0= 1
##$TE= 296.16
##$TE2= 300
##$TE3= 300
##$TEG= 300
##$TL= (0..7)
0 120 120 120 120 120 120 120 
##$TP= (0..7)
150 150 150 150 150 150 150 150 
##$TP07= 0
##$TPNAME0= <>
##$TPNAME1= <>
##$TPNAME2= <>
##$TPNAME3= <>
##$TPNAME4= <>
##$TPNAME5= <>
##$TPNAME6= <>
##$TPNAME7= <>
##$TPOAL= (0..7)
0.5 0.5 0.5 0.5 0.5 0.5 0.5 0.5 
##$TPOFFS= (0..7)
0 0 0 0 0 0 0 0 
##$TUNHIN= 0
##$TUNHOUT= 0
##$TUNXOUT= 0
##$USERA1= <user>
##$USERA2= <user>
##$USERA3= <user>
##$USERA4= <user>
##$USERA5= <user>
##$V9= 5
##$VALIST= <valist>
##$VCLIST= <CCCCCCCCCCCCCCC>
##$VD= 0
##$VDLIST= <DDDDDDDDDDDDDDD>
##$VPLIST= <PPPPPPPPPPPPPPP>
##$VTLIST= <TTTTTTTTTTTTTTT>
##$WBST= 1024
##$WBSW= 4
##$XGAIN= (0..3)
0 0 0 0 
##$XL= 0
##$YL= 0
##$YMAX_a= 367768
##$YMIN_a= -421011
##$ZGOPTNS= <>
##$ZL1= 120
##$ZL2= 120
##$ZL3= 120
##$ZL4= 120
##$ABSF1= 16.45149
##$ABSF2= -4.241682
##$ABSG= 5
##$ABSL= 3
##$ALPHA= 0
##$AQORDER= 0
##$ASSFAC= 0
##$ASSFACI= 0
##$ASSFACX= 0
##$ASSWID= 0
##$AUNMP= <proc_1d>
##$AZFE= 0.1
##$AZFW= 0.1
##$BCFW= 0
##$BC_mod= 0
##$BYTORDP= 0
##$COROFFS= 0
##$CY= 12.5
##$DATMOD= 1
##$DC= 0
##$DFILT= <>
##$DTYPP= 0
##$F1P= 14.0000005364418
##$F2P= -0.99999901652339
##$FCOR= 0.5
##$FTSIZE= 32768
##$FT_mod= 6
##$GAMMA= 0
##$GB= 0
##$INTBC= 1
##$INTSCL= 1
##$ISEN= 128
##$LB= 0.3
##$LEV0= 0
##$LPBIN= 0
##$MAXI= 10000
##$MC2= 0
##$MEAN= 0
##$ME_mod= 0
##$MI= 0
##$NCOEF= 0
##$NC_proc= -4
##$NLEV= 6
##$NOISF1= 0
##$NOISF2= 0
##$NSP= 0
##$NTH_PI= 0
##$NZP= 0
##$OFFSET= 16.45149
##$PC= 1
##$PHC0= 142.1728
##$PHC1= 26.7279
##$PH_mod= 1
##$PKNL= yes
##$PPARMOD= 0
##$PSCAL= 4
##$PSIGN= 0
##$REVERSE= no
##$SF= 250.130017634007
##$SI= 32768
##$SIGF1= 0
##$SIGF2= 0
##$SINO= 400
##$SIOLD= 32768
##$SREGLST= <1H.CDCl3>
##$SSB= 0
##$STSI= 32768
##$STSR= 0
##$SW_p= 5175.98343685301
##$SYMM= 0
##$S_DEV= 0
##$TDeff= 65536
##$TDoff= 0
##$TI= <Analysis number 999999
Compound Code 99
Book Reference 9
Project Code 9>
##$TILT= no
##$TM1= 0
##$TM2= 0
##$TOPLEV= 0
##$USERP1= <user>
##$USERP2= <user>
##$USERP3= <user>
##$USERP4= <user>
##$USERP5= <user>
##$WDW= 1
##$XDIM= 32768
##$YMAX_p= 328727662
##$YMIN_p= -520542
$$ End of Bruker specific parameters
$$ ---------------------------------
##NTUPLES= NMR SPECTRUM
##VAR_NAME=  FREQUENCY,     SPECTRUM/REAL,   SPECTRUM/IMAG
##SYMBOL=    X,             R,               I
##VAR_TYPE=  INDEPENDENT,   DEPENDENT,       DEPENDENT
##VAR_FORM=  AFFN,          ASDF,            ASDF
##VAR_DIM=   32768,         32768,           32768
##UNITS=     HZ,            ARBITRARY UNITS, ARBITRARY UNITS
##FACTOR=    0.157963299565203, 1,           1
##FIRST=     4115.01158441341, 0,            0
##LAST=      -1060.9718524396, 0,            0
##MIN=       -1060.9718524396, -520542,      0
##MAX=       4115.01158441341, 328727662,    0
$$ Real data points
##PAGE= N=1
##DATA TABLE= (X++(R..R)), XYDATA
$$ [...]
26947G3375k21669m6323O2660j1182M7822L6937O5715J9929P2121P9881j0837
$$ 73375 -148294 -194617 -131957 -143139 -95317 -58380 7335 27264 99385 179266 168429
26936A68429M5692O7629k6160n0936J358l5001M1044J23385l1161k40741j69332
$$ 168429 214121 281750 255590 204654 206012 171011 212055 335440 304279 63538 -105794
26925a05794O5040m637L8801J6138R1784k6269l709r057n827l8966j10085n5084
$$ -105794 -40754 -45391 -6590 9548 101332 75063 71354 62297 56470 17504 -92581 -147665
26913a47665l3263k2083O3286J31201J31388j0738j7893q3908O4795R4872M7098
$$ -147665 -180928 -203011 -139725 -8524 122864 112126 94233 10325 75120 169992 217090
26902B17090r3302j79819p6411o490K3407j6573P1975P3861J16198n2329l158
$$ 217090 123788 -56031 -132442 -138932 -115525 -132098 -60123 13738 129936 77607 74449
26891G4449j8951o7748l9055J1693J07796N1845n1751n9160k09328O831P7278
$$ 74449 55498 -12250 -51305 -39612 68184 120029 68278 9118 -200210 -193379 -116101
26880a16101k3183r1853L9398J24038K4345p1934J0230K0400k8507J94024p5106
$$ -116101 -139284 -231137 -191739 -67701 -43356 -115290 -105060 -84660 -113167 80857 5751
26869E751m8973p6449l687O212l6383L9709o6739R0076M1707J02571L2836P064
$$ 5751 -43222 -119671 -123358 -117146 -153529 -113820 -180559 -90483 -48776 53795 86631 93695
26857I3695R9810n9866j19268P1579l6662r9429R891K11690j52780L7975Q4426
$$ 93695 193505 133639 14371 85950 49288 -50141 -40250 171440 18660 56635 141061
26846A41061N2918K8937j61447j32981k9094J68974R6067j6636o42m1513O1360
$$ 141061 193979 222916 61469 -71512 -100606 68368 164435 147799 147157 105644 167004
26835A67004M3224k6681q0452j05095o5968J10595j1098k8571Q4252Q117j14272
$$ 167004 210228 183547 103095 -2000 -67968 42627 31529 2958 87210 95327 -18945
26824a8945q399l5579m2290N4569j21412n9579J42873J00492N8889l7364j05303
$$ -18945 -27344 -62923 -105213 -50644 -172056 -231635 -88762 11730 70619 33255 -72048
26813g2048l0212N542J51781p7314L8354K621O2009J55116J25702O1506K3800
$$ -72048 -102260 -96718 55063 -22251 16103 18724 80733 235849 361551 423057 446857
26802D46857j29318K8931n5337n6394l2357j13684p9234l7511J1417L5391p256
$$ 446857 317539 346470 291133 234739 202382 88698 9464 -28047 -16630 18761 11505
26791A1505m5568M7456L4475m3485l7149j7933l3133J13498J6701K2823k2240
$$ 11505 -34063 13393 47868 4383 -32766 -50699 -83832 29666 46367 69190 46950
26780D6950L4422L3071n4932n5316M1123m0476n9699K1907J06401q0639j17525
$$ 46950 81372 114443 59511 4195 45318 4842 -54857 -32950 73451 -7188 -124713
26769a24713J0785M6348M2998l602Q6133R160j23584J08093J51078o787m2215
$$ -124713 -113928 -67580 -24582 -28184 57949 67109 -56475 51618 202696 195909 153694
26758A53694P5963o0350j05356O7533o0258o7199m1819Q2133l9924M3150J37182
$$ 153694 229657 169307 63951 131484 71226 4027 -37792 44341 4417 47567 184749
26747A84749o7093r8858j14174L7803J02940R9839J1006j18598k09109M5808J69365
$$ 184749 117656 18798 -95376 -57573 45367 145206 156212 37614 -171495 -125687 43678
26736D3678O9938l7493M179r3218o1159P6866R2305n4995j35638j252m57j4536
$$ 43678 113616 76123 80302 -12916 -74075 2791 95096 40101 -95537 -96789 -97246 -111782
26724a11782R0829O5371M120J02572L7512p1519n7983k2083k926L3409Q5093J07858
$$ -111782 -20953 44418 48538 151110 188622 117103 59120 37037 34111 67520 152613 260471
26712B60471r054j02843j17234j04103j5492R0064Q7575K0130L4428r9538m53
$$ 260471 251417 148574 31340 -72763 -88255 1809 89384 109514 143942 44404 43951
26701D3951J04685o240p0878R822p8605m0968m4844K9922L9637K311J4615J06112
$$ 43951 148636 142396 71518 81340 2735 -38233 -83077 -53155 -13518 -11207 3408 109520
26689A09520J28206j10675O6315m6337j72936n4913J07128P4962J3103q1914R8607
$$ 109520 237726 127051 193366 147029 -25907 -80820 26308 101270 114373 32459 131066
26678A31066K7450j73791j03929j10237J09671L1072k8980m4543L3845R5303Q8711
$$ 131066 158516 -15275 -119204 -229441 -119770 -88698 -117678 -162221 -128376 -33073 55638
26667E5638K2616j26559o4140j8209q2227p243K86724J80908P2741J460j57182
$$ 55638 78254 -48305 -112445 -130654 -212881 -220124 66600 247508 320249 321709 164527
26656A64527r5130J09349j44437j09466P9268M4247Q8815k4324j29104J8034o4574
$$ 164527 69397 178746 34309 -75157 4111 48358 137173 112849 -16255 1779 -62795
26645f2795k9134o7351j20947R6156J22646o5633n0335J07230O4489J35834J4875
$$ -62795 -91929 -159280 -280227 -184071 -61425 -127058 -177393 -70163 -5674 130160 145035
26634A45035L3808o2800p5387j802m549K1878J03110r4022m5224r9259j60737
$$ 145035 178843 116043 40656 38854 34305 56183 159293 65271 20047 -79212 -239949
26623b39949j23419P6157J82315P7189n2479R8196K2066k2955q0657j5585J57527
$$ -239949 -363368 -287211 -104896 -27707 -80186 18010 40076 17121 -63536 -79121 78406
26612G8406J46617m9122k4066q3124J0947o0869L7290K2811L1537q6998P006N7717
$$ 78406 225023 175901 151835 68711 79658 18789 56079 78890 110427 23429 30435 88152
26600H8152O0507m9562l9175k35065r4690K32451J19184l9473J87408l7412j7322
$$ 88152 148659 99097 59922 -175143 -269833 -37382 81802 42329 229737 192325 175003
26589A75003j0124q8123n4375N8615M1405k4650M4049m2134j43671J72769K5673
$$ 175003 164879 76756 22381 80996 122401 97751 141800 99666 -44005 128764 154437
26578A54437r0360M1840M8810J13307M1171m9625p288j65645j51038N7133O8541
$$ 154437 64077 105917 154727 268034 309205 259580 252292 86647 -64391 -7258 61283
26567F1283j53l6439l7028q19o9307q7884J1834P4209J38632R8430j00256J19583
$$ 61283 61130 24691 -12337 -13156 -82463 -170347 -158513 -84304 54328 152758 52502 172085
26555A72085m3393j70664K4642j8231r2420l1057K4509J18895P8199p1143j42253
$$ 172085 128692 -41972 -17330 -35561 -127981 -159038 -134529 -15634 62565 -8578 -150831
26544a50831Q8852O7922J02219L7130j20831o6420J19157n9403q2211L3205J0120
$$ -150831 -61979 5943 108162 145292 24461 -41959 77198 17795 -64416 -31211 -21091
26533b1091o7295O8553J29450O1700n4896M5910j71814j20570P3686K1875o6028
$$ -21091 -88386 -19833 109617 171317 116421 162331 -9483 -130053 -56367 -34492 -100520
26522a00520J28877J00852n0545M0254p9774k6349M7312R9512J6948j06879L2876
$$ -100520 28357 129209 78664 118918 39144 12795 60107 159619 176567 69688 102564
26511A02564O180l8410l7708q0515r2164M6245j38527K011M8049J45816R1289
$$ 102564 108744 70334 32626 -47889 -140053 -93808 -232335 -230324 -182275 -36459 54830
26500E4830r0373j43980L0935k6711J445O0552J53375K6932J40053J22995k07004
$$ 54830 -35543 -179523 -148588 -175299 -173854 -113302 40073 67005 207058 330053 123049
26489A23049k44940k6911J7807J35921J41828O0494k0231j05549K5432P475j92155
$$ 123049 -121891 -148802 -130995 4926 146754 207248 187017 81468 106900 114375 -77780
26478g7780N3147N2246J55083n8691o5062k5567j09139o6994O8859K8865O8225
$$ -77780 -24633 27613 182696 124005 58943 33376 -75763 -142757 -73898 -45033 23192
26467B3192N718j3116k963m910P4635K8817J8557j412r949m0664K5337O3102m531
$$ 23192 28910 15794 12831 7921 82556 111373 129930 128518 118569 77905 103242 166344 161813
26454A61813Q0296P5733j02008j33965m4709j04269P1703l5122m7853K2657R8126
$$ 161813 242109 317842 215834 81869 37160 -67109 4594 -30528 -78381 -55724 42402
26443D2402O0131j5584m936O2982O711q9953j974N7277N0242j02182l0860o1084
$$ 42402 102533 86949 82013 144995 151706 61753 59779 117056 167298 65116 34256 -26828
26431b6828o2806L4185N0389k1779J7122J8348L1709j00766Q156j3213j64666
$$ -26828 -89634 -55449 -5060 -26839 -9717 8631 40340 -60426 -52270 -65483 -230149
26420b30149O4713J03394o7484J3084J39294r1671j34487j27036J66632L8115
$$ -230149 -165436 -62042 -129526 -116442 22852 -68819 -203306 -330342 -163710 -125595
26410a25595J01513J78302K3868q4587j26585j4681J23469M0308R6852N055o1873
$$ -125595 -24082 154220 178088 93501 -33084 -47765 75704 116012 212864 217919 156046
26399A56046m6896M5344j56178j26970N6968M2765L0750j7784M3329m5478n9923
$$ 156046 109150 154494 -1684 -128654 -71686 -28921 1829 -15955 27374 -18104 -78027
26388g8027M0540O1982J0591o9167L9202l4569m2286p4183L8214J284j8064M1337
$$ -78027 -37487 24495 35086 -34081 5121 -29448 -71734 -145917 -107703 -106419 -124483 -83146
26376h3146N9898j7543L5713j1432P7180m2511k505J6190j83429p355J7284q9713
$$ -83146 -23248 -40791 -5078 -16510 60670 18159 15654 31844 -151585 -158940 -141656 -231369
26364b31369P1382N3853J12765L1145p224n6915j36678p4379J08538O9748J48397
$$ -231369 -159987 -106134 6631 37776 30552 -26363 -163041 -237420 -128882 -59134 89263
26353H9263P5615m9629J6982k1739k573p6899j09983m4913R0678M5428q9960K7315
$$ 89263 164878 115249 132231 110492 107919 31020 -78963 -123876 -33198 12230 -77730 -50415
26341e0415N2230k5989O4206R3465J09744r3522j64678j16424m8976J80535Q0124
$$ -50415 1815 -24174 40032 133497 243241 149719 -14959 -131383 -180359 176 80300
26330H0300o5473j31262J23611o80j00365o7780K3811M3817m9823j46959J02174
$$ 80300 14827 -116435 7176 6496 -93869 -161649 -137838 -94021 -143844 -290803 -188629
26319a88629J5098l2130J15210r000J02270K9711N6720m218p0663m5633K1658
$$ -188629 -173531 -205661 -90451 -99451 2819 32530 89250 85032 14369 -31264 -9606
26308i606k8234n9071J6409k4350q1395l2833J44586M7114m2840p2808j24144
$$ -9606 -37840 -96911 -80502 -104852 -186247 -219080 -74494 -27380 -70220 -143028 -267172
26297b67172M6109J03272J68205j3126o9913L4769l1256k7258N828M375K8908
$$ -267172 -221063 -117791 50414 37288 -32625 2144 -29112 -56370 -50542 -46167 -17259
26286a7259L4111j2581J26764m5774R110q4252J0218J25009L8390j28247o9731
$$ -17259 16852 4271 131035 85261 94371 10119 20337 145346 183736 55489 -14242
26275a4242P2728q1052j07135O2224J38323m988N8110K1690j3537r2194j20331
$$ -14242 58486 -22566 -129701 -67477 70846 65858 123968 145658 132121 39927 -80404
26264h0404m6374k3875j9092k251n8314P4504J08732K23158k1551L3271L6111
$$ -80404 -126778 -150653 -169745 -171996 -230310 -155806 -47074 176084 154533 187804 223915
26253B23915l9461l4279j43967k12793k7994J0957j03395L4553J91270J60552
$$ 223915 184454 150175 6208 -206585 -234579 -223622 -327017 -292464 -101194 59358
26243E9358O0244n2757k34485j67023K14820M6026P0967Q4013o8596q0198m453
$$ 59358 119602 66845 -167640 -334663 -119843 -73817 -2850 81163 12567 -67631 -72084
26232g2084r4330j8212J7459P6286n2446M8930J09358L0194M3416q3617o0076
$$ -72084 -166414 -184626 -167167 -90881 -143327 -94397 14961 45155 88571 4954 -55122
26221e5122J2475J87553P656n0905J32274m2199K4362j04966j88494J1596M1009
$$ -55122 -42647 144906 152562 101657 233931 191732 216094 111128 -77366 -65770 -24761
26210b4761k4396J05705P4273n8267M4644N457l2262r3128J33683j01472m8726
$$ -24761 -49157 56548 130821 72554 117198 122655 90393 -2735 130948 29476 -19250
26199a9250j57212M8905R7499j13815M912Q9334J81917o7921j28987Q2818k0619
$$ -19250 -176462 -127557 -30058 -143873 -138961 -49627 132290 64369 -64618 18200 -2419
26188b419j61627n8821J01000O1620m1426j436N9081l0859p6309r55m6704j07769
$$ -2419 -164046 -222867 -121867 -60247 -101673 -103109 -44028 -74887 -151196 -152151 -198855 -306624
26176c06624K5751Q6726M2596R1794j5400j21335J92011J76666l1670j19307n6474
$$ -306624 -280873 -194147 -151551 -59757 -75157 -196492 -4481 172185 140515 21208 -35266
26165c5266O2402n1608O4168J13840m3244l1370M5322L2903l0766n4849P1930
$$ -35266 27136 -24472 39696 153536 110292 78922 124244 157147 126381 71532 143462
26154A43462Q9499k0130k01461j6838k3313l4293r2268N1974J03360j08773k8205
$$ 143462 232961 212831 11370 -5468 -28781 -63074 -155342 -103368 -8 -108781 -136986
26143a36986J9413l5954Q7759l3431j57065J27083Q9832J68641M4990J8423L2730
$$ -136986 -117573 -153527 -65768 -99199 -256264 -129181 -39349 129292 174282 192705 225435
26132B25435m7743j66846M7847k2220J30876l619l3952K0047O5038n601M3389
$$ 225435 177692 10846 58693 36473 167349 163730 129778 149825 214863 209262 252651
26121B52651P6837k0452l8599q4070j42469q0831q3653R5846J72304o675k31243
$$ 252651 329488 309036 270437 186367 43898 -36933 -120586 -24740 147564 140889 -90354
26110i0354j05403J60833J83051l1206Q747j29024q9966O8384K04284k6076j34265
$$ -90354 -195757 -34924 148127 116921 125668 -3356 -93322 -24938 179346 153270 19005
26099A9005J3049r9772J9036J10957M2362q15m4732q4647P9988J1448j66016j41438
$$ 19005 32054 -67718 -48682 62275 104637 103822 59090 -25557 54431 65879 -100137 -241575
26087b41575K3048J83066k158j09125J3108J08164R5278L9433J5889Q2402K1115
$$ -241575 -218527 -35461 -37619 -146744 -133636 -25472 69806 109239 125128 207530 228645
26076B28645j08066l2974O5851j05195n7027L8317O1268P7329j51125j02728M0566
$$ 228645 120579 87605 153456 48261 -8766 29551 90819 168148 17023 -85705 -45139
26065d5139R498J08281N7610L0149L975l674l7105j18957j3468k8876L8856Q6966
$$ -45139 -35641 72640 130250 160399 164374 160700 123595 4638 -8830 -37706 1150 88116
26053H8116j6671j7484Q6838l9886m4801r6235j13627j4389J05819K21744p8794
$$ 88116 71445 53961 140799 100913 56112 -40123 -153750 -168139 -62320 159424 80630
26042H0630j74464Q2415N1858k4636k2455p8473n3140O2704J9146o8851J76387
$$ 80630 -93834 -11419 40439 15803 -6652 -85125 -138265 -75561 -56415 -125266 51121
26031E1121p4102j14678n2417N0964j3582j7968n9940O4269J38480N3746N9592
$$ 51121 -22981 -137659 -190076 -139112 -152694 -170662 -230602 -166333 -27853 25893 85485
26020H5485J10052p1881j02524Q0430O7787n853L113o8604J3465k7305m1975n3382
$$ 85485 195537 123656 21132 101562 169349 163496 166609 98005 111470 84165 42190 -11192
26008a1192M2139l7278P490Q3366q6628j39200J5769j3199O0721Q9722O9627j35323
$$ -11192 30947 -6331 1159 84525 -2103 -141303 -125534 -138733 -78012 11710 81337 -53986
25996e3986N9105J30362P2081m3753L1786R0047J10826m1519j28257j65262o3187
$$ -53986 5119 135481 207562 163809 195595 285642 396468 354949 226692 61430 -1757
25985a757m3241o8404l3142n340O4042j75145O441O7984k8011K6609L7561J24165
$$ -1757 -44998 -113402 -146544 -151884 -87842 -262987 -256546 -188562 -216573 -189964 -152403 -28238
25973b8238K59110Q2736m8795q9330R8228K1679j9318j8972o2945K8742n1868
$$ -28238 230872 313608 264813 175483 273711 295390 276072 257100 194155 222897 171029
25962A71029n2455p462j8449n8548J08398L2340j67171p8649R721j3366M3560
$$ 171029 118574 111112 92663 34115 142513 174853 7682 -70967 -61246 -74612 -31052
25951c1052L4675J16707J7960j82010j96538K5967J13639J96872r2642j61295
$$ -31052 3623 120330 138290 -43720 -240258 -214291 -100652 96220 3578 -157717
25941a57717J6373p189o5527J03038J24686J2740q5493m4902j5393N3046N0777
$$ -157717 -141344 -148533 -214060 -111022 13664 26404 -59089 -103991 -119384 -66338 -15561
25930a5561o4153J6088J62489j53131n9410J06186K6996J34795o4680J1529o6180
$$ -15561 -79714 -63626 98863 -54268 -113678 -7492 19504 154299 89619 101148 34968
25919C4968j51850J5397K8691L6618j22932j84444l5598K52566J31241N6282k1566
$$ 34968 -116882 -101485 -72794 -36176 -159108 -343552 -379150 -126584 4657 60939 39373
25908C9373l0578q7312j76128Q3941P1389N7021L3898J90472L5715j74512j17337
$$ 39373 8795 -78517 -254645 -170704 -99315 -42294 -8396 182076 217791 43279 -74058
25897g4058K7994J51337J17291R9299m7135k15519R290n180J05112R3700l830
$$ -74058 -46064 105273 222564 321863 274728 59209 68499 63319 168431 262131 258301
25886B58301l7089k0873l0526J92311k9693j85215Q2882l3969j37382O3258M4270
$$ 258301 221212 200339 169813 362124 332431 147216 230098 196129 58747 122005 166275
25875A66275j36627q5487K29M330q5330m3152n5311P7852M924J02781J74650k7322
$$ 166275 29648 -55839 -55610 -51280 -136610 -179762 -235073 -157221 -152297 -49516 125134 97812
25863I7812l4574K351o6167J21501J20187K2287j00349q6977p9329j1142r5624
$$ 97812 63238 65589 -578 120923 241110 263397 163048 76071 -3258 -14400 -110024
25852a10024O2296J16043K9660l1389p3073J40510K708O459r404J2397n0186O0054
$$ -110024 -47728 68315 97975 66586 -6487 134023 136731 143190 133786 146183 95997 156051
25840A56051N0310l0262l0464N0904R377m2837q8925r2039K7065N0088n1157J8670
$$ 156051 206361 176099 145635 196539 205916 163079 74154 -17885 9180 59268 8111 26781
25828B6781j13114r4339R8010J24374M8112j58680L0274Q2599L3054n5194J51646
$$ 26781 -86333 -180672 -82662 41712 89824 -68856 -38582 44017 77071 21877 173523
25817A73523M7858k0492l1413o0054n0192M0268J19291L1088K2034m4376r6106
$$ 173523 221381 200889 169476 109422 59230 99498 218789 249877 271911 227535 131429
25806A31429p7517M0987K8142O4611j18098j11139m116j07475L439J25000Q1256
$$ 131429 53912 94899 123041 187652 69554 -41585 -45701 -153176 -149737 -24737 56519
25795E6519K3471q1854n2988p838K9024K2995m4712l7690P8231p658J88275J0158
$$ 56519 79990 -1864 -54852 -62690 -33666 -10671 -55383 -93073 -14842 -22500 165775 175933
25783A75933k56941j1407P2709R6711K9609m2148k5636P1157j088p1665P147L8619
$$ 175933 -81008 -92415 -19706 77005 106614 64466 38830 109987 108899 37234 44381 83000
25771H3000N4381r1898R2778N6118k2950q9411j10271P7915l6566q1150l6610
$$ 83000 137381 45483 138261 194379 171429 82018 -28253 49662 13096 -68054 -104664
25760a04664J08788M3387j409n7639l9476J07669O814n4277k3780K4191M4166
$$ -104664 4124 47511 46102 -11537 -51013 56656 63470 9193 -14587 9604 53770
25749E3770p4308n1027K0756k1474Q5162P1712P5700N0098n3104m0083Q8810q3232
$$ 53770 -20538 -71565 -50809 -72283 12879 84591 160291 210389 157285 117202 206012 122780
25737A22780K1594K6019N599j65698r9935p3414Q637J9182O0624J42138j3905
$$ 122780 144374 170393 175992 10294 -89641 -163055 -154418 -135236 -74612 67526 53621
25726E3621o0698O3277N0477o6859j68106J0723J02715N0636o7775M871m8864
$$ 53621 -7077 56200 106677 39818 -128288 -117565 -14850 35786 -31989 -27118 -75982
25715g5982J09388M2262K4208l3677n5457j2953m4045j1490m3447m0510N6846
$$ -75982 33406 75668 99876 66199 10742 -2211 -46256 -57746 -101193 -141703 -84857
25704h4857Q9303J01280o9291J04677m058j43075r1883J37296J4439k6306l0576
$$ -84857 4446 105726 36435 141112 137054 -6021 -97904 39392 53831 27525 -3051
25693c051J9549k1491p0575K1558L9144P056R6899K7642P130q2257j33611l2235
$$ -3051 16498 -4993 -75568 -54010 -14866 -7810 89089 116731 123861 41604 -92007 -124242
25681a24242l9148j464O8422M3472k7611L1919J48271k3379r3226P1812P821K0528
$$ -124242 -163390 -164854 -96432 -52960 -80571 -48652 99619 76240 -16986 54826 62647 83175
25669H3175n4713j23871j10263k1747P6824Q617k6920M677P6082j0575P7998m4350
$$ 83175 28462 -95409 -205672 -227419 -150595 -141978 -168898 -164221 -88139 -98714 -20716 -65066
25657f5066j81545Q7787K01753M6504l9133o537Q3826j22865q9319M672j6272
$$ -65066 -246611 -158824 42929 89433 50300 43763 127589 4724 -84595 -79923 -96195
25646i6195N6264J57396q619r6198m5608m0576n4059J93659J36665q4338j07792
$$ -96195 -39931 117465 108846 12648 -32960 -73536 -127595 66064 202729 118391 10599
25635A0599j55423M4033J82414j09156q9608R851O0705J56855o4178m7444l4379
$$ 10599 -144824 -100791 81623 -27533 -117141 -107290 -46585 110270 46092 -1352 -35731
25624c5731n5710j10556j4092O0484J6392J02208J04977M3599N7501m0690m5931
$$ -35731 -91441 -201997 -216089 -155605 -139213 -37005 67972 111571 169072 128382 82451
25613H2451m5326J1321o573n3684M3208M2553M2450p1110j17547n4759O8274R4373
$$ 82451 37125 48446 41873 -11811 31397 73950 116400 45290 -72257 -127016 -58742 35631
25601C5631R9853j33314J6231O6791M4083K4062K4430j26239k24598K1108J93735
$$ 35631 135484 2170 18401 85192 129275 153337 177767 51528 -173070 -151962 41773
25590D1773N9964o3232l3176J133N7086l5708r2905j09446J21055O8812J0958
$$ 41773 101737 38505 5329 6462 63548 27840 -65065 -174511 -53456 15356 26314
25579B6314r3584R5833P8585j44457p389J14277p3707l9636N3940L2576q0025
$$ 26314 -67270 28563 107148 -37309 -44698 69579 -4128 -43764 10176 42752 -37273
25568c7273j759L5129J55088M9433l5654k45668j4539Q9478l0002j41035j6583
$$ -37273 -39032 -3903 151185 200618 164964 -80704 -95243 -5765 -35767 -176802 -193385
25557a93385J06630P6231p8352j9819R5520L6474l6668M4291l4092j7062p2082
$$ -193385 -86755 -10524 -88876 -108695 -13175 23299 -13369 30922 -3170 -20232 -92314
25546i2314L8004J15851p0622j42423J26255j2774J2440Q9116j13360k02037j10977
$$ -92314 -54310 61541 -9081 -151504 -25249 -38023 -25583 63533 -49827 -251864 -362841
25535c62841J29381J20579M9258j8819N577p3214K469r2046J0613R7683O719k9341
$$ -362841 -233460 -112881 -63623 -82442 -76865 -150079 -147610 -239656 -229043 -131360 -124641 -153982
25523a53982k2317J04432R0251P9188q1073k01444K1766j19928J02493K56736
$$ -153982 -176299 -71867 18384 97572 16499 -184945 -163179 -283107 -180614 76122
25513G6122K810p2317J80802j57934k47259K1941M6041j7301O6294J15131O4265
$$ 76122 78932 6615 187417 29483 -217776 -195835 -149794 -167095 -100801 14330 78595
25502G8595R5809j89967j05557J41948j813r4525K8406j33112L6445R7986p855
$$ 78595 174404 -15563 -121120 20828 19015 -75510 -47104 -180216 -143771 -45785 -53640
25491e3640p1406N6313m4630r4224O1080J00214m201j4934R9059O3831N4279K0891
$$ -53640 -125046 -68733 -113363 -207587 -146507 -46293 -50494 -65428 33631 97462 151741 172632
25479A72632N0643n5000j51836l4495M9141Q1911K3223j35379P0664N9288m2045
$$ 172632 223275 168275 16439 -18056 31085 112996 136219 840 71504 130792 88747
25468H8747j73242O6110M8789P6734M3232j04307j05645K5624L0828q8148Q9199
$$ 88747 -84495 -18385 30404 107138 150370 46063 -59582 -33958 -3130 -91278 -2079
25457b079N2758j00515J15308Q4083J37220l6185j47227j23803J1601m7499j08665
$$ -2079 50679 -49836 65472 149555 286775 250590 103363 -20440 -8839 -56338 -165003
25446a65003L8597J1287N771l6841m9069R8417R7253Q2017J37768k8034j52363
$$ -165003 -126406 -115119 -109348 -146189 -195258 -96841 412 82429 220197 192163 39800
25435C9800j8331j5435p0137p2753n716L0070O4121k9096n4689J41963N9805R0060
$$ 39800 21469 6034 -64103 -136856 -142572 -112502 -48381 -77477 -132166 9797 69602 159662
25423A59662l5289j39154o8285j28457m8478j0427J46519J54921K1020m006R5161
$$ 159662 124373 -14781 -83066 -211523 -260001 -270428 -123909 31012 52032 48026 143187
25412A43187r6523r1896Q4314N6156j19320k9751J65234r7954k13651j08308R0737
$$ 143187 46664 -45232 39082 95238 -24082 -53833 111401 13447 -200204 -308512 -217775
25401b17775M9332r252N3686M9854J824l1211p0612K3439p4982R5095J14540N1366
$$ -217775 -168443 -177695 -124009 -74155 -72331 -103542 -174154 -150715 -225697 -130602 -16062 35304
25389C5304j6432k17610K4462J12930k8787P7928L5546o755Q6077P1209j39607
$$ 35304 18872 -198738 -174276 -61346 -90133 -12205 23341 16586 102663 173872 34265
25378C4265j42781N2035K24713K1382k5918J346n9624O0208N8477R9828M3584
$$ 34265 -108516 -56481 168232 189614 163696 165042 105418 165626 224103 323931 367515
25367C67515j52361j02592M7119M1620p3220p6059o9313J15830K4505m7830P3262
$$ 367515 215154 112562 159681 201301 128081 52022 -17291 98539 123044 75214 148476
25356A48476L3847r2520L2299o7801j39193l782J59605p877j47658o4718J13116
$$ 148476 182323 89803 122102 54301 -84892 -88674 70931 63054 -84604 -149322 -36206
25345c6206M9987q1643J24903o7697j25745J24585J42821M9738j4181o5290j23173
$$ -36206 13781 -67862 57041 -10656 -136401 -11816 131005 180743 166562 101272 -21901
25334b1901j03918r1058J21967J10213R590O3477K6025j0059p6181J449K0219
$$ -21901 -125819 -216877 -94910 15303 24893 88370 114395 104336 28155 29604 49823
25323D9823J8874j44351P3988J05271j50940j78182J97681J45698J16832m2342
$$ 49823 68697 -75654 -1666 103605 -47335 -225517 -27836 117862 234694 192352
25313A92352J7599n7080r8905k05461L6859J93444M5825m5222r5067o8242Q150
$$ 192352 209951 152871 53966 -151495 -114636 78808 124633 79411 -15656 -83898 -75748
25302g5748l2650q6156n4843Q6100J05626R7188l0822N8229J6503m4009j96740
$$ -75748 -108398 -194554 -249397 -163297 -57671 39517 8695 66924 83427 39418 -157322
25291a57322n030P8001l1014Q3990K01767J37755q9754r5763R0133o7801j41236
$$ -157322 -162352 -84351 -115365 -31375 170392 308147 218393 122630 212763 144962 3726
25280C726Q3822m2051j4092M7022l1503j4657Q2998p9981l1011j10130R7741R2468
$$ 3726 87548 45497 31405 78427 46924 32267 115265 35284 4273 -105857 -8116 84352
25268H4352J77792J40466j12657q2315j17910j16708k9905Q2589n2772j12720
$$ 84352 262144 402610 289953 207638 89728 -26980 -56885 25704 -27068 -139788
25258a39788p7369J12492P7834n3547j09058L7827j0134N6595O9118o4116j2199
$$ -139788 -217157 -104665 -26831 -80378 -189436 -151609 -161743 -105148 -36030 -100146 -112345
25247a12345K9183K5714p2881m9846L2901J9346O0599L0909n1696k2203q7490
$$ -112345 -83162 -57448 -130329 -180175 -147274 -127928 -67329 -36420 -88116 -110319 -197809
25236a97809L4933J25786k9004l2392J17410n4303l4454j4842J01212K4606m5456
$$ -197809 -162876 -37090 -66094 -98486 18924 -35379 -69833 -84675 16537 41143 -4313
25225d313k3863r1545J17163q1689j73222o590Q8732J4581J4237J09010k8691
$$ -4313 -28176 -119721 -2558 -84247 -257469 -264059 -175327 -160746 -146509 -37499 -66190
25214f6190O1099N9541j12099n2267k9790j33289N9639J04851j06060j49517J21241
$$ -66190 -5091 54450 -57649 -109916 -139706 -272995 -213356 -108505 -214565 -364082 -242841
25203b42841J64916m059N3854j22659q7962r2316L386J55895j2646K2103J46091
$$ -242841 -77925 -81984 -28130 -150789 -238751 -331067 -327681 -171786 -184432 -162329 -16238
25192a6238J26712N4522M1286o9096j4575q1895n4205n0271o0016m5043j4620
$$ -16238 110474 164996 206282 137186 122611 40716 -13489 -63760 -123776 -168819 -183439
25181a83439K4111J45516J08512j72003j17060J13293l640j3444L3419J34284
$$ -183439 -159328 -13812 94700 -77303 -194363 -81070 -84710 -98154 -64735 69549
25171F9549J1058n2975j0267j4069M2736O0155O607k6382j30361M8997k1000j7444
$$ 69549 80607 27632 17365 3296 46032 106187 112794 86412 -43949 5048 -15952 -33396
25159c3396k2282L9440L1601q0101q6443L4339J02321O9740j70508o7659N4507
$$ -33396 -55678 -16238 15363 -64738 -151181 -116842 -14521 55219 -115289 -182948 -128441
25148a28441M2122l8883J81447J77914J0533r5246j0378J33378p8537j24607j8675
$$ -128441 -86319 -125202 56245 234159 244692 149446 139068 272446 193909 69302 50627
25137E0627j606p1054M3577P9L394M0795K6970k4964j5076j7897o3442O9285L2458
$$ 50627 49021 -22033 21544 21623 25017 65812 92782 67818 52742 34845 -28597 40688 73146
25124G3146K5947K9453r0569P6300J02145j65167j95313K8816J41559J48643M6579
$$ 73146 99093 128546 37977 114277 216422 51255 -144058 -115242 26317 174960 221539
25113B21539r1125O1755n387j59048l964N7221j8419J05867K4633j91785q5110
$$ 221539 130414 192169 186782 27734 23770 80991 62572 168439 193072 1287 -83823
25102h3823P366K8066j8769k4106m3749l1547n2192J05365J49414J00052O1554
$$ -83823 -76457 -48391 -67160 -91266 -135015 -166562 -218754 -113389 36025 136077 197631
25091A97631p9749o6283M56l4079j16511p0237K8368N0835P5364k5506q4417M7238
$$ 197631 117882 51599 52055 17976 -98535 -168772 -140404 -89569 -14205 -39711 -124128 -76890
25079g6890M4945m6394q2214J34519L3902j1701K3733L3522L3161J9940q0994
$$ -76890 -31945 -78339 -160553 -26034 7868 -3833 19900 53422 86583 106523 25529
25068B5529j54827J3159P2941K2657m2782j35002J09751K0375K38423K3078j69649
$$ 25529 -129298 -116139 -43198 -20541 -63323 -198325 -88574 -68199 170224 193302 23653
25057B3653r5407P2144r557k1668k02268j603M9232J43666J75574N4026r7442
$$ 23653 -71754 390 -9167 -30835 -233103 -234706 -185474 -41808 133766 187792 90350
25046I0350L3635q0035j18528l2031l1575o6654M7330L1156K36839J4993k41253
$$ 90350 123985 43950 -74578 -106609 -138184 -204838 -157508 -126352 110487 125480 -115773
25035a15773o3293L0437Q488l8450m65k8690n8916L2088J9658j31006M3217J09533
$$ -115773 -179066 -148629 -140141 -178591 -179056 -207746 -266662 -234574 -214916 -345922 -302705 -193172
25023a93172J11278J64666L3057r587p4592o6290j29679L3052m6460m2585k3255
$$ -193172 -81894 82772 115829 106242 31650 -34640 -164319 -131267 -177727 -220312 -243567
25012b43567L5070j4445J07679j04953J14936K8018L1133K2179L6751j2141l3533
$$ -243567 -208497 -222942 -115263 -220216 -105280 -77262 -46129 -23950 12801 660 -32873
25001c2873N941r0670j36749J34470J09726J05477j052m2723M8999k050m4315
$$ -32873 -26932 -117602 -254351 -119881 -10155 95322 94270 51547 100546 98496 54181
24990E4181L864J28565l3958n2521r4609j43828P40J49845R4012K7327q5337m9386
$$ 54181 58045 186610 152652 100131 5522 -138306 -137566 12279 106291 133618 48281 -1105
24978a105k5999L5551o1497P9406M3404L8785j21355j09745O247j8068N4674J37855
$$ -1105 -27104 8447 -53050 26356 69760 108545 -12810 -122555 -116308 -134376 -79702 58153
24966E8153j7126p8994k9459K7700K4856l4907j3179p2905K8630J32851P7643
$$ 58153 41027 -37967 -67426 -39726 -14870 -49777 -62956 -135861 -107231 25620 103263
24955A03263k2565k5472R3031l7253j07854l1465j645l0469l9494K2874l7235
$$ 103263 80698 55226 148257 111004 3150 -28315 -29960 -60429 -99923 -77049 -114284
24944a14284j9978K2046J30533J65586k5873Q5904N6573j12903q8069p3608n2680
$$ -114284 -134262 -112216 18317 183903 158030 243934 300507 187604 99535 25927 -26753
24933b6753J27684P3200l8400j41480q3409K209r2211K9850K42114P9329j62505
$$ -26753 100931 174131 135731 -5749 -89158 -86949 -179160 -149310 92804 172133 9628
24922I628q2972p477Q8009P224m6505k234l0173J5095O4854J2365j73379p3663
$$ 9628 -73344 -80821 7188 14412 -32093 -34327 -64500 -49405 15449 27814 -145565 -219228
24910b19228P2626L8734k8639j4391K2114j6961n0900r9155L1864J19396K01695
$$ -219228 -146602 -107868 -136507 -150898 -128784 -145745 -196645 -295800 -263936 -144540 57155
24899E7155n2317Q9196l9990j63983n5775J03642m8558M8059L0687l989R6680
$$ 57155 4838 94034 54044 -109939 -165714 -62072 -110630 -62571 -31884 -35873 60807
24888F0807j0155q9341j62837Q379L7536R4569P2663j86400k5758R0136O1853
$$ 60807 50652 -38689 -201526 -193147 -155611 -61042 11621 -174779 -200537 -110401 -48548
24877d8548N5667M5839o5127o8735J925j0179K1451q4330p0194O2678R6225L325
$$ -48548 7119 52958 -12169 -80904 -78979 -89158 -67707 -152037 -222231 -159553 -63328 -60003
24865f0003J04111N9838n7248o2294J10675o3827R4087N4199n1903n0780Q1770
$$ -60003 44108 103946 46698 -15596 95079 31252 125339 179538 127635 76855 158625
24854A58625k1873r8832M3905L8382n7704J45893N5068o5971j09163K0884J8630
$$ 158625 136752 37920 81825 120207 62503 208396 263464 197493 88330 109214 127844
24843A27844L8340l5398k1528j03643l6008O8577J12628m9o0107J2951j5087O5686
$$ 127844 166184 130786 109258 5615 -30393 38184 150812 150763 90656 103607 88520 154206
24831A54206J9480j39489j52550M2586j6342N4248J51216r9643R8211J87654n1853
$$ 154206 173686 34197 -118353 -75767 -92109 -37861 113355 13712 111923 299577 247724
24820B47724q9970j31191o7720j01782O4734R0649O6149n8597j54895p7644J4253
$$ 247724 157754 26563 -41157 -142939 -78205 12444 78593 19996 -134899 -212543 -198290
24809a98290O9183L133J50558P9379j68081k00286j1725m2541L5751J30598K24741
$$ -198290 -129107 -125974 24584 103963 -64118 -264404 -276129 -318670 -282919 -152321 72420
24798G2420J01821n7145q1070j6785Q6059M7300j79699j18953R9663O6818J432
$$ 72420 174241 117096 36026 19241 105300 152600 -27099 -146052 -46389 20429 21861
24787B1861p00k7538Q3970J3414N9744j73555j24617O9191J16637p5536p6834
$$ 21861 21161 -6377 77593 91007 150751 -22804 -147421 -78230 38407 -37129 -113963
24776a13963k3305L8270O5394o0617J8685p4039m2482N6783k517J350l3606K0365
$$ -113963 -137268 -98998 -33604 -94221 -75536 -149575 -192057 -135274 -137791 -136441 -170047 -149682
24764a49682P3614L0545P0103j09976q3594J18321Q3085Q6361K7101n5494N3524
$$ -149682 -76068 -45523 24580 -85396 -168990 -50669 32416 118777 145878 90384 143908
24753A43908J29990k9057p5267q088J45998n8608j38512P1022P4432j2007M5118
$$ 143908 273898 244841 169574 161486 307484 248876 110364 181386 255818 243811 288929
24742B88929r0714j21493J0982P6451O57j46441j51105L135Q280m827K252l2356
$$ 288929 198215 76722 87704 164155 164812 18371 -132734 -129599 -121319 -126146 -123894 -156250
24730a56250q072r485M5988l3940R3563K6106n1053M9501j06639l5003j3710R7786
$$ -156250 -164322 -173807 -127819 -161759 -68196 -42090 -93143 -43642 -150281 -185284 -198994 -101208
24718a01208R5525J22978j09580n817R1606J3825o2559J0716J77143N806k1833
$$ -101208 -5683 117295 7715 1898 93504 107329 44770 55486 232629 238435 216602
24707B16602q1119j02748N5210J8495J11991J22181k08582q5377K5716j4504J9947
$$ 216602 135483 32735 87945 106440 218431 340612 132030 46653 72369 57865 77812
24696G7812n1259l6365o1481m719k5392j3627J25039J4007j11119K0216J0651
$$ 77812 26553 -9812 -71293 -76012 -101404 -115031 10008 24015 -87104 -66888 -56237
24685e6237p9609p1544J00514Q9579J7209M8733o1011n9029l3757l0053J16062
$$ -56237 -135846 -207390 -106876 -17297 -88 48645 -12366 -71395 -105152 -135205 -19143
24674a9143J7520Q9253J9018j3341K5080J8149P317j4152l6656k20075k0676L7071
$$ -19143 -1623 87630 106648 93307 118387 136536 143853 129701 93045 -127030 -147706 -110635
24662a10635K1371q4497r8428M4716P3702j8041K4491j55817j8747Q0814J06349
$$ -110635 -89264 -173761 -272189 -227473 -153771 -171812 -147321 -303138 -321885 -241071 -134722
24651a34722m780k7918m3597K6112P4975m595k4064M4534P643j62261j9748K8481
$$ -134722 -139502 -167420 -211017 -184905 -109930 -114525 -138589 -94055 -86412 -248673 -268421 -239940
24639b39940R6173Q9147j27520J04817M8207J850P2839l1316m5979k1389J3018
$$ -239940 -143767 -54620 -182140 -77323 -29116 -27266 45573 14257 -31722 -53111 -40093
24628d0093n3252J27278J62674J1225o2308o6457k44583r3641J06Q8177L9451
$$ -40093 -93345 33933 196607 207832 145524 79067 -165516 -259157 -259051 -170874 -131423
24617a31423K5080m4104q5128K7080Q3836L033j40526M4218J26120n9679l6463
$$ -131423 -106343 -150447 -235575 -208495 -124659 -121626 -262152 -217934 -91814 -151493 -187956
24606a87956J10105J07506o3187k6046J21142J06503J8142P8211m2553q6037j92647
$$ -187956 -77851 29655 -33532 -59578 61564 168067 186209 264420 221867 135830 -56817
24595e6817p0056m9036L2401J36955J24707n8775j1347p007m4617Q3612P6731
$$ -56817 -126873 -175909 -143508 -6553 118154 59379 48032 41025 -3592 80020 156751
24584A56751J7490Q7918O9158o3879j54938j47519m3697M1182n0076M3878l4395
$$ 156751 174241 262159 331317 267438 112500 -35019 -78716 -37534 -87610 -43732 -78127
24573g8127N0329J8040r7527k30900j36579M6032J93334J67594l3296m7774l7567
$$ -78127 -27798 -9758 -107285 -338185 -474764 -428732 -235398 -67804 -101100 -148874 -186441
24562a86441J38720P7810m6393m7770o8765R1550r704k2527K2512n8745J0548
$$ -186441 -47721 30089 -16304 -64074 -132839 -41289 -50993 -73520 -51008 -109753 -99205
24551i9205J808Q6410K3893m0573j13348n3742q974N311m8759R8350K3968j8156
$$ -99205 -97397 -10987 12906 -27667 -141015 -194757 -203731 -198420 -247179 -148829 -124861 -143017
24539a43017L0362N5767q6712o2996J05657k4493j03216O2155J34737Q2210q6
$$ -143017 -112655 -56888 -143600 -206596 -100939 -125432 -228648 -166493 -31756 50454 50368
24528E0368m8993M7663j00288k855J7498r1895N8166Q7638O5902j9876n3151n8159
$$ 50368 1375 49038 -51250 -54105 -36607 -128502 -70336 17302 83204 63328 10177 -47982
24516d7982n6443L133r284J6731K726m6976q3926J25174J58071L461P6951J8503
$$ -47982 -104425 -101292 -110576 -93845 -91119 -138095 -222021 -96847 61224 64685 141636 160139
24504A60139j72762K9689l135p717o6767k4875r1357l3799J06385Q5247q5132
$$ 160139 -12623 17066 13931 6214 -60553 -85428 -176785 -210584 -104199 -18952 -104084
24493a04084j33625M5925Q5759k3939j9296k2331J40888n8896n5650O4125P6675
$$ -104084 -237709 -191784 -106025 -129964 -149260 -171591 -30703 -89599 -145249 -81124 -4449
24482d449K2193K9193k271J8886K8911l8671M742N9785p552j02241Q0188m8457
$$ -4449 17744 46937 44666 63552 92463 53792 58534 118319 110767 8526 88714 40257
24470D0257j12185q237n6660k0807J98977n0468k11966j25215K48892K02501p9316
$$ 40257 -71928 -80165 -136825 -157632 41345 -9123 -221089 -346304 -97412 105089 25773
24459B5773p6785J24970J36553o2395o0200o1543j02366o9979Q6409k5810J5784
$$ 25773 -51012 73958 210511 148116 87916 26373 -75993 -145972 -59563 -85373 -69589
24448f9589N3243n1980n3771J37382R0154r0794j1045q839k9200j80295J8253
$$ -69589 -16346 -68326 -122097 15285 105439 14645 3600 -5239 -34439 -214734 -196481
24437a96481J35891M1407N3411L2936k3964k3992O8792l6978n100j36222l9685
$$ -196481 -60590 -19183 34228 67164 43200 19208 88000 51022 45922 -90300 -129985
24426a29985M1530L8715L1407O5449O6332l1053p9030q315k1804J53360K0054
$$ -129985 -88455 -49740 -18333 47116 113448 82395 3365 -4950 -26754 126606 146660
24415A46660j27743O153l1750j0723R9046J5922l6165k860n972n1683j42836q0959
$$ 146660 18917 25070 -6680 -17403 81643 97565 61400 58540 52568 885 -141951 -222910
24403b22910J01040J06838o8247R6564O0914K593l1534M6435j04331o4148L3319
$$ -222910 -121870 -15032 -83279 13285 74199 76792 45258 91693 -12638 -76786 -43467
24392d3467m9886j5554k6425J7592P5648J25233K1535M5199j52988j17577n2717
$$ -43467 -93353 -108907 -135332 -117740 -42092 83141 104676 149875 -3113 -120690 -173407
24381a73407O1628O4814j03717P738n6956R0724K34357J55761M8822j00685n4341
$$ -173407 -111779 -46965 -150682 -142944 -199900 -109176 125181 280942 329764 229079 174738
24370A74738n3773N4724J30585j04666k55472L0006J8141j63360M7190m2680j0782
$$ 174738 120965 175689 306274 201608 -53864 -23858 -5717 -169077 -121887 -164567 -175349
24359a75349q3932R508P7615P3321J91677O5918J8012l5308n4014j56239l752
$$ -175349 -259281 -249773 -172158 -98837 92840 158758 176770 141462 87448 -68791 -72543
24348g2543O994j26395p5270M3370n6438J4741J41437k6273J7294n9867q1254
$$ -72543 -65549 -191944 -267214 -223844 -280282 -265541 -124104 -150377 -133083 -192950 -274204
24337b74204J7908Q812J18325O6838R6936P6174p9345j96054j21462J22523N7564
$$ -274204 -256296 -247484 -129159 -62321 34615 110789 31444 -164610 -286072 -163549 -105985
24326a05985Q7123R0643P8579n1847k5813K4918J9503L5376k162k19604k03246
$$ -105985 -18862 71781 150360 98513 72700 97618 117121 152497 150335 -69269 -272515
24315b72515J41599J46932M3216k0229k1825R1750j4659r0824n2745k25M0894
$$ -272515 -130916 16016 59232 39003 17178 108928 94269 3445 -49300 -49525 -8631
24304h631p027k63966K5099P3731P6799N6379k5030m9788m9788L2172l4858L9037
$$ -8631 -15658 -279624 -254525 -180794 -103995 -47616 -72646 -122434 -172222 -140050 -174908 -135871
24292a35871j4334J33346J64633m0115n9958j66008p2073M3661Q9166N1735J8538
$$ -135871 -150205 -16859 147774 107659 47701 -118307 -190380 -146719 -57553 -5818 12720
24281A2720l1093j7420M2132P1619n6056J527Q4040M7838r6803q9093J21663k5798
$$ 12720 -18373 -35793 6339 77958 21902 23429 107469 155307 58504 -30589 91074 65276
24269F5276M805Q3743k9906j93597j5156Q1064O0412k7010O1452k4025j44064
$$ 65276 70081 153824 123918 -69679 -84835 -3771 56641 29631 91083 67058 -77006
24258g7006k5138O4720J14737J75740M4159j37923j45473j42077Q7518J92191
$$ -77006 -102144 -37424 77313 253053 297212 159289 13816 -128261 -40743 151448
24248A51448J2886l5503j43065l9009L7031J14734p2001N4302K083L3606j16515
$$ 151448 164334 128831 -14234 -53243 -16212 98522 26521 80823 82906 116512 -3
24237cj88010q709O7904o5468m8612m0731q9488J1235m9839M4127J55515N0866
$$ -3 -188013 -196722 -128818 -194286 -242898 -283629 -373117 -361882 -411721 -367594 -212079 -161213
24225a61213N4498j2508J8801k0499n6805R5592K31225J02570j03343r6122l7120
$$ -161213 -106715 -119223 -100422 -120921 -177726 -82134 149091 251661 148318 52196 15076
24214A5076k1691j38223L0332J03887K7324N3418Q4719j21887j21059J4178R8102
$$ 15076 -6615 -144838 -114506 -10619 16705 70123 154842 32955 -88104 -73926 24176
24203B4176J31327J0638j08532j39325N1658O0591o4934j18095m8391Q6496P3094
$$ 24176 155503 166141 57609 -81716 -30058 30533 -34401 -152496 -200887 -114391 -41297
24192d1297K15151J18692K0284j04519j41063j35686O6202P483j18381M4583o2213
$$ -41297 173854 292546 312830 208311 67248 -68438 -2236 5247 -113134 -68551 -130764
24181a30764J4725o3376j48807n0505J19574q278J25796L732q673l6468J15176
$$ -130764 -116039 -179415 -328222 -378727 -259153 -267431 -141635 -137903 -146576 -183044 -67868
24170f7868J13096k4122m9537j53082j07045J36078Q7176O8466o297m9062J5371
$$ -67868 45228 21106 -28431 -181513 -288558 -152480 -65304 3162 -3135 -52197 -36826
24159c6826N3005M2161J25326j64256j63307M3389J03625j121j22714r585J82688
$$ -36826 16179 58340 183666 19410 -143897 -100508 3117 1996 -120718 -130303 52385
24148E2385Q1044R4750O0033j57667l0089R5614O5762j30495m3485p3965m3604
$$ 52385 133429 228179 288212 130545 100456 196070 261832 131337 87852 13887 -29717
24137b9717K9245J33197n4381P393O5630j9619j9749j15915r6889J0264j1034
$$ -29717 -472 132725 78344 85737 151367 131748 111999 -3916 -100805 -90541 -101575
24126a01575n9957J39218J45973m2304j34791l2609k2126K8634N0866P0609L7826
$$ -101575 -161532 -22314 123659 81355 -53436 -86045 -108171 -79537 -28671 41938 79764
24115G9764M9890r4989j25102j14707Q9399J78285M8626J65448k9417k23695j39202
$$ 79764 129654 34665 -90437 -205144 -115745 62540 111166 276614 247197 23502 -115700
24104a15700O0122J22568k4542K248j3388m6349p363O6143J0521j00290j14107
$$ -115700 -55578 66990 42448 44696 31308 -15041 -22404 43739 54260 -46030 -160137
24093a60137o9576p5068R2533K35677L7248q4495q7309O1813O795l1620O8945
$$ -160137 -229713 -304781 -212248 23429 60677 -23818 -111127 -49314 -42519 -74139 -5194
24082e194m2766N4414r7094M8539P3565j04082K4107K15253m4688l6930r9713
$$ -5194 -47960 6454 -90640 -42101 31464 -72618 -48511 166742 122054 85124 -14589
24071a4589r5038O0478J14677J32413K7612p0630n5735m7218r2784n8109l5344
$$ -14589 -109627 -49149 65528 197941 225553 154923 99188 51970 -40814 -98923 -134267
24060a34267P7371L1816M3938O1903M2052n4983R4818j4238j7186k2253L8063
$$ -134267 -56896 -25080 18858 80761 122813 67830 162648 148410 131224 108971 147034
24049A47034j5936j87625p6399m6704q1229M4514J16764Q8319j26775N1682J32235
$$ 147034 131098 -56527 -132926 -179630 -260859 -216345 -99581 -11262 -138037 -86355 45880
24038D5880J5087J1068N0004R4220k0977j42502J6196q6917k3707m5571M9608
$$ 45880 60967 72035 122039 216259 195282 52780 68976 -17941 -41648 -87219 -37611
24027c7611j8951r2369n7634J25747r304l0098l8246J60401J62515l0326m0758
$$ -37611 -56562 -148931 -206565 -80818 -90122 -120220 -158466 1935 164450 134124 93366
24016I3366k2387O293q0192j3503R9487J9175k7257l7874k5796L7449N5307J0122
$$ 93366 70979 77272 -2920 -16423 83064 102239 74982 37108 11312 48761 104068 114190
24004A14190P2659j1718j3387n0253N0988l5918j69526j6598j8276m6188K0353
$$ 114190 186849 175131 161744 111491 162479 126561 -42965 -59563 -77839 -124027 -103674
23993a03674K6814M7669m1673Q2501l3235R7721K8396J0045M8739m7195J04643
$$ -103674 -76860 -29191 -70864 11637 -21598 76123 104519 114564 163303 116108 220751
23982B20751J03460j16789j69030j32936K370o7244R765q3454N1155J53706o120
$$ 220751 324211 207422 38392 -94544 -92174 -159418 -149653 -233107 -181952 -28246 -34366
23971c4366j37621o257R3043J01215M611K8138p3524k33475m2613K0640J9062
$$ -34366 -171987 -178244 -85201 16014 20625 48763 -24761 -258236 -300849 -280209 -261147
23960b61147N7939L8648m626J02272J8965J21839L1863k3674l4986j32135P4534
$$ -261147 -203208 -164560 -169186 -66914 -47949 73890 105753 82079 47093 -85042 -10508
23949a0508J02717p1575M1957J80849p4304j1705m0716K9943N3130j30306J0742
$$ -10508 92209 20634 62591 243440 169136 157431 116715 146658 199788 69482 80224
23938H0224n8072O2579r866k04872j78139Q7901n599Q7970J18906k6377q4094
$$ 80224 22152 84731 74865 -130007 -308146 -220245 -225844 -137874 -18968 -45345 -129439
23927a29439P9180k6355k7209q266l3127K0596Q2212M1289k8088j62193K5326
$$ -129439 -50259 -76614 -103823 -112089 -145216 -124620 -42408 -1119 -29207 -191400 -166074
23916a66074J14810J61320O5096o6371j6741K7653p156O9148n3024L4113j6413
$$ -166074 -51264 110056 175152 108781 92040 119693 112537 181685 128661 162774 146361
23905A46361k06452j31907O7222Q4226l9907q4297m9629N3580J53709L415P387
$$ 146361 -60091 -191998 -124776 -40550 -80457 -164754 -214383 -160803 -7094 -3679 3708
23894C708L9459p7643N360N3235P3354K9568R623Q2781N0141q2027q6596p4094
$$ 3708 43167 -34476 -29116 24119 97473 127041 136664 219445 269586 187559 100963 26869
23882B6869J69243J9168j07223p3609k058q3832n8878N3362o8575M4205Q1653
$$ 26869 196112 215280 108057 34448 32390 -51442 -110320 -56958 -125533 -81328 325
23871C25j02673j50678N2629J61924O7092j6753J2040j51970J6608L7938L6323
$$ 325 -102348 -253026 -200397 -38473 28619 11866 23906 -128064 -111456 -73518 -37195
23860c7195J79976J2885r1557n1770N4176l6858O0715q9389j19957n2867J42648
$$ -37195 142781 155666 64109 12339 66515 29657 90372 983 -118974 -171841 -29193
23849b9193J48570P2426L8952o3246p5028j84712p4648R3052K5256m925n0419
$$ -29193 119377 191803 230755 167509 92481 -92231 -166879 -73827 -48571 -53496 -103915
23838a03915r2494J24532K24568m4814j27947J95431K2649m296j68306p0828J45917
$$ -103915 -196409 -71877 152691 107877 -20070 175361 198010 193714 25408 -45420 100497
23827A00497r824p4319o5394K1460Q735l1711r3652M613j26858R5347J60431j183
$$ 100497 90673 16354 -49040 -27580 -18845 -50556 -144208 -139595 -266453 -171106 -10675 -11858
23815a1858j13065k2510J12857P3259j86036q0205J50116J8339L0027K11105R852
$$ -11858 -124923 -147433 -34576 38683 -147353 -227558 -77442 -59103 -29076 182029 191881
23804A91881k2211M5514r0340m8900l9776J03766r9445j41198m2636l0778r5874
$$ 191881 169670 215184 124844 75944 36168 139934 40489 -100709 -143345 -174123 -269997
23793b69997K3887J86791J24706R9023N7108j85201o6892n2079J6962L7331o0497
$$ -269997 -246110 -59319 65387 164410 221518 36317 -30575 -82654 -65692 -28361 -88858
23782h8858l2252J18577R3216M7189r171j8020J0697J07835l6234j32757m9042
$$ -88858 -121110 -2533 90683 137872 128701 110681 121378 229213 192979 60222 11180
23771A1180J82391k2187k39416K4792k7109k4221Q0546M0950n2666p5818q5906
$$ 11180 193571 171384 -68032 -43240 -70349 -94570 -14024 26926 -25740 -101558 -187464
23760a87464k4230J38598J68620j0847p9625j05381r6705o7680Q4122J5241l1492
$$ -187464 -211694 -73096 95524 84677 5052 -100329 -197034 -264714 -180592 -165351 -196843
23749a96843p1023J63046J24930l7026Q9842P5209r01R397k3993m997l1936p4215
$$ -196843 -267866 -104820 20110 -16916 72926 148135 147234 156631 132638 127641 95705 21490
23737B1490p2650q8486m5676r8336O4544J73761j803Q2415R6217n9544o0080m0140
$$ 21490 -51160 -139646 -185322 -283658 -219114 -45353 -47156 35259 131476 71932 11852 -28288
23725b8288l1655M1944O5963l7627j8363n0292R2493L8291j38264k8069K3735
$$ -28288 -59943 -17999 47964 10337 -8026 -58318 34175 72466 -65798 -93867 -70132
23714g0132o3098J37837P4333j27562J40865N6440j00495n2991m0548l0593P9598
$$ -70132 -133230 4607 78940 -48622 92243 148683 48188 -4803 -45351 -75944 3654
23703C654J14228K805p4447j94071j01067J13420K3163J25327l6507P721P9574
$$ 3654 117882 120687 46240 -147831 -248898 -135478 -112315 13012 -23495 -15774 63800
23692F3800k3853r9798J29503l2569j09470o0465m8755k0693j2977J46954P7672
$$ 63800 39947 -59851 69652 37083 -72387 -132852 -181607 -202300 -215277 -68323 9349
23681I349J04753O8058k7982J0229o8538J1702n7275l9364p2159o6281R7103K10267
$$ 9349 114102 182160 154178 164407 95869 107571 50296 10932 -61227 -127508 -30405 179862
23669A79862O5885j27726j94047j01610j4681M1370K7786j3087M8400J46009M6937
$$ 179862 245747 118021 -76026 -177636 -192317 -150947 -123161 -136248 -87848 58161 105098
23658A05098j79125j43944P7294J43689o3688R3844J03980l8314k2444q1471k2699
$$ 105098 -74027 -217971 -140677 3012 -60676 33168 137148 98834 76390 -5081 -27780
23647b7780j10797r9813O9088J46519L5681j10958p7969M1049o1314m5961P3985
$$ -27780 -138577 -238390 -169302 -22783 12898 -98060 -176029 -134980 -196294 -242255 -168270
23636a68270M2410L9461o1704O2119R3721j2869m2521o702N8462J33632k2032
$$ -168270 -125860 -86399 -148103 -85984 7737 -5132 -47653 -54355 4107 137739 115707
23625A15707R0656o4948o2022L9071N447o1957j16612R3570o9719j84798r5364
$$ 115707 206363 141415 79393 118464 123911 61954 -54658 38912 -30807 -215605 -310969
23614c10969O9823R8043R7776K8315j51182L5626m3664J1873J28354J18315L8237
$$ -310969 -241146 -143103 -45327 -17012 -168194 -132568 -176232 -164359 -36005 82310 120547
23603A20547p8618p4852J19888j28682j72126J8321K52001J28096o6052j39776
$$ 120547 41929 -32923 86965 -41717 -213843 -195522 56479 184575 118523 -21253
23593b1253O870J04082j1001o4993k2054q4620j01720q5039M0287J70384m8378
$$ -21253 -14383 89699 78698 13705 -8349 -92969 -194689 -279728 -239441 -69057 -117435
23582a17435O268M9839L5795m1036L185O5834J6511n9336j621N1038K522j56318
$$ -117435 -111167 -61328 -25533 -66569 -63384 2450 18961 -40375 -41996 9042 11564 -144754
23570a44754k3084L6995l9787M0418o700p9394k0308O8275P8261J25655J02880
$$ -144754 -167838 -130843 -170630 -130212 -136912 -216306 -236614 -168339 -90078 35577 138457
23559A38457P6329Q8713o5940n2532J8135p5092j16733k308J54379M0739j12608
$$ 138457 214786 303499 237559 185027 203162 128070 11337 9029 163408 204147 91539
23548I1539p9081O2034m2347o2309k3856m9821L662j7995p1875K235N4265Q6607
$$ 91539 12458 74492 32145 -30164 -54020 -103841 -100179 -118174 -190049 -187814 -133549 -46942
23536d6942l5438J9784J08701O9417j63790n0290p4706j4760J04834Q2684j50612
$$ -46942 -82380 -62596 46105 115522 -48268 -98558 -173264 -188024 -83190 -506 -151118
23525a51118M5195j22834O1908J59718N7053j29892l9344o6341j3691l707J9524
$$ -151118 -105923 -228757 -166849 -7131 49922 -79970 -119314 -185655 -199346 -203053 -183529
23514a83529M367L8007o910l7852J54771R3239L8600k1468n7199l7085L8882k6926
$$ -183529 -179162 -141155 -148065 -185917 -31146 62093 100693 79225 22026 -15059 23823 -3103
23502c103j39149l1277J5384m3568k548k5632M590J62098R2033j9514J00032p0694
$$ -3103 -142252 -173529 -158145 -201713 -204261 -229893 -225303 -63205 28828 9314 109346 38652
23490C8652p1317N2857P5002m7230J17484L3133j51311Q899p9893J23573L0143
$$ 38652 -32665 20192 95194 47964 165448 198581 47270 56169 -23724 99849 129992
23479A29992l651j7542J6686o9592o0614J22291j7349j23960N7173K932m3611
$$ 129992 126341 108799 125485 55893 -4721 117570 100221 -23739 33434 36366 -7245
23468g245N3103N1161j72682K2335M2284j56309r7989J28962J50847q4732L8234
$$ -7245 45858 97019 -75663 -53328 -11044 -167353 -265342 -136380 14467 -70265 -32031
23457c2031J722k5261o690o7022m885P6934N6985R6709N0991m9816n6358p3861
$$ -32031 -30309 -55570 -62260 -129282 -134167 -57233 -248 96461 147452 97636 41278 -32583
23445c2583J40835p7683j22018R952M457J02231N2491k920N9282j2903o9835J26424
$$ -32583 108252 30569 -91449 -81497 -77040 25191 77682 74762 134044 121141 51306 177730
23433A77730l4574N9176J7979k7458j0783j27015m6223N0785l997p4482m4245
$$ 177730 143156 202332 220311 192853 182070 55055 8832 59617 55620 -18862 -63107
23422f3107R1884R2602J2180j3871p1048j49886p8480O4069K21009M7233m6645
$$ -63107 28777 121379 133559 119688 48640 -101246 -179726 -115657 105352 152585 105940
23411A05940l6327o540J4403j01618l4428O6135M6115j73186j77587J57561K70826
$$ 105940 69613 63073 77476 -24142 -58570 7565 53680 -119506 -297093 -139532 131294
23400A31294q7931j32503j36330N852J46444p305J4485K6326L0780O4427j80500
$$ 131294 43363 -89140 -225470 -219618 -73174 -80479 -65994 -39668 -8888 55539 -124961
23389a24961K9566J95302j34747m386q548M997o5609j7792J05344J2414r7960
$$ -124961 -95395 99907 -34840 -39226 -47774 -42777 -108386 -126178 -20834 -8420 -106380
23378a06380j14366J3921N3878n0535J78316M983j69744q0307J45770p0668J3446
$$ -106380 -220746 -206825 -152947 -203482 -25166 -20183 -189927 -270234 -124464 -195132 -181686
23367a81686J63178Q1753L9079r5278N5891l5906k07621k0354J18507R5562j2853
$$ -181686 -18508 63245 102324 7046 62937 27031 -180590 -200944 -82437 13125 272
23356B72j30608n9709O6241r838L8636q777m9496J4919N7018m2204n0579n8050
$$ 272 -130336 -190045 -123804 -133642 -95006 -103783 -153279 -138360 -81342 -123546 -174125 -232175
23344b32175q7697J14482K06895K03895r5689p9621J13825J02064j3171j47464
$$ -232175 -319872 -205390 1505 205400 109711 30090 143915 245979 232808 85344
23334H5344j36532Q5067J66797n7052j08989p8356l2700L0861Q834J29566P6945
$$ 85344 -51188 33879 200676 143624 34635 -43721 -76421 -45560 -36726 92840 169785
23323A69785n0023j67371j51554m0591J77723J4026R841p4968l9741J07607J9645
$$ 169785 119762 -47609 -199163 -239754 -62031 -48005 -38164 -113132 -152873 -45266 -25621
23312b5621K7786m6629j77065Q0083J76460R4201j35255j40190K1813M8847K2761
$$ -25621 2165 -44464 -221529 -141446 35014 129215 -6040 -146230 -124417 -75570 -52809
23301e2809p2830L540K09407J28181n6464j01397k9920J28642J14658l2964m2482
$$ -52809 -125639 -122099 87308 215489 159025 57628 27708 156350 271008 238044 195562
23290A95562o3371r7023o4779l3260o5639J16655J78590o4217l1418l8576L2028
$$ 195562 132191 35168 -29611 -62871 -128510 -11855 166735 102518 71100 32524 64552
23279F4552m3972m8221R4804q5963q148j0643P240N0029M5515k6124j61864j03012
$$ 64552 20580 -27641 67163 -18800 -26948 -37591 -30351 19678 65193 39069 -122795 -225807
23267b25807J9425R4291M9914L5716q4990N1941l5674p3916m8166J3034J08112
$$ -225807 -206382 -112091 -62177 -26461 -111451 -59510 -95184 -169100 -217266 -204232 -96120
23256i6120J07581O8628j9314k8016J118R1878P9149l5532p0318j63639R227k7686
$$ -96120 11461 80089 60775 32759 33877 125755 204904 169372 99054 -64585 -55358 -83044
23244h3044R9417J51506p5815q4937j0161J32232O3045M3567L8247n3981j83874
$$ -83044 16373 167879 92064 7127 -3034 129198 192243 235810 274057 220076 36202
23233C6202l2057o014n4915o9411q4903O2679k7583l4434Q4791N7532n8896K8961
$$ 36202 4145 -1869 -56784 -126195 -211098 -148419 -176002 -210436 -125645 -68113 -127009 -98048
23221i8048k8603K8620l61O1144r1375j05599P5214P1911J31280J14205k8252
$$ -98048 -126651 -98031 -98392 -37248 -128623 -234222 -159008 -87097 44183 158388 130136
23210A30136r7748n8388J90700P7631j29288j39800P6847j6066j03614j42796
$$ 130136 32388 -26000 164700 242331 113043 -26757 50090 34024 -69590 -212386
23200b12386l9837n6352l6799J6814J31020J5163N6059l384p0214Q857K0156J9638
$$ -212386 -252223 -308575 -345374 -328560 -197540 -182377 -126318 -129702 -199916 -191059 -170903 -151265
23188a51265R2932p710n1887j0797o8353P007O4361n0700k7242K6017J7302N278
$$ -151265 -58333 -66043 -117930 -128727 -197080 -190073 -125712 -176412 -203654 -177637 -160335 -155057
23176a55057o6962n8976P6975P3422M3311O6062N799n5205m7982J7555K6588Q4169
$$ -155057 -222019 -280995 -204020 -130598 -87287 -21225 -15426 -70631 -118613 -101058 -74470 9699
23164I699N7127J41323O9551j05718O522m33l06813J4879J15790j96n1263l136
$$ 9699 66826 208149 277700 171982 178504 178071 -128742 -113863 1927 1731 -49532 -52668
23152e2668K18313N3056j12035j28370j73055j1052J14053J17886M7140N773l8056
$$ -52668 165645 218701 106666 -21704 -194759 -205811 -91758 26128 73268 79041 40985
23141D0985N1762R99o3026l8702O0347P941j05642j21247m9433Q7702N1912J3146
$$ 40985 92747 93746 30720 -7982 52365 60306 -45336 -166583 -216016 -128314 -76402 -63256
23129f3256n3441l386P200k23436j13417p0806J97096K21427J29346l6806j02536
$$ -63256 -116697 -120083 -112883 -336319 -449736 -520542 -323446 -102019 27327 -9479 -112015
23118a12015Q8455r037o4458n358N3706R3308q7615j5085M1382N7100q1151l9161
$$ -112015 -23560 -32597 -97055 -102413 -48707 44601 -43014 -58099 -16717 40383 -40768 -79929
23106g9929l7329M59Q811r466O3450R4618p4611j94385m6420J76068J02978L7748
$$ -79929 -117258 -116799 -107988 -117454 -54004 40614 -33997 -228382 -274802 -98734 4244 41992
23094D1992j04456j37811k561J68512O2207l1425l7449J13602N2132J6947O2352
$$ 41992 -62464 -200275 -202836 -34324 27883 -3542 -40991 72611 124743 141690 204042
23083B04042j19659o6866p8635J25260n459l24598J59511K43371N6394k04343
$$ 204042 84383 17517 -61118 64142 58683 -265915 -106404 136967 193361 -10982
23073a0982o9151j6405J18778O4968K1510O4502l6667o6784j21963o0954P9966
$$ -10982 -80133 -96538 22240 87208 108718 173220 136553 69769 -52194 -113148 -33182
23062c3182J45919J3491n8100n1404j6883Q6055J3238l5080q8150L6049q743m1694
$$ -33182 112737 126228 68128 16724 -159 85896 99134 64054 -24096 11953 3210 -38484
23050c8484p4829l685J15132l0765k9137j13207r5903O0991Q8647Q5687J06144
$$ -38484 -113313 -116998 -1866 -32631 -61768 -174975 -270878 -209887 -121240 -35553 70591
23039G0591M4770q9376O190K2394J03241k3796j67135o379Q6976Q6945n0287n156
$$ 70591 115361 25985 32175 54569 157810 134014 -33121 -39500 47476 134421 84134 78978
23027G8978p2904o8101p7750N0926Q7261J51724p0433k0866L2101K2955j46206
$$ 78978 6074 -62027 -139777 -88851 -1590 150134 79701 58835 90936 113891 -32315
23016c2315r1169j6125R429J1747p791P2570J38450n2318j55169j19596J94432
$$ -32315 -123484 -139609 -130180 -118433 -126224 -53654 84796 32478 -122691 -242287 -47855
23005d7855L06455J42446m2644n5887j55937K2132O2324q9435n1417L1517q5861
$$ -47855 258600 401046 358402 302515 146578 168710 231034 141599 90182 121699 35838
22994C5838o4169p2823M4563k2496l0903M6823Q9016K2528l5367K6165m1351j70994
$$ 35838 -28331 -101154 -56591 -79087 -109990 -63167 25849 48377 13010 39175 -2176 -173170
22982a73170j07169j9727J11803O4074p2649J03133n645L5402Q1212M7633R4808
$$ -173170 -280339 -300066 -188263 -124189 -196838 -93705 -99350 -63948 17264 64897 159705
22971A59705M0526j79873n7541J29197N8227j60377j68103J7885M4209J37834
$$ 159705 200231 20358 -37183 92014 150241 -10136 -178239 -160354 -116145 21689
22961B1689j09526j69186r6414J38677M7487j12395n910R9530l2135j0310Q2314
$$ 21689 -87837 -257023 -353437 -214760 -167273 -279668 -285578 -186048 -218183 -228493 -146179
22950a46179j45107j4819K16883Q1627j15820r1810j31683J46554J68327r7295
$$ -146179 -291286 -306105 -89222 -7595 -123415 -215225 -346908 -200354 -32027 -129322
22940a29322k6775M6207q1228L4221J66439M1341p1139j65878Q4756N3751K6827
$$ -129322 -156097 -109890 -191118 -156897 9542 50883 -20256 -186134 -101378 -47627 -20800
22929b0800k2516j7536R9512l7040J12053k8305j76066j06197J27636M0742L5050
$$ -20800 -43316 -60852 38660 1620 113673 85368 -90698 -196895 -69259 -28517 6533
22918F533p2355J1752J3523L9505j5305o0220m4314Q68j1545K5675q930o0538
$$ 6533 -65822 -54070 -40547 -1042 -16347 -76567 -120881 -120013 -131558 -105883 -114813 -175351
22906a75351p823O827L6740k4542m9132J5997l7679O8580J12823J08517M7871
$$ -175351 -183174 -176347 -139607 -164149 -213281 -197284 -234963 -166383 -53560 54957 102828
22895A02828J3558K3916O9901q6846j53424m3879j4758l1268j3206p8826L6029
$$ 102828 116386 140302 210203 123357 -30067 -73946 -88704 -119972 -133178 -212004 -175975
22884a75975L4817R75l7640k2126O0896M6281Q934J38890O7675l8839j57191j6402
$$ -175975 -141158 -140183 -177823 -199949 -139053 -92772 -83838 55052 122727 83888 -73303 -89705
22872h9705J00522K827j018o5702N796N1125m2694o5914n8729O9475Q212l2417
$$ -89705 10817 13644 12626 -53076 -47280 3845 -38849 -104763 -163492 -94017 -85805 -118222
22860a18222m3455N1164J75103M6184j09671q8010N7629O2092J8453j32422K30
$$ -118222 -161677 -110513 64590 110774 1103 -86907 -29278 32814 51267 -81155 -80925
22849h0925n868M9224j28299j12789L006J05758R5653R1509K0307j07132K3492
$$ -80925 -86793 -37569 -165868 -278657 -275651 -169893 -74240 17269 37576 -69556 -46064
22838d6064o9173J23284j33674m9810L5007n4826r2620j12322n4805R2016J06011
$$ -46064 -115237 8047 -125627 -175437 -140430 -195256 -287876 -400198 -455003 -362987 -256976
22827b56976P6917N5912J28783r2734k7416O2721K9494Q2194L1515o3040p2775
$$ -256976 -180059 -124147 4636 -88098 -115514 -52793 -23299 58895 90410 27370 -45405
22816d5405j45684O41J58624K3594p7123J9327L0372k7952M004o0519K6122L3667
$$ -45405 -191089 -190448 -31824 -8230 -85353 -66026 -35654 -63606 -59602 -120121 -93999 -60332
22804f0332l5655m707j33476q1751J6404L6365l1757L7124K39779K1707m4117
$$ -60332 -95987 -100694 -234170 -315921 -299517 -263152 -294909 -257785 -18006 3701 -40416
22793d0416J04063J24812R241j15724q8596j09839m7256J09341J52471j6715j46248
$$ -40416 63647 188459 197700 81976 -6620 -116459 -163715 -54374 98097 81382 -64866
22782f4866J330l5695N0368o4126r2862K7050o9168Q3544Q2923J45891J05959
$$ -64866 -63536 -99231 -48863 -112989 -205851 -178801 -247969 -164425 -81502 64389 170348
22771A70348j12028p9430l3767m4374J7R9666r0916p408O9246j005K1909m6591
$$ 170348 58320 -21110 -54877 -99251 -99234 432 -90484 -97892 -28646 -29651 -7742 -54333
22759e4333R9611r391M2386k67p0718K6485k4149j10735j09844k0270Q0300J20219
$$ -54333 45278 35887 78273 78006 7288 33773 9624 -101111 -210955 -231225 -150925 -30706
22747c0706J08761O863n2194K9491j12839m3905J24179R1915j56098j11804m685
$$ -30706 78055 84918 32724 62215 -50624 -94529 29650 121565 -34533 -146337 -151022
22736a51022R0736K613j452l8575P7511K2721j4447j11832P100Q5181Q7295k8638
$$ -151022 -60286 -57673 -59125 -97700 -20189 2532 -11915 -123747 -116647 -31466 55829 27191
22724B7191r8114j9427k662N6556L5811o8437l2514N3101J47347J14972M2992
$$ 27191 -70923 -90350 -93012 -36456 -645 -69082 -101596 -48495 98852 213824 256816
22713B56816o0672j73927l8123l0469l6307J0495J71529K11739k02945k28963
$$ 256816 196144 22217 -15906 -46375 -82682 -72187 99342 311081 108136 -120827
22703a20827J0226J44441J3516J47957J25170j90557j17459O619j4720p1972q4175
$$ -120827 -110601 33840 47356 195313 320483 129926 12467 19086 4366 -67606 -151781
22692a51781m1251J14004J72566j11083p5564K0099J16610l4067q995L8662m5534
$$ -151781 -193032 -79028 93538 -17545 -93109 -73010 43600 9533 538 39200 -6334
22681f334P8489R0820o4043m6440k4255j7816J3316j25931R4589P8390K9134o9864
$$ -6334 72155 162975 98932 52492 28237 10421 23737 -102194 -7605 70785 99919 30055
22669C0055n1913M4801R4887J6643O7737m099l9500j15434j87611l1778J94745
$$ 30055 -21858 22943 117830 134473 202210 198111 158611 43177 -144434 -176212 18533
22658A8533J4405r4682r8107N2420J8902l0949Q2572J08954k5292q4316K073Q6315
$$ 18533 32938 -61744 -159851 -107431 -88529 -119478 -36906 72048 46756 -37560 -35487 50828
22646E0828R093J44325n3694p0070K1000j31102P2688R9438N3266o0607j25972
$$ 50828 59921 204246 150552 80482 101482 -29620 43068 142506 195772 135165 9193
22635I193m6493O3690m7667m2063N5149j440o848J02038m969r2678M2583k23k4410
$$ 9193 -37300 26390 -21277 -63340 -8191 -9631 -16479 85559 80590 -12088 30495 30272 5862
22622E862n6395Q6051j5825L3724P9104J28252r8680j50884j02834j00035P9316
$$ 5862 -50533 35518 19693 53417 132521 260773 162093 11209 -91625 -191660 -112344
22611a12344M3329k081J76949L423j52430j22025q634J06326J01443M2256p6497
$$ -112344 -69015 -71096 105853 109276 -43154 -165179 -173813 -67487 33956 76212 -285
22600b85o8477n2012j34630J09023p749K4120J61367Q385j05091p991K0455l7709
$$ -285 -68762 -120774 -255404 -146381 -154130 -130010 31357 39742 -65349 -73340 -52885 -90594
22588i0594k2058M2984J78406J4552j11744L9336j00975q7369Q4963Q8106l1491
$$ -90594 -112652 -69668 108738 123290 11546 50882 -50093 -137462 -52499 35607 4116
22577D116J5270p8702l5627P2750J35989P6513j0149m6384j2431O4572q4370j37963
$$ 4116 19386 -59316 -94943 -22193 113796 190309 180160 133776 121345 185917 101547 -36416
22565c6416L7580N0144P5081L1323r9670j66772m7507m714J29717J71039k6435
$$ -36416 1164 51308 126389 157712 58042 -108730 -156237 -160951 -31234 139805 113370
22554A13370M5518k4505m2850O2572Q5837n8645j98941q8422q171J958R067R7386
$$ 113370 158888 134383 91533 154105 239942 181297 -17644 -106066 -114237 -112279 -103212 -5826
22542e826l9592j84269j5943P6549M2309R8808K27875K5964j21248P948l526r1310
$$ -5826 -45418 -229687 -245630 -169081 -126772 -27964 199911 225875 104627 112575 109049 17739
22530A7739j5875J32632N5428k4785p3778N5500r2743j18396P934J2549q2063
$$ 17739 1864 134496 189924 165139 91361 146861 54118 -64278 -56344 -43795 -125858
22519a25858J982P2061J13962j8792q7228p057o2111J5430P8997L2413k7875l7262
$$ -125858 -123876 -51815 62147 43355 -43873 -50930 -113041 -97611 -18614 13799 -14076 -51338
22507e1338k8190R4139J39008j3062o6731q0112l7563J06670J70636K2496r8647
$$ -51338 -79528 14611 153619 140557 73826 -6286 -43849 62821 233457 255953 157306
22496A57306j81426r48J04724p7642o5311n8866R1842Q6189r4800M2752M7466
$$ 157306 -24120 -25068 79656 2014 -63297 -122163 -30321 55868 -38932 3820 51286
22485E1286M0533P9709q5583o6326j28674j2377P1009Q9920L0533n6087j33056
$$ 51286 91819 171528 85945 19619 -109055 -121432 -50423 39497 70030 13943 -119113
22474a19113P8674N6679L4871n9579O104l0073q487o3848J063R8550k0930J18546
$$ -119113 -40439 16240 51111 -8468 -2364 -32437 -40924 -104772 -103709 -5159 -26089 92457
22462I2457O5661o9831k3472j82560q7735J39235m024N5097K1187j03J0184M8614
$$ 92457 158118 88287 64815 -117745 -205480 -66245 -70269 -15172 6015 5912 16096 64710
22450F4710N8444l38l7383M8336p4531o1026l7431j08119n108O4535J16276J0637
$$ 64710 123154 122816 85433 133769 59238 -1788 -39219 -147338 -152446 -87911 28365 39002
22438C9002j953n2874j0540m4817p9828j1087m2808R9105J76081J00241J07436
$$ 39002 37049 -15825 -26365 -71182 -151010 -162097 -204905 -105800 70281 170522 277958
22427B77958q4602m0364M3036j35585q1335P4944j13157j51069J12372J54804
$$ 277958 193356 152992 196028 60443 -20892 54052 -59105 -210174 -97802 57002
22417E7002m014J32666J36026p3725k28362j10158J51489J18342l1319j0427P4269
$$ 57002 52988 185654 321680 247955 19593 -90565 60924 179266 147947 137520 211789
22406B11789l6947j3962j01086j92143j44719O2340J43002k9581L3284Q979j88584
$$ 211789 174842 160880 59794 -132349 -277068 -214728 -71726 -101307 -68023 -59044 -247628
22395b47628O4131J81707J05447r2306n283N3669l3937k4465K951N4273j1304
$$ -247628 -183497 -1790 103657 11351 6068 59737 25800 1335 4286 58559 47255
22384D7255m645j34147L964P0436p3743L651R8094K4942L2104K1037j22547j11250
$$ 47255 42610 -91537 -87573 -17137 -90880 -87229 10865 35807 67911 88948 -33599 -144849
22372a44849l3127p1780R2491P5550Q4197J3909j01014o9933P1416N6658J30733
$$ -144849 -177976 -249756 -157265 -81715 2482 16391 -84623 -154556 -83140 -26482 104251
22361A04251Q6254m3625j3412j00753Q7118m6785k3553P6382k1973m2052j13729
$$ 104251 190505 146880 133468 32715 119833 73048 49495 125877 103904 61852 -51877
22350e1877q3756J5168J69697r1629M0561R271J5772L0102j24441l2039P6179
$$ -51877 -135633 -120465 49232 -42397 -1836 7435 23207 53309 -71132 -103171 -26992
22339b6992O5055l8744M8638N7343J6473j7458n2097O9217j16105k44964M9673
$$ -26992 38063 -681 47957 105300 121773 104315 52218 121435 5330 -239634 -189961
22328a89961J23696K23043J23736o8019K3776l1628m5943l3885j06716O7533J55548
$$ -189961 -66265 156778 280514 212495 236271 204643 158700 124815 18099 85632 241180
22317B41180m9423k35771K6972k4606K9970N3532j52766j24605N5267J40657n802
$$ 241180 191757 -44014 -17042 -41648 -11678 41854 -110912 -235517 -180250 -39593 -45395
22306d5395j03217l1793J69456O0587o521q0387N7168p354l8290J49451Q5782
$$ -45395 -148612 -180405 -10949 49638 43117 -37270 19898 12544 -25746 123705 209487
22295B09487k6948L6798o4792j24585o6353j84788R430J34559p3380N9220M1015
$$ 209487 182539 219337 154545 29960 -36393 -221181 -211751 -77192 -150572 -91352 -50337
22284e0337r7557L8244N3334m5881J6243J01461M7987J335Q9201J24545l2229
$$ -50337 -147894 -109650 -56316 -102197 -85954 15507 63494 64829 154030 278575 246346
22273B46346j44574k9576K678N1594J16964m6194r9230j56894j02160L8408J55787
$$ 246346 101772 72196 74874 126468 243432 197238 98008 -58886 -161046 -122638 33149
22262C3149j700o8044m093N085k8862J84440J4532K6912j20334k25297o5784K04082
$$ 33149 31449 -36595 -40688 -35603 -64465 119975 134507 161419 41085 -184212 -249996 -45914
22250d5914J82884m091j35959j14595P5075M354l8683n8796K3281R476K6773j1306
$$ -45914 136970 132879 -3080 -117675 -42600 -38246 -76929 -135725 -112444 -102968 -76195 -87501
22238h7501N18K2060Q4029J17684j56530j26246m3701j0296M0345M4544K25849
$$ -87501 -86983 -64923 19106 136790 -19740 -145986 -189687 -199983 -159638 -115094 110755
22227A10755N0572n1420J3475j98685M7143N6474q081k6189j4665N5853P9541
$$ 110755 161327 109907 123382 -75303 -28160 28314 20233 -5956 -20621 35232 114773
22216A14773O2235j8286J02761p4490k4920M033n6371q3268n4549J17165K8094
$$ 114773 177008 158722 261483 186993 162073 166106 109735 26467 -28082 89083 117177
22205A17177n1272N4237J34777j07705l3618j47649O578o9984m5145P5721O5288
$$ 117177 65905 120142 254919 147214 113596 -34053 -27475 -97459 -142604 -66883 -1595
22194a595p1863o0920J3532J27293m3558j12379J01768J691l5078N8285J83322
$$ -1595 -73458 -134378 -120846 6447 -37111 -149490 -47722 -46031 -81109 -22824 160498
22183A60498q9808r6641P0762K6212j4173L9319R3104Q9236J562j38671n6462
$$ 160498 70690 -25951 44811 71023 56850 96169 189273 278509 280071 141400 84938
22172H4938j7202r516m8446N8914n7393m7992J68032J39664j02687j76056q1852
$$ 84938 67736 58220 9774 68688 11295 -36697 131335 270999 168312 -7744 -89596
22161h9596M6580K5170n9225k5870K677J24960J3687j38932k9631N3041K9029
$$ -89596 -43016 -17846 -77071 -102941 -100264 24696 38383 -100549 -130180 -77139 -48110
22150d8110O1752J04186J6781J7764j04127J07808k6663n3235o3187R0261J29567
$$ -48110 13642 117828 134609 152373 48246 156054 129391 76156 12969 103230 232797
22139B32797j5897j60356Q7872M620M2221J52346K07762R7202K22737J80115P1751
$$ 232797 216900 56544 144416 149036 191257 343603 551365 648567 871304 1051419 1123170
22128A123170J82740K41678J11263J05610j22955j13234L8732Q6360j13431j13113
$$ 1123170 1305910 1547588 1658851 1764461 1641506 1528272 1567004 1653364 1539933 1426820
22118A426820J60251R4378J95959P4751k68542k27500p7134P71j8436k23499j95115
$$ 1426820 1587071 1681449 1877408 1952159 1683617 1456117 1378983 1379754 1361318 1137819 942704
22107I42704j41485j98111k62286j18196K5292k998p8990j3514K299R9673J10374
$$ 942704 801219 603108 340822 222626 247918 244920 165930 152416 154715 254388 364762
22096C64762K3270j44394r1268k2382j5067L5101p5276l9883J19414r2265K7202
$$ 364762 388032 243638 152370 129988 114921 150022 74746 34863 154277 62012 89214
22085H9214J82592J02352M3859k6504l4964p1718k13195J5872k6808R9467J18213
$$ 89214 271806 374158 418017 391513 356549 284831 71636 87508 60700 160167 278380
22074B78380l6599l5604L5849N8477n2216r4581j48734p4783J25678R6319R5229
$$ 278380 241781 206177 242026 300503 248287 153706 4972 -69811 55867 152186 247415
22063B47415j63089r0024P743j490N5455O1937q590n2668l1609N1457O4993j1319
$$ 247415 84326 -5698 2045 555 56010 117947 109357 56689 25080 76537 141530 130211
22051A30211n5082q8965L6499m1247J3007K38302P6540p9783o1006n1699q7788
$$ 130211 75129 -13836 22663 -18584 -5577 232725 309265 229482 168476 116777 28989
22040B8989J187M6105j17093N6024J12869L8488o7596p9551n8800J15704l7353
$$ 28989 30176 76281 -40812 15212 128081 166569 98973 19422 -39378 76326 38973
22029C8973l4718J05954j0702L2946j03756Q776Q3157n6187M8170J52814J59491
$$ 38973 4255 110209 99507 132453 28697 37473 120630 64443 112613 265427 424918
22018D24918p7635j11355k0991n2470P9250O5602j36707q9433k0485q385j1617
$$ 424918 347283 235928 214937 162467 241717 307319 170612 81179 60694 52309 40692
22007D0692Q7201J36392n4881r8838q413M8277j50905k0292M7564o2146L0493
$$ 40692 127893 264285 209404 110566 102153 150430 -475 -20767 26797 -35349 -4856
21996d856p9482K6896O0758r2348J2593K08456J28857K530r6510k2145k8035l2936
$$ -4856 -84338 -57442 3316 -89032 -76439 132017 260874 263404 166894 144749 116714 83778
21984H3778J13590p2943j16929N4135o5926M5698M5725M6718N5905N2738l1510
$$ 83778 197368 124425 7496 61631 -4295 41403 87128 133846 189751 242489 210979
21973B10979r7387L9460J45021o5476l5614o4015q1075J06323N2155j05135j52975
$$ 210979 113592 153052 298073 232597 196983 132968 51893 158216 210371 105236 -47739
21962d7739n6341R518J57007J45576q1207k0214K3096P15O7198L8574j67724j69261
$$ -47739 -104080 -94562 62445 208021 126814 106600 129696 130411 197609 236183 68459 -100802
21950a00802Q3805j2427J14148o9368j5637J61542J18525J32480n424j17537o048
$$ -100802 -16997 -29424 84724 15356 -281 161261 279786 412266 406842 289305 283257
21939B83257j03603j58115J7752m2378k8412R3754J01113r9943j87964j1373J50675
$$ 283257 179654 21539 39291 -3087 -31499 62255 163368 63425 -124539 -135912 14763
21928A4763Q3635Q3697M7464n3806j7303j0006n2618n887J10727L1059r8848l586
$$ 14763 98398 182095 229559 175753 158450 148444 95826 89939 200666 231725 132877 129291
21916A29291q7012q9733J8132J23856J22289P8314o917J2313k06136l9722O9822
$$ 129291 42279 -47454 -29322 94534 216823 295137 288220 300533 94397 54675 124497
21905A24497O3870m5657p2465K8058P11l5200M4252Q2133J73723o114n5160m6439
$$ 124497 188367 142710 70245 98303 99014 63814 108066 190199 363922 357808 302648 256209
21893B56209Q027l3140J8745o358P756j73088n4328K9805J349M4828R5548p015
$$ 256209 264236 231096 249841 243483 251239 78151 23823 53628 54977 99805 195353 188338
21881A88338M918k0502J42343n2092M054r4949k4518K20532m8567j45312j38661
$$ 188338 193256 172754 315097 263005 267059 172110 147592 368124 319557 174245 35584
21870C5584n0463N7129N5142M7710o7908q4562J31456L0390j06252r6044J00348
$$ 35584 -14879 42250 97392 145102 77194 -7368 124088 154478 48226 -47818 52530
21859E2530J25358m5668q9622P4144J34980m5325m7506l3344R9302o489k17136
$$ 52530 177888 132220 42598 116742 251722 206397 158891 125547 224849 218360 1224
21848A224j52439j3963O4157J11020P1935p3124J26771J34276j17872p3600j6173
$$ 1224 -151215 -165178 -101021 9999 81934 8810 135581 269857 151985 78385 62212
21837F2212N6222J47439k4963j10107j33960O4537K05042J93917K9517j29129
$$ 62212 118434 265873 240910 130803 -3157 61380 266422 460339 489856 360727
21827C60727o4666N635j56377k520O6584j942r203L0548J5671K8339J98671P252
$$ 360727 296061 301696 145319 142799 209383 207441 198238 228786 244457 272796 471467 478719
21815D78719j30050r1866J57944O1200n4877M8496j50601j08443j13536o7304
$$ 478719 348669 256803 414747 475947 421070 469566 318965 210522 96986 29682
21805B9682N0780L5424L4494k8028j13517q0962J7293n3886K4039J13624m1516
$$ 29682 80462 115886 150380 122352 8835 -72127 -54834 -108720 -84681 28943 -12573
21794a2573m0418M3560J05151k6178J11507J6141j2615p6248L6986p1809J2756
$$ -12573 -52991 -9431 95720 69542 181049 197190 184575 108327 145313 73504 86260
21783H6260J1221M6748p693l328K6981R513o7277R2177P1936l6050R243j72116
$$ 86260 97481 144229 136536 133208 160189 169702 102425 194602 266538 230488 239731 67615
21771F7615j63496Q3784m8860q3401N9849O924m8047N9340J78747m8982j80918
$$ 67615 -95881 -12097 -60957 -144358 -84509 -77585 -125632 -66292 112455 63473 -117445
21760a17445J50253J38154k052o3394O3833Q7449o7816o0307Q7383K6696j68252
$$ -117445 32808 170962 168910 105516 169349 256798 188982 128675 216058 242754 74502
21749G4502n198J60174O7099J26038P2377o1400j71806j78070J350J15704N4869
$$ 74502 69304 229478 296577 422615 494992 433592 261786 83716 85066 200770 255639
21738B55639J17922P887R2323q0352r9470R7971J07852j15808p7408p4992Q4385
$$ 255639 373561 381448 473771 393419 293949 391920 499772 383964 306556 231564 315949
21727C15949L9450l6902M4326J429L2717M7060q180N2689l4219O8288R3647N059
$$ 315949 355399 318497 362823 364252 396969 444029 435849 488538 454319 522607 616254 621313
21715F21313r9551k1532J78808J23086R0528J49633L380l0094k8269k9859J04644
$$ 621313 521762 500230 679038 802124 892652 1042285 1045665 1015571 987302 957443 1062087
21704A062087R0934o5345J184k754M632j5419j50297k41784P1498J26561K8249
$$ 1062087 1153021 1087676 1088860 1086106 1090738 1075319 925022 683238 754736 881297 909546
21693I09546J06544J9026n2222P9675m3609p5253o4388m0867N7719L4839n4221
$$ 909546 1016090 1035116 982894 1062569 1018960 943707 879319 838452 896171 931010 876789
21682H76789k8226j161r45m3437L9705J3041j44950j1264J00800N2146N9681K6311
$$ 876789 848563 847402 846457 803020 842725 855766 710816 699552 800352 852498 912179 938490
21670I38490n975J8045R5945J12797O4923N0644r7447j19588K7419J10322J83110
$$ 938490 932515 950560 1046505 1159302 1224225 1274869 1177422 1057834 1085253 1195575 1378685
21659A378685l753p9544q4950J8807J24773O2708l9892Q3652O149j23821r9754
$$ 1378685 1374932 1295388 1210438 1229245 1354018 1416726 1376834 1460486 1466635 1342814 1243060
21648A243060Q8659K31693M7060k6100j5554J27141P5875J68457j04297P2792
$$ 1243060 1331719 1563412 1610472 1584372 1568818 1695959 1771834 1940291 1835994 1908786
21638A908786j2883j00711J36130J47713J41275R4073J98667K2978J06667J35343
$$ 1908786 1895903 1795192 1931322 2079035 2220310 2314383 2513050 2536028 2642695 2778038
21628B778038J24677K17506M8953j2431o6146J59676K50675Q5987N7216J22086
$$ 2778038 2902715 3120221 3169174 3156743 3090597 3250273 3500948 3586935 3644151 3766237
21618C766237K10321J93595L03361K67172M20819P29120O27115N66682P12021
$$ 3766237 3976558 4170153 4473514 4740686 5161505 5890625 6517740 7084422 7796443
21609G796443P61398J047127J280122J033960Q07051R26023J315428J557680J709918
$$ 7796443 8557841 9604968 10885090 11919050 12726101 13652124 14967552 16525232 18235150
21600A8235150K359698L412244M949235P283065J1231688J8033148K5480480K6240015
$$ 18235150 20594848 24007092 28956327 36239392 47471080 65504228 90984708 117224723
21592A17224723K0185506K1115901L4385268M0543659L1944062J7681565r753878
$$ 117224723 137410229 158526130 192911398 233455057 265399119 283080684 273326806
21585B73326806o373547J2906033K0526636o564755k8565240o293494J8223887
$$ 273326806 266953259 279859292 300385928 293821173 265255933 258962439 277186326
21578B77186326K0991090J1333607j4079905l3007843j9366303j0019173j7278319
$$ 277186326 298177416 309511023 295431118 262423275 243056972 233037799 215759480
21571B15759480m6424301m1763211k6127679j6795701j1572180q391362o377754
$$ 215759480 169335179 127571968 101444289 84648588 73076408 64685046 58307292
21564E8307292n257804m430298l766033k799872k000620j632215j680615j665634
$$ 58307292 53049488 48619190 44853157 42053285 40052665 38420450 36739835 35074201
21556C5074201j644557j644223j466037j586840j694801j679292j418961j185883
$$ 35074201 33429644 31785421 30319384 28732544 27037743 25358451 23939490 22753607
21548B2753607j067674q76520q57114o56051o41431o58630o08065o51011o63437
$$ 22753607 21685933 20809413 19952299 19296248 18654817 17996187 17388122 16737111 16073674
21539A6073674n78362n24129o13207m95479n21117l61497l89495l81193l60197
$$ 16073674 15495312 14971183 14357976 13862497 13341380 12979883 12590388 12209195 11848998
21530A1848998l64704k77231k58889l21769m74885l07495l18380m19798j80732
$$ 11848998 11484294 11207063 10948174 10626405 10151520 9844025 9525645 9105847 8925115
21521H925115k97947q9515l20355l61769p7767j64496j72721k66889l89579k91993
$$ 8925115 8627168 8537653 8217298 7855529 7777762 7613266 7440545 7173656 6784077 6492084
21511F492084j10508j45170k63835k25349k58816j26569j06845r9098p0242k03504
$$ 6492084 6381576 6236406 5972571 5747222 5488406 5361837 5254992 5155894 5085652 4882148
21501D882148k32983j60655j49934j05011p2746o5996p1870l8204q4665k50369
$$ 4882148 4649165 4488510 4338576 4233565 4160819 4094823 4022953 3984749 3900084 3649715
21491C649715q5937j77071j47483q4278l2401N1618r4765j9348j06101j97917
$$ 3649715 3563778 3386707 3239224 3154946 3122545 3174163 3079398 3060050 2953949 2756032
21481B756032l5199Q5690j13006l9113j16177Q219p5927J1669j26891m6011R4865
$$ 2756032 2720833 2806523 2693517 2654404 2538227 2546446 2470519 2482188 2355297 2309286 2404151
21470B404151R6006k8221j17685j40497l7929M292l3976o3719j3934n2870O4106
$$ 2404151 2500157 2471936 2354251 2213754 2175825 2180117 2146141 2082422 2068488 2015618 2079724
21459B079724k1121l1069J1623O6301p837O4634J22313J92054K16687J43512J16966
$$ 2079724 2058603 2027534 2039157 2105458 2097621 2162255 2284568 2476622 2693309 2836821 2953787
21448B953787J6110j4399N1999J3970k4377j76453o5247M1241P2097j02068k04742
$$ 2953787 2969897 2955498 3007497 3021467 2997090 2820637 2755390 2796631 2868728 2766660 2561918
21437B561918k17675j0119j46976l99912k63315k38716j33322j90546j19503k3474
$$ 2561918 2344243 2334124 2187148 1787236 1523921 1285205 1151883 961337 841834 818360
21427H18360p8169p2020J38842Q3726M9611j11942j90995K1795l7551k2652K664
$$ 818360 740191 668171 807013 890739 940350 828408 637413 659208 621657 599005 601669
21416F01669o048j28423m3876J34682o7515r0207L3681L7356M5829j2846L6788
$$ 601669 595621 467198 423322 558004 490489 400282 433963 471319 517148 504302 541090
21405E41090m9212r6480K2694o4164O1754n6568Q2580J3436k2767k2487J9637
$$ 541090 491878 395398 418092 353928 415682 359114 441694 455130 432363 409876 429513
21394D29513M769k3329J37420J10732r756r2407J56489P9035j0343k21095r7709
$$ 429513 434282 410953 548373 659105 649349 556942 713431 792466 782123 561028 463319
21383D63319q646J7590n9314q7646n6446o261R2066k0344O9042M9324j56186j35480
$$ 463319 454673 472263 412949 325303 268857 262596 354662 334318 403360 452684 296498 161018
21371A61018o9736R8101L2985M7776k4021l9904Q5181J07653J04928n8420l187
$$ 161018 91282 189383 222368 270144 246123 206219 291400 399053 503981 445561 442374
21360D42374K7300j42101m0926l8902p0877n3778J3790k7443J30606J05198j29506
$$ 442374 469674 327573 286647 247745 176868 123090 136880 109437 240043 345241 215735
21349B15735o6442M958k3834m6881J37743J43996J18921J2160P6329m212R031
$$ 215735 149293 154251 130417 83536 221279 365275 484196 496356 572685 568473 577504
21338E77504q372J950j63722j30596m6766O9470O6517r262n6860n9507Q3554n8058
$$ 577504 569132 571082 407360 276764 229998 299468 365985 356723 299863 240356 323910 265852
21326B65852k6350o202O3780k4198j06627q3948L3120l308L9022L3914j9369j82203
$$ 265852 239502 233300 297080 272882 166255 82307 115427 112119 151141 185055 165686 -16517
21314a6517q7366J1781R4599Q3209n964j49401k5458L504k606j21552N723P9137
$$ -16517 -103883 -92102 2497 85706 79742 -69659 -95117 -91613 -94219 -215771 -210048 -130911
21302a30911k310M9222Q7266q33K1015j93035k7275l8838J04436l1471M3821J12145
$$ -130911 -133221 -83999 3267 2434 23449 -169586 -196861 -235699 -131263 -162734 -118913 -6768
21290f768m920p4592k26402j05608Q5161O9656J83394O8120J7440n0861k9369
$$ -6768 -11688 -86280 -312682 -418290 -333129 -263473 -80079 -11959 5481 -45380 -74749
21279g4749L7610n0856j77934O8451P2078L7218J60904Q0534n9745j31952j11936
$$ -74749 -37139 -87995 -265929 -197478 -125400 -88182 72722 153256 93511 -38441 -150377
21268a50377l8452p7813L3095n0965L4179j6585k6418k1791P439L9899k3684J03653
$$ -150377 -188829 -266642 -233547 -284512 -250333 -266918 -293336 -315127 -307688 -267789 -291473 -187820
21256a87820J95084K9238n5290j59724j17753J845P293L7027J27862J10846R845
$$ -187820 7264 36502 -18788 -178512 -296265 -294420 -287127 -250100 -122238 -11392 -1547
21245a547q2195j32809j5443k3805L2566K07001R1667j52719j30389J10737J13920
$$ -1547 -83742 -216551 -231994 -255799 -223233 -16232 75435 -77284 -207673 -96936 16984
21234A6984j38809m4893Q144n0857k0333j7110k4763m2462J64420J37608J6844
$$ 16984 -121825 -166718 -158574 -209431 -229764 -246874 -271637 -314099 -149679 -12071 4773
21223D773j693q187P1277M5478o0407l613n8609k3457j06398j13348m5724N3403
$$ 4773 3080 -5107 66170 111648 51241 47628 -10981 -34438 -140836 -254184 -299908 -246505
21211b46505J15107J1655M1160k02934L0651M6082J5925J78137m2981j92467l6531
$$ -246505 -131398 -119743 -78583 -281517 -250866 -204784 -188859 -10722 -53703 -246170 -282701
21200b82701p5419L1227P6009J55137P237j83005N1847J15268O4436l6043j36124
$$ -282701 -358120 -326893 -250884 -95747 -88510 -271515 -219668 -104400 -39964 -76007 -212131
21189b12131j07125P8673J73916r437L665j22903n5505J35928O0388p4499j81970
$$ -212131 -319256 -240583 -66667 -76104 -72439 -195342 -250847 -114919 -54531 -129030 -311000
21178c11000M3184K00184R7871l6589O2673l9337o8868O1043K8328p6117j22805
$$ -311000 -267816 -67632 30239 -6350 56323 16986 -51882 9161 37489 -38628 -161433
21167a61433j34258R490R081R6236M3312M2809J3985l0548L8298l1541n3389j6813
$$ -161433 -295691 -286201 -277120 -180884 -137572 -94763 -80778 -111326 -73028 -104569 -157958 -174771
21155a74771J8885J4484j14276k3513R1813o98L3504R3631r929k5869k5827R0105
$$ -174771 -155886 -141402 -255678 -279191 -187378 -188076 -154572 -60941 -70870 -96739 -122566 -32461
21143c2461J08107N780l3801n7361m3911r816q1286q9294q0068r9987M967Q9343
$$ -32461 75646 81426 47625 -9736 -53647 -63463 -144749 -234043 -314111 -414098 -409131 -319788
21131c19788M0979p752J25524J43570Q756j20933j08049Q0356o6981P811R2452
$$ -319788 -278809 -286561 -161037 -17467 -8711 -129644 -237693 -157337 -224318 -216507 -124055
21120a24055Q4144l4885K7726k1241j08796m7612k5970J8206J75519M1515j7347
$$ -124055 -39911 -74796 -47070 -68311 -177107 -224719 -250689 -232483 -56964 -15449 -32796
21109c2796l2186p1503j09358P5628J63598J48379K2119l4043j25291j84540j5792
$$ -32796 -64982 -136485 -245843 -170215 -6617 141762 163881 129838 4547 -179993 -195785
21098a95785n1134J87938J62058K426q7701j38521l0364N283j08236k3147J03664
$$ -195785 -246919 -58981 103077 105503 17802 -120719 -151083 -145800 -254036 -277183 -173519
21087a73519J36897P8391J2713K9143m2700p7722L7002R9565Q1333j26673j3183
$$ -173519 -36622 41769 54482 83625 40925 -36797 205 99770 181103 54430 41247
21076D1247l8081j07384r1614j4572n4499n2202J3187L9887L1501j15107m0606
$$ 41247 3166 -104218 -195832 -210404 -264903 -317105 -303918 -264031 -232530 -347637 -388243
21065c88243P937P5809K35146Q1002o9855k7212r1082J9947j1762J27550Q7706
$$ -388243 -380306 -304497 -69351 11651 -58204 -85416 -176498 -156551 -168313 -40763 46943
21054D6943l6164J44594J73744L4759J26757O9563J6698J93773K97743L11150
$$ 46943 10779 155373 329117 363876 490633 560196 576894 770667 1068410 1379560
21044A379560K18073m6352r6799J24156J58344K5605k52499r1097K32957K31525
$$ 1379560 1597633 1551281 1454482 1578638 1736982 1762587 1510088 1418991 1651948 1883473
21034A883473k2066j60189j66292j84345j06464j83320l69649k30851k5079n7401
$$ 1883473 1861407 1701218 1534926 1350581 1244117 1060797 691148 460297 435218 377817
21024C77817j75736K1932O2870l8829q8685o5582p0516P067J20529K324j59203
$$ 377817 202081 224013 286883 248054 159369 93787 23271 30338 150867 153191 -6012
21013f012j61423N6970M6236n37K888m0326N8239J01929k8414j22214J2190p9804
$$ -6012 -167435 -110465 -64229 -64766 -61878 -102204 -43965 57964 29550 -92664 -80474 -160278
21001a60278o1586J38248J52752L3178J681r6017p3151J50323Q8947n7003o1172
$$ -160278 -221864 -83616 69136 102314 103995 7978 -65173 85150 174097 117094 55922
20990E5922k7686O200Q2695Q1618p534m7877j96666k13052M7224L7200j4064J28381
$$ 55922 28236 34436 117131 198749 191215 143338 -53328 -266380 -219156 -181956 -196020 -67639
20978f7639K43113N190j84642j16582L5417Q466j14147J1901J66474j1113j08152
$$ -67639 175474 180664 -3978 -120560 -85143 -76677 -190824 -178923 -12449 -23562 -131714
20967a31714j36997n0262j6319Q430K5667J51218J13280Q0048N4301O506k14677
$$ -131714 -268711 -318973 -335292 -326862 -301195 -149977 -36697 43351 97652 104158 -110519
20956a10519o9241J30101P7994k2197n7326m4369K806p2003K7940j5273L068r251
$$ -110519 -179760 -49659 28335 6138 -51188 -95557 -92751 -164754 -136814 -152087 -149019 -158270
20944a58270O8061J83542m9309j39781R379J68154L1274k1725r7443Q0658o715
$$ -158270 -90209 93333 44024 -95757 -86378 81776 113050 91325 -6118 74540 67825
20933F7825j62961Q3P8622o325q6823m8964Q0641J92465P3271r2656j34255n0728
$$ 67825 -95136 -95053 -16431 -22756 -109579 -158543 -77902 114563 187834 95178 -39077 -89805
20921h9805l5918J06446r2261r0805M6544l4834l3896l8321P3517Q4783k5734
$$ -89805 -125723 -19277 -111538 -202343 -155799 -190633 -224529 -262850 -189333 -104550 -130284
20910a30284j03796M9634J0273L751J04982j21584q1091P8679J85332M6398j09582
$$ -130284 -234080 -184446 -174173 -170422 -65440 -187024 -268115 -189436 -4104 42294 -67288
20899f7288j62404l644P6448J47606J52658M2908j39264K4294p2934p0387r9212
$$ -67288 -229692 -233336 -156888 -9282 143376 186284 47020 71314 -1620 -72007 -171219
20888a71219R1456l6537O4923J49530N5198L964l1295m912j19363n3134J3134
$$ -171219 -79763 -116300 -51377 98153 153351 157315 126020 121108 1745 -51389 -38255
20877c8255o5347o9220J6943J8821o1364J48093L0700o8093j21631j31949N4397
$$ -38255 -103602 -172822 -155879 -137058 -198422 -50329 -19629 -87722 -209353 -341302 -286905
20866b86905J03199q57p8194O2975P8944p2102q361O5317M9334O2508L572o881
$$ -286905 -183706 -184563 -262757 -199782 -120838 -192940 -201301 -135984 -86650 -24142 -20570 -27451
20854b7451j73238K487J9021N6326R2302N5737m20j11686j01142L8921M9822l3024
$$ -27451 -200689 -198202 -179181 -122855 -30553 25184 24764 -86922 -188064 -149143 -99321 -132345
20842a32345P3666L4010M8p4443O1699J69884m8928K1660J05838k2891j15131
$$ -132345 -58679 -24669 -24621 -99064 -37365 132519 83591 105251 211089 188198 73067
20831G3067J08420J22592m6223j17781j28541m8245k7711J5514J06056n9121m2746
$$ 73067 181487 304079 257856 140075 11534 -36711 -64422 -48908 57148 -1973 -44719
20820d4719J32983K4537j21039P6861P6810l8567J15221J52720q500k1293n2265
$$ -44719 88264 112801 -8238 68623 145433 106866 222087 374807 366307 345014 292749
20809B92749l9686k5846j1852o327J66563J14350k5768p8687M2341M6542K4010
$$ 292749 253063 227217 215365 209038 375601 489951 464183 385496 427837 474379 498389
20798D98389M6637k984j30315R1758R2948l6614k8595j38606j24114k44639n2673
$$ 498389 545026 542042 411727 503485 596433 559819 531224 392618 268504 23865 -28808
20787b8808o1812P7608J1586k6020n230K1904K5072P5413R3809P305j27089k55025
$$ -28808 -90620 -13012 -1426 -27446 -32676 -10772 14300 89713 183522 190827 63738 -191287
20775a91287j29466L5688R7238N4098J24234R0197M4977K2509o9197j12219j22477
$$ -191287 -320753 -285065 -187827 -133729 -9495 80702 125679 148188 78991 -33228 -155705
20764a55705l982R6724J05055M7687k8537n8118r919L6866j1341k7625j4611J45322
$$ -155705 -159687 -62963 42092 89779 61242 3124 -6795 30071 18730 -8895 -23506 121816
20752A21816J0675j23600K736P4917j6124q9277P2941K509r1941L9158L5782j20622
$$ 121816 132491 8891 11627 86544 70420 -18857 54084 56593 -35348 3810 39592 -81030
20740h1030p3072J10486N0130j1855K4420L3516M9599L208j28541j52542j05962
$$ -81030 -154102 -43616 6514 -5341 19079 52595 102194 105402 -23139 -175681 -281643
20729b81643N2973q651n7984l4887J67486N4706L2559m0989J4310N3232P2450
$$ -281643 -228670 -237321 -295305 -330192 -162706 -108000 -75441 -116430 -102120 -48888 23562
20718B3562P0697k09697r5289K8544l253l3930K779J05524Q5557o7083L9437J36959
$$ 23562 94259 -115438 -210727 -182183 -185436 -219366 -216587 -111063 -25506 -92589 -53152 83807
20706H3807O740j58227k03252P2732K17773Q1607O1991k79100j77235l5687Q0300
$$ 83807 90547 -67680 -270932 -198200 19573 101180 163171 -115929 -293164 -328851 -248551
20695b48551Q6097P488M3392M6847J77630n9995j000j8211j52300p98O9097p0111
$$ -248551 -162454 -154966 -111574 -64727 112903 52908 51908 33697 -118603 -119401 -50304 -120415
20683a20415P0302p5131j02863l2875K8846J11493L1321K8363N379j7071R0208
$$ -120415 -50113 -125244 -228107 -260982 -232136 -120643 -89322 -60959 -55580 -72651 17557
20672A7557L2326J0896J1616j04729M8038j330M7499P1070M035M4441n5769j54778
$$ 17557 49883 60779 72395 -32334 15704 14374 61873 132943 136978 181419 125650 -29128
20660b9128j2631q4084m0689k9928O3590m581r5466r621m7963j14796Q3230K08525
$$ -29128 -41759 -125843 -166532 -196460 -132870 -137451 -232917 -242538 -290501 -405297 -322067 -113542
20648a13542J77834k7854r91l3416p8782k4173M6094L6319j1375J6199j309p8524
$$ -113542 64292 36438 35447 2031 -76751 -100924 -54830 -18511 -29886 -13687 -14996 -93520
20636i3520N4026J01431Q9208j27319q7585N2602J5790M1091L7456m8007j50451
$$ -93520 -39494 61937 151145 23826 -63759 -11157 4633 45724 83180 35173 -115278
20625a15278P458O0253R2799j3183r1748o6637l5325M4665Q0986L7852p9386J0097
$$ -115278 -107820 -47567 45232 32049 -59699 -126336 -161661 -116996 -36010 1842 -77544 -67447
20613f7447k7055l8025L3148O6836p238M0172j03740o1472n179p3696m737J4316
$$ -67447 -94502 -132527 -99379 -32543 -39781 391 -103349 -164821 -170000 -243696 -248433 -234117
20601b34117o636J41488Q360j20118p8783K2619R8311p211K4489O1713P3518j56635
$$ -234117 -240753 -99265 -90905 -211023 -289806 -267187 -168876 -176087 -151598 -89885 -16367 -173002
20589a73002J6945P6126N0826O3922r1212j80806J29768j9463Q822M7969k6720
$$ -173002 -156057 -79931 -29105 34817 -56395 -237201 -107433 -126896 -118074 -70105 -96825
20578i6825R698j00555J2208Q7672Q8883j44915N1271J04765n0344j43001l7086
$$ -96825 -87127 -187682 -175474 -87802 1081 -143834 -92563 12202 -38142 -181143 -218229
20567b18229J28227K3192j229k3837q0918l3586j4201l2699R0327K9784J37572
$$ -218229 -90002 -66810 -68039 -91876 -172794 -206380 -220581 -253280 -162953 -133169 4403
20556D403J23232j64611j71410M4671J53362p2955n4944N8975k6778o796n8211
$$ 4403 127635 -36976 -208386 -163715 -10353 -83308 -138252 -79277 -106055 -112851 -171062
20545a71062J15315N9506l6239j51421J6956J9911K1663l2787J1778J67278j7824
$$ -171062 -55747 3759 -32480 -183901 -166945 -147034 -125371 -158158 -146380 20898 3074
20534C074O008r015L5890j04573N4293k1153O1515N373p1530j09355k8570Q811
$$ 3074 9082 67 35957 -68616 -14323 -35476 26039 31412 -40118 -149473 -178043 -169232
20522a69232J34094L612p8973K0935O3064O3383J06353m318L8861p2136q4484
$$ -169232 -35138 -31526 -110499 -89564 -26500 36883 143236 138918 177779 105643 21159
20511B1159J491j13598m4390K2879k0373R5424L8290J07325K7923Q1257p2261
$$ 21159 22650 -90948 -135338 -112459 -132832 -37408 882 108207 136130 217387 145126
20500A45126p4524J6731K162r5204M04O4941o678p6430q6181J02373J53315j81701
$$ 145126 70602 87333 89495 -5709 -5305 59636 52958 -23472 -109653 -7280 146035 -35666
20488c5666M6482N4241k06729r8609J61201J28811r927j67044q5228K26023J03399
$$ -35666 10816 65057 -141672 -240281 -79080 49731 39804 -127240 -212468 13555 116954
20477A16954J4924j16233j9155n287j01184l347K9315J13334j23809Q6198M5905
$$ 116954 131878 15645 -3510 -8797 -109981 -113328 -84013 29321 -94488 -8290 37615
20466C7615j22236l6357Q6565J3411J3913Q9965l2389m6519j6804J9418j84813
$$ 37615 -84621 -120978 -34413 -21002 -7089 82876 50487 3968 -12836 6582 -178231
20455a78231j19641J41865K6235N254q3931N6871M3645J7331J77404N8565Q538
$$ -178231 -297872 -156007 -129772 -124518 -208449 -151578 -107933 -90602 86802 145367 153905
20444A53905K3022j45095q3190m8016j06114Q1229J03586J10550l0609l4946O29
$$ 153905 176927 31832 -51358 -99374 -205488 -124259 -20673 89877 59268 24322 24951
20433B4951K4788p9595N4665K7153m494R6916J20173j16679n2444M7268j133j52408
$$ 24951 49739 -29856 24809 51962 47468 144384 264557 147878 95434 142702 141569 -10839
20421a0839j17075M5547M881N6197N1557J11453o9748r1513p8160k9336J87256
$$ -10839 -127914 -82367 -77486 -21289 30268 141721 71973 -19540 -97700 -127036 60220
20410F0220J20799j5800N9452J17547J68456K10771Q5610J10712j4185j2155K3847
$$ 60220 181019 165219 224671 342218 510674 721445 807055 917767 903582 891427 915274
20399I15274j24989o5987J64389K004k08705r9207J40175O6768j2113q7322r5435
$$ 915274 790285 724298 888687 890691 681986 582779 722954 789722 777609 690287 594852
20388E94852j09931j07962q1287N6594l6805j0779o1600j15614n8713j08017j2999
$$ 594852 484921 376959 295672 352266 315461 304682 243082 127468 68755 -39262 -52261
20377e2261Q0181J51934O5375K8468r1695j9862q5271l2082P0359N5272J29953
$$ -52261 27920 179854 245229 273697 182002 162140 76869 44787 115146 170418 300371
20366C00371R2393K46669L08671K57180J50365K05962K22698K90719L12912k4626
$$ 300371 392764 639433 948104 1205284 1355649 1561611 1784309 2075028 2387940 2363314
20356B363314m0358K92405L74709k8992j96751J38068K44972J29824j39045k99241
$$ 2363314 2322956 2615361 2990070 2961078 2764327 2902395 3147367 3277191 3138146 2838905
20346B838905k38524k06187j74252l51441k99295j97790K1178N645n3997k6905
$$ 2838905 2600381 2394194 2219942 1868501 1569206 1371416 1392594 1398239 1344242 1317337
20336A317337j28266k22286k25567r9896j85327j17849K273J50420M5586j88780
$$ 1317337 1189071 966785 741218 641322 455995 338146 340419 490839 536425 347645
20326C47645j22731L0719N1021j03662j51359M3253M9095P4478R9831K175p7206
$$ 347645 224914 255633 306654 202992 51633 94886 143981 218459 318290 320465 243259
20315B43259o0203r96L1252p7745j68420j2651J12602R0919J23058j836j42817
$$ 243259 183056 182060 213312 135567 -32853 -45504 67098 158017 281075 279239 136422
20304A36422N4573q6892n8359k7001J02422M8248J06246N4848l4554j40086j42824
$$ 136422 190995 104103 45744 18743 121165 169413 275659 330507 295953 155867 13043
20293A3043j41000P0907R3491n1097k372K1632J4925J6835J04359R7000l4185
$$ 13043 -127957 -57050 36441 -14656 -17028 4604 19529 36364 140723 237723 203538
20282B03538j21133j02342J61803K16445k7143m1809r6481k4467N7831M1711m7618
$$ 203538 82405 -19937 141866 358311 331168 289359 192878 168411 226242 267953 220335
20271B20335L2381N9046K8502j2537K2209j36689k59816r1282O6830n7374O7302
$$ 220335 252716 311762 340264 327727 349936 213247 -46569 -137851 -71021 -128395 -61093
20260f1093J63515P9230q2622k28845l1741P0473N1426R8250Q7674P1122l5129
$$ -61093 102422 181652 99030 -129815 -161556 -91083 -39657 58593 146267 217389 182260
20249A82260j00774j49227K960J96175Q5456j08010K2274J20141m4245j20725
$$ 182260 81486 -67741 -64781 131394 216850 108840 131114 251255 207010 86285
20239H6285L55n1708j441o380o5208j32757M8032R9030m189m4843J66217N95l7759
$$ 86285 86640 34932 33491 27111 -38097 -170854 -122822 -23792 -27981 -72824 93393 93988 56229
20226E6229M3700M0773R7587k5969J09959N5866J53893K0942J76419K50025K15776
$$ 56229 99929 140702 238289 212320 322279 378145 532038 552980 729399 979424 1195200
20215A195200J69622j000k07197k35007k5030q9619k50984j73179j08851j08001
$$ 1195200 1364822 1363822 1156625 921618 896588 806969 555985 382806 273955 165954
20205A65954j35397r4033J07661L2090l1219R8167j5846L8685l9772k4442R038
$$ 165954 30557 -63476 44185 76275 45056 143223 127377 166062 126290 101848 110886
20194A10886K9513o2782n568J820O139Q360O6236r0164Q0527Q8204l6873Q9099
$$ 110886 140399 77617 72049 73869 80008 88368 154604 64440 144967 233171 196298 285397
20182B85397M360j53495k34250K3846P0095o8107k2370Q6100J13219j63133Q0902
$$ 285397 289757 136262 -97988 -74142 -4047 -72154 -94524 -8424 104795 -58338 22564
20171B2564R9233R4570L8707J8615J21972J52733K68972K27656J55270L06990
$$ 22564 121797 216367 255074 273689 395661 548394 817366 1045022 1200292 1507282
20161A507282R9004p531j22805r8498j10583k10916k50296q9669j1514k53417
$$ 1507282 1606286 1598755 1475950 1377452 1266869 1055953 805657 715988 704474 451057
20151D51057k41349j9191O5593j45836j19822j8853j5862P6931K1017J10574J7797
$$ 451057 209708 190517 256110 110274 -9548 -28401 -44263 32668 53685 164259 182056
20140A82056l9675n7743j8557j56199n6856J24536K25433J12492J3299O707k8424
$$ 182056 142381 84638 66081 -90118 -146974 -22438 202995 315487 328786 335493 307069
20129C07069K9627K7966j30163j12582N0557K12351m3223j66620j96017r7672
$$ 307069 336696 364662 234499 121917 172474 384825 341602 174982 -21035 -118707
20119a18707J1166P5k2805n578M1799L4153R0683k7376j65087P037L096O6762
$$ -118707 -107541 -107466 -130271 -135849 -94050 -59897 30786 3410 -161677 -154640 -151544 -84782
20107h4782Q071L659J71762K0092L9156j9898J08842m090p2499q4622L1320q4589
$$ -84782 -76711 -73052 98710 118802 157958 138060 246902 242812 170313 85691 117011 32422
20095C2422j14823M327O8990L7877Q1082J85799J00974q3982j03183o8127j10028
$$ 32422 -82401 -78074 -9084 28793 109875 295674 396648 312666 209483 141356 31328
20084C1328o2686M1089Q1365P4556P8922r1564m7939k9323q0887J8448k6210K8969
$$ 31328 -31358 9731 91096 165652 244574 153010 105071 75748 -5139 13309 -12901 16068
20072A6068J3775k8241O6018J01206j47925k6031k7941m8532j5332j3992N0778
$$ 16068 29843 1602 67620 168826 20901 -5130 -33071 -81603 -96935 -110927 -60149
20061f0149l6128N256N2776K0147L9044m1761P4158J78143N1082q4180k6599J8113
$$ -60149 -96277 -91021 -38245 -18098 20946 -20815 53343 231486 282568 198388 171789 189902
20049A89902Q2178K9779n4868j34451n5293O8394m6499J01435p2858J08562J11105
$$ 189902 272080 301859 246991 112540 57247 125641 79142 180577 107719 216281 327386
20038C27386J00232M5117j14177q8345n4526l8991m9638n2232r7591Q5646l7044
$$ 327386 427618 472735 358558 270213 215687 176696 127058 74826 -22765 62881 25837
20027B5837J39066O506Q2653k6033p1784j27216j63699k6162q3968J22980J41734
$$ 25837 164903 171409 254062 228029 156245 29029 -134670 -160832 -244800 -121820 19914
20016A9914R0337Q0842m3736j28447j64568r8664k3514J10624J10545o5853J18282
$$ 19914 110251 191093 147357 18910 -145658 -244322 -267836 -157212 -46667 -112520 5762
20005E762K00911M9725K9708Q7644R3773r1076k171j28591J4082J18274q175J7739
$$ 5762 206673 256398 286106 373750 467523 376447 374276 245685 259767 378041 369866 387605
19993C87605j3867p2758n0325r219p9847Q9444M0520J62391J9168L3656J12135
$$ 387605 373738 300980 250655 241436 161589 251033 291553 453944 473112 506768 618903
19982F18903j46470k54376p0273N3879n0764o8397m0880J9165N3978K5084j13198
$$ 618903 472433 218057 147784 201663 150899 82502 41622 60787 114765 139849 26651
19971B6651m1346k2389j72R1249O7560J6955n4370J6841L2252P4280L4197N997
$$ 26651 -14695 -37084 -37256 53993 121553 138508 84138 100979 133231 207511 241708 247705
19959B47705Q3752Q7809j00518o3081L3422n4809j658K20836j698m9793J009k9966
$$ 247705 331457 419266 318748 255667 289089 234280 232622 453458 451760 401967 402976 373010
19947C73010J03284J59311L0821j4149j13031R0684J99980Q6586j49443j87420
$$ 373010 476294 635605 666426 652277 539246 629930 829910 916496 767053 579633
19937E79633j22139p7268P4056k3258R9067J13815K93012K01409K4888R6552M354
$$ 579633 457494 380226 454282 431024 530091 643906 936918 1138327 1163215 1259767 1264121
19926A264121O8238J02348J31640N8365K53300K08868K40284J08879k5218r2490
$$ 1264121 1332359 1434707 1566347 1624712 1878012 2086880 2327164 2436043 2410825 2318335
19916B318335o598P988K3346K08018R9488M9001j6635O1036J2404J77685O1778
$$ 2318335 2311737 2319725 2343071 2551089 2650577 2699578 2682943 2743979 2756383 2934068 2995846
19905B995846j277J20892K25131J83523K22742J49094K88777L67720L27056K26301
$$ 2995846 2994569 3115461 3340592 3524115 3746857 3895951 4184728 4552448 4879504 5105805
19895E105805O12401Q73070J011309J301069J318642J808507L018464N275414
$$ 5105805 5718206 6591276 7602585 8903654 10222296 12030803 15049267 20324681
19887B0324681Q886021J4317183J7582599J3695899O657193P075608J2921887
$$ 20324681 29210702 43527885 61110484 74806383 81463576 88539184 101461071
19880A01461071J4471479J2775224n01958k2100581j3503295J089699O233876
$$ 101461071 115932550 128707774 128205816 106105235 92601940 93691639 99925515
19873I9925515K393263K21488N738735J0009039Q938773L388512k1160647k9042766
$$ 99925515 102318778 102540266 108279001 118288040 127226813 130615325 109454678 80411912
19865H0411912j9224165j1865878p610673n266843l952561k853440k271163j977073
$$ 80411912 61187747 49321869 41711196 36444353 32491792 29638352 27367189 25390116
19857B5390116j589691j674247j284046j054496q61139n91643l33532r4809p1697
$$ 25390116 23800425 22126178 20842132 19787636 18926497 18334854 18001322 17906513 17834816
19848A7834816r7338k18818q222J0087n2990L8677P9322N43799Q17127J217239
$$ 17834816 17737478 17518660 17510438 17520525 17467535 17506212 17585534 18129333 18946460 20163699
19838B0163699J495794J923797K762834M179164O692489J1140624J8901599K7262594
$$ 20163699 21659493 23583290 26346124 30525288 37217777 48358401 67260000 94522594
19830I4522594K7414075J6819662R385814J6492678K3661823K2196997J4778899
$$ 94522594 121936669 138756331 148142145 164634823 188296646 210493643 225272542
19823B25272542k2013329l3896609r975627P986291Q524806P83172L586911J3906627
$$ 225272542 203259213 169362604 159386977 167373268 175898074 176681246 180268157 194174784
19815A94174784J6078760J2204831j2075451m9631047m2704320k6530077j6664163
$$ 194174784 210253544 222458375 210382924 160751877 118047557 91517480 74853317
19808G4853317j1143137p935132o069270m919016m214487l402874k610542k103852
$$ 74853317 63710180 55775048 49705778 44786762 40572275 37169401 34558859 32455007
19800C2455007j734841j464802j054174q40231p56554j001053j130720j097913
$$ 32455007 30720166 29255364 28201190 27360959 26604405 25603352 24472632 23374719
19792B3374719j083339j007515j053877r74933q15427n96328n07964o06751m39778
$$ 23374719 22291380 21283865 20229988 19255055 18439628 17843300 17335336 16728585 16288807
19783A6288807n05426m56806o53601o08952o85128n76670n01384m56185m27851
$$ 16288807 15783381 15326575 14672974 14064022 13378894 12802224 12300840 11844655 11416804
19774A1416804l15647k89229l69875l09841l54790k94888k57455j38473k60715
$$ 11416804 11101157 10811928 10442053 10132212 9777422 9482534 9225079 9086606 8825891
19765H825891j87171j80082l14539m00636j83764j28030k38568k65165k54328
$$ 8825891 8638720 8458638 8144099 7743463 7559699 7431669 7193101 6927936 6673608
19756F673608j29774q2647j02215j83490j37654j46775j14427l2929l8462n0310
$$ 6673608 6543834 6461187 6358972 6175482 6037828 5891053 5776626 5743697 5705235 5654925
19746E654925N5774r2565r1980l6618r9360j21294r9448j03151j26792l24185
$$ 5654925 5710699 5618134 5526154 5489536 5390176 5268882 5169434 5066283 4939491 4615306
19736D615306l51349j61715k5646N204o1121j46190M2080q8794j40167j00746
$$ 4615306 4263957 4102242 4076596 4081800 4020679 3874489 3916569 3827775 3687608 3586862
19726C586862k2643J01102P9625j53743j16789n7739R779J3943j35093M4907Q966
$$ 3586862 3564219 3665321 3744946 3591203 3474414 3416675 3426454 3440397 3305304 3350211 3359177
19715C359177L9289J16685k6802L8885L0110O4625J50214k05494o2421M5152n735
$$ 3359177 3398466 3515151 3488349 3527234 3557344 3621969 3772183 3566689 3504268 3549420 3543685
19704C543685J69671K67880K79898K77507K27684J71692M13488N31699L77674
$$ 3543685 3713356 3981236 4261134 4538641 4766325 4938017 5351505 5883204 6260878
19695F260878L05781L39608L95719M65694N80935O13908M72344N40092P96530
$$ 6260878 6566659 6906267 7301986 7767680 8348615 8962523 9434867 9974959 10771489
19686A0771489Q75729R65780J403589J835246K596514L403892M721219P123544
$$ 10771489 11647218 12612998 14016587 15851833 18448347 21852239 26573458 33697002
19678C3697002J1150204J8175999K8232325L3598792K8509973K3440518L3566740
$$ 33697002 44847206 63023205 91255530 124854322 153364295 176804813 210371553
19671B10371553M7769904M3957075K6629130n739437k9647933j8113663q367801
$$ 210371553 258141457 302098532 328727662 322988225 293340292 275226629 266858828
19664B66858828j7395079n2336202n1895515l4185942k1802988j4907267j0605336
$$ 266858828 249463749 197127547 145232032 111046090 89243102 74335835 63730499
19657F3730499q056961o085966m695797l672953k805647k355935j898964j642590
$$ 63730499 55673538 49587572 44891775 41218822 38413175 36057240 34158276 32515686
19649C2515686j456656j135245j101490j069312r64228q23178p01489p57119p40003
$$ 32515686 31059030 29923785 28822295 27752983 26788755 25965577 25264088 24506969 23766966
19640B3766966n21809n66749m89470o82614n78890l45323l43773j13119M3157
$$ 23766966 23245157 22678408 22188938 21506324 20927434 20582111 20238338 20125219 20168376
19631B0168376j91537J24938O41757R15135J263791J927638L122557M914436Q102919
$$ 20168376 19976839 20101777 20743534 21658669 22922460 24850098 27972655 32887091 40990010
19622D0990010J3644856J9073663J9441664J4638886J5038262K4515012K9205286
$$ 40990010 54634866 73708529 93150193 107789079 122827341 147342353 176547639
19615A76547639K1738069Q089099j5081644j6473816p786269m875481k1113467
$$ 176547639 198285708 206374807 191293163 174819347 167033078 162157597 141044130
19608A41044130l5189947k5956686j6316194j0792584p600710n573473m315968
$$ 141044130 105854183 79897497 63581303 52788719 45188009 39614536 35298568
19601C5298568l269913k537440j960254j632919j224409j057787j212870q82230
$$ 35298568 32028655 29491215 27530961 25898042 24673633 23615846 22402976 21520746
19593B1520746q49401q68306q36433o69608o84668p66709o04268n76253m11505
$$ 21520746 20671345 19803039 18966606 18296998 17612330 16845621 16241353 15665100 15253595
19584A5253595n66526p85646o39960l94496n10832n89314l79575l08896m33104
$$ 15253595 14687069 13901423 13261463 12866967 12356135 11766821 11387246 11078350 10645246
19575A0645246l68653k79908q0894l06857l58685o0852K288j20034j27949k5396
$$ 10645246 10276593 9996685 9915791 9608934 9250249 9189397 9191685 9071651 8943702 8918306
19565H918306n9199r5411o4477k5168r1277k72956l12336j93742j26319j01495
$$ 8918306 8859107 8763696 8699219 8674051 8582774 8309818 7997482 7803740 7677421 7575926
19555G575926j81663j01146j22539n0138k6538J06775J56143L20005M4051k20958
$$ 7575926 7394263 7293117 7170578 7120440 7093902 7200677 7356820 7676825 7720876 7499918
19545G499918j58641j06983K0542k69215n21799m49465j97179j25043k79255k63463
$$ 7499918 7341277 7234294 7254836 6985621 6463822 6014357 5817178 5692135 5412880 5149417
19535E149417k94129j69652k29250j94600r1837j85392l15811j16494J36512k2847
$$ 5149417 4855288 4685636 4456386 4261786 4169949 3984557 3668746 3552252 3688764 3665917
19525C665917k42747m5873m9175m0043l7972j81824m7802j16786J8651Q5169m6540
$$ 3665917 3423170 3377297 3328122 3288079 3250107 3068283 3020481 2903695 2922346 3007515 2960975
19514B960975j79871j20736j34029q6836j5872j04482p3909p124k7444m8821N251
$$ 2960975 2781104 2660368 2526339 2439503 2423631 2319149 2245240 2238116 2210672 2161851 2167102
19503B167102J89445K99737Q9513J21592J15302K0808J95110K82569J92567J75168
$$ 2167102 2356547 2656284 2745797 2867389 2982691 3003499 3198609 3481178 3673745 3848913
19493C848913j70679j25229j17788k11276k43855k59043j67901k57019k28519
$$ 3848913 3678234 3553005 3435217 3223941 2980086 2721043 2553142 2296123 2067604
19484B067604q7386q8530k2663l5464r8527j83602p1464j08407r1607o2073J301
$$ 2067604 1980218 1891688 1869025 1833561 1735034 1551432 1479968 1371561 1279954 1217881 1219182
19473A219182m8113p5387o6977Q225J88297L8377r1729k5356n075m4429m1699
$$ 1219182 1171069 1095682 1028705 1036930 1225227 1263604 1171875 1146519 1141444 1097015 1055316
19462A055316k9311r907N8017K7193J01837j17870r8811m7847K1640N9785p6943
$$ 1055316 1026005 1016098 1074115 1101308 1203145 1085275 986464 938617 960257 1020042 943099
19451I43099k8155o2984K4656l49n9467o8538p8467Q3951J04397q316M1001K9528
$$ 943099 914944 851960 876616 876267 816800 748262 669795 753746 858143 849827 890828 920356
19439I20356J25378l5875k87874q6145J6223M6987Q9423m0577J7355J41082R7503
$$ 920356 1045734 1009859 721985 635840 652063 699050 788473 747896 765251 906333 1003836
19428A003836J4454l0170n5165j05053n7170r2349N5773M8999j2599m7548P8745
$$ 1003836 1018290 988120 932955 827902 770732 678383 734156 783155 770556 723008 801753
19417H01753p5021m5269m8973M7511P3927Q4880p1912j69276r579L2591l7009
$$ 801753 726732 681463 632490 680001 753928 838808 766896 597620 588041 620632 583623
19406E83623l4394J40462K8203k8147J04742M0296m4469o0293q8504j37977j38398
$$ 583623 549229 689691 717894 689747 794489 834785 790316 730023 641519 503542 365144
19395C65144M6326Q4364P8532P554p0697n3481J4884m7974n1010J22966O4127
$$ 365144 411470 495834 574366 581920 511223 457742 472626 424652 373642 496608 560735
19384E60735l6051M3591M540Q1456J01988k7165j18729K3675o039q6091Q7339
$$ 560735 524684 568275 572815 654271 756259 729094 610365 634040 628001 541910 629249
19373F29249J7628j01533j8792n1091k05681j58614N1555M279N541J29493Q5013
$$ 629249 646877 545344 526552 475461 269780 111166 162721 167000 172541 302034 387047
19362C87047m8371n5662n2173L9258J04495M6105P1700p0856J9476J62369N2367
$$ 387047 338676 283014 230841 270099 374594 420699 492399 421543 441019 603388 655755
19351F55755j8165j0707J20124J01215J30880n080N919R2893N9302P9284K55317
$$ 655755 637590 626883 747007 848222 979102 974022 979941 1072834 1132136 1211420 1466737
19340A466737m0874k44427m1011J57722J04956p0370K3035L2042l5373r96n6247
$$ 1466737 1425863 1181436 1140425 1298147 1403103 1332733 1355768 1387810 1352437 1351441 1295194
19329A295194j26327j97437j34553j14711m5891Q697P0111m1327p1258j50146
$$ 1295194 1168867 971430 836877 722166 676275 684972 755083 713756 642498 492352
19319D92352l4964q8843r1305p4283K40320J34833K06873o8202j11521J0560p9378
$$ 492352 457388 368545 277240 202957 443277 578110 784983 716781 605260 615820 536442
19308E36442j31802r3275J09246L4272j1023k7282n2069l1619J1812P3179K8486
$$ 536442 404640 311365 420611 454883 443860 416578 364509 332890 344702 417881 446367
19297D46367J354m3497m2013Q6712O3529J20106J59993J93447M4031R9586L0684
$$ 446367 447721 404224 362211 448923 512452 632558 792551 985998 1030029 1129615 1160299
19286A160299j30228j26418N4791J07572K5650L3445R6j3489P6053k1412n406
$$ 1160299 1030071 903653 958444 1066016 1091666 1125111 1125207 1111718 1187771 1166359 1160953
19275A160953j8483k28426k59651p7864q3805j18935j45960J0459l605k6767J39481
$$ 1160953 1142470 914044 654393 576529 492724 373789 227829 238288 234683 207916 347397
19264C47397J11003R587l1716j8800P9853K7322q9402j9842j18580P6507j9343
$$ 347397 458400 467987 436271 417471 497324 524646 435244 415402 296822 373329 353986
19253C53986m4527r4749j05234j3420J20346m2522m2219q127N6594o7030N4659
$$ 353986 309459 214710 109476 96056 216402 173880 131661 123534 180128 113098 167757
19242A67757J12063q4695k2886J16422l4050r6442o5643j7194k3778M9167L2169
$$ 167757 279820 195125 172239 288661 254611 158169 92526 75332 51554 100721 132890
19231A32890J21800J8301L2531P7887K8086j7308j97756j3975j04387n0737L4114
$$ 132890 254690 272991 305522 383409 411495 394187 196431 182456 78069 27332 61446
19220F1446K25286J02770j1424p4368n7134m7115q4310K3229J15812k2825K8030
$$ 61446 286732 389502 378078 303710 246576 199461 115151 138380 254192 231367 259397
19209B59397J00980l7567j43085J959L2973J6815m9089J28923R1580J4851L0031
$$ 259397 360377 322810 179725 181684 214657 231472 182383 311306 402886 417737 447768
19198D47768O4623k02876j59400m2847O7417R6491N0138l112k4971P6519J5405
$$ 447768 512391 309515 150115 107268 174685 271176 321314 318202 293231 369750 385155
19187C85155k7324O6047j39865j03770j01691p4405l8345Q9616J39897l9852K02589
$$ 385155 357831 423878 284013 180243 78552 4147 -34198 55418 195315 155463 358052
19176C58052P4665l8446j60918j7234J94042Q7719p4842r3451K3178j09251K1152
$$ 358052 432717 394271 233353 216119 410161 497880 423038 329587 352765 243514 264666
19165B64666M9m8319q2934p2540j5967j14650l750n0107J23862J15243O7220K3524
$$ 264666 264715 216396 133462 60922 44955 -69695 -73445 -123552 310 115553 182773 206297
19153B06297k270p1638k13548n0534R8852J94238K3780m052M4175R8519K3111
$$ 206297 204027 132389 -81159 -131693 -32841 161397 185177 181125 225300 323819 346930
19142C46930K9523L1241P6038Q7770j44574k02166o6363p5625R0253K1505K26899
$$ 346930 376453 407694 483732 571502 426928 224762 158399 82774 173027 194532 421431
19131D21431J26659Q2318R7601K99748K43571J49718J82269p4897q4894k8002
$$ 421431 548090 630408 728009 1027757 1271328 1421046 1603315 1528418 1443524 1415522
19121A415522o6246p3681j32531k62373k62518k44231P7641M6511P4849r2047
$$ 1415522 1349276 1275595 1143064 880691 618173 373942 451583 498094 572943 480896
19111D80896j22474J7571j09281l1735J17948L5678r3483l6975L8749j01422p3216
$$ 480896 358422 375993 266712 234977 352925 388603 295120 258145 296894 195472 122256
19100A22256K3457J4609j02430n7546N1723K6514J2006k4368n824J90072J91951
$$ 122256 145713 160322 57892 346 52069 78583 90589 66221 60397 250469 442420
19089D42420m2958j04936k9476M423k2908L1464M5799p3330L2555P1958k1445
$$ 442420 399462 294526 265050 269473 246565 278029 323828 250498 283053 355011 333566
19078C33566J21977K25371J03322O1807L3106K42834K86115J93470p3739l5721
$$ 333566 455543 680914 784236 846043 879149 1121983 1408098 1601568 1527829 1492108
19068A492108j12813L9181r6135k61740k61379n041j81108j45904j8929j9866
$$ 1492108 1379295 1418476 1322341 1060601 799222 794181 613073 467169 448240 428374
19058D28374j23969l6835j10915J47019J29388K6731p0424j10604q6190J46277
$$ 428374 304405 267570 156655 303674 433062 459793 389369 278765 192575 338852
19048C38852P5728l7246j51978j16770L1294O5885L9744n1095j1747J45474P3008
$$ 338852 414580 377334 225356 108586 139880 205765 245509 194414 182667 328141 401149
19037D01149m6458k6767j02987j24634j66716M3757r903P8570J9546L5416J11905
$$ 401149 354691 327924 224937 100303 -66413 -22656 -32559 46011 65557 100973 212878
19026B12878m0075J7291J4069n882n8318j00467m8032P2260J0978r1847n8694
$$ 212878 172803 190094 204163 198281 139963 39496 -8536 63724 74702 -17145 -75839
19015g5839N9656K14862J89938j4480j43291j0402M3233J27903K0151j75540j87576
$$ -75839 -16183 198679 388617 374137 230846 220444 263677 391580 411731 236191 48615
19004D8615M887R0261Q2183j25393J59264O7237j9197j2487p5303k9703J19724
$$ 48615 53502 143763 225946 100553 259817 327054 307857 295370 220067 190364 310088
18993C10088M9899q0545n4027m5298O135m6949Q4919j6519J23306k8528L4510
$$ 310088 359987 279442 225415 180117 186252 139303 224222 207703 331009 302481 336991
18982C36991K86096K23325K22499J95910q4155M2407J82300k3615m0766j590J7744
$$ 336991 623087 846412 1068911 1264821 1180666 1223073 1405373 1381758 1340992 1339402 1357146
18971A357146j7772l7419J1362O1764J2809Q8037k2755j31048k16550k48538j23175
$$ 1357146 1339374 1301955 1313317 1375081 1387890 1475927 1453172 1322124 1105574 857036 733861
18960G33861j54871j47167q2881Q8129K6741O3875l2138J4007k1911k7594m0500
$$ 733861 578990 431823 348942 437071 463812 527687 495549 509556 487645 460051 419551
18949D19551j17597o756J22602N0122m4691o8486r8333j49275p4557R2274l0975
$$ 419551 301954 295198 417800 467922 423231 354745 256412 107137 32580 124854 93879
18938I3879p9276J37299R7930M5063p6437j98536n3339N8103N588K34541K52406
$$ 93879 14603 151902 249832 294895 218458 19922 -33417 24686 30274 264815 517221
18927E17221K07026K84115m0881l875P3265K07694j2070j74673p1420m6103k05959
$$ 517221 724247 1008362 967481 963606 1036871 1244565 1232495 1057822 986402 940299 734340
18916G34340J3806J72615J36217J17581K2494j65207k69406k60375k73414J01248
$$ 734340 748146 920761 1056978 1174559 1197053 1031846 762440 502065 228651 329899
18906C29899M1250j55974o3893N5044n2268O5887O729p4635j4801j45120o769
$$ 329899 371149 215175 151282 206326 154058 219945 226674 152039 137238 -7882 -14651
18895a4651n6304J42783J27658J8404j59899j05037L8643J86149P3314O4428l7829
$$ -14651 -70955 71828 199486 217890 57991 -47046 -8403 177746 251060 315488 277659
18884B77659k3717m1528l2901O854M1873k1994q1568k4983j32822j73091l9834
$$ 277659 253942 212414 179513 186367 228240 206246 124678 99695 -33127 -206218 -246052
18873b46052K24922P4075Q3180M848K8263r6162o0001J03397Q9856M7644l9845
$$ -246052 -21130 52945 136125 140973 169236 73074 13073 116470 206326 253970 214125
18862B14125p3705j8428q6234m3943Q4679o4978o449M1940j28042k4209l8399
$$ 214125 140420 121992 35758 -8185 76494 11516 5067 47007 -81035 -105244 -143643
18851a43643J56930J07993q976J8242q1101o0506P1757J49551j16250p4053m7197
$$ -143643 13287 121280 112304 130546 49445 -11061 60696 210247 93997 19944 -27253
18840b7253k5288K4715k602J00627n5491N9085J45417N7063l4445l8079k6801
$$ -27253 -52541 -27826 -30428 70199 14708 73793 219210 276273 241828 203749 176948
18829A76948J5357M464n7628M6289m0862n6335j43401M3973j0779J22827J63241
$$ 176948 192305 196769 139141 185430 144568 88233 -55168 -11195 -21974 100853 264094
18818B64094M6969j64763j44676M4687M8039k642r5689J32198O0681j4785l3645
$$ 264094 311063 146300 1624 46311 94350 91708 -3981 128217 188898 174113 140468
18807A40468r5643L2004k8080L1833K0497n4924j08133M9986J67204K068r585
$$ 140468 44825 76829 48749 80582 101079 46155 -61978 -11992 155212 157280 147695
18796A47695J27063J9023j60603p5693k0282O1585r2448m7480J1844l041P7142
$$ 147695 274758 293781 133178 57485 37203 98788 6340 -41140 -29296 -32337 44805
18785D4805J24856J52330k35902p4667N2392J4817K3242M0585m555J25424J01766
$$ 44805 169661 321991 86089 11422 63814 78631 101873 142458 137903 263327 365093
18774C65093j9838K9545J63357J71539J06770l7858k7478L0081J01896M3165k88675
$$ 365093 345255 374800 538157 709696 816466 778608 751130 781211 883107 926272 637597
18763F37597k89670m7930j23027j16003L2183J22888m779k01124R019L3928n1355
$$ 637597 347927 299997 176970 60967 93150 216038 211259 10135 19154 53082 1727
18752A727J30908R7324m0818J7763J6992r2271J4962l273m4478k3594j15960j63005
$$ 1727 132635 229959 189141 206904 223896 131625 146587 143314 98836 75242 -40718 -203723
18740b03723q6658J3631J97898J65736n403j53836O1570m8022m322J62905K17750
$$ -203723 -290381 -276750 -78852 86884 81481 -72355 -10785 -58807 -63129 99776 317526
18729C17526n790j19862j65136k1981o2142o3274P8896J30092J38798l1013j47340
$$ 317526 311736 191874 26738 4757 -57385 -120659 -41763 88329 227127 196114 48774
18718D8774o2604L5164O9995j36951l9561m9887L6219L1558K3359P7055j1439
$$ 48774 -13830 21334 91329 -45622 -85183 -135070 -98851 -67293 -43934 33121 21682
18707B1682J1181j29640j01316K923J96686J92391l5487n0128r1705m012L6600
$$ 21682 32863 -96777 -198093 -195170 1516 193907 158420 108292 16587 12575 49175
18696D9175Q2070J0113k2109o7650R3658O6319j284p6372m218l0555J02273j4567
$$ 49175 131245 141358 119249 51599 145257 211576 210292 133920 129702 99147 201420 186853
18684A86853p0121K9848k9849R3862o0295m4014J9264J6762j4022M8680L0758
$$ 186853 116732 146580 116731 210593 150298 106284 125548 142310 128288 176968 207726
18673B07726m548J23025J07402K3599l2956P1477o822j54326o5403J18253j6908
$$ 207726 203178 326203 433605 457204 424248 495725 488903 334577 269174 387427 370519
18662C70519n0447p6516j56086n4253m7809L0413J14767N034J01299L9748j10024
$$ 370519 320072 243556 87470 33217 -14592 15821 130588 135622 236921 276669 166645
18651A66645p5399N8945K1340Q3687r4546j76999r0120L8707J36200K40863Q0574
$$ 166645 91246 150191 171531 255218 160672 -16327 -106447 -67740 68460 309323 389897
18640C89897r3186q8982o4909o2419J02440L9078j34747J40081J56600o7330j8649
$$ 389897 296711 207729 142820 80401 182841 221919 87172 227253 383853 316523 297874
18629B97874N7347J276l1983j28072N8302O4540Q2266o4454j07314m6175R331
$$ 297874 355221 356497 324514 196442 254744 319284 401550 337096 229782 183607 192938
18618A92938n030Q772J34926l7635J6029m6070K7519P406o9147p94Q671q7865
$$ 192938 187908 196680 331606 293971 310000 263930 291449 298855 229708 228914 237585 149720
18606A49720k6056Q9046j48395o932P6679j3862P0495j10107j31431j2932K1558
$$ 149720 123664 212710 64315 57383 134062 120200 190695 80588 -50843 -63775 -42217
18595d2217J1025M4731K4226j80302L1496M2739N785N1634M2648r161j14805k5758
$$ -42217 -31192 13539 37765 -142537 -111041 -68302 -62517 -10883 31765 22604 -92201 -117959
18583a17959r7560P6319J18368J02862P1029K1317l5716q4059j6514j9502o2924
$$ -117959 -215519 -139200 -20832 82030 153059 174376 138660 54601 38087 18585 -44339
18572d4339j8166n889J9891o168N7194L3450j09723K846K7281J14965J05862R8709
$$ -44339 -62505 -68394 -48503 -54671 2523 35973 -73750 -70904 -43623 71342 177204 275913
18560B75913m6044j00886p0783r8605k6215M3137J9434J28379J67041k4221j4953
$$ 275913 229869 128983 58200 -40405 -66620 -23483 -4049 124330 291371 267150 252197
18549B52197n9192N911j3438P1055l5740j02162j8316M3647j3270K2414O5213
$$ 252197 193005 198916 185478 256533 220793 118631 100315 143962 130692 153106 218319
18538B18319P7311j25203p5433n6084j91166L0615J09306L2211M5418J4379n1584
$$ 218319 295630 170427 94994 38910 -152256 -121641 -12335 19876 65294 79673 28089
18527B8089P0226K7342O3795J278r7814j01117l9286J6190K7319J49349m7515
$$ 28089 98315 125657 189452 190730 92916 -8201 -47487 -31297 -3978 145371 97856
18516I7856j25328j4372J01958o5884p9027l657M0124J00146O3906j22639q836
$$ 97856 -27472 -41844 60114 -5770 -84797 -88454 -48330 51816 115722 -6917 -15753
18505a5753N55J12391p0685j44717r497N2376R6443Q8550k8707P806J9728n7110
$$ -15753 -15198 97193 26508 -118209 -127706 -75330 21113 109663 80956 88762 108490 51380
18493E1380j65261J17091Q1477l0936m8957j8902R7000L3150J6386j4202Q745
$$ 51380 -113881 3210 84687 53751 4794 -14108 82892 116042 132428 118226 126971
18482A26971K618q4170n6816o9696m4131J0938Q1983j8423j49038P3609J53606
$$ 126971 129589 45419 -11397 -81093 -125224 -114286 -32303 -50726 -199764 -126155 27451
18471B7451L818J6166L3907q3155J06069J9241p9439J02196q8663j84166j2561
$$ 27451 31269 47435 81342 -1813 104256 123497 44058 146254 57591 -126575 -139136
18460a39136J02753N6777Q1374p6949q4320l0116J38557P2011N8090j3460L9535
$$ -139136 -36383 20394 101768 24819 -59501 -89617 48940 120951 179041 165581 205116
18449B05116k7424o7419k6885q9456P8117j2287L4029k0570L468r1101O1092P1423
$$ 205116 177692 110273 83388 -6068 72049 59762 93791 73221 76689 -14412 46680 118103
18437A18103N3618J7759J1761J3338j14332l0856Q4734q351n4339j31825q6106
$$ 118103 171721 189480 201241 214579 100247 69391 154125 145774 91435 -40390 -126496
18426a26496M5411N7787k587J08584N4402m5967l3325J8856J9181L6418n9630
$$ -126496 -81085 -23298 -25885 82699 137101 91134 57809 76665 95846 132264 72634
18415G2634p2045Q8226m3615j07882q6172P4139J11780P6075n5305l8134J9540
$$ 72634 589 88815 45200 -62682 -148854 -74715 37065 113140 57835 19701 39241
18404C9241j6439m9810N1441O3674M0696K4354o7544r7908p5712J04568j0090
$$ 39241 22802 -27008 24433 88107 128803 153157 85613 -12295 -88007 16561 6471
18393F471P2171q0607j25219J29270J17764j5524j61936j8469k3988L9643J6001
$$ 6471 78642 -1965 -127184 2086 119850 104326 -57610 -76079 -100067 -60424 -44423
18382d4423p1388k1933J88959K9824P9263j4839N9660N5139L1323L1742k29502
$$ -44423 -115811 -137744 51215 81039 160302 145463 205123 260262 291585 323327 93825
18371I3825j12117K1900N9401L9526j00750q872p090N1065O0907o2229k3006l0198
$$ 93825 -18292 3608 63009 102535 1785 -7087 -14177 36888 97795 35566 12560 -17638
18359a7638j08100k1720o254N4273l6024P985J30885J15549q5456k41707k1312
$$ -17638 -125738 -147458 -153712 -99439 -135463 -127478 3407 118956 33500 -208207 -229519
18348b29519J35059K13983K9240k4123J2166K8836j04948l9282N1164m1849j00400
$$ -229519 -94460 119523 148763 124640 136806 165642 60694 21412 72576 30727 -69673
18337f9673L0150K02242L0215J6887J01047o220j04484j49763J19591N485j38539
$$ -69673 -39523 162719 192934 209821 310868 304648 200164 50401 169992 175477 36938
18326C6938k3522j5760q1050r0376J74939J12233l9603j220r5360q9824r6673
$$ 36938 13416 -2344 -83394 -173770 1169 113402 73799 72579 -22781 -112605 -209278
18315b09278j6563M4827K1339R5371J4025k810j8023K20580J09298j19057j08093
$$ -209278 -225841 -181014 -159675 -64304 -50279 -53089 -71112 149468 258766 139709 31616
18304C1616q7089k3918O7740R4653n3779K9217j5735n0077r8076K6243K6253N6660
$$ 31616 -55473 -79391 -11651 83002 29223 58440 42705 -7372 -105448 -79205 -52952 3708
18292C708L8255p8681N922L6257J31474o2282n3450j36485p683J02601J51122
$$ 3708 41963 -36718 -30796 5461 136935 74653 21203 -115282 -122965 -20364 130758
18281A30758N0917p8997j96951q0533O7647J22351o5651o6579N1593p530p118
$$ 130758 181675 102678 -94273 -174806 -107159 15192 -50459 -117038 -65445 -72975 -80093
18270h0093J05275l864r0655K4543o958j3692j7874m0140l4354R194n8232k3438
$$ -80093 25182 21318 -69337 -44794 -51752 -65444 -83318 -123458 -157812 -148618 -206850 -230288
18258b30288j4416Q2390J25266m0199m0636P0450K8130m4773j8152K580m304m3128
$$ -230288 -244704 -162314 -37048 -77247 -117883 -47433 -19303 -64076 -82228 -79648 -83952 -127080
18246a27080j063P2823L4942j8839j0685K0704Q5397J97813l03q3789o0831K2318
$$ -127080 -128143 -55320 -20378 -39217 -49902 -29198 56199 254012 253709 169920 109089 131407
18234A31407P5055l8517j9J24035R4599K10j21259r3073j75338l2548M5950m4109
$$ 131407 206462 167945 167926 291961 386560 386770 265511 172438 -2900 -35448 10502 -33607
18222c3607m6071J25700J73351r1590j52012j25212Q1154P1394R2482J5856P1558
$$ -33607 -79678 46022 219373 127783 -24229 -149441 -68287 3107 95589 111445 183003
18211A83003K1387o840j46799n3212n726q6251k6492L9253K00192M6781k3720
$$ 183003 204390 197550 50751 -2461 -8187 -94438 -120930 -81677 118515 165296 141576
18200A41576P593j9427N1536N8452p3219n1036Q7381m6542l8569j3349Q2558p6647
$$ 141576 149169 129742 181278 239730 166511 115475 202856 156314 117745 104396 186954 110307
18188A10307k3758l5348M4390L8615n1611J468n9698j12354P3678J22555K8279
$$ 110307 86549 51201 95591 134206 82595 84063 24365 -87989 -14311 108244 136523
18177A36523j23483j8730j38211m2554J88977P2618j02026k9395L5675R4078j05012
$$ 136523 13040 -5690 -143901 -186455 2522 75140 -26886 -56281 -20606 73472 -31540
18166c1540L9016P0884j06127j61415J0451Q3948o6568j74342l5791J75844K5053
$$ -31540 7476 78360 -27767 -189182 -178731 -94783 -161351 -335693 -371484 -195640 -170587
18155a70587Q6496K5479m3058J68343K2685j10825K857L1576J04387J05684P4703
$$ -170587 -84091 -58612 -101670 66673 89358 -21467 -18610 12966 117353 223037 297740
18144B97740M546o585k3385k1454k8510j1554Q7082l756Q4354J25961J04260k2377
$$ 297740 302286 295701 272316 250862 222352 210798 297880 294124 378478 504439 608699 586322
18132E86322J72285J50677N8202R6717K67607L54583J22023K26706M92901O00834
$$ 586322 758607 909284 967486 1064203 1331810 1686393 1808416 2035122 2528023 3128857
18122C128857P29915P36813R48237J429880K343619L809848O783899J2474417
$$ 3128857 3858772 4595585 5543822 6973702 9317321 13127169 19911068 32385485
18114C2385485J9188908J9223507R866283L678957J0168105J6084608J4396813
$$ 32385485 51574393 70797900 80664183 84343140 94511245 110595853 124992666
18107A24992666J0070217k4421237l6737019k2604663j2954291p719569n171664
$$ 124992666 135062883 110641646 73904627 51299964 38345673 30626104 25454440
18100B5454440l921611l037759k221484j986751j417561r93705q11546o12310
$$ 25454440 21532829 18495070 16273586 14286835 12869274 11875569 11064023 10451713
18092A0451713n70809l71753m16549n02663m90989l48756m44635l67604l02057
$$ 10451713 9880904 9509151 9092602 8589939 8098950 7750194 7305559 6937955 6635898
18083F635898k19366l49983o0473K0345j78250k28792l06980l35948k32347j97174
$$ 6635898 6416532 6066549 6006076 6026421 5848171 5619379 5312399 4976451 4744104 4546930
18073D546930j48914l03117r2592j28800k22236M6553j06816q9110k6066j04343
$$ 4546930 4398016 4094899 4002307 3873507 3651271 3697824 3591008 3501898 3475832 3371489
18063C371489l14191j31102j21244N8465R850k18812r2057l3101M7525j30147
$$ 3371489 3057298 2926196 2804952 2863417 2873267 2654455 2562398 2529297 2576822 2446675
18053B446675o1158P7724J5501j23778o0994l4854j9680n4277M4908j1306j11819
$$ 2446675 2385517 2463241 2478742 2354964 2293970 2259116 2239436 2185159 2230067 2218761 2106942
18042B106942j73904M2842Q0905j82286j55017N960M2819r1636j53681m0036K6841
$$ 2106942 1933038 1975880 2056785 1874499 1719482 1725442 1768261 1676625 1522944 1482908 1509749
18031A509749R7842l4593j48907m1354j3580j11001j1014q563j7930q3058j72062
$$ 1509749 1607591 1572998 1424091 1382737 1369157 1258156 1247142 1238579 1220649 1137591 965529
18020I65529n6206j21939n939R8625j7880N5752q0761n7554L3509J7513k1806
$$ 965529 909323 787384 781445 880070 862190 917942 837181 779627 813136 830649 808843
18009H08843o7577J10705n1626j66893r1367J50131J96481k40426L6758M3312
$$ 808843 741266 851971 800345 633452 542085 692216 888697 648271 685029 728341
17999G28341k5068k7775O4254n9860p3522R2828M1441N2098M1602j9181m9216
$$ 728341 703273 675498 739752 679892 606370 699198 740639 792737 834339 815158 765942
17988G65942K8737m1391p0414L0124o0625n4775R6815P4974J41423n1304j790
$$ 765942 794679 753288 682874 712998 652373 597598 694413 769387 910810 859506 857716
17977H57716k0048Q827J353j35174j04120P6715P6163q0095j05570r0587R5744
$$ 857716 837668 846495 847848 712674 608554 685269 761432 681337 575767 485180 580924
17966E80924N0179j50292J7355J76996K4410p2941J445j29167j28414J5067q5173
$$ 580924 631103 480811 498166 675162 699572 626631 628076 498909 370495 385562 300389
17955C00389k695R3183J17038Q5691N4316M5907k0088j0739o1233J5953m8773
$$ 300389 297694 390877 507915 593606 647922 693829 673741 663002 601769 617722 568949
17944E68949n2692l0103o2502l2270L4623K6546l2196j07467r6487J22972J12317
$$ 568949 516257 486154 423652 391382 426005 452551 420355 312888 216401 339373 451690
17933D51690P2989k3696r3343o2683j19310Q1607J04026O997j07953r2004K2739
$$ 451690 524679 500983 407640 344957 225647 307254 411280 418277 310324 218320 241059
17922B41059J13220Q4742m7239k8734j22038M2301L7004L1903k4340r8334J29558
$$ 241059 354279 439021 391782 363048 241010 283311 320315 352218 327878 229544 359102
17911C59102R6724l8785j8518l4016k0424l1659j23458J22610L77P6956j4829
$$ 359102 455826 417041 398523 364507 344083 312424 188966 311576 311953 388909 374080
17900C74080J08791l4579n3990J53116j70906k32900n7458J79411n6511j58044
$$ 374080 482871 448292 394302 547418 376512 143612 86154 265565 209054 51010
17890E1010N2168P1912P0084J26335J41333m3607j79036k26198j26447P4993J63153
$$ 51010 103178 175090 245174 371509 512842 469235 290199 64001 -62446 12547 175700
17879A75700J07065j2144q7149R677J08706p0404r4014j46924P7166K35568l6661
$$ 175700 282765 270621 183472 193149 301855 231451 137437 -9487 67679 303247 266586
17868B66586j14243o8375m6593p3913J5890M2134M7188k8557M2050P3509r1468
$$ 266586 152343 83968 37375 -36538 -20648 21486 68674 40117 82167 155676 64208
17857F4208q0412k150R3207Q1534O0258n7721J2220J4407j59656j01119k4116
$$ 64208 -16204 -18354 74853 156387 216645 158924 171144 185551 25895 -75224 -99340
17846i9340O9806l4642J57571p4034j30262P3169J21570P1890m894j30124m2895
$$ -99340 -29534 -64176 93395 19361 -110901 -37732 83838 155728 150834 20710 -22185
17835b2185o3965k411N4272L0737Q669L4533l5320j26278n0201J1757O3768J4824
$$ -22185 -86150 -88561 -34289 -3552 5117 39650 4330 -121948 -172149 -160392 -96624 -81800
17823h1800J63325K9056j31108j1226J78933L7479j16355k4583M3043m8553k230
$$ -81800 81525 110581 -20527 -31753 147180 184659 68304 43721 86764 38211 35981
17812C5981m4609Q232j01971j9231n576q365J01696J01668K6572j16386j1356
$$ 35981 -8628 -396 -102367 -121598 -127174 -135539 -33843 67825 94397 -21989 -33345
17801c3345j5799j4473O5859O9471R4107j37410n9452p614k8137J40539M9354
$$ -33345 -49144 -63617 2242 71713 165820 28410 -31042 -38656 -66793 73746 123100
17790A23100o5456M4169p6551j5572j04073q0815Q660N1639K7797q0721L4750
$$ 123100 57644 101813 25262 9690 -94383 -175198 -166538 -114899 -87102 -167823 -133073
17779a33073q336l7058p008r4583O7932J31262K82000O2543n4381q9914O204O0019
$$ -133073 -141409 -178467 -185475 -280058 -212126 -80864 201136 263679 209298 119384 125588 185607
17767A85607r6907N6052P6014K488j22275M7298O7926k0811O9531M853j23830
$$ 185607 88700 144752 220766 223254 100979 148277 216203 195392 264923 269776 145946
17756A45946j32767n9639K2163O2446Q4743j46884N0841K23475L4810j84764m1783
$$ 145946 13179 -46460 -24297 38149 122892 -23992 26849 250324 285134 100370 58587
17745E8587N5145j24743k8116N5782M1103l1087K7399k1983P8009l3313j1829
$$ 58587 113732 -11011 -39127 16655 57758 26671 54070 32087 110096 76783 64954
17734F4954M7395l126L0847k1036R4738k6970l9301r825J1693J37821j0135k25667
$$ 64954 112349 109223 140070 119034 213772 186802 147501 137676 149369 287190 277055 51388
17722E1388m8447J8016M5713l548m1212K9474J07403k7927m4667r4455N4669O3531
$$ 51388 2941 20957 66670 63122 21910 51384 158787 130860 86193 -8262 46407 109938
17710A09938l8546K7027n0686l9743P5089l7269n4819K4917j0826l4501K1913
$$ 109938 71392 98419 47733 7990 83079 45810 -9009 15908 5082 -29419 -7506
17699g506j09817j16065J57554O4553p6895N9018o24J2078J23603l7166l8764
$$ -7506 -117323 -233388 -75834 -11281 -88176 -29158 -29782 -17704 105899 68733 29969
17688B9969M4918J7776k00P1896q475M5155p4556n3470M8958q4752j02609m791
$$ 29969 74887 92663 92463 164359 155884 201039 126483 73013 121971 37219 -65390 -70181
17676g0181J18815n349p1041J25000j48j61603K102J41708l5473K0422J2307p0331
$$ -70181 48634 43285 -27756 97244 97096 -64507 -62405 79303 43830 64252 76559 6228
17664F228Q8827K2636l0363R4857Q4359n0701j69287o7683o0861J7886m0069J8765
$$ 6228 95055 117691 87328 182185 266544 215843 46556 -21127 -81988 -64102 -104171 -85406
17652h5406L3906k6612O7088j3756q4291L909Q2183J8869m7429j0352M0560R4030
$$ -85406 -51500 -78112 -11024 -24780 -109071 -105162 -22979 -4110 -51539 -61891 -21331 72699
17640G2699O7476J22088J31087o8646j35415o4463o872k4342m9364n6267O0183
$$ 72699 140175 262263 393350 324704 189289 124826 117954 93612 44248 -12019 48164
17629D8164R4639O1036j40550n1139L3455L6871M0180J1151M0681r5777k1220
$$ 48164 142803 203839 63289 12150 45605 82476 122656 133807 174488 78711 57491
17618E7491o0974j4676P5836k7268j49019K0317N4245M4190J53626k06974j99134
$$ 57491 -3483 -18159 57677 30409 -118610 -98293 -44048 142 153768 -53206 -252340
17607b52340O5766J94939P6998J29316o2623j39949J04621M132q7184J6895M3891
$$ -252340 -186574 8365 85363 214679 152056 12107 116728 120860 33676 50571 94462
17596I4462k6663k5237p247R6756O5402l9728j05606l7957n3151K1208K09775
$$ 94462 67799 42562 35315 132071 197473 157745 52139 14182 -38969 -17761 192014
17585A92014p5755j74039k4595Q8806k6547j05942J0645M8348k1136j1480J2756
$$ 192014 116259 -57780 -82375 6431 -20116 -126058 -115413 -67065 -88201 -99681 -86925
17574h6925l1830J28580J08846Q9817R4477o7076r3524j56313q1319l4173O5550
$$ -86925 -118755 9825 118671 208488 302965 235889 142365 -13948 -95267 -129440 -63890
17563f3890M7314j01740j59389N2974Q2452K5062m7205M4665J9085q443N7190
$$ -63890 -16576 -118316 -277705 -224731 -142279 -117217 -164422 -119757 -100672 -109115 -51925
17552e1925k749o1669O7071K41643n6705k7759n6268j24523M0858p9041n61m016
$$ -51925 -54674 -116343 -49272 192371 135666 107907 51639 -72884 -32026 -111067 -111628 -115644
17540a15644K7653J19248K22640l3880j00041k5736M4554o0084j71470n5095K06813
$$ -115644 -87991 31257 253897 220017 119976 94240 138794 78710 -92760 -147855 58958
17529E8958J08807J5226P4615j02895j99016k2404J08288K8917n6859q7966l31
$$ 58958 167765 182991 257606 154711 -44305 -66709 41579 70496 13637 -74329 -74660
17518g4660K5726j09148N7114o4567J1537J16721o5700L2857k6128k9559J35027
$$ -74660 -48934 -158082 -100968 -165535 -153998 -37277 -102977 -70120 -96248 -125807 9220
17507I220j6399J37413J03958L8086p5937k6043j44522j32670r9177K7741Q1931
$$ 9220 -7179 130234 234192 272278 196341 170298 25776 -106894 -206071 -178330 -96399
17496i6399N2683j67526J14039l5911J1657L994j7303J06945J37962r4482M7286
$$ -96399 -43716 -211242 -97203 -133114 -121457 -117463 -134766 -27821 110141 15659 62945
17485F2945r8105k23611j055Q8139J41100J11791r5075r2594k7001L2212Q8309
$$ 62945 -35160 -258771 -259826 -171687 -30587 81204 -13871 -106465 -133466 -101254 -12945
17474a2945J29025k3313R8225j4356o3736J03956O0121j52216p7243j24819m7435
$$ -12945 116080 92767 190992 176636 112900 216856 276977 124761 47518 -77301 -124736
17463a24736K594Q1294o4689L2577l4254R8181P3290o3137j110K5122k1806M2111
$$ -124736 -122142 -40848 -105537 -72960 -107214 -9033 64257 1120 10 25132 3326 45437
17451D5437O247M2070J15109l5812Q4013k3929K6628J14297m5744J80065K03970
$$ 45437 51684 93754 208863 173051 257064 233135 259763 374060 328316 508381 712351
17440G12351r2473l01459k84990K4100M5447J0194l779L7376k7469Q5628K2159
$$ 712351 619878 318419 33429 57529 102976 113170 109391 146767 119298 204926 227085
17429B27085l9116k864j77796j1915P3515J41287m5542j56182o9299L4388R4569
$$ 227085 187969 185105 7309 -4606 68909 210196 164654 8472 -60827 -26439 68130
17418F8130P0688j72737j1963Q7049l8333j40715J32421R2315P4168j290p2712
$$ 68130 138818 -33919 -45882 41167 2834 -137881 -5460 86855 161023 159733 87021
17407H7021P541r5551j587P9320p7879j66289j10698m5813Q1264N2604j7722K01319
$$ 87021 94562 -989 -2576 76744 -1135 -167424 -278122 -323935 -242671 -190067 -207789 -6470
17395f470J48471m0580j04300m6222p1340O2960O0190K5060j43746o1866j4716
$$ -6470 142001 101421 -2879 -49101 -120441 -57481 2709 27769 -115977 -177843 -192559
17384a92559M4193J18205p0970m3222R1025L6597O6352o4278n2635M6519K3897
$$ -192559 -148366 -30161 -101131 -144353 -53328 -16731 49621 -14657 -67292 -20773 3124
17373C124R0663k1588n580r2565n001K4246R1003N732Q8531Q002K5579P1338j01246
$$ 3124 93787 72199 66619 -25946 -30947 -6701 84302 90034 178565 186567 212146 283484 182238
17360A82238j33462j4335J6734p935p6787N0825p2181L1589k7306J0039j92314
$$ 182238 48776 34441 51175 43240 -33547 17278 -54903 -23314 -50620 -40581 -232895
17349b32895K8787J64681K0504o4412n3081M6394J34145N8268k28475j1552P6217
$$ -232895 -204108 -39427 -18923 -83335 -136416 -90022 44123 102391 -126084 -137636 -61419
17338f1419O5627J40821R331j47582M5275J4406j05576k7746Q7746M5702R0731
$$ -61419 4208 145029 154360 6778 52053 66459 -39117 -66863 20883 66585 157316
17327A57316p4129n051J29631k21841r7243j9370n6216R9331m0394l9817k1811
$$ 157316 83187 78136 207767 -14074 -111317 -130687 -186903 -87572 -127966 -167783 -189594
17316a89594k8164M0058R5828J45445J17387M6901j06537j33030r4382M3746L9567
$$ -189594 -217758 -177700 -81872 63573 180960 227861 121324 -11706 -106088 -62342 -22775
17305b2775N4873O2443N8679J26470O0181j10195j20439j55403o7711o4840K9239
$$ -22775 32098 94541 153220 279690 339871 229676 109237 -46166 -113877 -178717 -149478
17294a49478P2932J4565R3854J26844N8414p0284K4841L869n3221j43953J23871
$$ -149478 -76546 -61981 31873 158717 217131 146847 171688 175557 122336 -21617 102254
17283A02254j31Q893K8056m2652o6455O3148n7413m4743J26904m4936n9308p7395
$$ 102254 102123 111016 139072 96420 29965 93113 35700 -9043 117861 72925 13617 -63778
17271f3778n9702Q5075J8622m1279q054N1932q5663q0986K1414J3603Q5431J59782
$$ -63778 -123480 -38405 -19783 -61062 -69116 -17184 -102847 -183833 -162419 -148816 -63385 96397
17259I6397n1490j3015Q8594Q2884m7309j4876k8276L6711j10778j31696k6333
$$ 96397 44907 31892 120486 203370 156061 141185 112909 149620 38842 -92854 -119187
17248a19187j8974N0082J3334J21026J81639j36846k26820l6750L8195M4023P3379
$$ -119187 -138161 -88079 -74745 46281 227920 91074 -135746 -172496 -134301 -90278 -16899
17237a6899R3366M9414k7140o6726k15288r2448m9909m6426J16765J12433L0726
$$ -16899 76467 125881 98741 32015 -183273 -275721 -325630 -372056 -255291 -142858 -112132
17226a12132r4163n0471J69709J63653l5733j44667j3074J13873O8302p327j38487
$$ -112132 -206295 -256766 -87057 76596 40863 -103804 -116878 -3005 65297 57970 -80517
17215h0517n6216O0987J4497n7815n1521K9260R2063o2253q3377K34279m6895
$$ -80517 -136733 -75746 -61249 -119064 -170585 -141325 -49262 -111515 -194892 39387 -7508
17204g508N0285P7370L0471O5132o2333l0356o0566Q3711n8026p5471n8988j08642
$$ -7508 42777 120147 150618 215750 153417 123061 62495 146206 88180 12709 -46279 -154921
17192a54921j13963J16565J61746j09103L8303O3030N77L2897r9123k8665L6467
$$ -154921 -268884 -152319 9427 -99676 -61373 1657 2234 35131 -63992 -92657 -56190
17181e6190m6682l4363N0828M1545k1316M1562o9395J857L6165N3716j92153j541
$$ -56190 -102872 -137235 -86407 -44862 -66178 -24616 -94011 -92154 -55989 -2273 -194426 -195967
17169a95967J19702p8000J27533P6107k4320j03046j19328J41394J09538p8131
$$ -195967 -76265 -154265 -26732 49375 25055 -77991 -197319 -55925 53613 -24518
17159b4518j86310k8166Q8272P6932N9791p2240N6522Q6925N6706K1896P2425
$$ -24518 -210828 -238994 -150722 -73790 -13999 -86239 -29717 57208 113914 135810 208235
17148B08235j0722k847j5957n106o8524N2324n886j10496o501P7838J1136l0889
$$ 208235 197513 194666 178709 173603 105079 157403 151517 41021 34520 112358 123494 92605
17136I2605q3313m4820l337l5995l1642J19001L2713k4486P6138J63191l4235
$$ 92605 9292 -35528 -38865 -74860 -106502 12499 45212 20726 96864 260055 225820
17125B25820j58791j7684J6178m6353j04079m2782J58105P9187K4145N5115o1806
$$ 225820 67029 49345 65523 19170 -84909 -127691 30414 109601 133746 188861 127055
17114A27055O7790M7479K5018j41642p5771j01352O9272Q7083J17043M4969k9211
$$ 127055 194845 242324 267342 125700 49929 -51423 17849 104932 221975 266944 237733
17103B37733k9708j21675q0305n9741k3615P9405m3843Q020L5094q3636j0219
$$ 237733 208025 86350 6045 -53696 -77311 2094 -41749 -33729 1365 -82271 -92490
17092i2490l8686l2466K26446L8059M0214j5300n0473j5895p4649N258p7602R9419
$$ -92490 -131176 -163642 62804 100863 141077 125777 75304 59409 -15240 -9982 -87584 11835
17080A1835K34432R749r2032l8895Q465l8855j15810L0611J33339J15900R482
$$ 11835 246267 256016 163984 125089 133554 94699 -21111 9500 142839 258739 268221
17069B68221j51395j54538n1077l9127R1671Q7982J22427Q602j87969l1059K8478
$$ 268221 116826 -37712 -88789 -127916 -36245 51737 174164 182766 -5203 -36262 -7784
17058g784j44254m6495k1003Q2663m2236k7454Q7457j7170p6675O543Q91J67078
$$ -7784 -152038 -198533 -219536 -136873 -179109 -206563 -119106 -136276 -212951 -206408 -205517 -38439
17046c8439o000n9153J098r8707r3492J04306Q5218O7878O759J7857m2597k15499
$$ -38439 -44439 -103592 -102494 -201201 -294693 -190387 -105169 -37291 -30532 -12675 -55272 -270771
17034b70771j10449L9645O1598J23888O1763J47714J67033j05367q2461j41703
$$ -270771 -381220 -341575 -279977 -156089 -94326 53388 220421 115054 32593 -109110
17024a09110r0967j1712Q5754O7127P0431l898n3349l5409J57537N9757j17219
$$ -109110 -200077 -211789 -126035 -58908 11523 7625 -45724 -81133 76404 136161 18942
17013A8942r1206N8642R2534p7806k42262m8836J80104O7725k9325j13958J8661
$$ 18942 -72264 -13622 78912 1106 -241156 -289992 -109888 -42163 -71488 -185446 -166785
17002a66785J17170K2468L574r1289o7230M5573J9631J6332N981j7006q8591K1664
$$ -166785 -49615 -27147 -23573 -114862 -182092 -136519 -116888 -100556 -94575 -111581 -200172 -178508
16990a78508J13724J0422K4431N199l8202j0223l8833M051N2329J16215Q3990
$$ -178508 -64784 -54362 -29931 -24732 -62934 -73157 -111990 -107939 -55610 60605 144595
16979A44595j20901j49408j9858J18203K5693O465N3688Q401N1804K5857p9014
$$ 144595 23694 -125714 -145572 -27369 -1676 4789 58477 66878 118682 144539 65525
16968F5525j04564q6904J70375N8363q5736j6802R2055m8222r6144l5761P489
$$ 65525 -39039 -125943 44432 102795 17059 257 92312 44090 -52054 -87815 -80326
16957h0326J59699r74K1622n8473N1806o4750J4566P358j25521o8848l6823K6267
$$ -80326 79373 78399 100021 41548 93354 28604 43170 50528 -74993 -143841 -180664 -154397
16945a54397J5980J22595l9840l7485m0919Q5545J55544N4889p017J48216M349
$$ -154397 -138417 -15822 -55662 -93147 -134066 -48521 107023 161912 154895 303111 307460
16934C07460j65607k3063N5077l635p0192j1154N3738j41159j7126J20477L5020
$$ 307460 141853 118790 173867 170232 100040 88886 142624 1465 -15661 104816 139836
16923A39836n1527o8593p6464j06177J53083J00123o6092J680r7276L4709r7595
$$ 139836 88309 19716 -56748 -162925 -9842 90281 24189 25869 -71407 -36698 -134293
16912a34293L7718M1041J08646K4804j16494j1738j7666O618R3504k8397l8421
$$ -134293 -96575 -55534 53112 77916 -38578 -50316 -67982 -61364 32140 3743 -34678
16901c4678m6023k0282J06595N0092p876q636j23676j92222M7985l415r975J22733
$$ -34678 -80701 -100983 5612 55704 47828 39192 -84484 -276706 -228721 -232136 -242111 -119378
16889a19378l75J23066O5002p3044m6250k4729L8397L0622Q1682k7680L3846m4995
$$ -119378 -119753 3313 68315 -4729 -50979 -75708 -37311 -6689 74993 47313 81159 36164
16877C6164j85958j1755J09046O8720n2626j08318l8303Q9717p5971O6329R4986
$$ 36164 -149794 -161549 -52503 16217 -36409 -144727 -183030 -93313 -169284 -102955 -7969
16866g969k5935L7524R1260M2286M6363J08778j12521n7730r3126p739J19632
$$ -7969 -33904 3620 94880 137166 183529 292307 179786 122056 28930 21191 140823
16855A40823l6546N5026j6234k8216n3753K2620p0226J2509p7313j60465k049
$$ 140823 104277 159303 143069 114853 61100 83720 13494 26003 -51310 -211775 -213824
16844b13824J31805Q8668J55689K1884p7380j34672j41810n2639R4257J19670
$$ -213824 -82019 6649 162338 184222 106842 -27830 -169640 -222279 -128022 -8352
16834h352J4172M2760M199P4346N5736j40123P9243J11353k06026k31081r9384
$$ -8352 5820 48580 52779 127125 182861 42738 121981 233334 27308 -203773 -303157
16823c03157p5122L6343J60858J06445N7356j6861P5621p7012M891j15654k6087
$$ -303157 -378279 -341936 -181078 -74633 -17277 -34138 41483 -35529 -30638 -146292 -172379
16812a72379J31996K0415j92381k5975J30250J17072J1751J0624o4120Q039M4453
$$ -172379 -40383 -19968 -212349 -238324 -108074 8998 20749 31373 -32747 -24708 19745
16801A9745n5753r5048O3954R7221J06812L9517L1056j02620j67820l2723J5688
$$ 19745 -36008 -131056 -67102 30119 136931 176448 207504 104884 -62936 -95659 -79971
16790g9971N0649J6956M6439l1112j62021J37554J75766L9543K2775l7421l8065
$$ -79971 -29322 -12366 34073 2961 -159060 -21506 154260 193803 216578 179157 141092
16779A41092o4144p1179J12482R014M080j27683q9642J18953O9292o8280r6714
$$ 141092 76948 5769 118251 127265 131345 3662 -85980 32973 102265 33985 -62729
16768f2729k5283p389r2677Q5272K6017L1949m6233j6713P6428J39713J05471
$$ -62729 -88012 -95401 -188078 -102806 -76789 -44840 -91073 -107786 -31358 108355 213826
16757B13826p2650l0836n2524n0493k9297l7734N8563l3645j00394p3285R2134
$$ 213826 141176 110340 57816 7323 -21974 -59708 -1145 -34790 -135184 -208469 -116335
16746a16335l5039p477J41228J13079L6959k2817k6698j7591m1724n1433Q1533
$$ -116335 -151374 -158851 -17623 95456 132415 109598 82900 65309 23585 -27848 53685
16735E3685l6565j8401J36927p5171j51791L415r7877L1064J7698J08432m3827
$$ 53685 17120 -1281 135646 60475 -91316 -87901 -185778 -154714 -137016 -28584 -72411
16724g2411Q2243p3211Q1547L9117j6854m3752j3531k5046m3423J16026M1500
$$ -72411 9832 -63379 18168 57285 40431 -3321 -16852 -41898 -85321 30705 72205
16713G2205m918m5384k08554k1366n9995n6448P6769J34462o0976N1222R2100
$$ 72205 67287 21903 -186651 -208017 -268012 -324460 -247691 -113229 -174205 -122983 -30883
16702c0883m4207N1829J67542j4668p0593l1493M4941k7309j5455r2748N6175
$$ -30883 -75090 -23261 144281 129613 59020 27527 72468 45159 29704 -63044 -6869
16691f869o519k47106Q3140J60385k6007O1483k7187q3245J51305P7555Q0284
$$ -6869 -13388 -260494 -177354 -16969 -42976 18507 -8680 -91925 59380 136935 217219
16680B17219n5315j88382J00409O2204j11553j4396j5360j04219J09817R486L2352
$$ 217219 161904 -26478 73931 136135 24582 10186 -5174 -109393 424 9910 42262
16669D2262n9134J1532l4196j41084p2499M2553P708N7778Q751j6773j0494Q9856
$$ 42262 -16872 -5340 -39536 -180620 -253119 -210566 -202858 -145080 -136329 -153102 -163596 -73740
16657g3740R7193m2301j70857q3684R4025k2411J41386N7090P1172O767J68132
$$ -73740 23453 -18848 -189705 -273389 -179364 -201775 -60389 -3299 67873 74640 242772
16646B42772k7593r7438m0855K7045J22610m2593r7311L8847O5494r9413n5209
$$ 242772 215179 117741 76886 103931 226541 183948 86637 125484 190978 91565 36356
16635C6356o243J03282O4696q0211l4084J8092M457j8983K0257k5555L2503P9304
$$ 36356 30113 133395 198091 117880 83796 101888 106345 87362 107619 82064 114567 193871
16623A93871o483L2799r9909j24036o9990K2516j753M7848r625n4612J8479o2782
$$ 193871 187388 220187 120278 -3758 -73748 -51232 -52985 -5137 -14762 -69374 -50895 -113677
16611a13677K1631k9141n214P4448K418J9028J08932M8869j00236q4137Q7300
$$ -113677 -92046 -121187 -126401 -51953 -49535 -30507 78425 127294 27058 -57079 30221
16600C0221j8649L3439j4832J822N0810J0714l9842l0935k6390M4657n8315j03604
$$ 30221 11572 45011 30179 32001 82811 93525 53683 22748 -3642 41015 -17300 -120904
16588a20904l8993j45492Q0802J04256J34566M9520j00504m4947L6022K7717N7024
$$ -120904 -159897 -305389 -224587 -120331 14235 63755 -36749 -81696 -45674 -17957 39067
16577C9067N173q4144l8977M3302J22862R2513l067j8156q7961k7172j0365j04505
$$ 39067 44240 -39904 -78881 -35579 87283 179796 176729 158573 70612 43440 33075 -71430
16565g1430J8985Q0531P6891N2833O0141k8553j73994q6735j8005k16991l2360
$$ -71430 -52445 28086 104977 157810 217951 189398 15404 -71331 -89336 -306327 -338687
16554c38687J2269J89062K93603M1228j95605k4614L8680q9628k4712m7853l9936
$$ -338687 -326418 -137356 156247 197475 1870 -22744 15936 -73692 -98404 -146257 -186193
16543a86193j27319J36322j1857j3152m3046M1189N2784K4665L8497n8196K2494
$$ -186193 -313512 -177190 -189047 -202199 -245245 -204056 -151272 -126607 -88110 -146306 -123812
16532a23812j21l9757J17843J6394j74666J2931N9965m2349K5080J02124j22894
$$ -123812 -123933 -163690 -45847 -29453 -204119 -191188 -131223 -173572 -148492 -46368 -169262
16521a69262J9280L7813M455P8315m9413o4634Q0048n2975k3484l4105P2214l5800
$$ -169262 -149982 -112169 -107714 -29399 -78812 -143446 -63398 -116373 -139857 -173962 -101748 -137548
16509a37548m145J61960O9279o8527j39566J44421j3862j06562j13109j03173
$$ -137548 -141693 20267 89546 21019 -118547 25874 12012 -94550 -207659 -310832
16499c10832n0094Q5666J35855J34617j30887J072r49p2911N0385J00392L4312
$$ -310832 -360926 -275260 -139405 -4788 -135675 -134603 -135552 -208463 -158078 -57686 -23374
16488b3374M0485K2783M7905j17601j26841q0044n1510J0364L8783J25678O7929
$$ -23374 17111 39894 87799 -29802 -156643 -236687 -288197 -277833 -239050 -113372 -45443
16477d5443L5318K946N8373L937q3391p5907q4857L2417J55264m134Q4249Q8736
$$ -45443 -10125 -7179 51194 55131 -28260 -104167 -189024 -156607 -1343 -5477 78772 167508
16465A67508j88514j55893M9168Q9089o3671r5396M434P9564L3402Q989n1900
$$ 167508 -21006 -176899 -127731 -38642 -102313 -197709 -193275 -113711 -80309 -71320 -123220
16454a23220k8889r8145O3412J22887J54445J44550j30798j41769j03486j00091
$$ -123220 -152109 -250254 -186842 -63955 90490 235040 104242 -37527 -141013 -241104
16444b41104k1261J70244P1143L951j11905L0943O1527N1086n066l5551m0268
$$ -241104 -262365 -92121 -20978 -17027 -128932 -97989 -36462 14624 9558 -25993 -66261
16433f6261O3807m9146k9612J930J07017m799j2372r3850k0333k3560l9969j5237
$$ -66261 -2454 -51600 -81212 -79282 27735 22936 10564 -83286 -103619 -127179 -167148 -182385
16421a82385j9989j27261M1201J37538N7532P7514N3851k9299m1538k8247r8930
$$ -182385 -202374 -329635 -288434 -150896 -93364 -15850 38001 8702 -32836 -61083 -160013
16410a60013K546Q9446J15595J0192O948L7677P332j81654j16788m1378M4526
$$ -160013 -157467 -68021 47574 57766 64714 102391 109723 -71931 -188719 -230097 -185571
16399a85571K4508J11184m0606k6866j05651k2238P6322J17749K8939J6696j7126
$$ -185571 -161063 -49879 -90485 -117351 -223002 -245240 -168918 -51169 -22230 -5534 -22660
16388b2660J10132P5395K36497K4841k70178j58473r145O4507m8348o7434r869
$$ -22660 87472 162867 399364 424205 154027 -4446 -13591 50916 2568 -64866 -74735
16377g4735R3841J22754p8086j68181P2845N8095p078r0484k1988M3850k8790
$$ -74735 19106 141860 63774 -104407 -31562 26533 19455 -71029 -93017 -49167 -77957
16366g7957j45690N2372k4449p8455J51517J48852r5151q5177j25596l3262K7402
$$ -77957 -223647 -171275 -195724 -274179 -122662 26190 -68961 -154138 -279734 -312996 -285594
$$ [...]
##END NTUPLES=NMR SPECTRUM
##END=
