##TITLE=Analysis number 322251
Compound Code cc 09510
Project Code adrs
Chemist Name stores
##JCAMPDX= 6.0         $$ Bruker NMR JCAMP-DX V2.0
##DATA TYPE= NMR SPECTRUM
##DATA CLASS= NTUPLES
##ORIGIN= Bruker BioSpin GmbH
##OWNER= nmr
$$ XWIN-NMR		Version 3.5
$$ Tue Sep 19 08:48:32 2006 GMT Daylight Time (UT+1h)  MAYBRIDGE\nmr@NMR_250MHZ
##.OBSERVE FREQUENCY= 250.131544655141
##.OBSERVE NUCLEUS= ^1H
##.ACQUISITION MODE= SIMULTANEOUS (DQD)
##.ACQUISITION SCHEME= undefined
##.AVERAGES= 16
##.DIGITISER RES= 18
##SPECTROMETER/DATA SYSTEM= dpx250
##.PULSE SEQUENCE= zg30
##.SOLVENT NAME= CDCl3
##.SHIFT REFERENCE= (INTERNAL, CDCl3, 0, 16.522)
##AUDIT TRAIL= $$ (NUMBER, WHEN, WHO, WHERE, WHAT)
$$ ##TITLE= Audit trail, XWIN-NMR		Version 3.5
$$ ##JCAMPDX= 5.01
$$ ##ORIGIN= Bruker BioSpin GmbH
$$ ##OWNER= nmr
$$ C:\u/data/dgb/nmr/ADRS/990/pdata/1/auditp.txt
$$ ##AUDIT TRAIL=  $$ (NUMBER, WHEN, WHO, WHERE, WHAT)
(   1,<2006-09-19 08:48:04.77 +100>,<MAYBRIDGE\nmr>,<NMR_250MHZ>,
      <created by zg, POWCHK disabled, PULCHK disabled
       configuration hash MD5:
       E2 DF 36 D8 04 B2 41 60 5A D7 A3 38 5A 4B D0 FE
       data hash MD5: 64K
       E4 35 EA 43 4C 34 71 CE 13 80 FA A9 57 43 C8 97>)
(   2,<2006-09-19 08:48:20.28 +100>,<MAYBRIDGE\nmr>,<NMR_250MHZ>,
      <Start of raw data processing
       ef LB = 0.3 FT_mod = 6 PKNL = 1 SI = 32K 
       data hash MD5: 32K
       91 4D 41 02 CB F8 89 83 34 62 87 B9 07 43 3D 8C>)
(   3,<2006-09-19 08:48:22.28 +100>,<MAYBRIDGE\nmr>,<NMR_250MHZ>,
      <apk 
       data hash MD5: 32K
       BD 63 21 2D A9 C0 53 87 7F 48 0A A1 FE EB DE A1>)
(   4,<2006-09-19 08:48:23.00 +100>,<MAYBRIDGE\nmr>,<NMR_250MHZ>,
      <abs ABSG = 5 
       data hash MD5: 32K
       28 27 7B E3 62 1C 8D 66 E9 75 92 74 5E 7B C4 DD>)
$$ ##END=
$$ 
$$ hash MD5
$$ 8D 8C 0A 0C 71 93 4D 4D 72 73 51 B9 EC 01 F2 78
##$RELAX= 
##$RELAX= 
##$RELAX= 
##$RELAX= 
##$RELAX= 
##$RELAX= 
##$RELAX= 
$$ Bruker specific parameters
$$ --------------------------
##$DU= <C:\u>
##$EXPNO= 990
##$NAME= <ADRS>
##$PROCNO= 1
##$TYPE= <nmr>
##$USER= <dgb>
##$AMP= (0..31)
100 100 100 100 100 100 100 100 100 100 100 100 100 100 100 100 100 100 
100 100 100 100 100 100 100 100 100 100 100 100 100 100 
##$AQSEQ= 0
##$AQ_mod= 3
##$AUNM= <au_zg>
##$AUTOPOS= <32 >
##$BF1= 250.13
##$BF2= 250.13
##$BF3= 250.13
##$BF4= 250.13
##$BF5= 500.13
##$BF6= 500.13
##$BF7= 500.13
##$BF8= 500.13
##$BYTORDA= 1
##$CFDGTYP= 0
##$CFRGTYP= 5
##$CHEMSTR= <none>
##$CNST= (0..31)
1 1 145 1 1 1 1 1 1 1 1 1 1 1 1 1 1 1 1 1 1 1 1 1 1 1 1 1 1 1 1 1 
##$CPDPRG= <>
##$CPDPRG1= <>
##$CPDPRG2= <>
##$CPDPRG3= <>
##$CPDPRG4= <mlev>
##$CPDPRG5= <mlev>
##$CPDPRG6= <mlev>
##$CPDPRG7= <mlev>
##$CPDPRG8= <mlev>
##$CPDPRGB= <>
##$CPDPRGT= <>
##$D= (0..31)
0 1 0 0 0 0 0 0 0 0.06 0 0 0 0 0 0 0.0002 0 0 0 0 0 0 0 0 0 0 0 0 0 0 
0 
##$DATE= 1158652083
##$DBL= (0..7)
120 120 120 120 120 120 120 120 
##$DBP= (0..7)
150 150 150 150 150 150 150 150 
##$DBP07= 0
##$DBPNAM0= <>
##$DBPNAM1= <>
##$DBPNAM2= <>
##$DBPNAM3= <>
$$ [...]
##$SUBNAM7= <"">
##$SUBNAM8= <"">
##$SUBNAM9= <"">
##$SW= 20.6930455092707
##$SWIBOX= (0..15)
0 0 3 0 0 0 0 0 0 0 0 0 0 0 0 0 
##$SW_h= 5175.983436853
##$TD= 65536
##$TD0= 1
##$TE= 295.16
##$TE2= 300
##$TE3= 300
##$TEG= 300
##$TL= (0..7)
0 120 120 120 120 120 120 120 
##$TP= (0..7)
150 150 150 150 150 150 150 150 
##$TP07= 0
##$TPNAME0= <>
##$TPNAME1= <>
##$TPNAME2= <>
##$TPNAME3= <>
##$TPNAME4= <>
##$TPNAME5= <>
##$TPNAME6= <>
##$TPNAME7= <>
##$TPOAL= (0..7)
0.5 0.5 0.5 0.5 0.5 0.5 0.5 0.5 
##$TPOFFS= (0..7)
0 0 0 0 0 0 0 0 
##$TUNHIN= 0
##$TUNHOUT= 0
##$TUNXOUT= 0
##$USERA1= <user>
##$USERA2= <user>
##$USERA3= <user>
##$USERA4= <user>
##$USERA5= <user>
##$V9= 5
##$VALIST= <valist>
##$VCLIST= <CCCCCCCCCCCCCCC>
##$VD= 0
##$VDLIST= <DDDDDDDDDDDDDDD>
##$VPLIST= <PPPPPPPPPPPPPPP>
##$VTLIST= <TTTTTTTTTTTTTTT>
##$WBST= 1024
##$WBSW= 4
##$XGAIN= (0..3)
0 0 0 0 
##$XL= 0
##$YL= 0
##$YMAX_a= 477167
##$YMIN_a= -541011
##$ZGOPTNS= <>
##$ZL1= 120
##$ZL2= 120
##$ZL3= 120
##$ZL4= 120
##$ABSF1= 16.522
##$ABSF2= -4.171173
##$ABSG= 5
##$ABSL= 3
##$ALPHA= 0
##$AQORDER= 0
##$ASSFAC= 0
##$ASSFACI= 0
##$ASSFACX= 0
##$ASSWID= 0
##$AUNMP= <proc_1d>
##$AZFE= 0.1
##$AZFW= 0.1
##$BCFW= 0
##$BC_mod= 0
##$BYTORDP= 0
##$COROFFS= 0
##$CY= 12.5
##$DATMOD= 1
##$DC= 0
##$DFILT= <>
##$DTYPP= 0
##$F1P= 14.0000005364418
##$F2P= -0.99999901652339
##$FCOR= 0.5
##$FTSIZE= 32768
##$FT_mod= 6
##$GAMMA= 0
##$GB= 0
##$INTBC= 1
##$INTSCL= 1
##$ISEN= 128
##$LB= 0.3
##$LEV0= 0
##$LPBIN= 0
##$MAXI= 10000
##$MC2= 0
##$MEAN= 0
##$ME_mod= 0
##$MI= 0
##$NCOEF= 0
##$NC_proc= -3
##$NLEV= 6
##$NOISF1= 0
##$NOISF2= 0
##$NSP= 0
##$NTH_PI= 0
##$NZP= 0
##$OFFSET= 16.522
##$PC= 1
##$PHC0= 144.0984
##$PHC1= 10.18532
##$PH_mod= 1
##$PKNL= yes
##$PPARMOD= 0
##$PSCAL= 4
##$PSIGN= 0
##$REVERSE= no
##$SF= 250.13
##$SI= 32768
##$SIGF1= 0
##$SIGF2= 0
##$SINO= 400
##$SIOLD= 32768
##$SREGLST= <1H.CDCl3>
##$SSB= 0
##$STSI= 32768
##$STSR= 0
##$SW_p= 5175.98343685301
##$SYMM= 0
##$S_DEV= 0
##$TDeff= 65536
##$TDoff= 0
##$TI= <Analysis number 999999
Compound Code 99
Book Reference 9
Project Code 9>
##$TILT= no
##$TM1= 0
##$TM2= 0
##$TOPLEV= 0
##$USERP1= <user>
##$USERP2= <user>
##$USERP3= <user>
##$USERP4= <user>
##$USERP5= <user>
##$WDW= 1
##$XDIM= 32768
##$YMAX_p= 312795034
##$YMIN_p= -182846
$$ End of Bruker specific parameters
$$ ---------------------------------
##NTUPLES= NMR SPECTRUM
##VAR_NAME=  FREQUENCY,     SPECTRUM/REAL,   SPECTRUM/IMAG
##SYMBOL=    X,             R,               I
##VAR_TYPE=  INDEPENDENT,   DEPENDENT,       DEPENDENT
##VAR_FORM=  AFFN,          ASDF,            ASDF
##VAR_DIM=   32768,         32768,           32768
##UNITS=     HZ,            ARBITRARY UNITS, ARBITRARY UNITS
##FACTOR=    0.157963299565203, 1,           1
##FIRST=     4132.6476996994, 0,             0
##LAST=      -1043.33573715361, 0,           0
##MIN=       -1043.33573715361, -182846,     0
##MAX=       4132.6476996994, 312795034,     0
$$ Real data points
##PAGE= N=1
##DATA TABLE= (X++(R..R)), XYDATA
$$ [...]
24042g790P363l590M128o335K261N237k6549l888j649p972K2515j1820l967r087
$$ -7790 -427 -4017 111 -6224 -3963 1274 -25275 -29163 -30812 -38784 -16269 -28089 -32056 -41143
24028d1143J3952L3483K5993K0778j4608m124j9599j7940L9323R524l536l2281
$$ -41143 -27191 6292 32285 53063 38455 34331 14732 -3208 36115 45639 42103 9822
24016I822N408J5667m208J1211j5580l3251j8491l367J6380K3756j0816r781J5633
$$ 9822 15230 30897 26689 37900 22320 -10931 -29422 -32789 -16409 7347 -3469 -13250 2383
24003B383Q261j6755j0119M500L1048J902k5890m2692J5071J879N1452K3109m1868
$$ 2383 10644 -6111 -16230 -11730 19318 21220 -4670 -47362 -32291 -30412 21040 44149 2281
23990B281k8601K4177N517l9840j8159K0453L4128p199l0234k0894J8108M7939
$$ 2281 -26320 -2143 3374 -36466 -54625 -34172 -44 -7243 -37477 -58371 -40263 7676
23978G676L365m1958K2218L2163o902k6205J6994R254J788r142M562o213l6094
$$ 7676 11041 -30917 -8699 23464 16562 -9643 7351 16605 18393 9251 13813 7600 -28494
23965b8494J1775K7160m459j3790J5871p829J153J4739j4912L3109K0334k4825
$$ -28494 -16719 10441 5982 -7808 8063 234 1387 16126 1214 34323 54657 29832
23953B9832j2445K6121J4207K3769k1407j6427j7394O087o574J1363j0634Q278
$$ 29832 17387 43508 57715 81484 60077 43650 26256 32343 25769 37132 26498 34776
23941C4776l615j7739k2028J131K7789m1243l7310N785K4425J2652K074L451J6536
$$ 34776 31161 13422 -8606 -7475 20314 -20929 -58239 -52454 -28029 -15377 -13303 -9852 6684
23928F684q07j8596j6425J6696n975L4454K6783J1680l081j25k3157n647q270
$$ 6684 5877 -12719 -29144 -12448 -18423 16031 42814 54494 51413 51288 28131 22484 14214
23915A4214j308L5558O626k8784l3575J8523L924j3411l315K6339j6359p382j7188
$$ 14214 12906 48464 55090 26306 -7269 11254 15178 1767 -1548 24791 8432 1050 -16138
23902a6138J3920J9251j6136m272k6335j5739J8857N5123J9117J1001j8186j4312
$$ -16138 -2218 17033 897 -3375 -29710 -45449 -26592 28531 47648 58649 40463 26151
23890B6151r050J5611j0145J5475J4406j609k3222l3743j0276k7107K173K3609
$$ 26151 17101 32712 22567 38042 52448 50839 27617 -6126 -16402 -43509 -41336 -17727
23878a7727K7855k082k0426j2382O532j3408k447L6197q238k2025L293J5731J0682
$$ -17727 10128 8046 -12380 -24762 -18230 -31638 -34085 2112 -6126 -28151 -24858 -9127 1555
23865A555k4934J301J5900p327J889J6882k2189j9603L1975K7979p907j4506O872
$$ 1555 -23379 -22078 -6178 -13505 -11616 5266 -16923 -36526 -4551 23428 15521 1015 7887
23852G887p266l0763o021N0327N832j2929o728K60l108L649j7620k0918k5465
$$ 7887 621 -30142 -36163 14164 19996 7067 339 599 -2509 1140 -16480 -37398 -62863
23839f2863J0115J8090o018n225K536L1987L0943K034J5938K730j2621J7582j7134
$$ -62863 -52748 -34658 -40676 -45901 -43365 -11378 19565 21599 37537 40267 27646 45228 28094
23826B8094k6665k7175k4724L5110J0259N336k0995J5681j4080J1439Q743P217
$$ 28094 1429 -25746 -50470 -15360 -5101 235 -20760 -5079 -19159 -7720 1023 8240
23814H240k635Q044k2130J9945K4748M561p62J311l8546j7600O755O000k089J591
$$ 8240 5605 13649 -8481 11464 36212 40773 40011 41322 2776 -14824 -8069 -2069 -4158 -2567
23800b567R265r131J021j690j7265l3805j1773K1644K3914K0650K4265m365j3516
$$ -2567 6698 -2433 -1412 -3102 -20367 -54172 -65945 -44301 -20387 263 24528 20163 6647
23787F647J2124K8037j5729l6978j3128l233J3421j3685J1701J7701J7735j0625
$$ 6647 18771 46808 31079 -5899 -19027 -22260 -8839 -22524 -10823 6878 24613 13988
23775A3988l9333N374j5922Q177L9475J7091l410J4661j0664k7932j3762Q285
$$ 13988 -25345 -19971 -35893 -27716 11759 28850 25440 40101 29437 1505 -12257 -3972
23763c972p793j1317k7923P54J2656q764j3718j3212j0996L0571J9113N396J9584
$$ -3972 -11765 -23082 -51005 -50251 -37595 -46359 -60077 -73289 -84285 -53714 -34601 -29205 -9621
23750i621m661j5700K944J6567n41j1806l1600k0652K5770M5553L4465m900l8595
$$ -9621 -14282 -29982 -27038 -10471 -11012 -22818 -54418 -75070 -49300 -3747 30718 25818 -12777
23737a2777l5717N641q161L5123K4229k3674j1694K0527L2730j1663N1522M5886
$$ -12777 -48494 -42853 -51014 -15891 8338 -15336 -27030 -6503 26227 14564 66086 111972
23725A11972j7636k6401j6633j1312k0579q2K2390k1506k2060q558J3818Q935
$$ 111972 94336 67935 51302 39990 19411 19329 41719 20213 -1847 -10405 3413 12348
23713A2348Q818l77j4874J5450K327Q060p781m068j6489K620L4224J4638k3202
$$ 12348 21166 20789 5915 21365 23692 31752 23971 19903 3414 6034 40258 54896 31694
23700C1694j8988k4249q843o711k8016K8083M5212M0105J5186P548o421k1829
$$ 31694 12706 -11543 -20386 -27097 -55113 -27030 18182 58287 73473 81021 74600 52771
23688E2771l671j4515o225K9650K1052m3445l2834J2314L637r38l9229J7284j2011
$$ 52771 49100 34585 28360 58010 79062 35617 2783 15097 18734 17796 -21433 -4149 -16160
23675a6160J682O948J1994J6357M018q5k1352j8344M331j2210j1611k4712K4785
$$ -16160 -14478 -7530 4464 20821 24839 24754 3402 -14942 -10611 -22821 -34432 -59144 -34359
23662c4359K4036k8216k0469Q770J6168J4319k518j3083o159K9996k0585L3149
$$ -34359 -10323 -38539 -59008 -50238 -34070 -19751 -22269 -35352 -41511 -11515 -32100 1049
23650A049o216j7390J9983k56j4723k289j1397L590L2048j92l5180J4066j9840
$$ 1049 -5167 -22557 -2574 -2830 -17553 -19842 -31239 -27649 4399 4207 -30973 -16907 -36747
23637c6747m0544l2598M1537L3105K150j5284l0830M384L920K7183M207K4780
$$ -36747 -77291 -109889 -68352 -35247 -33097 -48381 -79211 -74827 -70907 -43724 -39517 -14737
23625a4737J0573m8459k9347k849M2580L4323K1672J764j5299J957K2374k3006
$$ -14737 -4164 -52623 -81970 -84819 -42239 -7916 13756 15520 221 2178 24552 1546
23613A546j4194M2147J6880j2236p451l9366j5114J3762q208o101N5059J3872
$$ 1546 -12648 29499 46379 34143 26692 -12674 -27788 -14026 -22234 -28335 26724 40596
23601D0596k309m2203m0626l1436J1971K2848Q244j2106q104K0379O542K1631
$$ 40596 38287 -3916 -44542 -75978 -64007 -41159 -32915 -45021 -53125 -32746 -26204 -4573
23589d573O549P881o361j1421j3644L6910J1201r974j4946J6984K376j2365l3420
$$ -4573 1976 9857 3496 -7925 -21569 15341 26542 16568 1622 18606 20982 8617 -24803
23576b4803R164p320m389O960j8265R56L5369K7888k443K4430J7766j8668k9827
$$ -24803 -15639 -22959 -27348 -20388 -38653 -37697 -2328 25560 23117 47547 65313 46645 16818
23563A6818l8029K3960J4870j4805l2519j1879k799P335o117n048J8405K8007
$$ 16818 -21211 2749 17619 2814 -29705 -41584 -44383 -37048 -43165 -48213 -29808 -1801
23551a801J2381O741m262J1520K4750m3093l9878N530j0151K6664K8017o69l299
$$ -1801 10580 17321 13059 24579 49329 6236 -33642 -28112 -38263 -11599 16418 15749 12450
23538A2450R996J9738P458k2672k9433P707L1097J5196k6033l5160j0191k171
$$ 12450 22446 42184 49642 26970 -2463 5244 36341 51537 25504 -9656 -19847 -22018
23526b2018l062L2528O024M334k9263K4738L3474m442k7553j7736l2144K3719
$$ -22018 -25080 7448 13472 17806 -11457 13281 46755 42313 14760 -2976 -35120 -11401
23514a1401K4282M76N3643K0829j3010J9449j9635m1564j0493o70j112J3083R031
$$ -11401 12881 13357 67000 87829 74819 94268 74633 33069 22576 21906 20794 33877 42908
23501D2908P059L448k9692o0184PJ3454j7489n513k6554l239L2595M6204j760
$$ 42908 49967 53415 23723 -36461 -36454 -23000 -40489 -46002 -72556 -75795 -43200 3004 1244
23488A244m0062k2484M496N0984L0177q085Q034L815J6698k2576k904K782P705
$$ 1244 -38818 -61302 -56806 -5822 24355 16270 24304 28119 44817 22241 19337 22119 29824
23475B9824m089j5675j4756k8491L395J0428M3284J7654J1063j2673j7060N65
$$ 29824 25735 10060 -4696 -33187 -29792 -19364 23920 41574 52637 39964 22904 23469
23463B3469K0438m557l1584l933J9353J1357Q60j0157n99j604l587k3236K396
$$ 23469 43907 39350 7766 3833 23186 34543 35403 25246 24647 23043 19456 -3780 -1384
23450a384J7878n335r312J6411n17m876J5101k1120K0967J825J5114R739k561
$$ -1384 16494 11159 1847 18258 17741 12865 27966 6846 27813 29638 44752 54491 51930
23437E1930m234J9777k123k0335j4392l7077j588O561k9354k784L3590M6721l08
$$ 51930 47696 67473 65350 45015 30623 -6454 -8042 -1481 -30835 -33619 -29 46692 46384
23424D6384l8601l918K608m951L0402n176J112M074q32k8130k9622L2122K7786
$$ 46384 7783 3865 6473 1522 31924 26748 27860 31934 31102 2972 -26650 5472 33258
23411C3258j7360k2907L818O849J0482j0346j8423R287K7303k2514k8321J2677
$$ 33258 15898 -7009 -3191 3658 14140 3794 -14629 -5342 21961 -553 -28874 -16197
23399a6197J5047Q292J3440l675l5044J2668J2565m6112j6491j92K2048K6671
$$ -16197 -1150 7142 20582 16907 -18137 -5469 7096 -39016 -55507 -55699 -33651 -6980
23387f980J3247m752j9863J0539k0972j6920K3197p213j7428K2732M4183L998
$$ -6980 6267 1515 -18348 -7809 -28781 -45701 -22504 -29717 -47145 -24413 19770 23768
23375B3768j7331j6926j2557j3041L5949L0363J1548J2150k1596j0138k91R004
$$ 23768 6437 -10489 -23046 -36087 -138 30225 41773 53923 32327 22189 21898 30902
23363C0902k1119r805L2015M3140j2106m6880p989j8084j3371J0884M7228K7222
$$ 30902 9783 -22 31993 75133 63027 16147 8158 -9926 -23297 -12413 34815 62037
23351F2037m4360m0420K0329M8807j8176j4292j2332j1233L8489Q001p083k3208
$$ 62037 17677 -22743 -2414 46393 28217 13925 1593 -9640 28849 36850 29767 6559
23339F559q235J7412L3443j5352l9847R198P911J402N295p965j7377K167N801
$$ 6559 -1676 15736 49179 33827 -6020 3178 11089 12491 17786 9821 -7556 -5389 412
23326D12K5247L2934L255r415r029j2897j8334j6255J6022j5298k1869J5183L228
$$ 412 25659 58593 61848 52433 43404 30507 12173 -4082 11940 -3358 -25227 -10044 -6816
23313f816J7339J6326n720k1539R080l1344q704N16M1225Q684r605k0433j0925
$$ -6816 10523 26849 21129 -410 8670 -22674 -31378 -30862 10363 19047 9442 -10991 -21916
23300b1916l2878j6338K6926K3689J0568r937j0874J0229K9029N077n425K238
$$ -21916 -54794 -71132 -44206 -20517 -9949 -19886 -30760 -20531 8498 13575 8150 10388
23288A0388l575J026K0649p907l4378j1061j9117q426J5023L420J5199L9673k5928
$$ 10388 6813 7839 28488 20581 -13797 -24858 -43975 -52401 -37378 -33958 -18759 20914 -5014
23275e014l8155J6431M68J8468J5449L2196P771q396J8912K0608k4839n6301P149
$$ -5014 -43169 -26738 -26270 -7802 7647 39843 47614 39218 58130 78738 53899 -2402 4747
23262D747m568K0684K7719j9596k7297k021P850k0603j8901J4257Q464J4403J112
$$ 4747 179 20863 48582 28986 1689 -332 7518 -13085 -31986 -17729 -9265 5138 6250
23249F250Q677J5181J3876j3076p1864l0370L8850J6557o574j9597q898J7320
$$ 6250 14927 30108 43984 30908 -40956 -71326 -32476 -15919 -22493 -42090 -50988 -33668
23237c3668J6965J7075k6339j7639j9793j091M9922K7824J782J9338k1623l0460
$$ -33668 -16703 372 -25967 -43606 -63399 -64490 -14568 13256 15038 34376 12753 -17707
23225a7707j8809j6028L2210r881J7371J2992k188j5236J5029N80j0501r819J6868
$$ -17707 -36516 -52544 -20334 -30215 -12844 148 -2040 -17276 -2247 -1667 -12168 -21987 -5119
23212e119L428j6656O47N5173J2561n0955j4502K0619n132J4369K599q168k0940
$$ -5119 -1691 -18347 -17700 37473 50034 -921 -15423 5196 64 14433 17032 8864 -12076
23199a2076l504J4203J5637K9259L4677j8890k9957k623K7304k3154k9514K5066
$$ -12076 -15580 -1377 14260 43519 78196 59306 29349 26726 54030 30876 1362 26428
23187B6428J0J239k1196R791o140l3172r355k1206l5482K0005M713m416L0985
$$ 26428 26438 27677 6481 16272 10132 -23040 -32395 -53601 -89083 -69078 -64365 -68781 -37796
23174c7796J2520k0528L2075K2784O457j5324j0448j4423J5643K5906l428J6608
$$ -37796 -25276 -45804 -13729 9055 15512 188 -10260 -24683 -9040 16866 13438 30046
23162C0046j776J504o967k7157K5075Q869K8176J3170N418m1973o2829K9556L2180
$$ 30046 28270 29774 22807 -4350 20725 29594 57770 70940 76358 34385 -28444 1112 33292
23149C3292J0889l8068k3260O556J5624L6821N3617l1976o7274j0643K8814J2687
$$ 33292 44181 6113 -17147 -10591 5033 41854 95471 63495 -3779 -14422 14392 27079
23137B7079j6419m0539J1584L32k6242o047K2652L6354Q758q963l676J2666j9434
$$ 27079 10660 -29879 -18295 -17963 -44205 -50252 -27600 8754 17512 8549 4873 17539 -1895
23124a895q955k8214L5699K8074k5612k1480k0475J9912p20P484J3887j3953K2228
$$ -1895 -10850 -39064 -3365 24709 -903 -22383 -42858 -22946 -23666 -16182 -2295 -16248 5980
23111E980J2071J5486k1414j2967o247n452J8383j2592J3381N843J3578k4927
$$ 5980 18051 33537 12123 -844 -7091 -12543 5840 -6752 6629 12472 26050 1123
23099A123m3630j1897N1295K5709K851k3638j6510J4640O516J6597n376j3924
$$ 1123 -42507 -54404 -3109 22600 25451 1813 -14697 -57 6459 23056 17680 3756
23087C756L2831j2890j0811q203J1986j1426Q50l549j8314j8874J5818Q865p598
$$ 3756 36587 23697 12886 4683 16669 5243 6093 2544 -15770 -34644 -18826 -9961 -17559
23074a7559o02J1542M491l984k4286k7775L7702M7701j9344j9993j0897K817M5727
$$ -17559 -18161 -6619 -2128 -6112 -30398 -58173 -20471 27230 7886 -12107 -23004 -20187 25540
23061B5540L4988J953k7227l9429J698k0802J8240O941j2247j9011j1606K2636
$$ 25540 60528 62481 35254 -4175 -2477 -23279 -5039 1902 -10345 -29356 -40962 -18326
23049a8326J5057l4691k579K05J2303J6595L1754J4234R851l775O737j6103k5191
$$ -18326 -3269 -37960 -40539 -40334 -28031 -11436 20318 34552 44403 40628 47365 31262 6071
23036F071L848j0747j1904L5019K5327r017j2829j9401J5108J3643l991K936J2196
$$ 6071 9919 -828 -12732 22287 47614 38597 25768 6367 21475 35118 31127 34063 46259
23023D6259J3021N456O656L1547j2341n1233k0262k2247j446J9500J9057J1211
$$ 46259 59280 64736 71392 102939 90598 39365 19103 -3144 -4590 14910 33967 45178
23011D5178K1270j5507n851J950J783k8957R040L0020r656l859k3532n252M402
$$ 45178 66448 50941 45090 47040 48823 19866 28906 58926 49270 45411 21879 16627 21029
22998B1029o176k1543L1134M186k6801k1668r257j122L0395K7241k5406j8593
$$ 21029 14853 -6690 24444 28630 1829 -19839 -29096 -30218 177 27418 2012 -16581
22986a6581k3713L5260L0562K9419R414l444r066j7097j9629K935q374j2541n989
$$ -16581 -40294 -5034 25528 54947 64361 60917 51851 34754 15125 18060 9686 -2855 -8844
22973h844k3138k3791J9255j8181k4440j9059L5870K7273M309J7807l487K7075
$$ -8844 -31982 -55773 -36518 -54699 -79139 -98198 -62328 -35055 -30746 -12939 -16426 10649
22961A0649j284j2637j6688j4275M748K9844K2514L807l9704K5402l819J4829
$$ 10649 9365 -3272 -19960 -34235 -29487 357 22871 26678 -13026 12376 8557 23386
22949B3386k7009m1728J0175k854l3926J4727L2577Q208J4216j2022k5773n226
$$ 23386 -3623 -45351 -35176 -38030 -71956 -57229 -24652 -16444 -2228 -14250 -40023 -45249
22937d5249Q245K304R087J3239j3527k332L0105J7583J5479k033j0589j8683k2717
$$ -45249 -37004 -34700 -25613 -12374 -25901 -28233 1872 19455 34934 32901 22312 3629 -19088
22924a9088n150N144K1230n940J5511K6632J0212j1594k8912k0217M431K1213
$$ -19088 -24238 -19094 2136 -3804 11707 38339 48551 36957 8045 -12172 -7741 13472
22912A3472J9959k6583q461K814J749J5003k1058p862Q836k668N499o826j9543
$$ 13472 33431 6848 -1613 1201 2950 17953 -3105 -10967 -2131 -4799 700 -6126 -25669
22899b5669L5107Q945N3444J073n5774l4169K0676L7937k2541j968k1464J7113
$$ -25669 9438 18383 71827 72900 17126 -17043 3633 41570 19029 17061 -4403 12710
22887A2710L0150p638k3168j3261J7937M810l5696k1346K8604L1751J3628r040
$$ 12710 42860 35222 12054 -1207 16730 21540 -14156 -35502 -6898 24853 38481 29441
22875B9441k7283p481O279K4498k6692r153N3170K491l4970j1486Q248J4084J0423
$$ 29441 2158 -5323 956 25454 -1238 -10391 42779 45270 10300 -1186 7062 21146 31569
22862C1569K412m2515m9214j8840R199j1611L6822J9315J5895K7091N806j5493
$$ 31569 33981 -8534 -57748 -76588 -67389 -79000 -42178 -22863 -6968 20123 25929 10436
22850A0436m051n636r480J3791N103J172m38m2275J2000m860M82P649L7355j7103
$$ 10436 6385 749 -8731 5060 10163 11335 10897 -31378 -19378 -24238 -23756 -16107 21248 4145
22836D145o0706k7596J7382L8538o29K2418P258J4355J1893j2432j8262l818k8040
$$ 4145 -56561 -84157 -66775 -28237 -28866 -6448 810 15165 27058 14626 -3636 -7454 -35494
22823c5494j312L4836l78j013J4500K2357k557k0448n9854m3086K7332M6246K790
$$ -35494 -36806 -1970 -2348 -3361 11139 33496 30939 10491 -49363 -92449 -65117 -18871 -16081
22810a6081l591P701K9803Q478M527q588k4802p188K5983j089m2832k0779J6178
$$ -16081 -19672 -11971 17832 26310 30837 22249 -2553 -9741 16242 15153 -27679 -48458 -32280
22797c2280K0442p513K3987J2880j6553O823L5661k0081m4297n0130J1236J8187
$$ -32280 -11838 -19351 4636 17516 963 7786 43447 23366 -20931 -71061 -59825 -41638
22785d1638J9570L9312J5611k7412k944l898n346k9493r987J4635O730o944J5377
$$ -41638 -22068 17244 32855 5443 2499 -1399 -6745 -36238 -46225 -31590 -24860 -31804 -16427
22772a6427K6404R658O689R102k0531j0783l9611k0612L008m953M1605M271J6515
$$ -16427 9977 19635 26324 35426 14895 4112 -35499 -56111 -53103 -58056 -16451 -12180 4335
22759D335q804r425j6075p91j3332k8947K4448j4495k6710O528j719L4483m556
$$ 4335 -4469 -13894 -29969 -30760 -44092 -73039 -48591 -63086 -89796 -83268 -84987 -50504 -55060
22746e5060j0694Q435J6012K2560J339K8354L4002O21J5161k078n0557j4337J0851
$$ -55060 -65754 -57319 -41307 -18747 -17408 10946 44948 45569 60730 58652 8095 -6242 4609
22733D609j8723N48J3077J5159J762l3068J998J4100j4333j0973J1481l8031k8569
$$ 4609 -14114 -13566 -489 14670 16432 -16636 -14638 -538 -14871 -25844 -14363 -52394 -80963
22720h0963R029O4101N0785N014p55L835k9867j5197r712R708k278r378M963j1119
$$ -80963 -71934 -7833 42952 47966 47211 51046 21179 5982 -3730 5978 3700 -5678 -715 -11834
22706a1834n474J3391q066j2395L9032Q937K6136K4031j2078k89m2641j6698J0249
$$ -11834 -17308 -3917 -11983 -24378 14654 23591 49727 73758 61680 61391 18750 2052 12301
22693A2301J4047k485l591l61J0745k1853k2951J3045K4284K3692m9645M111K9893
$$ 12301 26348 23863 20272 19911 30656 8803 -14148 -1103 23181 46873 -2772 1339 31232
22680C1232j0220n36r844l192J2272m6337m4456L0687K2903K8005J5697J4424
$$ 31232 21012 20476 10632 7440 19712 -26625 -71081 -40394 -17491 10514 26211 40635
22668D0635L0913M768l2225l7874j3160J4575J5960Q094j0513L8843O343k7888
$$ 40635 71548 76316 44091 6217 -6943 7632 23592 31686 21173 60016 66359 38471
22656C8471m0374K992K0320J1918j0726r82j0389M679L3433j0307j6703j153L161
$$ 38471 -1903 1089 21409 33327 22601 21619 11230 15909 49342 39035 22332 21179 24340
22643B4340K726J2888J360M24j1228m4984k5734K714J2369J5766Q861k5404o141
$$ 24340 27066 39954 41314 41738 30510 -14474 -40208 -37494 -25125 -9359 -498 -25902 -32043
22630c2043K6334L0194M3810K7141j2920k8426k3383J0218J6688K6698R920l7759
$$ -32043 -5709 24485 68295 95436 82516 54090 30707 40925 57613 84311 94231 56472
22618E6472m9743J281j529j1822K55O122J6664J5378Q390j6667j4438p377j3091
$$ 56472 6729 8010 6481 -5341 -5086 1036 17700 33078 41468 24801 10363 2986 -10105
22605a0105N115j5540K8984O195k5287k320N389J307Q036N8078K6237k5160m0778
$$ -10105 -4990 -20530 8454 14649 -10638 -12958 -7569 -6262 1774 59852 86089 60929 20151
22592B0151m3812n813K4691K0626P446K7745M809L860k050k7853O452j2249k6121
$$ 20151 -23661 -29474 -4783 15843 23289 51034 55843 59703 57653 29800 36252 24003 -2118
22579b118j3130j7603K2238n933l9210o285L7084K6107j3214j4111L6649K1590
$$ -2118 -15248 -32851 -10613 -16546 -55756 -62041 -24957 1150 -12064 -26175 10474 32064
22567C2064r106M778J0434J7350L2769p788l4610J643k6390j5755j0853J8350
$$ 32064 22958 27736 38170 55520 88289 80501 45891 47534 21144 5389 -5464 12886
22555A2886J5379k1331j9309J009M3365K6831J9307k1191m1640r145J9197K0592
$$ 12886 28265 6934 -12375 -11366 31999 58830 78137 56946 15306 6161 25358 45950
22543D5950k4168j6489J0693K8300O962K582n0876o259M2930p952k8917J5836
$$ 45950 21782 5293 15986 44286 51248 53830 2954 -3305 39625 31673 2756 18592
22531A8592O906n2546j8272M8346K5783K0257J950j4620l539m146k6713J6622
$$ 18592 25498 -27048 -45320 3026 28809 49066 51016 36396 32857 28711 1998 18620
22519A8620K0089N755j2802j5078j3932J1262p065J7563J9764J8590n0655l9411
$$ 18620 38709 44464 31662 16584 2652 13914 6849 24412 44176 62766 12111 -27300
22507b7300K7829J0119J8501O925j5902k7823L386q208l0108J2621K548L6172
$$ -27300 529 10648 29149 36074 20172 -7651 -4265 -12473 -42581 -29960 -27412 8760
22495H760J124m1230J5235R721J6371P975K9564j256L764j9887k0388r974K4196
$$ 8760 9884 -31346 -16111 -6390 9981 17956 47520 46264 50028 30141 9753 -221 23975
22482B3975J5077K158k196p922j5169o413r601k880L9675J9762r078R469k5850
$$ 23975 39052 41210 39014 31092 15923 9510 -91 -2971 36704 56466 47388 56857 31007
22469C1007m6922k2998J8026J1996K5008J5184P983K2430K0060l8000l9232j563
$$ 31007 -15915 -38913 -20887 -8891 16117 31301 39284 61714 81774 43774 4542 2979
22457B979P462L233j3007K719j0119m241k8883J2554L4749K434Q328L62j8180
$$ 2979 10441 13674 667 3386 -6733 -10974 -39857 -27303 7446 9880 18208 18570 390
22444C90k1548j6796K9706N9592R927l8121k1350l0753J8841K3583j4266p999
$$ 390 -21158 -37954 -8248 51344 61271 23150 1800 -28953 -10112 13471 -795 -8794
22432h794k190M7960M4947j7060k275l4751j9748J0746r298j9713N019O33N19
$$ -8794 -10984 36976 81923 64863 62588 27837 8089 18835 9537 -10176 -5157 -4524 -4005
22419d005L9744J1864j8787Q462q425O512k226k2918Q385P809J3132K7077j2366
$$ -4005 35739 47603 28816 37278 28853 35365 33139 10221 18606 26415 39547 66624 54258
22406E4258N754l071j4403M341P255J6794j5133l4658j9353P276l0324K2272J5595
$$ 54258 60012 56941 42538 46879 54134 70928 55795 21137 1784 9060 -21264 1008 16603
22393A6603L851k593K826k0555j2228k1915J9158J3833p871j123O498K9571p792
$$ 16603 20454 17861 20687 132 -12096 -34011 -14853 -1020 -8891 -10014 -3516 26055 18263
22380A8263j6185l924q963P424J819J3509j1092j0080R291K1883m578j102L842
$$ 18263 2078 -1846 -10809 -3385 -1566 11943 851 -9229 62 21945 17367 16265 20107
22367B0107p364P025k4095l7295k4339m36J9337J2960J2530J0701o22o589Q628
$$ 20107 12743 19768 -4327 -41622 -65961 -66397 -47060 -34100 -21570 -10869 -11491 -18080 -9452
22354i452J2939J7866N862J135j0859j737j3188k102k939j7655q462J1387L165
$$ -9452 3487 21353 27215 28350 17491 15754 2566 464 -2475 -20130 -28592 -17205 -14040
22341a4040j88k5899m441J3002J4178J8667J2124m5197j3729R253L2871l838k8108
$$ -14040 -14228 -40127 -44568 -31566 -17388 1279 13403 -31794 -45523 -36270 -3399 -7237 -35345
22328c5345O90J8052J943J1864L597M3689J7455j6808J2708j1794j7587j3962
$$ -35345 -34655 -16603 -14660 -2796 801 44490 61945 45137 57845 46051 28464 14502
22316A4502L416j590L1168N156M968l4754j5326l6013K6338L9343J6563k5456
$$ 14502 17918 16328 47496 52652 57620 22866 7540 -28473 -2135 37208 53771 28315
22304B8315m6943j0865K3848L1854J3059M6233K597o661R094K7603O768l1976
$$ 28315 -18628 -29493 -5645 26209 39268 85501 88098 81437 90531 118134 124902 92926
22292I2926p0043r092j2359M17J218J8391k5856j3457Q234K1371n520l2782j1119
$$ 92926 22883 13791 1432 1849 3067 21458 -4398 -17855 -9621 11750 6230 -26552 -37671
22279c7671K9383J3722q469K0135K1586J9574k1731k4193j3126L825K4492k8217
$$ -37671 -8288 5434 -3035 17100 38686 58260 36529 12336 -790 3035 27527 -690
22267f90j0574J5571j3194l9874j6486m810r576M4600o181M795R885M5194j0810
$$ -690 -11264 4307 -8887 -48761 -65247 -70057 -79633 -35033 -41214 -36419 -26534 18660 7850
22254G850R419j3625j890K715L3787Q911k543m9793l0689K281K3867M6263J4360
$$ 7850 17269 3644 1754 4469 38256 47167 44624 -5169 -35858 -33577 -9710 36553 50913
22241E0913n053l1936k0167R952R451j0104K8169L4442j5923p025K5142j0224
$$ 50913 45860 13924 -6243 3709 13160 3056 31225 65667 49744 42719 67861 57637
22229E7637k8004k1123j5051J6949P747O082o011j9400N376J1554j404L7450J6144
$$ 57637 29633 8510 -6541 10408 18155 24237 18226 -1174 4202 15756 14352 51802 67946
22216F7946j9723n3079j9800N4470L3051l827l9288k1144k3661P284K5246l655
$$ 67946 48223 -4856 -24656 29814 62865 59038 19750 -1394 -25055 -17771 7475 3820
22204C820O486J6619j3300k1519L704K4007q78p074M3319l1283m1910L8930J4481
$$ 3820 10306 26925 13625 -7894 -4190 19817 18939 11865 55184 23901 -18009 20921 35402
22191C5402k0551k0109K9059J6464J2163k0166j031n81m4983k5344J8182o004
$$ 35402 14851 -5258 23801 40265 52428 32262 31231 30650 -14333 -39677 -21495 -27499
22179b7499j0387J0553N186K5946N2122n1791j6705K0619j5854k4055k8013j1647
$$ -27499 -37886 -27333 -22147 3799 55921 4130 -12575 8044 -7810 -31865 -59878 -71525
22167g1525K7876L175K3175J8736K3416j3935r976J2716K7053j8264n2179R071
$$ -71525 -43649 -40474 -17299 1437 24853 10918 942 13658 40711 22447 -29732 -20661
22155b0661K8124K7287j110l0265r332K7918J8518p206K095j3731k2053j8963
$$ -20661 7463 34750 33640 3375 -5957 21961 40479 33273 35368 21637 -416 -19379
22143a9379J8393J2194M206m257K152j0232k8012J8701J9331l083o545m039K0888
$$ -19379 -986 11208 15414 11157 13309 3077 -24935 -6234 13097 10014 3469 -570 20318
22130B0318M060l2084o1579o035j448Q985M1939M6400L1696j4073m5432K4921
$$ 20318 24378 -7706 -69285 -75320 -76768 -67783 -25844 20556 52252 38179 -7253 17668
22118A7668L7577j3619k1219k9101j7331K660j1059K6682O151N372j0867M464
$$ 17668 55245 41626 20407 -8694 -26025 -23365 -34424 -7742 -1591 3781 -7086 -2622
22106b622m120P173L139L954r130k698l9663l694L1861p135L173N583K9603R386
$$ -2622 -6742 431 3570 7524 -1606 -4304 -43967 -47661 -15800 -22935 -19762 -14179 15424 24810
22092B4810j9181j9368R660K5728K7177l4830j6032K5633j0678p214K3703O188
$$ 24810 5629 -13739 -4079 21649 48826 13996 -2036 23597 12919 5705 29408 35596
22080C5596Q268n895l7420L626q24N198M0388M0131j7771k6592r515J885k5529
$$ 35596 43864 37969 549 4175 3351 8549 48937 89068 71297 44705 35190 37075 11546
22067A1546k5848L3325k16O495Q840j7730o176k8796J3527J6458r371r083J0382
$$ 11546 -14302 19023 18807 25302 34142 16412 10236 -18560 -5033 11425 2054 -7029 3353
22054C353O361K698K3801j2786q376q046k1461l984j8452J3900K3921j6704m116
$$ 3353 9714 12412 36213 23427 15051 7005 -14456 -18440 -36892 -22992 929 -15775 -19891
22041a9891L691j7101k1658o641J6979J0316N815L29J2725K541m4641J2351r178
$$ -19891 -16200 -33301 -54959 -61600 -44621 -34305 -28490 -28161 -15436 -12895 -57536 -45185 -54363
22028e4363L544J7855K461K4837O394J1930j0815K3299K3906j0278j1871p455
$$ -54363 -50819 -32964 -30503 -5666 728 12658 1843 25142 49048 38770 26899 19444
22016A9444m289L527J8221k335k1329n66k8515m216J2136K4592M7101n394m3794
$$ 19444 15155 18682 36903 34568 13239 12673 -15842 -20058 -7922 16670 63771 58377 14583
22003A4583l6811L0264J8888J9358m249k6888k6093M558l477n448L2201j371J2312
$$ 14583 -22228 8036 26924 46282 42033 15145 -10948 -6390 -9867 -15315 16886 15515 27827
21990B7827p044k1763j1006J3780L1525k3422j285l723j3052j519j7156K6062
$$ 27827 20783 -980 -11986 1794 33319 9897 8612 4889 -8163 -9682 -26838 -776
21978g76j3683k1675K8873L0453j510j9855n004q124J1146J6330K3270m242n0012
$$ -776 -14459 -36134 -7261 23192 21682 1827 -3177 -11301 -155 16175 39445 35203 -14809
21965a4809L620L7657Q089q626m632j7907J6162j6514J0253L7392p278j5827k8673
$$ -14809 -11189 26468 34557 25931 21299 3392 19554 3040 13293 50685 43407 27580 -1093
21952a093j0727M829j1543M792j1086J3628l79K6785K1159k0142N631K845j151
$$ -1093 -11820 -6991 -18534 -13742 -24828 -11200 -11579 15206 36365 16223 21854 24699 23548
21939B3548j0031m3815j6550N9728L8230l1842J4612M1238j3479k8499R896j3233
$$ 23548 13517 -30298 -46848 12880 51110 19268 33880 75118 61639 33140 43036 29803
21927B9803j6836J3425K4307L4015l4177l4232o154l9585o944Q323J1637j5572
$$ 29803 12967 26392 50699 84714 50537 16305 10151 -29434 -36378 -28055 -16418 -31990
21915c1990k2112P217K3401K0744K0496K1664l8259L363K5752L4741O013j8566
$$ -31990 -54102 -46885 -23484 -2740 17756 39420 1161 4524 30276 65017 71030 52464
21903E2464O206L0736j342m0263m0530j3116K4810J3330l1491k2570K8728K047
$$ 52464 58670 89406 88064 47801 7271 -5845 18965 32295 804 -21766 6962 9009
21891I009q669L7747J7878l1109j2027j811J9207K991q232K1619n020n849L2446
$$ 9009 340 38087 55965 24856 12829 11018 30225 33216 24984 46603 41583 35734 68180
21878F8180J9436m4682n4184P013l002p194l1227k420K5483k93k349M5684K0931
$$ 68180 87616 42934 -11250 -4237 -7239 -14433 -45660 -48080 -22597 -22890 -25239 20445 41376
21865D1376k4364j2894j9414j2090k8006q632K2068K4495k593N079J6353K4216
$$ 41376 17012 4118 -15296 -27386 -55392 -64024 -41956 -17461 -20054 -14975 1378 25594
21853B5594m0320j5096L9377q48o946Q01J3334K7069J3919j2671p872o549k4442
$$ 25594 -14726 -29822 9555 8707 1761 2562 15896 42965 56884 44213 36341 29792 5350
21840E350l7949J8751R318p041k6135J7746J2726l092n07K9622R326j1600k8974
$$ 5350 -32599 -13848 -4530 -11571 -37706 -19960 -7234 -10326 -10833 18789 28115 16515 -12459
21827a2459J2195J9525M103l2898n456n454K7954n16N724J373j2022k814n527
$$ -12459 -264 19261 23364 -9534 -14990 -20444 7510 6994 12718 14091 2069 -745 -6272
21814f272r771J9804K0958j8185k423L6533K692k4711p89P177j9246J4032L5190
$$ -6272 -16043 3761 24719 6534 4111 40644 43336 18625 17836 25013 5767 19799 54989
21801E4989K1776Q604k726j3690j6702P898q537m1660l5201M423K8461K6187J9350
$$ 54989 76765 85369 82643 68953 52251 60149 51612 9952 -25249 -20826 7635 33822 53172
21788E3172l355p068n902J4402k5703R59K4467L4671J2952n946k1303m5197n3507
$$ 53172 49817 42749 36847 51249 25546 26505 50972 85643 98595 92649 71346 26149 -27358
21775b7358K350K6410J1494l5684r834L7458J1291O136n201j020n185J29J9412
$$ -27358 -25008 1402 12896 -22788 -32622 4836 16127 22263 17062 16042 10857 10986 30398
21762C0398o919N686p74j8421l0299l8687j2136M8981M7438J0134j6100K257k462
$$ 30398 23479 29165 28391 9970 -20329 -59016 -71152 -22171 25267 35401 19301 21558 19096
21749A9096J8083k9846l993O128L738P098k7485r311K5167K3387K7924L917m0503
$$ 19096 37179 7333 3340 9468 13206 20304 -7181 -16492 8675 32062 59986 63903 23400
21736B3400l9376O084j3424P311M037m547K3001k4131k4261J3450N4286M292k3127
$$ 23400 -15976 -9892 -23316 -16005 -11968 -16515 6486 -17645 -41906 -28456 25830 30122 6995
21723F995k9458Q641K9408K699k7475M515j2927l4735K9756L4478L068N2660J8319
$$ 6995 -22463 -13822 15586 18285 -9190 -4675 -17602 -52337 -22581 11897 14965 67625 85944
21710H5944j2784j1447j8427m277k1582o620J3077j3154j6194L053j061k103L986
$$ 85944 73160 61713 43286 39009 17427 10807 23884 10730 -5464 -2411 -3472 -5575 -1589
21697a589J9108n592p471L800n861r396K134k6598J086J5612K7610M4589K3328
$$ -1589 17519 11927 4456 8256 2395 -7001 -4867 -31465 -30379 -14767 12843 57432 80760
21684H0760J0130r306k8440n0098J4322J3720k6482j1722L044j1207n648K2408
$$ 80760 90890 81584 53144 3046 17368 31088 4606 -7116 -4072 -15279 -20927 1481
21672A481J8374k2727k565K5753k502J8703k3815k1595m568J3240K5815K6184
$$ 1481 19855 -2872 -5437 20316 17814 36517 12702 -8893 -13461 -221 25594 51778
21660E1778K2754J247l8541k1298K4222J2922Q470P811l3998l0555O768j1511
$$ 51778 74532 75779 37238 15940 40162 53084 61554 69365 35367 4812 11580 69
21648F9q592Q655o374N55O549J5159O769J3753p674k4295P385l435j5503R961
$$ 69 -8523 132 -6242 -5687 862 16021 22790 36543 28869 4574 11959 8524 -6979 2982
21634B982j2936Q963J5449K0512J8818m3321l1880j3118K4564K1777M077k4577
$$ 2982 -9954 -991 14458 34970 53788 10467 -21413 -34531 -9967 11810 15887 -8690
21622h690j3727J8911K9496J6266k1479j3656j9781m496o580P54j5687k0426O1319
$$ -8690 -22417 -3506 25990 42256 20777 7121 -12660 -17156 -23736 -22982 -38669 -59095 2224
21609B224N3946K1069j3945j5750p922N32j8530p412J6331k9123M813m960J0632
$$ 2224 56170 77239 63294 47544 39622 40154 21624 14212 30543 1420 6233 1273 11905
21596A1905k407K0283L929J4176K8025r714o2424O584K979j5009j2775J1345L4192
$$ 11905 9498 29781 33710 47886 75911 66197 3773 10357 13336 -1673 -14448 -3103 31089
21583C1089j7650O423J0652J4272l540k2520j3305l3260p13J2264J9605M473p544
$$ 31089 13439 19862 30514 44786 41246 18726 5421 -27839 -28552 -16288 3317 7790 246
21570B46L931N485r570j1192o086K2158M703K951k4722p64K0683j6585N961J8258
$$ 246 4177 9662 92 -11100 -17186 4972 9675 12626 -12096 -12860 7823 -8762 -2801 15457
21556A5457K0792J6978j0367k2849L301J8856K5669r418j7800j0408J3681J4422
$$ 15457 36249 53227 42860 20011 23312 42168 67837 58419 40619 30211 43892 58314
21544E8314J3781M959j207l3965n1733j2519M8129k164m1637Q956J8993K8304
$$ 58314 72095 77054 75847 41882 -9851 -22370 25759 23595 -18042 -9086 9907 38211
21532C8211q585l1456l9402O741k2351j9210O458K0988K7894J7499J0049J0090
$$ 38211 29626 -1830 -41232 -34491 -56842 -76052 -69594 -48606 -20712 -3213 6836 16926
21520A6926j6482N882o874K2164l2563J3634k645r351K8579m127k9625m510K3677
$$ 16926 444 6326 -548 21616 -10947 2687 42 -9309 19270 15143 -14482 -18992 4685
21507D685j039L1101j0520k780o276j7584K9701P086M547j6048k9661q660l515
$$ 4685 3646 34747 24227 21447 15171 -2413 27288 34374 38921 22873 -6788 -15448 -18963
21494a8963j8537j3118J1634K9942M124N162L0072J3482k0416j3448J7378P980
$$ -18963 -37500 -50618 -38984 -9042 -4918 244 30316 43798 23382 9934 27312 35292
21482C5292q050q4O493k3773p557o384j3842K441L6665j965k3297n4043N421N6968
$$ 35292 27242 27158 33651 9878 2321 -4063 -17905 -15464 21201 19236 -4061 -58104 -52683 4285
21468D285n689P312l8048k9787k403K8133L2697P541j6952J9222K0388j3712M229
$$ 4285 -1404 5908 -32140 -61927 -64330 -36197 -3500 4041 -12911 6311 26699 12987 17216
21455A7216Q73J6410N861r354Q379j0815j5146k7985j6068M5215K75j7962l580
$$ 17216 18089 34499 40360 31006 39385 28570 13424 -14561 -30629 14586 14861 -3101 -6681
21442f681M3118P015Q457K743l395j1623j3818j5429r388k1393Q764M267j6046
$$ -6681 36437 43452 51909 54652 51257 39634 25816 10387 999 -20394 -11630 -7363 -23409
21429b3409o929k4519L8150L9588j2701l2857o74j1414K4705j763J8023J7634
$$ -23409 -30338 -54857 -16707 22881 10180 -22677 -23351 -34765 -10060 -11823 6200 23834
21417B3834q964J6781J3819l7656j1963L9891J922J8401l2793K798M884m438k2735
$$ 23834 14870 31651 45470 7814 -4149 35742 37664 56065 23272 26070 30954 26516 3781
21404C781k3398j1901O011n723N6495R966m64j8215k8798L4451j0621j7583K0324
$$ 3781 -19617 -31518 -25507 -31230 25265 35231 34767 16552 -12246 22205 11584 -5999 14325
21391A4325M477r882j5743K697m5L417k1968R681L0598M0605R052k8684k5148
$$ 14325 18802 8920 -6823 -4126 -4171 -754 -22722 -13041 17557 58162 67214 38530 13382
21378A3382p651k6962J7394M617j2714J2298P494J2732l094J7017R564J5836r202
$$ 13382 5731 -21231 -3837 780 -11934 364 7858 20590 17496 34513 44077 59913 50711
21365E0711l6561L8012J9824k1659l5263J4610j2529j8046R283J443k1355O401
$$ 50711 14150 52162 71986 50327 15064 29674 17145 -901 8382 9825 -11530 -5129
21353e129m529M085K3690J4503j797m7030m838K4008R99j64m72j6816N911P341
$$ -5129 -9658 -5573 18117 32620 30823 -16207 -21045 2963 3962 3798 3326 -13490 -7579 -238
21339b38k487j6474M038J4257M983r523J4986J274K3046j6205j187J1904L613
$$ -238 -2725 -19199 -15161 -904 4079 -5444 9542 10816 33862 17657 16470 28374 31987
21326C1987N438J1170l0414K159k433K9556J005K132K5650k3869l9014l6280L1396
$$ 31987 37425 48595 18181 20340 17907 47463 48468 50600 76250 52381 13367 -22913 8483
21313H483K0872l061K6160L9371j0186k2325j4044M133R375k6713j6548J4906
$$ 8483 29355 26294 52454 91825 81639 59314 45270 49403 58778 32065 15517 30423
21301C0423j973j5478l7193q193M712j561L039R388J2769J0010L9177K173j3196
$$ 30423 28450 12972 -24221 -32414 -27702 -29263 -26224 -16836 -4067 5943 45120 47293 34097
21288C4097L292k739m1354m4664N1989K2458k1494k770l1517j6299L1536L2376
$$ 34097 37389 34650 -6704 -51368 621 23079 1585 -1185 -32702 -49001 -17465 14911
21276A4911N773j1003J6451o86q299J3844j8057Q768J8297j3893o737M198K3670
$$ 14911 20684 9681 26132 25446 17147 30991 12934 21702 39999 26106 19369 23567 47237
21263D7237l9678l8148l8284M530J0871j2736K651N3395J6927J8350N873L2008
$$ 47237 7559 -30589 -68873 -64343 -53472 -66208 -63557 -10162 6765 25115 30988 62996
21251F2996k5390l8859J2473K1419O383j6506o863k5979q688K5409M2319q881
$$ 62996 37606 -1253 11220 32639 39022 22516 15653 -10326 -19014 6395 48714 39833
21239C9833k6345J4655k933j1794R176j4498P764R785J6397j71P886k1772K2619
$$ 39833 13488 28143 25210 13416 22592 8094 15858 25643 42040 41869 49755 27983 50602
21226E0602J4262k1770r896n6827N606J5492j5405M0595K3524k9512q529r399
$$ 50602 64864 43094 33198 -23629 -18023 -2531 -17936 22659 46183 16671 8142 -1257
21214a257j6412M279P870k7333J5982J1427k1989L1582N3489o325P973m3593m1667
$$ -1257 -17669 -13390 -5520 -32853 -16871 -5444 -27433 4149 57638 51313 59286 15693 -25974
21201b5974j1953n257m311O489j1248L3016k813j732K4809K292m428K955n071
$$ -25974 -37927 -43184 -47495 -41006 -52254 -19238 -22051 -23783 1026 3318 -1110 1845 -3226
21188c226J0563j2219j8N792L87p516K6956J7854k0267k0128l2939p007M948O742
$$ -3226 7337 -4882 -4900 892 1279 -6237 20719 38573 18306 -1822 -34761 -41768 -36820 -30078
21174c0078J429j413M983K6776J45q002l3309q866J7157K3392K734J0070k1980
$$ -30078 -28649 -30062 -25079 1697 1842 -6160 -39469 -48335 -31178 -7786 -5052 5018 -16962
21161a6962J4178K8761K1751J389k0051m2360l738L5838l35M289J611L2764j2500
$$ -16962 -2784 25977 47728 49117 29066 -13294 -17032 18806 18471 22760 24371 57135 44635
21148D4635N224k1813k4058J7562K1269l407k2410n0558k2456M3205M4323K652
$$ 44635 49859 28046 3988 21550 42819 39412 17002 -33556 -56012 -12807 31516 34168
21136C4168J6233J789l0665j6209K5003L4239j155l0765j2518o156J7375L010
$$ 34168 50401 52190 21525 5316 30319 64558 63403 32638 20120 13964 31339 34349
21124C4349l6426j870j7634M869K5898J8880K2941j5985J496n036k398j6412Q059
$$ 34349 -2077 -3947 -21581 -16712 9186 28066 51007 35022 36518 31482 29084 12672 20731
21111B0731L4357P951k6609j6915j5770K7410J4844k9558L0925K8625p970L674
$$ 20731 55088 63039 36430 19515 3745 31155 45999 16441 47366 75991 68021 71695
21099G1695J6544N754J733j7586q619k8568j2690J2223P075K2948j7215m169N296
$$ 71695 88239 93993 95726 78140 69521 40953 28263 40486 47561 70509 53294 49125 54421
21086E4421J6276n989j4691k3165j626j709N587k2589j6565J0351K4637M9290
$$ 54421 70697 64708 50017 26852 25226 23517 29104 6515 -10050 301 24938 74228
21074G4228p837k1668j3151k9521m1528L3639L1586j1251k1866p689j2548L823
$$ 74228 66391 44723 31572 2051 -39477 -5838 25748 14497 -7369 -15058 -27606 -23783
21062b3783K29k3088K935p832J0373O632M1751O458j1975l7981k6487K769J3342
$$ -23783 -23554 -46642 -43707 -51539 -41166 -34534 7217 13675 1700 -36281 -62768 -59999 -46657
21049d6657L2406k1523l6667l999N9771L3244J6098J122k4206J013K0120M5980
$$ -46657 -14251 -35774 -72441 -76440 -16669 16575 32673 33795 9589 10602 30722 76702
21037G6702J8308j3662m5676q95N964M2355j6036m9755j098K7013L7502J6858
$$ 76702 95010 81348 35672 34777 40741 83096 67060 17305 16207 43220 80722 97580
21025I7580k9093m2200o619O850L3255m0191r951J6865m863j4277k1363K8051
$$ 97580 68487 26287 19668 26518 59773 19582 9631 26496 21633 7356 -14007 14044
21013A4044r852j022M762P891J560K5969r366l5025k2134J3282K1151L1558J2299
$$ 14044 4192 3170 7932 15823 17383 43352 33986 -1039 -23173 -9891 11260 42818 55117
21000E5117J9930Q908J1892o479j3392K698l1758l8346j0200j556l185q3k958
$$ 55117 75047 83955 95847 89368 75976 78674 46916 8570 -1630 -3186 -6371 -6454 -9412
20987i412J1801N529L8819k912l1932k1664K3528L5990N309J8668j1455r599p603
$$ -9412 2389 7918 46737 43825 11893 -9771 13757 49747 55056 73724 62269 52670 45067
20974D5067M12P694l713p870n949k2437k3386j5467K456K5564r397K4438J22m8246
$$ 45067 45479 53173 49460 41590 35641 13204 -10182 -25649 -23193 2371 -7026 17412 17534 -30712
20960c0712l2036o810L0449L8546l95j7423K113L6976K5272j5657K859N4199l728
$$ -30712 -62748 -69558 -39109 -563 -958 -18381 -16268 20708 45980 30323 33182 87381 83653
20947H3653k5475J5536L3070j9819k8719j8480n608j4237P046M371K38k4596m310
$$ 83653 58178 73714 106784 86965 58246 39766 34158 19921 26967 31338 31576 6980 2670
20934B670k1591M1671J1598j5893J0647n641k7440N713L0958Q1508j8834j9050
$$ 2670 -18921 22750 34348 18455 29102 23461 -3979 1734 32692 114200 95366 76316
20922G6316k4464k3549L669J2345r213k593L699j933l107k0382K3565j977O231
$$ 76316 51852 28303 31972 44317 35104 32511 36210 34277 31170 10788 34353 32376 38607
20909C8607k3437k37M647j218l34J6391J7005R453k4989k1704m116K4300j0293
$$ 38607 15170 14933 19580 18362 18028 34419 51424 60877 35888 14184 10068 34368 24075
20896B4075j5715j3172k1074m1515K4397M5445K7996m383l0906p11j1216k5504
$$ 24075 8360 -4812 -25886 -67401 -43004 2441 30437 26054 -4852 -5563 -16779 -42283
20884d2283k5036K6743k781K3594L5117K3553q712k98o151Q271k4016m5039L9974
$$ -42283 -67319 -40576 -43357 -19763 15354 38907 30195 29897 23746 32017 8001 -37038 2936
20871B936M5561R943j6158N081J7159l1054k9618j2366j2561J8298K3500M7474
$$ 2936 48497 58440 42282 47363 64522 33468 3850 -8516 -21077 -2779 20721 68195
20859F8195q719n8156l364L249J7898K685k112p254m883K2012L3074P903k5372
$$ 68195 59476 1320 -2044 1205 19103 21788 19676 12422 7539 29551 62625 70528 45156
20846D5156M041R682M68j6972J1807l1529j9129m037j2715L542K5696L5023j7342
$$ 45156 49197 58879 59347 42375 54182 22653 3524 -513 -13228 -9686 16010 51033 33691
20833C3691j2582L1340l9316k5466L1124r670l4919k5275j2224M0820L9125k133
$$ 33691 21109 52449 13133 -12333 18791 9121 -25798 -51073 -63297 -22477 16648 14515
20821A4515K47l5672k6459J471K524j0939M5009L1099j2185m6502j2336M4932
$$ 14515 14762 -20910 -47369 -45898 -43374 -54313 -9304 21795 9610 -36892 -49228 -4296
20809d296L9624L1615J3296L395j8814l0260k5644K9317K3352j660l9683j8942
$$ -4296 35328 66943 80239 83634 64820 34560 8916 38233 61585 59925 20242 1300
20797A300N940j293J5323J5784P461J9J7073l7362J2366L1630m8780j1792J0928
$$ 1300 7240 5947 21270 37054 44515 44534 61607 24245 36611 68241 19461 7669 18597
20784A8597l3763O53M6612K2137l117p335J4712J9610j2555n6424K408J6147K100
$$ 18597 -15166 -14513 32099 54236 51119 43784 58496 78106 65551 9127 11535 27682 29782
20771B9782J4014K3239k6141k2933J9181O422j6943j8089K2945K0235k1624j6808
$$ 29782 43796 67035 40894 17961 37142 43564 26621 8532 31477 51712 30088 13280
20759A3280k3141K6372j6898j9785n367J5804K9547K3445L1967k2930k9611l6966
$$ 13280 -9861 16511 -387 -20172 -25539 -9735 19812 43257 75224 52294 22683 -14283
20747a4283O314L4697R376J8898K180k2852j7959J2606J1692k3083R706N759K9960
$$ -14283 -7969 26728 36104 55002 57182 34330 16371 28977 40669 17586 27292 33051 63011
20734F3011j6374J8899J3420j7132q721Q875k3357j9881o035m375j7292k9394
$$ 63011 46637 65536 78956 61824 53103 61978 38621 18740 12705 8330 -8962 -38356
20722c8356J5301J6907J7623M3194j6688r326L4479J6503q681k7429j9876J4158
$$ -38356 -23055 -6148 11475 54669 37981 28655 63134 79637 70956 43527 23651 37809
20710C7809p642j4217M6682J816n052l1041m3528O276J903R418k3621Q187L6824
$$ 37809 30167 15950 62632 64448 59396 28355 -15173 -8897 -6994 2424 -21197 -13010 23814
20697B3814K4260j2445j1251j4469L9599K3471j6465j7506k6023j9162o023J2039
$$ 23814 48074 35629 24378 9909 49508 72979 56514 39008 12985 -6177 -12200 -161
20685a61k6782j7815R283K2512M4966L451n72J5215j559o1773m3758j2155K0745
$$ -161 -26943 -44758 -35475 -12963 32003 35454 34882 50097 48538 -13235 -56993 -69148 -48403
20672d8403O0202M3373K3538o237k8593l7688l062L6660p219j9741R0o249J427
$$ -48403 11799 55172 78710 72473 43880 6192 3130 39790 32571 12830 12920 6671 8098
20659H098J0617O195k1941K1286J0405m577o376L3402M855n09o640N313k8907
$$ 8098 18715 24910 2969 24255 34660 30083 23707 57109 61964 61455 54815 60128 31221
20646C1221J825J4812k0144l791k4598J3601K4851l010o1832k0554M4827K6161
$$ 31221 33046 47858 27714 23923 -675 12926 37777 34767 -27065 -47619 -2792 23369
20634B3369K7468l974j2218j4577R694l5736l0536k30K70Q965k487k2288j9920
$$ 23369 50837 46863 34645 20068 29762 -5974 -36510 -36740 -36470 -27505 -29992 -52280 -72200
20621g2200K8476L8638K4749J1450j8483r099K3499R219J5929k496j4150j0583
$$ -72200 -43724 -5086 19663 31113 12630 3531 27030 36249 52178 49682 35532 24949
20609B4949m905J5322J9373j2468j191J1057M8914K4668k9903o0118j1952K3251
$$ 24949 20044 35366 54739 42271 41080 52137 101051 125719 95816 35698 23746 46997
20597D6997K145P874j4851J2035J5821o2082j5057K7344o437K388J1926J6927
$$ 46997 49142 57016 42165 54200 70021 7939 -7118 20226 13789 16177 28103 45030
20585D5030J1850J2402J5528l023k5761J0063J5936k4375P399O1729k5995n7179
$$ 45030 56880 69282 84810 81787 56026 66089 82025 57650 65049 126778 100783 43604
20573D3604j9559K0809K2395P238L765J8122r764k7330k4378r191J5469q774P537
$$ 43604 24045 44854 67249 74487 78252 96374 86610 59280 34902 25711 41180 32406 39943
20560C9943p231J0353P32j2689l9768j1388K0674K565K739K4716k197j0379j3480
$$ 39943 32712 43065 43797 31108 -8660 -20048 626 3191 5930 30646 28449 18070 4590
20547D590J0330j7481O403J5059J3309j9096j4577R144J7065j1547n743K696m658
$$ 4590 14920 -2561 3842 18901 32210 13114 -1463 7681 24746 13199 7456 10152 5494
20534E494M744K4302l3261l7042M5228L6069n258Q072K3198J4163k2576j679K5551
$$ 5494 10238 34540 1279 -35763 9465 45534 40276 48348 71546 85709 63133 61454 87005
20521H7005J1257r628j7883l4295N125o278j4686l4830M379J9343L5038r876j5709
$$ 87005 98262 88634 70751 36456 41581 35303 20617 -14213 -9834 9509 44547 34671 18962
20508A8962M695K2097n713k6968m020j5635j3727o80j7866J2966K4337Q880L0511
$$ 18962 23657 45754 40041 13073 9053 -6582 -20309 -20989 -38855 -25889 -1552 7328 37839
20495C7839r187j4683M97Q646J2294Q085K3826j8730j3309O739R854m277j6642
$$ 37839 28652 13969 14466 23112 35406 43491 67317 48587 35278 42017 51871 47594 30952
20482C0952J6458l5347l4788M988K5656M033j1397j0910l1652L5947K258k1390
$$ 30952 47410 12063 -22725 -17737 7919 11952 555 -10355 -42007 -6060 -3802 -25192
20470b5192P025K7296L752K1509L5277o008l7011J951M988k2870Q545K8343l595
$$ -25192 -18167 9129 12881 34390 69667 63659 26648 28599 33587 10717 19262 47605 44010
20457D4010L199J7587K1721j103j5801r872o511k476l1530K3408N529K080J2289
$$ 44010 47209 64796 86517 85414 69613 59741 53230 50754 19224 42632 48161 50241 62530
20444F2530l5820j0313K5068n833J2195K8565j147o110K589K275l9771M98K8654
$$ 62530 26710 16397 41465 35632 47827 76392 75245 69135 71724 73999 34228 34726 63380
20431F3380k625j0295M910l261k0657J6161P444L701q383l4449l9009j9308J5168
$$ 63380 60755 50460 55370 52109 31452 47613 55057 58758 50375 15926 -23083 -42391 -27223
20418b7223P4362L8571n8689j1903J0652j7413m008L1105J6783J6155L13k5635
$$ -27223 47139 85710 27021 15118 25770 8357 4349 35454 52237 68392 68705 43070
20406D3070J817K4550L37l110j1269l7356j0612q72j5115J4628J7597K4443j4342
$$ 43070 44887 69437 69774 66664 55395 18039 7427 6555 -8560 6068 23665 48108 33766
20393C3766J0384m177k8575m1148j9176M3750L7349l29N274O836J9998j9199k5640
$$ 33766 44150 39973 11398 -29750 -48926 -5176 32173 31844 37118 43954 63952 44753 19113
20380A9113R624N119j6766l8791k7371Q069L1658J3101j8585o255M7142J3584
$$ 19113 28737 33856 17090 -21701 -49072 -41003 -9345 3756 -14829 -21084 26058 39642
20368C9642J7853M126L948j2664k8050j9077K2452K1098K3869n690o0836l3287
$$ 39642 57495 61621 65569 52905 24855 5778 28230 49328 73197 67507 6671 -26616
20356b6616J5269K6679J5416L724k2199k2373N944O742p443l20J583K5698Q950
$$ -26616 -11347 15332 30748 34472 12273 -10100 -4156 2586 -4857 -5177 -3594 22104 31054
20343C1054K6959J0157n1050k7839K4221M5589J261j3008J8041j7945J0721K8702
$$ 31054 58013 68170 17120 -10719 13502 59091 60352 47344 65385 47440 58161 86863
20331H6863O816k4234p482o288n132K084Q566K2093j2209j0173j6819L510L2956
$$ 86863 93679 69445 61963 55675 50543 52627 61193 83286 71077 60904 44085 47595 80551
20318H0551k3211k8627K9867J1143q986M30j365M534Q918k3554m2059k2664R825
$$ 80551 57340 28713 58580 69723 60737 61167 59802 64336 73254 49700 7641 -15023 -5198
20305e198R248K5073K1136K1224j0380n770Q3k1704M823J3575J0043N820j8576
$$ -5198 4050 29123 50259 71483 61103 55333 55416 33712 38535 52110 62153 67973 49397
20292D9397k6328l2009j3418J0105J3296m285L0030J1463k1501k5319p502K3284
$$ 49397 23069 -8940 -22358 -12253 1043 -3242 26788 38251 16750 -8569 -16071 7213
20280G213J4323L1627j809J0332K0253o643Q472j3688l7866l8104N987K5920K0326
$$ 7213 21536 53163 51354 61686 81939 75296 83768 70080 32214 -5890 97 26017 46343
20267D6343L3638L555j9537r585K1219K5571j4229N37j2045K4767j9804j7443
$$ 46343 79981 83536 63999 54414 75633 101204 86975 87512 75467 100234 80430 62987
20255F2987n970q48L2548j2526j6536l2422J5656R826j3351l058j8108J7238J5986
$$ 62987 57017 56169 88717 76191 59655 27233 42889 52715 39364 36306 18198 35436 51422
20242E1422K7713M838l030j0464N967r738K5653k242L647m0570k286J1526J4035
$$ 51422 79135 83973 80943 70479 76446 66708 92361 90119 93766 53196 50910 62436 76471
20229G6471R655k7982P383n858j3961J7300K221k586k5292L6633J1173O011J2354
$$ 76471 86126 58144 65527 59669 45708 63008 65229 62643 37351 73984 85157 91168 103522
20216A03522J1869j4400k8322P76N333k5589n807k972Q641O627J2586K9073j2349
$$ 103522 115391 100991 72669 73445 78778 53189 47382 44410 53051 59678 72264 101337 88988
20203H8988k4516j5533q31j2818J9437J75k7139N688j8685l945K4178J3642J3013
$$ 88988 64472 48939 48108 35290 54727 54902 27763 33451 14766 10821 34999 48641 61654
20190F1654J2613n534o055j7836J4799N411l786k6094r684K3922J7361M299k1357
$$ 61654 74267 68733 62678 44842 59641 65052 61266 35172 25488 49410 66771 71070 49713
20177D9713o5972k7211K6911J2002j1012m024n549L3218O8125r426l1226k6356
$$ 49713 -16259 -43470 -16559 -4557 -15569 -19593 -25142 8076 76201 66775 35549 9193
20165I193j0918j990j356J4627M8191Q806m6165k6230n103L2100J4402J6215j845
$$ 9193 -1725 -3715 -5071 9556 57747 66553 20388 -5842 -10945 21155 35557 51772 49927
20152D9927P831k1396j6374J462l788k595J5293L335O317O830j2451k4135J3049
$$ 49927 57758 36362 19988 21450 17662 15067 30360 33695 40012 46842 34391 10256 23305
20139B3305J6506K5668q581j4580j075k6720o026j660J6779J2530N4227J9786
$$ 23305 39811 65479 56898 42318 41243 14523 8497 6837 23616 36146 90373 110159
20127A10159m7822m0386r751k012j0820m368K5987K1419l978k7575M0383M5151
$$ 110159 62337 21951 12200 10188 -632 -5000 20987 42406 38428 10853 51236 96387
20115I6387n094k018j2031l8878M1474K6166o404K3679j5525o4266k9594J8504
$$ 96387 91293 89275 77244 38366 79840 106006 99602 123281 107756 43490 13896 32400
20103C2400L419k2683L3019K5397J4084J8862P806O557o687l7116p484J9098M0631
$$ 32400 35819 13136 46155 71552 85636 104498 112304 118861 112174 75058 67574 86672 127303
20090A27303j2119l8538m9957p344J3290j8035L615K2104L4441J6070j7434K1269
$$ 127303 115184 76646 26689 19345 32635 14600 18215 40319 74760 90830 73396 94665
20078I4665l2513l5199L9363K8004j3888m993o130j3734k9240j1242M273M272
$$ 94665 62152 26953 66316 94320 80432 75439 69309 55575 26335 15093 19366 23638
20066B3638K2868p338M704j4300j4842J9263R54j083m4513l711K4735j802j3404
$$ 23638 46506 39168 43872 29572 14730 33993 34947 33864 -10649 -14360 10375 8573 -4831
20053d831l0800j6498P7348J2446l1906L5800J6191n835l1981K0639J8549J7353
$$ -4831 -35631 -52129 25219 37665 5759 41559 57750 51915 19934 40573 59122 76475
20041G6475o692l0940j8898L6895Q157k0470M549O848r828r592m610J544K4088
$$ 76475 69783 38843 19945 56840 64997 44527 49076 55924 46096 36504 31894 33438 57526
20028E7526O550j7382j0533k2109k3536K267M3268J6830J6557K2143j516K6597
$$ 57526 64076 46694 36161 14052 -9484 -7217 36051 52881 69438 91581 90065 116662
20016A16662N896m671j7819k7244Q726J2035j9346o348J0225P421K2072j7100
$$ 116662 122558 117887 100068 72824 81550 93585 74239 67891 78116 85537 107609 90509
20004I0509k9468m797j4458j2536r123k1208j6759K2567l578K2145j2588K0892
$$ 90509 61041 56244 41786 29250 20127 -1081 -17840 4727 1149 23294 10706 31598
19992C1598j1650j4955J3033L505K0377L7608q741r333j4032n24m91P409J2023
$$ 31598 19948 4993 18026 21531 41908 79516 70775 61442 47410 46886 46395 53804 65827
19979F5827J1509k0188m5688r04K3973j5423J8175r943J3751K8049j049m07j3854
$$ 65827 77336 57148 11460 10556 34529 19106 37281 27338 41089 69138 68089 67682 53828
19966E3828N655k4398o884M408L2649N989r762J9543J8889j8258N121J6956J6243
$$ 53828 59483 35085 28201 32609 65258 71247 61485 81028 99917 81659 86780 103736 119979
19953A19979l5035j8358M343N323O636k3926L317l3757j0837l595j001k503k2718
$$ 119979 84944 66586 70929 76252 82888 58962 62279 28522 17685 14090 13089 10586 -12132
19940a2132Q993J2350k9018J5791L5649J3658J6118J9503L0854p372l5592k9038
$$ -12132 -3139 9211 -19807 -4016 31633 45291 61409 80912 111766 104394 68802 39764
19928C9764r621K2801K7918L0836r204k9790k7722R79R379J5621o604q435n82
$$ 39764 30143 52944 80862 111698 102494 72704 44982 45961 55340 70961 64357 55922 55340
19915E5340r74K0947l3454j4548K2071M1864L9896J0185j6197l4225j3956k6463
$$ 55340 54366 75313 41859 27311 49382 91246 131142 141327 125130 90905 76949 50486
19903E0486l6819K3231M720J8613L154K2901J4046j7501k222j0186j859J033M0811
$$ 50486 13667 36898 41618 60231 63385 86286 100332 82831 80609 70423 68564 69597 110408
19890A10408j8924l3354j7235m163M2159r3N075K933j3238Q32L5315L170J3629
$$ 110408 91484 58130 40895 36732 78891 78798 83873 86806 73568 74400 109715 112885 126514
19877A26514l9632k9421R276j4396k0587l378J1771J6m34R439P864N584J3548
$$ 126514 86882 57461 66737 52341 31754 28376 40147 40163 39729 49168 57032 62616 76164
19864G6164Q780l3611o370L1340L0833m030k9478j1911j020j5703l4762J4838
$$ 76164 84944 51333 44963 76303 107136 103106 73628 61717 60697 44994 10232 25070
19852B5070K9428k143k190r009J5147N478J906K914K0644J695k6573k1196L346
$$ 25070 54498 52355 50165 41156 56303 61781 63687 66601 87245 88940 62367 41171 44517
19839D4517J4136J3898j548J458r772R281r2L71k390K968j6508q897J6611J4425
$$ 44517 58653 72551 71003 72461 62689 71970 71878 72249 69859 72827 56319 47422 64033 78458
19825G8458J0518n153j3098j6577j3636J1748p425J3479l0725k495j6684M0406
$$ 78458 88976 83823 70725 54148 40512 52260 44835 58314 27589 25094 8410 48816
19813D8816j160J306L6399M803k6722k0124j0913j1567p262Q145J1570K8740k7593
$$ 48816 47656 48962 85361 90164 63442 43318 32405 20838 13576 21721 33291 62031 34438
19800C4438k5532j164N0334r011J8740k268j2256L1603J0286j0063k653J7556
$$ 34438 8906 7742 58076 49065 67805 65537 53281 84884 95170 85107 82454 100010
19788A00010j0642l864j030j3485J7240j8675N51K6373n360l8274J6860J1563
$$ 100010 89368 85504 84474 70989 88229 69554 70105 96478 91118 52844 69704 81267
19776H1267r586L9221l375n011r657r582m7266k689L372j2439K1987K0269M173
$$ 81267 71681 110902 107527 102516 92859 83277 36011 33322 36694 24255 46242 66511 70684
19763G0684Q215O286M4114N417k2139k3099R009q622q246j949k6912J0912N272
$$ 70684 78899 85185 129299 134716 112577 89478 98487 89865 81619 79670 52758 63670 68942
19750F8942K5008Q153q887j5944o0322j7000L9535K6449p435K0098K7870K5218
$$ 68942 93950 102103 93216 77272 16950 -50 39485 65934 58499 78597 106467 131685
19738A31685k5002j6048k8226j55j1449N222J1513J142j3008k275K3783J4652
$$ 131685 106683 90635 62409 62254 50805 56027 67540 68682 55674 53399 77182 91834
19726I1834l8346q072J643J4179j462N000J1825K0263j3391j6871j1149J2152
$$ 91834 53488 45416 47059 61238 59776 64776 76601 96864 83473 66602 55453 67605
19714F7605J7809k5739k6691n752p770L6344L5054L5236J574k6675k1054K9376
$$ 67605 85414 59675 32984 27232 19462 55806 90860 126096 127670 100995 79941 109317
19702A09317N555m4155p39K2177q946k6445o780K2767K3490K0877j6120l2557
$$ 109317 114872 70717 69978 92155 83209 56764 49984 72751 96241 117118 100998 68441
19690F8441j3139l498O355L5061K3206k795j9869k4542k4965n973J3158J91Q704
$$ 68441 55302 51804 58159 93220 116426 113631 93762 69220 44255 38282 51440 51631 60335
19677F0335M852j0589J4764J8784j1503j3097P205J1486n974K5330K2181r471
$$ 60335 65187 54598 69362 88146 76643 63546 70751 82237 76263 101593 123774 114303
19665A14303n202l9566J1039J6038J2656k3889J463Q125J1893J5158o817r933
$$ 114303 109101 69535 80574 96612 109268 85379 86842 94967 106860 122018 115201 105268
19653A05268j5560j8053L3316J3440Q959k162k0730M586j7467j1505O660j4412
$$ 105268 89708 71655 104971 118411 127370 125208 104478 109064 91597 80092 86752 72340
19641G2340j8649q23P371K3115R794k812m1131J9470O7603j8841k3509M944J6459
$$ 72340 53691 52868 60239 83354 93148 90336 49205 68675 136278 117437 93928 98872 115331
19628A15331L0239k1798j9792J5403k4459k6872N479J0707L9074M070k9320k3300
$$ 115331 145570 123772 103980 119383 94924 68052 73531 84238 123312 127382 98062 74762
19616G4762m2547j5861M0832L6069P87j6839J8610J8168n68k0150l948j4460J0990
$$ 74762 32215 16354 57186 93255 94042 77203 95813 113981 113413 93263 89315 74855 85845
19603H5845O045k9800K9030M2806k0300k8737J6998m090l4998j8702j4092L0944
$$ 85845 91890 62090 91120 133926 113626 84889 101887 97797 62799 44097 30005 60949
19591F0949o944k9814R196L2144N696l4777j821M589K4894K5802K111K5013j3404
$$ 60949 54005 24191 33387 65531 71227 36450 34629 39218 64112 89914 92025 117038 103634
19578A03634o932K6805J3098J1425j9291q385j8728j9061l305L076n077j9845
$$ 103634 96702 123507 136605 148030 128739 120354 101626 82565 79260 82336 77259 57414
19566E7414o26K2609j2138j682m082o299M771j1662J363L0802N7106K6848k5073
$$ 57414 56788 79397 67259 65577 61495 55196 59967 48305 49668 80470 137576 164424 139351
19553A39351k6757R11P505m7796j202J0676j608L059j1710J6708M2924n565k3210
$$ 139351 112594 113505 121010 73214 72012 82688 81080 84139 72429 89137 132061 126496 103286
19540A03286j0112J6252L5333M7290l8519n6771p64P615j6502j7001J8264q589
$$ 103286 93174 109426 144759 192049 153530 96759 95995 103610 87108 70107 88371 79782
19528G9782L858q579K8166M6478L592m1180k4608r691M4691O146n621r974M417
$$ 79782 83640 75061 103227 149705 153297 112117 87509 77818 122509 128655 123034 113060 117477
19515A17477K6903k6601k3490j6219J6620K3523J8968j158P384J8230K9618j4068
$$ 117477 144380 117779 94289 78070 94690 118213 137181 136023 143407 161637 191255 177187
19503A77187l6832Q144L784J6819k5626j4021k2993J6366L9874J1837j2160n5067
$$ 177187 140355 148499 152283 169102 143476 129455 106462 122828 162702 174539 162379 107312
19491A07312R055P726Q245j8598j6338L976L088J089J8867L3289J4538j7825j4875
$$ 107312 116367 124093 132338 113740 97402 101378 104466 105555 124422 157711 172249 154424 139549
19478A39549j4971l1773k6076K1551J4802J9541L8325N364j7681k8875j1513J906
$$ 139549 124578 92805 66729 88280 103082 122623 160948 166312 148631 119756 108243 110149
19466A10149q475j5175R539K1385J2905p68J3397m699J4423j2943j8237Q034m1128
$$ 110149 101674 86499 96038 117423 130328 129560 142957 138258 152681 139738 121501 129535 88407
19453H8407m602L2446l284K674J4355k5491k6710L1219J6219j991M1309M1286
$$ 88407 83805 116251 112967 115641 129996 104505 77795 109014 125233 123242 164551 205837
19441B05837m3520q587O943k2316m2285L3045R266j1582J1181M026m3982k4058
$$ 205837 162317 153730 160673 138357 96072 129117 138383 126801 137982 142008 98026 73968
19429G3968p67K4635L1653J0701l1238k7049L3205N321o51P838K2525J2267L308
$$ 73968 73201 97836 129489 140190 108952 81903 115108 120429 119778 127616 150141 162408 165716
19416A65716j8546J034K6350k2398k6156k7309j804J6282m342j8801j62L7508
$$ 165716 147170 148204 174554 152156 126000 98691 96887 113169 108827 90026 89864 127372
19404A27372N378m203k614J956M985j6537K5656K35K045O815o183n480P836J8737
$$ 127372 132750 128547 125933 127889 132874 116337 141993 142228 144273 151088 144905 139425 147261 165998
19390A65998m735j9477m156m956j6412O95J1804K1167j3708j372J0284K7359k4284
$$ 165998 161263 141786 137630 132674 116262 116957 128761 149928 136220 134848 145132 172491 148207
19377A48207l0939K9543L3110j6033k0997o751k0246J5606K4798J2127k851j2114
$$ 148207 117268 146811 179921 163888 142891 136140 115894 131500 156298 168425 165574 153460
19365A53460q705L860j4743k5409k3833K8534L4161j2460n632K1556N428J1695
$$ 153460 144755 148615 133872 108463 84630 113164 147325 134865 129233 150789 156217 167912
19353A67912r549K4035j4831n9921k1658N6911K9299n409k6699K897j7887o37
$$ 167912 158363 182398 167567 107646 85988 142899 172198 166789 140090 142987 125100 124463
19341A24463n100j7324J1317J8077J3521K7749J2184r116j8181m5408l4665J2940
$$ 124463 119363 102039 113356 131433 144954 172703 184887 175771 157590 112182 77517 90457
19329I0457O793L950j3566K1577L682L652j9599j4152L9720K2650l7045J1069
$$ 90457 97250 101200 87634 109211 112893 116545 96946 82794 122514 145164 108119 119188
19317A19188P045k0733k1046J6035Q112j4406L5682J8888l535J1325N075k464
$$ 119188 126233 105500 84454 100489 108601 94195 129877 148765 145230 156555 161630 159166
19305A59166j8798p300J2286k711K1757L3633o867j7832L95J0446k021K2898m07
$$ 159166 140368 133068 145354 142643 164400 198033 191166 173334 173729 184175 182154 205052 204645
19292B04645k2540l268J604J5604L6271l3746l5015L4242K3509j7998m1574J4085
$$ 204645 182105 178837 180441 196045 232316 198570 163555 197797 221306 203308 161734 175819
19280A75819j3341J5086j8844j0405k7794K5178L7021M6228J6226l395k0056K669
$$ 175819 162478 177564 158720 148315 120521 145699 182720 228948 245174 241779 221723 224392
19268B24392K0K5305L0871M7197M00K1231L2218O7843O4303M7169J10034J06465
$$ 224392 224412 249717 280588 327785 328185 349416 381634 449477 513780 560949 670983 777448
19256G77448J04305J12992J18693N2201M9296L1359Q03k5272j21538j45140j21804
$$ 777448 881753 994745 1113438 1165639 1214935 1246294 1247097 1221825 1100287 955147 833343
19245H33343q2958m9026j4791l7557l5990l447J7596K1121O950O0087J05698J48145
$$ 833343 750385 701359 686568 649011 613021 609574 627170 648291 655241 715328 821026 969171
19233I69171J39006R0058O7644Q1181L8136K4439n6832q9794j35072j57211j56304
$$ 969171 1108177 1198235 1265879 1347060 1385196 1409635 1352803 1263009 1127937 970726 814422
19222H14422r1990o4565q1948o5058k9774n1498l2412L486Q572m322k7120m7292
$$ 814422 722432 657867 575919 510861 481087 429589 397177 400663 409235 404913 377793 330501
19210C30501j8184n583L811J9796p004k6161j0965K537J2860N486J7350m514j3468
$$ 330501 312317 306734 310545 330341 323337 297176 286211 288748 301608 307094 324444 319930 306462
19197C06462j3821l75L96K9608k817k2877k6564l747j7106j891N7402l0917l3187
$$ 306462 292641 292266 292662 322270 319453 296576 270012 266265 249159 247268 304670 273753 240566
19184B40566j0323j1792O595p04L059J366J3093j7665q699p668M384M335L1991
$$ 240566 230243 218451 225046 224342 227401 228767 241860 224195 215496 207828 212212 216547 248538
19171B48538M090j8261J7066j2576m8384k8068L9912N3882j3515q394m1424O647
$$ 248538 252628 234367 251433 238857 190473 162405 202317 256199 242684 234290 192866 199513
19159A99513q44R382L1745M9294l634l1923j9523j5982J0469l491k083q624J574
$$ 199513 198669 208051 239796 289090 285456 253533 234010 218028 228497 225006 222923 214299 215873
19146B15873Q043q52K813K1698O4J8426J4604o2713m2253J4942q690l1024k081
$$ 215873 223916 223064 225877 247575 247639 266065 280669 217956 175703 190645 181955 150931 148850
19133A48850J2435O1475K0273j9802k8315k0588j7843j7699k957o533K920K8498
$$ 148850 161285 222760 243033 223231 194916 174328 156485 138786 135829 129296 132216 160714
19121A60714K9816R222J5872O138J0809J6609J5374r448o383J8906J0777N858
$$ 160714 190530 199752 215624 221762 232571 249180 264554 255106 248723 267629 278406 284264
19109B84264k6827j4657k749J310K3711L4700J0463k3904k2938K766O233L93L1885
$$ 284264 257437 242780 240031 241341 265052 299752 310215 286311 263373 266139 272372 272765 304650
19096C04650j8682M80j1416r669L914L6729K4530N451k4173l3956O145l744j5696
$$ 304650 285968 286448 275032 265363 269277 306006 330536 335987 311814 277858 284003 280259 264563
19083B64563q092j3688k5570J9418K9121l884J8737J5439O353l625J0615l1642
$$ 264563 256471 242783 217213 236631 265752 261868 280605 296044 302397 298772 309387 277745
19071B77745j969j0793l4462j7724L1071K6601n975k0858j4256K9597L2294q970
$$ 277745 275776 264983 230521 212797 243868 270469 264494 243636 229380 258977 291271 282301
19059B82301j5915R128O714J9327j495m5492j1566J6652k759j2609k6903M2297
$$ 282301 266386 275514 282228 301555 300060 254568 243002 259654 256895 244286 217383 259680
19047B59680L3637j1535l9213p751J9812K7824k3986j1080n460j1072P095N521
$$ 259680 293317 281782 242569 234818 254630 282454 258468 247388 241928 230856 237951 243472
19035B43472j824K796L0994N0272J3347j9237N106j000l2207J265q973M116J0078
$$ 243472 241648 244444 275438 325710 339057 319820 324926 323926 291719 292984 284011 288127 298205
19022B98205M6650r381m186j1061j5543k2917k2488L2099k3078n095o071O299
$$ 298205 344855 335474 331288 320227 304684 281767 259279 291378 268300 263205 257134 263433
19010B63433R123P262J977o204K2663J0950L8075j9810k2780k9007L355L0859
$$ 263433 272556 279818 281795 275591 298254 309204 347279 327469 304689 275682 279037 309896
18998C09896q176j3452m1377J2763K042k6738J6948J5177m973J1192k6317j8394
$$ 309896 301720 288268 246891 259654 261696 234958 251906 267083 262110 273302 246985 228591
18986B28591L3011K030k640j6835j6235M2792L2331j7965K969N036k316L0001
$$ 228591 261602 263632 260992 244157 227922 270714 303045 285080 288049 293085 290769 320770
18974C20770K9449J4194m1601k9590j6581O754L7957R8J0943J4721j701k0423
$$ 320770 350219 364413 322812 293222 276641 283395 321352 321450 332393 347114 345413 324990
18962C24990n3790p687k839J4768M967J199K5150J7136k669k517j2270J767L3169
$$ 324990 271200 263513 260674 275442 280409 281608 306758 323894 321225 318708 306438 308205 341374
18949C41374j650p436J6937k3620j1201p223k1355k9062N031L0216K9130o065
$$ 341374 339724 332288 349225 325605 314404 307181 285826 256764 261795 292011 321141 315076
18937C15076r251l4690k7865j66l349J2263L4119j0725J3051M2875M0085J1977
$$ 315076 305825 271135 243270 243104 239755 252018 286137 275412 288463 331338 371423 383400
18925C83400K7572l3906k3241j1995k354k3363p600m447K4579N2446K1947j385
$$ 383400 410972 377066 353825 341830 339476 316113 308513 304066 328645 381091 403038 401653
18913D01653N275K947Q104K3878J0138k1895M2595M5063K2342j0899l8736n4753
$$ 401653 406928 409875 417979 441857 451995 430100 472695 517758 540100 529201 490465 435712
18901D35712k275K0510K8503p130P413Q134j7329j5684N2631J0245J2768P882
$$ 435712 433437 453947 482450 475320 482733 490867 473538 457854 510485 520730 533498 541380
18889E41380L2449j6583j2447P4324K4741k9633l9351o961J688O0178O044n6086
$$ 541380 573829 557246 544799 619123 643864 614231 574880 567919 569607 629785 635829 579743
18877E79743j0418q31j4124M661j5628k2788j6644j1593K9130K9044J6109l996
$$ 579743 569325 568494 554370 559031 543403 520615 503971 492378 521508 550552 566661 562665
18865E62665K0267m393n9238J5662J4180k7310J1516K993k578P778Q801p937J3427
$$ 562665 582932 578539 519301 534963 549143 521833 533349 536342 533764 541542 550343 542406 555833
18852E55833p729n7268j7215M52K2132j7235q265J8481L2791J4251j954l3245
$$ 555833 548104 490836 473621 474073 496205 478970 470705 489186 521977 536228 534274 501029
18840E01029o610l4965k7167K4077L0336p900j8347P1906M6437k065k1070J360
$$ 501029 494419 459454 432287 456364 486700 478800 460453 532359 578796 576731 555661 557021
18828E57021K8484l4298j5846K0625j203m537J6168k981k6613j869P906k4262
$$ 557021 585505 551207 535361 555986 554783 550246 566414 563433 536820 534951 542857 518595
18816E18595J7132J3068J5874K0759J9082L77M643L2139L2339K3040r122q473
$$ 518595 535727 548795 564669 585428 604510 604887 609530 641669 674008 697048 687926 679453
18804F79453m559m299J9026K1940J9877J9523q102K3430J2143N497K2363j690
$$ 679453 674894 670595 689621 711561 731438 750961 742859 766289 778432 783929 806292 804602
18792H04602L808O573K077Q461j0563L6200N3850M9727O0076P3077N5782N1822
$$ 804602 808410 814983 817060 825521 814958 851158 905008 954735 1014811 1087888 1143670 1195492
18780A195492N1777Q7999J05319R6939J37527K11432J74091Q7818N3314R2926
$$ 1195492 1247269 1335268 1440587 1537526 1675053 1886485 2060576 2148394 2201708 2294634
18770B294634J29179Q9837m8631k32838k14413j21911j12092m0282O824M3351
$$ 2294634 2423813 2513650 2465019 2232181 2017768 1895857 1783765 1743483 1750307 1793658
18760A793658J0779L0803l372L7921J25108J81742K57205K99281L06135J90498
$$ 1793658 1804437 1835240 1831868 1869789 1994897 2176639 2433844 2733125 3039260 3229758
18750C229758Q5486Q7801J39008J88434J36119k93358n34292m36460k85701j40964
$$ 3229758 3315244 3403045 3542053 3730487 3866606 3573248 3038956 2602496 2316795 2175831
18740B175831n9888n5919k8167O582j1548j8867K0955M0411M7048L0429K7621
$$ 2175831 2115943 2060024 2031857 2038439 2026891 2008024 2028979 2069390 2116438 2146867 2174488
18729B174488J4857K7063K6319K6184O4109L2957K3546P7103P8359Q2511J04392
$$ 2174488 2189345 2216408 2242727 2268911 2333020 2365977 2389523 2466626 2544985 2627496 2731888
18718B731888J09126J34154J60314J40421J22140J41733O2411L3752Q5960N7657
$$ 2731888 2841014 2975168 3135482 3275903 3398043 3539776 3602187 3635939 3721899 3779556
18708C779556M3428k706J4796M7067P4308J11562J20172J91957K26930K21092
$$ 3779556 3822984 3820278 3835074 3882141 3956449 4068011 4188183 4380140 4607070 4828162
18698D828162K57953L13656K69999K56626K53484K16676J61179J32553J42330
$$ 4828162 5086115 5399771 5669770 5926396 6179880 6396556 6557735 6690288 6832618
18689F832618J85284J68792J39144J29453J22527J59824K32911K20634J43148
$$ 6832618 7017902 7186694 7325838 7455291 7577818 7737642 7970553 8191187 8334335
18680H334335K19700L10487M51172N71125O18650O82641P53493Q41360R50562
$$ 8334335 8554035 8864522 9315694 9886819 10505469 11188110 11941603 12782963 13733525
18671A3733525J046504J166057J293867J484160J805318K154589K509576L002889
$$ 13733525 14780029 15946086 17239953 18724113 20529431 22684020 25193596 28196485
18663B8196485L679615M627610N864557P535135R702669J2419031J5762231J9012846
$$ 28196485 31876100 36503710 42368267 49903402 59606071 72025102 87787333 106800179
18655A06800179K0801257J9922073J6694764J3052744J0149271O922389J270883
$$ 106800179 127601436 147523509 164218273 177271017 187420288 194342677 195613560
18648A95613560p697926j7146488k1997975k1118579j7177986j2795313q907532
$$ 195613560 187915634 170769146 148771171 127652592 110474606 97679293 88771761
18641H8771761n669612k851314k73393K339858N203280Q515696J2316573J6372753
$$ 88771761 83102149 80250835 79977442 82317300 87520580 96036276 108352849 124725602
18633A24725602J9667568K0628094J8533384J4590933J0980133P857795L500393
$$ 124725602 144393170 165021264 183554648 198145581 209125714 216983509 220483902
18626B20483902m286389j4996604k3949152k6665581k4167524j9752606j5511168
$$ 220483902 216197513 201200909 177251757 150586176 126418652 106666046 91154878
18619I1154878j2020002r340071p426778n986742m859601m032338l323262k791849
$$ 91154878 79134876 69794805 62368027 56381285 51521684 47489346 44166084 41374235
18611D1374235k495866k219630j883359j650364j464853j260346j134083j033143
$$ 41374235 38878369 36658739 34775380 33125016 31660163 30399817 29265734 28232591
18603B8232591j024248r81843r54496r13226r01861r09022q21913p47005o98387
$$ 28232591 27208343 26226500 25272004 24358778 23456917 22547895 21725982 20978977 20280590
18594B0280590o54694o02137n21100m97044l91960m70947n57788n08905m69179
$$ 20280590 19625896 19023759 18502659 18005615 17613655 17142708 16584920 16076015 15606836
18585A5606836m27864l92587l51670l13423k82690l65067m29365m02795m13833
$$ 15606836 15178972 14786385 14434715 14121292 13838602 13473535 13044170 12641375 12227542
18576A2227542m48909m67663m25378l66976k97499k50568k46992k58923k05564
$$ 12227542 11778633 11310970 10885592 10518616 10221117 9970549 9723557 9464634 9259070
18567I259070j66873j74283k45508l11921l22435l73686l53270l13666k98552
$$ 9259070 9092197 8917914 8672406 8360485 8038050 7664364 7311094 6997428 6698876
18558F698876k58446k30086j77994j77283j81287j61615j15381j28881j61357
$$ 6698876 6440430 6210344 6032350 5855067 5673780 5512165 5396784 5267903 5106546
18549E106546j53804j27846j12046j64020j40337p0772j02512j24752j11889o8415
$$ 5106546 4952742 4824896 4712850 4548830 4408493 4337721 4235209 4110457 3998568 3930153
18539C930153p3404r9561j19495j31041r9255o8683n5174l9557p8547r0285q7573
$$ 3930153 3856749 3757188 3637693 3506652 3407397 3338714 3283540 3243983 3165436 3075151 2987578
18528B987578n7096o1501n5239p5322j23856q8079o3507l5832p4568r1797r3482
$$ 2987578 2930482 2868981 2813742 2738420 2614564 2526485 2462978 2427146 2352578 2260781 2167299
18517B167299j01508m9114n0811n9945l4934m1548l5155m5665j6495n3226n1300
$$ 2167299 2065791 2016677 1965866 1905921 1870987 1829439 1794284 1748619 1732124 1678898 1627598
18506A627598j3691n7593o9217n0005j3200l3251o0877o9305l6622n1017m2824
$$ 1627598 1613907 1556314 1487097 1437092 1423892 1390641 1329764 1260459 1223837 1172820 1129996
18495A129996k4758l4888n559l2112k1671j4690k2608k9738k1511k1761j5872
$$ 1129996 1105238 1070350 1064791 1032679 1011008 996318 973710 943972 922461 900700 884828
18484H84828J3670p894L18k6166k7783j6570k5682j7393J056j4611J527K491l7112
$$ 884828 898498 890604 890922 864756 836973 820403 794721 777328 778384 763773 765300 767791 730679
18471G30679j1918R610K5557J9063k4990j113Kk0681M837j9323l622J3308M854
$$ 730679 718761 728371 753928 772991 748001 746888 746890 726209 731046 711723 708101 721409 726263
18458G26263n719l7092m5564m3397m8705K4659K2424J9896j9420k4366J1230J3597
$$ 726263 720544 683452 637888 594491 545786 570445 592869 612765 593345 568979 580209 593806
18446E93806M3928J610k32k954K0891n808P637k8796j9938l1249j8925l0521k1897
$$ 593806 637734 639344 639112 636158 657049 651241 658878 630082 610144 578895 559970 529449 507552
18433E07552k1765l3051M5562M6941J1105M4036K1812k4438K0821M4254M4438
$$ 507552 485787 452736 498298 545239 556344 600380 622192 597754 618575 662829 707267
18422G07267j3556l442L1710k8541p5068k8504j7782m1812n3685j9828R447k1755
$$ 707267 693711 690269 721979 693438 618370 589866 572084 530272 476587 456759 466206 444451
18410D44451Q757K6744M4392N4321P2828O6588J4541j4405k8021l2323J4235l12
$$ 444451 453208 479952 524344 578665 651493 718081 732622 718217 690196 657873 672108 671796
18398F71796m706q552l1389m6403o758j0807q76j5767n3267j5873J648J5169K7071
$$ 671796 667090 658538 627149 580746 573988 563181 562305 546538 493271 477398 479046 494215 521286
18385E21286J7134q523k9895j6236k194Q586P207L1842J7109o697n4460m6672
$$ 521286 538420 529897 500002 483766 481572 490158 497365 529207 546316 539619 485159 438487
18373D38487P225R225K288j6885l215L645J5825k303k46j697M2063k0245o3640
$$ 438487 445712 454937 457225 440340 437125 440770 456595 454292 454046 452349 494412 474167 410527
18360D10527m582j5234k8326k0149o332m4952l0118K9593L8795j39J5127J1596
$$ 410527 405945 390711 362385 342236 335904 290952 260834 290427 329222 329083 344210 355806
18348C55806L0174L6923J0130M562Q078q748j9007P760p007l8802m4473j0123
$$ 355806 385980 422903 433033 437595 445673 436925 417918 425678 418671 379869 335396 325273
18336C25273J7220L6115K9039J8798K2043K7477N3544L5827K8120J6742k7363
$$ 325273 342493 378608 407647 426445 448488 475965 529509 565336 593456 610198 582835
18325E82835k4957N258O301r996L936j9883l7169j2303r342J1028j2020n427q426
$$ 582835 557878 563136 569437 559441 563377 543494 506325 494022 484680 495708 483688 478261 469835
18312D69835j4954l8108J5599M2089M2555q423j2661l7344J2182O7707Q0926Q8833
$$ 469835 454881 416773 432372 474461 517016 508593 495932 458588 470770 538477 619403 708236
18300G08236O2465o287L437j3334J10560J58376N4920j31519j81562r1176K0965
$$ 708236 770701 764414 767851 754517 865077 1023453 1078373 946854 765292 674116 695081
18289F95081M4410l9986M115P238R789M7755N7291l9344n521J05306J09169R6675
$$ 695081 739491 699505 703620 710858 720647 768402 825693 786349 780828 886134 995303 1091978
18277A091978J2538o9092n8990L9976J64840J16565j7638k02155j29729K5463
$$ 1091978 1104516 1035424 976434 1016410 1181250 1297815 1280177 1078022 948293 973756
18267I73756O1340k6242j2908J1832L755L1385q668R061K9171J8209l6394l1220
$$ 973756 1035096 1008854 995946 1007778 1011533 1042918 1034250 1043311 1072482 1090691 1054297 1023077
18255A023077k8076K1137K7223L8350M878j4509K4616k390l4278k321J2430N0123
$$ 1023077 995001 1016138 1043361 1081711 1086589 1072080 1096696 1094306 1060028 1057707 1070137 1120260
18243A120260J2934M8903P8724L1042K083m671m6852K6138J6468M804j2359J7436
$$ 1120260 1133194 1182097 1260821 1291863 1293946 1289275 1242423 1268561 1285029 1289833 1277474 1294910
18231A294910K8448J2473J1764q657K6055N8530M9717M9505P0343M0618r239J5958
$$ 1294910 1323358 1335831 1347595 1338938 1364993 1423523 1473240 1522745 1593088 1633706 1624467 1640425
18219A640425L3375N6401N6920R379N7005L9423J0634O0851M3122P8725J59511
$$ 1640425 1673800 1730201 1787121 1796500 1853505 1892928 1903562 1964413 2007535 2086260 2245771
18208B245771J99509J83197J25537J76502K15269K59075L38704L96654M93977
$$ 2245771 2445280 2628477 2754014 2930516 3145785 3404860 3743564 4140218 4634195
18199D634195M03308K94173L27820L47189M44029N33898K92667J33017L89983
$$ 4634195 5037503 5331676 5659496 6006685 6450714 6984612 7277279 7410296 7800279
18190G800279O80278Q55687Q70188Q93262J073559J217635J487901J738811J796832
$$ 7800279 8480557 9336244 10206432 11099694 12173253 13390888 14878789 16617600 18414432
18181A8414432K014174K934161M347161O365238R252856J3996471K2993184L7218960
$$ 18414432 20428606 23362767 27709928 34075166 43328022 57324493 80317677 117536637
18173A17536637N0299838M5797091J9706868Q879604J5971507K4862170K9741319
$$ 117536637 167836475 213633566 233340434 242220038 258191545 283053715 312795034
18166C12795034p997033p5254321p1784347m2606463k4410163j4744361r323381
$$ 312795034 304798001 229543680 157759333 115152870 90742707 75998346 66674965
18159F6674965o097472l600648j264288J190668M031201P692752J3687688K3966732
$$ 66674965 60577493 56976845 55712557 56903225 60934426 68627178 82314866 106281598
18151A06281598L7775131M5396844L1742727R608964Q862887J6523653K4393082
$$ 106281598 144056729 189453573 221196300 230805264 239668151 256191804 280584886
18144B80584886J9542665l6897077p6588071n5476756l2068353j9399905j2791300
$$ 280584886 300127551 263230474 186642403 131165647 99097294 79697389 66906089
18137F6906089r273810o941909n198187l900531k936409k234353j799993j570599
$$ 66906089 57632279 50690370 45492183 41591652 38655243 36420890 34620897 33050298
18129C3050298j430772j352944j211260r51708r49137j105067r37325o35784n39239
$$ 33050298 31619526 30266582 29055322 28103614 27154477 26049410 25112085 24476301 23937062
18120B3937062n35045l80501l2167L20889R25921J764519K838472L851094K848103
$$ 23937062 23402017 23021516 22989349 23310238 24236159 26000678 28839150 32690244 35538347
18111C5538347N48501L79860J239921K158011K015575l674562q461133o427764
$$ 35538347 36086848 36466708 37706629 39864640 41880215 38205653 29744520 23316756
18103B3316756l791886k338696j599201j144818r14805p68705o78547n78887m93775
$$ 23316756 19524870 17186174 15586973 14442155 13527350 12758645 12080098 11501211 11007436
18094A1007436m31186l83508l42037l18148l40945l19973k87265k32917k26195
$$ 11007436 10576250 10192742 9850705 9532557 9191612 8871639 8584374 8351457 8125262
18085H125262j76488j21795q3157m3213o2984j57678k25312j04433o5656p9660
$$ 8125262 7948774 7826979 7743822 7700609 7637625 7479947 7254635 7150202 7084546 7004886
18075G004886l17242m74481l62803k75610k22995j76287j63414j57363j44663
$$ 7004886 6687644 6213163 5850360 5574750 5351755 5175468 5012054 4854691 4710028
18066D710028j66827j42035j00174p6603l5604p323N2943J15394O6138o2795j08351
$$ 4710028 4543201 4401166 4300992 4224389 4188785 4181462 4234405 4349799 4415937 4353142 4244791
18055D244791l8679J3618M0270k04530l05814k17879j34084j02298j2088Q9474
$$ 4244791 4206112 4219730 4260000 4055470 3749656 3531777 3397693 3295395 3283307 3372781
18045C372781J17460M1074m2190r2054J2112N6510j8007j89726k55292k56408
$$ 3372781 3490241 3531315 3489125 3397071 3409183 3465693 3447686 3257960 3002668 2746260
18035B746260j61849j33124j52178j30493j19301j05247p8963m7153n2131o3124
$$ 2746260 2584411 2451287 2299109 2168616 2049315 1944068 1865105 1817952 1765821 1702697
18025A702697l235N8983J11922Q1446k5554l6138l0641P7584R3791j18567k06810
$$ 1702697 1699462 1758445 1870367 1951813 1926259 1890121 1859480 1937064 2030855 1912288 1705478
18014A705478j51741j37603j45739j19004q9177n2422p0330n5170j9958o8523
$$ 1705478 1553737 1416134 1270395 1151391 1062214 1009792 939462 884292 864334 795811
18004G95811p3628o4083J6113J2865Q892l0464k8637k3062o0703j1071j0893j4478
$$ 795811 722183 658100 674213 687078 695970 665506 636869 613807 553104 542033 531140 516662
17992E16662j870N1329J4489j0089r161L122R932k927j862k774j0817L5862N1919
$$ 516662 514792 566121 580610 570521 561360 564482 574414 571487 569625 566851 556034 591896 643815
17979F43815m2836n4303k3439l8672n1461n4805k0835r425J9271o553J3136j3144
$$ 643815 600979 546676 523237 484565 433104 378299 357464 348039 367310 360757 373893 360749
17967C60749l14J392l141L269J9791k627L2972L1074m3645k6342J5485K1273k361
$$ 360749 360435 361827 358686 361955 381746 379119 412091 443165 399520 373178 388663 409936 407575
17954D07575o5046l7887k8623j2346k0655J9857j4966j2449L5624j0163k6246
$$ 407575 342529 304642 276019 263673 243018 262875 247909 235460 271084 260921 234675
17943B34675N738k1771l3991n1K6824J2833n4279m4766k5072n57L4264J4732k0671
$$ 234675 240413 218642 184651 184600 211424 224257 169978 125212 100140 99583 133847 148579 127908
17930A27908j5308k9755K0353O1075N9242l01j99K8979J3399j0006m8727n1955
$$ 127908 112600 82845 103198 164273 223515 223214 223015 251994 265393 255387 206660 154705
17918A54705l3676o768M095J9222L0338j1741k2064m272j9032j6850N345Q062
$$ 154705 121029 114261 118356 137578 167916 156175 134111 129839 110807 93957 99302 107364
17906A07364K5574k6597l0163R595k989j70J1893k7386j4943k3595o514j6373
$$ 107364 132938 106341 76178 85773 82784 82614 94507 67121 52178 28583 22069 5696
17894E696J970r586n586L0454K3595K0173N84r080j4303j4780l5357J1792L4717
$$ 5696 7666 -1920 -7506 22948 46543 66716 67300 58220 43917 29137 -6220 5572 40289
17881D0289j9869o462j9694k3565k8025j4215n712J930K1993Q512j8467L9088
$$ 40289 20420 13958 -5736 -29301 -57326 -71541 -77253 -75323 -53330 -44818 -63285 -24197
17869b4197K0971m1765j2846K4443J8920M8131N7538j7985m8806q942j2662R447
$$ -24197 -3226 -44991 -57837 -33394 -14474 33657 91195 73210 24404 15462 2800 12247
17857A2247N272J3468k6725j7262J3508p942l5163l7450R055K96L6785J79J5243
$$ 12247 17519 30987 4262 -13000 508 -7434 -42597 -80047 -70992 -70696 -33911 -33732 -18489
17844a8489J9310O397O864o859k1901j9488J3150o559j6878Q002m0885J5035J3043
$$ -18489 821 7218 14082 7223 -14678 -34166 -21016 -27575 -44453 -36451 -77336 -62301 -49258
17831d9258k3289k708K0726J4601K6089P130k2222M590J079k1245N360R937k568
$$ -49258 -72547 -75255 -54529 -39928 -13839 -6709 -28931 -24341 -23262 -44507 -39147 -29210 -31778
17818c1778j6454k719P322l13k1399j4426l431J6977K011k5019l4873J7384M7812
$$ -31778 -48232 -50951 -43629 -43942 -65341 -79767 -83198 -66221 -64210 -89229 -124102 -106718 -58906
17805e8906n977r736K7659l593j6798o342j7284j2986K453J7263j8783J5915j0383
$$ -58906 -64883 -74619 -46960 -50553 -67351 -73693 -90977 -103963 -101510 -84247 -103030 -87115 -97498
17792i7498n197J4560j325L273J6376J8094L1681K4290j8813k6686k3388L0581
$$ -97498 -102695 -88135 -89460 -86187 -69811 -51717 -20036 4254 -14559 -41245 -64633 -34052
17780c4052J3477k7910j133K4664k1900l9111m304O076O567k3168J3040j0036
$$ -34052 -20575 -48485 -49618 -24954 -46854 -85965 -90269 -84193 -77626 -100794 -87754 -97790
17768i7790k2035l71O183j3265L654K4746N989M969J7673Q239m5177j7637J1454
$$ -97790 -119825 -120196 -114013 -127278 -123624 -98878 -92889 -87920 -70247 -62008 -107185 -124822 -113368
17755a13368J5851M298J3995j4201m401k4594k7812L5661p865K3061j5160J4385
$$ -113368 -97517 -93219 -79224 -93425 -97826 -122420 -150232 -114571 -122436 -99375 -114535 -100150
17743a00150L7124p811o444k8071J8932j0564k2292k4429k3150J7615K2193n369
$$ -100150 -63026 -70837 -77281 -105352 -86420 -96984 -119276 -143705 -166855 -149240 -127047 -132416
17731a32416K3874J053n462q073j5076k1222K8063K0923Q171p124n066R483k7041
$$ -132416 -108542 -107489 -112951 -121024 -136100 -157322 -129259 -108336 -100165 -107289 -112355 -102872 -129913
17718a29913k4409J8915L2059J1575j6876l3852M476J9459J0398J3104j9465k0730
$$ -129913 -154322 -135407 -103348 -91773 -108649 -142501 -138025 -118566 -108168 -95064 -114529 -135259
17706a35259k0460J1948J6616J970O409j1932q201K4430l1252l7115K0672M4361
$$ -135259 -155719 -143771 -127155 -125185 -118776 -130708 -138909 -114479 -145731 -182846 -162174 -117813
17694a17813N8434M2684J5624j0155q34k7870k0078J4996J8950r006j7415l4047
$$ -117813 -59379 -16695 -1071 -11226 -12060 -39930 -60008 -45012 -26062 -35068 -52483 -86530
17682h6530l5494r853R067n975P729J0777J3239k314n1360K457K3872J0911L6096
$$ -86530 -122024 -131877 -122810 -128785 -121056 -110279 -97040 -99354 -150714 -148257 -124385 -113474 -77378
17669g7378L3595J5961j39o390k2185J1187L8907J8788k0865m2160k9085k0981
$$ -77378 -43783 -27822 -27961 -34351 -56536 -45349 -6442 12346 -8519 -50679 -79764 -100745
17657a00745N607j9001j3853O6063K5831j343m3900j3947J0162J4842K2755j805
$$ -100745 -95138 -114139 -127992 -61929 -36098 -37441 -81341 -95288 -85126 -70284 -47529 -49334
17645d9334k7177j2806J9417j2172N230J0733j902K100p121j2606m243J84M203
$$ -49334 -76511 -89317 -69900 -82072 -76842 -66109 -68011 -65911 -73032 -85638 -89881 -89697 -85494
17632h5494j589l863R709m321J4736o671J2130J2749J0370k1641p250J3822o793
$$ -85494 -87083 -90946 -81237 -85558 -70822 -77493 -65363 -52614 -42244 -63885 -71135 -57313 -64106
17619f4106K232q848O476n880k1700J7556J8243j4866r315J1195J8402j5608p588
$$ -64106 -61874 -70722 -64246 -70126 -91826 -74270 -56027 -70893 -80208 -69013 -50611 -66219 -73807
17606g3807q617j338O995K5302q591J3858J4666l9012n923K6208n724j2104O261
$$ -73807 -82424 -83762 -76767 -51465 -60056 -46198 -31532 -70544 -76467 -50259 -55983 -68087 -61826
17593f1826L9474r150l2742k2584J9822J7130r200k812k183K4710L2251N7082
$$ -61826 -22352 -31502 -64244 -86828 -67006 -49876 -59076 -61888 -64071 -39361 -7110 49972
17581D9972J2709j1625P098l99j1552K6628K881j5211l5382j3162Q0261P3148
$$ 49972 62681 51056 58154 57755 46203 72831 75712 60501 25119 11957 92218 165366
17569A65366L6856L4422J27911K02496K77220K33327J10833O8302P6122J47199
$$ 165366 202222 236644 364555 567051 844271 1077598 1188431 1256733 1332855 1480054
17559A480054J93309m4767l86331l54295k59911j25941p2895p0487l1365j9801
$$ 1480054 1673363 1628596 1242265 887970 628059 502118 429223 358736 327371 307570
17549C07570l9455k1201Q42O0919J21185J33055K20843K78352K03368Q7706J9333
$$ 307570 268115 246914 247756 308675 429860 562915 783758 1062110 1265478 1353184 1372517
17538A372517J06391J52032J35322k10558m60493l42252k01664j28629p2742p975
$$ 1372517 1478908 1630940 1766262 1555704 1095211 752959 551295 422666 349924 341949
17528C41949m7670m2365m3593m8133j5684K344l1356l4183q293J1764R362N8738
$$ 341949 294279 251914 208321 160188 144504 146848 115492 81309 73016 84780 94142 152880
17516A52880j254k261k242j1896L108j3043o6420j5901J25j7611k7206K2751O041
$$ 152880 151626 149365 147123 135227 138335 125292 58872 42971 43096 25485 -1721 21030 27071
17503B7071l7099q279K4110J7548J2767q776m2144M687J8570J6200J2934k580
$$ 27071 -10028 -18307 5803 23351 36118 27342 -14802 -10115 8455 24655 37589 35009
17491C5009k1239p490j7270l6332M259l340j6944J055N1136K1512l016j1741j9499
$$ 35009 13770 6280 -10990 -47322 -43063 -46403 -63347 -62292 -11156 10356 7340 -4401 -23900
17478b3900k8336o41R304K0381q117k1326N878L1454N456k8307J0633k4178k0072
$$ -23900 -52236 -52877 -43573 -23192 -31309 -52635 -46757 -15303 -9847 -38154 -27521 -51699 -71771
17465g1771m018K9006J8056n009k8593k0920L5856N485j4519J1203j4028p068
$$ -71771 -75789 -46783 -28727 -33736 -62329 -83249 -47393 -41908 -56427 -45224 -59252 -66320
17453f6320J1571J3684L4911J6564k7397L895K5999K8796J7423L71M5407L6689
$$ -66320 -54749 -41065 -6154 10410 -16987 -13092 12907 41703 59126 59497 104904 141593
17441A41593J0662l8314n0731m3158l8668k2371l4120k5298K3162K3586l2867
$$ 141593 152255 113941 63210 20052 -18616 -40987 -75107 -100405 -77243 -53657 -86524
17430h6524Q61L2407M699k72p637j4160K0696q764j9221l194J3541l822K0617
$$ -86524 -85663 -53256 -48557 -48829 -56466 -70626 -49930 -58694 -77915 -81109 -67568 -71390 -50773
17417e0773K9680O906m3504j9097J4398p221j7787k3383K5952L3739l666j6935
$$ -50773 -21093 -14187 -57691 -76788 -62390 -69611 -87398 -110781 -84829 -51090 -54756 -71691
17405g1691k2748K6526L2454J3911k1703K1619N292r075p607q889j0659j1206
$$ -71691 -94439 -67913 -35459 -21548 -43251 -21632 -16340 -25415 -33022 -41911 -52570 -63776
17393f3776O902l625N960K0003k9882k3699K1523l294J0709N657k2783J7465O847
$$ -63776 -56874 -60499 -54539 -34536 -64418 -88117 -66594 -69888 -59179 -53522 -76305 -58840 -51993
17380e1993M748j3345K2051P815L2037q247n7177O622K3942q76L498j7709J5681
$$ -51993 -47245 -60590 -38539 -30724 1313 -6934 -64111 -57489 -33547 -34423 -30925 -48634 -32953
17367c2953K7751R59Q606m5427l6518j0015j6203l341K4364K1528K3965K828k5827
$$ -32953 -5202 -4243 4363 -41064 -77582 -87597 -103800 -107141 -82777 -61249 -37284 -34456 -60283
17354f0283l847j5805K5425j4139l1234l5456K2698K3371P89K8044q768q30j1331
$$ -60283 -64130 -79935 -54510 -68649 -99883 -135339 -112641 -89270 -88481 -60437 -69205 -70035 -81366
17341h1366K0943K0976o779p936p453k5879R951K7410J2618j0264J0837l509L60
$$ -81366 -60423 -39447 -46226 -54162 -61615 -87494 -77543 -50133 -37515 -47779 -36942 -40451 -40091
17328d0091j0734R913K6379l9945n5657j4419r562M6973J4556J2819J5900n588
$$ -40091 -50825 -40912 -14533 -54478 -110135 -124554 -134116 -87143 -72587 -59768 -43868 -49456
17316d9456k1890l6517j3793K5352K7408K3617k6735o548K9373M2892P648J563
$$ -49456 -71346 -107863 -121656 -96304 -68896 -45279 -72014 -78562 -49189 -6297 1351 2914
17304B914k3719l5015J1338P89L8992K6707k7105m2546J7290j2692m527j3406
$$ 2914 -20805 -55820 -44482 -43693 -4701 22006 -5099 -47645 -30355 -43047 -47574 -60980
17292f0980q597k6720j3284K3703M0094K3331rk6960K503M391j7854j527O201
$$ -60980 -69577 -96297 -109581 -85878 -45784 -22453 -22462 -49422 -46919 -42528 -60382 -61909 -55708
17279e5708k9930k6588n28L0314M2384l2621K518K3451m326j1904l4578j3571
$$ -55708 -85638 -112226 -112754 -82440 -40056 -72677 -70159 -46708 -51034 -62938 -97516 -111087
17267a11087J1508J6855j5206J9312J2566n023L6244k1883k5904j4854J83K6580
$$ -111087 -99579 -82724 -97930 -78618 -66052 -71075 -34831 -56714 -82618 -97472 -97289 -70709
17255g0709M8914L30l8828J6325J029r139L3140K7964K0875l725o1788l8496J2893
$$ -70709 -21795 -21465 -60293 -43968 -42939 -52078 -18938 9026 29901 26176 -35612 -74108 -61215
17242f1215J1293J0402j7002J3093K9257n9k6855Q650j778j0255J8508j0508m588
$$ -61215 -49922 -39520 -56522 -43429 -14172 -14231 -41086 -32436 -34214 -44469 -25961 -36469 -41057
17229d1057l5274k231j4522J1210K1461l116j2574R726L230K1651j7302R1O213
$$ -41057 -76331 -78562 -93084 -81874 -60413 -63529 -76103 -66377 -63147 -41496 -58798 -58707 -52494
17216e2494j1009j4459K272k2849J9595M6731k5379k5797J6892P29j3755j0495
$$ -52494 -63503 -77962 -75690 -98539 -78944 -32213 -57592 -83389 -66497 -65768 -79523 -90018
17204i0018J1980J8851n22K4278k2330l2402K4055j818j8175M578J5601O735Q461
$$ -90018 -78038 -59187 -59709 -35431 -57761 -90163 -66108 -67926 -86101 -81523 -65922 -59187 -50726
17191e0726Q430K2392j1668k3857j6996j8333N581K0333J6654J3337J472j8390
$$ -50726 -42296 -19904 -31572 -55429 -72425 -90758 -85177 -64844 -48190 -34853 -33381 -51771
17179e1771m277P294K541K95J4056j0249k3029L226K882m416J7233J3527j2067
$$ -51771 -56048 -48754 -46213 -45918 -31862 -42111 -65140 -61914 -59032 -63448 -46215 -32688 -44755
17166d4755k0977j4008j2638L3028p088o051l238J1369q958k0921J4906J9643
$$ -44755 -65732 -79740 -92378 -59350 -66438 -72489 -75727 -64358 -73316 -94237 -79331 -59688
17154e9688K7287j7688N4081P761l500k2217m1356P686J4564p513l3572k3900
$$ -59688 -32401 -50089 3992 11753 8253 -13964 -55320 -47634 -33070 -40583 -74155 -98055
17142i8055M5990M3941L26k433k0087j4493Q095K5609J2784k4074l350k0967P9
$$ -98055 -52065 -8124 -7798 -10231 -30318 -44811 -36716 -11107 1677 -22397 -25747 -46714 -46635
17129d6635J4693j8274J7760J0545j2790m601J8255p653j7272m440L124p675P359
$$ -46635 -31942 -50216 -32456 -21911 -34701 -39302 -21047 -28700 -45972 -50412 -47288 -54963 -47604
17116d7604K6393J9527k410r299M1718k2681k6337K197j2239m271J4327J0688
$$ -47604 -21211 -1684 -4094 -13393 28325 5644 -20693 -18496 -30735 -35006 -20679 -9991
17104i991o494n0087l6536m142J3282k573L5312M856j2805k1102P577L9786K9499
$$ -9991 -16485 -66572 -103108 -107250 -93968 -96541 -61229 -56373 -69178 -90280 -82703 -42917 -13418
17091a3418L9245l2685J7351J5145l3419l0393o0583j925J8271M621J5319K034
$$ -13418 25827 -6858 10493 25638 -7781 -38174 -98757 -100682 -82411 -77790 -62471 -60437
17079f0437K2637J0241K898r056o149K7401L0400j81o152Q876k7996n5054j2946
$$ -60437 -37800 -27559 -24661 -33717 -39866 -12465 17935 17754 11602 20478 -7518 -62572 -75518
17066g5518K5219L1525l7853j3392N0199J7635o762j2148j5614j5720l6149j0448
$$ -75518 -50299 -18774 -56627 -70019 -19820 -2185 -8947 -21095 -36709 -52429 -88578 -99026
17054i9026L489J6629K2796J6030K8405o051k4911j6845O425K7369K754j4263
$$ -99026 -95537 -78908 -56112 -40082 -11677 -17728 -42639 -59484 -53059 -25690 -22936 -37199
17042c7199L942k4620J5874L8365m152K25N994N657L229J6618l0903j5073k6217
$$ -37199 -33257 -57877 -42003 -3638 -7790 -7565 -1571 4086 7315 23933 -6970 -22043 -48260
17029d8260M663j084j878K1584J1186Q86j2549K802j6670q102M7303M4607j4416
$$ -48260 -43597 -44681 -46559 -24975 -13789 -12903 -25452 -22650 -39320 -47422 -119 44488 30072
17016C0072j8093m619J8690J3276j2029l7681J2578j1755k6929m138k4752L905
$$ 30072 11979 7360 26050 39326 27297 -10384 2194 -9561 -36490 -40628 -65380 -61475
17004f1475K3323J4082J2808J0612J525J5917K0797K46j3319j0322j6162k8926
$$ -61475 -38152 -24070 -11262 -650 875 16792 37589 37835 24516 14194 -1968 -30894
16992c0894L3045j6744m7625K406P983j3762k0720L7359O837m419O722L6660K1100
$$ -30894 2151 -14593 -62218 -59812 -51829 -65591 -86311 -48952 -42115 -46534 -39812 -3152 17948
16979A7948n873m691m933J6414K3263m0858j7977n42J3216k5591k5153J189o375
$$ 17948 12075 7384 2451 18865 42128 1270 -16707 -17249 -4033 -29624 -54777 -53588 -59963
16966e9963J2045o462J0811L7688j9190k7281k4598l2398m576L3724M6363L7629
$$ -59963 -47918 -54380 -43569 -5881 -25071 -52352 -76950 -109348 -113924 -80200 -33837 3792
16954C792O484O348k1739j7307k438r005k4586K4022J1494k5682J345L341j348
$$ 3792 10276 16624 -5115 -22422 -24860 -33865 -58451 -34429 -22935 -48617 -47272 -43931 -45279
16941d5279l756L2847K6147k3408k7609o843R790M1009K6413k0329n571k8250
$$ -45279 -49035 -16188 9959 -13449 -41058 -47901 -38111 2898 29311 8982 3411 -24839
16929b4839k4205P762K5703k5981l3592K4645k0566J1148M0058l972k1909j1691
$$ -24839 -49044 -41282 -15579 -41560 -75152 -50507 -71073 -59925 -19867 -23839 -45748 -57439
16917e7439K8490Q627j6508o604P60L217O891N430q977l3922q818M4822N316J8835
$$ -57439 -28949 -20322 -36830 -43434 -42674 -39457 -32566 -27136 -36113 -70035 -78853 -34031 -28715 -9880
16903i880J2186j9425k0849j0448r006L0402J7327k0685l1799J7431J3908j8903
$$ -9880 2306 -17119 -37968 -48416 -57422 -27020 -9693 -30378 -62177 -44746 -30838 -49741
16891d9741r055j4236K5982J7184P452K4671j2959l8400p108K4815k5948m948
$$ -49741 -58796 -73032 -47050 -29866 -22414 2257 -10702 -49102 -56210 -31395 -57343 -62291
16879f2291J0120K5141J9566j5706j7747m777r1l0786n266M995L4981L1611L670
$$ -62291 -52171 -27030 -7464 -23170 -40917 -45694 -45785 -76571 -81837 -76842 -41861 -10250 -6580
16866f580m002K016j4472J8183p828p974R456j2854J3395N7385J8625M272k5001
$$ -6580 -10582 -8566 -23038 -4855 -12683 -20657 -11201 -24055 -10660 46725 65350 69622 44621
16853D4621l1036m807O528P26Q940K078K1978R809p366M963j839k5866L352n0715
$$ 44621 13585 8778 15306 16032 24972 27050 49028 58837 51471 56434 54595 28729 32081 -18634
16839a8634J256K877l354r419m80n287R203J3364K225k1153k2411p813j0214n989
$$ -18634 -17378 -14501 -17855 -27274 -27754 -33041 -23838 -10474 -8249 -29402 -51813 -59626 -69840 -75829
16825g5829K4448N9512P678k2948j3318k306R17N896N668p474l178j5080L0567
$$ -75829 -51381 8131 15809 -7139 -20457 -22763 -21846 -15950 -10282 -17756 -20934 -36014 -5447
16812e447L1483J7429j1159k0765k1576J040N089l1800m6499j1543L2129J0455
$$ -5447 26036 43465 32306 11541 -10035 -8995 -3906 -35706 -82205 -93748 -61619 -51164
16800e1164l1587m194N102K1207M5109M11J033J0262n512j7755J262P439L5904
$$ -51164 -82751 -86945 -81843 -60636 -15527 -15116 -14083 -3821 -9333 -27088 -25826 -18387 17517
16787A7517K1189l0948j8887j3136j949J3834j8440j2824J6718j9387L284q125
$$ 17517 38706 7758 -11129 -24265 -26214 -12380 -30820 -43644 -26926 -46313 -43029 -51154
16775e1154m750m483J3051J2943j5985m7994j3507J4196K2070k179L5009O186
$$ -51154 -55904 -60387 -47336 -34393 -50378 -98372 -111879 -97683 -75613 -77792 -42783 -36597
16763c6597j2606j7697J8555k5361K0926K0131n451K107n070K2146l905j2044
$$ -36597 -49203 -66900 -48345 -73706 -52780 -32649 -38100 -35993 -41063 -18917 -22822 -34866
16751c4866J048J3000j9253k606k7677L080p744J3710J2148K2883J1047q405K2588
$$ -34866 -33818 -20818 -40071 -42677 -70354 -67274 -75018 -61308 -49160 -26277 -15230 -23635 -1047
16738a047j3141j9430l0615J9813M491o775L2049J820j5395J093k4094Q56M7442
$$ -1047 -14188 -33618 -64233 -44420 -39929 -46704 -14655 -12835 -28230 -27137 -51231 -50375 -2933
16725b933K9841l9046j7990p701k472N361M746L2680o257J6361M969l6308j0701
$$ -2933 26908 -12138 -30128 -37829 -40301 -34940 -30194 2486 -3771 12590 17559 -18749 -29450
16712b9450j4111o378J1837J1846O963l460j3822r023J3874o211L1002J5172l1775
$$ -29450 -43561 -49939 -38102 -26256 -19293 -22753 -36575 -45598 -31724 -37935 -6933 8239 -23536
16699b3536q677q707J0626K537J3223K7002j562j5557p618k4185r144n944k0045
$$ -23536 -32213 -40920 -30294 -27757 -14534 12468 10906 -4651 -12269 -36454 -45598 -51542 -71587
16686g1587K0101j2068M569J5573m4871J5655L2796K635J3173k3354j4641j974
$$ -71587 -51486 -63554 -58985 -43412 -88283 -72628 -39832 -37197 -24024 -47378 -62019 -63993
16674f3993J6965J2972j6687J7509R452K2780J19J1203l8879p470J8208J0997
$$ -63993 -47028 -34056 -50743 -33234 -23782 -1002 -883 10320 -28559 -36029 -17821 -6824
16662f824p952k6557q15q666J857j2782k371k8143L3642n968j4137K5417k3642
$$ -6824 -14776 -41333 -42148 -50814 -48957 -61739 -64110 -92253 -58611 -64579 -78716 -53299 -76941
16649g6941j719J5604j6214j5822K9964J4273Q260q15k4826L6263J9179k226j980
$$ -76941 -78660 -63056 -79270 -95092 -65128 -50855 -42595 -43410 -68236 -31973 -12794 -15020 -17000
16636a7000J9952j044o277j5026N444P156L8996K0890p1582m6524N6344J7129
$$ -17000 2952 1908 -4369 -19395 -13951 -6795 32201 53091 -18491 -65015 -8671 8458
16624H458J7888k1459j3688p783j5662j1888l8836J3470P271K5178J0321J1087
$$ 8458 26346 4887 -8801 -16584 -32246 -44134 -82970 -69500 -62229 -37051 -26730 -15643
16612a5643L1600J194m0934J033L1114M072l1603k7691N607K5679l42k2340j9665
$$ -15643 15957 17151 -23783 -22750 8364 12436 -19167 -46858 -41251 -15572 -15914 -38254 -57919
16599e7919n380l203J7482J5136L3399R17n015J6929o241l1728K5921J9911m2793
$$ -57919 -63299 -66502 -49020 -33884 -485 432 -4583 12346 6105 -25623 298 20209 -22584
16586b2584P362J1990m534k5909j6219R424l494m83k776L4186L3401j8259k437
$$ -22584 -15222 -3232 -7766 -33675 -49894 -40470 -43964 -44447 -47223 -13037 20364 2105 -332
16573c32L568l571k746Q163q349p330j6060K1855L7335k4026k5495J1271j8106
$$ -332 3236 -335 -3081 5082 -3267 -10597 -26657 -4802 32533 8507 -16988 -5717 -23823
16560b3823o676J3333k4807j0073J2928L0402K7964n160j5331j5213K911Q987
$$ -23823 -30499 -17166 -41973 -52046 -39118 -8716 19248 14088 -1243 -16456 -13545 -4558
16548d558m7107k2532Q914J5633J3663M4918j0030k9915k798K8073O139k4974
$$ -4558 -51665 -74197 -65283 -49650 -35987 8931 -1099 -31014 -33812 -5739 400 -24574
16536b4574j5679K5356J1862L136L5686N146o274k9547P587k072J3306N111k1452
$$ -24574 -40253 -14897 -3035 101 35787 40933 34659 5112 12699 10627 23933 29044 7592
16523G592k686J9704K7831j4151j5728j9194K999J031K4047l795n4844j78K7053
$$ 7592 4906 24610 52441 38290 22562 3368 6367 7398 31445 27650 -27194 -27372 -319
16510c19j5468k5771j0289P448r179n807n750Q457J3280K6061K9006j001L655
$$ -319 -15787 -41558 -51847 -44399 -53578 -59385 -65135 -56678 -43398 -17337 11669 10668 14323
16497A4323K3194R79m9868m3332K5112P567J4263Q079j0049j1763j8367j2946
$$ 14323 37517 38496 -11372 -54704 -29592 -22025 -7762 317 -9732 -21495 -39862 -52808
16485e2808J867j118j1928J4568J6686o720L0704J018k2957J5443J5566J0688
$$ -52808 -50941 -52059 -63987 -49419 -32733 -39453 -8749 -7731 -30688 -15245 321 11009
16473A1009k4080q16p429j5637J8187J1336n165L1379R196j1135p057l4865q365
$$ 11009 -13071 -13887 -21316 -36953 -18766 -7430 -12595 18784 27980 16845 9788 -25077 -33442
16460c3442M868j3012K3730J6268m9077n0234M424J8915L4070J4280k3443j7898
$$ -33442 -28574 -41586 -17856 -1588 -50665 -100899 -96475 -77560 -43490 -29210 -52653 -70551
16448g0551K2975j5118p314J2011Q620Q756J8353j8334M546N1923Q824J6544J924
$$ -70551 -47576 -62694 -70008 -57997 -49377 -40621 -22268 -40602 -36056 15867 24691 41235 43159
16435D3159l1676l6930n479r782M461L2674j4940j4946K7576r129q343j1118J4374
$$ 43159 11483 -25447 -30926 -40708 -36247 -3573 -18513 -33459 -5883 -15012 -23355 -34473 -20099
16422b0099P635k6316R725J7880j163k2112k2859j5934M873L2467J1613L801J4491
$$ -20099 -12464 -38780 -29055 -11175 -12338 -34450 -57309 -73243 -68370 -35903 -24290 -20489 -5998
16409e998K1995k8051j2038L2296K0057j9798M6668K3333k0570r360N013P315
$$ -5998 15997 -12054 -24092 8204 28261 8463 55131 78464 57894 48534 53547 60862
16397F0862l1194m704m348k9075l7895l1184m342L4804K6852J7060K2080o944
$$ 60862 29668 24964 20616 -8459 -46354 -77538 -81880 -47076 -20224 -3164 18916 11972
16385A1972p405l4962j7584L5395j0393K424n967j4329j0884L0191J6626j2109
$$ 11972 4567 -30395 -47979 -12584 -22977 -20553 -26520 -40849 -51733 -21542 -4916 -17025
16373a7025O815j2856k3564o699m390k4279o179P866P036K7361M4831j4244n097
$$ -17025 -10210 -23066 -46630 -53329 -57719 -81998 -88177 -80311 -73275 -45914 -1083 -15327 -20424
16360b0424k9097J029k4172O6j0481P748N5562K8073m5925l8183K0181j3274K3805
$$ -20424 -49521 -48492 -72664 -72598 -83079 -75331 -19769 8304 -37621 -75804 -55623 -68897 -45092
16347d5092q143P684K4136K0680L854l0516j4379k2794j5934J2037r0l1j7126
$$ -45092 -53235 -45551 -21415 -735 3119 -27397 -41776 -64570 -80504 -68467 -68557 -68588 -85714
16334h5714O49K3819L7318R957K8212J489j1698J152n701r029j0269K482L19r15
$$ -85714 -85065 -61246 -23928 -13971 14241 15730 4032 5184 -517 -9546 -19815 -17333 -17014 -17929
16320a7929l325l4813j3838K3123M8292J9929J7529J0113j2466k8357K9515k0499
$$ -17929 -21254 -56067 -69905 -46782 1510 21439 38968 49081 36615 8258 37773 17274
16308A7274j0575J5665m4202l4219M2838J4054o255J3116J5814K6071l049r103
$$ 17274 6699 22364 -21838 -56057 -13219 835 -5420 7696 23510 49581 46532 37429
16296C7429r934k1833J1208L0678j4339m7174k1105k5335O620J0152p357J8087
$$ 37429 27495 5662 16870 47548 33209 -13965 -35070 -60405 -53785 -43633 -50990 -32903
16284c2903R131M131K4697k8213o822J0992J1369j498o939J6599j6532l6177M979
$$ -32903 -23772 -19641 5056 -23157 -29979 -18987 -7618 -9116 -16055 544 -15988 -52165 -47186
16271d7186K8309K4401K5416K6901m122o8227j7057J9054K542l0280J5320m12
$$ -47186 -18877 5524 30940 57841 53719 -14508 -31565 -12511 -9969 -40249 -24929 -25341
16259b5341K8621L674k4202J9080l355J1542j4929P305J4855J1840k168m3142
$$ -25341 3280 6954 -17248 1832 -1523 10019 -4910 2395 17250 29090 26922 -16220
16247a6220j02P281p177j4241r736j1511r364K3389J7741l0586q111J0760J8628
$$ -16220 -16322 -9041 -16218 -30459 -40195 -51706 -61070 -37681 -19940 -50526 -58637 -47877 -29249
16234b9249K6482Q593J0763l0094l1038K6402k058j5231j8789R088M7139M6291
$$ -29249 -2767 5826 16589 -13505 -44543 -18141 -20199 -35430 -54219 -45131 2008 48299
16222D8299j2366k0622k858J6047Q27k2704l9079l6018l6287l579L0561P970L0149
$$ 48299 35933 15311 12453 28500 29327 6623 -32456 -68474 -104761 -108340 -77779 -69809 -39660
16209c9660j0348L276K5742j097O096L538J0209o903M726J5029R88j8366R251
$$ -39660 -50008 -46732 -20990 -22087 -15991 -12453 -2244 -9147 -4421 10608 11596 -6770 2481
16196B481m4241R504o295N448q469L475l723j3667J2470j7400K8356L7490K3136
$$ 2481 -41760 -32256 -38551 -33103 -41572 -38097 -41820 -55487 -43017 -60417 -32061 5429 28565
16183B8565J1446j6573P321j1872K620Q74j5369k6670j4761N2327j593k774m263
$$ 28565 40011 23438 30759 18887 21507 22381 7012 -19658 -34419 17908 16315 13541 9278
16170I278n502J4435K4642r953m4706K5598j106J7309J9418o504k8391j2698J0885
$$ 9278 3776 18211 42853 32900 -11806 13792 12686 29995 49413 42909 14518 1820 12705
16157A2705K7193k3416k4717Q55l0025j3856q669j9976J1660N6818L2504q865
$$ 12705 39898 16482 -8235 -7380 -37405 -51261 -59930 -79906 -68246 -11428 21076 12211
16145A2211j1397k4134k4335J4947J029K3957Q134k0151j8816N624J3353k6683
$$ 12211 814 -23320 -47655 -32708 -31679 -7722 412 -19739 -38555 -32931 -19578 -46261
16133d6261l8402p140K6343L2522L2887L4731Q003p080m0664m0158k9118J9619
$$ -46261 -84663 -91803 -65460 -32938 -51 34680 42683 35603 -5061 -45219 -74337 -54718
16121e4718P758J2933M9620K729r941p405j0817J545J3972R637k496L474J4907
$$ -54718 -46960 -34027 15593 18322 8381 976 -9841 -8296 5676 15313 12817 16291 31198
16108C1198j3589J5999j7288k4483p258Q874K8668J3590l2719j3374j6901K991
$$ 31198 17609 33608 16320 -8163 -15421 -6547 22121 35711 2992 -10382 -27283 -24292
16096b4292Q42K0931N5003j3066o274j2037m8209J015J274M27J842K2409M612
$$ -24292 -23450 -2519 52484 39418 33144 21107 -27102 -26087 -24813 -24386 -22544 -135 4477
16083D477n775j5241J888p87k5671J1677J2867L59K6762j3122j912j544J01J9956
$$ 4477 -1298 -16539 -14651 -15438 -41109 -29432 -16565 -16206 10556 -2566 -4478 -6022 -5921 14035
16069A4035p368l3628Q372Q274k046j6784o351O955k4853j7835o40L2461J5962
$$ 14035 6667 -26961 -18589 -10315 -12361 -29145 -35496 -28541 -53394 -71229 -71869 -39408 -23446
16056b3446L2992j9517l3162P109K3356J7749J2297J4883n878k5400j3778J3850
$$ -23446 9546 -9971 -43133 -36024 -12668 5081 17378 32261 26383 983 -12795 1055
16044A055K0309q432j9012o43K0718K2963P550l4518m022J8031J0757l1369n1216
$$ 1055 21364 12932 -6080 -6723 13995 36958 44508 9990 5968 23999 34756 3387 -47829
16031d7829m6122L6575L0980j0452k5815k3220j6771K1561N1055N950k8372l1542
$$ -47829 -93951 -57376 -26396 -36848 -62663 -85883 -102654 -81093 -30038 -24088 -52460 -84002
16019h4002r455K8722K5409P536K4784L3337L589q348l6494K8407R958q428R577
$$ -84002 -93457 -64735 -39326 -31790 -7006 26331 29920 21572 -14922 13485 23443 15015 24592
16006B4592M524P613j3886k5441O792k7199J4271K5263P229k7140k5005L3270
$$ 24592 29116 36729 22843 -2598 4194 -23005 -8734 16529 23758 -3382 -28387 4883
15994D883N83l1156L0478j0157p597l0871R806j3053J9669K6031P553j1039k5264
$$ 4883 5466 -25690 4788 -5369 -12966 -43837 -34031 -47084 -27415 -1384 6169 -4870 -30134
15981c0134M4337M2769n299l2616m9602k0357q626n912o916L0587M6747j9607
$$ -30134 14203 56972 51673 19057 -30545 -50902 -59528 -65440 -72356 -41769 4978 -14629
15969a4629j5257n254K3352K2047J4048l9557q622J5119J2015J6500j4174j3138
$$ -14629 -29886 -35140 -11788 10259 24307 -15250 -23872 -8753 3262 19762 5588 -7550
15957g550o906K3034J5980j103J3603q998k8282L392K1942j9447k3089j2268k4625
$$ -7550 -14456 8578 24558 23455 37058 28060 -222 3170 25112 5665 -17424 -29692 -54317
15944e4317J1295L2354K9132q432R381M688L8437n359n3443k7580J1322J6284
$$ -54317 -43022 -10668 18464 10032 19413 24101 62538 57179 3736 -23844 -12522 3762
15932C762j5652k48j3872n38q122J1576M0705j5857m4997p376k5464L3875K9974
$$ 3762 -11890 -12138 -26010 -26548 -34670 -23094 17611 1754 -43243 -50619 -76083 -42208 -12234
15919a2234K4796j5177l8105K47J2337K0121M208p748j1256l7407j0953K6860
$$ -12234 12562 -2615 -40720 -40473 -28136 -8015 -3807 -11555 -22811 -60218 -71171 -44311
15907d4311L8830j3286L989o229K5422L2207L1416o6427j9569j1432J9586K0945
$$ -44311 -5481 -18767 -14778 -21007 4415 36622 68038 1611 -17958 -29390 -9804 11141
15895A1141j3241L841M424J2644K8866q294j3890K2400j9107q170k6344l4991
$$ 11141 -2100 1741 6165 18809 47675 39381 25491 47891 28784 20614 -5730 -40721
15883d0721J6487j5063l757L798J7750Q276n987r445J1619j6143J8584N0037q385
$$ -40721 -24234 -39297 -43054 -39256 -21506 -13230 -19217 -28662 -17043 -33186 -14602 35435 27050
15870B7050m4372k789r030K5918J9751j122m8499j2445j4862L4716K0522L6462
$$ 27050 -17322 -20111 -29141 -3223 16528 15406 -33093 -45538 -60400 -25684 -5162 31300
15858C1300L162j1209K305J0919K43M079J0687j8248l5257J8383q644k2348j7402
$$ 31300 34462 23253 25558 36477 36720 40799 51486 33238 -2019 16364 7720 -14628 -32030
15845c2030K396j2086Q771M1714l590M330N2247k502n0038k9043k5772K8268J1719
$$ -32030 -29634 -41720 -32949 8765 5175 9505 61752 59250 9212 -19831 -45603 -17335 -5616
15832e616k7495k1872J0751K0374J7776J393k1425m2663J9668L7836K5380j7046
$$ -5616 -33111 -54983 -44232 -23858 -6082 -4689 -26114 -68777 -49109 -11273 14107 -2939
15820b939J4700J7571j4144k3800j273K6122K3782L416m0981k0814j9502J5620
$$ -2939 11761 29332 15188 -8612 -9885 16237 40019 43435 2454 -18360 -37862 -22242
15808b2242J4662J5537n981J7561J820l4395j9529L4794M550J535O238m867J034
$$ -22242 -7580 7957 1976 19537 21357 -13038 -32567 2227 6777 8312 14550 9683 10717
15795A0717J0128m2796m979J5645O293j662q071j945J7808p327l3377j1999M927
$$ 10717 20845 -21951 -26930 -11285 -4992 -6654 -14725 -16670 1138 -6189 -39566 -51565 -46638
15782d6638M6585J8667O126Q420K77O855l554R860j6009j7740J1307j3121l0110
$$ -46638 -53 18614 24740 33160 33437 40292 36738 46598 30589 12849 24156 11035 -19075
15769a9075J212J4142J7085K915n432j1957k3471m942P85m1421j5585K2731J7237
$$ -19075 -17863 -3721 13364 16279 10847 -1110 -24581 -29523 -28738 -70159 -85744 -63013 -45776
15756d5776j5024L0085M7838J1243k628K904m0261l0923R433l4625N520p875Q64
$$ -45776 -60800 -30715 17123 28366 25738 28642 -11619 -42542 -33109 -67734 -62214 -70089 -69225
15743f9225M000N58M6103P970J4085J5721L2740j7212m621K128q339M66P087q00
$$ -69225 -65225 -64667 -18564 -10594 3491 19212 51952 34740 30119 32247 23908 24374 31461 30661
15729C0661j4556K62M593l061J1492j8833m7343j7352m907J2817J6559K5084J6899
$$ 30661 16105 16367 20960 17899 29391 10558 -36785 -54137 -59044 -46227 -29668 -4584 12315
15716A2315j294M911k9091k6521P585J0728K4244k1882N250j2875M707L7731j199
$$ 12315 11021 15932 -13159 -39680 -32095 -21367 2877 -19005 -13755 -26630 -21923 15808 14609
15703A4609m0954k1110k254K7149N210J9304j3856j9168K4588M381M805M499J3329
$$ 14609 -26345 -47455 -49709 -22560 -17350 1954 -11902 -31070 -6482 -2101 2704 7203 20532
15690B0532m684n365L164j3712j6899O542K2764Q874P022J4060Q838k6413r338
$$ 20532 15848 10483 13647 -65 -16964 -10422 12342 21216 28238 42298 51136 24723 15385
15677A5385Q024n206N980M71k381n1693n4228j2105M9095L2041j5224j8607K6530
$$ 15385 23409 18203 24183 24654 22273 -29420 -83648 -95753 -46658 -14617 -29841 -48448 -21918
15664b1918J5807J00K4005l0830K654Q573K303L3121L2170N045m0228l7306j1046
$$ -21918 -6111 -6011 17994 -12836 -10182 -1609 694 33815 65985 71030 30802 -6504 -17550
15651a7550J4598M674J2113l40j2789J8495K1005k5340m5795K5898P249k0894
$$ -17550 -2952 1722 13835 13495 706 19201 40206 14866 -30929 -5031 2218 -18676
15639a8676n779q472R207N530j971J1081q42K584M367K511M916k157J7110J5757
$$ -18676 -24455 -32927 -23720 -18190 -20161 -9080 -9922 -7338 -2971 -460 4456 2299 19409 35166
15625C5166l668o455j1885J7k6136K2415K3766k0285O892n957k3193j6460P533
$$ 35166 31498 25043 13158 13175 -12961 9454 33220 12935 19827 13870 -9323 -25783 -18250
15612a8250N866m4142j0992m540J9188M1243K4765J5327J5183k438j5887k0524
$$ -18250 -12384 -56526 -67518 -72058 -52870 -11627 13138 28465 43648 41210 25323 4799
15600D799m168R313j1713k2882k1051J0563J3345n764J8221K158J4772j881n623
$$ 4799 631 9944 -1769 -24651 -45702 -35139 -21794 -27558 -9337 -7179 7593 5712 89
15587H9P450J177J6976L2373L1918J123k9707p2092j226J6741J1568m592P050
$$ 89 7539 8716 25692 58065 89983 91106 61399 -10693 -11919 4822 16390 11798 18848
15574A8848l183j9449l1925j0627J3855K552L7842p95k4713J5144M8025l402j2459
$$ 18848 15665 -3784 -35709 -46336 -32481 -29929 7913 7118 -17595 -2451 45574 42172 29713
15561B9713K5540r208k8100J6895j5019K4282J6668n2916k2318Q643L0474j0665
$$ 29713 55253 46045 17945 34840 19821 44103 60771 7855 -14463 -5820 24654 13989
15549A3989j3154k693j8755N388J9346j8385R612P312l8714J0966J4348J3988
$$ 13989 835 -1858 -20613 -15225 4121 -14264 -4652 2660 -36054 -25088 -10740 3248
15537C248k8252J1706M0639R401j2327J080q137j1349o975J6031k3107o821K4230
$$ 3248 -25004 -13298 27341 36742 24415 25495 17358 6009 -966 15065 -8042 -14863 9367
15524I367K5341k732q084R159J1720q608o593k8772l992j5480l3016m478K3290
$$ 9367 34708 31976 23892 33051 44771 36163 29570 798 -3194 -18674 -51690 -56168 -32878
15511c2878j829L173j5008m175j9748J7253L4651N145J1581J0665R474M1875n3938
$$ -32878 -34707 -31534 -46542 -50717 -70465 -53212 -18561 -13416 -1835 8830 18304 60179 6241
15498F241k3854O394l7094J3754K0292J3809J1642J0217k6361O215j8113j9280
$$ 6241 -17613 -11219 -48313 -34559 -14267 -458 11184 21401 -4960 1255 -16858 -36138
15486c6138J116K2446J6422J7369p624J7906j5992l351l773l2446j7343j0377
$$ -36138 -35022 -12576 3846 21215 13591 31497 15505 12154 8381 -24065 -41408 -51785
15474e1785q286L8753K3123K1028J6979l6071j7818j3091r143r56J7300n884J3567
$$ -51785 -60071 -21318 1805 22833 39812 3741 -14077 -27168 -36311 -37267 -19967 -25851 -12284
15461a2284M6047J7393j6755l9328J8941J5486J8013n337q616K675k1682j1397
$$ -12284 33763 51156 34401 -4927 14014 29500 47513 42176 33560 36235 14553 3156
15449C156K5889p908l7377j1695l567n341M3617K9022k0323n270k3654j4476P096
$$ 3156 29045 21137 -16240 -27935 -31502 -36843 6774 35796 15473 10203 -13451 -27927 -20831
15436b0831l0841j733R615l245M3326K0987r696K7842k9935j5464M1605J0388
$$ -20831 -51672 -53405 -43790 -47035 -3709 17278 7582 35424 5489 -9975 31630 42018
15424D2018k7647j4008J6406J0889k403k3590m1982k1172J511j463K3506Q224
$$ 42018 14371 363 16769 27658 25255 1665 -40317 -61489 -59978 -61441 -37935 -29711
15412b9711L3339l833L457r678Q840J797l3947J0207k1933j9981K6744O0629M284
$$ -29711 3628 -205 3252 -6426 2414 4211 -29736 -19529 -41462 -61443 -34699 25930 30214
15399C0214m0596j1322K7746K9066K1054k5690k6017k4661Q561j4287j739p253
$$ 30214 -10382 -21704 6042 35108 56162 30472 4455 -20206 -11645 -25932 -27671 -34924
15387c4924K8233M3132J180N369j9063l1255l3056K3439O303j5875k1111L89L962
$$ -34924 -6691 36441 37621 42990 23927 -7328 -40384 -16945 -10642 -26517 -47628 -47239 -43277
15374d3277l18j7787L4931M7479j6545n061k4566k8736J9866j4273P246j0995
$$ -43277 -43595 -61382 -26451 21028 4483 -578 -25144 -53880 -34014 -48287 -41041 -52036
15362e2036R90P935J0175J3055k0661k0669L0530K1357k4624o328P481J2960K6006
$$ -52036 -51046 -43111 -32936 -19881 -40542 -61211 -30681 -9324 -33948 -40276 -32795 -19835 6171
15349F171J9244J136j4300j2238k0897o172k433q822j924K9310K828l5547m0396
$$ 6171 25415 26551 12251 13 -20884 -27056 -29489 -38311 -40235 -10925 -8097 -43644 -84040
15336h4040K4047J9215J0264J946L4797K5008j2952m1369j7486K4102L2557j1594
$$ -84040 -59993 -40778 -30514 -28568 6229 31237 18285 -23084 -40570 -16468 16089 4495
15324D495m2083K7505K8729m2028l7885m041J0292j0162K4614J0673p54K2489
$$ 4495 -37588 -10083 18646 -23382 -61267 -65308 -55016 -65178 -40564 -29891 -30645 -8156
15312h156P998k9327q446J4166L4450M0912P920j6786j5801K57p294j0079J658
$$ -8156 -158 -29485 -37931 -23765 10685 51597 59517 42731 26930 27187 19893 9814 11472
15299A1472L6462l0922l1014N138P549N975j8354K347J4297J189o923j4006j9672
$$ 11472 47934 17012 -14002 -8864 -1315 4660 -13694 -11347 2950 4139 -2784 -16790 -36462
15286c6462L1300K2945K2806k1429m9868l2296J2502Q754J9248M2934J1594p373
$$ -36462 -5162 17783 40589 19160 -30708 -63004 -50502 -41748 -22500 20434 32028 24655
15274B4655j1450J644P14O383m0219j1049J9160m825m086j4869J2103M9710q32
$$ 24655 13205 14849 15563 21946 -18273 -29322 -10162 -14987 -19073 -33942 -21839 27871 27039
15261B7039R813J6119j7388k8861k8931j2206l084J5377j3753J968K072K4431
$$ 27039 36852 52971 35583 6722 -22209 -34415 -37499 -22122 -35875 -33907 -31835 -7404
15249g404n130j5030K8343m461k8619n259K945k984L858P507L477J0444J0496
$$ -7404 -12534 -27564 779 -3682 -32301 -37560 -34615 -37599 -33741 -26234 -22757 -12313 -1817
15236a817K2397J0874j4447j273K5072j9051k3531l2701m5469K5201J6268j3944
$$ -1817 20580 31454 17007 15734 40806 21755 -1776 -34477 -79946 -54745 -38477 -52421
15224e2421K425L8251M3061P551M904p865m9059m6534R4J9601J8639L0165L5458
$$ -52421 -49996 -11745 31316 38867 43771 35906 -13153 -59687 -59593 -39992 -21353 8812 44270
15211D4270m4267n9707R935L4929R022M8599J9156l8172k9460q847K8540j899
$$ 44270 3 -59704 -49769 -14840 -5818 42781 61937 23765 -5695 -14542 13998 12099
15199A2099j1090j0326K8153M6829r520m1150r252L9537j1095j5042o080j7110
$$ 12099 1009 -9317 18836 65665 56145 14995 5743 45280 34185 19143 13063 -4047
15187d047q70O204J318J3060O357K0000k1951j6065k8573q044R980j1670j4373
$$ -4047 -4917 1287 2605 15665 22022 42022 20071 4006 -24567 -32611 -22631 -34301 -48674
15174d8674M3495Q070J6891j4727j1040j2169l907l1649L6052M6463k0553J87
$$ -48674 -5179 2891 19782 5055 -5985 -18154 -22061 -53710 -17658 28805 8252 8439
15162H439L717l5950k5349J4192K6861l4844k6778j3473J9165N5719L3224j791
$$ 8439 12156 -23794 -49143 -34951 -8090 -42934 -69712 -83185 -64020 -8301 24923 23132
15150B3132o495j5189p798n88k1614k4971j2846N7683Q394j3717j0806j9254j278
$$ 23132 16637 1448 -6350 -6938 -28552 -53523 -66369 -8686 -292 -14009 -24815 -44069 -45347
15137d5347r312K5075K6647J2472Q945K1052r311k5577j1033O083n601J4530p484
$$ -45347 -54659 -29584 -2937 9535 18480 39532 30221 4644 -6389 -306 -5907 8623 1139
15124A139K7146j1022J6888L0338J1041k1530j5654n743l7794p782N0375k8223
$$ 1139 28285 17263 34151 64489 75530 54000 38346 32603 -5191 -12973 37402 9179
15112I179j9350L701J307n4r416j5341k4875l711N1722j655m711J3482J5426J5733
$$ 9179 -10171 -6470 -5163 -5217 -14633 -29974 -54849 -58560 -6838 -8493 -13204 278 15704 31437
15098C1437k8736k6583l2948M065K7262K2240K842k4221K064L1326L0355Q137
$$ 31437 2701 -23882 -56830 -52765 -25503 -3263 -421 -24642 -22578 8748 39103 47240
15086D7240J9224j2720m890l240n9290m9911R590O8043O543l4476R929j3367r800
$$ 47240 66464 53744 48854 45614 -13676 -63587 -53997 14046 20589 -13887 -3958 -17325 -27125
15073b7125J2643j744J0385J4266J6687k890k1391j2929j6580j8262j3984k074
$$ -27125 -14482 -16226 -5841 8425 25112 22222 831 -12098 -28678 -46940 -60924 -62998
15061f2998Q286K4872N4840L003k5970k9668j187L8506q59j8913j4421O254J721
$$ -62998 -54712 -29840 25000 28003 2033 -27635 -28822 9684 8825 -10088 -24509 -18255 -16534
15048a6534K4609j1651J3434j239R549j804k9169J7651J2880M3023r153k4848
$$ -16534 8075 -3576 9858 8619 18168 16364 -12805 4846 17726 60749 51596 26748
15036B6748m192j8963J4765J2236O978M0744M365m0075j066l3006n1153j5252
$$ 26748 22556 3593 18358 30594 37572 78316 82681 42606 41540 8534 -42619 -57871
15024e7871K1405K6015K9914J7960k4015l1492J1773K0412k37Q421L013k4788
$$ -57871 -36466 -10451 19463 37423 13408 -18084 -6311 14101 13864 22285 25298 510
15012E10R491J5494L118j1428N843N27J2123r361j5605L3849J0680j7017K8830
$$ 510 10001 25495 28613 17185 23028 23555 35678 26317 10712 44561 55241 38224 67054
14999F7054m254j4886j9873k3424n1854l089L7423K2663M913j7012j7027Q140
$$ 67054 62800 47914 28041 4617 -47237 -50326 -12903 9760 14673 -2339 -19366 -11226
14987a1226J3219o669j1249L8342L0301k124j3365o354J1558k4194j2040L740
$$ -11226 1993 -4676 -15925 22417 52718 50594 37229 30875 42433 18239 6199 9939
14975I939j733l8801m5499J6975O357M2931J0358k9952J3671L2089J5437k9203
$$ 9939 8206 -30595 -76094 -59119 -52762 -9831 527 -29425 -15754 16335 31772 2569
14963B569o512j1883J2488L1817q878l794Q416J6148j0118j8236j0656J5884J9148
$$ 2569 -3943 -15826 -3338 28479 19601 15807 24223 40371 30253 12017 1361 17245 36393
14950C6393l494l4306m104l255J7979K8994P58K929j9972K0706K6179m832q42
$$ 36393 32899 -1407 -5511 -8766 9213 38207 38965 41894 21922 42628 68807 63975 63133
14937F3133j3453J3101n823l1446N093J0J4780o097o77l067j9165j2238K6177
$$ 63133 49680 62781 56958 25512 30605 30615 45395 39298 38621 35554 16389 4151 30328
14924C0328o492l0273o172P480J4278M617j8074J5622J8998j0642q270k2269l0109
$$ 30328 23836 -6437 -12609 -5129 9149 13766 -4308 11314 30312 19670 11400 -10869 -40978
14911d0978M845K6909m210j4596J3249J206o651j0025j0445Q640K0686Q258k1968
$$ -40978 -36133 -9224 -13434 -28030 -14781 -13575 -20226 -30251 -40696 -32056 -11370 -3112 -25080
14898b5080j606J1244j7657q340L1274J0910k7299l5248L366J8778o140k1433
$$ -25080 -26686 -15442 -33099 -41439 -10165 745 -26554 -61802 -58436 -39658 -45798 -67231
14886f7231K876M187J2719O655Q792r659k808J7269K7402J5599J7599l2253k2074
$$ -67231 -64355 -60168 -47449 -40794 -32002 -41661 -44469 -27200 202 15801 33400 1147 -20927
14873b0927K1167J2961k8164j4621J2791n1676k4316M361L4191K3591K3706K759
$$ -20927 240 13201 -14963 -29584 -16793 -68469 -92785 -88424 -54233 -30642 -6936 -4177
14861d177J4058K4818J825R665J7217j2395n5588j0262M7826O5262j34l8946n551
$$ -4177 9881 34699 36524 46189 63406 51011 -4577 -14839 32987 98249 98115 59169 53618
14848E3618o575j5332p092k0761j8113j4373K7280K6489k3233J0763j281K9217
$$ 53618 47043 31711 24619 3858 -14255 -28628 -1348 25141 1908 12671 11390 40607
14836D0607l139j8133l1155k8503K9905q360r54j4163j3292j1102J3602M0169
$$ 40607 37468 19335 -11820 -40323 -10418 -18778 -19732 -33895 -47187 -58289 -44687 -4518
14824d518j3162k3094J2827j3377k0712J6116L7618J9632k0439k6544k0598K1502
$$ -4518 -17680 -40774 -27947 -41324 -62036 -45920 -8302 11330 -9109 -35653 -56251 -34749
14812c4749j940p116k5046K4526L7539K6445O994J3774J4363k819N6273J0477
$$ -34749 -36689 -43805 -68851 -44325 -6786 19659 26653 40427 54790 51971 108244 118721
14800A18721k8724k0865j2644j2634j2561K8366j0623l6J17m715l6175j1760p739
$$ 118721 89997 69132 56488 43854 31293 59659 49036 49000 49117 44402 8227 -3533 -11272
14787a1272j0913J7016K7171J1035J9863J6623l6412j4893k050l1644l0866j0537
$$ -11272 -22185 -5169 22002 33037 52900 69523 33111 18218 16168 -15476 -46342 -56879
14775e6879N0831J1945k2955j5866K4084K2546k9983n934k4261L3281M6857l6681
$$ -56879 -6048 5897 -17058 -32924 -8840 13706 -16277 -22211 -46472 -13191 33666 -3015
14763c015m2712K1373M2533J3400L0586O652J5288N84j6532k2259K795K211j3382
$$ -3015 -45727 -24354 18179 31579 62165 68817 84105 84689 68157 45898 48693 50904 37522
14750C7522Q377K82n617k6339k9542j1832L1461M4515k3570J6185j7303l4892
$$ 37522 45899 46181 40564 14225 -15317 -27149 4312 48827 25257 41442 24139 -10753
14738a0753Q626P419q2K3603K2240j7112n410J1229J0884K224j0647l5032k1696
$$ -10753 -2127 5292 5210 28813 51053 33941 28531 39760 50644 52868 42221 7189 -14507
14725a4507J7794K1256J2749R994J6176k8553k7644j9414J2315N819q460l3690
$$ -14507 3287 24543 37292 47286 63462 34909 7265 -12149 166 5985 -2475 -36165
14713c6165j5650L2610J6318Q169J5745J7886J9688l8021p443k1021j0110R615
$$ -36165 -51815 -19205 -2887 5282 21027 38913 58601 20580 13137 -7884 -17994 -8379
14701h379j3611J5015K1325N191J139j7575L674k83j5976n354l0993j517m954
$$ -8379 -21990 -6975 14350 19541 20680 3105 6779 6496 -9480 -14834 -45827 -47344 -52298
14688e2298k1369J8025L3011j8170M200J0537k490j9534J2639L2678n310J9158
$$ -52298 -73667 -55642 -22631 -40801 -36601 -26064 -28554 -48088 -35449 -2771 -8081 11077
14676A1077p008j1874N313K6476j1722n178J1378L601K866J226N132Q68l8026
$$ 11077 4069 -7805 -2492 23984 12262 7084 18462 22063 24929 26155 31287 32155 -5871
14663e871J0226K4831L8625k630o256l6966K618M412P837k401j3902l832k4101
$$ -5871 4355 29186 67811 65181 58925 21959 24577 28989 36826 34425 20523 16691 -7410
14650g410k1804K0984J6682l6230J2958J9014K0930r965l4567q689J8051o498
$$ -7410 -29214 -8230 8452 -27778 -14820 4194 25124 15159 -19408 -28097 -10046 -16544
14638a6544Q425j7930m129m890P482J6538j7942p695M6387n371j1315K928q378
$$ -16544 -8119 -26049 -30178 -35068 -27586 -11048 -28990 -36685 9702 4331 -6984 -4056 -12434
14625a2434N117M640p589K0696M76k8101q307J2364K4256N46J1245K3347j0866
$$ -12434 -7317 -2677 -10266 10430 10906 -17195 -25502 -13138 11118 11664 22909 46256 35390
14612C5390j4012k1320l7429J502n391o137j2978K095Q763J6260J1854J3391p091
$$ 35390 21378 58 -37371 -35869 -41260 -47397 -60375 -58280 -49517 -33257 -21403 -8012 -15103
14599a5103M4027M6836k0657n9234m8256K229M3000K6232l868l2325r364j5558
$$ -15103 28924 75760 55103 -4131 -52387 -50158 -7158 19074 15206 -17119 -26483 -42041
14587d2041K1362O979m258K8613j9063r054K8332K6860m879k3576k5570l2752
$$ -42041 -20679 -13700 -17958 10655 -8408 -17462 10870 37730 32851 9275 -16295 -49047
14575d9047K6141K4755K0920j5168l4624K4735N173J3380n081k2219L395l2570
$$ -49047 -22906 1849 22769 7601 -27023 -2288 2885 16265 11184 -11035 -7640 -40210
14563d0210Q57M9126N882K816K9332N051k1587L662j4931k2360M822K5535P67
$$ -40210 -39353 9773 15655 18471 47803 52854 31267 34929 19998 -2362 2460 27995 28762
14550B8762r018M475J954R178j0317o817O774l1167l0758l3075k6937K5740K6118
$$ 28762 19744 24219 26173 35351 25034 18217 24991 -6176 -36934 -70009 -96946 -71206 -45088
14537d5088K3110J3408l2736Q313M7273K5622k7672n114k2608L283j1813m4944
$$ -45088 -21978 -8570 -41306 -32993 14280 39902 12230 7116 -15492 -12209 -24022 -68966
14525f8966o1123M3588N0914J6882O03l494J5861M5080P600m0736L557k1892j4174
$$ -68966 -130089 -86501 -35587 -18705 -18102 -21596 -5735 39345 46945 6209 9766 -12126 -26300
14512b6300J654L3143J1190r492j7997j130J3223K1227J6715k4692m1560J5386
$$ -26300 -24646 8497 19687 10195 -7802 -8932 4291 25518 42233 17541 -24019 -8633
14500h633J7930l543J2259J0559n1056l7522L7342L1730j8795J4914K7456Q194
$$ -8633 9297 5754 18013 28572 -22484 -60006 -22664 9066 -9729 5185 32641 40835
14488D0835l8020j7942K1857J9040M349j7333l1486k1749j3205o247r299L160
$$ 40835 2815 -15127 6730 25770 30119 12786 -18700 -40449 -53654 -59901 -69200 -66040
14476f6040K4408M0172N923r91J0204N531Q613j4806k1135j8735m206R047O511
$$ -66040 -41632 -1460 4463 3472 13676 19207 27820 13014 -8121 -26856 -31062 -22015 -15504
14463a5504N825J700J6046k674J429k3481j8059K741p573r210J8500M0388N4193
$$ -15504 -9679 -7979 8067 5393 6822 -16659 -34718 -31977 -39550 -48760 -30260 10128 64321
14450F4321J0033m0101m8472k7887J5052O8K9479K2146K6579Q65m6099l3657J7051
$$ 64321 74354 34253 -14219 -42106 -27054 -26986 2493 24639 51218 52083 5984 -27673 -10622
14437a0622J3045R346r868l9748K0718J5092Q858k327m943j32m5913k2030q598
$$ -10622 2423 11769 1901 -37847 -17129 -2037 6821 4494 -449 -581 -46494 -68524 -77122
14424g7122J5574J1688J3031K7788N292N237K1914R494k9107k959r673L1357M2053
$$ -77122 -61548 -49860 -36829 -9041 -3749 1488 23402 32896 3789 830 -8843 22514 64567
14411F4567M33J3671k8302l2512k9181j5908j5434P542J9015K6096k602l714j6711
$$ 64567 65000 78671 50369 17857 -11324 -27232 -42666 -35124 -16109 9987 7385 3671 -13040
14398a3040O482j5638P513M0188k601m7201o077O406K0520J1592j4905l651j7422
$$ -13040 -6558 -22196 -14683 25505 22904 -24297 -30374 -23968 -3448 8144 -6761 -10412 -27834
14385b7834K362J992O887K462M799O509R162o13j263P412r336j5488R610K1711
$$ -27834 -25472 -23480 -16593 -14131 -9332 -2823 6339 5726 4463 11875 2539 -12949 -3339 18372
14371A8372J0341m3514k9817J5071Q082R01N420l753j315q334K793O80k465J2044
$$ 18372 28713 -14801 -44618 -29547 -21465 -20564 -15144 -18897 -20212 -28546 -25753 -25073 -27538 -15494
14357a5494J7126K887J3918K8919j1543l4881K3338K6580K0414P396k318k3295
$$ -15494 1632 4519 18437 47356 35813 932 24270 50850 71264 78660 76342 53047
14345E3047k1905R726j3879M537N811m821l660p224j8963r455J4588J327P344
$$ 53047 31142 40868 26989 31526 37337 32516 28856 21632 2669 -6786 7802 9129 16473
14332A6473l2899J7979j9427J2663K4581J4444O62k1430l1038o840l362K7828
$$ 16473 -16426 1553 -17874 -5211 19370 33814 34476 13046 -17992 -24832 -28194 -366
14320c66K5602j5828R130o941L5986j2915n1443j9671J0635L3258Q519j2123j3839
$$ -366 25236 9408 18538 11597 47583 34668 -16775 -36446 -25811 7447 15966 3843 -9996
14307i996n290M911k5040J816J5904n256j7471P363K2449M3284j7341k4670K3379
$$ -9996 -15286 -10375 -35415 -33599 -17695 -22951 -40422 -33059 -10610 32674 15333 -9337 14042
14294A4042K3873M6066k4559k5512q253j102j7724l3298q94R372J846P620M1509
$$ 14042 37915 83981 59422 33910 25657 24555 6831 -26467 -27361 -17989 -16143 -8523 32986
14281C2986M2780j4264o68j7114m1138L820n960J0689M9171j086k422m1854m2599
$$ 32986 75766 61502 60834 43720 2582 6402 442 11131 60302 59216 56794 14940 -27659
14268b7659J2810L1266J9179j3911q296j2086Q347R435J7198J702j5949O412K5324
$$ -27659 -14849 16417 35596 21685 13389 1303 9650 19085 36283 37985 22036 28448 53772
14255E3772l3364l3312j5982j0223N0345P530j8529j250J1751j398J5340J4052
$$ 53772 20408 -12904 -28886 -39109 11236 18766 237 -1013 10738 9340 24680 38732
14243C8732k3228q039j8453o529L4934K8639l1636l9704j2291O901O315J0663
$$ 38732 15504 7465 -10988 -17517 17417 46056 14420 -25284 -37575 -30674 -24359 -13696
14231a3696M4829K2090m5376m6012j7809J2185L3100J4838K101k4766j2541J4403
$$ -13696 31133 53223 7847 -38165 -55974 -43789 -10689 4149 6250 -18516 -31057 -16654
14219a6654J0379J3592p446J2050K761J2853L096j2148p015J2325j3782k9304
$$ -16654 -6275 7317 -129 11921 14682 27535 30631 18483 11468 23793 10011 -19293
14207a9293K0023L9434j156l2849M491J9065L729k7369j2089j2714j5418J7774
$$ -19293 730 40164 39008 6159 10650 29715 33444 6075 -6014 -18728 -34146 -16372
14195a6372J5599J2675l230j7696o683k380M6045J5256N823l1812q229j641J926
$$ -16372 -773 11902 8672 -9024 -15707 -18087 27958 43214 49037 17225 8996 7355 9281
14182I281o016J9651j7986P704M0283M22r890l5282l016K7174J3592n879j1073
$$ 9281 3265 22916 4930 12634 52917 53339 43449 8167 5151 32325 45917 40038 28965
14169B8965j4299k9333j6097j7953J1435J1664M379j533k7084K5599J1396J7404
$$ 28965 14666 -14667 -30764 -48717 -37282 -25618 -21239 -22772 -49856 -24257 -12861 4543
14157D543K3240l5469k807Rr434R07L2611M889r770M221q571j061K886k6344k7750
$$ 4543 27783 -7686 -10493 -10484 -19918 -19011 13600 18489 8719 12940 4369 3308 6194 -20150 -47900
14142d7900j0942K3795M3004J3337j439J1939K0894l1100j1206P921K3882K4728
$$ -47900 -58842 -35047 7957 21294 19855 31794 52688 21588 10382 18303 42185 66913
14130F6913k6650l3994m184k678J2059j1964o297K5430K5414j1704j1954Q000
$$ 66913 40263 6269 2085 -593 11466 -498 -6795 18635 44049 32345 20391 28391
14118B8391J8468K2076j2888l675k8727j4127k548O134j675n4032k2162L2554
$$ 28391 46859 68935 56047 52372 23645 9518 6970 13104 11429 -42603 -64765 -32211
14106c2211L4690O834R936j0812j4239N274P454L5349K322k9336m0400j2542k574
$$ -32211 2479 9313 19249 8437 -5802 -528 6926 42275 44597 15261 -25139 -37681 -40255
14093d0255N123R04J65K10k747K1722l35J9818M405k9065k1767K8511O0149J9891
$$ -40255 -35132 -34228 -34063 -33853 -36600 -14878 -15213 4605 9010 -20055 -41822 -13311 46838 66729
14079F6729m4846n501n183k8250q309k2036L3218L0229J7678j9176p759O553L5004
$$ 66729 21883 16382 11199 -17051 -25360 -47396 -14178 16051 33729 14553 6794 13347 48351
14066D8351l4595q248J007k7031k9628J8361M4469L2671m7850M549K3757J8j2191
$$ 48351 13756 5508 6515 -20516 -50144 -31783 12686 45357 -2493 2056 25813 25831 13640
14053A3640N7867J8146j1873j254n1512R860K1558j2863m0228k4961n276J4258
$$ 13640 71507 89653 77780 76526 25014 34874 56432 43569 3341 -21620 -26896 -12638
14041a2638Q276l6775k7447l389K7094O5583j0571k4499P154L7769J3338o020
$$ -12638 -4362 -41137 -68584 -71973 -44879 20704 10133 -14366 -7212 30557 43895 37875
14029C7875m1001j1653r505K5701K9557J9038J2675l5515m6100l5731J0153l633
$$ 37875 -3126 -14779 -24284 1417 30974 50012 62687 27172 -18928 -54659 -44506 -48139
14017d8139M922M4144j5534j8343P995J4859J9215p443k9062p818K1758k789j7835
$$ -48139 -43217 927 -14607 -32950 -24955 -10096 9119 1676 -27386 -35204 -13446 -16235 -34070
14004c4070j2875L1343J1106k8057k668k345P485K7458L2737J7153o9l7783n1302
$$ -34070 -46945 -15602 -4496 -32553 -35221 -37566 -30081 -2623 30114 47267 47198 9415 -41887
13991d1887k7025L5526K6655j2707L834J7457K5649J170j3727L400j3833q62J0631
$$ -41887 -68912 -33386 -6731 -19438 -15604 1853 27502 28672 14945 18345 4512 3650 14281
13978A4281n940j3870j5063j5939R828Q241Q568o491K3200P300k462j4530j7238
$$ 14281 8341 -5529 -20592 -36531 -26703 -18462 -9894 -16385 6815 14115 11653 -2877 -20115
13965b0115j9206j0998K9415N0835O103j6534k2537J139o855j3447J4522L6949
$$ -20115 -39321 -50319 -20904 29931 36034 19500 -3037 -1898 -8753 -22200 -7678 29271
13953B9271O836j5253n136k9550K3053j3532m0584j0042K7792L8005J3345q32
$$ 29271 36107 20854 15718 -13832 9221 -4311 -44895 -54937 -27145 10860 24205 23373
13941B3373j4843k904Q00L6982j0915l8244k2282K3405J0564o68Q995l537K677
$$ 23373 8530 5626 6426 43408 32493 -5751 -28033 -4628 5936 5268 14263 10726 13403
13928A3403q963M519k0721J603O0698L1921k8922k9072j7787J0264K8102p404
$$ 13403 4440 8959 -11762 -10159 50539 82460 53538 24466 6679 16943 45045 37641
13916C7641j9673q348l9464J6519J5515K9169k753m745J1447o27l368j3910l0780
$$ 37641 17968 9620 -29844 -13325 2190 31359 28606 23861 35308 34681 31313 17403 -13377
13903a3377o273L4254P487m4684Q066k48J829p238j9436L0172P207L141O637o214
$$ -13377 -19650 14604 22091 -22593 -14527 -14775 -12946 -20184 -39620 -9448 -2241 900 7537 1323
13889A323J0854J412q598p170J9062K970k2848k2770K156K3729K4598l466R772
$$ 1323 12177 13589 4991 -2179 16883 19853 -2995 -25765 -23609 120 24718 21252 31024
13876C1024q561j1246J1807m788o743l3901j3411j4131k5276O677K0287J8968
$$ 31024 22463 11217 23024 18236 11493 -22408 -35819 -49950 -75226 -68549 -48262 -29294
13864b9294J4749M7627m423j3726p948J2854J4945K0400m8004o549K0650j0639
$$ -29294 -14545 33082 28659 14933 6985 19839 34784 55184 7180 631 21281 10642
13852A0642L1139N2472J8399q301k9162k6810l3375m312N725j9106J4775j6524
$$ 10642 41781 94253 112652 104351 75189 48379 15004 10692 16417 -2689 12086 -4438
13840d438R900k0690J7561M2425R54l1555l1398j8546L5350J4475O833J0590k3587
$$ -4438 5462 -15228 2333 44758 45712 14157 -17241 -35787 -437 14038 20871 31461 7874
13827G874R487L3348p401q930l6147J8455j7701l708M395J2332l9979k3838J9581
$$ 7874 17361 50709 43308 34378 -1769 16686 -1015 -4723 -328 12004 -27975 -51813 -32232
13814c2232M3075J364n43j9926k0216k8353L7382O0879k1152j8737N251j9475
$$ -32232 10843 12207 11664 -8262 -28478 -56831 -19449 41430 20278 1541 6792 -12683
13802a2683j7103J907j723p357M3969M7775j226k9216k3416k7130k8752j9365
$$ -12683 -29786 -27879 -29602 -36959 7010 54785 53559 24343 927 -26203 -54955 -74320
13790g4320L1285J3760J7431L4124j8451m219r14j0053J2978j4460j5613Q153
$$ -74320 -43035 -29275 -11844 22280 3829 -390 -1304 -11357 1621 -12839 -28452 -20299
13778b0299o775Q748K937J0710j0681L8497J3776L2239M242J3437m621k2061k8875
$$ -20299 -27074 -18326 -15389 -4679 -15360 23137 36913 69152 73394 86831 82210 60149 31274
13765C1274m0204k5011R0L5225j209J0403J5611P001j5159K1127k519k239j8487
$$ 31274 -8930 -33941 -33851 1374 165 10568 26179 33180 18021 39148 36629 34390 15903
13752A5903j1840P410j5996m181K8300k254p873J2031J0070J848j7056n0162J894
$$ 15903 4063 11473 -4523 -8704 19596 17342 9469 21500 31570 33418 16362 -33800 -31906
13739c1906M0244J2838L2825j4052j3467l4882l6537K2657K6411k007l458K3156
$$ -31906 8338 21176 54001 39949 26482 -8400 -44937 -22280 4131 2124 -1334 21822
13727B1822M8322J1060m0339m6522L7923M8582j7947m6257o91j88p807j1934N992
$$ 21822 70144 81204 40865 -5657 32266 80848 62901 16644 15953 15765 7958 -3976 2016
13714B016k1641J290K4115o804r749J3199j1731j170q70j316K6227m517j9673
$$ 2016 -19625 -18335 5780 -1024 -10773 2426 -9305 -10475 -11345 -12661 13566 9049 -10624
13701a0624O741J8769J7153J837K1132N1K121Q338p500j8098j397K4539j2202
$$ -10624 -3883 14886 32039 33876 55008 55059 57180 65518 58018 39920 38523 63062 50860
13688E0860l6292j7273K3582J247j7209R766K2072j0899k1611M2018K7773k4517
$$ 50860 14568 -2705 20877 22124 4915 14681 36753 25854 4243 46261 74034 49517
13676D9517l3363j1259j7432j5453o100L1196J0472m8166K7738O2876P001l6159
$$ 49517 16154 4895 -12537 -27990 -34090 -2894 7578 -40588 -12850 50026 57027 20868
13664B0868j3003J1646K7318J261j8892j5945p168n354j9322P57L1195M951o65
$$ 20868 7865 19511 46829 48090 29198 13253 6085 731 -18591 -17834 13361 18312 17647
13651A7647R516R36r645m178l1947j9497M097J1928J7576J9752R387j0298l3165
$$ 17647 27163 28099 18454 14276 -17671 -37168 -33071 -21143 -3567 16185 25572 15274 -17891
13638a7891j5413O614L3324L0761L3251l2598j8801n20j4357J4216K051r493L7499
$$ -17891 -33304 -26690 6634 37395 70646 38048 19247 18727 4370 18586 20637 11144 48643
13625D8643N858n8P156J1338l034k0152l2552n346j4778K0288K1356l820k4960
$$ 48643 54501 54443 61599 72937 69903 49751 17199 11853 -2925 17363 38719 34899 9939
13612I939l0958o067L668o286J7181J3585J4217Q822j4015J0640J8256k8618l2312
$$ 9939 -21019 -27086 -23418 -29704 -12523 1062 15279 24101 10086 20726 38982 10364 -21948
13599b1948J6381J6313l9943K629L478O851j0634l0826P737K5073M1144J629j809
$$ -21948 -5567 10746 -29197 -26568 -23090 -16239 -26873 -57699 -49962 -24889 16255 17884 16075
13586A6075p468J9124L4009k7194m3094J0678J4157J1607j3457P444j0695j588
$$ 16075 8607 27731 61740 34546 -8548 2130 16287 27894 14437 21881 11186 9598
13574I598j4170k4777R722M9320J3090k1128j0927P112K7251J3178N986q124p848
$$ 9598 -4572 -29349 -19627 29693 42783 21655 10728 17840 45091 58269 64255 56131 48283
13561D8283p890j3648j0K761K737k6855j2306m572J1196J9666J417R468k317k1007
$$ 48283 40393 26745 26735 29496 32233 5378 -6928 -11500 -304 19362 20779 30247 27930 6923
13547F923J4750K8290p4k0006j8059M3463L1455J2836j1418j7166n3009r536J1586
$$ 6923 21673 49963 49889 29883 11824 55287 86742 99578 88160 70994 17985 8449 20035
13534B0035Q74J0983M321k1572l0890K4840J7395J3955R482p325j3736m229r324
$$ 20035 20909 31892 36213 14641 -16249 8591 25986 39941 49423 42098 28362 24133 14809
13521A4809J0475J3783Q853n7430l6323K2847K0648k2677l4878J746K6178K1694
$$ 14809 25284 39067 47920 -9510 -45833 -22986 -2338 -25015 -59893 -58147 -31969 -10275
13509a0275k6061L0463M6546k2599Q365J2893l1059k2283Q670J2242k8515K8293
$$ -10275 -36336 -5873 40673 18074 26439 39332 8273 -14010 -5340 6902 -21613 6680
13497F680l580K5736k236k1824r367j6986j9207k195J1818J4916p029L785J3816
$$ 6680 3100 28836 26600 4776 -4591 -21577 -40784 -42979 -31161 -16245 -23274 -19489 -5673
13484e673J6908l1823K5255L4234m016m1092J7806J1317l5882r17J2716p681l042
$$ -5673 11235 -20588 4667 38901 34885 -6207 11599 22916 -12966 -13883 -1167 -8848 -11890
13471a1890p810K955L60j5545j8339J5870k3961J6190O6560L5073k2838K986N248
$$ -11890 -19700 -16745 -16385 -31930 -50269 -34399 -58360 -42170 24390 59463 36625 39611 44859
13458D4859j1925q191K444j1395K859J7999k7187Q773M32q302j6763J0241K7479
$$ 44859 32934 24743 27187 15792 18651 36650 9463 18236 18668 10366 -6397 3844 31323
13445C1323K474J0533K4000o559j1444k7760J428L9360j4793j6219r057M814J171
$$ 31323 33797 44330 68330 61771 50327 22567 23995 63355 48562 32343 23286 28100 29271
13432B9271L300p126n1398k7376J3349L9208J5788K0496L554l820J6417%q236
$$ 29271 32571 25445 -25953 -53329 -39980 -772 15016 35512 39066 35246 51663 51663 43427
13419D3427L559k918k3966j3014k8328l6343r524L0812n266M898J5376K7322J5789
$$ 43427 46986 44068 20102 7088 -21240 -57583 -67107 -36295 -41561 -36663 -21287 6035 21824
13406B1824K8580J1589j6270k6634k0029l665L438M5171L5986m1810j1204p180
$$ 21824 50404 61993 45723 19089 -940 -4605 -1167 44004 79990 38180 26976 19796
13394A9796l2331p03l401K2963J1282M728K1428k9685J1573K6027L0004k2914
$$ 19796 -12535 -13238 -16639 6324 17606 22334 43762 14077 25650 51677 81681 58767
13382E8767k9131n284P637n056k5482j3557j3356j5363m393K6228m653m957O064
$$ 58767 29636 24352 31989 26933 1451 -12106 -25462 -40825 -45218 -18990 -23643 -28600 -22536
13369b2536K77K2742j1984j4547K9536K9730o596m21l4834l2520l120J5061K0831
$$ -22536 -22259 483 -11501 -26048 3488 33218 26622 26201 -8633 -41153 -44273 -29212 -8381
13356h381K3319M0859k354j9094k4470j9088J6533K1990r189k6774K643j4799
$$ -8381 14938 55797 53443 34349 9879 -9209 7324 29314 20125 -6649 -4006 -18805
13344a8805k8459r177K2380J6611J2035r33l214k3191J8912L531K1230j0252R959
$$ -18805 -47264 -56441 -34061 -17450 -5415 -6348 -9562 -32753 -13841 -10310 10920 668 10627
13331A0627J0276Q475j4829j8595j0294n802J5454k946J1779j3493M4O825l346
$$ 10627 20903 29378 14549 -4046 -14340 -20142 -4688 -7634 4145 -9348 -9304 -2479 -5825
13318e825k0431K0695K6782J122j4602J748J8952K1147p334j7362k8115O697O2132
$$ -5825 -26256 -5561 21221 22343 7741 9489 28441 49588 42254 24892 -3223 3474 65606
13305F5606L3606j6948l6862k7478j4715l0929k1762J1215N3921K4382p111p498
$$ 65606 99212 82264 45402 17924 3209 -27720 -49482 -38267 15654 40036 32925 25427
13293B5427k9672m651k3303K1986M6580N109k436O391k1956j6153L567j4361J6582
$$ 25427 -4245 -8896 -32199 -10213 36367 41476 39040 45431 23475 7322 10889 -3472 13110
13280A3110L990k5865j0404J2142R481q552k3531J8984J2255m964J8619r797l0746
$$ 13110 17100 -8765 -19169 -7027 2454 -6098 -29629 -10645 1610 -3354 15265 5468 -25278
13267b5278j8404k5321j500L2331K8902J5465K8984K746R167J8387M407p693m877
$$ -25278 -43682 -69003 -70503 -38172 -9270 6195 35179 37925 47092 65479 69886 62193 57316
13254E7316j3110k2636l2913k4017L1084L1872J9200N466m2143m2593O735J5859
$$ 57316 44206 21570 -11343 -35360 -4276 27596 46796 52262 10119 -32474 -25739 -9880
13242i880O392o477k413j2334K0489L8926r276P006j314Q487q718j3889K7120
$$ -9880 -3488 -9965 -12378 -24712 -4223 34703 25427 32433 31119 39606 30888 16999 44119
13229D4119J5975k9090l6759j4859K4438K0890J626K171N020K1964k066j7978
$$ 44119 60094 31004 -5755 -20614 3824 24714 26340 28511 33531 55495 53429 35451
13217C5451k7613j8564O619Q009p924J5716J0125k2712J1759j1240K12l881J686
$$ 35451 7838 -10726 -4107 3902 -4022 11694 21819 -893 10866 -374 -162 -4043 -2357
13204b357o342K474J2758l374j5025m107N961Q302M726J9759L7914J2004l1331
$$ -2357 -8699 -6225 6533 3159 -11866 -15973 -10012 -1710 3016 22775 60689 72693 41362
13191D1362o440L155J4352l1222j5029J355P871n270Q994k8233j6338k584Q977
$$ 41362 34922 38077 52429 21207 6178 7533 15404 10134 19128 -9105 -25443 -28027 -19050
13178a9050j6979o009J2306p686J7281K5168J6573j6410J8617O719m163j2498
$$ -19050 -36029 -42038 -29732 -37418 -20137 5031 21604 5194 23811 30530 26367 13869
13166A3869J7648J7317L835j0246q525K47M99J5920m5323k6546N670J2423J610
$$ 13869 31517 48834 52669 42423 33898 34145 34644 50564 5241 -21305 -15635 -3212 -1602
13153a602j2825K4128L2381o360q238l156K2387K688K3014o746k174K4792R193
$$ -1602 -14427 9701 42082 35722 27484 24328 46715 49403 72417 65671 63497 88289 97482
13140I7482k2932J0980l5202n0660j9191K4040j8724o418P317K2294L123k1373
$$ 97482 74550 85530 50328 -332 -19523 4517 -14207 -20625 -13308 8986 12109 -9264
13128i264J0077n788j686J7961J0182o485k3672j5666K9485P298m362k0725j6321
$$ -9264 813 -4975 -6661 11300 21482 14997 -8675 -24341 5144 12442 8080 -12645 -28966
13115b8966q99M3967r072j8471l2758m048p183J0953M9236L6597j0114j5034k4724
$$ -28966 -29865 14102 5030 -13441 -46199 -50247 -57430 -46477 2759 39356 29242 14208 -10516
13102a0516K8905J1154K0746j5961n211M749j1833Q518j9160k2585k4556O825
$$ -10516 18389 29543 50289 34328 29117 33866 22033 30551 11391 -11194 -35750 -28925
13090b8925m466j1059O594J4180P262j076n851j2287j8993l39L0762J550J0513
$$ -28925 -33391 -44450 -37856 -23676 -16414 -17490 -23341 -35628 -54621 -54960 -24198 -22648 -12135
13077a2135J9543L3992M3260l4769k1873j7116N613j3421j1159K0624L2462k37
$$ -12135 7408 41400 84660 49891 28018 10902 16515 3094 -8065 12559 45021 44784
13065D4784l5768k6914L1831J0017L86j6074j0694J0659K2553J4399J654J4921
$$ 44784 9016 -17898 13933 23950 24336 8262 -2432 8227 30780 45179 46833 61754
13053F1754k0062n0653l6864J9445M1050j2923o289l925R121K0298q908J8910
$$ 61754 41692 -8961 -45825 -26380 14670 1747 -4542 -8467 654 20952 12044 30954
13041C0954l4184k9896n423L4689o774j7797J4024K4873M0165j8553j8498K2561
$$ 30954 -3230 -33126 -38549 -3860 -10634 -28431 -14407 10466 50631 32078 13580 36141
13029C6141o471j7504J6520K7824p947l9244Q86L0300N686m3175o507k152j509
$$ 36141 29670 12166 28686 56510 48563 9319 10205 40505 46191 3016 -3491 -5643 -7152
13016g152o106k780J3754j731K3678k0790l1096j1000O156m921j0457O503R528
$$ -7152 -13258 -16038 -2284 -4015 19663 -1127 -32223 -43223 -37067 -41988 -52445 -45942 -36414
13003c6414P709j4871Q394N038K6267J3632q057j2925l909o538j2904K1074Q584
$$ -36414 -28705 -43576 -35182 -30144 -3877 9755 1698 -11227 -15136 -21674 -34578 -13504 -4920
12990d920l5775j872O272Q931J2420K6698J0605l0500m5183J5905K9703M2327
$$ -4920 -40695 -42567 -36295 -27364 -14944 11754 22359 -8141 -53324 -37419 -7716 34611
12978C4611L0212j5179k8919l6811q235j652J0310P669k6274j4350K7478J6688
$$ 34611 64823 49644 20725 -16086 -24321 -25973 -15663 -7994 -34268 -48618 -21140 -4452
12966d452K0731Q544k0875k1142j7656J3766j5052K2487M905K9601k072k2770
$$ -4452 16279 24823 3948 -17194 -34850 -21084 -36136 -13649 -8744 20857 18785 -3985
12954c985j7844j2033k505J1551M8906M5455r142k6580r90j8164M069j771K0066
$$ -3985 -21829 -33862 -36367 -24816 24090 69545 60403 33823 32833 14669 18738 16967 37033
12941C7033K0293o2177k1153O643M8513J6556J8576m3928l9600k5376j01j6197
$$ 37033 57326 -4851 -26004 -19361 29152 45708 64284 20356 -19244 -44620 -44721 -60918
12929f0918p348j2880K7148L7137j1419q061K6963m369r880L0514j2803j471K9048
$$ -60918 -68266 -81146 -53998 -16861 -28280 -36341 -9378 -13747 -23627 6887 -5916 -7387 21661
12916B1661K500k722K06k4261j863P657M813j253J9123K019l7082j1362k0464
$$ 21661 24161 21439 21645 -2616 -4479 3178 7991 6738 25861 27880 -9202 -20564 -41028
12903d1028L3566L8243K811k997M141K8688k4556k8426k0038J1631O438O859O468
$$ -41028 -7462 30781 33592 30595 34736 63424 38868 10442 -9596 2035 8473 15332 21800
12890B1800J5165j4360j8672j150M122m246l943o439m5699j610K2127L7809J2807
$$ 21800 36965 22605 3933 2783 6905 2659 -1284 -7723 -53422 -55032 -32905 4904 17711
12877A7711q533m2157l7511J8135L8940N135j9143K5174l757j7903l150K7208
$$ 17711 9178 -32979 -70490 -52355 -13415 -8280 -27423 -2249 -6006 -23909 -27059 149
12865A49m460m881L189n517q271J5234K3912J3694j3989k0525n570k836j380j366
$$ 149 -4311 -9192 -6003 -11520 -19791 -4557 19355 33049 19060 -1465 -7035 -9871 -11251 -12617
12851a2617J3592M2191N441k375J609j8849P764r051k4595o121o125j5046q034
$$ -12617 975 43166 48607 46232 47841 28992 36756 27705 3110 -3011 -9136 -24182 -32216
12838c2216M1770K7052K6573J8884l5154k8601k3713J3144J005k3681j3L0568
$$ -32216 9554 36606 63179 82063 46909 18308 -5405 7739 8744 -14937 -14950 15618
12826A5618J7478j2751o672K8775L0869l461l4249J1839J7831j5562m3424J4436
$$ 15618 33096 20345 13673 42448 73317 69856 35607 47446 65277 49715 6291 20727
12814B0727J2067J0549j5635k3418k2152j9602J2217j6429L108L1669L916n316
$$ 20727 32794 43343 27708 4290 -17862 -37464 -25247 -41676 -38568 -6899 -2983 -8299
12802h299K984j6071k143K3375M395L291q190o620J1428R423J0463K7457J8993
$$ -8299 -5315 -21386 -23529 -154 4241 7532 -658 -7278 4150 13573 24036 51493 70486
12789G0486K7650n398l8947l2581q889r661j6332j016J8409J1811Q724L6923l342
$$ 70486 98136 92738 53791 21210 12321 2660 -13672 -14688 3721 15532 24256 61179 57837
12776E7837l1748j3961k308L364J7820k5317J2172K3441p229j3305N902m74l0886
$$ 57837 26089 12128 9820 13184 31004 5687 17859 41300 34071 20766 26668 26194 -4692
12763d692P127K1180j0144L196j7987k4427l1253L9063J9191Q431k5525J712l2545
$$ -4692 2435 23615 13471 16667 -1320 -25747 -57000 -17937 1254 9685 -15840 -14128 -46673
12750d6673O946J0373K3947J7k211J4371K2042k5225K3461n408l512l2176k4061
$$ -46673 -39727 -29354 -5407 -5390 -7601 6770 28812 3587 27048 21640 18128 -14048 -38109
12737c8109L4296N8913j5734l9711J2257n467j4597Q510O236k0733p551K2582
$$ -38109 -3813 55100 39366 -345 11912 6445 -8152 358 6594 -14139 -21690 892
12725H92J1777o773M204k3947j1853K6957J6569l257j1159o847N503J0003J7860
$$ 892 12669 5896 10100 -13847 -25700 1257 17826 14569 3410 -3437 2066 12069 29929
12712B9929M87K8694n49o1894l0017K6105J0488N623L069k6453k1697j330l808
$$ 29929 30416 59110 58561 -3333 -33350 -7245 3243 8866 11935 -14518 -36215 -37545 -41353
12699d1353K9907K0907K4123J4603k0597l0164q894M0923k3211j7182o304J8693
$$ -41353 -11446 9461 33584 48187 27590 -2574 -11468 29455 6244 -10938 -17242 1451
12687A451J4087k9760k1822r547J2655J3475K3789k2966k8644j6978k4406K7150
$$ 1451 15538 -14222 -36044 -45591 -32936 -19461 4328 -18638 -47282 -64260 -88666 -61516
12675f1516L8235Q409r154K8278k4633j6643Q041R308K4766J7765j2987k8852
$$ -61516 -23281 -14872 -24026 4252 -20381 -37024 -28983 -19675 5091 22856 9869 -18983
12663a8983L6801J3832J5118O890k5741q157o404m858O056J0709P877j2170k646
$$ -18983 17818 31650 46768 53658 27917 19760 13356 8498 14554 25263 33140 20970 18324
12650A8324J4289J8948j990k1926M701l086k5057k693J4441k805j7429n957J5248
$$ 18324 32613 51561 49571 27645 32346 29260 4203 1510 15951 13146 -4283 -10240 5008
12637E008K2384J0017K057r668l2013L585J2787j0435L1313R754k1554j9435J6480
$$ 5008 27392 37409 39466 29798 -2215 1370 14157 3722 35035 44789 23235 3800 20280
12624B0280K2780J629k3735k272k5195N834J3476R294Q410K3033J1626p767o155
$$ 20280 43060 44689 20954 18682 -6513 -679 12797 22091 30501 53534 65160 57393 51238
12611E1238k0166o4743j0346L9428l3023o071M1586Q384J8342K1229O340j1708
$$ 51238 31072 -33671 -44017 -4589 -37612 -43683 -2097 6287 24629 45858 52198 40490
12599D0490l417m478q61J6433j2404m7629r507K2081K4230J4277k7766j6304p333
$$ 40490 37073 32595 31734 48167 35763 -11866 -21373 708 24938 39215 11449 -4855 -12188
12586a2188k161P573j0027L3382O944k1078m720Q807K0800j6462j3805J2951K595
$$ -12188 -14349 -6776 -16803 16579 23523 2445 -2275 6532 27332 10870 -2935 10016 12611
12573A2611j8684k5046J3887J2561q897R850K4417J8105K746L88P199J1507M831
$$ 12611 -6073 -31119 -17232 -4671 -13568 -3718 20699 38804 41550 41938 49137 60644 65475
12560F5475M405k9799m9164l1452L8578L2946j2085k8671m0776m949M863k5970
$$ 65475 69880 40081 -9083 -40535 -1957 30989 18904 -9767 -50543 -55492 -50629 -76599
12548g6599J3894M9610L7378j383j4633P97Q166p119O270j7762J502L3559J736
$$ -76599 -62705 -13095 24283 22900 8267 9064 17230 10111 16381 -1381 121 33680 35416
12535C5416K87q697m2920p287J1271j794K3695j2185j2954k866J5427k0242p41
$$ 35416 35703 27006 -15914 -23201 -11930 -13724 9971 -2214 -15168 -18034 -2607 -22849 -23590
12522b3590l236J3565K2316o093J8587K9568k0345k2471k3199l7409K1994L8622
$$ -23590 -26826 -13261 9055 2962 21549 51117 30772 8301 -14898 -52307 -30313 8309
12510H309P411O787K5440j7259l7923K3549J8608j7069k651K6749k8017q112l0440
$$ 8309 15720 22507 47947 30688 -7235 16314 34922 17853 15202 41951 13934 5822 -24618
12497b4618M906Q604K2491J9207l9934l5236N7M9979L1195Q872j9204j9598k5848
$$ -24618 -19712 -11108 11383 30590 -9344 -44580 -44523 5456 36651 45523 26319 6721 -19127
12484a9127R180K6014j6749n2612l1909M021J9681K3989K5141j9351o2K2790P500
$$ -19127 -9947 16067 -682 -53294 -85203 -81182 -61501 -37512 -12371 -31722 -31784 -8994 -1494
12471a494J1310J5532j644R681M316N774J9687j9599l889l797L373k0434M180
$$ -1494 9816 25348 23704 33385 37701 43475 63162 43563 39674 35877 39250 18816 22996
12458B2996J2768J763O652k3485j182j7550j4534J5338K2697K4361J485j3934
$$ 22996 35764 37527 44179 20694 19512 1962 -12572 2766 25463 49824 51309 37375
12446C7375P476J152l0300J6054J4005J4961j9426r686l3370J1100j023J2221
$$ 37375 44851 46003 15703 31757 45762 60723 41297 31611 -1759 9341 8318 20539
12434B0539K8923j526K038j5020m3736L357O913j0162r783j592K4808J0049m3468
$$ 20539 49462 47936 49974 34954 -8782 -5425 1488 -8674 -18457 -20049 4759 14808 -28660
12421b8660p057J5320J8078l6k3086j2772k4714K0943J8101L714l675r061L5168
$$ -28660 -35717 -20397 -2319 -2355 -25441 -38213 -62927 -41984 -23883 -20169 -23844 -32905 2263
12408B263J5132q783j6670k0729k789j5092q269m63L2069J7223K019j494l0029
$$ 2263 17395 8612 -8058 -28787 -31576 -46668 -54937 -55400 -23331 -6108 -4089 -5583 -35612
12395c5612J02L4248n613m8102M9383K3319k1736o5J2732J4116k4125k4578K7132
$$ -35612 -35510 -1262 -6875 -54977 -5594 17725 -4011 -4076 8656 22772 -1353 -25931 1201
12382A201L3570O87K23K103J2426l7150J2259Q7r943j7478r299j8901J3879L5221
$$ 1201 34771 35458 35681 37784 50210 13060 25319 25406 15463 -2015 -11314 -30215 -16336 18885
12368A8885K8099n930o680K980j2476m5408k7803j9374l448J5627K6515J4335
$$ 18885 46984 41054 34374 37354 24878 -20530 -48333 -67707 -71155 -55528 -29013 -14678
12356a4678L0207L0904K1141j9797j4997J4051J612j6011k2694l6150n471r52
$$ -14678 15529 46433 67574 47777 32780 46831 48443 32432 9738 -26412 -31883 -32835
12344c2835P517P786L7127P884k3274k2683r285J6493M4729l337j5236j2560J5314
$$ -32835 -25318 -17532 19595 27479 4205 -18478 -27763 -11270 33459 30122 14886 2326 17640
12331A7640O703R615p455n679l0743P078K0002J4839K6169j9665l630J8017J0854
$$ 17640 24343 33958 26503 20824 -9919 -2841 17161 32000 58169 38504 34874 52891 63745
12318F3745l526m319j1911k3684k0873p884J0820J6776p164j8298k786n459O474
$$ 63745 60219 55900 43989 20305 -568 -8452 2368 19144 11980 -6318 -9104 -14563 -8089
12305h089K1684K7585O039K1811o943p003j2967k679k7736m5433Q325J082j6255
$$ -8089 13595 41180 47219 69030 62087 55084 42117 39438 11702 -33731 -25406 -24324 -40579
12292d0579K3651K5209J2287k3238N743P789M164k3453r591r415k1451k495J9103
$$ -40579 -16928 8281 20568 -2670 3073 10862 15026 -8427 -18018 -27433 -48884 -51379 -32276
12279c2276J3840J0216k68r419L8252K3198j5095j7811j4779k6788o965P058L3413
$$ -32276 -18436 -8220 -8488 -17907 20345 43543 28448 10637 -4142 -30930 -37895 -30837 2576
12266B576M8982L9036m574n3364n2784R72K2325J7719j2500j537J0320Q60K0985
$$ 2576 51558 90594 86020 32656 -20128 -19156 3169 20888 8388 6851 17171 18031 39016
12253C9016L1254n119l1122r597r268k3823j5549K7958Q406o756k7225N1825K7633
$$ 39016 70270 65151 34029 24432 15164 -8659 -24208 3750 12156 5400 -21825 30000 57633
12240E7633j4714k1152j8777n351J675J3409P934k818r987j14l036j6430M969
$$ 57633 42919 21767 2990 -2361 -686 12723 20657 17839 7852 7738 4702 -11728 -6759
12227f759j2177j5815J4644L3585K1468J9340k223K1487j5317k2760k3614k5773
$$ -6759 -18936 -34751 -20107 13478 34946 54286 52063 73550 58233 35473 11859 -13914
12215a3914j0576Q886K9655Q957l856N730k8567Q98O328n047J7318q744j0786
$$ -13914 -24490 -15604 14051 23008 19152 24882 -3685 -2787 3541 -1506 15812 7068 -3718
12202c718N837J2850k2605j9824K4363O058k8852j2662L777L4364J1955q946j2631
$$ -3718 2119 14969 -7636 -27460 -3097 2961 -25891 -38553 -34776 -412 11543 2597 -10034
$$ [...]
##END NTUPLES=NMR SPECTRUM
##END=
