##TITLE=Analysis number 322178
Compound Code cc 12502
Project Code adrs
Chemist Name fudan
##JCAMPDX= 6.0         $$ Bruker NMR JCAMP-DX V2.0
##DATA TYPE= NMR SPECTRUM
##DATA CLASS= NTUPLES
##ORIGIN= Bruker BioSpin GmbH
##OWNER= nmr
$$ XWIN-NMR		Version 3.5
$$ Fri Sep 15 11:46:34 2006 GMT Daylight Time (UT+1h)  MAYBRIDGE\nmr@NMR_250MHZ
##.OBSERVE FREQUENCY= 250.131544655141
##.OBSERVE NUCLEUS= ^1H
##.ACQUISITION MODE= SIMULTANEOUS (DQD)
##.ACQUISITION SCHEME= undefined
##.AVERAGES= 16
##.DIGITISER RES= 18
##SPECTROMETER/DATA SYSTEM= dpx250
##.PULSE SEQUENCE= zg30
##.SOLVENT NAME= CDCl3
##.SHIFT REFERENCE= (INTERNAL, CDCl3, 0, 16.4603)
##AUDIT TRAIL= $$ (NUMBER, WHEN, WHO, WHERE, WHAT)
$$ ##TITLE= Audit trail, XWIN-NMR		Version 3.5
$$ ##JCAMPDX= 5.01
$$ ##ORIGIN= Bruker BioSpin GmbH
$$ ##OWNER= nmr
$$ C:\u/data/dgb/nmr/ADRS/800/pdata/1/auditp.txt
$$ ##AUDIT TRAIL=  $$ (NUMBER, WHEN, WHO, WHERE, WHAT)
(   1,<2006-09-15 11:46:05.91 +100>,<MAYBRIDGE\nmr>,<NMR_250MHZ>,
      <created by zg, POWCHK disabled, PULCHK disabled
       configuration hash MD5:
       E2 DF 36 D8 04 B2 41 60 5A D7 A3 38 5A 4B D0 FE
       data hash MD5: 64K
       5F 7E DE 7D DF 80 91 31 1E 40 CC 64 10 C1 1D 61>)
(   2,<2006-09-15 11:46:20.53 +100>,<MAYBRIDGE\nmr>,<NMR_250MHZ>,
      <Start of raw data processing
       ef LB = 0.3 FT_mod = 6 PKNL = 1 SI = 32K 
       data hash MD5: 32K
       37 A4 8D 7F E2 03 B3 2F 91 99 FA 45 B9 74 63 94>)
(   3,<2006-09-15 11:46:22.50 +100>,<MAYBRIDGE\nmr>,<NMR_250MHZ>,
      <apk 
       data hash MD5: 32K
       A6 64 6E EE 75 2F 60 9F 2C D0 F4 6F 16 49 64 8E>)
(   4,<2006-09-15 11:46:23.24 +100>,<MAYBRIDGE\nmr>,<NMR_250MHZ>,
      <abs ABSG = 5 
       data hash MD5: 32K
       FA 20 9F DC 9F DB ED 73 FB 1E 1D BF A1 68 93 78>)
$$ ##END=
$$ 
$$ hash MD5
$$ B0 A7 B7 BC 07 85 36 BE 5F FB AC 99 4D 0F 4D F8
##$RELAX= 
##$RELAX= 
##$RELAX= 
##$RELAX= 
##$RELAX= 
##$RELAX= 
##$RELAX= 
$$ Bruker specific parameters
$$ --------------------------
##$DU= <C:\u>
##$EXPNO= 800
##$NAME= <ADRS>
##$PROCNO= 1
##$TYPE= <nmr>
##$USER= <dgb>
##$AMP= (0..31)
100 100 100 100 100 100 100 100 100 100 100 100 100 100 100 100 100 100 
100 100 100 100 100 100 100 100 100 100 100 100 100 100 
##$AQSEQ= 0
##$AQ_mod= 3
##$AUNM= <au_zg>
##$AUTOPOS= <48 >
##$BF1= 250.13
##$BF2= 250.13
##$BF3= 250.13
##$BF4= 250.13
##$BF5= 500.13
##$BF6= 500.13
##$BF7= 500.13
##$BF8= 500.13
##$BYTORDA= 1
##$CFDGTYP= 0
##$CFRGTYP= 5
##$CHEMSTR= <none>
##$CNST= (0..31)
1 1 145 1 1 1 1 1 1 1 1 1 1 1 1 1 1 1 1 1 1 1 1 1 1 1 1 1 1 1 1 1 
##$CPDPRG= <>
##$CPDPRG1= <>
##$CPDPRG2= <>
##$CPDPRG3= <>
##$CPDPRG4= <mlev>
##$CPDPRG5= <mlev>
##$CPDPRG6= <mlev>
##$CPDPRG7= <mlev>
##$CPDPRG8= <mlev>
##$CPDPRGB= <>
##$CPDPRGT= <>
##$D= (0..31)
0 1 0 0 0 0 0 0 0 0.06 0 0 0 0 0 0 0.0002 0 0 0 0 0 0 0 0 0 0 0 0 0 0 
0 
##$DATE= 1158317163
##$DBL= (0..7)
120 120 120 120 120 120 120 120 
##$DBP= (0..7)
150 150 150 150 150 150 150 150 
##$DBP07= 0
##$DBPNAM0= <>
##$DBPNAM1= <>
##$DBPNAM2= <>
##$DBPNAM3= <>
$$ [...]
##$SUBNAM7= <"">
##$SUBNAM8= <"">
##$SUBNAM9= <"">
##$SW= 20.6930455092707
##$SWIBOX= (0..15)
0 0 3 0 0 0 0 0 0 0 0 0 0 0 0 0 
##$SW_h= 5175.983436853
##$TD= 65536
##$TD0= 1
##$TE= 296.16
##$TE2= 300
##$TE3= 300
##$TEG= 300
##$TL= (0..7)
0 120 120 120 120 120 120 120 
##$TP= (0..7)
150 150 150 150 150 150 150 150 
##$TP07= 0
##$TPNAME0= <>
##$TPNAME1= <>
##$TPNAME2= <>
##$TPNAME3= <>
##$TPNAME4= <>
##$TPNAME5= <>
##$TPNAME6= <>
##$TPNAME7= <>
##$TPOAL= (0..7)
0.5 0.5 0.5 0.5 0.5 0.5 0.5 0.5 
##$TPOFFS= (0..7)
0 0 0 0 0 0 0 0 
##$TUNHIN= 0
##$TUNHOUT= 0
##$TUNXOUT= 0
##$USERA1= <user>
##$USERA2= <user>
##$USERA3= <user>
##$USERA4= <user>
##$USERA5= <user>
##$V9= 5
##$VALIST= <valist>
##$VCLIST= <CCCCCCCCCCCCCCC>
##$VD= 0
##$VDLIST= <DDDDDDDDDDDDDDD>
##$VPLIST= <PPPPPPPPPPPPPPP>
##$VTLIST= <TTTTTTTTTTTTTTT>
##$WBST= 1024
##$WBSW= 4
##$XGAIN= (0..3)
0 0 0 0 
##$XL= 0
##$YL= 0
##$YMAX_a= 526404
##$YMIN_a= -548947
##$ZGOPTNS= <>
##$ZL1= 120
##$ZL2= 120
##$ZL3= 120
##$ZL4= 120
##$ABSF1= 16.46033
##$ABSF2= -4.232843
##$ABSG= 5
##$ABSL= 3
##$ALPHA= 0
##$AQORDER= 0
##$ASSFAC= 0
##$ASSFACI= 0
##$ASSFACX= 0
##$ASSWID= 0
##$AUNMP= <proc_1d>
##$AZFE= 0.1
##$AZFW= 0.1
##$BCFW= 0
##$BC_mod= 0
##$BYTORDP= 0
##$COROFFS= 0
##$CY= 12.5
##$DATMOD= 1
##$DC= 0
##$DFILT= <>
##$DTYPP= 0
##$F1P= 14.0000005364418
##$F2P= -0.99999901652339
##$FCOR= 0.5
##$FTSIZE= 32768
##$FT_mod= 6
##$GAMMA= 0
##$GB= 0
##$INTBC= 1
##$INTSCL= 1
##$ISEN= 128
##$LB= 0.3
##$LEV0= 0
##$LPBIN= 0
##$MAXI= 10000
##$MC2= 0
##$MEAN= 0
##$ME_mod= 0
##$MI= 0
##$NCOEF= 0
##$NC_proc= -2
##$NLEV= 6
##$NOISF1= 0
##$NOISF2= 0
##$NSP= 0
##$NTH_PI= 0
##$NZP= 0
##$OFFSET= 16.46033
##$PC= 1
##$PHC0= 148.0501
##$PHC1= 4.63048
##$PH_mod= 1
##$PKNL= yes
##$PPARMOD= 0
##$PSCAL= 4
##$PSIGN= 0
##$REVERSE= no
##$SF= 250.130015424131
##$SI= 32768
##$SIGF1= 0
##$SIGF2= 0
##$SINO= 400
##$SIOLD= 32768
##$SREGLST= <1H.CDCl3>
##$SSB= 0
##$STSI= 32768
##$STSR= 0
##$SW_p= 5175.98343685301
##$SYMM= 0
##$S_DEV= 0
##$TDeff= 65536
##$TDoff= 0
##$TI= <Analysis number 999999
Compound Code 99
Book Reference 9
Project Code 9>
##$TILT= no
##$TM1= 0
##$TM2= 0
##$TOPLEV= 0
##$USERP1= <user>
##$USERP2= <user>
##$USERP3= <user>
##$USERP4= <user>
##$USERP5= <user>
##$WDW= 1
##$XDIM= 32768
##$YMAX_p= 300336994
##$YMIN_p= -26068
$$ End of Bruker specific parameters
$$ ---------------------------------
##NTUPLES= NMR SPECTRUM
##VAR_NAME=  FREQUENCY,     SPECTRUM/REAL,   SPECTRUM/IMAG
##SYMBOL=    X,             R,               I
##VAR_TYPE=  INDEPENDENT,   DEPENDENT,       DEPENDENT
##VAR_FORM=  AFFN,          ASDF,            ASDF
##VAR_DIM=   32768,         32768,           32768
##UNITS=     HZ,            ARBITRARY UNITS, ARBITRARY UNITS
##FACTOR=    0.157963299565203, 1,           1
##FIRST=     4117.22236061006, 0,            0
##LAST=      -1058.76107624295, 0,           0
##MIN=       -1058.76107624295, -26068,      0
##MAX=       4117.22236061006, 300336994,    0
$$ Real data points
##PAGE= N=1
##DATA TABLE= (X++(R..R)), XYDATA
$$ [...]
21471 -1152 -12886 -14057 1082 7381 1859 525 470 -2852 -6876 -4746 -7395 -6112 -3417 -6580 -3970
21456 -3970 -4328 -1936 -5240 -10511 -6023 -6359 -15131 -20605 -19881 -16968 -10369 -7483 -5169 -2493 -3750
21441 -3750 -3270 -2327 4139 4378 -3394 -8479 -10422 -9966 -5496 -2471 -1750 -899 2662 -1319 -3832 -1340
21425 -1340 2009 -4074 -9367 -6243 -4228 -4516 -4462 -5361 -7753 -1673 13923 12782 10349 9725 10802 7464
21409 7464 304 -3245 -6727 -2463 -7930 -10766 -11982 -16634 -15086 -7072 -6785 -3151 -641 -3039 -2699
21394 -2699 -2260 -5280 -6603 -2888 5783 11305 10155 2884 -6592 -7184 -4001 -1580 -3575 -563 1974
21379 1974 -1060 -3039 -2468 -7179 -7854 -5219 -3411 2269 5969 4276 4354 261 -1264 -997 -1693 -6358
21363 -6358 -8862 -8318 -6899 -1732 959 1812 4150 5224 10165 1647 -2666 -4761 -5179 -57 3463
21348 3463 4312 5988 380 2913 10338 3530 -11224 -6349 -5494 -9240 -4652 -10129 -10713 -3906 3002
21333 3002 -200 -2353 5156 3669 -236 680 -5548 -9206 -7692 -4349 -3901 -5670 -8378 -9617 -10684
21318 -10684 -10072 -10766 -8390 -4328 -325 -1591 -4958 -1417 -3718 -5502 -8672 -13816 -11953 -2591 -1320
21303 -1320 -328 -6122 -1564 -2342 3254 2392 -3348 -7992 -4225 -5246 -2632 -1043 -1934 4096 11257 6620
21287 6620 3976 5315 10790 10463 2914 171 -3803 -7386 -1986 4975 3652 3762 7316 1514 4443
21272 4443 5669 2629 2471 -83 1567 -2794 -883 -7402 -12987 -11020 -2638 -3791 -9204 -5299 -3273
21257 -3273 238 256 -4284 1247 3309 -4760 -367 -866 -5143 -7561 -7153 -5996 -3142 -874 -949 -3709
21241 -3709 -11327 -6731 -3575 -823 72 3210 2690 115 824 3665 11942 9609 5005 -398 -475 3428
21225 3428 3247 -1861 1101 3693 9596 9717 11730 9675 5697 2988 -1625 -5015 -3347 -434 3430
21210 3430 2644 -6161 -7846 -9923 -4243 -4786 -8334 -9155 -4135 -135 2017 -3106 -4331 2151 3786
21195 3786 1055 -2352 -3087 1891 -1401 -9353 -7068 4923 479 -2114 -11243 -13272 -11943 -14779 -14411
21180 -14411 -7715 -10332 -7410 -5718 -3039 1718 6312 4826 -2732 390 -1151 -3014 -5044 -10930
21166 -10930 -11846 -7751 213 2377 6365 11427 9105 1655 2252 7340 6258 3348 3962 4012 -967 -2467
21150 -2467 -3977 -5937 -5215 3488 7297 5221 -374 -1558 3805 2185 -7259 -8645 -6894 -7557 -8630
21135 -8630 -15195 -10546 -10059 -9725 -12895 -9136 -6741 -5868 -7909 -1222 2909 4247 -2418 -11401 -14125
21120 -14125 -11550 -9191 -4111 -6051 -9844 -5470 -8312 -10520 -8894 -12242 -9985 -9519 -5551 -5338 -9629
21105 -9629 -12249 -2583 -1557 -2829 3390 801 -2699 4206 9223 -1201 -1114 4167 -5496 -8894 -7871
21090 -7871 -3532 936 388 -5547 -4422 -2560 -3263 -5175 -7702 -7810 -6772 1178 894 -5478 -7558 -7821
21074 -7821 -7162 -3528 1472 4183 4823 2720 -4249 -6840 -5233 -7206 -10835 -12231 -7094 -5907 -3781
21059 -3781 -3137 -1923 -5117 -5362 -4002 -2585 269 138 2641 8242 -4395 -13732 -4829 -3968 -1062
21044 -1062 -2215 -786 -4087 2145 6833 -1923 -4061 -2452 -1591 -9657 -12117 -2420 -5596 -5481 -988
21029 -988 -957 4715 2775 -1267 -2399 -7162 -10628 -9789 -7219 -5859 -1497 1709 2173 -3874 -8943 -7018
21013 -7018 -4947 -10364 -7013 -7399 -8754 -9365 -7316 -8961 -15831 -11486 -2882 -574 5985 4800 3484
20998 3484 1483 3320 -3468 -12191 -8570 -7794 -11173 -11302 -5182 -2328 -5271 -7291 -8496 -10222 -4964
20983 -4964 -1412 -5952 -2524 1042 -4506 -2325 670 633 7864 6765 -1317 1337 -5696 -13475 -14435
20968 -14435 -13717 -16170 -18345 -17193 -9344 -12762 -13828 -13189 -8723 -1583 -2441 -2776 3445 8831 6143
20953 6143 -7926 -9025 -4773 406 4500 626 -3386 -125 243 -1392 -5517 -7708 -5871 -6890 -6697
20938 -6697 -6939 -14700 -15719 3964 10483 9269 13927 14243 13865 15262 5389 -4192 -2807 -4092 -11748
20923 -11748 -11891 -14309 -13752 -14127 -11127 -6592 1890 -6557 -14498 -13253 -3533 -1515 -6701 -3103 2048
20908 2048 -1183 -3609 2779 2398 2090 447 1721 -1915 -733 -3260 -3017 3108 2299 -2802 -8383 -5404
20892 -5404 -3170 1132 -3702 -9147 -10538 -7747 -340 -3210 -10194 -13074 -10333 -7682 -14047 -11152 -8159
20877 -8159 -9710 -13030 -8522 -10460 -4724 -2137 -452 -1193 -3040 -4834 -3753 5151 552 203 -2657
20862 -2657 -4372 -6430 -4167 -8109 -4663 1150 927 -3722 -2214 4494 2598 -1222 -3586 -414 12755
20847 12755 10863 1580 1000 1830 3147 5027 2278 1814 -4175 -7364 -12955 -15417 -11239 -7150 -3809
20832 -3809 -2453 -4326 -9336 -8375 -8032 -4404 -3295 1721 5986 1405 5609 10168 11264 9935 4971
20817 4971 2992 851 2526 4987 5668 9898 5145 4205 3984 -1363 -5250 -1588 -772 1518 -2026 -2491
20801 -2491 -170 -9467 -10785 -10868 -10912 -2361 1548 -10693 -16359 -9062 -452 -2781 -9310 -8000 -2441
20786 -2441 -2339 1447 7894 5774 4500 1295 -6452 -9885 -10782 -10146 -9118 -244 7156 2594 501
20771 501 -3163 -9552 -6453 -6103 -4302 1084 8554 7348 6153 1133 -4344 -5580 -3753 -3428 -6670
20756 -6670 -4908 -4779 -548 5637 1988 3244 8811 6921 -1479 -8851 -5505 -928 2034 2038 -464 -2307
20740 -2307 -2291 -11545 -15372 -12819 -13883 -15473 -12939 -12568 -7449 -6063 -8390 -10812 -10364 -10650 -5851 -7036
20724 -7036 -8311 -10351 -9257 -5838 -673 -273 -2182 -3986 -8249 -5666 -5762 -5579 -4623 -8802 -15589 -10314
20708 -10314 -4458 -946 1306 -1484 2747 2515 1634 3520 7190 4686 -1382 -905 -387 746 -3028
20693 -3028 -9539 -11498 -9351 -8082 -12507 -11476 -3127 -393 3525 363 -4420 -7163 -5543 -3405 22
20678 22 10265 7698 -401 -1515 -2428 -9162 -13742 -9438 -4960 -1672 -2372 -3629 -360 -2940 -6026
20663 -6026 -1396 -1039 -2201 -10244 -10599 -8022 -8309 -11622 -10715 -10059 -5256 -4669 -2472 -693 -1369 -4712
20647 -4712 -13014 -11619 -6682 -7215 -8666 -8736 -11264 -9148 -3324 -444 2033 1270 2891 -2479 -5957 -6119
20631 -6119 -3590 -1209 -13267 -19002 -11304 -5413 -3713 -5629 -5068 -4223 -8305 -11412 -4167 -7775 -10958
20616 -10958 -9103 -10396 -8271 -5757 -3327 -3833 -2143 -214 -2128 617 1320 2127 1548 1797 -342 3200
20600 3200 3490 3382 7637 2555 -924 -3893 -1345 -5378 -6920 -5826 -10568 -13241 -6948 -8001 -9973
20585 -9973 -5240 -2653 -6058 -10420 -9003 -9289 -2469 -3781 -7378 -8671 -12711 -9711 -6601 -5578 -3487
20570 -3487 2537 568 -1823 -9531 -3479 2529 4744 2512 -463 -1712 -3875 -6526 -297 208 1748
20555 1748 4305 5908 4095 1258 -687 -629 729 -5375 -8656 -9898 -8983 -8900 -7085 -3673 -6282 -5364
20539 -5364 -2625 -962 1725 4886 150 -1044 -6365 -6659 -3754 2718 3938 5242 -302 -3243 -3553
20524 -3553 1115 10310 6904 4081 -2575 -8687 -10489 -15990 -16115 -6611 -2946 -7330 -6305 -1574 -3798
20509 -3798 -6834 -9788 -8281 -9862 -8322 -5279 -2064 1793 1864 -1424 -5597 -5884 -10584 -8562 -410
20494 -410 -3325 -7402 -9673 -16983 -25068 -24498 -19056 -12503 -9698 -7250 727 -1385 -7584 -3674 -2416
20479 -2416 -2503 -2985 -53 -3512 -4003 -7309 -8541 -10125 -4247 181 -1337 -1527 1501 -4207 -11873 -12012
20463 -12012 -11654 -10990 -4410 -2362 -2547 -3397 -6619 -12355 -16815 -12317 -11736 -17993 -12005 -8417 -6225 -6853
20447 -6853 -5859 -7847 -5783 -554 -3326 -2721 -5591 -6482 -3018 -1191 -6163 -6756 -3828 -614 -4970 346
20431 346 -3793 -3020 3085 5751 4563 -1058 -5221 -2933 327 -2130 -8594 -1950 7140 4333 2931
20416 2931 -1708 -5350 -1073 -1901 1623 408 680 3100 4020 2594 361 1875 18 -7825 -9704
20401 -9704 -5031 -4050 -13855 -9864 -8379 -9820 -9884 -7607 -6805 -13073 -20775 -18043 -13354 -9112 -3404 2446
20385 2446 6476 2171 -6143 -4174 -2520 -4050 -3878 1480 2241 3772 4358 5738 3825 1993 -554
20370 -554 -2638 -193 876 -4928 -6436 -5853 -4278 -3110 -2030 -1116 717 3057 10123 9105 3588
20355 3588 -52 4214 -1463 -6802 -5021 -2974 1795 9970 11609 8648 -5368 -13048 1291 9380
20341 9380 4356 2103 3024 2995 3573 1429 2202 -4089 -2571 1524 3943 161 -6702 -11291 -15804 -14480
20325 -14480 -13718 -11218 434 6825 5711 7832 8235 11373 10187 7052 181 -2642 -4207 -3861 2325
20310 2325 4579 5861 -1069 -10905 -11254 -10922 -13097 -6495 -2987 -6068 -5632 -8746 -9017 -7258 -4276 268
20294 268 4974 3588 2120 2068 11310 7780 2327 -889 350 3907 6339 2843 -122 -7391 -14137
20279 -14137 -13174 -9388 -10330 -4831 3218 1118 -6583 -5939 -4819 -4430 318 -1402 -5301 -8980 -8639 -9522
20263 -9522 -12075 -10373 -9873 -6097 -5050 -2370 -12575 -16904 -14718 -13857 -13022 -6647 -3739 794 -2050
20248 -2050 -5431 -2031 -6763 -8614 -5473 -3773 -4407 -8375 -7133 -1976 -892 -6279 -1956 -3468 -4400
20233 -4400 -7651 -8334 -8340 -7375 -2341 -8572 -9845 -3386 -2229 239 -5512 -3459 1249 -1394 -5245 -11945
20217 -11945 -13474 -5938 -1846 -719 3207 -237 -2128 -3302 -2930 -2767 -1997 -10384 -12344 -10099 -7966
20202 -7966 1896 786 -2646 -2778 -5776 -14426 -19134 -15960 -13062 -11760 -9792 -8125 -9191 -8785 -6559
20187 -6559 -8946 -11179 -12435 -5682 383 -2982 -7188 -3818 -537 -2835 -9295 -16227 -21251 -18664 -8013
20172 -8013 -6919 -8828 -11164 -8510 -1613 677 -5582 -8957 -3030 -200 -2020 -3864 -4541 2029 5823
20157 5823 -5372 -9103 -12198 -11424 -14459 -11052 -1673 -216 -8000 -16063 -8495 -3829 -3507 -728 5411
20142 5411 244 -6224 -10657 -7265 -7958 -4940 2875 5130 3365 -894 4619 -3144 -15462 -10390 -8419
20127 -8419 -4436 -1121 -7141 -13105 -18068 -19346 -15601 -6976 -4587 -5062 -4812 -8539 -12984 -15715 -7294
20112 -7294 -4304 -2353 -3763 -4582 -9016 -8659 -1757 -2483 1195 -2188 -1805 377 -9099 -11427 -6597 -4015
20096 -4015 -7659 -8787 -12459 -16166 -11453 -2351 -3759 -1274 -695 1296 -112 -9389 -12434 -12449 -11321
20081 -11321 -7013 -9844 -8086 -9302 -7130 -7364 -9414 -9558 -7757 -6448 4929 6076 -3681 -6393 -11823
20066 -11823 -8942 -18324 -18476 -13007 -4604 1346 -1639 -3259 -3023 2113 5866 9984 9808 2003 -6060
20051 -6060 -8513 -11132 -6911 -1878 1530 6503 -1563 -13816 -12535 -4524 5216 4345 4980 16491 20793
20036 20793 16162 10223 -1853 -7371 -1970 -279 -2439 -1297 864 1422 1286 -5355 -7387 -4836 -8028
20021 -8028 -8141 -6034 -4104 -5402 -2291 -3820 -3773 -6805 -3765 -4565 -5382 -11762 -16425 -15161 -4808 -346
20005 -346 -3678 -6841 -11489 -15077 -16766 -13843 -11597 -11393 -10165 -5609 2199 3801 634 -4785 -7410
19990 -7410 -6475 -6169 -7863 -762 -1975 -3400 517 1289 -3476 -907 10951 12248 4874 -5791 -17489
19975 -17489 -22455 -16039 -5134 -191 1995 4131 8207 4734 1372 337 1275 -2395 -5578 -3925
19961 -3925 4550 11063 4114 -5437 -1310 3332 -392 -3082 -75 6261 4004 -2123 -7290 -11629 -7086
19946 -7086 -1186 1372 7107 9092 -2434 -10748 -13804 -9986 -18981 -22023 -13857 -661 4426 4426 -1803
19931 -1803 -7642 -4848 -2503 -8127 -12279 -14459 -13554 -10197 -8485 -1115 2612 -4833 -10628 -7046 -832
19916 -832 2330 3121 -6004 -18764 -20134 -19411 -16996 -15703 -13083 -9230 -13287 -18205 -9139 -6674 -5507
19901 -5507 -3450 -4125 -3410 -2543 1261 590 -3622 -8943 -6213 -2393 -1345 -2113 4238 4678 3597 2186
19885 2186 -1470 -1914 -1132 2242 5625 -753 -8311 -12311 -9817 583 -2997 -3839 32 -1492 -4509
19870 -4509 -6617 486 -884 -6025 -3324 321 347 -1497 -2402 -4516 -8561 -10442 -14325 -6365 1857
19855 1857 2204 6209 9037 7092 2420 1261 -242 -1049 -8627 -11970 -8129 -4918 -6480 -8637 -7622
19840 -7622 -11268 -14606 -9205 -9228 -15323 -3741 -1437 -7449 -3616 -3791 -6993 -4311 -6397 -9250 -7524
19825 -7524 -8666 -6672 -2683 -7555 -13503 -13015 -855 6654 -763 -1804 -1681 -2864 -922 -4060 -5935
19810 -5935 -11943 -12978 -11125 -4595 8505 14080 9009 6414 9766 10220 3478 415 -1500 -4741 -7797
19795 -7797 -10148 -9444 -10958 -7733 -6643 -9694 -7567 -4333 2428 4306 -1112 -3112 -6214 -8160 -13117
19780 -13117 -15745 -11151 -7513 -2487 -3911 -8738 -13047 -14852 -14648 -13505 -8800 -6576 -8574 -9221 -16865
19765 -16865 -18749 -10966 -2200 -861 -2656 -10735 -10319 -3437 3498 10248 6936 -2733 -10600 -7330 -2837
19750 -2837 162 -1371 -1814 2982 3854 966 -1248 -1275 -3713 -7946 -12560 -15688 -16836 -9919 -5230 1176
19734 1176 2856 1243 -2287 9 5450 5462 8051 7997 7986 6402 4737 6175 1992 893 -838 -2612
19718 -2612 -3726 5303 11526 7174 -3365 -6011 -1019 3689 5582 6351 -3766 -11349 -9462 -7065
19704 -7065 -5334 -4922 -2240 -9896 -14249 -9381 -6510 -6515 -8158 -8521 -3274 -2631 -1247 536 -5109 -5792
19688 -5792 -5805 -4224 2711 2913 788 -6519 -114 3591 -4235 -11920 -13921 -18678 -20666 -21513 -12668 -4521
19672 -4521 2297 11239 11145 7516 3012 -1300 -5713 -7475 -16521 -20731 -16751 -8585 -10911 -11378 -11154 -13235
19656 -13235 -13607 -10335 -7190 -2885 -1544 -3026 -10444 -7406 8837 8193 2006 7811 9703 5456 -2961
19641 -2961 -4652 1504 6476 6812 4109 3183 -1500 -9530 -7288 797 6605 10254 7191 -3850 -6968
19626 -6968 418 4596 3232 -6904 -4864 6269 12416 6508 3719 770 -4696 -6763 -7038 -9165
19612 -9165 -5787 -4735 -2639 -2452 3226 5339 2471 -6728 -5804 -3166 612 -1032 -4735 -4456 1562
19597 1562 4667 554 -1243 -7861 -13160 -16768 -16611 -7624 -7822 -10382 -9069 -6808 -6282 -1216 -2088 -34
19581 -34 -1273 -1794 4266 8695 5783 4113 5215 449 1429 3324 -213 -2256 -4875 -4753 -893 1648
19565 1648 -1552 -3536 -1018 -3866 -9996 -12988 -10340 -8740 -9666 -12486 -20428 -20464 -14803 -19338 -23143
19550 -23143 -22644 -18896 -13089 -2428 -2215 -8472 -2292 1106 2752 2190 -4274 -3054 -9103 -14571 -13774
19535 -13774 -9716 -11586 -21460 -23393 -11102 -2439 -2437 -1680 2472 3531 3745 1561 -1293 -6759 -5692
19520 -5692 -2506 2515 3152 -1454 -4455 -1472 -5124 -9897 -10620 -6137 3263 -1205 -2501 -2671 559
19505 559 6577 3976 -1081 -7989 -11385 -1666 7391 8424 4296 5842 2361 1684 3019 2215 -1245
19490 -1245 -2658 -3965 -6270 -6607 101 -6611 -13994 -12953 -11970 -10560 -13072 -8738 -6911 -9080 -11965
19475 -11965 -13640 -8314 -7550 -9551 -9047 -4030 -6182 -8782 -11958 -16632 -15735 -11589 -3416 -6680 -12869
19460 -12869 -11079 -6902 -11254 -9211 -8653 -9218 -7217 -6658 -4913 -6241 -5976 -13664 -8988 -2076 -3446
19445 -3446 -6661 -6358 -1022 2166 5402 4012 7183 3191 -3385 482 -3545 -4819 2460 -2316 -8297
19430 -8297 -7725 -10005 -6845 -5708 25 -1085 -8107 -5581 -5279 -10096 -10888 -6347 -2585 1155 -1388
19415 -1388 -5340 -3546 -928 -804 -2533 -1597 346 -154 2643 125 3704 1159 -515 422 -3082 -3688
19399 -3688 -1908 -743 -377 2296 1672 -1574 -2613 -4358 -9446 -7328 -9803 -4694 983 -1823 -2989
19384 -2989 -5011 1364 8061 3008 1129 2570 4045 -587 -2875 -5752 -1553 -1168 -2309 -1818 -3443
19369 -3443 -7007 -9934 -5034 1947 -6512 -6348 -1466 -6740 -6503 -4882 -14 8890 7449 1238 -7140
19354 -7140 -5867 -10219 -10905 -14235 -13818 -5695 -3479 -6073 -45 2497 3006 1338 -2134 -6146 -4861
19339 -4861 2065 2282 1232 -2489 -1406 659 -3169 3941 1845 1174 1641 -3986 -9216 -9130 -10470 -10360
19323 -10360 -13642 -10696 -4459 3240 4103 -1272 -1090 1602 -3288 -4150 475 -3314 -8686 -5402 -4582
19308 -4582 -2374 -2462 5869 10386 11026 9256 5879 503 -1003 4994 6330 4505 782 -5461 -9977
19293 -9977 -4215 1143 4258 3559 -3396 -10706 -3657 -3022 -5126 944 3581 6159 1891 3013 6955
19278 6955 1548 2573 5360 2037 2224 3284 -137 -7459 -6462 -2783 411 5646 10851 10065 2810
19263 2810 5609 11332 10856 10481 3412 -6975 -10615 -10496 -11516 -6726 -8710 -11034 -5407 -4491 -4483 -5118
19247 -5118 338 6819 10435 7214 6183 5855 -1323 -6085 -2195 1493 1055 -4294 -3334 -1363 -6846
19232 -6846 -11727 -13847 -11484 -3986 -5693 -5611 -439 2173 583 -4576 -9980 -10698 -4347 3713 324
19217 324 1398 -2822 1559 -1720 -4500 -4011 -11211 -13177 -11975 -8491 -2009 1110 -866 -3959 -118
19202 -118 536 -2122 -9083 -8862 -9951 -663 4784 -3435 -6679 -5918 -9901 -15347 -11188 -9080 -9291 -4097
19186 -4097 -169 3024 3200 2866 24 -4165 -6283 -4073 -1679 -1750 -1870 3183 6563 3417 5022 -1129
19170 -1129 -11100 -8977 -8879 -11308 -9130 -1226 293 2721 707 3296 -1399 -5147 -10078 -10142 -3514 7769
19154 7769 10015 2791 -266 -3315 -4656 127 -1992 -1353 5706 4727 -2536 -4059 -1827 2040 -3158
19139 -3158 -3528 -7134 -8216 -5907 -4709 -5521 -4717 3825 7425 2719 3458 7138 8530 3562 -3300 263
19123 263 769 -3484 -1129 2653 3236 831 -4693 -4599 -10199 -7433 -7719 -1464 4668 11663 7528 810
19107 810 4411 11978 7200 829 -5562 -3437 -4506 -4367 -2313 -2639 -50 -428 3294 100 -3407 -4221
19091 -4221 2876 3822 3740 3637 1092 -2713 -9086 -8932 -2556 -748 -2023 -824 -1757 826 2381 2424 5341
19074 5341 4779 1198 7118 7404 8165 5449 -1695 2250 -237 420 -1152 3487 -240 -3155 -1583 1181
19058 1181 188 107 5638 9429 10844 14617 16809 15044 12355 7824 9100 14978 10148 2045 3545
19043 3545 10114 13056 12549 10415 -531 2501 2716 2978 -179 -4247 -3886 3244 10089 16754 19459
19028 19459 19689 10885 -224 -2236 -4856 401 7752 10943 13760 4749 -4132 -4284 4258 2369 6957
19013 6957 6618 6369 6797 7777 4601 7540 8616 10710 7223 5295 1292 -608 -2793 -412 5781 2436
18997 2436 -5015 2109 6785 3569 -3304 -5337 -1395 -2157 -1431 -2595 -7806 -5753 -4458 1312 2768
18982 2768 -5998 -7619 -1927 2615 1840 -29 -5793 -5559 -4979 -4294 -4351 -7059 -10242 -6788 -3216 -3366
18966 -3366 1058 -1917 -4644 3955 11200 7372 4829 -2603 -8977 -13998 -11696 -5634 -3429 -3221 3261
18951 3261 3120 -134 -4918 -10717 -6529 -2804 -1134 4475 2360 -2312 6079 1901 -5043 2314 8487
18936 8487 8367 -158 -452 -372 -3796 -5400 1766 4403 -4673 -5940 -2904 12 -1556 -4606 -2213 -1189
18920 -1189 -3278 -815 1555 272 -6078 -27 2968 2060 102 -727 -903 576 2939 -78 -2493
18905 -2493 374 4723 4428 5552 14871 11527 -4220 -618 3367 1192 2052 3854 3028 146 -8282
18890 -8282 -7477 -4045 -4140 703 7198 7416 6326 5211 1088 7063 4950 6928 1623 -5337 -409 7461
18874 7461 3217 7750 12653 13493 11843 10451 12753 9090 763 1701 3814 -257 -3283 -657 3123
18859 3123 1380 3062 8076 14785 13099 8907 461 -1862 -1041 -3497 -1993 -2751 492 1254 202
18844 202 5968 12446 12386 5690 -1052 -10921 -14142 -7481 -106 -1696 1171 4689 905 175 -2190 -6333
18828 -6333 -9734 -9219 -1841 -2157 -2681 -1510 2277 -190 -4791 -9765 -4902 8924 12715 11209 13248
18813 13248 10493 5400 -150 -2965 631 511 4000 5055 4669 2579 -1118 -2115 502 3927 2764
18798 2764 4590 4259 2708 759 -1572 -4652 -3608 -1639 -527 648 3205 4562 1509 5069 10958
18783 10958 15511 14759 11655 8683 5081 -785 -5442 -5857 2413 3792 -2055 503 6992 11331 17201
18768 17201 19548 23093 25354 20228 7823 -2867 -3561 4541 5985 5759 4254 375 -1465 -615 147
18753 147 -465 -781 -4820 -6518 -4772 3080 9634 4406 -2093 1388 937 2170 1545 1790 126 -6132
18737 -6132 -5940 -2204 1031 -5095 -115 -1690 -4189 4590 11755 9330 2946 829 3058 5080 132
18722 132 2022 7953 9533 3993 -1963 -2748 -3909 1327 10892 12672 14071 11713 9844 12485 10840
18707 10840 2334 -1486 -4558 -976 7301 7616 8339 -2446 -10691 -7783 -2366 2126 2799 9346 12250
18692 12250 12405 11295 19334 18846 13555 8073 10159 14003 10516 8558 2289 429 -5430 554 -453
18677 -453 1055 737 1902 4052 9064 13734 18523 13767 5079 7524 7666 5432 -588 -4510 -1938
18662 -1938 6395 9934 5061 7704 10863 5771 4298 3397 1932 11828 18572 12705 11075 13657 10771
18647 10771 8960 7849 -129 -120 9094 10424 5261 -2768 -3222 -356 3299 3834 5630 17280 20792
18632 20792 15083 17342 22949 20215 14960 10342 7673 5300 7352 3391 -2701 -2401 5097 13546 17919
18617 17919 15918 10528 6850 5003 -935 -7639 -12594 -16745 -8096 -4217 -9300 -8862 -790 7717 10948
18602 10948 6640 2518 290 -3149 -56 -4645 -1625 -3032 -2769 -1579 5233 3299 422 -6337 -5656
18587 -5656 1680 10011 9594 2191 -1538 1155 1851 2731 4402 4616 8106 11448 10614 2932 4989 12359
18571 12359 14512 15315 8196 6671 6744 6071 5567 4636 4923 1747 6412 14138 16126 11763 7730 6749
18555 6749 4948 2415 1320 4007 17465 20284 15690 9059 7843 9236 6935 9271 12313 9357
18541 9357 11458 12239 3682 -1420 1728 12553 15103 13614 13651 11363 6424 4924 6985 5312 2551
18526 2551 4009 4954 11214 16628 17612 20327 20126 22431 21057 17759 15242 10755 11337 9454 6364 5121
18510 5121 5184 7280 12256 13992 12910 11105 5272 4028 6338 4931 6281 7854 3337 -1989 7415
18495 7415 9955 4253 1232 4606 3392 -4144 -4480 -3002 -9729 -4379 -1323 -2690 3192 1971 -1944
18480 -1944 85 2777 5688 297 -402 6022 12604 13197 8964 8235 14135 13594 12776 10025 9814 10893
18464 10893 9202 9771 8497 8566 5851 1039 6552 1020 4376 12085 13205 15584 14616 15889 18331
18449 18331 13620 9016 7036 5634 1885 3737 -250 6451 9466 4444 -164 -1877 1441 2330 12579
18434 12579 14895 11725 15527 9383 2805 3093 9989 9198 4843 4209 7548 11693 10909 4849 529
18419 529 2699 9620 10580 9618 11217 16183 18710 21135 17500 12663 9050 10996 11949 16810 22326 21651
18403 21651 21966 23096 21469 18257 17701 15084 13619 19659 19039 14589 14747 12719 11698 9623 9307 10845
18387 10845 12162 14554 14752 13860 1607 1217 5277 12499 11834 7712 7424 8220 7166 6860 14865 10869
18371 10869 9029 7064 2148 -6450 -8865 -214 3606 11312 8512 8332 11896 5903 -3353 -5971 5564
18356 5564 11304 13176 12551 11534 8649 4590 -149 -2492 -1542 -1135 5898 11572 17392 15090 7831
18341 7831 2992 -239 -1740 4268 12703 17685 11689 5176 4479 8421 12101 14548 5868 -210 -63
18326 -63 8395 10635 8507 9583 10776 11390 11881 13488 8763 9723 19472 27760 21490 21101 20099 14459
18310 14459 16108 17619 16043 13629 3713 465 11696 18788 15110 10582 7223 10425 18223 24165
18296 24165 20287 20116 19961 21529 12971 3680 3661 5343 10390 16586 18835 24152 23977 29436 30467 15850
18280 15850 13276 16812 19755 20156 21785 29083 29558 26420 30415 33588 34889 36491 36916 34145 32844
18265 32844 30400 28671 31344 34584 38688 42917 40509 33818 31152 25972 23147 25473 23615 24034 18699
18250 18699 11994 13888 22043 27233 25551 24652 26747 24171 20222 24210 28751 31086 30894 28474 25923
18235 25923 27735 41223 41251 33360 32438 27957 29929 24897 13132 14379 13623 17758 15658 12615 8615
18220 8615 11404 14862 20515 20511 18789 22420 23271 16619 17530 18872 26008 33184 30769 31482 25963 24651
18204 24651 19220 16952 23159 29632 36894 32250 28498 34983 31469 31899 34230 34907 29211 33007 32369
18189 32369 35233 39226 38745 32715 29069 30978 29574 25565 22100 21992 19261 19708 18223 26192 34664
18174 34664 27001 20987 21200 26743 32723 36163 32457 26708 27933 36535 42804 46809 43721 38560 42410
18159 42410 45681 48018 45487 36435 40465 51518 55979 51444 48402 42800 40351 45252 47996 52364
18145 52364 55946 59358 61294 58566 53635 55802 67018 78651 85802 85683 83977 87918 92289 94355
18131 94355 91800 98022 110424 119120 134780 158238 189414 215759 243482 282960 339438 403201
18119 403201 476125 573571 717051 929124 1288438 1943015 2939132 3927468 4477605 4873995
18109 4873995 5573446 6258909 6551875 5353783 3658893 2576655 1960438 1580763 1323113
18100 1323113 1145130 1020248 921514 840209 775331 719109 679964 639300 608150 566372 518802
18089 518802 480387 460143 440588 421815 416989 410252 410294 423436 429453 446099 460300 476833 512957
18076 512957 550254 589624 624136 660243 715453 776638 852024 916927 970641 1015035 1054455
18065 1054455 1093411 1125761 1145833 1147009 1142608 1162514 1207196 1261304 1307860 1334500 1320640 1258767
18053 1258767 1169530 1060737 937497 817366 705146 613324 550158 500624 466908 438620
18043 438620 433376 438521 450366 462961 472759 477742 474411 470339 453686 423849 397202 376111 370360
18030 370360 385692 413992 465243 546304 653464 774485 899505 1032485 1175905 1301126
18020 1301126 1380737 1392825 1340214 1263551 1188913 1118895 1042480 953121 863212 778298 706836
18009 706836 645627 591621 532402 476946 426422 394640 375167 346943 312609 293947 279154
17998 279154 260676 246645 232393 224063 225001 222736 217151 203754 198597 197691 191728 187564 190260 188170
17984 188170 184136 188468 197648 193474 192497 198617 215396 231979 241493 259029 278085 303393 336132
17971 336132 372366 406470 444044 503820 573406 651725 740602 840583 957800 1079630 1200597
17960 1200597 1325563 1465828 1587824 1687014 1784154 1885624 1958883 1983752 1971165 1952636
17950 1952636 1922182 1860873 1766865 1654245 1530943 1418130 1286199 1154194 1033402 931433
17940 931433 841343 768393 705472 664802 633937 604362 579739 555078 543180 530580 506430
17929 506430 490501 482752 483615 496432 504629 521410 550303 584095 626236 657426 686630 728411
17917 728411 785320 840413 882552 904660 935618 985540 1021697 1031975 1035580 1055519 1081681 1099784
17905 1099784 1105984 1100872 1094915 1084283 1066745 1041090 994794 939622 884075 816535 737386 659447
17893 659447 584653 515276 457371 405812 363161 343584 329676 316934 309173 302796 296475 299382
17881 299382 298327 292403 292265 284165 273719 256147 246566 231746 223899 221068 215964 214739 213283 218344
17867 218344 226536 222610 220156 218442 220176 219708 216785 220400 222025 233232 240178 240585 239402 237158
17853 237158 229442 219883 212429 204132 201043 191252 175683 167396 172945 171396 166624 154434 143976
17840 143976 135000 123589 114999 104612 99577 101801 106093 107150 99745 91800 90445 82164 80709 74693
17826 74693 72727 74278 80315 74996 69679 70972 66696 67193 72577 72528 62701 53925 53730 55568 58931
17811 58931 56004 47637 49622 46544 42986 39116 43064 48121 45433 42826 44512 43980 39871 40413 44139
17796 44139 48227 47833 48049 53385 55158 48568 46788 40020 35492 36624 31432 26133 24311 21407 19804
17781 19804 13534 11863 10888 8032 14256 23332 28509 22849 19407 19274 22100 23050 20742 18243 16595
17766 16595 21581 27261 24556 20632 20025 21366 26881 24634 19343 19271 21590 18205 17006 30998 31266
17751 31266 29888 35877 45398 41444 45110 54864 55761 55122 55399 56028 48242 42265 43540 45136 45235 38010
17735 38010 32795 34113 33900 33791 29519 28712 36163 34426 38803 39119 43225 47312 44240 47981 55453
17720 55453 53485 50483 46123 40319 33251 27974 31463 42319 43311 42797 38736 37648 37024 35215 38723
17705 38723 44928 51393 51555 52032 51761 43624 37382 37075 35585 35781 34886 32202 24920 29596 33142 30942
17689 30942 25068 26717 22702 19858 24257 28362 29891 28890 22896 20707 31704 41603 39639 37895
17675 37895 30757 23319 19030 19741 21084 20323 25563 29113 30545 31469 19266 15902 17856 17459 17303
17660 17303 25730 27937 26515 29816 29268 27216 30532 31703 36718 35608 37863 37466 33072 35013 41928
17645 41928 45438 49376 48963 44282 45145 50487 51572 45863 46555 53041 52742 52671 55962 52526 47833 46734
17629 46734 44296 49688 55863 57222 58261 60836 74449 85421 90949 96901 106032 124928 138403
17616 138403 144062 151190 154848 152697 148946 148837 149529 152181 147559 141219 135772 133213 134185 135218 133563
17601 133563 134864 140499 147637 144313 143302 140398 142581 139343 135320 135825 132334 132928 127798 118941 118174
17586 118174 119505 119842 115151 113399 109214 114538 117746 118792 114153 117630 126732 131284 128681 122555
17572 122555 123486 134374 139040 143525 148837 157505 155855 156371 153578 161532 166658 167427 175868 186719
17558 186719 194009 203578 209854 211968 229253 237751 247721 258239 262292 268003 277577 275360 284466 298558
17544 298558 306183 314058 316740 324792 338346 348552 356804 360926 365919 373313 379194 387864 401005
17531 401005 422200 438033 458744 478554 499613 522912 555236 590833 620822 653801 697885
17520 697885 757486 824663 896413 983317 1098445 1226755 1362347 1507185 1671494 1858015
17510 1858015 2056600 2260910 2488532 2760042 3089575 3480684 3976433 4639816 5580479
17501 5580479 6922047 8868127 11581896 15164253 19696421 25466582 32624320 40551181
17493 40551181 48250008 55488068 62538020 68750711 72429642 72540736 70217592 66974724
17485 66974724 62307331 55256181 47003964 39486138 33047747 27305958 22399305 18602228
17477 18602228 15842146 13844979 12363680 11207474 10271179 9496974 8846498 8283544 7773310
17468 7773310 7318113 6923099 6565409 6232763 5929172 5657848 5389735 5133895 4888802
17459 4888802 4663720 4454555 4269489 4103727 3951804 3806012 3669616 3553444 3447018
17450 3447018 3350231 3260150 3175571 3082838 2988442 2899804 2812937 2723100 2642005 2558807 2474158
17439 2474158 2384576 2295834 2216808 2145834 2078242 2014701 1954510 1895983 1844222 1787998 1734297
17428 1734297 1686902 1633170 1585722 1540251 1487946 1440745 1405033 1374887 1343921 1311902 1284190
17417 1284190 1251347 1215082 1181963 1153600 1134568 1103324 1069298 1039437 1022280 1004356 985548
17406 985548 956662 928797 900468 880889 859672 844623 822263 797181 775773 751319 727753
17395 727753 704047 686232 674074 665127 633109 606580 596187 587666 570812 551109 526516 502776
17383 502776 492746 480622 468852 457077 445511 435072 421252 417297 407352 393628 391318 383339
17371 383339 377317 365942 360339 358837 362626 359618 352739 352658 350665 347620 345767 340765 333193 331492
17357 331492 336552 328785 323140 317390 305483 292702 286126 279011 268528 259530 254651 251202 246383
17344 246383 242326 240995 241751 238697 228475 215970 208038 204174 204289 203992 198661 198849 190548 185299 181570
17329 181570 178362 181144 175282 176264 177405 166030 151318 141338 132798 127388 118103 111265 108006 102662
17315 102662 100774 103054 102788 103830 102588 99328 92641 88141 85336 79110 75071 76932 76446 69581 66302
17300 66302 68946 73436 69660 71213 69621 68368 70307 70293 74943 69505 64072 70163 68719 63566 59132
17285 59132 56087 55145 59037 57431 49420 49168 51037 51175 53441 57606 56611 51409 50345 57313 60968
17270 60968 57832 63939 72613 73431 71067 80406 92909 98973 97793 88535 88801 97856 105549 115740
17256 115740 125689 129125 123818 117264 111349 118457 121548 115383 107419 103615 103418 113924 117381 123476
17242 123476 131423 136061 133202 137171 142141 141555 141082 135635 121547 114298 104485 88792 76830 69218
17228 69218 65456 67629 66163 66723 64631 64370 59140 52864 48797 50600 55916 56435 54012 53272 49930
17213 49930 42580 40583 44881 48820 49875 45942 53360 58487 58321 53610 47902 47018 49615 53253 47878
17198 47878 42250 44113 46713 45887 45019 47135 41643 34346 30885 28580 18922 13523 9807 8968 14777
17183 14777 25836 23191 17033 15453 13117 9452 11437 12255 10667 14898 22254 17720 17618 23478 26215
17168 26215 23905 19802 22014 26438 28071 25996 28429 28675 28172 21306 13853 17764 18795 16174 22385
17153 22385 22304 20425 23217 19757 16110 14861 14768 12887 15963 14676 16618 16664 15536 7390 3317 4439
17137 4439 5888 6961 11096 19980 21260 18130 13184 10672 12476 16759 17880 13154 10594 6868 7486
17122 7486 3494 223 5111 16315 22124 20369 16602 13935 15237 11970 9057 8217 1637 2128 362
17107 362 -4002 -9550 -6223 -2548 -947 6263 9587 3672 3546 5409 7048 10032 5138 3256 3137
17092 3137 11632 11623 8338 7417 9872 4335 -354 608 1754 -1961 -9539 -5957 2559 583 -5760 -4643
17076 -4643 -6577 -9640 -7035 -1279 38 -4290 -7299 -3668 1344 3987 -437 -4023 -5651 -7459 -7118
17061 -7118 -7922 -8159 -5588 -3913 -6718 -4273 -3770 -2432 -3910 2099 4247 5947 8866 7265 4333
17046 4333 -2383 -10743 -16909 -15866 -15379 -8524 -5486 -9043 -2505 -4622 -3725 1036 2570 -5295 -10585
17031 -10585 -10520 -10435 -10076 -7268 -7658 -2893 2170 4298 2386 -4041 -8550 -8114 -7224 -7487 -5440 -8553 -9806
17014 -9806 -10186 -12031 -12970 -7630 -8287 -536 2729 -1084 -2468 -39 -3686 -3612 -1868 -7101 -6801 5524
16998 5524 9354 7083 5063 6917 5307 834 -2637 -3952 -2844 -3870 -8590 -10903 -7536 -5465 -4785
16983 -4785 -6773 -6441 -1751 1234 104 -59 3429 787 -1824 -5197 -5443 -1455 959 7233 6329 3441
16967 3441 -1866 -9298 -5679 -9333 -4533 162 6460 71 -681 8537 11213 11469 2615 -1968 -4386
16952 -4386 4998 10754 8520 4933 -1432 -11750 -6388 1168 4276 1026 4076 8070 11219 15430
16938 15430 12114 9058 5752 1553 2758 8192 11233 7253 9476 19936 30603 44967 61670
16925 61670 83886 110787 144217 172364 210283 255220 299976 340663 376708 394452 389553 368345
16913 368345 345149 318289 275447 230410 194585 163939 131984 103400 84234 74411 68995 62060
16901 62060 54881 52174 58368 54514 44722 39084 31417 33262 32854 26301 17913 17349 16808 21378 33488
16886 33488 33841 26815 23252 22738 24591 22404 22586 17064 17767 22270 19843 22834 26864 26567 16569 11129
16870 11129 13227 10982 13459 12713 13845 10552 10735 11240 6024 946 -1675 4780 9559 13012 10713
16855 10713 11057 9823 7133 14015 17515 9923 8214 8232 9703 9560 8560 9678 9510 7696 6537 2105
16839 2105 5850 6402 8974 10586 6115 -3376 -3723 2914 4559 -1882 -2756 -3830 2289 -582 -2046
16824 -2046 -3375 1904 5852 5454 6081 9430 9840 10666 8102 4985 1384 -1732 1275 4695 264 -3515
16808 -3515 -1130 1883 756 -650 1330 -1886 -11032 -8198 -799 4115 2608 -848 589 1861 5268
16793 5268 1224 -3944 -4625 -8096 -449 -2648 -3478 -9222 -8673 1278 -256 -391 -2275 -7107 -8508 -998
16777 -998 81 3185 2900 -4821 -3556 -3889 -6776 -3408 -12655 -13398 -8864 -2301 -5278 -7488 -6409 -1742
16761 -1742 -2511 -2352 -3638 -5249 -5990 -6636 -9502 -8706 -14515 -18369 -8748 2958 9878 7477 3070 6716
16745 6716 10992 4216 -6212 -2658 5632 8018 7726 2049 3504 -4116 -5392 -8037 -10471 -19126 -14783
16730 -14783 -7232 -9549 -9759 -11678 -8961 -5844 -1113 116 1714 3904 3094 667 689 6409 2036
16715 2036 -8314 -11406 -19532 -19305 -16804 -5869 -3875 -6255 -5941 814 -18 -2466 -2411 -6397 -4118
16700 -4118 -3566 -7204 -4242 255 182 -2445 -1831 -2536 -14113 -10422 -412 -4312 -7720 -7096 -10344 -7520
16684 -7520 -136 -1382 -3104 -10628 -11210 -7589 -5149 -5695 -7272 -4074 -8310 -6334 5186 2980 -3959
16669 -3959 -2630 3286 3602 -1229 -941 -6809 -1939 2856 -1573 -4591 -8242 -4785 609 -1766 -3737
16654 -3737 -273 -2727 -5896 -6756 -4101 -3417 -1585 3018 -5144 -2921 7233 -702 -4684 -242 -70
16639 -70 -1828 -3442 -8102 -8717 -12434 -6304 -1062 -1552 -6280 -6183 -3871 -7572 -14820 -16667 -10678 -9536
16623 -9536 -10663 -12928 -12144 -9344 -2089 -46 431 -4939 -1096 -2942 -6037 -4638 2235 11354 14877
16608 14877 10439 7102 6116 6470 5163 4449 1168 2135 -1162 -1186 -3160 377 4009 4143 5574 -1158
16592 -1158 -7499 -11797 -11570 -6469 -927 -1570 -4915 -5247 -4322 -9394 -9837 -7781 -4010 -5051 -4895 405
16576 405 3309 2999 1801 -2682 -5640 -2011 -5191 -9029 -8581 -5560 -7234 -9090 -8882 -3719 -782 238
16560 238 -4783 -6072 -1664 -466 -151 -8596 -5163 3762 1764 -3379 -8098 -5178 1001 506 -409 -5198
16544 -5198 -7519 -9595 -5092 615 1554 -782 -1099 -7276 -10980 -8034 -4953 -4368 -3597 -2786 -9957 -4444
16528 -4444 -6041 -8353 -3300 -4395 -4214 -7541 -9127 -13022 -12083 -6659 -6860 -7128 -6966 -8379 -4080 -8724
16512 -8724 -10033 -9382 -11474 -10037 -6150 -6258 -11005 -11135 -4205 -7429 -3093 471 -6324 -8186 -2712
16497 -2712 -1850 1091 -470 -2809 -4132 191 -3124 -4453 -123 -5945 -12318 -16299 -11993 -9651 -17845
16482 -17845 -19016 -17990 -11116 -8532 -15529 -18817 -12619 -9294 -1776 4600 2872 5744 6614 4543 1595
16467 1595 9828 6310 -3621 -6968 -3496 5616 7076 -8857 -3392 10085 2391 -4272 -5493 -6018
16453 -6018 -5428 -6963 -4789 -5518 -3032 -4555 -5522 -3664 -10732 -8493 -13445 -16231 -8162 570 4251
16438 4251 -3890 -10583 -9602 -12430 -9527 -730 -6497 -10871 -10292 -13783 -7722 1666 4771 9578 3438
16423 3438 -1342 -3217 -2522 -4123 -2527 -3735 -4553 -11004 -10599 -499 4638 5785 -271 -14526 -16043
16408 -16043 -13172 -7203 1079 -1314 -10230 -18297 -21684 -19496 -18273 -14831 -8907 -3933 -8550 -11759
16394 -11759 -13460 -10978 -7081 -2656 -3521 -5428 -9842 -11820 -6313 -6502 -5311 -6353 -9413 -10521 -4804
16379 -4804 -2943 2528 9390 39 -4270 -988 2981 2023 -3179 -9682 -7460 -2378 -3774 -7525 -5721
16364 -5721 -1521 170 8888 6874 2993 2889 -6888 -11100 -11808 -6390 84 -4774 -19774 -18298 -15649
16349 -15649 -14668 -10556 -7511 -4622 -5529 -5164 -3616 -5190 -12923 -15014 -13407 -13171 -18288 -12002 -8024
16334 -8024 -12695 -16071 -5868 1263 -4192 -3031 -5455 -10628 -8894 -7349 -11464 -14157 -11444 -10606 -13963
16319 -13963 -16988 -15985 -7927 -1411 -113 -3120 -5654 -105 516 -7599 -14538 -14154 -12401 -16973 -14066
16304 -14066 -6142 -8741 -13343 -11877 -8707 -6045 -2821 -7496 -10231 -10967 -7566 -8210 -4036 -5996 -4090
16289 -4090 -1718 -9590 -9460 -10356 -6214 -5852 -4351 -3182 -132 -7351 -11098 -9833 -14216 -15907 -12509
16274 -12509 -9701 -8770 -2272 423 -842 370 11 -6005 -131 4946 4527 -1279 2018 1418 734 -1772
16258 -1772 -4422 -4231 -40 383 855 -662 1015 10685 9824 1018 -1591 4739 3577 -1380 -2540 1161
16242 1161 6014 8095 8148 14321 24993 22596 14088 10396 8277 10119 7932 7032 6502 7865 9044
16227 9044 4667 -6252 -11850 -8457 -6783 -5512 -6457 -10553 -7713 -5030 -8942 -3259 -5248 -10537 -11196
16212 -11196 -6333 -7573 -6161 -5710 1328 -890 -2836 -5633 -4567 -7086 -6407 -8728 -11221 -7357 -2372
16197 -2372 -270 -3748 -697 547 250 -4004 -8979 -8404 -7698 -9481 -8160 -4374 -12651 -13346 -4731 -1709
16181 -1709 -350 -3004 -3719 -7141 -5222 -8369 -12108 -13481 -15662 -16380 -13487 -10895 -5631 -5024 -8408
16166 -8408 -6105 -513 2632 2840 3124 -1096 -5107 -2876 -6538 -7454 -2111 -4071 -7355 -5573 -5506 -3163
16150 -3163 -4788 -6733 -6106 -4571 185 4037 1691 -3173 -1007 1876 -2151 -1868 1694 2255 1716 -4538
16134 -4538 -3530 3197 729 -5637 -2884 984 1568 -2623 -5438 -5026 -1711 102 -7715 -8191 -8177 -6807
16118 -6807 -4665 -7967 -8641 -7550 758 1849 1855 180 -2805 -5308 -11331 -17161 -17099 -16530 -14443 -6818
16102 -6818 -5214 -3714 2964 -2283 -6148 -5951 -5946 5488 13215 7044 -1360 -5217 -4240 92 -2080 -10519
16086 -10519 -8539 -8844 -4669 -995 -1798 -1055 -3358 -8829 -11948 -8355 -8404 -4532 -4536 -9120 -10607 -7823
16070 -7823 -6481 -11982 -9926 -7964 -5586 -15914 -16650 -14632 -8652 3240 5297 1770 -2051 -7319
16056 -7319 -9969 -7174 -8528 -8605 -4974 1220 2444 1671 4732 -2652 -164 8048 3964 -1205 -3482
16041 -3482 -2305 -2477 -7077 -3791 -562 4128 -522 2353 8936 12872 6654 -4023 -8859 -8081 -9267
16026 -9267 -9318 -5227 -6523 -10763 -10807 -8308 -6673 -4525 -6681 -2194 1909 -2443 -4696 -3566 -1793 -4532
16010 -4532 -9765 -5996 -439 9249 9838 1319 -3863 1995 305 -4554 -6410 -6000 -1639 -4684 -12612
15995 -12612 -8451 -6592 -3441 -2507 5363 4730 389 -6728 -3483 -310 3759 5166 7656 6191 4377
15980 4377 262 -5395 -5426 -7974 -4186 -2388 -5463 -1210 -2709 -12240 -13232 -12380 -12921 -9686 -10617 -13548
15964 -13548 -14900 -10937 2341 9339 5106 -2616 -11314 -15478 -6533 -1179 1551 -3569 1193 5558
15950 5558 1826 -7111 -4723 -8390 -14338 -16402 -11980 -9448 -5311 -4444 -8859 -10706 -1549 1683 3733
15935 3733 -290 -3131 861 -1793 -3885 -8435 -12700 -9614 -13460 -10075 -668 1499 4133 79 -2666
15920 -2666 -10343 -8482 -6473 -1763 -4548 -4170 -1536 -1773 635 1845 2383 -2782 2723 490 443 3739
15904 3739 3395 -655 -5288 -10090 -12739 -9074 -8816 -481 -1369 -6837 -7225 -6131 -3651 -2059 -3249 -4494
15888 -4494 3292 826 -4321 -8102 -6815 -1116 449 -532 1107 -6425 890 6556 457 -7115 -9530
15873 -9530 -11274 -9212 -4306 3710 5027 1102 -2292 -2799 1763 2456 307 -6497 -9175 -9217 -13393 -5323
15857 -5323 4328 6265 5640 2591 -2983 -7729 -11756 -14776 -3932 985 -1289 -10454 -13913 -2498
15843 -2498 905 1464 5747 6342 1272 -681 3528 5171 3033 11133 16194 4698 -4268 -6465 -3812
15828 -3812 -2999 -1380 61 769 2165 4996 13053 9807 6880 7735 715 -421 -1889 -14207 -16541
15813 -16541 -7402 2914 13808 23439 28569 33699 29246 16055 1360 -3672 -7026 -6705 -9577 -10137
15799 -10137 -3327 1043 5908 1938 -344 -4553 -8699 -10480 -8695 -4789 -4477 -3124 -10769 -3589 -3139
15784 -3139 -9915 -6550 -3874 2880 -1124 -3585 3760 4771 1098 -1166 -334 -1275 -3832 1696 1114
15769 1114 -2752 -881 -3729 -11016 -9075 -7761 -3259 5437 7819 1815 -10036 -5036 -7737 -10043
15755 -10043 -12987 -13376 -12856 -10338 -1567 -4211 -3965 3180 5172 3313 -1823 2676 6546 3268 1153
15740 1153 -173 -1714 -1369 2904 -605 -9280 -9016 -2055 1281 -448 -6479 -9691 -8809 -6003 -2819
15725 -2819 3850 978 -217 -1738 -10596 -7828 -6719 -7394 -10654 -4611 3107 6445 5660 -2652 -13129
15710 -13129 -8759 -7142 -6921 -2660 -585 -3261 -4372 -6600 -3228 1170 4077 3665 -244 1069 3519
15695 3519 -129 -4077 -6913 -1575 -5152 -9073 -9767 -6121 -6974 -11476 -13458 -9719 -12056 -8383 -6513
15680 -6513 -7738 -7688 -7639 97 2429 -176 -4471 -5004 -11671 -14049 -12259 -8793 -9278 -7604 -9559 -10195
15664 -10195 335 716 -9377 -16649 -19708 -13089 -17399 -14021 -8954 3064 2832 -1233 -7511 -7798
15650 -7798 -7131 -6909 -2151 -1752 1470 214 -5754 -13801 -13767 -12409 -13742 -16550 -20289 -10621 -4354 -3536
15634 -3536 -7395 -4044 -5865 -1335 4087 8499 6711 -616 -3715 -3995 -3430 -2212 2677 4317 -714
15619 -714 3942 6452 11398 16308 14142 7489 5347 2672 -2031 -3481 -4315 -8525 -12966 -9663 -9504
15604 -9504 -4027 -1331 -8429 -14088 -12652 -8157 -9766 -9296 -8201 -8153 -9528 -7060 -2592 -3678 -3003 -5167
15588 -5167 -6927 -3327 -4140 -7159 -2248 1202 1084 83 -2239 -7416 -10486 -6617 -5034 -7907 -4308
15573 -4308 -979 -2192 -4135 -4631 -10948 -11795 -12587 -11263 -12820 -13278 -11014 -6788 -7828 -13182 -13611 -11255
15557 -11255 -13859 -11321 -8620 -7373 -2477 -5963 -13194 -19632 -16419 -13035 -5523 -7570 -7701 -6150 -5890
15542 -5890 -10538 -9030 -3377 -1757 -8098 -9404 -13044 -14966 -16074 -12000 -10434 -8581 -5705 -6366 -7643
15527 -7643 -4897 -1651 2728 61 -4036 -3680 3153 11073 4047 -375 -4816 -9420 -6403 -1004 1162
15512 1162 1328 -2289 1269 -473 -193 -5675 562 1144 2666 6472 4718 7301 8940 1647 1874 1709
15496 1709 -329 -5653 -6098 -5383 -504 -339 210 1563 2265 1050 -2799 -6918 -5578 -5633 -9306 -3688
15480 -3688 -995 -1693 -2872 -12275 -14815 -16957 -16389 -15263 -9422 -7956 -3032 -6916 -2892 -3795 -5347
15465 -5347 -3200 -3993 -3835 3009 -926 -7421 -13411 -7688 -2725 -5117 -4086 -2820 -5960 -6614 -7138 -9842
15449 -9842 -7279 -4964 -2783 -6600 -9871 -16501 -12226 -9989 -12706 -18442 -17299 -16465 -18720 -22750 -16542
15434 -16542 -12122 -12360 -3972 715 1574 4749 4253 -734 183 1364 13445 13580 9274 7468 -1270
15419 -1270 -2964 -8847 -6006 -9838 -10479 -6467 157 -2643 -3839 -2986 -3449 -809 -135 -5012 -3754 -8130
15403 -8130 -15814 -14620 -7219 707 -4249 -3820 3430 6413 -224 -3951 -5576 -2714 1030 -436 2542
15388 2542 -979 931 1681 3585 3766 2881 -773 -4057 -4253 -1705 -7039 -2831 -612 -4833 -6367 -6325
15372 -6325 -8483 -11624 -11760 -7773 -3587 -6074 -5248 -3325 -9478 -16661 -11555 -5452 -6408 -15166 -13970
15357 -13970 -14932 -17689 -18444 -13493 -7440 -15590 -18765 -13553 -17682 -16371 -4400 -1522 1083 -4288 -10180
15342 -10180 -11582 -7203 -4373 -1199 1192 3016 2774 8556 2286 -96 1718 4607 10314 10773 -1430
15327 -1430 1661 4820 6468 6473 8080 2751 -1363 -2795 -1699 1546 61 -516 -2160 -5606 -3764 -6566
15311 -6566 -3073 5247 10905 8047 -2545 -8458 -5447 228 7034 7051 5074 8341 -1094 -6416 -7920
15296 -7920 -9622 -6767 -13205 -16082 -11189 -1445 4 -3487 -2775 -5288 -1934 -2483 -2718 -1049 -3261
15281 -3261 -8474 -7887 -3211 -4638 -7358 -2561 -1329 -1257 1960 208 -1592 -4478 -7425 -5267 1632
15266 1632 1454 -3773 2805 6484 7783 6507 7241 3793 -4330 -5564 -1999 660 1206 408 -2322 -30
15250 -30 -1265 -3052 -2610 -6166 -9251 -17558 -14163 -8766 -7462 -7683 -10031 -7181 -2134 -1235 -3102 -7941
15234 -7941 -9678 -2526 5867 6252 3864 8355 7952 1307 -4449 -12744 -12010 -3914 -7806 -5780 -4201
15219 -4201 -3062 -93 3580 5996 3555 -1589 -6475 -1614 -1351 -426 -1388 2447 7199 6004 3045
15204 3045 4028 -3370 -6549 -7816 -10708 -7196 -1387 -180 1328 2889 1186 -1135 518 -1205 3475
15189 3475 4347 2875 -937 -2187 -1885 -2215 -2446 -4356 -6777 -1127 896 1028 -7246 -8888 -10394 -16449
15173 -16449 -8976 -2864 -360 -4329 -4873 -1965 -267 -1150 -4746 -2513 -7089 -6426 -6443 -14015 -15408 -18658
15157 -18658 -17482 -12262 -13910 -15525 -12905 -7798 -3921 1331 4551 -3992 -3524 4561 7061 3733 -2561
15142 -2561 -3345 -8002 -8240 -6424 -993 3302 1819 -4081 -6097 478 161 1150 1364 -2625 -3760 -5168
15126 -5168 -4282 -2491 341 9286 15283 5444 -10940 -15127 -5747 2248 9637 12453 2027 -1204
15112 -1204 -7646 -3244 2276 -5213 -17527 -16736 -7490 -163 -2940 -8927 -8622 -7914 -2933 -4519 -4275
15097 -4275 -4969 -4740 -7673 -11542 -3692 -1226 -9267 -8779 -11783 -5741 -3737 -6283 -8931 -6504 -8387
15082 -8387 -4562 -627 -1534 -3706 -5034 -10208 -10281 -6509 -4653 -5674 -7400 -6555 -4311 -3656 -5764 -1761
15066 -1761 6906 7585 1957 -536 -5563 -6109 317 988 6939 6999 5097 8662 6567 7336 2556 -531
15050 -531 -1658 -3729 -9597 -7071 3740 8125 2980 -645 -7993 -13381 -9863 -4127 -3119 -2525 -6428
15035 -6428 -10281 -8909 -3799 -1250 -660 -5691 -13106 -14095 -6538 -1561 -1161 -7013 -8669 -4896 -1678
15020 -1678 -4985 -6301 -6071 -7554 -12304 -10972 -6525 -112 4792 2659 1741 2888 7710 11185 13901
15005 13901 14065 12764 9862 2510 94 -170 -2474 -5163 -7897 -9139 -6838 -4484 -1673 -5398 -10063
14990 -10063 -13427 -12657 -12016 -7859 -4597 -690 -5762 -5752 1041 9852 15388 12227 6339 1563 -2906
14975 -2906 1303 7312 14517 11568 4193 1350 4605 8079 4177 3255 -146 -3349 -6288 -1623 -5797
14960 -5797 -8901 -8920 -12231 -9102 -9706 -12858 -10561 -9276 -10242 -9304 -3340 -1631 -3529 -6210 -5818 -8042
14944 -8042 -10168 116 4046 3833 -1038 -6060 -9085 -18887 -20151 -15951 -15875 -16391 -13171 -13621 -11997 -3702
14928 -3702 -2649 -5771 -6282 -9090 -10225 -7704 -6726 -3694 -3298 -4697 -2393 872 2420 3028 -2829 208
14912 208 3963 1795 -2295 -8338 -10368 -10410 -6727 -6306 -5236 -148 -2722 -7060 -10837 -10470 -8531 -5036
14896 -5036 -5717 -1114 3492 9154 9496 6348 2411 -357 -3660 -1394 -3992 -3060 -6514 -5288 -4056
14881 -4056 -4281 -10865 -15597 -2225 1210 -8606 -8770 -5754 -7300 -6651 -713 1455 901 -7939 -10706
14866 -10706 565 12047 13358 9799 9447 134 -8822 -6418 512 572 1703 8001 12076 14743 4810
14851 4810 -6132 -5063 2151 2089 194 -5360 -3894 6813 5233 1169 -1661 -4604 -3357 -605 1551
14836 1551 -6121 -5349 1206 1361 -4428 -760 7370 3937 -3741 -12043 -15107 -10817 -10482 -11097 -6936 -6160
14820 -6160 -1201 -2076 -5275 -6211 -2617 -5426 -2994 -460 3147 2544 -1379 839 8474 6156 2997
14805 2997 -3490 -6401 -6548 512 -1446 -10855 -13016 -1535 -722 -1450 -6660 -852 4733 -828 -924 -2817
14789 -2817 -1345 8285 8682 6166 4115 1357 4607 1282 -3832 -8074 -14714 -14156 -9083 -1801 4821
14774 4821 3247 -4664 -4484 -3015 5616 631 -481 -702 -5511 -8663 -2369 1264 1560 -814 -1018 -3141
14758 -3141 -4632 -3558 -19295 -15801 -9685 -5967 -4814 -280 -3134 2485 9332 9183 1177 -3016 -2090
14743 -2090 -6471 -11729 -12759 -4277 -5597 -11165 -2519 -1720 -334 -597 -5961 -12475 -13305 -7822 -7523 -8906
14727 -8906 -7586 -10333 -11810 -10744 -8041 -3371 4149 5768 4060 4020 -2678 -5167 -5965 -6022 -2971 1258
14711 1258 3347 8125 7940 8961 7817 5834 2482 -861 -2115 362 4469 1819 4071 11986 18826
14696 18826 20506 11927 1655 8614 7556 7418 4174 -3150 -3625 3702 8939 5336 2584 6764 10996
14681 10996 10873 8443 2266 521 -5281 -8334 -5082 -5884 -5230 -2898 4118 3654 5862 6898 1621
14666 1621 -1778 4775 4739 5330 -165 -2174 -3878 -4351 -2522 2725 3411 8035 8812 3922 3833 -2028 -3759
14649 -3759 -7567 -1266 -2734 7168 7243 8131 5754 -5083 -3650 1362 2411 -2027 -7979 -16886 -12613
14634 -12613 -2209 4357 -398 -8882 -9767 -9128 -7703 -9848 -10508 -10263 800 9147 9291 5063 4220
14619 4220 -5864 -4542 1555 -370 -5872 -4780 1700 326 -4003 -7710 -8467 -4795 3743 4557 -12
14604 -12 -549 814 1960 3162 8273 8451 4322 1038 1230 2768 2294 3514 2580 4844 4050 -246 -6344
14587 -6344 1200 6636 -205 -2655 3061 8397 7048 7947 155 -6091 -5263 -3198 -4134 -2259 -7133
14572 -7133 -10941 -8815 -6091 5227 7362 5038 -384 -2209 -1039 2412 335 -1895 5736 6560 5012
14557 5012 6748 7281 5395 7902 12517 14095 12250 8420 1509 2406 2418 -1561 589 530 2379 5874
14541 5874 -1294 -1220 -2071 -3133 -457 906 6824 11813 16032 13467 14650 21097 17882 11269 9762
14526 9762 1334 -6065 -3291 4575 16421 13507 5398 2519 9398 11504 9842 9433 6298 3050 -2053
14511 -2053 204 2071 7103 8037 11780 12269 8468 9565 7517 -783 -1641 -969 2656 -384 -4422 -8121
14495 -8121 -8474 -10571 -11480 -5744 -4922 667 2989 5788 1811 -4395 -3312 576 7098 3871 -1625
14480 -1625 -5120 -7754 -7722 -2917 1515 -6461 -8966 -1314 2588 1307 1098 463 6691 13527 9567 9304
14464 9304 9826 9225 6725 -4141 -10272 -13333 -11352 -10125 -2806 3432 1248 -5768 185 10040 9411
14449 9411 1181 3996 7859 6046 3396 2260 -1002 -8607 -5005 -158 -6762 -12420 -8849 -10462 -7918
14434 -7918 -3086 3392 10016 9800 10304 8166 2761 1211 -131 -7202 -8248 -4713 -3924 -1203 1143
14419 1143 -6014 -9261 -5269 -3093 -2348 4869 9071 8246 6949 1744 481 -4109 -947 1633 3889
14404 3889 1094 -660 153 -62 5305 3506 2612 616 -968 -173 -421 -4662 -7691 -8028 -12477 -8185
14388 -8185 -6392 250 9489 8946 7528 8937 7406 5902 5345 -2392 -5081 1670 -1325 -6757 -3354
14373 -3354 2165 7434 6058 4168 2005 -2973 -594 460 7555 6002 2121 6255 9938 7884 10538
14358 10538 15399 18029 11162 4637 1537 -1527 -1479 234 1183 6243 5919 1322 -860 1812 1757 1573
14342 1573 1236 2727 2811 1884 123 -2305 1685 -1268 -2765 -4634 -746 987 4049 206 -2431 -8440
14326 -8440 -5273 -4578 -2027 735 -902 -1545 -38 3132 1484 802 -2609 -7649 -12168 -5816 -3367
14311 -3367 -5665 -4237 -321 -6160 -6973 -1450 1885 4796 1563 3819 4836 -2518 -185 577 2493
14296 2493 13985 16185 12610 7150 1531 6072 6838 5373 407 -4193 -755 3849 1829 2414 7025
14281 7025 6321 1718 -2790 -1360 -5645 -2964 1030 -977 -2916 3670 3677 -2745 530 4970 3542 3291
14265 3291 3065 2171 3937 4365 2795 3424 2142 -371 -995 -2946 555 -841 1079 -34 -1317 -1086
14249 -1086 -5542 -4373 -10483 -3077 3762 310 -1548 -2218 -1636 669 5910 5413 3999 -2418 -2965 -5068
14233 -5068 1466 2772 3685 -1036 -5560 -3588 1843 -3380 -3499 4805 5030 -1095 -3527 -5320 -852
14218 -852 7237 16216 17600 19242 24134 16549 10389 1896 14 -3803 -2330 252 7665 3540 -595
14203 -595 1766 3447 4310 4173 2852 3720 5335 4613 4644 1045 2973 2764 4434 8010 12073 7251 7830
14186 7830 11242 11077 6285 2699 2655 4727 5846 6030 2740 7246 10527 7955 953 2518 8783 7990
14170 7990 13770 16182 13115 8552 3473 4161 4871 9273 9896 -1515 -5336 -7705 -9316 -3582 2015
14155 2015 -107 3088 5810 2416 1120 2299 -2505 2084 -1033 -1423 10582 9409 9709 6111 -2742
14140 -2742 -2009 316 -1386 -505 -5188 -7234 -3983 195 -4991 -2155 3383 11026 11896 15682 15638 9173
14124 9173 2311 5463 11718 9104 4861 7282 8529 11893 12735 13888 13114 10774 6729 8946 6655
14109 6655 778 3086 5357 2283 -2973 -4545 -793 7548 5846 7352 8049 3250 -41 645 7183
14094 7183 4602 3241 5533 4364 4771 2861 9356 10604 14203 14384 4616 5245 5331 6208 823 4106
14078 4106 11476 8812 9049 14904 10215 12228 8237 571 -7573 -8320 -3188 -1921 -2013 3911 7324 11694
14062 11694 13139 14652 12950 11621 14273 16677 12001 8274 6258 3413 -3117 753 6262 6929 9180
14047 9180 10004 11215 5290 2743 7574 13757 19244 19672 17713 14747 15088 19031 22160 21965 15344 11557
14031 11557 13681 11229 4983 5687 4684 6515 11809 14332 14775 14383 13267 10814 10821 17948 23567 18656
14015 18656 10121 8839 5481 4447 7203 3716 76 4727 3214 149 1225 8110 10178 7802
14001 7802 10679 13367 9552 6943 4219 3532 1710 -345 9874 16831 11562 7168 11196 9036 10759
13986 10759 8396 12797 14917 17310 10451 6731 8242 7964 1824 4218 4474 2900 2835 12250 20439
13971 20439 18929 14803 9332 9672 15512 15862 9420 5661 12719 22570 23611 22205 25823 20647 12816
13956 12816 15042 15863 19346 17569 15184 6702 5205 7911 13855 14913 12040 11938 13752 15926 13289
13941 13289 17215 18845 13018 15133 21142 16413 17306 13290 11616 15112 8559 10782 13239 11202 3852
13926 3852 3997 7081 10762 3591 1752 6546 9565 11396 14797 11776 -208 -2177 -4618 -4344 -1846
13911 -1846 5839 11597 8271 7959 15048 20075 19563 11399 6646 4561 10491 12982 9678 7036 9640
13896 9640 14514 18102 7177 -3457 -5484 -12440 -8450 -5648 1183 7938 14111 12439 13014 14307
13882 14307 8831 6321 2785 7494 15963 18130 16766 15664 16285 20224 15341 22024 25774 25537 19581
13867 19581 14661 16839 14172 17680 30331 36682 40769 46141 52273 60536 67327 71099 67647 54766
13853 54766 43921 47759 42570 31579 25681 31834 29592 19206 15044 16376 16675 17941 12457 10287
13839 10287 11380 16752 11464 9818 11392 17160 31533 38757 39835 34594 36807 38004 38319 36898
13825 36898 36036 33177 27655 20426 18780 22415 17066 20092 24994 22494 27180 26472 18163 17568 25007
13810 25007 30445 22360 17865 15954 14360 16032 16454 15924 16500 19085 17380 14680 18833 20408 16918
13795 16918 19414 20740 20556 23169 26822 28567 28275 23215 22977 23765 22273 22097 18117 19251 18162 22992
13779 22992 22005 22115 21019 22791 20468 19554 17399 13885 13645 18341 27715 32149 31779 28499 23252 15386
13763 15386 14638 14453 12693 9583 11866 6761 10386 13543 14743 14604 17573 20425 23822 19509 13719
13748 13719 21058 20043 15519 10176 9721 12277 13660 14001 15841 14979 5317 4071 2052 3893 1034
13733 1034 2106 6045 4607 6187 8772 9101 8793 10049 20964 22287 15451 14804 15785 19241 17770
13718 17770 22427 30355 26648 26886 33007 27789 22432 14804 12167 16016 16436 8002 11883 15522 23805
13703 23805 23643 21287 26424 22084 14106 13788 19154 24904 28537 24524 14481 11035 13837 11271 20133
13688 20133 27349 26659 20722 22026 21000 22841 17988 18459 20849 22214 28858 29820 30927 37334 42558
13673 42558 39173 32044 34782 35794 37660 35488 28813 32418 34611 40067 42587 49202 46652 40809
13659 40809 41651 42726 43625 41816 39063 46639 43090 36846 35319 37026 30625 26640 29010 25336 17193
13644 17193 25563 31853 38981 37290 32349 30415 31228 37522 38775 36786 38421 38469 38774 40948 43260
13629 43260 45523 47675 46768 44911 45970 52882 57530 54888 55210 54630 62732 72537 73843 70458 58722
13614 58722 49153 50908 53774 45525 44045 41691 44736 41462 45020 42974 42268 42304 38977 37835 31810
13599 31810 30839 28521 32091 32690 40382 34147 30769 31371 35648 43254 43288 42487 36835 36193 42325 49999
13583 49999 49574 49927 56833 68365 71351 56840 45425 44938 55856 63350 63477 60909 56132 54546
13569 54546 50960 46431 48449 49748 53432 51216 51018 47393 46350 51097 51261 49510 37951 33804 37602
13554 37602 42823 42908 40491 39547 37658 41315 46118 45855 48119 44841 37283 32017 42967 49101 49602
13539 49602 49724 54204 53481 52167 56288 54472 55994 67388 65232 60133 59033 54710 53242 47831 46441
13524 46441 49547 52237 54117 55287 53841 55226 58663 65405 75526 75498 74029 68350 67872 62562 57185
13509 57185 58782 62825 67238 58925 49700 50669 48744 46296 35907 33871 34098 36261 37126 37693 42170
13494 42170 54613 57659 62326 72132 82050 82946 82913 87347 83122 81419 82344 78978 76782 83276 80535
13479 80535 75511 74350 80095 84999 92808 95487 92953 94925 99564 106190 110890 106995 96836 94116
13465 94116 107039 134262 175163 219730 266413 347518 474811 663834 877608 1077764 1244577
13454 1244577 1399551 1541420 1614815 1544210 1313501 1014979 762871 587396 468899 386219
13444 386219 327220 284492 257281 238643 219529 208974 199091 187933 176181 162789 155075 150247
13432 150247 144456 138221 139389 140743 137208 133721 130848 130216 134703 130706 126981 123284 113654 102543
13418 102543 97080 95757 93871 86838 81180 77816 80140 78855 73920 69768 64970 57884 67524 74274
13404 74274 74866 74691 66634 65553 66347 63066 65525 70746 72018 67095 63268 56212 51044 51470 58196
13389 58196 63250 56754 59645 64242 62762 61981 63454 61972 58239 57587 59101 62104 63893 60210 62147
13374 62147 63658 71617 74092 77083 77827 82629 88121 90868 87959 84189 79384 72507 72649 72216 76540
13359 76540 83699 88634 93012 92935 93746 96829 108881 117802 124510 137637 152933 156136 163430 168847
13345 168847 182259 202083 211413 226489 228736 234476 239524 237714 234131 231865 227601 223232 219653
13332 219653 211277 202362 199931 191811 188085 176061 173410 163002 148204 140202 134834 128585 119580
13319 119580 114364 110227 103698 99407 90315 82459 80944 81615 85773 91650 96999 102347 100998 100620 96836
13304 96836 87680 78799 70014 52634 45923 37197 35850 38567 33778 36637 39776 43279 48765 59585
13290 59585 60147 59444 53403 62148 73370 78875 85533 90304 85055 84017 86096 87154 80823 74948 69347
13275 69347 68687 66709 67244 76373 92220 113178 129145 149834 175131 203341 225246 230127 230399
13262 230399 233697 226144 217074 211613 202159 190063 179544 168119 161092 153655 144206 138041 139230
13249 139230 137877 133446 134037 134953 136902 141574 143223 135260 130182 131502 131152 132372 141993 147551 151627
13234 151627 160629 177879 210885 240458 260519 284354 301616 314370 321655 316263 301838 282907
13222 282907 258790 247030 234225 221096 203377 189904 174223 161005 151634 143064 139529 135755
13210 135755 124949 131665 141593 145712 139482 133810 126222 122925 119008 117874 122718 132746 147805
13197 147805 169916 205117 259829 308030 339056 355193 360323 373333 388907 393525 379542 342471
13185 342471 289161 241079 208466 185612 177643 168900 161221 167468 175102 178229 181933 178719 178592
13172 178592 185783 184877 180633 181182 182902 188130 187729 182151 174534 175907 180473 187690 196035 206571 212661
13157 212661 206674 198539 189241 188083 193878 188476 185778 187641 189874 185976 184221 179074 169061 167771
13143 167771 171215 189179 223980 273757 328534 375649 422178 480771 535313 571618 590717 582970
13131 582970 555531 515154 484557 460578 438532 437589 439344 437068 440315 451009 462107 474726
13119 474726 479262 482948 487155 481105 479166 478089 477613 466185 450449 439437 432187 417856 407797
13106 407797 399584 395637 399577 402458 409152 418321 420058 420203 431128 436901 440708 452377 465331 481412
13092 481412 507664 523945 526384 520262 514247 503572 503922 505725 510709 528754 553060 566740 577820
13079 577820 588791 605088 622418 646271 670636 702497 735669 768552 797798 824193 843715
13068 843715 857386 882110 907803 935912 959099 992554 1027711 1057868 1083019 1104995 1122719
13057 1122719 1139381 1159841 1182427 1201904 1215599 1228975 1249450 1296231 1357953 1418589 1468688
13046 1468688 1520100 1590287 1682408 1788704 1899011 1994522 2082512 2171475 2257508 2346579 2447427
13035 2447427 2578737 2767509 3014373 3319581 3675191 4067695 4507447 4981877 5486619
13026 5486619 6011155 6601822 7302644 8178518 9291011 10733299 12668464 15342972 19047369
13017 19047369 24205596 31604295 42846012 60785067 88787578 127180663 169582445
13010 169582445 206806443 236498370 263605528 288686556 300336994 283556770 237875155
13003 237875155 181678854 134580242 102159606 80803136 66207427 55782593 48137564
12996 48137564 42409406 37981364 34434189 31474413 28912236 26645013 24640588 22904990
12988 22904990 21421784 20164174 19091353 18178582 17384675 16666464 15998771 15371862 14767027
12979 14767027 14177281 13602854 13056357 12543887 12068882 11656005 11302298 10995312 10707431
12970 10707431 10414533 10135911 9876364 9623109 9363222 9089198 8803174 8517386 8242033
12961 8242033 7981420 7724476 7456965 7184737 6925392 6689159 6476712 6275971 6086803
12952 6086803 5902396 5718035 5533473 5357071 5192954 5039961 4895612 4755232 4619513
12943 4619513 4489377 4369565 4255390 4146912 4050087 3956698 3862417 3767630 3676967 3584204
12933 3584204 3495697 3405723 3315454 3236978 3154986 3077801 2999658 2928205 2855999 2785256 2718329
12922 2718329 2657012 2595532 2537329 2481928 2426288 2371841 2311290 2249611 2177172 2110002 2056694
12911 2056694 2005556 1941232 1877915 1823830 1768624 1713344 1656092 1603907 1555637 1500527 1448495
12900 1448495 1394240 1348781 1314918 1285170 1262451 1240066 1204534 1172809 1151799 1129880 1106448
12889 1106448 1086860 1067854 1057005 1057158 1064245 1057352 1050657 1049547 1054573 1048641 1039505 1024517 1009388
12876 1009388 992109 970458 963991 942415 920817 903802 886874 868534 842481 821962 810403
12865 810403 795899 773563 754287 742798 727420 702490 672890 644448 611851 577642 550365
12854 550365 533512 510348 483496 464058 452042 442900 423924 404704 387486 369845 359995 354120
12842 354120 342772 331395 326450 322896 320897 317226 311321 308717 307500 310530 306049 311658 305245 293885
12828 293885 294057 286820 277247 267272 248875 227807 208798 201155 206059 205045 201440 202927 220110
12815 220110 237417 242888 243226 234809 228017 216747 201301 193283 189532 184675 183255 180388 174097 174816
12801 174816 179365 175334 170027 156292 137718 119850 108538 103002 95983 103077 113040 128171 137320
12788 137320 138328 152413 159786 156666 160424 158803 146260 134394 134544 136910 143111 152410 160540 168439
12774 168439 179866 192299 200546 204704 217524 229460 232786 229755 222163 202567 188435 184519 173313
12761 173313 165846 167713 169658 176780 171784 165440 164587 165966 159481 162680 158249 156728 145702 135313
12747 135313 135881 140174 153134 154209 147453 150973 152781 148343 147317 148070 148264 143005 140145 135731 127797
12732 127797 120006 118832 120145 120248 113448 113387 119066 125181 131482 133237 139146 149344 155670 158413 148760
12717 148760 142825 130365 125397 121224 113367 104115 100717 97543 89599 84682 82068 79994 76317 73505
12703 73505 63895 59694 70769 76177 80750 80101 73808 70917 59102 44565 43205 50493 50902 46837
12689 46837 43780 42900 37557 40890 49340 46162 41710 37162 35183 40450 53841 67587 70487 69260
12675 69260 66165 64326 61334 58581 50556 48089 50373 52245 56671 61071 59166 56453 50235 48717
12661 48717 57140 60958 60889 62586 59008 56191 59264 66914 62176 55725 62151 62314 64442 64343 65288 59413
12645 59413 54372 56444 60012 65861 66293 68370 65965 73368 79586 84183 87227 81959 81104 79787 72407
12630 72407 74367 78328 78199 82484 81428 79405 86380 91168 96155 94901 88731 91708 104289 116466
12616 116466 119202 117304 120060 121699 124380 126761 125492 118020 109863 101384 106675 109397 109097 112243
12602 112243 115543 112605 112106 116012 108833 109914 115412 114677 114732 116694 111818 106995 100137 96603 101867
12587 101867 106542 107729 112512 119471 124281 130284 135677 133748 125457 124238 121299 123725 127447 128934
12573 128934 133104 133057 133146 142015 151268 158470 177537 198766 218610 245067 283642 337993 422459
12560 422459 563788 756607 971687 1165291 1328775 1481234 1622109 1693734 1598971 1346307
12550 1346307 1048023 802995 640079 531885 458817 404420 364587 331557 299146 281193
12540 281193 269865 266657 263864 265865 261125 250380 244706 240134 226333 217859 211904 209184 209068 203466
12526 203466 197501 198404 204618 210994 220337 222785 217708 213390 215987 218011 214055 215545 216415 212632 213919
12511 213919 213656 212010 212202 216536 214351 212314 209782 206345 206587 209518 206594 209826 211678 215103 218162
12496 218162 217032 219668 214201 211157 215691 213652 210461 207318 208013 213738 219865 215254 203575 203740
12482 203740 205407 199494 195375 197158 203007 204283 214001 220324 212220 212075 217923 221108 221152 221546 216281
12467 216281 207113 209377 214676 212829 210440 204790 202697 206158 209365 214246 213887 207881 205213 213068
12453 213068 207351 204531 201305 202060 207578 200673 192783 185281 185250 185752 194381 195135 190619 188161 189601
12438 189601 192431 190376 195538 195994 189570 184054 187305 190843 192364 188995 186771 189286 186190 186807 185868
12423 185868 181986 182296 182454 171856 163807 161693 159408 158013 150135 147192 156244 155114 148006 148721 153160
12408 153160 152790 148322 149096 150474 152398 150533 149980 147287 139870 132243 135433 135529 135005 133738 137734 140822
12392 140822 138984 136334 130145 130302 131915 137613 134950 131823 133682 128339 119991 108696 107757 114260
12378 114260 111662 107872 98359 100272 104930 106638 104241 100053 97501 99891 104684 102265 102082 100055
12364 100055 105308 109919 108079 111678 111325 102280 94985 91658 88738 84243 81634 80185 70577 67557
12350 67557 71604 72925 72632 77276 79588 83046 88145 86755 85828 80430 68430 66934 70965 69536 67079
12335 67079 69367 67697 66643 65781 63537 65349 63263 54787 54203 59791 60106 63806 64334 69162 72611
12320 72611 72748 75972 77560 79445 74360 76711 71453 63569 63599 65447 61450 62012 63630 58464 59410 63244
12304 63244 52961 44794 45308 45063 44033 46226 47729 57080 52052 42492 35351 34016 40103 48547 53830
12289 53830 54986 52627 49997 45333 47260 50251 50554 41367 38260 40907 42531 39376 46453 44213 43487
12274 43487 41911 44706 38925 44350 47728 41156 35653 35564 32937 33987 37644 39358 35963 36406 37643
12259 37643 37964 32430 33668 34890 37389 36255 24942 26248 31532 28764 23395 26105 22923 24444
12245 24444 25355 22483 18804 20420 24378 31495 29718 26161 24243 20033 25740 27335 22729 20911 15887
12230 15887 18094 15772 15909 14963 8741 13021 18667 15459 16653 17549 13556 14883 13641 14768 21062
12215 21062 21583 22219 20286 21746 24820 24113 27515 30726 18794 18146 18122 22511 25346 23938 25224 22865
12199 22865 23433 24974 20050 16588 11602 11433 14555 20097 26436 26706 20047 19857 17357 19629 21133
12184 21133 19707 21588 18018 11778 14750 16196 21390 26033 27813 21581 16130 14551 17952 19972
12170 19972 20953 17969 12181 5312 6958 11278 10963 10125 14902 12725 12787 20074 29765 29893 28182 26408
12154 26408 30017 32944 33279 35190 32404 21769 14052 14876 17960 10811 6085 4807 6848 6553 10938
12139 10938 16820 15896 8410 9643 13139 9505 19058 26586 26728 26413 19769 20730 23397 17899 21998
12124 21998 23082 17163 17169 23774 23177 26083 23983 17042 16087 18982 16293 17542 13500 8309 9435 7779
12108 7779 6737 903 2026 5241 12123 12911 9691 13151 9032 12048 11455 7663 10999 6554 746
12093 746 4484 -3761 -8216 -7591 -2252 1662 -300 1058 10738 15901 15110 8624 6086 1401 -3973
12078 -3973 -5961 -7080 -3400 5152 4574 9412 11952 12366 11069 12381 8036 -2336 3481 6970 7537
12063 7537 2539 4024 806 2373 9180 7952 3503 -2281 -2098 5047 9905 10365 8050 6766 7186
12048 7186 12661 11944 10958 10312 3958 5954 3476 -23 639 -3658 -2047 5753 3801 4926 3525 -2917
12032 -2917 -2152 4500 8073 7973 574 -689 -2748 -5456 -4837 -3274 -1916 526 5016 9989 12022
12017 12022 9935 10189 11867 3720 -5206 -3989 1633 10999 11716 7283 8429 -844 -3291 1792 2247
12002 2247 2934 5376 9266 5286 1695 5167 13693 18063 15881 12313 12719 13724 10864 13698 13735 13765
11986 13765 11758 9409 5147 7347 6746 386 -3428 -8307 -6613 -568 1280 3260 -1969 -2192 2419
11971 2419 9231 6960 1433 -1835 775 2786 285 -2296 1024 6239 5686 1295 1227 6607 4176
11956 4176 5126 9806 9112 8913 8275 4891 -138 -7536 -5893 1195 6053 6293 6183 1981 -402 -1733
11940 -1733 -2881 -4734 -2808 508 -6518 -4402 -1992 -624 5171 11218 11903 12362 6393 5771 7792
11925 7792 3037 8697 8435 11133 11238 5671 3037 1823 2775 4171 5329 3145 565 2872 3562 5903
11909 5903 7808 7435 11304 9288 5481 5786 11901 10334 11931 9654 6953 3986 5632 4953 4473 -52
11893 -52 -5636 -2528 126 -2467 -3400 -8047 -6513 1953 5557 -792 -6363 -9930 -9608 -7204 -6147 -7464
11877 -7464 -7018 -5849 2436 6370 8331 -3866 -11526 -10176 273 3903 2041 2870 5721 5561 9552
11862 9552 8231 8817 5095 5579 6155 6808 3920 -1253 -6586 -8475 -8821 -10253 -11760 -7926 -4563 -6428
11846 -6428 -2622 4272 4283 1356 -4612 -494 -4358 -10947 -4942 -2954 -5477 -11267 -10920 -12330 -9450
11831 -9450 -5932 -1574 706 -657 -716 -6248 -2978 6510 6097 5389 5415 11049 10466 7774 12409 15379
11815 15379 12167 10807 8105 12657 13247 9185 9939 16150 18022 20526 13962 4148 -3503 -3779 2905
11800 2905 7214 10297 11628 14406 18285 10866 3137 835 2091 5121 5749 6020 1325 2152 7168
11785 7168 6119 1960 -3313 1063 3200 5137 4570 3260 2226 1652 1669 8052 5838 -204 -3035 2462
11769 2462 5854 4928 331 -4751 -3931 -849 -1496 2413 8531 11897 6290 7797 6690 -326 549 2853
11753 2853 4802 -30 -3943 -5874 -3454 -3369 -1957 -277 8556 11390 -2195 -4909 -963 -5542 -3573
11738 -3573 410 3539 -2015 -1517 2647 4795 5805 11267 22850 24720 32115 31774 21038 11767 9591
11723 9591 8674 9014 1779 -358 395 3558 9196 3529 7756 11564 9204 5074 4728 5109 2951 7655
11707 7655 8296 1887 -6022 -8916 -3317 484 335 2538 3085 1675 -925 -4551 -5129 -5491 -404 1672
11691 1672 8546 2775 -4005 -5037 -2901 1703 -4919 -10082 -12219 -12898 -10672 -3079 -284 4612 3884
11676 3884 -327 4631 2185 1198 801 -1416 -4489 -196 -69 2122 5784 9440 3563 685 8147
11661 8147 7044 8110 3870 -170 -2731 -3451 3268 10232 12066 15133 15909 10524 5751 6935 8585
11646 8585 12218 7892 -1168 -5345 -668 5008 3768 -2399 -1636 4804 4127 3767 5363 4375 1899 -412
11630 -412 -663 6568 4724 -3382 -2244 -2642 -1769 -4584 -7181 -3139 -3011 556 7024 21044 25787 29298
11614 29298 39524 40576 43625 41603 43881 48922 43603 39958 30946 21088 21327 20393 18889 17413 24712
11599 24712 28884 26540 23441 27148 27195 38815 43647 51385 55593 60738 71081 82266 93412 102543
11585 102543 105573 102025 88758 75212 67170 59854 46050 34838 33601 31673 29873 26234 24590
11572 24590 21862 22188 22782 13170 7905 3687 5366 4723 3078 4335 7869 10411 13350 21186 22107
11557 22107 22980 23830 13896 8119 12724 18522 21761 16183 19032 19339 12045 11116 6417 9178 12051
11542 12051 6773 2211 3707 2285 2200 -3197 -398 11390 6037 -367 2243 -1875 -4464 13 7122
11527 7122 7813 7552 6138 3160 8460 7769 10035 11632 2524 1569 6726 7852 8020 7518 7612 8734 5486
11510 5486 7614 9096 10400 15087 13910 9285 7579 8115 1823 -1793 -4311 -3801 1326 4395 -1225
11495 -1225 -5060 2564 9417 11828 5740 -2983 -3293 -3241 -18 1355 7610 14100 13885 11665 7813 2612
11479 2612 2662 7433 13588 14243 14353 14646 13459 8379 4872 4121 2581 9010 11041 11443 11951 9833 6036
11462 6036 6174 6684 7176 2971 8884 11543 9840 9806 12267 6509 4802 11190 15188 20938 18983 22329
11446 22329 31349 36989 40702 43927 55553 69021 79106 85424 89006 87551 80162 66069 55634
11433 55634 48293 40362 34439 28169 23644 22307 19126 19477 20542 17714 12456 5919 2750 -2046 -338
11418 -338 2050 7011 170 -4985 -3293 2288 2731 4978 2920 -279 2241 3238 4116 4998 8896 11290
11402 11290 11987 12067 10207 6808 218 -3213 -2696 3179 6391 4322 7574 6346 3322 3041 6660 5679
11386 5679 10700 17252 16333 14510 17391 21708 19685 21506 18460 3752 -3189 2910 11657 13440 9622
11371 9622 10344 12287 9058 4864 3682 6297 10277 5704 3628 6505 5918 3880 7524 8788 2080
11356 2080 1217 486 1856 -767 -4144 -6015 -7799 -11159 -6622 -2816 512 1843 3048 10161 15218
11341 15218 11390 7247 2057 3618 5473 8005 6858 6273 2663 4479 6741 10423 3762 7871 11134
11326 11134 10658 10686 10319 13153 25400 28357 26259 22103 12367 11087 14086 11493 14457 15125 12186
11311 12186 11441 17575 15613 11848 15626 24464 21628 19531 26263 36368 50578 52823 51487 49479
11297 49479 44809 40868 36398 31603 31291 35704 32321 37379 46192 45241 41086 41227 38184 33096 35006
11282 35006 36354 30386 27067 21649 21551 21043 22153 19070 12731 12051 5932 3944 4722 4961 3137 1633
11266 1633 2960 2187 3792 5470 2175 -1586 2324 2769 415 3023 -6164 -10617 -3558 -1096 3510
11251 3510 5868 2629 -2578 -2511 -321 14778 20027 19303 23062 17985 11111 6522 9731 14673 14832
11236 14832 15434 17651 15895 13555 11424 13069 9983 7122 2667 9265 13131 12491 10776 1348 3314
11221 3314 9080 10644 4120 3197 8880 6407 8717 10122 11126 11730 13373 10906 7739 11632 14717
11206 14717 9226 4710 3108 4773 5609 6599 724 3194 12404 10354 -626 2226 5791 5297 11687
11191 11687 10849 8153 16488 19061 20622 16101 7261 5018 11665 14517 12183 6830 5784 2431 4962
11176 4962 7223 14138 18235 21600 19335 24720 27907 25838 31195 46450 54716 60363 64243 61533
11162 61533 54156 46981 41177 34234 28274 19864 15589 16073 16459 23118 26351 24559 20283 15043 8165
11147 8165 4168 5330 9570 16427 16193 9443 10214 9950 10683 3562 3116 4518 10269 9634 6903 6621
11131 6621 14868 14333 12709 13876 7751 6977 15005 21390 16813 12702 12482 18192 13103 10276 6294
11116 6294 4889 9965 13703 17915 21944 22815 13301 10012 3789 1989 1043 400 -6460 -16062 -13669
11101 -13669 -5935 887 1483 709 5296 2272 1695 2488 8006 14487 14633 13283 11570 7068 4438 4208
11085 4208 2265 8009 11111 8053 -2638 -3922 2096 17284 19449 11494 5965 7338 9845 1971
11071 1971 -4542 -601 6168 14178 15439 8215 15202 19765 17265 14387 14714 10028 213 4126 6750
11056 6750 8898 5214 208 2624 6172 11234 7597 6844 3081 5614 4496 9917 12966 11658 10215
11041 10215 7347 4611 8752 11816 9405 3349 5043 11795 17551 19837 17781 21442 21705 12983 11271
11026 11271 18466 19373 16619 17713 12148 10858 10746 8428 8740 17734 18541 20973 25211 27314 27269 25626
11010 25626 22690 19977 15378 11296 14818 20480 17971 12421 12064 12166 13302 8491 9445 5285 3674
10995 3674 11621 19830 20222 19448 19583 14581 11490 14391 17004 21128 24240 20689 30306 30021 29148 26038
10979 26038 21559 10795 13114 14670 16252 23175 16566 14122 12582 16025 12892 15624 20760 16939
10965 16939 12009 14979 20812 29309 29275 18652 10199 7387 7270 11214 13037 14791 16968 17071 18540
10950 18540 18987 17629 15631 10787 10909 10849 11325 13277 14510 11620 3911 5561 14791 12280 9874 15310
10934 15310 20633 17473 14034 13041 11933 9872 8576 17919 23694 24472 26614 27747 29713 24491 21163
10919 21163 23507 30588 29592 28036 34071 33227 24762 16792 6843 6354 13067 13557 9656 13271 21169
10904 21169 26466 25839 23636 21855 21577 22564 18403 8878 12060 16581 21873 17826 16143 22818 26564
10889 26564 31101 28442 23631 20856 27171 28146 31607 29632 31676 32914 29167 33424 37650 40938 44097
10874 44097 41076 42506 37061 33828 36514 31624 30231 23209 24308 31155 34897 39521 40292 40835 38245
10859 38245 42126 46935 56362 62435 64067 68754 71350 73640 81109 97427 112971 124047 135695
10846 135695 150204 168633 175935 175453 172879 162759 160629 164525 168739 165757 140964 113922 96159
10833 96159 77989 73508 68637 65380 65109 60637 53608 51166 56254 58328 55319 58195 47790 45508
10819 45508 47078 48767 45675 43559 42068 47065 47037 40930 36561 39471 46095 51304 49142 46910 41670
10804 41670 38408 40014 41151 41535 50197 47152 45352 45688 41826 43526 48611 47409 38515 36717 31683
10789 31683 32675 36775 43785 40899 38914 42566 42396 43425 39890 38748 41028 44305 42963 40889 37999
10774 37999 30801 31627 31391 33574 40549 43780 44661 49273 51612 43073 40452 40819 34876 30716 34289
10759 34289 31320 23931 26024 32082 31532 37979 39157 38208 41920 41658 44121 52460 57554 43782 38297
10744 38297 36910 38798 38345 40971 44163 41375 36081 40264 48032 46894 49859 52050 54958 55442 58437
10729 58437 60044 52939 48189 47597 49732 53415 59295 48586 37483 41622 51879 51107 49250 53084
10715 53084 54825 52719 51996 49202 52733 56746 57578 50535 53457 55702 60839 68048 71065 70074 72947
10700 72947 77316 71121 64967 65102 57058 52999 56483 60249 58097 55766 50372 54961 61500 69015 70160
10685 70160 64391 64823 58255 55283 56917 56390 54021 56423 63120 66707 67787 72724 67636 69697 67941
10670 67941 65526 61134 54734 50057 47378 38360 35339 33253 44907 57734 61969 63500 58477 58385
10656 58385 54149 54783 56296 47474 40382 40225 39058 39754 42520 42667 46981 50875 45077 45054 52592 53839
10640 53839 56787 55017 56672 64279 68559 66082 61744 63552 68535 76399 74412 74980 82366 88152 92991
10625 92991 99718 111473 120659 127136 135229 148920 177209 213091 268257 354791 479679 624990
10613 624990 777556 953855 1149657 1335935 1462151 1487978 1419389 1318599 1193563 1017593
10603 1017593 809947 627575 492822 402354 339747 304470 276510 244463 219303 199675 187397
10592 187397 182888 181432 175502 168119 172424 176874 180492 173310 164943 160968 159370 147054 137234 129718
10578 129718 126272 120514 120908 120400 117888 110557 104039 102835 102524 102163 96180 93836 94163 102338 102372 102916
10562 102916 109707 115925 113938 102767 95635 99460 103804 106600 106725 119590 120887 125561 125669 117233
10548 117233 109523 97834 93364 97341 103462 109067 105829 96995 86743 73392 69632 82310 89359
10535 89359 87108 90644 94171 95569 98486 98835 98186 97087 94816 93725 89463 85213 85968 83448 79851
10520 79851 79920 80140 81215 80306 74666 76352 78189 76520 72410 72538 74632 72004 71861 73270 74215 71097
10504 71097 66798 63103 53035 46210 45972 42962 36363 26004 23937 23200 22529 25207 28969 33198 37892
10489 37892 42098 51090 61047 65815 72142 80444 84812 81751 85288 81418 74290 70375 77825 75400
10475 75400 70272 71702 71335 79896 84412 92041 103775 118996 134961 147003 159041 172277 184891
10462 184891 195906 198758 193553 192813 183461 169912 158255 152476 151377 149194 147059 143282 142177 138879
10448 138879 139678 138595 130739 133176 132115 132525 134360 130827 130666 139594 142558 142530 151067 149227 145119
10433 145119 145647 148072 144492 146922 150833 154443 154250 157728 161142 167992 169725 168979 176907 183000 190937
10418 190937 181666 170390 167051 161624 160504 153738 148215 146036 151658 154496 152681 156892 153876 154785
10404 154785 151524 158598 161493 165451 177087 191498 209893 234363 266360 300772 330704 346006
10392 346006 359406 366998 362088 354244 340157 321327 298186 282781 268496 259203 249208 230117
10380 230117 220862 218432 219704 222705 217059 212752 213309 213871 207622 205457 201155 204624 209445 213381 221435
10365 221435 222248 221536 222817 228538 238622 233599 233436 233998 235645 239112 239378 240340 243108 238870 236023
10350 236023 231708 228371 228794 224982 220204 227169 234951 240644 253029 274894 301726 339208 388463
10337 388463 440274 493006 537559 579833 616450 639317 654064 661836 662394 652089 645091 653926
10325 653926 670855 686415 700612 723664 759446 810224 885054 985202 1131224 1342086 1620373
10314 1620373 1963975 2389408 2896326 3451979 3984649 4465574 4910892 5259757 5451445
10305 5451445 5442776 5280890 4997972 4655245 4196506 3682849 3163984 2721690 2340596 2020026
10295 2020026 1745102 1540239 1400128 1308363 1250462 1210333 1177495 1151961 1127286 1099326 1072931
10284 1072931 1051338 1038337 1036439 1037048 1036109 1035228 1035947 1037998 1046474 1054134 1063831 1073830 1079292 1087672
10270 1087672 1103380 1119047 1135861 1146150 1157865 1171363 1186561 1212645 1235858 1260582 1293388
10259 1293388 1332620 1371352 1399611 1425576 1452836 1471315 1486126 1503803 1529504 1560904 1594028
10248 1594028 1638024 1700815 1772688 1854523 1954697 2058637 2172058 2299400 2432895 2567680
10238 2567680 2691636 2815775 2939745 3101342 3316338 3597010 3944611 4355488 4845232
10229 4845232 5409768 6034723 6647778 7212234 7775789 8430368 9214910 10130787 11263684
10220 11263684 12796372 14897793 17722839 21596917 27237694 35972940 49754437 70139117
10212 70139117 96140232 124422008 153591136 185610633 219498128 247115680 258841949
10205 258841949 253538079 239100005 221298383 196466596 162224046 125738278 96189076
10198 96189076 75784961 62180975 52798724 46017870 40915924 36907985 33631316 30871278
10190 30871278 28504040 26453529 24688430 23221483 22032512 21061128 20206913 19448266
10182 19448266 18807179 18238272 17639660 16988162 16366031 15810347 15223644 14489151 13641807
10173 13641807 12847458 12189797 11663149 11232107 10861928 10525858 10202120 9889966 9585092
10164 9585092 9290865 9007028 8730755 8446413 8159718 7883546 7614815 7352799 7100282
10155 7100282 6855567 6634184 6426222 6218461 6026126 5841824 5659392 5469807 5297954
10146 5297954 5135949 4975637 4830076 4693945 4562287 4434184 4322220 4211516 4099275
10137 4099275 3993842 3894925 3799589 3707437 3618614 3532653 3446950 3360377 3273035 3189402 3119304
10126 3119304 3041617 2960147 2888294 2812525 2744253 2680492 2615689 2557684 2493088 2431808 2371053
10115 2371053 2305889 2241599 2184902 2122741 2061960 2004698 1942285 1886707 1832253 1772034 1723018
10104 1723018 1672531 1614896 1558073 1498559 1438697 1389701 1352537 1322844 1292007 1256148 1225588
10093 1225588 1203665 1181413 1161119 1133792 1108215 1086368 1073989 1059368 1053104 1049967 1048966 1044639
10081 1044639 1041302 1029439 1015118 1012819 1010639 995252 973151 954230 940205 925664 908698 893799
10069 893799 872319 852233 834636 814617 796573 773573 758599 747524 727633 714233 695203
10058 695203 670854 644428 608064 574110 549485 537484 522165 500099 483981 478119 461586 442068
10046 442068 423141 409938 402761 400941 399908 394941 391727 393487 388745 386743 388431 402939 424762
10033 424762 458740 507938 588319 729682 1005757 1467779 1968172 2263075 2435029 2754930
10023 2754930 3110729 3342463 2869556 1978188 1387940 1064573 876495 740957 644758 581868
10013 581868 547523 518972 488731 458587 430390 404225 374637 347630 337993 334693 324519 317311
10001 317311 297254 276892 267016 257058 245602 234585 219180 202107 188553 175682 177652 179467
9989 179467 183974 186966 191538 194776 195000 192242 180425 177545 178766 178083 169638 169438 170359 168115 156011
9974 156011 151100 148226 149392 149687 147066 144458 149224 146447 147482 152239 153665 153644 150991 154579 152946
9959 152946 146103 145863 145970 145916 149926 145549 149330 150280 144144 139015 136532 138760 137065 130961 130614 139037
9943 139037 151140 149730 143566 136709 131598 127341 121598 117943 115248 116499 116650 113751 107144 101980
9929 101980 92757 99051 102515 102632 97432 97240 105889 110340 112624 118656 120299 114882 117728 124603 121250
9914 121250 112321 107092 98298 88892 91447 86905 73997 69949 60631 59475 62816 65187 61153 55962
9900 55962 53232 45654 37402 37897 43889 42035 34649 28529 21704 19096 25122 24996 13279 12814 15420
9885 15420 14199 14590 17011 15285 7419 4777 7010 13272 19606 26981 24649 17466 7885 6099 1350
9870 1350 1786 2977 4299 7616 9458 6923 6288 -768 -2783 4195 10316 4767 6036 8124 10382
9855 10382 13287 14658 14514 19862 21826 18617 15521 12436 12312 16826 17817 8877 2161 7195 10240
9840 10240 13726 10286 12748 19836 24610 17685 17430 22641 26588 27148 28031 30928 24627 21017 19273
9825 19273 28639 36551 40991 37041 44787 52443 54805 53936 52035 55850 63841 67392 71433 76522 89757
9810 89757 105835 136801 172046 217365 281138 379041 511416 662912 821155 998518 1194968
9799 1194968 1367261 1446438 1430899 1354199 1253102 1113235 914232 701656 534683 423702
9789 423702 348373 291913 252812 225147 204110 185562 172317 159042 154105 145354 133211 125495
9777 125495 125951 121280 115623 108725 95620 89546 88967 85638 82389 79635 73300 74438 81929 82900 78878
9762 78878 75682 67999 50861 45168 49045 54582 43083 33747 33906 33505 37572 40214 43213 45547 49108
9747 49108 54879 52825 48029 36367 21755 19860 20342 17735 13706 10875 12304 10115 11373 15068
9733 15068 17404 14562 10384 5766 7354 1748 -5381 -8253 -12061 -18651 -14662 -13422 -9614 -6897 -8422
9718 -8422 -4559 -2559 -3080 1920 4929 5441 -1039 -5047 -305 -1343 -1647 -2508 -1211 283 315 -2037
9702 -2037 -10181 -8296 98 1352 -4409 -12945 -12270 -4379 -2649 -7511 -8463 601 11688 11291 6019
9687 6019 2411 -71 5725 6024 -761 -49 528 -390 -1738 -7194 -6455 -9127 -10873 -10577 -11170 -18458 -22806
9670 -22806 -19299 -11341 -5255 -3795 -4785 -3554 -648 -358 -2405 -4683 -7812 -16143 -7647 -2200 -6236
9655 -6236 -4218 -2495 -987 2506 4777 4314 -3500 -2848 -541 -1366 -3696 -7552 -7185 -6649 -3096 4467
9639 4467 4188 -4325 -3533 -593 205 -3220 -14167 -22802 -17308 -12405 -13213 -14657 -10377 167 3207
9624 3207 4396 6052 9690 6686 6407 8930 7480 -2576 -4258 -10468 -17175 -13184 -11188 -15412 -17885
9609 -17885 -8283 1499 -8155 -12050 -6395 -2425 145 -231 -2615 -6864 -11789 -6601 -5440 -204 -3170
9594 -3170 -2064 -24 -7055 -13139 -14705 -17180 -19791 -14687 -10066 -5562 -5171 -10455 -12757 -19620 -20589
9579 -20589 -12683 -7910 -4111 -1727 -2211 -2060 -2286 -11173 -20049 -15200 -10522 -11850 -9851 -11600 -13864
9564 -13864 -13915 -9504 -11300 -9241 -6710 -6258 -14410 -17796 -13575 -7500 -5903 -9899 -12626 -3959 -4042 -4938
9548 -4938 -5619 -13109 -13269 -15677 -18363 -13006 -16027 -19546 -18831 -12525 -8086 -5622 -11905 -21625 -18150 -18998
9532 -18998 -15807 -14396 -11604 -11843 -8560 -4903 -3630 -6581 -4477 -10615 -10190 -2135 3645 5761 7126
9517 7126 4119 -2 -4912 -2839 -1799 1852 4273 -1477 -6971 -9017 -2307 -4375 -7187 -5282 -9532
9502 -9532 -11717 -8605 -4807 -4334 -7239 -6351 -7794 -6301 -8654 -10774 -12308 -8052 -5622 -3461 3381
9487 3381 3379 -4988 -12368 -11911 -8879 1319 1951 3479 4506 2383 4873 7738 11340 10946 12355 7150
9471 7150 -4888 -4410 -9001 -15292 -9671 -10585 -15457 -15560 -13475 -8316 -9189 -4152 -8877 -17051 -19264 -9748
9455 -9748 -4922 -5283 -8272 -9765 -9632 -10937 -18049 -22577 -13944 -5249 -4222 -9126 -7720 -6984 -6973 -7035 -12769
9438 -12769 -14714 -22118 -20790 -9226 -1948 -8413 -6672 -5851 -6856 -1914 -2295 2497 -115 -3007 -10268
9423 -10268 -10578 -9858 -10802 -12461 -16154 -10924 -7845 -16858 -21262 -23856 -14054 -2601 407 -4185 -8510
9408 -8510 -11935 -15506 -24010 -24000 -26068 -22604 -21924 -22771 -17414 -12311 -8610 -14548 -14364 -15436 -13799 -18162
9392 -18162 -23108 -21766 -19854 -15485 -13877 -10129 -12043 -11934 -6420 -5977 -6132 -8934 -7822 -8736 -9448 -12200
9376 -12200 -13333 -9974 -2885 -3985 -5394 -8561 -9654 -16434 -17411 -13186 -9859 -10028 -11448 -12290 -4152
9361 -4152 -1929 -5992 -3138 2182 1767 3646 3722 -5756 -6606 -4338 -6254 -7832 -4606 -8196 -14029 -10643
9345 -10643 -5608 -5520 -2154 -912 -8222 -11877 -13492 -7584 913 5952 9943 8856 5573 3994 6547
9330 6547 1490 -2974 -8573 -6862 -6733 -9533 -10450 -7989 -2435 3378 3271 3708 940 -1644 -3247 108
9314 108 -515 1358 824 -1476 -8107 -17478 -14513 -7499 -3079 1040 988 2161 -4890 -6585 -2577 -5232
9298 -5232 -1906 -4441 -4326 -4836 -1726 -224 -4096 -5139 -8141 -10391 -10663 -10454 -4731 3022 -3795 -8003
9282 -8003 -6501 -1383 2918 85 -3723 3348 2914 4952 2171 -2648 1621 1135 -2138 -1895 -2633 -6347
9266 -6347 -3573 -2423 -3983 -2744 -3140 -7366 -15339 -21523 -15783 -15601 -24681 -24862 -25866 -19328 -12748 -12152
9250 -12152 -11997 -3316 9109 11707 8764 5755 9876 13604 8718 4569 4385 -4964 -9525 -4012 5363
9235 5363 280 -6779 -10398 -11185 -11692 -6232 -5131 -6494 -6001 362 2005 3181 -404 -2490 -4913 -5436
9219 -5436 -1645 -3084 -6699 -10357 -7006 -3065 329 1212 -4885 -6844 -10995 -3993 3211 5279 -2064
9204 -2064 -2026 -5685 -9372 -8431 -16167 -13547 -7127 -4111 -4149 -2627 550 839 -137 -1900 -11183 -18463 -19797
9187 -19797 -15248 -7176 -1070 -2071 -981 -235 -5725 -6883 -9777 -5061 330 -2543 -1764 -3787 -4764
9172 -4764 -278 -1066 -1873 1054 -6109 -5375 -9021 -9706 -16623 -13645 -12516 -3057 3754 2682 -785 -8651
9156 -8651 -11921 -10284 -4842 -1056 1420 249 -4432 -3053 -4392 -17 3846 3935 3352 4278 3717 -155
9140 -155 -1409 -11974 -13899 -4539 2333 -3875 -4692 -7600 -7818 650 -1513 -1596 -2097 1089 940 -4411
9124 -4411 -7376 -1384 1462 -479 -2354 8775 12470 3356 842 -1456 -7238 -3950 -75 -1095 -6309
9109 -6309 -7094 -790 -161 -2557 -2227 743 8007 11570 8459 4172 2301 -2113 -6382 -11338 -13456 -4570
9093 -4570 2341 -211 2106 3627 5570 14143 14906 13887 12651 11751 14951 17696 10757 4861 -2979
9078 -2979 -1 1603 -4227 1140 7513 13571 19654 14910 11209 8091 4852 2970 5277 3345 3747
9063 3747 4634 5405 7048 9570 15744 18833 13399 15497 19898 17865 9070 7283 6422 7818 11483 17274
9047 17274 16653 14111 4090 4815 2474 12013 14701 17692 18858 20493 12931 11395 12272 14222 8757
9032 8757 5669 6202 3364 4460 9350 5546 6409 9154 7631 9401 6809 12076 7071 -3170 -2975
9017 -2975 148 -3976 -7031 -1172 4276 3883 9895 17754 14654 15170 14184 7552 11417 12227 9165 10102
9001 10102 12342 15416 10456 9933 14438 10839 6381 2078 -4988 -1583 374 2188 6373 11424 10613
8986 10613 5182 6402 15160 15495 8839 10796 15499 16145 14449 12782 15138 14020 14658 15735 24220
8971 24220 15698 8187 7576 6092 12357 10676 6702 2932 3064 1772 7522 12761 10410 10897 16532
8956 16532 15435 10401 7420 2362 2181 34 4361 12208 10589 7898 7106 7532 10020 15110 16780
8941 16780 20783 20271 15715 10688 8004 3295 -1269 3737 10978 15007 7563 630 6442 5042 3019
8926 3019 204 3909 4611 2945 4311 -143 2385 3715 2730 3309 9254 14318 19260 17427 17405 13941
8910 13941 12123 2631 1536 10452 21708 15496 8027 6525 4784 6338 6323 6270 12154 13661 10160
8895 10160 1521 9081 8935 326 -6872 -2082 2917 10317 14975 11788 9970 2621 6188 13005 21359
8880 21359 21804 11988 9044 5275 6650 6233 3040 11524 20116 27717 25378 16761 12366 10569 7236
8865 7236 9428 11393 17012 19396 17845 15254 7313 6132 9992 12216 11586 15173 20870 24163 26074
8850 26074 28973 24402 25059 26071 26691 26454 33254 43558 50734 46331 54133 62695 66610 71510 67685
8835 67685 53943 43310 45468 43978 39740 31458 30708 32617 33255 36059 38798 38261 41443 46726 44294
8820 44294 43346 44817 44357 42794 40663 34414 27969 21634 25130 36424 33794 29187 29168 31629 27046
8805 27046 25332 27671 29798 31252 32790 31085 34461 43097 57145 72197 84371 87585 89571 100432
8791 100432 101729 85308 68685 56765 46386 39787 37824 29606 23942 24057 29645 34073 41607 49718
8777 49718 57203 51789 48797 47849 37038 33897 30379 29617 22947 16695 19484 27894 26734 23391 18147
8762 18147 20861 23765 24341 19942 16328 23264 21455 18474 29332 35073 41259 46468 42884 45151 54020
8747 54020 58752 55873 48349 40727 35512 29833 27657 15429 15919 18529 20649 26976 27584 25452 19703
8732 19703 19206 23778 26679 24198 14717 10327 3239 9811 8824 5540 5291 7614 9840 14000 18918
8717 18918 14570 6961 9377 12977 15859 14540 12112 18641 17794 15814 9856 8619 4365 11000 17639
8702 17639 15887 11678 14020 12660 12539 14154 19507 15535 7295 4720 -512 -1945 -2542 -8467 -5139
8687 -5139 -962 125 4938 16442 17583 15287 19566 14658 10202 13421 16376 10967 10305 9643 9822
8672 9822 13202 15133 11016 8329 5984 9452 11705 9013 7280 7702 7685 9045 22019 23083 16992
8657 16992 11461 5591 6267 13034 11595 9904 12148 11517 7424 99 6104 12668 8018 18164 19199
8642 19199 14917 13738 15553 13918 12640 14689 18071 25389 26287 23297 19538 14836 11069 12914 14433
8627 14433 15850 13700 14128 21010 19732 16570 12150 19111 23324 26918 27176 28313 28797 27074 30258
8612 30258 28913 29985 30691 27952 29895 35633 39454 35933 31074 27558 32996 32173 29418 28978 28767 31465
8596 31465 34501 35259 36109 39042 44304 47020 43877 42104 45532 48730 53124 50582 57373 64140 72450
8581 72450 72887 73267 75093 82402 91232 99273 110979 131101 145578 153169 158229 169548 181610 187359
8567 187359 188809 183595 172478 159148 148449 137154 120961 108660 95191 90941 85802 82853 72647
8554 72647 66875 62675 58105 57401 49457 44642 44416 41451 43765 41106 38128 31897 30763 31174 33320
8539 33320 32771 31243 31568 26499 26298 34476 33938 27686 18985 20403 21204 27381 30202 24509 26427 27176
8523 27176 27293 25604 18823 12351 12155 18005 24168 24384 23148 24392 19162 14178 15891 16362 18619 25183
8507 25183 28605 28302 23230 22119 23635 24777 21576 19370 23508 17708 13817 10154 8799 3302 -2145
8492 -2145 -7038 -6100 -8092 -2298 9895 12102 12694 11991 11554 9147 17953 14424 3777 2968 3224 -352
8476 -352 -1861 -922 1433 -2976 -4206 1760 3477 -2021 -8148 -5917 -3070 -3276 796 4810 10451 6273
8460 6273 -3237 -4009 -5894 -3319 -4036 -2141 479 1687 3816 -3810 -1511 2995 -2841 1898 6393
8445 6393 9648 6921 6461 9165 9035 11975 13353 15590 21484 26155 30483 30975 32742 33564 37843 37172
8429 37172 33181 36811 47646 63883 81607 96447 103548 110815 118625 115935 107751 80597 53714
8416 53714 42375 33315 19389 14414 16532 17491 20360 24120 24379 22964 23057 24662 25620 18064 16856
8401 16856 13826 6076 4598 3969 8615 13933 16116 11893 4362 6806 9665 12312 18398 16226 9291
8386 9291 12438 12414 5599 4064 7095 5854 6434 13434 16109 8293 2539 -5642 -11219 -8013 -6353 -8041
8370 -8041 -99 11391 11208 3589 6400 11429 12457 11018 423 -9106 -7232 -4355 3029 1790 5236
8355 5236 4141 -7995 -12328 -5574 -5176 -3655 -680 933 2618 2419 3869 3158 3306 3666 806 1432
8339 1432 -2113 -5000 -4567 -5828 2252 4939 62 15 1703 1631 -3998 -3353 -3479 -856 -1459 -8827 -8905
8322 -8905 -1683 2160 9343 12207 9602 12230 12887 13692 14943 15049 11465 10040 7724 6356 7239 2934
8306 2934 -4547 -5729 -1012 1982 528 -1926 -2116 -3404 98 4834 9307 9669 15404 16315 13045 7365
8290 7365 4647 2630 -1530 -7153 -10597 -7860 4365 3175 5408 4754 -1434 -4495 483 4397 6240
8275 6240 4008 2357 -4181 -10638 -5926 1860 4308 8368 2887 -2850 -6602 -894 -751 240 3911
8260 3911 3335 3164 1175 -5021 -113 3684 714 -1161 -337 -910 4201 4325 -1683 -5564 -4545 588
8244 588 4910 6668 2681 -1384 -3613 -1021 -104 2761 -3932 -7630 -12825 -7010 -4724 -4435 -7348 -6732
8228 -6732 -3285 -4171 -6288 -4009 -3346 -976 -1607 -11092 -11005 -12331 -5755 -994 -6773 -10841 -6155 225
8212 225 -1371 -3198 -3518 -7950 -9710 -11513 -12820 -11325 -10707 -4659 -2138 -7539 -6394 -1636 -2795 -7305
8196 -7305 -7885 -9642 -2313 243 -4901 -7043 -5915 -4170 -3871 -5268 -1342 2688 -1267 -2579 3535
8181 3535 9613 7533 6592 6921 4182 3428 2869 -2249 -23 900 -5664 -8415 -7353 -5365 -5072 696
8165 696 6883 5085 2654 7224 2855 2237 4447 8512 9698 6340 3321 6090 9750 5605 3574
8150 3574 5340 -2982 -2872 3135 7533 14471 16839 9547 11906 9912 5483 5877 6969 5905 10438
8135 10438 13293 15123 10858 15882 11286 6105 3568 -1724 1075 -697 4986 15781 9319 -667
8121 -667 -2054 -4831 -4783 -2081 -5587 -6535 3993 5756 -423 -2138 -33 1515 -3908 -5179 -8510 -7804
8105 -7804 -3869 892 4438 3829 -3117 -1713 1257 3834 2372 42 3224 5749 2453 5109 4170
8090 4170 10535 14696 6860 6775 4167 -3282 -3384 -3552 3248 5674 5529 2959 6777 -1185 -5811 -127
8074 -127 6028 11578 2977 -3547 -672 -1274 -3409 3034 6739 7493 1390 3875 5336 6067 3041 -330
8058 -330 -2757 1856 4328 282 -4230 49 6511 6480 870 4253 5498 -774 -2417 -1376 5240 9312
8042 9312 15946 19745 19382 18587 18449 20123 18642 15997 17382 21120 16382 11753 7341 11198 4857 -1001
8026 -1001 3894 10172 6102 3008 6496 7571 13700 16658 17941 15303 20907 21045 11759 10593 12768
8011 12768 15499 16588 18344 17937 8121 6990 12418 15665 16822 16610 13172 10304 14789 16028 13040
7996 13040 14950 18216 21838 24556 31041 28099 24986 21002 12804 13734 17561 20058 23870 25034 23201
7981 23201 16258 16893 19297 23938 27039 33969 31470 23670 19652 17590 24224 21873 17966 12435 11272
7966 11272 9373 13439 18426 14777 11567 7627 3607 8085 20212 23808 19596 19892 15081 15239 17497
7951 17497 19468 14615 8775 10938 15247 11171 1091 -3001 6974 13114 13282 17425 19107 12459 2142
7936 2142 5634 14983 20469 26618 25806 19457 18391 24493 20234 12521 15293 18363 17469 14505 12897
7921 12897 8556 3061 2497 2054 5498 11466 6279 7042 10937 11468 13109 16581 16059 12146 -374 -218
7905 -218 9765 9657 14496 18005 23181 21081 16781 12656 8941 14925 16959 13032 13233 17654 18835 14683
7889 14683 15430 17762 16827 17186 21751 19938 19646 11322 7863 10118 11651 5034 1846 5131 10763 15441
7873 15441 18538 20633 19178 14280 10021 7775 8061 14628 14216 13844 10830 8187 15370 20170 15999
7858 15999 15423 18573 12513 4127 2579 5414 14554 12654 11402 7648 3041 1409 2439 1262 1790
7843 1790 -1645 -5592 -912 -1169 -4919 -702 5863 13998 13886 4556 -7634 -8149 -5729 -498 8680
7828 8680 6421 1649 5711 2652 -3716 -3271 -4593 -7469 -5492 -4838 -1431 1921 -4052 -3758 50 -3138
7812 -3138 865 9198 9505 40 -3855 -5595 238 1930 6951 8113 1372 2196 3721 3335 1428 910
7796 910 -2048 -4921 -10644 -11692 -9450 -8274 -9319 -8729 -7183 1657 4168 -2502 -10541 -13786 -15282
7781 -15282 -10834 -9686 -7423 -3176 -1532 -3297 1055 7587 4761 92 -4093 923 422 -3822 -16730
7766 -16730 -17338 -13723 -13541 -8188 1513 7993 13948 17084 19642 15795 4995 -2020 -1931 1449 8574
7751 8574 11921 10827 6133 1616 8864 3916 2657 -1976 -10948 -13020 -7963 -6069 -328 419 402 2730
7735 2730 3074 3633 2627 5366 1795 -7833 -12551 -4824 1117 126 766 -1820 -3654 -2120 -5067 -4866
7719 -4866 -2542 -4507 -15867 -20393 -13188 -9063 -4487 328 -1207 68 -831 -5989 -7725 -5352 -1324
7704 -1324 -1259 -731 -7785 -13791 -12631 -13098 -8066 -2047 1496 9414 6534 3412 8473 15798 13930 5009
7688 5009 -5986 -8778 -8040 -7981 -1239 413 -2438 -5632 -11516 -14950 -7117 -7463 -4897 -1531 -3578 -2275
7672 -2275 -6065 -8136 -5145 -11868 -10900 -7076 3546 10245 5500 -4389 -7421 -8046 -5939 -7352 -14585
7657 -14585 -12467 -6510 -7741 -9292 -12746 -14751 -14480 -15861 -13729 -11181 -7568 -2914 -1678 -315 -743
7642 -743 -5891 -7851 -6637 -4519 -2598 -6089 -6854 -3526 -7088 -4040 401 -10818 -16703 -9835 -5018
7627 -5018 -2429 2815 -655 -12102 -13995 -12379 -6925 -3682 -8086 -9300 -5244 -1080 530 -2718 2054
7612 2054 4860 6018 8034 5890 -1582 -5102 -12846 -17559 -14681 -11705 -12795 -8051 -4848 -6486 -7773
7597 -7773 -12190 -9072 -3779 -3143 -2616 -10340 -14985 -15573 -14631 -5564 -1436 -3906 -6090 -9665 -14867 -16718
7581 -16718 -9394 -3385 -7225 -10605 -6169 -3944 -7030 -2487 -3283 -6548 -5867 -8730 -15803 -14460 -12189
7566 -12189 -10463 -13754 -5457 -2678 -9704 -11344 -8828 -10387 56 2911 -10426 -16380 -15282 -14616
7552 -14616 -12995 -4539 -5477 -9154 -2417 835 2736 -4280 -8256 -7991 1429 6386 3659 1891 4881
7537 4881 6773 7295 2358 -1900 -6759 -6747 -9009 -8381 -9763 -10936 -12214 -10243 -5502 -1215 1955 1466
7521 1466 1055 -3913 -9919 -17078 -18940 -9801 -7896 -12176 -15277 -13802 -14978 -16535 -13676 -15883 -17123
7506 -17123 -9556 -2170 -3355 -6958 -1877 -4372 -12834 -13271 -6266 -11422 -9482 -8036 -7866 -13391 -9486
7491 -9486 -6236 -10451 -10906 -11713 -12620 -14462 -14296 -11267 -6897 450 -4650 -10456 -5287 -1729 -2348 -1219
7475 -1219 -1086 -3775 -10527 -16879 -13742 -7595 1528 -1621 -4893 -7459 -9299 -5505 413 -3567 -5129
7460 -5129 -8328 -12760 -12546 -3644 23 -2198 -10540 -8952 -4202 -3901 -5832 -9668 -5857 -4269 -4310 -4174
7444 -4174 746 -694 -2715 -2837 -8565 -9193 -8581 1148 5549 -1046 -10306 -4864 -4919 -7527 -7433 -1339 -5382
7427 -5382 -7393 -2488 824 2924 -3080 -7977 -8135 -6512 -9368 -6541 -8166 -5780 2031 4295 1590
7412 1590 1392 3181 9668 8501 9636 10817 10472 8872 6354 4655 2644 -1667 -5939 -5236 -4364 -2561
7396 -2561 -1508 -1554 -10142 -12283 -2315 -2211 -10584 -11795 -7040 -8808 -12250 -8417 -6694 -3889 -2780 -9341
7380 -9341 -8363 -9732 -12439 -6267 -3128 -2031 -839 -4564 -2402 -4508 -10351 -10849 -11136 -11517 -6953 -482
7364 -482 2569 4622 1471 -1736 -2707 -4288 -7776 -7852 -3653 1614 -2168 -7785 -10609 -10176 -1032 3878
7348 3878 5174 6603 4713 -3870 -6259 -5886 -5185 -8995 -16037 -12897 -6834 -11352 -7601 -1791 -2295 -4991
7332 -4991 -6195 -4899 -1454 -4645 -12251 -12138 -13182 -7390 -2499 5977 6007 6503 1554 -1533 -1038 -5055
7316 -5055 -1561 5178 1701 1679 5204 -269 -5034 -8652 -10613 -13173 -12356 -9837 -12917 -13058 -10719 -8451
7300 -8451 -2690 229 2241 -1255 -6005 -6762 -2009 3746 420 -6240 -4971 -4287 -10733 -9697 3985
7285 3985 2309 -5771 -9113 -11522 -8959 -4409 919 -286 -368 -5530 -6371 -2096 2680 5121 2352 -871
7269 -871 3021 2810 -3396 -9935 -9770 -10175 -10700 -7139 854 8139 11703 2413 310 1265 7388 2647
7253 2647 -3754 -6303 -10082 -8461 -4312 1519 9216 3948 -8186 -14811 -8190 -8863 -12994 -10679 -8100
7238 -8100 -4725 -4074 -11989 -13270 -14698 -16494 -18842 -13049 -12832 -11464 -16612 -14341 -14295 -14948 -7572 1563
7222 1563 -3579 -7802 -13310 -14008 -12263 -12003 -16464 -11890 -9262 -9072 -9348 -7143 -9136 -16426 -10916 -9082
7206 -9082 -11181 -10821 -8648 -11772 -10568 -3659 -6022 -4679 -6749 -5044 -5495 -424 4649 3888 -460 3966
7190 3966 -608 -7094 -3840 -3070 -6694 -12484 -13632 -10799 -13566 -7873 1932 9535 11285 8811 6108
7175 6108 -1591 -5677 -11317 -5651 -6364 -8717 -11921 -15128 -18689 -22882 -13400 -10719 -10983 -7327 5594
7160 5594 5100 3265 4890 11042 5398 966 -985 437 5465 2168 -2212 -6138 -4981 -6183 -4108
7145 -4108 -3418 -804 5381 4428 3363 232 -2955 -5103 510 762 -1056 -5949 -5211 -5097 -5804 -4324
7129 -4324 -5105 -8939 -5775 -3596 -9669 -9933 -3588 -4155 -7955 -13160 -7306 -4566 -3490 -2202 169 2457
7113 2457 5339 9137 7904 4064 2756 2762 3080 1636 -6571 -6632 -8249 -5668 -1150 -999 -2732 651 674
7096 674 -149 -4722 -5567 -5206 -7834 -8435 -836 -889 -7071 -10288 -11197 -9808 -14462 -12907 -8490 -4829 -516
7079 -516 -3952 -5987 -4294 -2974 -12710 -17113 -13804 -16419 -11096 -11474 -12105 -8341 -8829 -12011 -15251 -11923
7063 -11923 -7777 -987 1162 -5460 -4901 -5059 -2020 -1218 -10815 -15932 -12858 -10524 -9265 989 6479
7048 6479 10099 6790 -4720 -3868 1105 669 -1688 -4544 -5018 -6807 -6555 -5961 -3469 -521 -1580 1701
7032 1701 1630 4361 3702 368 -6060 -10350 -10292 -4266 2582 6562 -498 -9673 -17663 -12972 -11394 -6729
7016 -6729 -3479 -6968 -8957 -9298 -8149 -3697 -8705 -13947 -14581 -13924 -6302 943 5553 6387 4042 905
7000 905 -4569 -5293 756 1950 3658 6912 6577 -3111 -5516 -5050 -1591 56 -2613 1695 2135 10383
6984 10383 8904 748 -3436 -7897 -4217 -4149 -10713 -13703 -7366 -842 -4702 -11150 -20625 -20475 -14037
6969 -14037 -7309 -4197 -5988 -8743 -8597 -11066 -16837 -17186 -12949 -16862 -13011 -7641 -3434 -10324 -10816
6954 -10816 -12896 -5473 -5237 -8609 -5154 -1925 -523 5168 4992 -665 -1610 -9457 -13394 -11986 -9047
6939 -9047 -4543 -3441 -5240 -6663 -1601 3642 1327 -2809 -7201 -6850 -1013 -434 2569 4830 7588
6924 7588 5336 -1776 -1721 -3097 -2485 3069 2704 -1823 -3300 -2031 -3833 -57 -420 -835 10905 10914 7220
6907 7220 10009 5005 -2553 -3190 -676 -3147 -4934 -1702 3752 3270 -1682 2044 1110 123 1579 -4990
6891 -4990 -5138 500 -2096 2305 11454 14918 8317 2064 -3609 -3051 -2948 -6488 -9891 -12659 -11721 -6560
6875 -6560 -6758 -5320 -5337 -5344 -4833 -5350 -7100 -11120 -13567 -12143 -8164 -1312 -3801 -6217 -7039 -2982 -2805
6858 -2805 -306 -890 1139 -2636 289 5361 1346 -1934 -774 -1351 -5011 -9091 -6446 -8024 -9880
6843 -9880 -12384 -8647 3496 10324 15127 10198 5460 4977 1921 1473 -3958 -5113 -4703 -4368 -3293 -1868
6827 -1868 1453 6810 5169 2534 6234 4676 38 231 -7282 -6119 1038 2812 3210 -3321 -6071
6812 -6071 -8424 -8350 -10126 -2780 3019 5390 5606 5345 10297 17154 14950 13644 12743 10197 8771 10798
6796 10798 18122 13055 4124 1893 -4018 -6238 179 2022 2457 324 2908 761 -7998 -10432 -3989
6781 -3989 747 -2039 2877 5724 194 555 -7262 -10070 -1615 3567 159 3708 2809 584 4002
6766 4002 4098 4861 2018 -6541 -13688 -11777 -8217 -1310 9301 12130 13293 13609 10389 13551 13049 14387
6750 14387 9462 10692 10742 10197 14787 13816 12095 9688 4478 5573 5674 7905 8686 14418 20067 34925
6734 34925 36309 43335 52835 49672 41945 32166 23883 14794 23077 35161 34365 39312 40172 36845 35354
6719 35354 35618 30389 31688 34530 37895 41997 46603 54809 61991 61542 65046 76879 88021 98472
6705 98472 106402 114067 117020 115876 104590 79547 55125 42220 31305 23301 19143 15984 20567
6692 20567 21594 20144 17217 14216 10175 14006 14745 16879 19917 21308 13632 5729 1760 5302 7897
6677 7897 6377 2405 -1531 -3224 1210 -1720 -2126 -1721 -4124 131 5697 7777 9503 -896 -2764
6662 -2764 2614 6506 7439 5781 2082 3234 928 5732 977 -3754 -1769 -426 -9575 -7944 623
6647 623 7860 8096 2187 6480 8152 4801 -2438 -3378 3944 4438 -3690 -8985 -15174 -5273 -1672 -88
6631 -88 -5283 -789 3348 1197 782 407 3086 1349 -20 -2226 -2536 2040 639 -645 2302 -547
6615 -547 -6777 29 607 -5723 -1093 2506 784 1156 -4726 -1111 -2621 -6578 -5896 -1222 4665 6895
6599 6895 3825 3067 1235 1927 2842 1821 123 -155 -399 -5 1810 -4028 -6215 -8235 -7954 -14149 -8005
6582 -8005 -1505 653 -1606 -9999 -14480 -15789 -14703 -7440 -1912 -4322 1960 4804 6580 1305 -5452
6567 -5452 -5928 -10622 -6484 -6855 -2763 898 4422 5508 -2781 -5862 -6167 -9066 -9784 -8539 -3400 -3752
6551 -3752 -7433 -6099 -1013 5486 5756 2549 2130 -1897 3230 5436 14536 11600 3993 2999 4651 5743
6535 5743 4383 3968 1080 -449 4837 14771 10346 3756 28 -4056 -4030 -4815 -8943 -8905 -8166 -9424 -7089
6518 -7089 -4662 -10903 -8336 -1786 556 -924 -3524 -1390 -2371 -5233 -1570 3427 -809 -1434 -4701
6503 -4701 -7256 -3092 -3330 -6378 -11383 377 -752 -1443 -14236 -18018 -14242 -9857 -6674 -6924 -8819
6488 -8819 -11699 -15815 -10148 -2520 843 439 4024 6943 -1415 -2650 968 -4857 -2334 -7535 -7667
6473 -7667 -4843 5243 6480 4262 2964 -1165 2426 4793 4940 -38 -2808 -6492 -11582 -3544 -255
6458 -255 4807 7795 6208 -2595 -7178 -10186 -10570 -10688 -13706 -13087 -13946 -15584 -12652 -10079 -4397 -2209
6442 -2209 198 -2768 -6344 -3053 -1834 -9457 -1263 -800 -7560 -5277 -2914 -4266 -6792 -610 942
6427 942 -1490 394 3287 3648 -1509 -5472 -6530 -7318 -9015 -8568 -1383 5610 2304 -860 1593 2318
6411 2318 8423 649 -8389 -9476 -10606 -7503 -5146 -5371 -3253 3787 3606 -1251 -2996 -5632 -4238
6396 -4238 2124 5410 2354 -2251 -12108 -15529 -11744 -8194 -7777 -12514 -15156 -7920 -1331 -5332 -18035
6381 -18035 -24236 -12590 -10476 -9182 -2085 334 -3655 -4854 -3129 -3886 -4973 -7708 -3946 -4907 -7868
6366 -7868 -10496 -7634 -10362 -12056 -9857 -8003 -1779 5859 4162 -2442 -4609 -3830 -2880 -6831 -8099
6351 -8099 -2179 -181 -724 -2417 -6634 -2023 340 -1547 -2239 5089 3607 1573 -85 -198 4604 3178
6335 3178 -6011 -3019 3258 8285 1910 -4545 -3809 2769 9829 5495 6447 4254 1930 2574 3093 4554
6319 4554 9662 7368 2331 337 4548 6952 4093 4281 5119 770 -4417 -8003 -5612 -2915 -5154
6304 -5154 -6154 1104 -1407 -2232 -1550 672 -5384 -10154 -8389 -5696 -6517 -12866 -10736 -957 -202 -5995
6288 -5995 -11254 -9826 -15130 -18913 -17544 -18152 -19905 -14907 -8122 -2259 2855 2784 -980 -324 -4569 -2892
6272 -2892 1752 2550 -6681 -10670 -10232 -9337 -15275 -12560 -6288 -7561 -5040 495 5416 3267 -4833 -6075
6256 -6075 -10734 -12607 -1194 1760 -2233 -787 -1227 48 2546 4143 7796 5143 4430 1627 -1513
6241 -1513 1010 3707 8129 8038 987 -7579 -12185 -8930 -2285 4613 4277 5990 3857 1141 4090 1543
6225 1543 1217 627 2181 -2224 3557 4703 -793 -2501 -1013 -9373 -15290 -5938 1039 -1143 -998 -4353
6209 -4353 -12530 -12197 -10318 -13673 -12923 -13306 -15925 -11234 -14135 -10518 -2331 -6682 -5565 -8289 -9698 -5736
6193 -5736 -1000 1349 -3545 -8767 -1127 2415 1647 -5436 -7291 -10255 -18220 -21433 -13718 -6009 -6659
6178 -6659 -5440 -641 -4954 -5398 -7973 -9869 -9672 -11824 -12653 -8292 -7852 -11181 -18058 -19280 -12233 -7421
6162 -7421 -312 2594 3675 7283 2195 -3673 -2168 4049 4343 -2301 1192 4762 -384 -4950 -8900
6147 -8900 -3370 -56 3246 4815 2061 836 -13 -6635 -9262 -7277 -10691 -12670 -10071 -14541 -11517
6132 -11517 -1266 1858 -1060 -6298 -11035 -16222 -10242 -1854 -2563 -2662 -1025 8145 10090 7933 3638
6117 3638 2108 3656 1646 3178 79 573 -2638 -4529 -382 -5953 -6126 -9802 -5648 -6040 -6463 -2260
6101 -2260 -6560 -9103 -10413 -6541 -4931 -1743 8094 9142 3385 -2492 -917 -217 -3603 -1992 1592
6086 1592 5385 3338 -2541 -6482 -2448 -4357 -6987 -5179 -4735 -13030 -13185 -7003 -7209 -8923 -6293 -5423
6070 -5423 -5186 -1199 5550 3288 -1550 4591 6559 6975 782 3003 1207 -1761 -6769 -4868 -4589 -1270
6054 -1270 6783 7101 1465 -1082 -1106 -5930 -12453 -6070 -2110 1082 -3974 76 -717 5513 -168 -6155
6038 -6155 -8849 -12149 -16283 -11850 -2157 2476 6639 2343 -859 2436 3574 79 2791 5928 12626
6023 12626 7090 -4941 -11597 -4281 -1251 5007 835 -4152 6822 12127 7802 5855 5610 8009
6009 8009 7921 5606 5993 5263 4878 1610 551 2070 -2838 -7797 -11990 -9357 -4716 -4211 1422 4446
5993 4446 -981 -1389 236 -384 2655 8788 6136 7126 448 -175 857 2913 7069 3215 6605 9710
5977 9710 1108 -4749 -174 4187 -432 -4688 -150 7273 7875 5366 1907 -1850 -5428 -2744 -2280
5962 -2280 -4649 -9497 -15074 -9768 -1696 1622 4869 5365 85 -6933 -5572 -6756 794 3802 1166
5947 1166 -4291 -5534 -3974 -5691 -8036 -11107 -8781 -7358 -8947 -14836 -19019 -11760 -6701 -6518 -7540
5932 -7540 -4991 3121 6782 2751 2558 3685 6818 10332 10456 10011 8874 6545 4191 567 -3189 -11631
5916 -11631 -10694 -7356 -2910 -2931 -6406 -7787 -7104 -1493 1264 620 1388 -279 2264 4392 -2278 -5893
5900 -5893 -536 -4185 -5788 -3118 -5077 -10939 -15956 -10769 -3196 -1713 -2149 -5337 -8858 -8488 -14962
5885 -14962 -18317 -16138 -11957 -6205 -5266 -2954 -7510 -16631 -17674 -20640 -13848 -7313 -3875 -4834 -12437
5870 -12437 -9900 -6516 -3292 -8470 -7015 537 -355 -6141 -5645 -6965 -5091 -4211 -7647 -11671 -11205 -4605
5854 -4605 -3155 -4136 -6219 1310 1264 6094 7778 17 182 7172 9437 8260 3532 -1981 -2720 -7215
5838 -7215 -6722 -4582 -7550 -6532 -5566 -6669 -11900 -13453 -10034 -7409 -3572 -855 2433 -15 -5181
5823 -5181 -7229 -8759 -5576 -1821 -4836 -8519 -14306 -16625 -11599 -6847 -3276 -6620 -6671 -3910 897
5808 897 3214 -282 -4988 -2514 104 4372 1992 -7070 -7320 -4210 -2834 -4163 -5871 -11807 -14745
5793 -14745 -7480 5501 8784 6359 2354 3280 3441 2906 3271 937 -10210 -11525 -13590 -15585 -10915
5778 -10915 -8787 -9851 -13603 -16763 -15455 -7910 -9713 -4122 -185 -1494 1351 -1541 4578 557 -10149
5763 -10149 -13748 -8554 -6793 -5913 142 3072 -7474 -15155 -13597 -5568 -3858 -11774 -10999 -5266 -3406
5748 -3406 6160 15526 4561 -4103 -8092 -9453 -5872 -2418 6 -2685 -5129 -9909 -6422 -2679 -3566
5733 -3566 -4770 -4717 855 8858 12024 16562 17145 10295 14166 12044 -523 -3174 -3911 -1552 -91 -6050
5717 -6050 -7712 -1239 -4890 -8989 -12816 -19055 -9266 4125 8318 2179 467 -2676 -4705 -1658 -4123
5702 -4123 -4982 -5715 -636 -123 -488 3749 -505 524 908 -5947 -6693 -2392 -700 6811 6121 5543 4569
5685 4569 552 -4094 -7472 -14803 -18738 -12092 2277 -2930 -1675 -1487 -1021 1571 -1046 -5515 -7755
5670 -7755 -7092 -5559 -1606 1356 -654 -1558 3854 7284 -1209 -7668 -8209 -8207 -7246 -11303 -9136 -7325 2976
5653 2976 11898 14968 9571 -4423 -10662 -8941 -15029 -17274 -14296 -5331 -1049 1411 6719 4394 -679
5638 -679 -7783 -12376 -14638 -15527 -13781 -6705 -4581 -1877 1742 -1859 964 8492 7467 4116 4871 6657
5622 6657 -5220 -12121 -12999 -1532 8277 9649 4640 3203 2620 525 -8483 -8614 -9018 -7672 -6231
5607 -6231 -7158 -1173 -5781 -13715 -5752 -542 3933 11650 6501 3426 -71 -3457 -4540 -4944 -8898
5592 -8898 -11613 -11621 -11147 -9367 -10645 -12897 -11489 -10670 -8518 -5654 -7994 -10913 -10340 -5855 -6387 -6201 -6524
5575 -6524 -4635 -2847 867 5158 569 1741 -2782 -49 5140 8672 7677 4631 3448 2304 -5717
5560 -5717 -9460 -4143 -8420 -10077 -4935 -5158 -4352 -9544 -17192 -8662 -652 5264 1647 -4 -1664
5545 -1664 -1697 -4757 -6957 -5046 -2601 -1242 -3325 -1961 -194 1518 -739 6510 13847 10489 4159
5530 4159 -6184 -12900 -13080 -9215 -970 3688 -2091 -6945 -6772 -8293 -8632 -4017 -1122 -7885 -5086
5515 -5086 -5620 -6021 -8930 -7767 -840 2352 -1057 -6036 -6386 -7195 -4491 5584 5749 -5281 -6896 4093
5499 4093 2558 -5752 -6027 -12736 -6083 -4033 -1366 7799 9284 4091 4626 1203 165 -2000 3729
5484 3729 10020 5718 3128 3597 1496 -8960 -15319 -15309 -6745 -10394 -10595 -3075 2106 393 -7210 -9991
5468 -9991 -5553 -9878 -11452 -6443 -11489 -16012 -12394 -6823 -1319 -2409 -4071 -2755 -6672 -12708 -7094
5453 -7094 908 -3457 -6724 -5583 -1220 4548 5526 9022 3648 3352 7533 1336 -3640 -11170 -18473
5438 -18473 -18078 -11853 -734 6040 2910 76 6145 8344 8627 -4501 -11632 -5850 2975 8113 6507
5423 6507 1070 -8998 -9044 -5542 1914 4484 -1354 -4220 -7287 -8967 -5134 -3259 -4471 -8462 -7645
5408 -7645 -4536 -2749 -6960 -5553 -6126 -5467 -5075 -3663 -1455 -5456 -6995 -7176 -3725 -6999 -8852 -7428
5392 -7428 -4269 -293 26 -10693 -17027 -15285 -9752 -3257 4258 5671 687 -2725 -8021 -7486 -7799
5377 -7799 -6429 -4827 -5135 -6095 -5149 -5929 -10081 -7967 -6587 -2447 3975 2602 1726 6969 6589 2355
5361 2355 1000 -592 -4579 -5218 -4590 35 644 -920 -4654 -484 5518 5620 1551 -7395 -9566 -11785
5345 -11785 -14751 -20829 -19556 -20406 -17980 -8498 -4716 -4816 1260 9676 13484 2234 -7525 -5485 -783
5330 -783 4890 6276 8461 10586 5430 448 -6993 -8111 1038 2975 309 4595 6526 9345 7455
5315 7455 -695 -1422 -3604 -1397 2675 2471 995 -4935 -7803 -1017 -688 -6320 -1949 -2291 -2698 2149
5299 2149 4951 8268 5979 3154 2262 5164 2568 -4301 -14171 -15977 -12465 -15453 -17825 -16579 -12934
5284 -12934 -7859 -3367 -2369 5700 3365 -1083 -1590 -5370 -7951 -12136 -10686 -10343 -6547 -8217 -11928
5269 -11928 -14921 -10249 -4809 -1938 1025 5653 5182 4436 268 -2576 2464 -587 -3747 -2000 6050
5254 6050 944 -1735 -5056 -10095 -9062 -5977 -10469 -9577 -7245 -9999 -8037 -4960 7500 10189 1849
5239 1849 -2852 -4427 -831 -1235 1253 8638 1657 -1413 1379 3689 2648 2590 -4644 -14407 -15345 -5589
5223 -5589 -1886 -9165 -12285 -12056 -14346 -13384 -6595 -4056 -9566 -13476 -10674 -9778 -8188 -8418 -6656 -3173
5207 -3173 -4468 3138 7460 5482 2828 -5248 2672 2747 -1967 -2477 1293 2903 4478 770 -2769 -278
5191 -278 -5675 -9723 -8907 -3788 2445 4109 7208 9774 8751 1744 -4683 -8733 -7966 -1447 2891 4461
5175 4461 -605 -3107 -5143 -3979 -2525 2709 4869 4833 89 -4378 -7593 -5138 -5147 -1079 -699 -6753
5159 -6753 -16605 -11188 -3178 -3667 -9688 -13913 -10919 -11013 -8833 -11672 -14388 -6550 -8910 -10870 -6454 1448
5143 1448 2787 1338 -2233 -2959 -3066 -2948 6835 6828 -847 -469 -11990 -9952 -5651 -5370 -1476 2525 -960
5126 -960 -3645 -5412 -8547 -4778 3528 -802 -5524 -4870 -3333 -4711 -3241 -2277 -6644 -1756 1012 4936
5110 4936 5609 10225 8356 694 -3039 -5007 -8581 -4650 -7386 -9595 -7555 -9094 -5910 -5864 -3366 3505
5094 3505 1346 348 -2256 1048 -2814 -5039 -1756 3471 8326 5096 -9199 -7180 -5565 -214 1947
5079 1947 1180 4018 4592 4294 9630 18026 18090 9635 1878 1011 2143 2629 4299 3345 1578 -1168 467
5062 467 -154 1531 4772 4668 5097 8246 4321 -2670 -6175 -11224 -5771 -58 568 -2457 -1859 1613
5046 1613 -2941 -8518 -7341 1770 -3958 -7510 -3635 -5491 -7369 -8190 -407 -979 -2341 2460 -2669
5031 -2669 -8565 -9338 -4520 -5361 -2242 -2565 -1920 945 -4390 -1538 -1966 1543 -2340 629 -100 1259
5015 1259 552 6399 6614 1447 933 1846 375 -3597 -7564 -513 7540 7198 5228 2746 456 -2481
4999 -2481 -3847 -9242 -11314 -13744 -12774 -6739 544 4998 6029 2958 -2251 -4553 -6290 -2216 777
4984 777 1754 -8026 -11324 -7403 -3409 -3944 -1072 -432 -2702 -5066 -11954 -8917 -6303 -7607 -12015 -9888
4968 -9888 -920 -1669 -3235 1019 3154 -2226 -1603 2652 1482 -5405 -8413 -47 949 -6812 -5150 -682
4952 -682 -2754 -837 -1746 -3057 -9854 -4219 3314 5330 2560 312 -701 7236 11457 4053 1430
4937 1430 -2832 -3451 1474 1902 -1856 -4164 -2869 5382 3849 4009 1695 -2660 2679 -277 -6853 -5558
4921 -5558 -3942 2845 7625 1936 2966 7643 11503 8176 5169 1257 -1923 1312 5561 10141 6496
4906 6496 6525 9966 16345 17045 12840 930 -8881 -14282 -16265 -9482 -605 2065 3249 -471 1689
4891 1689 -1026 434 2636 9338 4363 -7581 -8299 -3490 5287 5431 3364 -1418 -5967 -9748 -12147
4876 -12147 -9651 -6244 -3605 -3100 -1750 4380 520 4786 916 -6834 -10897 -7412 -3073 1188 7637
4861 7637 7072 5467 6477 3887 3822 -476 -9632 -13794 -19241 -15214 -8077 -3015 -1073 -2845 -4381 -5361
4845 -5361 -5230 -9239 -7199 3452 6639 3100 -1655 -1392 -4559 -6732 -3246 -5017 -6495 -12518 -8000
4830 -8000 3920 663 -9131 -8301 -6329 -13564 -14714 -10700 -10241 -9575 -7020 -6607 -3988 2392 8686 5175
4814 5175 -6519 -13579 -11730 -10325 -7427 -8985 -7285 -3524 -695 297 -5757 -7994 -963 -497 1655
4799 1655 -661 -2187 -639 3254 -571 1245 3477 5836 5137 5703 -332 -5380 -1755 712 5206
4784 5206 9409 1592 -466 -1579 -3593 -7435 -11585 -6778 -1288 4123 7384 10814 9228 8570 8577 3900
4768 3900 968 -2953 -4820 -6900 -10696 -8559 -11641 -10582 -9038 -16265 -18371 -16670 -13839 -10250 -15945
4753 -15945 -15873 -5218 830 3985 6187 -1196 2305 3847 -1316 -9794 -10816 -3600 1289 5302 8083
4738 8083 5297 3577 -8894 -8507 302 2014 1689 -4934 -9765 -2644 485 -4753 -12346 -8945 -4961
4723 -4961 -1324 -6972 -6005 -663 -249 -2979 -1942 -1313 -3870 -801 6731 3599 2250 4595 1905 -4036
4707 -4036 -8186 -9387 -14479 -12980 -17332 -23508 -16660 -9111 -7240 -8481 -13384 -12576 -658 7065 3438
4692 3438 3275 4636 3854 -2293 -3133 7664 8385 7672 -2022 -6065 -1968 725 -7189 -8958 -2618 1716
4676 1716 1103 4905 8474 4706 -1043 -3804 -5402 -4655 -4661 -8317 -12301 -10437 -3374 -231 -5051 -6364
4660 -6364 -6523 -4836 -5150 -368 1 -3181 -7057 -3409 -4918 -11631 -12797 -12669 -5556 -1700 -4373 -6106
4644 -6106 -9360 -9770 -11856 -10476 -12664 -12264 -16706 -11750 -9889 -7805 -5622 -2761 3379 -3219 -2139
4629 -2139 2628 1955 3654 5053 3748 4345 2176 1156 7442 9043 7611 7928 3077 -1400 3735 90
4613 90 -2393 -3223 -393 4400 -1477 -10535 -11642 -10500 -3832 -3457 -9391 -9286 -8263 -8188 -8953 -6104 -3685
4596 -3685 -2323 -1516 4250 5253 6566 2538 118 4314 2475 4618 11586 8593 -2006 -4404 -1782
4581 -1782 -707 -104 -7352 -7965 -6797 -2792 6066 11375 3416 2691 2832 -1385 -7261 -6091 -3893 6788
4565 6788 2995 521 696 5479 3182 -4508 -3687 -628 -138 -4590 -3562 -2033 3040 990 -4188 -5036
4549 -5036 -4321 -678 -2893 -12492 -11732 -6211 -8896 -3021 5300 382 1477 5004 2236 3522 4307 -153
4533 -153 -4696 -3866 -905 8 2083 2455 1639 9546 7533 5394 3717 1262 3821 4201 -5702 -5959 -273
4516 -273 -4513 -3907 -5252 -2430 1574 7849 6474 6281 6623 5785 2636 7360 11507 7856 596 961
4500 961 -4977 -9805 -3105 2149 8295 8645 -2354 -6339 -9825 -9688 -5118 -5470 -14710 -16600 -12426 -2506
4484 -2506 859 -1045 -5052 -5458 1792 4142 7999 10404 8819 1535 -1161 -8682 -18515 -19301 -11269
4469 -11269 -5356 -6816 -3011 6716 7132 2669 2106 1651 989 746 547 2085 5089 6537 643 -4151
4453 -4151 3162 5931 5654 1388 2984 3552 8809 13304 13987 11417 8494 15118 14132 8678 -337 -10173
4437 -10173 -9790 -2437 -1451 -9361 -7998 -9020 -5270 -6546 371 -570 -2156 9076 6503 3080 -2991
4422 -2991 -3201 -5373 -6843 -4566 80 7561 11687 8561 3681 10344 11146 8026 738 -6588 -5564
4407 -5564 981 -1696 -6396 -2787 -2806 -4073 -5548 -780 -3380 1411 8858 11163 6675 -1415 -6456
4392 -6456 -7462 -5558 145 3678 1593 1268 -8684 -11239 -17318 -13529 -6718 -9626 -8114 1496 3042
4377 3042 4403 7463 6049 3950 4181 8967 7123 1240 5011 8617 4510 5806 9457 8744 2076
4362 2076 -3818 -11777 -11065 -7657 -7810 -4712 -4757 -8022 -6850 -228 -6857 -12335 -12969 508 3707 -3588
4346 -3588 -8427 -5961 -2696 -549 4103 5005 1619 -1736 -2375 -7484 -5018 4744 6940 3553 324
4331 324 274 -1263 4902 5534 1068 3250 6941 5584 8157 5072 -576 -3184 -2871 -2754 -3477 -6354 -5136
4314 -5136 -661 -859 -2337 -4143 -2822 -7708 -5700 -7471 -17011 -9808 -4902 -12412 -10700 -7006 -3648
4299 -3648 -762 2252 432 -1265 -5570 -6739 -11412 -8352 -2784 89 -960 -8645 -19444 -19683 -14064
4284 -14064 -8719 -11366 -9432 1433 -1125 -11094 -14465 -10546 -6278 -2799 -2203 -7566 -7551 -4666 -2244
4269 -2244 -884 634 -2887 2274 5547 4248 1061 5460 1396 -3975 -3309 -69 2455 4845 -2687
4254 -2687 -7860 -7641 -5786 -7907 -7105 -3751 1625 3005 -2217 -14149 -18589 -14018 -6867 -5713 2823
4239 2823 11741 12949 -212 -2136 2639 4897 -4090 -5435 -3212 -2144 -6575 -8818 -7413 -2022 1668
4224 1668 1998 4168 6919 -1639 80 8299 8980 6035 1777 -1708 -3647 -3217 -97 -1077 -4814 1056
4208 1056 4282 2591 7763 -755 -7446 -9802 -6312 -10850 -8458 -10993 -7554 -2002 -3117 -8177 -9056
4193 -9056 -5780 -1529 -3574 -4293 -2431 -974 -1246 -7080 -3696 -5894 -7489 -5176 -4176 -6915 -5199
4178 -5199 1882 2608 3279 10896 3022 -3664 -471 835 -3917 -7438 1470 6660 8708 4938 1582
4163 1582 -1980 -2806 -1370 2801 1247 -535 -3036 -5565 -1882 3801 8628 9646 12045 15307 15840
4148 15840 16833 9811 10912 14044 9720 4938 -1759 -5343 -7842 -2814 -2966 -8623 -1949 4377 4221
4133 4221 3730 5745 2941 3521 4207 -171 -3309 2087 9298 9981 10617 9443 3523 5649 15540 18790
4117 18790 13571 3917 -1409 -1073 182 7844 7358 9234 11929 7238 5172 2956 2696 2663 -4710 -9206
4101 -9206 -10704 -13483 -12005 -9604 -4278 1085 1072 4418 5486 1125 -244 2721 3981 3073 2983 5820
4085 5820 7261 1256 -6349 -12404 -14287 -6020 -7586 -11746 -8393 -8357 -9600 -4849 -4551 -3130 1774 10
4069 10 954 2913 209 -2307 448 -10 -2462 -5183 -1187 -4694 -3958 -3873 -4648 -4146 147 -707 -10394
4052 -10394 -12713 221 5102 -525 1127 3696 5340 -1114 -6443 -7423 -294 1791 159 4540 12885
4037 12885 11095 6758 -4081 -481 1520 -1212 -9017 -4597 3241 3133 -2625 -2308 3185 7637 2480
4022 2480 773 8683 10047 1433 -11944 -7000 2805 1017 -247 6736 1469 637 2364 8559 8903
4007 8903 6153 5413 4422 4145 -711 -317 -2440 -1422 4139 9421 9765 7819 8871 5797 4573 7174
3991 7174 2587 2404 4098 1575 -3664 -10105 -9657 -11063 -11011 -9696 -961 1135 -4124 -7966 -3652 -1497
3975 -1497 -6880 -9637 -11755 -13835 -10101 -5942 -1213 517 -583 3948 1608 -4702 -10063 -9012 -4872
3960 -4872 1087 2803 -9751 -17858 -16183 -11818 -4491 -5360 -5988 4779 9500 5167 3084 -928 -3696
3945 -3696 -2700 -1473 -6091 -13189 -11919 -6667 -5489 -9117 -4988 -2065 -190 6408 3577 3633 -2090 35
3929 35 704 -2741 -3860 -7295 -7535 -6551 -7166 -7686 -8785 -7677 -7583 -6545 -7970 -558 -71 -2499 2035
3912 2035 9387 8467 3958 4630 3024 -950 -2258 -12757 -14543 -4208 7930 8631 5792 5034 9853
3897 9853 10858 -554 -730 808 -5217 -6084 716 1699 -7301 -4879 -4267 -6798 918 612 319 2619
3881 2619 -1022 -5158 -4970 2352 7648 10084 5870 2918 -8203 -15699 -7075 -3155 -1136 4658 5241
3866 5241 1724 -6589 -10944 -5370 -4155 -9951 -8787 -6461 -11137 -8331 -4523 1076 3786 6355 2924
3851 2924 4398 7942 5160 -6650 -5686 -6448 -5426 1171 4809 3074 1679 7851 952 -8994 -6461
3836 -6461 -6289 -3532 -1561 -2310 -10624 -11116 -8967 -5186 -4016 -6882 -7136 -5752 -3235 -5880 -7756 -10567
3820 -10567 -9296 -14264 -13787 -7503 -6292 -6964 -6794 -2466 -5670 -7798 -2679 -954 -325 -404 -239 -7103
3804 -7103 -11758 -10084 -9727 -3743 1005 -3558 -2665 -4842 -3581 -4490 -8928 -7479 -6154 -3538 -3050 -1400
3788 -1400 2046 -2591 -1891 1380 5717 4634 2076 4923 4554 -140 2484 5563 -2751 -11103 -4927
3773 -4927 -1291 1289 -1899 -3496 -6723 -8224 -8170 -1491 6926 3146 -422 -625 -4474 -9685 -6805 -7071
3757 -7071 -6927 -5045 -3682 -5078 -10684 -14787 -3117 -4946 -8555 -5904 -489 4298 8747 7066 2833
3742 2833 -977 -4983 -7318 -8002 -8561 -4976 -4523 -6386 -4905 -2686 -2169 -6096 -9109 -5617 -4749 3107
3726 3107 2688 -957 -5982 -7073 -4249 -2953 -2898 -586 -1249 -1119 1462 -1483 -4475 -1767 5925 203
3710 203 -8034 -1236 1698 -2107 -5924 -8840 -5971 950 -8005 -6799 -4901 -11124 -6664 -3850 -1427
3695 -1427 -8367 -7080 -6386 -9388 -3483 1299 -5501 -4184 -3198 1280 -4022 -7612 -11955 -6659 14
3680 14 875 774 -590 2119 5258 9531 8358 7993 8716 11437 14744 15220 11264 6902 9189 8332 11456
3663 11456 14613 12204 6190 -1592 -8633 -8719 -4103 2738 -1381 -8595 -20025 -18283 -5423 256 -1964
3648 -1964 -5715 -1950 857 -1292 1675 6589 6337 6616 5448 3781 1169 -4014 -7079 -14488 -12672
3633 -12672 -8481 -2751 -1489 3380 4691 2323 4494 3996 9037 10657 15248 8214 -3641 -3136 3537
3618 3537 1553 4531 8525 11390 10953 9601 8928 4317 -942 65 1035 3292 5875 2108 -2975 -282
3602 -282 -3018 -8905 -7365 -2352 -1577 -2909 1907 7806 10011 4224 2632 2922 4697 4176 730 -1297
3586 -1297 -1405 -3329 307 -4116 -9298 -2962 -343 4229 7017 5792 5578 4068 9597 10588 5934 5690
3570 5690 7308 5214 5153 3196 3911 10475 8361 3918 -5271 -10898 -8339 -3250 4470 4722 3504 3020
3554 3020 -4466 -11542 -1648 7901 12640 6425 -3925 -2246 3788 7683 6311 4122 4671 5499 7854
3539 7854 7845 512 -188 754 4487 4802 2943 -1199 -508 -714 -5900 -3080 -1771 1306 5594 8862 15892
3522 15892 12963 2343 -9670 -6977 46 5661 8278 4288 4977 6086 8952 -1156 -4681 -4094
3508 -4094 -6213 -6495 -2746 -1325 -4151 -3771 -4319 -8598 -11094 -11480 -6700 -5493 -2060 -1606 -8542 -5269
3492 -5269 1276 9916 12185 15032 11330 7124 -787 -4093 -5009 -2260 -2742 -4952 -5285 -5938 618 6127
3476 6127 8626 6567 3099 -3476 -5634 -7290 -11099 -12810 -9113 -3106 2612 2310 589 4981 10121
3461 10121 13134 17931 22879 16585 14530 12254 16579 15919 10651 -962 -974 2547 5845 1895 6853
3446 6853 10715 8899 2715 -1296 -3228 -4395 -1446 1247 2278 2381 8886 8006 9005 5173 -2367 -7159
3430 -7159 -12116 -10832 -5464 -10778 -14407 -9020 -1291 6312 3269 709 3328 5979 6258 3091 533
3415 533 -1580 333 1049 2214 7732 12837 17549 19266 8620 6373 10616 7650 6331 4972 1834
3400 1834 -5991 -4112 307 2156 -2932 -5144 2699 3950 2463 3566 7634 10073 10813 12317 4475
3385 4475 1673 -669 -7173 -12107 -16006 -21120 -8579 1190 4227 -447 -10206 -16716 -11189 -4908 3062
3370 3062 2624 4128 9806 11661 4628 -5318 -10018 -14134 -15941 -11476 -6864 -8042 -13934 -18507 -7720
3355 -7720 -1107 -4815 -5980 -5303 -4307 -4076 -7384 -5163 -768 856 3825 5397 1087 -4539 -15016
3340 -15016 -18007 -17433 -10770 -3221 -814 -1225 4066 -997 -3034 -4178 -3563 -637 -1912 238 2030
3325 2030 2846 1520 3832 5711 2955 1045 2366 5791 9859 3555 641 4635 11181 17379 12012
3310 12012 4724 5219 6869 724 -4079 -5599 -646 -5904 -6957 -2207 -2563 -416 2875 3869 1758
3295 1758 7309 7566 -709 892 1956 1418 514 -5461 -2318 -1358 1948 9640 3624 1774 4209 4320
3279 4320 -613 3980 6331 3066 8516 13595 10708 9413 12012 10355 9340 8110 3346 2739 -3067
3264 -3067 -5604 -2146 2612 2496 3157 10432 17289 18525 10842 7710 7558 2673 -1362 -4232 -2083 -3888
3248 -3888 -6193 -2534 -3801 -2015 4584 8118 6676 4206 4153 1933 5266 5638 2550 -3581 -6517 -5292
3232 -5292 470 3627 3543 7766 9131 7111 228 1253 9646 12765 9537 7085 3520 -8386 -12352
3217 -12352 -14405 -8171 2471 5679 -343 -4003 -4486 -1494 -2866 -7706 -11461 -12258 -7744 -8588 -11242
3202 -11242 -11187 -4434 -1782 437 2558 4883 4475 3776 5309 12852 11475 7631 3288 -1918 774 2153
3186 2153 -1296 2366 4728 -2978 -10661 -11883 -7413 2369 4768 371 4995 610 -724 -116 2546
3171 2546 5726 147 -4343 33 -778 -3959 -2720 2605 5062 2000 6046 6403 7208 7836 3835 -1097
3155 -1097 -1642 -2829 -6076 -7461 -5588 -3131 -3437 -1899 -10491 -7031 -109 6390 8447 4162 7150
3140 7150 11660 7837 13562 14332 13165 15884 11743 8773 6789 11410 12825 13009 13389 7193 1229 3086
3124 3086 423 -1836 -830 2013 5554 3692 1507 5712 4893 2327 538 -2244 -1306 7896 4671
3109 4671 383 -1601 -3178 -8758 -7483 -5784 699 -5566 -12278 -6873 -692 1407 327 -347 1970
3094 1970 -4270 -17715 -11279 -6107 3669 2336 -1607 -3286 296 -845 -299 -1299 -187 3900 -1851
3079 -1851 -974 1903 -982 -5242 892 757 2123 678 1118 6247 3268 1167 2579 1445 -4465 -8546
3063 -8546 -6605 383 1267 7750 6896 2514 -3509 -5780 -1348 -491 -3784 -4206 -5058 -4528 2624 3477 -3557
3046 -3557 -11982 -11410 -3680 -9389 -15196 -9164 11 590 2045 6128 7883 6505 5930 7272 4929 2554
3030 2554 3745 1959 825 3798 3123 3207 6559 7231 14428 16765 11705 7445 9437 7774 7884 5893
3014 5893 8838 10395 10217 9731 10031 8309 4475 7425 4361 3126 515 -5628 -1192 6327 2987 -244
2998 -244 1022 2080 2072 573 4256 6679 4351 -3801 -1844 -117 -4434 -5071 -907 -256 -1499 665
2982 665 3660 2073 3386 7490 4182 -2467 -3630 -7819 -1417 -112 -3575 -6145 -9808 -4012 -1163
2967 -1163 494 3619 5285 4875 3571 5125 8553 4708 404 -2317 -10884 -6352 1862 3808 2706
2952 2706 255 -3214 -4086 1412 4494 2573 -6132 -9326 -7803 -5935 -6378 -1286 759 -4768 -3865 1223
2936 1223 -3273 -560 5588 9174 9031 4029 207 5148 1595 1098 -1739 -2833 -4340 272 345 4816
2920 4816 11688 5994 -3214 -9293 -10670 -5459 -2007 3507 10415 11746 5943 5387 9816 8921 7486
2905 7486 13316 10351 6551 3069 5656 4118 9216 4728 3352 960 5789 5683 7972 7101 3490
2890 3490 -1815 -7077 -6443 -5788 -4652 -4641 -3571 -3732 -8002 -7769 -5631 -3589 1825 5321 3080 -1244
2874 -1244 1431 -1382 -2975 6331 16330 11011 7729 12416 6420 5428 441 1227 -692 -1145 -5802 -2488
2858 -2488 10200 13716 11217 13687 5038 -3311 -7437 -7708 -5878 -1663 2835 5705 6155 5190 -1367
2843 -1367 -6843 -5842 -2106 9027 11192 10873 1897 -3061 1478 2808 7767 13674 13170 8657 3415
2828 3415 4488 6517 4449 4041 5256 2488 -1823 -652 1506 1779 4162 13152 11184 4277 4483 3891
2812 3891 2364 7034 13932 21117 25054 17778 7254 1850 5745 12624 14461 4576 -312 -1838 -1865
2797 -1865 2805 124 272 1698 3919 1246 -1119 1224 1728 -1261 -9007 -12219 -9120 -542 4150
2782 4150 8628 8902 6245 4554 4252 1351 818 -3739 -5305 -3411 5417 11374 2877 -1620 -156 1193
2766 1193 1519 2553 -441 -5728 -2012 2984 369 -637 -1660 -3612 -2670 -3703 -8550 -8295 -2857 3323
2750 3323 4008 6127 4969 963 4122 759 -6708 -12334 -11648 -12005 -11898 -10719 -10717 -6409 -1188 -669 -879
2733 -879 719 -2356 -6255 -5584 3688 3668 1335 -4098 -3891 -6217 -5385 -3250 -1037 -1350 -2232 -3496 -3415
2716 -3415 -9057 -10027 -4214 -6235 -10852 -12319 -6215 -7543 -7587 -1204 4245 2231 4051 633 -4788 -3389
2700 -3389 -843 -1023 1737 -1914 -2733 -5866 -7173 -2106 2796 2689 -2117 -9078 -6094 -7329 -162 5702
2684 5702 5288 2514 5459 4374 3333 4047 5283 6282 1107 450 -614 857 3370 2449 516 247
2668 247 6496 5467 -3606 -8200 -5288 2621 4265 5445 591 -639 -2011 -2262 1807 3413 459
2653 459 1302 8055 7455 8882 8028 -2755 -6041 -3891 6370 15527 14483 10543 7392 3553 3186 -4163
2637 -4163 -4815 -1817 -5787 -4467 6507 5557 8697 8062 6023 4136 2464 5898 390 152 6246 6446
2621 6446 5539 3412 3102 3199 -2164 1180 1757 9154 11133 8328 2233 2667 490 1621 6782 5773
2605 5773 6156 -289 56 3464 9313 4709 5743 6597 5901 6308 7646 7017 2894 2241 467 1712 -2007
2588 -2007 2507 1862 6517 6791 4887 3199 3657 5101 3548 4927 2893 283 -377 -2331 -2818 -2549
2572 -2549 -3674 -7195 -2820 1247 2951 1605 -8133 -11040 -8902 -2197 2920 7273 8402 11138 11053
2557 11053 14026 22064 20444 22733 15834 12301 11706 5808 4813 3054 6261 7767 10403 5930 3890
2542 3890 10370 7438 2507 -2272 -9130 -9727 -6485 -3932 5684 9062 8880 6727 7407 11013 8326 -2645
2526 -2645 -3290 -1184 -8391 -5355 -5377 -4058 5003 560 -5845 -5142 -8920 -9102 -749 140 2348 9812
2510 9812 14853 16212 13054 9445 11478 11150 3429 -1207 1316 14981 16722 21625 21750 14737 8572
2495 8572 177 -1688 -4438 -2972 1915 11081 10642 3046 -1162 -6392 -10072 -10139 -5647 -5690 -11144 -12723
2479 -12723 -11005 -6097 -6106 -2037 1545 -2523 -3008 -1238 2027 -905 -5339 -8112 -651 1507 6215 10821
2463 10821 12194 5383 -1036 -752 1629 975 -2316 -5911 -2738 1494 7717 9273 10871 6879 9215
2448 9215 9247 1789 4418 6615 6189 7918 8619 4805 3509 1721 -3605 -5464 -1489 1964 -491 -1573
2432 -1573 -4041 -3600 6192 6016 2312 4452 4408 3166 3179 1320 3058 3953 4722 10015 10107 3018 4984
2415 4984 3257 1208 3203 4719 9229 9542 9898 10864 8626 7294 8021 -923 3540 2612 -2176 -1366
2399 -1366 -2220 -3167 -4436 -7033 -7033 2520 7756 5223 2827 1897 -4205 -4508 -2752 -2446 -1924 -684 -4362
2382 -4362 -7980 -2644 -2010 -1431 63 -2455 -566 6445 12966 4476 -4174 -483 -2018 -6058 -7132
2367 -7132 -1713 -3910 -6985 -10499 -16590 -18370 -18154 -10853 -4932 -686 -9355 -5650 -4092 -6353 -4711
2352 -4711 -3974 3536 10199 9465 1561 2699 8605 7819 4697 3723 3954 -504 -3039 -628 6543 8339
2336 8339 5095 2004 -468 1482 3047 8393 11751 16354 20611 15489 12636 12898 9755 6510 3118
2321 3118 -1489 -2473 -1420 -3632 -2685 -3369 -2231 -3800 7214 9693 885 -2379 -3325 3311 -1330 1584
2305 1584 4850 6874 6573 12078 13282 16584 17561 20845 20990 16437 7697 3183 3419 -311 -3828 -5550
2289 -5550 -7256 -7024 -6249 -1385 3661 7767 4063 5537 2612 -1832 2656 5713 5416 1815 721 -2206
2273 -2206 -5268 -4342 -2224 -5282 -9607 -8162 2276 -154 -7777 -5526 426 1153 1327 590 1550 -3340
2257 -3340 -1036 2465 765 4790 800 1519 7254 10334 2022 5022 8060 9417 9277 7816 -340
2242 -340 -1526 -838 1534 6567 7527 6000 5632 4007 19 -1198 1682 4717 12038 9095 6142 10214
2226 10214 8154 3944 2580 -663 -8664 -14738 -10105 -247 4684 5962 7142 -1289 -6323 -2235 7796
2211 7796 5338 5538 3805 -3669 -1782 -976 -4684 -808 5866 9326 7247 8680 5510 3895 39
2196 39 2007 3389 -1989 531 6074 7844 11105 12165 4305 2057 2315 -1391 253 909 3413 6115
2180 6115 6571 2813 6540 6008 -1253 -12850 -12682 -1772 3795 2197 -1896 -266 -5935 -7113 -5575
2165 -5575 -7399 -12652 -7775 -5487 -3220 -3135 -6339 -13968 -10727 -297 1280 1076 2546 4721 -2660
2150 -2660 65 3292 2479 4718 5251 -1990 -8195 -9852 -7573 -649 3225 4793 3275 2061 6360
2135 6360 9446 3324 886 2472 3544 6925 6239 -1465 -4219 -1819 5838 13353 7586 5666 -2433
2120 -2433 -7252 -12943 -7758 -5279 283 5574 7623 9141 7554 1457 4532 3951 904 7176 4550
2105 4550 11436 14597 12997 4389 -1937 -1901 107 -869 -1471 -4262 -6017 -2657 -4046 -2520 3395 1151
2089 1151 -4268 -5917 -2835 -4706 -4901 -4275 -5038 -5526 -5734 -2436 -3887 -1733 25 1912 1489 -1439
2073 -1439 4566 3756 -3330 -6831 -5528 -1768 4174 9470 8980 8783 10052 9070 7609 4200 1370 2752
2057 2752 9276 7422 1045 -2640 -2955 -3823 -1335 -4446 -4607 -3274 -2634 2753 -1537 4984 9872 8676
2041 8676 2298 -3035 -6534 -9683 -12074 -17800 -16307 -6910 -4435 -3522 -2737 402 1308 -1306 -9529 -7182
2025 -7182 2111 10376 9610 5826 6285 4193 10111 15048 4181 -2585 1213 7662 9391 7720 5582
2010 5582 1459 1579 3177 3777 5243 10645 14506 6475 486 -2764 -1733 2672 3678 2678 32
1995 32 -4991 -7495 -7194 -7369 -7074 -1087 3477 4751 5440 5136 6098 4430 -3333 -13403 -16593 -14787 -6490
1978 -6490 -3260 -1618 3233 6101 7328 6914 4052 5526 5803 11856 21870 22148 22901 12469 5095
1963 5095 7668 8709 4960 5873 10628 4490 2191 4336 47 -1436 -4250 -3160 -2408 5581 4588 -4522
1947 -4522 -6984 -8867 -11426 -15948 -14052 -7969 -5898 -2042 -3661 -1224 -2568 -7349 -9679 -5315 2897
1932 2897 455 -3910 604 10864 11841 3544 6396 10280 3659 -1214 -6446 -1722 223 406 837
1917 837 4097 604 -5339 -5468 -3190 1181 -2084 2403 4844 1405 -1809 -5572 1429 10044 7016
1902 7016 5509 8165 2978 -4488 -5212 942 1011 -2536 -4392 -1930 6839 4749 5338 6162 8148 11170
1886 11170 4068 2864 8289 16397 16091 11849 4315 4706 4791 3840 3828 5624 7450 396 -6523 -2891
1870 -2891 -641 -393 6193 5579 3976 190 543 -1373 -857 1243 4685 3036 1893 -740 -1845 4971
1854 4971 6791 4183 -5284 -3923 -1889 -1661 -3247 -8022 -3396 -2919 -1827 -5012 -14294 -14679 -3535
1839 -3535 1767 1577 6819 9762 10795 8906 6605 5548 1121 6887 7905 2314 4473 8992 7947
1824 7947 7081 6089 2766 4927 436 -1948 1913 5245 9067 6336 6415 5950 -3038 -5710 -5761 -6213 -2305
1807 -2305 488 -1431 -255 5777 5492 3108 4462 5854 3808 1644 -3773 -7876 -8235 -6735 1504
1792 1504 3525 975 -2635 1159 4728 5562 7020 4566 -2157 -1370 5823 4896 273 2796 7058 7966
1776 7966 2061 -2207 -5741 -2892 -705 1269 -999 -2107 -4851 788 3325 578 212 3207 -291
1761 -291 -9341 -10390 -8772 -4369 -4910 -3360 -3641 -308 -4613 -4669 -4901 -6619 -2052 -4468 -1471 1350
1745 1350 1372 1133 938 2648 7900 9307 3387 918 5694 5250 1277 -649 4112 901 1210 3441
1729 3441 4081 5372 9011 49 2632 2665 1250 3905 2804 6985 1119 -4219 -1813 -3710 -3184 155
1713 155 3484 12124 11710 3223 -1664 -4270 2911 4639 5201 7847 8669 4728 -5770 -2995 753 -1210
1697 -1210 -7120 -6912 -6608 -1659 -1141 -1888 -2005 -1602 -2111 2332 3533 5875 4228 4349 7325 3232 -5298
1680 -5298 -5954 -4652 2699 8313 1313 -2786 -5716 -5996 -4124 -2300 858 180 -3477 -3459 -1294 -5757
1664 -5757 -6249 -5417 2330 8942 5083 -4015 291 4974 6024 4638 3997 2364 -1798 -8525 -14831 -8850
1648 -8850 -5827 -2216 7381 15209 22106 20051 19228 8610 3063 3495 3039 591 5608 10479 3171
1633 3171 -3719 -4989 -3427 -6949 -5581 -9790 -8113 1443 1477 3074 5769 4741 2974 -9302 -8985
1618 -8985 -2978 3795 3887 3411 4437 2281 1129 -80 1792 1667 -2816 -2057 3266 -1147 -1879 -4884
1602 -4884 -3386 -359 1339 -1594 -7097 -11387 -11106 -3986 5759 3821 4924 6960 11455 9977 6452
1587 6452 11611 6812 -1210 -995 93 -1940 17 5944 15732 7873 6373 1328 -6827 -3696 -3311
1572 -3311 -590 5519 2568 1419 -4495 -4801 -6621 -8710 -2621 9945 18017 12475 7295 10201 968
1557 968 1496 2371 4612 4039 171 -6184 -11164 -14200 -15580 -7754 2278 264 -5130 -9209 -13040 -15155
1541 -15155 -8203 -8916 -10256 -4534 -2744 -3670 -3609 -7053 -352 149 -4745 -4851 -3598 2 1041 2087
1525 2087 10364 12768 13164 7382 4033 2079 2116 3869 5031 5633 10733 14869 19025 5796 -2327 -375
1509 -375 3090 6905 7430 -813 -9924 -9177 -13476 -10703 -6550 -5286 -2317 -3357 -6359 -4224 -2738 -2849
1493 -2849 -5972 -5738 -3750 4603 868 4036 3597 -54 -825 1039 5667 6637 8111 13210 11216 4199
1477 4199 -353 -6235 -6685 613 7155 17689 13270 3337 363 -4996 -3151 3277 7789 2623 2419
1462 2419 1848 266 2556 5975 2910 -638 -4705 -4007 -4432 -5929 -5404 -4683 -5300 -6759 -13456 -8272
1446 -8272 536 -4488 -9313 -11524 -5564 2284 3314 5649 11347 6539 607 5029 2774 -848 -571
1431 -571 651 3180 1080 6963 4564 80 -1594 12 -2620 -3789 -5375 -4788 3543 5067 11449
1416 11449 13047 15091 12785 8251 5690 3844 3337 4909 -1087 -8219 -9600 -7239 -5786 -5850 -9240
1401 -9240 -2235 4883 5725 2632 -353 371 0 1902 -3564 -6359 -7923 -8544 -4558 8000 11602 16736
1385 16736 10039 11886 10014 2052 -6157 -4793 -849 3948 8140 6230 6128 9664 12645 17900 10167
1370 10167 4576 985 -5606 -1487 -1421 -5045 -5792 -5102 199 3674 -3065 -2919 2079 14181 12509 5318
1354 5318 1903 3689 1854 -4415 -4321 -5364 -8298 -4413 -420 -2299 -3848 -8735 -10800 -4907 -1915
1339 -1915 -18 -2141 -12287 -14905 -15361 -17382 -13818 -8094 -7216 -2496 -1443 -811 2667 4118 3057
1324 3057 -2011 -5600 -5675 -3546 -2969 3256 6813 7047 2838 3 6792 18510 15374 12210 1878
1309 1878 -6940 -10299 -11528 -9222 -1455 2222 942 -5180 -686 1299 -3713 -2840 -909 1239 2608
1294 2608 -1734 -3672 -2329 -3953 -7196 -12202 -10305 1494 3014 3886 994 597 -1182 -680 -3076
1279 -3076 -1940 -1519 -660 -4923 -6435 -4358 -5720 -6218 -951 1254 8904 9762 1818 -3055 -4081 -4168
1263 -4168 -4681 3329 7583 17389 18793 10388 6154 -205 -3480 -2982 1373 -3101 -15855 -7106 673
1248 673 1168 1262 -190 -633 -876 1635 -18 1065 7227 16384 12397 6353 -954 -11038 -10686 3715
1232 3715 5910 1497 5614 11901 16036 5640 -2818 -6794 927 -989 -1779 2361 3825 1847 5554
1217 5554 2717 -5745 -9593 -10338 -7122 -2174 -6199 -6279 -264 2592 187 -7288 -9328 -4716 -6054 -12110
1201 -12110 -11709 -8452 -1665 2915 6964 4666 -3836 -7456 -3863 -4107 -4524 -2038 4681 12791 8138
1186 8138 6605 6257 6092 3902 1627 -432 -1297 2684 -2818 -4966 47 -2756 -7926 -4019 3636 11377
1170 11377 7338 7884 5225 2006 1597 -1482 -6664 -6050 -770 6219 8285 -243 -4113 -255 4828
1155 4828 304 -5408 -6958 1739 -329 -4429 2752 12664 8964 6385 9463 13028 10801 6757 -1097
1140 -1097 -317 -1912 2763 1412 -416 1786 3789 1108 3834 13891 8937 7491 192 4211 4391
1125 4391 3231 5002 4570 1265 251 728 -1081 5305 9892 13535 10188 7099 3715 3547 4006 4636
1109 4636 12201 17293 11794 6852 -2774 -8655 -5260 -7181 -7672 -5568 935 7567 7595 7659 11721 14322
1093 14322 11409 4929 505 -4584 1915 4717 4857 8402 15794 5456 3364 5208 2130 2238 5356
1078 5356 3403 3232 3163 -1581 -1459 124 -3336 308 198 -4558 -6968 -181 2248 5193 5618 4898 12080
1061 12080 16842 15115 12366 5298 0 5006 3722 -4148 -6860 -8415 -7000 -2840 -3851 -5914 -1076
1046 -1076 -1986 2099 3756 2629 1610 4151 1911 -1137 -7065 -13556 -13845 -5658 -2330 -2006 807 -1104
1030 -1104 -1611 150 5005 4598 2324 -1870 -8859 -13354 -6228 -59 -302 726 -3592 -9823 -7400 -7828
1014 -7828 -4399 -856 579 -186 -2146 313 -9166 -8858 -9571 -2634 5184 8307 -1662 -5461 -5838 -6934
998 -6934 -9773 -5555 -2125 1737 884 -762 -664 3611 3789 1169 186 -1249 3955 2528 6332 6720 3678
981 3678 11711 18991 19135 12132 4980 222 -3685 -1658 4298 5900 5119 -2308 -8669 -3088 -1 2114
965 2114 -6757 -9490 -7617 -9248 -3882 1547 -2221 -343 2602 340 1028 932 1848 -5 1469 -3158
949 -3158 -9247 112 10486 10416 6908 2312 612 -3204 921 2551 1671 -108 1717 5337 8374 3905
933 3905 -1279 -489 269 156 -2855 -2528 -866 -774 901 55 -823 610 6983 6027 7884 10537 14280
916 14280 11708 5443 5 -3999 -8949 -9093 -4761 -287 3286 1724 8429 15582 6916 -5595 -1052
901 -1052 2478 1180 1826 4034 6709 7674 7781 7735 7739 7765 874 -2184 -1024 315 220 -1348 1609 3972
883 3972 3142 1475 2900 3138 8450 7438 6290 703 27 2512 2107 2377 -1289 -3067 3024 4541
867 4541 4133 11350 12392 10277 6347 7817 9790 14757 13747 6239 -936 -5534 -19 8382 7268
852 7268 9810 6883 9780 11384 2069 101 8224 9426 6017 4724 8240 10626 2811 -2821 -2716
837 -2716 5022 5480 3064 2707 -2064 -2963 -2537 -5782 2783 4644 1277 170 -5568 -5197 3671 8459
821 8459 5495 3025 -211 -2619 -1305 -1692 -1526 2755 8529 3367 2660 4940 3950 1715 5100 3829
805 3829 4500 9306 16094 17536 13599 13045 11381 6856 -1441 -8198 -4271 -9412 -14108 -12278 -7561 561
789 561 6018 -4447 -10620 -478 6460 6819 1939 2874 5277 5729 4930 5185 1802 2275 11127 16591
773 16591 10184 7657 8943 13053 9676 3300 7464 7735 4399 6825 7857 4217 8275 9322 4990
758 4990 2886 5295 1342 4859 7520 3719 2002 1327 -217 3435 12574 11061 7722 1588 -355
743 -355 -231 -221 -2021 3281 5904 -131 2121 416 -1412 2399 1675 5047 10797 12481 7390 -689
727 -689 -3031 3403 10612 12446 10168 9485 9857 5896 5269 1509 2321 2864 1721 2963 9453 12314 12324
710 12324 11119 8129 7824 6122 2568 2582 3689 5522 2766 -2914 408 2916 8092 9193 18731 17515
694 17515 6522 5748 3751 686 6172 13774 10684 14708 16137 10621 -887 -3972 -522 -137 -3161
679 -3161 4360 11698 9704 4956 3665 1274 574 -2159 -5916 -6422 -4790 3193 3856 -174 -5367 1937
663 1937 9488 7405 7778 529 -1789 8671 7486 -2029 -1802 -508 4314 6774 2025 2875 3102 7658
647 7658 7367 5076 -6488 -9050 -6612 -3445 -5544 -702 -1394 -7481 -5091 -3095 338 1540 -4643
632 -4643 -1904 -1490 -6737 -4848 1578 -448 3601 6074 7325 14177 17438 15015 2617 -1623 2466
617 2466 1803 4872 2273 -510 4440 9183 10342 7447 -607 4025 5490 5625 7799 7223 5055 -369
601 -369 -1799 -890 2537 8181 9922 3112 4918 7840 8670 11676 8993 8783 10113 10796 15661 22072
585 22072 13703 7152 7858 6083 3742 963 3433 11100 11143 9409 8598 10672 8715 12009 13491 9652
569 9652 4048 5084 5567 7574 3307 -6828 -9536 -9210 -8271 -8283 -3938 -5376 -993 -1708 -5511 -7904
553 -7904 -7809 986 6430 8431 12424 12517 8267 5220 3623 2181 3066 354 -1057 3745 4866 6711
537 6711 608 1568 485 -1300 -1090 -4353 2080 5612 6848 3506 1184 7991 14547 13586 9945 8932
521 8932 6696 4394 6219 2801 2149 12063 15560 12843 8619 3032 5723 10455 10030 6176 7016 5897
505 5897 13475 11720 10714 5593 5677 3323 3803 3971 4063 -721 -4828 -9318 -827 5472 8467 5127 3352
488 3352 9445 13119 9773 891 -1227 3284 5686 7153 10782 13989 15376 12553 8353 438 -8444
473 -8444 -3843 6627 10206 4597 -938 3013 9560 8620 14463 18279 16306 4269 279 4868 4614
458 4614 -667 -8246 -5841 -4208 -4762 -3819 -7102 -9309 -6506 2779 8967 4105 6821 11243 11745 7584
442 7584 6122 2602 1893 -84 1463 4870 2146 -1316 -6126 -3645 2507 3483 13409 15676 14353 10413
426 10413 6686 3987 1759 -1242 5591 12753 12138 4680 -107 -1545 6263 14320 16629 14086 15588
411 15588 16979 18635 15409 9444 12076 10356 10535 4668 7563 16614 13974 3154 745 -748 -889
396 -889 1839 5001 6127 8414 10892 11541 9242 1271 -1840 332 5631 8754 5612 633 -4539 -2883
380 -2883 3870 9052 11698 9613 3443 3205 4190 7115 6332 8315 8753 13257 13376 8512 7654 6719 7099
363 7099 7666 12483 6500 1757 2605 15207 14253 11275 12667 11032 11416 17024 19925 17136 10479 12543
347 12543 12849 10595 10402 5720 1289 3520 4951 -491 -1449 -1540 6163 9169 8696 3646 -2433 -1596 1297
330 1297 2869 -375 -1519 -328 -2334 -2429 1406 210 3330 526 -3998 -1937 5941 10290 9562 9217
314 9217 12747 11993 9769 7714 10795 7917 560 -593 4923 6215 515 -752 -951 -2748 -2341 6177
298 6177 12350 12300 9635 3779 -38 1504 1022 5097 2641 726 7649 10395 11877 10374 11251 10958
282 10958 8421 6497 7941 2684 -336 9237 13468 6248 1315 7125 7309 7171 5589 2486 839
267 839 -3551 -1063 377 2116 8802 8481 3338 1881 2882 -139 -1064 4900 1643 1619 3707 -959
251 -959 776 -2632 -1495 2631 1520 -4526 -6577 -518 5192 7241 5102 7643 2964 5658 7580
236 7580 8160 606 -1016 4385 3506 -1299 -3254 -1993 2138 2600 2022 5510 9124 9142 6352 8296 10697
219 10697 12451 11454 10410 7656 1825 -1615 1983 2194 6764 9272 8302 5735 8254 9505 8360 8696
203 8696 10890 14341 13039 9439 8492 10095 161 -1866 100 -2995 1256 6502 2326 -176 -2351
188 -2351 -2876 3459 7796 7045 2973 4272 5158 4792 1604 5468 8762 10321 11738 6400 5019 2413
172 2413 6216 8743 7897 9731 10065 12075 12215 8037 3598 2598 1938 3089 1232 -2128 1533 5429
156 5429 5941 3320 1474 1527 2642 782 -4075 -3299 456 7842 12478 7407 2985 4601 4954 4157 2086
139 2086 2323 6813 11148 13154 14479 8334 937 1289 4293 6100 -2500 -920 3044 2521 965 3241
123 3241 4680 4466 5132 4115 3591 3992 9819 10969 14091 14907 18103 14120 8167 6870 5755 3054
107 3054 6110 12674 13726 14410 13659 10357 8868 12316 16037 15129 17598 14737 14866 17498 18076 15336
91 15336 7012 3691 7649 6929 8754 13082 9598 10173 6610 460 1031 3 -319 4110 4567 8305
75 8305 13663 9186 9078 8079 10442 7676 4681 11177 16157 9807 6485 6749 3986 3948 9666 15481 11561
58 11561 5618 4837 9007 9626 10777 10247 5062 11219 11680 9078 6492 5087 3205 4854 5325 1487
42 1487 1016 2984 8236 11877 10730 6684 1252 1023 7827 4760 -609 -2674 2324 4396 1834 1014
26 1014 2179 4765 9318 7484 -1716 2996 3399 1288 5938 8707 4446 3124 4815 4002 5316 5158
10 5158 3871 3164 6720 5872 5235 5017 6272 4108 4624 10001
0 10001
$$ Imaginary data points
##PAGE= N=2
##DATA TABLE= (X++(I..I)), XYDATA
32767 32686 32325 31860 36366 34461 31776 29939 32746 36876 36882 34162 34474 36509 37993 34443 37092 42776
32751 42776 39815 39311 40329 40985 43001 42672 44005 42767 41478 44939 46893 41863 45694 50428 46712
32736 46712 44812 46333 49062 48155 50053 53554 59674 64218 58027 57611 58768 55058 57501 62210 60386
32721 60386 59912 60528 57491 55971 58250 55502 52218 49644 51208 55834 57086 54487 57800 64122 68523
32706 68523 71124 70917 66454 64185 66513 68041 62422 62150 68671 71132 70589 73053 73208 72761 69529 71572
32690 71572 73290 71430 69700 71386 76163 76317 73179 72685 78747 76675 73722 67814 66195 66711 69024
32675 69024 77557 81699 86036 88892 81747 81638 77974 73920 76425 76845 72429 71065 74745 80249 82959
32660 82959 80649 75198 80097 83591 86935 85133 87194 87396 88587 87572 81073 78853 79398 78154 81968
32645 81968 85517 85844 86810 92484 94372 88982 90506 92209 91720 92459 92271 89426 85896 83767 86139 90838
32629 90838 92299 93891 90570 91144 91785 94131 98815 99329 95890 95957 98186 98966 98693 98421 101486 101329 101151
32612 101151 100205 100476 101847 102295 100284 99112 103342 105706 103778 98998 103170 106051 105502 107296 112645
32597 112645 107786 105176 111466 113182 108657 109746 111392 112435 112188 108993 110028 113699 110464 108922
32583 108922 110042 110279 105362 104248 106743 108365 109007 110048 106327 106517 110666 110871 110552 112947 114736
32568 114736 112699 111552 111177 109620 111858 116805 118479 117088 117150 118550 120450 123161 123784 123689 125525 126567
32552 126567 125027 121797 120965 127965 131319 137957 133523 134977 133756 129315 130688 128492 128738 137502 137629
32537 137629 132341 126980 127960 131269 131680 133669 132391 129974 123248 121567 125860 127910 131636 128431 124488
32522 124488 129039 133582 133139 129487 128936 129290 134911 135746 134292 133839 134948 137186 141745 143297 139317
32507 139317 138443 140444 145988 144237 144297 141060 135412 132902 130159 129056 131138 125781 131053 129646 125174
32492 125174 132512 138677 138489 135231 136669 143287 142605 140321 139252 137841 140158 140778 143185 145462 145620
32477 145620 148575 144871 142729 148175 148482 143723 138672 141306 139703 142583 141986 142055 152293 154108 144999
32462 144999 134864 135337 139004 144108 142410 142203 138099 138821 134579 137872 142080 145260 150404 155770 160817
32447 160817 163660 158876 151443 147058 150388 149362 146817 150076 149579 153166 156486 153240 153531 154684 148071
32432 148071 144541 143666 142263 147781 151914 146501 148977 155420 160943 163843 169991 166261 162377 160529
32418 160529 157388 156284 154177 150578 149329 155482 156711 158219 156956 158911 155897 154323 157525 160698
32404 160698 159729 160719 160716 173165 175695 172599 166912 155500 156246 162259 166574 171072 166567 167374 162618
32389 162618 162829 164608 162639 157113 150698 147224 149731 153805 163789 164006 159983 158882 160808 155688 162603
32374 162603 164747 162867 166527 166160 161658 158872 156026 159721 165070 166437 162447 165706 166697 168675 166307
32359 166307 163035 162731 165499 168878 164212 167641 165160 162110 154871 162330 165095 162218 159531 161424
32345 161424 157591 156283 160176 161820 165791 171255 176542 179030 173307 167313 165212 164965 167785 171236
32331 171236 167923 166177 165622 162633 161207 164297 170410 178393 181140 175074 171418 170470 170672 172901 170209
32316 170209 167258 166603 165740 166009 174126 180260 170753 161924 162122 163001 169070 176911 177504 178276 189917 183818
32300 183818 178342 178886 179736 174777 169385 168442 171131 174045 173323 173625 173854 169452 174197 173260 174758 173981
32284 173981 171380 175615 182474 186379 181366 176222 174404 176519 180008 178673 173579 176499 176282 176906 186497
32269 186497 186054 187061 187696 183543 178359 179542 179051 175702 181826 177984 172716 175812 182873 184170 179914
32254 179914 176365 173591 174747 183340 185025 183002 182631 179131 170647 167598 164961 163717 166725 169948
32240 169948 172902 171353 173174 175292 176077 177259 175099 176982 177958 178959 179158 175088 178516 182304 184810
32225 184810 185489 187830 190985 185379 180933 184734 185587 186277 184822 180815 175678 172931 176766 180891 182424
32210 182424 179951 179754 177811 173192 179499 180689 173722 176251 174351 173044 173242 173673 172221 181027 189107
32195 189107 180778 174794 179084 183104 186468 191610 193443 192886 184840 187767 188410 189037 192419 186374 181969
32180 181969 185809 186205 187710 190495 189364 188008 186175 188166 189980 188218 191178 188551 183410 186030
32166 186030 182304 178316 184675 185090 180270 167317 161835 165081 176265 179917 185695 189537 186130 180408
32152 180408 172452 179383 181618 177541 172393 173581 182915 190825 196716 190627 184537 181144 183087 187749
32138 187749 188260 185368 181330 183622 187561 187700 188291 182679 181391 190494 197589 190720 179284 177339 187982
32123 187982 191153 192763 185874 187251 186665 183773 187530 185805 183054 181377 183261 181657 179290 183719
32109 183719 189524 187151 184157 186041 184000 179587 178673 174465 174994 179299 178191 181716 185292 183464 181300
32094 181300 178974 179224 168825 171122 172315 174188 176382 181417 181689 185965 182694 179429 180232 186800 183074
32079 183074 182397 176096 169206 172323 181624 187772 186240 186452 186165 177866 175098 172968 176697 181777 180183
32064 180183 181130 178293 179626 182561 178422 175973 174956 180162 186115 190591 189047 184747 178648 177400
32050 177400 182130 183322 183989 187438 188743 185806 188318 190101 186503 177847 174669 181904 196677 203686
32036 203686 192057 176346 171844 172022 168014 170481 177041 177026 181633 186700 184240 189386 186490 180185
32022 180185 181426 184387 180941 182167 187546 198044 196456 188986 190358 192600 193420 189655 190521 188001
32008 188001 187616 183215 178740 183100 187021 191597 185311 173547 176203 182608 183058 187254 187587 181318 177769
31993 177769 174724 178343 183152 177854 175006 180443 176888 170858 174384 184401 188822 186723 183623 186620
31979 186620 188117 179522 174491 179003 183110 179183 177865 177879 183027 183328 180789 177294 180629 183090 181457
31964 181457 179662 179849 184452 188102 192733 193675 187107 182961 185281 183711 185944 188193 185340 177166 178458
31949 178458 183261 184189 187645 190460 188840 195468 195682 188584 182778 183077 191350 188286 192799 194123 188409
31934 188409 185297 185800 188149 190644 191305 195138 194045 190753 184927 186284 187980 183155 182464 182762 181844
31919 181844 181347 180803 181438 189092 190895 186500 184919 192418 186789 182654 188788 194774 190214 190144 191021 185712
31903 185712 180769 179690 176528 182615 192196 194218 194152 200594 200566 199841 194797 191424 194574 191088 180550
31888 180550 178837 180676 181294 178643 176787 182704 189813 190260 194402 190194 186133 184362 185012 179777 182512
31873 182512 182212 180072 184249 182589 182055 183031 178510 173097 173046 178234 181315 177589 173887 181179 186167
31858 186167 184904 186722 181588 174486 177495 181207 180151 183531 187897 187238 189190 189302 194191 199113 199080
31843 199080 193497 196696 197348 195214 192269 181965 177976 173883 175386 180942 185664 187877 188089 190153
31829 190153 193341 191242 183383 178698 181037 179889 174316 177203 183866 189119 193804 196504 187800 183500
31815 183500 185343 185418 188885 197969 198815 188512 178353 178403 183523 184312 185588 188797 186949 184302 183416
31800 183416 185429 185722 189648 188873 186909 179579 179018 187708 190270 191398 192651 193928 193039 186949 181992
31785 181992 184252 185729 184392 179108 182782 182352 182270 179500 180506 185512 185976 184612 181902 189660 184869
31770 184869 180264 187819 187522 183326 173781 174763 179012 175668 175039 175661 176028 177200 177306 172185 170387 174071
31754 174071 179056 184780 188330 186187 185828 186448 185490 181555 179844 177221 181526 188245 188094 187922 187641 185880
31738 185880 183544 185776 193895 199955 195398 193143 197807 198116 197426 199560 204140 203865 194540 180373 183166
31723 183166 191261 187454 186753 188948 184629 186324 185988 191841 194152 188162 188294 189561 194984 203975 200908
31708 200908 196288 191680 188571 190273 192981 194706 193438 193642 193224 191707 186205 178097 183217 182548 187156
31693 187156 188287 187311 192019 188980 181303 181826 183710 189419 192988 195308 190368 185979 191593 188850 185371
31678 185371 177544 179389 181480 185232 185367 186342 195214 197934 194718 185696 179903 184789 187424 186350 181889
31663 181889 181882 186450 189977 190881 188460 185621 184047 184250 176447 178876 182281 183884 184944 186990 189325
31648 189325 188406 187529 188758 190983 185419 184195 186231 186787 183901 188836 193245 190650 182541 182301 187557
31633 187557 186058 185013 191931 195904 191221 187186 188723 188387 185672 186545 182376 178956 181913 183370 182216
31618 182216 182598 185363 186822 188930 193077 195558 196379 197467 198675 197395 191182 186909 184264 179921 183662
31603 183662 184120 185581 190704 189598 184457 185116 191309 195075 196764 194088 190706 189059 185337 184332 187845
31588 187845 190128 195597 196636 193822 188401 186986 184392 183590 192346 196601 201310 208181 204648 195680
31574 195680 188823 185105 182948 181301 180543 186800 192249 190161 184987 181704 183313 182828 181889 175828 176613
31559 176613 180878 181712 183651 181581 182633 188570 186840 187306 186226 191887 193205 190747 191530 194500 194341
31544 194341 185282 183367 188183 188178 179852 183521 183691 182488 183229 182394 190510 194591 193087 190764 191716 188064
31528 188064 178199 184567 188407 194395 193413 189999 184468 182332 189783 189783 191039 190415 186761 183874 186468
31513 186468 191868 193301 191130 188055 187529 183489 184323 177856 177846 181208 181974 184314 188995 189282 182535 181188
31497 181188 179633 178284 179002 179967 186796 189716 188128 189073 183799 184552 183181 175113 177844 188417 197455
31482 197455 204869 200230 186471 177163 178136 178126 175767 178280 188622 190648 184633 184216 187810 189226 189825
31467 189825 191111 193278 197033 198970 191533 190056 191530 187609 187351 188959 194291 194820 195248 192656 188770
31452 188770 186385 184635 183808 184848 187461 190855 194354 198087 195727 190168 187961 181850 183924 182304
31438 182304 180602 184706 189453 189181 191017 192440 198074 201374 200490 202040 196917 194403 192541 187323 186892
31423 186892 188380 191404 190036 189034 189224 187002 178399 181514 182284 179511 178195 182583 186932 187386 189889
31408 189889 195319 193077 190056 186231 186670 188530 193238 200700 199848 197520 188845 177854 180303 184353
31394 184353 184690 184765 176363 177777 180548 183608 180733 181357 186950 186453 185516 188399 192257 194107 193604 193950
31378 193950 193582 197416 199012 194313 191349 185707 185247 183990 190079 190720 183757 188894 192337 193517 186335
31363 186335 185517 184937 189683 191207 187598 186306 190343 193179 192497 188815 187234 190552 189060 179223 186747
31348 186747 196801 197715 192707 189453 187909 189607 196317 194612 191325 185512 185315 183725 185437 180201
31334 180201 181678 179628 175881 183549 189234 191178 199061 201270 197971 191946 182497 177827 183808 186619
31320 186619 187146 192600 187214 176864 181595 188988 188266 188112 193503 192244 192968 193088 191251 193694 196017
31305 196017 194717 194088 201386 196519 187776 187616 192137 190131 185641 190824 191140 188040 188627 185545 184967
31290 184967 182031 183187 178335 179399 188389 191751 192614 189839 190213 195798 200865 195767 190294 186108 182436
31275 182436 182873 184030 192285 191694 187823 186113 189553 185841 184015 179850 183277 185656 183038 194717
31261 194717 189499 183679 183075 184053 184300 180953 185067 191629 187562 184559 193093 195187 197836 196723 200187
31246 200187 196281 193428 198611 206025 206263 202967 203826 200701 195917 200982 205937 210813 204168 195925 199293
31231 199293 203493 199083 192341 189470 187865 190130 195168 195778 192306 181585 185951 189985 189460 187914
31217 187914 181318 184273 183154 178873 177104 181971 188106 187070 183855 188656 195402 196501 191977 191156
31203 191156 182083 180031 181204 180067 173494 180689 191462 191488 193897 188746 175716 175736 178220 176834 180641
$$ [...]
##END NTUPLES=NMR SPECTRUM
##END=
