##TITLE=Analysis number 322112
Compound Code cc 21101
Book Reference 483/58/1
Project Code adrs
Chemist Name mattw
##JCAMPDX= 6.0         $$ Bruker NMR JCAMP-DX V2.0
##DATA TYPE= NMR SPECTRUM
##DATA CLASS= NTUPLES
##ORIGIN= Bruker BioSpin GmbH
##OWNER= nmr
$$ XWIN-NMR		Version 3.5
$$ Wed Sep 13 09:12:02 2006 GMT Daylight Time (UT+1h)  MAYBRIDGE\nmr@NMR_250MHZ
##.OBSERVE FREQUENCY= 250.131544655141
##.OBSERVE NUCLEUS= ^1H
##.ACQUISITION MODE= SIMULTANEOUS (DQD)
##.ACQUISITION SCHEME= undefined
##.AVERAGES= 16
##.DIGITISER RES= 18
##SPECTROMETER/DATA SYSTEM= dpx250
##.PULSE SEQUENCE= zg30
##.SOLVENT NAME= DMSO
##.SHIFT REFERENCE= (INTERNAL, DMSO, 0, 16.522)
##AUDIT TRAIL= $$ (NUMBER, WHEN, WHO, WHERE, WHAT)
$$ ##TITLE= Audit trail, XWIN-NMR		Version 3.5
$$ ##JCAMPDX= 5.01
$$ ##ORIGIN= Bruker BioSpin GmbH
$$ ##OWNER= nmr
$$ C:\u/data/dgb/nmr/ADRS/650/pdata/1/auditp.txt
$$ ##AUDIT TRAIL=  $$ (NUMBER, WHEN, WHO, WHERE, WHAT)
(   1,<2006-09-13 09:11:36.67 +100>,<MAYBRIDGE\nmr>,<NMR_250MHZ>,
      <created by zg, POWCHK disabled, PULCHK disabled
       configuration hash MD5:
       E2 DF 36 D8 04 B2 41 60 5A D7 A3 38 5A 4B D0 FE
       data hash MD5: 64K
       D5 D2 A2 10 D2 BC 6B F7 8F 63 A8 88 D4 71 64 B8>)
(   2,<2006-09-13 09:11:50.96 +100>,<MAYBRIDGE\nmr>,<NMR_250MHZ>,
      <Start of raw data processing
       ef LB = 0.3 FT_mod = 6 PKNL = 1 SI = 32K 
       data hash MD5: 32K
       39 93 41 93 A4 6F 57 11 48 2E 68 70 ED 63 FD B3>)
(   3,<2006-09-13 09:11:53.20 +100>,<MAYBRIDGE\nmr>,<NMR_250MHZ>,
      <apk 
       data hash MD5: 32K
       92 24 64 3E 6D 53 6B 55 96 E8 08 76 2A 33 39 31>)
(   4,<2006-09-13 09:11:54.10 +100>,<MAYBRIDGE\nmr>,<NMR_250MHZ>,
      <abs ABSG = 5 
       data hash MD5: 32K
       07 73 52 3B 44 3F 2A 25 03 4D 19 F1 A2 D6 D9 A4>)
$$ ##END=
$$ 
$$ hash MD5
$$ 86 2E B1 8A 97 8E E7 30 EE AC DD AC 3E C9 C8 C3
##$RELAX= 
##$RELAX= 
##$RELAX= 
##$RELAX= 
##$RELAX= 
##$RELAX= 
##$RELAX= 
$$ Bruker specific parameters
$$ --------------------------
##$DU= <C:\u>
##$EXPNO= 650
##$NAME= <ADRS>
##$PROCNO= 1
##$TYPE= <nmr>
##$USER= <dgb>
##$AMP= (0..31)
100 100 100 100 100 100 100 100 100 100 100 100 100 100 100 100 100 100 
100 100 100 100 100 100 100 100 100 100 100 100 100 100 
##$AQSEQ= 0
##$AQ_mod= 3
##$AUNM= <au_zg>
##$AUTOPOS= <3 >
##$BF1= 250.13
##$BF2= 250.13
##$BF3= 250.13
##$BF4= 250.13
##$BF5= 500.13
##$BF6= 500.13
##$BF7= 500.13
##$BF8= 500.13
##$BYTORDA= 1
##$CFDGTYP= 0
##$CFRGTYP= 5
##$CHEMSTR= <none>
##$CNST= (0..31)
1 1 145 1 1 1 1 1 1 1 1 1 1 1 1 1 1 1 1 1 1 1 1 1 1 1 1 1 1 1 1 1 
##$CPDPRG= <>
##$CPDPRG1= <>
##$CPDPRG2= <>
##$CPDPRG3= <>
##$CPDPRG4= <mlev>
##$CPDPRG5= <mlev>
##$CPDPRG6= <mlev>
##$CPDPRG7= <mlev>
##$CPDPRG8= <mlev>
##$CPDPRGB= <>
##$CPDPRGT= <>
##$D= (0..31)
0 1 0 0 0 0 0 0 0 0.06 0 0 0 0 0 0 0.0002 0 0 0 0 0 0 0 0 0 0 0 0 0 0 
0 
##$DATE= 1158135095
##$DBL= (0..7)
120 120 120 120 120 120 120 120 
##$DBP= (0..7)
150 150 150 150 150 150 150 150 
##$DBP07= 0
##$DBPNAM0= <>
##$DBPNAM1= <>
$$ [...]
##$SUBNAM7= <"">
##$SUBNAM8= <"">
##$SUBNAM9= <"">
##$SW= 20.6930455092707
##$SWIBOX= (0..15)
0 0 3 0 0 0 0 0 0 0 0 0 0 0 0 0 
##$SW_h= 5175.983436853
##$TD= 65536
##$TD0= 1
##$TE= 295.16
##$TE2= 300
##$TE3= 300
##$TEG= 300
##$TL= (0..7)
0 120 120 120 120 120 120 120 
##$TP= (0..7)
150 150 150 150 150 150 150 150 
##$TP07= 0
##$TPNAME0= <>
##$TPNAME1= <>
##$TPNAME2= <>
##$TPNAME3= <>
##$TPNAME4= <>
##$TPNAME5= <>
##$TPNAME6= <>
##$TPNAME7= <>
##$TPOAL= (0..7)
0.5 0.5 0.5 0.5 0.5 0.5 0.5 0.5 
##$TPOFFS= (0..7)
0 0 0 0 0 0 0 0 
##$TUNHIN= 0
##$TUNHOUT= 0
##$TUNXOUT= 0
##$USERA1= <user>
##$USERA2= <user>
##$USERA3= <user>
##$USERA4= <user>
##$USERA5= <user>
##$V9= 5
##$VALIST= <valist>
##$VCLIST= <CCCCCCCCCCCCCCC>
##$VD= 0
##$VDLIST= <DDDDDDDDDDDDDDD>
##$VPLIST= <PPPPPPPPPPPPPPP>
##$VTLIST= <TTTTTTTTTTTTTTT>
##$WBST= 1024
##$WBSW= 4
##$XGAIN= (0..3)
0 0 0 0 
##$XL= 0
##$YL= 0
##$YMAX_a= 337228
##$YMIN_a= -545758
##$ZGOPTNS= <>
##$ZL1= 120
##$ZL2= 120
##$ZL3= 120
##$ZL4= 120
##$ABSF1= 16.522
##$ABSF2= -4.171173
##$ABSG= 5
##$ABSL= 3
##$ALPHA= 0
##$AQORDER= 0
##$ASSFAC= 0
##$ASSFACI= 0
##$ASSFACX= 0
##$ASSWID= 0
##$AUNMP= <proc_1d>
##$AZFE= 0.1
##$AZFW= 0.1
##$BCFW= 0
##$BC_mod= 0
##$BYTORDP= 0
##$COROFFS= 0
##$CY= 12.5
##$DATMOD= 1
##$DC= 0
##$DFILT= <>
##$DTYPP= 0
##$F1P= 14.0000005364418
##$F2P= -0.99999901652339
##$FCOR= 0.5
##$FTSIZE= 32768
##$FT_mod= 6
##$GAMMA= 0
##$GB= 0
##$INTBC= 1
##$INTSCL= 1
##$ISEN= 128
##$LB= 0.3
##$LEV0= 0
##$LPBIN= 0
##$MAXI= 10000
##$MC2= 0
##$MEAN= 0
##$ME_mod= 0
##$MI= 0
##$NCOEF= 0
##$NC_proc= -5
##$NLEV= 6
##$NOISF1= 0
##$NOISF2= 0
##$NSP= 0
##$NTH_PI= 0
##$NZP= 0
##$OFFSET= 16.522
##$PC= 1
##$PHC0= 114.6059
##$PHC1= 55.87473
##$PH_mod= 1
##$PKNL= yes
##$PPARMOD= 0
##$PSCAL= 4
##$PSIGN= 0
##$REVERSE= no
##$SF= 250.13
##$SI= 32768
##$SIGF1= 0
##$SIGF2= 0
##$SINO= 400
##$SIOLD= 32768
##$SREGLST= <1H.DMSO>
##$SSB= 0
##$STSI= 32768
##$STSR= 0
##$SW_p= 5175.98343685301
##$SYMM= 0
##$S_DEV= 0
##$TDeff= 65536
##$TDoff= 0
##$TI= <Analysis number 999999
Compound Code 99
Book Reference 9
Project Code 9>
##$TILT= no
##$TM1= 0
##$TM2= 0
##$TOPLEV= 0
##$USERP1= <user>
##$USERP2= <user>
##$USERP3= <user>
##$USERP4= <user>
##$USERP5= <user>
##$WDW= 1
##$XDIM= 32768
##$YMAX_p= 357453110
##$YMIN_p= -5581282
$$ End of Bruker specific parameters
$$ ---------------------------------
##NTUPLES= NMR SPECTRUM
##VAR_NAME=  FREQUENCY,     SPECTRUM/REAL,   SPECTRUM/IMAG
##SYMBOL=    X,             R,               I
##VAR_TYPE=  INDEPENDENT,   DEPENDENT,       DEPENDENT
##VAR_FORM=  AFFN,          ASDF,            ASDF
##VAR_DIM=   32768,         32768,           32768
##UNITS=     HZ,            ARBITRARY UNITS, ARBITRARY UNITS
##FACTOR=    0.157963299565203, 1,           1
##FIRST=     4132.6476996994, 0,             0
##LAST=      -1043.33573715361, 0,           0
##MIN=       -1043.33573715361, -5581282,    0
##MAX=       4132.6476996994, 357453110,     0
$$ Real data points
##PAGE= N=1
##DATA TABLE= (X++(R..R)), XYDATA
$$ [...]
27595 8016 -8700 -19344 -26277 71064 109991 88752 82143 68133 179437 210827 266988 374853
27583 374853 490422 475346 343735 223629 100484 18976 -55950 -17591 -43171 49371 127464
27572 127464 148061 33865 -47442 4714 109132 80671 70199 -83511 -202202 -76038
27562 -76038 13226 -4636 -6130 6945 38408 1252 97216 167104 50391 -29621 37171 136898
27550 136898 75307 70888 54741 -4826 -28513 1859 -6018 -1623 -25813 74284 62440 -9484
27538 -9484 -136113 -126400 -34714 47380 13424 25719 63928 29781 9242 -44093 -73721 -130131
27526 -130131 -77579 -51380 -70296 -100847 -55218 -25277 -77706 -60898 -60889 70018 36015 5961
27514 5961 30504 44160 67305 140504 176844 160106 227257 170206 151143 260373 269424 126132
27502 126132 10888 -52142 -10764 85196 27201 -56511 -19585 52642 22304 -18620 -38303
27491 -38303 -5998 -13073 84786 164982 208929 249801 224634 167329 101446 93889 185606 186866
27479 186866 178701 126129 92951 58636 -96766 -122486 -74702 -38453 29486 -18889 -76808
27468 -76808 85817 158231 98071 67685 58446 70957 66335 90538 117309 32728 3829 111488
27456 111488 172895 87392 65124 9058 -10587 5785 54033 100461 24980 -109806 -152622
27445 -152622 -115036 74015 190584 221703 139039 75338 112865 47841 35231 -54403 -95506
27434 -95506 -129179 -63292 -3407 13500 30851 36962 47863 40737 25815 90314 84510 104837
27422 104837 168432 21283 188280 183919 -53451 -36694 133317 165833 189802 235282 155713
27411 155713 76291 61424 62449 593 -135842 -127973 -103764 -182354 -160240 -69994 -212083
27400 -212083 -337764 -247196 -88176 82939 49760 116289 187728 163024 146700 160050 85716
27389 85716 -24916 22475 -34733 45845 79309 64493 4339 25032 -19745 -91167 -168735
27378 -168735 -195787 -151210 -136574 -114126 -79516 -25101 -2942 13127 -151138 -223364 -237237
27367 -237237 -202111 -170767 -168180 -112756 -36799 15942 45589 5523 35634 83046 66816 176342
27355 176342 85765 92450 80817 87066 187758 255105 187837 114919 -15897 -90416 16190
27344 16190 33153 14410 48937 21016 62615 88134 222237 279199 196643 64162 3751
27333 3751 59240 75349 48646 28672 76115 124916 90394 -56581 -64784 -69165 -31816 134350
27321 134350 162760 85807 46068 -23383 -49241 -92645 -186905 -119542 28024 98143 225252
27310 225252 172783 148736 183730 120110 170397 16908 -113232 765 6225 -47686 -33956
27299 -33956 96265 118653 70770 77616 103444 29701 21338 -5635 -75566 -41902 -34441 24612
27287 24612 103257 96166 99632 170808 156843 96331 115448 110723 44190 83690 136763 503
27275 503 -39551 -25661 -53294 -14997 -8289 -53512 -124044 -82026 -28819 23972 9463 -2981
27263 -2981 -14221 155056 189992 5098 65711 123022 84981 160522 214137 245129 345258
27252 345258 196776 58149 60245 -10031 3035 -66285 -108834 -41469 8412 45247 -23742
27241 -23742 -59796 -143046 -78205 30690 63202 63849 71277 98096 39883 -50983 -31508 -25529
27229 -25529 -2949 104464 101684 75294 93597 30126 77167 157794 -2369 -99955 8084
27218 8084 86492 100538 60722 -37391 21671 38713 87806 75144 65155 -4169 -19644 -49777
27206 -49777 -109656 -167178 -230186 -170579 -80226 -83297 3119 91855 -1805 -23873 -87574 24934
27194 24934 79107 -35273 -52065 -21572 38390 55433 122046 164078 214197 150079 79519
27183 79519 -25132 -143533 -156306 -134330 8597 91581 -17452 -100547 -120707 -62196 4297
27172 4297 -62941 -122708 -28256 95060 114156 185540 255560 159969 129506 153445 234406 151664
27160 151664 45461 96736 35244 118528 82436 93854 199929 114958 100350 96319 67929
27149 67929 -13022 -42468 26919 33466 -15606 33486 -32707 -106988 -110882 -179580 -119140 3127
27137 3127 134491 191971 194391 232223 185715 76775 30767 -173 -13294 -95508 -48509 23713
27125 23713 61374 41705 28605 59349 105505 78572 24880 142498 256378 258210 186734
27114 186734 231770 127248 -112368 -246999 -270371 -160022 -96499 -100955 -56962 39072 27444
27103 27444 182599 133468 91270 22075 74838 124498 144523 175839 87289 59068 15471
27092 15471 56095 56124 76550 117980 131762 62042 -13239 -35346 8280 -31525 107152 234398
27080 234398 234609 225709 153235 124054 90742 97310 133680 189201 240005 147901 141749 226742
27068 226742 327476 375039 340485 246337 66654 70509 155888 138030 112840 72057 7051
27057 7051 -36919 -150720 -242609 -267544 -180202 7453 151422 197450 120714 -3838 83023
27046 83023 254354 443835 289904 -27746 -18513 78606 81599 151074 94805 53925 117582
27035 117582 182785 129854 64125 182866 323698 251705 236136 232734 210374 236886 79380
27024 79380 -25913 -189682 -197455 -129209 -92645 -122768 -96018 -68266 -40282 -97983 -57166
27013 -57166 7240 29762 13319 -27954 -80348 -30999 -19085 -72707 -188471 -102910 -78755
27002 -78755 -47082 -31841 25932 -12530 -55981 -124912 -210246 -171478 -49671 75757 43748
26991 43748 -2258 -87012 4433 29306 102164 83536 58163 -22141 -98389 -93473 -7455 -83680
26979 -83680 -67716 -18947 112759 207702 272573 155620 133607 120497 144452 5483 -43550
26968 -43550 95444 90990 42971 -19209 35090 -4281 2275 6435 50976 103508 134676 94328
26956 94328 44081 139414 88383 -87071 -105275 -84094 25896 -1070 -162708 -123289 43380
26945 43380 87621 106191 76874 38807 -22371 884 241963 154234 113193 60974 -31700
26934 -31700 -15623 46802 -17467 -48835 -59693 -77219 -13063 133567 155623 78827 58132
26923 58132 119943 104552 12566 -34245 -64678 -115397 -97140 42666 57949 39118 183004
26912 183004 128393 61622 13928 25186 107953 39038 -38030 -737 79699 79368 -12138 -10750
26900 -10750 20664 -100071 -120334 -80037 -117893 -120462 -93692 -86020 -109511 -144775 -130473 -136002
26888 -136002 -112259 16941 18716 -39907 -18192 110542 238076 274775 150923 153655 43718
26877 43718 -34884 54000 35086 -92620 -161866 -28172 18959 -24414 36830 68060 69213
26866 69213 69514 43168 50264 -39219 -62004 -94082 -176357 -172577 -169529 -133336 -51172 -22260 37477
26853 37477 103564 162361 327645 308147 209216 87989 5539 89633 86593 11449 13364 -72455
26841 -72455 -54720 -13160 -90734 -35245 28066 -4516 16589 -68006 -58236 -25995 42859 82189
26829 82189 109187 99266 2863 -50712 82027 135637 101782 94744 152063 89790 83569 79692
26817 79692 52702 180151 148384 133769 201740 121146 36026 113546 234758 144949 106572
26806 106572 106585 103481 -1965 -148691 -174147 -54208 -12774 -71572 -23332 75562 49200 35199
26794 35199 122359 248358 273910 205277 47970 -152057 -55652 62399 73548 105182 59921
26783 59921 -3455 37268 293153 380142 213807 78183 30340 87133 122626 76371 166850
26772 166850 213716 126978 91440 1371 -20711 28196 153379 284789 362721 221455 19376
26761 19376 -108631 -149798 -114390 -146068 -8722 23845 -114907 -146707 13746 141001 160178
26750 160178 168410 187980 81533 39640 31092 -12118 17079 -33266 -175169 -317826 -198850
26739 -198850 -81462 -28264 123366 105609 24359 36314 -87261 -90462 39675 115346 146385
26728 146385 227670 193608 116507 50435 39732 68268 5480 1312 -47962 -181609 -213069
26717 -213069 -111407 -83912 -19270 -41194 -64869 -11287 103515 58138 36723 68190 104816
26706 104816 101726 131453 88047 38613 -28172 -102873 -19633 120969 -1732 -26543 -50739
26695 -50739 -72808 -65590 -126624 -106668 -172806 -184104 -26978 -34506 -92729 -30362 19006 10218
26683 10218 38020 -53409 -63832 -97456 -217918 -231041 -150202 41421 178412 256668 388212
26672 388212 279284 98769 -138446 -159743 -111938 -34498 54772 89844 -71534 -127789 -101622
26661 -101622 -53014 24068 -30869 -26088 -34147 -36971 -139033 -210366 -58169 73450 -14995
26650 -14995 75637 24541 -75333 -116652 -125492 -115500 -40920 -37602 -81181 -79768 -27122 -22785 -43984
26637 -43984 42928 138101 133057 208705 257033 182077 72184 -27231 -100942 -96397 -9966 66944
26625 66944 159498 168688 158710 129871 78400 71293 123022 137196 184070 181878 100680 95436 127184
26612 127184 174250 37773 17340 58587 53551 10268 -69707 -113941 -209049 -208815 -191598 -131219
26600 -131219 -47548 30356 16653 -65057 -9707 18881 -61459 -35024 48787 141005 109105
26589 109105 199989 239738 185672 70090 138576 231393 217381 42531 -5334 81338 39456
26578 39456 84156 77311 -10658 4203 136968 270144 260460 195949 190416 303031 236289 156726
26566 156726 75637 -36573 -52259 -57694 -131016 -169793 -115033 -21948 -46999 -12301 31820
26555 31820 84979 133747 87892 -26902 -70827 -83705 -37094 -67089 -3115 -32882 -135881
26544 -135881 -59598 209 75154 99762 114591 105162 81804 71389 124312 165616 100127 88107
26532 88107 188636 194486 160712 82992 -44867 -73481 75578 19185 1519 -34670 -60909
26521 -60909 13335 -93650 -132729 -72481 -120994 -235547 -248251 -74318 37574 69960 34400
26510 34400 11909 -21147 -606 -87297 -48192 -3261 -102625 -173437 -128150 -106785 -94588 5759
26498 5759 51686 67438 10021 -33404 61828 137673 110240 58144 7490 -32983 -45092 14750
26486 14750 46011 54554 136156 172408 94887 155567 108698 31149 35497 121132 106154 148263
26474 148263 95634 27362 -102868 -135097 -36888 -55647 -45976 -22368 91780 69544 -12988
26463 -12988 -217071 -291510 -238057 -67779 -55749 -49973 -18459 -64459 -93864 -55547 -30370
26452 -30370 -13134 -16752 44544 86820 104252 185795 214070 124225 214258 176052 69386 74078
26440 74078 77424 75084 78963 104549 178804 247699 352250 382820 255669 146308 92787 106646
26428 106646 70519 23788 -72311 6736 91903 81595 -110331 -184978 23758 103489 36100
26417 36100 -43667 -60816 19465 69523 182780 137015 12842 4950 105186 72336 98838
26406 98838 183619 204484 123262 73213 92389 119749 102194 141121 141938 33098 60158 64351
26394 64351 70760 92237 137417 125637 93088 11353 31383 52988 25946 -57764 -75991 -77977
26382 -77977 4289 56476 -7247 -6769 -65149 -4676 19267 54095 70440 217749 268237 259041
26370 259041 221855 99244 -19562 -86539 -45254 38298 69100 91318 14256 -14364 54203
26359 54203 52872 76825 109760 107463 17735 -22775 94784 164719 40647 -134547 -129518 -95263
26347 -95263 -56649 -20261 -118779 -173170 -65584 80203 -14868 -499 -36531 35784 85435
26336 85435 57959 66272 -14159 29479 -54234 -11175 73809 58019 47322 -36617 -161803 -110586
26324 -110586 -83901 -49870 -156191 -186182 -181057 -177600 -118672 -56852 -14604 56129 -72662
26313 -72662 -276927 -339936 -256096 -288810 -273115 -98136 -114731 -87404 -90598 -93885 -102766 -118046
26301 -118046 -159071 -217419 -153993 -16029 -4200 -83449 53810 173078 68837 -43310
26291 -43310 -1572 -8483 7708 -35543 -57485 71511 9066 -1378 117702 245180 286975
26280 286975 274261 118331 83556 53069 43310 93478 88757 167014 57321 40178 174652
26269 174652 125737 -32317 -108652 54402 -47422 -53672 -50627 -3160 -16867 119137 113528
26258 113528 54157 -91962 -118046 -122699 -77666 -66220 87347 211742 139336 66079 17598
26247 17598 67623 108769 178151 265144 235273 67793 -19187 -88437 -94474 -92092 -20060 62177
26235 62177 109208 68577 29004 65096 100832 184593 172028 129599 69241 -7506 59719 60788
26223 60788 127388 139547 145154 152074 175631 145213 154850 151899 130114 38056 -10799 96802
26211 96802 92706 144452 142708 64145 45419 -19975 -63538 69800 229654 257378 196300 139612
26199 139612 179637 171298 137270 175265 198514 160989 129169 49689 103413 214522 120586
26188 120586 18699 -55357 -145351 -117625 -32807 30190 -7352 -29753 -14617 -19068 -31293
26177 -31293 -86696 -118332 -105038 -59053 -121602 -78108 -96452 -55784 82456 128390 42888
26166 42888 -86246 -36154 -106525 -59910 -22025 24188 77372 66451 1598 -18468 -5789
26155 -5789 26954 -21135 10754 -59346 7849 34647 56249 23205 86132 99562 66101 77485
26143 77485 157654 136410 -21073 -46974 30686 22996 14087 4535 105717 103868 55065 116118
26131 116118 122512 87943 13339 -13811 -104916 3311 13433 32958 22589 35659 146154
26120 146154 137595 84201 61374 126560 155633 207966 239480 88474 -42698 -119070 -124988
26109 -124988 -6089 64987 2247 -117322 -136296 -80095 -9754 15263 73406 108161 116808
26098 116808 109304 147977 163456 61597 104811 247213 215175 114102 183091 76198 148006
26087 148006 185741 124150 74914 5643 -56082 -40106 -47624 -125294 -45569 -59666 -91727 -46892
26075 -46892 73314 112043 158876 211559 199995 90937 125403 202806 265919 199034 304498
26064 304498 264464 175373 120987 89251 -42632 -118014 -123410 -82972 -174913 -226257 -131520
26053 -131520 -98647 32775 55022 5501 -68427 -92455 -5110 -52331 86248 278994 316442
26042 316442 189275 1748 -32921 90842 44305 -80180 -129895 -104640 88333 50427
26032 50427 45372 42211 -40823 50716 54050 -35669 -83282 -72483 -61055 -8155 -3581 115800
26020 115800 225652 133972 159943 169196 221006 307590 368967 321741 211542 322813 300445
26009 300445 193355 185277 224937 277489 297959 167109 55142 31004 61039 7805 -21295
25998 -21295 -78072 -57297 30369 110149 141117 55355 31426 -71455 -61683 -18307 9144 40860
25986 40860 10756 2608 203305 172909 141165 16282 -116469 -171731 -20873 13544 -82908
25975 -82908 -199346 -231964 -185036 -129514 -129 -57234 -123113 -106719 -61774 -22436 -94956
25964 -94956 -45278 -143107 -95056 -62653 65206 218155 108589 40499 74956 17350 583
25953 583 -4284 -35575 -28249 -32846 -89668 -17532 -35099 -36046 131901 213477 40174 -69258
25941 -69258 -10271 -74841 -176976 -292703 -353768 -384761 -286391 -172238 -57854 117079 134120
25930 134120 -15083 -80741 -121913 -107481 -62675 -82910 56302 81542 -94195 -118841 -81939
25919 -81939 -61964 31510 244710 196390 22586 33165 -21604 -38581 -58498 -34181 -75353
25908 -75353 -62494 -26635 -39828 -11377 -3981 46478 132900 22391 -29728 39281 23100 -64386
25896 -64386 -99408 68407 96147 116691 92031 111615 137549 54914 -32104 113894 140753
25885 140753 47929 -620 -55119 -80146 -102973 -44030 -65922 -79242 -83 -98804 -208789
25874 -208789 -285122 -183087 -63377 -13018 18065 82159 184602 90817 3391 55393 64984
25863 64984 98388 -2226 -22952 -60358 4545 164696 226981 71299 17014 11151 -13188
25852 -13188 -108169 -110560 -72985 -3609 37869 -61593 -142634 -97300 -12932 -1684 -76271 -70050
25840 -70050 -26499 151480 172066 188524 -24167 -104061 -24712 10581 18488 42234 -6995
25829 -6995 -48715 -51844 -1884 4674 -61177 -197856 -207881 -231463 -163753 -2043 162852 223989
25817 223989 216452 107670 102046 99491 76505 99431 79149 138871 191502 323077 317536 353398
25805 353398 277481 86462 -5025 -52723 -183504 -126647 -52875 -5892 30952 -13110 -37843
25794 -37843 -45846 25347 -24249 -83717 -42085 -40913 -7224 126046 106748 146318 165065 146127
25782 146127 163975 155527 164274 211574 226048 213454 169366 128311 -30401 -68925 25980 25820
25770 25820 32526 -23279 -69708 51462 144351 128464 29800 -81167 -1481 37597 92780
25759 92780 115764 61730 159677 73824 -73663 3452 30416 -57433 -74431 -124754 -140909
25748 -140909 -161836 -123699 -165290 -117995 -50124 -42560 -3607 48149 80649 189145 180272 70778
25736 70778 51884 96323 1888 -20153 -11268 -4112 -23856 104054 147853 -2057 50281 124125
25724 124125 119166 133638 133473 176761 78125 -14123 -52949 -105569 -11512 -14173 -42500 -76990
25712 -76990 15491 24654 -24918 58426 88418 -40586 -35915 36946 78772 88544 33249 65265
25700 65265 91952 49425 -20433 28954 76143 130233 187984 100278 8773 36910 -46515 -103442
25688 -103442 -15521 48497 -35213 -42541 -54679 1880 43635 -10270 47122 46877 14836 28291
25676 28291 69724 200160 274223 231398 238130 181110 116940 12783 6492 -58265 19915 26322
25664 26322 -75919 -168916 -238664 -311542 -254577 -177208 -99678 -12447 57916 13485 -22630
25653 -22630 -51755 -126745 -82918 -86301 -115190 -4339 -2951 -106540 -78072 -51758 -43167 -184321
25641 -184321 -183895 -7061 161407 177018 88154 3370 -22024 5932 -45644 -109547 -31697
25630 -31697 53303 -28633 65217 86322 109748 102211 34102 250 66957 89335 130546 159743
25618 159743 174905 80475 17257 102015 114397 48771 58052 55732 85718 42108 110630 190220
25606 190220 164494 74087 78260 -9781 -60226 -171583 -201029 -178599 -157784 -89667 -52451
25595 -52451 -113327 -70569 -19603 -15905 56127 47763 -49113 -3038 51873 -40809 -25327 -73315
25583 -73315 -35703 5913 -70261 -27802 58254 31715 -51442 -35755 119251 172096 187574
25572 187574 306745 252340 186483 121068 11005 -27329 -102522 -32147 117632 143895 143920
25561 143920 39144 -106365 -152561 -243133 -211494 3582 96810 -68263 -10499 14869 65163
25550 65163 154732 37070 27109 17479 -86413 -41746 -32860 -38479 -57251 -111443 -55699 38390
25538 38390 209643 164659 121640 181190 140533 99243 120801 180951 76787 -79172 -137477
25527 -137477 -114389 -105281 -180983 -203798 -20247 7698 46060 -34058 -84063 76983 99893
25516 99893 19846 6564 39948 93254 -6184 -12089 -103166 19018 121495 74509 17838
25505 17838 120325 175848 -25975 -63950 -89394 -125552 -20981 99235 120380 109021 150096
25494 150096 85876 -23537 -24665 -84040 -59869 88508 73885 7266 -88876 -189848 -172250
25483 -172250 -43296 1462 -90591 -165010 -98287 -50385 -21848 -63754 -49367 -36017 -163812
25472 -163812 -101791 -57241 -83500 -40488 -45430 53023 54452 30937 61734 -86784 -179607 -90509
25460 -90509 -78681 -101762 -43136 -40773 -80905 22726 64150 -57134 -98753 -186771 -188009 -67602
25448 -67602 89964 70860 37141 -65087 -64641 908 146004 151926 -4967 1714 66872 41888
25436 41888 9541 -86809 -30324 89240 100357 36202 -20943 -104924 -104472 -117470 24692 93805
25424 93805 199941 237302 182235 21761 -13128 -68185 26964 -15420 -109977 -108725 -107747 14626
25412 14626 -38969 -6427 93993 141488 91561 128420 33449 -46814 -32467 -27663 -107003 47705
25400 47705 38379 57900 45531 46983 -4472 -2950 -29945 -29490 -28531 52021 58510 -1011 -90658
25387 -90658 -44612 32809 -4879 -30990 35390 77108 53685 62749 -2075 28132 135619 113918
25375 113918 91092 88474 84124 -28589 -50533 60260 156763 198833 80841 1209 -56784
25364 -56784 31126 87036 56995 -89085 -189648 -117321 68055 74762 86900 49801 142645
25353 142645 103617 92603 43392 75983 -12283 -40009 259 34629 125692 252231 210483
25342 210483 32300 -72669 -146382 -194543 -118445 71403 28684 172869 339221 300274
25332 300274 279140 238168 254988 242851 145643 -32906 27313 128500 158995 260121 237665
25321 237665 90655 45676 23510 45879 75158 122986 119889 128456 65237 -12086 -32794 77552
25309 77552 54085 14581 53988 76221 28911 -32815 22661 131173 206894 86572 15632
25298 15632 -9423 -33199 84129 63852 -969 8 -80044 -160793 -165491 -106578 -96475 -56329
25286 -56329 -106481 -117783 -134023 -65327 1368 -53157 -27244 87880 29297 -74705 37245
25275 37245 101120 78722 3872 -95779 -43662 40356 34301 5635 -1399 -35125 -104730 -52843
25263 -52843 77453 109897 121104 99671 80825 314 -48562 -53848 -28107 -16929 39567 40332
25251 40332 68321 100931 137965 99973 12813 -70182 -32034 -101157 -123391 -165138 -136953 -37632
25239 -37632 -13218 -972 7012 -70330 -76638 42953 17564 -24841 12462 168028 139095 -3386
25227 -3386 -66351 -127190 -95434 -66177 -130323 -127271 -4196 17345 -4987 -74744 -175743 -220449
25215 -220449 -170263 -122883 5211 81042 112478 27636 -17253 58455 131762 222534 309506
25204 309506 165738 -140189 -172703 -68754 -62429 -35787 -48920 -139011 -123899 -21554 32393
25193 32393 80543 105366 33531 33426 39735 69227 63946 -40115 -99333 -151388 -151237 -141706 -26869
25180 -26869 -46750 -50227 -72550 -82753 -158233 -136617 -19038 -29549 12684 -5674 24290 84220
25168 84220 187475 170558 219009 194890 33104 -85719 -111058 -168209 -87227 146488 257298
25157 257298 266143 258638 98684 -112310 -14307 12031 -67872 -199035 -262471 -186804 -22088
25146 -22088 94350 151571 128194 132471 101526 31026 1702 -23615 70846 207724 173194
25135 173194 18701 -85801 -62790 -59977 -139737 -7535 114466 70347 60836 -11729 -14956
25124 -14956 2494 -97347 -260378 -212890 -251823 -245223 -84782 18713 -5171 2799 19625
25113 19625 86604 106384 -77682 -32329 69533 95956 103528 159987 135226 50150 113707
25102 113707 75605 -39271 -132611 -59006 -53327 32254 88934 100241 56246 -11221 -29220
25091 -29220 17971 -16237 98039 62045 54335 39839 -24271 91916 83077 23157 50694 -43202
25079 -43202 7166 33573 101483 96111 69834 86385 60399 56310 48265 37422 -13032 -91704
25067 -91704 -6779 -41715 -154039 -92903 3404 26411 63233 122622 157292 181361 66692
25056 66692 29998 50272 80794 55568 138495 148170 44168 -134139 -190471 -123374 -95287
25045 -95287 -102444 24555 92525 144240 235293 125930 77577 3948 -31059 62491 130380
25034 130380 134632 53936 23879 -29022 -210438 -138531 -62197 -72576 -126073 -83553 -67927
25023 -67927 -69702 -34658 1565 10131 98941 93580 57968 152037 173899 88272 22870 47646
25011 47646 98285 191319 170967 21994 -3472 49059 -47282 -46328 -91372 -144403 -16657 -78239
24999 -78239 -162338 -121247 -45218 -4181 -9190 28952 133036 174672 211681 109660 72177
24988 72177 63788 88133 69110 19565 -76945 -8063 -4180 101362 156137 116066 13839 50593
24976 50593 132892 167195 64708 55901 12349 -91580 -108690 -11633 83508 170274 103569
24965 103569 -34109 -24021 95662 134313 145612 69250 -14554 61494 4977 -116212 -102068
24954 -102068 95079 74573 126022 111979 35770 55457 62596 40232 -35787 -81292 -76727 -131793
24942 -131793 -110262 -72800 58643 141527 41482 95113 58078 -18584 28372 -44500 -190233
24931 -190233 -218342 -95285 -57738 35982 137763 52523 72992 72655 89541 107390 124961
24920 124961 75700 -7585 -56201 -154314 -209523 -155154 -106145 -111898 -2667 -3053 -6257 -31539
24908 -31539 -18274 -72699 -28701 -36867 -78935 -111049 -72834 -98773 -103525 -152865 -137997 -126297
24896 -126297 -52205 -42542 -42277 -31962 -93341 -58733 29558 42191 136976 108298 9615 -54193
24884 -54193 -9100 64724 34504 34084 157490 98892 -30271 80481 87203 56347 37622 124473
24872 124473 220595 256255 262848 252289 211952 64857 24974 -17540 -22241 -78024 -7772 76516
24860 76516 136794 139024 29730 -34230 -100259 -24758 -5576 -43089 -81929 7966 -62182 1376
24848 1376 -49752 -91819 -164150 -236399 -195855 -27175 -17687 -35103 3146 -35629 31441 40286
24836 40286 46693 67783 36291 -74106 -47475 108928 85419 33253 -7923 64547 84910
24825 84910 80629 -56968 -98058 -158984 -96375 22849 14859 -47944 -27629 -44747 11923 28050
24813 28050 73432 40148 -60631 -29795 31113 95977 5665 19161 -79901 -177642 -121014
24802 -121014 62671 136353 82274 -5801 47587 111919 161981 80832 -83455 -88156 -87791 -165043
24790 -165043 -189111 -143837 -69788 -19570 -92168 -136706 35065 -78686 -99063 -107287 -130917
24779 -130917 -34282 114918 50400 42837 64058 -39017 -117235 -153221 -138937 -46065 -31146
24768 -31146 -11752 52530 96562 137428 146237 186541 51723 17027 92137 -44059 -43295 -38688
24756 -38688 -67401 -99120 -30362 -95571 -137366 -109748 -49275 -132314 -128736 108 66658 3531
24744 3531 -34904 -16206 29597 -41108 -35630 40061 62043 57018 10478 -32780 -90455 -64447
24732 -64447 -118913 -164564 -220182 -251729 -163591 -71667 4963 102789 121130 81138 100375 120417
24720 120417 105427 100554 51848 11093 13240 34023 63468 9514 43287 53721 85441 55588
24708 55588 -35703 1139 35940 -10422 52988 146004 29364 9646 -65535 -100798 37173
24697 37173 89802 206571 197015 100881 68857 107594 131507 105697 3486 -40322 -44116 -11458
24685 -11458 76715 -102295 -229745 -191298 -36493 52022 117934 120284 9620 -89797 -92329
24674 -92329 842 80776 121995 128570 117998 139089 186417 117569 22837 40559 51096 69533
24662 69533 105516 93366 36270 106330 31629 -36530 -52175 -117703 -64810 -72539 -161668 -173102
24650 -173102 -126420 -10915 30104 20558 -3729 -59018 -40653 12525 9769 29300 21725 -16843
24638 -16843 -111439 -25465 -16930 -29927 19923 178421 243110 208383 85961 -59939 -34908
24627 -34908 89639 55709 40281 6354 -32905 -4844 19056 61857 194857 64760 45935
24616 45935 -73295 -75431 -91085 -141480 -94227 -105476 -269799 -214723 -74809 26907 49908
24605 49908 46243 12967 27594 67154 126155 44717 -67338 31250 19569 17001 55089 164762
24593 164762 196102 124513 70098 56301 51839 60323 32156 85013 40074 -33329 -30968 3092
24581 3092 -30831 -103811 -79985 -146986 -52908 12576 3236 -69094 -51008 31747 102914 159117
24569 159117 207060 139968 99088 19497 -144131 -243743 -207534 -257344 -217067 -86065 -57334
24558 -57334 -64717 -138109 -154332 -43036 36490 -63725 -187761 -250595 -259546 -40620 27167
24547 27167 46799 147965 140855 5089 -66846 -85996 -47205 14508 58769 -50555 -82175
24536 -82175 -68709 -27240 -11943 -70550 -155620 -100638 -55915 -11150 32209 -63751 -106853 -166047
24524 -166047 -117272 -6071 86797 107709 152694 177538 231859 248517 127265 56496 -42405
24513 -42405 -112908 -157926 -176942 -178896 -67428 -27837 -108062 -147489 -132089 -149457 -108550 -110762
24501 -110762 -198198 -103538 -100277 -117784 -48358 3413 36777 82854 92588 -41271 -33356 154519
24489 154519 86210 -109687 -108746 -11622 33587 66350 147238 81429 15328 -94710 -161693
24478 -161693 -54695 127576 166703 126715 118245 34721 -153401 -201262 -157808 -122958 -95164
24467 -95164 -57718 -100414 -111254 -190839 -282307 -178226 -11273 10144 -52703 142725 176983
24456 176983 257203 285406 286545 107264 -19107 -18608 15077 6729 189040 272578 152189
24445 152189 50928 55379 -43695 -35754 -2908 -98380 -21011 63822 67216 135816 149440 127697
24433 127697 133554 88427 66395 -35759 -88446 -11772 12939 -27350 -88610 -34965 45606
24422 45606 41099 2022 -2313 -19929 -96578 -185527 -219462 -151411 -90753 -162263 -256146 -234358
24410 -234358 -132622 -87250 -141832 -120431 -156784 -170811 -90902 -129310 -108914 -126241 -127774
24399 -127774 -14071 17769 -2142 -37646 -42690 -34983 -122154 -73672 -88873 -131066 -4887
24388 -4887 112731 139509 28064 51695 -55445 -115034 -119140 -57129 22615 460 -126943
24377 -126943 -144806 26196 -13224 -23535 10313 -40816 -34363 -108366 -160235 70598 158962
24366 158962 81301 -52018 -106565 -83104 16375 192064 182195 57791 80453 69828 80179
24355 80179 3817 -8450 70232 90664 26987 56463 80767 80158 173745 156756 34425 -64584
24343 -64584 -46825 7296 14231 33996 6139 -25234 -95553 -172554 -75738 -118797 -76607 -113864
24331 -113864 -211748 -179853 -62619 17190 -8136 -164403 -241493 -224309 -195332 -72608 42258
24320 42258 43786 118398 19272 47849 -56993 -91326 -203621 -247434 -178004 -38095 -133151
24309 -133151 -287367 -370720 -233486 -105470 -140578 -40477 -10226 -104227 -151826 -165710 -173556
24298 -173556 -146862 -144895 -72273 -6708 25669 70844 -11801 -58632 -56204 -90204 -67729 -53433
24286 -53433 24460 127565 133580 122998 91977 71243 51255 -32575 -42298 -41083 7715 114724
24274 114724 43881 -34800 -14908 25111 77396 172364 184307 17985 32056 102359 65510
24263 65510 169450 165875 93814 16151 -16910 46544 86578 131240 121012 103368 180427 181111
24251 181111 105313 130411 190961 107326 53812 11071 18809 -135124 -38598 -38897 -23555 96881
24239 96881 169551 52571 42498 17842 -18312 -66370 6819 24246 8163 -116812 -199972
24228 -199972 -191636 -3099 61641 -11181 -57384 -120896 -155649 -220533 -217211 -247901 -214903 -50028
24216 -50028 -27250 -6869 -9067 -81577 -211550 -221226 -236608 -229627 -132283 -26299 57740 163692
24204 163692 194649 214166 198147 173354 110472 42782 52383 -33201 -54161 -103341 -117208 -165424
24192 -165424 -200272 -185415 -108730 -129680 -104884 -88106 -79782 -67010 5857 -11058 -7644 70935
24180 70935 43373 -57295 -135560 -143114 -144091 -132807 -24954 83189 118525 35613 68499 53723
24168 53723 -101709 -98319 -67102 -56315 25238 17181 -91037 -17749 -86149 -30546 84985
24157 84985 73678 -5990 -84359 -22252 -25364 -99469 -81997 -38803 19463 63268 84888 73767
24145 73767 55006 -28528 -21595 38159 66949 -2489 -33640 -1218 -24084 2521 56258 11305
24133 11305 -3305 64386 26004 36915 42022 22035 -51274 -116099 -91915 -3958 87510 173142
24121 173142 164706 62626 -58329 -91237 -111316 -84773 -137173 -73387 -6287 94058 -67847
24110 -67847 -173474 -205138 -55297 45689 49148 45928 70898 95870 -3802 -47058 -77309
24099 -77309 -114285 -37164 54804 140970 72180 39795 50408 -22499 -32077 -95762 13012 37395
24087 37395 -46567 -111071 -56399 -10968 32470 52985 45527 -78827 -205756 -280478 -292922
24076 -292922 -70774 158179 134010 56531 10033 86372 76469 -62384 -185631 -263673 -219841
24065 -219841 -315627 -289486 -194964 -110622 -25831 -6133 12603 -95175 -139374 -270322 -286555
24054 -286555 -183336 -61653 11888 26044 93130 79661 -10092 -95381 -52958 -8462 15541
24043 15541 13600 76496 -32191 -159928 -234550 -146275 -58130 -61003 -30287 -153959 -195383
24032 -195383 -76633 -91752 -228709 -301360 -159136 -22096 47769 111088 96977 51729 15654
24021 15654 -107429 -255481 -218227 -114440 506 93060 70314 58926 -9826 -7453 129432
24010 129432 135067 47837 32819 20778 -9186 67498 113308 103520 27655 -50863 -27323 15471
23998 15471 29691 -53375 -28918 30669 -23358 -180249 -147914 -207597 -124067 -77757 -33587
23987 -33587 -85333 -85045 -65807 -81507 -86310 -32507 23190 84357 -7325 4380 15504 -11514
23975 -11514 -19772 60603 100908 130006 66805 -92411 -56729 -43700 -111707 -17578 25822 105433
23963 105433 137044 115391 93294 53554 -13958 49779 44431 -24132 -151340 -140790 -110323
23952 -110323 -69191 -102691 -53575 37952 -12508 -142291 -40203 -10059 -156223 -250574 -76358
23941 -76358 68893 140178 21237 37207 50325 56438 45484 162093 206643 105919 -8179
23930 -8179 1719 -39549 -119226 -144690 -121317 16650 40072 -242 53220 65909 198043 210950
23918 210950 70263 -8363 -44152 -59796 -48516 -49961 -169933 -316179 -254030 -152067 -46795
23907 -46795 -108510 -132927 -164164 -8047 17098 -81006 -138217 -98325 70667 147311 83515
23896 83515 83316 23101 -42850 48886 88958 89386 -39187 -85365 7383 -12776 -77481 -66583
23884 -66583 -10468 34373 12196 168 29751 -39856 -107193 -75692 45738 138803 181073
23873 181073 123125 89496 -46671 -73866 -53569 -128495 -175804 -55121 -41339 -110347 -116861
23862 -116861 714 24244 77463 73790 -8506 -18126 65847 -2287 -62698 -84197 -41897 -56167
23850 -56167 -95638 -47241 199 -39137 -46189 -63435 -96531 -83198 -87930 -99057 -126374 -181964
23838 -181964 -104215 -64525 -58205 36274 105941 10302 -43214 12542 51766 8786 9532 73261
23826 73261 103744 18947 59410 123956 102019 -60851 -84407 -27755 -115268 -220496 -156142
23815 -156142 -109161 -43567 9131 56902 53361 -17411 -151983 -261742 -254126 -130987 -126204
23804 -126204 -83365 -72826 -119470 -86819 -81066 -82044 -30423 -15485 -160409 -133071 15598 -45274
23792 -45274 -65981 -25235 -114771 -139934 21388 2715 -178863 -286620 -304842 -235340 -183121
23781 -183121 -228123 -149247 -32010 -30658 23445 81630 61744 39391 -103220 -115202 24442
23770 24442 78081 10046 -141623 -201862 9954 99686 54363 91186 98940 -24780 29745
23759 29745 82619 51807 -19674 30665 -18598 -67543 -181748 -229814 -228163 -216025 -127927 -6740
23747 -6740 -78905 -193567 -111886 40663 67645 42219 64086 101094 39190 -123974 -208473
23736 -208473 -200393 -87057 -141438 -256427 -163660 -115734 -98310 -218099 -177807 -55444 -19016
23725 -19016 -40122 51882 164687 230715 235474 171332 160844 11972 -78052 -149987 -101207
23714 -101207 -92647 44846 113564 184358 97730 -78610 -97155 -3176 67830 48098 -81630
23703 -81630 -58877 146977 62589 32926 -45512 -171709 -178046 -158785 37302 119452 169486
23692 169486 84373 93833 19431 -48092 -12419 -119468 -183743 -73927 -14287 35419 121694
23681 121694 107413 -71600 -116806 -21082 29365 66683 54232 -26171 -214627 -275968 -183394
23670 -183394 -214014 -56836 59488 83861 113988 162764 193429 -11134 -166192 -43305
23660 -43305 117044 144505 125816 73546 201618 254083 191897 51423 -124918 -24776 81527
23649 81527 72148 46359 -17603 -44001 32658 24649 -61208 -135481 -181949 -127796 -67762 16499
23637 16499 70655 133107 -63813 -217013 -131213 -110545 -186406 -119848 3967 -26425 -34800
23626 -34800 -38401 -147213 -151765 -140554 -93369 -28849 -14088 -23048 -82136 -133858 19562 174652
23614 174652 72840 -48349 -61344 -142008 -150531 7991 29516 -19049 -114103 -177398 -162392
23603 -162392 -186391 -146059 -85271 6385 138769 96205 8753 10257 143083 114063 74572
23592 74572 225100 165418 -59060 -182996 -163414 -173449 -37469 95100 131531 102463 68822
23581 68822 -47134 -169292 -74864 -50597 -9304 19691 1506 -45625 -105019 -65753 39592
23570 39592 155247 115363 53639 -50849 -152806 -81038 72713 122888 184411 142596 93411
23559 93411 -42030 -125502 65191 259229 339272 195566 188804 138496 61609 47282 64900
23548 64900 87237 130164 121769 23467 50667 169020 234585 239346 235053 171795 202995 187399
23536 187399 86194 3558 -41363 58207 109354 113825 86916 89330 -104992 -191866 -251104
23525 -251104 -238286 -257573 -130972 -156460 -218192 -126772 -112192 -97923 -61797 271 8438
23514 8438 -99652 -166168 -299194 -176937 -123008 -86802 -21352 61556 26730 -44316 -96064
23503 -96064 -142808 -200192 -121077 -98358 -49488 -20474 -105199 -82462 -38855 -136879 -110294 -10452
23491 -10452 -2601 -66807 67811 97805 31050 -12818 66222 97659 17788 28888 -48003 11190
23479 11190 3641 -68463 6287 81711 67299 116954 34528 37038 13104 126600 104574 51485
23467 51485 67088 -64449 -108159 -17515 74989 143287 113780 108501 129196 55067 69408 107116
23455 107116 81186 71248 107875 6313 -67570 62469 108632 52861 57340 141258 164067
23444 164067 97231 -16411 -28167 -172465 -84716 19365 45659 47625 27346 19109 -7748
23433 -7748 -125362 -146211 -92793 -80666 -58387 18292 -23042 -102675 -85718 -38800 -132580 -263071
23421 -263071 -258390 -140244 -153324 -170278 -169506 52705 23053 -192499 -168726 27281 24176
23410 24176 83769 85493 -4374 -2089 80629 159338 178357 71977 -52055 -112173 -2346
23399 -2346 -26004 -68362 -24994 -124931 -161543 -68271 73330 183551 162711 64745 23998
23388 23998 -100453 -89916 -27193 -15006 7798 -22764 -12786 47970 167286 215498 159083
23377 159083 92443 53047 123007 102751 61905 74476 80007 38600 -44540 -12180 -24777 -101539
23365 -101539 -135057 -122007 -99478 -91300 -28747 42579 109633 203115 138388 104129 46456 -58513
23353 -58513 -130960 -199996 -207487 -138614 -123281 -158748 -235140 -162301 -153516 -222838 -56294 -94419
23341 -94419 -89087 -26630 4370 -74760 -88969 -30692 -18376 50503 46004 54848 92280 -15399
23329 -15399 -32721 -110387 -307506 -298276 -159712 -48141 11557 10643 68214 91362 54984 31231
23317 31231 -60149 -7573 71808 66501 -13649 -58467 -138239 -47447 61131 112981 60707 -19199
23305 -19199 -168654 -220781 -167521 -73290 -123234 -200198 -220799 -200622 -234879 -287623 -203038
23294 -203038 -83080 -3636 -63787 -40432 -30483 -31974 -26905 -30608 -128904 -127516 -124098 -118835 -88005
23281 -88005 -123444 -190901 -142624 -177621 -236928 -184346 -203335 -74991 -1876 -20221 -101264
23270 -101264 -105620 -72700 -132002 -25824 -7139 -72029 -48661 75085 86833 96440 125211
23259 125211 -20171 -178482 -106513 27218 91491 75410 118349 25906 -40173 -29725 -11478
23248 -11478 50049 8944 -60123 -19376 66544 142115 155636 219973 296200 216533 91834
23237 91834 87738 202635 81342 -37129 14378 121482 83162 79876 81837 96218 -42678
23226 -42678 -19183 29739 15319 -214 -50018 -7704 -23543 -141326 -109080 -168840 -158722
23215 -158722 -2666 174451 143590 126694 116629 93515 66619 -35011 -70096 -3523 102306
23204 102306 3451 -216754 -204172 -106455 10477 113165 -5393 10311 74223 134528 78480
23193 78480 56058 123987 124459 59421 171741 172457 1472 4654 58061 5306 -27709 -108390
23181 -108390 -197317 -219845 -106371 29502 74053 112878 159579 90567 48530 32067 82588
23170 82588 275 -49646 -195187 -194480 -21849 -151714 -98777 73258 136986 65740 -23767
23159 -23767 -9930 22344 54201 72643 53703 48565 33140 -26427 50902 110411 92843 6690
23147 6690 -39291 -175308 -310530 -255940 -56306 -65043 -49895 37165 88347 -35028 -21088
23136 -21088 134821 130288 103713 124693 144785 207003 311543 180634 63338 100715 144595
23125 144595 22272 -56697 -2379 3211 -41250 -44408 -47360 -83079 -198640 -252190 -229668 -265643
23113 -265643 -319615 -224264 -92577 81365 49498 -109225 -64946 15786 73620 -11163 -187836
23102 -187836 -167815 -84891 -122242 -193303 -104509 -22203 -6429 -135629 -131179 -95112 -139352
23091 -139352 -103967 -56168 1550 42415 13303 -60256 -127245 -94199 25844 100129 -22990
23080 -22990 -34072 27731 19559 2909 -20147 -38714 -11012 -34150 33082 91589 116 11343
23068 11343 -70357 -45952 -52961 -96768 -148455 -138052 -224720 -208063 -145240 -148353 -211434 -161949
23056 -161949 -77041 -72401 -6434 52807 93237 4618 37193 198691 187221 78418 74473
23045 74473 82202 136462 208442 200239 176682 282233 185561 -3429 -38383 26073 73706 182993
23033 182993 303028 206682 -2820 -112407 37845 255237 291691 217135 44382 125931
23023 125931 184433 59148 21367 72484 74257 90889 85081 61345 73920 100984 78198 -41589
23011 -41589 -149733 -95526 -19469 -89991 -205259 -65214 -14305 -21273 -98630 -14098 89437
23000 89437 146100 167836 198609 120037 42911 28551 72698 161430 92916 50199 -27923 -125038
22988 -125038 -211519 -190632 -220528 -138774 44672 -19908 -35608 107323 113981 -8078 -26074
22977 -26074 -41787 -123398 -188395 -183042 -138959 -25049 25322 -115522 -247459 -226724 -77448
22966 -77448 -27237 10747 53692 -105153 -126185 -158099 -135873 -108667 -7056 -36385 -36135 -135470
22954 -135470 -274409 -230015 -80594 -45320 -143773 -179477 -214516 -207137 -74681 -84565 -113979
22943 -113979 -146620 -56972 -80875 81916 101295 85178 9471 -118202 -161973 -94610 -48229
22932 -48229 -230250 -153500 -44319 -5055 40695 -35038 -81433 23687 -73129 -90615 -74506
22921 -74506 -67309 12378 164102 167220 36426 48521 -43894 -45409 75928 155878 122567 75058
22909 75058 71934 100797 80693 107931 9380 -61245 -46883 73539 8610 85094 216332
22898 216332 314921 261434 113379 -5683 -27221 -80828 -120383 -112896 -143592 -211878 -263404
22887 -263404 -244658 -297228 -274568 -126056 -179859 -223043 -211080 -198351 -152363 -137638 -129507
22876 -129507 -54968 11890 -17004 -4265 113376 67583 70099 24727 39830 -80171 -20209
22865 -20209 15950 -92234 -115034 -120925 -135576 -97091 -71810 -34304 -37540 -73859 -61086 11066
22853 11066 -49122 -191355 -174464 -98086 -98330 -46026 37167 106699 118249 113849 57102 119936
22841 119936 46611 18243 133148 217979 195479 294302 328445 259554 176817 -53921 -174394
22830 -174394 -172587 -127038 -75940 -20737 -27483 79876 118934 174941 148283 138981 153381 114590
22818 114590 57301 2210 -17236 58369 120404 117961 12861 35155 105817 205972 200887
22807 200887 251931 161521 -93331 -186580 -99219 82290 25113 36621 -85234 -174163 -193627
22796 -193627 -172909 -101339 -94386 -101278 -133472 -162626 -186241 -207249 -223231 -210198 -89725 -69066
22784 -69066 41254 37703 -60406 -140708 -139314 -211443 -227773 -168230 -155049 -69410 -101243 9173
22772 9173 -18566 -138028 -97920 -13314 50891 12113 33590 123038 150579 149073 174948 143765
22760 143765 124198 136884 76189 89760 267054 254524 202848 51906 -148157 -77115 -41299
22749 -41299 13002 75546 26239 57868 -54546 -72229 100556 167780 223317 213185 278786
22738 278786 277470 250205 221106 175832 92660 112885 127354 -10181 -15525 98217 125445
22727 125445 113152 -11316 -10134 50085 -20613 25696 99557 -1781 53475 362 6005
22716 6005 -1769 -45840 -3313 -45172 -118473 -202270 -211442 -174943 -91097 -37873 85648 174828
22704 174828 159840 76593 81398 7338 -95066 -69704 -70669 -56357 -58557 -137495 -171911 -164250
22692 -164250 -94257 -2456 3760 -11623 -35176 -4282 45277 110680 152889 104347 145904 142028
22680 142028 243755 283495 242990 141805 -15779 -75094 -139875 -34172 101081 120784
22670 120784 172537 66702 71110 148458 169542 142125 65641 -48801 -90141 -88258 -55971
22659 -55971 22146 32161 57364 84688 52712 12025 57783 68101 103585 142439 98162 32555
22647 32555 -15445 119799 234880 170623 126720 59512 94875 -18485 -8697 49316 -22966
22636 -22966 -214449 -236166 -144135 -40560 14153 -64658 -11613 -12024 -56492 -129190 91
22625 91 152060 134731 193090 84144 76805 124177 212036 71806 -57272 -8488 -82670 -218179
22613 -218179 -197776 -96545 -56962 -104949 -137467 -198962 -144624 -154042 -137557 -149569 -25287
22602 -25287 115593 126348 93376 56465 -854 -62152 -92651 -91215 -33877 93513 32189
22591 32189 26472 -25708 -33235 -24720 -76981 -29705 -17890 -77698 -93906 -42461 84867 142657
22579 142657 101638 132277 125400 -28927 -31819 -26887 -39666 -29889 -30235 -82772 66733 126502
22567 126502 84962 24800 17029 83477 85708 85524 25212 17993 53483 93971 67358 42087
22555 42087 176374 142459 71285 146339 140661 167305 195694 76882 -6457 27830 78960
22544 78960 87060 122136 65163 105498 105405 88744 122739 63293 86905 2037 -147426 -115017
22532 -115017 -56360 31393 97648 66739 61104 -25174 -32062 -80936 -103881 -141004 -113191 -79986
22520 -79986 -27844 43521 65693 68375 41208 85058 34126 15912 -60135 -184858 -219087 -160039
22508 -160039 -85200 -110432 -75956 -44848 -80441 -137386 -36901 -32473 -137402 -203614 -290528
22497 -290528 -265605 -48752 -40616 -108378 -185284 -109780 -177663 -258640 -243506 -242257 -260798 -201307
22485 -201307 -161280 -60638 -22610 -148369 -238000 -95145 -26520 56757 24479 -68374 -83599
22474 -83599 -74879 -63933 -96744 -86962 -73468 -33614 96111 122219 227183 178546 126341 26836
22462 26836 -22384 -121541 -207855 -193309 -203993 -220016 -185348 -133393 17753 -15333 -141796
22451 -141796 -121866 -59125 -89116 -57875 3045 -16063 22744 18509 1239 30395 491 -80085
22439 -80085 -112657 -53814 36765 -4652 47792 101893 25868 20209 47480 57700 -92260 52379
22427 52379 70375 -84971 -156952 -61836 -85879 -178433 -189643 -67332 29799 9363 -14957
22416 -14957 47363 152938 137537 193896 136100 141703 141255 -20958 -35923 -71569 -52046 -41490
22404 -41490 17444 77239 161042 71341 23835 -78025 -108527 -108936 -56988 52573 145791 116544
22392 116544 -43053 -108216 -99962 -89916 -95409 -116086 1587 21145 24814 -28026 3344 -37185
22380 -37185 -59329 117956 122226 26979 -59384 -20924 31395 -38030 -163717 -187051 -40641
22369 -40641 9972 88848 7302 -41790 -82222 -33650 19616 43870 48618 8611 -31293 17132
22357 17132 32986 -37217 38573 97014 128620 152372 -35266 -129277 -58832 -78499 -48767
22346 -48767 81427 -80098 -160554 45210 65874 11816 -69701 -83679 -63509 -131923 -103541
22335 -103541 -14903 96087 48113 -89059 -15800 124501 99334 123411 26705 -65736 -93117
22324 -93117 -163282 -153017 -212406 -136903 -151185 -50645 -10224 -64263 -173598 -126585 -20744
22313 -20744 42198 81824 55069 62847 115003 70216 147753 270859 225256 155916 173626 58719
22301 58719 109286 101310 195386 173627 102815 91091 4354 -96479 -147770 -153316 -25528 90506
22289 90506 39543 67311 31107 -21604 -29542 -25923 -50623 21888 102535 62639 -22627 25792
22277 25792 17897 -65 -87498 -74780 -98527 -34051 56710 66915 84432 115694 55560 114361
22265 114361 96902 120145 105548 78857 59650 -32548 -22207 -42313 -125359 -64374 6900
22254 6900 -13052 13342 100975 104903 155876 161398 139459 115875 40812 69627 251269 198946
22242 198946 195650 198875 267408 231957 97063 -52182 -62497 -57246 -63554 18746 -38883 -83198
22230 -83198 -67953 -85128 -84222 -107613 -167960 -73165 -30125 -14389 27957 -3086 35260 116764
22218 116764 191178 50378 -4656 40560 75054 77351 82095 162041 116500 52243 25081 -195949
22206 -195949 -169547 -135071 -135676 -72951 -102730 -136394 -104018 -111271 -180802 -104886 25150 66360
22194 66360 63793 130148 186515 188401 76932 83517 116203 95970 136784 124401 57741 54902
22182 54902 -891 -21658 151827 198175 170909 73301 -56261 -42855 65439 16779 106825
22171 106825 134887 167415 170538 161935 58766 -9916 -101138 -88407 22076 -53707 -43482
22160 -43482 -41449 -125542 2561 -77705 -94080 -20747 -78741 -49645 32076 64604 80544 36639
22148 36639 2624 -54919 -79389 29081 185095 158222 171457 60200 -56732 -30724 73958
22137 73958 48346 63763 52011 33718 -12261 -5378 106572 224994 172918 38271 135095
22126 135095 147377 95098 42536 160817 113407 51002 -53948 12510 79216 -27306 -107018
22115 -107018 -149564 -98867 -18738 -20029 -103662 -108152 -110176 1930 84417 123499 38511 4358
22103 4358 -49013 -84047 -248948 -160904 -133280 -93538 -15144 -22544 -18188 161508 242052 145428
22091 145428 -27190 -49214 -18857 -93461 -56800 15592 66276 29628 -115925 -91082 119071
22080 119071 94012 -75502 -132703 -3423 109310 77706 -77879 -101923 -13370 -15145 -73003
22069 -73003 -27653 -29648 70427 104227 118145 118236 127795 102182 97839 275667 318519 262638
22057 262638 94664 174087 120493 143053 202607 120014 76364 -54387 -18873 67126 121970
22046 121970 100165 62365 138900 168128 206596 243988 358022 391722 321223 241054 51168
22035 51168 -83424 -42745 -27991 20964 -10369 12328 94875 104072 128792 47571 -7415 84413
22023 84413 125257 133352 45782 33417 116775 34707 30942 73304 76384 179038 187856 128175
22011 128175 183601 122460 123117 110346 58571 87650 107312 119630 160170 192233 126256 60349
21999 60349 -12660 -78011 -32903 -58803 -110569 -52211 42129 82988 101687 182434 123482 -26943
21987 -26943 -54562 -53832 -142716 -49158 6395 -148373 -235161 -50121 -1195 -14677 48976 118646
21975 118646 186276 202436 98734 43387 49197 93046 18506 -22928 10515 163309 114292
21964 114292 -8907 -55182 -2513 70255 127237 194143 230544 260984 280706 199755 175658
21953 175658 170448 246536 241418 174640 143537 119445 173249 202055 207854 174782 194650 290082
21941 290082 206893 191514 210987 108053 197471 140905 -29150 -34166 -54527 -49362 69207
21930 69207 142990 73934 110967 152602 176787 97814 -27055 -47429 85998 88702 -23992
21919 -23992 60454 48796 16389 60636 125964 107390 58607 109834 135536 141177 141731 116908
21907 116908 26596 73034 11764 132906 75387 136280 221581 213522 198010 110017 74882
21896 74882 1429 -21075 62953 75759 74191 94082 180713 259862 184205 225657 300041 352645
21884 352645 357956 281906 268900 215485 185003 41511 -34586 -43587 -78607 -48122 -87238 81703
21872 81703 205921 93180 147974 205529 139460 32197 17004 82671 142317 235656 208291
21861 208291 32041 -62447 -34446 -52173 -81596 -90192 -71676 -2048 162514 268440 202342
21850 202342 50992 -54648 6314 114313 95738 139413 103499 56931 224086 186931 139700
21839 139700 164034 116824 135281 133951 141367 205485 171637 135507 198172 277723 272659 187544
21827 187544 118372 39913 -71452 8049 -6586 -78297 -40361 51244 44494 120473 216178
21816 216178 134273 110234 155887 210396 124038 57520 -72270 -74153 -5511 -20736 -36013
21805 -36013 31151 71578 120597 70827 101144 228881 138407 17457 14014 -2512 -90547
21794 -90547 10160 146584 72893 13421 23325 32186 59019 116847 216719 288157 184907
21783 184907 13912 53345 39758 4829 28896 169124 343447 378904 338889 234261 157939
21772 157939 219137 153233 191311 213900 284154 333470 360391 169187 83535 121044 79809
21761 79809 34252 36310 117043 83572 120506 242051 227088 229819 205125 205700 216789 216879 269270
21748 269270 193851 101338 43337 160267 241850 287733 259378 239188 184323 141015 22920
21737 22920 48588 102924 177128 215925 251901 166568 205132 165760 127032 214705 188077 204165
21725 204165 177909 65701 38208 -21623 30737 223569 229478 164998 114017 61093 114455
21714 114455 162908 194159 373949 427739 306437 265747 281545 322569 369027 406454 463983
21703 463983 390713 326399 415953 511443 550391 518507 651161 774053 847585 898729 1118845
21692 1118845 1251482 1225240 1092830 1170914 1112856 1130612 1196411 1176577 1126582 1197203 1177337
21681 1177337 1161856 1072159 1061917 1086661 1013343 993633 936401 795796 837879 726455 558230
21670 558230 588197 583472 574024 519823 415098 383309 355604 286317 270980 331261 402571 335027
21658 335027 320441 336621 328299 368623 294390 350734 295511 222732 339389 333807 258108 192960
21646 192960 221158 286805 275416 301646 380076 412793 494361 405511 256883 98985 129111
21635 129111 249522 127232 110846 116760 145223 281130 358987 302599 325821 241869 255464
21624 255464 257651 213426 237270 241359 301492 254921 232782 125440 127882 152860 131183 107075
21612 107075 253738 290283 258999 231463 309028 361609 350743 365407 419965 385530 324364
21601 324364 214081 123425 59122 37193 136951 233387 276579 221343 235076 241054 253791
21590 253791 258584 204537 213907 160457 167830 211506 207249 253833 249456 204981 258776 327422
21578 327422 299444 294924 326869 242387 293998 318748 272538 230205 168703 289636 367849
21567 367849 244460 172431 126222 108770 172799 104952 222862 360223 258602 302974 393206
21556 393206 376901 321227 318686 346348 278680 214274 104999 155936 132357 110736 138612
21545 138612 280326 373465 322440 250424 244693 225981 260626 253656 228423 281180 293273 365269
21533 365269 369259 364127 374826 236848 229381 214393 81882 12835 97106 236401 272876
21522 272876 220872 209539 214105 188399 246412 296286 406542 262115 136796 186074 226405
21511 226405 256760 187325 105129 161664 255906 253998 114362 170479 327452 436030 458149
21500 458149 413614 270333 203002 200244 293488 335905 221050 196495 211663 190461 185467
21489 185467 329337 336292 321324 327436 330674 292376 459661 444910 318519 121882 73840
21478 73840 111576 249178 378096 285479 149681 140354 87681 147243 228520 327513 300394
21467 300394 295084 362535 294522 164052 310111 410097 455480 487683 470823 462672 333402
21456 333402 232652 275856 213719 311072 454399 473301 395037 379638 410038 344647 263488
21445 263488 274764 181306 260606 316084 325030 326088 506044 542619 524107 448173 388782 498479
21433 498479 477926 476087 545680 486683 446285 454798 450254 338898 321877 306231 202297 211530
21421 211530 346910 426921 452055 507178 489905 531611 478188 360294 316368 362435 482387
21410 482387 497817 450899 499611 558814 461545 447859 586871 605465 624745 662574 500230
21399 500230 395484 418235 602524 531751 512225 554968 606945 560581 578198 507688 351991
21388 351991 353442 353073 366321 320645 455398 442668 444286 495885 556060 613080 616197 577109
21376 577109 623770 638254 681262 833024 898107 745818 698457 664822 615339 546304 515369
21365 515369 629785 843631 828119 702199 757481 792225 733133 636212 641562 564247 602883
21354 602883 687879 706455 665027 661305 617012 671592 781074 799791 806937 869972 919645 854232
21342 854232 748047 729829 870703 919913 742818 707626 649469 635124 674007 736628 731376
21331 731376 678884 567358 699824 715187 719983 720405 629913 655803 653460 697582 725517 813254
21319 813254 873744 924852 907883 865341 762746 621893 717278 817333 708720 830591
21309 830591 973796 1005611 948481 810892 703284 765171 711649 845118 957160 993692
21299 993692 933687 1074160 1037046 967575 830693 811865 786485 760366 706670 724216 851218
21288 851218 946646 858642 944440 1054330 1020545 1148429 1190313 1080767 984717 1041184 1073889
21277 1073889 1069529 970499 921466 922104 969615 975580 1078457 1174983 1220194 1173497 1181558 1186328
21265 1186328 1058797 1066953 1075632 1085171 1079382 1039285 986411 1038313 992293 1090252 1213674 1157445
21253 1157445 1178228 1285992 1297703 1391439 1518524 1581690 1599813 1520283 1602364 1557945 1602445
21242 1602445 1647096 1684643 1782441 1775363 1658587 1667767 1943474 2093055 2153246 2053581 1938265
21231 1938265 1939027 1958191 1920533 2021114 2088567 2089596 2110432 2073600 1977088 1976178 1889429 1843725
21219 1843725 1822276 1918441 2027796 1986418 1925297 1908660 1902632 1956550 2038406 2046195 2108058
21208 2108058 2225817 2152968 2096713 2018556 2115560 2167110 2255577 2316197 2297199 2402165 2479657
21197 2479657 2502397 2558714 2730216 2866191 2965324 2764719 2661395 2716130 2799410 2744088
21187 2744088 2703848 2923649 3115162 3226731 3191300 3232814 3432966 3537853 3526278 3630382
21177 3630382 3772516 3797676 3767359 3885722 3896063 3894994 3889738 3945918 3950119 4085131 4296892
21166 4296892 4596953 4875196 5059901 5168572 5393429 5644837 5970162 6163378 6461127
21157 6461127 6854217 7231895 7571464 8039590 8292712 8461122 8805949 9157933 9591627
21148 9591627 10087810 10629419 11292822 11938981 12659551 13461630 14396064 15467859 16519322
21139 16519322 17598211 18751533 20252932 21979716 24004615 26407744 29420560 33285193
21131 33285193 38302248 44996352 54172921 66699352 81963434 97426661 110292105
21124 110292105 120833937 131782837 145145737 160879923 175689764 185169423 184740084
21117 184740084 175792231 168225710 168140683 175960115 185054870 185028474 176655940 168332397
21109 168332397 164952757 167589655 174979820 183477928 188280984 181614107 162890120 143939338
21101 143939338 131269050 124146717 116812767 101418971 80926360 63747644 51714223
21094 51714223 43551273 37882343 33680912 30532774 27967087 25940376 24210359 22897709
21086 22897709 21746293 20752855 19708771 18653186 17680563 16742930 16080282 15638745 15004618
21077 15004618 14270589 13681595 13177021 12786478 12332507 11875453 11368666 10868451 10604288
21068 10604288 10223741 9744373 9272362 8769163 8359965 8009420 7548868 7168011 6810549
21059 6810549 6464707 6300537 5987373 5502614 5261150 5142685 5006812 4859672 4677989
21050 4677989 4538441 4466370 4359945 4186417 4034771 3937149 3803339 3629404 3565415 3396144
21040 3396144 3184916 3023347 2907057 2737243 2666615 2553349 2459262 2466836 2404560 2291721
21030 2291721 2242756 2207042 2111410 2019675 1969044 1939295 1750308 1732849 1626797 1508350 1521037
21019 1521037 1487038 1421234 1438071 1352845 1341869 1258000 1141693 1056598 989562 906262 916528
21008 916528 952785 941105 920363 910826 828154 876772 890740 852900 682939 397322 367172
20997 367172 474596 632832 651142 576624 513288 463409 406376 375810 356800 297422 239163
20986 239163 364101 472202 394986 314091 321530 209836 284265 373308 291174 214584 176745
20975 176745 252869 207358 223349 163180 32807 -5813 18087 47251 120159 139252 127352
20964 127352 5270 -231909 -319487 -227112 -146453 -204597 -164743 -204305 -253867 -282762 -302909
20953 -302909 -225153 -220274 -359944 -343053 -274541 -415968 -411317 -377436 -498910 -437785 -355143
20942 -355143 -351121 -355317 -478756 -626365 -653860 -632386 -751444 -674090 -616541 -527234 -355271
20931 -355271 -402014 -461928 -464199 -433690 -521787 -671975 -717382 -577391 -437883 -496976 -657267
20920 -657267 -540088 -419253 -414594 -474398 -446089 -442959 -362826 -309915 -392456 -418109 -357216
20909 -357216 -416396 -445356 -555169 -589366 -639815 -553171 -549835 -534663 -470107 -373657 -323294
20898 -323294 -292719 -357247 -503089 -501515 -399789 -328394 -333455 -478548 -574366 -507387 -410184
20887 -410184 -356366 -350754 -343252 -223652 -117695 -25896 -71664 -145808 -190483 -300021 -378452
20876 -378452 -387525 -333063 -412971 -432482 -356104 -339967 -375148 -274890 -297775 -261003 -227465
20865 -227465 -254879 -388795 -509624 -463113 -333619 -255753 -304402 -411636 -428052 -328464 -264420
20854 -264420 -331455 -369878 -419932 -457944 -678187 -745816 -590681 -444713 -362288 -356482 -440527
20843 -440527 -454085 -318856 -240854 -240278 -251048 -233068 -245607 -310296 -332753 -352660 -267297 -197026
20831 -197026 -166140 -136781 -175324 -167057 -184648 -311308 -374154 -293398 -267828 -304995 -332781
20820 -332781 -400072 -358035 -295863 -345105 -387920 -355629 -353326 -471615 -605819 -569219 -523706
20809 -523706 -504111 -542621 -517153 -501323 -450274 -338513 -235028 -242787 -207022 -198727 -257202
20798 -257202 -283021 -365530 -430889 -382957 -355694 -478878 -336871 -311761 -404756 -337813 -367519
20787 -367519 -418399 -589216 -643247 -486312 -312146 -208607 -297552 -287571 -303903 -423830 -407138
20776 -407138 -369173 -331195 -383841 -425619 -351982 -264612 -281888 -444685 -616486 -583255 -540330
20765 -540330 -447822 -391556 -423097 -527042 -517986 -450055 -456849 -456885 -532164 -558814 -540916 -491038
20753 -491038 -439806 -384454 -462664 -494478 -490506 -390535 -305593 -317686 -380298 -349500 -339001 -280477
20741 -280477 -323221 -388345 -398728 -443119 -406095 -389395 -360787 -267395 -239323 -244663 -282937 -331656
20729 -331656 -373030 -226489 -176782 -314307 -394120 -361315 -365712 -382890 -339023 -339928 -380698 -467799
20717 -467799 -458451 -469893 -343624 -262540 -302394 -389740 -515904 -470241 -271012 -221903 -315911
20706 -315911 -352549 -354304 -492043 -501324 -347739 -224043 -173174 -372067 -375763 -248882 -174566
20695 -174566 -92066 -17110 -31227 -88907 -63940 -20726 -200633 -405197 -449406 -366477 -263975
20684 -263975 -173962 14426 12638 -215632 -142569 -173323 -82266 -117929 -155922 -209491 -150101
20673 -150101 -134218 -317507 -408858 -335105 -305652 -328817 -235234 -275919 -323391 -311548 -449636
20662 -449636 -441722 -322112 -297108 -256658 -306397 -315935 -287206 -395324 -438669 -314314 -211400
20651 -211400 -214725 -81469 -99487 -73513 -64522 -229367 -388591 -388951 -357004 -301204 -341006 -395671
20639 -395671 -362761 -272731 -178318 -219338 -356734 -444522 -345716 -233579 -352844 -399353 -381057
20628 -381057 -343917 -279894 -404367 -458775 -338697 -328570 -254438 -233289 -310263 -361664 -332414
20617 -332414 -331735 -315590 -285267 -270124 -205368 -81240 -18299 -74179 -36698 -55594 -72392 -147523
20605 -147523 -353479 -380647 -262208 -132822 -89427 -57056 -95698 -109567 -160259 -250472 -300062
20594 -300062 -161332 -134599 -223225 -262490 -257285 -259981 -310262 -233030 -192837 -191330 -171034 -60915
20582 -60915 -22418 -93358 -58250 60370 57218 -19332 17175 -24630 -6424 24903 66931 110525
20570 110525 -102642 -204404 -230208 -207088 -261677 -293197 -113477 70296 42276 31468 -42111
20559 -42111 -113344 -50228 -10425 109237 182481 181637 119742 274278 305174 329014 314633 327258
20547 327258 458711 504564 495268 631013 784228 783755 779482 778473 784805 723032 761065 789624
20535 789624 714252 675003 655048 618421 696923 702924 616232 632580 695554 686653 687058 618670
20523 618670 596142 445338 354154 340783 291431 196118 142906 121526 169763 140731 52131
20512 52131 103157 210419 241745 128205 77759 132957 80948 140657 179465 -27444 -211946
20501 -211946 -206121 -107242 -35376 -9502 -44236 -8396 -26151 -93647 -47893 -43962 -42023 25316
20489 25316 150219 206056 166292 -8984 -78728 -178771 -232052 -84108 28330 62078 8971
20478 8971 34452 7778 -32568 -72025 -166168 -58301 50513 52212 7743 136735 142912 87949
20466 87949 -13600 -113005 -45105 -58444 -108871 -119009 -32626 -22528 -91031 -181072 -261330
20455 -261330 -158844 34729 72066 64614 34747 -86605 -68819 -55351 -210390 -109485 45815
20444 45815 100502 -64264 -179056 -203246 -229351 -251016 -185068 -115522 -88214 -97327 37989
20433 37989 131325 135691 52199 -26405 -58114 43366 24389 -33740 -15462 606 -15882 -71323
20421 -71323 40557 114095 -25369 -162845 -219326 -267823 -234237 -156818 -187257 -128254 -100714
20410 -100714 -94786 -14096 59470 31816 19637 109423 78084 68896 137143 152745 108052 95747
20398 95747 -1103 -38571 -61197 -69775 -44163 5866 -34617 21105 70145 127469 92262 42200
20386 42200 12592 100843 142213 40231 -100616 -129967 26146 142416 308818 249223 147958
20375 147958 199352 233673 278497 360525 409798 410252 349086 218815 337919 497280 511698
20364 511698 507259 429935 393565 429506 417149 319107 249887 267072 473298 475144 434980 387236
20352 387236 425771 412205 417475 384400 415534 369940 283426 287757 383402 372009 365068 295404
20340 295404 221609 279705 185898 86912 59409 114476 290752 292682 296906 329545 242119 273171
20328 273171 151516 -99469 -115919 -32899 27924 121753 151025 256888 438831 574395
20318 574395 590824 465713 442121 566435 601954 633278 647588 532457 484593 369276 337893
20307 337893 373326 353538 430368 516500 578377 566705 498416 568624 636320 624742 659716
20296 659716 753001 679102 507917 438191 411975 484010 427795 401188 289595 70769 -45895
20285 -45895 57349 96058 115899 92462 94272 48884 146098 251252 194615 137111 156868
20274 156868 152344 130570 84625 69567 55392 10966 -21610 13541 50322 39560 50234 -44891
20262 -44891 -45131 14722 133638 271409 181695 55937 125363 78056 81638 193650 168853
20251 168853 54848 88539 58031 42648 -13684 28326 153593 198554 114667 -14883 16955
20240 16955 56658 229404 377880 339425 238744 267083 195653 124204 119699 59739 66721
20229 66721 19897 53884 91459 77845 142246 203536 247095 208521 106484 143640 179699
20218 179699 225539 187845 129550 130066 223355 332430 329851 352939 337947 289649 221303 187065
20206 187065 221451 165950 248428 422944 564229 520988 467463 438012 353604 340107 212936
20195 212936 136240 115360 86055 110032 111018 190288 69368 -95984 -65353 -2063 32131
20184 32131 41287 92676 175360 244229 220561 274948 245147 188979 229042 214738 151574 162515
20172 162515 115108 65111 31369 77979 121600 186700 209989 241853 306693 230832 73701
20161 73701 93089 162878 300106 476466 412678 328604 408987 473470 474200 412074 262686
20150 262686 159611 194805 267093 282060 326386 479649 493498 432526 293469 292484 298340
20139 298340 295617 188611 283165 327219 205004 202143 268630 370307 417972 310389 330017
20128 330017 358370 325254 397125 445087 460333 270817 183404 255230 254523 204789 213969 251689
20116 251689 377393 473473 478062 386975 447561 466299 470714 398535 470512 475801 531696 614826
20104 614826 607178 638449 644886 612444 604992 665850 828544 899069 927903 953971 952666 978657
20092 978657 945669 981858 966088 1003210 1019842 1017082 1023172 995990 1006911 1036313 1077396 1106353
20080 1106353 1106491 1086131 1005431 922990 811837 738604 903488 959551 971370 947618 991720
20069 991720 960507 978059 998384 965595 849561 817051 972420 1196062 1249780 1363662 1437909
20058 1437909 1335804 1321442 1333554 1394345 1334155 1326134 1382929 1379307 1417426 1352638 1342139
20047 1342139 1259682 1260869 1330306 1328528 1321132 1221372 1147500 1219060 1243169 1273200 1285950 1268539
20035 1268539 1369225 1356061 1352738 1397235 1279202 1361367 1392997 1357549 1281428 1155735 1221173
20024 1221173 1426362 1392943 1248268 1251508 1346648 1374883 1273990 1100905 1120306 1216856 1155202
20013 1155202 1129777 1076160 1057900 1089352 1089292 1196957 1159567 1226677 1425475 1416576 1391762 1390593
20001 1390593 1455987 1485792 1424191 1440944 1444071 1448445 1483570 1284753 1170665 1087516 1086970 976440
19989 976440 990389 1056621 1023485 1058391 1148969 1079416 986218 1067903 1100529 1065390 1151763
19978 1151763 1223777 1160870 1271013 1243469 1193310 1176935 1181265 1230854 1126017 1115912 1323571
19967 1323571 1385365 1317946 1364067 1349149 1447726 1453934 1509832 1480893 1511014 1466041 1485338
19956 1485338 1451621 1491760 1701255 1870740 1887928 1896856 1895347 2026130 2199382 2259029 2170657
19945 2170657 2326268 2322853 2354230 2400222 2364543 2297055 2182048 2153688 2126780 2166404 2062107
19934 2062107 1836565 1709035 1662627 1604871 1748378 1810321 1811418 1801561 1752698 1758877 1577564
19923 1577564 1531628 1547151 1675082 1811835 1968145 2002501 1908778 1889932 1932997 2039115
19913 2039115 2078400 2131004 2123653 2088883 2247924 2213461 2109691 2119942 2142185 2215298 2174902
19902 2174902 2110032 2146510 2210434 2279778 2373150 2582513 2642464 2735998 2748859 2709913 2731953
19891 2731953 2737601 2706122 2839759 2898810 2969122 3028405 3115897 3251791 3363456 3430175 3570072
19880 3570072 3663918 3756597 3900908 4091686 4331063 4683799 4966555 5223020 5549926 5936880
19870 5936880 6303498 6662171 7145019 7732039 8238775 8822764 9449944 10190567 10906644
19861 10906644 11921908 13187123 14512772 16153516 18443141 21374307 25219175 30468832
19853 30468832 37746252 47691325 59342620 69528975 75189224 76975214 77496493 78768785
19845 78768785 81977655 87528529 91924196 87708568 76775917 68386273 65621779 68110885
19837 68110885 74232052 80386796 83133299 82689588 81178977 80394988 81283561 83870914
19829 83870914 85359085 79049270 65485242 52296320 42808289 36300388 31823547 28820159
19821 28820159 26668009 25094456 23822157 22888490 22153338 21783011 21668993 21465858 21426572
19812 21426572 21587228 21874024 22387337 23079301 24197892 25644055 27372229 29491907 32455443
19803 32455443 36521097 42061733 49899429 60801323 74726414 89124116 99631497
19796 99631497 104135390 105056478 105555721 107733496 112729833 119577895 120738797 110155569
19788 110155569 96501268 88614412 88094075 94008865 102972154 109828246 111221333 108987705
19780 108987705 106477932 105610602 107652661 111426698 110105651 95720443 75548170 59078823
19772 59078823 47682568 39883620 34480013 30532811 27491073 25129075 23264264 21722620
19764 21722620 20401691 19210360 18180637 17099845 16073687 15308726 14525487 13890841
19756 13890841 13589154 13212111 12699271 12123370 11542991 11044882 10711362 10401270 10094183
19747 10094183 9725163 9403086 9068750 8691483 8393723 8164485 7878564 7593233 7421220
19738 7421220 7161647 6961249 6860211 6618303 6383318 6166480 6124538 6111883 5924665 5786362
19728 5786362 5634491 5585963 5461532 5269373 5105286 5161322 5022518 4950761 4926041 4837588
19718 4837588 4781521 4617886 4517643 4550564 4587754 4437536 4252704 4259319 4166741 4036922
19708 4036922 3948816 3947216 3964405 3966427 3937985 3849946 3822202 3841466 3876354 3774317 3772876 3659692
19696 3659692 3618622 3548962 3489015 3538033 3463658 3487932 3489378 3425897 3373393 3277407 3264401
19685 3264401 3228457 3178513 3196352 3178143 3239671 3215727 3234873 3326062 3254067 3222922 3252154
19674 3252154 3273093 3278404 3222366 3332020 3443263 3430746 3389366 3379950 3494564 3468936 3366023
19663 3366023 3418099 3463269 3476160 3573211 3678356 3708502 3714584 3767566 3807838 3803754 4016512
19652 4016512 4224348 4251024 4360991 4550906 4597222 4595206 4647419 4737751 4806068 4985762 5244530
19641 5244530 5311534 5321371 5425048 5477150 5527009 5556779 5641373 5773555 5926429 6128483 6339564
19630 6339564 6628514 7019952 7310203 7497371 7681911 7843810 8043650 8327173 8673404
19621 8673404 8873273 8925364 8891035 8983418 9125957 9487161 9956265 10554702 11162156 11905135
19611 11905135 12822612 13680887 14512942 15352574 16239866 17229362 18319338 19616171 21050593
19602 21050593 22550522 24166970 26145753 28768526 31877571 35264767 38815793 42516587
19594 42516587 46621618 51575095 57856568 66309463 77280324 90542418 105187786 118983461
19586 118983461 129169567 135390944 139130748 142519858 147802081 155485389 162539352 163336195
19578 163336195 157068222 148017977 140702084 137484663 138211687 141309903 144888610 148065463
19570 148065463 150918392 153818972 156274031 156851327 154627976 150084000 144276108 138863734
19562 138863734 134490921 130054473 124577901 117995746 111263546 106131526 103666907 103763353
19554 103763353 105382229 106624953 106127488 104845557 104716176 106858990 111068807 115894717
19546 115894717 119146867 119610204 118767444 119584926 123586263 130643153 138785623 145586969
19538 145586969 152430042 161697320 172278386 180359753 184250098 185371699 185534155 186856585
19530 186856585 191395212 198055313 201102707 196901315 189311468 181956092 174331519 166602349
19522 166602349 159942303 155391446 153679174 153251256 149059123 135742434 116350023 97838450
19514 97838450 83074049 72325660 64811191 59607044 55880280 53292173 51480024 50086116
19506 50086116 49032230 47921479 46675933 45331966 43824853 42424354 41309841 40228126
19498 40228126 39120747 37660836 36182109 35030549 34224111 33724876 33531747 33729603 34283989
19489 34283989 35070837 36169362 37684335 39640111 42249281 45799048 50407397 56625723
19481 56625723 65111654 76594804 91057628 106743195 120760302 131506499 140900795
19474 140900795 151818244 165267352 179550967 189789627 189601024 177778588 162338012
19467 162338012 150124335 142487836 135998632 124058256 105976187 87690317 72990675
19460 72990675 61958422 53765851 47808800 43229876 39556852 36575650 34107203 31922127
19452 31922127 30107605 28700172 27492227 26494979 25550490 24813037 24364796 23928779 23594500
19443 23594500 23492151 23471436 23400653 23451481 23663568 23998715 24472038 25023572 25846758 26959018
19433 26959018 28522151 30704833 33547184 37331590 42504100 49623279 59187604 70739307
19425 70739307 82666269 92832138 100523920 107453982 116152594 127026712 137730813
19418 137730813 144185584 141660002 130517049 118246378 109542087 104330132 99109578 88782081
19410 88782081 73800865 59798929 49088961 41381976 35807491 31630862 28482687 26007576
19402 26007576 23881826 21990986 20518741 19238735 18181710 17161506 16290335 15457807
19394 15457807 14680858 14059147 13502296 12978905 12272081 11738944 11458750 11077131 10552236
19385 10552236 10188021 9891158 9562738 9213590 8847635 8516385 8082816 7722954 7504154
19376 7504154 7241787 7108440 6943176 6633636 6381939 6112323 5896165 5631619 5389770
19367 5389770 5340143 5186703 4827722 4565917 4484509 4381264 4251908 4026370 3873283 3841179
19357 3841179 3801696 3634584 3475354 3337690 3230978 3095830 3040651 2950806 2866641 2859676
19347 2859676 2737606 2659918 2612481 2655435 2593538 2467990 2454283 2404171 2300284 2328784 2206685
19336 2206685 2047782 1970974 1935832 1899725 1864949 1838651 1842546 1788466 1687037 1638800 1524517
19325 1524517 1404472 1477509 1561077 1491299 1363804 1367303 1406286 1470160 1528164 1405423 1333434
19314 1333434 1364854 1360132 1329460 1389403 1300482 1263392 1317838 1365970 1283994 1153881 1108695
19303 1108695 1164322 1131126 1175290 1208673 1107588 1080611 1089907 1095690 1027139 954578 918206
19292 918206 1009228 906224 638208 517473 419172 442847 503782 532605 491945 568247 610205
19281 610205 515642 381608 298363 288211 289628 265379 227627 218617 280802 229672 134194 172497
19269 172497 176556 87984 95079 195376 141818 77583 162508 143988 240747 211281 229321 185345
19257 185345 204268 234848 208978 36944 76708 83799 119918 144265 134988 97310 65484 75391
19245 75391 26621 -135512 -199793 -128672 18205 -4553 -138387 -187545 -186757 -194543 -164962 -205360
19233 -205360 -214863 -178577 -9092 -81618 -223300 -354925 -383277 -300708 -139801 -134115 -70983
19222 -70983 -47417 -98410 -34084 20492 -5306 -80718 -100215 -155004 -236693 -272927 -269305 -241567
19210 -241567 -331954 -378226 -355277 -455817 -396715 -256381 -189550 -208561 -271524 -349539 -310817
19199 -310817 -295104 -276839 -341339 -391388 -432637 -366343 -294315 -284786 -284000 -306409 -387173 -474597
19187 -474597 -505240 -469120 -481380 -588781 -745802 -666852 -569006 -517706 -533706 -555059 -491000
19176 -491000 -435581 -360950 -437805 -382467 -427776 -396473 -356752 -442654 -408149 -301098 -308103
19165 -308103 -282951 -347511 -366649 -337181 -405954 -552422 -544328 -467514 -524372 -497361 -600826
19154 -600826 -560194 -465142 -435230 -384882 -414708 -400481 -428224 -488139 -478008 -613277 -658133
19143 -658133 -504114 -391094 -294552 -344275 -279788 -305294 -293606 -256093 -201661 -433465 -423729
19132 -423729 -333947 -403497 -546548 -579675 -559213 -460158 -435102 -552826 -571256 -443236 -518653
19121 -518653 -605629 -649882 -516346 -448008 -282658 -161455 -90691 51368 77420 67364 145081
19110 145081 109013 129426 97010 77883 137452 111435 -61609 -120664 -76701 -121452 -125112
19099 -125112 -76168 -9330 -13268 29505 135456 233159 213834 16005 -86937 -12908 -45346
19088 -45346 43022 188290 283691 313686 269898 241378 216466 134391 95095 182711 423504
19077 423504 623728 680232 836863 874123 889007 972289 996648 1103095 1211706 1330657
19067 1330657 1449637 1524142 1490383 1428486 1442662 1594024 1580320 1513034 1529262 1427835 1389337
19056 1389337 1411501 1378987 1400935 1237647 1102613 1085535 943056 861874 731043 617086
19046 617086 668246 632030 570863 574304 664644 747038 749630 717556 584979 474179 623379
19035 623379 664532 749602 714216 778768 843666 872293 866084 917817 913576 972633 1020147 971138
19023 971138 976532 1015272 1134378 1258732 1340519 1425018 1421499 1373599 1356671 1289350 1180024
19012 1180024 1277633 1396405 1382470 1286449 1344792 1247203 1104058 969727 850628 843885 728018
19001 728018 648981 585977 594260 532308 387563 312882 336731 353753 238764 149564 3506
18990 3506 -2358 -28363 -75522 -202734 -170100 -156866 -132146 -164655 -205319 -187856 -172205 -255502
18978 -255502 -399951 -364203 -280012 -206113 -144885 -48617 15816 82261 156338 150095 59985
18967 59985 59312 87041 118440 187869 265680 282988 254120 224326 289191 229989 172579 249467
18955 249467 234836 161210 362779 431399 379537 345666 324385 319405 384194 435203 322906
18944 322906 242395 278186 324210 347699 228060 151732 78685 -18140 -196782 -266640 -265240
18933 -265240 -196015 -190479 -383925 -313178 -168554 -121654 -145829 -187602 -259734 -294394 -250401
18922 -250401 -255135 -254642 -219971 -292199 -373761 -443186 -436901 -433081 -401613 -304117 -100908 -24515
18910 -24515 -152471 -192146 -229077 -207113 -203503 -144929 -33326 32650 -11527 -18572 88314
18899 88314 145904 205460 195528 161636 265577 334953 213531 91690 95737 177066 170416 143060
18887 143060 -16251 -192238 -189160 -111934 -121587 -270039 -381004 -412249 -309817 -335044 -383995
18876 -383995 -416933 -315864 -291978 -325531 -400008 -436205 -405413 -374125 -403159 -328793 -239514
18865 -239514 -180985 -210151 -354165 -459415 -447988 -438351 -246606 -199561 -362321 -521774 -523789
18854 -523789 -456735 -459337 -380965 -360458 -320501 -177972 -202226 -254418 -203434 -257891 -334650
18843 -334650 -311890 -282721 -338434 -363442 -394780 -410612 -368396 -389344 -421801 -400821 -384758
18832 -384758 -471479 -494071 -356727 -243303 -181202 -251845 -336133 -355123 -370826 -295195 -325388
18821 -325388 -240604 -134406 -273660 -438443 -460837 -285911 -243544 -259851 -205129 -205551 -165168
18810 -165168 -181079 -214750 -248627 -245031 -237467 -256207 -187577 -187683 -191921 -208302 -203410 -251510 -246891
18797 -246891 -268511 -260521 -209431 -229434 -225850 -229091 -257127 -414024 -371833 -208700 -90824
18786 -90824 -88729 -140055 -165620 -60211 94072 225196 246039 208502 154357 21323 -26332
18775 -26332 -63021 -8662 2511 -10809 108331 202553 167857 142888 112398 28429 -43382
18764 -43382 -36839 -39710 -56349 -113413 -202301 -226171 -187640 -204021 -80906 4403 11046 31150
18752 31150 -71008 -58211 -6203 -50407 -4826 60594 86771 105834 178130 199233 224437
18741 224437 4838 -21124 23195 142380 308389 284909 239965 298901 372657 352349 258169
18730 258169 180953 179600 155004 231261 117874 42480 75218 193194 306861 327246 206186
18719 206186 257490 257251 282059 316448 206020 202947 342255 404124 448637 398243 416570 492600
18707 492600 530578 436705 412870 417314 582739 608609 559748 566002 547026 632007 791633
18696 791633 924860 869819 901693 912154 892155 727100 844564 992633 1169878 1207717
18686 1207717 1219455 1174360 1173071 1115235 1096303 1227785 1344304 1398367 1363729 1293969 1345321
18675 1345321 1305513 1296950 1270967 1150247 1100664 1091092 1144635 1228155 1347283 1357448 1361943
18664 1361943 1362058 1657046 1848095 1838238 1832326 1844769 1912681 1988902 1970465 2039144 2099340 2269292
18652 2269292 2433307 2579481 2717068 2929007 3266557 3430113 3659782 3902145 4110368
18643 4110368 4264366 4432054 4683906 4846576 5013582 5114344 5205809 5423282 5566008 5842711
18633 5842711 6113830 6384228 6816313 7449414 8266077 9300781 10759010 12733889 15244758
18624 15244758 18253933 21118342 23261584 24630484 25726276 26687686 27844730 29328328
18616 29328328 30604539 30663533 29842454 28709834 27418374 26324593 25611776 25317706 25555325
18607 25555325 26716152 28488142 30422661 32075451 33457365 35550004 38670483 42250929
18599 42250929 45476926 47537129 48900360 49775977 50372715 51384071 53133683 54330972
18591 54330972 53490378 51565964 50374857 49935144 49570786 49291796 49523256 50216936 51505384
18582 51505384 53041337 53715239 53017114 51764977 51183635 52001886 54390143 58756396 65278727
18573 65278727 74160246 85408305 98761428 112827035 126663574 140243284 153978817
18566 153978817 167718201 180437813 191163214 198492833 201131471 199830449 197453488
18559 197453488 194361804 188864343 180974948 172524081 164063291 155188349 147180606 140282040
18551 140282040 133756778 128244673 124059766 120149257 115991776 112743763 112111068 114607997
18543 114607997 119224745 124168266 128758134 133555351 139395208 146536977 155071013 165222092
18535 165222092 175766479 184126362 190538442 197910784 207483901 219315417 234625569
18528 234625569 253559812 272601853 286697808 294057865 298410807 305576661 319181776
18521 319181776 337649180 353493325 357453110 347016804 330311081 316793829 309673238
18514 309673238 307100257 303270624 291090564 268115770 240120495 215130842 194856383
18507 194856383 176494557 157997955 140577493 125479772 113866199 105692096 100302695
18500 100302695 97012556 95580422 95549967 96230262 97044173 97392508 97136900 95977595 94034691
18491 94034691 92275805 90815221 88553588 85672356 83013154 80327178 76888894 72831291
18483 72831291 68829556 65271502 62466336 60710349 59601250 57914584 54381590 49417530
18475 49417530 44524656 40417400 37198725 34949175 33143201 31452425 30013328 28676551
18467 28676551 27492247 26419164 25490377 24672317 24032908 23412066 22972737 22670690 22492893
18458 22492893 22416622 22577133 22952411 23349537 23570479 23572196 23621111 23507772 23500812 23652451
18448 23652451 23840515 23716327 23407781 23091965 22423153 21627572 20998415 20417032 19996540
18439 19996540 19712540 19618218 19332692 18361766 17068464 15967873 14965363 13969947 13276227
18430 13276227 12761774 12375995 12042656 11634911 11021597 10305341 9730984 9416217 9095154
18421 9095154 8680051 8236814 7911255 7638407 7429005 7275835 7181420 6937344 6634001 6361753
18411 6361753 6218913 5982004 5849274 5777944 5642152 5563308 5409967 5177966 5055417 5057574
18401 5057574 4929454 4704333 4565235 4395601 4375111 4325798 4189558 4160964 3971472 3863110
18391 3863110 3836192 3681714 3543077 3408486 3286212 3247164 3222055 3171111 2978072 2823428
18381 2823428 2823389 2867964 2964533 2910102 2746260 2625291 2465305 2505490 2410171 2382060 2394840
18370 2394840 2296848 2241016 2153572 2086048 2051223 2008418 1975730 2024124 1886905 1662357 1584263
18359 1584263 1630774 1646326 1541640 1544899 1539405 1449224 1323684 1268863 1303862 1138882 1094612
18348 1094612 1269760 1307720 1238207 1209867 1054276 1073526 1107460 1050320 1028047 953922 980805
18337 980805 1074983 1027588 1011023 831586 760469 750343 799714 774153 818296 764133 739843
18326 739843 700538 753017 715003 646792 638547 754450 790987 718777 607710 668202 658493
18315 658493 557799 553613 533883 619883 485049 394294 436628 546219 662264 678685 676695
18304 676695 668825 539610 376731 392765 306324 419486 485684 437747 456135 422196 419983
18293 419983 431677 379400 446512 493033 341543 288313 417368 492115 421115 360759 387756
18282 387756 305563 304931 231277 218474 313128 371725 412369 445851 254252 95136 55937
18271 55937 89598 121234 128918 178158 186660 158034 268294 227053 177792 207210 229031 232964
18259 232964 172857 57432 132965 219468 195939 147228 182647 268728 257337 177569 276757
18248 276757 437271 341711 214201 192382 90254 46921 91440 -14810 -79692 -53428 -61049
18237 -61049 -16787 -64024 -58506 -49546 -58318 -98913 -126360 -16380 67157 63475 -1725 -7134
18225 -7134 -20776 -11643 -128806 -90510 -75619 13969 146042 18332 -5017 61527 -10235
18214 -10235 -86948 -79928 -59502 -100593 -102646 -53269 -8992 26520 46973 78440 27787 55217
18202 55217 8082 -155448 -63607 -45772 -147810 -168149 -121454 -22786 3769 -45706 -158019
18191 -158019 -147375 -138881 -120988 -130819 -135983 -182696 -227044 -268789 -262254 -222911 -210582 -296004
18179 -296004 -321017 -249564 -137118 -219304 -203831 -132108 -148515 -157049 -27407 -20510 32361
18168 32361 -47417 -147123 -79682 -59195 -32899 -105800 -218674 -156977 -117730 -132885 -16150
18157 -16150 157426 143256 20169 -9285 -65974 -87990 -183503 -103488 -144644 -220000 -189583
18146 -189583 -289243 -292478 -185972 -229498 -175085 -142049 -201603 -167281 -21036 -107689 -148598
18135 -148598 -150438 -230835 -206567 -201948 -155920 -143602 -223277 -274445 -183322 -156400 -89180 -50974
18123 -50974 -65230 -114101 -175165 -224161 -202193 -133435 -139748 -251653 -276043 -204116 -136585 -152865
18111 -152865 -179574 -164891 -168372 -208790 -157462 -177956 -195202 -145233 -59720 66081 37192
18100 37192 170540 261714 207088 78725 70568 198002 375321 503809 412428 351228 307912
18089 307912 273338 180230 111972 46523 -807 58091 179410 170587 122671 149823 132869
18078 132869 154088 251812 256750 191011 74677 62804 59465 121360 138753 173271 197135 256459
18066 256459 293609 301224 334002 442920 476174 445217 331374 178072 215218 349736 389670
18055 389670 406497 373939 344243 419899 525553 568747 714666 816236 837093 813040 743898
18044 743898 789954 867706 937278 852338 879511 924593 931073 989045 875695 808654 817763 594638
18032 594638 607985 683450 706383 714142 708802 792372 717828 710431 608675 455212 327727
18021 327727 314454 306969 353686 318527 275802 285118 340824 441428 493953 586327 525780 365361
18009 365361 355506 396307 429469 372485 366055 514517 690699 817944 761004 702113 692677
17998 692677 646368 647519 693645 644309 662719 657877 576175 583613 617994 713332 771208 781388
17986 781388 775005 834697 767113 721381 661445 469648 401690 398843 280757 115284 177985
17975 177985 210380 205415 108784 88594 49824 46506 64075 10933 -59709 31502 -34641 44430
17963 44430 116233 87503 -82668 -90290 -153761 -102529 -39107 -14992 -35016 7941 158991
17952 158991 294691 279978 378174 353298 308686 232600 848 -17568 23546 23142 119319
17941 119319 158047 102811 -6216 -50664 -36701 -93776 42370 152309 167540 230597 157843
17930 157843 64670 84394 50965 -15168 -54900 -92823 -64857 -39352 -128068 -164849 -133168
17919 -133168 -127339 -106598 -91728 -152743 -215540 -228814 -166299 -264541 -329662 -355902 -392824 -313536
17907 -313536 -183386 -151219 -281683 -356022 -313737 -367692 -383322 -389966 -485322 -510816 -595974
17896 -595974 -555161 -406682 -287455 -290827 -227901 -115926 -138178 -119577 -127338 -183061 -280636
17885 -280636 -332064 -308757 -213544 -130472 1023 20336 -230 -127978 -209984 -257900 -252706
17874 -252706 -264856 -280771 -257143 -337833 -278111 -223624 -350876 -443495 -426491 -399550 -317238
17863 -317238 -355804 -390251 -444742 -390086 -274127 -234822 -181527 -289340 -284800 -362549 -359607
17852 -359607 -268438 -42042 -76026 -265062 -369377 -320216 -314596 -275365 -280688 -291585 -301604
17841 -301604 -369419 -481997 -494353 -456704 -355011 -269540 -182372 -212168 -322020 -342774 -247335
17830 -247335 -225831 -167771 -108527 -82296 -37161 -65460 -90274 -160584 -264177 -317388 -353425
17819 -353425 -355061 -388384 -459342 -493660 -497907 -476056 -510293 -565468 -548409 -411157 -341486 -305872
17807 -305872 -182986 -141010 -173889 -233826 -378716 -338398 -284146 -220283 -221865 -206616 -156839
17796 -156839 -172544 -283806 -287698 -332003 -459602 -459984 -400611 -226882 -213068 -264600 -256580 -266443
17784 -266443 -262423 -212853 -176940 -83203 -39517 -127497 -341244 -409204 -301965 -309271 -364106
17773 -364106 -248378 -205100 -197994 -171144 -250258 -240644 -273270 -366220 -181378 -57190 -202767
17762 -202767 -285206 -255768 -137976 -30616 -211991 -393367 -405482 -345301 -341162 -414249 -463355
17751 -463355 -295590 -193546 -352578 -401199 -348001 -356365 -442502 -412113 -374154 -375556 -418634
17740 -418634 -376184 -394579 -468778 -485248 -463566 -456885 -496141 -443050 -414797 -415968 -314305 -310642
17728 -310642 -319906 -380369 -395120 -433858 -455710 -493173 -499713 -425031 -311432 -261877 -134828
17717 -134828 -142656 -252365 -238023 -256505 -228828 -284014 -333295 -339850 -231507 -182839 -191745 -279885
17705 -279885 -338575 -413503 -404969 -407329 -426318 -431710 -377445 -365284 -361366 -450379 -415506 -377736
17693 -377736 -331058 -284112 -340311 -320121 -316636 -392506 -400195 -315628 -251106 -307858 -336848 -294064
17681 -294064 -295061 -383407 -444115 -362508 -356775 -383323 -407139 -522055 -491883 -343204 -404031 -356405
17669 -356405 -305966 -183025 -71143 -22765 -122333 -176011 -220373 -131526 -96793 -108972 -198834
17658 -198834 -236517 -245549 -342058 -455224 -369236 -277577 -192047 -230831 -229105 -187565 -254125 -307572
17646 -307572 -380037 -505007 -392820 -268515 -280283 -358587 -363938 -307525 -266338 -118127 -81984
17635 -81984 -161034 -185281 -185109 -225958 -213104 -337404 -353883 -242944 -232452 -278164 -309014 -439798
17623 -439798 -495953 -493766 -375239 -333082 -331756 -249112 -287344 -282297 -148328 -204279 -280661 -246428
17611 -246428 -186609 -157914 -221100 -376065 -421235 -350507 -326583 -320372 -351257 -324557 -348964
17600 -348964 -447542 -414764 -333383 -456335 -567517 -512051 -442063 -356012 -306912 -202856 -274158
17589 -274158 -337500 -331608 -274964 -265427 -245284 -223986 -195774 -176850 -120855 -119828 -136360 -241237
17577 -241237 -264337 -256308 -335537 -264433 -192095 -213927 -162079 -182495 -175241 -112442 -162755 -297532
17565 -297532 -403866 -394453 -407088 -454565 -413844 -221216 -226540 -191853 -167167 -212737 -235958
17554 -235958 -158137 -156303 -295525 -329055 -265520 -279088 -386438 -420780 -352703 -397519 -294206
17543 -294206 -218519 -242008 -336611 -306425 -205460 -206678 -297924 -284779 -298603 -185831 -139247
17532 -139247 -228739 -262754 -306089 -374097 -432314 -349151 -308584 -297518 -341193 -294765 -173160
17521 -173160 -199274 -373315 -364240 -330181 -309340 -369582 -297884 -194428 -181911 -198007 -208826
17510 -208826 -212904 -239416 -317732 -223477 -174790 -140282 -155687 -241383 -236266 -219265 -215953 -218758
17498 -218758 -214126 -275825 -245199 -266675 -231986 -324393 -467906 -454002 -479872 -459770 -423718
17487 -423718 -423247 -447162 -359790 -372440 -342353 -262771 -261375 -266164 -296642 -390465 -440024 -423667
17475 -423667 -394293 -325423 -230278 -323673 -390483 -376034 -338187 -310819 -262532 -297537 -394642
17464 -394642 -336249 -280905 -360910 -432653 -419169 -386363 -350940 -387010 -504566 -575062 -462890
17453 -462890 -507861 -412775 -216695 -235062 -214340 -270494 -166155 -96803 -76898 -152470 -112231
17442 -112231 -270267 -302230 -377787 -343630 -241748 -181269 -303940 -410362 -520641 -373066
17432 -373066 -196510 -220894 -288402 -418668 -473832 -384926 -247143 -215500 -243253 -290487 -408134
17421 -408134 -372787 -212026 -230838 -347940 -455407 -477231 -475728 -339351 -287044 -398955 -393279
17410 -393279 -346842 -340945 -367636 -331795 -340171 -322396 -251651 -274504 -354642 -447720 -361280 -276381
17398 -276381 -265285 -228011 -352026 -432809 -395894 -347620 -268366 -208419 -202501 -109418 -98347
17387 -98347 -139308 -235021 -228732 -127785 -37937 -23806 -271071 -373925 -308453 -295398 -196528
17376 -196528 -244392 -414142 -419679 -409210 -362874 -307646 -179403 -204104 -322450 -246652 -323880
17365 -323880 -362198 -326833 -437151 -482951 -391205 -325914 -236075 -257315 -193894 -197319 -204571 -201329
17353 -201329 -132760 -10604 -134243 -245391 -263933 -256308 -213902 -281596 -384222 -445052 -371320
17342 -371320 -352997 -404216 -376740 -274783 -259164 -320951 -311433 -312074 -280628 -231589 -188955 -153398
17330 -153398 -124704 -51665 -2886 161788 73072 -88673 -167627 -225298 -230875 -201742 -92427
17319 -92427 -206 -58461 -153467 -237404 -207491 -103423 -24614 -4885 -124810 -169277 -209993
17308 -209993 -385988 -417023 -331148 -351440 -309005 -190787 -251002 -287403 -302218 -256000 -209918
17297 -209918 -219604 -333578 -332148 -267578 -314668 -227787 -72762 -114105 -370765 -421677 -353456
17286 -353456 -326923 -292647 -329128 -439091 -439436 -355426 -233423 -291604 -324274 -301150 -308219 -313696
17274 -313696 -218785 -170868 -128597 -99221 -184978 -282940 -281645 -314320 -283222 -87257 -4730
17263 -4730 -107373 -203343 -226139 -269265 -347455 -315425 -250735 -259300 -243979 -215780 -182694 -215966
17251 -215966 -220145 -262960 -202019 -270963 -371727 -313942 -369671 -442369 -380319 -393846 -447226
17240 -447226 -374911 -307070 -301442 -248334 -253719 -231820 -261376 -395583 -377419 -262123 -303849
17229 -303849 -343900 -290755 -251987 -341584 -353105 -320292 -317609 -403006 -497517 -449601 -349593
17218 -349593 -304780 -230992 -330695 -322457 -431834 -521508 -397372 -310453 -161697 -69110 -157276
17207 -157276 -108339 -75946 -103837 -220350 -314941 -328567 -265313 -234436 -303023 -407492 -387367
17196 -387367 -507411 -483768 -336576 -263652 -237988 -332260 -329267 -279805 -244727 -231776 -189719
17185 -189719 -205291 -183479 -184354 -106357 -123715 -121618 -220136 -300828 -239593 -242698 -238085 -351099
17173 -351099 -284669 -199575 -187706 -364724 -445444 -409084 -370196 -290965 -328121 -426585 -359628
17162 -359628 -303818 -371863 -315968 -129606 -13197 -126672 -300821 -366882 -343864 -357935 -307182
17151 -307182 -226733 -268283 -363732 -391769 -364390 -375599 -406162 -509605 -371920 -291500 -395140
17140 -395140 -501947 -400684 -283750 -275175 -274780 -299005 -309269 -224107 -163485 -307684 -394667
17129 -394667 -401073 -353247 -324097 -194572 -4337 2898 -89625 -160959 -210767 -271210 -325953
17118 -325953 -231870 -136272 -55164 -86518 -103358 -115325 -206089 -112393 -66393 -114550 -198108
17107 -198108 -180540 -199828 -210627 -172608 -183806 -115697 -173445 -195685 -169286 -123472 -193196
17096 -193196 -159754 -282055 -302650 -255666 -334517 -450386 -337120 -190935 -112125 -140534 -299481
17085 -299481 -373895 -367557 -250377 -76499 -164182 -250001 -301586 -315513 -281145 -231951 -258194
17074 -258194 -330513 -375906 -231246 -246811 -350897 -349224 -260336 -206687 -139273 -159800 -173223
17063 -173223 -88585 -127403 -269315 -321375 -301188 -270188 -210859 -99572 -33928 -34271 -138655
17052 -138655 -189385 -180600 -290334 -400840 -314569 -187983 -200134 -246500 -253589 -298414 -304483
17041 -304483 -263481 -292753 -307796 -382193 -255434 -171111 -173689 -221724 -191041 -257308 -309132
17030 -309132 -284680 -278845 -315052 -304541 -296378 -295378 -256017 -142763 -233642 -327786 -246515 -189247
17018 -189247 -216449 -286968 -371964 -330423 -315302 -215624 -305386 -299780 -188620 -115966 -224401
17007 -224401 -267636 -279464 -201787 -208944 -309473 -414166 -378458 -264991 -288138 -432519 -424562
16996 -424562 -306391 -365361 -411369 -409567 -338402 -291754 -248334 -351491 -353831 -336122 -309588
16985 -309588 -327568 -297455 -315135 -273353 -119099 -38871 14128 -89637 -174495 -257868 -246776
16974 -246776 -281368 -288569 -431938 -435064 -408523 -384775 -348343 -364773 -285536 -198085 -198963 -251239
16962 -251239 -162147 -79248 -91688 -84158 -44312 56189 -62955 -203978 -223283 -181995 -149912
16951 -149912 -106365 -230227 -294616 -260380 -164801 -125082 -168923 -168613 -124153 -149764 -114872 -125715
16939 -125715 -117344 -103474 -34141 -107886 -159415 -257023 -338925 -425036 -433860 -445608 -242323 -125562
16927 -125562 -149699 -98324 -156368 -242648 -195313 -90760 -156665 -227712 -127895 -108493 -161900
16916 -161900 -145096 -142013 -172505 -159075 -180443 -116842 -182897 -362257 -343182 -112024 -29819
16905 -29819 -60923 -159738 -204852 -229471 -221179 -138672 -79307 -103486 -271116 -360517 -452788 -461348
16893 -461348 -364242 -309840 -161443 -178730 -195455 -352879 -481650 -463070 -391126 -348482 -329548
16882 -329548 -281157 -180135 -105064 34973 25026 54519 -7550 89327 32315 -80034 -68444
16871 -68444 -223652 -289458 -138841 -73881 -163232 -303554 -333183 -272232 -220230 -223269 -164801
16860 -164801 -279399 -318844 -308990 -262711 -309783 -306816 -295672 -317814 -253972 -264543 -331832 -250585
16848 -250585 -244893 -340845 -289553 -258324 -123419 -205435 -233546 -137186 -42338 -60622 -130380
16837 -130380 -115937 -107011 -204719 -257094 -372766 -495956 -513913 -334588 -245355 -277159 -254746
16826 -254746 -261725 -222764 -157591 -209824 -163996 -79727 -69649 -122779 -215702 -229694 -181765 -147124
16814 -147124 -149131 -98812 -226940 -370943 -454683 -311801 -253076 -300100 -290381 -278031 -205658
16803 -205658 -212627 -232421 -304646 -301163 -210121 -147892 -128372 -123911 -307383 -409413 -399505 -277377
16791 -277377 -313249 -218058 -67244 -79280 -133922 -237359 -321686 -217808 -176608 -99537 -66585
16780 -66585 -42741 -105664 -187739 -205642 -211758 -150652 -163892 -210980 -219951 -193709 -124192 -163808
16768 -163808 -239298 -249960 -141534 -51646 1939 10137 -21248 -163334 -292261 -163946 -124794
16757 -124794 -159803 -229297 -262911 -228632 -178893 -48871 -61004 -60941 -44602 -182128 -313452
16746 -313452 -409179 -409398 -363512 -207308 -197859 -375843 -461955 -295418 -296521 -334713 -328106 -378444
16734 -378444 -334674 -200528 -120177 -89824 -139907 -156611 -251405 -236786 -221275 -258163 -419281
16723 -419281 -425735 -447348 -370681 -277366 -188678 -209819 -259902 -223261 -281303 -344653 -344526 -368299
16711 -368299 -413719 -549378 -553555 -431283 -319102 -316552 -246494 -172601 -604 -156289 -348370
16700 -348370 -249767 -171078 -214423 -244550 -259450 -264379 -226225 -210827 -240865 -259750 -133171
16689 -133171 -165352 -226912 -195384 -155060 -124060 -71699 -75305 -149147 -206899 -243269 -204213 -200725
16677 -200725 -144432 -117637 -192948 -156767 -97405 -94525 -215787 -393669 -499401 -471549 -339569
16666 -339569 -272508 -353430 -248784 -293410 -312226 -251504 -268985 -201730 -191843 -182648 -146702 -140139
16654 -140139 -215734 -250191 -249620 -138295 -157606 -108662 -109222 -201950 -230343 -92233 -49496 -51052
16642 -51052 -101218 -113189 -236069 -292795 -400357 -490870 -387547 -390268 -424868 -349861 -317353
16631 -317353 -333345 -310103 -272411 -319350 -369868 -378560 -202849 -218514 -373288 -280621 -195563
16620 -195563 -260458 -320406 -266444 -142706 -74022 -104505 -109643 -158769 -250453 -207734 -172765
16609 -172765 -59182 -138424 -229202 -247820 -278581 -232282 -159899 -147458 -173964 -160968 -160074 -161320
16597 -161320 -144923 -90654 -72577 -224684 -265776 -254522 -366281 -351217 -238348 -208296 -85313
16586 -85313 -99868 -134406 -117772 -98651 -236269 -368992 -352995 -135479 61029 116300 24428
16575 24428 -216605 -264196 -259611 -164472 -102140 -131604 -192496 -218330 -200208 -211205 -278743 -229940
16563 -229940 -169235 -187021 -143909 -190941 -292067 -323008 -386724 -332478 -299002 -345675 -253212
16552 -253212 -207679 -222877 -262566 -269579 -220744 -258185 -200632 -109283 -123027 -219546 -220220 -275064
16540 -275064 -229212 -398370 -444253 -406436 -394831 -282267 -246396 -249876 -348934 -373234 -233857
16529 -233857 -221428 -323992 -295276 -231388 -97539 18229 -75007 -167558 -122089 -218810 -235852
16518 -235852 -214879 -232324 -254042 -291146 -346690 -327305 -316542 -175326 -156602 -235958 -337056
16507 -337056 -342240 -288889 -314998 -226942 -304476 -365253 -277465 -156229 -245453 -379533 -360676
16496 -360676 -317783 -264567 -259389 -188412 -307700 -372657 -355802 -277563 -135938 -77689 -66633
16485 -66633 -152784 -253733 -302269 -120423 -74536 -227354 -290454 -236069 -250466 -259644 -344745
16474 -344745 -316635 -216578 -307119 -376205 -356185 -374672 -457162 -405120 -318433 -213856 -263317
16463 -263317 -422026 -418151 -280212 -307623 -337283 -341022 -201081 -233614 -295696 -305386 -251545
16452 -251545 -228967 -326280 -255898 -139029 -65296 -133839 -103459 6571 -20384 76072 43202
16441 43202 -23538 -97078 -64503 -118478 -105989 -113668 -168949 -166932 -118591 -119530 -93791 -132726
16429 -132726 -34142 -37170 -224202 -348874 -246155 -112438 -73087 11008 86196 94488 -44231
16418 -44231 -152640 -267162 -392023 -449246 -486881 -484527 -307930 -216042 -232296 -219957 -168021
16407 -168021 -19534 -45700 -107881 -57957 -6409 -77065 -52528 -12153 -174461 -273141 -183174
16396 -183174 -186268 -197809 -253774 -171828 -144819 -161769 -189054 -274111 -264170 -209030 -213699 -150643
16384 -150643 -200902 -163017 -65824 -106576 -172073 -204206 -113077 -13113 17390 -64408 -34476
16373 -34476 104310 35266 -99376 -103855 -40832 -35041 67853 62530 -13597 -169672 -153431
16362 -153431 14029 33420 -29172 -122909 -158264 -56139 -3703 458 -34317 -78829 -48656
16351 -48656 -160450 -245615 -139157 -192699 -260257 -258644 -214097 -219548 -175406 -155822 -245188 -243745
16339 -243745 -115038 -201060 -381750 -274092 -253326 -320001 -306155 -259904 -198571 -202052 -139751
16328 -139751 -150128 -106942 -289577 -504966 -375048 -373779 -248022 -201931 -177718 -119353 -187130
16317 -187130 -144500 -6055 24243 37964 -76291 -253439 -269210 -260720 -154826 -172006 -204131
16306 -204131 -100137 -173600 -109012 -79083 -49063 -6980 -4482 -56622 -66117 -25176 -117049 -135266
16294 -135266 -79607 -131605 -114051 -153645 -119330 -21690 -9558 -56617 -89060 -93324 -81553 -118840
16282 -118840 -158268 -132321 -145523 -208051 -316371 -373896 -305064 -76245 47121 -54655 -154281
16271 -154281 -145063 -172834 -314143 -309653 -224302 -122180 -39663 -21735 -183097 -267384 -233949
16260 -233949 -269004 -392995 -391674 -322291 -316264 -294573 -231831 -204473 -38680 -41383 -108650 -157150
16248 -157150 -120429 -213772 -155280 31103 51405 34857 -27129 -102169 -66088 -54506 -47242
16237 -47242 -107267 -185503 -191146 -104919 -62871 -82825 -153148 -207446 -177899 -160546 -194915 -93491
16225 -93491 -145324 -354856 -331844 -283979 -276427 -233797 -115569 -4647 30099 733 -60750
16214 -60750 -76690 9955 -36267 -88256 -143319 -214490 -150936 -15238 -1374 -7672 -84723 -121439
16202 -121439 -84485 -213283 -148909 -123590 -134769 -14312 26407 21185 3633 -79010 -99159
16191 -99159 -47404 -134836 -207932 -177928 -73109 31101 -22982 -17460 -38077 -114029 -107785 -152836
16179 -152836 -150801 -174749 -43123 118946 32145 46607 -162 10255 25569 39316 -90094
16168 -90094 -121805 -125956 -44278 -90222 -233998 -231118 -287010 -312079 -286540 -168525 -150338 -218656
16156 -218656 -237894 -110618 -79128 -149429 -101990 -90039 -161093 -163418 -51334 -56486 -44688
16145 -44688 41131 33365 113185 146261 148599 173455 224495 149894 69668 16307 -35330 -96743
16133 -96743 -200361 -313856 -358255 -204173 -86045 -110471 -234272 -245183 -251825 -134918 -5680
16122 -5680 -107253 -163823 -90251 -63130 38773 -3158 -31246 -69010 -2462 -45538 -181007
16111 -181007 -162562 -130836 -203133 -177843 -86147 -157726 -104587 -94553 -102369 -90300 -119897 -14916
16099 -14916 21106 -91666 -121048 -105566 -156003 -207234 -137912 -98455 -153191 -135152 -158422
16088 -158422 -278946 -385457 -311954 -208956 -157902 -160009 -264018 -289430 -211355 -126415 -136716
16077 -136716 -145387 -148278 -123130 -160758 -167992 -213604 -273542 -122811 -21151 -59718 -101805 -93207
16065 -93207 -42439 27804 -33195 -103447 -49713 -84162 -138263 -84868 -175823 -219486 -254322 -284381
16053 -284381 -186369 -193281 -160010 -122315 -198415 -194638 -143790 -208623 -102450 12985 94061
16042 94061 18379 -68428 -122688 -91509 -20209 -74483 -108270 -265509 -304737 -225233 -267232
16031 -267232 -286126 -273058 -234140 -85102 -46894 -164922 -258615 -249578 -238454 -328090 -285235
16020 -285235 -266795 -201153 -156565 -225857 -382845 -368476 -262573 -227216 -164147 -166232 -116810
16009 -116810 -49319 -4730 98367 77565 46160 2457 117215 17176 -95948 565 121411
15998 121411 136609 100914 23820 -79108 -13251 45861 47273 95221 21530 28486 -55990 -6019
15986 -6019 63385 71346 -21125 -191808 -234522 -192217 -261557 -193306 -483 -4425 -46668 -148980
15974 -148980 -244727 -209677 -116473 -69764 -208888 -228637 -127337 2294 47916 -60212 -155653
15963 -155653 -173428 -127981 -190999 -270196 -112410 -15400 -44258 -109494 -126670 -1955 87403
15952 87403 26277 -47678 -42270 -94849 1090 41467 -31260 -110520 -194427 -178931 -215473 -198461
15940 -198461 -178670 -226389 -276128 -272933 -162304 -74809 18328 46221 96965 104285 27334 17226
15928 17226 40355 113668 79262 6251 9829 -130396 -187750 -208522 -196332 -230324 -183554 -179986
15916 -179986 -227644 -196400 -184476 -157832 -123297 -79470 -33753 -84802 -93028 -84801 -111621 -68701
15904 -68701 -112668 -192398 -120739 -18781 -2544 8069 -57684 36487 8265 -121971 -94391
15893 -94391 -99988 -237108 -274067 -236737 -199843 -168314 -279497 -219233 -102749 -86303 -65488
15882 -65488 -113293 -199909 -176499 -91029 68317 73891 15528 18766 -17496 -5982 -104953 -173859
15870 -173859 -239126 -222957 -88282 67474 97843 115253 77045 42829 -102164 -139274 -183043
15859 -183043 -256658 -230567 -204429 -172906 -257315 -296826 -195975 -78954 -143993 -103067 -89347
15848 -89347 -122461 -191968 -185441 -111288 -131170 -26521 89298 58316 -94289 -247454 -268732
15837 -268732 -330700 -286804 -102568 -193239 -150982 -26536 53595 145528 99135 88096 -8391
15826 -8391 43852 123985 113454 61281 79083 184745 137601 35226 41499 133677 104764 81495
15814 81495 80415 126709 227161 173987 49829 -23390 -27312 -29041 -108902 -72365 -105041 -9211
15802 -9211 -13900 58429 13647 27611 50330 79647 70112 103089 -2358 -199208 -224141 -89616
15790 -89616 -34306 -97627 -73213 -34936 -138 29090 -21100 -153341 -132842 -95969 -111944
15779 -111944 -88979 -172972 -103606 -64434 -27218 95697 185246 142868 56079 79289 4678
15768 4678 -36768 2913 145175 74527 20410 -90282 -160813 -104350 -58454 91351 167506
15757 167506 193016 131620 104476 227147 481928 838303 1224200 1300545 1098211 997759
15747 997759 1050614 973287 1118830 1353629 1217491 805831 496856 391229 431155 368451
15737 368451 198458 161571 256963 215251 241565 142710 62835 -82158 -43005 64095 167724
15726 167724 166202 36506 19923 89669 92093 111253 82253 -63452 -53059 -59022 -91535 -143230
15714 -143230 -149861 -164426 -208267 -231177 -114269 50554 21543 -141048 -260984 -177630 -48056
15703 -48056 -15594 -80025 -10970 5900 -11504 -11659 9391 57889 34248 -21532 6944 25644
15691 25644 23180 90223 -29026 -157738 -56111 -29824 79263 151289 73602 -44881 -160251
15680 -160251 -131354 -57017 -79769 -161101 -140833 -218321 -326532 -141595 -84296 -86006 -54532
15669 -54532 -91286 -127109 -169920 -116808 -94038 43927 -336 54983 3854 31971 150606
15658 150606 116955 88631 54926 18788 -23219 -8521 107236 111582 99157 62377 87768
15647 87768 69923 19255 -50073 -78501 -97416 -31429 -55153 -130261 -173753 -215473 -211932 -219075
15635 -219075 -201866 -156796 -156963 -144601 -98812 4938 -55352 -70558 -93158 -150188 -104878 -22136
15623 -22136 -37957 43247 66360 13522 -51058 -89445 -18834 25602 36358 74939 125657 72260
15611 72260 32230 66205 126645 109892 56977 42493 62631 54409 20168 16186 59288 89974
15599 89974 92304 -66364 -3355 115458 66690 94843 -4730 2243 177376 47087 -77489
15588 -77489 -48089 -36385 30662 40083 -55441 -72436 -92350 -33435 47273 33104 -39257 -8618
15576 -8618 -7421 105901 115493 -12265 -91830 -35225 69586 322218 346008 281316 124169
15565 124169 -12855 7775 100083 81816 4591 -39577 35904 123396 120194 42205 39152 16271
15553 16271 12991 11664 155268 167715 47916 -26340 -51848 -86517 -207161 -171865 -99660
15542 -99660 -132257 -125895 -81501 -25548 -99077 -142423 -39924 148159 122438 143578 214658
15531 214658 249033 71123 7042 -84433 -101851 -33252 38020 7653 47819 104925 39189
15520 39189 20356 15970 34274 3253 -42421 66619 79430 -45439 -61575 -35665 -155146
15509 -155146 -183452 -44447 54276 7199 -62466 -45174 -78740 -82976 -215147 -254808 -242828
15498 -242828 -91807 -68964 -121674 -31994 77876 19966 -100352 -281838 -348639 -327334 -179611
15487 -179611 48106 82654 53234 105649 56488 -49083 -57129 -149680 -183782 -136766 -167749
15476 -167749 -199985 -118346 -24046 27618 52632 95028 147237 55227 -26909 17800 -65330
15465 -65330 -67894 27106 111650 92284 29131 38351 39886 70826 121452 87514 8027 52125
15453 52125 -66705 -194761 -259515 -130713 -86049 47054 125917 25019 -204114 -208092 -104443
15442 -104443 -109020 -74168 7013 -94044 -97596 -40385 105128 101477 159342 272725 179073
15431 179073 105914 143872 87006 8515 20977 72139 48336 -32208 -82764 21084 176987
15420 176987 214909 164475 147685 159282 146873 38938 -107650 -109062 -75332 11628 -84204
15409 -84204 -120406 -111863 -205533 -186392 -82823 -47543 -123331 -143596 -98200 -85706 -32173 -622
15397 -622 -35078 -15341 156199 168568 71238 536 25212 22918 57335 56787 98059 117220
15385 117220 134092 90292 217485 115005 53895 6194 -28584 -63191 -19573 37944 30376
15374 30376 31515 78834 34705 -9926 -23486 40564 146939 115398 108330 265956 221994 172192
15362 172192 218107 208799 178677 100618 90945 -16673 -64746 -128426 -178274 -164332 -133995 -27329
15350 -27329 143746 263025 157973 71691 34446 82313 75221 -60543 10970 129285 251662
15339 251662 178384 93425 35980 61595 180753 175367 186424 182720 91472 -46377 -74653
15328 -74653 26601 95644 7672 -71224 -64369 -55639 -8794 42997 -14540 -91831 -161803 -161528
15316 -161528 -119953 -175234 -95105 -83746 -21277 -12900 -28866 66270 249365 257344 156442
15305 156442 207020 187558 196590 162360 30001 63268 247136 228824 122778 31068 22647
15294 22647 -49235 -47758 69106 219212 217177 303506 261712 221171 192475 205954 61648
15283 61648 -41862 -20130 57414 144244 87214 108067 77364 80043 118604 126370 -52094 -26798
15271 -26798 50925 -2065 59442 108911 63267 124272 91185 110653 180552 258159 190393 87277
15259 87277 -93672 -212236 -84510 82105 8007 33252 104811 115282 -69059 -131592 27533
15248 27533 101178 81142 47787 27748 12174 -53841 -104999 -43740 -7809 47329 -81272
15237 -81272 -163277 -185782 -95018 -10534 41588 -925 93778 173899 78271 86172 92429 61028
15225 61028 17421 -100193 -150839 -142388 -102196 -83578 -141781 -67742 22997 47958 -18143 18349
15213 18349 -74660 -59251 113654 208739 232836 182107 194886 221823 196660 207487 112542
15202 112542 9161 -38116 36870 151917 82496 62649 31186 107236 116915 75352 48507
15191 48507 64027 126729 209705 184881 163925 157698 157990 120621 79640 215880 187978 192590
15179 192590 223096 34283 -47805 -34226 34445 68532 56404 77475 67812 -76654 -72765
15168 -72765 -51364 33790 157379 194025 214841 138011 84000 164139 147719 149962 179288 121143
15156 121143 197297 227751 119381 45851 5651 -20060 21105 -1339 53161 177231 125974
15145 125974 130186 200964 168535 132945 20175 -81206 -53497 14244 34265 -39433 -14959
15134 -14959 140608 197524 198019 36650 -42063 -128537 -104601 -28057 18235 18381 -42807 -113495
15122 -113495 -54446 -28680 -134461 -126191 103565 195053 196613 155018 109255 112086 148021 195564
15110 195564 171834 214969 244470 204914 109322 -42389 -75510 -80766 -5700 115131 52918
15099 52918 12030 -85434 -98648 -77777 -47393 27906 28923 -70316 -95851 -86508 33368 206008
15087 206008 202556 278805 273616 267394 90464 150268 119907 161360 218515 126608 37591 -5401
15075 -5401 68780 133160 16562 -32681 40783 127909 232259 237997 158233 66999 11987 -2274
15063 -2274 28745 131525 169595 172950 188667 198909 193649 187100 191869 170568 89583 73250
15051 73250 134101 70792 29045 42358 77430 143843 150438 231064 289637 220083 133706 163978
15039 163978 191426 181927 136630 155284 136112 34207 9193 24438 11545 58423 69094
15028 69094 46527 90442 109588 219753 231573 169739 113391 187983 209594 199933 171325 113572
15016 113572 128803 76399 185665 323982 231617 124802 131073 95663 150250 280339 222910
15005 222910 236555 220182 254696 213381 158167 76469 995 -20149 29304 124301 44938
14994 44938 12859 20074 -17100 -48369 -31568 18630 60286 49852 191560 266444 263518 266898
14982 266898 167594 88857 101367 209800 187238 144415 138730 118481 65988 130498 183650
14971 183650 115617 80142 241452 320481 227199 165245 107389 114617 225429 239654 200948
14960 200948 247380 128499 16325 -67206 29671 122986 144369 29495 56786 158195 100879
14949 100879 -28181 -112092 -202199 -71518 9123 104033 61582 114385 226017 225535 121091
14938 121091 91155 76439 39763 -94451 -150171 -134968 -89272 -120475 -148328 -27123 73704
14927 73704 42811 59354 70333 -12797 17712 118214 41731 -30005 2251 -4944 -55732 -56406
14915 -56406 48832 42127 71830 22799 -52103 -76348 -82324 30350 42204 69023 63644 14736
14903 14736 54102 186462 212194 52848 40825 41038 -32661 -115649 -145157 -90226 -43858 14835
14891 14835 79461 94498 100137 46114 65123 142623 278552 276054 208784 145535 108992 152745
14879 152745 185742 130056 245589 223924 222330 226331 160408 67424 39874 64374 54305 237331
14867 237331 295653 303620 287664 266565 268272 199853 81487 185794 336954 390549 372223
14856 372223 317746 129781 5793 1240 66665 74655 81567 74148 156080 157716 60359 36343
14844 36343 -12431 -25749 32089 118040 143506 146588 207546 81236 11490 52216 173145
14833 173145 203976 155872 164879 44609 -54212 -1775 1292 9739 24953 75035 84376 91917
14821 91917 125504 85964 46723 29593 82396 22301 -15057 -18503 101766 302572 355316
14810 355316 390130 318059 176046 153494 107922 102840 102989 15606 -1190 17126 86428 98940
14798 98940 38890 11970 30770 43287 -10849 43492 99062 168713 101128 -3624 -10701 106920
14786 106920 95562 23243 -21014 35114 64796 53591 2833 -35314 -3793 -11502 69996 151799
14774 151799 62408 75730 104722 219496 196009 155573 195100 196391 160223 192794 111989
14763 111989 -13718 44971 116770 178493 168034 199491 164225 192498 178731 138542 -12281
14752 -12281 -43639 70715 128450 198132 141586 159174 121484 174879 301072 296114 303318 266059
14740 266059 177654 60973 -14491 42458 39530 7163 122320 106967 155203 254794 279055
14729 279055 237760 141975 212561 237161 244199 234201 177010 182217 172072 226718 184324 218050
14717 218050 194648 173938 201436 162176 94353 85851 47467 13519 27520 139717 269320
14706 269320 274550 236187 130375 131977 27876 -51018 -147303 -52560 38676 76593 110981
14695 110981 139704 124809 152220 201723 217239 213796 246287 181147 161342 213821 313282 252702
14683 252702 90616 26986 14427 131785 148213 39018 -40988 -30059 91464 131058 112592
14672 112592 26305 33042 99178 176032 218774 220822 250561 212357 107561 207111 355630
14661 355630 272203 361205 343109 239068 158985 160081 222517 270443 184958 152821 149918 69363
14649 69363 133588 201396 125847 214104 241876 304042 357450 371404 309111 281867 302146 249002
14637 249002 193361 158691 55597 151083 285957 335947 271655 350276 318512 298719 234799
14626 234799 268008 261727 250590 201784 311713 251663 148717 149833 84809 150018 388789
14615 388789 464454 377659 363207 329804 231794 267186 340101 331806 319371 256068 156342 37763
14603 37763 80716 246033 264507 335333 500388 446943 291691 265275 250934 195434 271015
14592 271015 316001 282235 242026 257509 296699 231266 96824 50870 36371 39185 2423
14581 2423 129712 222768 210281 162641 137820 162551 227437 187956 251328 264430 185897 256190
14569 256190 405863 419787 314189 179630 166237 172246 120527 164105 104875 -11506 40816
14558 40816 25831 -22479 49389 132082 197920 270647 226603 110596 92760 131162 92190
14547 92190 89028 144664 83234 19495 185759 246551 238867 227951 198019 153262 204842 306741
14535 306741 329965 245037 263824 260082 269094 210595 84241 -47846 -27807 58947 152854
14524 152854 168615 122164 91110 254610 225290 114000 100226 135231 125650 92171 95496
14513 95496 94145 193629 172136 -2458 -75259 -37042 73035 264221 360344 331116 213715
14502 213715 226727 283368 328871 339864 231420 251075 323126 373569 359080 200015 125972
14491 125972 197454 236068 282782 315599 311874 361913 375022 245540 243336 373792 361284
14480 361284 299488 204630 153662 215359 290937 222350 284671 136817 66349 76264 150363
14469 150363 246682 264628 266242 256865 303200 266265 218812 178095 159210 199491 239096 175175
14457 175175 141628 188295 225684 198710 183980 187163 199042 150338 168914 299362 207123
14446 207123 173836 247044 186827 107234 68189 2752 107274 275811 334279 191311 127039
14435 127039 211635 236693 234987 231212 241474 180746 124982 219391 290876 344956 402901 345978
14423 345978 295460 153385 75548 105611 198349 310845 226986 185771 96383 121865 135929
14412 135929 168532 195205 232677 247656 209025 184967 170440 128723 91877 181776 168921
14401 168921 240616 246588 218289 349665 302962 290353 355352 373605 432130 383230 401712
14390 401712 167173 34919 91058 112144 103971 231164 224290 246865 314412 398214 357331
14379 357331 368562 195061 140908 259312 341467 313530 250361 220730 242418 223549 82785
14368 82785 11199 57575 113902 243442 313246 412005 367940 322556 441187 438377 290465
14357 290465 188388 171045 144035 252528 337836 386421 294394 193076 211486 195265 152594
14346 152594 91728 116297 140345 197148 168925 103138 -97193 -185087 -117655 53916 207784
14335 207784 286417 310668 348503 286523 192442 296300 354360 265985 236090 212750 278506
14324 278506 456400 369915 181452 245300 362945 438929 313353 160821 259926 279557
14314 279557 187815 235074 292110 264823 199687 134321 147480 153634 195109 234981 330109 299734
14302 299734 296616 270696 130126 63810 58409 106391 41974 57153 72230 76283 66952 93500
14290 93500 124130 133507 130768 5719 72416 109300 114674 223778 300935 159283 185231 270915
14278 270915 275183 256146 303267 349291 375206 252225 177302 149344 150930 246133 303001 239591
14266 239591 201982 228135 286291 194747 108754 131561 260144 258600 134768 157315 173278
14255 173278 192411 316395 370681 392306 394513 392487 322557 316764 268125 256495 242387 266148
14243 266148 207194 230967 168325 106373 212826 253632 317450 289625 248034 243172 181688
14232 181688 103164 154674 177929 132519 173042 210954 187714 221870 301126 249088 202073
14221 202073 114696 141575 244123 322466 344786 399683 342538 245812 173588 140040 240732
14210 240732 230069 169991 146799 194347 186219 130449 176829 166209 110767 59650 96394 52258
14198 52258 120093 283477 316544 177994 87718 103226 133128 117348 202270 200326 93846
14187 93846 -5788 30622 26865 -6108 -33693 8216 76510 173832 187616 177020 203896 197947
14175 197947 170785 140926 234655 275315 267551 199187 81460 41967 157841 329187 297270
14164 297270 326078 383229 310042 278946 353869 282107 331979 401210 325845 259877 229703
14153 229703 175686 139292 165123 159252 263836 312973 439028 512127 364372 345717 476495
14142 476495 533338 508369 388442 309491 309522 340279 266106 294633 352658 389052 340334 298505
14130 298505 366427 315470 243963 177702 217640 231099 201729 192231 135763 120626 171956 200120
14118 200120 230623 328547 310018 206075 143187 250806 374314 432499 513848 516284 532338
14107 532338 503254 412514 311078 247493 264156 228887 190051 265989 292473 136035 5162
14096 5162 -52639 75096 90098 43870 93013 156184 206166 349886 336915 269349 184519
14085 184519 188054 197853 297441 370433 419350 444846 394581 269667 257149 289029 333202 426369
14073 426369 473893 452657 401289 334009 329595 459864 233469 128380 66301 42664 147348
14062 147348 228893 286841 224963 163254 186433 209502 291108 334559 147711 189686 293606
14051 293606 230071 191106 102505 125700 198417 194607 142778 130771 111048 134335 187385 182047
14039 182047 175300 155128 189738 222535 208293 54970 43346 110371 232337 331131 244808
14028 244808 196266 153658 226085 328939 417241 375665 313874 387573 379320 330520 352323
14017 352323 273683 276533 429288 430098 395491 430463 422407 284645 265324 193307 162139 249890
14005 249890 268462 247993 301279 264304 260698 306582 232048 151410 82149 107293 211916
13994 211916 211949 255426 250540 380858 327692 375126 359327 304987 183620 96862 243419 273044
13982 273044 311386 373590 300897 173131 196893 235858 302832 384882 400338 304231 264028
13971 264028 247204 275900 258283 224513 234065 353742 322934 217552 185742 195900 274947
13960 274947 331294 377752 406341 330933 322259 426625 389072 327753 338221 287618 337238
13949 337238 403557 517858 557700 536059 455106 463228 505511 347229 248911 295328 360342
13938 360342 422269 425304 368125 162147 137477 81803 61992 179314 332252 309531 334609
13927 334609 398860 344724 308906 361932 380345 400914 393830 351349 317052 298773 364930 327284
13915 327284 199962 147239 192771 263513 294854 226437 160828 42209 102257 186790 208892
13904 208892 162021 110999 221069 258920 257956 368681 390437 311761 297737 304093 296696 294304
13892 294304 229192 43941 47820 56182 113452 50867 22265 84797 132193 200198 335246
13881 335246 395552 482221 371160 342283 364993 333131 284088 272481 250794 275763 287181
13870 287181 103148 39748 38823 123902 166387 162715 200147 159860 144109 165993 253183 385724
13858 385724 395644 361640 279052 252710 57955 -12955 25120 195371 312109 279018 326742
13847 326742 350385 313577 244661 205552 216454 252001 234931 245638 251732 250041 275287 123364
13835 123364 60529 82665 68458 132689 188788 63548 81404 204581 234577 182804 231267
13824 231267 326553 495864 516759 450177 456768 392553 329038 314095 338611 419098 362468
13813 362468 259492 202380 184614 241929 234892 221529 337675 419934 304684 234947 243799
13802 243799 332409 363535 309022 225157 212089 342905 318397 222207 228774 173156 107399
13791 107399 190383 248041 276128 263201 198765 197955 198241 279361 336211 328957 237337 259023
13779 259023 193235 175164 309190 401350 413805 458184 415997 402582 403130 397485 397763 454524
13767 454524 444740 417239 379595 231504 145581 263306 353994 321123 300963 366054 338821
13756 338821 335678 343522 243341 371686 381265 394190 412074 410430 375187 335131 320060 363042
13744 363042 425573 448206 423872 436139 348772 294799 411584 455440 376586 406281 475717
13733 475717 435465 426189 279372 138977 152080 293441 193892 197311 270245 286116 327392
13722 327392 280354 314894 296648 298368 178297 84585 65490 35544 58187 60369 256833
13711 256833 368815 353993 314438 329478 277721 244365 233263 104084 7349 69535 226484
13700 226484 310411 445171 472075 412811 372092 257827 204196 341662 512220 433146 419133
13689 419133 406316 300781 248126 294984 269757 216463 184582 193876 196173 198613 169291 131024
13677 131024 108734 50906 179865 275705 329835 404219 495460 560125 607233 562727 447034
13666 447034 418486 439540 392972 383837 389709 337788 330199 265520 345113 385710 297165 196660
13654 196660 299224 356453 357783 363101 351798 255013 336624 400613 376422 384442 381542 311990
13642 311990 220385 206439 254910 292696 218108 230382 237845 221832 306670 398603 467209 507308
13630 507308 491145 407862 422383 394462 324304 354229 389234 339429 282204 301112 224274
13619 224274 181527 146907 173794 173914 187229 249367 290032 219632 172117 307665 404181 416753
13607 416753 362491 313779 277858 323341 288250 215137 257993 322131 348781 386912 398454
13596 398454 396812 392461 318696 281311 331549 437718 542249 469353 484451 475592 358324
13585 358324 342786 225958 226288 276720 214744 166781 126375 175487 252182 246186 241754 293705
13573 293705 299133 388504 455457 374303 220128 133814 165130 207224 187476 189397 229587 323701
13561 323701 276871 197417 225521 349883 465544 471744 391860 506894 404766 306734 293999
13550 293999 269364 212905 286347 272427 288655 299173 342293 264198 210869 215325 191533 168312
13538 168312 101607 197414 279955 326280 349576 315390 360647 417218 444981 435301 452074 374774
13526 374774 334114 235826 264333 166677 204372 190649 237504 314014 362827 343017 293533
13515 293533 200198 207082 353833 383476 288481 305613 371585 298105 364985 332453 286265
13504 286265 349203 461160 462936 379331 270543 263004 328705 292146 79799 4455 1674
13493 1674 59602 176350 231042 196293 188218 279720 330617 386579 427758 575846 502860 447928
13481 447928 466721 331831 217836 321293 369837 338453 270322 247728 333920 427440 497039
13470 497039 508509 380135 235886 192257 169405 174293 292861 372581 361245 260935 125327
13459 125327 96630 183130 186168 213624 143467 21652 68017 170700 373917 367988 282348
13448 282348 303081 353583 255267 138639 177375 234709 280854 291467 151962 150493 205349
13437 205349 315842 361770 368376 355262 300029 339091 298331 261920 242943 298461 348109
13426 348109 286009 301028 366373 241307 219276 366681 495927 476390 397317 391077 268288
13415 268288 286082 293770 258639 276584 209528 165367 190062 302555 303631 234920 203074 217122
13403 217122 260648 294956 274824 390404 520457 492875 407474 514879 596556 485659 365088
13392 365088 317312 373032 467590 462671 476201 400687 346674 275463 301969 246013 225647 248139
13380 248139 186423 123793 198404 316116 344426 281305 308586 378563 299260 316784 403184
13369 403184 515491 423135 415771 429408 447512 410661 468206 543178 551983 400600 266391
13358 266391 190006 152868 230251 371848 418869 331457 328335 317829 323169 335554 407619 490286
13346 490286 502599 408359 305932 307308 343400 468957 335448 282702 205793 289780 441105
13335 441105 466875 409016 343821 483320 446998 384836 306113 107299 -6153 85470 264628
13324 264628 270381 214454 191765 122353 73549 -63556 -97558 -38503 14116 48223 51901 114357
13312 114357 80784 172878 169701 142243 101019 112424 190511 279004 306484 276466 331423 352307
13300 352307 263383 263971 425550 464068 474530 519848 492650 440926 380391 319426 352942 412748
13288 412748 292316 146693 104335 266525 273169 313569 306826 183452 249993 311168 273218
13277 273218 262541 281696 297351 452324 371569 293210 305618 298806 204262 182342 283645
13266 283645 443123 456937 336479 260061 183061 220493 272531 369799 377103 363465 431339
13255 431339 394957 338927 339942 255158 200273 292958 307391 399897 480550 468042 368173 388802
13243 388802 412045 410625 367227 251876 260880 288500 349969 428780 327552 318793 312447 317796
13231 317796 379006 400867 458159 422947 382615 464482 446869 391933 305839 229026 233956 184059
13219 184059 96608 35270 251309 289901 468003 483433 357642 333277 360848 264406 194706
13208 194706 214773 200799 276566 316991 341407 402097 498037 460775 387895 387957 426572 501767
13196 501767 606980 595734 406082 248137 215101 321050 440350 380337 229001 297474
13186 297474 337458 275057 309238 385932 536714 484206 497972 282688 133458 158508 163583
13175 163583 125676 154756 219796 212216 228052 264428 332906 460141 429656 394467 407452
13164 407452 319947 352032 431682 471298 406290 330186 302341 336779 348242 279010 354766
13153 354766 288141 102275 200005 316155 260504 241838 286544 378233 340041 219668 108346
13142 108346 137804 221978 172277 213819 190028 158054 177701 214158 272505 377583 403959
13131 403959 415562 373019 328186 314341 334665 305976 290383 304337 390373 388394 313203 247126
13119 247126 243482 291744 279186 264307 196829 187163 191082 280612 272633 240822 204216 198893
13107 198893 249838 286753 245805 238322 341578 283960 176592 136478 134549 232796 257400
13096 257400 226474 381858 427587 358622 316199 272724 299301 333838 435092 524489 594878
13085 594878 640731 611079 600712 550052 453565 399430 381095 335856 310159 323324 192860
13074 192860 149637 180582 135909 66421 112746 214115 188482 258605 229557 113782 191320
13063 191320 187404 94821 55029 215559 439719 546432 481252 341932 337903 310702 367599
13052 367599 292521 243705 312425 298125 225313 145258 265406 250487 171021 227253 280863
13041 280863 252720 262516 260652 223933 236997 218558 327402 344779 196800 -14163 16838
13030 16838 150758 280065 328699 375906 391972 408836 349415 347724 484658 510689 482088
13019 482088 342859 208486 192658 287021 422509 459590 370541 337772 357658 314731 355419
13008 355419 432405 426899 458484 464149 514096 382283 260325 195539 152293 198778 119796
12997 119796 152411 229691 247580 236965 141123 76660 97727 124204 168383 196859 231385
12986 231385 234456 218950 280568 418981 386859 398797 454276 367726 387324 404418 431330
12975 431330 395916 376486 337123 283652 298706 284831 396136 391662 312579 283554 373476
12964 373476 425611 334004 277694 286965 395700 415730 326578 352909 346317 255859 232263 203076
12952 203076 244845 269412 177179 73638 49919 165136 230564 276403 327510 205209 179953
12941 179953 223216 373404 401588 360302 324726 415910 298609 125466 59108 85397 92609
12930 92609 150038 251978 428199 415027 379910 426792 315934 321928 315767 387706 407637
12919 407637 255731 244938 358414 323226 280545 159199 335 -34843 17072 58909 220509
12908 220509 223153 175236 167814 192269 243417 187488 110129 124619 234557 398392 388796 236169
12896 236169 151890 237854 373682 365477 297519 379234 409807 389721 329115 187620 271808
12885 271808 348512 371162 321038 334768 327112 330544 344021 319507 352505 361423 344926 365987
12873 365987 371208 376099 350680 230029 277478 247486 256329 173898 115289 197180 227744 278471
12861 278471 286087 275563 264024 217358 237772 251171 355634 417613 320726 260922 226149
12850 226149 227600 271558 316230 408738 353522 323724 333189 387242 270551 232780 184767 275921
12838 275921 304856 242230 248643 275197 320667 311041 374720 456148 290445 184767 352965
12827 352965 445127 516809 415258 237790 316822 384839 350561 326416 241110 217792 204677
12816 204677 280890 295723 358481 467546 543572 394870 351084 321301 206612 105392 133943
12805 133943 132152 73897 75304 247979 389869 234947 149192 247655 349640 467182 534979
12794 534979 301634 250146 239536 253363 295744 187214 133751 -24268 -83752 -77397 16032
12783 16032 95735 94909 77804 141421 157072 134976 237406 277891 359983 402009 344217 291109
12771 291109 119415 41637 84941 25292 66992 42069 199520 277342 395925 378341 278366
12760 278366 169557 188720 239711 296127 201730 251331 320567 388826 255381 251875 319369
12749 319369 260774 199255 248672 221261 292023 189375 110820 286969 357415 318233 300318
12738 300318 279188 317984 221344 151043 209187 278948 308194 223511 149292 178762 169815 108878
12726 108878 149664 98250 -24547 9464 106966 174862 78202 117926 109120 145100 335694
12715 335694 340773 301750 248736 76553 126551 251616 290409 221817 351636 407839 324978
12704 324978 180555 142777 70011 92977 219399 284405 156980 -18999 5279 23784 42677
12693 42677 114954 187567 248745 238330 241371 270140 327398 278392 250010 130113 142400 275362
12681 275362 274840 211500 259944 254357 263521 273950 290819 201049 231805 196992 159140 153471
12669 153471 183971 232247 278291 224697 135938 104113 56249 202995 237705 214422 144686
12658 144686 -11913 10241 214510 382993 348181 327983 246187 204874 81347 68340 66460
12647 66460 138506 212231 268347 182449 180505 140431 82371 113528 119145 137708 277320 344276
12635 344276 268565 106507 72084 230734 282132 343777 439570 413667 335170 321566 265260
12624 265260 143239 218119 425688 468737 496087 337617 215682 161115 148240 151107 211841
12613 211841 375688 342178 277324 231176 170236 221768 98633 67046 68493 178056 164550
12602 164550 104603 117755 91092 100529 85548 78746 40335 -10049 -102132 -62889 46096 110249
12590 110249 158478 187146 201967 185764 163603 142833 109239 90914 140403 141527 131368 98024
12578 98024 115501 143204 340471 472454 321296 188904 149663 204876 158045 72854 130753
12567 130753 110986 90963 120901 33370 -35493 -5231 -68065 -30098 92534 189102 279398
12556 279398 257761 171522 74563 23990 116568 180971 205244 268939 327395 301763 212986
12545 212986 117517 111812 140268 182129 89715 130425 328314 395655 351093 183396 159989
12534 159989 221851 262099 278255 144726 120474 264233 344963 317415 280566 269221 285846
12523 285846 123603 133644 201274 260477 263924 247570 281050 399843 470885 411351 252733
12512 252733 217157 123480 152417 303234 255788 156760 218804 321446 413967 363711 215790
12501 215790 144868 198571 233422 327992 309453 230559 99307 -29323 82029 165259 159616
12490 159616 82288 117727 35498 50344 164548 274123 273991 157746 36525 65530 210527
12479 210527 173102 103302 22499 70171 91837 44509 28797 110328 122745 103035 55370
12468 55370 -61162 -135947 -115628 -30487 155849 182136 106897 -39846 -7331 102122 134465
12457 134465 150757 204449 176296 153639 176304 195813 291860 410078 436654 322207 320756
12446 320756 397888 235865 171343 272263 243870 139979 177848 359971 359588 265370 321743
12435 321743 250567 195194 226167 212496 234591 340858 300716 286389 332914 311175 381073
12424 381073 383305 362094 321767 286769 254206 191628 133922 163836 127392 40401 30369 9278
12412 9278 75237 242141 289979 129228 30111 2489 45502 13610 -53039 11411 168387
12401 168387 129454 92959 166122 139006 243091 216869 83634 168681 257476 265582 118579
12390 118579 33870 -53596 -101628 -112712 37184 17671 -70828 -39537 10533 103077 34785
12379 34785 40379 88295 232154 254157 175866 142804 151479 271412 253924 64307 99655
12368 99655 128313 204678 351748 438414 304992 155082 91652 37734 73523 212797 338892
12357 338892 360218 306125 197976 43493 -26081 -30835 59618 52623 129043 181773 260141
12346 260141 323756 312489 292912 226208 117828 34553 62186 6821 -76166 81807 71131
12335 71131 895 70150 137749 212246 178186 32905 -60908 -31437 -52970 -70579 -22856
12324 -22856 63393 149100 207154 86354 89869 -31460 -10871 109909 203192 220573 5821
12313 5821 -36044 -3176 64544 119358 74698 79654 129267 203208 295513 275753 203896 134324
12301 134324 145723 156875 187540 170905 168119 215959 213208 189108 177359 128863 22237 -15425
12289 -15425 1214 18770 -61785 -107915 -98262 4291 73688 -30154 -86181 -10075 90992
12278 90992 113889 88273 53946 193945 226502 167507 163674 234529 275657 321184 238479 178323
12266 178323 205518 139254 149837 147283 157679 198248 172302 174158 148050 139138 237320 206011
12254 206011 194848 168054 108479 167293 230327 182175 121681 65564 -274 54962 177595
12243 177595 217460 140565 153593 116876 137964 103077 155153 156726 164151 96956 98925 92339
12231 92339 156223 115486 -9288 -44328 -98724 2210 104192 142179 255108 257337 162263
12220 162263 74848 53798 -7253 46320 91117 18953 77742 -35697 -126961 -89975 50850
12209 50850 52126 131513 76123 68257 261351 318061 159252 112745 118983 115037 -33215 -104772
12197 -104772 -140416 -70582 47909 85728 -16832 -6761 19419 86356 9176 -8732 116070
12186 116070 116808 96166 -3599 8084 68452 59843 -56783 -103191 9933 21675 71084 75712
12174 75712 130879 168285 124178 42515 57540 110905 170686 138927 94642 159019 116929 42213
12162 42213 44384 119045 118546 26432 56691 104811 109855 124957 148030 111169 -62898 -53639
12150 -53639 -58712 -45012 19091 191804 287367 139261 96120 50343 79027 76548 81582 101331
12138 101331 102568 199241 131017 38781 50122 16707 66304 -1528 -8480 65605 78659 67622
12126 67622 -90364 -145939 -174938 -139154 -178971 -122196 -60530 72425 109537 17810 15351
12115 15351 52496 3805 -146770 2288 134669 228785 161557 35825 32668 118735 214314
12104 214314 136225 47019 -26838 -79217 -30352 -39092 -69959 -19910 27558 -103351 -171960
12093 -171960 -161358 -151079 37461 160216 179482 51064 -499 -18881 -72348 -34232 -42790
12082 -42790 -21113 5667 -26072 -25811 -14791 -91136 -16318 -5771 -49637 -64625 -47487 -7828
12070 -7828 3166 -30355 -55738 -16739 -27216 -13622 -29525 -50107 14707 61966 120223 136545
12058 136545 140025 73126 104264 61560 42271 29195 -1306 -108188 -85701 28224 71136
12047 71136 57863 75616 -56478 -81320 -9148 23800 71755 62422 -51148 -121827 -135140
12036 -135140 -27396 74081 70505 21157 55293 105561 30382 -64336 -103634 -28212 -3272
12025 -3272 13761 69410 15376 -98348 2386 22219 29807 83709 120158 209922 148439 156651
12013 156651 183293 42923 31879 -22536 -49473 -157592 -141588 -145928 -106762 -68081 -56947
12002 -56947 -134884 -94883 -96904 -122383 -232449 -281346 -316587 -267865 -153921 -21189 12347
11991 12347 -15982 6737 65493 41878 10402 157044 163628 69797 44062 -80839 -64801
11980 -64801 -91172 -106902 15424 9822 -37504 -28226 19935 -46954 -42119 -3418 -76693 -75814
11968 -75814 -103620 -69366 -80856 -78700 26797 106770 -13282 -95006 -6460 3677 58849
11957 58849 227857 138255 57723 60470 23144 -111714 -79187 -44352 -59536 69389 69987 26376
11945 26376 -63509 -117383 -189823 -138147 -50599 5647 -107827 -299798 -366374 -382087 -250853
11934 -250853 -141056 -183416 -186752 -152170 -123902 -107690 -102874 -35287 -89342 -52724 -8936 13197
11922 13197 -7060 19431 123558 149398 51647 -28422 101365 115096 18875 -49923 -17136
11911 -17136 45292 -98911 -164173 -94674 28619 126340 79290 7849 48085 52860 -12837
11900 -12837 -59805 -95537 -215549 -178170 -60693 27019 186336 179339 101894 -26379 -157974
11889 -157974 -224984 -136397 -156978 -149948 -48277 -41068 -41690 -85806 -145400 -184273 -179633 -156289
11877 -156289 -151257 -174498 -242119 -122220 -58703 -89531 -151366 -142509 17112 4211 -80541
11866 -80541 -118525 24651 -24677 -49914 -124324 -243443 -205601 -181550 -142610 -175412 -223304
11855 -223304 -250070 -216454 -160012 -178164 -207162 -129492 1804 159712 35805 -188369 -124597
11844 -124597 -101650 -155498 -212231 -300181 -265691 -89712 -33908 -88084 -143953 -165554 -202266
11833 -202266 -202537 -264319 -224665 -183889 -169116 -222409 -325500 -338048 -254331 -261988 -174452 -195633
11821 -195633 -266357 -249201 -159218 -122596 -166616 -240425 -392362 -298545 -127887 -66844 -147853
11810 -147853 -273847 -186157 -76073 71737 63274 -102095 -101365 -101277 -159218 -257699 -355200 -269399
11798 -269399 -93716 -152983 -135281 -167247 -172406 -55118 -55810 -66408 4352 57811 -26298 -86941
11786 -86941 -119285 -20240 -12751 29229 67526 77689 49975 -1096 -221844 -198726 -194817 -111688
11774 -111688 -7538 -103666 -91699 -267787 -265359 -184292 -62106 -75639 -190630 -170812 -155957
11763 -155957 -130423 7194 -52359 16340 123530 10404 -122905 -204749 -162831 -51581
11753 -51581 58517 -5264 -36086 -15915 22155 56457 52426 -118569 -275475 -211625 -141089
11742 -141089 -106780 -154313 -239596 -224774 -126589 -204810 -231781 -192805 -163473 -204825 -260126
11731 -260126 -265214 -148790 -130635 -256474 -292794 -156118 -40877 -59587 -127771 -206118 -233914
11720 -233914 -262909 -203248 -244945 -223499 -47451 -6191 47118 -88089 -196421 -186890 -216425
11709 -216425 -195883 -174147 -93832 -65337 -53463 -67946 -111183 -79631 -105436 -48931 61526
11698 61526 119582 81835 -12348 -94777 -137950 -91753 -167988 -96730 -223741 -265313 -231696
11687 -231696 -291898 -234498 -201276 -128669 -62668 -135361 -67973 42546 -41048 -158762 -218134
11676 -218134 -132464 -181560 -187974 -179915 -197385 -230047 -198907 -222714 -199206 -167815 -65047 -24299
11664 -24299 -203217 -286699 -384247 -423367 -295647 -123080 -102925 -13788 -55463 -93820 -537
11653 -537 6941 -48280 -76428 -52391 -139879 -328401 -370579 -346932 -372720 -287731 -199859 -238516
11641 -238516 -286280 -270963 -234145 -310161 -274157 -257968 -204603 -91359 -143404 -286839 -322734
11630 -322734 -342329 -358948 -393529 -258839 -108190 -19598 44329 29220 1896 -22741 -116341
11619 -116341 -144343 -107157 -141189 -141677 -200469 -143299 -300284 -336701 -319496 -252605 -307767 -258312
11607 -258312 -224842 -243614 -211961 -134429 -76227 -112902 -281237 -363616 -349053 -284782 -292789
11596 -292789 -329529 -277087 -271681 -298390 -310686 -336693 -255949 -333582 -415209 -295825 -167941
11585 -167941 -184155 -346945 -340458 -296603 -280999 -230966 -69906 5507 -41587 -136742 -233004
11574 -233004 -237376 -290205 -260535 -295017 -432081 -525114 -542586 -399541 -149260 -13242 -56040
11563 -56040 -171429 -248273 -249254 -321187 -340642 -366752 -413469 -325327 -225763 -296055 -267270 -232789
11551 -232789 -184750 -178969 -148149 -121094 -101500 -129155 -196247 -254723 -226316 -300941 -240268 -257799
11539 -257799 -387837 -404309 -351524 -248032 -252720 -225747 -262307 -172969 -166326 -218056 -260197
11528 -260197 -341516 -414501 -397714 -339162 -247456 -254625 -286704 -270672 -317043 -411350 -384461 -279077
11516 -279077 -278645 -338068 -342745 -225183 -221562 -137321 -192280 -251100 -212167 -144021 -138086 -287149
11504 -287149 -322283 -439418 -337919 -249128 -143621 -96464 -84658 -49108 -180892 -422990
11494 -422990 -408550 -393901 -345400 -369105 -356150 -266531 -261858 -262285 -262661 -217807 -232443 -273547
11482 -273547 -283775 -193696 -206570 -294259 -373244 -282710 -164822 -192663 -194925 -266812 -375461
11471 -375461 -336374 -256494 -368524 -483903 -490569 -456795 -479648 -435732 -479421 -489569 -482742
11460 -482742 -551983 -546799 -416357 -436659 -449622 -425148 -343373 -330111 -399911 -421091 -371716
11449 -371716 -501211 -529763 -506233 -567971 -604988 -527582 -492260 -505869 -412000 -404602 -404818 -404840
11437 -404840 -348341 -262393 -226774 -260925 -279447 -263655 -287113 -440061 -406961 -375281 -422988
11426 -422988 -466060 -508257 -493630 -493765 -461108 -391084 -374948 -366787 -384016 -400207 -403539 -350862
11414 -350862 -264391 -284564 -289432 -327369 -322633 -358350 -435689 -451125 -508258 -514089 -412271 -407003
11402 -407003 -449516 -535834 -497637 -424452 -376258 -304277 -308057 -356089 -385655 -348531 -334264 -400923
11390 -400923 -410330 -384881 -464660 -354855 -298360 -307792 -256633 -313829 -470387 -559943 -634135
11379 -634135 -596979 -556962 -501432 -455320 -434207 -310120 -262793 -378326 -409785 -319811 -355856
11368 -355856 -329805 -277535 -381068 -350743 -316917 -408987 -440722 -500406 -564192 -501022 -460371
11357 -460371 -497762 -443799 -462673 -509922 -591480 -550285 -523561 -521951 -481775 -417340 -296301
11346 -296301 -397994 -514042 -472279 -519662 -566037 -501191 -361150 -333213 -276868 -334243 -449100
11335 -449100 -508585 -456551 -444776 -538332 -550533 -584175 -574668 -469052 -373292 -380216 -422722 -469365
11323 -469365 -424331 -353015 -355715 -364836 -413257 -370941 -311032 -359927 -336866 -391093 -458964 -478801
11311 -478801 -583692 -533035 -510999 -450122 -463434 -468730 -581057 -637271 -566518 -525331 -540457
11300 -540457 -504493 -459783 -427759 -413380 -386399 -451089 -549547 -532923 -501677 -621508 -673821
11289 -673821 -656009 -700148 -676890 -610582 -641665 -498652 -395996 -430518 -590430 -674653 -520129
11278 -520129 -454812 -469729 -474559 -598302 -643696 -668084 -637072 -480624 -322277 -349363 -518571
11267 -518571 -528992 -533980 -439061 -481793 -622999 -599860 -584767 -695174 -664701 -589857 -524440
11256 -524440 -531566 -541442 -472231 -429872 -332564 -339127 -587217 -712422 -610521 -675909 -738194
11245 -738194 -718099 -639196 -727955 -675711 -569347 -579857 -573774 -515991 -701220 -761501 -759472
11234 -759472 -717772 -631409 -532565 -531523 -486149 -543929 -616664 -499319 -557112 -536301 -592123
11223 -592123 -642836 -628436 -528733 -465828 -392037 -351634 -374691 -408511 -403538 -379210 -488532
11212 -488532 -642223 -533526 -513912 -459855 -355828 -268807 -345152 -442639 -425228 -281455 -161877
11201 -161877 -198982 -236347 -79898 43624 84592 135669 193185 229403 179878 105380 -61271
11190 -61271 -151889 -188304 -289530 -321763 -510216 -621192 -591171 -531849 -455973 -414044 -438715
11179 -438715 -562989 -588652 -534077 -453772 -425298 -509690 -562763 -555673 -618648 -584354 -597792
11168 -597792 -588238 -545621 -526760 -467029 -497813 -579112 -654153 -712860 -713236 -603127 -539139 -638178
11156 -638178 -740042 -741573 -686608 -604866 -518612 -515435 -533101 -415952 -407622 -457353 -571911
11145 -571911 -539285 -603880 -642098 -718454 -705804 -753109 -765846 -715357 -764934 -699875 -706794 -829624
11133 -829624 -844810 -717310 -618821 -514504 -451001 -513529 -636575 -669666 -656521 -477795 -399412
11122 -399412 -419589 -505481 -602752 -656148 -553123 -689149 -847694 -932900 -823231 -610746
11112 -610746 -615634 -743879 -693023 -711454 -845647 -824158 -776674 -807832 -782476 -790960 -785149 -776511
11100 -776511 -709565 -731466 -645320 -617155 -660466 -662883 -726656 -730113 -815727 -795983 -726286 -631668
11088 -631668 -650878 -677948 -635177 -597860 -536122 -493940 -498794 -639828 -770789 -854415 -796718
11077 -796718 -636795 -568703 -520222 -610290 -766727 -876799 -843494 -859146 -861528 -836572 -910999
11066 -910999 -910030 -851490 -813930 -764963 -725611 -802541 -798503 -845091 -916789 -904533 -901571 -835781
11054 -835781 -867952 -929181 -867256 -810267 -852489 -910350 -852503 -637089 -558902 -564376 -601061
11043 -601061 -590658 -486029 -456804 -580269 -660638 -608895 -578376 -470144 -433029 -548207 -519866
11032 -519866 -437181 -358276 -315982 -372065 -377028 -351435 -364616 -241077 -186987 -168209 -180397
11021 -180397 -200504 -233586 -204875 -184717 -236584 -133085 -42104 -42686 -96505 -125839 -121274 -145404
11009 -145404 -205147 -214689 -292631 -439663 -328751 -244660 -395829 -640640 -588251 -492455 -467882
10998 -467882 -575757 -631975 -654319 -612036 -754083 -921529 -889672 -853268 -857202 -832808 -695836
10987 -695836 -744590 -899425 -840786 -734845 -740744 -912969 -923666 -888845 -790499 -734080 -765879
10976 -765879 -844675 -847523 -858498 -947202 -972341 -983840 -1011468 -994286 -874526 -971735 -1022284
10965 -1022284 -1001440 -980933 -1005148 -1050386 -944768 -808996 -816938 -918300 -951755 -849264 -756111
10954 -756111 -733069 -661897 -616267 -479142 -507048 -466629 -321857 -224997 -262302 -429906 -584673
10943 -584673 -622686 -613319 -615706 -630873 -802313 -938185 -961641 -982088 -1041345 -1122233 -1138116
10932 -1138116 -1068710 -1121341 -1134562 -1042922 -1128836 -1240936 -1270441 -1048964 -1082346 -1163577 -1217587
10921 -1217587 -1169414 -1135641 -1173700 -1367426 -1320477 -1199670 -1068955 -1031870 -1065196 -1180070
10911 -1180070 -1294942 -1248259 -1111816 -1131695 -1208147 -1250360 -1278436 -1233997 -1185730 -1284919 -1286764
10900 -1286764 -1294895 -1427702 -1445612 -1362889 -1286836 -1303103 -1372604 -1344572 -1413122 -1454985 -1468484
10889 -1468484 -1417372 -1497975 -1526772 -1458447 -1401546 -1425654 -1485092 -1573456 -1576463 -1434796 -1409265
10878 -1409265 -1400756 -1452284 -1396282 -1354783 -1340499 -1363558 -1536240 -1594769 -1604158 -1610207 -1609849 -1573311
10866 -1573311 -1486141 -1465499 -1359240 -1382886 -1381383 -1404752 -1391469 -1324648 -1349548 -1314871 -1299950
10855 -1299950 -1196820 -1254273 -1334614 -1361646 -1472123 -1465756 -1484051 -1484962 -1441026 -1436262 -1427387 -1507243
10843 -1507243 -1672082 -1765423 -1647630 -1591315 -1597201 -1520547 -1451750 -1440237 -1512643 -1519435 -1499453
10832 -1499453 -1564286 -1651072 -1702908 -1799446 -1825395 -1862166 -1946742 -1925042 -1810620 -1778867 -1834687
10821 -1834687 -1851687 -1860363 -1773606 -1718451 -1712786 -1736614 -1723829 -1796677 -1878801 -1930082 -1968687 -2107221
10809 -2107221 -2031146 -1903701 -1848760 -1822772 -1794424 -1874210 -1861640 -1905273 -1842156 -1876968 -1885854
10798 -1885854 -1902687 -1878264 -1905419 -1924511 -1866255 -1734958 -1795525 -1801098 -1805487 -1721088 -1758732
10787 -1758732 -1578608 -1474686 -1503016 -1649536 -1614067 -1503878 -1489670 -1431207 -1358473 -1393216
10777 -1393216 -1482530 -1457094 -1502008 -1606337 -1754885 -1935261 -1953824 -2008332 -2171784 -2193876
10767 -2193876 -2149396 -2205808 -2128157 -2157248 -2188269 -2183726 -2211770 -2169681 -2145388 -2206029 -2287146
10756 -2287146 -2204285 -2276095 -2265175 -2247099 -2313993 -2358618 -2409854 -2394175 -2497515 -2413992 -2463038
10745 -2463038 -2505979 -2627473 -2650768 -2634886 -2630928 -2588409 -2583555 -2715607 -2736800 -2720211 -2754531
10734 -2754531 -2775228 -2751368 -2681111 -2687725 -2735382 -2707266 -2768559 -2891132 -2928189 -2876801 -2772492
10723 -2772492 -2754724 -2812110 -2848220 -2851752 -2840417 -2844123 -2874615 -2885271 -2877956 -2978396 -3058545 -3149887
10711 -3149887 -3190586 -3204202 -3323214 -3338160 -3401221 -3363416 -3253711 -3118914 -3127527 -3238165 -3314142
10700 -3314142 -3461300 -3457631 -3455685 -3516868 -3461004 -3374817 -3329608 -3293575 -3273944 -3234864 -3146090
10689 -3146090 -3173344 -3176530 -3036264 -2833593 -2687738 -2508880 -2522595 -2532285 -2605730 -2725993 -2785859
10678 -2785859 -2879529 -2951270 -3088722 -3287393 -3481852 -3624025 -3830503 -3968596 -4106831 -4231485
10668 -4231485 -4368493 -4481926 -4530970 -4545844 -4710806 -4803272 -4813235 -4734245 -4752983 -4795881 -4892002
10657 -4892002 -5022783 -5125180 -5162712 -5149675 -5159446 -5308790 -5395181 -5428606 -5543906 -5581282 -5505578
10646 -5505578 -5470977 -5528575 -5571419 -5441449 -5353601 -5263224 -5085225 -4934320 -4657560 -4444197
10636 -4444197 -4416901 -4417128 -4208015 -4095680 -3895451 -3611618 -3440326 -3165286 -2626170 -1800590
10626 -1800590 -755369 735817 2871026 5806243 9382964 13617467 17843498 21633791
10618 21633791 24940900 27952623 31157220 34864532 39073153 43711494 48210322 52810181
10610 52810181 58346266 64754357 70896372 75974101 80013103 83643251 87683297 92983042
10602 92983042 99474410 105640227 109951988 113079283 116820158 121871912 127014499 130688281
10594 130688281 132786672 134365198 136580539 140333181 144796058 147306494 145519124 140603869
10586 140603869 135629875 132127931 129480037 126892726 124026656 121403423 119868753 119505570
10578 119505570 119361165 117525753 112604662 105568305 98654127 92820549 88176711 84233989
10570 84233989 80670586 77324973 74557174 72303345 69959291 66873860 62347109 56982166
10562 56982166 51736496 47118870 43350167 40250146 37611714 35335838 33616298 32154412
10554 32154412 30771449 29471000 28274475 27150284 26276784 25491514 24671884 23895439 23111036
10545 23111036 22319276 21773616 21240014 20659110 20191554 19700346 19302733 18893433 18535826
10536 18535826 18150852 17636361 17235145 16776754 16353217 15919752 15618566 15236574 14903408
10527 14903408 14561820 14139001 13757704 13375920 13045336 12760441 12639650 12459076 12292903
10518 12292903 12137832 11893840 11590882 11293641 10998686 10847343 10676891 10466939 10191324
10509 10191324 10085385 9924832 9744583 9661198 9418603 9314518 9280363 9047836 8865630 8646032
10499 8646032 8534592 8478077 8330448 8223997 8143458 8165989 7931044 7792605 7763251 7671471
10489 7671471 7556490 7534362 7438644 7262415 7101421 7024125 6987067 6877160 6845917 6716394
10479 6716394 6587279 6533900 6471344 6424052 6360040 6261541 6094840 5931120 5741341 5690991
10469 5690991 5605420 5596459 5709761 5677486 5530164 5390472 5345902 5286669 5178743 5192393 5121646
10458 5121646 4905567 4864338 4851988 4905191 4911071 4782181 4707157 4579875 4480770 4453145 4333481
10447 4333481 4273775 4340580 4324786 4319833 4375536 4344110 4256983 4087514 3977323 4094230 4122861
10436 4122861 4065091 4018400 3865214 3713881 3654624 3671592 3636986 3689424 3769558 3684324 3585992
10425 3585992 3517571 3462746 3320701 3366516 3326607 3322267 3420543 3410175 3414663 3336123 3277751
10414 3277751 3152888 2946519 2848884 2941800 2948697 2972151 2870792 2853403 2875415 2903461 3014982
10403 3014982 2986928 3021080 3054924 3074903 2921638 2858493 2935337 3076169 3026056 2917494 2737862
10392 2737862 2701779 2745330 2699589 2670419 2706072 2661117 2621111 2536307 2469950 2463016 2580045
10381 2580045 2475981 2371575 2333793 2319398 2387099 2532749 2495442 2435202 2520177 2512170 2526799
10370 2526799 2559852 2447598 2386828 2497451 2630389 2644891 2592894 2641924 2498791 2321058
10360 2321058 2199131 2238271 2179307 2159261 2267159 2253713 2149815 2105407 2141694 2122114 2131331
10349 2131331 2035711 2065405 2065182 2179126 2189524 2112082 2073112 2107375 2118664 2124721 2170410 2255627
10337 2255627 2306309 2183999 2125042 2020123 1890477 1743338 1751714 1779597 1803969 1783452 1825384
10326 1825384 1823447 1717997 1668229 1742709 1847185 1912667 1855701 1814791 1877524 1842233 1833660
10315 1833660 1857842 1887340 1781608 1667437 1727528 1814696 1856146 1943224 2043963 2066036 1989072
10304 1989072 1848525 1796080 1786628 1757685 1666588 1691937 1628601 1626773 1649512 1679383 1777104
10293 1777104 1784585 1737861 1623388 1599926 1658985 1727217 1686965 1690791 1641268 1755868 1855163
10282 1855163 1765803 1650271 1597788 1680951 1680508 1612347 1657030 1595326 1463745 1521623 1579213
10271 1579213 1590180 1579115 1504351 1395085 1372461 1432336 1389424 1377340 1389948 1360937 1336171
10260 1336171 1453769 1470588 1362090 1397953 1376255 1444148 1468664 1389203 1385943 1426698 1347108
10249 1347108 1236519 1259029 1299064 1160714 1088323 1045643 1021312 1071347 1028461 1002730 1137011
10238 1137011 1311945 1457190 1404935 1405302 1400963 1357377 1350699 1342692 1276044 1281027 1323904 1239697
10226 1239697 1112002 1065032 1040967 1159331 1289922 1292742 1268108 1239042 1314871 1345931 1180983
10215 1180983 1052887 1149243 1172657 1125093 993635 896117 953572 906314 947883 1038385 1200117
10204 1200117 1300849 1389790 1346702 1381686 1280447 1236954 1198107 1146535 1165591 1163943 1128024
10193 1128024 1114060 1099591 1032238 1114196 1236333 1273962 1259562 1320436 1268155 1232534 1223125
10182 1223125 1236093 1376500 1440833 1382678 1262026 1238080 1293270 1317699 1328951 1390941 1607011
10171 1607011 1671927 1691514 1674730 1659344 1565509 1599806 1773474 1803033 1716950 1627555 1629131
10160 1629131 1744679 1877393 1815873 1806247 1704215 1584030 1689913 1771959 1700182 1645335
10150 1645335 1683775 1755405 1703569 1703077 1759063 1737205 1715892 1700131 1706195 1736927 1713172 1676384
10138 1676384 1661467 1646352 1505407 1376721 1369588 1398092 1556318 1618431 1447378 1384561 1374214
10127 1374214 1365148 1392086 1424267 1334240 1238462 1204929 1108439 1134748 1120634 1140390 1186026
10116 1186026 1163587 1147099 949122 889448 835583 864883 889956 894862 988405 1075386 983657
10105 983657 854521 888693 857588 856734 930542 921044 952683 931906 919150 927155 950455 1032844
10093 1032844 1037528 1075860 1098869 1067635 1101568 1157708 1162067 1052901 1078612 963315 925291
10082 925291 937035 1007795 1072429 970841 920465 880777 830947 782048 726147 778804 754581
10071 754581 735403 778099 805686 819146 767788 751787 856151 901925 909238 870141 768094
10060 768094 714141 706146 700231 825196 913599 850559 922350 933519 928116 988773 872212 829915
10048 829915 841622 688730 627948 728745 719835 762820 842800 836548 854363 744393 645397
10037 645397 670814 745877 695775 741134 779204 730162 778576 790182 755890 774177 898576
10026 898576 958706 903093 874350 822844 762257 839957 926250 946987 855294 759001 744289
10015 744289 642160 704867 685809 701650 735804 688074 618085 642710 636403 727452 745721
10004 745721 791612 648553 551793 596898 682119 779895 692270 700544 909384 878217 860755
9993 860755 739913 749634 820112 921756 887294 761940 724265 669888 620658 806663 827948
9982 827948 724122 684435 671216 620776 656807 773636 842415 826280 684460 686765 640141
9971 640141 498063 593577 661977 509554 402987 403626 502747 552212 611051 567822 595554
9960 595554 580627 588222 544274 572085 672870 677890 666061 622424 555243 516505 525131 490438
9948 490438 561308 599506 693876 860979 854523 739799 673788 501624 568758 686984 772857
9937 772857 766902 780637 671282 478456 395641 463567 578102 633882 591390 616680 678907
9926 678907 742145 683041 707201 747121 831447 792761 780023 813540 703280 683777 719147
9915 719147 699770 618645 455710 418230 477195 543937 612617 484898 383038 475281 510036
9904 510036 479963 432725 506887 583713 557277 482823 418450 429826 494604 487233 454545 417519
9892 417519 464634 396277 402731 421108 397310 319807 331546 437149 543500 507042 476440
9881 476440 534393 637156 573058 551378 577242 552266 545930 515590 495433 402461 380181 411751
9869 411751 506381 426798 292280 442245 542453 683436 725696 638447 561817 505469 409973
9858 409973 314121 309532 375006 464319 466999 566245 564925 508037 608468 711415 652372 515291
9846 515291 527746 615208 620151 668896 514754 551303 670336 606479 638332 615828 530977
9835 530977 599489 665693 680784 632013 635870 646222 627979 614577 599489 517433 439570 354371
9823 354371 517836 654877 595035 431185 363843 465396 391541 283393 305172 397626 457069
9812 457069 391722 370236 436857 439270 332672 343196 396389 266359 397021 603950 608959
9801 608959 610052 579551 644496 699096 702288 629647 672308 495582 367282 369703 380319 401066
9789 401066 463631 427068 481175 432637 514643 573628 603627 555458 565042 600513 539497 479715
9777 479715 572647 595012 587859 514437 455198 453851 478827 499925 527344 603168 606764 532323
9765 532323 427322 386316 348491 420804 413649 417335 421337 420435 511239 496402 437384 420077
9753 420077 485728 570111 514686 405050 374329 353290 376563 365802 390234 425935 361507
9742 361507 390074 289910 231674 186363 215181 341796 374241 454014 480545 384385 341673
9731 341673 347208 445249 413116 353285 396586 414183 320641 220459 307799 378310 388328 388994
9719 388994 401821 383828 333438 328723 499330 478794 500124 564518 505101 454445 381085 373963
9707 373963 271967 285928 444172 491592 511044 600014 347148 308651 386709 343582 348580
9696 348580 328926 256419 368831 457543 322442 215355 393322 372374 185196 78490
9686 78490 67734 16370 120821 225707 313332 366258 346161 417323 472704 465220 422153 344711
9674 344711 351503 307146 321170 316198 336692 379228 455938 505806 570058 655522 973874 1396922
9662 1396922 1976084 2709044 3378555 3518692 3657354 3679187 3740214 3997383 4501108 4974212
9652 4974212 4559709 3575848 2770101 2261664 1961069 1818748 1616852 1420352 1327043 1139628
9642 1139628 1085475 1095412 1035579 1077574 1018018 1013471 1091108 1192043 1095216 902407 919983
9631 919983 1019666 992765 838477 957748 1003182 881010 774548 722822 636655 599407 565821
9620 565821 585986 678105 710947 594400 532047 427954 502914 526851 374085 391683 452421
9609 452421 368562 378110 483491 522333 492947 461990 432669 525261 596164 606710 616904 560491
9597 560491 480028 405478 386623 291326 327882 374557 274156 162011 188535 292848 388014
9586 388014 404347 456186 583209 536045 577251 629126 637709 619936 646040 640092 609109 585832
9574 585832 538105 538632 541880 468889 554596 467480 377426 373943 420870 580704 615036 493962
9562 493962 449923 519985 624636 590730 575604 533218 603095 672176 560360 549131 576748
9551 576748 554026 418228 297196 288892 395689 262224 247123 240402 332026 281898 249445
9540 249445 291791 417821 562633 559193 577608 493813 386290 407549 432362 476781 381727
9529 381727 258127 222035 194800 364616 488710 456565 515779 504744 441926 311240 301437
9518 301437 345696 298819 241073 226630 322891 364306 297540 250083 226675 289586 382474 514290
9506 514290 396118 241796 193740 180683 133325 128015 156461 263138 344131 281565 136147
9495 136147 153034 295312 322147 409584 426174 416319 443003 436524 388323 367423 366685 306435
9483 306435 312983 286078 246914 238817 236876 303333 427943 413886 352194 310641 237753 355536
9471 355536 623226 554721 442452 519418 450161 404706 436114 355958 283847 312139 380726
9460 380726 375056 315980 359734 463742 375762 236017 172973 153650 208165 352968 483641
9449 483641 423809 325463 324122 275341 169079 -35853 -35604 45984 175653 271503 320684 224535
9437 224535 121226 126094 185342 142976 127217 199791 303056 387917 457717 402059 378058
9426 378058 315380 183156 173422 254786 226748 199435 259560 215484 141902 154270 161780 164102
9414 164102 151906 152489 189577 208806 140936 178268 169628 103677 215495 227812 238986 222311
9402 222311 286433 278766 257695 390530 522061 462480 372096 374655 358753 274764 153569
9391 153569 -7059 41701 141350 192504 141304 113064 213692 223394 276394 328936 253071
9380 253071 316999 273635 137356 111807 95971 244079 378113 355022 204962 157399 140508
9369 140508 191812 356137 407322 341769 382939 349761 352708 242754 262458 255985 291278 267751
9357 267751 165201 216268 404753 478637 477858 300333 266400 376519 315773 192268 191356
9346 191356 266691 221014 219202 236257 162448 229217 302736 340423 243562 203141 244309 310073
$$ [...]
##END NTUPLES=NMR SPECTRUM
##END=
