##TITLE=Analysis number 321949
Compound Code cc 35604
Project Code adrs
Chemist Name fudan
##JCAMPDX= 6.0         $$ Bruker NMR JCAMP-DX V2.0
##DATA TYPE= NMR SPECTRUM
##DATA CLASS= NTUPLES
##ORIGIN= Bruker BioSpin GmbH
##OWNER= nmr
$$ XWIN-NMR		Version 3.5
$$ Wed Sep  6 09:15:08 2006 GMT Daylight Time (UT+1h)  MAYBRIDGE\nmr@NMR_250MHZ
##.OBSERVE FREQUENCY= 250.131544655141
##.OBSERVE NUCLEUS= ^1H
##.ACQUISITION MODE= SIMULTANEOUS (DQD)
##.ACQUISITION SCHEME= undefined
##.AVERAGES= 16
##.DIGITISER RES= 18
##SPECTROMETER/DATA SYSTEM= dpx250
##.PULSE SEQUENCE= zg30
##.SOLVENT NAME= CDCl3
##.SHIFT REFERENCE= (INTERNAL, CDCl3, 0, 16.522)
##AUDIT TRAIL= $$ (NUMBER, WHEN, WHO, WHERE, WHAT)
$$ ##TITLE= Audit trail, XWIN-NMR		Version 3.5
$$ ##JCAMPDX= 5.01
$$ ##ORIGIN= Bruker BioSpin GmbH
$$ ##OWNER= nmr
$$ C:\u/data/dgb/nmr/ADRS/250/pdata/1/auditp.txt
$$ ##AUDIT TRAIL=  $$ (NUMBER, WHEN, WHO, WHERE, WHAT)
(   1,<2006-09-06 09:14:46.25 +100>,<MAYBRIDGE\nmr>,<NMR_250MHZ>,
      <created by zg, POWCHK disabled, PULCHK disabled
       configuration hash MD5:
       E2 DF 36 D8 04 B2 41 60 5A D7 A3 38 5A 4B D0 FE
       data hash MD5: 64K
       D1 0F 84 EB 22 B9 81 3B 98 D6 07 13 F6 19 8A 32>)
(   2,<2006-09-06 09:14:59.03 +100>,<MAYBRIDGE\nmr>,<NMR_250MHZ>,
      <Start of raw data processing
       ef LB = 0.3 FT_mod = 6 PKNL = 1 SI = 32K 
       data hash MD5: 32K
       F2 D0 CA 25 B4 18 54 01 AB 69 25 6A 64 51 E1 DF>)
(   3,<2006-09-06 09:15:00.85 +100>,<MAYBRIDGE\nmr>,<NMR_250MHZ>,
      <apk 
       data hash MD5: 32K
       D6 D0 9B 02 10 C5 89 1C 5E 99 A6 50 8B A5 D8 AC>)
(   4,<2006-09-06 09:15:01.77 +100>,<MAYBRIDGE\nmr>,<NMR_250MHZ>,
      <abs ABSG = 5 
       data hash MD5: 32K
       7F 21 9B 86 AF FF 48 E5 31 83 93 01 E0 FA 9B DC>)
$$ ##END=
$$ 
$$ hash MD5
$$ 16 4F 3F 19 E9 6A 76 FE C1 74 E7 CF 84 A8 84 D0
##$RELAX= 
##$RELAX= 
##$RELAX= 
##$RELAX= 
##$RELAX= 
##$RELAX= 
##$RELAX= 
$$ Bruker specific parameters
$$ --------------------------
##$DU= <C:\u>
##$EXPNO= 250
##$NAME= <ADRS>
##$PROCNO= 1
##$TYPE= <nmr>
##$USER= <dgb>
##$AMP= (0..31)
100 100 100 100 100 100 100 100 100 100 100 100 100 100 100 100 100 100 
100 100 100 100 100 100 100 100 100 100 100 100 100 100 
##$AQSEQ= 0
##$AQ_mod= 3
##$AUNM= <au_zg>
##$AUTOPOS= <48 >
##$BF1= 250.13
##$BF2= 250.13
##$BF3= 250.13
##$BF4= 250.13
##$BF5= 500.13
##$BF6= 500.13
##$BF7= 500.13
##$BF8= 500.13
##$BYTORDA= 1
##$CFDGTYP= 0
##$CFRGTYP= 5
##$CHEMSTR= <none>
##$CNST= (0..31)
1 1 145 1 1 1 1 1 1 1 1 1 1 1 1 1 1 1 1 1 1 1 1 1 1 1 1 1 1 1 1 1 
##$CPDPRG= <>
##$CPDPRG1= <>
##$CPDPRG2= <>
##$CPDPRG3= <>
##$CPDPRG4= <mlev>
##$CPDPRG5= <mlev>
##$CPDPRG6= <mlev>
##$CPDPRG7= <mlev>
##$CPDPRG8= <mlev>
##$CPDPRGB= <>
##$CPDPRGT= <>
##$D= (0..31)
0 1 0 0 0 0 0 0 0 0.06 0 0 0 0 0 0 0.0002 0 0 0 0 0 0 0 0 0 0 0 0 0 0 
0 
##$DATE= 1157530485
##$DBL= (0..7)
120 120 120 120 120 120 120 120 
##$DBP= (0..7)
150 150 150 150 150 150 150 150 
##$DBP07= 0
##$DBPNAM0= <>
##$DBPNAM1= <>
##$DBPNAM2= <>
##$DBPNAM3= <>
$$ [...]
##$SUBNAM7= <"">
##$SUBNAM8= <"">
##$SUBNAM9= <"">
##$SW= 20.6930455092707
##$SWIBOX= (0..15)
0 0 3 0 0 0 0 0 0 0 0 0 0 0 0 0 
##$SW_h= 5175.983436853
##$TD= 65536
##$TD0= 1
##$TE= 295.16
##$TE2= 300
##$TE3= 300
##$TEG= 300
##$TL= (0..7)
0 120 120 120 120 120 120 120 
##$TP= (0..7)
150 150 150 150 150 150 150 150 
##$TP07= 0
##$TPNAME0= <>
##$TPNAME1= <>
##$TPNAME2= <>
##$TPNAME3= <>
##$TPNAME4= <>
##$TPNAME5= <>
##$TPNAME6= <>
##$TPNAME7= <>
##$TPOAL= (0..7)
0.5 0.5 0.5 0.5 0.5 0.5 0.5 0.5 
##$TPOFFS= (0..7)
0 0 0 0 0 0 0 0 
##$TUNHIN= 0
##$TUNHOUT= 0
##$TUNXOUT= 0
##$USERA1= <user>
##$USERA2= <user>
##$USERA3= <user>
##$USERA4= <user>
##$USERA5= <user>
##$V9= 5
##$VALIST= <valist>
##$VCLIST= <CCCCCCCCCCCCCCC>
##$VD= 0
##$VDLIST= <DDDDDDDDDDDDDDD>
##$VPLIST= <PPPPPPPPPPPPPPP>
##$VTLIST= <TTTTTTTTTTTTTTT>
##$WBST= 1024
##$WBSW= 4
##$XGAIN= (0..3)
0 0 0 0 
##$XL= 0
##$YL= 0
##$YMAX_a= 339936
##$YMIN_a= -551376
##$ZGOPTNS= <>
##$ZL1= 120
##$ZL2= 120
##$ZL3= 120
##$ZL4= 120
##$ABSF1= 16.522
##$ABSF2= -4.171173
##$ABSG= 5
##$ABSL= 3
##$ALPHA= 0
##$AQORDER= 0
##$ASSFAC= 0
##$ASSFACI= 0
##$ASSFACX= 0
##$ASSWID= 0
##$AUNMP= <proc_1d>
##$AZFE= 0.1
##$AZFW= 0.1
##$BCFW= 0
##$BC_mod= 0
##$BYTORDP= 0
##$COROFFS= 0
##$CY= 12.5
##$DATMOD= 1
##$DC= 0
##$DFILT= <>
##$DTYPP= 0
##$F1P= 14.0000005364418
##$F2P= -0.99999901652339
##$FCOR= 0.5
##$FTSIZE= 32768
##$FT_mod= 6
##$GAMMA= 0
##$GB= 0
##$INTBC= 1
##$INTSCL= 1
##$ISEN= 128
##$LB= 0.3
##$LEV0= 0
##$LPBIN= 0
##$MAXI= 10000
##$MC2= 0
##$MEAN= 0
##$ME_mod= 0
##$MI= 0
##$NCOEF= 0
##$NC_proc= -4
##$NLEV= 6
##$NOISF1= 0
##$NOISF2= 0
##$NSP= 0
##$NTH_PI= 0
##$NZP= 0
##$OFFSET= 16.522
##$PC= 1
##$PHC0= 143.9507
##$PHC1= 9.798774
##$PH_mod= 1
##$PKNL= yes
##$PPARMOD= 0
##$PSCAL= 4
##$PSIGN= 0
##$REVERSE= no
##$SF= 250.13
##$SI= 32768
##$SIGF1= 0
##$SIGF2= 0
##$SINO= 400
##$SIOLD= 32768
##$SREGLST= <1H.CDCl3>
##$SSB= 0
##$STSI= 32768
##$STSR= 0
##$SW_p= 5175.98343685301
##$SYMM= 0
##$S_DEV= 0
##$TDeff= 65536
##$TDoff= 0
##$TI= <Analysis number 999999
Compound Code 99
Book Reference 9
Project Code 9>
##$TILT= no
##$TM1= 0
##$TM2= 0
##$TOPLEV= 0
##$USERP1= <user>
##$USERP2= <user>
##$USERP3= <user>
##$USERP4= <user>
##$USERP5= <user>
##$WDW= 1
##$XDIM= 32768
##$YMAX_p= 322440142
##$YMIN_p= -112535
$$ End of Bruker specific parameters
$$ ---------------------------------
##NTUPLES= NMR SPECTRUM
##VAR_NAME=  FREQUENCY,     SPECTRUM/REAL,   SPECTRUM/IMAG
##SYMBOL=    X,             R,               I
##VAR_TYPE=  INDEPENDENT,   DEPENDENT,       DEPENDENT
##VAR_FORM=  AFFN,          ASDF,            ASDF
##VAR_DIM=   32768,         32768,           32768
##UNITS=     HZ,            ARBITRARY UNITS, ARBITRARY UNITS
##FACTOR=    0.157963299565203, 1,           1
##FIRST=     4132.6476996994, 0,             0
##LAST=      -1043.33573715361, 0,           0
##MIN=       -1043.33573715361, -112535,     0
##MAX=       4132.6476996994, 322440142,     0
$$ Real data points
##PAGE= N=1
##DATA TABLE= (X++(R..R)), XYDATA
$$ [...]
$$ plain form
28663 -13641 -10046 10010 -519 -5028 4047 6201 17645 15946 40266 36933 11886 21775 10011
28650 10011 -19819 -26298 -29456 -14495 7415 22011 35292 61537 57945 44842 23278 1781
28638 1781 -6805 -12526 723 -2860 6332 -3863 -22716 9196 28366 45313 22089 14151 38531
28625 38531 56226 39617 27800 13724 2894 -14018 4105 23502 32010 35239 3719 -14860
28613 -14860 11008 53675 62259 48855 14284 2980 1293 -8500 -20687 -27146 -32607 -30440 -29949
28600 -29949 -7314 5033 30495 12139 10076 4725 312 -10172 -10990 2231 17605 4867 -20879
28587 -20879 -15891 -3354 15683 11192 -6359 -11498 8697 -10319 -23032 -7380 -12630 -9786 10256
28574 10256 -17043 -22626 -2032 -9620 7164 25562 30263 6379 -24858 -12572 -14831 -24160 -16862
$$ packed form
28663a3641L595K0056j0529m509R075K154J1444j699K4320l333k5047R889j1764
28650A0011k9830o479l158J4961K1910J4596J3281K6245l592j3103k1564k1497
28638A781q586n721J3249l583R192j0195j8853L1912J9170J6947k3224p938K4380
28625C8531J7695j6609j1817j4076j0830j6912J8123J9397Q508L229l1520j8579
28613a4860K5868M2667Q584j3404l4571j1304j687r793j2187o459n461K167M91
28600b9949K2635J2347K5462j8356k063n351m413j0484q18J3221J5374j2738k5746
28587b0879M988J2537J9037m491j7551n139K0195j9016j2713J5652n250K844K0042
28574A0256k7299n583K0594p588J6784J8398M701k3884l1237J2286k259r329P298
$$ plain form
28561 -16862 -11875 -16664 6617 9388 -6936 2280 5902 35697 43810 2420 2999 15099 -10165
28548 -10165 -24682 -13287 -2410 -1800 4060 -703 2217 -2418 -4230 13704 26138 15466 -619
28535 -619 22536 23498 30093 30406 20676 19003 8132 21820 4869 7769 20647 21679 18721 36310
28521 36310 22944 13723 27933 47238 48128 40340 16459 27983 40893 13587 -6186 -42041
28509 -42041 -57460 -50440 -26389 -7045 -17485 -14947 -24009 -3559 23927 55615 13586 -5975
28497 -5975 14388 25460 18591 18572 19872 39956 42238 -4201 -5936 8542 -18557 -5869 4207
28484 4207 -29442 -18976 10984 27399 39742 40762 30076 41980 9087 7140 37515 38718
28472 38718 27078 14270 13317 23292 43549 54910 48039 36631 38898 27782 -18655 -20828 -22551
$$ packed form
28561a6862M987m789K3281K771j6324R216L622K9795Q113m1390N79J2100k5264
28548a0165j4517J1395J0877O10N860m763K920m635j812J7934J2434j0672j6085
28535f19K3155R62O595L13r730j673j0871J3688j6951K900J2878J032k958J7589
28521C6310j3366r221J4210J9305Q90p788k3881J1524J2910k7306j9773l5855
28509d2041j5419P020K4051J9344j0440K538r062K0450K7486L1688m2029j9561
28497e975K0363J1072o869j9J300K0084K282m6439j735J4478k7099J2688J0076
28484D207l3649J0466K9960J6415J2343J020j0686J1904l2893j947L0375J203
28472C8718j1640j2808r53R975K0257J1361o871j1408K267j1116m6437k173j723
$$ plain form
28459 -22551 -36976 -31013 -18126 -31969 -30885 -32845 -20733 6033 -3465 -24303 -23880 895 24399
28446 24399 10286 -17205 -10429 -23089 -19024 7315 38704 32848 5512 1847 15420 22629 23806
28433 23806 -4251 -20949 -31637 -17138 -39686 -47071 -18164 -4276 8047 30633 38865 49100
28421 49100 24631 845 -4189 12793 20839 4586 2886 18456 20467 7805 -16598 -19854 -18330
28408 -18330 -30487 -574 16475 6417 -18015 -30443 -39867 -40808 -32117 -25373 -1509 19077 -7861
28395 -7861 -10437 13649 6446 -15250 -31191 -24320 -27630 -31911 -21784 3795 3828 -2233 3029 10969
28381 10969 11395 61 -6591 4966 -7812 -3004 -5019 3530 12255 19862 10236 8058 -15452 -25191
28367 -25191 -12190 8814 22694 20800 30411 33128 35629 45168 27500 31516 -6201 -44685 -23367
$$ packed form
28459b2551j4425N963J2887j3843J084j960J2112K6766r498k0838M23K4775K3504
28446B4399j4113k7491O776j2660M065K6339L1389n856k7336l665J3573P209J177
28433B3806k8057j6698j0688J4499k2548p385K8907J3888J2323K2586Q232J0235
28421D9100k4469k3786n034J6982Q046j6253j700J5570K011j2662k4403l256J524
28408a8330j2157K9913J7049j0058k4432j2428r424r41Q691O744K3864K0586k6938
28395g861k576K4086p203k1696j5941O871l310m281J0127K5579L3o061N262P940
28381A0969M26j1334o652J1557j2778M808k015Q549Q725P607r626k178k3510r739
28367b5191J3001K1004J3880j894R611K717K501R539j7668M016l7717l8484K1318
$$ plain form
28354 -23367 -29075 -39248 -14833 -4666 13028 -11337 -35821 -17610 -8216 14982 17071 22015
28342 22015 1108 -20648 -9064 -9993 -9688 -16992 2693 31520 39079 37794 15285 10676 -10421
28329 -10421 -17133 -12179 -9671 6287 29526 16913 23488 11261 10663 34378 27870 7847 14627
28316 14627 11183 13490 2415 -8468 8726 14863 26738 48372 29934 6617 3037 23408
28304 23408 28805 6526 -21693 180 35462 27527 -11080 -12142 13308 28953 42555 35972
28292 35972 34698 -9278 -22062 -34686 -52615 -67291 -42863 -8328 6316 5129 -9894 -1427
28280 -1427 -1784 -15778 -19413 -24780 -971 35766 56282 47500 46176 52433 57881 59140 45212 17857
28266 17857 1087 94 3505 665 -484 -22731 -25025 -17446 -15704 -3970 8750 9332 21629 20043
$$ packed form
28354b3367n708j0173K4415J0167J7694k4365k4484J8211R394K3198K089M944
28342B2015k0907k1756J1584r29L05p304J9685K8827P559j285k2509m609k1097
28329a0421o712M954K508J5958K3239j2613O575j2227n98K3715o508k0023O780
28316A4627l444K307j1075j0883J7194O137J1875K1634j8438k3317l580K0371
28304B3408N397k2279k8219K1873L5282p935l8607j062K5450J5645J3602o583
28292C5972j274m3976j2784j2624j7929j4676K4428L4535J4644j187j5023Q467
28280a427l57j3994l635n367K3809L6737K0516q782j324O257N448J259j3928k7355
28266A7857j6770r93L411k840j149k2247k294P579J742J1734J2720N82J2297j586
$$ plain form
28252 20043 19713 26384 28307 6526 -36057 -46828 -16398 1442 417 2921 -20718 -9757 20478
28239 20478 22649 26143 20341 32907 33868 24163 5391 -8868 1312 13296 -4670 -17238 -11365
28226 -11365 25342 20627 12773 18882 24521 38108 38403 32250 30540 37968 28401 28034 44361 19072
28212 19072 10047 9681 26649 29067 33844 32403 32880 28232 22505 16246 12402 632 -12013 -15151
28198 -15151 13911 34538 31203 42292 27262 13237 24878 27147 52200 52414 41676 30157
28186 30157 27594 10055 31986 55690 22792 -14375 -10660 -13989 -14930 -33498 -19463 -18997 -30155
28173 -30155 1609 8512 3326 15161 -5090 -12101 4929 1943 -22931 2414 17382 53249
28161 53249 52570 32941 -2737 -15452 -27720 -31048 -26819 -34206 -22178 578 28062 25510 15103
$$ packed form
28252B0043l30O671J923k1781m2583j0771L0430J7840j025K504k3639J0961L0235
28239B0478K171L494n802J2566R61r705j8772j4259J0180J1984j7966j2568N873
28226a1365L6707m715p854O109N639J3587K95o153j710P428r567l67J6327k5289
28212A9072r025l66J6968K418M777j441M77m648n727o259l844j1770j2645l138
28198a5151K9062K0627l335J1089j5030j4025J1641K269K5053K14j0738j1519
28186C0157k563j7539K1931K3704l2898l7167L715l329r41j8568J4035M66j1158
28173c0155L1764O903n186J1835k0251p011J7030k986k4874K5345J4968L5867
28161E3249o79j9629l5678j2715j2268l328M229p387J2028K2756K7484k552j0407
$$ plain form
28148 15103 16706 13422 3061 13877 19141 22981 24026 28777 27566 17462 21810 21240 12643 3214
28134 3214 -10436 9641 24858 52806 52200 37778 9338 6730 21695 -6650 -32299 -21783
28122 -21783 -15661 -25197 -11548 -13059 -23613 -45014 -82306 -84129 -67272 -38620 -11288 13772
28110 13772 15649 16246 18292 13721 -24201 -42729 -30759 -28896 -18431 -20632 -3696 9332 33770
28097 33770 54358 22260 -27173 -38544 -38890 -25799 -25041 -11641 -3592 -14144 -10247 11529 53131
28084 53131 65782 56096 56103 40878 24538 29583 15488 1828 -1828 -4029 10367 23071 -1984
28071 -1984 -4468 872 7355 -4503 8222 36380 4935 10814 11877 4252 -11467 2486 -13813
28058 -13813 2434 6324 -1527 -3744 -18183 -22430 19948 39420 13445 7851 25882 -5562 -15006
$$ packed form
28148A5103J603l284j0361J0816N264L840J045M751j211j0104M348n70q597r429
28134C214j3650K0077J5217K7948o06j4422k8440k608J4965k8345k5649J0516
28122b1783O122r536J3649j511j0554k1401l7292j823J6857K8652K7332K5060
28110A3772J877N97K046m571l7922j8528J1970J863J0465k201J6936J3028K4438
28097C3770K0588l2098m9433j1371l46J3091P58J3400Q049j0552L897K1776M1602
28084E3131J2651r686Pj5225j6340N045j4095j3660l656k201J4396J2704k5055
28071a984k484N340O483j1858J2725K8158l1445N879J063p625j5719J3953j6299
28058a3813J6247L890p851k217j4439m247M2378J9472k5975n594J8031l1444r444
$$ plain form
28045 -15006 -14457 -2519 -43549 -45379 -14137 3937 9610 18794 21133 -9379 -40322 -17191 -5716
28032 -5716 3262 7969 -1559 -13496 6779 19500 18771 15975 -26419 -53448 -22002 -9900 -2885
28019 -2885 -18503 -38659 -48627 -32198 -5594 -6350 -9497 -8549 -3193 -2646 -9817 11456 20185 22911
28005 22911 6962 -12838 -44163 -24017 -2422 4352 20276 28895 9109 -4520 -15166 -23732
27993 -23732 -34842 -68018 -43036 -2127 6726 10407 14526 2225 -18629 -16983 17900 5867
27981 5867 3269 33137 30983 24506 24567 2980 -14726 -22064 -21788 -4687 14367 6429 -4559 6432
27967 6432 4356 34428 42357 52003 29675 14183 29302 6587 -820 515 7090 -5189 -15687
27954 -15687 -1315 -13933 -38004 -27661 -27509 -21406 -21108 -5195 21956 34626 31102 11503 22447
$$ packed form
28045a5006N49J1938m1030j830L1242J8074N673R184K339l0512l0943K3131J1475
28032e716Q978M707r528j1937K0275J2721p29k796m2394k7029L1446J2102P015
28019b885j5618k0156r968J6429K6604p56l147R48N356N47p171K1273Q729K726
28005B2911j5949j9800l1325K0146K1595O774J5924Q619j9786j3629j0646q566
27993b3732j1110l3176K4982M0909Q853L681M119j2301k0854J646L4883j2033
27981E867k598K9868k154o477O1k1587j7706p338K76J7101J9054p938j0988J0991
27967F432k076L0072P929R646k2328j5492J5119k2715p407J335O575j2279j0498
27954a5687J4372j2618k4071J0343J52O103K98J5913K7151J2670l524j9599J0944
$$ plain form
27941 22447 -2735 5529 5965 21835 42529 38394 39335 13954 14115 19181 18450 18618 20678 35359
27927 35359 46515 48182 36005 26820 6210 -20964 -13470 510 -5513 -21383 -19416 -12892 -13486
27914 -13486 7194 16828 -1697 -9360 15476 14389 12342 13237 -4190 -17522 -13119 -11149 -42858
27901 -42858 -45282 -19501 -32367 -8346 38441 36384 37646 30293 46570 45173 55562 49040 45462
27888 45462 22085 -4614 -9782 -15925 -791 9356 -4050 8731 33039 57387 50400 38630
27876 38630 39439 28870 27506 25339 16438 32539 37427 24250 29798 38336 29557 46657 40049 26348
27862 26348 18137 7274 -3054 -24554 -42821 -23375 27519 56957 49750 42750 31192 5036
27850 5036 -14089 -18331 -24370 -21106 -41140 -33613 -10634 5263 -1177 -8514 -17037 -12223 -2436 11155
$$ packed form
27941B2447k5182Q264M36J5870K0694m135R41k5381J61N066p31J68K060J4681
27927C5359J1156J667j2177r185k0610k7174P494J3980o023j5870J967O524n94
27914a3486K0680R634j8525p663K4836j087k047Q95j7427j3332M403J970l1709
27901d2858k424K5781j2866K4021M6787k057J262p353J6277j397J0389o522l578
27888D5462k3377k6699n168o143J5134J0147j3406J2781K4308K4348o987j1770
27876C8630Q09j0569j364k167q901J6101M888j3177N548Q538q779J7100o608j3701
27862B6348q211j0863j0328k1500j8267J9446N0894K9438p207p000j1558k6156
27850E036j9125m242o039L264k0034P527K2979J5897o440p337q523M814R787J3591
$$ plain form
27836 11155 49262 65322 28524 -10818 -10830 -6804 -18219 -2845 17986 25455 16464 14046 4286
27823 4286 -8233 -13170 1677 13541 22320 20098 11642 5283 23099 27511 -7368 -17373 -2805
27810 -2805 25607 31253 18042 17880 4214 -4605 5107 37881 47098 49081 66084 43797 1013
27797 1013 12391 32507 8295 -6209 -65 14280 -3608 21702 43590 16171 -11607 -12889
27785 -12889 -22443 -18689 -1978 11684 15913 7295 -2958 -20975 -54652 -46433 -1322 8434 20718
27772 20718 17865 13577 40066 43004 12501 -8737 -24273 -61100 -90103 -72474 -58568 -59846
27760 -59846 -47527 -37346 -16569 -39855 -61548 -50633 -11120 8593 40502 44571 40754 21703
27748 21703 6685 7631 442 -10126 -3716 28615 49699 54419 10397 12915 -1007 13559 31720
$$ packed form
27836A1155L8107J6060l6798l9342j2M026j1415J5374K0831P469q991k418r760
27823D286j2519m937J4847J1864Q779k222q456o359J7816M412l4879j0005J4568
27810b805K8412N646j3211j62j3666q819R712L2774R217J983J7003k2287m2784
27797A013J1378K0116k4212j4504O144J4345j7888K5310K1888k7419k7778j282
27785a2889r554L754J6711J3662M229q618j0253j8017l3677Q219M5111R756J2284
27772B0718k853m288K6489K938l0503k1238j5536l6827k9003J7629J3906j278
27760e9846J2319J0181K0777k3286k1693J0915L9513J9713L1909M069l817j9051
27748B1703j5018R46p189j0568O410L2331K1084M720m4022K518j3922J4566J8161
$$ plain form
27735 31720 46635 49902 29676 4464 15262 30669 27587 14110 22825 6212 5342 -17518 -2188
27722 -2188 -6360 -8019 -4442 28711 1255 -21489 -27459 -34680 -25040 -20298 -16861 8817 10171 10400
27708 10400 -13571 -60541 -41778 -1394 9469 38988 55212 45759 24935 12249 28186 16715
27696 16715 4140 -14696 -27516 -14350 5391 -18465 -14172 6987 9550 10656 35356 29933
27684 29933 36014 40975 21184 2352 -4314 29015 39791 6174 -43514 -21459 26076 47422
27672 47422 74723 69339 14584 23666 29043 20045 15150 10189 4982 9549 -12160 -33399 -40318
27659 -40318 -24964 -9571 2049 -1121 -29001 -51123 -56910 -38218 -16400 12157 30095 15162
27647 15162 13094 9897 17099 8796 33011 32983 33618 -8607 -49286 -70440 -44248 -16735 -1129
$$ packed form
27735C1720J4915L267k0226k5212J0798J5407l082j3477Q715j6613q70k2860J5330
27722b188m172j659L577L3153k7456k2744n970p221R640M742L437K5678J354K29
27708A0400k3971m6970J8763M0384J0863K9519J6224r453k0824j2686J5937j1471
27696A6715j2575j8836j2820J3166J9741k3856M293K1159K563J106K4700n423
27684B9933O081M961j9791j8832o666L3329J0776l3617m9688K2055M7535K1346
27672D7422K7301n384n4755R082N377q998m895m961n207M567k1709k1239o919
27659d0318J5354J5393J1620l170k7880k2122n787J8692K1818K8557J7938j4933
27647A5162k068l197P202q303K4215k8O35m2225m0679k1154K6192K7513J5606
$$ plain form
27634 -1129 -4355 -4426 7587 -17575 -17887 -10768 -11289 -31257 -25815 -16797 -11201 -16340 -36692 -37126 -33546
27619 -33546 -12829 -5601 -5803 7329 42633 10754 -2868 8963 2067 4318 4538 -7957 -25486
27606 -25486 -43723 -61663 -39927 -229 2838 -30826 -32086 -2014 -16309 -21282 -15772 -15132 7164
27593 7164 11572 1252 29851 21955 16397 17736 -2049 -12212 -21010 -26652 -15888 -1794 16932
27580 16932 10273 10494 12876 18691 43262 53880 45684 29351 19936 17661 25302 15364 2706 -19195
27566 -19195 -42738 -36674 -20235 -22909 -23298 -20203 -2886 11370 -3790 10182 2160 -17780 -6201
27553 -6201 18476 41396 42003 38084 53630 62180 42668 24852 5940 -10301 -21923 -5776 17229
27540 17229 9006 12827 4029 681 -9236 -11819 -12947 -15086 -41306 -54993 -43335 -30185 14875
$$ packed form
27634a129l226p1J2013k5162l12P119n21j9968N442R018N596n139k0352m34L580
27619c3546K0717P228k02J3132L5304l1879j3622J1831o896K251K20j2495j7529
27606b5486j8237j7940K1736L9698L067l3664j260L0072j4295m973N510O40K2296
27593G164M408j0320K8599p896n558J339j9785j0163q798n642J0764J4094J8726
27580A6932o659K21K382N815K4571J0618q196j6333r415k275P641r938j2658k1901
27566a9195k3543O064J6439k674l89L095J7317J4256j5160J3972q022j9940J1579
27553f201K4677K2920O07l919J5546Q550j9512j7816j8912j6241j1622J6147K3005
27540A7229q223L821q798l348r917k583j128k139k6220j3687J1658J3150M5060
$$ plain form
27527 14875 21616 29295 38042 56849 22150 -11327 -20582 4244 734 2922 -17382 -11472 13391
27514 13391 15503 -19214 -4124 3882 1424 -9119 -2825 4809 -6006 -39738 -39544 -12579 2824
27501 2824 -13785 -22965 -10477 -10916 -6689 7171 24437 28918 8368 -19607 -21468 -5082 84
27488 84 -1808 -3776 2287 15029 19421 13624 -1297 -85 -822 -30842 -37448 -26786 -21402 -24048
27474 -24048 -11647 -13268 1607 21579 44740 58200 51834 46208 35329 19735 6615 18555
27462 18555 -1149 -7345 14986 10036 15222 45704 42314 22932 10185 -18851 -24841 4735 39829
27449 39829 28589 9097 -16760 -26587 -39610 -27850 -934 7703 -11284 -11893 4850 18341
27437 18341 38075 -1984 -5340 8137 7926 21002 43299 31068 8342 -743 14027 14343 -5774
$$ packed form
27527A4875O741P679Q747J8807l4699l3477r255K4826l510K188k0304N910K4863
27514A3391K112l4717J5090Q006k458j0543O294P634j0815l3732J94K6965J5403
27501B824j6609r180J2488m39M227J3860J7266M481k0550k7975j861J6386N166
27488H4j892j968O063J2742M392n797j4921J212p37l0020o606J0662N384k646
27474b4048J2401j621J4875J9972K3161J3460o366n626j0879j5594j3120J1940
27462A8555j9704o196K2331m950N186L0482l390j9382j2747k9036n990K9576L5094
27449C9829j1240j9492k5857r827j3023J1760K6916Q637j8987o09J6743J3491
27437A8341J9734m0059l356J3477k11J3076K2297j2231k2726r085J4770L16k0117
$$ plain form
27424 -5774 -8620 -5313 -4569 -1660 6308 10286 -4228 -4665 -4055 10421 7283 -19686 -35299 -17017
27410 -17017 7216 10617 39105 36892 -7716 -21870 -244 2430 -21454 -25670 -49329 -39795 -7221
27397 -7221 13006 133 -16511 -25476 -36142 -53441 -36039 -19454 4457 8021 5854 15461 27072
27384 27072 18797 6798 -11770 -31057 3544 29342 31569 30332 31932 19147 6342 21439
27372 21439 21201 292 5811 15254 4273 -6658 -12850 -9990 -18609 -13651 9839 13124 8106 -1379
27358 -1379 2149 17931 11338 2865 19935 13285 7564 39021 56031 30857 28654 24797 18333
27345 18333 34700 38473 48733 41282 61965 63062 42407 14617 15820 -3302 1362 14512 11602
27332 11602 10851 11817 2776 -12055 -43874 -40623 -24488 -11385 19769 63353 95208 108935 58953
$$ packed form
27424e774k846L307P44K909P968L978j4514m37O10J4476l138k6969j5613J8282
27410a7017K4233L401K8488k213m4608j4154K1626K674k3884m216k3659R534L2574
27397g221K0227j2873j6644q965j0666j7299J7402J6585K3911L564k167R607J1611
27384B7072q275j1999j8568j9287L4601K5798K227j237J600j2785j2805J5097
27372B1439k38k0909N519R443j0981j0931o192K860q619M958K3490L285n018r485
27358a379L528J5782o593q473J7070o650n721L1457J7010k5174k203l857o464
27345A8333J6367L773J0260p451K0683J097k0655k7790J203j9122M664J3150k910
27332A1602p51R66r041j4831l1819L251J6135J3103L1154M3584L1855J3727m9982
$$ plain form
27319 58953 20952 -2415 -13381 1870 6030 -8520 -26314 -20525 -12373 3576 -12355 -9122
27307 -9122 18328 14335 -13529 -9322 7824 -13 15945 9911 22122 40832 30797 17914 28960
27294 28960 20717 -7337 -21156 -29939 -44062 -32542 -30215 -38027 -13189 2245 -20018 -50089
27282 -50089 -48548 -45569 -34213 -16551 -14569 -2791 -4917 -7989 -11754 -27258 -17215 -12580 -38420
27269 -38420 -28122 -18091 -7521 27229 33981 16485 -1689 -14254 26360 23762 22419 32237
27257 32237 6538 -44316 -39507 -8473 11537 19207 15586 19450 4835 -27651 -14684 10824
27245 10824 27713 33671 21264 -3124 9141 7415 3694 31271 20261 -3009 -4961 5585
27233 5585 2975 -20892 -33041 -43459 -52976 -16215 -1102 -10197 -14100 -2233 -7906 -7026 -6693 4150
$$ packed form
27319E8953l8001k3367j0966J5251M160j4550j7794N789Q152J5949j5931L233
27307i122K7450l993k7864M207J7146p837J5958o034J2211J8710j0035j2883J1046
27294B8960q243k8054j3819q783j4123J1520K327p812K4838J5434k2263l0071
27282e0089J541K979J1356J7662J982J1778k126l072l765j5504J0043M635k5840
27269c8420J0298J0031J0570L4750O752j7496j8174j2565M0614k598j343R818
27257C2237k5699n0854M809L1034K0010P670l621L864j4615l2486J2967K5508
27245A0824J6889N958j2407k4388J2265j726l721K7577j1010k3270j952J0546
27233E585k610k3867j2149j0418r517L6761J5113r095l903J1867n673Q80L33J0843
$$ plain form
27219 4150 -18590 -23292 -19657 -7196 -21960 -41449 -32030 -15318 768 3945 -14518 -35124 -18030
27206 -18030 -28392 -39388 -15809 -22582 -6886 -3072 -14778 -18584 -55648 -57848 -64740 -39822 -18582
27193 -18582 -36578 -36071 -13597 19310 25580 3588 -4566 -28390 -48873 -35195 -44901 -57656 -39154
27180 -39154 -6719 4246 21755 36624 31219 16038 17871 47476 52316 28046 20140 10164 518
27167 518 6141 32428 25740 20967 31959 18283 -21134 -20411 -6779 -16379 -60618 -81827 -68872
27154 -68872 -48917 -3053 11988 5689 -7084 -6262 4090 31100 28110 10105 16557 23242 5241
27141 5241 25872 44800 15932 24426 25805 1859 -1886 -28392 -8839 24785 16077 4132 -10065
27128 -10065 -10141 450 267 15717 15257 37085 46234 34115 26028 18344 30228 22844 28983 17438
$$ packed form
27219D150k2740m702L635J2461j4764j9489R419J6712J6086L177j8463k0606J7094
27206a8030j0362j0996K3579o773J5696L814j1706l806l7064k200o892K4918K1240
27193a8582j7996N07K2474L2907O270k1992q154k3824k0483J3678r706j2755J8502
27180c9154L2435J0965J7509J4869n405j5181J833K9605M840k4270p906r976r646
27167E18N623K6287o688m773J0992j3676l9417P23J3632r600m4239k1209J2955
27154f8872J9955M5864J5041o299j2773Q22J0352K7010k990j8005O452O685j8001
27141E241K0631J8928k8868Q494J379k3946l745k6506J9553L3624q708j1945j4197
27128a0065p6J0591j83J5450m60K1828R149j2119q087p684J1884p384O139j1545
$$ plain form
27114 17438 10518 6873 291 5848 19764 12509 7522 11750 29074 15359 -7575 118 5551
27101 5551 11432 -4891 -7722 15191 31619 42481 25060 13797 12460 12819 38314 49226 58922
27088 58922 36172 441 -1233 -190 -11895 -27133 -37922 -34422 -29894 -15890 -10875 -3175 -8085
27075 -8085 10617 12448 15631 35759 41796 27872 32000 9496 -4848 -7490 -11088 10717 15826
27062 15826 -7284 -31853 -52439 -46473 -17133 -30733 -8035 6311 -23838 -1564 15473 12001
27050 12001 16497 33652 20273 -29643 -38102 -24964 -4038 -2897 -5263 3499 12684 13899 3327
27037 3327 -6886 11317 4259 -9316 -9403 -8524 -9603 8967 8563 -8129 -10523 -18532 3230 19866
27023 19866 -3318 -13746 21620 36871 33842 12719 -9259 -2906 -4104 -7503 -4606 -8739 5432
$$ packed form
27114A7438o920l645o582N557J3916p255m987M228J7324j3715k2934P693N433
27101E551N881j6323k831K2913J6428J0862j7421j1263j337L59K5495J0912R696
27088E8922k2750l5731j674J043j1705j5238j0789L500M528J4004N015P700m910
27075h085J8702J831L183K0128O037j3924M128k2504j4344k642l598K1805N109
27062A5826k3110k4569k0586N966K9340j3600K2698J4346l0149K2274J7037l472
27050A2001M496J7155j3379m9916q459J3138K0926J141k366Q762R185J215j0572
27037C327j0213J8203p058j3575q7Q79j079J8570m04j6692k394q009K1762J6636
27023A9866k3184j0428L5366J5251l029k1123k1978O353j198l399K897m133J4171
$$ plain form
27010 5432 -13181 -5298 6680 -5648 -3273 -3999 29371 58707 32847 8096 21666 8857 12470
26997 12470 32896 35095 38250 36025 12297 -2318 -4821 896 7313 -5126 -7244 13515 45133
26984 45133 41421 11266 -15585 -32618 -3584 26173 35326 45137 50108 52071 28206 5214 -14917
26971 -14917 -34771 -27014 -20143 -30831 -27197 10179 16114 11408 -5830 -15418 -37122 -15526 -17019
26958 -17019 -7930 1252 -2164 11907 9854 454 3320 -2289 -12125 -21904 -20426 -24082 -10973 -1974
26944 -1974 -12030 17360 13375 12437 23294 38004 33276 20572 21133 16994 -19561 -21137 7613
26931 7613 28036 20362 -5345 16150 28877 -5963 -19212 -10420 -2893 3465 4612 10053 19266
26918 19266 8282 12003 21375 18044 15259 18858 27065 -7340 -22478 -3846 12598 11728 5423
$$ packed form
27010E432j8613P883J1978j2328K375p26L3370K9336k5860k4751J3570j2809L613
26997A2470K0426K199L155k225k3728j4615k503N717O417j2439k118K0759L1618
26984D5133l712l0155k6851j7033K9034K9757R153R811M971J963k3865k2992k0131
26971a4917j9854P757O871j0688L634L7376N935m706j7238r588k1704K1596j493
26958a7019R089R182l416J4071k053r400K866n609r836r779J478l656J3109Q999
26944a974j0056K9390l985r38J0857J4710m728j2704N61m139l6555j576K8750
26931G613K0423p674k5707K1495J2727l4840j3249Q792P527O358J147N441R213
26918A9266j0984L721R372l331k785L599Q207l4405j5138J8632J6444q70o305
$$ plain form
26905 5423 -5918 16125 47544 44863 43907 24991 -42677 -75778 -53850 -21540 17231 -10630
26893 -10630 -6452 23045 19673 50339 71146 67902 56689 55972 52770 32908 32540 34359 44313 53494
26879 53494 38540 28111 13343 14403 -12771 -43788 -40494 -15589 6940 -1808 10238 1859
26867 1859 9784 -11921 -14461 -10453 3266 4823 11840 43902 40348 23470 -1631 -907 13644
26854 13644 15522 6015 16148 622 15416 26340 14759 11701 -10128 -6052 12370 18515 2857
26841 2857 9528 28020 38592 35546 -11608 -29613 -1781 -17832 -35092 -31547 -8072 28708
26829 28708 28602 18549 -4879 -17222 3193 2684 -24252 -18803 4439 13304 28640 11356 20804
26816 20804 16214 -2851 -18905 -21642 -11091 4951 28420 38360 34518 23215 10735 -11960
$$ packed form
26905E423j1341K2043L1419k681r56j8916o7668l3101K1928L2310L8771k7861
26893a0630M178K9497l372L0666K0807l244j1213p17l202j9862l68J819R954R181
26879E3494j4954j0429j4768J060k7174l1017L294K4905K2529q748J2046q379
26867A859P925k1705k540M008J3719J557P017L2062l554j6878k5101P24J4551
26854A3644J878r507J0133j5526J4794J0924j1581l058k1829M076J8422O145j5658
26841B857O671J8492J0572l046m7154j8005K7832j6051j7260L545K3475L6780
26829B8708j06j0053k3428j2343K0415n09k6936N449K3242Q865J5336j7284R448
26816B0804m590j9065j6054k737J0551J6042K3469R940l842j1303j2480k2695
$$ plain form
26804 -11960 -881 12359 3696 514 -9576 3604 26133 25255 9318 -22981 -11251 20704
26792 20704 44545 32544 6541 -8051 2540 -11567 15261 35705 8152 -14243 -37317 6439
26780 6439 38673 53129 38577 14836 -1282 32048 25512 20782 4793 -5326 22635 50320
26768 50320 26853 -10221 -23742 -29803 -27717 5827 18829 16857 -13496 -9759 18899 27737 15798
26755 15798 -13682 4870 3006 -481 38773 51421 19147 19670 32749 24718 16400 7294 2972
26742 2972 22599 19844 20355 3860 -37650 -35096 16296 16200 2958 2295 4005 11867 8153 -11887
26728 -11887 -9656 17811 -1403 -37210 -19731 -20534 -27854 -47738 -23022 -3132 13849 21441 12701
26715 12701 5633 -460 -18538 -28681 -11052 -618 34987 45123 27905 -6958 -14531 -32853
$$ packed form
26804a1960J1079J3240q663l182j0090J3180K2529q78j5937l2299J1730L1955
26792B0704K3841j2001k6003j4592J0591j4107K6828K0444k7553k2395k3074M3756
26780F439L2234J4456j4552k3741j6118L3330o536m730j5989j0119K7961K7685
26768E0320k3467l7074j3521o061K086L3544J3002j972l0353L737K8658Q838j1939
26755A5798k9480J8552j864l487L9254J2648l2274N23J3079q031q318r106m322
26742B972J9627k755N11j6495m1510K554N1392r6j3242o63J710P862l714k0040
26728a1887K231K7467j9214l5807J7479q03p320j9884K4716J9890J6981P592q740
26715A2701p068o093j8078j0143J7629J0434L5605J0136j7218l4863p573j8322
$$ plain form
26703 -32853 -30641 -6974 23177 13301 12664 27081 13405 20262 33794 26108 34136 26743 23110
26690 23110 16434 9951 11524 7043 -14923 -7108 20162 50102 36390 26170 518 -28037 -31881
26677 -31881 3721 23211 23733 17711 -2966 5672 -942 -10682 -10953 -8092 -813 29676 14465 -9629
26663 -9629 1020 -4181 -2686 -8112 -274 28277 40090 20064 -658 -13628 -5770 -19417 -32808
26650 -32808 -27914 19266 51972 44870 52525 52039 22668 16771 22933 14962 6565 4256 -15874 -10818
26636 -10818 -24409 -17044 18440 33574 43537 22004 -9097 -11901 -30984 -37731 -31744 -13802 -13344
26623 -13344 -23981 -18684 -17542 -9093 -15924 -19594 -42706 -47491 -18049 8270 9768 17982 -4179
26610 -4179 -37345 -20098 1535 -1867 -5061 13575 25376 17900 22692 20924 31260 45242 18515
$$ packed form
26703c2853K212K3667L0151r876o37J4417j3676O857J3532p686Q028p393l633
26690B3110o676o483J573m481k1966P815K7270K9940j3712j0220k5652k8555l844
26677c1881L5602J9490N22o022k0677Q638o614r740k71K861P279L0489j5211k4094
26663i629J0649n201J495n426P838K8551J1813k0026k0722j2970P858j3647j3391
26650c2808M894M7180L2706p102P655m86k9371n897O162p971q397k309k0130N056
26636a0818j3591P365L5484J5134R963k1533l1101k804j9083o747N987J7942M58
26623a3344j0637N297J142Q449o831l670k3112m785K9442K6319J498Q214k2161
26610d179l3166J7247K1633l402l194J8636J1801p476M792j768J0336J3982k6727
$$ plain form
26597 18515 4569 6117 -9194 -6203 -2037 4448 -3487 2967 5143 12765 3816 -199 8357 10656
26583 10656 -6757 2125 19057 38614 25828 35953 7437 -10260 -2942 -8154 -16304 15079
26571 15079 9255 19012 31521 25076 14751 31220 60426 35114 -6265 -15892 -17108 -36766 -38123
26558 -38123 -7967 6762 22647 32424 50763 40024 38160 15562 28803 36390 38671 44771 41875
26545 41875 27063 39054 40605 32880 8717 -17158 -37203 -40681 -1602 -3982 -17764 801
26533 801 10064 15344 34278 46140 45145 48988 19604 17671 21655 14459 1990 14657 -332 -17440
26519 -17440 -43120 -46762 -15596 52 1047 -5568 -34105 -10420 -8382 -11849 4288 6825 -4115
26506 -4115 14101 37896 28554 -15933 -3479 18942 21294 -9677 -11540 -22958 -8976 9777
$$ packed form
26597A8515j3946J548j5311K991M166O485p935O454K176P622q949m015Q556K299
26583A0656j7413Q882J6932J9557j2786J0125k8516j7697P318n212q150L1383
26571A5079n824R757J2509o445j0325J6469K9206k5312m1379r627j216j9658j357
26558c8123L0156J4729J5885R777J8339j0739j864k2598J3241P587K281O100k896
26545D1875j4812J1991J551p725k4163k5875k0045l478L9079k380j3782J8565
26533H01R263N280J8934J1862r95L843k9384j933L984p196j2469J2667j4989j7108
26519a7440k5680l642L1166J5648R95o615k8537K3685K038l467J6137K537j0940
26506d115J8216K3795r342m4487J2454K2421K352l0971j863j1418J3982J8753
$$ plain form
26494 9777 8486 1523 -21019 -17027 -5127 -9519 -8526 -11230 7691 22262 12026 30036 22742
26481 22742 11979 -8092 4382 -3422 6581 -5299 -16582 -19852 -29376 -35574 -18014 6932
26469 6932 5806 78 39631 16466 12939 25198 69763 65973 45194 26156 49895 41339 10041
26456 10041 5675 887 10674 7507 15246 9570 14739 27552 29817 10716 -5890 -15220 8109
26443 8109 30635 37657 30020 1204 -1314 -6545 -18360 -15039 -17726 -38108 -25760 -10415 -88
26430 -88 -313 -35693 -46938 -27112 -15019 -23927 -10605 9418 49617 77406 80071 75890 67995
26417 67995 62344 74130 78502 74047 66730 26241 5316 -2148 1786 -5366 2532 28078 34066
26404 34066 20711 2964 16750 20692 -416 -7615 3851 33159 40421 53444 45183 20128
$$ packed form
26494I777j291o963k2542L992J1900m392R93k704J8921J4571j0236J8010p294
26481B2742j0763k0071J2474p804J0003j1880j1283l270r524o198J7560K4946
26469F932j126n728L9553k3165l527J2259M4565l790k0779j9038K3739q556l1298
26456A0041m366m788R787l167P739n676N169J2813K265j9101j6606r330K3329
26443H109K2526P022p637k8816k518n231j1815L321k687k0382J2348J5345J0327
26430h8k25l5380j1245J9826J2093q908J3322K0023M0199K7789K665m181p895
26417F7995n651J1786M372m455p317m0489k0925p464L934p152P898K5546N988
26404C4066j3355j7747J3786L942k1108p199J1466K9308P262J3023q261k5055
$$ plain form
26392 20128 26205 28941 19537 17943 -11779 -26710 -19238 2405 15988 30453 23867 -3096 -30368
26379 -30368 -48331 -40321 -24510 -12428 9447 3861 -8276 4804 -94 -4865 -394 5630 9475
26366 9475 722 -8959 -25296 -30694 -23083 -27661 -24009 -6944 -1662 -14939 -31392 -40356 -20198
26353 -20198 -11250 -13452 -11016 5428 21239 11334 -9929 -12985 6400 23781 32462 16397 -11637
26340 -11637 -25418 -35725 -48731 -17895 29501 38055 36834 7051 -3115 -16497 3178 14735
26328 14735 -5323 -20965 -7254 -3296 -7001 21027 37612 20758 -7480 -1097 -6543 -2022 3599
26315 3599 -7592 -30213 -42342 -27852 -12926 -1581 7347 6943 13943 14184 949 -11424 -11587
26302 -11587 9520 2259 1850 14038 16626 -23569 -32816 -30599 -42794 -55025 -33038 -23235 -38462
$$ packed form
26392B0128O077K736r404j594k9722j4931P472K1643J3583J4465o586k6963k7272
26379c0368j7963Q010J5811J2082K1875n586j2137J3080m898m771M471O024L845
26366I475q753r681j6337n398P611m578L652J7065N282j3277j6453q964K0158
26353b0198Q948k202K436J6444J5811r905k1263l056J9385J7381Q681j6065k8034
26340a1637j3781j0307j3006L0836M7396Q554j221k9783j0166j3382J9675J1557
26328A4735k0058j5642J3711L958l705K8028J6585j6854k8238O383n446M521N621
26315C599j1191k2621j2129J4490J4926J1345Q928m04P000K41j3235j2373j63
26302a1587K1107p261m09J2188K588m0195r247K217j2195j2231K1987R803j5227
$$ plain form
26289 -38462 -38242 -9207 2755 17508 5629 -7579 -8230 -25640 -28492 -7785 -3071 14965 30783
26276 30783 42771 34385 40602 5305 6307 -25729 -20165 5741 18423 35445 45426 30534 27922
26263 27922 40750 19579 -13736 -20679 -17986 -29414 -50525 -49867 -38163 -22543 -19332 -34116 -40880
26250 -40880 -10750 9636 2589 -9841 -30798 -42147 -46209 -19637 11557 27937 21324 -12438
26238 -12438 -13968 5298 1594 24480 31211 -11225 -20210 -14471 13222 22313 8176 7054 -14827
26225 -14827 -38511 -26660 -13506 -8305 -6226 23023 52394 49918 27678 281 -3509 4033 9581
26212 9581 13795 -15375 -26340 -29461 -32571 -47428 -34701 -6172 4507 26651 144 3830 19775
26199 19775 10197 2381 8795 9416 6852 11010 33182 38244 14034 15392 55290 48447 16235 2015
$$ packed form
26289c8462K20K9035J1962J4753j1879j3208o51j7410k852K0707M714J8036J5818
26276C0783J1988q386O217l5297J002l2036N564K5906J2682J7022R981j4892k612
26263B7922J2828k1171l3315o943K693j1428k1111O58J1704J5620L211j4784o764
26250d0880L0130K0386p047j2430k0957j1349m062K6572L1194J6380o613l3762
26238a2438j530J9266l704K2886O731m2436q985N739K7693R091j4137j122k1881
26225a4827k3684J1851J3154N201K079K9249K9371k476k2240k7397l790P542N548
26212I581M214k9170j0965l121l110j4857J2727K8529J0679K2144k6507L686J5945
26199A9775r578p816O414O21k564M158K2172N062k4210J358L9898o843l2212j4220
$$ plain form
26185 2015 -8184 -1202 -13362 -13793 816 22908 38118 14934 6672 11415 25982 32692 43688
26172 43688 48414 33631 38671 49865 15672 16944 13934 9506 7682 5941 -14309 -31089 -15199
26159 -15199 -19677 -13287 17050 28252 19732 5991 -10896 -12236 15636 18112 531 -18181 -18454
26146 -18454 -26870 -18338 -17298 1711 -17859 -39830 -37869 -23690 -16322 -20587 -9179 5796 2410
26133 2410 -18743 -29189 -25775 -51165 -55092 -66474 -47455 -22996 4191 1303 28201 17558
26121 17558 -3684 -6141 -3415 -13238 -12816 -11577 -25812 -35517 -36845 -29330 -15847 15450 14140 -677
26107 -677 2117 -6098 -15228 7645 25890 34267 11171 -26015 -38100 -17958 -16073 -30342 -30096
26094 -30096 -18763 -12970 -267 -3433 -33646 -15326 -3393 -90 6297 2120 -8424 -11090 -19693
$$ packed form
26185B015j0199O982j2160m31J4609K2092J5210k3184q262M743J4567O710J0996
26172D3688M726j4783N040J1194l4193J272l010m428j824j741k0250j6780J5890
26159a5199m478O390L0337J1202q520j3741j6887j340K7872K476j7581j8712k73
26146a8454q416Q532J040J9009j9570k1971J961J4179P368m265J1408J4975l386
26133B410k1153j0446L414k5390l927j1382J9019K4459K7187k888K6898j0643
26121A7558k1242k457K726r823M22J239j4235r705j328P515J3483L1297j310j4817
26107f77K794q215r130K2873J8245Q377k3096l7186j2085K0142J885j4269K46
26094c0096J1333N793J2703l166l0213J8320J1933L303O387m177j0544k666q603
$$ plain form
26081 -19693 -1975 -5711 -28047 -42171 -21132 -18839 -41005 -52958 -30289 14980 9283 -7932
26069 -7932 -25378 -9503 -566 7600 13396 11888 -1245 8789 3693 12418 -10580 -33760 -52301
26056 -52301 -66498 -34050 -23894 -21403 21 -5221 7108 -11431 -28971 -8415 -12395 10351
26044 10351 20839 4755 -3359 -2282 -16446 -3100 24135 21708 13897 7943 15368 19685 12424
26031 12424 16979 -5554 -24322 -23245 -29677 -37785 -21155 -22420 -4027 14540 20154 22125 30379
26018 30379 13557 -12973 -17744 7775 33901 15561 25114 28185 6458 -18605 -25935 -45135
26006 -45135 -45941 -28282 -40275 -30061 -5149 14593 6240 13718 13022 26216 26663 29387 34755 9587
25992 9587 20335 23751 25463 12910 5065 9358 20432 27550 8021 -1631 -18229 -40378 -56958
$$ packed form
26081a9693J7718l736k2336j4124K1039K293k2166j1953K2669M5269n697j7215
26069g932j7446J5875Q937Q166N796j508j3133J0034n096Q725k2998k3180j8541
26056e2301j4197L2448J0156K491K1424n242J2329j8539j7540K0556l980K2746
26044A0351J0488j6084q114J077j4164J3346K7235k427p811n954P425M317p261
26031A2424M555k2533j8768J077o432q108J6630j265J8393J8567N614J971Q254
26018C0379j6822k6530m771K5519K6126j8340R553L071k1727k5063p330j9200
26006d5135q06J7659j1993J0214K4912J9742q353P478o96J3194M47K724N368k5168
25992I587J0748L416J712j2553p845M293J1074P118j9529r652j6598k2149j6580
$$ plain form
25979 -56958 -28020 -11327 -5115 -3081 -10115 5204 -15985 -25185 172 19590 6328 845 -9118
25966 -9118 -36289 -11748 7134 3040 -7617 2991 11149 -2514 -17615 -20006 4814 20407
25954 20407 25406 -9760 -33978 -44849 -39935 -27996 -6331 10696 19781 30517 13809 -21226
25942 -21226 -20412 6611 -13818 -36009 -37052 -35626 -50176 -72117 -40275 -20660 -22254 16355 25610
25929 25610 -9529 -2315 15794 18882 38187 44543 33812 -4881 -10837 -8830 -15262 -27304 -23615
25916 -23615 -9303 5125 9536 -6708 -12507 -2332 -571 -11025 -3375 14765 16843 16 14829
25903 14829 30688 21849 3369 -19654 -17889 -25148 -39356 -39051 -32924 -6830 3465 12718 -1732
25890 -1732 1784 1181 -14020 -21525 -21746 -14847 -15333 -21343 -12528 -11310 -15322 -3152 1956 1258 13891
$$ packed form
25979e6958K8938J6693O212K034p034J5319k1189r200K5357J9418j3262n483r963
25966i118k7171K4541J8882m094j0657J0608Q158j3663j5101k391K4820J5593
25954B0407M999l5166k4218j0871M914J1939K1665J7027R085J0736j6708l5035
25942b1226Q14K7023k0429k2191j043J426j4550k1941L1842J9615j594L8609R255
25929B5610l5139P214J8109L088J9305O356j0731l8693n956K007o432j2042L689
25916b3615J4312J4428M411j6244n799J0175J761j0454P650J8140K078j6827J4813
25903A4829J5859q839j8480k3023J765p259j4208L05O127K6094J0295R253j4450
25890a732L516o03j5201p505k21O899m86o010Q815J218m012J2170N108o98J2633
$$ plain form
25875 13891 28983 22902 28204 22393 16044 24563 24975 7340 -28055 -26264 -18535 495 23436
25862 23436 19347 -14345 -12573 44411 55365 35795 13013 3273 31133 21524 19596 39674 29648
25849 29648 -3069 -10627 5185 -4481 -19816 33404 51204 22843 10245 -11496 -25454 -31005
25837 -31005 -13456 6671 8719 6524 28299 42821 35987 -8356 -15733 38612 80260 73739 41360
25824 41360 52566 51938 49714 36739 7915 -7015 -10417 -19700 -13194 -3632 7578 10652 18628
25811 18628 22646 16305 24842 23056 6701 -11943 13256 15758 29204 28020 39039 32489 3258
25798 3258 -3574 -970 19033 51019 36307 -5103 9419 54234 47380 -817 -10395 -4197 -35307
25785 -35307 -44231 -24557 -3585 -2317 -33208 -15193 -3721 -6443 -11 -7481 -25487 -33791 -38538
$$ packed form
25875A3891J5092o081N302n811o349Q519M12j7635l5395J791P729J9030K2941
25862B3436m089l3692J772N6984J0954j9570k2782r740K7860r609j928K0078j0026
25849B9648l2717p558J5812r666j5335N3220J7800k8361j2598k1741j3958n551
25837c1005J7549K0127K048k195K1775J4522o834m4343p377N4345M1648o521l2379
25824D1360J1206o28k224j2975k8824j4930l402r283O506R562J1210L074P976
25811A8628M018o341Q537j786j6355j8644K5199K502J3446j184J1019o550k9231
25798C258o832K604K0003L1986j4712m1410J4522M4815o854m8197r578O198l1110
25785c5307q924J9674K0972J268l0891J8015J1472k722O432p470j8006q304m747
$$ plain form
25772 -38538 -27939 -25462 -33946 -18485 -1669 8511 -2702 -20821 -24365 -41382 -47759 -36383
25760 -36383 -17236 -4345 -7743 -2108 -9412 7115 -7336 -26912 -42478 -43059 -25848 -25799 -14892
25747 -14892 -11406 -20032 -3865 8138 5394 -12658 -21409 -36434 -35723 -3210 20322 14328 -201
25734 -201 -23145 -33485 -30168 -38733 -21455 -18965 -24512 -27034 -5634 2838 -12405 6336 12141
25721 12141 -6161 -41849 -40039 -18979 -14325 -29945 -32960 -10938 -3192 -9758 430 9511 -7023
25708 -7023 -12624 -4013 -28053 -41449 -31530 10723 32313 12672 -16388 -10267 15916 42281 29164
25695 29164 38180 37730 23485 -119 -41470 -41441 -34091 -28981 -35040 -26400 -3730 11621 24434 37042
25681 37042 29134 15071 6387 6333 17731 22117 13688 20639 3065 -3076 20867 32200 53365
$$ packed form
25772c8538J0599K477q484J5461J6816J0180j1213j8119l544j7017o377J1376
25760c6383J9147J2891l398N635p304J6527j4451j9576j5566n81J7211M9J0907
25747a4892L486q626J6167J2003k744j8052q751j5025P11L2513K3532n994j4529
25734b01k2944j0340L317q565J7278K490n547k522K1400Q472j5243J8741N805
25721A2141j8302l5688J810K1060M654j5620l015K2022P746o566J0188R081j6534
25708g023n601Q611k4040j3396R919M2253K1590j9641k9060O121K6183K6365j3117
25695B9164R016m50j4245k3604m1351K9P350N110o059Q640K2670J5351J2813J2608
25681C7042p908j4063q684n4J1398M386q429O951j7574o141K3943J1333K1165
$$ plain form
25668 53365 53525 35432 45255 29555 -12802 -38543 697 17148 58512 33982 -1001 -3269
25656 -3269 9566 1872 -22042 -27283 -24106 3634 -2272 -35022 -39759 -38250 -12503 29357 9651
25643 9651 -573 -4724 18035 50163 64515 55618 26162 32900 46581 14229 17982 18223 14695
25630 14695 -27990 -35815 -27995 -21348 6201 -7361 -10634 -17668 -21510 -20931 -18547 1670 170 2901
25616 2901 -10866 -20138 -26393 -22729 -7152 -1603 14876 27398 14203 -8899 -8697 6196 9565
25603 9565 11915 7451 4810 20411 40245 16984 -12248 -24252 -13544 -16064 -8494 7237 19883
25590 19883 9588 -8360 -1464 -4181 10017 19927 5147 2279 16840 18436 -9319 -13478 4269
25577 4269 25490 32136 51792 31885 20084 19163 4310 18166 33932 20643 26192 25115 8070
$$ packed form
25668E3365J60j8093R823j5700m2357k5741L9240J6451M1364k4530l4983k268
25656c269J2835p694k3914n241L177K7740n906l2750m737J509K5747M1860j9706
25643I651j0224m151K2759L2128J4352q897k9456O738J3681l2352L753K41l528
25630A4695m2685p825P820O647K7549j3562l273p034l842N79K384K0217j500K731
25616B901j3767r272o255L664J5577N549J6479J2522j3195k3102K02J4893L369
25603I565K350m464k641J5601J9834k3261k9232j2004J0708k520P570J5731J2646
25590A9883j0295j7948O896k717J4198R910j4780k868J4561J596k7755m159J7747
25577D269K1221O646J9656j9907j1801r21j4853J3856J5766j3289N549j077j7045
$$ plain form
25564 8070 5405 13600 23983 -3945 -28145 -27612 -17686 2106 8940 -2751 -24824 -19325 -19259 15990
25550 15990 42853 43786 33638 21956 19207 34182 23353 24838 34196 36977 -450 -14854 -28352
25537 -28352 -30415 -25435 -17008 16483 16678 -3264 -20235 -49107 -70627 -60960 -27693 -19670 -27644
25524 -27644 -6198 -3595 -25716 -30468 8239 34434 30186 34381 14967 6596 3791 49783 60127
25511 60127 28362 -11350 -26369 -10060 15627 31342 23470 15497 35811 36830 12997 -3323
25499 -3323 -26829 -40471 -41699 -58643 -45359 -50437 -14245 -4803 -30898 -64145 -54242 -17193 23253
25486 23253 17543 22238 5427 -13921 -9714 -2388 1519 -11959 -29148 -20937 -31820 -59729 -37689
25473 -37689 -15476 -15672 -33433 -36821 -39409 -22021 1446 11868 22328 16509 -11501 -2302 46187
$$ packed form
25564H070k665Q195J0383k7928k4200N33R926J9792O834j1691k2073N499O6L5249
25550A5990K6863R33j0148j1682k749J4975j0829J485R358K781l7427j4404j3498
25537b8352k063M980Q427L3491J95j9942j6971k8872k1520R667L3267Q023p974
25524b7644K1446K603k2121m752L8707K6195m248M195j9414q371k805M5992J0344
25511F0127l1765l9712j5019J6309K5687J5715p872p973K0314J019k3833j6320
25499c323k3506j3642j228j6944J3284n078L6192R442k6095l3247R903L7049M0446
25486B3253n710M695j6811j9348M207P326L907j3478j7189Q211j0883k7909K2040
25473c7689K2213j96j7761l388k588J7388K3467J0422J0460n819k8010R199M8489
$$ plain form
25460 46187 32354 -7746 -3272 -6326 10399 1607 -23907 -3465 -21993 -25479 -2894 -11823 -9138
25447 -9138 -19272 -12636 -12741 -23900 -37625 -41861 -24767 -7795 -5568 -16308 -51684 -37864 -4871
25434 -4871 -6127 -6267 -5091 -14217 12427 4628 802 -11662 -20399 -19543 -22472 -21914 -23146 -15781 7270
25419 7270 -30780 -34787 -19622 -12052 -3461 -28171 -28031 -16915 -1441 11814 43146 28761 15041
25406 15041 11661 11870 -10832 -17358 7051 26457 26228 25474 10188 335 13128 30645 42550
25393 42550 30143 -801 -6653 -1287 -9607 8985 7401 310 -14442 -23030 -45292 -17655 11605
25380 11605 -1397 1373 20364 18398 -3759 -13773 -24742 -8565 12360 20459 16933 9507 5057
25367 5057 -24180 -31893 -6361 -6805 -27524 -32711 -11592 -2107 -355 -21869 -57415 -57387 -32037 -35165
$$ packed form
25460D6187j3833m0100M474l054J6725q792k5514K0442j8528l486K2585q929K685
25447i138j0134O636j05j1159j3725m236J7094J6972K227j0740l5376J3820L2993
25434d871j256j40J176r126K6644p799l826j2464q737Q56k929N58j232P365K3051
25419G270l8050m007J5165P570Q591k4710J40J1116J5474J3255L1332j4385j3720
25406A5041l380K09k2702o526K4409J9406k29p54j5286r853J2793J7517J1905
25393D2550j2407l0944n852N366q320J8592j584p091j4752q588k2262K7637K9260
25380A1605j3002K770J8991j966k2157j0014j0969J6177K0925Q099l526p426m450
25367E057k9237p713K5532m44k0719n187K1119R485J752k1514l5546K8K5350l128
$$ plain form
25353 -35165 -58467 -49697 -27110 -20953 -8702 8352 23567 26781 28220 21886 -16267 -28681 -31117
25340 -31117 -55298 -34282 -15513 -6732 11069 25800 -4677 -32591 -48122 -42745 -30918 -58313
25328 -58313 -65632 -57502 -18545 7073 11861 -27255 -37613 -31470 -29499 -16207 -19891 -33901 -26229
25315 -26229 2901 30146 23434 18761 -2803 -26065 -66744 -81662 -74203 -43690 -35510 -64262
25303 -64262 -74948 -23879 20128 13790 2287 6747 21200 28067 4890 -12209 7873 37242
25291 37242 23391 16545 -9723 8641 19746 27715 16491 -6644 887 5431 -7629 5147
25279 5147 16973 30020 38866 8786 14322 12738 -13559 -9078 15698 29696 31454 27827 -15399
25266 -15399 8170 21509 12742 -5966 -19373 9435 31658 21899 2328 6040 12069 5017 -29938
$$ packed form
25353c5165k3302Q770K2587O157J2251J7054J5215L214J439o334l8153j2414k436
25340c1117k4181K1016J8769Q781J7801J4731l0477k7914j5531N377J1827k7395
25328e8313p319Q130L8957K5618M788l9116j0358O143J971J3292l684j4010P672
25315b6229K9130K7245o712m673k1564k3262m0679j4918P459L0513Q180k8752
25303f4262j0686N1069M4007o338j1503M460J4453O867k3177j7099K0082K9369
25291C7242j3851o846k6268J8364J1105P969j1224k3135P531M544j3060J2776
25279E147J1826J3047Q846l0080N536j584k6297M481K4776J3998J758l627m3226
25266a5399K3569J3339q767j8708j3407K8808K2223r759j9571L712O029p052l4955
$$ plain form
25253 -29938 -44082 -33899 -34268 -20805 -5786 -36928 -52491 -36137 10495 25961 6689 5305
25241 5305 17624 3045 -38424 -43604 -51195 -43143 -15375 5539 -13257 -15981 8721 38883 36232
25228 36232 28536 27653 15973 -4426 -11419 2154 28613 12483 -20962 -37670 -51666 -40022
25216 -40022 -20331 -21687 -35242 -21509 -17119 -5116 -8225 -23948 -28303 -31479 -17202 -15814 -5574
25203 -5574 16572 26067 13047 -12273 -37624 -53105 -46095 -54342 -67388 -44670 -32258 -675
25191 -675 1553 16136 -10316 -26283 -566 -6528 -37804 -61438 -45483 -24849 -5438 -8174 8281
25178 8281 31931 40228 43233 29915 21497 -14460 -11221 23092 35065 31672 28856 32090 11898
25165 11898 -913 -29231 -57635 -42053 1532 2689 21472 27537 15935 7697 -9198 -21325
$$ packed form
25253b9938j4144J0183l69J3463J5019l1142j5563J6354M6632J5466j9272j384
25241E305J2319j4579m1469n180p591Q052K7768K0914j8796k724K4702L0162k651
25228C6232p696q83j1680k0399o993J3573K6459j6130l3445j6708j3996J1644
25216d0022J9691j356j3555J3733M390J2003l109j5723m355l176J4277J388J0240
25203e574K2146R495j3020k5320k5351j5481P010q247j3046K2718J2412L1583
25191f75K228J4583k6452j5967K5717n962l1276k3634J5955K0634J9411k736J6455
25178H281K3650Q297L005j3318q418l5957L239L4313J1973l393k816L234k0192
25165A1898j2811k8318k8404J5582M3585J157J8783O065j1602q238j6895j2127
$$ plain form
25153 -21325 -14489 -10735 -16453 -15033 1300 691 -5078 767 23197 -4266 -29713 -27432 -18874 5565
25139 5565 17590 1603 -4186 449 -17104 -22001 -21435 -15406 -43784 -34772 -19133 -6202 12154
25126 12154 -23731 -51360 -41887 -33613 -38477 -17309 15760 20946 21751 21178 3466 -1668 -1566 2569
25112 2569 360 4545 24905 39163 36811 17366 7091 -15571 -39079 -38728 -23575 -20646 -23652
25099 -23652 -41804 -32098 -12964 -13704 -6555 -7240 -6604 884 -35026 -56825 -27182 -16844 17663
25086 17663 33074 12471 8932 -6071 1287 -32843 -64123 -37542 -21400 -48621 -74050 -72602
25074 -72602 -25814 -9167 -13371 568 9703 -6891 -16702 -14124 -15881 -37184 -30069 -57690 -71019
25061 -71019 -24950 -21170 -20233 -21546 -45407 -40020 -22466 -30507 -36744 -26143 -30538 -24904 -3424
$$ packed form
25153b1325O836L754n718J420J6333o09n769N845K2430k7463k5447K281Q558K4439
25139E565J2025j5987n789M635j7553m897N66O029k8378R012J5639J2931J8356
25126A2154l5885k7629R473Q274m864K1168L3069N186Q05n73j7712n134J02M135
25112B569k209M185K0360J4258k352j9445j0275k2662k3508L51J5153K929l006
25099b3652j8152R706J9134p40P149o85O36P488l5910k1799K9643J0338L4507
25086A7663J5411k0603l539j5003P358l4130l1280K6581J6142k7221k5429J448
25074g2602M6788J6647m204J3939R135j6594r811K578j757k1303P115k7621j3329
25061g1019M6069L780R37j313k3861N387J7554q041o237J0601m395N634K1480
$$ plain form
25048 -3424 -6181 -31237 -61059 -31486 -1327 15431 4007 -33197 -45594 -24842 -23421 -31388
25036 -31388 -25657 -14522 -14345 -20709 -27267 -15111 -25340 -18348 -14521 -322 -1256 2276 24335 48414
25022 48414 20259 12061 -6670 -7774 -12301 -1431 10432 13075 1415 -36658 -41600 -38900 -34751
25009 -34751 -25728 -34180 -48694 -23147 72 -4526 -5068 -9915 -12865 -5063 1557 7306 17923 31120
24995 31120 26938 26934 -1821 -26809 -16052 -4014 -20773 -45876 -32710 -43653 -37173 1174 9584
24982 9584 9196 15990 -3857 -15585 -10981 11213 11709 14855 21824 13008 11160 310 -13970 -14216
24968 -14216 2125 5093 -12125 -3112 8789 457 -15135 10480 11675 -11720 -14398 -43870 -38634
24955 -38634 -36337 -43141 -39971 -9134 -2207 -7629 5245 21399 13301 -4337 -1987 4184 -13569
$$ packed form
25048c424k757k5056k9822K9573L0159J6758j1424l7204j2397K0752J421p967
25036c1388N731J1135J77o364o558J2156j0229O992L827J4199r34L532K2059K4079
25022D8414k8155q198j8731j104m527J0870J1863K643j1660l8073m942K700M149
25009c4751R023q452j4514K5547K3219m598n42m847k950P802O620N749J0617J3197
24995C1120m182mk8755k4988J0757J2038j6759k5103J3166j0943O480L8347Q410
24982I584l88O794j9847j1728M604K2194M96L146O969q816j848j0850j4280k46
24968a4216J6341K968j7218R013J1901q332j5592K5615J195k3395k678k9472N236
24955c8634K297o804L170L0837O927n422J2874J6154q098j7638K350O171j7753
$$ plain form
24942 -13569 -25626 -33524 -37026 -25824 -33879 -18625 -30485 -26846 -4886 -11340 -23544 -7668 13054
24929 13054 9129 -226 18973 39359 11039 -19518 -14437 -8069 -2564 -11775 -23168 -7554 9831
24916 9831 2515 8917 -7244 15903 34189 34983 17682 8513 30692 34121 24346 -6151 -35369
24903 -35369 -18736 1482 18484 9041 -656 4449 8304 1171 -3191 -18595 -44379 -42386 -27137
24890 -27137 -89 25599 16869 31058 51785 38799 7870 -13670 12268 35112 7715 -35019
24878 -35019 -39725 -6741 -1056 -559 10952 22291 28499 55062 62039 34509 32945 9197 -18954
24865 -18954 -36741 -19523 -13684 -24608 -2381 334 26065 31933 14543 -4188 -29572 -23160
24853 -23160 15746 23559 15201 -10581 7017 -4892 -19590 8438 544 -36206 -53949 -56380
$$ packed form
24942a3569j2057p898l502J1202q055J5254j1860L639K1960o454j2204J5876K0722
24929A3054l925r355J9199K0386k8320l0557N081O368N505r211j1393J5614J7385
24916I831p316O402j6161K3147J8286P94j7301r169K2179L429r775l0497k9218
24903c5369J6633K0218J7002r443r697N105L855p133m362j5404k5784J993J5249
24890b7137K7048K5688q730J4189K0727j2986l0929k1540K5938K2844k7397m2734
24878c5019m706L2984N685M97J1511J1339O208K6563O977k7530j564k3748k8151
24865a8954j7787J7218N839j0924K2227K715K5731N868j7390j8731k5384O412
24853b3160L8906P813q358k5782J7598j1909j4698K8028p894l6750j7743k431
$$ plain form
24841 -56380 -59565 -47558 -29998 -9848 -6228 15300 27142 22551 24974 19708 44903 35865 7978
24828 7978 -6532 -3982 -5233 11152 44256 43409 44556 36865 21716 17223 28238 28848 9361 16
24814 16 -36991 -54110 -48414 -30440 7594 42627 50192 39883 51741 55192 32624 2097 4989
24801 4989 24473 30444 49862 51300 23483 5926 4839 -13587 -14637 -34856 -57487 -55396 -36172
24788 -36172 -42741 -51706 -49918 -28642 -25598 -25110 -13195 -20394 -29852 -36938 -29111 -19860 -20099 -12384
24774 -12384 -16997 -15476 -23338 84 -521 6428 -11572 -28288 -27147 -8952 -9085 11789 57223
24761 57223 50369 42433 34307 16074 -5648 -33258 -55117 -52169 -23020 3126 2588 -5348 -2723
24748 -2723 -3972 -28042 -26026 -13053 10729 15545 29745 24113 29408 50370 36814 8677 7058
$$ packed form
24841e6380l185J2007J7560K0150L620K1528J1842m591K423n266K5195r038k7887
24828G978j4510K550j251J6385L3104q47J147p691j5149m493J1015O10j9487r345
24814A6l7007j7119N696J7974L8034L5033P565j0309J1858L451k2568l0527K892
24801D989J9484N971J9418J438k7817j7557j087j8426j050k0219k2631K091J9224
24788c6172o569q965J788K1276L044M88J1915p199r458p086P827R251k39P715
24774a2384m613J521p862K3422o05O949j8000j6716J141J8195j33K0874M5434
24761E7223o854p936q126j8233k1722k7610k1859K948K9149K6146n38p936K625
24748b723j249k4070K016J2973K3782M816J4200n632N295K0962j3556k8137j619
$$ plain form
24735 7058 5701 -2972 -5673 -12532 5334 -7913 -9320 8373 12707 -9132 -40715 -57137 -30290
24722 -30290 -18204 -23735 -41006 -66386 -61843 -48716 -57287 -54317 -13708 -1952 -9832 -2311 -16667
24709 -16667 6920 10202 -11270 -2149 8605 20481 20463 -992 -1797 3180 -26501 -4864 30123
24696 30123 13283 4039 -20859 -34182 -33691 -19711 976 -3785 -30716 -33624 -4732 209 -9530
24683 -9530 900 13196 -12210 -16590 -29672 -40946 -39189 -38936 -52770 -10972 9078 -2935 13947
24670 13947 16595 2019 -31927 -37740 -47487 -39093 -51351 -52873 -25592 -15251 -38642 -61366 -69426
24657 -69426 -65219 -35263 7527 9610 -593 -21190 -7362 -1069 -19539 -24863 -16618 -32113 -10725
24644 -10725 -1803 -19312 -27252 -28635 -13888 -10628 2989 -12473 5281 3435 -20925 -24935 -13858
$$ packed form
24735G058j357q673k701o859J7866j3247j407J7693M334k1839l1583j6422K6847
24722c0290J2086n531j7271k5380M543J3127q571K970M0609J1756p880P521j4356
24709a6667K3587L282k1472R121J0754J1876j8k1455q05M977k9681K1637L4987
24696C0123j6840r244k4898j3323M91J3980K0687m761k6931k908K8892M941r739
24683i530J0430J2296k5406m380j3082j1274J757K53j3834M1798K0050j2013J6882
24670A3947K648j4576l3946n813r747Q394j2258j522K7281J0341k3391k2724q060
24657f9426M207K9956M2790K083j0203k0597J3828O293j8470n324Q245j5495K1388
24644a0725Q922j7509p940j383J4747L260J3617j5462J7754j846k4360m010J1077
$$ plain form
24631 -13858 -14544 -18105 -8127 10585 19829 -3902 -21633 -21436 -18045 -32883 -45791 -38996 -24032
24618 -24032 -29251 16217 30652 11767 -14639 -23828 -26288 -27926 -15658 -3977 -6198 -11639 -1698
24605 -1698 319 -10168 -2714 5273 1453 -8495 9085 18817 832 4174 10202 19822 -3766 6596
24591 6596 9730 -17628 -13233 -2453 10577 15042 37933 40134 19387 6590 4668 10875 23955
24578 23955 29484 325 -2044 10045 2678 7816 -4094 -9278 -9662 -5204 -3544 -37272 -55805
24565 -55805 -38351 -41619 -48847 -44049 -37071 -39569 -35831 -16683 4765 17132 15163 24986 40160
24552 40160 71171 59099 41676 12916 -3777 26955 20048 -22447 -40489 -43788 -27638 -15509
24540 -15509 -88 5595 4180 7027 4106 19303 5242 -10165 4989 25694 21226 20109 -4203
$$ packed form
24631a3858o86l561R978J8712R244k3731j7731J97L391j4838j2908O795J4964
24618b4032n219M5468J4435j8885k6406r189k460j638J2268J1681k221n441R941
24605a698K017j0487P454P987l820r948J7580R732j7985L342O028R620k3588J0362
24591F596L134k7358M395J0780J3030M465K2891K201k0747j2797j922O207J3080
24578B3955N529k9159k369J2089p367N138j1910n184l84M458J660l3728j8533
24565e5805J7454l268p228M798O978k498L738J9148K1448J2367j969R823J5174
24552D0160L1011j2072j7423k8760j6693L0732o907m2495j8042l299J6150J2129
24540a5509J5421N683j415K847k921J5197j4061j5407J5154K0705m468j117k4312
$$ plain form
24527 -4203 -19310 -37887 -40194 -40463 -22292 -28 -7061 -42890 -49580 -38779 -24423 -14539 7016
24514 7016 26401 29623 43108 45106 24842 -4058 -4007 -1991 5115 52392 45847 34799 29978 11148
24500 11148 -133 8990 1602 9433 36591 64204 52562 34321 14173 17752 37830 14604
24488 14604 474 -9641 -23472 -29118 -25420 -34609 -53574 -57982 -37617 -745 8951 12536 8782
24475 8782 -10102 -18933 -3387 20915 24179 6849 -22321 -5533 -7551 -19866 -24053 -11740 -27769
24462 -27769 -33673 -29973 -20324 1386 11590 44818 63459 16785 -12390 -10310 4640 -14504
24450 -14504 -19948 -4097 22831 20548 20134 22744 32942 27229 -869 -33607 -36488 -21793 -13174
24437 -13174 -29817 -29068 -13299 -6106 -5207 3600 7412 -17150 -25144 -9689 -7364 -27285 -16625
$$ packed form
24527d203j5107j8577k307k69J8171K2264p033l5829o690J0801J4356R884K1555
24514G016J9385L222J3485J998k0264k8900N1K016P106M7277o545j1048m821j8830
24500A1148j1281R123p388P831K7158K7613j1642j8241k0148L579K0078k3226
24488A4604j4130j0115j3831n646L698r189j8965m408K0365L6872R696L585l754
24475H782j8884q831J5546K4302L264j7330k9170J6788k018j2315m187J2313j6029
24462b7769n904L700R649K1710J0204L3228J8641m6674k9175K080J4950j9144
24450a4504n444J5851K6928k283m14K610J0198n713k8098l2738k881J4695Q619
24437a3174j6643P49J5769P193Q99Q807L812k4562p994J5455K325j9921J0660
$$ plain form
24424 -16625 -21243 -36416 -60974 -73932 -78454 -72287 -56579 -3887 34577 32089 9489 9837 -11817
24411 -11817 -35754 -14490 -41293 -91578 -71993 -49758 -47057 -40652 -36550 6463 31892 39496
24399 39496 6618 -35726 -39981 -8501 16053 21164 13121 -8344 -5911 30355 43780 10251
24387 10251 -17489 -13300 -15682 -28329 -30308 -24649 -31771 -27245 24883 37680 8298 -10485 -5880
24374 -5880 6758 7724 21660 25401 24062 -1667 -39444 -33219 -13940 -1064 -14577 -21168 -33299
24361 -33299 -22630 -20422 -54717 -66543 -36357 -30403 -25442 -11769 13239 -4775 -439 27866
24349 27866 -2738 -19173 -19434 -57893 -34995 -20633 -13757 -22107 -18979 -42649 -60841 -34546 -30502
24336 -30502 -68081 -52082 -26161 -11269 -528 6720 -7341 -26755 -19254 -16652 4408 6682
$$ packed form
24424a6625m618j5173k4558j2958m522O167J5708N2692L8464k488k2600L48k1654
24411a1817k3937K1264k6803n0285J9585K2235K701O405M102M3013K5429P604
24399C9496l2878m2344m255L1480K4554N111q043k1465K433L6266J3425l3529
24387A0251k7740M189k382j2647j979N659p122M526N2128J2797k9382j8783M605
24374e880J2638R66J3936L741j339k5729l7777O225J9279J2876j3513o591j2131
24361c3299J0669K208l4295j1826L0186N954M961J3673K5008j8014M336K8305
24349B7866l0604j6435k61l8459K2898J4362O876q350L128k3670j8192K6295M044
24336c0502l7579J5999K5921J4892J0741P248j4061j9414P501K602K1060K274
$$ plain form
24324 6682 789 14006 18979 8849 16325 12321 27193 15438 15392 10514 8116 27496 40079 30070
24310 30070 9385 -6584 -22865 -48130 -31076 -12456 -1674 -944 -12566 14352 40368 38728
24298 38728 16612 6622 6925 17807 24056 12974 6870 -11364 -15341 -46918 -39332 -19027 -12458
24285 -12458 -41503 -30261 -13750 -29375 -34315 -20192 -4815 10122 36751 22788 8058 36023
24273 36023 30857 21140 13330 -3563 -15412 2704 -8241 -28586 -8669 15060 20334 7797
24261 7797 -22600 -30649 -20297 5664 -342 6703 -10210 -27430 -24637 -18942 -4384 -11752 -17605
24248 -17605 20177 17063 -6126 6584 27041 41771 34728 -4599 -35428 -18477 3528 -24601
24236 -24601 -43580 -32044 -20269 -21585 4118 20313 25099 11645 10474 9349 9357 17949 34494
$$ packed form
24324F682n893J3217M973j0130P476m004J4872j1755m6m878k398J9380J2583j0009
24310C0070k0685j5969j6281k5265J7054J8620J0782P30j1622K6918K6016j640
24298C8728k2116r990L03J0882O249j1082o104j8234l977l1577P586K0305O569
24285a2458k9045J1242J6511j5625m940J4123J5377J4937K6629j3963j4730K7965
24273C6023n166r717p810j6893j1849J8116j0945k0345J9917K3729N274j2537
24261G797l0397q049J0352K5961o006P045j6913j7220K793N695J4558p368n853
24248a7605L7782l114k3189J2710K0457J4730p043l9327l0829J6951K2005k8129
24236b4601j8979J1536J1775j316K5703J6195M786j3454j171j125QQ592J6545
$$ plain form
24223 34494 10065 11835 662 -16079 1469 2409 9597 15616 -7555 -19115 -34848 -28929 -39728
24210 -39728 -49131 -40901 -21884 11595 47834 50994 5975 -10793 -17034 -43997 -63450 -56256 -27588
24197 -27588 -25461 -18800 -3966 -10510 -31831 -26098 5104 53229 44496 44719 29418 50064 58478
24184 58478 59746 62180 24808 15393 19672 14070 28064 33114 31172 33482 35776 14646 2791
24171 2791 22813 30565 19894 19701 11544 2790 13881 9213 -10412 -24576 -20938 -19981 -15821 -4572
24157 -4572 14978 26083 12555 -3289 13223 5106 13021 10867 -4335 -22414 -16489 -2125 30599
24144 30599 31318 1277 -19666 -3704 -2967 -5791 -3889 -523 4370 -22014 -2359 -96 7273 -17831
24130 -17831 -26419 -18883 -13080 6881 21538 32626 12229 -36210 -41927 -17351 5114 -16014
$$ packed form
24223C4494k4429J770j1173j6741J7548R40P188O019k3171j1560j5733N919j0799
24210c9728r403Q230J9017L3479L6239L160m5019j6768o241k6963j9453P194K8668
24197b7588K127O661J4834o544k1321N733L1202M8125q733K23j5301K0646Q414
24184E8478J268K434l7372r415M279n602J3994N050j942K310K294k1130j1855
24171B791K0022P752j0671j93q157q754J1091m668j9625j4164L638R57M160J1249
24157d572J9550J1105j3528j5844J6512q117P915k154j5202j8079N925J4364L2724
24144C0599P19l0041k0943J5962P37k824J902L366M893k6384J9655K263P369k5104
24130a7831q588P536N803J9961J4657J1088k0397m8439n717K4576K2465k1128
$$ plain form
24118 -16014 -4101 923 -23744 -32403 -30601 -23636 -13168 -12258 -21536 -22333 -4091 -10437 -17877 -11497
24104 -11497 15141 -4819 -20154 -2924 -7696 -19168 -5737 -1419 19687 26750 11268 5294
24092 5294 -11294 -29801 -9977 -16011 -55688 -45937 -28014 -31432 -45954 -18648 9154 -5502
24080 -5502 -8696 1785 2369 12754 21768 13310 24624 34242 35173 9731 11652 10543 -23224 -56925
24066 -56925 -29526 -38942 -14702 13813 7671 -11765 29151 48051 14065 9285 6690 8285 16209
24053 16209 11154 -16545 -15606 -15432 -16441 -6071 250 32338 57464 37776 14244 -1894 -34110
24040 -34110 -11159 937 5974 10072 12218 -9478 -4563 -8309 125 -276 5066 11517 -4282 -12086
24026 -12086 -12155 19272 10238 -33272 -44025 -33087 -12877 26561 26743 -2613 -12114 8364 10123
$$ packed form
24118a6014J1913N024k4667q659J802O965J0468R10r278p97J8242o346p440O380
24104a1497K6638j9960j5335J7230m772j1472J3431M318K1106P063j5482n974
24092E294j6588j8507J9824o034l9677R751J7923l418j4522K7306K7802j4656
24080e502l194J0481N84J0385R014q458J1314R618R31k5442J921j109l3767l3701
24066e6925K7399r416K4240K8515o142j9436M0916J8900l3986m780k595J595P924
24053A6209n055k7699R39J74j009J0370O321L2088K5126j9688k3532j6138l2216
24040c4110K2951J2096N037M098K146k1696M915l746Q434m01N342O451j5799p804
24026a2086o9L1427r034m3510j0753J0938K0210L9438J82k9356r501K0478J759
$$ plain form
24013 10123 -1291 7509 -421 20693 -19294 -39011 -28725 -21738 -49643 -23052 -31102 -59105
24001 -59105 -62545 -58535 -46029 -27480 -17413 -13646 -31818 -30517 -23057 -35363 -35015 -31004 -23065
23988 -23065 -53254 -76020 -48268 -45209 -50168 -35650 -13476 -744 -22784 -41795 -3472 -15678
23976 -15678 -2637 -9818 -16028 32995 72250 61322 21967 5039 12184 15429 4740 14766
23964 14766 13120 17283 27767 26385 20102 11718 17289 8065 5631 19211 -18492 -38087 -34396
23951 -34396 -26535 -13178 395 -5524 -5950 -24631 -26903 -21976 -2013 7937 1626 4028 17236
23938 17236 8771 7057 13138 -1603 43102 28558 6291 -19593 -11901 5209 -3517 -20873 -28539
23925 -28539 -37934 -20779 5144 -12169 -2903 18832 12712 -10777 -6672 11146 5035 7669 11119
$$ packed form
24013A0123j1414Q800p930K1114l9987j9717J0286O987k7905K6591q050k8003
24001e9105l440M010J2506J8549J0067L767j8172J301P460j2306L48M011P939
23988b3065l0189k2766K7752L059m959J4518K2174J2732k2040j9011L8323j2206
23976a5678J3041p181o210M9023L9255j0928l9355j6928P145L245j0689J0026
23964A4766j646M163J0484j382o283q384N571r224k434J3580l7703j9595L691
23951c4396P861J3357J3573n919m26j8681k272M927J9963R950o311K402J3208
23938A7236q465j714O081j4741M4705j4544k2267k5884P692J7110q726j7356p666
23925b8539r395J7155K5923j7313R266K1735o120k3489M105J7818o111K634L450
$$ plain form
23912 11119 -12371 -6598 -10008 -19523 -32469 -6805 32816 46557 35171 3616 -13401 -38923
23900 -38923 -51790 -54916 -38287 -31383 -19110 -4919 24300 21787 596 15095 25157 38275
23888 38275 -13868 -30182 -16349 12131 36727 77752 43530 11777 6183 663 6836 10302
23876 10302 124 -10536 -15115 -12745 -561 14184 22329 24705 -5254 -41146 -61370 -49290
23864 -49290 -19410 -66 -9250 13769 32300 40249 25105 5384 912 -18181 -27094 -29230 -11896
23851 -11896 -2472 3534 -24578 -27298 -9655 17092 19088 -2745 -6070 -31795 -35447 -16968 -24832
23838 -24832 -4986 -4674 -7492 -13402 -29254 -6608 2998 -2683 4240 4685 2315 -19398 -19989 -40257
23824 -40257 -45913 -40568 -26020 -27387 -11400 -10235 -22282 -26470 -21661 -3882 23098 33286 44338
$$ packed form
23912A1119k3490N773l410r515j2946K5664L9621J3741j1386l1555j7017k5522
23900c8923j2867l126J6629O904J2273J4191K9219k513k1191J4499J0062J3118
23888C8275n2143j6314J3833K8480K4596M1025l4222l1753n594n520O173L466
23876A0302j0178j0660m579K370J2184J4745Q145K376k9959l5892k0224J2080
23864d9290K9880J9344r184K3019J8531P949j5144j9721m472j9093q913k136J7334
23851a1896R424O006k8112k720J7643K6747J996k1833l325k5725l652J8479p864
23838b4832J9846L12k818n910j5852K2646R606n681O923M45k370k1713n91k0268
23824d0257n656N345J4548j367J5987J165j2047m188M809J7779K6980J0188J1052
$$ plain form
23811 44338 37447 20956 13631 20788 38451 21290 -18219 -27963 -45551 -17407 238 -15989
23799 -15989 -45410 -57211 -35490 5689 -20893 -35605 -46556 -33255 -3118 13218 27124 -1492
23787 -1492 -1213 -16855 -20435 -11398 1626 8593 2993 -9845 -3317 2414 9840 7592 8810 -5308
23773 -5308 14667 33712 34412 -10104 -28384 -23696 -2668 1985 -5224 -15613 -18445 -29391 -27739
23760 -27739 -50296 -41707 -51770 -45285 -16969 -9034 5188 14885 27615 59014 31143 11206
23748 11206 18374 36515 49723 47285 22007 31915 17505 -5711 -10694 4147 1357 -29925 -60892
23735 -60892 -46342 -48805 -45354 -16935 -23390 -15813 8238 -13043 -9994 5135 -2224 -1734 3076
23722 3076 -19746 -42950 -38757 -1405 27687 26124 25556 14193 3681 5013 -17775 -10778 -7860
$$ packed form
23811D4338o891j6491p325P157J7663j7161l9509r744j7588K8144J7645j6227
23799a5989k9421j1801K1721M1179k6582j4712j0951J3301L0137J6336J3906k8616
23787a492K79j5642l580R037J3024O967n600j2838O528N731P426k248J218j4118
23773e308J9975J9045P00m4516j8280M688K1028M653p209j0389k832j0946J652
23760b7739k2557Q589j0063O485K8316P935J4222R697J2730L1399k7871j9937
23748A1206P168J8141J3208k438k5278R908j4410k3216m983J4841k790l1282l0967
23735f0892J4550k463L451K8419o455P577K4051k1281L049J5129p359M90M810
23722C076k2822k3204M193L7352K9092j563n68j1363j0512J332k2788O997K918
$$ plain form
23709 -7860 -19965 -34833 -42967 -43687 -42614 -43574 -22451 -684 1474 -16952 -29465 -33376 -39034 -25509
23695 -25509 1037 -9339 -3994 -15418 -6524 8017 -29276 -43358 -42336 -40838 -20861 -17318 -43246
23682 -43246 -23110 5289 19188 -6957 -34307 -38534 -28058 -19450 6879 -5368 2329 3052 -29250
23669 -29250 -39499 -43900 -57183 -71035 -48317 -20633 -27489 -49740 -18823 9337 40362 26427
23657 26427 10369 5245 -5047 10114 -35711 -50929 -18736 -26169 -48198 -37439 -44704 -20325
23645 -20325 -23986 -13041 3963 3023 13411 101 4134 -9377 19441 23351 4284 -8986 -2186
23632 -2186 5368 -16248 -27035 81 21409 5762 -2456 -17751 -16602 -15551 -31873 -27256 -4018
23619 -4018 -9860 3907 -22461 -21483 -38578 -42268 -24777 -13854 -43287 -55465 -48723 8474 40976
$$ packed form
23709g860j2105j4868q134p20J073r60K1123K1767K158j8426j2513l911n658J3525
23695b5509K6546j0376N345j1424Q894J4541l7293j4082J022J498J9977L543k5928
23682d3246K0136K8399J3899k6145k7350m227J0476Q608K6329j2247P697P23l2302
23669b9250j0249m401j3283j3852K2718K7684o856k2251L0917K8160L1025j3935
23657B6427j6058n124j0292J5161m5825j5218L2193p433k2029J0759p265K4379
23645b0325l661J0945J7004r40J0388j3310M033j3511K8818L910j9067j3270O800
23632b186P554k1616j0787K7116K1328j5647q218j5295J149J051j6322M617K3238
23619d018n842J3767k6368R78j7095l690J7491J0923k9433j2178O742N7197L2502
$$ plain form
23606 40976 35326 13210 -19591 -17895 -7401 -860 -822 12116 27775 31200 22112 10081 16623
23593 16623 33236 19156 2297 419 -2409 2531 -9186 -2334 548 -824 9182 -2742 -7672
23580 -7672 -2669 19867 15777 24538 20279 -7295 -14415 -21008 -35250 -33683 -9682 -15762 -8165 -3700
23566 -3700 -2630 -28381 -37182 -37321 -31394 -18136 -24335 -31474 -22453 -20960 -1178 7005 -6656 -16035
23552 -16035 3564 858 7220 27011 40252 44946 36134 13662 13047 -1811 13472 5688 16143
23539 16143 42162 59367 50396 37278 47885 66046 67298 57251 48942 35093 430 17992
23527 17992 41399 9540 -5844 2783 9261 -10162 -16728 -2953 -1044 -25300 -35906 -40520 -53333
23514 -53333 -35103 -23881 4484 36512 28904 10109 -5171 -35957 -13537 -19293 -26411 -49465
$$ packed form
23606D0976n650k2116l2801J696J0494O541L8J2938J5659L425r088j2031O542
23593A6623J6613j4080j6859j878k828M940j1717O852K882j372J0006j1924m930
23580g672N003K2536m090Q761m259k7574p120o593j4242J567K4001o080P597M465
23566c700J070k5751q801j39N927J3258o199p139R021J493J9782Q183j3661r379
23552a6035J9599k706O362J9791J3241M694q812k2472o15j4858J5283p784J0455
23539A6143K6019J7205q971j3118J0607J8161J252j0047q309j3849l4663J7562
23527A7992K3407l1859j5384Q627O478j9423o566J3775J909k4256j0606m614j2813
23514e3333J8230J1222K8365L2028p608j8795j5280l0786K2420n756p118k3054
$$ plain form
23502 -49465 -78124 -43790 -6653 -1631 9337 -11689 -20019 -21331 -3268 -7664 -6423 -393 -4869
23489 -4869 -8841 16081 13901 -10345 -32705 -40667 -13384 -12160 -27446 -21827 -25489 -35929 -43555
23476 -43555 -25895 -20682 -11785 9399 16417 13246 2346 -25335 -16362 -7544 -19865 -48965 -49768
23463 -49768 -44180 -35987 -36204 -47248 -84232 -74152 -36292 -16263 -17512 -22668 -16137 -14173 -9210
23450 -9210 -9916 -3819 -16204 -16077 14212 31953 42585 42225 25450 611 -3846 18960 28623 35221
23436 35221 16810 -15549 -20049 -18174 8645 9089 -796 423 -4093 -10287 -7691 -3134 -13003 -7748
23422 -7748 4709 -5556 -21082 -25634 -1897 25929 42492 17351 1625 -918 -26455 -44041
23410 -44041 -39352 -15309 12997 20502 23402 13384 -364 -7700 -9203 10021 16279 2098 12478
$$ packed form
23502d9465k8659L4334L7137N022J0968k1026q330j312J8063m396J241O030m476
23489d869l972K4922k180k4246k2360p962K7283J224j5286N619l662j0440p626
23476d3555J7660N213Q897K1184P018l171j0900k7681Q973Q818j2321k9100q03
23463d9768N588Q193k17j1044l6984J0080L7860K0029j249n156O531J964M963
23450i210p06O097j2385J27L0289J7741J0632l60j6775k4839m457K2806R663O598
23436C5221j8411l2359m500J875K6819M44r885J219m516o194K596M557r869N255
23422g748J2457j0265j5526m552K3737K7826J6563k5141j5726k543k5537j7586
23410d4041M689K4043K8306P505K900j0018j3748p336j503J9224O258j4181J0380
$$ plain form
23397 12478 9127 17479 11210 207 -7213 -2867 18621 21393 22861 14603 2077 -7062 -11380 8312
23383 8312 10652 -7950 -19724 3509 9618 11022 1976 -8761 -12554 -17868 3411 38153 33750
23370 33750 17445 15538 12358 6351 465 -6626 194 11395 -3324 -40057 -24854 -314 -5093
23357 -5093 -2143 9921 -8256 5324 5155 -19567 -27553 -28042 -35068 -47129 -52960 -60008 -32334 -45639
23343 -45639 -53043 -34161 -40084 -45223 -46036 -57265 -34701 4955 16417 5937 -11861 -26453 -5660
23330 -5660 2625 -11136 5566 -12352 -9731 -13401 4955 47109 54046 56476 65563 59790 34017
23317 34017 46707 36647 28479 3897 -1054 -7528 3082 -14405 -10836 18402 16727 -12556 -15309
23304 -15309 -11940 -10789 20336 44532 56144 38708 6866 -14318 -9771 -260 -6667 -5569 -13540
$$ packed form
23397A2478l351Q352o269j1003p420M346K1488K772J468q258j2526r139m318J9692
23383H312K340j8602j1774K3233O109J404r046j0737l793n314K1279L4742m403
23370C3750j6305j907l180o007n886p091O820J1201j4719l6733J5203K4540m779
23357e093K950J2064j8177J3580j69k4722p986m89p026j2061n831p048K7674j3305
23343d5639p404J8882n923n139q13j1229K2564L9656J1462j0480j7798j4592K0793
23330e660Q285j3761J6702j7918K621l670J8356M2154O937K430R087n773k5773
23317C4017J2690j0060q168k4582m951o474J0610j7487L569K9238j675k9283k753
23304a5309L369J151L1125K4196J1612j7436l1842k1184M547R511o407J098p971
$$ plain form
23291 -13540 -23979 -23336 -35016 -38363 -9639 -37758 -48213 -25046 2019 90 -9595 -6758 -10314
23278 -10314 -8617 -6996 14358 35615 64922 70845 66036 42997 -4170 -34354 -36684 -7497 -26191
23265 -26191 -34840 -43264 -23127 348 17652 31827 27643 17431 3006 -25471 -39741 -16779
23253 -16779 25960 34320 27537 11346 26567 38943 16112 548 29192 54380 50197 36006
23241 36006 40440 37268 26769 10763 19263 16513 7894 7699 21769 11829 -8952 3049 -3440
23228 -3440 19741 35686 35193 46591 70722 75471 105342 103801 62024 31453 20171 1380 6295
23215 6295 24518 23700 32747 39938 24637 -3597 -11833 780 8768 22892 -18146 -20616 6194
23202 6194 3896 -15488 -22163 -22254 -32259 -34352 -39580 -23959 -27 -2669 -17294 -12167 -23472 3335
$$ packed form
23291a3540j0439O43j1680l347K8724k8119j0455K3167K7065j929r685K837l556
23278a0314J697J621K1354K1257K9307N923m809k3039m7167l0184k330K9187j8694
23265b6191q649q424K0137K3475J7304J4175m184j0212j4425k8477j4270K2962
23253a6779M2739Q360o783j6191J5221J2376k2831j5564K8644K5188m183j4191
23241C6006M434l172j0499j6006Q500k750q619j95J4070r940k0781J2001o489
23228c440K3181J5945m93J1398K4131M749K9871j541m1777l0571j1282j8791M915
23215F295J8223q18R047P191j5301k8234q236J2613P988J4124m1038k470K6810
23202F194k298j9384o675r1j0005k093n228J5621K3932k642j4625N127j1305K6807
$$ plain form
23188 3335 -7448 12201 48187 42406 70568 47661 -9774 -11872 -12447 -16725 2779 24102 16920
23175 16920 -8708 -20022 -28850 -27666 -13485 4890 -6998 -7842 -5476 -21973 -35439 -28999 -27983
23162 -27983 -10829 20263 7045 4080 -18331 -10766 5304 19661 17892 28620 19544 8407
23150 8407 20783 32372 33222 20090 36973 52628 26923 8824 29414 23851 23024 59113 60295
23137 60295 64862 88569 113766 106720 117081 138028 160173 202882 251342 318954 455230 697455
23125 697455 980516 1305516 1576571 1675328 1569811 1341797 1039098 751839 566456 444882
23115 444882 385815 318628 264413 237938 248275 225441 192927 176874 180057 166539 154013 140901
23103 140901 138377 144133 146575 145648 116623 103748 110257 130829 125792 99794 67214 67305 90187
$$ packed form
23188C335j0783J9649L5986n781K8162k2907n7435k098n75m278J9504K1323p182
23175A6920k5628j1314q828J184J4181J8375j1888q44K366j6497j3466O440J016
23162b7983J7154L1092j3218k965k2411P565J6070J4357j769J0728r076j1137
23150H407J2376J1589Q50j3132J6883J5655k5705j8099K0590n563q27L6089J182
23137F0295M567K3707K5197p046J0361K0947K2145M2709M8460O7612J36276K42225
23125F97455K83061L25000K71055R8757j05517k28014l02699k87259j85383j21574
23115D44882n9067o7187n4215k6475J0337k2834l2514j6053L183j3518j2526j3112
23103A40901k524N756K442r27k9025j2875O509K0572n037k5998l2580R1K2882
$$ plain form
23090 90187 94493 114011 99849 101116 115727 106303 92356 70979 77178 97182 115758 98718
23078 98718 64867 72547 95056 73729 71141 59797 33867 51300 82786 74099 44847 46345
23066 46345 73818 81287 63218 48530 43597 57821 57753 58819 66685 70976 81112 55697 34556
23053 34556 28646 44695 40191 51273 55664 41757 39881 62438 33016 21906 22808 -7958 -15294
23040 -15294 -7718 9975 56940 46872 9073 -146 13410 15207 2955 5920 -13245 18608
23028 18608 37431 22590 6403 -1812 -8087 15916 21244 21695 27962 24162 20262 10112 -19822
23015 -19822 -32130 -15064 -6653 -22316 7760 -769 -13153 5531 17938 51173 58921 46213
23003 46213 31639 -3036 -20766 -14038 17612 -1681 12041 22650 56487 61817 34491 36450
$$ packed form
23090I0187M306J9518j4162J267J4611r424j3947k1377O199K0004J8576j7040
23078I8718l3851P680K2509k1327k588j1344k5930J7433L1486q687k9252J498
23066D6345K7473P469j8069j4688m933J4224o8J066P866M291J0136k5415k1141
23053C4556n910J6049m504J1082M391j3907j876K2557k9422j1110R02l0766p336
23040a5294P576J7693M6965j0068l7799r219J3556J797j2252K965j9165L1853
23028A8608J8823j4841j6187q215o275K4003N328M51O267l800l900j0150k9934
23015a9822j2308J7066Q411j5663L0076q529j2384J8684J2407L3235P748j2708
23003D6213j4574l4675j7730O728L1650j9293J3722J0609L3837N330k7326J959
$$ plain form
22991 36450 15708 19068 10981 12784 12535 33857 15556 13323 22040 12832 23644 19733 22009 13166
22977 13166 -2383 -479 -11664 -14801 -7344 -5557 15252 33238 51013 69953 81897 98710
22965 98710 86710 49076 37033 30601 26883 16134 17941 20308 23399 18882 -190 -9800 -12887
22952 -12887 -3276 -16022 5472 32785 19990 2329 -32567 -31906 106 21310 52454 42309
22940 42309 -15054 -7060 15710 22589 12773 -35346 -52104 -13629 -11988 -26533 -34200 -47781 -42555
22927 -42555 -9249 -497 -7441 9007 14593 13888 10320 7337 17531 24378 17546 16895 36250 44634
22913 44634 44220 59127 83994 103065 86424 68710 40593 37273 42656 69194 80358 83872 58557
22900 58557 30791 39954 18636 10541 29022 23399 28323 37620 57067 47104 41042 18746 -4921
$$ packed form
22991C6450k0742L360q087J803k49K1322j8301k233Q717r208J0812l911K276q843
22977A3166j5549J904j1185l137P457J787K0809J7986J7775J8940J1944J6813
22965I8710j2000l7634j2043o432l718j0749J807K367L091m517j9072r610l087
22952a2887R611j2746K1494K7313j2795j7661l4896O61L2012K1204L1144j0145
22940D2309n7363P994K2770O879r816m8119j6758L8475J641j4545p667j3581N226
22927d2555L3306Q752o944J6448N586p05l568k983J0194O847o832o51J9355Q384
22913D4634m14J4907K4867J9071j6641j7714k8117l320N383K6538J1164L514k5315
22900E8557k7766R163k1318q095J8481n623M924R297J9447r963o062k2296k3667
$$ plain form
22887 -4921 -26453 -11319 -6147 21425 27799 27854 4156 3347 -14149 -10913 -7430 7283 25044 13479
22873 13479 38461 56511 90119 91678 81301 45043 41156 56083 51395 43116 35565 31881 14765
22860 14765 18491 28771 61533 70600 42872 17335 -19699 -24900 -39885 -26726 15327 15113 25914
22847 25914 43653 44130 21417 22941 27787 38010 60022 78089 66242 22319 -2764 -8102 8049
22834 8049 47537 75547 74544 81696 90122 93939 127614 156220 186490 174408 149656 123981 88801
22821 88801 49931 33976 27777 24414 41549 69380 69887 58643 84965 102590 116213 97046
22809 97046 81741 71215 62292 91562 109567 91643 83001 81269 69394 78648 115418 118214 126772
22796 126772 123065 117344 114704 105266 75542 62938 37834 29976 53908 64356 76305 97059
$$ packed form
22887d921k1532J5134N172K7572O374N5k3698q09j7496L236L483J4713J7761j1565
22873A3479K4982J8050L3608J559j0377l6258l887J4927m688q279p551l684j7116
22860A4765L726J0280L2762R067k7728k5537l7034n201j4985J3159M2053k14J0801
22847B5914J7739M77k2713J524M846J0223K2012J8067j1847m3923k5083n338J6151
22834H049L9488K8010j003P152Q426L817L3675K8606L0270j2082k4752k5675l5180
22821H8801l8870j5955o199l363J7135K7831N07j1244K6322J7625J3623j9167
22809I7046j5305j0526q923K9270J8005j7924q642j732j1875R254L6770K796Q558
22796A26772l707n721k640r438k9724j2604k5104p858K3932J0448J1949K0754
$$ plain form
22784 97059 93512 87736 64419 33959 14426 31172 52154 87442 75205 44510 54458 69114
22772 69114 83648 87624 88267 105821 104157 69171 45560 35962 1703 -3823 -5991 7318 28004
22759 28004 54717 84579 78315 70852 61393 82262 105633 137558 124206 92595 94109 75227
22747 75227 54396 54652 57961 65514 92092 124029 140432 137516 142172 140831 151088 136678 141450
22734 141450 136622 109942 132500 137155 112560 122664 120293 104354 92296 112923 148327 165623
22722 165623 142566 104870 94368 67402 47423 56077 45481 55437 50572 49233 62231 65157
22710 65157 53849 47173 54908 90339 137610 151908 171950 188583 179246 210520 268074 308467
22698 308467 368955 370566 323266 283066 255528 245466 258801 269255 268018 270839 259721 219645
$$ packed form
22784I7059l547n776k3317l0460j9533J6746K0982L5288j2237l0695R948J4656
22772F9114J4534L976O43J7554j664l4986k3611r598l4259n526k168J3309K0686
22759B8004K6713K9862o264p463r459K0869K3371L1925j3352l1611J514j8882
22747G5227k0831K56L309P553K6578L1937J6403k916M656j341J0257j4410M772
22734A41450m828k6680K2558M655k4595J0104k371j5939j2058K0627L5404J7296
22722A65623k3057l7696j0502k6966j9979Q654j0596R956m865j339J2998K926
22710F5157j1308o676P735L5431M7271J4298K0042J6633r337L1274N7554M0393
22698C08467O0488J611m7300m0200k7538j0062J3335J0454j237K821j1118m0076
$$ plain form
22686 219645 198681 193256 211812 217494 201689 202050 220569 215796 207414 200688 233591 270811 298458
22673 298458 307249 312668 313480 321225 328887 310527 285926 298108 293427 278915 285484 333781 381716
22660 381716 399433 423459 461586 487353 477712 520700 603226 721041 923378 1220436 1549233
22649 1549233 1910867 2143846 2137275 1941667 1646766 1262502 988580 849898 830815 821864
22639 821864 795869 799484 821778 834849 849690 848258 857859 830255 798101 743248 721935 703137
22627 703137 694005 696780 687034 641280 590973 578447 540635 549916 586763 633686 637283 617708
22615 617708 607274 617173 674227 763578 866590 948053 1022131 1092545 1201094 1303934 1385818
22604 1385818 1496464 1620137 1700208 1772477 1840633 1899562 2005734 2113313 2314233 2557708
$$ packed form
22686B19645k0964n425J8556N682j5805L61J8519m773q382o726L2903L7220K7647
22673B98458Q791N419Q12P745P662j8360k4601J2182m681j4512O569M8297M7935
22660C81716J7717K4026L8127K5767r641M2988Q2526J17815K02337K97058L28797
22649A549233L61634K32979o571j95608k94901l84264k73922j38682j9083q951
22639H21864k5995L615K2294J3071J4841j432R601k7604l2154n4853k1313j8798
22627G03137r132K775r746m5754n0307j2526l7812R281L6847M6923L597j9575
22615F17708j0434R899N7054Q9351J03012Q1463P4078P0414J08549J02840Q1884
22604A385818J10646J23673Q0071P2269O8156N8929J06172J07579K00920K43475
$$ plain form
22594 2557708 2934311 3467042 4071381 4721864 5344313 5898124 6479109 7189143 8069157
22585 8069157 9201678 10669549 12627018 15278056 18947974 24182416 32032658 44710432
22577 44710432 66973854 105096772 158732938 219776932 280993869 322440142 321208458
22570 321208458 286191124 230902154 165516540 114258026 85012171 69042740 59109226
22563 59109226 51790780 45766176 40660921 36350766 32801696 29860958 27450631 25427901
22555 25427901 23754026 22357401 21256605 20429992 19814178 19361848 18975625 18582930 18189476
22546 18189476 17757072 17257523 16714738 16096195 15416778 14741539 14098372 13499860 12970273
22537 12970273 12506458 12098848 11742713 11439926 11147190 10832057 10508817 10191296 9823515
$$ packed form
22594B557708L76603N32731O04339O50483O22449N53811N80985P10034Q80014
22585H069157J132521J467871J957469K651038L669918N234442P850242J2677774
22577D4710432K2263422L8122918N3636166O1043994O1216937M1446273j231684
22570C21208458l5017334n5288970o5385614n1258514k9245855j5969431r933514
22563E9109226p318446o024604n105255m310155l549070k940738k410327k022730
22555B5427901j673875j396625j100796q26613o15814m52330l86223l92695l93454
22546A8189476m32404m99549n42785o18543o79417o75239o43167n98512n29587
22537A2970273m63815m07610l56135l02787k92736l15133l23240l17521l67781
$$ plain form
22528 9823515 9450218 9105414 8812844 8544930 8314367 8111871 7920938 7707164 7462537
22519 7462537 7184810 6940888 6742776 6527120 6288894 6046518 5860170 5681032 5494597
22510 5494597 5348412 5211085 5048555 4901751 4790819 4689002 4594360 4520590 4452223 4425798
22500 4425798 4403366 4424042 4589159 4823217 5072157 5289998 5338547 5162570 4835420 4399609
22490 4399609 3939667 3584869 3358769 3235666 3116887 3014012 2934349 2864488 2800676 2712057
22480 2712057 2667175 2656603 2637751 2561685 2462349 2366912 2305075 2267124 2204889 2119158 2070690
22469 2070690 2034358 1977641 1938777 1883208 1832207 1780720 1746560 1701134 1671614 1654573 1601246
22458 1601246 1564544 1519431 1477788 1457023 1421884 1384162 1354917 1344346 1331516 1304403 1244182
$$ packed form
22528I823515l73297l44804k92570k67914k30563k02496j90933k13774k44627
22519G462537k77727k43922j98112k15656k38226k42376j86348j79138j86435
22510E494597j46185j37327j62530j46804j10932j01817r4642p3770o8367k6425
22500D425798k2432K0676J65117K34058K48940K17841M8549j75977l27150m35811
22490D399609m59942l54798k26100j23103j18779j02875p9663o9861o3812q8619
22480B712057m4882j0572j8852p6066r9336r5437o1837l7951o2235q5731m8468
22469B070690l6332n6717l8864n5569n1001n1487l4160m5426k9520j7041n3327
22458A601246l6702m5113m1643k0765l5139l7722k9245j0571j2830k7113o0221
$$ plain form
22447 1244182 1187649 1160681 1157536 1175562 1177831 1161031 1133879 1085128 1061868 1055844 1047502 1021980
22435 1021980 1015156 1022156 1002132 969754 941706 879891 848004 838859 824510 804673 789011 783983
22423 783983 751393 721799 726336 741063 748055 702783 707728 718878 698040 711557 694882 668515
22411 668515 649570 638384 648853 635420 602359 590707 577846 559351 523355 493974 459663
22400 459663 441551 433922 414629 399009 394267 378672 345633 331752 330707 317447 270331 232803
22388 232803 189205 182057 204094 238399 253464 284059 285503 257399 240466 221955 180160 138464
22376 138464 118514 144865 158377 177793 165065 165311 154907 143777 131135 119183 141147 163215
22364 163215 150121 138901 118894 109640 109288 118248 123178 139490 112978 92043 83963 94104 83130
$$ packed form
22447A244182n6533k6968l145J8026K269j6800k7152m8751k3260o024q342k5522
22435A021980o824P000k0024l2378k8048o1815l1887r145j4349j9837j5662n028
22423G83983l2590k9594M537J4727O992m5272M945J1150k0838J3517j6675k6367
22411F68515j8945j1186J0469j3433l3061j1652j2861j8495l5996k9381l4311
22400D59663j8112p629j9293j5620m742j5595l3039j3881j045j3260m7116l7528
22388B32803m3598p148K2037L4305J5065L0595J444k8104j6933j8511m1795m1696
22376A38464j9950K6351J3512J9416j2728K46j0404j1130j2642j1952K1964K2068
22364A63215j3094j1220k0007r254l52Q960M930J6312k6512k0935q080J0141j0974
$$ plain form
22351 83130 72537 77371 92543 108173 102762 99907 80562 72272 80317 99357 99283 92780 85972 99482
22337 99482 90031 88869 113701 103716 63010 56277 85814 96752 89801 85826 100083 114225 121540
22324 121540 105414 100831 86903 77811 76589 88651 133071 128924 72296 54677 89010 114580
22312 114580 112520 98068 104034 117523 124790 159233 208747 279459 341292 389356 377296 325212
22300 325212 245359 212090 192642 177556 162199 123223 104562 61625 28935 25030 3117 10222
22288 10222 40561 32927 45310 53185 40971 23015 12116 15960 26800 39882 38561 37651 32039
22275 32039 25699 8777 5833 17706 47061 49758 63559 66022 62015 42723 51185 76135 91920
22262 91920 85345 74574 64335 33361 32325 9328 649 42131 31543 -6389 -29784 -46322
$$ packed form
22351H3130j0593M834J5172J5630n411k855j9345q290Q045J9040p4o503o808J3510
22337I9482r451j162K4832r985m0706o733K9537J0938o951l975J4257J4142P315
22324A21540j6126m583j3928r092j222J2062M4420m147n6628j7619L4333K5570
22312A14580k060j4452N966J3489P267L4443M9514P0712O1833M8064j2060n2084
22300C25212p9853l3269j9448j5086j5357l8976j8661m2937l2690l905k1913P105
22288A0222L0339p634J2383P875j2214j7956j0899L844J0840J3082j321r10n612
22275C2039o340j6922k944J1873K9355K697J3801K463m007j9292Q462K4950J5785
22262I1920o575j0771j0239l0974j036k2997q679M1482j0588l7932k3395j6538
$$ plain form
22250 -46322 -42217 -42375 -28658 -9381 15445 25443 -11528 -29839 -41243 -22114 -4057 -29954
22238 -29954 -12612 1478 -7776 -28830 -37518 -7146 -13270 -31599 -52946 -32947 11439 28663
22226 28663 39150 32375 -332 -8298 -7736 -27607 -21932 -4272 -17636 -26075 -19342 -24048 -50764
22213 -50764 -44672 -14411 -20000 -32793 -20865 4891 14022 -941 1012 -10356 -28855 -42118
22201 -42118 -27620 -646 -9018 12132 21964 -21895 -4049 13978 -6382 -24017 -20534 17301
22189 17301 29615 22669 11642 7576 -9218 -15919 -26902 -28340 -39860 -44346 -60716 -57303 -51741
22176 -51741 -43426 -51064 -34994 -29297 -33001 -13717 4664 22377 26103 15829 22651 49094 32485
22163 32485 -13382 4907 51416 57794 34737 12903 -11324 -5153 3812 14299 13357 17327 6699
$$ packed form
22250d6322M105j58J3717J9277K4826R998l6971j8311j1404J9129J8057k5897
22238b9954J7342J4090r254k1054q688L0372o124j8329k1347J9999M4386J7224
22226B8663J0487o775l2707p966N62j9871N675J7660j3364q439O733m706k6716
22213e0764O092L0261n589j2793J1928K5756R131j4963J953j1368j8499j3263
22201d2118J4498K6974q372K1150R832m3859J7846J8027k0360j7635L483L7835
22189A7301J2314o946j1027m066j6794o701j0983j438j1520m486j6370L413N562
22176e1741Q315p638J6070N697l704J9284J8381J7713L726j0274O822K6443j6609
22163C2485m5867J8289M6509O378k3057k1834k4227O171Q965J0487r42L970j0628
$$ plain form
22150 6699 -11845 -20255 -46601 -74845 -62392 -46283 -33796 -46986 -52444 -43772 -20958 -11081 -3657
22137 -3657 -6309 -26740 -40374 -44107 -31200 -38434 -28689 -26963 -42591 -28407 -48033 -40959 -20287
22124 -20287 -18851 -13701 -5792 -53525 -55583 -59131 -41254 -44966 -26784 -3419 10267 383 -7970
22111 -7970 11231 16610 -11225 -24653 5577 11441 16682 23007 20668 15108 4891 13020 19664
22098 19664 -868 -45510 -66869 -71079 -38148 -9290 -11971 -8632 15125 33182 15540 24919
22086 24919 13198 -14728 687 1284 -10870 -17810 -11600 -10430 -17247 -27170 -14329 -26750 -37158
22073 -37158 -45022 -31323 -20654 -46219 -58481 -76490 -63077 -61300 -44741 -33770 -30423 -29105
22061 -29105 -23841 -40361 -40665 -58760 -46329 -16751 -22865 -28592 -41616 -24733 -6362 -9219 -17306
$$ packed form
22150F699j8544q410k6346k8244J2453J6109J2487j3190n458Q672K2814R877P424
22137c657k652k0431j3634l733J2907p234R745J726j5628J4184j9626P074K0672
22124b0287J436N150P909m7733k058l548J7877l712J8182K3365J3686r884q353
22111g970J9201N379k7835j3428L0230N864N241O325k339n560j0217Q129O644
22098A9664k0532m4642k1359m210L2931K8858k681L339K3757J8057j7642R379
22086B4919j1721k7926J5415N97j2154o940O210J170o817r923J2841j2421j0408
22073c7158p864J3699J0669k5565j2262j8009J3413J777J6559J0971L347J318
22061b9105N264j6520l04j8095J2431K9578o114n727j3024J6883J8371k857q087
$$ plain form
22048 -17306 -32291 -36514 -33684 -11832 -2694 -26142 -18988 -17308 -18118 -26251 -16166 -6996 -8336 22495
22034 22495 44029 55529 18148 5542 5295 46160 49504 42114 58936 59763 53121 68876 90754
22021 90754 118077 172613 217027 286711 410848 589788 844343 1130571 1422713 1615750
22011 1615750 1617250 1454311 1188301 906641 669169 491556 394499 345206 296049 247512
22001 247512 216434 202137 191355 139948 118089 122065 114282 98175 112787 95683 93118 82059
21989 82059 92463 89663 89063 64655 53694 48765 81484 49779 64453 85820 90686 58170 37380
21976 37380 37617 41670 52670 66814 42917 21733 9347 9981 22681 35779 30376 16815 2585
21963 2585 30545 33407 28517 41348 36459 28072 28867 18602 -6454 -8299 -10240 -33356 -24854 -2563
$$ packed form
22048a7306j4985m223K830K1852R138k3448P154J680q10q133J0085R170j340L0831
22034B2495K1534J1500l7381j2606k47M0865L344p390J6822Q27o642J5755K1878
22021I0754K7323N4536M4414O9684J24137J78940K54555K86228K92142J93037
22011A615750J500j62939k66010k81660k37472j77613r7057m9293m9157m8537
22001B47512l1078j4297j0782n1407k1859L976p783j6107J4612j7104k565j1059
21989H2059J0404k800o00k4408j0961m929L2719l1705J4674K1367M866l2516k0790
21976C7380K37M053J1000J4144k3897k1184j2386O34J2700J3098n403j3561j4230
21963B585K7960K862m890J2831m889q387P95j0265k5056j845j941k3116Q502K2291
$$ plain form
21949 -2563 16029 10604 15387 -5134 -24998 -26524 -32790 -34777 -39414 -33988 -7947 -1671 -12052
21936 -12052 -31168 -37427 -47275 -29052 3668 18954 8603 24352 26301 17561 20569 -373 -3849
21923 -3849 -4228 -14638 -33656 -34697 -17260 -549 -19394 -43722 -36682 -40434 -40348 -58825 -73898
21910 -73898 -55679 -50717 -28246 -24603 -26129 -31568 -47888 -37490 -45897 -53391 -52989 -73909 -77822
21897 -77822 -57541 -19882 -13522 -46215 -55880 -24616 -9819 4449 14661 12506 7243 -11183
21885 -11183 -17493 -4183 9625 7949 23287 6686 -18394 -12280 4893 8673 -21582 -28373 -38970
21872 -38970 -29409 -6690 -32789 -63086 -56737 -23723 -34048 -29868 -14887 -13884 -36261 -26978 -16563
21859 -16563 -1236 -15980 -10759 -7429 4098 7445 -5012 -14866 11376 -7072 -31069 -22801 -4986
$$ packed form
21949b563J8592n425M783k0521j9864j526o266j987m637N426K6041O276j0381
21936a2052j9116o259r848J8223L2720J5286j0351J5749J949q740L008k0942l476
21923c849l79j0410j9018j041J7437J6711j8845k4328P040l752Q6j8477j5073
21910g3898J8219M962K2471L643j526n439j6320J0398q407p494M02k0920l913
21897g7822K0281L7659O360l2693r665L1264J4797J4268J0212k155n263j8426
21885a1183o310J3310J3808j676J5338j6601k5080O114J7173L780l0255o791j0597
21872c8970R561K2719k6099l0297O349L3014j0325M180J4981J003k2377R283J0415
21859a6563J5327j4744N221L330J1527L347j2457r854K6242j8448k3997Q268J7815
$$ plain form
21846 -4986 18335 46448 53043 50637 29977 46727 63124 29960 -10629 -27476 -24131 -48578
21834 -48578 -95109 -80455 -57753 -42315 -47872 -56300 -28679 -155 -21412 -39690 -907 183
21822 183 -9013 -27015 -8740 20254 25527 1686 -11660 -19574 5389 -14514 -34491 -28500 2669
21809 2669 3466 -20579 -56794 -58901 -44280 -22904 -22283 -42309 -40754 -29870 -27841 -18304 -30226
21796 -30226 -21374 3589 -8015 -20122 -8005 14430 -6231 -50965 -60028 -44396 -57893 -60346
21784 -60346 -51763 -49545 -39078 -68297 -67157 -33005 -4862 15672 8725 -2652 -13778 -7918 -26359
21771 -26359 -22204 -14 15823 9823 11971 -17639 -45425 -30391 -30529 -31634 -24192 -25312 -31287
21758 -31287 -26722 -36216 -35788 -34442 -37749 -46898 -82784 -79180 -55827 -43094 -38113 -57232 -63550 -59008
$$ packed form
21846d986K3321K8113O595k406k0660J6750J6397l3164m0589j6847L345k4447
21834d8578m6531J4654K2702J5438n557q428K7621K8524k1257j8278L8783J090
21822A83r196j8002J8275K8994N273k3841j3346p914K4963j9903j9977N991L1169
21809B669P97k4045l6215k107J4621K1376O21k0026J555J0884K029R537j1922
21796c0226Q852K4963j1604j2107J2117K2435k0661m4734r063J5632j3497k453
21784f0346Q583K218J0467k9219J140L4152K8143K0534o947j1377j1126N860j8441
21771b6359M155K2190J5837o000K148k9610k7786J5034j38j105P442j120n975
21758c1287M565r494M28J346l307r149l5886L604K3353J2733M981j9119o318M542
$$ plain form
21744 -59008 -32507 -48159 -55600 -66045 -65378 -51566 -32273 -64567 -89610 -88135 -91752 -90192 -112535
21731 -112535 -79304 -36624 -28388 -30969 -43030 -34805 -53690 -59529 -38110 -11923 -18698 -41397
21719 -41397 -55926 -49741 -29519 -28835 -28739 -40331 -44468 -64429 -56412 -39481 -23002 -22525 -26383 -16784
21705 -16784 756 -24008 -31235 -14176 2959 1061 -15740 -26853 -10026 7483 15167 -1119
21693 -1119 -13638 -6470 3710 -4798 -37164 -41395 -62145 -58586 -31087 -46235 -58236 -60974 -45908
21680 -45908 -38710 -31650 -22389 -14814 -515 -14563 -44208 -41457 -14704 -23173 -58086 -55682 -56867
21667 -56867 -69272 -69650 -59564 -46873 -38768 -40208 -40243 -51539 -54203 -33875 -31469 -50370 -52571 -21117
21653 -21117 5449 2734 -16875 -41081 -49127 -74068 -62481 -34406 -40663 -56872 -45010 -45621 -30534
$$ packed form
21744e9008K6501j5652p441j0445O67J3812J9293l2294k5043J475l617J560k2343
21731a12535L3231M2680Q236k581j2061Q225j8885n839K1419K6187o775k2699
21719d1397j4529O185K0222O84R6j1592m137j9961Q017J6931J6479M77l858R599
21705a6784J7540k4764p227J7059J7135j898j6801j1113J6827J7509P684j6286
21693a119j2519P168J0180q508l2366m231k0750L559K7499j5148j2001k738J5066
21680d5908P198P060R261P575J4299j4048k9645K751K6753q469l4913K404j185
21667e6867j2405l78J0086J2691Q105j440l5j1296k664K0328K406j8901k201L1454
21653b1117K6566k715j9609k4206q046k4941J1587K8075o257j6209J1862o11J5087
$$ plain form
21640 -30534 -40765 -41937 -48298 -72607 -47278 -22318 -34857 -36382 -19094 -26753 -40957 -45603 -33318
21627 -33318 -7144 -12604 -19208 -22136 18110 8394 3183 -25352 -53374 -48968 -46330 -65986 -82078
21614 -82078 -47504 -12788 -21559 -24838 -46435 -64573 -40494 -10307 1577 29981 29205 11094
21602 11094 -4735 7863 2790 -3428 -8401 -12207 -6733 -16900 -17524 -28206 -42386 -38995 -28093
21589 -28093 -29226 -38867 -23993 -35959 -61782 -57962 -30499 -25613 -6189 -10088 -16980 -15035 -9766
21576 -9766 -18252 -23451 -43779 -49247 -29807 -16884 -36415 -48786 -30718 2654 -3569 12849 14064
21563 14064 -30917 -39931 -42753 -41998 -44253 -48141 -33696 -11060 -5520 -8232 4777 15412 -9784
21550 -9784 -33616 -24244 -13517 -19194 -31382 -46507 -47417 -50053 -33039 -9655 -4952 -7187 -28177
$$ packed form
21640c0534j0231j172o361k4309K5329K4960j2539j525J7288p659j4204m646J2285
21627c3318K6174n460o604k928M0246r716n211k8535k8022M406K638j9656j6092
21614h2078L4574L4716q771l279k1597j8138K4079L0187J1884K8404p76j8111
21602A1094j5829J2598n073o218m973l806N474j0167o24j0682j4180L391J0902
21589b8093j133r641J4874j1966k5823L820K7463M886J9424l899o892J945N269
21576i766q486n199k0328n468J9440J2923j9531j2371J8068L3372o223J6418J215
21563A4064m4981r014k822P55k255l888J4445K2636N540k712J3009J0635k5196
21550i784k3832R372J0727n677j2188j5125r10k636J7014K3384M703k235k0990
$$ plain form
21537 -28177 -46054 -29847 -12132 -27657 -43857 -46330 -28784 -3744 -19500 -10245 7855 -5346
21525 -5346 -26245 -64789 -53981 -31032 -15830 -35326 -22442 -29084 -27268 -10473 5825 -2514
21513 -2514 -18265 -7055 -18350 -28176 -22540 16199 5979 -3361 843 -1690 8171 5385 -23314
21500 -23314 -23854 -57 30032 27447 376 -16450 -19651 -30164 -29133 -11094 -23532 -24400 -24025
21487 -24025 -17780 -34041 -46051 -55448 -58007 -57691 -38092 -31536 -12398 18832 11433 -11419 -5823
21474 -5823 21922 10045 -9479 -4018 -11394 -8595 -10412 -15778 -11493 9829 12002 6798 -6266
21461 -6266 18572 12235 20608 11163 -2245 18697 61854 99053 158831 212770 260712 269170 224345
21448 224345 145875 96318 49176 20293 33826 58334 61861 52275 35849 11196 10884 14262
$$ packed form
21537b8177j7877J6207J7715j5525j6200k473J7546K5040j5756R255J8100j3201
21525e346k0899l8544J0808K2949J5202j9496J2884o642J816J6795J6298q339
21513b514j5751J1210j1295r826N636L8739j0220r340M204k533R861k786k8699
21500b3314n40K3797L0089k585k7071j6826l201j0513J031J8039j2438q68L75
21487b4025O245j6261j2010r397k559L16J9599O556J9138L1230p399k2852N596
21474e823K7745j1877j9524N461p376K799j817n366M285K1322K173n204j3064
21461f266K4838o337Q373r445j3408K0942M3157L7199N9778N3939M7942Q458m4825
21448B24345p8470m9557m7142k8883J3533K4508L527r586j6426k4653l12L378
$$ plain form
21436 14262 3473 -7749 3073 -1590 -6712 21824 30136 46608 47897 30757 12469 3167 7622
21423 7622 9065 -14048 -40161 -40390 -17659 -11051 -11592 6132 9323 1390 -1269 2835 3159 18384
21409 18384 -6940 -48666 -23885 -9756 457 6532 -19753 3557 11145 -3044 3445 -1647
21397 -1647 -13327 -35108 -55618 -34853 -29701 -36895 -31578 -19306 1221 13290 2252 -16431
21385 -16431 -30398 -35735 -13822 -13396 -24633 -23267 -6943 -8642 -11795 -1724 14696 35184 34325
21372 34325 16648 -22185 -52274 -55232 -52874 -57634 -55429 -49971 -46003 -35045 -17586 -9690 -8435
21359 -8435 -24293 -23828 -36663 -47701 -37849 -11263 -1606 1271 -13700 -29550 -30532 -8205 -9131 811
21345 811 -6436 -19064 -30520 -17587 -18531 5721 43537 38832 -8315 -2758 28649 28338 33721 29190
$$ packed form
21436A4262j0789j1222J0822m663n122K8536Q312J6472J289j7140j8288r302M455
21423G622J443k3113k6113k29K2731O608n41J7724L191p933k659M104L24J5225
21409A8384k5324m1726K4781J4129J0213O075k6285K3310P588j4189O489n092
21397a647j1680k1781k0510K0765N152p194N317J2272K0527J2069j1038j8683
21385a6431j3967n337K1913M26j1237J366J6324j699l153J0071J6420K0488q59
21372C4325j7677l8833l0089k958K358m760K205N458L968J0958J7459P896J255
21359h435j5858M65j2835j1038R852K6586R657K877j4971j5850r82K2327r26R942
21345H11p247j2628j1456J2933r44K4252L7816m705m7147N557L1407l11N383m531
$$ plain form
21331 29190 25844 23165 -8039 -12070 16049 30880 35688 54762 80228 45621 30853 16952
21319 16952 25842 12987 -18250 -30965 4501 21468 -7112 -29767 -36389 -38007 -43684 -31725
21307 -31725 -33115 -16074 21664 40038 33489 3757 -26488 -26732 -22402 -17528 -14810 -14056 -1091
21294 -1091 -2944 -16805 -18869 -14604 -22451 -22075 -17402 -25571 -27312 -37981 -42662 -51406 -37786 -30295
21280 -30295 -39277 -13166 1479 15979 -19861 -59915 -81733 -91801 -68788 -41317 -30903 -34485
21268 -34485 -24900 -16219 -11640 4809 10878 7669 12930 35057 29001 6743 -18044 -28459 -15852
21255 -15852 1347 4900 6726 19321 11612 33358 32004 10653 -28354 -35454 -37031 -58031 -70614
21242 -70614 -44773 -20347 -21462 -28196 -31127 -34710 -34947 -19534 -2989 -11143 -32068 -44510 -38860
$$ packed form
21331B9190l346k679l1204m031K8119J4831M808J9074K5466l4607j4768j3901
21319A6952Q890j2855l1237j2715L5466J6967k8580k2655o622j618n677J1959
21307c1725j390J7041L7738J8374o549k9732l0245k44M330M874K718P54J2965
21294a091j853j3861k064M265p847L76M673q169j741j0669m681q744J3620P491
21280c0295q982K6111J4645J4500l5840m0054k1818j0068K3013K7471J0414l582
21268c4485R585Q681M579J6449O069l209N261K2127o056k2258k4787j0415J2607
21255a5852J7199L553J826J2595p709K1746j354k1351l9007p100j577k1000j2583
21242g0614K5841K4426j115o734k931l583k37J5413J6545q154k0925j2442N650
$$ plain form
21229 -38860 -36321 -39078 -1907 8552 -12512 -41697 -48958 -20790 -32003 -32466 -38754 -32976 -2059
21216 -2059 -6165 -21554 -22657 -29335 -17014 22108 60541 42671 29931 41175 38603 32934 22501
21203 22501 21481 13774 -4018 -10360 -7847 -13007 -35462 -31112 -16846 -36913 -65300 -68084 -79610
21190 -79610 -60473 -57423 -48648 -45180 -30992 -48170 -20583 1708 10329 4021 -15673 -35289 -42783
21177 -42783 -64961 -75805 -47799 -24993 -32047 -35949 -42114 -68242 -65253 -56449 -50839 -62340 -53158
21164 -53158 -46273 -36232 -37672 -66921 -73760 -52101 -30289 -41689 -25511 -2642 4234 6359 5651
21151 5651 14475 29077 14354 24638 27972 17823 -2034 -48105 -61992 -69593 -54306 -47883 -42791
21138 -42791 -42708 -34905 -13087 1488 7528 -5300 -46054 -36940 2039 36511 5842 1583 12198
$$ packed form
21229c8860K539k757L7171J0459k1064k9185p261K8168j1213m63o288N778L0917
21216b059m106j5389j103o678J2321L9122L8433j7870j2740J1244k572n669j0433
21203B2501j020p707j7792o342K513n160k2455M350J4266k0067k8387k784j1526
21190g9610J9137L050Q775L468J4188j7178K7587K2291Q621o308j9694j9616p494
21177d2783k2178j0844K8006K2806p054l902o165k6128K989Q804N610j1501R182
21164e3158O885J0041j440k9249o839K1659K1812j1400J6178K2869O876K125p08
21151E651Q824J4602j4723J0284L334j0149j9857m6071j3887p601J5287O423N092
21138d2791Q3P803K1818J4575O040j2828m0754R114L8979L4472l0669m259J0615
$$ plain form
21125 12198 -6082 -20204 -17027 1235 29644 30104 15796 24362 45920 38680 18990 8140 -9704
21112 -9704 -2910 -17068 -6070 -10023 -5490 15858 4351 19267 5869 6635 -5462 -8901 -19915
21099 -19915 -32308 -33591 -27043 -8627 -6078 746 31074 43094 36697 15618 -13399 -16630 13300
21086 13300 47344 58169 49984 54318 65984 59300 49665 78977 71056 49062 33059 36694 31517
21073 31517 23532 34364 49226 48691 4189 -6963 -11042 11103 13677 5007 5756 13129 -4241
21060 -4241 -14818 -15766 -29897 -9894 18809 47564 40392 56131 63857 61931 60399 45417 41955
21047 41955 42014 54425 46283 32261 18692 18969 20527 40334 14437 -21021 -29329 -14674 -4757
21034 -4757 -7526 -9080 -26543 -15319 -18671 1227 9063 -19997 6754 30378 19917 12306 28192
$$ packed form
21125A2198j8280j4122L177J8262K8409M60j4308Q566K1558p240j9690j0850j7844
21112i704O794j4158J0998l953M533K1348j1507J4916j3398P66j2097l439j1014
21099a9915j2393j283O548J8416K549O824L0328J2020o397k1079k9017l231K9930
21086A3300L4044J0825q185M334J1666o684r635K9312p921k1994j6003L635n177
21073C1517p985J0832J4862n35m4502j1152m079K2145K574q670P49P373j7370
21060d241j0577r48j4131K0003K8703K8755p172J5739P726j926j532j4982l462
21047D1955N9J2411q142j4022j3569K77J558J9807k5897l5458q308J4655R917
21034d757k769j554j7463J1224l352J9898P836k9060K6751K3624j0461p611J5886
$$ plain form
21021 28192 15602 14914 14759 12570 12617 8559 -6678 -14167 3647 16156 8143 -2560 -31611 -14504
21007 -14504 36814 45842 43287 46983 31873 19091 2434 19341 26128 4645 -8919 16231
20995 16231 29626 27506 30334 16464 -7193 5892 25507 30487 59797 60236 37726 28571 49048
20982 49048 67495 39470 38507 50449 23467 11677 37485 53043 56542 19032 20450 30156 47321
20969 47321 39426 31834 36138 54259 58040 56876 62788 79897 68152 77465 104189 108541 116031
20956 116031 122863 139449 164327 210915 237882 279855 370697 494107 637512 819811 976453
20945 976453 1059477 1051793 927975 763983 649069 614736 615352 622772 625850 572599 492199 426489
20933 426489 382841 400916 418827 445449 458889 421763 374092 359151 329919 357249 366675 377759
$$ packed form
21021B8192j2590o88j55k189M7m058j5237p489J7814J2509q013j0703k9051J7107
21007a4504N1318R028k555L696j5110j2782j6657J6907O787k1483j3564K5150
20995A6231J3395k120K828j3870k3657J3085J9615M980K9310M39k2510r155K0477
20982D9048J8447k8025r63J1942k6982j1790K5808J5558L499l7510J418R706J7165
20969D7321p895p592M304J8121L781j164N912J7109j1745R313K6724M352P490
20956A16031O832J6586K4878M6588K6967M1973R0842J23410J43405J82299J56642
20945I76453Q3024p684j23818j63992j14914l4333O16P420L078n3251q0400o5710
20933D26489m3648J8075J7911K6622J3440l7126m7671j4941k9232K7330R426J1084
$$ plain form
20921 377759 409343 443224 450931 495256 560356 609913 644269 652226 658349 640161 656328 785786
20909 785786 931071 1075198 1197768 1221824 1088645 872428 686850 587996 510610 414747
20899 414747 383345 394180 398943 372546 329640 291236 265558 231306 222434 213642 196295 209251
20887 209251 212758 169255 169593 186117 212198 233153 233973 200890 179395 165955 166178 145927 125092
20874 125092 130173 127784 100266 69502 44755 55791 80360 75200 88827 109387 73312 60226
20862 60226 74594 101627 96554 72061 38791 25557 44160 62520 45168 55873 67114 73338
20850 73338 81358 55857 55866 72768 69923 68459 35251 50200 60967 60590 68540 68069 67642 47645
20836 47645 44674 40916 47292 28156 5849 25429 39735 59771 73818 54881 38622 25287
$$ packed form
20921C77759L1584L3881P707M4325O5100M9557L4356P957O123j8188J6167J29458
20909G85786J45285J44127J22570K4056j33179k16217j85578r8854p7386r5863
20899D14747l1402J0835M763k6397m2906l8404k5678l4252q872q792j7347J2956
20887B09251L507m3503L38J6524K6081K0955Q20l3083k1495j3440K23k0251k0835
20874A25092N081k389k7518l0764k4747J1036K4569n160J3627K0560l6075j3086
20862F0226J4368K7033n073k4493l3270j3234J8603J8360j7352J0705J1241O224
20850G3338Q020k5501RJ6902k845j464l3208J4949J0767l77P950m71m27j9997
20836D7645k971l758O376j9136k2307J9580J4306K0036J4047j8937j6259j3335
$$ plain form
20824 25287 18878 21250 23589 35518 30840 46648 55178 46906 37784 33525 18727 19193 28358 -3185
20810 -3185 -19249 26354 58559 74840 93626 97424 56752 40400 36848 45938 40433 23000 25193
20797 25193 31332 15889 13810 39831 65916 56311 25081 7706 -5881 -3951 7162 35530
20785 35530 53431 53922 24749 16587 37195 65257 44569 42519 55045 61983 86187 93609 76743
20772 76743 67601 89496 108703 91435 74110 78774 96998 85479 61836 47960 19985 18684
20760 18684 28028 24170 18031 26698 21300 24687 39881 17566 -2393 -11160 4021 13110 7345
20747 7345 14114 44004 42600 19170 14989 10374 5842 35395 74611 64065 57858 51512 41371
20734 41371 51592 82301 82826 95575 126207 137362 152224 143536 95834 26392 4104 -1997
$$ packed form
20824B5287o409K372K339J1929m678J5808Q530q272r122m259j4798M66R165l1543
20810c185j6064M5603L2205J6281J8786L798m0672j6352l552R090n505j7433K193
20797B5193O139j5443k079K6021K6085r605l1230j7375j3587J930J1113K8368
20785C5530J7901M91k9173q162K0608K8062k0688k050J2526O938K4204P422j6866
20772G6743r142K1895J9207j7268j7325M664J8224j1519k3643j3876k7975j301
20760A8684R344l858o139Q667n398L387J5194k2315j9959q767J5181R089n765
20747G345O769K9890j404k3430m181m615m532K9553L9216j0546o207o346j0141
20734D1371J0221L0709N25J2749L0632J1155J4862q688m7702o9442k2288o101
$$ plain form
20722 -1997 -2931 -3262 26729 30658 26274 31967 36162 49462 51977 47037 39380 56730 33210 13503
20708 13503 20287 27950 44353 41216 48614 53535 54031 62947 52726 65716 58517 24493 45420
20695 45420 36771 36430 28010 36539 13729 21312 56744 26572 34535 53112 51101 41465 19233
20682 19233 821 19479 33101 46595 60100 51891 60514 62285 57843 72294 74906 82010 109364
20669 109364 84756 74305 69958 46953 47077 74076 77095 75072 68326 65394 59636 35131 6434
20656 6434 5326 31066 45489 48391 48228 42030 44045 57833 95937 113874 79371 72763 71529
20643 71529 71921 74491 65334 91849 118853 126818 138115 159018 164424 153924 126310 102879 112082
20630 112082 144550 155680 169734 183718 184826 188100 174169 144740 124145 140311 136615 101850
$$ packed form
20722a997r34l31K9991L929m384N693M195J3300K515m940p657J7350k3520j9707
20708A3503O784P663J6403l137P398M921M96Q916j0221J2990p199l4024K0927
20695D5420q649l41q420Q529k2810P583L5432l0172P963J8577k011r636k2232
20682A9233j8412J8658J3622J3494J3505q209Q623J771m442J4451K612P104K7354
20669A09364k4608j0451m347k3005J24K6999L019k023o746k932n758k4505k8697
20656F434j108K5740J4423K902j63o198K015J3788L8104J7937l4503o608j234
20643G1529L92K570r157K6515K7004P965J1297K0903N406j0500k7614k3431R203
20630A12082L2468J1130J4054J3984J108L274j3931k9429k0595J6166l696l4765
$$ plain form
20618 101850 90973 97789 113231 132061 135852 117201 128927 142462 172009 186587 189201 172730
20606 172730 153276 143990 161924 180067 160302 170193 205876 232911 235234 203049 191465 189456
20594 189456 176493 151741 168052 174074 160801 133129 92475 83745 92216 82551 100402 112206
20582 112206 129714 144682 152957 151315 119186 81334 59421 91514 93132 72493 90417 121092
20570 121092 151653 179275 155700 118373 105625 100878 102273 110845 109973 128981 144680 168970
20558 168970 204962 212790 163977 157469 161065 147662 162478 176885 187951 182810 142891 134709
20546 134709 145423 138341 129336 154863 177926 181615 167962 183908 175647 190234 188383 170815
20534 170815 140611 133314 134343 172032 205411 212504 220649 214031 198826 183294 202097 204096 208800
$$ packed form
20618A01850j0877O816J5442J8830L791j8651J1726J3535K9547J4578K614j6471
20606A72730j9454r286J7934J8143j9765R891L5683K7035K323l2185j1584k009
20594A89456j2963k4752J6311O022j3273k7672m0654q730Q471r665J7851J1804
20582A12206J7508J4968Q275j642l2129l7852k1913L2093J618k0639J7924L0675
20570A21092L0561K7622k3575l7327j2748m747J395Q572q72J9008J5699K4290
20558A68970L5992P828m8813o508L596j3403J4816J4407J1066n141l9919q182
20546A34709J0714p082r005K5527K3063L689j3653J5946q261J4587j851j7568
20534A70815l0204p297J029L7689L3379P093Q145o618j5205j5532J8803J999M704
$$ plain form
20521 208800 199778 175120 162127 156850 159123 166372 196324 232721 258111 291944 313608 350383
20509 350383 388250 378164 357793 356953 348319 331862 327135 326995 328156 353311 379421 390470 384964
20496 384964 366842 351098 316706 316751 311243 304924 323502 354852 352689 357243 377335 371796 384048
20483 384048 410208 423790 421269 455588 458457 449663 420845 408896 446520 517401 558880 575879
20471 575879 615037 672391 701888 705911 653668 596198 561370 576011 581588 586662 621356 636909
20459 636909 640388 663010 661388 666848 675138 698446 717786 732684 742641 780946 812463 850826
20447 850826 889128 925765 946834 978472 993972 985503 1000313 1016065 1041051 1061521 1102610 1152967
20435 1152967 1208971 1338280 1472443 1584993 1643167 1678095 1683524 1637245 1579478 1577251 1629008
$$ packed form
20521B08800r022k4658j2993n277K273P249K9952L6397K5390L3833K1664L6775
20509C50383L7867j0086k0371q40q634j6457m727j40J161K5155K6110J1049n506
20496C84964j8122j5744l4392M5n508o319J8578L1350k163M554K0092n539J2252
20483C84048K6160J3582k521L4319K869q794k8818j1949L7624P0881M1479J6999
20471E75879L9158N7354K9497M023n2243n7470l4828J4641N577N074L4694J5553
20459F36909L479K2622j622N460Q290K3308J9340J4898R957L8305L1517L8363
20447H50826L8302L6637K1069L1638J5500q469J4810J5752K4986K0470M1089N0357
20435A152967N6004J29309J34163J12550N8174L4928N429m6279n7767k227N1757
$$ plain form
20424 1629008 1724605 1882373 2108283 2387957 2725687 3051941 3290019 3401492 3388703 3323557
20414 3323557 3387123 3528216 3749372 4010136 4313648 4692199 5029087 5359225 5804291 6359279
20404 6359279 6959886 7503420 7819964 7849162 7845143 8035033 8473155 9192303 10257725 11671932
20394 11671932 13436283 15680843 18716913 22955643 29149981 38652661 53453633 75195713
20386 75195713 104516296 139993268 172337399 190998996 194616784 178413608 143629842
20379 143629842 111420873 93096116 86731263 89885613 101137698 116531073 129545720
20372 129545720 136616296 133707578 116316229 92285148 73269899 61330379 54297891
20365 54297891 50253009 48162834 47378081 47756471 49631697 53694695 61437349 74837594
$$ packed form
20424A629008R5597J57768K25910K79674L37730L26254K38078J11473j2789o5146
20414C323557O3566J41093K21156K60764L03512L78551L36888L30138M45066N54988
20404F359279O00607N43534L16544K9198m019J89890M38122P19148J065422J414207
20394A1671932J764351K244560L036070M238730O194338R502680J4800972K1742080
20386G5195713K9320583L5476972L2344131J8661597L617788j6203176l4783766
20379A43629842l2208969j8324757o364853L154350J1252085J5393375J3014647
20372A29545720P070576k908718j7391349k4031081j9015249j1939520p032488
20365E4297891m044882k090175p84753L78390J875226M062998P742654J3400245
$$ plain form
20357 74837594 94082549 114502435 130601995 139796853 136416550 119713863 102425354
20350 102425354 93927253 95451528 107727292 132080996 164715171 195455600 218741402
20343 218741402 226306412 206028580 168717858 133504797 104969533 84455775 70946664
20336 70946664 61903780 55473215 50539696 46493342 43023721 40042447 37477589 35302185
20328 35302185 33472551 31899998 30592935 29553703 28730935 28079454 27492175 26823808 26131706
20319 26131706 25417226 24696290 24000940 23268700 22549707 21807944 21004892 20228244 19615905
20310 19615905 19190416 18813453 18364683 17825562 17140692 16369776 15660990 15014312 14424148
20301 14424148 13858749 13330854 12873458 12466801 12082551 11716535 11378435 11057831 10757327
$$ packed form
20357G4837594J9244955K0419886J6099560R194858l380303j6702687j7288509
20350A02425354q498101J524275J2275764K4353704L2634175L0740429K3285802
20343B18741402P565010k0277832l7310722l5213061k8535264k0513758j3509111
20336G0946664r042884o430565m933519m046354l469621k981274k564858k175404
20328C5302185j829634j572553j307063j039232q22768o51481n87279o68367o92102
20319B6131706p14480p20936o95350p32240p18993p41763q03052p76648o12339
20310A9615905m25489l76963m48770n39121o84870p70916p08786o46678n90164
20301A4424148n65399n27895m57396m06657l84250l66016l38100l20604l00504
$$ plain form
20292 10757327 10499907 10241138 9934608 9631185 9350232 9096559 8818993 8543849 8319696
20283 8319696 8104595 7908243 7724917 7544439 7365578 7179931 7047906 6918524 6768980
20274 6768980 6614874 6466020 6295479 6123480 5977187 5794312 5636157 5486595 5346340
20265 5346340 5241050 5176785 5093075 4985401 4862795 4713715 4580670 4454074 4364739 4291958
20255 4291958 4209929 4120491 4043408 3981139 3942966 3889133 3813389 3723811 3617178 3565349 3511296
20244 3511296 3423455 3341716 3279749 3195956 3129461 3048981 2961980 2877041 2838721 2775857 2708368
20233 2708368 2644609 2590235 2533355 2473213 2430758 2356117 2302745 2298052 2300300 2277807 2245742 2218038
20221 2218038 2152907 2119871 2042867 1996901 1946615 1873759 1853482 1853868 1826606 1798350 1753963 1725771
$$ packed form
20292A0757327k57420k58769l06530l03423k80953k53673k77566k75144k24153
20283H319696k15101j96352j83326j80478j78861j85647j32025j29382j49544
20274F768980j54106j48854j70541j71999j46293j82875j58155j49562j40255
20265E346340j05290o4265q3710j07674j22606j49080j33045j26596q9335p2781
20255D291958q2029q9438p7083o2269l8173n3833p5744q9578j06633n1829n4053
20244C511296q7841q1739o1967q3793o6495q0480q7001q4939l8320o2864o7489
20233B708368o3759n4374n6880o0142m2455p4641n3372m693K248k2493l2065k7704
20221B218038o5131l3036p7004m5966n0286p2856k0277L86k7262k8256m4387k8192
$$ plain form
20209 1725771 1694532 1659601 1622413 1549325 1497787 1470343 1421514 1407825 1375322 1347298 1339117
20198 1339117 1278624 1222744 1205738 1183254 1169642 1160865 1152350 1132659 1085891 1055368 1008155 991125
20186 991125 972526 975100 968053 968995 997926 965656 904785 847075 819917 800634 772805 733619
20174 733619 715351 717471 743021 746235 715643 695183 640350 618986 593795 582093 555115 535580
20162 535580 545640 529323 505118 484444 472019 485766 502566 507501 506849 509692 535824 504922
20150 504922 458515 434475 401774 392315 388279 375625 363342 375231 381086 385332 382831 368556
20138 368556 335804 325192 350762 337885 339857 356307 376570 362373 334742 342050 347314 323334
20126 323334 290884 292266 317085 323568 320560 305481 291804 288862 285171 262702 258782 254524 279042
$$ packed form
20209A725771l1239l4931l7188p3088n1538k7444m8829j3689l2503k8024q181
20198A339117o0493n5880j7006k2484j3612q777q515j9691m6768l0523m7213j7030
20186I91125j8599K574p047R42K8931l2270o0871n7710k7158j9283k7829l9186
20174G33619j8268K120K5550L214l0592k0460n4833k1364k5191j1702k6978j9535
20162E35580J0060j6317k4205k0674j2425J3747J6800M935o52K843K6132l0902
20150E04922m6407k4040l2701r459m036j2654j2283J1889N855M246k501j4275
20138C68556l2752j0612K5570j2877J972J6450K0263j4197k7631P308N264k3980
20126C23334l2450J382K4819O483l008j5079j3677k942l691k2469l920m258K4518
$$ plain form
20113 279042 287893 297528 310228 313453 327187 308061 272804 261302 265963 244213 224125 230451
20101 230451 226222 242240 269688 256263 263887 273395 230930 227450 233643 241150 230334 242350 287756
20088 287756 280531 251000 219355 225131 247070 262899 265138 264815 245125 243343 249137 282055 267697
20075 267697 240096 250303 271698 275707 276333 288560 293180 296038 279750 266971 243080 256015
20063 256015 241137 227499 242727 270804 285048 288878 285568 275884 239774 198229 208098 235010
20051 235010 233852 186075 204250 230867 245546 261810 220030 194674 174143 183257 213540 228746
20039 228746 236332 247731 284071 278034 242613 225988 214513 220236 243194 253934 265820 261255
20027 261255 263371 260686 230144 214359 192465 160242 122382 144047 162762 145113 138448 134543
$$ packed form
20113B79042Q851R635J2700L225J3734j9126l5257j1502M661k1750k0088O326
20101B30451m229J6018K7448j3425P624R508m2465l480O193P507j0816J2016M5406
20088B87756p225k9531l1645N776K1939J5829K239l23j9690j782N794L2918j4358
20075B67697k7601J0207K1395M009O26J2227M620K858j6288j2779k3891J2935
20063B56015j4878j3638J5228K8077J4244L830l310r684l6110m1545R869K6912
20051B35010j158m7777J8175K6617J4679J6264m1780k5356k0531R114L0283J5206
20039B28746P586J1399L6340o037l5421j6625j1475N723K2958J0740J1886m565
20027B61255K116k685l0542j5785k1894l2223l7860K1665J8715j7649o665l905
$$ plain form
20015 134543 116651 119282 126013 126381 135246 147200 143144 128601 150854 140123 119084 113206 121779
20002 121779 115818 137727 181758 209303 250178 317723 333519 371054 418040 464792 501810 508501
19990 508501 520588 472232 452409 475968 506984 590401 662556 726078 799546 845638 860545
19979 860545 802761 728308 687906 636021 574405 574911 612086 641618 671291 681421 659439 638571
19967 638571 630254 580768 521634 483719 447744 398861 381719 395933 393391 388277 393922 390281
19955 390281 430070 471084 493267 535641 536418 557871 627807 720658 790819 900100 1087664
19944 1087664 1377551 1812661 2374274 3023243 3773196 4534895 5152824 5524323 5601663 5145282
19934 5145282 4271322 3520166 3159967 3200443 3504629 3919263 4176749 4233877 4005735 3391816
$$ packed form
20015A34543j7892K631O731L68Q865J1954m056j4543K2253j0731k1039n878Q573
20002A21779n961K1909M4031K7545M0875O7545J5796L7535M6986M6752L7018O691
19990E08501J2087m8356j9823K3559L1016Q3417P2155O3522P3468M6092J4907
19979H60545n7784p4453m0402n1885o1616N06L7175K9532K9673J0130k1982k0868
19967F38571q317m9486n9134l7915l5975m8883j7142J4214k542n114N645l641
19955C90281L9789M1014K2183M2374P77K1453O9936R2851P0161J09281J87564
19944A087664K89887M35110N61613O48969P49953P61699O17929L71499P7340m56381
19934E145282q73960p51156l60199M0476L04186M14634K57486N7128k28142o13919
$$ plain form
19924 3391816 2713996 2177897 1833255 1648469 1561262 1465255 1407336 1390027 1406533 1462872
19914 1462872 1585373 1783936 2084473 2542146 3128942 3683139 4074790 4221816 4021167
19905 4021167 3597888 3324809 3369062 3784359 4537873 5354535 5980352 6347587 6147413 5367777
19895 5367777 4521685 3838599 3255873 2719863 2298239 1995360 1774308 1610166 1474488
19886 1474488 1375081 1282657 1228546 1155316 1093212 1034466 967922 943614 922200 902345 883735
19875 883735 880661 861275 859332 859001 840891 801570 772526 738981 695774 685050 683468 646071
19863 646071 608376 594800 553944 510811 520253 530142 514862 490566 458900 408425 396022 398108
19851 398108 397249 394954 391882 409349 406501 380569 357432 341005 376075 376369 382629 341420 312246
$$ packed form
19924C391816o77820n36099l44642j84786q7207r6007n7919j7309J6506N6339
19914A462872J22501J98563L00537M57673N86796N54197L91651J47026k00649
19905D021167m23279k73079M4253M15297P53514Q16662O25817L67235k00174p79636
19895E367777q46092o83086n82726n36010m21624l02879k21052j64142j35678
19886A474488r9407r2424n4111p3230o2104n8746o6544k4308k1414j9855j8610
19875H83735l074j9386j943l31j8110l9321k9044l3545m3207j0724j582l7397
19863F46071l7695j3576m0856m3133R442R889j5280k4296l1666n0475j2403K086
19851C98108q59k295l072J7467k848k5932k3137j6427L5070K94O260m1209k9174
$$ plain form
19838 312246 302776 293084 337168 313337 289094 275502 291147 316621 333173 342677 321915 288373
19826 288373 310662 334870 338784 334247 342190 350608 363216 384853 432619 500516 624016 815279
19814 815279 983416 1133200 1233842 1212736 1066009 910020 828909 802180 798747 797883 759475
19803 759475 674596 592363 521232 472667 470702 479035 514105 544167 570929 610209 626689 647329
19791 647329 629491 572439 531654 528724 519526 487820 481865 539944 626010 704765 780185 831564
19779 831564 845151 923079 1048475 1178314 1292948 1361917 1324311 1142513 924504 713617
19769 713617 595689 524950 480101 448293 410142 353437 338052 337107 322549 314052 292307 268652
19757 268652 251111 263576 274667 275673 270453 261683 250138 251080 262370 262255 226234 219548 212496
$$ packed form
19838C12246r470r692M4084k3831k4243j3592J5645K5474J6552R504k0762l3542
19826B88373K2289K4208L914m537P943Q418J2608K1637M7766O7897J23500J91263
19814H15279J68137J49784J00642k1106j46727j55989q1111k6729l433q64l8408
19803G59475q4879q2233p1131m8565j965Q333L5070L0062K6762L9280J6480K0640
19791F47329j7838n7052m0785k930r198l1706n955N8079Q6066P8755P5420N1379
19779H31564J3587P7928J25396J29839J14634O8969l7606j81798k18009k10887
19769G13617j17928p0739m4849l1808l8151n6705j5385r45j4558q497k1745k3655
19757B68652j7541J2465J1091J006n220q770j1545R42J1290j15l6021o686p052
$$ plain form
19744 212496 221367 209999 207610 195480 158049 146965 162206 216737 255183 258379 238832 235739
19732 235739 237975 258392 267675 260297 251697 258617 258116 240016 232909 235298 209041 210113 225604
19719 225604 219204 192138 203732 211349 206953 214489 250901 287767 296632 330704 345260 347882 384323
19706 384323 386822 394705 407688 437249 490909 530888 559133 538038 502697 456603 418038 406909
19694 406909 407471 402304 403101 414719 422438 412475 370953 325124 261926 205299 213823 211870 214997
19681 214997 215801 199966 179357 174890 191728 180387 178360 166551 148909 143353 136884 123762 134708
19668 134708 154393 162790 190093 230932 268388 287464 317573 368527 384604 378577 357876 382097
19656 382097 401984 421233 487319 544334 551823 559819 544867 473975 432435 401908 398095 411759
$$ packed form
19744B12496Q871j1368k389j2130l7431j1084J5241N4531L8446L196j9547l093
19732B35739K236K0417R283p378q600O920n01j8100p107K389k6257J072J5491
19719B25604o400k7066J1594P617m396P536L6412L6866Q865L4072J4556K622L6441
19706C84323K499P883J2983K9561N3660L9979K8245k1095l5341m6094l8565j1129
19694D06909N62n167P97J1618P719r963m1522m5829o3198n6627Q524j953L127
19681B14997Q04j5835k0609m467J6838j1341k027j1809j7642n556o469j3122J0946
19668A34708J9685Q397K7303M0839L7456J9076L0109N0954J6077o027k0701K4221
19656C82097J9887J9249O6086N7015P489P996j4952p0892m1540l0527l813J3664
$$ plain form
19644 411759 443302 460843 459754 415518 374517 309257 276159 244490 187840 212086 227654 232491
19632 232491 213940 234501 283273 329285 368802 380906 435812 471773 445471 422275 409485
19621 409485 406987 418440 452218 491401 524019 548886 560481 590412 609155 597570 554817 514536
19609 514536 492215 520325 574292 591922 618153 617523 553788 477008 412139 376415 359549 348750
19597 348750 347957 339398 335089 320241 329349 333393 325746 316647 314117 307998 296178 302237 320569 321147
19583 321147 329096 351472 362444 385526 464860 525574 573083 596814 601443 604369 579809 562098
19571 562098 573521 640921 701179 747518 797113 828167 864098 855757 838592 796309 741511 702725
19559 702725 704530 744404 791705 786310 752695 695016 663657 655343 604110 562439 531978 554214
$$ packed form
19644D11759L1543J7541j089m4236m1001o5260l3098l1669n6650K4246J5568M837
19632B32491j8551K0561M8772M6012L9517J2104N4906L5961k6302k3196j2790
19621D09485k498J1453L3778L9183L2618K4867J1595K9931J8743j1585m2753m0281
19609E14536k2321K8110N3967J7630K6231o30o3735p6780o4869l5724j6866j0799
19597C48750p93q559m309j4848R108M044p647r099k530o119j1820O059J8332N78
19583C21147P949K2376J0972K3082P9334O0714M7509K3731M629K926k4560j7711
19571E62098J1423O7400O0258M6339M9595L1054L5931q341j7165m2283n4798l8786
19559G02725J805L9874M7301n395l3615n7679l1359q314n1233m1671l0461K2236
$$ plain form
19547 554214 520800 506944 525015 529591 552785 581212 597880 596188 559072 546973 563427 584289
19535 584289 597536 573835 546514 538230 548746 550841 553318 559550 590256 620755 671624 687187
19523 687187 698254 714249 724389 775412 817227 868000 934365 1021142 1156872 1300579 1476178
19512 1476178 1723130 1979713 2283402 2632694 2909334 3163581 3446881 3723481 4003443
19503 4003443 4326946 4799352 5392791 6123768 7034396 8215418 9807512 12094339 15653505
19494 15653505 21486656 30273482 40717400 51261433 61917231 69988985 71960272 70942203
19486 70942203 70313538 67678684 63971346 65880303 75390040 90393566 109039115 125989187
19478 125989187 136172188 140814904 139165638 129237785 114768937 100237176 86990917
$$ packed form
19547E54214l3414j3856J8071M576K3194K8427J6668j692l7116j2099J6454K0862
19535E84289J3247k3701k7321q284J0516K095K477O232L0706L0499N0869J5563
19523F87187J1067J5995J0140N1023M1815N0773O6365Q6777J35730J43707J75599
19512A476178K46952K56583L03689L49292K76640K54247K83300K76600K79962
19503D003443L23503M72406N93439P30977R10628J181022J592094K286827L559166
19494A5653505N833151Q786826J0443918J0544033J0655798Q071754J971287j018069
19486G0942203o28665k634854l707338J908957R509737J5003526J8645549J6950072
19478A25989187J0183001M642716j649266r927853j4468848j4531761j3246259
$$ plain form
19471 86990917 79376355 79935216 84824583 91428154 97824954 98250395 92174060 85555538
19463 85555538 77964723 65665952 52063099 42211151 36120509 32268265 29563047 27489540
19455 27489540 25810346 24365709 23033817 21845005 20769395 19812336 18899099 18103558
19447 18103558 17364649 16641639 15983047 15385006 14823590 14269039 13732660 13201372 12736342
19438 12736342 12317641 11924157 11529534 11130579 10740588 10333228 9956798 9611506 9326424
19429 9326424 9071220 8798220 8523909 8247258 7992334 7791686 7596001 7364508 7117634
19420 7117634 6892378 6680012 6471742 6315313 6149048 6004888 5848534 5688926 5520714
19411 5520714 5350257 5195793 5076917 4960344 4829507 4703793 4571489 4430938 4312347
$$ packed form
19471H6990917p614562N58861M889367O603571O396800M25441o076335o618522
19463H5555538p590815j2298771j3602853r851948o090642l852244k705218k073507
19455B7489540j679194j444637j331892j188812j075610r57059r13237p95541
19447A8103558p38909p23010o58592n98041n61416n54551n36379n31288m65030
19438A2736342m18701l93484l94623l98955l89991m07360l76430l45292k85082
19429I326424k55204k73000k74311k76651k54924k00648j95685k31493k46874
19420G117634k25256k12366k08270j56429j66265j44160j56354j59608j68212
19411E520714j70457j54464j18876j16573j30837j25714j32304j40551j18591
$$ plain form
19402 4312347 4212463 4125043 4042973 3950440 3841558 3758121 3670170 3567100 3469113 3372184 3291728
19391 3291728 3190934 3136512 3079041 3026201 2962677 2910428 2850421 2772852 2714805 2628993 2567224
19380 2567224 2504593 2461779 2443067 2415533 2364277 2284624 2240060 2252906 2230675 2194844 2140296
19369 2140296 2076251 2011984 2014688 1987234 1946083 1899310 1870184 1841306 1802285 1791291 1761655
19358 1761655 1703701 1668976 1633931 1594456 1562972 1515355 1491630 1490408 1465018 1442520 1415983
19347 1415983 1372833 1340920 1313311 1302251 1283905 1236920 1188502 1183814 1187905 1168987 1095645 1069474
19335 1069474 1057722 1052862 1057181 1016412 968046 965492 997505 994363 949774 923668 927065 942451
19323 942451 950505 927460 917176 907376 886755 888609 874966 890309 897831 886338 867035 839126
$$ packed form
19402D312347r9884q7420q2070r2533j08882q3437q7951j03070r7987r6929q0456
19391C291728j00794n4422n7471n2840o3524n2249o0007p7569n8047q5812o1769
19380B567224o2631m2814j8712k7534n1256p9653m4564J2846k2231l5831n4548
19369B140296o4045o4267K704k7454m1151m6773k9126k8878l9021j0994k9636
19358A761655n7954l4725l5045l9475l1484m7617k3725j222k5390k2498k6537
19347A415983m3150l1913k7609j1060j8346m6985m8418m688M091j8918p3342k6171
19335A069474j1752m860M319m0769m8366k554L2013l142m4589k6106L397J5386
19323I42451Q054k3045j0284r800k0621J854j3643J5343P522j1493j9303k7909
$$ plain form
19311 839126 841329 808982 801815 792637 774857 758515 743574 731146 755025 765011 759981 758753 754654
19298 754654 751917 743294 714926 668984 634894 611852 590824 569714 533156 527632 528119 508556
19286 508556 488952 463163 447707 431712 455736 461958 481863 498280 500934 486750 457684 426968
19274 426968 439028 474198 474865 472682 482297 517464 514060 488662 503682 528116 545920 556257
19262 556257 590268 605010 638000 672057 712445 768230 803900 877581 935908 996666 1037172
19251 1037172 1033343 1022414 990170 936871 870683 812024 782240 760215 715695 701028 733658
19240 733658 723074 716443 750441 756168 729606 739451 775599 782799 811172 839542 860861 890637
19228 890637 922437 972087 1051660 1126842 1201477 1295138 1398736 1532475 1678898 1847559 2038841
$$ packed form
19311H39126K203l2347p167r178j7780j6342j4941j2428K3879R986n030j228m099
19298G54654k737q623k8368m5942l4090k3042k1028k1110l6558n524M87j9563
19286E08556j9604k5789j5456j5995K4024O222J9905J6417K654j4184k9066l0716
19274D26968J2060L5170O67k183R615L5167l404k5398J5020K4434J7804J0337
19262E56257L4011J4742L2990L4057M0388N5785L5670P3681N8327O0758M0506
19251A037172l829j0929l2244n3299o6188n8659k9784k2025m4520j4667L2630
19240G33658j0584o631L3998N727k6562R845L6148P200K8373K8370K1319K9776
19228H90637L1800M9650P9573P5182P4635R3661J03598J33739J46423J68661J91282
$$ plain form
19217 2038841 2215591 2363482 2568823 2801016 3054119 3342816 3698372 4139434 4610378
19208 4610378 5115694 5789953 6703654 8037621 10157621 13733889 19537979 27144613 34481146
19199 34481146 40260474 43264647 41299292 36694948 35529556 40324559 49503391 60271402
19191 60271402 70724300 76702617 74345446 66614179 56902662 47306528 41899003 42335778
19183 42335778 46447183 50734864 53318596 52283350 45146940 34957942 27111831 22516320
19175 22516320 19890885 18205748 16957593 15978153 15176092 14487611 13916562 13511698 13256726
19166 13256726 13102315 13000342 12914660 12872752 12875174 12994838 13299878 13802057 14703076 16170380
19156 16170380 18663638 23057879 30137395 39037310 47371068 53813228 56713847 53867833
$$ packed form
19217B038841J76750J47891K05341K32193K53103K88697L55556M41062M70944
19208D610378N05316O74259R13701J333967K120000L576268N804090P606634P336533
19199C4481146N779328L004173j965355m604344j165392M795003R178832J0768011
19191F0271402J0452898N978317k357171p731267r711517r596134n407525M36775
19183D2335778M111405M287681K583732j035246p136410j0188998p846111m595511
19175B2516320k625435j685137j248155r79440q02061o88481n71049m04864k54972
19166A3256726j54411j01973q5682m1908K422J19664L05040N02179R01019J467304
19156A6170380K493258M394241P079516Q899915Q333758O442160K900619k846014
$$ plain form
19148 53867833 49124701 49294490 56491097 68385718 81771917 94019642 99630257 95246737
19140 95246737 85315467 73260712 62116805 56979994 58953980 64803310 70342350 73535841
19132 73535841 71797505 62798159 51540331 44619625 43467631 47293126 53624944 59205088
19124 59205088 63242622 63399773 56992698 49768175 47860843 51426750 57407759 63091043
19116 63091043 68370241 70930030 69089637 66800466 66106366 65142624 59643938 51172299
19108 51172299 46316545 46842260 50574768 53942244 55887725 54869435 47710488 37976965
19100 37976965 31109134 27091476 24584655 22825045 21544379 20585672 19766495 19035914
19092 19035914 18437362 17984619 17632461 17347827 17196103 17134089 17112220 17117022 17296137 17808893
$$ packed form
19148E3867833m743132J69789P196607J1894621J3386199J2247725N610615m383520
19140I5246737r931270j2054755j1143907n136811J973986N849330N539040L193491
19132G3535841j738336q999346j1257828o920706j151994L825495O331818N580144
19124E9205088M037534J57151o407075p224523j907332L565907N981009N683284
19116F3091043N279198K559789j840393k289171o94100r63742n498686q471639
19108E1172299m855754N25715L732508L367476J945481j018290p158947r733523
19100C7976965o867831m017658k506821j759610j280666r58707q19177p30581
19092A9035914n98552m52743l52158k84634j51724o2014k1869M802J79115N12756
$$ plain form
19082 17808893 18781615 20519220 23578978 29016203 38118998 50083916 61000662 69130932
19074 69130932 72794747 67070145 56295507 50713836 52592861 59032721 66167912 73298481
19066 73298481 79269993 81210093 80993486 81501655 81943376 76652138 64404574 54731706
19058 54731706 52417646 55510229 59682370 62440402 62516160 56079124 44688524 35402530
19050 35402530 29715333 26194327 23752964 21949904 20596986 19559380 18727156 18024697
19042 18024697 17384302 16678676 15882686 15131712 14501238 13989886 13525652 13058263 12579601
19033 12579601 12175656 11769845 11420033 11074467 10708724 10378756 10082853 9820395 9592565
19024 9592565 9362318 9167782 8969473 8710010 8469495 8245249 8052729 7838478 7629977
$$ packed form
19082A7808893R72722J737605L059758N437225R102795J1964918J0916746Q130270
19074F9130932L663815n724602j0774638n581671J879025O439860P135191P130569
19066G3298481N971512J940100k16607N08169M41721n291238j2247564r672868
19058E4731706k314060L092583M172141K758032P5758o437036j1390600r285994
19050C5402530n687197l521006k441363j803060j352918j037606q32224p02459
19042A8024697o40395p05626p95990p50974o30474n11352m64234m67389m78662
19033A2579601m03945m05811l49812l45566l65743l29968k95903k62458k27830
19024I592565k30247j94536j98309k59463k40515k24246j92520k14251k08501
$$ plain form
19015 7629977 7385786 7116287 6924230 6833836 6753466 6635936 6486905 6315622 6151523 5999946
19005 5999946 5858274 5704030 5547442 5329030 5112466 4935393 4746490 4583619 4468919
18996 4468919 4377224 4278453 4172484 4089836 3997540 3881023 3779354 3685640 3608852 3523637 3466971
18985 3466971 3441134 3426133 3405111 3381077 3363333 3370679 3352158 3325614 3296177 3234456 3181207
18974 3181207 3094345 3016345 2953168 2911842 2917449 2957538 2963966 2946236 2892831 2805422 2726140 2609939
18962 2609939 2513903 2416501 2336642 2304442 2284389 2262163 2239430 2229562 2202177 2149183 2092041
18951 2092041 2015216 1910994 1797902 1732204 1701390 1698049 1687747 1638892 1601576 1573572 1538961
18940 1538961 1464832 1413100 1398819 1397763 1423924 1472593 1464719 1436911 1371722 1318156 1264127 1211741
$$ packed form
19015G629977k44191k69499j92057r0394q0370j17530j49031j71283j64099j51577
19005E999946j41672j54244j56588k18412k16564j77073j88903j62871j14700
18996D468919r1695r8771j05969q2648r2296j16517j01669r3714p6788q5215n6666
18985C466971k5837j5001k1022k4034j7744P346j8521k6544k9437o1721n3249
18974C181207q6862p8000o3177m1326N607M0089O428j7730n3405q7409p9282j16201
18962B609939r6036r7402p9859l2200k0053k2226k2733r868k7385n2994n7142
18951B092041p6825j04222j13092o5698l0814l341j0302m8855l7316k8004l4611
18940A538961p4129n1732j4281j056K6161M8669p874k7808o5189n3566n4029n2386
$$ plain form
18928 1211741 1165913 1147475 1153093 1148024 1089897 1045849 1003852 989508 973780 958360 927076 897265
18916 897265 911782 925814 931542 932547 910294 896416 893893 864430 845682 822219 783441 792403
18904 792403 783335 765561 778658 763554 727107 722590 728922 721463 703792 711485 692920 679606
18892 679606 653170 639269 611086 559672 559638 564434 565330 590413 582506 580342 598419 607582 602786
18879 602786 583529 556179 556162 575238 586876 573141 541487 516462 491101 482030 469565 465771
18867 465771 472047 477602 489052 502310 477391 475720 492421 510936 517282 502766 506143 492498
18855 492498 480602 478760 487711 506773 519802 507846 478609 466972 470863 468619 493929 520127
18843 520127 514303 503247 504560 516066 514094 500797 505127 509571 538711 552509 586329 598898
$$ packed form
18928A211741m5828j8438N618n069n8127m4048m1997j4344j5728j5420l1284k9811
18916H97265J4517J4032N728J005k2253j3878k523k9463j8748k3463l8778Q962
18904G92403r068j7774J3097j5104l6447m517O332p459j7671P693j8565j3314
18892F79606k6436j3901k8183n1414l4M796Q96K5083p907k164J8077R163m796
18879F02786j9257k7350j7J9076J1638j3735l1654k5025k5361r071j2465l794
18867D65771O276N555J1450J3258k4919j671J6701J8515O346j4516L377j3645
18855D92498j1896j842Q951J9062J3029j1956k9237j1637L891k244K5310K6198
18843E20127n824j1056J313J1506j972j3297M330M444K9140J3798L3820J2569
$$ plain form
18831 598898 596016 590256 565658 555063 564221 551012 518275 531681 540818 542515 537855 537573 520306
18818 520306 554405 584993 597677 606058 631993 639190 671330 713554 729007 774125 832149 894241
18806 894241 997792 1125972 1288148 1470243 1640297 1809499 1948111 2070253 2163880 2288388
18796 2288388 2395551 2469485 2501834 2592015 2724867 2885940 3106723 3402997 3739512 4175072
18786 4175072 4826944 5763721 7099791 9120175 12328852 17512186 25423555 35711198
18778 35711198 47744203 61205007 72422666 78607712 81494237 79844159 72128700 61685373
18770 61685373 51095303 39672048 29911998 23652392 19761866 17182328 15318442 13858561
18762 13858561 12663226 11649047 10830720 10171374 9695372 9367382 9194753 9152918 9255848
$$ packed form
18831E98898k882n760k4598j0595R158j3209l2737J3406R137J697m660k82j7267
18818E20306L4099L0588J2684Q381K5935P197L2140M2224J5453M5118N8024O2092
18806H94241J03551J28180J62176J82095J70054J69202J38612J22142R3627J24508
18796B288388J07163P3934L2349R0181J32852J61073K20783K96274L36515M35560
18786D175072O51872R36777J336070K020384L208677N183334P911369J0287643
18778C5711198J2033005J3460804J1217659O185046K886525j650078p715459j0443327
18770F1685373j0590070j1423255r760050o259606l890526k579538j863886j459881
18762A3858561j195335j014179q18327o59346m76002l27990j72629m1835J02930
$$ plain form
18753 9255848 9432457 9610077 9750897 9848271 9850767 9743528 9561739 9350706 9169417 9021898
18743 9021898 8974537 9029867 9214878 9503865 9969778 10697565 11803817 13447508 15958430
18734 15958430 19967812 26429992 36440522 50159485 67213975 86503835 104730214
18727 104730214 118197443 125549735 126186855 119268575 105835888 89492313 72417825
18720 72417825 56430131 43682369 35274275 29913017 26222575 23465860 21244883 19431030
18712 19431030 17940440 16685124 15678201 14901272 14343437 13958612 13718639 13598687 13525484
18703 13525484 13435618 13277103 13106196 12834667 12484329 12041739 11600974 11177004 10773312
18694 10773312 10474283 10245739 10074574 9998708 9994837 10157925 10504768 11152444 12181565 13891691
$$ packed form
18753I255848J76609J77620J40820R7374K496j07239j81789k11033j81289j47519
18743I021898m7361N5330J85011K88987M65913P27787J106252J643691K510922
18734A5958430M009382O462180J0010530J3718963J7054490J9289860J8226379
18727A04730214J3467229P352292O37120o918280j3432687j6343575j7074488
18720G2417825j5987694j2747762q408094n361258l690442k756715k220977j813853
18712A9431030j490590j255316j006923p76929n57835l84825k39973j19952p3203
18703A3525484q9866j58515j70907k71529l50338m42590m40765m23970m03692
18694A0773312k99029k28544j71165p5866l871J63088L46843O47676J029121J710126
$$ plain form
18684 13891691 16791899 21372732 27453531 34594496 42820503 50086101 54075393 55852309
18676 55852309 55164416 50544636 43760038 36944509 29614486 23095699 18816592 16192352
18668 16192352 14520056 13299292 12354181 11560810 10865801 10186625 9571054 9031001 8594315
18659 8594315 8298541 8125543 8047789 8003942 7920821 7784757 7613606 7371910 7043121 6734173
18649 6734173 6482819 6216967 6004159 5821387 5611209 5420582 5267197 5134959 5034892
18640 5034892 4897119 4755960 4664730 4566244 4461800 4361633 4205759 4069414 4004757 3963752
18630 3963752 3937504 3933017 3911672 3848888 3729456 3624031 3515915 3422454 3333674 3230646 3191066
18619 3191066 3178618 3180445 3170654 3145288 3099497 3064538 3028783 3006826 2984996 2986540 2988126 2933517
$$ packed form
18684A3891691K900208M580833O080799P140965Q226007P265598L989292J776916
18676E5852309o87893m619780o784598o815529p330023o518787m279107k624240
18668A6192352j672296j220764r45111p93371o95009o79176o15571n40053m36686
18659H594315k95774j72998p7754m3847q3121j36064j71151k41696l28789l08948
18649F734173k51354k65852k12808j82772k10178j90627j53385j32238j00067
18640E034892j37773j41159r1230r8486j04444j00167j55874j36345o4657m1005
18630C963752k6248m487k1345o2784j19432j05425j08116r3461q8780j03028l9580
18619C191066j2448J827r791k5366m5791l4959l5755k1957k1830J544J586n4609
$$ plain form
18607 2933517 2885061 2898192 2908925 2940419 2971696 2993636 3008990 3001214 2965629 2880001 2790426
18596 2790426 2701253 2631361 2615594 2639999 2713365 2818134 2917653 2950218 2894892 2794794 2684886
18585 2684886 2514854 2355148 2299373 2265755 2258931 2275732 2334793 2408987 2466645 2542184 2576191
18574 2576191 2593871 2635464 2696088 2754574 2829739 2941254 3066003 3241834 3479468 3786911
18564 3786911 4101724 4442134 4848028 5338327 5897084 6444597 6894999 7283204 7775287
18555 7775287 8519511 9579216 10871962 12346219 14130448 16304184 19327524 24023161
18547 24023161 31512047 43883339 63741053 92696933 131652857 175204616 206527204
18540 206527204 219452329 213445381 178194272 131047931 99869947 86301468 85245169
$$ packed form
18607B933517m8456J3131J0733L1494L1277K1940J5354p776l5585q5628q9575
18596B790426q9173o9892j5767K4405P3366J04769R9519L2565n5326j00098j09908
18585B684886j70032j59706n5775l3618o824J6801N9061P4194N7658P5539L4007
18574B576191J7680M1593O0624N8486P5165J11515J24749J75831K37634L07443
18564C786911L14813L40410M05894M90299N58757N47513M50402L88205M92083
18555G775287P44224J059705J292746J474257J784229K173736L023340M695637
18547B4023161P488886J2371292J9857714K8955880L8955924M3551759L1322588
18540B06527204J2925125o006948l5251109m7146341l1177984j3568479j056299
$$ plain form
18533 85245169 94867600 113180796 132581855 146356920 151892693 140266290 111524362
18526 111524362 84319796 67239110 57651527 52205905 48919885 47168807 46877886 47920585
18518 47920585 50642941 56278262 66996318 85147795 108701008 129892601 144757081
18511 144757081 149018585 134155233 108929388 91352457 85945226 91959432 111125058
18504 111125058 144083527 181366653 212868279 234913001 230438405 193702740 151687292
18497 151687292 116975954 90876944 74314777 64024419 57128986 52170779 48303103
18490 48303103 45067616 42301716 39740463 37321694 35174663 33326102 31664416 30132247
18482 30132247 28757953 27614520 26705511 25903512 25178279 24510327 23805755 23067532 22291229
$$ packed form
18533H5245169R622431J8313196J9401059J3775065N535773j1626403k8741928
18526A11524362k7204566j7080686r587583n445622l286020j751078k90921J042699
18518D7920585K722356N635321J0718056J8151477K3553213K1191593J4864480
18511A44757081M261504j4863352k5225845j7576931n407231O014206J9165626
18504A11125058L2958469L7283126L1501626K2044722m474596l6735665m2015448
18497A51687292l4711338k6099010j6562167j0290358o895433m958207l867676
18490D8303103l235487k765900k561253k418769k147031j848561j661686j532169
18482C0132247j374294j143433r09009q01999p25233o67952p04572p38223p76303
$$ plain form
18473 22291229 21512402 20779639 20049521 19296642 18597232 17975855 17382942 16833457 16386179
18464 16386179 15937101 15506169 15111963 14715224 14310013 13888003 13454728 12997704 12578772
18455 12578772 12196206 11833662 11537129 11302060 11045514 10799527 10543804 10307870 10040066
18446 10040066 9754102 9439719 9136069 8882287 8649982 8407892 8218145 8031315 7851371
18437 7851371 7693949 7538033 7394456 7251967 7132224 7030073 6886603 6727937 6559422
18428 6559422 6396763 6260247 6110081 6004423 5908557 5855816 5834124 5825088 5786798 5843431 5958129
18417 5958129 6206745 6613448 7126470 7876200 8866701 9778807 10260308 10590806 10420298
18408 10420298 9065594 7518906 6712470 6530687 6815821 7361109 7843001 8156101 8136684
$$ packed form
18473B2291229p78827p32763p30118p52879o99410o21377n92913n49485m47278
18464A6386179m49078m30932l94206l96739m05211m22010m33275m57024m18932
18455A2578772l82566l62544k96533k35069k56546k45987k55723k35934k67804
18446A0040066k85964l14383l03650k53782k32305k42090j89747j86830j79944
18437G851371j57422j55916j43577j42489j19743j02151j43470j58666j68515
18428F559422j62659j36516j50166j05658r5866n2741k1692r036l8290N6633J14698
18417E958129K48616M06703N13022P49730R90501R12106M81501L30498j70508
18408A0420298j354704j546688q06436j81783K85134N45288M81892L13100j9417
$$ plain form
18399 8136684 7360591 6237620 5428046 4969035 4696807 4501375 4379881 4265133 4159416
18390 4159416 4055686 4010835 4028267 4124185 4361737 4816774 5511955 6272226 6816005 7189862
18380 7189862 7062784 6199303 5401260 5124825 5359190 6180667 7256289 8100733 8837543
18371 8837543 9016005 7968379 6678411 5875034 5254213 4597409 3998875 3605997 3368204
18362 3368204 3181712 3016086 2904082 2802599 2673555 2552526 2487538 2403287 2332251 2301303
18352 2301303 2258798 2233528 2193975 2144196 2095786 2057978 2023999 1953474 1915191 1887970 1872274
18341 1872274 1868141 1869222 1864464 1829681 1779938 1727527 1684531 1676329 1639694 1617394 1615589 1583413
18329 1583413 1540961 1497378 1468649 1434462 1379902 1320449 1259710 1225211 1193875 1160728 1123561
$$ packed form
18399H136684p76093j122971q09574m59011k72228j95432j21494j14748j05717
18390D159416j03730m4851J7432R5918K37552M55037O95181P60271N43779L73857
18380G189862j27078q63481p98043k76435K34365Q21477J075622Q44444P36810
18371H837543J78462j047626j289968q03377o20821o56804n98534l92878k37793
18362C368204j86492j65626j12004j01483j29044j21029o4988q4251p1036l0948
18352B301303m2505k5270l9553m9779m8410l7808l3979p0525l8283k7221j5696
18341A872274m133J081m758l4783m9743n2411m2996q202l6635k2300j805l2176
18329A583413m2452m3583k8729l4187n4560n9453o0739l4499l1336l3147l7167
$$ plain form
18318 1123561 1067048 1011686 977225 961483 951893 947245 952463 945516 937330 921546 901485 877244
18306 877244 878844 885498 882853 859371 843194 804363 814031 834204 835425 806723 766489 786198
18294 786198 830462 899965 936417 967875 998838 981709 996388 1008712 969487 925709 881779
18283 881779 843987 820652 803270 822059 853362 843440 803693 766459 729458 707000 682030 659514
18271 659514 669002 683727 702974 686927 652071 639560 657585 685577 698760 687198 728771 799527
18259 799527 882938 926518 968809 957265 899994 852865 798853 724073 664800 632810 628893 656528
18247 656528 697694 699754 656204 640871 599523 564752 581586 580342 513881 488120 516533 536320
18235 536320 533080 537600 532539 493757 471674 482506 469043 443337 422955 416148 419972 423974 404801
$$ packed form
18318A123561n6513n5362l4461j5742r590m648N218o947q186j5784k0061k4241
18306H77244J600O654k645k3482j6177l8831R668K0173J221k8702m0234J9709
18294G86198M4264O9503L6452L1458L0963j7129J4679J2324l9225m3778m3930
18283H81779l7792k3335j7382J8789L1303r922l9747l7234l7001k2458k4970k2516
18271F59514R488J4725J9247j6047l4856j2511J8025K7992J3183j1562M1573P0756
18259G99527Q3411M3580M2291j1544n7271m7129n4012p4780n9273l1990l917K7635
18247F56528M1166K060m3550j5333m1348l4771J6834j244o6461k5761K8413J9787
18235E36320l240M520n061l8782k2083J0832j3463k5706k0382o807L824M002j9173
$$ plain form
18222 404801 397221 401578 377537 370418 391110 405196 455331 486041 523748 598826 681418 776337
18210 776337 843885 929909 976995 958871 907260 821994 743324 657952 578581 524638 482552
18199 482552 440089 409119 401221 421725 431033 412306 401293 382703 379077 406925 444213 465990
18187 465990 491751 488262 478445 471250 471234 490705 522700 546561 554765 589302 583679 548586 534295
18174 534295 533546 530673 526904 514434 448814 433707 451621 460877 496772 502285 559653 640735 691664
18161 691664 724830 760738 811672 837346 841560 840512 820741 820901 800086 753266 712869 667231
18149 667231 642146 614280 593771 581998 566477 546981 524091 499291 460061 443066 470399
18138 470399 508520 509471 524061 526164 506561 516638 530244 556363 600619 629982 661231 665021
$$ packed form
18222D04801p580M357k4041p119K0692J4086N0135L0710L7707P5078Q2592R4919
18210G76337O7548Q6024M7086j8124n1611q5266p8670q5372p9371n3943m2086
18199D82552m2463l0970p898K0504R308j8727j1013j8590l626K7848L7288K1777
18187D65990K5761l489r817p195j6J9471L1995K3861Q204L4537n623l5093j4291
18174E34295p49k873l769j2470o5620j5107J7914R256L5895N513N7368Q1082N0929
18161F91664L3166L5908N0934K5674M214j048j9771J60k0815m6820m0397m5638
18149F67231k5085k7866k0509j1773j5521j9496k2890k4800l9230j6995K7333
18138D70399L8121R51J4590K103j9603J0077J3606K6119M4256K9363L1249L790
$$ plain form
18126 665021 697201 757613 815935 832651 803125 786421 832699 883394 958269 1069839 1184519
18115 1184519 1328427 1536827 1824895 2199045 2842973 3956687 6124771 10416635 17065026
18106 17065026 23056481 27230953 29901772 26047750 16747816 10464740 7444332 5914757
18098 5914757 5026360 4402753 3940414 3548644 3196799 2892787 2643134 2443220 2271629
18089 2271629 2144354 2019057 1890445 1784749 1743935 1694221 1655950 1645518 1595722 1578607
18079 1578607 1546758 1505316 1469944 1413826 1343302 1247742 1185469 1175028 1157961 1119213 1095668
18068 1095668 1053995 1016987 992300 994917 1009752 988144 945880 892598 871816 867543 862596 836987
18056 836987 809236 787291 785481 783418 768817 718843 692559 696697 677408 664688 656062 603941
$$ packed form
18126F65021L2180O0412N8322J6716k9526j6704M6278N0695P4875J11570J14680
18115A184519J43908K08400K88068L74150O43928J113714K168084M291864O648391
18106A7065026N991455M174472K670819l854022r299934o283076l020408j529575
18098E914757q88397o23607m62339l91770l51845l04012k49653j99914j71591
18089B271629j27275j25297j28612j05696m0814m9714l8271j0432m9796j7115
18079A578607l1849m1442l5372n6118p0524r5560o2273j0441j7067l8748k3545
18068A095668m1673l7008k4687K617J4835k1608m2264n3282k0782m273m947k5609
18056H36987k7751k1945j810k063j4601m9974k6284M138j9289j2720q626n2121
$$ plain form
18044 603941 593822 630039 634558 618423 608390 580419 577313 610928 645106 665753 727903 829080
18032 829080 914420 1004329 1070759 1099056 1078449 1082648 1106739 1155085 1143637 1052928 988956 1014206
18020 1014206 1056173 1099826 1143032 1150564 1129157 1089340 1058941 1055635 1051641 1042527 934783 773906
18008 773906 674159 625179 592658 605435 619489 635009 670776 720670 789750 865999 942803
17997 942803 1010939 1012262 1009131 1034135 1077134 1079459 1051911 965729 870719 828328 857404 946249
17985 946249 1002614 1013652 959029 903745 913120 894052 879631 816212 742535 673153 606630 553384
17973 553384 533450 506211 484486 455546 439229 416107 414432 421990 383999 385749 395918 385332
17961 385332 387843 380626 405356 435611 424253 407994 403005 394719 387573 404858 389722 368241
$$ packed form
18044F03941j0119L6217M519j6135j0033k7971l106L3615L4178K0647O2150J01177
18032H29080Q5340Q9909O6430K8297k0607M199K4091M8346j1448r0709o3972K5250
18020A014206M1967M3653M3206P532k1407l9817l0399l306l994r114j07744j60877
18008G73906r9747m8980l2521J2777J4054J5520L5767M9894O9080P6249P6804
17997I42803O8136J323l131K5004M2999K325k7548q6182r5010m2391K9076Q8845
17985I46249N6365J1038n4623n5284R375j9068j4421o3419p3677o9382o6523n3246
17973E53384j9934k7239k1725k8940j6317k3122j675P558l7991J750J0169j0586
17961C85332K511p217K4730L0255j1358j6259m989q286p146J7285j5136k1481
$$ plain form
17949 368241 362100 357065 322960 329341 320355 307730 317004 314036 338415 333526 330368 327733 342239
17936 342239 346671 346600 354371 352109 358286 363429 339483 295421 272741 269330 282612 259827 260450 282180
17922 282180 258716 257350 249283 255933 294714 321112 343628 361855 391524 369565 347514 370016
17910 370016 378526 393182 362167 359099 346221 324496 328730 348168 350713 354666 360566 369953 376373
17897 376373 365199 353405 359921 358299 344849 355284 362669 355073 341062 348330 376973 360845
17885 360845 345267 327821 290460 304716 306089 328799 323555 307706 330561 376032 435867 498525
17873 498525 571591 638160 651677 643867 612093 590950 574557 542289 503987 495618 511660 530810
17861 530810 532376 518239 537837 531765 528767 490880 456014 434221 409889 406985 413109 383592
$$ packed form
17949C68241o141n035l4105O381q986j2625R274k968K4379m889l158k635J4506
17936C42239M432p1P771k262O177N143k3946m4062k2680l411J3282k2785O23K1730
17922B82180k3464j366q067O650L8781K6398K2516J8227K9669k1959k2051K2502
17910C70016Q510J4656l1015l068j2878k1725M234J9438K545L953N900R387O420
17897C76373j1174j1794O516j622j3450J0435P385p596j4011P268K8643j6128
17885C60845j5578j7446l7361J4256J373K2710n244j5849K2855M5471N9835O2658
17873D98525P3066O6569J3517p810l1774k1143j6393l2268l8302q369J6042J9150
17861E30810J566j4137J9598o072k998l7887l4866k1793k4332k904O124k9517
$$ plain form
17849 383592 345820 327034 301200 293659 304306 320555 307349 270174 291286 310017 326064 320477
17837 320477 293811 279087 267455 240415 241565 252263 259708 231750 189389 176672 199118 198900
17825 198900 215703 235831 214082 167601 175837 212433 222032 220179 200847 176853 159698 140239
17813 140239 128902 147437 144804 147897 172643 189984 184448 152914 118579 102322 82205 89407
17801 89407 100230 123599 141927 154044 168971 138793 133453 142424 169335 172005 197880 253625
17789 253625 290210 317371 336157 332155 326434 302220 276440 290519 287278 277436 282629 326268
17777 326268 339728 336975 307060 281367 291517 293095 268353 243382 202133 175626 183981 175233
17765 175233 171788 145680 135785 130740 144357 150652 164087 175950 165301 152972 154733 165446
$$ packed form
17849C83592l7772j8786k5834p541J0647J6249j3206l7175K1112J8731J6047n587
17837C20477k6666j4724j1632k7040J150J0698P445k7958m2361j2717K2446k18
17825A98900J6803K0128k1749m6481Q236L6596R599j853j9332k3994j7155j9459
17813A40239j1337J8535k633L093K4746J7341n536l1534l4335j6257k0117P202
17801H9407J0823K3369J8328J2117J4927l0178n340Q971K6911K670K5875N5745
17789B53625L6585K7161J8786m002n721k4214k5780J4079l241r842N193M3639
17777C26268J3460k753k9915k5693J0150J578k4742k4971m1249k6507Q355q748
17765A75233l445k6108r895n045J3617O295J3435J1863j0649j2329J761J0713
$$ plain form
17753 165446 170348 169014 176077 174667 173224 155721 145454 121032 113426 120919 114525 104290 133754
17740 133754 191271 221117 233346 236254 233112 217844 196071 178876 190444 197650 207489 202193
17728 202193 183562 167460 161018 172533 165242 165635 165585 156741 151568 131023 122501 80042 65166
17715 65166 92776 106510 95060 105355 91346 97643 90204 71252 70789 70624 82678 98342 90618
17702 90618 71309 53383 35098 25128 3420 15955 39083 44801 41832 60612 61003 40939 37770
17689 37770 34665 30109 44321 45120 37996 76558 86460 74062 71571 72907 61377 36289 38777
17676 38777 52818 50267 59598 59333 58875 53304 74180 66719 30317 21053 36755 35544 9297 23902
17662 23902 25067 43262 43212 66705 79590 71576 48235 53720 44855 68766 84276 75421 83240
$$ packed form
17753A65446M902j334P063j410j443j7503j0267k4422p606P493o394j0235K9464
17740A33754N7517K9846J2229K908l142j5268k1773j7195J1568P206R839n296
17728B02193j8631j6102o442J1515p291L93n0q844n173k0545q522m2459j4876
17715F5166K7610J3734j1450J0295j4009O297p439j8952m63j65J2054J5664p724
17702I0618j9309j7926j8285r970k1708J2535K3128N718k969J8780L91k0064l169
17689C7770l105m556J4212P99p124L8562R902j2398k491J336j1530k5088K488
17676C8777J4041k551R331k65m58n571K0876p461l6402r264J5702j211k6247J4605
17662B3902J165J8195n0K3493J2885q014k3341N485q865K3911J5510q855P819
$$ plain form
17649 83240 92023 84384 62177 60993 56183 47309 62901 61116 77813 98854 83930 71561 71130
17636 71130 90059 99493 92138 90988 78253 47280 13842 18000 42360 56380 32226 59754
17624 59754 91466 101129 119104 91757 77457 57945 70710 80758 80305 72825 48585 37745
17612 37745 22962 23053 8583 17744 9155 10094 15007 36013 48442 60818 56363 43016 16766
17599 16766 44984 32954 26736 30293 34241 45321 34538 -332 -6057 5490 13254 -1776 -4308
17586 -4308 17652 -3612 -11224 5127 1068 15504 12212 20632 36718 51324 40099 26639 21221
17573 21221 17212 43676 44452 34249 39188 51661 63273 61907 52524 50471 34350 740 7106
17560 7106 45920 47320 37052 29214 7003 3050 9527 19164 26639 38124 21592 17810 18542 20058
$$ packed form
17649H3240Q783p639k2207j184m810q874J5592j785J6697K1041j4924j2369m31
17636G1130J8929R434p355j150j2735l0973l3438M158K4360J4020k4154K7528
17624E9754L1712R663J7975k7347j4300j9512J2765J0048m53p480k4240j0840
17612C7745j4783R1j4470R161q589R39M913K1006J2429J2376m455j3347k6250
17599A6766K8218j2030o218L557L948J1080j0783l4870n725J1547P764j5030k532
17586d308K1960k1264p612J6351m059J4436l292Q420J6086J4606j1225j3460n418
17573B1221m009K6464P76j0203M939J2473J1612j366r383k053j6121l3610O366
17560G106L8814J400j0268p838k2211l953O477R637P475J1485j6532l782P32J516
$$ plain form
17546 20058 37566 19882 20232 -1460 13247 32999 29424 26351 27300 20909 7736 34213 64686
17533 64686 57227 18973 -13794 16588 29775 32141 20024 23674 30880 4586 -27953 -18226 1394
17520 1394 14951 8979 -7674 1966 14594 18546 39891 49410 43103 49902 33498 8900 21936
17507 21936 13731 -5279 30334 59955 61579 46049 46475 74888 102356 109914 92942 89392 66101
17494 66101 30848 -4194 -12364 15558 32996 38474 38309 28056 24705 8288 -4113 -12128 647
17481 647 -2200 -1629 44858 53388 65472 47344 37813 52516 53962 46156 56459 59481 53308 49840
17467 49840 47857 70529 52447 33425 68911 54845 47975 71893 83846 89795 85189 96547
17455 96547 80552 55166 41264 33722 47718 43175 26759 32113 29142 41214 58888 27958
$$ packed form
17546B0058J7508j7684L50k1692J4707J9752l575l073R49o391j3173K6477L0473
17533F4686p459l8254l2767L0382J3187K366j2117L650P206k6294l2539R727J9620
17520A394J3557n972j6653R640J2628L952K1345R519o307O799j6404k4598J3036
17507B1936q205j9010L5613K9621J624j5530M26K8413K7468P558j6972l550k3291
17494F6101l5253l5042q170K7922J7438N478j65j0253l351j6417j2401q015J2775
17481F47k847N71M6487Q530J2084j8128r531J4703J446p806J0303L022o173l468
17467D9840j983K2672j8082j9022L5486j4066o870K3918J1953N949m606J1358
17455I6547j5995k5386j3902p542J3996m543j6416N354k971J2072J7674l0930
$$ plain form
17443 27958 49202 46706 73077 94859 126923 154799 140684 129251 110658 89799 84292 85023
17431 85023 109583 102787 111312 109530 104492 85584 67200 67392 53036 64686 54977 51497 33079
17418 33079 30810 40343 47541 35923 11372 8712 37917 34010 23855 49283 35992 23485 23672
17405 23672 32379 33131 6432 -30522 -32733 -4533 21279 7846 15432 24966 30163 16579 31134
17392 31134 51865 50375 34270 12698 7543 15844 35118 12331 27256 63635 75145 41316
17380 41316 38501 61232 55952 35497 30246 29361 49822 28608 30672 47755 50851 46043 57963
17367 57963 38987 58130 53983 22897 16287 31480 56177 57999 54424 55522 24020 24329 45467
17354 45467 48899 9967 5546 11904 3900 -17558 17319 60592 64305 64648 49407 42175 29870
$$ packed form
17443B7958K1244k496K6371K1782L2064K7876j4115j1433j8593k0859n507P31
17431H5023K4560o796Q525j782n038j8908j8384J92j4356J1650r709l480j8418
17418C3079k269R533P198j1618k4551k660K9205l907j0155K5428j3291j2507J87
17405B3672Q707P52k6699l6954k211K8200K5812j3433P586R534N197j3584J4555
17392C1134K0731j490j6105k1572n155Q301J9274k2787J4925L6379J1510l3829
17380D1316k815K2731n280k0455n251q85K0461k1214K064J7083L096m808J1920
17367E7963j8976J9143m147l1086o610J5193K4697J822l575J098l1502L09K1138
17354D5467L432l8932m421O358q004k1458L4877M3273L713L43j5241p232j2305
$$ plain form
17341 29870 34614 61577 60040 60041 67665 50574 13064 23038 34732 17276 15147 27869 23399 43262
17327 43262 70694 53068 31612 17639 28074 13974 31688 57262 33128 14832 -5049 -23499
17315 -23499 -40597 -49149 -18414 668 27318 35924 10418 28845 27184 26775 19689 18262 20309
17302 20309 41583 52900 58803 80096 80996 61521 61033 65213 68876 62006 35571 23405 13104
17289 13104 26512 36621 35400 18798 10425 33347 8028 -9904 7046 41396 51399 35442
17277 35442 17266 917 5164 11217 5775 12605 31553 16289 3124 29645 34268 38166 33474
17264 33474 33873 59859 73126 60769 60932 36596 10762 15848 7733 -12444 -15860 5666 12378
17251 12378 51304 92846 112847 113958 83898 31695 27757 34036 32401 54708 70302 52069
$$ packed form
17341B9870M744K6963j537JP624j7091l7510R974J1694j7456k129J2722m470J9863
17327D3262K7432j7626k1456j3973J0435j4100J7714K5574k4134j8296j9881j8450
17315b3499j7098q552L0735J9082K6650Q606k5506J8427j661m09p086j427K047
17302B0309K1274J1317N903K1293R00j9475m88M180L663o870k6435j2166j0301
17289A3104J3408J0109j221j6602q373K2922k5319j7932J6950L4350J0003j5957
17277C5442j8176j6349M247O053n442O830J8948j5264j3165K6521M623L898m692
17264C3474L99K5986J3267j2357J63k4336k5834N086q115k0177l416K1526O712
17251A2378L8926M1542K0001J111l0060n2203l938O279j635K2307J5594j8233
$$ plain form
17239 52069 24343 14698 35010 9838 7706 22995 58975 38428 -6075 -13207 -20468 -35784
17227 -35784 -37692 -37016 -38485 -21418 -27284 -9025 26197 31010 27969 16217 23998 36846 60166
17214 60166 82494 68509 59543 71713 66943 54707 25307 268 7268 57196 81332 82712
17202 82712 81801 20968 1461 11884 31990 32221 62563 66805 47001 53248 40831 36461 53783
17189 53783 78204 74496 44188 25448 27469 41567 47449 55469 23329 453 11633 15574 35930
17176 35930 46165 31511 30969 22265 18130 28353 43002 58536 73641 81270 75471 62023 63753
17163 63753 41937 -1794 20650 11776 -9244 -12541 400 4190 26868 44674 4669 -7870
17151 -7870 -3241 -10640 -12994 -9556 3267 -10675 -17168 -633 3427 15955 26873 33381 56532
$$ packed form
17239E2069k7726r645K0312k5172k132J5289L5980k0547m4503p132p261j5316
17227c5784j908O76j469J7067n866J8259L5222M813l041j1752P781J2848K3320
17214F0166K2328j3985q966J2170m770j2236k9400k5039P000M9928K4136J380
17202H2712r11o0833j9507J0423K0106K31L0342M242j9804O247j2417m370J7322
17189E3783K4421l708l0308j8740K021J4098N882Q020l2140k2876J1180L941K0356
17176C5930J0235j4654n42q704m135J0223J4649J5534J5105P629n799j3448J730
17163F3753k1816m3731K2444q874k1020l297J2941L790K2678J7806m0005j2539
17151g870M629p399k354L438J2823j3942o493J6535M060J2528J0918O508K3151
$$ [...]
##END NTUPLES=NMR SPECTRUM
##END=
