##TITLE=Analysis number 322242
Compound Code cc 44206
Book Reference 468/155
Project Code adrs
Chemist Name colinb
##JCAMPDX= 6.0         $$ Bruker NMR JCAMP-DX V2.0
##DATA TYPE= NMR SPECTRUM
##DATA CLASS= NTUPLES
##ORIGIN= Bruker BioSpin GmbH
##OWNER= nmr
$$ XWIN-NMR		Version 3.5
$$ Mon Sep 18 14:07:12 2006 GMT Daylight Time (UT+1h)  MAYBRIDGE\nmr@NMR_250MHZ
##.OBSERVE FREQUENCY= 250.131544655141
##.OBSERVE NUCLEUS= ^1H
##.ACQUISITION MODE= SIMULTANEOUS (DQD)
##.ACQUISITION SCHEME= undefined
##.AVERAGES= 16
##.DIGITISER RES= 18
##SPECTROMETER/DATA SYSTEM= dpx250
##.PULSE SEQUENCE= zg30
##.SOLVENT NAME= CDCl3
##.SHIFT REFERENCE= (INTERNAL, CDCl3, 0, 16.522)
##AUDIT TRAIL= $$ (NUMBER, WHEN, WHO, WHERE, WHAT)
$$ ##TITLE= Audit trail, XWIN-NMR		Version 3.5
$$ ##JCAMPDX= 5.01
$$ ##ORIGIN= Bruker BioSpin GmbH
$$ ##OWNER= nmr
$$ C:\u/data/dgb/nmr/ADRS/970/pdata/1/auditp.txt
$$ ##AUDIT TRAIL=  $$ (NUMBER, WHEN, WHO, WHERE, WHAT)
(   1,<2006-09-18 14:06:45.57 +100>,<MAYBRIDGE\nmr>,<NMR_250MHZ>,
      <created by zg, POWCHK disabled, PULCHK disabled
       configuration hash MD5:
       E2 DF 36 D8 04 B2 41 60 5A D7 A3 38 5A 4B D0 FE
       data hash MD5: 64K
       7C 2B C7 B2 13 7E A9 42 05 07 7C 88 BC F1 99 3B>)
(   2,<2006-09-18 14:07:01.70 +100>,<MAYBRIDGE\nmr>,<NMR_250MHZ>,
      <Start of raw data processing
       ef LB = 0.3 FT_mod = 6 PKNL = 1 SI = 32K 
       data hash MD5: 32K
       C8 C3 B4 C7 E3 32 8D 52 8B E8 85 A8 8F 02 E9 C6>)
(   3,<2006-09-18 14:07:03.57 +100>,<MAYBRIDGE\nmr>,<NMR_250MHZ>,
      <apk 
       data hash MD5: 32K
       49 ED AC C4 54 06 53 7E D6 47 1C 45 62 3C CC ED>)
(   4,<2006-09-18 14:07:04.29 +100>,<MAYBRIDGE\nmr>,<NMR_250MHZ>,
      <abs ABSG = 5 
       data hash MD5: 32K
       1F 2E BE D9 C9 14 F5 32 99 DD 36 D6 DE B6 EF 94>)
$$ ##END=
$$ 
$$ hash MD5
$$ 79 59 95 9D E6 E0 E5 43 C0 E0 17 ED 85 C1 8F 11
##$RELAX= 
##$RELAX= 
##$RELAX= 
##$RELAX= 
##$RELAX= 
##$RELAX= 
##$RELAX= 
$$ Bruker specific parameters
$$ --------------------------
##$DU= <C:\u>
##$EXPNO= 970
##$NAME= <ADRS>
##$PROCNO= 1
##$TYPE= <nmr>
##$USER= <dgb>
##$AMP= (0..31)
100 100 100 100 100 100 100 100 100 100 100 100 100 100 100 100 100 100 
100 100 100 100 100 100 100 100 100 100 100 100 100 100 
##$AQSEQ= 0
##$AQ_mod= 3
##$AUNM= <au_zg>
##$AUTOPOS= <48 >
##$BF1= 250.13
##$BF2= 250.13
##$BF3= 250.13
##$BF4= 250.13
##$BF5= 500.13
##$BF6= 500.13
##$BF7= 500.13
##$BF8= 500.13
##$BYTORDA= 1
##$CFDGTYP= 0
##$CFRGTYP= 5
##$CHEMSTR= <none>
##$CNST= (0..31)
1 1 145 1 1 1 1 1 1 1 1 1 1 1 1 1 1 1 1 1 1 1 1 1 1 1 1 1 1 1 1 1 
##$CPDPRG= <>
##$CPDPRG1= <>
##$CPDPRG2= <>
##$CPDPRG3= <>
##$CPDPRG4= <mlev>
##$CPDPRG5= <mlev>
##$CPDPRG6= <mlev>
##$CPDPRG7= <mlev>
##$CPDPRG8= <mlev>
##$CPDPRGB= <>
##$CPDPRGT= <>
##$D= (0..31)
0 1 0 0 0 0 0 0 0 0.06 0 0 0 0 0 0 0.0002 0 0 0 0 0 0 0 0 0 0 0 0 0 0 
0 
##$DATE= 1158584804
##$DBL= (0..7)
120 120 120 120 120 120 120 120 
##$DBP= (0..7)
150 150 150 150 150 150 150 150 
##$DBP07= 0
##$DBPNAM0= <>
##$DBPNAM1= <>
$$ [...]
##$SUBNAM7= <"">
##$SUBNAM8= <"">
##$SUBNAM9= <"">
##$SW= 20.6930455092707
##$SWIBOX= (0..15)
0 0 3 0 0 0 0 0 0 0 0 0 0 0 0 0 
##$SW_h= 5175.983436853
##$TD= 65536
##$TD0= 1
##$TE= 296.16
##$TE2= 300
##$TE3= 300
##$TEG= 300
##$TL= (0..7)
0 120 120 120 120 120 120 120 
##$TP= (0..7)
150 150 150 150 150 150 150 150 
##$TP07= 0
##$TPNAME0= <>
##$TPNAME1= <>
##$TPNAME2= <>
##$TPNAME3= <>
##$TPNAME4= <>
##$TPNAME5= <>
##$TPNAME6= <>
##$TPNAME7= <>
##$TPOAL= (0..7)
0.5 0.5 0.5 0.5 0.5 0.5 0.5 0.5 
##$TPOFFS= (0..7)
0 0 0 0 0 0 0 0 
##$TUNHIN= 0
##$TUNHOUT= 0
##$TUNXOUT= 0
##$USERA1= <user>
##$USERA2= <user>
##$USERA3= <user>
##$USERA4= <user>
##$USERA5= <user>
##$V9= 5
##$VALIST= <valist>
##$VCLIST= <CCCCCCCCCCCCCCC>
##$VD= 0
##$VDLIST= <DDDDDDDDDDDDDDD>
##$VPLIST= <PPPPPPPPPPPPPPP>
##$VTLIST= <TTTTTTTTTTTTTTT>
##$WBST= 1024
##$WBSW= 4
##$XGAIN= (0..3)
0 0 0 0 
##$XL= 0
##$YL= 0
##$YMAX_a= 456928
##$YMIN_a= -604714
##$ZGOPTNS= <>
##$ZL1= 120
##$ZL2= 120
##$ZL3= 120
##$ZL4= 120
##$ABSF1= 16.522
##$ABSF2= -4.171173
##$ABSG= 5
##$ABSL= 3
##$ALPHA= 0
##$AQORDER= 0
##$ASSFAC= 0
##$ASSFACI= 0
##$ASSFACX= 0
##$ASSWID= 0
##$AUNMP= <proc_1d>
##$AZFE= 0.1
##$AZFW= 0.1
##$BCFW= 0
##$BC_mod= 0
##$BYTORDP= 0
##$COROFFS= 0
##$CY= 12.5
##$DATMOD= 1
##$DC= 0
##$DFILT= <>
##$DTYPP= 0
##$F1P= 14.0000005364418
##$F2P= -0.99999901652339
##$FCOR= 0.5
##$FTSIZE= 32768
##$FT_mod= 6
##$GAMMA= 0
##$GB= 0
##$INTBC= 1
##$INTSCL= 1
##$ISEN= 128
##$LB= 0.3
##$LEV0= 0
##$LPBIN= 0
##$MAXI= 10000
##$MC2= 0
##$MEAN= 0
##$ME_mod= 0
##$MI= 0
##$NCOEF= 0
##$NC_proc= -3
##$NLEV= 6
##$NOISF1= 0
##$NOISF2= 0
##$NSP= 0
##$NTH_PI= 0
##$NZP= 0
##$OFFSET= 16.522
##$PC= 1
##$PHC0= 144.1348
##$PHC1= 7.797874
##$PH_mod= 1
##$PKNL= yes
##$PPARMOD= 0
##$PSCAL= 4
##$PSIGN= 0
##$REVERSE= no
##$SF= 250.13
##$SI= 32768
##$SIGF1= 0
##$SIGF2= 0
##$SINO= 400
##$SIOLD= 32768
##$SREGLST= <1H.CDCl3>
##$SSB= 0
##$STSI= 32768
##$STSR= 0
##$SW_p= 5175.98343685301
##$SYMM= 0
##$S_DEV= 0
##$TDeff= 65536
##$TDoff= 0
##$TI= <Analysis number 999999
Compound Code 99
Book Reference 9
Project Code 9>
##$TILT= no
##$TM1= 0
##$TM2= 0
##$TOPLEV= 0
##$USERP1= <user>
##$USERP2= <user>
##$USERP3= <user>
##$USERP4= <user>
##$USERP5= <user>
##$WDW= 1
##$XDIM= 32768
##$YMAX_p= 486672834
##$YMIN_p= -131235
$$ End of Bruker specific parameters
$$ ---------------------------------
##NTUPLES= NMR SPECTRUM
##VAR_NAME=  FREQUENCY,     SPECTRUM/REAL,   SPECTRUM/IMAG
##SYMBOL=    X,             R,               I
##VAR_TYPE=  INDEPENDENT,   DEPENDENT,       DEPENDENT
##VAR_FORM=  AFFN,          ASDF,            ASDF
##VAR_DIM=   32768,         32768,           32768
##UNITS=     HZ,            ARBITRARY UNITS, ARBITRARY UNITS
##FACTOR=    0.157963299565203, 1,           1
##FIRST=     4132.6476996994, 0,             0
##LAST=      -1043.33573715361, 0,           0
##MIN=       -1043.33573715361, -131235,     0
##MAX=       4132.6476996994, 486672834,     0
$$ Real data points
##PAGE= N=1
##DATA TABLE= (X++(R..R)), XYDATA
$$ [...]
18478B197358m3804m8399o3468n2814o0193m3677k9775n3765n3439o4653o3842
18467A619529o7956p1117r3971p5817m5610l4232m1179l8164o491J3093j8574
18456A139511k6894m1809j9618k1937l5976m5549o8372m1478j6215j4709k8048
18445G78906k8624k6865r011r51J349r57k8715k0067J194p853j4287p459p690
18432F28970j3974K938R56q857J1931L060O75P987O279Q778K3704K952L185K2088
18418G00672r030k8439l5729j9400l5232o6768m3145j4394k2424k2734M721K8981
18406D37079K2677O58k2110l6228M476L475Q65m3536m8422j7032k1557O827j438
18393B85734O264J7843Q483K9050L1468M5492L8283L9164M9225M6110O644L281
$$ plain form
18478 2197358 2153554 2105155 2041687 1988873 1928680 1885003 1855228 1801463 1748024 1683371 1619529
18467 1619529 1551573 1480456 1386485 1310668 1265058 1230826 1189647 1151483 1144992 1158085 1139511
18456 1139511 1112617 1070808 1051190 1029253 993277 947728 879356 837878 821663 806954 778906
18445 778906 750282 723417 714406 713455 714804 713847 685132 665065 666259 658406 644119 636660 628970
18432 628970 614996 617934 618890 610033 621964 625024 625699 633686 639965 648743 672447 675399 678584 700672
18418 700672 691642 663203 627474 608074 572842 506074 462929 448535 426111 403377 408098 437079
18406 437079 459756 460414 438304 402076 406552 410027 410892 367356 318934 301902 280345 287172 285734
18393 285734 291998 309841 318324 347374 378842 424334 462617 501781 551006 597116 603760 607041
18381F07041n955K190k1852l6950m9862n8570l5597k0155l5072j1846K5800J4939
18369C74111K5979M9003N3826L9627L3061L3492M8153J6882J2576j8277l0734
18358F37699m0574m0802p3596l9241m2037m3707k7734k1440J810j5713j5691j3317
18346B65657K096Q727L685k011k4838K237J2725J143j176j2804j4412r905J0880
18333B42004J1287P132n22j0972k0871p755m264j791K611q433j6709j8044J623
18320A75296K2331R408Q806n547j3005j2703L66Q2O001L8331M175j8740O428k83
18306B20946j341M955K7735O909q394l936j117J4928K7014L8847K7190L5299J7213
18293D06248N8881M6303R358J1597J2784J6993J8627J6858J6980q186P622K0432
$$ plain form
18381 607041 601086 603276 581424 544474 494612 436042 400445 380290 345218 333372 359172 374111
18369 374111 400090 449093 502919 542546 575607 609099 657252 674134 686710 668433 637699
18358 637699 597125 556323 482727 443486 401449 357742 330008 308568 310378 294665 278974 265657
18346 265657 267753 276480 280165 278154 253316 255553 268278 269421 268245 255441 241029 231124 242004
18333 242004 253291 260423 259901 248929 228058 220303 216039 214248 216859 208426 191717 173673 175296
18320 175296 197627 207035 215841 210294 197289 184586 184952 185034 191035 229366 233541 214801 221229 220946
18306 220946 219605 224560 252295 259204 250810 246874 245757 260685 287699 326546 353736 389035 406248
18293 406248 465129 511432 520790 532387 545171 562164 580791 597649 614629 606443 614065 634497
18281F34497O055j5345o769q028r193j8313k8292n999k4339l7392m4956l5098
18269D06828j7926k8235m9278m0009l6387m086j182r242j0912n913J0917N791
18257B20366j4741j4325q083J0169j7830J1452R328j1527j434M72j3578J667j404
18244A70532o128M914Q513k364P435K775J7191K0342P870q367p533l4712k5933
18231A54535J064L83R744J8689K682R17R81m339L676J514k1868K913J1717j0000
18217A72608j3036j6471j5081M386N411o059P967J1815k4600n211p51m268k3607
18204I3103j6415J1659L0905J2819j169J4709J3931O053L7L242j3649L978K4794
18191A83997Q989J498J458R81k218J2359K4200p690O791k964j8611K374J3517
$$ plain form
18281 634497 640552 625207 618438 610410 601217 582904 554612 548613 524274 486882 441926 406828
18269 406828 388902 360667 311389 271380 234993 230907 229725 220483 209571 203658 214575 220366
18257 220366 205625 191300 183217 193386 175556 187008 196336 184809 183375 183847 170269 171936 170532
18244 170532 164404 169318 177831 175467 182902 185677 202868 223210 231080 222713 215180 180468 154535
18231 154535 155599 155982 165726 184415 187097 188014 188995 184656 188332 189846 167978 170891 182608 172608
18217 172608 159572 143101 128020 132406 137817 131758 139725 151540 126940 121729 120978 116710 93103
18204 93103 76688 88347 119252 132071 130902 145611 159542 165595 165632 168874 155225 159203 183997
18191 183997 192986 194484 195942 196923 194705 207064 231264 223574 230365 227401 208790 211164 224681
18178B24681K3549J3221n985J6242k204k1070M442N198j8526j0224L757n115L991
18165B31957K2233K209l2009l5004r176R231Q178j0952K0456J6051l694J0806
18153B30286J9874P134P999J2314M7957K8194K4283J0265K9766K6011j960J1631
18141D53754O108J7089K0546J0612K02R340J1549L1039L0040J0134k0904R942
18129E89451R543K4880K9808O0581N7736P0718P3462R9491J24051J62519K20524
18118A522764K98092M74203P88951J350102K122023K481009J925639J043157J085628
18109A3091568J318538J011008O20841n02023l107708l785073k429080j457328
18101D760743r44256o40990m47159l17634k19192j66983j33178j20234p7011q6102
$$ plain form
18178 224681 248230 261451 255466 271708 269504 248434 252876 258074 239548 229324 233081 227966 231957
18165 231957 254190 256399 224390 189386 180210 189441 197619 186667 207123 223174 219480 230286
18153 230286 250160 257294 265293 277607 325564 353758 378041 388306 418072 444083 442123 453754
18141 453754 459862 476951 497497 508109 508311 517651 529200 560239 590279 600413 579509 589451
18129 589451 598994 623874 653682 714263 771999 842717 916179 1015670 1139721 1302240 1522764
18118 1522764 1820856 2295059 3084010 4434112 6556135 9037144 10962783 12005940 13091568
18109 13091568 14410106 15421114 16041955 15539932 12432224 8647151 6218071 4760743
18101 4760743 3816487 3175497 2728338 2410704 2191512 2024529 1891351 1771117 1694106 1608004
18091A608004p1571q1334o1097n2869o7258o7128m5406l9040k5061j1805k3715
18080A061720j0637K38R477L5674K5075j4441N786J9311L137m4473n4359n1409
18068I85099n5483o3348m3988k1147l8586j9941l757J0343k0416m563J3581R511
18056G47305K9950J108r871J481j974j6243j8701j3245j0668J9779M0499J6929
18044G86349K3858K7859K2425M6506L8619N762k5734j6380P861k5184m81P307
18032H98767j7650M707J7736K8274L5214J8776L5076K9106R359N409P134k3278
18020A048630m1415o2932o1199m5208m2102n0470o2960o9500p2973m4396k4255
18009D71220r652m450L795L355N09K911J4859K5844Q187J8679J0137J0195j9712
$$ plain form
18091 1608004 1536433 1455099 1394002 1341133 1273875 1206747 1161341 1122301 1097240 1085435 1061720
18080 1061720 1051083 1051321 1060798 1096472 1121547 1107106 1112892 1132203 1135340 1090867 1036508 985099
18068 985099 929616 866268 822280 801133 762547 742606 738849 749192 728776 724213 737794 747305
18056 747305 777255 778363 768492 769973 767999 751756 733055 719810 709142 728921 769420 786349
18044 786349 810207 838066 860491 906997 945616 951378 925644 909264 917125 891941 891460 898767
18032 898767 881117 885824 903560 931834 967048 985824 1020900 1050006 1059365 1064774 1071908 1048630
18020 1048630 1007215 944283 883084 837876 795774 745304 682344 612844 539871 495475 471220
18009 471220 461568 457118 460913 464268 464777 467688 482547 508391 516578 535257 545394 555589 535877
17996E35877j2027O383K5512J9008N20N660J9108j0951p293q81j4062k9779k4637
17983E12438k5963l792J1076o530j0900k1158j0096j4898l0613j5595j9435k2339
17971C42195l8487k1990j3841k2181l1785j3969J675J1458k167K165m531m349
17959B04193o304K746m739p277j0024n247j5201J1979j2241m279J4158r977L450
17946A61237J2957j6326j3407p203J8932N278K84J4057J3874O258K4520M1408
17934B61869K5861K385O988l1694k9623n408J5400J9035L190N906J3157j0245
17922B76821j645L281j5721Q52J4664J6290K1150L6877L7941L5383m934l0713
17910C90246k616j3398r719K5683N330j827J5060J1371K4681P201j5513L591J1054
$$ plain form
17996 535877 523850 530233 555745 574753 575273 580933 600041 589090 581797 580916 566854 537075 512438
17983 512438 486475 482683 493759 487229 476329 455171 445075 430177 399564 383969 364534 342195
17971 342195 303708 281718 267877 245696 213911 199942 201617 213075 210908 213073 208542 204193
17959 204193 197889 200635 195896 188619 178595 173348 158147 170126 157885 153606 167764 157787 161237
17946 161237 174194 157868 144461 137258 156190 161468 161752 175809 189683 195941 220461 261869
17934 261869 287730 290115 297103 265409 235786 230378 245778 264813 268003 273909 287066 276821
17922 276821 275176 278457 262736 263588 278252 294542 315692 352569 390510 425893 420959 390246
17910 390246 387630 374232 364513 390196 395526 393699 408759 420130 444811 452012 436499 440090 451144
17897D51144o432J9743K2350K103j985j0800p845o075k9969j2526K8065J0421
17885D58194L1066J1278J754R114K0644K4114j3584j1027J3175O799l313N524
17873E53738J9649K3383J2899p552Q225J210O15J2110J6665m673k008j0241J5538
17860F39558K3764J4505J3722J0844M2832L8917L8329L8272M6983L2202K8276
17849I68204L5283K4426M0339K5109J1868L5799L5486M6323Q2128J04320J06193
17838A515478J41794J64612J98491K14570K11953K29645J87417J67294J65902
17829C197156J67402J73473K06425J99459K35198L10025M30368N76185P96361
17820F292052J123349J560539K235341L311159M892895O867106Q606142R395409
$$ plain form
17897 451144 444712 464455 486805 488908 486923 476123 468278 462203 432234 419708 447773 458194
17885 458194 489260 500538 502292 511406 532050 556164 542580 531553 544728 551527 548214 553738
17873 553738 573387 596770 609669 602117 610342 611552 612167 624277 640942 636269 634261 624020 639558
17860 639558 663322 677827 691549 702393 745225 784142 822471 860743 907726 939928 968204
17849 968204 1003487 1027913 1068252 1093361 1105229 1141028 1176514 1222837 1304965 1409285 1515478
17838 1515478 1657272 1821884 2020375 2234945 2446898 2676543 2863960 3031254 3197156
17829 3197156 3364558 3538031 3744456 3943915 4179113 4489138 4919506 5495691 6292052
17820 6292052 7415401 8975940 11211281 14522440 19415335 26282441 34888583 44283992
17812D4283992Q982848P857074O652191N494914L834051Q57821l478717p881516
17804F6602658j0535688j0552520q449732n656365l223166j235017N50204K539065
17796C0039439M894869P490365R818824J1195984J1438595J0975690J0223223
17789I6076989R321450Q047161N572592J380416l386661o748401p650459o023371
17781I6589716l156885j249304j216253k018590k246925j113954P07628J419919
17773H7715352M74002r19436j754571j687747j216078j746814l625110n602612
17765G1636986o678054o629067n973423n833166o271028o103037m962608l668826
17757B5517777k715836k092576j637567j300003j091862r42409q52409q02243
$$ plain form
17812 44283992 53266840 61123914 67776105 73271019 77105070 77962891 74484174 66602658
17804 66602658 56066970 45514450 37064718 31408353 28185187 26950170 27500374 30039439
17796 30039439 34934308 42424673 52243497 63439481 74878076 85853766 96076989
17789 96076989 105398439 113445600 119018192 120398608 117011947 110263546 102613087 96589716
17781 96589716 93432831 92183527 90967274 88948684 86701759 85587805 86295433 87715352
17773 87715352 88189354 87269918 85515347 83827600 82611522 80864708 77239598 71636986
17765 71636986 64958932 58329865 52356442 46523276 40252248 34149211 29186603 25517777
17757 25517777 22801941 20709365 19071798 17771795 16679933 15737524 14885115 14082872
17749A4082872p35439o69636o21259n97651n45394m83912m43871m13871l84805
17740I187034l22236l20373l14091k96102k89493k92949k70657k42025k39059
17731F600049k30330k11756j92593k09309k02956j62079j63528j71714j55903
17722D899881j47076j35821j18280j17029j24610j14283j01807j22492j18454
17713C800029r8696j05592j15870j23421r0412p0611j01624q6974q5820p6705
17703B844304p0522o0061n4855m8695l6520m4377o0523n2207k9759m9231m4655
17692B292899m8840m0545m3347n0563l4211j5383j3697l878m966j6764k5414m2914
17680A952377n5274q6999j34383j34559j07608p3697o9494n1896k9404l2953p3056
$$ plain form
17749 14082872 13347433 12677797 12056538 11458887 10913493 10429581 9985710 9571839 9187034
17740 9187034 8864798 8544425 8230334 7934232 7644739 7351790 7081133 6839108 6600049
17731 6600049 6369719 6157963 5965370 5756061 5553105 5391026 5227498 5055784 4899881
17722 4899881 4752805 4616984 4498704 4381675 4257065 4142782 4040975 3918483 3800029
17713 3800029 3701333 3595741 3479871 3356450 3266038 3195427 3093803 3006829 2921009 2844304
17703 2844304 2773782 2713721 2658866 2610171 2573651 2529274 2468751 2416544 2386785 2337554 2292899
17692 2292899 2244059 2203514 2160167 2109604 2075393 2060010 2046313 2042435 2037469 2020705 1995291 1952377
17680 1952377 1897103 1810104 1675721 1541162 1433554 1359857 1290363 1238467 1209063 1176110 1103054
17669A103054q6032m1270k0864k7695j5099J2940R693J03K2392O253l0329o1704
17657H71442n8682n4342l5235k0100P921M481k2579j1307O543R91j1994j7369
17645F59770j2152Q39R072j924j2635l149r069O457n305k0730k5299n569L829
17632E84135j2594l465O180r043j8242r140K7571l941l7074j4589K280N610J4069
17619E31757K3513K6176k207j2681j21J7180L1301P295q70j166m873J9563J0113
17606F44980n152K830k4160l9474k6234J3810J3505j4236r635J3346N81K2039
17594E92200L5654M68J1419J3899j894J6928K9073K1440R882O955J835j621p448
17581G28790K2838L5254J2102K1161N2789O5516P1200O2574O6134O2404P6221
$$ plain form
17669 1103054 1017022 975752 954888 927193 912094 925034 934727 934830 957222 963475 933146 871442
17657 871442 812760 758418 723183 703083 711004 715485 692906 681599 688142 689133 677139 659770
17645 659770 647618 648457 657529 655605 642970 639821 630752 637209 631904 611174 585875 580306 584135
17632 584135 571541 568076 574256 565213 546971 537831 565402 561461 524387 509798 512078 517688 531757
17619 531757 555270 581446 579239 566558 566437 583617 614918 622213 621343 620177 615304 634867 644980
17606 644980 639828 642658 618498 579024 552790 566600 580105 565869 556234 569580 570161 592200
17594 592200 627854 628322 639741 653640 651746 668674 697747 719187 729069 736024 737859 736238 728790
17581 728790 751628 786882 798984 820145 872934 938450 1009650 1072224 1138358 1200762 1276983
17570A276983O7892N9924N6708P6705R4262J41337J74438J65428J98322K36239
17560B548238K56750L07069M05885N12590O66528R46669J429753K273432L618840
17551A2965754N331619O504524O006591M353816L559558L772533L480948K413567
17543D8388910Q3983m277568o787170m390628m26335K235897K707709J869654
17535C9404452J697568K110551J855654Q25135j623472n932800q399344o985801
17527B2951943m720731l202305k220523j540013j120594q35941o32036m65445
17519H214355l63060k88313k23189k00198k50852k45357k08685j44892p2118l5888
17509F181803n967K4329N8899J11524J84055K88728M75086P65318J269846K092564
$$ plain form
17570 1276983 1344875 1404799 1461507 1538212 1632474 1773811 1948249 2113677 2311999 2548238
17560 2548238 2804988 3112057 3517942 4030532 4697060 5643729 7073482 9346914 12965754
17551 12965754 18297373 24801897 30808488 35162304 38721862 42494395 45975343 48388910
17543 48388910 48472893 44195325 37408155 33017527 32591192 34827089 37534798 39404452
17535 39404452 41102020 43212571 45068225 45893360 44269888 38337088 29937744 22951943
17527 22951943 18231212 15028907 12808384 11268371 10147777 9311836 8679800 8214355
17519 8214355 7851295 7562982 7339793 7139595 6888743 6643386 6434701 6289809 6217691 6181803
17509 6181803 6175836 6200165 6259064 6370588 6554643 6843371 7318457 8083775 9353621 11446185
17499A1446185L370547M931015N794343N097268L614998L124419L299124K885697
17491D3563596J844951n84502m613424o065324l333982J81701K260686K369462
17483C5623164J567746J550611J894550J512514M36295k119625o159235p742114
17475B6563906o061201m058414k770829j937494j408210j034645p81602o00377
17467G911134m93848m11141l35220k50413k48436k77609k87342k70394k69104
17458E067627k28167j98817k10600k09093j71512j48612j48414j55147j46090
17449C451175j47094j23872j15142r5210j21384j05555o4140o1215n8361o3560
17439B495642q5258q8645p9062n3116l1376j3989L160L1477o28l234J3982K2137
$$ plain form
17499 11446185 14816732 19747747 25542090 30639358 34254356 37378775 40677899 43563596
17491 43563596 45408547 44824045 40210621 34145297 30811315 30993016 33253702 35623164
17483 35623164 37190910 38741521 40636071 42148585 42584880 40465255 34306020 26563906
17475 26563906 20502705 16444291 13673462 11735968 10327758 9293113 8511511 7911134
17467 7911134 7417286 7006145 6670925 6420512 6172076 5894467 5607125 5336731 5067627
17458 5067627 4839460 4640643 4430043 4220950 4049438 3900826 3752412 3597265 3451175
17449 3451175 3304081 3180209 3065067 2969857 2848473 2742918 2678778 2617563 2559202 2495642
17439 2495642 2410384 2321739 2242677 2189561 2158185 2144196 2147356 2178833 2178205 2174971 2188953 2211090
17427B211090J6504N797m0853o8835p8829o3852m2387n0049n7240r1896j21036
17416A618414r9455q7295p0644l9300j5163p139j2460j5903J4228K6788J0467
17405A322538o625m9863o9578p4342m9292n3767n5075n3850n5254n4625m0990
17394G59277l0507k3199j4792N214j3567j9365l9463j8906j1202k0689m0546l2998
17382D99257k437j4088j6229j2428k3972j3747M458k1760p865j8188O965j71o965
17369C72830l636o203j2740J7688J0114n711k8769l3510l2147o871q789j7854
17357B44402P027L1870J6023J4679O097j331k2760l7206l1236J034r484o177j3327
17344A99611j0835O36l470k3208j2275J390K1467K095R170K0751L309L054j646
$$ plain form
17427 2211090 2227594 2233391 2192538 2123703 2044874 1981022 1938635 1888586 1831346 1739450 1618414
17416 1618414 1518959 1431664 1361020 1321720 1306557 1299418 1286958 1271055 1285283 1312071 1322538
17405 1322538 1315913 1266050 1196472 1122130 1072838 1019071 963996 910146 854892 800267 759277
17394 759277 728770 705571 690779 695993 682426 663061 623598 604692 593490 572801 532255 499257
17382 499257 496820 482732 466503 454075 430103 416356 420814 399054 391189 373001 379966 379795 372830
17369 372830 369194 362991 350251 367939 378053 372342 343573 310063 277916 271045 262256 244402
17357 244402 251429 283299 299322 314001 320098 318767 296007 258801 227565 228599 219115 212938 199611
17344 199611 188776 189412 185942 162734 150459 151849 173316 175411 184581 205332 208641 211695 210049
17331B10049N00m700j213p86o608J2699o775j2282k0556L661K6553K6071k7694
17318A98919k4475m787P186N259j1210j4111j947J5296K3505L131k8667j6205
17306A51894l198j9624J6040J0304J639k2281j7721r897n546J3183O672o068j2256
17293A03141K21K958q790j2081K132N461Q873J1424K153J1561J3460J6091N477
17280A62081K173K2328J7420J2494J0190K5366M1415N8983N0499K9726J6866J5372
17268D64913J0963M0723J4282j0436k3435J5183n788j3896k234m865j2942K61
17256D72729L708k9593k3815j8710n6802l7549j5639p885k8938m7672k1378j1942
17244A76514j5748j7663o836J1412J0839j1455N183J6852L4290J4209Q302N2751
$$ plain form
17331 210049 210549 205849 204636 203850 197242 209941 203166 190884 170328 173989 200542 226613 198919
17318 198919 174444 169657 176843 182102 170892 156781 154834 170130 193635 196766 168099 151894
17306 151894 148696 129072 145112 155416 157055 134774 117053 107156 101610 114793 121465 115397 103141
17293 103141 103362 106320 97530 85449 87581 93042 101915 113339 115492 127053 140513 156604 162081
17280 162081 164254 186582 204002 216496 226686 252052 293467 352450 402949 432675 449541 464913
17268 464913 475876 516599 530881 520445 497010 512193 506405 492509 490275 485410 472468 472729
17256 472729 476437 446844 423029 404319 347517 309968 294329 286444 257506 209834 188456 176514
17244 176514 160766 143103 136267 147679 158518 147063 152246 169098 203388 217597 225899 278650
17232B78650M4890K4478K4530L1200L4694O941m225m0695m8720l8981n3700n8709
17220B00353l7633L433j0358r666M3021M8920J0622L7796O3876M4098L3261L4739
17208D62462K7089K984k5276l4580n0520p6384n4029k5879l3076k5920j7686j7224
17196A31961j6580O824P313j6449j688Q437j0578P095L822j3132j6219J3773o106
17183I8473j810m266j033j6068p591j0908R68K3488j4143r129j6048L028l497
17170D1464K2219m121l682R058o857n237k0318k5063j0733K4315J9183N301p947
17157C7582J825r441Q565R509j2605p16P942k808K0526O258j4691k0391J0799
17144D2354J5141J8501k672L334j2067n480J1880j0614q592m61J6203K2116l031
$$ plain form
17232 278650 323540 348018 372548 403748 438442 445383 441158 400463 351743 312762 259062 200353
17220 200353 162720 166153 155795 146129 189150 238070 248692 286488 350364 394462 427723 462462
17208 462462 489551 492535 467259 432679 382159 305775 251746 225867 192791 166871 149185 131961
17196 131961 115381 122205 129518 113069 111381 119818 109240 116335 120157 107025 90806 104579 98473
17183 98473 96663 92397 91364 75296 67705 56797 57765 81253 67110 57981 41933 44961 41464
17170 41464 63683 59562 55880 64938 58081 52844 32526 7463 -3270 21045 40228 45529 37582
17157 37582 39407 29966 38531 48040 35435 34719 42661 39853 60379 66637 51946 31555 42354
17144 42354 57495 75996 73324 76658 64591 59111 70991 60377 51785 51324 67527 89643 86612
17131H6612q55j4164j5623M714J0566J4748j3562k6141n706L758J2432J0704N824
17118G3307r142o191Q847K4999K9537R299J4347o973l3529j1909L121P123q937
17105I3899k5794l61o270r113K0523L374P393J3873L852p059J4771j5161l3269
17092F0658j7530P84J3445k335m743n836J2116k589k4457K82J7280o698L632K5836
17078F9845K713j0516L00J7839J0760m672k6865j2238j3027l774N260K0196K6513
17065H2334R527j7933j9726k4225p509J0845K1264K4040m965k1773j3329J4813
17053E3363J581J0008R168O44k3236j1845j807q875O8N474J3059m184R274j688
17039E1004M797K7974L8151J8171K6525M1578J0316J7669K5540O628j5841j9733
$$ plain form
17131 86612 85757 71593 55970 60684 71250 85998 72436 46295 40589 44347 56779 67483 73307
17118 73307 64165 57974 66821 91820 121357 130656 145003 138030 104501 92592 95713 102836 93899
17105 93899 68105 67744 61474 52361 72884 76258 83651 97524 101376 94317 109088 93927 60658
17092 60658 43128 43912 57357 55022 50279 44443 56559 53970 29513 29795 47075 40377 44009 69845
17078 69845 72558 62042 62342 80181 90941 86269 59404 47166 34139 30365 35625 55821 82334
17065 82334 91861 73928 54202 29977 22468 33313 54577 78617 73652 51879 38550 53363
17053 53363 54944 64952 74120 74764 51528 39683 37876 29001 29069 34543 47602 43418 52692 51004
17039 51004 55801 83775 121926 140097 166622 208200 218516 236185 261725 268353 252512 232779
17027B32779k6964o224q760J4736K3864J4133m45L8791J8820J4902k3938l6399
17015B55295k3899m7421k7928j5267p443k515M282J566J9809J2763P080j7766
17003A58556o063o55P856Q194M366r45j8285R465j4378j7845k122K1930K4972
16990A75046n241J4302L9764L4830J2272J1752P560K0604L6947K3227J3735K6002
16978D10800L641p205k881j7516k3039K758L1356N007L067J4626n51K087K6440
16965D48590J6531j2980l3906k8102l1089k9977k0277j0709o580q320j00K5438
16953C08519J0987r87j820j2074r280J7224K1054R419l260R605J2013k1058p278
16940C33064J05P386L7603K7805J3728j0398J749R787R76L055J1132m190K0496
$$ plain form
17027 232779 205815 199591 190831 205567 229431 243564 243119 281910 300730 315632 291694 255295
17015 255295 231396 183975 156047 140780 133337 130822 135104 136670 156479 169242 176322 158556
17003 158556 152493 151838 159694 167888 172254 171309 153024 162489 148111 130266 128144 150074 175046
16990 175046 169805 184107 223871 258701 270973 282725 290285 310889 347836 371063 384798 410800
16978 410800 414441 407236 404355 386839 363800 366558 397914 402921 405988 420614 420063 422150 448590
16965 448590 465121 452141 418235 390133 359044 329067 308790 298081 291501 283181 283081 308519
16953 308519 319506 318519 316699 304625 295345 312569 333623 343042 339782 349387 361400 340342 333064
16940 333064 333169 340555 378158 405963 419691 409293 411042 420829 421805 424860 435992 431802 452298
16927D52298L4770K7177J3261J6848M0790K6769L1344J4999J2152J2373K3099
16916G05880J7409J4664K5977L3500M2379N8189O4190O8284Q0612O3398N5851
16905A230333J04632J71197J88691J78161J42834J70478K31275K63242K59470
16896B940313K45438K51959L06387M15322N19023O55658Q15344J117353J663124
16887H929921K611804M043264N667589O604114O121502N287685N782649P207240
16879E2255768P958776O936156K901492k710581m801849l317821k017020k139044
16871E5065877m464720p695775p705405m828345j688717J146920L549012M759387
16863C8138234M485137M073132N000450O399175O892154N443252J014690m030461
$$ plain form
16927 452298 487068 514245 527506 544354 585144 611913 643257 658256 670408 682781 705880
16916 705880 723289 737953 763930 797430 839809 897998 962188 1030472 1111084 1174482 1230333
16905 1230333 1334965 1506162 1694853 1873014 2015848 2186326 2417601 2680843 2940313
16896 2940313 3185751 3437710 3744097 4159419 4678442 5334100 6149444 7266797 8929921
16887 8929921 11541725 15584989 21252578 27856692 33978194 39265879 45048528 52255768
16879 52255768 60214544 67150700 70052192 67341611 62539762 59221941 57204921 55065877
16871 55065877 50601157 42905382 35199977 30371632 28682915 29829835 33378847 38138234
16863 38138234 42623371 46696503 51696953 58096128 64988282 70431534 71446224 67415763
16855F7415763n135400l550447k566853l152507n888613q767931q332976n971462
16847B4049574m063042k817261j999290j459065j078550q59533p77313o70764
16839A0324756n38233m82095m41186m31668m09175l78242l30168l14695k90519
16830F708775k77842k41951k54648k63132k50105k24349k09209j98033j99527
16821D589979k33364k22878j85720j59858j63059j51999j23129j03424q2470q9243
16811C074835q3070p8217r1437q4545p3425o4555p4193r6824p2392n6349p1439
16800B228389r0634m9034k7971p2099j05356p5045m1250l6201o0454n2590m9828
16789A567927n7233m8058n0784m4461l8311k7901j6983m6237m4525l3065l8636
$$ plain form
16855 67415763 62280363 58729916 56163063 53010556 47121943 38354012 30021036 24049574
16847 24049574 19986532 17169271 15169981 13710916 12632366 11772833 10995520 10324756
16839 10324756 9786523 9304428 8863242 8431574 8022399 7644157 7313989 6999294 6708775
16830 6708775 6430933 6188982 5934334 5671202 5421097 5196748 4987539 4789506 4589979
16821 4589979 4356615 4133737 3948017 3788159 3625100 3473101 3349972 3246548 3164078 3074835
16811 3074835 2991765 2913548 2822111 2737566 2664141 2599586 2525393 2428569 2356177 2299828 2228389
16800 2228389 2137755 2088721 2060750 1988651 1883295 1808250 1767000 1730799 1670345 1617755 1567927
16789 1567927 1510694 1462636 1411852 1367391 1329080 1301179 1284196 1237959 1193434 1160369 1121733
16778A121733o952j6472k3758k4386k1595n8849l3017j2296k4471j9275l5612
16767H45050n4803m4155m4286k0892j6165j4202r17j0549l3891j9284N964N547
16755E97417j6144j3245L817J6896o886n0545n6261j7203J1063j7095k8145k3049
16743D00620m8521j9988j5049j3151k7298p905P203k1474n409K2801J6260K6641
16731C14730K0639k283l2613j6778p425J0731L645o41l3515k0729j527j802N011
16718B37443q383L902k825j1937j2258Q14R448p801k1615q309J8735O598p949
16705A95863o800p491J0014K2203j3894Q344Q800l349j6599o465N914j8418k2029
16692A56093J3988j0176N547l2258j1411J112J5162J1221k472R83J6217J5267
$$ plain form
16778 1121733 1114781 1098309 1074551 1050165 1028570 969721 936704 924408 899937 880662 845050
16767 845050 790247 746092 701806 680914 664749 650547 649630 639081 605190 585906 591870 597417
16755 597417 581273 568028 571845 588741 581855 531310 475049 457846 468909 451814 423669 400620
16743 400620 352099 332111 317062 303911 276613 268708 275911 254437 249028 271829 288089 314730
16731 314730 335369 333086 300473 283695 276270 287001 290646 290005 256490 235761 234234 232432 237443
16718 237443 229060 232962 230137 218200 205942 206756 216204 208403 186788 178479 197214 203812 195863
16705 195863 189063 181572 191586 213789 199895 208239 217039 213690 197091 190626 196540 178122 156093
16692 156093 170081 159905 165452 133194 121783 122895 138057 149278 146806 147789 164006 179273
16680A79273j0275k2212p74M710j5857j8166p809r78p364O722P415j7268N223
16667A02640L502k107Q024M455o453j1986J710M660J5050M761J0544J516k0366
16654A15950r922o821j5236J6733P077m766m518n411J0087K775r941P238q079
16641I5166n835k5404k770K0190K3079L543n700k9220j6579R152J7028K228J89
16628H5067q769r07m163j1706J6062K519j4796m642o565j7162j7681j193J4706
16615C0770K883P03j0741j8996q784K7170J7905K882j1027n155o248r012Q073
16602B0423k727K206P290Q433j449n466m551r22N7M335r423j174j849P204R29
16587B3316q189N548j2016k8026j4818K875R997R102L3317J6573Q748k0849j7199
$$ plain form
16680 179273 168998 146786 146012 150722 134865 116699 108890 107912 100548 107270 114685 97417 102640
16667 102640 106142 104035 112059 116514 110061 98075 99785 104445 119495 124256 134800 136316 115950
16654 115950 106028 99207 83971 100704 107781 103015 98497 93086 103173 105948 96007 103245 95166
16641 95166 89331 63927 61157 81347 104426 107969 102269 73049 56470 65622 82650 84878 85067
16628 85067 76298 75391 71228 59522 75584 78103 63307 58665 52100 34938 17257 16064 30770
16615 30770 33653 34356 23615 4619 -4165 23005 40910 43792 32765 27610 21362 12350 20423
16602 20423 17696 19902 27192 35625 34176 28710 24159 23237 23294 27629 18206 17032 15183 22387 23316
16587 23316 15127 20675 8659 -19367 -34185 -31310 -21313 -12211 21106 37679 46427 25578 8379
16574H379K41Q944K891R457N471j7043j8780o792Q934N48j5682J480Q209m642
16560h385l90J1052J0491p779Q527J0075j3016j8592k1400j5059k953J0416J1725
16547b5288L3661o007j1219q022J0111J3994q940k33j528Q648r539m729K02J6208
16533G319O009k208l056j2482r646J826l06J7771K8547J248j6463m941R994J0340
16519C3952k3181k2635J7251J7955K6288J0426k5084j5902k805j7927k277N157
16507A218r246O278J6596J33J4109O458j1598j9071p726M439P942J7379j5991
16494A0920k3201L358J2728L212L774q60J6688j10j5180j1227r303j0246J126
16481a8321j129l933J8535n820j6115K363J0297R519L299j0341Q099R645n377
$$ plain form
16574 8379 8620 17564 20455 29912 35383 18340 -440 -7232 1702 2250 -13432 -11952 -3743 -8385
16560 -8385 -8775 2277 12768 4989 13516 23591 10575 -8017 -29417 -44476 -47429 -37013 -25288
16547 -25288 8373 2366 -8853 -16875 -6764 7230 -1710 -1943 -3471 5177 -4362 -9091 -8889 7319
16533 7319 13328 11120 8064 -4418 -14064 -12238 -12544 5227 33774 35022 18559 13618 23612 33952
16519 33952 10771 -11864 5387 23342 49630 60056 34972 19070 16265 -1662 -3939 1218
16507 1218 -8028 -1750 14846 14979 29088 35546 23948 4877 -2849 1590 9532 26911 10920
16494 10920 -12281 -8923 3805 7017 10791 9931 26619 26509 11329 102 -9201 -19447 -18321
16481 -18321 -19450 -23383 -4848 -10668 -26783 -24420 -14123 -4604 -1305 -11646 -3547 6098 721
16468G21j3435j1293O536O731L716J566J755J0651n444j2456j5405O894J1404
16455h059o434m971M982O187N158J1186p418j0713J3410o791K1247J1988r871
16442A9901m70n517j1363J9942O227j2184j0790j5626QO662J3756l391k072q326
16428c243O202m878j8522n720k303q233J8731J9080l818P120q435j2927O577J2947
16414B578j0932L690J4695l43j5789L706Q414kK299k896m536R476j180p022k914
16399g56r749m6K412m138J042J0516o803J8589k5255k2477m220J0175K1646J7603
16385H539K503j1811j0773j2313R023J3862Q62J6347K304j4607j8788J8514m941
16372a279o774m912J4539K991J122j691O870R992q588J0887O190N8j0103O012
$$ plain form
16468 721 -12714 -24007 -17471 -10740 -7024 -5458 -3703 6948 1504 -10952 -26357 -19463 -8059
16455 -8059 -14493 -19464 -14482 -8295 -3137 8049 631 -10082 3328 -3463 17784 29772 19901
16442 19901 19431 13914 2551 22493 28720 16536 5746 -9880 -9872 -3210 10546 7155 5083 -3243
16428 -3243 2959 -1919 -20441 -26161 -28464 -36697 -17966 1114 -2704 4416 -4019 -16946 -10369 2578
16414 2578 -8354 -4664 10031 9688 -6101 -2395 6019 6017 8316 5420 884 10360 9180 2158 -756
16399 -756 -10505 -10551 -8139 -12277 -11235 -719 -7522 11067 -14188 -36665 -40885 -30710 -9064 8539
16385 8539 11042 -769 -11542 -23855 -14832 -970 -108 16239 18543 3936 -14852 3662 -1279
16372 -1279 -8053 -12965 1574 4565 5687 3996 10866 20858 12270 23157 29347 29405 19302 25314
16358B5314j0418r97r937J2452j4437J0154O518j2621J1896o287j5349J601J5059
16345A2948K1159J9370o43n298M353m008j5019r077J1380J1621J2622j3527J7801
16332F3682M0488K7700K1939K3817K5622K8242L0432M2961L9496J7473m394j5828
16320C41630l9848k5778J9651k791l1591m8286l7259O082m553l303R853J3130
16308A96937P105K2539L6980N1007M8114J4038j9993m9090j4142k792L213k4340
16296B69576m4174m2451l3728k6427k9200K410J58k9342n337R079Q750j5606q290
16283E5418J6516j602k5736j4102K1780J8985j3716k4170k569j6056j318J2174
16271B5604O811q310j4713l170o255l941J5085n289j4872Q921Q909r408j2731
$$ plain form
16358 25314 14896 13899 3962 16414 1977 12131 18649 6028 17924 11637 -3712 -2111 12948
16345 12948 34107 53477 52834 47536 51889 47881 32862 23785 35165 46786 59408 45881 63682
16332 63682 104170 131870 153809 177626 203248 231490 261922 304883 344379 361852 357458 341630
16320 341630 301782 276004 295655 292864 261273 212987 175728 181810 177257 173954 183807 196937
16308 196937 204042 226581 263561 314568 362682 376720 356727 307637 293495 290703 293916 269576
16296 269576 225402 182951 149223 122796 93596 96006 96164 66822 61485 70564 79314 63708 55418
16283 55418 71934 70332 44596 30494 52274 71259 57543 33373 30804 14748 13430 25604
16271 25604 32415 24105 9392 6222 -33 -3974 11111 5822 -9050 -129 8780 -628 -13359
16258a3359j068O965j1464o658l276M644J8062K1714K0360k841l376k4392k1647
16245a6336P262j0662n289R318Q943K0772k3368l292l317l793Q85J149K3404N415
16231A1091k8192J3153K2428J7287M487j0780N532P66j9355j3844p814J2046O299
16218A3104J503J1292l29j9468o135K849R587L224j8618J0382J1664j077m834
16205A3144r991m483O04N445m711o681p850J0351k283J1929l0078j5000J0429
16192b9175q594J108l926K1394j1979M166L3459K0794j156j6642p947p163K426
16179c235L091J5692Q92M034n106j2699m508l203m715j274j0730j3284M640J5737
16165a4668J6563K616p535J1781o264j1282j9628O028j920K7637J9773Q816m991
$$ plain form
16258 -13359 -14427 -7462 -18926 -25584 -28860 -24216 -6154 15560 35920 33079 29703 5311 -16336
16245 -16336 -9074 -19736 -25025 -15707 -6764 14008 -9360 -12652 -15969 -19762 -18877 -17728 5676 11091
16231 11091 -17101 -3948 18480 35767 40254 29474 35006 35772 16417 2573 -5241 6805 13104
16218 13104 14607 25899 25570 6102 -33 2816 12403 15627 -2991 7391 19055 17978 13144
16205 13144 3153 -1330 -726 4719 8 -6673 -14523 -4172 -6455 5474 -24604 -39604 -29175
16192 -29175 -37769 -36661 -40587 -19193 -31172 -27006 6453 27247 26091 9449 1502 -5661 -3235
16179 -3235 -144 15548 16440 20474 15368 2669 -1839 -5042 -9757 -11031 -21761 -35045 -30405 -14668
16165 -14668 1895 4511 -3024 8757 2493 -8789 -28417 -22389 -24309 3328 23101 31917 26926
16152B6926k975j6696j1145q647P411m007m547j1483K684J5898l704p32l479n818
16138b0314K1399K366n644j2965q26j0855O100M917p586N388n428j095J5886J9403
16124A0746n17N163r971j200k1559O0Q292j4933j9161K001j184J6753J301j4125
16110c8334J2293P484N162J1661r258M955K0056j254N056r025j3883n293r070
16097a9450j969L966N983J2575j0095k6236R514K7812L619K394n617k759j6862
16084a7125m244J422N546o326N433j3952K0460K8507J1775j0474j3799p99J4422
16071B0846M04j9213k6122j4639J2748j186N67o512J7010j750j4483k848R883
16058b5295K1352J6357L766k4083j3840J0023l305J387J9696N146l822P466n689
$$ plain form
16152 26926 23951 7255 -3890 -12537 -5126 -9133 -13680 -25163 -22479 -6581 -10285 -11017 -14496 -20314
16138 -20314 1085 3451 -2193 -15158 -15984 -26839 -20739 -15822 -23408 -18020 -23448 -24543 -8657 10746
16124 10746 10229 15392 5421 4221 -17338 -17278 -8986 -23919 -43080 -41079 -42263 -25510 -24209 -38334
16110 -38334 -26041 -18557 -13395 -1734 -10992 -6037 14019 12765 17821 8796 -5087 -10380 -19450
16097 -19450 -21419 -17453 -11470 1105 -8990 -35226 -25712 2100 5719 8113 2496 -263 -17125
16084 -17125 -21369 -19947 -14401 -20727 -15294 -29246 -8786 19721 31496 21022 7223 6424 20846
16071 20846 21250 2037 -24085 -38724 -25976 -27162 -26595 -33107 -16097 -17847 -32330 -35178 -25295
16058 -25295 -3943 12414 16180 -7903 -21743 -11720 -15025 -13638 6058 11204 7382 14848 9159
16045I159n293n593m211j0026m266K205J589r042K790p49k424Q933K926j4669
16031b8671J3140K1218M656j8356j3184k972j3647P550J4331Q839J3104j030K270
16018G248o299q741q067j1907q861L046K9271K5407j915n100j9384N265Q010j6307
16004h334l2947L1137J4150n074J523K1522J611j8879j3307j1188R437J3974J0906
15991A4531r793j6745N764j2954j2968J4226q285m390m99l65p310n695J2650J2555
15977a9278L831J4322Q663J0283O189l1705n938K4197J0480k1344n809K078P280
15964C249O048j8448o556J2271q311L993J875j0550J710N637J6690Q763k1478
15951e107M822k129k9722p843M174j881K052K441m110n620K443J2605L983n103
$$ plain form
16045 9159 3866 -1727 -5938 -15964 -20230 -18025 -16436 -25478 -22688 -23437 -25861 -16928 -14002 -28671
16031 -28671 -15531 5687 10343 -8013 -21197 -24169 -37816 -30266 -15935 -7096 6008 4978 7248
16018 7248 949 -7792 -15859 -27766 -36627 -33581 -4310 21097 19182 14082 -5302 -37 7973 -8334
16004 -8334 -41281 -10144 4006 -1068 455 21977 23588 4709 -8598 -19786 -10349 3625 14531
15991 14531 4738 -12007 -6243 -19197 -32165 -17939 -26224 -30614 -31113 -31478 -38788 -44483 -31833 -19278
15977 -19278 -15447 -1125 7538 17821 24010 -7695 -13633 10564 21044 -300 -6109 -4031 3249
15964 3249 9297 -9151 -15707 -3436 -11747 -7754 -5879 -16429 -14719 -9082 7608 16371 -5107
15951 -5107 -285 -2414 -32136 -39979 -35805 -37686 -35634 -33193 -37303 -42923 -40480 -27875 -23892 -28995
15937b8995n401L923J4357L3627n277j6566j6474k6713J8839J4148P858N460J6548
15924A5334l954o857j4569j1376K3038L582R038m503k2052Q500K8157p052j8259
15911i73j6110r681m559M154K940J8973J1161j4437j9856j1672J6621J2752j556
15898a2243j2536K0621p223p464J1171Q364l768k1323L928j379m14m381M035J1883
15884a0729N71R12O185p693q705j7219M401J4420J0945P952p158K154m59K948
15870a475J8520k89k9815k3782p742j1764J1270P105J4346K0280k2492j6492J6857
15857b5473j310n124N424J3333J3272N864L426Q251j3438j6775L016J6982K0790
15844B8238l153k2842j6915j4808O817J1291J559m261j2459N296j8544j1021J920
$$ plain form
15937 -28995 -34396 -30473 -16116 17511 12234 -4332 -20806 -47519 -28680 -14532 -6674 -1214 15334
15924 15334 11380 4523 -10046 -21422 1616 5198 14236 9733 -12319 -3819 24338 17286 -973
15911 -973 -17083 -26764 -31323 -27169 -24229 -5256 5905 -8532 -28388 -40060 -23439 -10687 -12243
15898 -12243 -24779 -4158 -11381 -18845 -7674 690 -3078 -24401 -20473 -21852 -22266 -26647 -22612 -10729
15884 -10729 -10158 -9246 -3061 -10754 -19459 -36678 -32277 -17857 -6912 1040 -6118 -3964 -4423 -1475
15870 -1475 17045 16756 -13059 -36841 -44583 -56347 -45077 -37972 -23626 -3346 -25838 -42330 -25473
15857 -25473 -26783 -31907 -26483 -13150 122 5986 9412 17663 4225 -12550 -9534 7448 28238
15844 28238 25085 2243 -14672 -29480 -22663 -11372 -9813 -14074 -26533 -21237 -39781 -50802 -48882
15831d8882R010R277J0755J4160q709j284j957L414P714Q293n538j3976M842M648
15817h233L966J4940n353r974k9006L669J0030J7768r155R349J0662oj7927j3723
15803b2993j0931J470J2880O017J7792K397J3309L070j2165r204J2391N458k2513
15790c022J284j544j8094q029o414K1812K0200R738m003r185r82J6335Q997j431
15776B5662k4593p272J5582r416j8194p254o504P762M631k737j1581Q058J3940
15763a1916N312p077q83J110L865O183j472j255J498K875o376l752J0213j3547
15749a5222j4745j5466j4520J4894J1989K3364O898p721l86nl446L580J1507j157
15735d36l160j5660n712k960R867J4179P075k385K160m578J322l696j8134R9J0907
$$ plain form
15831 -48882 -39872 -30595 -19840 -5680 -14389 -15673 -17630 -14216 -6502 1791 -3747 -17723 -12881 -8233
15817 -8233 -4267 10673 5320 -4654 -33660 -29991 -19961 -2193 -11348 -1999 8663 8657 -9270 -22993
15803 -22993 -33924 -32454 -19574 -13557 4235 6632 19941 23011 10846 1642 14033 19491 -3022
15790 -3022 -1738 -3282 -21376 -29405 -35819 -14007 6193 15931 11928 2743 1761 18096 27093 25662
15776 25662 1069 -6203 9379 -37 -18231 -25485 -31989 -24227 -19596 -22333 -33914 -25856 -11916
15763 -11916 -6604 -13681 -14564 -13454 -9589 -3406 -4878 -6133 -4635 -1760 -8136 -11888 -1675 -15222
15749 -15222 -29967 -45433 -59953 -45059 -33070 -9706 -2808 -10529 -10915 -10920 -14366 -10786 721 -436
15735 -436 -3596 -19256 -24968 -27928 -18061 -3882 3193 808 2968 -1610 -288 -3984 -22118 -22019 -11112
15720a1112j2022L958J768k0590J0906J2476M232j52N634k422j6899M231R032
15707a0960K0667K3674J6353j4492k5052P719Q129k2533l847q973Q162J347k1194
15694b1000q885J8098J1438J154j1809m717K66N58l707O598J3567J9012j702r628
15680I243O295M285l214m243l460j8310o121J7210Q29N302K0o079m697L225R100
15665I385K872O168L205k430N705j982j2733j7100L683M06J4244O322P772j3961
15651A1556r106j129k2712K668Q675n819j6655O526m889j7180J4363K5013j8O237
15637b470R504L729R23J1211j184m98k303j3133j8197m40l681J485J6383N181
15623F510j998O092o387n254J0910R968o643O020Q935j6861n998J268O366j3606
$$ plain form
15720 -11112 -23134 -19176 -17408 -37998 -27092 -14616 -10384 -10536 -4902 -7324 -24223 -19992 -10960
15707 -10960 9707 33381 49734 35242 10190 17909 26038 3505 -342 -9315 -1153 194 -21000
15694 -21000 -29885 -11787 -349 805 -11004 -15721 -15455 -14897 -18604 -12006 1561 20573 18871 9243
15680 9243 15538 19823 16609 12366 8906 -9404 -15525 1685 2514 7816 7836 1757 -2940 285 9385
15665 9385 12257 18425 21630 19200 24905 22923 10190 -6910 -3227 -2821 11423 17745 25517 11556
15651 11556 2450 1321 -21391 -18723 -10048 -15867 -32522 -25996 -30885 -48065 -33702 -8689 -8707 -2470
15637 -2470 7034 10763 11686 22897 21713 21215 18912 5779 -12418 -12858 -16539 -15054 1329 6510
15623 6510 4512 10604 4217 -1037 9873 19841 13198 19218 28153 11292 5294 6562 12928 -678
15609f78R7J6900j818o884j853p900N984J4153j8638K864q109j3968J6354R92
15595b504L142j4414J870K0964J917K646J561l7953P268Q0J4306j0154k5719q205
15581d5195L580J6610L081k495m670R886K3950m226l253K559K336l427J8572m275
15567A3033p661j1933q245l905O532J428l022J7528J1191j393J0108Q383j0542
15554B1502j7637l308N972o197k0197J0486J6212l2337p709K4479K905J2220o503
15541a12n765O950J6703j5172j0346j5411J6843J0748K826J678p42j7774J12Q384
15527a078j0551J2813O623p911o726J2882q063l506N217j547j1272j2487p507
15514c3113J9946O936j2842j1362L025J7957j6591j4891O683k007J0657J1459
$$ plain form
15609 -678 -581 16319 14501 7617 5764 -2136 3848 18001 -637 2227 -5882 -19850 -3496 -2504
15595 -2504 638 -13776 -11906 9058 10975 13621 15182 -22771 -15503 -15423 -1117 -11271 -36990 -45195
15581 -45195 -41615 -25005 -21924 -24419 -29089 -19203 4747 521 -2732 -173 2163 -1264 17308 13033
15567 13033 5372 -6561 -14806 -18711 -12179 -10751 -13773 3755 14946 13553 23661 32044 21502
15554 21502 3865 557 6529 332 -19865 -9379 6833 -25504 -33213 -8734 -5829 6391 -112
15541 -112 -5877 1073 17776 2604 -7742 -23153 -6310 4438 7264 8942 8200 -9574 -9462 -1078
15527 -1078 -11629 1184 7807 -104 -6830 6052 -2011 -5517 -300 -1847 -13119 -25606 -33113
15514 -33113 -13167 -6231 -19073 -30435 -27410 -9453 -26044 -40935 -34252 -36259 -25602 -14143
15502a4143k470n320m694L77J6784J020J2055J0838o233j2065Q364J4967m586
15489A4894J0379j49N528j5651j4536j0826o364O4J6325j661m598Q045J3856j0569
15475D737l406P46J160J3958P9m090j9820j2855m120J0979N019R870j1919L144
15461f518K1712J0956R297O304k877l2174j8964p490q569J2969J8693j3084j9246
15448b8991J614J8205J5917n285P833L722K217j2564l08r154L825M550l927K3633
15434B1287j714k791j3587k4509N384J977J9545J070m809n148j2919K834k531
15421a5911n533j0440r039j572M221J2798J3571l6p854j6217P446R868k4068r701
15407e2467J5929K427L469J2130J8217M366j8032j199j544j1105J1072r377j6566
$$ plain form
15502 -14143 -16613 -21933 -26627 -26250 -9466 -8446 3609 14447 8214 -3851 4513 19480 14894
15489 14894 25273 25124 30652 15001 465 -10361 -16725 -16661 -336 -1997 -6595 1450 15306 4737
15475 4737 1331 2077 3237 17195 17274 13184 -6636 -19491 -23611 -12632 -7613 2257 -9662 -6518
15461 -6518 15194 26150 35447 41751 38874 6700 -12264 -19754 -28323 -15354 3339 -9745 -28991
15448 -28991 -27377 -9172 6745 1460 9293 13015 15232 2668 2360 -6794 -2969 1581 -2346 21287
15434 21287 19573 16782 3195 -21314 -15930 -13953 5592 6662 1853 -3295 -16214 -13380 -15911
15421 -15911 -21444 -31884 -40923 -42495 -38274 -25476 -11905 -11941 -19795 -36012 -28566 -18698 -42766 -52467
15407 -52467 -36538 -34111 -30642 -18512 -295 4071 -13961 -15160 -16704 -27809 -16737 -26114 -42680
15394d2680L746J4864j108n786J191J8330J0287j2306J1282J7163M47J1693Q536
15381C5659k2504j4548n457j0851J8132O29M790K3827r28r768Q193R303p511j7873
15367A1093k7356J5096J894j3129j6873J0341J6008l954k6092j4224l490m40J0303
15354d0823N977J4082J777k4893o584J6468K0106J2090Q65j681j0044l588K5482
15341I234K1449j0555j5837J2377n860k265j9537o800J1307k34j338J761j1792
15328a8090p47J0586m594J1646M573L888J9792J5863j0109k5700k7718j756P950
15315a4416n740j955r431p464r505Q414K4933J4366P507n646N755j0318n896k2269
15301c1665p911N8K0459J164n27K0027k395p829n652N46J8944L674j2234M872
$$ plain form
15394 -42680 -38934 -24070 -25178 -30964 -29773 -11443 -1156 -13462 -2180 14983 15430 27123 35659
15381 35659 13155 -1393 -6850 -17701 431 1060 5850 29677 28749 18981 27174 36477 28966 11093
15367 11093 -16263 -1167 727 -12402 -29275 -18934 -2926 -6880 -32972 -47196 -50686 -51126 -40823
15354 -40823 -34846 -20764 -18987 -43880 -50464 -33996 -13890 -1800 -935 -2616 -12660 -16248 9234
15341 9234 30683 20128 4291 16668 10808 8543 -10994 -17794 -6487 -6721 -8059 -6298 -18090
15328 -18090 -18837 -8251 -12845 -1199 3374 7262 27054 42917 32808 7108 -20610 -22366 -14416
15315 -14416 -20156 -22111 -31542 -39006 -48511 -40097 -15164 -798 6709 1063 6818 -3500 -9396 -31665
15301 -31665 -39576 -39518 -19059 -17895 -18422 1605 -790 -8619 -14271 -13725 5219 8893 -3341 1531
15287A531o89J172n401j0289J5013J2139k0396k0530J3522L979n811K250R624
15274c886K2415j0963K380M264k1410j3938J2311k0926P741O711J3188p519o595
15261a6227m653j4674n871J3963L8345R922J930q850p030n468O07k680j731L033
15247F16P141j1817l879J3113J1413J0842r529n565N203k7853q423q157R196M992
15233a2707K477Q259q365K992K996j2370R83L705R385P423J6579n950q017j7604
15219a0214M289M382J2397J1291p448j2736p838N713J4423k3243R871J9517o376
15206A4028N424L301j0454j2771K3204Q408j3360q494K13o0K737j0811k7047j4432
15192d0114J7907K2354j47K172J6457j673m358q912j4956l529P658L0155q707
$$ plain form
15287 1531 842 2014 -3387 -13676 1337 13476 -6920 -27450 -13928 -9949 -15760 -13510 -3886
15274 -3886 18529 7566 9946 14210 -7200 -21138 -8827 -29753 -22012 -15301 -2113 -9632 -16227
15261 -16227 -20880 -35554 -41425 -27462 10883 20805 22735 13885 6855 1387 1994 -686 -2417 616
15247 616 7757 -4060 -7939 5174 16587 27429 17900 12335 17538 -10315 -18738 -26895 -17699 -12707
15233 -12707 -10230 -1971 -10336 -7344 -4348 -16718 -15735 -12030 -2645 4778 21357 15407 7390 -10214
15219 -10214 -5925 -1543 10854 22145 14697 1961 -5877 -164 14259 -8984 887 20404 14028
15206 14028 19452 22753 12299 -472 22732 31140 17780 9286 9499 9439 12176 1365 -25682 -40114
15192 -40114 -22207 147 0 2172 18629 16956 12598 3686 -11270 -14799 -7141 23014 14307
15179A4307j5479M079j1874p856o797Q678k54K793J0519J0461J8624j2395J3756
15166B8562J570p940j4561o922P140K376l653q94M032N336L103j1233j1663M579
15152a68j4179j6804q598J0678J0459j6749j237o96r334k634J7124R302q051Q022
15138b2865Q17j1063j638Q416J7742n137p752P507N35k854j9428k2179j50K6479
15124c1570J7741L955J0160j3868j2515q21p510q467L0596J3078k014j0173K252
15111i156J6831j0948M582j774J3646J3038o440k1920j0433R39j024l200n705
15098b1564N200J1809N643J3300R822J884j3268K939k3088j3941J9914l921o582
15085a1853K023J6958p763k1778J3894J7156q538j4534P537Q58r585P938K259
$$ plain form
15179 14307 -1172 2907 -8967 -16823 -23620 -14942 -15196 -12403 -1884 8577 27201 14806 28562
15166 28562 30132 22192 7631 709 7849 10225 6572 5678 9710 15046 18149 6916 -4747 -168
15152 -168 -14347 -31151 -39749 -29071 -18612 -35361 -36598 -37294 -46628 -49262 -32138 -22836 -30887 -22865
15138 -22865 -22048 -33111 -34749 -26333 -8591 -13728 -21480 -13973 -13438 -16292 -35720 -57899 -58049 -31570
15124 -31570 -13829 -9874 286 -13582 -26097 -26918 -34428 -42895 -12299 779 -1235 -11408 -9156
15111 -9156 7675 -3273 1309 -465 13181 26219 19779 -2141 -12574 -11635 -12659 -15859 -21564
15098 -21564 -16364 -4555 1088 14388 24210 26094 12826 15765 -7323 -21264 -1350 -5271 -11853
15085 -11853 -9830 7128 -635 -22413 -8519 8637 99 -14435 -6898 -6040 -15625 -7687 -5428
15072e428j0289O97N265m532L68Q193r46j398M177O88q304n127l634O46o09K643
15056a7590Q729n041q055Q395K8264L127l1151J726N52J8696P588j3459k3389
15043b1608n186j792Q834J9505j047O043M653j0884J4328J5221k144j3071j4972
15030b120k4541k323N297K516o739Q45J8694O415L011J0022N260j3121p538R910
15016E588k251l578J0170j825n282Q579k4466M179K1596P671j0427K410M262j0106
15002F520p538l555q668m102R099J2097J2922R127j1193l944p469j1610j1868
14989b0182J6492m114k2657Q474P950o08J5419J5316J0396p553j6760j8620k1340
14976c7787O332O908k772l753J1125p121O061n359J3378J739l674Q720J1133K181
$$ plain form
15072 -5428 -15717 -15020 -9755 -14287 -13919 -5726 -6672 -8070 -3893 -3205 -11509 -16636 -20270 -19624 -20233 -17590
15056 -17590 -8861 -13902 -21957 -13562 14702 17829 -13322 -11596 -11044 7652 15240 1781 -21608
15043 -21608 -26794 -28586 -19752 -247 -1294 4749 9402 -1482 12846 28067 25923 12852 -2120
15030 -2120 -26661 -28984 -23687 -21171 -27910 -27065 -8371 -1956 1055 11077 16337 3216 -4322 5588
15016 5588 3337 -241 9929 8104 2822 11401 -13065 -8886 12710 20381 9954 12364 16626 6520
15002 6520 -1018 -4573 -13241 -17343 -8244 3853 16775 25902 14709 10765 3296 -8314 -20182
14989 -20182 -3690 -7804 -30461 -21987 -14037 -14645 774 16090 26486 18933 2173 -16447 -37787
14976 -37787 -31455 -24547 -27319 -31072 -19947 -27068 -21007 -26366 -12988 -11249 -14923 -6203 4930 7111
14962G111j0012n257J6163O172p082r260P083Q25O346M123M131m947m882k35k0939
14947a0660j1228J0565j3270o675L184J9817j4102k085J5149j656p239J2073l379
14934i506j5484k559K6855J1939J014j5706l152J0924K567j85n775j3505j6917
14921b9490p052K4303K658j5593J5746N191K250r686l452J1657J4915k438p014
14908A995j0968J3601K2289k215p188j3541r562k3387j1084R675M569q13n46J8204
14894h971n003K4540J9879m326j845j2543m089q900j7848m802L349K174r327J4315
14880a3397K653k667P010N155L121j1471K803n177O459J3961J4084k7711j5301
14867b0478J5960P951n963j850m030j3792k2807j2277K5187L103q439k74M090
$$ plain form
14962 7111 -2901 -8158 8005 14177 7095 -2165 4918 5743 12089 16212 20343 15396 10514 10279 -10660
14947 -10660 -21888 -11323 -24593 -31268 -28084 -8267 -22369 -24454 -9305 -10961 -18200 -6127 -9506
14934 -9506 -24990 -27549 -694 11245 12259 -3447 -6599 4325 6892 6707 932 -12573 -29490
14921 -29490 -36542 -12239 -9581 -25174 -9428 -4237 -1987 -11673 -15125 -3468 11447 9009 1995
14908 1995 -8973 4628 26917 24702 17514 3973 -5589 -28976 -40060 -30385 -25816 -26629 -27175 -8971
14894 -8971 -13974 10566 30445 26119 24274 11731 7642 -1258 -19106 -23908 -20559 -18385 -27712 -13397
14880 -13397 -10744 -13411 -6401 -1246 1875 -9596 -6793 -11970 -5511 8450 22534 -5177 -20478
14867 -20478 -4518 3433 -2530 -4380 -8410 -22202 -45009 -57286 -32099 -28996 -37435 -37709 -33619
14854c3619L505l751L449K156K6891K5472N397r765j3423k771k716L515p129p360
14840a0149J4147j3191r372p925M184R463M869J0747P792j6116R85l857R228J6801
14826A7606K379j8539j3785O603P386J3524j3452j4756L206k0765k353J3723K4795
14813E572Q48m467J1306k754K534r29J0233j0382k4447m276J0762J5405q347j2552
14799a1494M063P638J8789o203q778k263r869n413J0443l091J321Q279R140k2009
14785i447j0214J8294K6933O333r454j5590r918k2127Q706J1964L015q3O17j233
14771b204p392J2377J1344j01o587M240j374j0944j5770j949L287rL498M757J0981
14756D154P731N662j425K136j4124o694k184J0409j0738J2984k628r605j0443
$$ plain form
14854 -33619 -30114 -33865 -30416 -28260 -1369 24103 29500 19735 6312 3541 825 4340 -2789 -10149
14840 -10149 3998 -9193 -18565 -26490 -22306 -12843 -7974 2773 10565 -5551 -4566 -8423 805 17606
14826 17606 19985 1446 -12339 -5736 1650 15174 1722 -13034 -9828 -30593 -32946 -19223 5572
14813 5572 6420 1953 13259 10505 13039 12110 22343 11961 -12486 -16762 -6000 9405 1058 -11494
14799 -11494 -7431 207 18996 12793 4015 1752 -8117 -13530 -3087 -6178 -4857 3422 12562 -9447
14785 -9447 -19661 -1367 25566 31899 22445 6855 -3063 -25190 -16484 -4520 -1505 -1588 -971 -2204
14771 -2204 -9596 2781 14125 14024 7437 11677 10303 -641 -16411 -18360 -15073 -15082 -11584 -6827 4154
14756 4154 11885 17547 16122 18258 4134 -2560 -4744 5665 -5073 7911 5283 -4322 -14765
14743a4765k0694M79K0722J4399J2425J2760o821m999L051k5081j8859J1164K5766
14730I547p359M692O925M790l865j9741j0550j2104N892J272M898K3379J5652
14717B3428j1698k6189N354J4960k949j3714O175N76r123k9066r35J3329o240
14704c6092q291N584K2119J9844K413j4191j3871K586K3106n014O399P061j1023
14691F30k90K893m732j0546j2829j7694q97J017J1765J5967L054n449R463J8094
14677A0446P125j115M63k4744j8515N603J1069P930l934J6916k288r857j2669
14664a3570K543J0882J6706J7774O682O679p293k7140o382j2564m207R798o092
14651f184k4062J1560K1554J4683k968j9870p830J1742J1404j7525j8999m21j5921
$$ plain form
14743 -14765 -35459 -34980 -14258 141 12566 25326 18505 13506 16557 -8524 -27383 -16219 9547
14730 9547 2188 6880 13805 18595 14730 -5011 -15561 -27665 -21773 -20501 -15603 7776 23428
14717 23428 11730 -14459 -9105 5855 2906 -10808 -4633 -4057 -13180 -42246 -43181 -29852 -36092
14704 -36092 -44383 -38799 -16680 3164 5577 -8614 -22485 -19899 3207 -1807 4592 11653 630
14691 630 340 3233 -1499 -12045 -24874 -42568 -43465 -42448 -30683 -14716 -11662 -17111 -7648 10446
14677 10446 17571 16456 16919 -7825 -26340 -20737 -9668 -1738 -5672 11244 8956 -901 -13570
14664 -13570 -11027 -145 16561 34335 41017 47696 40403 13263 6881 -5683 -9890 -92 -6184
14651 -6184 -30246 -18686 2868 17551 14583 -5287 -13117 -1375 10029 -7496 -26495 -26916 -42837
14638d2837P903M086k812p924K0049J5561J3821J6906R564o462j1745n565j8641
14625h096L319J6107k402r327j6582l535L268J1411J0140p991P621n146k615n473
14611i301J3240K4346p429p965j6691j1253J6469L385N242J2730k1188J813R081
14598A2479j2118p016j726k494M213p089p436R859J3598k4809j8007Q847K851
14585b8848O041o233R147J5325j783K0968J0735n097M434K701Q7j3873k3080o500
14571a5976J9368k442n424Q599k016q196J384k013O621J5711j056k3946k0831
14558c0217N738L1694n403k276l618j384P771J1728p05K438J66j6483l543j7133
14544b1227j1564k085R890J9705o037j0011Q235m800J7045Q390m97L369j4268
$$ plain form
14638 -42837 -34934 -30848 -33660 -41584 -21535 -5974 7847 24753 34317 27855 16110 10545 -8096
14625 -8096 -4777 11330 8928 -399 -16981 -20516 -17248 -5837 4303 -3688 3933 -1213 -3828 -9301
14611 -9301 3939 28285 20856 12891 -3800 -15053 1416 4801 10043 22773 1585 3398 12479
14598 12479 361 -6655 -8381 -10875 -6662 -13751 -21187 -11328 2270 -22539 -40546 -31699 -28848
14585 -28848 -22807 -29040 -19893 -4568 -6351 14617 25352 20255 24689 27390 27477 13604 -9476 -15976
14571 -15976 3392 950 -4474 4125 2109 -6087 -4703 -6716 -95 15616 14560 -9386 -30217
14558 -30217 -24479 7215 1812 -464 -4082 -5466 2305 14033 13328 15766 15932 -551 -4094 -21227
14544 -21227 -32791 -34876 -24986 -5281 -11318 -21329 -13094 -17894 -849 7541 7044 10413 -3855
14531c855q650j4331Q278O476J6703K211j2722J1022J000k3310K7J1734Q885j2295
14517h827M279J2013J459j5046j6603J6269k704Q46J4015o305k6153M354K052
14504b0351J827P243k878M57Q412N317N515j5511m707n662O311J0250o223j676
14490a1676j0795R393K2815L684J2943j5421j5056k3580l2783R782K0655K1112
14478h927K0742R745j0819p625K848N284j3499m68R215p563M424j7597r518o211
14464b9969R979j6288J837L4170P052l578l838k5325l481J0810L385q024r87o994
14450c1251r297J8279K3371j0518k014j1020Q981n837k506L147O145J0462m246
14437f304m663J2690L0495O623j7307k5023j1777K0284O470j9912k3332M037R85
$$ plain form
14531 -3855 -12505 -26836 -18558 -12082 4621 6832 -5890 5132 6132 -17178 -17151 -5417 3468 -8827
14517 -8827 -4548 7465 8924 -6122 -22725 -6456 -9160 -8314 5701 -604 -26757 -22403 -20351
14504 -20351 -18524 -11281 -14159 -13702 -5290 27 5542 -9969 -14676 -20338 -14027 -3777 -10000 -11676
14490 -11676 -22471 -13078 9737 13421 26364 10943 -4113 -27693 -60476 -50694 -30039 -8927
14478 -8927 11815 21560 10741 3116 5964 11248 -2251 -2719 6496 -1067 3357 -14240 -23758 -29969
14464 -29969 -19990 -36278 -34441 -271 6781 3203 -635 -25960 -29441 -18631 -15246 -23270 -24257 -31251
14450 -31251 -40548 -22269 1102 -9416 -11430 -22450 -13469 -19306 -21812 -18665 -12520 -2058 -6304
14437 -6304 -10967 1723 32218 38841 21534 -3489 -15266 5018 11488 -8424 -31756 -27719 -26734
14424b6734r118J6664J7583j7614r467J7259J1665o409k304Q143K294J0891j1442
14411A411j0758k6303m220Q671K86q152Q336K4442J3766q802q916M803j9759N537
14397a9658K2034j562o130n209Q666o358q592M364K023n780q590P396J0599R351
14383B554J6329O344K976k0530j8735K350Q584n153P03K327O586K320J835J0710
14369A9200J272j7075o572j2761j841J8989J130K139l251q407J2019R849k2633
14356g942k6677J4106M205M807J7889P462J5775o390j3137j63j7522q571J0043
14343f115R003o409K538J1781L158j6684K435J4073J1292n499q921O733J2864
14330C0249M663k0611j8748k038J386n150j3079j5333m146r272P293J4102N309
$$ plain form
14424 -26734 -35852 -19188 -1605 -19219 -28686 -11427 238 -6171 -8475 -332 1962 12853 1411
14411 1411 -9347 -35650 -39870 -31199 -30913 -39065 -30729 -6287 7479 -1323 -10239 -5436 -25195 -19658
14397 -19658 2376 814 -5316 -10525 -1859 -8217 -16809 -12445 -10422 -16202 -24792 -17396 -6797 2554
14383 2554 18883 25227 28203 7673 -11062 -8712 -128 -5281 -4578 -2251 4335 6655 8490 19200
14369 19200 20472 3397 -3175 -15936 -17777 1212 2342 4481 1230 -7177 4842 14691 -7942
14356 -7942 -34619 -20513 -16308 -11501 6388 13850 29625 23235 10098 9935 -7587 -16158 -6115
14343 -6115 2888 -3521 -983 10798 13956 -2728 -293 13780 25072 19573 10652 17385 30249
14330 30249 34912 14301 -4447 -6485 -5099 -10249 -23328 -38661 -42807 -52079 -44786 -30684 -25375
14317b5375J4812J7535J141n569j0170O730l90k470o134m244P634k4788r332l697
14303d4317n095J3236R734j3253J1248L053k2476n372J4707P318j0976P338J5438
14290a9417j0862K980J841M087j7998J81L945j424J5461J8597J3824J1028k7878
14277e635j3576J1064K1840j850m146L348M943l304k6584m865N0J2641O758m105
14263c421R034j9283O108l73o713J6145q412j257Q622p61j6641j965P349j6475
14249b8043j288J2640j12K480L976P135j3942J578K349P080o736Q06J2845O081
14235F849Q588j8509q294l430j1325j4504M703L870J1323J7411P988M614J0826
14222B0110j7649M88O872j8658m274J7827J5559Q364m856j4179j5022K5935J4713
$$ plain form
14317 -25375 -10563 6972 8113 2544 -7626 -896 -1286 -3756 -9890 -14134 -6500 -31288 -40620 -44317
14303 -44317 -49412 -36176 -26442 -39695 -28447 -25394 -47870 -53242 -38535 -31217 -42193 -34855 -19417
14290 -19417 -30279 -27299 -25458 -21371 -39369 -39188 -35243 -36667 -21206 -2609 11215 22243 -5635
14277 -5635 -19211 -8147 13693 11843 7697 11045 15988 12684 -13900 -18765 -18715 -6074 684 -3421
14263 -3421 5613 -13670 -7562 -7935 -14648 1497 -6915 -8172 450 -311 -16952 -18917 -11568 -28043
14249 -28043 -29331 -16691 -16803 -14323 -10347 -3212 -17154 -15576 -13227 -6147 -12883 -12077 768 6849
14235 6849 15437 -3072 -11366 -14796 -26121 -40625 -35922 -32052 -20729 -3318 4670 9284 20110
14222 20110 2461 2949 9821 -8837 -13111 4716 20275 28639 23783 9604 -5418 20517 35230
14209C5230j5953l3521j0283J3820J1776O315J542m338j3397Q579J0381J6506
14197B6657p305O364j4487j6334J468R663J3269L522j4152o881Q125p978j1981
14184a0050K39K766O189K340j5842J1724L907l08k534K780o463N371j4223k306
14170a6410J9575K4124j0405n671j0362J6032n529k3903p708Q621K560K4592P901
14157B3417m454j3202j7242j9655J1416L6990L352k1812m247j410N675r829j0154
14144b1155J2368k242Q345j4983j9131n936n886P948R728J0602J9198j856j2704
14131a5704N159j1180N789K3081K0309R350l959j586j0031l408J3131j9317m0776
14118b9142K445K3546j066N44k445M510K055j0203P593J9865j1659j0285O787
$$ plain form
14209 35230 19277 -14244 -24527 -10707 1069 7384 8926 4588 -8809 -230 10151 26657
14197 26657 19352 25716 11229 -5105 -3637 6026 19295 22817 8665 1784 9909 1931 -10050
14184 -10050 -9811 -7045 -856 1484 -14358 -2634 1273 965 -1569 1211 -5252 119 -14104 -16410
14170 -16410 3165 27289 16884 11213 851 16883 11354 -12549 -20257 -11636 -9076 15516 23417
14157 23417 18963 5761 -11481 -31136 -19720 17270 20622 -1190 -5437 -6847 -1172 -11001 -21155
14144 -21155 -8787 -11029 -2684 -17667 -36798 -42734 -48620 -40672 -30944 -20342 -1144 -3000 -15704
14131 -15704 -10545 -21725 -15936 7145 27454 36804 32845 31259 21228 17820 30951 11634 -29142
14118 -29142 -26697 -3151 -4217 -3673 -6118 -1608 447 -9756 -2163 17702 6043 -4242 2545
14105B545j548N248k016O793p338J48k0824n821K9377K1057j1457k9110j2230
14092b5176M353N045k4893j4754K4293M3344R167j4357p568k5612m650Q199m899
14079b7508r18m316K0784J9607J0533N803j6499j6999l854m602J6424K2286q124
14066A2617R582m913J063j0791k8149l392L915N958q404K941J8146J563j3980
14053a3844j7155L300l985J6063K1276K407N978r317K1381J5826j7346k6236j1878
14040a3530k536j451Q905M345P397J1246N150k8007o895m769M140K2875J0106
14027A6976J4231L43j8972r870N688J3643m55J3339j6051k2589q906m056O799
14014i880J2952M672j4796L830J7585p898j3768j0182p68K7222K48m780o403m042
$$ plain form
14105 2545 997 6245 4229 11022 3684 3832 -16992 -22813 6564 27621 16164 -12946 -25176
14092 -25176 -20823 -15778 -40671 -55425 -31132 12212 21379 7022 -546 -26158 -30808 -22609 -27508
14079 -27508 -28426 -32742 -11958 7649 18182 23985 7486 -9513 -13367 -17969 -1545 20741 12617
14066 12617 22199 17286 18349 7558 -20591 -23983 -20068 -14110 -22514 -19573 -1427 136 -13844
14053 -13844 -30999 -27699 -31684 -15621 5655 8062 14040 4723 26104 41930 24584 -1652 -13530
14040 -13530 -16066 -17517 -8612 -4267 3130 14376 19526 -8481 -15376 -20145 -16005 6870 16976
14027 16976 31207 31550 12578 2708 8396 22039 21584 34923 18872 -3717 -12623 -16679 -9880
14014 -9880 3072 7744 -7052 -3222 14363 6465 -7303 -17485 -18253 8969 9217 4437 -1966 -6008
14000f008j2152L242J0871K071K803k538o6q68j0210J5902k892R2o367l055J9300
13985A0125p454l534J3185j050j3585j0135j4521j838M326j039J125o716j3929
13972d5040q722R198K193J5358P313N918K178k038L177o127J374m6K759j5245
13958b7750J2712K3582j1426k4079K494m422k644J4319K8816M918r198Q929l043
13945A3208j9822k5495q57M758R102R018N958j8044M593j077J1630N38j1749j3433
13931c1672j5960L336J4506Q147J3299N579r103K3369P816J947j2855k0256j0884
13918b2731J838Q500O177j671r80J21o520j0446m951J3650K1358K533p617j4028
13904a4767o219j543L169o021p17K2115J6495j4410j4337P21M040J220j3622j8111
$$ plain form
14000 -6008 -18160 -14918 -4047 -1976 827 -1711 -1777 -2645 -12855 3047 155 247 -6120 -9175 10125
13985 10125 2671 -863 12322 11272 -2313 -12448 -26969 -28807 -24481 -25520 -24395 -31111 -45040
13972 -45040 -53762 -44564 -42371 -27013 -19700 -13782 -11604 -13642 -10465 -16592 -15218 -15264 -12505 -27750
13958 -27750 -15038 8544 -2882 -26961 -24467 -28889 -31533 -17214 11602 16520 7322 16251 13208
13945 13208 -6614 -32109 -32966 -28208 -19106 -10088 -4130 -22174 -17581 -18658 -7028 -6490 -18239 -31672
13931 -31672 -47632 -44296 -29790 -21643 -8344 -2765 -11868 11501 19317 21264 8409 -11847 -22731
13918 -22731 -20893 -12393 -6216 -7887 -8867 -8746 -15266 -25712 -30663 -17013 4345 6878 -739 -14767
13904 -14767 -20986 -22529 -19360 -25381 -26098 -3983 12512 -1898 -16235 -15514 -11474 -10254 -23876 -41987
13890d1987M482J3610j338J1415J3312p57k260k1289o417P979k159l894O265n782
13876b8820l400R8j1577K3991J9047q948j516J3205K787J388R886p841p692J1010
13862A1618P777j8403j0850M777J3525o715j947n49j1680j3293o844J6682R140
13849f762m790N154m142L85o420j354J7326N391N213o937j0636J4144J916j6740
13835h252j3488N390R662m606J460K2433R189j2238n479j5385r560m418J7559
13822g733J5098J3893k5305j4666K980K109J7158R818q15r497m251j29m501O584
13808G43p112J1792k17J7214k405j2464j320n947p218k323m296L289J4621P482
13794A1839j8597j875N706J1163n070j2289m301J1840J605o889p518J0390K2091
$$ plain form
13890 -41987 -37505 -23895 -25233 -13818 -506 -1263 -3523 -24812 -31229 -23250 -25409 -29303 -23038 -28820
13876 -28820 -32220 -32122 -43699 -19708 -661 -9609 -11125 2080 4867 6255 16141 8300 608 11618
13862 11618 19395 992 -9858 -5081 8444 1729 -218 -767 -12447 -25740 -32584 -15902 -6762
13849 -6762 -11552 -6398 -10540 -10155 -16575 -17929 -603 4788 10001 3064 -7572 6572 8488 -8252
13835 -8252 -21740 -16350 -6688 -11294 -9834 12599 21788 9550 4071 -11314 -20874 -25292 -7733
13822 -7733 7365 21258 -4047 -18713 -15733 -13624 3534 13352 12537 3040 -1211 -1340 -5841 743
13808 743 -6369 5423 5206 22420 20015 7551 6231 284 -6934 -9257 -13553 -10264 4357 11839
13794 11839 -6758 -8633 -2927 8236 3166 -9123 -13424 -1584 21 -6868 -14386 -3996 18095
13781A8095J5418j9885k5099j3254L398K9564K1118q717k2327K516J6845O663
13769B4335j1905O1p139L8J7462m187j2302k0524J3108L0142j2579k0239k70j3798
13755a7797P992J681M313M82p132O957O208n719j4920R731J3027P431j8378j7491
13741b3615L043O495p478J23N534r23p32J5045L960j6578n410J5372M912J1264
13727A1012K289j6813j0333m799L320j0718k949Q023L998j8849n955J1266J1220
13714a9288j042k900R046j902r014N224L068R464O061k2N77J6313J0231m279P852
13699B9389m503j2653M887P637r1r375j0717q679L117J2532j0207J5452Q121l970
13685B0940o473Q981l612j5878k8355k5734J0335K6434K1334N957O928L95j587
$$ plain form
13781 18095 33513 13628 -11471 -24725 -21327 8237 29355 20638 -1689 827 17672 24335
13769 24335 12430 12491 5352 5390 22852 18665 6363 -14161 -1053 29089 16510 -3729 -3999 -17797
13755 -17797 -9805 -8124 -3811 -3329 -10461 -3504 2704 -3015 -17935 -8204 4823 12254 -6124 -23615
13741 -23615 -20572 -14077 -21555 -21432 -15898 -16821 -17553 -2508 1452 -15126 -20536 -5164 -252 11012
13727 11012 13301 -3512 -13845 -18644 -15324 -26042 -28991 -20968 -16970 -35819 -41774 -30508 -19288
13714 -19288 -20330 -23230 -14184 -16086 -25100 -19876 -16808 -7344 -1283 -1305 -728 15585 25816 21537 29389
13699 29389 24886 12233 17120 24757 24666 15291 4574 -4105 -988 11544 1337 16789 24910 20940
13685 20940 14467 23448 19836 3958 -24397 -50131 -39796 -13362 7972 13929 20857 21252 19665
13672A9665q383k5352k4821K0172K4119J3846j0425k2670n587K6646M199L33r066
13659B676k720J2255P348p45N604o773q322N21J2810M949l520j0909j5936J333
13645a429L876N334Q397L203j1892j4188p178r22m039k754k42K2261M2048j9103
13631B3372j8987j5987l545q520K1303O705j0482p02N842L525q444j7606j9540
13618d3066M255K4932J4432J6696J817o555N126p835k67o288k980m085R725J767
13604G674o616p142p610r224j4931J8785J5716Q091J0452J4112n891k4096r902
13591a0582k5408P583K4453j2455K063j031o037l515O707j0721J0334J0928J0246
13578B565N028N752J632M544j1562l1q4k1991k424j0486k141p69J3630K7279j615
$$ plain form
13672 19665 11282 -14070 -38891 -18719 5400 19246 8821 -13849 -19436 7210 11409 11742 2676
13659 2676 -44 12211 19559 18814 24418 17645 9323 9844 22654 27603 24083 13174 -2762 -1429
13645 -1429 2447 7781 16178 19381 7489 -6699 -13877 -14799 -18838 -21592 -21834 427 42475 23372
13631 23372 4385 -11602 -15147 -23667 -2364 4341 -6141 -6843 -1001 2524 -5920 -23526 -43066
13618 -43066 -38811 -13879 553 17249 19066 12511 17637 9802 9535 3247 267 -3818 5907 7674
13604 7674 1058 -6084 -13694 -22918 -37849 -19064 -3348 4743 15195 29307 23416 -680 -10582
13591 -10582 -35990 -28407 -3954 -16409 -14346 -15377 -21414 -24929 -18222 -28943 -18609 -7681 2565
13578 2565 7593 13345 14977 19521 7959 7928 7844 -14147 -16571 -27057 -29198 -29967 -16337 10942 9327
13563I327n223k742J4054j593J882l915k643N215j2749J2280K5462N544J7559
13550F2458K947L118j9525l3432Q97J6007n953p210m941n917K6431n352l7183
13537g655m699m721j1608j33N01j6297M518K4693N58M059K0880r170k3872j264
13523b4210r182k436J4272q52n486n253O368J0777J6736l129p276R817O684M609
13509A1439M587n281J2347J3956J2981l547M805j9256j3864J7019K2673n223J331
13496E3967l402j3088m29j3953j3411J4701J5973j2028o669J3450j6592k8375
13484i856J7733K4864J2502o255j5831K26q214N175J1428j872N907q548m966j2250
13470A0043q940O098P785p614n254K7728N334j9634p13Q84j180J1124m639o941
$$ plain form
13563 9327 4104 1362 15416 13823 15705 11790 9147 14362 1613 13893 39355 44899 62458
13550 62458 65405 68523 48998 15566 16463 32470 26517 19307 14366 8449 34880 29528 -7655
13537 -7655 -12354 -17075 -28683 -28816 -28315 -44612 -40094 -15401 -14843 -10784 10096 926 -22946 -24210
13523 -24210 -33392 -35828 -21556 -22408 -27894 -33147 -26779 -16002 734 -2395 -9671 146 6830 11439
13509 11439 16026 10745 23092 37048 50029 46482 51287 32031 18167 35186 57859 52636 53967
13496 53967 50565 37477 37048 23095 9684 24385 40358 28330 21661 35111 18519 -9856
13484 -9856 7877 32741 45243 38988 23157 23383 15169 20344 31772 29900 35807 27259 22293 10043
13470 10043 1103 7201 14986 7372 2118 29846 35180 15546 14833 15717 14537 25661 21022 14081
13456A4081l761K1600J1705J354J606J2673K002p972j3670j5246p740o122L727
13443A4237l338K563L04q3k60J509L888o44q728L715R402K79j3300j7072r667
13428a7195L943Q537m674M911K8045o884j0412n214Q266j125Q039j2955K368J1558
13414A7208N970J955K55M72n252l590M213n607Q11j8331o061J0758J1235O914
13400B0950j7825j2281O762J0726p659q395p039J9003J3320j1613j3101p147J4638
13387C39K2941M080k3782j6571K961J8631J2785p859n69K0547k304l83L44q495
13373B2665p221k3543P769J383Q949J0541j3509l255l572o224Q297m114n383O780
13359d37N469j2015Q943J5119r161j2779P342k6023P190J4170N07L367M538l453
$$ plain form
13456 14081 10320 31920 43625 44979 46585 59258 61260 53288 39618 24372 16632 10510 14237
13443 14237 10899 13462 13766 13683 13423 14932 18820 18176 9448 13163 22565 22844 9544 -7528 -17195
13428 -17195 -13252 -4715 -9389 -4478 23567 16683 6271 1057 9323 8198 16237 3282 5650 17208
13414 17208 23178 25133 25388 25860 20608 17018 21231 15624 16435 -1896 -7957 2801 14036 20950
13400 20950 3125 -9156 -2394 8332 673 -7722 -14761 4242 17562 5949 -7152 -14299 339
13387 339 23280 27360 3578 -12993 -10032 8599 21384 13525 12956 33503 31199 30816 31160 22665
13373 22665 15444 -8099 -330 1053 10002 20543 7034 3779 207 -6017 2280 -1834 -7217 -437
13359 -437 5032 -6983 1960 17079 7918 -4861 2481 -23542 -16352 -2182 -1675 1692 6230 2777
13345B777M95J719k3226N191K7136J4445N714j7265l792m860qn783r23o052l50
13330d782J4896K0206K849m689K201j3723J6194J0033j2113j0492k740j0439K048
13317I449j1882Q514K4210l264m394o767j5238k034R102K32R898N843O712j2111
13303A8270o354k032k46K381k622j5339k7945K1385L7299j0107k2046j2129k216
13290b1701Q550J9353J0414k3568j219l245R206L7591m577k1087l848K984J0130
13277A8983J1834J4662j4995j7113k764j7307J4234k569M186M848j9463M731J5324
13264A4591j2540k3584j199K9104P241K901Q650J3122J437Q991k168k0470m279
13251B1797o907K002K614O033O949j5527r754q329J9555M761L340j306n178P440
$$ plain form
13345 2777 3272 4991 -18235 -13044 14092 28537 34251 16986 13194 8334 8326 2543 1620 -4432 -4782
13330 -4782 10114 30320 33169 28480 30681 16958 33152 43185 31072 20580 17840 7401 9449
13317 9449 -2433 6081 30291 27027 22633 15866 628 -1406 7696 7928 17826 23669 30381 18270
13303 18270 11916 9884 9638 12019 9397 -5942 -33887 -12502 24797 14690 -7356 -19485 -21701
13290 -21701 -13151 6202 16616 -6952 -8171 -11416 -2210 35381 30804 9717 5869 8853 18983
13277 18983 30817 45479 30484 13371 10607 -6700 7534 4965 9151 13999 -5464 -733 14591
13264 14591 2051 -21533 -22732 6372 13613 16514 25164 38286 39723 48714 46546 26076 21797
13251 21797 14890 16892 19506 25539 32488 16961 7207 -1122 18433 23194 26534 25228 20050 27490
13237B7490k049J2711J8068n677K202l278J1439j7231q507K47O678j1490j6781
13224A3822l197K007R763J7661n390k3836j4023Q359M527J7173Q502k990L223
13211C5601k033p270k745K2472J3629j2802j7044r062J0296Q608j4183L818j2281
13198A7004J6340J1311k855l487j0805j0716K4457J423n305p423p963n171k5481
13185h671O751K429N757p170J7804J9417j5510l1348M550J5545J3241M255R20
13172B7970j1127j1467N938n795j4637M356L376N791J9948j987j3683N47j4222
13159d992J003R318n203m329r735p016J7261M303Q105K01K257Q662j0193n049
13145D593R755Q835P64j7782N839J9939K983l2001j3429O817K0126J3899M516
$$ plain form
13237 27490 25441 38152 56220 50543 52745 49467 60906 43675 35168 35415 42093 30603 13822
13224 13822 10625 12632 22395 40056 34666 10830 -3193 5166 9693 26866 35368 32378 35601
13211 35601 33568 26298 23553 46025 59654 46852 29808 20746 31042 39650 25467 29285 17004
13198 17004 33344 44655 41800 38313 27508 16792 41249 42672 37367 29944 21981 16810 -8671
13185 -8671 -1920 509 6266 -904 16900 36317 20807 -10541 -5991 9554 22795 27050 27970
13172 27970 16843 5376 11314 5519 -9118 -4762 -1386 4405 24353 22366 8683 9230 -4992
13159 -4992 -3989 5329 126 -4203 -13938 -20954 -3693 610 8715 8916 11173 19835 9642 4593
13145 4593 14348 23183 23947 6165 12004 31943 34926 2925 -10504 -3687 16439 30338 34854
13132C4854M646o59o497n724j530J2800j470J52j547q794o700j245M175N216K4660
13117E2337j4513r128q736j5898q013m844J0667L3863J9831l594q512J55Q512
13104E2127l147j4631k5997n381P285l151M317k0823r655M755J5673K5805N348
13091C2525q246j2918j1948J400J856j0428Q588J7250O117q011k045J7424J0541
13078D2105p836m415q224Q030m236Q01J1395J7895l957m921r327Q230N288j0147
13064D0681J1380O896L169J838K0773j9558j2808o578J2550j9925o764M896q51
13051C5699n012k90J869M976P371r274L250J202P256L0510J8574k1206m8210k2424
13037D291O507J5806N487p8R898m067J59J166J639j3583p403J6383J4753K703
$$ plain form
13132 34854 39500 38841 32344 26620 25090 37890 36420 36572 35025 26231 19531 18286 22461 27677 52337
13117 52337 37824 28696 19960 4062 -3951 -8795 1872 35735 55566 51972 43460 43615 52127
13104 52127 48980 34349 8352 2971 10256 7105 11422 -9401 -19056 -14301 1372 27177 32525
13091 32525 24279 11361 -587 813 2669 -7759 829 18079 24196 16185 14140 31564 42105
13078 42105 34269 29854 21630 29660 25424 26225 37620 55515 51558 46637 37310 45540 50828 40681
13064 40681 52061 58957 62126 63964 84737 65179 52371 45793 58343 38418 31654 36550 35699
13051 35699 30687 30397 32266 37242 44613 35339 38589 39791 47047 77557 96131 74925 26715 4291
13037 4291 10798 26604 32091 32013 41911 37844 38003 39169 40808 27225 19822 36205 50958 53661
13023E3661q652j175q54m538j9571J154N676l201O565N162J2883j3377n643J4064
13009D2154J7473l275J1314M1239L1390K5885L9652J3665J3299L7552O6357J14381
12997D51086J65147K37231L32943L24250K88738K39566J87712J65809J30021J1647
12987B534150k17425m05904m52256l78361k52328j69244j09408o1427n3724m1036
12977C93037m3518l2744k8310j2569J0401n148l3871k0177j0111j5876k5719r425
12965A65970m994j706q164q052O15M143j7899M896Q829R598M614n35K317P50M110
12950A64492J0761k769Q078q653k2774j9624k099n645j477N300P619M460j1539
12937A26130k06Q096j4975O551P544j5388j3786m344L213L343j1658r065j8805
$$ plain form
13023 53661 45009 43834 42980 38442 18871 20025 25701 22500 29065 34227 47110 33733 28090 42154
13009 42154 59627 56352 67666 108905 140295 166180 205832 219497 232796 270348 336705 451086
12997 451086 616233 853464 1186407 1510657 1799395 2038961 2226673 2392482 2522503 2534150
12987 2534150 2316725 1910821 1458565 1080204 827876 658632 549224 487797 434073 393037
12977 393037 349519 316775 288465 275896 286297 281149 247278 227101 216990 201114 175395 165970
12965 165970 160976 159270 151106 143054 143669 147812 129913 134809 143638 153236 157850 157315 159632 160382 164492
12950 164492 175253 172484 180562 171909 149135 129511 127412 121767 120290 125590 133209 137669 126130
12937 126130 125924 134020 119045 125596 133140 117752 103966 99622 102835 106178 94520 85455 66650
12924F6650j1699J2220O485k7964j1260Q541P185j3023q872n583J7340k408M065
12911D1677K3321L07O615j3557l3110M698R220N214J0205j0774j752J2934k745
12898E2253j2116j2538O914J9086K339J440l080k3772j837P07J0640K308J2981
12885E5325m426r913K013K1028R228k942K3417L4709M064J6918J2908l908p356
12872A51065j0630k1996J309K6480j0256l4808n414K6976K7168n45k909J68j7813
12859A28795k1980k0223j6979o744m926q948j9317M485K0220m520Q239N916J0735
12846G4753J371o147O946J5074r303j4179j0568k645j0585l947J1975J2051J1865
12833G6661J0145l026k126j3443l2805p146R853M909J6307J8595J3144P724K5475
$$ plain form
12924 66650 54951 67171 73656 45692 34432 42973 50158 37135 28263 22680 40020 37612 41677
12911 41677 64998 65305 71920 58363 25253 29951 39171 44385 54590 43816 42064 54998 52253
12898 52253 40137 27599 34513 53599 55938 57378 54298 30526 28689 29396 40036 42344 55325
12885 55325 50899 40986 42999 64027 73255 70313 93730 128439 132503 149421 162329 158421 151065
12872 151065 140435 118439 119748 146228 135972 101164 95750 122726 149894 149349 146440 146608 128795
12859 128795 106815 86592 69613 62869 57943 48995 29678 34163 54383 49863 58102 64018 74753
12846 74753 76124 69977 76923 91997 82694 68515 57947 55302 44717 40770 52745 64796 76661
12833 76661 86806 83780 81654 68211 35406 28260 38113 43022 59329 77924 91068 98792 124267
12820A24267J9802L9642J0929K0024L0304O1325L0586P380k2701J002N414K2998
12808C50972J416k1700q560k0480k1388j9799R505p285k52j7056l2676K048L0017
12795B44762K0156m061j4988k382J204L587j8428k9748j6122n118k5225k2841
12783A30796k2689r644j2350k1930j2566K402O218j367o5j2731j138l447j981
12770C9508j6589k449K3374J5963P443j263J6518J6757P28J1074N464r970l2064
12757G4494k1564m876n079J8359M280j6657m340K3242L9040K9350K6467L4936
12745A97652L1012J4168J1616J3637j2318m7456o1771o7162k8375l1238m2792
12734b3027m6621k9576j6930n33q967n581J6462K1972L822K5620L3447K6186J8224
$$ plain form
12820 124267 144069 183711 194640 214664 244968 306293 336879 344259 321558 322560 327974 350972
12808 350972 352388 330688 322128 301648 280260 260461 269966 262681 262429 245373 212697 214745 244762
12795 244762 264918 260857 245869 243487 244691 248278 229850 200102 183980 178862 153637 130796
12783 130796 108107 98463 86113 64183 51617 54019 60237 58870 58805 46074 44936 41489 39508
12770 39508 22919 20470 43844 59807 67250 65987 82505 99262 99990 111064 116528 106558 74494
12757 74494 52930 48054 42975 61334 65614 48957 44617 67859 106899 136249 162716 197652
12745 197652 228664 242832 254448 268085 255767 208311 146540 79378 51003 19765 -23027
12734 -23027 -69648 -99224 -116154 -116687 -125654 -131235 -114773 -92801 -88979 -63359 -29912 -3726 14498
12721A4498M632J9326K2651N857j8336J2364J465L058J2647O749J0280N449J5759
12708A16399K6986Q154l827j1893k926L59j0687k0250J208N867J8476n675k8557
12695I3634K1694J4340j7555l2020K7815M2649K8770j0069l8449m6514N3378J77981
12683C15654K37438K27183J00393o1278j76728k03941j39087l1531P4539J02185
12673D44827N9381L0206K7737J2765r720m616r546N439J1388l212K685K310J0229
12660E79873k194j2977l1944l8049K254q212o434J665N0713M7997M3066N7463
12648F83221O9057K9431N809j8179j8263l1769n716m739j1681O684L3599J9128
12636G56582L59J0779J7051R994R81J3917N43R371L2405M4328J5068k832J8556
$$ plain form
12721 14498 19130 38456 61107 66964 48628 60992 62457 65515 78162 84911 95191 100640 116399
12708 116399 143385 151539 147712 135819 132893 133252 122565 102315 103523 109390 127866 122191 93634
12695 93634 115328 129668 112113 80093 107908 150557 179327 169258 130809 84295 137673 315654
12683 315654 553092 780275 880668 819390 642662 438721 299634 268103 342642 444827
12673 444827 504208 534414 562151 574916 565196 560580 551034 556473 567861 564649 567334 569644 579873
12660 579873 577679 564702 532758 494709 496963 488751 482317 483982 534695 582692 625758 683221
12648 683221 752278 781709 787518 769339 751076 719307 713591 708852 697171 703855 737454 756582
12636 756582 756941 767720 784771 794765 795746 809663 810206 819577 851982 896310 911378 908546 927102
12623I27102K3267L9028P3395O3082Q5931J41685J71147J59107J44375J10689
12613A938808R5834O4573K0419k9598j12332j71174j37161r9408o2402j868M6388
12602A552079R9582J13690J07662J19934J30111J52289J42378J61059J46614R2844
12592B818242M6942M1914M1366M4528M2806R1149J71352K55783L14514L85869
12582D254465M47991N00318N51844O32875P49314Q55110R53538J116069J326950
12573A1388474J626657K016001K505643L104544L767301M619280N809455P676850
12565D2514205J0685522J5950852K5133475L9354022N5759649O5607963O1398000
12558C16403688M8219192L8108438L4652529L1076816J8212171j1647775n3072577
$$ plain form
12623 927102 950369 989397 1062792 1125874 1211805 1353490 1524637 1683744 1828119 1938808
12613 1938808 2034642 2099215 2119634 2090036 1977704 1806530 1669369 1569961 1507559 1505691 1552079
12602 1552079 1651661 1765351 1873013 1992947 2123058 2275347 2417725 2578784 2725398 2818242
12592 2818242 2865184 2907098 2948464 2992992 3035798 3126947 3298299 3554082 3868596 4254465
12582 4254465 4702456 5202774 5754618 6387493 7136807 7991917 8945455 10061524 11388474
12573 11388474 13015131 15031132 17536775 20641319 24408620 29027900 34837355 42514205
12565 42514205 53199727 69150579 94284054 133638076 189397725 255005688 316403688
12558 316403688 364622880 402731318 437383847 468460663 486672834 475025059 421952482
12551D21952482q3729084q5689133o4933787m3094793k8747159j9743526j3905133
12544H2109867j0128014p714264o129647m998732m030277l224894k697513k385977
12536D0800549k220559k130953k025728j863115j706490j539218j392614j286017
12528B6635855j178668j095284j051978j044674r95800r71451r55549r18552q56220
12519A7567679q31911p78737o99081o48231n60308m73844m20403l72971l37687
12510A2444506l27664l00033k93281l01629k66295k38567k63531k92667k94138
12501I866701l39630l84026l67777l27365l01092k94140k43358k14171k19959
12492G175183k15930k18420j86127j73124j65480j77004j82748j74924j70183
$$ plain form
12551 421952482 338223398 252534265 187600478 144505685 115758526 96015000 82109867
12544 82109867 71981853 64267589 58137942 53139210 49108933 45884039 43186526 40800549
12536 40800549 38579990 36449037 34423309 32560194 30853704 29314486 27921872 26635855
12528 26635855 25457187 24361903 23309925 22265251 21269451 20298000 19342451 18423899 17567679
12519 17567679 16735768 15957031 15257950 14609719 14049411 13575567 13155164 12782193 12444506
12510 12444506 12116842 11816809 11523528 11221899 10955604 10717037 10453506 10160839 9866701
12501 9866701 9527071 9143045 8775268 8447903 8146811 7852671 7609313 7395142 7175183
12492 7175183 6959253 6740833 6554706 6381582 6216102 6039098 5856350 5681426 5511243
12483E511243j57458j55804j46688j27886j17396j32072j37191j34712j14372
12474D287664j27434r8349q5981j19305j05690r4453j16483r9330m8135m6558
12464C345946o2768n5598m7335j9202J6744M5905L0375N8629J24159J77538K10182
12453C824575J66095J08585M6919K0109p938j12260j98875l20332m22212m60006
12443B644660l84464k84116k13812j79851j49798j13946r9506n4946j136O9592
12433A232677Q6779O2949L8817Q6003J61494K22301J30909m8078k14491k85301
12423A474059k39307j43691n8859k3915l2685l5781l8599l0969j3477k6476j72
12412H30128J6543M712k9785k2254j3209k4868j2529m561k1033j7215j4108n4
$$ plain form
12483 5511243 5353785 5197981 5051293 4923407 4806011 4673939 4536748 4402036 4287664
12474 4287664 4160230 4061881 3975900 3856595 3750905 3656452 3539969 3440639 3392504 3345946
12464 3345946 3283178 3227580 3180245 3161043 3177787 3223692 3254067 3312696 3436855 3614393 3824575
12453 3824575 3990670 4099255 4146174 4166283 4158345 4046085 3847210 3526878 3104666 2644660
12443 2644660 2260196 1976080 1762268 1582417 1432619 1318673 1219167 1164221 1163085 1232677
12433 1232677 1319456 1382405 1421222 1507225 1668719 1891020 2021929 1973851 1759360 1474059
12423 1474059 1234752 1091061 1032202 1008287 975602 939821 901222 870253 856776 830300 830128
12412 830128 846671 851383 821598 799344 786135 761267 748738 744177 723144 705929 691821 691767
12400F91767p237R412m074J1180Q204m799j7830j6291m207O253k116p012J7568
12387F80818J3498l526O742K2864K4471J5925K8860J8894J3061R943k0618l2638
12375G78294k6901m4014n9994p8920o3471m4930k7506l1224k6313k1246l98o39
12363C52738L2775L1043L0348R723q232J5969J8788j974K028n682J147n942k8057
12350D44672j6389j1339o240k718J2159K913j2711P293J0298O110J0162Q985o801
12337D46394l946n411N564J134q661j7011n766j5204k0141j1054l314K252K297
12324C67133j5941k1937k7497o711o667j6327j7675j2890n836n67q268j1655j346
12311B13816j7520r212K677J5325p959j5542J2222K4302J3709k779j3559k0940
$$ plain form
12400 691767 684530 693942 689868 701048 709252 704453 686623 670332 666125 672378 670262 663250 680818
12387 680818 694316 690790 697532 720396 744867 760792 789652 808546 821607 831550 810932 778294
12375 778294 751393 707379 647385 568465 504994 460064 432558 401334 375021 353775 353377 352738
12363 352738 385513 416556 446904 456627 448395 464364 483152 481178 483206 477524 478671 472729 444672
12350 444672 428283 416944 410704 407986 420145 423058 410347 417640 427938 434048 444210 453195 446394
12337 446394 442448 437037 442601 443735 435074 418063 412297 397093 376952 365898 362584 364836 367133
12324 367133 351192 329255 301758 295047 288380 272053 254378 241488 235652 235085 226817 215162 213816
12311 213816 196296 187084 189761 205086 197127 181585 193807 218109 231818 229039 215480 194540
12299A94540n100j5898j5556j1784j3924l784o90L534k148j1734J756J52L3160
12286A52524J4459j7144M616K2878J1968q029j2335k7143j1380j0357o251M592
12274A18398J487Q191J8473k2612o824j4167N095K790k3022J52R794K645K958
12261A03358L535o188k582R181N024p417j1566k0065k9130J332j4398l834J3545
12248D0795K855k7430j6201J612l795j2283J1046K5941J9497K064k1692l255J502
12235B0656Q945P019j7207j8130o166K3418K092J0792J9654O424p731p658j423
12222D0685K917j366K0585O656j6734J6467J2629j1049j3378L564Q568j5708L292
12209E7128J3062j2910J3032J1862q903p922L407o24J6983M934J0333r217R790
$$ plain form
12299 194540 189440 173542 157986 146202 132278 128494 127804 131338 129190 117456 119212 119364 152524
12286 152524 166983 149839 154455 177333 189301 181272 168937 141794 130414 120057 113806 118398
12274 118398 119885 128076 146549 123937 117113 102946 108041 110831 87809 87961 97755 100400 103358
12261 103358 106893 100705 98123 107304 112328 104911 93345 73280 44150 45482 31084 27250 40795
12248 40795 43650 16220 19 1631 -2164 -14447 -3401 22540 42037 44101 22409 19154 20656
12235 20656 29601 36620 19413 1283 -4883 18535 20627 31419 51073 57497 49766 42108 40685
12222 40685 43602 42236 62821 69477 52743 69210 81839 70790 57412 60976 69544 53836 57128
12209 57128 70190 57280 70312 82174 73271 65349 68756 68132 85115 90049 100382 91165 100955
12196A00955n186O88O654k817L29j9753J1845J0021j8321j1560l18M119M792k689
12182G8759j7656j1902J8743M674l4006l508J570k03O70k673n664J7029p81K912
12168D7964j7236k377P063q900J446L856j118j2623k918j271K0732K1584Q229
12155F4431m203o224J0426j1407j0889M152k1681J4734J5289R964J8219J4004
12143I6815Q854l024O884k751r757j5008J475N697L816P736O991r045p86J3388
12129A11285K1460K9713J2111J4670J4487M7477P6812J11894J74234K64474L38912
12118A217529L65842K85550K11196J66241J68634J28097r537k10612l87567m58884
12108A476489l98559k64127j56810j04681q7807l3338m4047m7736k9075j7838
$$ plain form
12196 100955 95769 96457 103111 100294 100623 80870 92715 102736 84415 72855 72537 76656 81448 78759
12182 78759 61103 49201 67944 72618 38612 35104 36674 36471 37141 34468 28804 45833 45052 47964
12168 47964 30728 28351 35414 26514 27960 31816 30698 18075 15157 13886 34618 56202 64431
12155 64431 60228 54004 64430 53023 42134 46286 24605 39339 54628 64592 82811 96815
12143 96815 105669 102645 109529 106778 97021 82013 83488 89185 93001 100737 107728 98683 97897 111285
12129 111285 132745 162458 174569 189239 203726 251203 328015 439909 614143 878617 1217529
12118 1217529 1583371 1868921 2080117 2246358 2414992 2543089 2533552 2322940 1935373 1476489
12108 1476489 1077930 813803 656993 552312 464505 431167 387120 339384 310309 292471
12098B92471j7591n981k2028k0098j3950j0447j389R787r49k8140k4594r004r784
12085A38303j8077n693O033J2437p441M156N648q831j6124J386J0421k782K602
12072A22038O943j5742Q387O763j0968k5903j7284L940O769k1j2318J890J3077
12059H7571k2359l3474r877O588q097M384K1770K1760n022k0418K930k698q788
12046C4270j9143l84J4460J462k303j352K172J2755j926J861j9525N448J3653
12033D1448J1458k0831j5295K1057J8817R45O859M567j1798J198R746R362P745
12020H5278J0907o496k2269j8028k3794r640P865J6770J6754n517k6910q556N167
12007B1531p806O480J2445j0232q3N371l414r921J8911L950m410k220K4398O674
$$ plain form
12098 292471 274880 268899 246871 226773 212823 202376 200987 210774 209825 181685 157091 148087 138303
12085 138303 120226 114533 120566 133003 125562 129718 135366 126535 110411 111797 122218 119436 122038
12072 122038 128981 113239 121626 128389 117421 91518 74234 78174 84943 84922 72604 74494 87571
12059 87571 65212 31738 21861 28449 20352 24736 46506 68266 63244 42826 45756 43058 34270
12046 34270 15127 14743 29203 30665 28362 27010 29182 41937 40011 41872 22347 27795 41448
12033 41448 52906 32075 16780 37837 56654 57599 64458 69025 57227 58425 68171 77533 85278
12020 85278 96185 89689 67420 49392 25598 15958 23823 40593 57347 51830 24920 16364 21531
12007 21531 13725 20205 32650 22418 22335 27706 24292 14371 33282 37232 32822 30602 55000 61674
11993F1674j4107j4294o31j4006j3044J0700N695J8541O964j4853r701r538k1861
11980h461o818R838J1067K0147j6623p663L599m851Q261J8169O729n898j9627
11967G869n180J5253Q168J223Q469l215J430J1901M055k6073k3119J0945J5069
11954B6795Q098J2451p664Q686P610K562j3826N803K301r448J2711m863k0732
11941C0484R273J3134o76J045O631o018L712J2797J987k5945j4219j3226k2124
11928c145j142J4472M263J4842J7324o588k1241j5601o812J560Q881J3329o471
11915A3671l261L312n035j3162J457n791J7152R540n095j748K50j7657j3513L996
11901a5884O838K850R107K801r656Q80J7288K006Q525k639n493m133J313J132
$$ plain form
11993 61674 47567 33273 32642 18636 5592 16292 21987 40528 47492 32639 22938 13400 -8461
11980 -8461 -15279 -5441 5626 25773 9150 1487 5086 235 8496 26665 33394 27496 7869
11967 7869 2689 17942 26110 27333 35802 32587 34017 45918 49973 23900 781 11726 26795
11954 26795 34893 47344 39680 48366 55976 58538 44712 50515 52816 43368 56079 51216 30484
11941 30484 39757 52891 52215 53260 59891 53873 57585 70382 72369 46424 32205 18979 -3145
11928 -3145 -4287 10185 14448 29290 46614 40026 18785 3184 -3628 -2068 6813 20142 13671
11915 13671 10410 13722 8687 -4475 -3018 -8809 8343 17883 12788 11040 11290 -6367 -19880 -15884
11901 -15884 -9046 -6196 2911 5712 -3944 -3064 14224 16230 24755 22116 16623 12490 13803 14935
11887A4935o206n86j4682J0376J9894M428l756J0908J0047K969j8303j4383K616
11874A8257j2968r937O388L731j0340O69R362L925J2858n262o140L846J118N085
11860B0592j239j4021j3467J0636J2459j604j9848j0282R430k42r03o799r846
11847b5134J5293K1743J3561J5916J6803j4944k3068q707j760K14r199J8150m026
11834A4842k6576k308J6626K9420M539r366K566j1021j5937l769K0749J1405J6765
11821D7935q29q169j5626q52J1501j8116j5835K034R090j551N850Q612j979l147
11807A8918j152j2029j8260j5661L159K6213L465k272J4226K187M318m378R385
11794B8119J3889l401j1194j2857j093j5855N627Q716J196j029J1916J0490J7755
$$ plain form
11887 14935 8729 8143 -6539 3837 23731 28159 24403 35311 45358 48327 30024 15641 18257
11874 18257 5289 -4648 1740 5471 -4869 -4200 5162 9087 21945 16683 10543 14389 15507 20592
11860 20592 19353 5332 -8135 2501 14960 13356 -6492 -16774 -7344 -7586 -8489 -15288 -25134
11847 -25134 -9841 11902 25463 41379 58182 43238 20170 11463 9703 9917 718 18868 14842
11834 14842 -11734 -14042 2584 32004 36543 27177 29743 18722 2785 -984 19765 31170 47935
11821 47935 47106 38937 23311 22459 33960 15844 9 2043 11133 9582 15432 24044 22065 18918
11807 18918 17766 5737 -12523 -28184 -25025 1188 4653 2381 16607 18794 23112 18734 28119
11794 28119 42008 38607 27413 14556 13463 -2392 3235 11951 13147 12118 24034 34524 52279
11781E2279j4981j6746K958J2523l503k0062j3570p691M105K2989j6380Q530p645
11768B806l798p427l728J4215M884o471n314m404q470J6155J5094j464k0949j2907
11754b1778L296R66j801M224M545Q378K1128q2j6674m899J3975J8556N583J1453
11740D6870J779q833k2161o737j129J4225P443p191j1604r672l193J484j486O742
11726F537J0908Q13j4114O560N081j077q871L3675K1812j4989j8505q156j0889
11713H785q853R322J6416r099j3245Q325J5259l919O241o55q833p469K703j9249
11699d271j0506J1162J2116j457k2152M298P123l650L877j226K0738K2884J802
11686D0738j7067o525q841l8372j0238j630q53K1833J0136L1912M388m251r078
$$ plain form
11781 52279 37298 20552 23510 36033 32530 12468 -1102 -8793 -4688 18301 1921 10451 2806
11768 2806 -992 -8419 -12147 2068 6952 481 -4833 -9237 -17707 -1552 13542 12078 -8871 -21778
11754 -21778 -18482 -17516 -19317 -15093 -10548 -2170 18958 18876 2202 -2697 11278 29834 35417 46870
11740 46870 48649 39816 17655 10918 9789 24014 31457 24266 12662 2990 -203 1281 -205 6537
11726 6537 17445 18258 4144 10704 15785 14708 5837 39512 61324 46335 27830 19674 8785
11713 8785 -68 9254 25670 16571 3326 11651 26910 22991 29232 28577 19744 12275 14978 -4271
11699 -4271 -14777 -3615 8501 7044 -15108 -10810 -3687 -7337 -3460 -4686 16052 38936 40738
11686 40738 23671 17146 8305 -30067 -40305 -41935 -42788 -20955 -10819 21093 25481 21230 12152
11673A2152J0502O200j0605N478J8672m52p677k0947j5767L957P278j6753r532
11660a7494p906J5545J1271K2732j2814m105n471j2138k617j3760J3521j1P399
11647e848R251K382j520J1083J4234J9608j1171k8106k636n39j4477r502P419
11634i822n231L998m507j210J0682J2375K671p162P425O633Q051J2454j1011r294
11620A6052j0039K269M675j5487l62j1111m375N84N08M883l003N467q380J6052
11606b267J3932j7379k023r928p714q521J6767J2490l937M569L41j388J6286K102
11592A3330j0625J8750J8499o245j4525n567r034K203M784P297J7187p516p776
11579B0762K652J1177n073N350J3117O93j3367r872R90j7574j202O336K275K782
$$ plain form
11673 12152 22654 28854 18249 23727 42399 41947 34270 13323 -2444 1513 8791 -7962 -17494
11660 -17494 -25400 -9855 1416 24148 11334 7229 1758 -10380 -12997 -26757 -13236 -13247 -5848
11647 -5848 3403 5785 4265 15348 29582 49190 38019 9913 7277 6738 -7739 -17241 -9822
11634 -9822 -15053 -11055 -15562 -16772 -6090 6285 8956 1794 9219 15852 23903 36357 25346 16052
11620 16052 6013 8282 12957 -2530 -2892 -14003 -18378 -17794 -17286 -12403 -15406 -9939 -18319 -2267
11606 -2267 11665 -5714 -7737 -17665 -25379 -33900 -17133 -4643 -8580 -4011 -3670 -5058 11228 13330
11592 13330 2705 21455 39954 33709 19184 13617 4583 6786 11570 18867 36054 28538 20762
11579 20762 23414 34591 29518 34868 47985 48678 35311 25439 26429 8855 7653 13989 16264 19046
11565A9046M701J7265j942l896L652n06q960R199q774j2376J1207M169j0453l276
11551A9056q599n828m718L079K382j1934n549O744J795r530j2351L55R69m332
11537b8461O441K0133N290l804K3994P688j3291J5141J116J2790J641k1658j0015
11524A7005q285K698P294J0073J450L032O342o317J0421j2708j9662q85j982l082
11510E394o066K249P276K0103j24L697l0932k312J7534M319L488p573r549m120
11496C384J3534Q16l939k1256L482N403J382l994j6687Q894K0382M296P78J049
11482A7524J4503j1063K58j397j1252j5103Q047J6347j4831K666O993j0913q430
11469f651p776K2136J1174k119q42j696L64j9722r433R613J2146L254J2361j4228
$$ plain form
11565 19046 23747 41012 39070 35174 38826 38320 29360 38559 29785 17409 28616 32785 22332 19056
11551 19056 10457 4629 -89 2990 5372 -6562 -12111 -5367 -3572 -13102 -25453 -25098 -24129 -28461
11537 -28461 -22020 -1887 3403 -401 23593 31281 17990 33131 34247 47037 48678 27020 17005
11524 17005 8720 11418 18712 28785 30235 33267 39609 33292 43713 31005 11343 10458 8476 5394
11510 5394 -672 1577 8853 28956 28832 32529 1597 -715 16819 21138 24626 17053 7504 3384
11496 3384 16918 17734 13795 -7461 -3979 1424 2806 -1188 -17875 -8981 11401 15697 16475 17524
11482 17524 32027 20964 21222 19825 8573 -6530 1517 17864 3033 5699 12692 1779 -6651
11469 -6651 -14427 7709 18883 16764 15922 14226 14590 -5132 -14565 -4952 7194 10448 22809 8581
11455H581k042j698J4939p05j8166j488j379J4014L1276J0215k873j0041l9562
11442A071r065R674J6870R310J4621J3222k3844k0409j4217j1960R594j748j007
11429g888q478j8511L419Q012K0444j5312o516r86J7950J4581p029N302J4495
11416A9483j3096k0285M46J5907J665m33l575P476K1573j2747j5907q103j0350
11403a7946m360R447N413Q107O228r6o274r574L112j0569J7659q90j233J9366
11389A8390m22L84K505k733k7074P11J055j2805o053M896K887J1507R764o278
11375c266P542O285o411l817R89j049L221p92M584n009J7371R749j5397R88q785
11360F203q931Q583N941j9916r639O523K2113j1217j2625J4098J8667J2353j9958
$$ plain form
11455 8581 6539 4841 19780 19075 909 -579 -1958 12056 43332 53547 50674 40633 1071
11442 1071 -7994 1680 18550 27860 42481 55703 31859 11450 -2767 -14727 -5133 -6881 -7888
11429 -7888 -16366 -34877 -31458 -23446 -3002 -18314 -24830 -25816 -7866 6715 -314 4988 19483
11416 19483 6387 -13898 -13452 2455 4120 3687 112 7588 29161 16414 507 -7596 -17946
11403 -17946 -22306 -12859 -7446 661 6889 6793 519 -9055 -5943 -16512 1147 257 -976 18390
11389 18390 17968 18352 20857 18124 -8950 -8239 -7184 -19989 -26042 -21146 -18259 -6752 3012 -3266
11375 -3266 4276 10561 4150 333 1322 273 3494 2702 7286 2277 19648 29397 14000 14988 6203
11360 6203 -2728 5855 11796 -8120 -17759 -11236 10877 -340 -12965 1133 19800 32153 12195
11347A2195N103J3785M510k943j3319k6961M439j431k603R498Q690N311m080j0289
11333A905k37N062k1412j3236k820O048O542J5135P055R25J2959k632m380N629
11319A6543n946j9161K314J0833j9766m995k395K1711O034J6275J0391M837k0785
11306A5890j4302K616r8M341K3636J1729j0110j1861R692Q154P270R802n779P42
11292E1722j2636L610m406n676O925J9783J555j1414l7164j4823L588J248j74
11279B138K3221K2419J817j1098k83j2652K113j1491L04J1155K151k4262r317
11266c785k3155L966R02m671J0687J9736k223L006k792j3097R382R023J0178r854
11252G303L461m535j5722j1461L112k234Q360J084J4506J3431R279q344J37R464
$$ plain form
11347 12195 17298 31083 35593 32650 19331 -7630 -3191 -4622 -7225 2273 10963 16274 12194 1905
11333 1905 1668 6730 -14682 -27918 -30738 -24690 -18148 -3013 4042 4967 17926 15294 10914 16543
11319 16543 10597 -8564 -6250 4583 -15183 -20178 -22573 -862 5172 21447 31838 36675 15890
11306 15890 1588 4204 4106 8447 32083 43812 33702 21841 31533 39687 46957 56759 50980 51722
11292 51722 39086 42696 38290 32614 39539 59322 60877 49463 12299 -2524 1064 2312 2138
11279 2138 25359 47778 49595 38497 38214 25562 27675 16184 16488 27643 29794 5532 -3785
11266 -3785 -26940 -22974 -22072 -26743 -16056 3680 1457 4463 1671 -11426 -2044 6979 17157 7303
11252 7303 10764 6229 -9493 -20954 -17842 -20076 -11716 -10632 3874 17305 26584 18240 18377 27841
11238B7841L27j0618M85k370k4733j1268K337J281L22L3962o703j0588J23J5307
11224A5705Q011k807j1913m163K1269o52j3136j2248j1935J6688K5894j7953k3519
11211a0759o36o998J4710j253N443J4082J8808N599j776J4588J5425R614j052
11198G5795n903k0948k0990k1684n576o447M749P12m28k281j3175O784J2901q945
11184e436j2863m457J1288R462Q757R124j034K61q64o802m89k02J914j0002r04
11169b247o092Q278K418o624k879q578m007o51P181K6800l522J0575J1785k4676
11155G761j806L818L68J003l033j4741k1647J1938Q087J1332J7001j8j6023j0552
11141f512L621j3584j7281Q160K7429j2317n210j00J3351K9570j0934j9326o33
$$ plain form
11238 27841 28168 17550 18035 15665 -9068 -20336 -17999 -16718 -16396 17566 10863 275 398 15705
11224 15705 23716 20909 8996 4833 26102 25450 12314 66 -11869 4819 30713 12760 -10759
11211 -10759 -11395 -18393 -3683 -4936 507 14589 33397 38996 37220 51808 67233 76847 75795
11198 75795 69892 48944 27954 6270 694 -5753 -1004 -292 -720 -3001 -16176 -9392 3509 -5436
11184 -5436 -18299 -22756 -11468 -2006 6751 15875 14841 15102 14238 7436 6947 6745 8659 -1343 -2247
11169 -2247 -8339 -61 2357 -4267 -7146 -15724 -19731 -20382 -13201 13599 10077 20652 32437 7761
11155 7761 5955 9773 10141 11144 8111 -6630 -28277 -16339 -8252 3080 20081 20063 4040 -6512
11141 -6512 -2891 -16475 -33756 -25596 1833 -10484 -15694 -15794 -2443 27127 16193 -3133 -3766
11128c766m961m251J6274m036k0975o072P792P809L0142O857j8142j0240j503
11115e072P227K014P048j2830j4913k53k0o297o314r69J4383J6832P006r336N12
11100i82K3456J625j6008K1140O62k459j3614l001j5376P613J8349M397p271j4218
11086D313n752K146p273j2920K0108J204K291q970p949n031j0493J4815P635l737
11072i613N588o218m661R139P501k075R160r649j0692K001O712O004O569O26Q063
11057A8455j4252M726j3945j2501J5554n428j8962J029J8213J0250J5531P326
11045B5996k2806j4274j89J0097J6707J1274r926L987k940m144J79k307r061J1231
11031A3824J0588j0429J1384j160j2303O523J388k578j5759j3635P665l24R180
$$ plain form
11128 -3766 -8727 -12978 3296 -740 -21715 -27787 -19995 -12186 17956 24813 6671 -3569 -5072
11115 -5072 2155 4169 11217 -1613 -16526 -16779 -16799 -23096 -29410 -30379 -15996 836 7842 -1494 -982
11100 -982 22474 24099 8091 29231 29893 27434 13820 10819 -4557 3056 21405 25802 18531 4313
11086 4313 -1439 707 -6566 -19486 622 1826 4117 -4853 -12802 -17833 -28326 -13511 -5876 -9613
11072 -9613 -4025 -10243 -14904 -5765 1736 -339 8821 -828 -11520 -9519 -2807 3197 9766 10392 18455
11057 18455 4203 8929 -5016 -17517 -1963 -7391 -26353 -25324 -7111 3139 18670 25996
11045 25996 3190 -11084 -11273 -1176 15531 26805 16879 20866 17926 13782 13961 11654 2593 13824
11031 13824 24412 13983 25367 24207 11904 18427 19815 17237 1478 -12157 -4492 -4816 4364
11018D364M556K711k2610l2730m128K2722K2786j0270J9358K0675j1831j7193
11006a590n87J901P581J2890j2463p375o870Q241J9854J2495j1147k1813P345
10993H462J6227q701j9191K232J1124J6090j130j5796L324R53j294k260Q388N241
10979B3669j1290k0517J0649L850k158n176L623L145L670k417Q107n919n341K698
10965F593R32l29j0896o740j4546J504m431L269J9069J7197J722j361j727o749
10951C507M458K0159o819q757l154j4084R063J3417J7000o251k6501k0979l530
10938b2471J8720K804K63R066O345q256j5573M669R581Q796q205R768j129k6883
10924a2505j7575N837J5597J029l0364k1684K0609J7220R186J6636j2610n574
$$ plain form
11018 4364 8920 11631 -10979 -43709 -47837 -25115 -2329 -12599 6759 27434 15603 -1590
11006 -1590 -2177 -276 7305 20195 7732 357 -6513 1728 21582 34077 22930 1117 8462
10993 8462 24689 15988 -3203 -971 10153 26243 25113 9317 12641 13594 12300 10040 18428 23669
10979 23669 12379 -8138 2511 6361 4203 -973 2650 5795 9465 7048 15155 9236 3895 6593
10965 6593 7525 7196 -3700 -10440 -24986 -23482 -27913 -24644 -5575 11622 13344 11983 10256 3507
10951 3507 7965 28124 21305 12548 9394 -4690 4373 17790 34790 28539 2038 -18941 -22471
10938 -22471 -3751 -947 -684 8382 14727 6471 -9102 -4433 5148 13944 5739 15507 14378 -12505
10924 -12505 -30080 -24243 -8646 -7617 -37981 -59665 -39056 -21836 -12650 3986 -8624 -14198
10912a4198N786r024k600J0452J748O854M964K1191j1490k1415M710K736j4073
10899a4359L004P919o164r429j2621j6415K0500P529J3540J29R04P999r516j5313
10885b2293Q795K4081n109j4859q711K475o984O17K0182P807r005o246n987m84
10871a5721R071k806O568K934n458J8301J0937o455j5288k314p398k3681L297
10858b8013l917K0221J1404J546j2977r761N404k1997M622K9843Q807M437l613
10845F006l339j461q449k90O738j2597L210J1526p839q81m102J320J7955Q107
10831A5904j7892R227p549m610J5254M913O740p752j0549n393j1714N618m327
10818a2130J6130J4795q890M880j6807j4859J5721j8924L250Q885k3236j8380
$$ plain form
10912 -14198 -8412 -17436 -20036 -9584 -7836 -982 3982 25173 13683 -7732 -3022 -286 -14359
10899 -14359 -11355 -3436 -9600 -19029 -31650 -48065 -27565 -20036 -6496 -6367 -5463 2536 -6980 -22293
10885 -22293 -13498 10583 5474 -9385 -18096 -15621 -22605 -21988 -1806 6001 -3004 -9250 -15237 -15721
10871 -15721 -6650 -9456 -2888 46 -5412 12889 23826 17371 2083 -231 -7629 -31310 -28013
10858 -28013 -31930 -11709 -305 1241 -11736 -21497 -16093 -38090 -33468 -3625 5182 9619 6006
10845 6006 2667 1206 -7243 -7533 -795 -13392 -10182 1344 -6495 -7376 -11478 -10158 7797 15904
10831 15904 -1988 7239 -310 -4920 10334 15247 21987 14235 3686 -1707 -13421 -7803 -12130
10818 -12130 4000 18795 9905 14785 -2022 -16881 -1160 -20084 -16834 -7949 -31185 -49565
10806d9565m032L219K1204J1Q894O338j0579J1174J3253K2224j2829k6982p780
10793b5450N315K373K0806M257K3042j7570j5343l866l045l553O05o087r111j7058
10779d4685J3888J3710N13L2358k0628k3173j395n402O106k13R845q896k546K492
10765b8026J7369O74q187Q056N141q12K275J5438Q042q901l100N983Q423p644
10751A4731R67N990o308m0886j3716J1196l011Q617J5134K1935l316L235k2137
10738g569p976K3561K7873K563l563J0774r837k7469n801r17o69j2196j0174K056
10724a9344l661L229L33P102k697k306o902j4900j8921J6160J3907O464J689P915
10710a1932R253o021N707j0989R44J5465J975N221M803J6289K1362O105j4085
$$ plain form
10806 -49565 -53597 -50378 -29174 -29163 -20269 -13931 -24510 -13336 -83 22141 9312 -17670 -25450
10793 -25450 -20135 -17762 3044 7301 30343 12773 -2570 -6436 -9481 -13034 -12429 -18516 -27627 -44685
10779 -44685 -30797 -17087 -16574 15784 -4844 -28017 -29412 -34814 -28708 -28921 -19076 -27972 -30518 -28026
10765 -28026 -10657 -9983 -18170 -10114 -4973 -5785 -3510 11928 19970 11069 7969 13952 22375 14731
10751 14731 15698 21688 15380 -25506 -39222 -28026 -31037 -22420 -7286 14649 11333 14568 -7569
10738 -7569 -15545 8016 35889 38452 34889 45663 35826 8357 2556 1639 970 -11226 -21400 -19344
10724 -19344 -23005 -19776 -19443 -12341 -15038 -17344 -24246 -39146 -58067 -41907 -28000 -21536 -19847 -11932
10710 -11932 -2679 -8700 -2993 -13982 -13038 2427 4402 9623 14426 30715 52077 58182 44097
10697D4097q399p396Q259Q698k0772j5741j5671m666J904o418j4746P926J4653
10684h272j035L704Q735L706p046k119J7725o750m566j256j4978l991J8413J7050
10670A9320j340j884J0901j2805p907m207Q825P352k768N428R2J4870n04P41K210
10655C8324q111j4646j525J1018o764q235J1334J096n416j2369J972L626O760
10642A7064j2433k2874K357J5721k911K172N610O808P592N711O062O038K878l868
10628C5927j3330N245l017k895j6887Q715M466q86J4949j702j659k347j1957k0730
10614f108J006J8438m099J3583K117k427j6315j3817J6222Q563J1223q0j407l172
10600B3727o357p158P162j2574j5153J6488p062m387L649m01n72j001K1005R206
$$ plain form
10697 44097 35698 28302 36561 45259 24487 8746 -6925 -11591 -9687 -16105 -30851 -22925 -8272
10684 -8272 -9307 -5603 3132 6838 -208 -2327 15398 8648 4082 2826 -12152 -16143 2270 19320
10670 19320 17980 16096 26997 14192 6285 2078 10903 18255 15487 20915 21007 35877 35373 36114 38324
10655 38324 30213 15567 14042 25060 18296 10061 21395 22491 17075 4706 6678 10304 17064
10642 17064 4631 -18243 -15886 -165 -3076 -904 4706 11514 19106 24817 30879 36917 39795 35927
10628 35927 22597 27842 24825 21930 5043 13758 18224 17338 32287 30585 28926 26579 14622 -6108
10614 -6108 -5102 13336 9237 22820 24937 22510 6195 -7622 8600 17163 28386 28306 26899 23727
10600 23727 17370 10212 17374 4800 -10353 6135 -927 -5314 -1665 -2066 -2638 -3639 17366 26572
10586B6572j9254q098o716n29J7371n550p721r711L168j1526j1701K4931l893
10573a2657k640k1927o64J0449k06J3682O925N961J2542j199k250P370j7506N040
10559B920j956L6J3576j8713N239J2977l063o325K028J5574r548j3231j0781l799
10545a5066j9339j5267J5182K346j6512L412J3237o388P536J215L042J9210M008
10532c384L219n153j406P458o296P251J6173o207J8919O68j1684j0196k7675J2323
10518e990K2743k020K779j2703j7160R47L804m596J748M417n094R717L561j0608
10504h455J4509O560k38k6567j5246j835J4184K6682k841J1095O096j9233r983
10491e272p170l831K161J674R867k732J131M511J6000n34k092M195k4949j8616
$$ plain form
10586 26572 7318 -780 -7496 -8025 9346 3796 -3925 -13636 -10468 -21994 -33695 -8764 -12657
10573 -12657 -15297 -37224 -37888 -27439 -27645 -13963 -7038 -1077 11465 10266 8016 15386 -2120 2920
10559 2920 964 1000 14576 -4137 1102 14079 11016 4691 6719 22293 12745 -486 -11267 -15066
10545 -15066 -34405 -49672 -34490 -32144 -48656 -45244 -32007 -38395 -30859 -29644 -26602 -7392 -3384
10532 -3384 -165 -5318 -6724 734 -5562 1689 17862 11655 30574 31242 19558 9362 -18313 -5990
10518 -5990 16753 14733 17512 4809 -12351 -11404 -7600 -12196 -10448 -6031 -11125 -1408 2153 -8455
10504 -8455 6054 12614 12376 -14191 -29437 -31272 -17088 9594 6753 17848 23944 4711 -5272
10491 -5272 -12442 -16273 -14112 -12438 -2571 -5303 -4172 339 16339 15805 13713 17908 -7041 -25657
10477b5657l167R939j685J2333Q167k1J2032m461j4432l0761J834O667J8989K6316
10463A6093J288Q28k024m029M257r218p167J2257j742j3922M728k98J3811j9596
10449d734p707O115j459K5070K7513p016j2973L596j0082j8663p033K0082K1110
10436C3819j2166j0701j0210M522j5752j4762p24K3098m762R785J1767l562P980
10423A8332K3751k586j4441l0854N764K345Q419n9q222Q468J2999P289m958j3206
10409A3041l519J7033O426j9964j1198j8373J1412L0870J1034Q646K6839k4492
10397D7755p489K3562K0649L234M190N386K4907K0021L1247K8789M9182O0130
10385C11563P0469Q2867Q9245R2017Q5519R7355O7243L2385K9058M492m6605p9486
$$ plain form
10477 -25657 -28824 -18885 -20570 -8237 -70 -91 11941 7480 -6952 -37713 -35879 -29212 -10223 16093
10463 16093 17381 18209 16185 12156 16413 7195 28 12285 10543 -3379 1349 1051 14862 -4734
10449 -4734 -12441 -6326 -7785 17285 44798 37782 24809 28405 18323 -340 -7373 12709 33819
10436 33819 21653 10952 742 5264 -10488 -25250 -25974 -2876 -7638 2147 13914 10352 18332
10423 18332 42083 39497 25056 -5798 -34 2311 10730 10671 2449 10917 23916 31205 26247 13041
10409 13041 9522 26555 32981 13017 1819 -16554 -5142 25728 36762 45408 72247 47755
10397 47755 40266 63828 84477 87711 91901 97287 122194 142215 173462 202251 251433 311563
10385 311563 382032 464899 554144 646161 731680 829035 896278 928663 957721 962213 915608 836122
10373H36122p3443q4742j01549q4826q6684p4871l3368m8983n0407j6666r396
10362A71187J680k4001j9794j5713q679j4347r790P03l758J3685N496k1022n411
10349G0236j1682N857n381k5349J2513j1872j3634l833L449l510R227K3490K0290
10336F9801P78j0070j0314j7103o482K906l76J0220j9574j3512J1540N801L476
10323B7091P403O118o029P090N976o936p544M118J971o896J1375l33K898J1548
10309E7850j9000j7603N517Q346K150j0L821Q253p955o535n463N742j0070Q111
10295C3154R832m772J1720N905N431p814Q233J7351J6253K0998P183L1201L2064
10282A86739N1306J08650J15661J41494J40624J20610J24299J45351J62163J34471
$$ plain form
10373 836122 762679 677937 576388 491562 404878 330007 296639 247656 197249 180583 171187
10362 171187 172867 148866 129072 113359 104680 90333 80543 81246 77488 91173 96669 75647 70236
10349 70236 58554 64411 59030 33681 46194 34322 20688 16855 20304 16794 26021 49511 69801
10336 69801 70579 60509 50195 33092 26610 29516 29140 39360 19786 6274 17814 23615 27091
10323 27091 34494 40612 34583 41673 47649 40713 33169 37287 39258 32362 43737 43404 46302 57850
10309 57850 38850 21247 26764 35110 37260 37250 41071 49324 41369 34834 29371 35113 25043 33154
10295 33154 42986 38214 49934 55839 61270 53456 61689 79040 95293 116291 123474 154675 186739
10282 186739 238045 346695 462356 603850 744474 865084 989383 1134734 1296897 1431368
10272A431368J02005L3023o0841j09461o9899j3834k8612p7218j71071j97968
10262H37492j76125j30032j02914p8083m8150k2021j2801l0723k4247j790j3877
10251A96729j8818m214P661n656j5310l958k139m193j6860J1528j2539l4618j2478
10238H5135M483J0274R890N990l2161K910Q194J9265r251k8184m82L234j817p968
10224F9512q058N66P471K078k861q679k597L764o965M389o476j6416K481j6567
10210B1642j832P874R834J1109k180o776m760J475J0208j3910k0049P541p451
10197A2725k4197J3385K2283R728l479r136p777j0994K3844j732j6750N359J9124
10184C2383k83O470j0662M716j2759q13n851m888m627l650K5342R091K886j0291
$$ plain form
10272 1431368 1533373 1566396 1505555 1396094 1326195 1312361 1283749 1206531 1035460 837492
10262 837492 661367 531335 428421 350338 302188 280167 267366 236643 212396 210606 196729
10251 196729 177911 173697 181358 175702 160392 156434 154295 150102 133242 144770 132231 97613 85135
10238 85135 89618 99892 109782 115772 83611 86521 94715 113980 104729 76545 76063 79297 77480 69512
10224 69512 61454 62020 69491 71569 68708 60029 57432 61196 54231 58620 52144 35728 38209 21642
10210 21642 19810 27684 37518 48627 46447 39671 34911 36386 46594 32684 12635 20176 12725
10197 12725 -11472 1913 24196 33924 30445 21309 13532 2538 26382 24650 7900 13259 32383
10184 32383 32100 38570 27908 32624 19865 19052 13201 8313 3686 36 25378 34469 37355 27064
10170B7064k3620j3044l302j7720n4K3105J7759L355k8387O779J4334l308o284
10157c323M710O748j514l358r341j3288q272N106J1394L561J8234m23r022j2943
10143a1731m25P154J0214P869M11M554k1254K582P720j439O96j0890L03L674r258
10128i820J0716k953p216P855j1420l087m379L697j0951J1990J3270l686N709
10115b75p871k97O242j0824o785j4559K0399L2537J0561k5061J43o471j1189j1623
10101b5073J1868J649J0966O260N792j0236k7731j583R962K9831J0030o734j9489
10088d488j1175q619J4282J5042J0385Q113j0823q523Q895P13L703k114j421K525
10074A6495j848Q325O398n782j3919r389N019K851J0830K475j5161k2870P590
$$ plain form
10170 27064 3444 -9600 -12902 -30622 -30676 -7571 10188 13543 -14844 -8065 6269 2961 -3323
10157 -3323 1387 8135 6621 3263 -6078 -19366 -27638 -22532 -11138 -7577 10657 10234 1212 -11731
10143 -11731 -12156 -5002 5212 13081 13492 18046 -3208 -626 7094 5655 6351 -4539 -4236 -562 -9820
10128 -9820 896 -2057 -9273 -1418 -12838 -15925 -20304 -16607 -27558 -15568 -2298 -5984 -275
10115 -275 -8146 -8443 -2201 -13025 -19810 -34369 -13970 18567 29128 4067 4210 -2261 -13450 -25073
10101 -25073 -13205 -11556 -590 5670 11462 1226 -26505 -28088 -18126 11705 21735 15001 -4488
10088 -4488 -15663 -24282 -10000 5042 15427 23540 12717 4194 13089 13802 17505 15391 13970 16495
10074 16495 14647 22972 29370 23588 9669 280 5299 8150 18980 21455 6294 -16576 -8986
10061h986j667o815q835J5689K4764J349k3971j7973n489J3090O554n208J6600
10048h98P644j765K5534Q145K410j0993k0186r385R633j526j6055j1151K460J1418
10034d715n654Q891R853r748k0346q52J5402l338K0201J1771k4076j6831J0245
10021i197J8662N236l810j9671Q705J5718J260j2807j8166J5342J1718j9229j0424
10008a6663R351O26l85L117k573K171K838r918j7676n59k07J7595R672J8017m616
9993A0790q456j7854N124J3238l706j0618n123J4486K0285J5045J3763j2307j0276
9980B4391n022M368J115J914k142k4903J392O45N606Q797N00l626j3769J4411
9966A3677m03M980J0428j2489j751J9725M241l320r466O083K505j6472j0097j6129
$$ plain form
10061 -8986 -10653 -17468 -26303 -10614 14150 15499 -8472 -26445 -31934 -18844 -12290 -17498 -898
10048 -898 6746 4981 30515 38660 41070 30077 9891 506 10139 8613 -7442 -18593 -16133 -4715
10034 -4715 -10369 -1478 8375 -1373 -21719 -22571 -7169 -10507 9694 21465 -2611 -19442 -9197
10021 -9197 9465 14701 10891 -8780 -75 15643 16903 4096 -14070 1272 12990 -6239 -16663
10008 -16663 -7312 -6686 -7071 -3954 -6527 -4356 -1518 -11436 -29112 -29671 -29878 -12283 -2611 15406 10790
9993 10790 2334 -15520 -10396 2842 -864 -11482 -16605 -2119 18166 33211 46974 34667 24391
9980 24391 19369 23737 24852 26766 24624 -279 1113 1758 7364 16161 16661 13035 -734 13677
9966 13677 13274 18254 28682 16193 14442 34167 38408 35088 25622 31705 34210 17738 7641 -8488
9952h488K950J8792J0085j5130j9765K87M095P245J3371R136j28O237k398k433
9938B3856n952p658J471J2905o031r642j681Q928M071m886q170q189j4612M894
9924a0696K1732l277k024j4617n587j4406o349J5797K0552J7444j0082j3555l350
9911h418Q827m506l463P434q802p251J3727j3081j9876O977m021K4717N808m453
9897f381O793r232k419o412M560K896P033j2259q240L0352K7446o296j2668j7053
9883a880O78k1227q288M676K1851J0950l989l0J258K660j8288j6830l510P828
9869b4141J4027K0040M964j4136n207J8838J1613j3630q714j5136q760r922O059
9856b4105O073J0493K61O328K390o155L175Q535J193l589n334J3316J6320k978
$$ plain form
9952 -8488 -5538 13254 23339 8209 -11556 -11269 -7174 71 13442 22578 22450 28687 26289 23856
9938 23856 17904 10246 11717 24622 18591 8949 7268 16196 20267 15381 7211 -978 -15590 -10696
9924 -10696 11036 7759 5735 -8882 -14469 -28875 -35224 -19427 1125 18569 8487 -5068 -8418
9911 -8418 409 -4097 -7560 -126 -8928 -16179 -2452 -15533 -35409 -28432 -32453 -7736 -1928 -6381
9897 -6381 412 -8820 -11239 -17651 -13091 -10195 -3162 -15421 -23661 6691 34137 27841 15173 -1880
9883 -1880 -1202 -22429 -30717 -26041 -4190 6760 2771 2741 3999 6659 -11629 -28459 -31969 -24141
9869 -24141 -10114 9926 14890 754 -4453 14385 25998 12368 3654 -11482 -20242 -30164 -24105
9856 -24105 -18032 -7539 -7278 -950 1440 -4715 -1540 6995 8188 4599 -735 12581 28901 25923
9842B5923r44p302J111k1536K825j2682L875L860P276k759J09p552r034L844J9244
9827F258j6251j1785L738P418o59L379p324j5559J368J2915P653J736J3010O442
9813A2339K031n134o217J925j3620J6737m633R277J8182k728j5432l893j3483
9800d649P892L432j0738j0444k754K800K669O93k0253J0866J2322j076l673K025
9786a0888O0M725J2797K921j4472J3527J1686j1342n189J2096K17j0582m431k316
9772a191o937K701J8451j274j6134o953r549J646J4555J1167J2695O15M443q951
9758A5284j302J1685J341k2867q092J9653k920o744M66j555k761n408O645J951
9744E376j0935j5284O471J1047k3671j6015J0264J0898l184N263L052o587q762
$$ plain form
9842 25923 24979 17677 18788 -2748 77 -12605 -8730 -4870 2406 -353 -244 -7796 -16830 -12986 6258
9827 6258 -9993 -21778 -18040 -10622 -11281 -7902 -15226 -30785 -29417 -16502 -8849 -7113 5897 12339
9813 12339 14370 9236 3019 4944 -8676 8061 3428 12705 30887 28159 12727 8834 -4649
9800 -4649 3243 6675 -4063 -14507 -17261 -14461 -11792 -11099 -31352 -20486 -8164 -9240 -12913 -10888
9786 -10888 -10828 -6103 6694 9615 -4857 8670 20356 9014 3825 15921 16138 5556 1125 -1191
9772 -1191 -8128 -5427 13024 11750 -4384 -11337 -20886 -19240 -4685 6482 19177 19792 24235 15284
9758 15284 13982 25667 27008 4141 -3951 15702 12782 6038 6504 4949 2188 -3220 3425 5376
9744 5376 -5559 -20843 -14372 -3325 -26996 -43011 -32747 -21849 -25033 -19770 -16718 -23305 -32067
9731c2067N015J3934J0476M630R827k030j8625l106K1454P055P023j450J4093
9718C6229j858j5036o578o122j0964R85O798j695j7933M47J9715o345j5175p172
9704b4704J5458L220P659j5906k1388m667N563K208J3940p339O054l739q910J7122
9690a5429K2498K5170P3j7989j7967n303r57M082O635J409n411j8242P535Q430
9676e466J2006M95j4069r679k980J0879j2411P506J882k451L107k2J3887k564
9662A20l97R670J7712O975q335K805o870j509k2416k800p38j3648M563O459j4038
9647b2447j0788m215P902J1512J1376R175j2585K0380L617j2039k552n062k1528
9634b7254N255m85M234Q612q156q146K4101J418p155k910K2376J0340o257m598
$$ plain form
9731 -32067 -27052 -13118 -2642 1988 11815 9785 -8840 -11946 9508 16563 23586 22136 36229
9718 36229 34371 19335 12757 6635 -4329 -3344 3454 1759 -16174 -15727 3988 -2357 -17532 -24704
9704 -24704 -9246 -6026 1633 -14273 -35661 -40328 -34765 -32557 -18617 -25956 -19902 -23641 -32551 -15429
9690 -15429 7069 32239 32312 14323 -3644 -8947 -9904 -5822 813 2222 -3189 -21431 -13896 -5466
9676 -5466 6540 7035 -7034 -16713 -19693 -8814 -21225 -13719 -11837 -14288 -11181 -11203 2684 120
9662 120 -277 9393 27105 34080 25745 28550 21680 20171 -2245 -5045 -5783 -19431 -14868 -8409 -22447
9647 -22447 -33235 -37450 -29548 -18036 -6660 2515 -10070 10310 13927 1888 -664 -5726 -27254
9634 -27254 -21999 -22484 -18250 -9638 -17794 -25940 -1839 -421 -7576 -10486 11890 22230 15973 11375
9620A1375o930L098J46m757K179J8326k2763j4029K1727L1909o064j1351j2100
9607A0766k0689M286j314J089j2663P12m180p946O208L632J0356J1312k100J3147
9593A2616K5715j3447l0662J4741Q88k237j2849l6J0022Q968J8683k0701k1765
9580a0064n8J1159J989J1222r446q165j616K4556J917o848N223r577j4720j510
9566e938j9048j2446P406J5987R419r044R373R935K821J8697l756k1567o69o72
9552D98M009k2007l235J9753M15n094K610k949Q46m839j4592l702J6021N973k421
9537h714k9510j1974O500J0426J3639k027J3754p252j1629k879J9532J6225j0338
9524d247j9089R842J984p530J0037j5441j1569K3249J7379j0876j5455K267R251
$$ plain form
9620 11375 4445 7543 7689 2932 5111 23437 674 -13355 8372 40281 34217 22866 10766
9607 10766 -9923 -5637 -6951 -5862 -18525 -17813 -21993 -29939 -23731 -20099 -9743 1569 -531 12616
9593 12616 38331 24884 -5778 8963 9851 7614 -5235 -5271 4751 13719 32402 11701 -10064
9580 -10064 -10122 1037 3026 14248 4802 -3363 -4979 19577 21494 14646 19869 10292 -4428 -5938
9566 -5938 -24986 -37432 -30026 -14039 -4620 -13664 -4291 5644 8465 27162 23406 1839 1170 498
9552 498 4507 -17500 -20735 -982 -567 -5661 -3051 -6000 -5154 -9993 -24585 -28287 -12266 -6293 -8714
9537 -8714 -38224 -50198 -43698 -33272 -19633 -21660 -7906 -15158 -26787 -29666 -10134 6091 -4247
9524 -4247 -23336 -13494 -11510 -19040 -9003 -24444 -36013 -12764 4615 -6261 -21716 -19449 -10198
9511a0198N146q137P679J6235n376r953r57J0114L271j286k873m52j6121o940
9497a9848j066P401P323J8362J1527j205k640k2747j3443m595M156R077L455j1466
9483a5709k118q900l831L289l175m538O860J1055o059p050j486J4325j917k2068
9469d1322n09q99P958K4919J8844l779J1804m685l5772K177k726j4289R983P28
9455b7568L917K218J0730K448n890j1133r966J583K819R025J3946m640J674N479
9441e358o01M845j734j8268N679J1970r423k022J8262J3297K082J129m316j3962
9427A580j4409N850L1304q351k2115j3870J1046K053o950J732J3357j0304k1748
9414c0825l118K0918K4563J6453r567J1248j8874j5769j1394n902J3193J5004
$$ plain form
9511 -10198 -5052 -13189 -5510 10725 5349 -4604 -5561 4553 7824 6538 3665 3213 -12908 -19848
9497 -19848 -20914 -13513 -6190 12172 23699 22494 19854 -2893 -16336 -20931 -16775 -7698 -4243 -15709
9483 -15709 -17827 -26727 -30558 -27269 -30444 -34982 -28122 -17067 -23126 -30176 -31662 -17337 -19254 -41322
9469 -41322 -41831 -42730 -34772 -9853 8991 5212 17016 12331 -23441 -21264 -23990 -38279 -28296 -27568
9455 -27568 -23651 -21433 -10703 -8255 -14145 -25278 -35244 -33661 -30842 -21817 -7871 -12511 -10837 -5358
9441 -5358 -5959 -1114 -2848 -21116 -15437 -3467 -12890 -14912 3350 16647 18729 19858 15542 1580
9427 1580 -12829 -6979 24325 15974 -6141 -20011 -8965 -6912 -13862 -12130 1227 -9077 -30825
9414 -30825 -33943 -13025 11538 27991 18424 29672 10798 -4971 -16365 -22267 -9074 5930
9402E930p176r72K635M789N127j3452n417K411n671o936N99n095j3493J6035J4819
9387e867q409p408K445j1249N363K8859j3763n618l351R62J1724L204m242R604
9373B254Q935L044O458J530K634r538j9838p928l781J6743q12k2429j3813J6945
9359a9596Q124p130k261o214K2955K2226r405l439R035j0199k5032q936J8093
9346a1779l941p764l136R364l440J2085M531k4419l562l193J3458N022J106O851
9332h817J5525m957J4109q308p972j9758p625J5977P909k935J3590P552k928m394
9318F968O471J0455l945q588o926j1929j3183r81K953J385j894Q393j5683j6966
9304d3470K1448K0812n606r380J2865p175K0062J6820j5636m173J5542M472R68
$$ plain form
9402 5930 -1246 -2218 417 5206 10333 -3119 -8536 -6125 -11796 -18732 -18133 -23228 -36721 -20686 -5867
9387 -5867 -14276 -21684 -19239 -30488 -25125 3734 -10029 -15647 -18998 -18036 -6312 -3108 -7350 2254
9373 2254 11189 14233 20691 22221 24855 15317 -4521 -12449 -16230 513 -299 -22728 -36541 -19596
9359 -19596 -11472 -18602 -20863 -27077 -4122 18104 8699 5260 14295 4096 -20936 -29872 -11779
9346 -11779 -15720 -23484 -26620 -17256 -20696 -8611 -4080 -28499 -32061 -35254 -21796 -16774 -15668 -8817
9332 -8817 6708 1751 15860 7552 -420 -20178 -27803 -11826 -3917 -6852 6738 14290 11362 6968
9318 6968 13439 23894 19949 11361 4435 -7494 -20677 -21658 -18705 -17320 -19214 -10821 -26504 -43470
9304 -43470 -22022 -1210 -6816 -16196 -3331 -10506 9556 26376 10740 6567 22109 26581 27549
9291B7549l661j4390R080j2267r204L893j5256j8277N263L1808o387l344j3688
9278a8881n106J8557J5720o28j1136O956R360R508k474Q324q595j3359N874j114
9264A3006q534M416k838j0216J773J7122K9356j601l1386j5366j623J4656m030
9251D735j0078K124J1698p115j1242m121J8506J4175o338j2723K547L768P595
9238A3531J4718J6718k364k2418k0357P42J0362r680j2314k200l947J4617J4668
9225A2076K612J0928j1067n636J4638O624p148k70o960j2528M103K153l531p779
9211a785N382j9585k3961K467P801L3129K2877J1322l7154k902L0747K017l2363
9198b008j4353l825o921L0528J1368J2839k287J7949p49o682j1123j8988J461
$$ plain form
9291 27549 23888 9498 18578 6311 -2893 1000 -14256 -32533 -27270 4538 -1849 -5193 -18881
9278 -18881 -23987 -5430 10290 9662 -1474 5482 14842 24350 21876 30200 21605 8246 14120 13006
9264 13006 4472 8888 6050 -4166 -2393 14729 44085 42484 11098 -4268 -5891 8765 4735
9251 4735 -5343 -3219 8479 1364 -9878 -13999 4507 18682 12344 -379 2168 5936 13531
9238 13531 28249 44967 42603 20185 -172 570 10932 1252 -11062 -13262 -17209 -2592 12076
9225 12076 14688 25616 14549 8913 23551 30175 23027 22757 15797 3269 7372 9525 5994 -1785
9211 -1785 3597 -15988 -39949 -37482 -29681 3448 26325 37647 493 -2409 28338 30355 -2008
9198 -2008 -16361 -20186 -27107 3421 14789 27628 25341 43290 42541 35859 24736 5748 7209
9185G209j4373j12J3794K0762M967p318L651j1541j2569J3247R591l150J311k0095
9171E374m895K886m346J7147j408j6218p528N309J2837L1939Q682j4474o574M556
9157C3287q244j4446N774O230q349r357P507r051O750J8647j1549j987N912j267
9143A9857j0571j1199j31J0143J2893l518k3145N55R408K2598J80j7676J3414
9130B2808J7056l845j1914K429p480j44K2265Q332j010j1783l277J687o684q666
9116A9774o398N792J3891K1629J1089r960L584M059j5619R355J3436j4598j0381
9103D5653K203J382j3120j2806K341n592q59P758K4336J5346K2480L9520J0061
9090A38703j2332J1851J2241J6457K3202K8420K6456K8695L0332M6843M8723J05325
$$ plain form
9185 7209 -7164 -7276 6518 27280 32247 24929 28580 17039 4470 17717 27308 24158 25469 5374
9171 5374 479 3365 -981 16166 14758 -1460 -8988 -3679 9158 41097 49779 35305 28731 33287
9157 33287 25043 10597 16371 22601 14252 4895 12402 3351 10101 28748 17199 15212 21124 19857
9143 19857 9286 -1913 -2044 8099 20992 17474 -5671 -5116 4292 26890 27070 9394 22808
9130 22808 39864 36019 24105 26534 19054 18910 41175 49507 48497 36714 33437 35124 28440 19774
9116 19774 13376 19168 33059 54688 65777 55817 59401 63460 47841 57196 70632 56034 45653
9103 45653 47856 49238 36118 23312 25653 20061 19202 26960 51296 66642 89122 128642 138703
9090 138703 126371 138222 150463 166920 190122 218542 244998 273693 304025 350868 399591 504916
9078E04916J36745J41717J99205L36541N83890R23816J329979J410123J014665
9069F581597O33546P08494P64425N58759K54197n76161j890141k000137j335643
9060C698936q67261n94793m08226k95257k17235j47382j16341p7930o1665n4787
9050H58059n8707k6997k6047m8097n6323m3690m3279k8301k5674M332j2964k7738
9038D64574k8874k2021j8143j8543j1295j4775J0122o693k0415k4985k5471j0146
9026B73335n498m210j3460j0006P359k0696p874k532J599J0556j0222j1372k0933
9013A86046j6229l239j140j2371j4725m784k0683K627k838p604o840L0569R872
9000A38661q108q432p435j6558O828n807L914R454J1946m425k4899j1024J3883
$$ plain form
9078 504916 641661 783378 982583 1319124 1903014 2826830 4156809 5566932 6581597
9069 6581597 7215143 7923637 8688062 9246821 9501018 8924857 7034716 5034579 3698936
9060 3698936 2831675 2236882 1828656 1533399 1316164 1168782 1052441 974511 912846 858059
9050 858059 799352 772355 746308 698211 641888 598198 554919 526618 500944 505276 492312 464574
9038 464574 435700 413679 395536 376993 365698 350923 361045 354352 333937 308952 283481 273335
9026 273335 267837 263627 250167 240161 247520 226824 218950 216418 218017 228573 218351 206979 186046
9013 186046 169817 166578 165438 153067 138342 133558 112875 115502 112664 105060 98220 128789 138661
9000 138661 130553 122121 114686 98128 104956 99149 103063 112517 124463 120038 95139 84115 97998
8987I7998P71J0084p464l505p514j2685J923J1086j6418j9074m773L350P344n772
8973E5351o511M896J4896R131m386r400j040n50j2638j2891k522l871m973l686
8959B1806q963p426J149l579J8238N818j0134k662J3392j3j452q737J664J1620
8945C0721j5743k074O507J409n265J5354J6144j1106j425N416j3128j0687j1664
8932D459j539J323P954L000j0025O163K2690Q008j0397k0019q593O103j1808N724
8918C043l030p026m619j243J6301l27m119L338m691j3272L08l255O526J7836M721
8903A0491J1043J2249l840k08j7216J4809J2408k0014j9005O923K9197q207q44
8890B7786L794L782M833k4720j4279P64p891l391L1010n625j2428R635M816r748
$$ plain form
8987 97998 98769 108853 101389 97884 90370 77685 79608 90694 74276 55202 50429 53779 61123 55351
8973 55351 48840 53736 68632 77763 73377 63977 62937 62387 49749 36858 34336 30465 25492 21806
8959 21806 12843 5417 6566 2987 21225 27043 16909 14247 27639 27626 26174 17437 19101 30721
8945 30721 14978 12904 19411 20820 15555 30909 47053 35947 34522 39938 26810 16123 4459
8932 4459 2920 4243 12197 15197 5172 11335 34025 42033 31636 11617 3024 9127 -2681 3043
8918 3043 13 -7013 -11632 -12875 3426 3099 -1020 2318 -2373 -15645 -15337 -18592 -12066 5770 10491
8903 10491 21534 33783 29943 29735 12519 27328 39736 19722 717 7640 36837 28630 27786
8890 27786 31580 35362 40195 15475 1196 1960 -5931 -9322 21688 16063 3635 13270 18086 8338
8876H338m940P848J5586n776R109J1316k674J3536P641j0885J8352M250k512Q966
8862G8155Jj3860o699J8768k4511j9556Q088k102j6285k460P745N519R25j955
8848C1773r882l600m244o512J700J6259k525k328P566m106m586q30j4462l5892
8834c1669J3476K5369J8324j496M943P389K352J4640J4053K3607J6801n125j2994
8821H9670J1862J7580R215j2641o330n733K3855J217k3089l9350j1952j3052r467
8808C1785o345p929J6182O131j1262k710P079k4773k5703R220Q821J3811j1528
8795B779j0181K4573J6192J3701m168q481J0020l127j6009j1857J180j4616P100
8782G106J2245R867O196k881J9876r749Q921L040M705p678l865j7097r066Q996
$$ plain form
8876 8338 3398 11246 26832 21056 30165 41481 38807 52343 59984 49099 67451 71701 69189 78155
8862 78155 78156 64296 57597 76365 51854 32298 40386 38284 21999 19539 27284 32803 33728 31773
8848 31773 21891 18291 14047 7535 9235 25494 22969 20641 28207 24101 19515 18685 4223 -31669
8834 -31669 -18193 7176 25500 24004 28947 36336 38688 53328 67381 90988 107789 102664 89670
8821 89670 101532 119112 128327 115686 109356 103623 127478 128695 105606 66256 54304 41252 31785
8808 31785 25440 17511 33693 39824 28562 25852 32931 8158 -17545 -8325 496 14307 2779
8795 2779 -7402 17171 33363 47064 42896 34415 44435 41308 25299 13442 14622 6 7106
8782 7106 19351 29218 35414 32533 52409 42660 51581 54621 59326 51648 47783 30686 21620 30616
8768C0616N196l640J579k0885q79J0571J8983O514r939N760m201j4529P178R190
8754D1514J3457J3905k2914k7146j3495O254l173n588L2458o111lM865j251j934
8740C0838j6190q673k2878J1840J0513J1028P272j0075k2874R948m654O685J3275
8727A6055J880L641m385L119J07q245Q064K6555k297q655j8026K289q175k7245
8713a5318k1771K1030J1212Q421r270N118J0643m093M559N194l0696k456m075
8700b1502j493N729K5557J7021m560n736l348L999Q299p350j2475N38P967L473
8686A6119l166J9482J0302o612o237J8902L74j4543P257j3637r228L916P906j1286
8672A9549j4109J5152J2060J591P209k078j2477n106J756n737k298M501r330r134
$$ plain form
8768 30616 35812 32172 33751 12866 11987 22558 41541 48055 38116 43876 39675 25146 32324 41514
8754 41514 54971 68876 45962 18816 5321 11575 8402 2814 35272 29161 29158 34023 32772 30838
8740 30838 14648 5975 -16903 -5063 5450 16478 23750 13675 -9199 749 -3905 2780 16055
8727 16055 17935 21576 17191 20310 20417 12172 20236 46791 44494 35839 17813 20102 11927 -15318
8713 -15318 -37089 -16059 -4847 3574 -5696 -578 10065 5972 10531 15725 -14971 -17427 -21502
8700 -21502 -22995 -17266 8291 25312 20752 15016 11668 15667 23966 16616 4141 4679 12646 16119
8686 16119 12953 32435 42737 36125 29888 48790 49164 34621 41878 28241 19013 22929 30835 19549
8672 19549 5440 20592 32652 34243 41452 39374 26897 21791 23547 17810 15512 20013 10683 1549
8658A549l30K2624J2495O262j403r442J8109J3546J2458Q583K2317L762m298j865
8644A04367j1451K1264K0778p152m778n980l8464k2373M699J9637J3260n793k5821
8631F2193N94Q479n269j3979O710j35j5026j574J060l667q078r610N743K504n241
8616B4704r097J1421J5806L365K485j0162j0270K582n443o570j6536K636q609
8603c688J3391R486O30k2364N046K1716K290O91O627N257j7108k7153p268J4949
8589B502K6033K232l0936j2080k631k666j835M319K758J3089R373R714r527k949
8575G396m835m073J0081Q728k0123J1281J658L938j4551N235N752K6450k0293
8562A6644j3138P521p278j2284r150L4J3880J3044J9908q862o055p456J893O425
$$ plain form
8658 1549 1219 23843 36338 42600 41197 31755 49864 63410 75868 84451 106768 110530 106232 104367
8644 104367 92916 114180 134958 127806 123028 117048 78584 56211 60910 80547 93807 88014 62193
8631 62193 62787 71266 65997 52018 58728 58593 43567 41993 43053 39386 31308 21698 27441 29945 24704
8616 24704 15607 27028 42834 46199 48684 38522 28252 30834 25391 18821 2285 4921 -3688
8603 -3688 9703 19189 19819 -2545 2501 24217 26507 27198 33825 39082 21974 -5179 -12447 2502
8589 2502 28535 30767 -169 -12249 -14880 -17546 -19381 -15062 -12304 785 10158 19872 10345 7396
8575 7396 2561 -1512 8569 17297 -2826 8455 10113 14051 -500 4735 10487 36937 16644
8562 16644 3506 11027 3749 -8535 -17685 -17651 -3771 9273 29181 20319 14264 6808 8701 15126
8548A5126r044m240P511J5656L74J5458J44r958N796k026m958o290j602K5854
8534D7801n946j4060r179n328k496M063J5202K876l5018l999J4211o974j6025
8521a4872O587j971m554M947O888o898n243j4696P099J0709J6858N963m876r283
8507c342K021J1570l356k43q084j2134m86k594j3167n214p463M340K2237K225
8493a3690J891P79O236R188l225r944J956r375n181L055R733K2349R897j471q865
8478A3333J631o979k7060j8649K0437J7992J5494k57j0133j3406M589k362r873
8465a5243l325O84K131P928K2737J990l431L648J2658q690J3827P709j5151l660
8451B3812Q564n942O636J5149j3492l3026j2091P750M291j1458L979o506j0829
$$ plain form
8548 15126 6082 1842 9353 25009 25383 40841 40985 31027 36823 34797 29839 23549 21947 47801
8534 47801 41855 27795 18616 13288 10792 14855 30057 32933 -2085 -6084 8127 1153 -14872
8521 -14872 -8285 -10256 -14810 -9863 -2975 -9873 -15116 -29812 -22713 -12004 4854 10817 5941 -3342
8507 -3342 -1321 10249 6893 6650 -1434 -13568 -14054 -16648 -29815 -35029 -42492 -38152 -15915 -13690
8493 -13690 -11799 -11020 -4784 4404 1179 -8765 -6809 -16184 -21365 -18310 -8577 13772 23669 22198 13333
8478 13333 14964 7985 -19075 -37724 -17287 705 16199 15942 5809 -7597 -3008 -5370 -15243
8465 -15243 -18568 -17884 -15753 -7825 14912 16902 13471 17119 29777 21087 34914 42623 27472 23812
8451 23812 32376 26434 33070 48219 34727 1701 -10390 -2640 1651 -9807 -5828 -12334 -23163
8438b3163p50O797O342J74n578M649L138n608p5J0620J0180j1699j099K16J8738
8423A2882J0749j6316M528N069l172P967j9200j0893n800J0600j030j3741J7167
8410a190J0656j6648j0074R018L495r251k525J0928o64q207j301m694n81K978
8396a8060l408N462O733J931J2351j534k57j4890M321J9699K531J501o744J4590
8382B4226L25j2232K746j2151Q541l069j2781Q982r7j7813P262J7917j2686j4566
8368a5396J2356j7057n928J4648M142K4015K1127L496k6538k3911J387m613O810
8355e462K186j1793n156J1944O202k712j3683P608L400J1590J6733j2070p306
8342A481J2372J2706j6957M246m88j2167M397k679p783Q403N718K9133O858p382
$$ plain form
8438 -23163 -23913 -17116 -10774 -10600 -16178 -11529 -8391 -13999 -14074 -3454 6726 -4973 -6072 -5856 12882
8423 12882 23631 7315 11843 16912 13740 21707 2507 -8386 -14186 -3586 -4616 -18357 -1190
8410 -1190 9466 -7182 -17256 -8238 -4743 -13994 -16519 -5591 -6255 -14462 -15763 -20457 -21038 -18060
8396 -18060 -21468 -16006 -9273 -7342 5009 3475 3218 -11672 -7351 12348 14879 16380 9636 24226
8382 24226 24551 12319 15065 2914 11455 8386 -4395 4587 4490 -13323 -6061 11856 -830 -15396
8368 -15396 -3040 -20097 -26025 -11377 -7235 16780 37907 41403 14865 -9046 -7659 -12272 -5462
8355 -5462 -3276 -15069 -20225 -8281 -2079 -4791 -18474 -10866 -7466 4124 20857 8787 1481
8342 1481 13853 26559 9602 13848 13360 1193 5590 2911 -4872 3531 9249 38382 45240 37858
8328C7858j8613p578q900L591J0000Q989K861j547j4795n146J3583n323j9524
8315d544j6778N848K8195n662m750q509J8318m833j0095Q168M460J9760J1304
8302D0882j0597j5613r80K857K178J917M593j2687K807O551n914P754J864O522
8288C2134j433n669j624k0198j256J6378K5720O181J007j1419n377Q482j1240
8275C1686n387k255m030l792P214p533l4123j955K4523K2862j103o910j157j5513
8261B527q954n66J371P140j3984P331J1654Q135K934j0967p714M585J4456N516
8247B3464K1333k720k240j4887l601J0395J2835k6974r671K6393J5349N917k340
8234E3253k2335o693p61K977r633n539o520o523k0142o932K3668R331j7930J2002
$$ plain form
8328 37858 19245 11667 2767 6358 16358 25347 28208 26661 11866 6720 20303 14980 -4544
8315 -4544 -21322 -15474 12721 7059 2309 -6200 12118 7285 -2810 5358 9818 29578 40882
8302 40882 30285 14672 13692 16549 18727 20644 25237 12550 15357 21908 15994 23748 25612 32134
8288 32134 30701 25032 23408 3210 1954 18332 44052 50233 51240 39821 34444 42926 31686
8275 31686 26299 24044 20014 16222 23436 15903 -18220 -20175 4348 27210 26107 19197 18040 2527
8261 2527 -6427 -6993 -5622 1518 -12466 -5135 6519 14654 17588 6621 -1093 3492 17948 23464
8247 23464 44797 42077 39837 24950 21349 31744 44579 17605 7934 34327 49676 55593 53253
8234 53253 30918 24225 23464 26441 16808 11269 4749 -1774 -21916 -28848 -5180 4151 -13779 -1777
8220a777K4635J923k8963j7828m632n93J5987O760Q320J0864O603O62n013N704
8206B2652J0329j104r562j8592j2056l500M246M331n431L560N21Q80J8596J1768
8192B6638k469q00j522L8N216m16K961l5433j8875J4002M225q066J998M866k271
8177i908o894J800K7940K327n90j3239j0194m068l502J792R756J3798K271L714
8163A5003o714q726j1729L89J0791L268M798o98O922j852O368J3686L293r508
8149B5291j7849k852R39o275P821o08q789q289O128K414P145l947n326J1172j0011
8134c036P574K5524j766Q90N330J5754k2462n021o285j2821p753j4318m740K81
8120b2849M990P753N893L193O59L58N982j5399J5012O654p409J5883K0920m633
$$ plain form
8220 -1777 22858 24781 -4182 -22010 -26642 -27235 -11248 -4488 3832 14696 21299 21961 16948 22652
8206 22652 32981 31877 22315 3723 -8333 -11833 -7587 -3256 -8687 -5127 -4606 -3726 14870 26638
8192 26638 24169 23369 21847 21885 27101 26685 29646 -5787 -24662 -10660 -6435 -14501 -12503 -7637 -9908
8177 -9908 -16802 -15002 12938 15265 14675 1436 -8758 -12826 -16328 -14536 -4780 9018 11289 15003
8163 15003 8289 -437 -12166 -11777 -986 2282 7080 6382 13304 11452 17820 31506 34799 25291
8149 25291 7442 4590 5529 -746 7075 6467 -2322 -10611 -4483 -2069 5076 1129 -4197 6975 -3036
8134 -3036 4538 30062 28296 29186 34516 50270 27808 22787 16502 3681 -4072 -18390 -23130 -22849
8120 -22849 -17859 -10106 -4213 -1020 -361 -3 5979 -9420 5592 12246 4837 20720 41640 37007
8106C7007j5161K112k0729m553M695k2058o487M212j281K1127J3951k4142M447
8093f860L2402j1647m885R15j9520l453K791j0029O907J1835J5028J7240K186
8080C2910R747j0962O681Q817j7262L519K516R729p623m814P329q939l124r533
8066A8991J4114P364J4039L030k0010j0760j5047j6358P146J1400J4517J7993
8054D6419J8532N701o42j2129j9277k2741k090J3643j3767j549j373P324J206
8041A9257K785o251N98J42J863P514p686M698j232j0235k034j2647q304K0357
8027H825j4683o088q803L265J2463L2059p584j2332K3730J3561j0333j0027j3018
8014A1035m638k035K1458P899j8998n550J7223K341R762l309N804L235L721j1448
$$ plain form
8106 37007 21846 23958 3229 -1324 3371 -18687 -25174 -20962 -22243 -1116 12835 -11307 -6860
8093 -6860 25542 13895 9010 9925 -9595 -13048 -10257 -20286 -13379 -1544 13484 30724 32910
8080 32910 42657 31695 38376 47193 29931 33450 35966 45695 38072 33258 40587 31648 28524 18991
8066 18991 33105 40469 54508 57538 37528 26768 11721 -4637 2509 13909 28426 46419
8054 46419 64951 70652 70010 57881 38604 15863 13773 27416 13649 12100 10727 18051 19257
8041 19257 22042 15791 16389 16531 18394 25908 18222 22920 21688 11453 9419 -3228 -11532 8825
8027 8825 -5858 -11946 -20749 -17484 -5021 27038 19454 7122 30852 44413 34080 24053 11035
8014 11035 6397 4362 25820 33719 14721 9171 26394 28735 38497 35188 40992 44227 47948 36500
8000C6500m689J2081k1654j2744j0685J8767J7688J677k713j4468O462N325K031
7987C3578j9041j5433j4194J4546J3427o755M711l56J742J6173M795O15o946j5232
7973A1630r370m712N131K7905L072j2382j1180j1514m303J0322J7395J5423m953
7960C2464j9860o478Q420J2215j2663j4297R012j1697O135L179j3757q549J4964
7947i12M290l95J159j3950j8244m483Q974R573L985J0086J5214Q118q562m621
7933A0232n854M530l035R278P759k093p890O138j8391l266J4043K0708j9209j0747
7919B203l280J8072R566J225j6514N34Q42r632j7321M944k836N317J696o04J1695
7904E907j0450l100K054j3953q080J694k742K750J6840N986l027q85r552n054
$$ plain form
8000 36500 31811 43892 22238 9494 -1191 17576 35264 36941 34228 19760 26222 31547 33578
7987 33578 14537 -896 -15090 -544 12883 6128 10839 10483 12225 28398 33193 33808 26862 11630
7973 11630 2260 -2452 2679 30584 33656 21274 10094 -1420 -5723 4599 21994 37417 32464
7960 32464 12604 6126 14546 26761 14098 -199 8813 -2884 3251 6430 -7327 -15876 -912
7947 -912 3378 2983 4142 -9808 -28052 -32535 -23561 -13988 -10003 83 15297 23415 14853 10232
7933 10232 4378 8908 5873 15151 22910 20817 12927 19065 674 -2592 11451 32159 12950 2203
7919 2203 -1077 16995 26561 27786 11272 11806 12648 3016 -14305 -9361 -12197 -6880 -5184 -5788 5907
7904 5907 -4543 -7643 -5589 -19542 -27622 -25928 -28670 -25920 -9080 -3094 -6121 -7006 -16558 -21612
7890b1612O008L2327K7287K076O519K401P465j4375k2617k1765P85k416l764L751
7876B070j969j882J7951o471l8793M189K1171m30P084L151m022n169K096J4634
7862A3610J800l983r085l837l548k50j1714r419J849J7142M642r39L915K2522
7848B2705P383l573j3272k5626J810J2258J2681j946m7P096k808K174N701o655
7834A7881j8994j3742J1080j0644k335L9M489L96Q194J0174O005K4462j1522l2375
7820f892j5861J8752J8495N306m962j9156Q729K899p383j0132j232L69Q618J2342
7806I892P790J482j7493j7575j1019K924O441J9112J3616j2524j3720j838L564
7793i348k5190k153K8204k291p94k676m336J7391M992Q441O02k5964q434j457
$$ plain form
7890 -21612 -15604 16723 44010 46086 52605 55006 62471 48096 25479 3714 4499 2083 -1681 2070
7876 2070 101 -1781 16170 9699 -29094 -24905 -3734 -4164 2920 6071 2049 -3120 -1024 13610
7862 13610 15410 11427 2342 -1495 -5043 -5293 -17007 -26426 -24577 -7435 -2793 -3732 183 22705
7848 22705 30088 26515 13243 -12383 -10573 1685 14366 12420 12373 19469 16661 18835 24536 17881
7834 17881 -1113 -14855 -3775 -14419 -16754 -16715 -12226 -11830 -3636 6538 12543 37005 25483 -6892
7820 -6892 -22753 -4001 14494 19800 14838 -4318 4411 7310 -73 -10205 -11437 -11068 -2450 9892
7806 9892 17682 19164 1671 -15904 -26923 -23999 -17558 1554 15170 2646 -11074 -12912 -9348
7793 -9348 -34538 -36691 -8487 -10778 -11572 -14248 -18584 -1193 3799 12240 12842 -13122 -21556 -23013
7779b3013Q983R835N998J875Q898L02j6300o501r253n008P262J005k2467J4685
7765b3699O206R17j1204j7004L071K2066j7177n194K7306j132q098J4664J429
7752g849J6480J0853N961j0527l908j0932k4559j2555j5135R199j611O90K3956
7739a9937J3559p641N620N407k0694J4875J8324R080J3001r2j3770O212N818m911
7725B4851k0869r045N975P017j0727o867K222n663R00N699J939K631J0278p463
7711H78j6035P770K585J5932P093j267k5504J705N108J0609l455j524j1254R064
7697A705K738Q924K315j7916j3823n579O281M874m831j5872K4276m429O154J5024
7683I841J6603k0551k4573J976K3528k950j1069J497k137m231j200j6906k2017
$$ plain form
7779 -23013 -14030 -4195 1803 3678 12576 12878 -3422 -9923 -19176 -24184 -16922 -15917 -38384 -23699
7765 -23699 -17493 -16576 -27780 -44784 -41713 -19647 -36824 -42018 -14712 -15844 -23942 -9278 -7849
7752 -7849 8631 19484 25445 14918 11010 78 -24481 -37036 -52171 -42972 -44583 -43893 -19937
7739 -19937 -6378 -14019 -8399 -2992 -23686 -8811 9513 18593 31594 31502 17732 23944 29762 24851
7725 24851 3982 -5063 912 7929 -2798 -9665 -7443 -13106 -12206 -6507 -4568 -1937 8341 878
7711 878 -15157 -7387 -4802 11130 18223 16956 -8548 -6843 -1735 8874 5419 3895 -7359 1705
7697 1705 4443 13367 15682 -2234 -16057 -21636 -15355 -10481 -15312 -31184 -6908 -11337 -5183 9841
7683 9841 26444 5893 -18680 -16704 6824 3874 -7195 -5698 -7835 -12066 -13266 -30172 -52189
7670e2189J0038J6415j6428J8996J7334k692M034J0518j305o550J0800l897l947
7657A127j6611Q126J2710Q018Q250r25n370o001J2120l076J818m219l4225j4937
7643c3195P587J6137J4834o970j9947O80L250l414m556K4942N524J2394r871j5200
7629g805m730M249O568r353K2757R448j3546q194j8643J518J6180M640J9483p13
7615B1859k0494j1959Q697N586j0106K048J8386j83j6830J9909J0524j4742j3488
7602g93J863j0080j6238J6895q449j6063P96R774k497K153r921J428J7750L5200
7588B1818j4461j3329o891j7578q74j2980M683J4699J8630K689j7111m868K3606
7575a967p992j1353Q292L348K501P26j1868M051R407J2909J5725Q342j3335k3927
$$ plain form
7670 -52189 -42151 -25736 -42164 -23168 -5834 -8526 -4492 6026 4721 -1829 8971 5074 1127
7657 1127 -15484 -7358 5352 13370 21620 20695 15325 9324 21444 18368 20186 15967 -18258 -33195
7643 -33195 -25608 -9471 5363 -1607 -21554 -20874 -17624 -21038 -25594 -652 4872 17266 7395 -7805
7629 -7805 -12535 -8286 -1718 -11071 11686 21134 7588 -606 -19249 -17731 -1551 3089 22572 21859
7615 21859 1365 -10594 -1897 3689 -6417 -4369 14017 13834 -2996 16913 27437 12695 -793
7602 -793 1070 -9010 -25248 -8353 -16802 -32865 -32069 -22295 -24792 -22639 -32560 -31132 -13382 21818
7588 21818 7357 -5972 -12863 -30441 -31315 -44295 -39612 -24913 -6283 -3594 -20705 -25573 -1967
7575 -1967 -9959 -21312 -13020 -9672 -7171 -6445 -18313 -14262 -4855 8054 23779 32121 18786 -5141
7561e141k2100K324J3932J7027j630J4128J5729K964k6428j104O400O064o592
7548A5573L748j1779j6668J2180J0923k9607j0015J2780J3686J6139J6735p958
7536B5737m046L796l755j7529j483l171P039j770l790j3330k3530K414J547Q659
7522b3212n151Q497k668M955J9093N838j4793L590j189o180N214L497L666k939
7508a782J514p035j4069j2844q084r360M57K1490J3395P921K829L015J7553j7600
7494b600M01O805k421N71J2744J717R539j817j0385j173m444R606R246j9598p085
7479A106j1024O94P91M507J378j2521j754J6325R053J3951K651o783j6786j4284
7465a2696J9789J6412j602k9681j1034L378j2509j5289k8K1607J6550p229j4802
$$ plain form
7561 -5141 -27241 -24917 -10985 6042 4412 18540 34269 37233 10805 9701 16101 22165 15573
7548 15573 19321 7542 -9126 3054 13977 -15630 -25645 -12865 821 16960 33695 25737
7536 25737 21691 25487 21732 4203 2720 -451 6588 4818 1028 -12302 -35832 -33418 -31871 -23212
7522 -23212 -28363 -19866 -22534 -17579 1514 7352 -7441 -3851 -5040 -11220 -6006 -2509 1157 -1782
7508 -1782 -268 -7303 -21372 -34216 -42300 -51660 -51203 -29713 -16318 -8397 -5568 -2553 15000 -2600
7494 -2600 -2199 4606 2185 2756 15500 17217 26756 24939 14554 13381 8937 18543 27789 8191 1106
7479 1106 -9918 -9224 -8433 -3926 -2548 -15069 -16823 -498 8555 22506 25157 18374 1588 -12696
7465 -12696 7093 23505 21903 -7778 -18812 -15434 -27943 -43232 -43260 -21653 -5103 -12332 -27134
7452b7134J629J9644K3377j9603L213M355o552K3312j0031j4366Q687j3886o129
7439a3484J1572J5669l098j8171K717K2152l828o987R267j3345k9636k2519P58
7426d8933o333N398J7375J3705J4899J4261n488p661J1699J2429M349n4j8943
7413F703O810N998J517r137j1247j6246l838N898l176J5125Q058N217k778m102
7399D802j2585J3494J2932p535r765q631R463r82k4373k826J3965J7983Q119K462
7385A6523k6125j5768j983J2389L574j3695L753J5993L895j1255k595O908l157
7372a1543k890q288J4338j0851m018m383L035k83J0848J4821j1219K430J5236
7359G233m760j3271k673N611J0086J642m392j0135R135m012M705P950m060p425
$$ plain form
7452 -27134 -25505 -5861 17516 -2087 1126 5481 -1071 22241 12210 -2156 6531 -7355 -13484
7439 -13484 -1912 13757 10659 -7512 -4795 17357 13529 6542 15809 2464 -27172 -49691 -48933
7426 -48933 -55266 -49868 -32493 -18788 -3889 10372 4884 -2777 8922 21351 25700 25646 6703
7413 6703 13513 19511 21028 11891 644 -15602 -19440 -13542 -16718 -1593 6465 11682 8904 4802
7399 4802 -7783 5711 18643 11108 1343 -7288 2175 1193 -23180 -26006 -12041 5942 14061 16523
7385 16523 -9602 -25370 -27353 -14964 -11390 -25085 -21332 -5339 -1444 -12699 -15294 -8386 -11543
7372 -11543 -14433 -22721 -8383 -19234 -23252 -27635 -24600 -24883 -14035 786 -10433 -8003 7233
7359 7233 2473 -10798 -13471 -7860 2226 3868 -524 -10659 -1524 -5536 -831 7119 3059 -4366
7345d366O055J5208M116M785Q423q102k5391k5060J3426Q608j8511j9908M108
7332c6609J0776J2170M944j8239k782K1189K5679j0163j1918R867J7695j100j2399
7319I110j043L729j5700L547J3015K820j4319P419l914M975j1454L621J4842N87
7305A7235j0737Q622J3440k1935j5501J1219j1131p502L529J0262M62j629l960
7292g626Q79P690J1161j5911l0555J3350J8225J958l705J422J6631N067l691n851
7278I044j0284j5319j2849j5964M6J4141J9746P474k581r515k424J842R552N97
7264f494j3386p637J5979N980m999L183J1400L912j7688O912J0446J742k59o262
7250B829k094o992o590k5607o966R424J2274L155J7717J1537O545j1599P93Q945
$$ plain form
7345 -4366 1689 16897 21013 25798 34221 26119 728 -24332 -10906 -2298 -20809 -40717 -36609
7332 -36609 -25833 -13663 -8719 -26958 -29740 -8551 17128 6965 -4953 4914 22609 21509 9110
7319 9110 8067 11796 -3904 -357 12658 15478 1159 8578 4664 9639 -1815 1806 16648 17235
7305 17235 6498 15120 28560 6625 -8876 2343 -8788 -16290 -12761 -2499 -2037 -3666 -7626
7292 -7626 -6747 943 12104 -3807 -34362 -21012 -2787 -829 -4534 -3112 13519 18586 14895 9044
7278 9044 -1240 -16559 -29408 -45372 -45326 -31185 -11439 -3965 -6546 -16061 -18485 -16643 -7091 -6494
7264 -6494 -19880 -27517 -11538 -5558 -10557 -7374 4026 7938 -9750 -2838 7608 9350 9091 2829
7250 2829 735 -6257 -12847 -38454 -45420 -35996 -23722 -20567 -2850 8687 15232 3633 4426 13371
7236A3371j8445j2571m471O196r824J6651Q435n283M384J436j0137j2596l89Q552
7222a4691l42Q484J9970N965J1878n707k2234j8446R133j6885Q783M707J2631
7209C246J1238k2908j2447O581Q726K2925L790j1413l61m335j557O634j4790k054
7195f725k2k816Q813P833K085R850j5778r585J189j429l033J833J785M294J1856
7180A0150j7264N3j7443Q705K5078R57O120m545j0110n640q251J1770J5526q27
7166A4279j3519m227n732m748J7327O866q982J1918O952p538r908r434J2931n574
7152F11k694N771R593J80q539o545j0414k473j0470j4688j734K1339R275j3895
7138b4683n401j4647M843Q150J3593j8657o461J0626J3118m704Q204J0124j4432
$$ plain form
7236 13371 -5074 -17645 -22116 -15920 -25744 -9093 -658 -5941 -1557 -121 -10258 -22854 -23243 -14691
7222 -14691 -15033 -6549 13421 19386 31264 25557 3323 -15123 -5990 -22875 -14092 -9385 3246
7209 3246 14484 -8424 -20871 -14290 -5564 17361 21151 9738 9377 5042 3485 10119 -4671 -6725
7195 -6725 -6747 -9563 -750 7083 9168 19018 3240 -6345 -5156 -6585 -9618 -7785 -6000 -1706 10150
7180 10150 -7114 -7061 -24504 -15799 9279 10236 16356 11811 1701 -3939 -12190 -420 15106 14279
7166 14279 760 -3467 -9199 -13947 3380 10246 1264 13182 20134 12596 2688 -6746 6185 611
7152 611 -2083 3688 13281 13461 4922 -1623 -12037 -14510 -24980 -39668 -41402 -20063 -10788 -24683
7138 -24683 -30084 -44731 -39888 -31738 -18145 -36802 -43263 -32637 -19519 -24223 -16019 -5895 -20327
7125b0327p925J3211N397J3442L189k4200k1996o48J1500J7884j3015j706k573
7112b7767J6597J2043J5713l812P497J926j3825P101N532j3679j1544j2150k466
7099a8834k060J4161K181j2098j9915J4721R878Q842J1261o09O240N385J0799
7086B9952M444J224k3472p488N568K2903M101M854j279k0536j2287k0948k2104
7073c5068l211J5020l028R161J5904o211j4079J2132K1282n855l869J3040L165
7060A8383P284n918j5853k4508k0300J0765M278O152K0903K4505J1506j3333j9815
7047D049k347l674k0074L806O35n922P974R103R529l795j842Q915O382r263j3298
7032i822j0214j469J1529j1881n452L4375J8647q719N954n215j3178j4133r402
$$ plain form
7125 -20327 -28252 -15041 -9644 3798 6987 -17213 -39209 -39857 -28357 -10473 -23488 -25194 -27767
7112 -27767 -11170 873 16586 12774 20271 22197 8372 15473 21005 7326 -4218 -16368 -18834
7099 -18834 -20894 -6733 -4552 -16650 -36565 -21844 -11966 -3124 8137 7528 13768 19153 29952
7086 29952 34396 35620 12148 4660 10228 33131 37232 42086 40807 20271 7984 -12964 -35068
7073 -35068 -38279 -23259 -26287 -17126 -1222 -7433 -21512 -9380 11902 6047 2178 15218 18383
7060 18383 25667 19749 3896 -20612 -40912 -30147 -25869 -19717 1186 25691 37197 23864 4049
7047 4049 1702 -1972 -22046 -18240 -17605 -23527 -15553 -6450 3079 -716 -2558 6357 12739 3476 -9822
7032 -9822 -20036 -21505 -9976 -21857 -27309 7066 25713 16994 22948 17733 4555 -9578 -18980
7019a8980j1125K4991L2667N681j794j256k4328j8055P932k830J0689J1651L123
7006A8366p517p514m52J440p27m332n649K0260r443m423K1341J7389j4231l1105
6992f597l487J6152J2157k837o557j351j9595j1976O243P601l84L17k799j4665
6978b7778p510K4357K4913j1369k1011M182L477O55q244J4216Q26J897J301Q327
6964H239p112j202n667O504j820N586J3744K255L948k4411J159n799L01o72K4451
6949A9504O586o099n955j546p125m558l05j3075k09J0756O46O12r399j7036j0208
6934c7411J8686K6592K1857L695l0163j3051N329R186Q23K31J739P193j3488K770
6920C988q937N191m743J49N93O417j992R219n904q677R25j639O030J0998j3075
$$ plain form
7019 -18980 -30105 -5114 27553 33234 31440 30184 5856 -12199 -4267 -7097 3592 15243 18366
7006 18366 10849 3335 2883 4323 3596 -736 -6385 13875 4432 9 21350 38739 24508 -6597
6992 -6597 -10084 6068 18225 15388 8831 7480 -12115 -24091 -17848 -10247 -10631 -10314 -13113 -27778
6978 -27778 -35288 -10931 13982 2613 -18398 -14216 -10739 -10084 -18328 -4112 -3286 -1389 -88 8239
6964 8239 1127 -75 -5742 762 -1058 4528 18272 20527 24475 64 1223 -4576 -4275 -4947 19504
6949 19504 26090 19991 14036 12490 5365 807 502 -12573 -12782 -2026 -1380 -768 -10167 -27203 -37411
6934 -37411 -18725 7867 29724 33419 3256 -9795 -4466 4720 5543 5774 7513 14706 1218 3988
6920 3988 -4949 242 -4501 -4352 -3759 2658 666 9885 3981 -4696 -3771 -5410 620 11618 -1457
6905a457Q029P260J2068k2507j4185J8266N791k534r004q765K316k102J1243K3505
6891B7924r74Q54j0077j218k97r580k1785j044J2988J3218j6169p89N815J3101
6877A1967K984N05Q557n827r702K825J115j1762j4220P186O233J2085O5M526J129
6862A7666R51r269J204j25j3082j3040M030K76p132K1454K2170j2252j4344J5605
6848A4112O143R90J963j7414k0218J5702J607n546P764K353r78j185n840o256
6834f803M883l857m886K1793M558K876J034j0441j2074m964m423K386J3324O890
6820A0296n899j0059j1679j053K292k216L974O841q078M129J2401K341k968K655
6806B977J1175o751r170o649J2018M21L788j3254p786J0711J726R107K5536n331
$$ plain form
6905 -1457 6572 13832 25900 3393 -10792 7474 13265 10731 1727 -7038 -4722 -6824 4419 27924
6891 27924 26950 27804 17727 16509 16212 6632 -15153 -16197 -3209 10009 -6160 -6949 -1134 11967
6877 11967 14951 15456 24013 18186 8484 11309 12424 662 -13558 -6372 -139 11946 12011 16537 17666
6862 17666 18617 9348 10552 10427 -2655 -15695 -11665 -11389 -18521 2933 25103 12851 -1493 14112
6848 14112 20255 21245 23208 5794 -14424 1278 2885 -2661 5103 7456 6478 5293 -547 -6803
6834 -6803 -1920 -5777 -10663 11130 15688 18564 19598 9157 -2917 -7881 -12304 -9918 3406 10296
6820 10296 4397 -5662 -17341 -18394 -16102 -18318 -14344 -7503 -15581 -11452 949 3290 322 2977
6806 2977 14152 7401 -1769 -8418 3600 4021 7809 -5445 -13231 -2520 -794 8313 33849 28518
6792B8518j0502j0210M486J3200o126o479j4546k0662J1055J355K086J6811R774
6779A8760K098P989n87j7965p125Q920n442k3543j7775m354J7611J3379Q834n705
6765d905K061J841m967K09Q243L103N311r298j4890k1035l833J6322K301O47J6387
6750b503K2318J1414j8962j3445J3796l869N424R384j543r038j1479o877N946
6737E66m152M717r469j0376k408J6810P89L726j0595J599L552p27J1279K0810
6723B6121O163o962j2444J046P281j7587R338J4804j7250k341O241Q662j408k534
6709A9130j0828j7491l607L106j0838K158J2161M820j1096l042J4839P503J147
6696G962K173j2709J5587K220j110K152k689j5488L37K461j374o119m951N738
$$ plain form
6792 28518 18016 7806 12292 25492 19366 12887 -1659 -22321 -11266 -9911 -7825 8986 18760
6779 18760 20858 28847 28260 10295 3170 12090 6648 -16895 -34670 -39024 -21413 -8034 800 -4905
6765 -4905 -2844 -1003 -5970 -5761 2482 5585 10896 1598 -13292 -34327 -38160 -21838 -19537 -18890 -2503
6750 -2503 19815 31229 12267 -1178 12618 8749 14173 23557 22014 12976 1497 -5380 566
6737 566 -3586 1131 -8338 -18714 -21122 -4312 -3523 203 -10392 -8793 -5241 -5968 5311 26121
6723 26121 32284 25322 12878 13924 21205 3618 12956 27760 10510 8169 14410 23072 21664 19130
6709 19130 8302 -9189 -12796 -9690 -20528 -18370 -6209 -1389 -12485 -15527 -688 6815 7962
6696 7962 10135 -2574 13013 15233 14123 16275 13586 -1902 -1565 896 -478 -6597 -11548 -5810
6682e810J4299K783j1931N172m626k8772L135L641J841K898J9915K5356p371j1572
6668H958q998k0582j2936J5479k423L260K6523o29j0455J642j638j4158j8890
6655c4847n031K2090o418J3641M049j0653j603J4917j1307l438J0575L589m089
6642h525j4429N876k0926k6715M679L0915J7888j0794q586J8255L792j1151j2134
6629c1855J3962J1094m190j2080K603L83K1663J7086K1332O425r383j1605j7054
6616H381k8381j2781K6207J8339l990L781M963Q93j133k9568j9155J5177J1845
6603e422J2358o240l5201L876j017q321P7n769j660K375J0479K0015R513K0822
6589A5885J3759n059j9774j9475j9060K4385K7170K8297J5346k1678j8456p150
$$ plain form
6682 -5810 8489 11272 -659 4513 -113 -28885 -25750 -22109 -20268 -17370 2545 27901 20530 8958
6668 8958 -40 -20622 -33558 -18079 -20502 -17242 9281 8652 -1803 -161 -1799 -15957 -34847
6655 -34847 -39878 -17788 -24206 -10565 -6516 -17169 -18772 -3855 -15162 -18600 -8025 -4436 -8525
6642 -8525 -22954 -17078 -38004 -64719 -60040 -29125 -11237 -22031 -30617 -12362 -8570 -19721 -31855
6629 -31855 -17893 -6799 -10989 -23069 -20466 -20083 1580 18666 39998 46423 37040 25435 8381
6616 8381 -20000 -32781 -6574 11765 7775 11556 16519 17412 16279 -13289 -32444 -17267 -5422
6603 -5422 6936 696 -34505 -30629 -31646 -39967 -39890 -45659 -47319 -44944 -34465 -14450 -4937 15885
6589 15885 29644 24585 4811 -14664 -33724 -9339 17831 46128 61474 39796 21340 14190
6577A4190K542l552M74j5080j4787j3066j9121J1410K9701J6226J1713j6105K204
6564F749O357k5164j2131j4005r607J0583J8296J0675N336K1990m073K943J4270
6551C2219L534N574Q235j5293j2326j2590j3641j4614N356N979J5544L35l574
6538D738J0544L112Q310Q74p910l195j1805Q588n384j3124j1894j4608L4647J5627
6524A8520n662m189O261j0296j7688L077K655J108P951J238k2421J3492J575O53
6510c726m126j1642o552M323O371J4380L778R948k66p442Q117j286j1887j7680
6496a7690l1390J5355n473K385J4989O644O427J1814m500o476K223J1316J2527
6483A8151R356j5025j8566J2335J2488j380k1890j3068J8470K26j0090o28l978
$$ plain form
6577 14190 16732 13180 13654 -1426 -16213 -29279 -48400 -36990 -7289 8937 20650 4545 6749
6564 6749 13106 -12058 -24189 -38194 -47801 -37218 -18922 -8247 -2911 19079 15006 17949 32219
6551 32219 35753 41327 49562 34269 21943 9353 -4288 -18902 -13546 -7567 7977 8312 4738
6538 4738 15282 18394 26704 27578 19668 16473 4668 13256 7872 -5252 -17146 -31754 2893 18520
6524 18520 12858 8669 14930 4634 -13054 -9977 -7322 -6214 1737 2975 -19446 -5954 -4379 -3726
6510 -3726 -7852 -19494 -26046 -21723 -15352 -972 2806 12754 12488 5046 13163 11877 -10 -17690
6496 -17690 -49080 -33725 -39198 -36813 -21824 -15180 -8753 3061 -1439 -7915 -5692 5624 18151
6483 18151 27507 12482 -6084 6251 18739 17359 -4531 -17599 871 1097 -8993 -9621 -13599
6470a3599J1294K282j4299o484O022o282O079N348j8759r097J7805L4018L877
6457A8205j8488J437O767o538j7908J6126J9114j0965P963P495j8417l2658n446
6444c3313J1475N800r434q855J0400N464N727J0772Q480j1686r421J8975O274
6431A0658m272K247R186j6401j2173J066L49K169r494L216K183k3890J1465J2520
6417a1171L619K220j9873m588O216J9360J5109r815q399o408p553j760L730j0426
6403b9739p209Q864J6937R578j2659n350N380o508r142K574J3683R839K823J0939
6389A0010J339j3283m177J0782n74p636L537O296O103j2660k0422O135o712k39
6375b1501J653K7968K953m475N88K601j3405j1525q877O461J1799J0538j0234
$$ plain form
6470 -13599 -2305 -23 -14322 -20806 -14784 -21066 -14987 -9639 -28398 -37495 -19690 14328 18205
6457 18205 -283 1154 7921 1383 -16525 -399 18715 7750 15713 23208 4791 -27867 -33313
6444 -33313 -21838 -16038 -25472 -34327 -23927 -18463 -12736 -1964 6516 -5170 -14591 4384 10658
6431 10658 6386 8633 17819 1418 -10755 -9689 -9340 -7171 -16665 -13449 -11266 -35156 -23691 -11171
6417 -11171 -7552 -5332 -25205 -29793 -23577 -4217 10892 1077 -7322 -13730 -21283 -23043 -19313 -29739
6403 -29739 -36948 -28084 -11147 -1569 -14228 -19578 -14198 -20706 -29848 -27274 -13591 -3752 -929 10010
6389 10010 11349 -1934 -6111 4671 4097 -3539 -2 6294 12397 -263 -20685 -14550 -21262 -21501
6375 -21501 -19848 8120 11073 6598 7186 9787 -3618 -15143 -24020 -17559 -5760 4778 -5456
6362e456R596M002j2554o653N447m961K479J1753J9443J277j916N979k1692k726
6348D018L06m346m805N336O184O592J0038O374K251r681j9286N407L160j8808
6334g260j229K074N82R813j80j5422k694l0J3510J3828j0685r617J457N650r770
6319i973j0158K564Q150K5719L5o626j5055j8615l463J003K633R847K3042n59
6305H544j0604M425j560R409N133m81O76M245p331j5667k3668l902O927J0415
6291a3439L277m334J2468k41J8207j5932k16j8000J7925q520o180J569J3116O724
6277F424L194N83N459q773q492L716Q076J094j4979K377n208l303l880Q344l083
6262h451r579j484p66J1141N496J4786J412n098k48k603R529j3376N053j1965
$$ plain form
6362 -5456 4140 8142 -4412 -11065 -5618 -10579 -8100 3653 23096 24373 22457 28436 6744 4018
6348 4018 4324 -22 -4827 509 6693 13285 23323 29697 31948 22267 2981 8388 11548 -7260
6334 -7260 -8489 -6415 -5833 3980 3800 -11622 -14316 -14346 -836 12992 2307 -7310 -5853 -203 -9973
6319 -9973 -20131 -17567 -9417 16302 16337 9711 -5344 -23959 -27422 -26419 -23786 -13939 9103 8544
6305 8544 -2060 2365 805 10214 15347 14866 15542 19787 12456 -3211 -26879 -30781 -23854 -13439
6291 -13439 -10162 -14496 -2028 -2269 15938 6 -210 -18210 -285 -8805 -14985 -13416 -300 6424
6277 6424 9618 10201 15660 6887 -1605 2111 10187 11281 -3698 -1321 -6529 -9832 -13712 -5368 -8451
6262 -8451 -18030 -19514 -20280 -9139 -3643 11143 12555 7457 7209 4606 14135 759 5812 -6153
6248f153Q57p60j1343J3889J2578p097J9119j1258J002Q374j1900L940m32r240
$$ plain form
6248 -6153 -5296 -6056 -17399 -3510 9068 1971 21090 9832 10834 19208 7308 11248 10816 1576
$$ [...]
##END NTUPLES=NMR SPECTRUM
##END=
