##TITLE=Analysis number 322239
Compound Code cc 47511
Book Reference 438/196
Project Code adrs
Chemist Name antons
##JCAMPDX= 6.0         $$ Bruker NMR JCAMP-DX V2.0
##DATA TYPE= NMR SPECTRUM
##DATA CLASS= NTUPLES
##ORIGIN= Bruker BioSpin GmbH
##OWNER= nmr
$$ XWIN-NMR		Version 3.5
$$ Mon Sep 18 12:14:16 2006 GMT Daylight Time (UT+1h)  MAYBRIDGE\nmr@NMR_250MHZ
##.OBSERVE FREQUENCY= 250.131544655141
##.OBSERVE NUCLEUS= ^1H
##.ACQUISITION MODE= SIMULTANEOUS (DQD)
##.ACQUISITION SCHEME= undefined
##.AVERAGES= 16
##.DIGITISER RES= 18
##SPECTROMETER/DATA SYSTEM= dpx250
##.PULSE SEQUENCE= zg30
##.SOLVENT NAME= CDCl3
##.SHIFT REFERENCE= (INTERNAL, CDCl3, 0, 16.4543)
##AUDIT TRAIL= $$ (NUMBER, WHEN, WHO, WHERE, WHAT)
$$ ##TITLE= Audit trail, XWIN-NMR		Version 3.5
$$ ##JCAMPDX= 5.01
$$ ##ORIGIN= Bruker BioSpin GmbH
$$ ##OWNER= nmr
$$ C:\u/data/dgb/nmr/ADRS/960/pdata/1/auditp.txt
$$ ##AUDIT TRAIL=  $$ (NUMBER, WHEN, WHO, WHERE, WHAT)
(   1,<2006-09-18 12:13:50.32 +100>,<MAYBRIDGE\nmr>,<NMR_250MHZ>,
      <created by zg, POWCHK disabled, PULCHK disabled
       configuration hash MD5:
       E2 DF 36 D8 04 B2 41 60 5A D7 A3 38 5A 4B D0 FE
       data hash MD5: 64K
       09 6B 0C 62 DA D4 F8 F6 8B 06 EC EF F1 DC 24 5D>)
(   2,<2006-09-18 12:14:05.68 +100>,<MAYBRIDGE\nmr>,<NMR_250MHZ>,
      <Start of raw data processing
       ef LB = 0.3 FT_mod = 6 PKNL = 1 SI = 32K 
       data hash MD5: 32K
       C7 ED 3E 4F 91 A2 28 CD CD 48 80 53 F7 ED 39 D9>)
(   3,<2006-09-18 12:14:07.40 +100>,<MAYBRIDGE\nmr>,<NMR_250MHZ>,
      <apk 
       data hash MD5: 32K
       0E EB DA 12 38 A3 CC 58 57 0F CA EB C9 FD CD 19>)
(   4,<2006-09-18 12:14:08.15 +100>,<MAYBRIDGE\nmr>,<NMR_250MHZ>,
      <abs ABSG = 5 
       data hash MD5: 32K
       8B B8 23 59 05 CD 3F D6 4A 57 09 6E B5 E6 F1 BA>)
$$ ##END=
$$ 
$$ hash MD5
$$ 64 E7 0B B4 0D 41 59 3B 91 5D 3E 9C D9 F6 5A 3E
##$RELAX= 
##$RELAX= 
##$RELAX= 
##$RELAX= 
##$RELAX= 
##$RELAX= 
##$RELAX= 
$$ Bruker specific parameters
$$ --------------------------
##$DU= <C:\u>
##$EXPNO= 960
##$NAME= <ADRS>
##$PROCNO= 1
##$TYPE= <nmr>
##$USER= <dgb>
##$AMP= (0..31)
100 100 100 100 100 100 100 100 100 100 100 100 100 100 100 100 100 100 
100 100 100 100 100 100 100 100 100 100 100 100 100 100 
##$AQSEQ= 0
##$AQ_mod= 3
##$AUNM= <au_zg>
##$AUTOPOS= <35 >
##$BF1= 250.13
##$BF2= 250.13
##$BF3= 250.13
##$BF4= 250.13
##$BF5= 500.13
##$BF6= 500.13
##$BF7= 500.13
##$BF8= 500.13
##$BYTORDA= 1
##$CFDGTYP= 0
##$CFRGTYP= 5
##$CHEMSTR= <none>
##$CNST= (0..31)
1 1 145 1 1 1 1 1 1 1 1 1 1 1 1 1 1 1 1 1 1 1 1 1 1 1 1 1 1 1 1 1 
##$CPDPRG= <>
##$CPDPRG1= <>
##$CPDPRG2= <>
##$CPDPRG3= <>
##$CPDPRG4= <mlev>
##$CPDPRG5= <mlev>
##$CPDPRG6= <mlev>
##$CPDPRG7= <mlev>
##$CPDPRG8= <mlev>
##$CPDPRGB= <>
##$CPDPRGT= <>
##$D= (0..31)
0 1 0 0 0 0 0 0 0 0.06 0 0 0 0 0 0 0.0002 0 0 0 0 0 0 0 0 0 0 0 0 0 0 
0 
##$DATE= 1158578028
##$DBL= (0..7)
120 120 120 120 120 120 120 120 
##$DBP= (0..7)
150 150 150 150 150 150 150 150 
##$DBP07= 0
##$DBPNAM0= <>
##$DBPNAM1= <>
$$ [...]
##$SUBNAM7= <"">
##$SUBNAM8= <"">
##$SUBNAM9= <"">
##$SW= 20.6930455092707
##$SWIBOX= (0..15)
0 0 3 0 0 0 0 0 0 0 0 0 0 0 0 0 
##$SW_h= 5175.983436853
##$TD= 65536
##$TD0= 1
##$TE= 296.16
##$TE2= 300
##$TE3= 300
##$TEG= 300
##$TL= (0..7)
0 120 120 120 120 120 120 120 
##$TP= (0..7)
150 150 150 150 150 150 150 150 
##$TP07= 0
##$TPNAME0= <>
##$TPNAME1= <>
##$TPNAME2= <>
##$TPNAME3= <>
##$TPNAME4= <>
##$TPNAME5= <>
##$TPNAME6= <>
##$TPNAME7= <>
##$TPOAL= (0..7)
0.5 0.5 0.5 0.5 0.5 0.5 0.5 0.5 
##$TPOFFS= (0..7)
0 0 0 0 0 0 0 0 
##$TUNHIN= 0
##$TUNHOUT= 0
##$TUNXOUT= 0
##$USERA1= <user>
##$USERA2= <user>
##$USERA3= <user>
##$USERA4= <user>
##$USERA5= <user>
##$V9= 5
##$VALIST= <valist>
##$VCLIST= <CCCCCCCCCCCCCCC>
##$VD= 0
##$VDLIST= <DDDDDDDDDDDDDDD>
##$VPLIST= <PPPPPPPPPPPPPPP>
##$VTLIST= <TTTTTTTTTTTTTTT>
##$WBST= 1024
##$WBSW= 4
##$XGAIN= (0..3)
0 0 0 0 
##$XL= 0
##$YL= 0
##$YMAX_a= 251022
##$YMIN_a= -586777
##$ZGOPTNS= <>
##$ZL1= 120
##$ZL2= 120
##$ZL3= 120
##$ZL4= 120
##$ABSF1= 16.45435
##$ABSF2= -4.238823
##$ABSG= 5
##$ABSL= 3
##$ALPHA= 0
##$AQORDER= 0
##$ASSFAC= 0
##$ASSFACI= 0
##$ASSFACX= 0
##$ASSWID= 0
##$AUNMP= <proc_1d>
##$AZFE= 0.1
##$AZFW= 0.1
##$BCFW= 0
##$BC_mod= 0
##$BYTORDP= 0
##$COROFFS= 0
##$CY= 12.5
##$DATMOD= 1
##$DC= 0
##$DFILT= <>
##$DTYPP= 0
##$F1P= 14.0000005364418
##$F2P= -0.99999901652339
##$FCOR= 0.5
##$FTSIZE= 32768
##$FT_mod= 6
##$GAMMA= 0
##$GB= 0
##$INTBC= 1
##$INTSCL= 1
##$ISEN= 128
##$LB= 0.3
##$LEV0= 0
##$LPBIN= 0
##$MAXI= 10000
##$MC2= 0
##$MEAN= 0
##$ME_mod= 0
##$MI= 0
##$NCOEF= 0
##$NC_proc= -4
##$NLEV= 6
##$NOISF1= 0
##$NOISF2= 0
##$NSP= 0
##$NTH_PI= 0
##$NZP= 0
##$OFFSET= 16.45435
##$PC= 1
##$PHC0= 149.5365
##$PHC1= 8.442083
##$PH_mod= 1
##$PKNL= yes
##$PPARMOD= 0
##$PSCAL= 4
##$PSIGN= 0
##$REVERSE= no
##$SF= 250.1300169198
##$SI= 32768
##$SIGF1= 0
##$SIGF2= 0
##$SINO= 400
##$SIOLD= 32768
##$SREGLST= <1H.CDCl3>
##$SSB= 0
##$STSI= 32768
##$STSR= 0
##$SW_p= 5175.98343685301
##$SYMM= 0
##$S_DEV= 0
##$TDeff= 65536
##$TDoff= 0
##$TI= <Analysis number 999999
Compound Code 99
Book Reference 9
Project Code 9>
##$TILT= no
##$TM1= 0
##$TM2= 0
##$TOPLEV= 0
##$USERP1= <user>
##$USERP2= <user>
##$USERP3= <user>
##$USERP4= <user>
##$USERP5= <user>
##$WDW= 1
##$XDIM= 32768
##$YMAX_p= 463486631
##$YMIN_p= -343272
$$ End of Bruker specific parameters
$$ ---------------------------------
##NTUPLES= NMR SPECTRUM
##VAR_NAME=  FREQUENCY,     SPECTRUM/REAL,   SPECTRUM/IMAG
##SYMBOL=    X,             R,               I
##VAR_TYPE=  INDEPENDENT,   DEPENDENT,       DEPENDENT
##VAR_FORM=  AFFN,          ASDF,            ASDF
##VAR_DIM=   32768,         32768,           32768
##UNITS=     HZ,            ARBITRARY UNITS, ARBITRARY UNITS
##FACTOR=    0.157963299565203, 1,           1
##FIRST=     4115.72672329719, 0,            0
##LAST=      -1060.25671355582, 0,           0
##MIN=       -1060.25671355582, -343272,     0
##MAX=       4115.72672329719, 463486631,    0
$$ Real data points
##PAGE= N=1
##DATA TABLE= (X++(R..R)), XYDATA
$$ [...]
20395A44075M746n2936k7730j5223p0483K0669J0733K670P0382k771n7393r9137
$$ 144075 148821 95885 68155 52932 -17551 3118 13851 16521 86903 84132 26739 -72398
20383g2398j8314j5872M5611r615K2097L0634J3668j7580k0735K2932O5218R52
$$ -72398 -90712 -106584 -60973 -70588 -48491 -17857 -4189 -21769 -42504 -19572 45646 46598
20371D6598n6926K0356k0869l2300j243K6650l8443j0558M3155P2334L9117j0630
$$ 46598 -10328 10028 -10841 -43141 -44384 -17734 -56177 -66735 -23580 48754 87871 77241
20359G7241n5522o2510J1912m413K1515N2582o699J9427l447j2382o0554m0514
$$ 77241 21719 -40791 -28879 -33292 -11777 40805 34106 53533 50086 37704 -22850 -63364
20347f3364k0139N3474N0196Q719L4981k9664j02554m6408N0316P56O2133R1128
$$ -63364 -83503 -30029 20167 28886 63867 34203 -68351 -114759 -64443 -63687 -1554 89574
20335H9574n2647k5233P838R359n4579n583N6063n1468o5913k0497l691O0996
$$ 89574 36927 11694 19532 28891 -25688 -31271 24792 -26676 -92589 -113086 -116777 -55781
20323e5781L6422M7888K7367j8023r6607J5263J01381K8347r050k4476M2158P0614
$$ -55781 -19359 28529 55896 37873 -58734 -43471 57910 86257 77207 52731 94889 165503
20311A65503m2039q068P9088O9153k5528j44572o2340j01440j7804k3479K6984
$$ 165503 123464 115396 194484 263637 238109 93537 31197 -70243 -88047 -111526 -84542
20300h4542O7891P2315M2100p2163N8689K0600M3255l158j21109Q009P9314L3859
$$ -84542 -16651 55664 97764 25601 84290 104890 148145 144987 23878 31887 111201 145060
20288A45060l4928n6358K9451l0819N22n1835m8584N6914N1055L499r2169K3305
$$ 145060 110132 53774 83225 52406 52928 1093 -47491 9423 60478 63977 -28192 -4887
20276d887k6077M1444l7279J0277O0263n2373p9018q131M2886M0009m5656p544
$$ -4887 -30964 10480 -26799 -16522 43741 -8632 -87650 -95781 -52895 -12886 -58542 -66086
20264f6086M5404m6812r338P3593M7049N7442k5857L6406J7699l1046k0034k3323
$$ -66086 -20682 -67494 -76832 -3239 43810 101252 75395 111801 129500 98454 78420 55097
20252E5097M5294M620q7605K6236Q908n428N2510j6633q323m7647l4782R5111
$$ 55097 100391 105011 17406 43642 52550 47122 99632 82999 74676 27029 -7753 87358
20240H7358M6495k5113P600o8231Q525Q184k9884P5410M4116K1253p947m5102
$$ 87358 133853 108740 116340 48109 56634 64818 34934 110344 154460 175713 167766 122664
20228A22664k2827j05525R912N3051r495O3299K8714p1081n3424J4589k3439P778
$$ 122664 99837 -5688 4224 57275 47780 111079 139793 68712 15288 29877 6438 14216
20216A4216N9424p9764m7258P3188k7792q308j3089K6427L9400k3071M5936L2667
$$ 14216 73640 -6124 -53382 19806 -7986 -16294 -29383 -2956 36444 13373 59309 91976
20204I1976N6147K2700l4907n4066K188k0587J7240J5097P5873j8346K4178J76088
$$ 91976 148123 170823 135916 81850 84038 63451 80691 95788 171661 153315 177493 353581
20192C53581L9408k4160R9990K30437J47192J11522P8127M3384P1702m6144l9124
$$ 353581 392989 368829 468819 699256 846448 957970 1036097 1079481 1151183 1105039 1065915
20181A065915j9171j69484j53235r7180o6145p7706k0670j26206p4719J1685J7430
$$ 1065915 1046744 877260 724025 626845 560700 482994 462324 336118 261399 273084 290514
20170B90514n5212n7507j3358m4068P3501P4217P0029n5686r1091n4086o3826
$$ 290514 235302 177795 164437 120369 193870 268087 338116 282430 191339 137253 73427
20159G3427r3630j02061l3285O9223N8310L5040p656l2638k6211L0740J13801
$$ 73427 -20203 -122264 -155549 -86326 -28016 7024 -632 -33270 -59481 -28741 85060
20148H5060M4749m6625K3149k5691j4848q0733o1819M9260O8246J37975R7760
$$ 85060 129809 83184 106333 80642 65794 -14939 -76758 -27498 40748 178723 276483
20137B76483p9900k8561m3285m1495p376o4761j1470N0591Q8470l062L5507J8914
$$ 276483 196583 168022 124737 83242 75866 11105 -365 50226 138696 135634 171141 190055
20125A90055j2077n2576J446j910n6044l2817l4188q484O3917J00816k8224j03615
$$ 190055 177978 125402 126848 124938 68894 36077 1889 -6595 57322 158138 129914 26299
20113B6299l7467l0909k3763l3318N6632M2147m5479k8530M7697Q5978n0450q3753
$$ 26299 -11168 -42077 -65840 -99158 -42526 -379 -45858 -74388 -26691 59287 8837 -74916
20101g4916P4125l5453K3255O1828j5592K1024L0768M3627K0409l0293j45789
$$ -74916 -791 -36244 -12989 48839 33247 54271 85039 128666 149075 118782 -27007
20090b7007k1135J4646m8603J4401O2413N0876L5909O8597l8853n5519N7839L3492
$$ -27007 -48142 -33496 -82099 -67698 -5285 45591 81500 150097 111244 55725 113564 147056
20078A47056p6902k4044n205L9590K9020J0039l1937k2245l3323j8753P7666L8079
$$ 147056 70154 46110 40905 80495 109515 119554 87617 65372 32049 13296 90962 129041
20066A29041N0404L433l5888k7622j810J0892P3328k8092o0205L4071j4059L5059
$$ 129041 179445 182878 146990 119368 117558 128450 201778 173686 113481 147552 133493 168552
20054A68552p2632n1217k2715k5985K949M5735O3972o5178m9547P613j008K3480
$$ 168552 95920 44703 21988 -3997 -1048 44687 108659 43481 -6066 1547 539 24019
20042B4019M7897k962o925n4582l3986m221Q2409J40834p8794j06368J4523r9859
$$ 24019 71916 68954 62029 7447 -26539 -30760 51649 192483 113689 7321 21844 -78015
20030g8015J5392J35205R5565o6014p0400k6126O619L793J6900Q8187O3834L9695
$$ -78015 -62623 72582 168147 102133 31733 5607 12226 16019 32919 121106 184940 224635
20018B24635n6103J7322r1320o6439j0792N524k9997j9525J29800l1547o6563
$$ 224635 168532 185854 94534 28095 17303 22827 -7170 -26695 103105 71558 4995
20007D995L2210Q0334l2986p0775l0533M8609K1175N9654o246m4343p056L8696
$$ 4995 37205 117539 84553 13778 -16755 31854 53029 112683 106437 62094 55038 93734
19995I3734J06926P9844k8148j07669k506m4322p5430L2615R706o2124K4792l6543
$$ 93734 200660 280504 252356 144687 142181 97859 22429 55044 64750 2626 27418 -9125
19983i125K5118O7558q159M9073m4350N3904J6593o2622o6362l7217P1132M5682
$$ -9125 15993 83551 75392 124465 80115 134019 150612 87990 21628 -15589 55543 101225
19971A01225m335k1819p8246J423j196P7546K3188k9596Q189l6913o4976K0668
$$ 101225 96890 75071 -3175 -1752 -2948 74598 97786 68190 76379 39466 -25510 -4842
19959d842P928M3728M3362l0158O71O8717j4764m5385m5824k4810K6865l374J9132
$$ -4842 3086 46814 90176 60018 60689 129406 114642 69257 23433 -1377 25488 22114 41246
19946D1246K1952k0067M3118q1497l3793L1202M8669L3623M990J1483L1688K3051
$$ 41246 63198 43131 86249 4752 -29041 2161 50830 84453 89443 100926 132614 155665
19934A55665m6086L5827L8156L4153K4745Q3389P1039K0302l3769L0018J44125
$$ 155665 109579 145406 183562 217715 242460 325849 396888 417190 383421 413439 557564
19923E57564J30351J8980J24246J41019J63848P9454l4786r0422k2740j19129
$$ 557564 687915 706895 831141 972160 1136008 1215462 1180676 1090254 1067514 948385
19913I48385q8359j12088j12998K704l2014n7570j10967j41724K1519k709j6244
$$ 948385 860026 747938 634940 637644 605630 548060 437093 295369 316888 314179 297935
19902B97935L2355j9179L942o5522Q8735j1121m0939j01563m7640K6159J3812
$$ 297935 330290 311111 315053 249531 338266 327145 286206 184643 137003 163162 176974
19891A76974o8082m6472M2N0738J8426P509m742P0760K3401O0982j07945p6405
$$ 176974 108892 62420 62462 113200 131626 139135 134393 205153 228554 289536 181591 105186
19879A05186m145N5003n8679o5986m4773p592l3123N0714Q5464K9623J0974k5468
$$ 105186 101041 156044 97365 31379 -13394 -20986 -54109 -3395 82069 111692 122666 97198
19867I7198m5027N0226J10141M5936K9244L2865l3212m002r2072R998m8504j1818
$$ 97198 52171 102397 212538 258474 287718 320583 287371 283369 191297 201295 152791 140973
19855A40973K5573j8298m5781o4107K2809M3218M2555J6079j4285l2530l04K8423
$$ 140973 166546 148248 102467 38360 61169 104387 146942 163021 148736 116206 115902 144325
19843A44325P8309N745J1263O4913l7600j20275k1853q5672p3982K4229P0089
$$ 144325 222634 228379 239642 304555 266955 146680 124827 39155 -34827 -10598 59491
19832E9491j9488N5130L1489l2599K6164J32730N0866p7443l0539n6806k4197
$$ 59491 40003 95133 126622 94023 120187 252917 303783 226340 195801 138995 114798
19821A14798L9630P0855r654j2056j2332m176N9669j8128o2320K9564o5980j4421
$$ 114798 154428 225283 215629 203573 191241 187065 246734 228606 166286 195850 129870 115449
19809A15449R4516P144M0189J9471K8803Q3767n6759l2111o2765k3989r072L234
$$ 115449 209965 217109 257298 276769 305572 389339 332580 300469 237704 213715 204643 207877
19797B07877O516m5355l5761O8611J1450p788J8137j7142l3187N2227J621N0009
$$ 207877 214393 169038 133277 201888 213338 205550 223687 206545 173358 225585 227206 277215
19785B77215Q4046o1312M2618j7496L8318O2799L2113n0489p8240l6453O752r3663
$$ 277215 361261 299949 342567 325071 363389 426188 458301 407812 329572 293119 299871 206208
19773B06208m1699J8938J24263L2362J3959k9468j4394n8136k4468p74j3850n6509
$$ 206208 164509 183447 307710 340072 354031 324563 310169 252033 227565 226791 212941 156432
19761A56432Q906O6857N424l3747j08702p1128j8021J05058P3267l3340p776L8692
$$ 156432 165338 232195 237619 203872 95170 24042 6021 111079 184346 151006 143230 181922
19749A81922M7098J0265L8107j1010j0667Q3834Q871k7530m646j01380k5656m9529
$$ 181922 229020 239285 277392 266382 255715 339549 348420 320890 316244 214864 189208 139679
19737A39679L6230k1931n4281K61P260L672J894J16419K20364k5117j00973N094
$$ 139679 175909 153978 99697 99958 107218 110890 112784 229203 449567 424450 323477 328571
19725C28571j224j6831k730p1688l9534L1806J5665N1401R7061k6593M3544o6317
$$ 328571 327347 310516 307786 236098 196564 228370 244035 295436 392497 365904 409448 343131
19713C43131L930R6958Q2576J93974J92045R8523J09964J45190K01330J09337
$$ 343131 347061 444019 526595 720569 912614 1011137 1121101 1266291 1467621 1576958
19703A576958K7816M8019O0158P3146Q0374M5651J1832O5757j293L1329r94j09578
$$ 1576958 1604774 1652793 1712951 1786097 1866471 1912122 1923954 1989711 1988418 2019747 2018753 1909175
19691A909175K4674l3474j23382j13457j6735n3880j24475j35670n7679j04904
$$ 1909175 1933849 1900375 1776993 1663536 1646801 1592921 1468446 1332776 1275097 1170193
19681A170193j57047j26686O771j4821q2235p7619J7586l7976o4011k2468Q1309
$$ 1170193 1013146 886460 893231 878410 796175 718556 736142 698166 634155 611687 692996
19670F92996K5043N130m1177j7011J8700K2673P2661J0733l9554k3053k1014J5732
$$ 692996 718039 723169 681992 664981 683681 706354 779015 789748 750194 727141 706127 721859
19658G21859j7334N1880J04038J64873N2709j0913Q962O7075Q6727M4561L5117
$$ 721859 704525 756405 860443 1025316 1078025 1067112 1076074 1143149 1229876 1274437 1309554
19647A309554j5003j7683L1965R131l2093K7356o5924j05955q7317p343j11564
$$ 1309554 1294551 1276868 1308833 1317964 1285871 1313227 1247303 1141348 1054031 1046688 935124
19636I35124p4425n9141j34531l4291N4013K0587O175p453M5947N2145O7414L82
$$ 935124 860699 801558 667027 632736 686749 707336 713511 706058 752005 804150 871564 871946
19624H71946J27331P1334j0812k4286k2463o1608p375L0766j6544P2920Q395Q0357
$$ 871946 999277 1070611 1059799 1035513 1013050 951442 944067 974833 958289 1031209 1039604 1119961
19612A119961N3618K0065l5083q6513K6082Q7620j2770N5457M4992N9802J94149
$$ 1119961 1173579 1193644 1158561 1072048 1098130 1185750 1172980 1228437 1273429 1333231 1527380
19601A527380Q1327K1111L36M5889L5977Q209j06283l3406j9625K721q7529O6755
$$ 1527380 1608707 1629818 1630154 1676043 1712020 1720229 1613946 1580540 1560915 1563636 1476107 1542862
19589A542862l4002j01233Q9564J6101n958m9505M7765L8927k5997k231L5407
$$ 1542862 1508860 1407627 1497191 1513292 1507334 1457829 1505594 1544521 1518524 1516293 1551700
19578A551700Q9385M1227o23J01060O239m482J00839J49981J18022J39231J15757
$$ 1551700 1641085 1682312 1681689 1782749 1788988 1784506 1885345 2035326 2153348 2292579 2408336
19567B408336K18852L58474K93689L20372L53230J94592K91553L05714J45737
$$ 2408336 2627188 2985662 3279351 3599723 3952953 4147545 4439098 4744812 4890549
19558D890549N7175J16964k178P9661K25709J07152J12085J40129K42391L33977
$$ 4890549 4947724 5064688 5062510 5142171 5367880 5475032 5587117 5727246 5969637 6303614
19548F303614L44860M67691O26499O81234P40763Q19500R85781J218014J529960
$$ 6303614 6648474 7116165 7742664 8423898 9164661 9984161 10969942 12187956 13717916
19539A3717916J706974K049304K642518L452604M533195O066674Q054917J0698640
$$ 13717916 15424890 17474194 20116712 23569316 28102511 34169185 42224102 52922742
19531E2922742J3983511J7444017K0799858K3229656K4065372K2571901J8424853
$$ 52922742 66906253 84350270 105150128 128379784 152445156 175017057 193441910
19524A93441910J1889782L516436n415397j3258157j9155068k2229110k2199107
$$ 193441910 205331692 208848128 203432731 190174574 171019506 148790396 126591289
19517A26591289k0313017j7302731j3883357j0783863q275529o450645n210681
$$ 126591289 106278272 88975541 75092184 64308321 56032792 49582147 44371466
19510D4371466m293985l520554k994361k649856k150172j896821j570520j363277
$$ 44371466 40077481 36556927 33562566 30912710 28762538 26865717 25295197 23931920
19502B3931920j138291j037182q16787p88936o88012o96791o64692n65934n57188
$$ 23931920 22793629 21756447 20939660 20150724 19462712 18765921 18101229 17535295 16978107
19493A6978107m34613m82803m90541m56196l95519m46394l46659l21663l70584
$$ 16978107 16543494 16060691 15570150 15113954 14718435 14272041 13925382 13603719 13233135
19484A3233135m13536m63445m41320m47359m19878m15511k90141k96061m80287
$$ 13233135 12819599 12356154 11914834 11467475 11047597 10632086 10341945 10045884 9565597
19475I565597l72597k46283k43883l58682l49004k91848k54237k83245k73857
$$ 9565597 9193000 8946717 8702834 8344152 7995148 7703300 7449063 7165818 6891961
19466F891961j63039j71192j75973j81446j44425j29973j34966j75361j27201
$$ 6891961 6728922 6557730 6381757 6200311 6055886 5925913 5790947 5615586 5488385
19457E488385j04577r5261o8646j25963p7081p9955j23621j86348k20172j34835
$$ 5488385 5383808 5288547 5219901 5093938 5016857 4936902 4813281 4626933 4406761 4271926
19447D271926q1060r4857j06560j47565j06739m4852l8729L359q6434j40229j13780
$$ 4271926 4190866 4096009 3989449 3841884 3735145 3690293 3651564 3654923 3568489 3428260 3314480
19436C314480r0107j34480n6228r5454n4415L84J09862n1923k05164r1170J167
$$ 3314480 3224373 3089893 3033665 2938211 2883796 2884180 2994042 2942119 2736955 2645785 2646952
19425B646952n8139n8995q993n6448j04377j14879L613N6478p2105k5064j7312
$$ 2646952 2588813 2529818 2520825 2464377 2360000 2245121 2248734 2305212 2233107 2208043 2190731
19414B190731j14063j05340K5338r149q4650k5891K1187J1161q0628o1879Q8078
$$ 2190731 2076668 1971328 1996666 1987517 1902867 1876976 1898163 1909324 1828696 1766817 1854895
19403A854895M0051k3159m7118j8210O7301m0519n3906j6406R121l1798K4292
$$ 1854895 1894946 1871787 1824669 1806459 1873760 1833241 1779335 1762929 1772050 1740252 1764544
19392A764544N3622J7408r392M1603k1114n5576K2563k6097r2656o738K3171k2694
$$ 1764544 1818166 1835574 1826182 1867785 1846671 1791095 1813658 1787561 1694905 1688167 1711338 1688644
19380A688644l1925n3919r535Q200O1024m1555q1102p5236r8651n141n0802N3291
$$ 1688644 1656719 1602800 1593265 1601465 1662489 1620934 1539832 1464596 1365945 1360804 1310002 1363293
19368A363293Q5579R093l9827q639o4550l2353m349N3338M2753K3790q8375k7387
$$ 1363293 1448872 1457965 1418138 1409499 1344949 1312596 1308247 1361585 1404338 1428128 1339753 1312366
19356A312366N2101M628o7924j3485j4232M0591L0984M7849l8182n9489r282n2400
$$ 1312366 1364467 1369095 1301171 1287686 1273454 1314045 1345029 1392878 1354696 1295207 1285925 1233525
19344A233525r7115r186k2276O995J0683r47O3335P0814J11626M7830q9187k7609
$$ 1233525 1136410 1127224 1104948 1111943 1122626 1121679 1185014 1255828 1367454 1415284 1326097 1298488
19332A298488n537N1314J48555J7321j1740J29010P5970m9743m1266L3566O3095
$$ 1298488 1292951 1344265 1492820 1510141 1498401 1627411 1703381 1653638 1612372 1645938 1709033
19321A709033Q2088Q6453M9495O8931N5582J6331Q4538O0814M3410J51884N5043
$$ 1709033 1791121 1877574 1927069 1996000 2051582 2067913 2152451 2213265 2256675 2408559 2463602
19310B463602Q3200K01844J34356J55738J65263J40079J67735J79630J73592J39832
$$ 2463602 2546802 2748646 2883002 3038740 3204003 3344082 3511817 3691447 3865039 4004871
19300D004871J37644P9494P5335K47943J19063K87855L88797M37168N35153M26822
$$ 4004871 4142515 4222009 4297344 4545287 4664350 4952205 5341002 5778170 6313323 6740145
19290F740145N39892O15668N55075O63236O67378O24857Q80061R98098J078447
$$ 6740145 7280037 7895705 8450780 9114016 9781394 10406251 11286312 12284410 13362857
19281A3362857J310097J531322J832862K515403L063516L866175N226338O937260
$$ 13362857 14672954 16204276 18037138 20552541 23616057 27482232 32708570 39645830
19273C9645830R191517J2333591J6326301K0536990K4124896K5823286K4997324
$$ 39645830 48837347 61170938 77497239 98034229 122159125 147982411 172979735
19266A72979735K1297640J4448034M723819o536072j6726169k3456083k5505968
$$ 172979735 194277375 208725409 213449228 206913156 190186987 166730904 141224936
19259A41224936k3643360j9721474j5380977j1728942q841777o793508n343430
$$ 141224936 117581576 97860102 82479125 70750183 61908406 55114898 49771468
19252D9771468m259784l614816l040520k648649k349217k080471j839746j644447
$$ 49771468 45511684 41896868 38856348 36207699 33858482 31778011 29938265 28293818
19244B8293818j519489j216813j067980j062854j021147j012307q87351p85876
$$ 28293818 26774329 25557516 24489536 23426682 22405535 21393228 20505877 19720001
19236A9720001r18760q87064q11799p75271o49786o03056n62218m43962l75709
$$ 19720001 18801241 17914177 17102378 16327107 15677321 15074265 14512047 14068085 13692376
19227A3692376m37375m33936l16411l30765l31210l11205k65941k70083k85685
$$ 13692376 13255001 12821065 12504654 12173889 11842679 11531474 11265533 10995450 10709765
19218A0709765k05893l06486k21396k72637k93444m12455l51092k98976l40472
$$ 10709765 10503872 10197386 9975990 9703353 9409909 8997454 8646362 8347386 8006914
19209H006914l70974k07376j69217j02409k21402k36165j34255j73610j08937
$$ 8006914 7635940 7428564 7259347 7156938 6935536 6699371 6565116 6391506 6282569
19200F282569m4417j45392j87056n3659q1189r9255j84172j56873j55915j43263
$$ 6282569 6238152 6092760 5905704 5852045 5770856 5671601 5487429 5330556 5174641 5031378
19190E031378k32108j08899j74422P352R119q7207j80765j72396K0914l1039m1125
$$ 5031378 4799270 4690371 4515949 4523301 4532420 4445213 4264448 4092052 4112966 4081927 4040802
19179D040802j34219o3490k9447p7538n5552p2276r0260j16342p7404o2384r7819
$$ 4040802 3906583 3843093 3813646 3736108 3680556 3608280 3518020 3401678 3324274 3261890 3164071
19168C164071l6867l0698O235P4271M5759L1381o4741m8143K5094L7560N6519
$$ 3164071 3127204 3096506 3102741 3177012 3222771 3254152 3189411 3141268 3166362 3203922 3260441
19157C260441M1893M3770L9628P6858J16261J83887J05623O7906L9670P6125K54300
$$ 3260441 3302334 3346104 3385732 3462590 3578851 3762738 3868361 3936267 3975937 4052062 4306362
19146D306362J82187J39404K94751J36968J15443K80955L83238N58780P13653
$$ 4306362 4488549 4627953 4922704 5059672 5175115 5456070 5839308 6398088 7111741
19137G111741Q83529J244088J811501K841168M455228O507105Q603834J0047641
$$ 7111741 7995270 9239358 11050859 13892027 18347255 24854360 33458194 43505835
19129D3505835J0774411J0674701Q952037O057777K494870L06397q80364r20206
$$ 43505835 54280246 64954947 73906984 79964761 82459631 82766028 81885664 80965458
19121H0965458Q32916K610686K293716k56378m719193q520610j1207961j2131493
$$ 80965458 81798374 84409060 86702776 86446398 81727205 73206595 61998634 49867141
19113D9867141j0358212p491339n045381l455472k420231j747092j310187j114678
$$ 49867141 39508929 32017590 26972209 23516737 21096506 19349414 18039227 16924549
19105A6924549q25630o41710o32012o09734m52264m04192l38280k18515j86601
$$ 16924549 16098919 15457209 14825197 14215463 13763199 13359007 13020727 12802212 12615611
19096A2615611j74131j10366j55515j00337p3643N8551J73283L67147M99413P32724
$$ 12615611 12441480 12331114 12175599 12075262 12001619 12060170 12233453 12600600 13100013 13832737
19086A3832737J304160J853398K835658M755816O878603Q975696J0624326J1452452
$$ 13832737 15136897 16990295 19825953 24581769 31460372 40436068 51060394 62512846
19078F2512846J1259413R436609O180541K158288k64456j448806j215097P93187
$$ 62512846 73772259 83208868 89389409 91547697 91283241 89834435 88619338 89412525
19070H9412525K797167K768695K30492m630827r092803j2046006j3156973j1464097
$$ 89412525 92209692 94978387 95208879 90578052 81485249 69439243 56282270 44818173
19062D4818173q630283n763857m068055k937089k121474j580465j291679j101658
$$ 44818173 36187890 30424033 26355978 23418889 21297415 19716950 18425271 17323613
19054A7323613q53845r34323r14545p05155o07575n11120l96001l47030l55837
$$ 17323613 16469768 15535445 14620900 13915745 13308170 12797050 12401049 12054019 11698182
19045A1698182l07484k95503k88170k53795l07938k58377k55557k90824j64946
$$ 11698182 11390698 11095195 10807025 10553230 10245292 9986915 9731358 9440534 9275588
19036I275588p9404j53577j44496k20285k48301k03603k16458k63240k92578j86057
$$ 9275588 9196184 9042607 8898111 8677826 8429525 8225922 8009464 7746224 7453646 7267589
19026G267589j42807k79522l49008l65000l51618l21101k32374k14359j11312
$$ 7267589 7124782 6845260 6496252 6131252 5779634 5458533 5226159 5011800 4900488
19017D900488j33606n9400r9897j67726j40898q797m4957j74405j32487o1464
$$ 4900488 4766882 4707482 4607585 4439859 4298961 4290164 4245207 4070802 3938315 3876851
19007C876851l4270p2555j07831j23355o2657k5459J6157j18816j79904j30949
$$ 3876851 3842581 3770026 3662195 3538840 3476183 3450724 3466881 3348065 3168161 3037212
18997C037212j30735m6178l7104m95L8322Q220j4254O8998J00536M7251M2920
$$ 3037212 2906477 2860299 2823195 2822700 2861022 2869242 2854988 2923986 3024522 3071773 3114693
18986C114693Q4042J9474r4840l4335K0122n7021n8665l9847m6651n9099n5196
$$ 3114693 3198735 3218209 3123369 3089034 3109156 3052135 2993470 2953623 2906972 2847873 2792677
18975B792677k39032k24129j94355p3211n4898j30568q4653n0917o5271M5734
$$ 2792677 2553645 2329516 2135161 2061950 2007052 1876484 1791831 1740914 1675643 1721377
18965A721377m6853j40977p6739j1958l102r4602n1456p5673j58375j5714K3199
$$ 1721377 1674524 1533547 1456808 1444850 1441748 1347146 1295690 1220017 1061642 1045928 1069127
18954A069127o816L2963L4176N4052J2238p2760m6977r8032l7628M441o1860q6282
$$ 1069127 1062311 1095274 1129450 1183502 1195740 1122980 1076003 977971 940343 944784 882924 796642
18942G96642m379l8130l1315O6150n241o228l7742L7473P375K544l8657k0502
$$ 796642 792263 754133 722818 788968 783727 777499 739757 777230 784605 787149 748492 727990
18930G27990n2337j5493M816K5072N7751J0148m9835L5191o8611K8834q483n5705
$$ 727990 675653 660160 664976 690048 747799 757947 708112 743303 674692 703526 695043 639338
18918F39338m6383J3205n2446k6835n4824k0245K5191L2605l4710l0414M7468
$$ 639338 592955 606160 553714 526879 472055 451810 477001 509606 474896 444482 491950
18907D91950j15213j5977K0251M9134O5599K39J9911m4748o263q0231o7441p5165
$$ 491950 376737 360760 381011 430145 495744 495983 515894 471146 464883 384652 317211 242046
18895B42046O3706M5758n5473M7259N0299q07N454m64n9577L7699J3134n1641
$$ 242046 305752 351510 296037 343296 393595 392788 398242 397778 338201 375900 389034 337393
18883C37393j3012l837k8519k6225r916M5178L5394n6363l8078p5L6605M2705
$$ 337393 324381 320544 292025 265800 255884 301062 336456 280093 242015 241940 278545 321250
18871C21250R424Q9126K1700j38611r232P9342R2945J4265Q5233L6578J05985
$$ 321250 330674 419800 441500 302889 293657 372999 465944 480209 565442 602020 708005
18860G08005J26008J06953J53554J60087J01237m231k5962O086o4979q7838j34290
$$ 708005 834013 940966 1094520 1254607 1355844 1351613 1325651 1331737 1266758 1178920 1044630
18849A044630q1200O491q4803q3712n2621j09748j46460p7092M981J32030O9763
$$ 1044630 963430 969921 885118 801406 748785 639037 492577 415485 420466 552496 622259
18838F22259n0033j15348N8416J3451n2964k8983N294N2663j39585j18399m9580
$$ 622259 572226 456878 515294 528745 475781 446798 452092 504755 365170 246771 197191
18827A97191J265L4931M0684L8941J17237N4107k1303k344K7008K2661M4169k2738
$$ 197191 198456 233387 274071 313012 430249 484356 463053 460709 487717 510378 554547 531809
18815E31809k4749l1598l4879O3024M6486L5414m0105r130o206l397o2486r0464
$$ 531809 507060 475462 440583 503607 550093 585507 545402 536272 530066 526669 464183 373719
18803C73719p269k2592r4077l6008j8214N3353M3353K2028j01071k0633l078M1523
$$ 373719 366450 343858 249781 213773 195559 248912 292265 314293 213222 192589 189511 231034
18791B31034L3493L2130M4259n181M1393J1515J4097l0705N275L833l9586j12359
$$ 231034 264527 296657 340916 335735 377128 388643 402740 372035 377310 381143 341557 229198
18779B29198q833L9022k9722M2722R7572J25027R8802R6714J52383J80010J25988
$$ 229198 220365 259387 229665 272387 369959 494986 593788 690502 842885 1022895 1148883
18768A148883M5863J8450n493j35654j44667k10632m3398J683l4505j64151q4132
$$ 1148883 1194746 1213196 1207703 1072049 927382 716750 673352 675035 640530 476379 392247
18757C92247J4593q2772K08k5917P362q3602k4924l0932O0804J48011m43j24803
$$ 392247 406840 324068 324276 298359 305721 222119 197195 166263 227067 375078 374635 249832
18745B49832n4477k3594o7232n3688m6061J4714L2724J02923N0827m7546n9330
$$ 249832 195355 171761 104529 50841 4780 19494 52218 155141 205968 158422 99092
18734I9092q4956O5053J1549k4808J6720J7228n0117Q539M9767Q6946R2192J7912
$$ 99092 14136 79189 90738 65930 82650 99878 49761 58300 108067 195013 287205 305117
18722C05117J2955J30990P5463n1171o1638n2741o6797r7399J225J06303O3368
$$ 305117 318072 449062 524525 473354 411716 358975 292178 194779 196004 302307 365675
18711C65675m0121q8565K4148r475L1302P2335l3347j31423q6245J50583J446
$$ 365675 325554 236989 261137 251662 282964 355299 321952 190529 104284 254867 256313
18700B56313q1117n3435J1596N3944P9696N0179N3916j6471O155K5681N7013J09158
$$ 256313 175196 121761 133357 187301 266997 317176 371092 354621 360776 386457 443470 552628
18688E52628Q1657J07568J22431j0232j3039J8557p918l8297k6172N5867Q2657
$$ 552628 634285 741853 864284 854052 841013 859570 851652 813355 787183 843050 925707
18677I25707J15172j5973m6900j01263j26206j12003j40854j17293p942J1590
$$ 925707 1040879 1024906 978006 876743 750537 638534 497680 380387 372445 384035
18667C84035M432m3669k2650k7104K332o9014o9451L7281M0442j10m3081p2971
$$ 384035 388467 344798 322148 295044 297376 228362 158911 196192 236634 236524 193443 120472
18655A20472l2761P7201M3304o798J41858R7793k0965p0840m5870L83P0211M8485
$$ 120472 87711 164912 208216 201418 343276 441069 420104 349264 303394 303777 373988 422473
18643D22473R817P0195O3808N6161J67969J12467P7068Q1352L1566J2973p0366
$$ 422473 432290 502485 566293 622454 790423 902890 979958 1061310 1092876 1105849 1035483
18632A035483p0228O8924P0482P8169L8976j5176K5696j9094r1437j51007k14713
$$ 1035483 965255 1034179 1104661 1182830 1221806 1206630 1232326 1213232 1121795 970788 756075
18621G56075n8253O37k5588q3574j3160P9674l359p3512o5818n164N3971P5972
$$ 756075 697822 698459 672871 589297 576137 655811 652452 578940 513122 507958 561929 637901
18609F37901J17287J26657K05933J55093P8642M3463P3770L7331R4780N6967K640
$$ 637901 755188 881845 1087778 1242871 1321513 1364976 1438746 1476077 1570857 1627824 1630464
18598A630464p8243k44163j80338k5427J9056k4717r3712j06010J1971Q3706l6265
$$ 1630464 1552221 1308058 1127720 1102293 1121349 1096632 1002920 896910 908881 992587 956322
18587I56322r8191q9691m3492q5218j23069j72990P605M0188K5986N9191R9187
$$ 956322 858131 768440 724948 639730 516661 343671 351276 391464 417450 476641 575828
18576E75828m5563r3519r5253m7645k1653P12L0679R251Q054o8046k1528K6068
$$ 575828 530265 436746 341493 293848 272195 272907 303586 312837 320891 252845 231317 257385
18564B57385J191j7577J2196J5133j868K1032J778n2665k5870J2552K02814O5282
$$ 257385 258576 240999 253195 268328 266460 287492 289270 236605 210735 223287 426101 491383
18552D91383n9669l4270O2328O7139N3628M5258L5712J071M3259Q762o0398m1078
$$ 491383 431714 397444 459772 526911 580539 625797 661509 662580 705839 714601 654203 613125
18540F13125K8438j5667j0384j0608j1138n1765o6641k6190o065n7616n2760l928
$$ 613125 641563 625896 615512 604904 593766 542001 475360 449170 443105 385489 332729 328801
18528C28801o0n5860k764M2145o9155p4139L6645r219o68O8578n2021k3969L229
$$ 328801 328741 272881 270117 312262 243107 168968 205613 196394 195726 264304 212283 188314 191543
18515A91543K7749L810J4274k4482k0219o455Q3579P3701j0504K8509L3819q778
$$ 191543 219292 223102 237376 212894 192675 186220 269799 343500 332996 361505 395324 386546
18503C86546l7359J5763N5330q5903n6769j8684o1708L248Q7523M2680n5008j2125
$$ 386546 349187 364950 420280 334377 277608 258924 197216 200464 287987 330667 275659 263534
18491B63534L199M4214K4466o2335L0502L0294j1990p0785k8768P5423N5212N921
$$ 263534 266733 310947 335413 273078 303580 333874 321884 251099 222331 297754 352966 358887
18479C58887N431l2405l2088J02785L5099j6080m6878l1835j7714l7842j6738
$$ 358887 364318 331913 299825 402610 437709 421629 374751 342916 325202 287360 270622
18468B70622n9487j04153k8666O0594M6055R002L7420Q2744J8828m9835k341k4014
$$ 270622 211135 106982 78316 138910 184965 193967 231387 314131 332959 283124 280783 256769
18456B56769K7648L4811N9797r7059K0025J4332l5107k0957Q059m7826k2507O6508
$$ 256769 284417 319228 379025 281966 301991 316323 281216 260259 268318 220492 197985 264493
18444B64493M93o6864K8273M8336k5952L6540K3522N3083M4112P7323L0018j61718
$$ 264493 264986 198122 226395 274731 248779 285319 308841 361924 406036 483359 513377 351659
18432C51659p3984P2391J05509N2645J00915O9027J4703k9600K2604m0516o6055
$$ 351659 277675 350066 455575 508220 609135 678162 692865 663265 685869 645353 579298
18421E79298P81L5301o892l8562q6306p9809J21611J05454O5792n8045k1426L4880
$$ 579298 580079 615380 608488 569926 483620 403811 525422 630876 696668 638623 617197 652077
18409F52077L2384p3301j40871n653J9672K0920r89p5346k1764M9321l545N0428
$$ 652077 684461 611160 470289 464636 484308 505228 504239 428893 407129 456450 452905 503333
18397E03333J4642j00289K9142J15892M3508r6919j5971L7326k192k9231J04322
$$ 503333 517975 417686 446828 562720 606228 509309 493338 530664 528472 499241 603563
18386F03563N0218j2339M7218j316o2158M1508J72194J07848N360J8818J01835
$$ 603563 653781 641442 688660 687344 625186 666694 838888 946736 952096 970914 1072749
18375A072749O4926P1n7995j21608j25824k5587R6092J07569R0659R6417j6863
$$ 1072749 1137675 1137746 1079751 958143 832319 806732 902824 1010393 1101052 1197469 1180606
18364A180606k3774m5649k4143M6881L6653j6442q639m1665J654J174K1476O1474
$$ 1180606 1156832 1111183 1087040 1133921 1170574 1154132 1145493 1103828 1105482 1106656 1128132 1189606
18352A189606R2985j676K4648k118M750m8666J9646N3758Q6993P1451J35355Q1842
$$ 1189606 1282591 1280915 1305563 1303445 1308195 1259529 1279175 1332933 1419926 1491377 1626732 1708574
18340A708574N8182O7403L335k6909P0658K2180j0583J7440J8566m874k1840j5647
$$ 1708574 1766756 1834159 1837494 1810585 1881243 1903423 1892840 1910280 1928846 1923972 1902132 1886485
18328A886485J13383N5551j4511P2794O4103K4153N5075J90643L46922L32684
$$ 1886485 1999868 2055419 2040908 2113702 2177805 2201958 2257033 2447676 2794598 3127282
18318C127282M25651N62143Q18901J274685J992128K954810L992196M700312M732017
$$ 3127282 3552933 4115076 4933977 6208662 8200790 11155600 15147796 19848108 24580125
18309B4580125M597107L842298K384950J072821q01278r21552o8540P62716J306435
$$ 24580125 29177232 33019530 35404480 36477301 35676023 34754471 34685931 35448647 36755082
18300C6755082J240938m1038j652446m268197n217095m864097m007656k616420
$$ 36755082 37996020 37954982 36302536 32034339 26817244 21953147 17945491 15329071
18292A5329071j742356j261261q34481n78201m89322m70604m37438k61613k32817
$$ 15329071 13586715 12325454 11490973 10912772 10423450 9952846 9515408 9253795 9020978
18283I020978k48797k13465j88847n9900R2449J18506K29268J83188K05818K28293
$$ 9020978 8772181 8558716 8369869 8309969 8402418 8520924 8750192 8933380 9139198 9367491
18273I367491J61366K57222N50474R72222J613808K505344L957947N787475P641635
$$ 9367491 9528857 9786079 10336553 11308775 12922583 15427927 19385874 25173349 32814984
18264C2814984R386126J0372406J0755486R494044P316646M340228J017446J53894
$$ 32814984 42201110 52573516 63329002 72823046 80139692 84479920 85497366 85651260
18256H5651260r68493k427J484086J774677P34223j863295o426970q999869j1584551
$$ 85651260 84682767 84680340 86164426 87939103 88673326 86810031 80383061 71383192 59798641
18247E9798641j1075354r161987o828207m664526l212720k425248j827071j301627
$$ 59798641 48723287 39561300 32733093 28068567 24855847 22430599 20603528 19301901
18239A9301901j028073r32576p84139o95724o48766n69051m31974m41331l31267
$$ 19301901 18273828 17341252 16557113 15861389 15212623 14643572 14211598 13770267 13439000
18230A3439000k37035j62510j00117k02692j47511q5799M5879K44779N12832Q90685
$$ 13439000 13201965 13039455 12939338 12736646 12589135 12503336 12549215 12793994 13306826 14197511
18220A4197511J427340K504675L882677N336024O638389P419540P083277O316906
$$ 14197511 15624851 18129526 22012203 27348227 33986616 41406156 48489433 54806339
18212E4806339M427530K168190l43502k379981j398876j79812J184106J864319
$$ 54806339 59233869 61402059 61058557 58678576 57279700 57099888 58283994 60148313
18204F0148313O66883j789670m993426q185435q206236p300105n417704l697373
$$ 60148313 60815196 59025526 54032100 45846665 37640429 30340324 24922620 21225247
18196B1225247k599851j928575j491606j133962q62951o97305n59142n67454m43333
$$ 21225247 18625396 16696821 15205215 14071253 13208302 12510997 11951855 11384401 10941068
18187A0941068m85792m44908m00528l24804k47071k83886k12744k38683k70292
$$ 10941068 10455276 10010368 9609840 9285036 9037965 8754079 8541335 8302652 8032360
18178H032360k18727k58359k61683k62390j54872j43392j26742l8953j4787J9214
$$ 8032360 7813633 7555274 7293591 7031201 6876329 6732937 6606195 6567242 6552455 6571669
18168F571669l1837l5429q2167j47266j90806k05365j65699k16557p7362p2464
$$ 6571669 6539832 6504403 6422236 6274970 6084164 5878799 5713100 5496543 5419181 5346717
18158E346717k8834q5114j68949j60990j76802j50112j04211k08861j44196p7537
$$ 5346717 5317883 5232769 5063820 4902830 4726028 4575916 4471705 4262844 4118648 4041111
18148D041111o9059j09510j54119j85516r0991m5514j22436J0113q4671r459K8068
$$ 4041111 3972052 3862542 3708423 3522907 3431916 3386402 3263966 3274079 3189408 3179949 3208017
18137C208017q0361j18072j49603m2197Q8628O3372R8413K502L7598N2849J68544
$$ 3208017 3127656 3009584 2859981 2817784 2906412 2969784 3068197 3070699 3108297 3161146 3329690
18126C329690R0915K35564K29747K00855J22378K74579N74746P25888R62756J513815
$$ 3329690 3420605 3656169 3885916 4086771 4209149 4483728 5058474 5784362 6747118 8260933
18116H260933K471887M243484P784630J2405917J3644717R628069Q401623R213095
$$ 8260933 10732820 14976304 22760934 35166851 48811568 58439637 66841260 76054355
18108G6054355O993912o523262k3196503j7183862r529943n852237m006778k620352
$$ 76054355 83048267 76525005 53328502 36144640 26614697 20762460 16755682 14135330
18100A4135330j602190j102558r28319q56801p46078n86429m14218m13520m77465
$$ 14135330 12533140 11430582 10502263 9645462 8899384 8312955 7898737 7485217 7007752
18091G007752m82911m38478l41278k41799j46150j58249o7866j51272k49543j82981
$$ 7007752 6524841 6086363 5745085 5503286 5357136 5198887 5131021 4979749 4730206 4547225
18081D547225j40808j68745q9718j97037j72079j54346j93220j05229n7831j06648
$$ 4547225 4406417 4237672 4147954 3950917 3778838 3624492 3431272 3326043 3268212 3161564
18071C161564k9615n2493m6836K2697m7552o3063r4211o0478P9775M8127o0188
$$ 3161564 3131949 3079456 3032620 3055317 3007765 2944702 2850491 2790013 2869788 2917915 2857727
18060B857727R4788J7961l1356n9300l9160j95940q0658L101o6567j14687n0305
$$ 2857727 2952515 2970476 2939120 2879820 2840660 2644720 2564062 2567163 2500596 2385909 2335604
18049B335604L4515M2448O8306M6941J4127N1076N6709p4905j19469j39084j43604
$$ 2335604 2370119 2412567 2480873 2527814 2541941 2593017 2649726 2574821 2455352 2316268 2172664
18038B172664r9141n315j19271r8816j07809p9570J7811N8669o4599j21195k6549
$$ 2172664 2073523 2068208 1948937 1850121 1742312 1662742 1680553 1739222 1674623 1553428 1526879
18027A526879o6176n5499n6201m672J4160p2210q1123q2126l849J08371M141q2599
$$ 1526879 1460703 1405204 1349003 1344331 1358491 1286281 1205158 1123032 1119183 1227554 1231695 1149096
18015A149096r005O2854K5315M9517R1633J03455P6841N731q5177p3296n880l9324
$$ 1149096 1140091 1202945 1228260 1277777 1369410 1472865 1549706 1555437 1470260 1396964 1391084 1351760
18003A351760k2620j1211l5000K0698O5277N4127O3675O1103J6609j684L770Q6034
$$ 1351760 1329140 1317929 1282929 1303627 1368904 1423031 1486706 1547809 1564418 1562734 1566504 1652538
17991A652538J51110J08036P8833O4560P5011j0980o5311j33953l3569n2851P9265
$$ 1652538 1803648 1911684 1990517 2055077 2130088 2119108 2053797 1919844 1886275 1833424 1912689
17980A912689j8336k2709K2455J8881K5569r1849m5092j0274l1349o1972p3653
$$ 1912689 1894353 1871644 1894099 1912980 1938549 1846700 1801608 1791334 1759985 1698013 1624360
17969A624360l6152o0830j23797r6082l8229n8997q9345R178Q0760P0807J11299
$$ 1624360 1588208 1527378 1403581 1307499 1269270 1210273 1120928 1130106 1210866 1281673 1392972
17958A392972m8779O026K4593k994K6020N5546R8048N958j9631O0030J04446J85052
$$ 1392972 1344193 1350219 1374812 1371818 1397838 1453384 1551432 1557390 1537759 1597789 1702235 1887287
17946A887287K64314J56064J35493J11474J43241K43172J84393Q1008O5096N7232
$$ 1887287 2151601 2307665 2443158 2554632 2697873 2941045 3125438 3206446 3271542 3328774
17936C328774J33197Q1069J36539J58580J86681K24819K62032K46131L85226N13385
$$ 3328774 3461971 3543040 3679579 3838159 4024840 4249659 4511691 4757822 5143048 5656433
17926E656433N52521O55930J036011J556108K285787L370479M499352N819280
$$ 5656433 6208954 6864884 7900895 9457003 11742790 15113269 19612621 25431901
17918B5431901P214487P926377P688852P301940O689764M781552J943441P56968
$$ 25431901 32646388 40572765 48261617 55563557 62253321 67034873 68978314 69735282
17910F9735282Q92480o06261J0901K974463M453678M054345M143668M083578J725632
$$ 69735282 70627762 70021501 70032402 73006865 77460543 81514888 85658556 89742134 91467766
17901I1467766k812013n620779o683804r642383j0458797q882010p594892o759638
$$ 91467766 88655753 83034974 76351170 66708787 56249990 47367980 39773088 33013450
17893C3013450m983892l391777k413942j765877j254331j017822q84256q01785
$$ 33013450 28029558 24637781 22223839 20457962 19203631 18185809 17301553 16499768
17885A6499768o09489n04511l97874k28005k01124p8964k7822N4955J43710K82432
$$ 16499768 15890279 15385768 14987894 14759889 14558765 14479801 14451979 14506934 14650644 14933076
17875A4933076N35579J092041J702553K452866L423437M574845N784236O385919
$$ 14933076 15468655 16560696 18263249 20716115 24139552 28714397 34498633 40884552
17867D0884552O249429N818327N170517L571964J128459j41757j98118j549258
$$ 40884552 47133981 52952308 58122825 61694789 62823248 62681491 62483373 60934115
17859F0934115r57634J426530K422908K385367K617659K475313P66656k356123
$$ 60934115 59976481 61403011 63825919 66211286 68828945 71304258 72070914 69714791
17851F9714791m216686n255719p442245p595234o367987n540464m812342l296001
$$ 69714791 65498105 60242386 52800141 45204907 38836920 33296456 28484114 25188113
17843B5188113j990750j149385l70148K87217J107080K330658L564909M669762
$$ 25188113 23197363 22047978 21677830 21965047 23072127 25402785 28967694 33637456
17835C3637456N886462O296885N454233M097582K038202L56556l021191n015407
$$ 33637456 39523918 45820803 51275036 55372618 57410820 57767376 54746185 49730778
17827D9730778l742846k897292j385075R30285K252346K222578J395766j4302
$$ 49730778 45987932 43090640 41705565 42635850 44888196 47110774 48506540 48492238
17819D8492238j405406m022580n536700n072735m961407m141630k834097j935279
$$ 48492238 47086832 43064252 37527552 32454817 27493410 23351780 20517683 18582404
17811A8582404j391897j011036p73332p19594n22101l77346m74114l00699k27771
$$ 18582404 17190507 16179471 15406139 14686545 14164444 13787098 13312984 13012285 12784514
17802A2784514j98185j88746m727N0348K3251J81737N03781P23571J059837J570970
$$ 12784514 12586329 12397583 12392856 12443204 12466455 12648192 13151973 13875544 14935381 16506351
17792A6506351K322866L391838M612742O294953Q007932Q636659Q729465Q192710
$$ 16506351 18829217 22221055 26833797 33128750 41136682 49773341 58502806 66695516
17784F6695516O985238M563647N45273j257071j854812l810750l759419r95232
$$ 66695516 73680754 78244401 78789674 77532603 75677791 71867041 68107622 67112390
17776F7112390L24131J262784K230505K239045O01707k593848m312333n427670
$$ 67112390 67436521 68699305 70929810 73168855 73770562 71176714 66864381 61436711
17768F1436711p925265q381713o819481o012252m854897l366702k370087j725937
$$ 61436711 53511446 45129733 38310252 32298000 27443103 24076401 21706314 19980377
17760A9980377j291003j005774p11796o64812n67670n33675n27828l90953l30457
$$ 19980377 18689374 17683600 16971804 16306992 15739322 15205647 14677819 14286866 13956409
17751A3956409l19316l71030k51310k01252r1631Q62J32385L82031Q28851J501738
$$ 13956409 13637093 13266063 13014753 12813501 12721870 12722732 12855117 13237148 14065999 15567737
17741A5567737K310778L094960L818117M594913M492322L872503K658347J181071
$$ 15567737 17878515 20973475 24791592 29386505 33878827 37751330 40409677 41590748
17733D1590748k27202k841838l167127k189716j460047J34306J483121K132012
$$ 41590748 41363546 38521708 35354581 33164865 31704818 31839124 33322245 35454257
17725C5454257J774852Q76262k83943j645707l982440m482684m072581l809059
$$ 35454257 37229109 38105371 37821428 36175721 32193281 27710597 23638016 19828957
17717A9828957l064768k235578j517521j060501q25095p31745n43936n22700n30956
$$ 19828957 16764189 14528611 13011090 11950589 11125494 10393749 9849813 9327113 8796157
17708H796157m40890l71423l06073k83025k64274k12388j82687j02885j36889
$$ 8796157 8355267 7983844 7677771 7394746 7130472 6918084 6735397 6632512 6495623
17699F495623k54829j98190j84511j97797j63203j25109k6646q5940j32689R853
$$ 6495623 6240794 6042604 5858093 5660296 5497093 5371984 5345338 5259398 5126709 5136562
17689E136562p7866p0522p0718m1555k7588j8604n8281j07411k28295j37698j26521
$$ 5136562 5058696 4988174 4917456 4875901 4848313 4829709 4771428 4664017 4435722 4298024 4171503
17678D171503j41542J3101p9556n6987o7611o1539k9031q7234l6153j07564j53852
$$ 4171503 4029961 4043062 3963506 3906519 3838908 3777369 3748338 3661104 3624951 3517387 3363535
17667C363535j00475j75714j60050p4179r5796o1048n8708j54840j16892j35967
$$ 3363535 3263060 3087346 2927296 2853117 2757321 2696273 2637565 2482725 2365833 2229866
17657B229866r4996j19500q0350l1266J26427k5464j09400j0827r5931j41626
$$ 2229866 2134870 2015370 1935020 1903754 2030181 2004717 1895317 1884490 1788559 1646933
17647A646933j3706P503O3163R868p6095j6985m3237K4007P4370K6892O1953O9867
$$ 1646933 1633227 1640730 1703893 1713761 1637666 1620681 1577444 1601451 1675821 1702713 1764666 1834533
17635A834533N0646r863q7945q9761q4663Q483m3888Q320P8721k9038J6858r5284
$$ 1834533 1885179 1875316 1787371 1697610 1612947 1621430 1577542 1585862 1664583 1635545 1652403 1557119
17623A557119j35993m6236l4844l0934n4873j06085p4192j21018j7888K752n934
$$ 1557119 1421126 1374890 1340046 1309112 1254239 1148154 1073962 952944 935056 937808 931874
17612I31874j9885r7789J8114r5291j313N8705P8293K5343j20887j49438o6544
$$ 931874 911989 814200 832314 737023 735710 794415 872708 898051 777164 627726 561182
17601E61182j237n0546Q9167O2638p150K37N5443M3444J8853j42091o1127k023
$$ 561182 559945 509399 598566 661204 654054 654291 709734 753178 772031 629940 568813 566790
17589E66790k6646M546L1262l3168p7190Q1783J4793j02082k1404J2305M8794
$$ 566790 540144 544690 575952 542784 465594 547377 562170 460088 438684 450989 499783
17578D99783l4087K132K4675J0027o434J8794p9477j18576L0812p5073p382N7230
$$ 499783 465696 467828 492503 502530 496096 514890 435413 316837 347649 272576 265194 322424
17566C22424k8206n5104n1476l3634L1326L7844K1031o259O2191Q5120o9419k3311
$$ 322424 294218 239114 187638 154004 185330 223174 244205 237946 300137 385257 315838 292527
17554B92527J0360p7587l2811K7890P2593M7104r1689j16119m2107M0713R7612
$$ 292527 302887 225300 192489 220379 292972 340076 248387 132268 90161 130874 228486
17543B28486Q674k6009l6401M0265j0709P538M1386r7112l0369K0757Q507k1686
$$ 228486 237160 211151 174750 215015 204306 211844 253230 156118 125749 146506 155013 133327
17531A33327k7298N0703M3575J3570J2267o68l1690K3667N7L2763r6262l4360
$$ 133327 106029 156732 200307 213877 226144 225476 193786 217453 217510 250273 154011 119651
17519A19651m5209M5214j1772l5183J5961M6909K9783p4283L1794O4071k7688
$$ 119651 74442 119656 107884 72701 88662 135571 165354 91071 122865 186936 159248
17508A59248j9421M5899J9249o7288l1537M8208l5595m5568P0175N2164N147J752
$$ 159248 139827 185726 204975 137687 106150 154358 118763 73195 143370 195534 200681 202433
17496B02433P016l6259j9119K2503L4298Q328j03813r8585k3407k0096j7314L9734
$$ 202433 209449 173190 154071 176574 210872 219200 115387 16802 -6605 -26701 -44015 -4281
17484d281O386J13348O6879r4673M1850P6012m1618K5809L5234j4288j22142n8715
$$ -4281 2105 115453 182332 87659 129509 205521 163903 189712 224946 210658 88516 29801
17472B9801J4686k1947J5347K9805J3531j9871N354J9507N1482k5753J5502k1372
$$ 29801 44487 22540 37887 67692 81223 61352 66706 86213 137695 111942 127444 106072
17460A06072p8550M8700O3452p8545J3974M0139J2882O3915L4417J3303J7353
$$ 106072 27522 76222 139674 61129 75103 115242 128124 192039 226456 239759 257112
17449B57112K0531P1184O1915n3050L0218O0409Q0728J18219P0077j54225r2933
$$ 257112 277643 348827 410742 357692 387910 448319 529047 647266 717343 563118 470185
17438D70185j00001l1875j1246j63329p0579m694M165N0577N4863m839j8685p7003
$$ 470185 370184 338309 327063 163734 93155 88461 92626 143203 198066 193227 174542 97539
17426I7539M2612o106l1596j8676j398k8670k2458j2982l794o645M1358J2081
$$ 97539 140151 134045 102449 83773 82375 53705 31247 18265 14471 7826 49184 61265
17414F1265l7042o2716l8869n649P8601L2243M0387M8848O0868R6057R0724Q3756
$$ 61265 24223 -38493 -77362 -83011 -4410 27833 68220 117068 177936 273993 364717 448473
17402D48473O3636L8075o1211k5880Q4075P0109L6518m5984l5030o5661K0080
$$ 448473 512109 550184 488973 463093 547168 617277 653795 607811 572781 507120 527200
17391E27200P1532m6621N7297J9973k6034k7369p0782p2553j34941r2179Q992
$$ 527200 598732 552111 609408 629381 603347 575978 505196 432643 297702 205523 214515
17380B14515J7819r2774j00929j1796L3722j1139R0388R6081m2744m7970l1269
$$ 214515 232334 139560 38631 26835 60557 49418 139806 235887 193143 145173 113904
17369A13904p6979M4602K379L0214M3523l7514J7697O9570J21292M6671q7026
$$ 113904 36925 81527 83906 114120 157643 120129 137826 207396 328688 375359 288333
17358B88333M3228J16095K2397K0824K620l2088M5828O5953K9862n7102k7910
$$ 288333 331561 447656 470053 490877 493497 461409 507237 573190 603052 545950 518040
17347E18040L5908O3790m1262o5927L4981J949J6638L920r1009r5389q4306k9588
$$ 518040 553948 617738 576476 510549 545530 547479 564117 568037 477028 381639 297333 267745
17335B67745m1348j11730l3495j4451N2474Q489K0939m2848K6385O6464R093m0896
$$ 267745 226397 114667 81172 66721 119195 127684 148623 105775 132160 198624 207717 166821
17323A66821o8751L5099l3909P103O0755K693N5232j8746n5496j5121M6048J25241
$$ 166821 98070 133169 99260 106363 167118 169811 225043 206297 150801 135680 181728 306969
17311C06969l367j5717o6418l8099K9407J9131q9903N2517N9186n8581j1561P139
$$ 306969 303602 287885 221467 183368 212775 231906 142003 194520 253706 195125 183564 190703
17299A90703J3216k4459p0890K248M0955N9048m5944o6211m2152m1484M1455O222
$$ 190703 203919 179460 108570 110818 151773 210821 164877 98666 56514 15030 56485 62707
17287F2707L1973P7496k5912k3116P0362L7944j6852o7562o789N2092j203o0095
$$ 62707 94680 172176 146264 123148 193510 231454 214602 147040 140251 192343 191140 131045
17275A31045k789M5256P9874K2966r0883j9540O3860J9551P5115L2320k5958j7178
$$ 131045 128256 173512 253386 276352 185469 165929 229789 249340 324455 356775 330817 313639
17263C13639j2697j8320J3981l2577j0767Q4313k076o2633k5031P9209j0016K1928
$$ 313639 300942 282622 296603 264026 253259 337572 335496 272863 247832 327041 317025 338953
17251C38953j2148j16865p8213n745O6365j3850j78852j1225l1746K3067j5775
$$ 338953 326805 209940 131727 125982 192347 178497 -355 -11580 -43326 -20259 -36034
17240c6034n3378k1120P6053O9617L705l2443k0021m2685L8569j345l5193O5500
$$ -36034 -89412 -110532 -34479 35138 38843 6400 -13621 -56306 -17737 -19082 -54275 11225
17228A1225o034L1003O703j3787L8294l7385j124R7487l435M7598Q7892k9200
$$ 11225 5191 36194 42897 29110 67404 30019 28895 126382 122947 170545 258437 229237
17216B29237Q765L7061o8597q6678k6389J4212Q5213L1747L2379m6171J3279m1499
$$ 229237 238002 275063 206466 119788 93399 107611 192824 224571 256950 210779 224058 182559
17204A82559j15732l6777L5418j5749K9105O4935n4507l8142l5140K5060R8992
$$ 182559 66827 30050 65468 49719 78824 143759 89252 51110 15970 41030 140022
17193A40022N3656j03063n8475j8526j00939n6601N0204J12755L8165j206P6914
$$ 140022 193678 90615 32140 13614 -87325 -143926 -93722 19033 57198 55992 132906
17182A32906O9490k893l7051p8295J7919J2983j00094p5314O163L1160O1653K8922
$$ 132906 202396 199503 162452 84157 102076 115059 14965 -60349 -54186 -23026 38627 67549
17170F7549l2908l1749k9148o3657p4656K7418R7572K6206n5181J8602J3475n1376
$$ 67549 34641 2892 -26256 -89913 -164569 -137151 -39579 -13373 -68554 -49952 -36477 -87853
17158h7853M7448M2210k5677p253o35P988p1674q6522o342J8314O2407J3291m8864
$$ -87853 -40405 1805 -23872 -31125 -31760 -23772 -95446 -181968 -188310 -169996 -107589 -94298 -143162
17145a43162l6822K8600m3807q580J15480N6528j9931l2508M1423Q424N3998M2856
$$ -143162 -179984 -151384 -195191 -203771 -88291 -31763 -51694 -84202 -42779 -34355 19643 62499
17133F2499L3100k6257m3561o9033J0682L717p0546N8644M5711j9715j2462J9297
$$ 62499 95599 69342 25781 -43252 -32570 -28853 -99399 -40755 4956 -14759 -27221 -7924
17121g924J9485K7226L2630j5382j23014J9216P1911O8191L1966l4110l6660J8844
$$ -7924 11561 38787 71417 56035 -66979 -47763 24148 92339 124305 90195 53535 72379
17109G2379l611O122O142k9751n5619N7268n8527q8320q939J12001J03561P1870
$$ 72379 68768 74890 81032 51281 -4338 52930 -5597 -93917 -102856 9145 112706 184576
17097A84576n9062l8466j8238k4621L2571m9153k5071K5565J2359m4230m108K200
$$ 184576 125514 87048 68810 44189 76760 27607 2536 28101 40460 -3770 -7878 -5678
17085e678R8050M807r50J8678j2551o3949J7943L0080j0755j0408R869k0634p27
$$ -5678 92372 97179 96229 114907 102356 38407 56350 86430 75675 65267 75136 54502 53775
17072E3775n8255k0983q933o9139m8891K0796k1076O4104J0111k151K1041q2665
$$ 53775 -4480 -25463 -34396 -103535 -152426 -131630 -152706 -88602 -78491 -80642 -59601 -142266
17060a42266R295k7784K0186O1530q3518L7329L8178J936k1621O3263M053P3730
$$ -142266 -132971 -160755 -140569 -79039 -162557 -125228 -87050 -85114 -106735 -43472 -39419 34311
17048C4311M1175N9341l4039j31984J9295N1047j9944o1100J8346O262n5615p4119
$$ 34311 75486 134827 100788 -31196 -11901 39146 19202 -41898 -23552 -17290 -72905 -147024
17036a47024K9039Q2913p0276m1360K1594M8180L8535m3871J7682j1038L9506
$$ -147024 -117985 -35072 -105348 -146708 -125114 -76934 -38399 -82270 -64588 -75626 -36120
17025c6120R8180M264n6539n0108j2489L8523J3844j730K9658j3890n7256p686
$$ -36120 62060 66324 9785 -40323 -52812 -14289 -445 -2175 27483 13593 -43663 -51349
17013e1349K6437m2548l604O7953R4573p816l8834M5650L1502l6095q2662m3859
$$ -51349 -24912 -67460 -71064 -3111 91462 83646 44812 90462 121964 85869 3207 -40652
17001d0652K3104k215o4965k9518M3146j8047J5752p045m6874L1401J37709M8299
$$ -40652 -17548 -19763 -84728 -114246 -71100 -89147 -73395 -80440 -127314 -95913 41796 90095
16989I0095n3977o3187k4814O042k7834j8747K2131m5543m6980J1088Q7690K9969
$$ 90095 36118 -27069 -51883 -45841 -73675 -92422 -70291 -115834 -162814 -151726 -64036 -34067
16977c4067m4870K4758J6299L5725j29860R564L7994m2298M5997k8261q691L350
$$ -34067 -78937 -54179 -37880 -2155 -132015 -122451 -84457 -126755 -80758 -109019 -117710 -114360
16965a14360O3626L5586k4881J7200J7800n1536m5964j9363L3262K2107L1755
$$ -114360 -50734 -15148 -40029 -22829 -5029 -56565 -102529 -121892 -88630 -66523 -34768
16954c4768N3026L5532p9477k9224J0792N7952P2162N843j8053j24520p159L4295
$$ -34768 18258 53790 -25687 -54911 -44119 13833 85995 91838 73785 -50735 -57894 -23599
16942b3599N7509R484l6426j8371j4543K2873l5505l3210J4704O8736N397q101
$$ -23599 33910 43394 6968 -11403 -25946 -3073 -38578 -71788 -57084 11652 17049 8948
16930H948k8581J2765k7357J7935K2097j4092o4969p9862j4593M7447j2126n4238
$$ 8948 -19633 -6868 -34225 -16290 5807 -8285 -73254 -153116 -167709 -120262 -132388 -186626
16918a86626K6482m17L6316K8226O964K8594K2110l4705r4744m3148R3284N1067
$$ -186626 -160144 -160561 -124245 -96019 -89055 -60461 -38351 -73056 -167800 -210948 -117664 -66597
16906f6597O614M2406J2566J8455N6619p3248r1844K5679N4184j0354O633J451
$$ -66597 -59983 -17577 -5011 13444 70063 -3185 -95029 -69350 -15166 -25520 -18887 -17436
16894a7436P6235P6449j65088q5086L5157o564l5258l0811J7094J0927k8991j5614
$$ -17436 58799 135248 -29840 -114926 -79769 -86333 -121591 -152402 -135308 -124381 -153372 -168986
16882a68986j7288K8359m01O8848K2795L4833o1196j07179l2120J23640O1641
$$ -168986 -186274 -157915 -158316 -89468 -66673 -31840 -93036 -200215 -232335 -108695 -47054
16871d7054J3893n1656q8898O491P11K7652N6605J7277o2656m6556J1213n3487
$$ -47054 -33161 -84817 -173715 -167224 -166513 -138861 -82256 -64979 -127635 -174191 -162978 -216465
16859b16465q100Q4847R4711N3923P8833j03175r4830m8303L6271J12324M7999
$$ -216465 -224565 -139718 -45007 8916 87749 -15426 -110256 -158559 -122288 -9964 38035
16848C8035j60163o1838J10094O4066P4850J8761p5573r9751K5973L1851M9327
$$ 38035 -122128 -183966 -73872 -9806 65044 83805 8232 -91519 -65546 -33695 15632
16837A5632n5963m2223J03176j4595o756J4467n5709j6653j1641J03764r25m6029
$$ 15632 -40331 -82554 20622 6027 -729 13738 -41971 -58624 -70265 33499 32574 -13455
16825a3455l5018k6915L2138P8793o0086m3150k9017K4986J29477L4718n8717
$$ -13455 -48473 -75388 -43250 35543 -24543 -67693 -96710 -71724 57753 92471 33754
16814C3754q6183q0319M3084L8034L2335j5394j3752J1598M4766J3225Q7178O2567
$$ 33754 -52429 -132748 -89664 -51630 -19295 -34689 -48441 -36843 7923 21148 108326 170893
16802A70893J6139k6368p3890r7204m3697K2973o3770L754J4100M3660Q0077j5232
$$ 170893 187032 160664 86774 -10430 -54127 -31154 -94924 -91170 -77070 -33410 46667 31435
16790C1435p0553q2209O1333o494n7474K8606L6483O6453N840r3133k9972M8975
$$ 31435 -39118 -121327 -59994 -66488 -123962 -95356 -58873 7580 13420 -79713 -109685 -60710
16778f0710L0386N7536l6687J1076j523k784M3240j9164J2019l6511k3595L758
$$ -60710 -30324 27212 -9475 1601 78 -2706 40534 21370 33389 -3122 -26717 -22959
16766b2959m8883o9610J0365M0403k9663K3068N7126n8547M1612K5679l7345j9602
$$ -22959 -71842 -141452 -131087 -90684 -120347 -97279 -40153 -98700 -57088 -31409 -68754 -88356
16754h8356j3219O4275Q5845l9721l4209p0560N677O5596n0710n5742m5989j2273
$$ -88356 -101575 -37300 48545 8824 -25385 -95945 -90268 -24672 -75382 -131124 -177113 -189386
16742a89386K2957P7996K4415n9646k2795O3093k8612M276J4624m2449J7317K3470
$$ -189386 -166429 -88433 -64018 -123664 -146459 -83366 -111978 -107702 -93078 -135527 -118210 -94740
16730i4740L7248J4145K6705R251n0659j5873j7537M9673P6659j3706o3344K2940
$$ -94740 -57492 -43347 -16642 -7391 -58050 -73923 -91460 -41787 34872 21166 -42178 -19238
16718a9238j620k9533L1462j5630M2715L3875m0240K9372j9294n1429l076o9656
$$ -19238 -20858 -50391 -18929 -34559 8156 42031 1791 31163 11869 -39560 -42636 -112292
16706a12292j2554J1219l2249K7774L2666k1699M620J1756M9691n0255m1828Q2586
$$ -112292 -124846 -113627 -145876 -118102 -85436 -107135 -102515 -90759 -41068 -91323 -133151 -50565
16694e0565M6840M3692q3790J4588M4094l4001j9242J3984p663L408j3543J962
$$ -50565 -3725 39967 -43823 -29235 14859 -19142 -38384 -24400 -32063 -28655 -42198 -40236
16682d0236r5043j7550L4350M5289K0429Q246k538L2757m4511R080Q2798M0405
$$ -40236 -135279 -152829 -118479 -73190 -52761 -44515 -47053 -14296 -58807 -49727 33071 73476
16670G3476q0533k5609L2172K6328K2616J43997K3411m9279j27305p2930K9601
$$ 73476 -7057 -32666 -494 25834 48450 192447 215858 166579 39274 -33656 -4055
16659d055K5119R897l7003p2983O7348k6553q0256J2888l1949K5402O5474O8433
$$ -4055 21064 30961 -6042 -79025 -11677 -38230 -118486 -105598 -137547 -112145 -46671 21762
16647B1762k1663j23398q2548L2391l6164Q7878N7517m2369m0831k7013L3369
$$ 21762 99 -123299 -205847 -173456 -209620 -121742 -64225 -106594 -147425 -174438 -141069
16636a41069J2389N5931k6739M4716P2940k9520K6510K9267m3209r3816k4861
$$ -141069 -128680 -72749 -99488 -54772 18168 -11352 15158 44425 1216 -92600 -117461
16625a17461l6231l702K272P0344o456K635j6104l6224M8660K9292m055Q2463
$$ -117461 -153692 -157394 -155122 -84778 -91234 -88599 -104703 -140927 -92267 -62975 -67030 15433
16613A5433L7080o8961M2339l2982J142j3827J2829l3565N6053N1448o0056j04213
$$ 15433 52513 -16448 25891 -7091 -5949 -19776 -6947 -40512 15541 66989 6933 -97280
16601i7280m1836N2189m3446q9090O4575Q3115Q0979j9147K4242o728K4612L1035
$$ -97280 -139116 -86927 -130373 -219463 -154888 -71773 9206 -9941 14301 7573 32185 63220
16589F3220o4277n772n6706J07696J16912J404j25345m4651J1787l7250J1187
$$ 63220 -1057 -6829 -63535 44161 161073 162477 37132 -7519 4268 -32982 -21795
16578b1795J8564M4319j2424j6062L8693k0616M4250j33346l6202p9136p669R4752
$$ -21795 -3231 41088 28664 12602 51295 30679 74929 -58417 -94619 -173755 -181424 -86672
16566h6672R6184N6933O0906l6971k3534q8505o7076O5750J42138m8687n8588
$$ -86672 9512 66445 127351 90380 66846 -21659 -88735 -22985 119153 70466 11878
16555A1878L3183L319o986j22711r6613R5984K3669R435J8691L365K29k022J2460
$$ 11878 45061 48380 41394 -81317 -177930 -81946 -58277 -48842 -30151 -26786 -26557 -28579 -16119
16542a6119M6818q5018n4020N1169L2920L1193j0440q7217k1501J64167M8465
$$ -16119 30699 -54319 -108339 -57170 -24250 6943 -3497 -90714 -112215 51952 100417
16531A00417L150p087p5160q8784n7725J3310J09930r187Q6557J7560m478r2108
$$ 100417 103567 96480 21320 -67464 -125189 -111879 -1949 -11136 75421 92981 88503 -3605
16519c605o8254l4739J4796M454J6883L9518O665K3790M683o4595j3912n1049
$$ -3605 -71859 -106598 -91802 -87348 -70465 -30947 -24282 -492 4191 -60404 -74316 -125365
16507a25365o1651N8395J13231O359j1226O785n661J501n9922J8421m5837m233
$$ -125365 -187016 -128621 -15390 -9031 -20257 -13472 -19133 -17632 -77554 -59133 -104970 -109203
16495a09203N7128O5969N6045p2115j8698M2897K1054q1003k2900J298L2110m1105
$$ -109203 -52075 13894 69939 -2176 -20874 22023 43077 -37926 -60826 -59528 -27418 -68523
16483f8523o28P3193P784Q8995n7010j32853M8192M4218k9817m6150o978j18042
$$ -68523 -69151 4042 11826 100821 43811 -89042 -40850 3368 -26449 -72599 -79577 -197619
16471a97619k0782J94970R8351q946k0298m6981k2357k764K9676L5738K2412l289
$$ -197619 -218401 -23431 74920 65974 45676 -1305 -23662 -26426 3250 38988 61400 58111
16459E8111l2673L5546m933R867l0293n8903k8049L1594J9147K1598K8759M0964
$$ 58111 25438 60984 56051 65918 35625 -23278 -51327 -19733 -586 21012 49771 90735
16447I0735r6803l1918L7249M6875l6389M1901j2542n5563j1089j9605l1495k7026
$$ 90735 -6068 -37986 -737 46138 9749 51650 39108 -16455 -27544 -47149 -78644 -105670
16435a05670L2614k3362L222R3477J8965q5124l9458m3954M5987Q1332M8040K9626
$$ -105670 -73056 -96418 -93196 281 19246 -65878 -105336 -149290 -103303 -21971 26069 55695
16423E5695L704P592p5607m2116N3393J02530Q5610r2473j8362P200o0120K1504
$$ 55695 59399 66991 -8616 -50732 2661 105191 190801 98328 79966 87166 27046 48550
16411D8550o237J6919m6681r1666o5780Q6674K9843j23240K1265L381L7824M2843
$$ 48550 42313 59232 12551 -79115 -144895 -58221 -28378 -151618 -130353 -126972 -89148 -46305
16399d6305n5554J9296O9962K9407M265l6485o106R456j2068r138K5658M0359
$$ -46305 -101859 -82563 -12601 16806 21071 -15414 -21520 -12064 -24132 -33270 -7612 32747
16387C2747M9025k1803l6279m1325M5973N0054n7746j4753n1459K4924Q1142L0123
$$ 32747 81772 59969 23690 -17635 28338 78392 20646 5893 -45566 -20642 60500 90623
16375I0623P0449p4203j12067k1493m6907Q6232J32051N9725k0979p0202j01386
$$ 90623 161072 86869 -25198 -46691 -93598 -7366 124685 184410 163431 93229 -8157
16364h157p3385m3367J2266K7843m948N2436K0011L8459L9123J0973j2198J6146
$$ -8157 -81542 -124909 -112643 -84800 -89748 -37312 -17301 21158 60281 71254 59056 75202
16352G5202l6096K7003k208N8538J37755P8193m4965j43632n3064J167N8111L5977
$$ 75202 39106 66109 63901 122439 260194 338387 293422 149790 96726 97893 156004 191981
16340A91981L4256k0668k1814n4511j7804L0845l0925k7540k8229M7912k1432
$$ 191981 226237 205569 183755 129244 111440 142285 111360 83820 55591 103503 82071
16329H2071q220M9265n324j4309J77j6306N2497n0363j5038N9158J3613l5577
$$ 82071 73851 123116 117792 103483 103660 87354 139851 89488 74450 133608 147221 111644
16317A11644j2249J39070K7004n7130K190L8681P7826p5267q6139n0042k4530
$$ 111644 99395 238465 265469 208339 210529 249210 327036 251769 165630 115588 91058
16306I1058R207P5389L6062J0141R892j3772p9830j2938P5603O5149Q0707r045
$$ 91058 100265 175654 211716 221857 231749 217977 138147 125209 200812 265961 346668 337623
16294C37623p1508n6061K1638L8954N7828q5577q1426M3129n2066o8556l2730
$$ 337623 266115 210054 231692 270646 328474 242897 161471 204600 152534 83978 51248
16283E1248j6335j2896R4043P0512p7650o9674L8760R8695L9428l4024r9056j8365
$$ 51248 34913 22017 116060 186572 108922 39248 78008 176703 216131 182107 83051 64686
16271F4686J10162K046L2823M9131m3329k6426K9496k2884p2062J29464l177m9902
$$ 64686 174848 176894 209717 258848 215519 189093 218589 195705 123643 253107 249930 200028
16259B00028J4789J6336L0701L6010k3421j06041n8058k4161k0301J46809o7165
$$ 200028 214817 231153 261854 297864 274443 168402 110344 86183 65882 212691 145526
16248A45526r9268j4666Q3484j3194q7925P0105N5914J0483k917J99k7499o6396
$$ 145526 46258 31592 115076 101882 13957 84062 139976 150459 147542 147741 120242 53846
16236E3846j260L2513j440o1751N9634j9090J2156M0907q6262n0750K5424Q8607
$$ 53846 52586 85099 83659 21908 81542 62452 74608 115515 29253 -21497 3927 92534
16224I2534O8395p0239k5277m5599r074r944k527j6803M733J6840R876J4799Q1430
$$ 92534 160929 90690 65413 19814 10740 796 -1731 -18534 -13801 3039 12915 27714 109144
16211A09144O8837j8424K7775J5195j05823k3217J5632m3683o702o7540k0773
$$ 109144 177981 159557 187332 202527 96704 73487 89119 45436 38734 -28806 -49579
16200d9579O4363P410m496l87O9301P1757k2237R49n2559m2064J355k5378k9777
$$ -49579 14784 22194 17698 17311 86612 158369 136132 137081 84522 42458 43813 18435 -11342
16187a1342l216K5411O9204K4741r5019K4801K4708m357k3042l6162p7290n7601
$$ -11342 -14558 10853 80057 104798 9779 34580 59288 54931 31889 -4273 -81563 -139164
16175a39164Q5704p5641M8048J46603J06792j3105j7712o4933j46044M8532J4148
$$ -139164 -53460 -129101 -81053 65550 172342 159237 141525 76592 -69452 -20920 -6772
16164f772Q186j3819K1969N430o0248m9993m0275J3537N6817J4617K3796N7625
$$ -6772 1414 -12405 9564 14994 -45254 -95247 -135522 -121985 -65168 -50551 -26755 30870
16152C0870J9651O183k1076j7618K1452Q8022k6568j10169n86M4338Q9940N9476
$$ 30870 50521 56704 35628 18010 39462 127484 100916 -9253 -9839 34499 124439 183915
16140A83915j34679o7543k6492k18l6826K9744M2442J8532M2673P2808K5731M783
$$ 183915 49236 -18307 -44799 -45017 -81843 -52099 -9657 8875 51548 124356 150087 154870
16128A54870J8416J7717m8563q5198j2224m3081M6751l0566l1820n5040m4134
$$ 154870 173286 191003 142440 57242 45018 1937 48688 18122 -13698 -68738 -112872
16117a12872J17862M1265L625R123K3575P389j1154q091m0668N565J6104j269
$$ -112872 4990 46255 49880 59003 82578 89967 78813 70722 30054 35619 51723 50454
16105E0454j1258l2213p5099j8085N9412P5096P1899K1785R449L7294k9967n2453
$$ 50454 39196 6983 -68116 -86201 -26789 48307 120206 141991 151440 188734 158767 106314
16093A06314o4673n3340n2458K6339L4198N3412o7015K1557P8848M0917r400k270
$$ 106314 41641 -11699 -64157 -37818 -3620 49792 -17223 4334 83182 124099 114699 112429
16081A12429o7509r2057M4380l103P5466J5276m5955l8284p7216m7121N6831L6418
$$ 112429 44920 -47137 -2757 -5860 69606 84882 38927 643 -76573 -123694 -66863 -30445
16069c0445L7095M5161L588o895j7431k0585N5862K3137l1854p4522N840N4818
$$ -30445 6650 51811 55399 48504 31073 10488 66350 89487 57633 -16889 -11049 43769
16057D3769L8624n1686k2373l7335r826P7153J4068j696O324p9812j06977K7219
$$ 43769 82393 30707 8334 -29001 -38827 38326 52394 50698 57022 -22790 -129767 -102548
16045a02548L6676N2839K9198l2599l8776j0552R517J7339J3112p9290J5398M2699
$$ -102548 -65872 -13033 16165 -16434 -55210 -65762 -56245 -38906 -25794 -105084 -89686 -46987
16033d6987L1337J04225L201m2842M6814N2807N808o9073l3766K7251J8817J8530
$$ -46987 -15650 88575 91776 48934 95748 148555 154363 85290 51524 78775 97592 116122
16021A16122m9563m0714K4604L0044R426j068m2126o0941j1428L9937K5181P5420
$$ 116122 66559 25845 50449 80493 89919 88851 46725 -14216 -25644 14293 39474 114894
16009A14894o547o5168K686p2781n134j4842o811Q1906O7O533O026j0522k2840
$$ 114894 108347 43179 45865 -26916 -32050 -46892 -53703 28203 28270 34803 40829 30307 7467
15996G467l8876p2680q031L4301J15177k3168Q835n8763M7885Q7021l4594M1433
$$ 7467 -31409 -104089 -112120 -77819 37358 14190 23025 -35738 12147 99168 64574 106007
15984A06007n3404J9573J1990K2918l8339J1630J02099k0684k5365m5657l2326
$$ 106007 52603 72176 84166 107084 68745 80375 182474 161790 136425 90768 58442
15973E8442N3931l2443p7423K6219n2665j3995P4763P471p5977L6767L0019m0202
$$ 58442 112373 79930 2507 28726 -23939 -37934 36829 44300 -31677 5090 35109 -5093
15961e093n4916M1081Q992r8746K4644O1653J49876m4869j09622R436M61P0153
$$ -5093 -60009 -18928 -9936 -108682 -84038 -22385 127491 82622 -27000 -17564 -17103 53050
15949E3050J6434p6M0278n7245l5989Q5917k3375q1024j02301l6746j3134O5755
$$ 53050 69484 69408 109686 52441 16452 102369 78994 -2030 -104331 -141077 -154211 -88456
15937h8456M7507O7901j457m183j0198r9274n2589N925m8879K8966j7283Q1761
$$ -88456 -40949 26952 25495 21312 11114 -88160 -140749 -134824 -183703 -154737 -172020 -90259
15925i0259J60250L7620o4069n5229j5371q529r5958L0704N4536k5963o609L7620
$$ -90259 69991 107611 43542 -11687 -27058 -35587 -131545 -100841 -46305 -72268 -78877 -41257
15913d1257R3860K5773J9129L6976R5950M4321l2697j11090o3764L223p2572L6955
$$ -41257 52603 78376 97505 134481 230431 274752 242055 130965 67201 70424 -2148 34807
15901C4807k760K5846O7903o3181l6299m9626k6641j5329M6573P781q6261l7226
$$ 34807 32047 57893 125796 62615 26316 -23310 -49951 -65280 -18707 -10926 -97187 -134413
15889a34413n6864L2692M7913P0691O1183n1012J9928P9752j0631m4503K0112
$$ -134413 -191277 -158585 -110672 -39981 21202 -29810 -9882 69870 59239 14736 34848
15878C4848N1208L7206n9695p7983n5189m868m3682M1101m3829p3174R6102Q1820
$$ 34848 86056 123262 63567 -14416 -69605 -74473 -118155 -77054 -120883 -194057 -97955 -16135
15866a6135o0428M5287P2298J815l2947n5814J02431J576J1266L2645k3806m4126
$$ -16135 -76563 -31276 41022 42837 9890 -45924 56507 58083 69349 101994 78188 34062
15854C4062l2929m3368o1663J6073J3748N6089N5152J2464n7998k1159L4648p4829
$$ 34062 1133 -42235 -103898 -87825 -74077 -17988 37164 49628 -8370 -29529 5119 -69710
15842f9710l7103O6527p1440J9J8896J6852k3992Q1791R954j02048N9159j02K143
$$ -69710 -106813 -40286 -111726 -111707 -92811 -75959 -99951 -18160 -8206 -110254 -51095 -51197 -49054
15829d9054M3682K5362l276j8393k0697K3023j3791j16171j21853J8523k7973
$$ -49054 -5372 19990 16714 -1679 -22376 647 -13144 -129315 -251168 -232645 -260618
15818b60618k3435J59602J11817O4113m885M2373P0147j36638l9898J41389M1957
$$ -260618 -284053 -124451 -12634 51479 46594 88967 159114 22476 -17422 123967 165924
15807A65924j34227j8699M1542J226K2549R5241M7793p0293m0331n994m8336O054
$$ 165924 31697 12998 54540 55766 78315 173556 221349 151056 110725 104731 56395 62449
15795F2449j604L9633j8331r3930m7989J4800L6506j0951Q8979O0113o9090k7750
$$ 62449 60845 100478 82147 -11783 -59772 -44972 -8466 -19417 69562 129675 60585 32835
15783C2835L8839k9392j7754l6107j26483J6957L1898R160O9855L3599p61J3522
$$ 32835 71674 42282 24528 -11579 -138062 -121105 -89207 -80047 -10192 23407 22646 36168
15771C6168J658J3533P4658M1277K9293l9903J8828l9104K0125o1220j9227K6512
$$ 36168 37826 51359 126017 167294 196587 156684 175512 136408 156533 95313 76086 102598
15759A02598j6844m9455m1243L7343j4923L2041j0098M2224o0337r2670K0767
$$ 102598 85754 36299 -4944 32399 17476 49517 39419 81643 21306 -71364 -50597
15748e0597R8201J8731k5234j5568K18O1157M2473o8289n2875m0272n4452O3890
$$ -50597 47604 66335 41101 25533 25751 86908 129381 61092 8217 -32055 -86507 -22617
15736b2617L5982K5949m0805m5792l191Q1147J8485j133J4017j5025J8909M035
$$ -22617 13365 39314 -1491 -47283 -50474 30673 49158 48025 62042 47017 65926 69961
15724F9961j3759O3857R5442l322N0093p6384o2189j35760K1877R364k5491j03947
$$ 69961 56202 120059 215501 212179 262272 185888 123699 -12061 9816 19180 -6311 -110258
15712a10258P90J9212O6544M3681k2348M4789J8406J2880j9935j2321p9537K2616
$$ -110258 -109468 -90256 -23712 19969 -2379 42410 60816 73696 53761 41440 -38097 -15481
15700a5481K8940J4364j04871M7841P1858L2250j1374o3074o0981L1633N4412
$$ -15481 13459 27823 -77048 -29207 42651 74901 63527 453 -60528 -28895 25517
15689B5517J12813J3068j27813j33326m0030J07976K4053q468m875j5454k1730
$$ 25517 138330 151398 23585 -109741 -149771 -41795 -17742 -26210 -31085 -46539 -68269
15678f8269M381Q2126R9931n2029o5032R354k2772O125J5686L5144J2946m4405
$$ -68269 -63888 18238 118169 66140 1108 10462 -12310 -6185 9501 44645 57591 13186
15666A3186N4P303o5996j574N4579O2804K5446m4108J5132K686j5765P9095J02
$$ 13186 13240 20543 -45453 -47027 7552 70356 95802 51694 66826 69512 53747 132842 132944
15653A32944N5643P7625n7503j4909N6476j5502K7218Q1551Q3563N4582J83788
$$ 132944 188587 266212 208709 193800 250276 234774 261992 343543 427106 481688 665476
15642F65476K68285K67596L34828L07466K38116K25252J28328o7067o8164j62397
$$ 665476 933761 1201357 1536185 1843651 2081767 2307019 2435347 2368280 2300116 2137719
15632B137719j73763k25787k61045k36475k11506j97241p5550n4288j12871j48603
$$ 2137719 1963956 1738169 1477124 1240649 1029143 831902 756352 702064 589193 440590
15622D40590m257L5724k1002p5292M4292m9645n2870m9023K9042l2545j10440
$$ 440590 436333 472057 451055 375763 420055 370410 317540 268517 297559 265014 154574
15611A54574K7741J16102J5689q2945j14782m2623Q152o0490m4025O612Q0990
$$ 154574 182315 298417 314106 231161 116379 73756 81908 21418 -22607 -15995 64995
15600F4995J13337O1618M8925j02754l2135K4849L4460L5365K852p0806m4111
$$ 64995 178332 239950 288875 186121 153986 178835 213295 248660 251512 180706 136595
15589A36595n7956k2717L2420K0892O1575M3648N3132J5568m3347o5489l1303
$$ 136595 78639 55922 88342 109234 170809 214457 267589 283157 239810 174321 143018
15578A43018l7054l1019J4851J2925n2514L4542P5588K0694o6705j20587m0223
$$ 143018 105964 74945 89796 102721 50207 84749 160337 181031 114326 -6261 -46484
15567d6484J04960K488J5658r189L100k6223k5006M7291j1853N2909l0576N4764
$$ -46484 58476 60964 76622 67433 70533 44310 19304 66595 54742 107651 77075 131839
15555A31839J6099o5360M3890K5939j1194j9300k1790Q1082j3260j03806k2474
$$ 131839 147938 82578 126468 152407 141213 121913 100123 181205 167945 64139 41665
15544D1665M2286j8231p1802J9985K6499n8120j3304R4719J1066j09868o8741
$$ 41665 83951 65720 -6082 13903 40402 -17718 -31022 63697 74763 -35105 -103846
15533a03846R6307M8235J5502m2620k7183K4275N6052M7969M0834q5685n5739
$$ -103846 -7539 40696 56198 13578 -13605 10670 66722 114691 155525 69840 14101
15522A4101q2977o8409j9035M7377O505k3650J05841Q8552K0201j0883j1142n6494
$$ 14101 -68876 -137285 -156320 -108943 -102438 -126088 -20247 68305 88506 77623 66481 9987
15510I987m3668L0379M4102P2069M9486J6393k2121l3749O884p7977Q109K1341
$$ 9987 -33681 -3302 40800 112869 162355 178748 156627 122878 129762 51785 59894 81235
15498H1235n2636n1150N6091l2465m1440n0081o7388K1844J40689Q9326o8600
$$ 81235 28599 -22551 33540 1075 -40365 -90446 -157834 -135990 4699 94025 25425
15487B5425L6184O483k3413m0098M1687K5868j07M3250L3396J7562l4216k5560
$$ 25425 61609 68092 44679 4581 46268 72136 72029 115279 148675 166237 132021 106461
15475A06461p70m8428j6142m1087M867K1979j93R2819M738p6290J5188P9984l8542
$$ 106461 105691 57263 41121 34 4901 26880 26687 119506 124244 47954 63142 143126 104584
15462A04584q6432k6946o7300L71M1143L6519L2189J0013n4553J78R1727R5400
$$ 104584 18152 -8794 -76094 -75723 -34580 1939 34128 44141 -10412 -10234 81493 176893
15450A76893o5954J28733J50390q9379k6915L8457L5633J2080J0319M4446k528
$$ 176893 110939 239672 390062 300683 273768 312225 347858 359938 370257 414703 412175
15439D12175n1340M378j2556k9667m0985O1540l7669m2280N397n3194n684M1368
$$ 412175 360835 365213 352657 322990 282005 343545 305876 263596 268993 215799 210115 251483
15427B51483m0747n9309l0557l0724K055P5763Q1991m6457q7589k1915p5945j5280
$$ 251483 210736 151427 120870 90146 92201 167964 249955 203498 115909 93994 18049 2769
15415B769M4630J00172q750J9486k232L5886N5184K1220N1146p153J4749J0376
$$ 2769 47399 147571 138821 158307 156075 191961 247145 268365 319511 312358 327107 337483
15403C37483p247k3410j1176k3764j09800m9535k6038o9905O9804O0593J1561
$$ 337483 330236 306826 295650 271886 162086 112551 86513 16608 86412 147005 158566
15392A58566Q6733l0889k6692l1132k4283j6504j07471K4169O0600K4729K1428
$$ 158566 245299 214410 187718 156586 132303 115799 8328 32497 93097 117826 139254
15381A39254k9436K0589l966Q6123M0806L3916L1610R8107Q448n8680k811L6441
$$ 139254 109818 130407 126441 212564 253370 287286 318896 417003 425451 366771 363960 400401
15369D00401m6861O2508L3356k1620l834m4468k8231n9260K3873n9341m8643L559
$$ 400401 353540 416048 449404 427784 423950 379482 351251 291991 315864 256523 207880 211439
15357B11439m5124q780J15558J1383p154J1357n1614l8308M7401N1814n1370q5894
$$ 211439 166315 157535 273093 284476 277322 288679 237065 198757 246158 297972 246602 160708
15345A60708J455J7290K2639k5662P3348J0826q8092k2636M1464N7666J1150k4711
$$ 160708 162163 179453 202092 176430 249778 260604 172512 149876 191340 249006 260156 235445
15333B35445n184K4543J5821L4300J2342O7733j69K7607K2688J6472K1634Q1718
$$ 235445 230261 254804 270625 304925 317267 385000 384831 412438 435126 451598 473232 554950
15321E54950L7608k3070J34820R9729R0618M2612m863k651K493O4461n5981m7668
$$ 554950 592558 569488 704308 804037 894655 937267 932404 929753 932246 996707 940726 893058
15309H93058m6403k4303j3372j1274q9650q9904l5716o7010K5432o4312K4253
$$ 893058 846655 822352 808980 797706 708056 618152 582436 515426 540858 476546 500799
15298E00799J2610J9182M6865L3160r990j6544M9307O0562m0403m4816J28808
$$ 500799 513409 532591 579456 612616 602626 586082 635389 695951 655548 610732 739540
15287G39540Q1301q018L3127J09546J06863M9029N2614L3268j4070k9857m8549
$$ 739540 820841 812823 845950 955496 1062359 1111388 1164002 1197270 1183200 1153343 1104794
15276A104794L5219J5771O9872Q5259K2275p9706J7366O3394O4659J56908K27231
$$ 1104794 1140013 1155784 1225656 1310915 1333190 1253484 1270850 1334244 1398903 1555811 1783042
15265A783042L41169L48156M37156N38622O07271O45776O17990N09354L70420
$$ 1783042 2124211 2472367 2909523 3448145 4055416 4701192 5319182 5828536 6198956
15256F198956J67539N3698j37614m18577n11438o15290n41086m39608l17771k88323
$$ 6198956 6366495 6420193 6282579 5864002 5352564 4737274 4196188 3756580 3438809 3150486
15246C150486j67313j55372k45835j27875r8227l8839k4428j19927q2190n7307
$$ 3150486 2983173 2827801 2581966 2454091 2355864 2317025 2292597 2172670 2090480 2033173
15236B033173K1961J00441J05552q105J30517J75960J58685K14855J96439J77526
$$ 2033173 2055134 2155575 2261127 2253022 2383539 2559499 2718184 2933039 3129478 3307004
15226C307004K24447K76497K62725K55660K37857L09075K91033K55933K73626
$$ 3307004 3531451 3807948 4070673 4326333 4564190 4873265 5164298 5420231 5693857
15217E693857L91086N66148P66585R31177J073409J392308J801700J947741K133092
$$ 5693857 6084943 6651091 7417676 8348853 9422262 10814570 12616270 14564011 16697103
15208A6697103K448708K562139K689914K993825L562518M495908N909026Q347739
$$ 16697103 19145811 21707950 24397864 27391689 30954207 35450115 41359141 49706880
15200D9706880J2211722J7626165K4667241L2816130M1502803M9416742N4522343
$$ 49706880 61918602 79544767 104212008 137028138 178530941 227947683 282470026
15193B82470026N5568063N1296127M1085873K5750382P316160j1676863k8713498
$$ 282470026 338038089 389334216 430420089 456170471 463486631 451809768 423096270
15186D23096270m1679870m9191757n1050323m8024786m1482346l3457033k5682292
$$ 423096270 381416400 332224643 281174320 233149534 191667188 158210155 132527863
15179A32527863j8928727j3606630j0105362p961693o447657n655618n008418
$$ 132527863 113599136 99992506 89887144 81925451 75477794 69822176 64813758
15172F4813758m502869m188470l733270l252414k943189k609736k191007j831667
$$ 64813758 60310889 56122419 52389149 49136735 46193546 43583810 41392803 39561136
15164C9561136j709642j581089j411232j410690j368836j345852j169547j100200
$$ 39561136 37851494 36270405 34859173 33448483 32079647 30733795 29564248 28464048
15156B8464048j045624r99634r54999r19918r26269p69107o50133o24763p04470
$$ 28464048 27418424 26418790 25463791 24543873 23617604 22848497 22198364 21573601 20869131
15147B0869131n87390m95939m86243n88015n13811n06603n76526m88815m65970
$$ 20869131 20281741 19785802 19299559 18711544 18197733 17691130 17114604 16625789 16159819
15138A6159819n69206o18839n24078n33301m56780l88369l72334l75847l42127
$$ 16159819 15590613 14971774 14447696 13914395 13457615 13069246 12696912 12321065 11978938
15129A1978938l12508k22603l19828k77422k22003l21253l14733k63373k36822
$$ 11978938 11666430 11443827 11123999 10846577 10624574 10303321 9988588 9725215 9488393
15120I488393k81124l23022k71173k31046k22127k39428j59258j59492k62709
$$ 9488393 9207269 8884247 8613074 8382028 8159901 7920473 7761215 7601723 7339014
15111G339014k28613l83838j79368o0894k18991k16585j32963n894j07368j63219
$$ 7339014 7110401 6726563 6547195 6486301 6267310 6050725 5917762 5911868 5804500 5641281
15101E641281j46332j50197o2611m6139o4971j16197o4876j53469j41721q1638
$$ 5641281 5494949 5344752 5282141 5236002 5171031 5054834 4989958 4836489 4694768 4613130
15091D613130j63660j95114j08233M616r0687j44255r6631j7586o3087m2951j18172
$$ 4613130 4449470 4254356 4146123 4150739 4060052 3915797 3819166 3801580 3738493 3695542 3577370
15080C577370p5592j29966j56091r9490q9834o7257j00854j09192k2992O8633
$$ 3577370 3501778 3371812 3215721 3116231 3026397 2959140 2858286 2749094 2726102 2794735
15070B794735n8666j3649n8281j90984j86873r2202Q8542R0188j6471p8379p4368
$$ 2794735 2736069 2722420 2664139 2473155 2286282 2194080 2282622 2372810 2356339 2277960 2203592
15059B203592K4676J8469o357q445m4939p1181m9005j9000j09410n8725q4555
$$ 2203592 2228268 2246737 2240380 2231935 2186996 2115815 2066810 2047810 1938400 1879675 1795120
15048A795120m3082p1196K0080j3238p4975n2655j4476j63757K2524L5918K4617
$$ 1795120 1752038 1680842 1700922 1687684 1612709 1560054 1545578 1381821 1404345 1440263 1464880
15037A464880K5157R666p1430o0276l147n429p618j27275p6342J3975p5500n3045
$$ 1464880 1490037 1499703 1428273 1367997 1364850 1359421 1351803 1224528 1148186 1162161 1086661 1033616
15025A033616p2260q3207m5613j434J0040p0083q0355j01170p5857o3412K040
$$ 1033616 961356 878149 832536 831102 841142 771059 690704 589534 513677 450265 452305
15014D52305K002q5270o2272j05889J6711M0615L1112R596n2144N476P4030K9024
$$ 452305 454307 369037 306765 200876 217587 258202 289314 298910 246766 252242 326272 355296
15002C55296k3070L1003k2288J0425M2584O4031Q4788k4871k5423l1490j67947
$$ 355296 332226 363229 340941 351366 393950 457981 542769 517898 492475 460985 293038
14991B93038k1744O2434J4390o8562m903K5132l1883j0289J7631J5915M2662K3963
$$ 293038 271294 333728 348118 279556 274653 299785 267902 257613 275244 291159 333821 357784
14979C57784r1376m9114O5184N4562J8397k5485K4354L8725o8567m902M5428J1999
$$ 357784 266408 217294 282478 337040 355437 329952 354306 393031 324464 319562 364990 376989
14967C76989M4767o7850l4801k0339j2429M9689K7961l2852l7057L5331j1640
$$ 376989 421756 353906 319105 298766 286337 336026 363987 331135 294078 329409 317769
14956C17769p6272M8049K6917L2282m1114q9897j22398P1445J22434N517j405
$$ 317769 241497 289546 316463 348745 307631 217734 95336 166781 289215 294732 293327
14945B93327M3928o0740o7815n5384L2916j8708J2761O7854L3780o7939K012L1432
$$ 293327 337255 276515 208700 153316 186232 167524 180285 248139 281919 213980 215992 247424
14933B47424J04221L1584J3628J0153L2224m2725j16640l5777o2840k4683j2435
$$ 247424 351645 383229 396857 407010 439234 396509 279869 244092 181252 156569 144134
14922A44134L0723k8196O0118K8244N9295j5220M3503L3684j972J01863j8143
$$ 144134 174857 146661 206779 235023 294318 279098 322601 356285 354313 456176 438033
14911D38033l8779q9691o9083n1169M2884Q5707o296k3200n6022j6997l2101j28563
$$ 438033 399254 309563 240480 189311 232195 317902 311606 288406 232384 215387 183286 54723
14899E4723J5796m5028l4384k2291K2786O401j3639k3736Q3070J2886n172m7087
$$ 54723 70519 25491 -8893 -31184 -8398 -1997 -15636 -39372 43698 56584 51412 4325
14887D325M8668J5951J921L6150k7563K2760L8492L1289k6506k2615p695K4208
$$ 4325 52993 68944 70865 107015 79452 102212 140704 171993 145487 122872 115177 139385
14875A39385M1134M6714l186m3235r0385R419P607M2868j1621n9542L8901j6953
$$ 139385 180519 227233 224047 180812 90427 99846 107453 150321 138700 79158 118059 101106
14863A01106k8129j9219o2247O7380Q8139j7603J6902j7077k9191O420l2101j0238
$$ 101106 72977 53758 -8489 58891 147030 129427 146329 129252 100061 106481 74380 64142
14851F4142n6849J2191j184j0816l788n8073J7934O4386R020m6462l3317L8066
$$ 64142 7293 19484 18300 7484 3696 -54377 -36443 27943 36963 -9499 -42816 -4750
14839d750O496m7901m6686M1832J11103l015n4168k3586O8278K0870K5935L2634
$$ -4750 1746 -46155 -92841 -51009 60094 57079 2911 -20675 47603 68473 94408 127042
14827A27042n3102J0070O2648Q106j5501m6787r5750J3740N0210L7098L4320n1583
$$ 127042 73940 84010 146658 154764 139263 92476 -3274 10466 60676 97774 132094 80511
14815H0511M7210Q5845m7072q0097m5176n7021O633J0998l6581L4313K5846K8609
$$ 80511 127721 213566 166494 86397 41221 -15800 -9167 1831 -34750 -437 25409 54018
14803E4018J874J794j5352n0902r709k1667o114J04708M0871q4833O7462J8366
$$ 54018 55892 57686 42334 -8568 -18277 -39944 -46058 58650 99521 14688 82150 100516
14791A00516L4738Q5007J6687n4539l2275n3559r80P922J224m6534K9891K7991
$$ 100516 135254 220261 236948 182409 150134 96575 95595 103517 104741 58207 88098 116089
14779A16089M340M9907m4596m0350l0691K3047l3825m8936j0407R5138N3110p0020
$$ 116089 120429 170336 125740 85390 54699 77746 43921 -5015 -15422 79716 132826 62806
14767F2806j4170P278m4932r654Q9720k3863m5870L7765Q7403J5645O8173L0255
$$ 62806 48636 55914 10982 1328 91048 67185 21315 59080 146483 162128 230301 260556
14755B60556m5268m0739K7546M6015K7926Q7262Q2475J26923J6864L2497J46318
$$ 260556 215288 174549 202095 248110 276036 363298 445773 572696 589560 622057 768375
14744G68375J35139J92431K67066K31258K22365K22756J98793J31758J7468j13286
$$ 768375 903514 1095945 1363011 1594269 1816634 2039390 2238183 2369941 2387409 2274123
14734B274123j32378k52022l06139k52686k02969r9796j02716j71487j74845p1117
$$ 2274123 2141745 1889723 1583584 1330898 1127929 1028133 925417 753930 579085 507968
14724E07968m1525n8448n0070j53390L0381R6989L8710k8025j3476m9722q0747
$$ 507968 466443 407995 357925 204535 234916 331905 370615 342590 329114 279392 198645
14713A98645P423m0497r501N2350m5021L6765O2415P152o8250p6019L6371o7021
$$ 198645 206068 165571 156070 208420 163399 200164 262579 269731 201481 125462 161833 94812
14701I4812q1700K453r180M5308N4544O8812k2085K8879M5231m1940K9602m0277
$$ 94812 13112 15565 6385 51693 106237 175049 152964 181843 227074 185134 214736 174459
14689A74459l9550N7081J13230j1998p4445o7705q3499k4569M5038l1017k6801
$$ 174459 134909 191990 305220 293222 218777 151072 67573 43004 88042 57025 30224
14678C0224N732m8574L3497P0955J32525r307j17814j4518L3173M5435Q4521j8402
$$ 30224 35956 -12618 20879 91834 224359 215052 97238 82720 115893 161328 245849 227447
14666B27447j12891p6910k9324N0588L3090n4566q6040n0970l2367Q964M4186
$$ 227447 114556 37646 8322 58910 92000 37434 -48606 -99576 -131943 -122979 -78793
14655g8793K5392o9943o3412R5754N5157K2690M795N9560J8066l3692k4462R032
$$ -78793 -53401 -123344 -186756 -91002 -35845 -13155 -8360 51200 69266 35574 11112 20144
14643B0144j4748k8033n467J5067O7437M0743K1064J5989l0408p4542n5640k2025
$$ 20144 5396 -22637 -28104 -13037 54400 95143 116207 132196 101788 27246 -28394 -50419
14631e0419J5082L6979J9681j6707k9037m1409j6944M2897J9083K6874q8689j0991
$$ -50419 -35337 1642 21323 4616 -24421 -65830 -82774 -39877 -20794 6080 -82609 -93600
14619i3600J34642L0803k2728J5939o8016l7203Q5784R9426n473j20625r1416
$$ -93600 41042 71845 49117 65056 -2960 -40163 45621 145047 139574 18949 -72467
14608g2467l303N0948O8693J3068K2443n0587K011k7057k6454j3617N0540M1266
$$ -72467 -75770 -24822 43871 56939 79382 28795 30806 3749 -22705 -36322 14218 55484
14596E5484L615o7793k4900l1174P3745m6073L9916J6943m4626L3975J1566L0931
$$ 55484 59099 -8694 -33594 -64768 8977 -37096 2820 19763 -24863 9112 20678 51609
14584E1609q042J041L646L6695n1613l3370o873k8790n828J9807n498J2772O8708
$$ 51609 43567 44608 48254 84949 33336 -34 -6907 -35697 -41525 -21718 -27216 -14444 54264
14571E4264J2806J2215J1424l0233m854k3112l9470k7425m9846M8127L8871j7734
$$ 54264 67070 79285 90709 60476 55622 32510 -6960 -34385 -84231 -36104 2767 -14967
14559a4967K2753J0481Q2582J01697L1224j32146m7418J7727j5798p3490n2954
$$ -14967 7786 18267 100849 202546 233770 101624 54206 71933 56135 -17355 -70309
14548g0309n126p501L4918l1348P5552j2272k6347R2443J6283m8732m1515j3537
$$ -70309 -75435 -82936 -48018 -79366 -3814 -16086 -42433 50010 66293 17561 -23954 -37491
14536c7491p55j033j7384J4136J7766Q1661l3216M235o7524K3777L3187n9179
$$ -37491 -38246 -39279 -56663 -42527 -24761 56900 23684 27919 -39605 -15828 17359 -41820
14524d1820P2654j9517k9095P1556J10994Q0818q6159r7241q9810j05255m1119
$$ -41820 30834 11317 -17778 53778 164772 245590 159431 62190 -27620 -132875 -173994
14513a73994j3988L4872l5235P9003n9887J258L9898Q063K555M2922L7834Q0079
$$ -173994 -187982 -153110 -188345 -109342 -169229 -167971 -128073 -120010 -117455 -74533 -36699 43380
14501D3380j9590m6517j4490o6318L694K3527L7385k0472m273M8503j0611m7180
$$ 43380 23790 -22727 -37217 -103535 -99841 -76314 -38929 -59401 -63674 -15171 -25782 -72962
14489g2962p885k6434P423L7192k402K2289P0274M975L1427j5893q826j5447Q2246
$$ -72962 -80847 -107281 -99858 -62666 -65068 -42779 27495 32470 63897 48004 39178 23731 105977
14476A05977j1070n8412q5126p3302J1987O4476M4088J0147P2230O4853M4023
$$ 105977 94907 36495 -48631 -121933 -109946 -45470 -1382 8765 80995 145848 189871
14465A89871M8190l1340m2365o9689p9678m2506k1496l7792L8537L3960L4039
$$ 189871 238061 206721 164356 94667 14989 -27517 -49013 -86805 -48268 -14308 19731
14454A9731J5202o1878q2080L3490M651n2258N7924J5198K5734R8359J8998l0550
$$ 19731 34933 -26945 -109025 -75535 -70884 -123142 -65218 -50020 -24286 74073 93071 62521
14442F2521k1661m4932p793k615R367R2799L7851J2019o6288j08679m4208N4394
$$ 62521 40860 -4072 -11865 -14480 -5113 87686 125537 137556 71268 -37411 -81619 -27225
14430b7225P2685N6279O609j08519j1039P1009j1534l0869L3330M9749n6795m2068
$$ -27225 45460 101739 108348 -171 -11210 59799 48265 17396 50726 100475 43680 1612
14418A612Q1289r010j04099M323N7169o065O6744K8484k6686j29169K3678J9738
$$ 1612 82901 73891 -30208 -25885 31284 25219 91963 120447 93761 -35408 -11730 8008
14406H008k3274K6709K890L0171J4740R460l8450q814L7290l8683l8463n7220
$$ 8008 -15266 11443 14333 44504 59244 68704 30254 21440 58730 20047 -18416 -75636
14394g5636J2334N0270L1200n4169l6902K2443k7108N411j5621j2105r3662j9106
$$ -75636 -63302 -13032 18168 -36001 -72903 -50460 -77568 -72157 -87778 -99883 -193545 -212651
14382b12651o0215J01325K9726N6293J5683j4616M6004M6302L7577M6130l0348
$$ -212651 -272866 -171541 -141815 -85522 -69839 -84455 -38451 7851 45428 91558 61210
14371F1210K4424l8097j20056P1954J09085K9543l7066n4988r0129J27L2986J0269
$$ 61210 85634 47537 -72519 -565 108520 138063 100997 46009 -44120 -43993 -11007 -738
14359g38l8198K1327J14604j8382k0978j09432n9961L6756Q268k5100L6934j0890
$$ -738 -38936 -17609 96995 78613 57635 -51797 -111758 -75002 -66734 -91834 -54900 -65790
14347f5790k5703P1519M3524k0478k5607L7523J01562L0404n1985K5450k4649
$$ -65790 -91493 -19974 23550 3072 -22535 14988 116550 146954 94969 120419 95770
14336I5770m1169O5974K8958O3250O3238J3115n7800K4160O236j0123K7410j889
$$ 95770 54601 120575 149533 212783 276021 289136 231336 255496 261732 251609 279019 277130
14324B77130J9830m9771r5499M8717K8822j22075M4912k5370m7810n8855p166
$$ 277130 296960 247189 151690 200407 229229 107154 152066 126696 78886 20031 12865
14313A2865M2247J3112o8595j9570L166r279p2511p8155n2942O1755R1109K6981
$$ 12865 55112 68224 -371 -19941 -16775 -26054 -98565 -176720 -229662 -167907 -76798 -49817
14301d9817o6168l8031n6168l802Q8298k9901J1032J9476Q9082O5107l9372K8337
$$ -49817 -115985 -154016 -210184 -213986 -125688 -155589 -144557 -125081 -35999 29108 -10264 18073
14289A8073M8133L7646J6699n7535m5650j7564j1366O544j5082O822K202J0090
$$ 18073 66206 103852 120551 63016 17366 -198 -11564 -5020 -20102 -13280 -11078 -988
14277i88j3342q2311j459O9601k3879p060J30613J05192j8371j17881p9278O583
$$ -988 -14330 -96641 -98100 -28499 -52378 -59438 71175 176367 157996 40115 -39163 -32580
14265c2580N0440J00950p9643l9931l4029q1265K3135J9872k197k982m2090l7103
$$ -32580 17860 118810 39167 -764 -34793 -116058 -92923 -73051 -75248 -78230 -120320 -157423
14253a57423N2491m5033M651Q3293L8918L5031P90p1811L7048m8741m1328L0345
$$ -157423 -104932 -149965 -145314 -62021 -23103 11928 12718 -59093 -22045 -70786 -112114 -81769
14241h1769Q7856L7217o7102M7200M4964L436N2796j7712L5406o4606o295O5070
$$ -81769 6087 43304 -23798 23402 68366 71802 124598 106886 142292 77686 71391 136461
14229A36461J28041k0854k7014n6887J452p371L4334m7161j24763k6394k7627
$$ 136461 264502 243648 216634 159747 161199 153828 188162 141001 16238 -10156 -37783
14218c7783J3490l0570l1085p2167r397J17746J08205R252O6345N308K90M903
$$ -37783 -24293 -54863 -85948 -158115 -167512 -49766 58439 67691 134036 139344 139634 144537
14206A44537q7440p7066P097j06419j8315N2211q44K3056N9233p815m7090J06010
$$ 144537 57097 -19969 -12872 -119291 -137606 -85395 -86239 -63183 -3950 -11765 -58855 47155
14194D7155M9895m8355M167J4522p2726k5649M0727L8973k6047n4497o685Q2858
$$ 47155 97050 48695 52862 67384 -5342 -30991 9736 48709 22662 -31835 -38520 44338
14182D4338r8038o3519k5922l0226L7933N5923o0741J4607J04283J2723j3581
$$ 44338 -53700 -117219 -143141 -173367 -135434 -79511 -140252 -125645 -21362 -8639 -22220
14171b2220o6973n0967K9047k1698J5088M8204K9818O2222Q580j6533n7465m1011
$$ -22220 -89193 -140160 -111113 -132811 -117723 -69519 -39701 22521 31101 14568 -42897 -83908
14159h3908K2017l4251r435N2819o1280p7568r996N97J06680L8107O9886J3888
$$ -83908 -61891 -96142 -105577 -52758 -114038 -191606 -201602 -201005 -94325 -56218 13668 27556
14147B7556n2894k8893k5565Q12o9L6102J5018R3883L4263j4198M952o0254n5385
$$ 27556 -25338 -54231 -79796 -78984 -79053 -42951 -27933 65950 100213 86015 90967 30713 -24672
14134b4672L2815k6157n5123J4156N5290J25372o0576j39170m5937n926L3558
$$ -24672 8143 -18014 -73137 -58981 -3691 121681 61105 -78065 -124002 -129928 -96370
14123i6370K4816M852k301p727m9353N0232P4706O7671J3060o0997n5036L7000
$$ -96370 -71554 -66702 -69003 -76730 -126083 -75851 -1145 66526 79586 18589 -36447 553
14111E53Q7682l5874l6405R541J6257j0094J918N2196j5624o2546l7069N3495
$$ 553 88235 52361 15956 25497 41754 31660 33578 85774 70150 7604 -29465 24030
14099B4030j9957m9785k3539k3337J7100J3116L5773L1938j3830L9693N2898J3188
$$ 24030 4073 -45712 -69251 -92588 -75488 -62372 -26599 5339 -8491 31202 84100 97288
14087I7288j6667p0074J9493L2792j9516m2925p3856j7024j0376M0275L9688k8488
$$ 97288 80621 10547 30040 62832 43316 391 -73465 -90489 -100865 -60590 -20902 -49390
14075d9390k3767p421n0281l2404M6696N3769k7073M7100M6600l5858j3490K446
$$ -49390 -73157 -80578 -130859 -163263 -116567 -62798 -89871 -42771 3829 -32029 -45519 -43073
14063d3073j1947k830K6924L1973K0069J3572k5065p5098L829P1909M9030O168
$$ -43073 -55020 -57850 -30926 1047 21116 34688 9623 -65475 -61646 10263 59293 65461
14051F5461q5414k9801k5353L0532k8249K0611M8929O1344O282m2207k9254n3756
$$ 65461 -19953 -49754 -75107 -44575 -72824 -52213 -3284 58060 64342 22135 -7119 -60875
14039f0875q13M4674J4619J953O9655R873N2621L0131j15918k784j030K916n6929
$$ -60875 -61688 -17014 -2395 -442 69213 79086 131707 161838 45920 43136 42106 45022 -11907
14026a1907L2706N850k2716l3705p3372K5464N3842n9989m5290L9603K0709J00665
$$ -11907 20799 26649 3933 -29772 -103144 -77680 -23838 -83827 -129117 -89514 -68805 31860
14014C1860M656j06316m6083m626P6991l6713K4110k8903o0843N4081P3297P033
$$ 31860 36516 -69800 -115883 -120509 -43518 -80231 -56121 -85024 -145867 -91786 -18489 -11456
14002a1456N3656N7948P4782j7438l8931k2522J9021k3223K2556k3183o0659K2366
$$ -11456 42200 100148 174930 157492 118561 96039 115060 91837 114393 91210 30551 52917
13990E2917L3743M3679R39l2552m8824n1574j8936N778k0463n9714N438K2092
$$ 52917 86660 130339 131278 98726 49902 -1672 -20608 -14830 -35293 -95007 -89569 -67477
13978f7477M1673K3149N5175j7720k1351K9539M7595L1913j20005n5742N2583
$$ -67477 -25804 -2655 52520 34800 13449 42988 90583 122496 2491 -53251 -668
13967f68P0262j0692j5153m3226k9262o5349K4808m760o8437P3317L4949j315
$$ -668 69594 58902 43749 523 -28739 -94088 -69280 -74040 -142477 -69160 -34211 -35526
13955c5526J08375K265o4941O022k638P627K1162k9412j3M237J2720k5051O77
$$ -35526 72849 75114 10173 16195 13557 21184 42346 12934 12921 17158 29878 4827 5504
13942E504K8666O778J4064O944p8116n1663O3395l9412k8464J4209M304J4297
$$ 5504 34170 40948 55012 61956 -16160 -67823 -4428 -43840 -72304 -58095 -53791 -39494
13930c9494J4901M3758O5840l4084l24M1592j4002K5882K9161J252n582j2107
$$ -39494 -24593 19165 85005 50921 50597 92189 78187 104069 133230 134482 128900 116793
13918A16793o4465q7022M753J4005l3420q4567L286N9940l4286Q9425j2923j4376
$$ 116793 52328 -34694 -29941 -15936 -49356 -133923 -130637 -70697 -104983 -15558 -28481 -42857
13906d2857j2645N4674L8861k3791L364p7434n0007n351Q4966L5982o6300J4759
$$ -42857 -55502 -828 38033 14242 17606 -59828 -109835 -115186 -30220 5762 -60538 -45779
13894d5779O722M8929k6760O4789P5459j4384J7582M0110l8292p2567J5563P3479
$$ -45779 -39057 9872 -16888 47901 123360 108976 126558 166668 128376 55809 71372 144851
13882A44851q840n4526o8041m1415n0270K4082L7197O5432K5754p3379P7003O4600
$$ 144851 136011 81485 13444 -27971 -78241 -54159 -16962 48470 74224 845 77848 142448
13870A42448L2112j19171o6963N3224J6339q063J5276l3770j6973n668j475j4086
$$ 142448 174560 55389 -11574 41650 57989 49926 65202 31432 14459 8791 7316 -6770
13858f770J7823Q3149M2215l6332k3838M8001L9482p5495Q887p4077J0338k5514
$$ -6770 11053 94202 136417 100085 76247 124248 163730 88235 97122 23045 33383 7869
13846G869l700K8447k4805L4626J1701j00469O191Q4464O637J4717p6061l1923
$$ 7869 4169 32616 7811 42437 54138 -46331 -40140 44324 50961 65678 -10383 -42306
13834d2306N5148K2807o6950J3269N4740o388n0008Q3854Q9904p1516l6340O8680
$$ -42306 12842 35649 -31301 -18032 36708 30320 -19688 64166 154070 82554 46214 114894
13822A14894L6074n2135j5589m5633o379M165o4324M9379M6343J15059M7511m2682
$$ 114894 150968 98833 83244 37611 31232 35397 -28927 20452 66795 181854 229365 186683
13810A86683j4201Q7186L3670l6392j8458M4007L3620j5775J70777K46020J78677
$$ 186683 172482 259668 293338 256946 238488 282495 316115 300340 471117 717137 895814
13799H95814K27417L22205L27413K69835L13372K73226J11049K1061n5103j75444
$$ 895814 1123231 1445436 1772849 2042684 2356056 2629282 2740331 2761392 2706289 2530845
13789B530845j91106j94793k56855k39493k74184k33764j68055j69459q8082l6190
$$ 2530845 2339739 2144946 1888091 1648598 1374414 1140650 972595 803136 715054 678864
13779F78864q8181q3030o7016N905o5382j7749k7655Q9267Q3555j2670j29202
$$ 678864 590683 507653 440637 446542 381160 363411 335756 425023 508578 495908 366706
13768C66706Q316j178l5303J20282Q8122J43117J63126J68887K36150L46407L65590
$$ 366706 375022 373844 338541 458823 546945 690062 853188 1022075 1258225 1604632 1970222
13757A970222K96041K78105K70651J01663J0170k0980j15039k25142k46679k75290
$$ 1970222 2266263 2544368 2815019 2916682 2926852 2905872 2790833 2565691 2319012 2043722
13747B043722k90833k97440l02474k24799j69214m9751k2128o4559j35614k0247
$$ 2043722 1752889 1455449 1152975 928176 758962 709211 687083 622524 486910 466663
13737D66663L1660k1797l411q1808m4762j7279k5530J1152J26386l5135p9600
$$ 466663 498323 476526 473115 391307 346545 329266 303736 314888 441274 406139 326539
13726C26539l3852R742q974o6529j2799k8921L0712L2106K2926J6200j06684K7358
$$ 326539 292687 302429 293455 226926 214127 185206 215918 248024 270950 287150 180466 207824
13714B07824N281o2166K7069J10669P2392n1663l5498l0034M6804K3442j20765
$$ 207824 213105 150939 178008 288677 361069 309406 273908 243874 290678 314120 193355
13703A93355l9963j0446P5585J4514K853L1898r0592j474R726N5161R11l6558
$$ 193355 153392 142946 218531 233045 235898 267796 177204 175730 185456 240617 241528 204970
13691B04970J7726n6260o1100k5310j0574J9478L8593Q69l7311q2054l40N9960
$$ 204970 222696 166436 105336 80026 69452 88930 127523 128392 91081 9027 8687 68647
13679F8647Q4950o8435J2117N392J8328K5650n477o4285L3099M1491K7499l249
$$ 68647 153597 85162 97279 102671 120999 146649 141172 76887 109986 151477 178976 175727
13667A75727p2966J3418m4129o1867j2074l6973n2162O7597k0002J2945R9884
$$ 175727 102761 116179 72050 10183 -1891 -38864 -91026 -23429 -43431 -30486 69398
13656F9398J479j5197P5786J09544j03733j7805N1644O9224L0371L0026R5857
$$ 69398 70877 55680 131466 241010 137277 119472 171116 240340 270711 300737 396594
13645C96594P9604j3179k9055n57K0780O793m8410j03968q6346o8792o4172q533
$$ 396594 476198 463019 433964 433407 454187 460980 412570 308602 222256 153464 89292 80759
13633H0759l2500j264K0660k336l8861l7964k5243L0425J685m0731m254J9156
$$ 80759 48259 46995 67655 65319 26458 -11506 -36749 -6324 -4639 -45370 -49624 -30468
13621c0468N0957O815j222l8799m2686K6552O0608M0333k3204J9899K5238k2776
$$ -30468 20489 27304 26082 -12717 -55403 -28851 31757 72090 48886 68785 94023 71247
13609G1247M6075J75554J16801P3512k6608p422m0527P2709j2635r2498N8534
$$ 71247 117322 292876 409677 483189 456581 449159 408632 481341 468706 376208 434742
13598D34742l2339j19415k001o9834o4852m8734L256j6603J1238L1815j03360
$$ 434742 402403 282988 280987 211153 146301 97567 100823 84220 95458 127273 23913
13587B3913k1837O0600P7135K0012K4593J1858l0418k9293K8244l1440p3870o9281
$$ 23913 2076 62676 139811 159823 184416 196274 165856 136563 164807 133367 59497 -9784
13575i784m3934O8414J10701n0096o4560j133l0932J7628M7542P0218m7776K5012
$$ -9784 -53718 14696 125397 75301 10741 9608 -21324 -3696 43846 114064 66288 91300
13563I1300l3141Q12k9423k0393j1823m5243K966Q5474K4335l6867l0598R9750
$$ 91300 58159 58971 29548 9155 -2668 -47911 -44945 40529 64864 27997 -2601 97149
13551I7149J14308M3979n1407L0687l463q8988p0411L6301P1260p0859J1914J6517
$$ 97149 211457 255436 204029 234716 231253 142265 71854 108155 179415 108556 120470 136987
13539A36987L4096L507j3129j00649j4375k0259k6341M9998P794k9464o0894o858
$$ 136987 171083 174590 161461 60812 46437 26178 -163 49835 57629 28165 -32729 -39587
13527c9587l8623J0178M0177L8337m2602M8689K2539K4238m8193k9018j5818P7986
$$ -39587 -78210 -68032 -27855 10482 -32120 16569 39108 63346 15153 -13865 -29683 48303
13515D8303k1593R161M5007M805k1941p3494j3934M8466p774J4785k2507p1758
$$ 48303 26710 35871 80878 85683 63742 -9752 -23686 24780 17006 31791 9284 -62474
13503f2474o6925M9470P6071J8813K6404M2672j8906k3808p8386l5571L455k8379
$$ -62474 -129399 -79929 -3858 14955 41359 84031 65125 41317 -37069 -72640 -69185 -97564
13491i7564J07338Q639j70091q8348Q1811Q7748K012n3080Q561k2599L0847R4193
$$ -97564 9774 18413 -151678 -240026 -158215 -70467 -68455 -121535 -112974 -135573 -104726 -10533
13479a0533O4110r4190q7187L8638n100o3977N8543Q4245j1980m9280n0483J9940
$$ -10533 53577 -40613 -127800 -89162 -94262 -158239 -99696 -15451 -27431 -76711 -127194 -107254
13467a07254J8232K9893L6842j0698o8187Q7169M4426p0838m8142O299q2813j6844
$$ -107254 -89022 -59129 -22287 -32985 -101172 -14003 30423 -40415 -88557 -82258 -165071 -181915
13455a81915L3347J04962P1164J2572n3696M7624N5715J825p1415l4715M113j5376
$$ -181915 -148568 -43606 27558 40130 -13566 34058 89773 91598 20183 -14532 -10419 -25795
13443b5795o9323Q3028l9211J4260m132o7312J4665p552j08075Q4984P4905O8337
$$ -25795 -95118 -12090 -51301 -37041 -41173 -108485 -93820 -101372 -209447 -124463 -49558 18779
13431A8779O8542Q4770n3104j21248n6831j3573m97L4436J3201m4145p0095N9480
$$ 18779 87321 172091 118987 -2261 -59092 -72665 -73162 -38726 -25525 -69670 -139765 -80285
13419h0285L3135p4016o581J00549p2391j15678j4254Q4324L4459q9339L3822
$$ -80285 -47150 -121166 -127747 -27198 -99589 -215267 -229521 -145197 -110738 -200077 -166255
13408a66255Q4105N2410P0780N9585m4705j7899k7656q0416p244p314j1958L0691
$$ -166255 -82150 -29740 41040 100625 55920 38021 10365 -70051 -77295 -84609 -96567 -65876
13396f5876l543o7573m9109O7694R8423N2579K3933m2924o9743P7758k0741M2306
$$ -65876 -69419 -136992 -186101 -118407 -19984 32595 56528 13604 -56139 21619 878 43184
13384D3184O016K9341k8219m3951j6731P3042j794j5122m9763r908l2013q7254
$$ 43184 49200 78541 50322 6371 -10360 62682 60888 45766 -3997 -13905 -45918 -133172
13372a33172k9121N9989l1458q526J04858P1113l3769o829L7960K7421j4434K0202
$$ -133172 -162293 -102304 -133762 -142288 -37430 33683 -86 -6915 31045 58466 44032 64234
13360F4234k0139r4076o1141J5904Q4037M4944o613k8887j5656j5826J9972P0239
$$ 64234 44095 -49981 -111122 -95218 -11181 33763 27150 -1737 -17393 -33219 -13247 56992
13348E6992Q3264L5428o0428l6121k9186K7501K0250N4885o0540m997M2945o808
$$ 56992 140256 175684 115256 79135 49949 77450 97700 152585 92045 87048 129993 123185
13336A23185j5340j17900K306j0378M3275m4293l8075O4370N4092J9836Q749m1025
$$ 123185 107845 -10055 -7749 -18127 25148 -19145 -57220 7150 61242 81078 89827 48802
13324D8802R415k4768l318k7505j6915k3901n746L8514K1416P247p2716l7696
$$ 48802 58217 33449 30131 2626 -14289 -38190 -43936 -5422 15994 23241 -49475 -87171
13312h7171O502j5794K62M13R8296N5929j4005J9118k306r8311M4943L985j7754
$$ -87171 -80669 -96463 -96201 -95788 2508 58437 44432 63550 61244 -37067 7876 11861 -5893
13299e893o0913k3031J0740m3645P8054K777J14294M7574m6937o4828M7203Q6143
$$ -5893 -66806 -89837 -79097 -122742 -44688 -41911 72383 119957 73020 8192 55395 141538
13287A41538n2041O3488k96j11605j3489O230K1212J01545J11l1838j00136k2875
$$ 141538 89497 152985 152689 41084 27595 33825 55037 156582 156693 124855 24719 1844
13275A844J36229K1004j08888n0620M5993M0256P0363m7312l273J7194k7606J9671
$$ 1844 138073 159077 50189 -431 45562 85818 156181 108869 105596 122790 95184 114855
13263A14855j07681n5421j1182L8840J7201M035J886P7649m6657j00540j7482
$$ 114855 7174 -48247 -59429 -20589 -3388 647 2533 80182 33525 -67015 -84497
13252h4497M5476n4133J4795L9212L7826j9088o9761Q3131K5466N551J4093j6664
$$ -84497 -39021 -93154 -78359 -39147 -1321 -20409 -90170 -7039 18427 23978 38071 21407
13240B1407l0966j0703j5950n9455L1960L2897L45j3297K839p1179K4143L7216
$$ 21407 -9559 -20262 -36212 -95667 -63707 -30810 -30465 -43762 -40923 -112102 -87959 -50743
13228e0743q424l496o615P667k3973J5079k1924o8157K7015J10546Q9422L3654
$$ -50743 -59167 -62663 -69278 -61611 -85584 -70505 -92429 -160586 -133571 -23025 66397 100051
13216A00051J735o1069p4382J0747K8227o2232l5535K610p612o8703O4780K8759
$$ 100051 101786 40717 -33665 -22918 5309 -56923 -92458 -89848 -97460 -166163 -101383 -72624
13204g2624j0017J9320M1126k0416j825P379l8955j4825J4073Q0499j7794O9871
$$ -72624 -82641 -63321 -22195 -42611 -44436 -37057 -76012 -90837 -76764 3735 -14059 55812
13192E5812O0031n6222l5911q9378P109J7569M0077k0382m2668K6004j6409N3174
$$ 55812 115843 59621 23710 -65668 -58559 -40990 -913 -21295 -63963 -37959 -54368 -1194
13180a194n2536K3111K8273l2412m3399R200p6964l2373K7899L613M5814P7128
$$ -1194 -53730 -30619 -2346 -34758 -78157 -68957 -145921 -178294 -150395 -146782 -100968 -23840
13168b3840o836K2706N0829m2515p3832J23089L5789p2027q9860o110M3900k9962
$$ -23840 -30676 -7970 42859 344 -73488 49601 85390 13363 -76497 -82607 -38707 -68669
13156f8669L497J14175L1352r460r8327P9307N2479N237N4694k1623m3265m0857
$$ -68669 -65172 49003 80355 70895 -27432 51875 104354 109591 164285 142662 99397 58540
13144E8540m2743K372m5850m4605M88k3726N2475R6970l4560J140p7367L3814
$$ 58540 15797 18169 -27681 -72286 -71798 -95524 -43049 53921 19361 20501 -56866 -23052
13132b3052R1038l2142k6448l5895N2565k1329k9285m09p925L0022M2546L4701
$$ -23052 67986 35844 9396 -26499 26066 4737 -24548 -24957 -32882 -2860 39686 74387
13120G4387K9893j01263P877N3705l5446n685j7934N2097K7821O9264J3937L298
$$ 74387 104280 3017 10894 64599 29153 23468 5534 57631 85452 154716 168653 171951
13108A71951j2041l1728j4993l1552M2072L9159j5832n572J3652m5848p978q2201
$$ 171951 159910 128182 113189 81637 123709 162868 147036 141464 155116 109268 101290 19089
13096A9089p5194j5246m9617O124q824o9556L9125J37394J01328L3000l4006K914
$$ 19089 -56105 -71351 -120968 -114844 -123668 -193224 -154099 -16705 84623 117623 83617 86531
13084H6531L9862o8218j654n744r0062m4035Q1879r4113j8173l762l0213j3227
$$ 86531 126393 58175 56521 50777 -39285 -83320 -1441 -95554 -113727 -117489 -147702 -160929
13072a60929L3864J35781Q6983r43m697n4535p7350n699O6100p4422J7153O3087
$$ -160929 -127065 8716 95699 94756 90059 35524 -41826 -47525 18575 -55847 -38694 24393
13060B4393K7273N2280O2590l8824R7320L3395j53270r1465r533M3374n6713p7229
$$ 24393 51666 103946 166536 127712 225032 258427 105157 13692 4159 47533 -9180 -86409
13048h6409o3560L4423L4071L9505M6410m4225m3668n3302j2687K3240O4416J2152
$$ -86409 -149969 -115546 -81475 -41970 4440 -39785 -83453 -136755 -149442 -126202 -61786 -49634
13036d9634Q6142m089p1970K4716l5079l2766j6862P5180M9418r9995K2129N2907
$$ -49634 36508 32419 -39551 -14835 -49914 -82680 -99542 -24362 25056 -74939 -52810 97
13024I7P374J2186O54P1626R0440n5961j47948p4116k6652j3747M324M9928P8134
$$ 97 7471 19657 20311 91937 182377 126416 -21532 -95648 -122300 -136047 -131723 -81795 -3661
13011c661k23L1071L7505k8932o8030k9792M8011m6488m2405k1173K1734L150
$$ -3661 -3884 27187 64692 35760 -32270 -62062 -14051 -60539 -102944 -124117 -102383 -99233
12999i9233p341J074m4119m8685j7886P6198N2443L0340m4136q5597J2196n7J7027
$$ -99233 -106574 -105500 -149619 -198304 -216190 -139992 -87549 -57209 -101345 -186942 -174746 -174803 -157776
12986a57776K5170J14310O2542j9490j05794J1438Q21J3576l6330Q1887l7871
$$ -157776 -132606 -18296 44246 24756 -81038 -69600 -68779 -55203 -91533 -9646 -47517
12975d7517r0796m0816K3960K3141M5469q660L0529n6961O61m0047p569R2403
$$ -47517 -138313 -179129 -155169 -132028 -86559 -95219 -64690 -121651 -120990 -161037 -168606 -76203
12963g6203Q3839N4239o0680j00040q8643K1165R094R500L1298L3900O6542K7103
$$ -76203 7636 61875 1195 -98845 -187488 -166323 -157229 -147729 -116431 -82531 -15989 11114
12951A1114Q8591l6245j4445k1042j08179L6930P0212j4132K5010k8009M691K477
$$ 11114 99705 63460 49015 27973 -80206 -43276 26936 12804 37814 9805 14496 16973
12939A6973J1256m4966l1037o4465m1402O005n8840j8105J0701R2521N8281n7627
$$ 16973 28229 -16737 -47774 -112239 -153641 -147636 -206476 -224581 -213880 -121359 -63078 -120705
12927a20705O0074L542n9165J3214l5695m129Q6326Q8021K08r9290k8810J00131
$$ -120705 -60631 -57089 -116254 -103040 -138735 -142864 -56538 31483 31691 -67599 -96409 3722
12915C722Q8721j1053l6805m0020p9035m8319P7240j7470K2635M4728J1447K6854
$$ 3722 92443 81390 44585 4565 -74470 -122789 -45549 -63019 -40384 4344 15791 42645
12903D2645l7358p6145n4175J11319J43452J1974r4899p1570n7554p821o1856
$$ 42645 5287 -70858 -125033 -13714 129738 141712 46813 -24757 -82311 -90132 -151988
12892a51988j8251m8553L247Q7510J36376R5417k4347n8887j7855o6755l983L2089
$$ -151988 -170239 -218792 -215545 -128035 8341 103758 79411 20524 2669 -64086 -68069 -35980
12880c5980j009J5328P559j8448m4336M9433Q9855M6890K7657j8760p5445K923
$$ -35980 -36989 -21661 -14102 -32550 -76886 -27453 62402 109292 136949 118189 42744 45667
12868D5667L0946p9069K6476N168n0885l2561K8431n2780m7763L0670N1377L4234
$$ 45667 76613 -2456 24020 29188 -21697 -54258 -25827 -78607 -126370 -95700 -44323 -10089
12856a0089J09635M7888m1680n1212m5320J7184p4399k94K8772M0363M28l799
$$ -10089 99546 147434 105754 54542 9222 26406 -47993 -48287 -19515 20848 21276 17477
12844A7477n7532j9626N6881K2381j01433O482N0055K9311m3333N9081k5633Q4293
$$ 17477 -40055 -59681 -2800 19581 -81852 -75370 -25315 3996 -39337 19744 -5889 78404
12832G8404p2708r6680M7554M8917M976P1837J3746l2491j03361P65J9113m0864
$$ 78404 5696 -90984 -43430 5487 10463 82300 96046 63555 -39806 -39041 -19928 -60792
12820f0792K6425J333J3401n7194P42Q6514l6188J9377P6858r1970r4017n904
$$ -60792 -34367 -33034 -19633 -76827 -76085 10429 -25759 -6382 70476 -21494 -115511 -121415
12808a21415q665L8504O5360M1882M0838Q7482J44965Q163J7821o694j437O1611
$$ -121415 -130080 -91576 -26216 15666 56504 143986 288951 297114 314935 308241 306804 368415
12796C68415j06253j63678m9002l1427q4673l2942J10388L1239q5580M4047J6019
$$ 368415 262162 98484 49482 18055 -66618 -99560 10828 42067 -43513 534 16553
12785A6553m5171K3977L6431M1992m9773p2515k4640K3327J05456R8873n3321
$$ 16553 -28618 -4641 31790 73782 24009 -48506 -73146 -49819 55637 154510 101189
12774A01189n2695o2819j2904N2311O8587n3990n201k3775M3328J01772j4663
$$ 101189 48494 -14325 -27229 25082 93669 39679 34478 10703 54031 155803 141140
12763A41140j29377l1209l753p3853m4957J9493k6576l5355J0130O5867J6692
$$ 141140 11763 -19446 -23199 -97052 -142009 -122516 -149092 -184447 -174317 -108450 -91758
12752i1758M7120M7940p6984k8517N0301O418J2367o888k7960m5146k3320L7591
$$ -91758 -44638 3302 -73682 -102199 -51898 -45480 -33113 -40001 -67961 -113107 -136427 -98836
12740i8836l2095K4530P2164O9958K8565p027l5222n0731M1254M6358L8016q5107
$$ -98836 -130931 -106401 -34237 35721 64286 57259 22037 -28694 12560 58918 96934 11827
12728A1827j6189k028j1895J8853P453j2635o0840M0229K7706k7359k5855p6544
$$ 11827 -4362 -6390 -18285 568 8021 -4614 -65454 -25225 2481 -24878 -50733 -127277
12716a27277L84p257j6639j9490o289J4020K0658k8918J00795L0084q6004o0342
$$ -127277 -126893 -134150 -150789 -170279 -176568 -162548 -141890 -170808 -70013 -39929 -125933 -186275
12704a86275J4826J12519M4048o866M4014l9569j1116p0748o5556P930J2651P9984
$$ -186275 -171449 -58930 -14882 -21748 22266 -17303 -28419 -99167 -164723 -156793 -144142 -64158
12692f4158M0443m6496n8826K250N1215j9658L2886K4535Q5834N2960j4238l3045
$$ -64158 -23715 -70211 -129037 -126787 -75572 -95230 -62344 -37809 48025 100985 86747 53702
12680E3702l0093r4022L9066K0579j8080N915n3677N3193r843L9668M4015P9666
$$ 53702 23609 -70413 -31347 -10768 -28848 -22933 -76610 -23417 -33260 6408 50423 130089
12668A30089l2743q5474l8209k3716j2386n0484m8023J9383q3115P2444N7650
$$ 130089 97346 11872 -26337 -50053 -62439 -112923 -160946 -141563 -224678 -152234 -94584
12657i4584j3837k9108O0698m1935N2424M2865k0356P1504k1643o3262j0834P7124
$$ -94584 -108421 -137529 -76831 -118766 -66342 -23477 -43833 27671 6028 -57234 -68068 9056
12645I056k2706Q0797K4554j491n3837j054j0655n4544l8695J4729P9171N9279
$$ 9056 -13650 67147 91701 90210 36373 35319 24664 -29880 -68575 -53846 25325 84604
12633H4604q2160q3976J0120m1816m6663l1985M3584Q4473J7477Q712K8880k3556
$$ 84604 2444 -81532 -71412 -113228 -159891 -191876 -148292 -63819 -46342 -37630 -8750 -32306
12621c2306p3329K6827J14760K7952N7393k6153m1678L696M3557n1567j7707n7819
$$ -32306 -105635 -78808 35952 63904 121297 95144 53466 57162 100719 49152 31445 -26374
12609b6374o927K5059J3824j8098k2081n5046l4306j7571J07729J08818k8721
$$ -26374 -33301 -8242 5582 -12516 -34597 -89643 -123949 -141520 -33791 75027 46306
12598D6306n2328J1590P135j4227O0661J1366p0622q342M9908L6091p9051k9673
$$ 46306 -6022 5568 12703 -1524 59137 70503 -119 -8461 41447 77538 -1513 -31186
12586c1186m0947q512K4683k6217L6519J09522R9278P3703r2936p3782m7732n8214
$$ -31186 -72133 -80645 -55962 -82179 -45660 63862 163140 236843 143907 70125 22393 -35821
12574c5821o4518L1782L7408N3639K0398J9350j1075q2226K087l4414N3457O8531
$$ -35821 -100339 -68557 -31149 22490 42888 62238 51163 -31063 -28976 -63390 -9933 58598
12562E8598k7307l629M3253k0500p568J0332q78m2208O75N1705K3191n7512p4364
$$ 58598 31291 27662 70915 50415 42847 53179 52301 10093 10768 62473 85664 28152 -46212
12549d6212J9648L4646n88q3518K147Q0087k2122p5633K4155J0249K3647r00N085
$$ -46212 -26564 8082 7494 -76024 -73877 6210 -15912 -91545 -67390 -57141 -33494 -34394 -29309
12536b9309k1450r7595l20K4820P8193k7521p7444R7959J09286M9699m5429o7540
$$ -29309 -50759 -148354 -148674 -123854 -45661 -73182 -150626 -52667 56619 106318 60889 -6651
12524f651J08643M6767n0672o2440p5637l6984p545Q6351P8158l0022l336q522
$$ -6651 101992 148759 98087 35647 -39990 -76974 -84519 1832 79990 49968 46632 38110
12512C8110N8307o669q718n0053j3021Q4435J764l9345l4715l4624m0884k5999
$$ 38110 96417 89748 81030 30977 17956 102391 104155 64810 30095 -4529 -45413 -71412
12500g1412l1105k6946j1341O9802M6142J6556k0806M7254r064N7291o3411n7119
$$ -71412 -102517 -129463 -140804 -71002 -24860 -8304 -29110 18144 9080 66371 2960 -54159
12488e4159M6775q8099o6869M8679M9725l1547P518r878j04893M9501K3907N1206
$$ -54159 -7384 -95483 -162352 -113673 -63948 -95495 -87977 -97855 -202748 -153247 -129340 -78134
12476g8134O3446o4451J318k4455Q596N0975O3542l9182j8090m0205r411K8938
$$ -78134 -14688 -79139 -77821 -102276 -93680 -42705 20837 -18345 -36435 -76640 -86051 -57113
12464e7113k4017K0242K0923M7914K0855o2847n8170k8504M7406L2294m3151L3514
$$ -57113 -81130 -60888 -39965 7949 28804 -34043 -92213 -120717 -73311 -41017 -84168 -50654
12452e0654q047M2141J07626j8863j3090k6416O585L4872K5573J1971k1599O7
$$ -50654 -58701 -16560 91066 72203 59113 32697 39282 74154 99727 111698 90099 90166
12440I0166p7487j6828J5034m1686r834O4692m342m3987l3340O9582J0405k4656
$$ 90166 12679 -4149 10885 -30801 -40635 24057 19715 -24272 -57612 11970 22375 -2281
12428b281k0093L219m1918k0766l1612N163l753J0582P698O6456J6968m881j34609
$$ -2281 -22374 -19155 -61073 -81839 -113451 -108288 -112041 -101459 -93761 -27305 -10337 -15218 -149827
12415a49827J1525o924m0274M7196Q3815O4337k9261J4503k8843n6878j6814j768
$$ -149827 -138302 -145226 -185500 -138304 -54489 9848 -19413 -4910 -33753 -90631 -107445 -109213
12403a09213Q8968P8313o016l0756j7578n7865q5057p174K4623j8345K1710K5013
$$ -109213 -20245 58068 52052 21296 3718 -54147 -139204 -146378 -121755 -140100 -118390 -93377
12391i3377L2724M5228m941q1651J7403K5949j5254R4948N4600J3274r7490n8019
$$ -93377 -60653 -15425 -20366 -102017 -84614 -58665 -73919 21029 75629 88903 -8587 -66606
12379f6606O610o871l3545p0692J3240K1834J1316N1962J5660J5115L2361m306
$$ -66606 -59996 -66867 -100412 -171104 -157864 -136030 -124714 -72752 -57092 -41977 -9616 -13922
12367a3922p8363L3208J10711J32865K0461q5970q4149j1365J9524o3972n7143
$$ -13922 -92285 -59077 51634 184499 204960 118990 34841 23476 43000 -20972 -78115
12356g8115m2962N2417Q8783O8844l4642j2941K375O2984K5598J9118k7517K595
$$ -78115 -121077 -68660 20123 88967 54325 41384 43759 106743 132341 151459 123942 126537
12344A26537k8969l7452l8380J1083J9589k2923k8945n3686m6137P596P068O368
$$ 126537 97568 60116 21736 32819 52408 29485 540 -53146 -99283 -91687 -84619 -78251
12332g8251M4402R917K7275M0781N9290l7017j18704o9044J7240r180j4893N5653
$$ -78251 -33849 -23932 3343 44124 103414 66397 -52307 -121351 -104111 -113291 -128184 -72531
12320g2531J21598Q3494l8142m1842p942m2565k793M4191K5226r3428j115K8566
$$ -72531 49067 132561 94419 52577 44635 2070 -723 43468 68694 -24734 -25849 2717
12308B717N0756O3382O891q0476L8699L3071l9196Q123o8196k0452r3887k582
$$ 2717 53473 116855 123746 43270 81969 115040 75844 83967 15771 -4681 -98568 -101150
12296a01150J32679L3218k6838N9893k3879q7749M8215N3762K5031J6012L0724
$$ -101150 31529 64747 37909 97802 73923 -13826 34389 88151 113182 129194 159918
12285A59918J6878K4625L976q4777l7734j9O661R7915P1637j05253m1601r85J3449
$$ 159918 176796 201421 205397 120620 82886 82867 89528 187443 259080 153827 112226 111241 124690
12272A24690J4860K9475o056l5647J9620k9245l6957m6201j462R2663K7794p3912
$$ 124690 139550 169025 162969 127322 146942 117697 80740 34539 33077 125740 153534 79622
12260G9622k1969o6627P5485J12609M5522j27507J6732M5849m2387m4408O9803
$$ 79622 57653 -8974 66511 179120 224642 97135 113867 159716 117329 72921 142724
12249A42724k4720p0515n8512J4497L9122r600P054J238N1633J4245r8772m0412
$$ 142724 118004 47489 -11023 3474 42596 32996 40050 41288 92921 107166 8394 -32018
12237c2018l9079m6030J00229J06237J7636n034n3156L4539M371K2457m25j2063
$$ -32018 -71097 -117127 -16898 89339 106975 101941 48785 83324 87695 110152 109727 97664
12225I7664k475K1652q9733m360P0701O5327K1580K724l5157m9242l2247r2388
$$ 97664 95189 116841 27108 22748 93449 158776 180356 183080 147923 98681 66434 -25954
12213b5954j14694K7389Q2272N4449m1101m4400N1844M667k2234q640l6020P954
$$ -25954 -140648 -113259 -30987 23462 -17639 -62039 -10195 -5528 -27762 -36402 -72422 -64468
12201f4468N2577j3647K1146J5834r666N6679n346k2941k6890l7695j4655K4758
$$ -64468 -11891 -25538 -4392 11442 1776 58455 53109 30168 3278 -34417 -49072 -24314
12189b4314L0555L7035j7937p2932o5951p4500J1386J9931L4856N6455Q3573K22
$$ -24314 6241 43276 25339 -47593 -113544 -188044 -176658 -156727 -121871 -65416 18157 18379
12177A8379n7417l6237M1043N0020j027R4897L6690o1378l7051p5702o8293M1735
$$ 18379 -39038 -75275 -34232 15788 14761 109658 146348 84970 47919 -27783 -96076 -54341
12165e4341O4001k1695k5595j7608m0212L5634J28461K3486k7644k6214o478l0419
$$ -54341 9660 -12035 -37630 -55238 -95450 -59816 68645 92131 64487 38273 31795 1376
12153A376J7723m8404k9345K3130K8920j0370j9347R1768K4683N2208l4894j28102
$$ 1376 19099 -29305 -58650 -35520 -6600 -16970 -36317 55451 80134 132342 97448 -30654
12141c0654o2634P1235L0566R0343K8641p9159j10133J668Q7744j158l6661N3434
$$ -30654 -93288 -22053 8513 98856 127497 48338 -61795 -60127 27617 26459 -10202 43232
12129D3232P4231m3966l8183p956K2860L725L2517p3289j21223o7031N1231K011
$$ 43232 117463 73497 35314 27358 50218 53943 86460 13171 -108052 -175083 -123852 -121841
12117a21841L6637J12077Q0926J8424L416m7786n8888J02129K3875j16454q4948
$$ -121841 -85204 26873 107799 126223 129639 81853 22965 125094 148969 32515 -52433
12106e2433M5338l0527r371Q2686P4553n2513J7465Q335k6007j4731j4o7318n9288
$$ -52433 -7095 -37622 -46993 35693 110246 57733 75198 83533 57526 42795 42781 -24537 -83825
12093h3825L8690j8274n4582N86L2412k7132O3799K1356o411p0047q3005m0549
$$ -83825 -45135 -63409 -117991 -117405 -84993 -112125 -48326 -26970 -33381 -103428 -186433 -226982
12081b26982M8841J05377P0412o554N7540r508j13217k0139j4732N0739M8578
$$ -226982 -178141 -72764 -2352 -8906 48634 39126 -74091 -94230 -108962 -58223 -9645
12070i645Q0967O7778r908j01158o7148L7715N3779m4943q0011K8047Q0175J02488
$$ -9645 71322 139100 129192 28034 -39114 -1399 52380 7437 -72574 -44527 35648 138136
12058A38136L6053n1830j07755R260J10382n412o1837l818m9618o9401j6977j5207
$$ 138136 174189 122359 14604 23864 134246 128834 66997 63179 13561 -55840 -72817 -88024
12046h8024Q0831J03694o8809p2732j5021m3877K8995M9808O8367k8246L5994
$$ -88024 -7193 96501 27692 -45040 -60061 -103938 -74943 -25135 43232 14986 50980
12035E0980j1480p5514l3806j3948k2243J3680N74L3406M7027M1692l2328M0286
$$ 50980 39500 -36014 -69820 -83768 -106011 -92331 -91757 -58351 -11324 30368 -1960 38326
12023C8326O2032n3197m264O5212L1763n9981j164p793K5250m3257m7451K7267
$$ 38326 100358 47161 42897 108109 139872 79891 78727 70934 96184 52927 5476 32743
12011C2743k4574j4257K3789k7750l4360j9827P9067M5053P8390M0681L0649J25109
$$ 32743 8169 -6088 17701 -10049 -44409 -64236 14831 59884 138274 178955 209604 334713
11999C34713J12060Q5192J10170J22458l7886j02506j80271r0127j13140l3012
$$ 334713 446773 531965 642135 764593 726707 624201 443930 353803 240663 207651
11989B07651N1442l67m8349n4571K4344N9816j2332n9079k2503j04192q998M5349
$$ 207651 259093 258726 210377 155806 180150 239966 227634 168555 146052 41860 32862 78211
11977G8211j180Q6803P6046l0102r034R7067L9090q8932M967j6973o3764J1898
$$ 78211 77031 163834 239880 209778 200744 297811 336901 247969 252936 235963 172199 184097
11965A84097k1176O2140J9715L8115N6965J11946N0250N9364J65612J09615J73648
$$ 184097 162921 225061 244776 282891 339856 451802 502052 561416 727028 836643 1010291
11954A010291R8576J05852K4332m018p6758j04276j19346k2376j1793Q674j04993
$$ 1010291 1108867 1214719 1239051 1235033 1158275 1053999 934653 912277 900484 909158 804165
11943H04165j55359m2053n1613j04566o1136K1369m4412n4419K2693Q4603J02592
$$ 804165 648806 606753 555140 450574 389438 410807 366395 311976 334669 419272 521864
11932E21864p3094p4722J12147J07020J01084k2994q5520l4099K5708m8772o9332
$$ 521864 448770 374048 486195 593215 694299 671305 585785 551686 577394 528622 459290
11921D59290o5405J3399K7357j9894q3150q066J1857M9807M1626J02084J31233
$$ 459290 393885 407284 434641 414747 331597 323531 335388 385195 426821 528905 660138
11910F60138J21587M8910M4261L2004J23241l3344j22059r3903r8928j28730j32615
$$ 660138 781725 830635 874896 906900 1030141 996797 874738 780835 681907 553177 420562
11899D20562q0807K3299o7770o1025P0172O2134j1659l5668l5539K8223n3168
$$ 420562 339755 363054 295284 234259 304431 366565 354906 319238 283699 311922 258754
11888B58754q1855P7996M8060K8487p6770p3076N249M175n6789P9944j6316l3954
$$ 258754 176899 254895 302955 331442 254672 181596 186845 191020 134231 214175 197859 163905
11876A63905l7875K1746m4757k4938Q667n4200K9012O8337l0749k0222M075j6298
$$ 163905 126030 147776 103019 78081 86748 32548 61560 129897 99148 78926 83001 66703
11864F6703m7467l4447K4380L2295N8001L4528N6979k298j00263n8601M6184o4869
$$ 66703 19236 -15211 9169 41464 99465 133993 190972 188674 88411 29810 75994 11125
11852A1125l5822L4293J3641j09536L1995L0460O0897N6356M9641j05746k3163
$$ 11125 -24697 9596 23237 -86299 -54304 -23844 37053 93409 143050 37304 14141
11841A4141L8212N6029k4004o7610j5182n780j8492O243J206N7534o2836r3461
$$ 14141 52353 108382 84378 16768 1586 -4194 -22686 -16443 -15237 42297 -20539 -114000
11829a14000k5800K180J7524N0711Q5972L802L2387l7245N251L233m4237n4916
$$ -114000 -139800 -137620 -120096 -69385 16587 20389 52776 15531 20782 24015 -20222 -75138
11817g5138p8456n651P5818K1730o882N2919K6368j5768M2129o9165J7908L1267
$$ -75138 -153594 -159245 -83427 -61697 -68579 -15660 10708 -5060 37069 -32096 -14188 17079
11805A7079L2539l5656n596N8982R143r2859j053K2958J7586l8482L4412O4327
$$ 17079 49618 13962 8366 67348 76491 -16368 -17421 5537 23123 -15359 19053 83380
11793H3380o2408m5223J4539O8685M0162o0648p6228m6204K1947N4829K6467L9603
$$ 83380 20972 -24251 -9712 58973 99135 38487 -37741 -83945 -61998 -7169 19298 58901
11781E8901K5845j51944j04185O8402J43733P6123j04499j04098L1283L3211K7757
$$ 58901 84746 -67198 -171383 -102981 40752 116875 12376 -91722 -60439 -27228 529
11770E29L409j2094n7410q8426m2042M7204J09860N936r0936k025m3534N420P395
$$ 529 3938 -8156 -65566 -153992 -196034 -148830 -38970 -33034 -123970 -125995 -169529 -164109 -156714
11757a56714O8632Q9126m7135O3403R6459L0555k4867l1156p8512o8615O933O5134
$$ -156714 -88082 1044 -46091 17312 113771 144326 119459 88303 9791 -58824 -51891 13243
11745A3243j657r2240m6821J19492N8936q6139J1449j1081M8654q6897J4577J5860
$$ 13243 11586 -80654 -127475 -7983 50953 -35186 -23737 -34818 13836 -73061 -58484 -42624
11733d2624o596l8685k0406L3270k5595n2314O6254N0717k5188l3319N5303L5233
$$ -42624 -49220 -87905 -108311 -75041 -100636 -152950 -86696 -35979 -61167 -94486 -39183 -3950
11721c950n3316k8321R2317R9754J4286j03241k5076O1805K5104j4452k5933J0890
$$ -3950 -57266 -85587 6730 106484 120770 17529 -7547 54258 79362 64910 38977 49867
11709D9867j7296m5161r186L6256k9313j46774m1983L3612n3439Q7448R8328m883
$$ 49867 32571 -12590 -21776 14480 -14833 -161607 -203590 -169978 -223417 -135969 -37641 -42524
11697d2524K3264L4726L88L0044n5439Q246j548o7640K8856R6896L3499p5220
$$ -42524 -19260 15466 15854 45898 -9541 -1295 -2843 -70483 -41627 55269 88768 13548
11685A3548l0051J02721p1892o5299n1654P7398N8496l1913j9033l6237Q0580
$$ 13548 -16503 86218 14326 -50973 -102627 -25229 33267 1354 -17679 -53916 26664
11674B6664J5159j05925l8779J8362N0096k2822j03850M3372J37470n884j14143
$$ 26664 41823 -64102 -102881 -84519 -34423 -57245 -161095 -117723 19747 13863 -100280
11663a00280j33397J4023Q5964K4937l1621L3994P7687K2385j6551r4948j0610
$$ -100280 -233677 -219654 -133690 -108753 -140374 -106380 -28693 -6308 -22859 -117807 -128417
11652a28417n3757O587L9088j246m9265L2896J01615L7916L7108m0771l5126m7959
$$ -128417 -182174 -175587 -136499 -137745 -187010 -154114 -52499 -14583 22525 -18246 -53372 -101331
11640a01331l203N6553K309l6297L7048q934R868J05273J1984j17931n2182J3845
$$ -101331 -104534 -47981 -45672 -81969 -44921 -53855 -43987 61286 73270 -44661 -96843 -82998
11628h2998K916M113k377O0564m570K9952m1426Q1726J08373j7731m1569k5247
$$ -82998 -80082 -75969 -78346 -17782 -22352 7600 -33826 47900 156273 138542 96973 71726
11616G1726n1820L3848p00q744K1482n7756j3833J0958K2489l41j2300K4493J9659
$$ 71726 19906 53754 53054 44310 65792 8036 -5797 5161 27650 27309 15009 39502 59161
11603E9161M0791n0388J8658M5955J2244k152p3395m9943j44121m5591N1298O6558
$$ 59161 99952 49564 68222 114177 126421 124269 50874 931 -143190 -188781 -137483 -70925
11591g0925J8090L0106M804o0108q8576N5463O0209L0822P6402Q332l1606r9261
$$ -70925 -52835 -22729 -17925 -78033 -166609 -111146 -50937 -20115 56287 64619 33013 -66248
11579f6248r063N298k7576l0241o4954k3164l1921K7843J54290p224J1297J6416
$$ -66248 -75311 -70013 -97589 -127830 -192784 -215948 -247869 -220026 -65736 -72960 -61663 -45247
11567d5247l6261m7092l5133j787m729q8339L2510J00726Q3013M3374J2470m3248
$$ -45247 -81508 -128600 -163733 -165520 -170249 -258588 -226078 -125352 -42339 1035 13505 -29743
11555b9743o7765k3695K0608M495M7461J6977J9809j9953k2904k3743k8797m1976
$$ -29743 -97508 -121203 -100595 -96100 -48639 -31662 -11853 -31806 -54710 -78453 -107250 -149226
11543a49226k052K6844J7327J7743q2494j0225K8689M4182J50648O7120K3579
$$ -149226 -151278 -124434 -107107 -89364 -171858 -182083 -153394 -109212 41436 108556 132135
11532A32135r1148j11070q7551M812K8327L837N1753J3433J7733l2587Q3257J09848
$$ 132135 40987 -70083 -157634 -152822 -124495 -120658 -68905 -55472 -37739 -70326 12931 122779
11520A22779n0643J6715j9196J277J9364N0688o4227J3103k2682m2443k482m1554
$$ 122779 72136 88851 69655 70932 90296 140984 76757 89860 67178 24735 22253 -19301
11508a9301o4563O6780K2641n9164l2540K2243j8737o9708M5990K0072o447M9882
$$ -19301 -83864 -17084 5557 -53607 -86147 -63904 -82641 -152349 -106359 -86287 -92734 -42852
11496d2852P0992J0191p2321j13071J8000J02174J6872j3979L6344p7067K4304
$$ -42852 28140 38331 -33990 -147061 -129061 -26887 -10015 -23994 12350 -64717 -40413
11485d0413k592J4893K9422r7322j9963O8359M8296q6588j58506r1556O0986J53955
$$ -40413 -43005 -28112 1310 -96012 -115975 -47616 680 -85908 -244414 -335970 -274984 -121029
11473a21029P4914j6179l402r2868o587K3166L6824P9925m2836k3006R607J31064
$$ -121029 -46115 -62294 -65696 -158564 -165151 -141985 -105161 -25236 -68072 -91078 -81471 49593
11461D9593J9278j07536J2899l816L1792n829M4919q3745k5952p601m663J8773
$$ 49593 68871 -38665 -25766 -29582 2210 -3619 41300 -42445 -68397 -75998 -80661 -61888
11449f1888P0422m3118n2749j3794J1896K2980m4682n558O4092r50n5838j7671
$$ -61888 8534 -34584 -87333 -101127 -89231 -66251 -110933 -116491 -52399 -53349 -109187 -126858
11437a26858P9523l7650l6069M7426L8878O1513j17357p4621Q8847P0648p937
$$ -126858 -47335 -84985 -121054 -73628 -34750 26763 -90594 -165215 -76368 -5720 -13657
11426a3657k4204n9586q8552j8296m5537J2862M9981j3840P7773Q9945M0236k6811
$$ -13657 -37861 -97447 -185999 -204295 -249832 -236970 -186989 -200829 -123056 -33111 7125 -19686
11414a9686j1450m0218L265R0103O192p2571N4302j1324J1894o0497p8678M7679
$$ -19686 -31136 -71354 -68089 22014 28206 -44365 9937 -1387 10507 -49990 -128668 -80989
11402h0989O0341k2400j4971P6209k0550N518Q624m4728q9264J9715p6535Q7019
$$ -80989 -20648 -43048 -58019 18190 -2360 3158 11782 -32946 -122210 -102495 -179030 -92011
11390i2011R7869J969l9694n7837J017L8665o4561n7293M3497J5835L498K7487
$$ -92011 5858 7827 -31867 -89704 -88687 -50022 -114583 -171876 -128379 -112544 -109046 -81559
11378h1559K4591p0739K5140K9096j7449j181L0842o307K5917p2933l71K6980
$$ -81559 -56968 -127707 -102567 -73471 -90920 -92101 -61259 -67566 -41649 -114582 -114953 -87973
11366h7973L4504o7634n1480k2493K4888J76591J03093j6079j18856o1837l3217
$$ -87973 -53469 -121103 -172583 -195076 -170188 6403 109496 93417 -25439 -87276 -120493
11355a20493m0566M6221O0661K8217O3356m1144p5959k2455J05844M3879j5908
$$ -120493 -161059 -114838 -54177 -25960 37396 -3748 -79707 -102162 3682 47561 31653
11344C1653m8553n1373k7115l2826p9109Q107j5692k697J6613J1858k0204O5327
$$ 31653 -16900 -68273 -95388 -128214 -207323 -199216 -214908 -217605 -200992 -189134 -209338 -144011
11332a44011N6013L8585o476J9791Q3468l725j02556N6771J08868j30907o0623
$$ -144011 -87998 -49413 -55889 -36098 47370 43645 -58911 -2140 106728 -24179 -84802
11321h4802N228j3823j2331j986K5969J9099Q145L2355n500K5803M3675l8189
$$ -84802 -79574 -93397 -105728 -107714 -81745 -62646 -54501 -22146 -27646 -1843 41832 3643
11309C643j10315J5431O8193K5336M8101m1915m4815o1087K889l887M6720j8114
$$ 3643 -106672 -91241 -23048 2288 50389 8474 -36341 -97428 -94539 -98426 -51706 -69820
11297f9820q7295l8792K4620P4342O8060K2674o710j0876l7607l6607n0560J0051
$$ -69820 -157115 -195907 -171287 -96945 -28885 -6211 -12921 -23797 -61404 -98011 -148571 -138520
11285a38520L9616j2097J3680N9485R2800K9352k3935j04489j08272j4976P5590
$$ -138520 -98904 -111001 -97321 -37836 54964 84316 60381 -44108 -152380 -167356 -91766
11274i1766J39275q317j9078j4064j07870j2760O8912j659q5233O0049R013K6869
$$ -91766 47509 39192 20114 6050 -101820 -114580 -45668 -47327 -132560 -72511 -63498 -36629
11262c6629L28L396M2958K8175l41k3158j03459L6164K6834J789k4482p7310N8335
$$ -36629 -36301 -32905 10053 38228 37887 14729 -88730 -52566 -25732 -23943 -48425 -125735 -67400
11249f7400O8558M2361N2792J8572l8814r4157J8203L4005L0056l7542l2113m2835
$$ -67400 1158 43519 96311 114883 76069 -18088 115 34120 64176 26634 -5479 -48314
11237d8314l6942M7554K1033k101l1642k5071M1805K8571K2137J7869J334q7210
$$ -48314 -85256 -37702 -16669 -18770 -50412 -75483 -33678 -5107 17030 34899 36233 -50977
11225e0977L2523R0696K4453j2793k3030p553q1696J3652m7133l6478O3249n1725
$$ -50977 -18454 72242 96695 83902 60872 53319 -28377 -14725 -61858 -98336 -35087 -86812
11213h6812M1547N67J3977p4528p743Q2214Q037M5409j109j28579L0167M2765
$$ -86812 -45265 -44698 -30721 -105249 -112992 -30778 -22741 22668 21559 -107020 -76853 -34088
11201c4088j9912K0771Q9277M466j41553n2188L4198O8372J2523j9416M2834l925
$$ -34088 -54000 -33229 56048 60514 -81039 -133227 -99029 -30657 -18134 -37550 5284 1359
11189A359n6952l0416J3677K2706P0367K2681k7409m5695K4989N8236J8903J254
$$ 1359 -55593 -86009 -72332 -49626 20741 43422 16013 -29682 -4693 53543 72446 73700
11177G3700k7695n992K8831N141j07787j9559j276p5468L3662R1784O4266J2513
$$ 73700 46005 40013 68844 73985 -33802 -53361 -54637 -130105 -96443 -4659 59607 72120
11165G2120J0234r5001N0641R2101m6097k7821M3282o1369p7789j36152P7514
$$ 72120 82354 -12647 37994 130095 83998 56177 99459 38090 -39699 -175851 -98337
11154i8337N1816L2128M5508P814k4974J3372k4348L1151O3585p1283j70665n648
$$ -98337 -46521 -14393 31115 38929 13955 27327 2979 34130 97715 26432 -144233 -149881
11142a49881L783M7801L1529O0801n074R2730n66m0107p1674L0286O7849m0390
$$ -149881 -146098 -98297 -66768 -5967 -11041 81689 81123 41016 -30658 -372 67477 27087
11130B7087k7589o4367N1327J01604j2919O1224K2487j6224r2080o8440J2529
$$ 27087 -502 -64869 -13542 88062 75143 136367 158854 142630 50550 -17890 -5361
11119e361P8679N5701l2750J10277R0646J2494J44484K79772K20006K67842M37326
$$ -5361 73318 129019 96269 206546 297192 309686 454170 733942 953948 1221790 1659116
11108A659116M74241M35434K30053J76355J44786J86479J28485N468k82003l79459
$$ 1659116 2133357 2568791 2798844 2975199 3119985 3306464 3434949 3440417 3158414 2778955
11098B778955k98874k50274k93790m49363l45578k19480j11961j03585m6320l4777
$$ 2778955 2480081 2229807 1936017 1486654 1141076 921596 809635 706050 659730 624953
11088F24953p1513j15752j9798M5917l4922m2613n9246q6475p7693o2218j3036
$$ 624953 553440 437688 417890 463807 428885 386272 327026 240551 162858 100640 87604
11077H7604J3612K9315M5876K0876j6683p8661k7172J19776J62743K5927o7292
$$ 87604 101216 130531 176407 197283 180600 101939 74767 194543 357286 383213 315921
11066C15921n2014l1643j09226q7589N26Q9736M0342m3328K3647K8515m4056q4418
$$ 315921 263907 232264 123038 35449 35975 125711 166053 122725 146372 174887 130831 46413
11054D6413m9710Q0714j1769k8430K537L3239l021n3763k9618L3307J35351J7628
$$ 46413 -3297 77417 65648 37218 39755 72994 69973 16210 -13408 19899 155250 172878
11042A72878P5218l2701p2590k5100m0723j4496M5314O5475j5610n3753n7614
$$ 172878 248096 215395 142805 117705 76982 62486 107800 173275 157665 103912 46298
11031D6298j00674r6230k0538L0493N3090O0739k5273K3454K4235L6788l1679
$$ 46298 -54376 -150606 -171144 -140651 -87561 -26822 -52095 -28641 -4406 32382 703
11020G03o0396m9912N48L2429j2353L2890J2437n5160j395O5008M9140O7152J3129
$$ 703 -59693 -109605 -109057 -76628 -88981 -56091 -43654 -98814 -100209 -35201 13939 81091 94220
11007I4220J3253M8763l0780N6878k7702p1272q669l3497o2310O352M7830N0045
$$ 94220 107473 156236 125456 182334 154632 83360 74691 41194 -21116 -14764 33066 83111
10995H3111q041l047J7827j4021p7848j7386N6263K1591l0765r0444j5706L5925
$$ 83111 75070 72023 89850 75829 -2019 -19405 36858 58449 27684 -62760 -78466 -42541
10983d2541o1018j8296P0301N1843K3000n7707n1122O358j3141M7614O0381R0278
$$ -42541 -103559 -121855 -51554 289 23289 -34418 -85540 -79182 -92323 -44709 15672 105950
10971A05950p8299j28992j7661j7223N6679l0169o0985o0461k8012R2169J64864
$$ 105950 27651 -101341 -119002 -136225 -79546 -109715 -170700 -231161 -259173 -167004 -2140
10960b140L6877n2412O9650K1916j5891m427K8863N608J136l4857m2283n2469
$$ -2140 34737 -17675 51975 73891 58000 53573 82436 88044 89180 54323 12040 -40429
10948d0429K5582J29067J20927n0679q5547p7253M4242l5573j9339K0765q6209
$$ -40429 -14847 114220 235147 184468 98921 21668 65910 30337 10998 31763 -54446
10937e4446m9050M2743K0702j336J4381R905l4156N23Q577l4785K5190o3890p950
$$ -54446 -103496 -60753 -40051 -41387 -27006 -17101 -51257 -50734 -42157 -76942 -51752 -115642 -123592
10924a23592L7441k6698k0941r067k437N1692O4917M5828J3689o0209M9054k8599
$$ -123592 -86151 -112849 -133790 -142857 -145294 -93602 -28685 17143 30832 -29377 19677 -8922
10912h922P938n2040M048j0004m8207P8346J16719L0036k8808J1033k3336M0835
$$ -8922 -984 -53024 -48976 -58980 -107187 -28841 87878 117914 89106 100139 76803 117638
10900A17638L1543p6512k504N0083l9061j45618q6315N5676R0822j7972J0097
$$ 117638 149181 72669 70165 120248 81187 -64431 -150746 -95070 -4248 -22220 -12123
10889a2123j7341j05833J5491K5878K896p094L6918p660p79N5162O848l6559n0314
$$ -12123 -29464 -135297 -119806 -93928 -91032 -98126 -61208 -68868 -69647 -14485 -7637 -44196 -94510
10876i4510j3049O4891N1777K7962n1714L4649J2037r1701m3656J00712P1230
$$ -94510 -107559 -42668 9109 37071 -14643 20006 32043 -59658 -103314 -2602 68628
10865F8628N6361K3858q5052K1120M166q4359m9539K6402N2253k2672P9191M9572
$$ 68628 124989 148847 63795 84915 89081 4722 -44817 -18415 33838 11166 90357 139929
10853A39929l8208q427p0823n1309K4868m4448o0650j0777J4395P9697N3756r0613
$$ 139929 101721 93294 22471 -28838 -3970 -48418 -109068 -119845 -105450 -25753 28003 -62610
10841f2610j2707O7859P828K1099p7315M0092M3536L1170k6895j01600n1705K8935
$$ -62610 -75317 -7458 370 21469 -55846 -15754 27782 58952 32057 -69543 -121248 -92313
10829i2313M6341K8856P3371o438m9855n4250m6305k9326O2110M4504K7914l9166
$$ -92313 -45972 -17116 56255 49817 -38 -54288 -100593 -129919 -67809 -23305 4609 -34557
10817c4557m7629M1096K1002M8318J182J0127J0317o3192j2443n0918M1280N9437
$$ -34557 -82186 -41090 -20088 28230 29412 39539 49856 -13336 -25779 -76697 -35417 24020
10805B4020o3094j9984k1481p1400j190n3214k8074K5147O0508J1139R120Q4842
$$ 24020 -39074 -59058 -80539 -151939 -153129 -206343 -234417 -209270 -148762 -137623 -128503 -43661
10793d3661M412J0105L1053l0618J7246l3401k4580O1012O6202O4012p2877j09833
$$ -43661 -39249 -29144 1909 -28709 -11463 -44864 -69444 -8432 57770 121782 48905 -60928
10781f0928n7608K838m1059k7494J12842J22861O1174p6193o0548M6047J0837
$$ -60928 -118536 -115698 -156757 -184251 -71409 51452 112626 36433 -24115 21932 32769
10770C2769q4843j14849n7084r723m0220O636O036J6052J47697M6988j7820p565
$$ 32769 -52074 -166923 -224007 -233730 -273950 -267314 -261278 -245226 -97529 -50541 -68361 -75926
10758g5926o8279q092J08439J35833K1675n4493N0401M9839L7753n8133j19027
$$ -75926 -144205 -152297 -43858 91975 113650 59157 109558 159397 197150 139017 19990
10747A9990r1844L1727J14744P5084n5169l5460M8130J71472J23478N3987r1406
$$ 19990 -71854 -40127 74617 149701 94532 59072 107202 278674 402152 456139 364733
10736C64733p9625j27097j33552l4319l1216j5890Q9515P0708L3268m4023r1287
$$ 364733 285108 158011 24459 -9860 -41076 -56966 32549 103257 136525 92502 1215
10725A215o4877p281J1461O0267k1799J0867k9465J4230J0899o0846J03983R4
$$ 1215 -63662 -70943 -59482 785 -21014 -10147 -39612 -25382 -14483 -75329 28654 28748
10713B8748l3713j8709P4407Q2481q7627j3427m0806k8757j7012k6150P9879N7600
$$ 28748 -4965 -23674 50733 133214 45587 32160 -8646 -37403 -54415 -80565 -686 56914
10701E6914J4415q0364J3651J043m0853N3194Q5310r2102J6766k8509l1991j3212
$$ 56914 71329 -9035 4616 5659 -35194 18000 103310 11208 27974 -535 -32526 -45738
10689d5738L1964q830p5416K4111L7597n3531l436J00636m8460L6926P8127k8831
$$ -45738 -13774 -22604 -98020 -73909 -36312 -89843 -93279 7357 -41103 -4177 73950 45119
10677D5119o5921m5425J5617N9784j09341n4603J2001N6293Q0853P5075k1379
$$ 45119 -20802 -66227 -50610 9174 -100167 -154770 -142769 -86476 -5623 69452 48073
10666D8073j25204l9082R2611N6020N1889P981m0886o0253m0362L601m2360J9063
$$ 48073 -77131 -116213 -23602 32418 84307 92288 51402 -8851 -49213 -45612 -87972 -68909
10654f8909M8166R819N411N1372j4305q4221m2418j9516j9212J2707Q0159N9684
$$ -68909 -20743 -10924 -5513 45859 31554 -52667 -95085 -114601 -133813 -121106 -40947 18737
10642A8737J0735l1817k3892j7502j1769j2945k6582J00846M8797j0470j4087
$$ 18737 29472 -2345 -26237 -43739 -55508 -68453 -95035 5811 54608 44138 30051
10631C0051M6360q0255j52714N3569J00862m561l5521N6771k720M277N8379q365
$$ 30051 76411 -3844 -156558 -102989 -2127 -6688 -42209 14562 11842 16119 74498 66133
10619F6133p241j04417L038L735o5029m6888O1086J06597J9483l7566r4341k3092
$$ 66133 58892 -45525 -42487 -38752 -103781 -150669 -89583 17014 36497 -1069 -95410 -118502
10607a18502K9278o6932m6256j1180k5183Q0908l8213L8825L8067L7922K139k9143
$$ -118502 -89224 -156156 -202412 -213592 -238775 -157867 -196080 -157255 -119188 -81266 -79127 -108270
10595a08270N1944P0928J5922p1349K955N9962M0497p5932m5677l3875j8038J7108
$$ -108270 -56326 14602 30524 -40825 -37870 22092 62589 -13343 -59020 -92895 -110933 -93825
10583i3825j6328L3020m0341p1708K5894P8744l9377N5425P7844P0065l6880k9470
$$ -93825 -110153 -77133 -117474 -189182 -163288 -84544 -123921 -68496 9348 79413 42533 13063
10571A3063J0229m812Q373m0877p3359j4811j09p9704L2150O0603l9786J1355
$$ 13063 23292 18480 26853 -14024 -87383 -102194 -102303 -182007 -149857 -89254 -129040 -117685
10559a17685j037J9215R914L4905n238n6326L3050l8532m246K5104Q9622J1790
$$ -117685 -118722 -99507 -89593 -54688 -59926 -116252 -83202 -121734 -125980 -100876 -11254 536
10547E36M1594L6156k3095L0653J0875l5366j8842M5035K8974o8563q3042n1114
$$ 536 42130 78286 55191 85844 96719 61353 42511 87546 116520 47957 -35085 -86199
10535h6199K540M1368j12012P1989R3327Q5842n788M6141n4305n1259J9157L9430
$$ -86199 -83659 -42291 -154303 -82314 11013 96855 91067 137208 82903 31644 50801 90231
10523I0231P6258j05808j29990o6539N9808P8966O6192L8279o1313m8340M3975
$$ 90231 166489 60681 -69309 -135848 -76040 2926 69118 107397 46084 -2256 41719
10512D1719m7358j5788n7445J4437N912j2210j5850R7869J9895k1597j18241r583
$$ 41719 -5639 -21427 -78872 -64435 -58523 -70733 -86583 11286 31181 9584 -108657 -118240
10500a18240J09456l6917p7750m344J5816P1701j2735k3623M2216m5554J2939
$$ -118240 -8784 -45701 -123451 -127795 -111979 -40278 -53013 -76636 -34420 -79974 -67035
10489f7035J0711J1684M5467j5732r3906l1531p6698l1970Q2883N1483N943O6200
$$ -67035 -56324 -44640 827 -14905 -108811 -140342 -217040 -249010 -166127 -114644 -108701 -42501
10477d2501K4129k606N1629n4719j29622M8857L7438p9427N1948J16138L8526
$$ -42501 -18372 -20978 30651 -24068 -153690 -104833 -67395 -146822 -94874 21264 59790
10466E9790n0649Q97j7707m4026k2519j71K6652L7695l4655k8464J8126L3574
$$ 59790 9141 10038 -7669 -51695 -74214 -74385 -47733 -10038 -44693 -73157 -55031 -21457
10454b1457K3935r552k6663k1224N8265Q7151N4673n4705q731l7059K2300j2606
$$ -21457 2478 -7074 -33737 -54961 3304 90455 145128 90423 81692 44633 66933 54327
10442E4327p9576m0878J1261J8152O946N6152O8628l8552p4389n3392j9258k6648
$$ 54327 -25249 -66127 -54866 -36714 -29768 26384 95012 56460 -17929 -71321 -90579 -117227
10430a17227M8602K622j6862P7432j6515l116j5668j0472R3649N1499L1049R848
$$ -117227 -68625 -66003 -82865 -5433 -21948 -25064 -40732 -51204 42445 93944 124993 134841
10418A34841P5328N0377L729J4923j0427M1414O1184K9156j3175m5852q6009K4405
$$ 134841 210169 260546 264275 279198 268771 310185 371369 400525 387350 341498 255489 279894
10406B79894Q5518N2320j795L0516l7246j17813j51042r0269j4112K8696O4663
$$ 279894 365412 417732 415937 446453 409207 291394 140352 50083 35971 64667 129330
10395A29330n3572q5827M5894M1630n9466L7176M9104K5476k878p3728J295Q1007
$$ 129330 75758 -10069 35825 77455 17989 55165 104269 129745 126867 53139 54434 135441
10383A35441l8566j3530M3192J8952J6124R479m3122k3554P5088L6685j2857K8903
$$ 135441 96875 83345 126537 145489 161613 171092 127970 104416 179504 216189 203332 232235
10371B32235J8029P8458P3833O3411O5683J3626o667N6833P7082N622O0743Q3254
$$ 232235 250264 328722 402555 465966 531649 545275 538608 595441 672523 678145 738888 822142
10359H22142P8975k8111j35832r6435K4986O420m689r9603o4844o8380j22473
$$ 822142 901117 873006 737174 640739 665725 672145 667456 567853 503009 434629 312156
10348C12156r9491R0618n70p1222n945K6340l5006n2807k9041J1167m1546L3184
$$ 312156 212665 303283 302713 231491 225546 251886 216880 164073 135032 146199 104653 137837
10336A37837j0756m3887L4547M798o254m719P255m4950M8551O4669J495K9999
$$ 137837 127081 83194 117741 122539 116285 111566 118821 73871 122422 187091 188586 218585
10324B18585K4648j5695K7522j1778J9078L9528M2305k2405K605J5215L805Q2716
$$ 218585 243233 227538 255060 243282 262360 301888 344193 321788 324393 339608 343413 426129
10312D26129P6445M4393r6514q9676P7387J12228L5542l8124m8252r4751m3225
$$ 426129 502574 546967 450453 360777 438164 550392 585934 547810 499558 404807 361582
10301C61582O905j9805l9369M2857J7573p4342n9746K3111O6449q3894p5765M4694
$$ 361582 368487 348682 309313 352170 369743 295401 235655 258766 325215 241321 165556 210250
10289B10250J3909L3258j0872m1138l4637O483N4004R928j50341j11141L3931
$$ 210250 224159 257417 246545 205407 170770 177253 231257 241185 90844 -20297 13634
10278A3634j674J1536n0257J0581q947J07459O51n4888J8958N1313J39241K3553
$$ 13634 11960 23496 -26761 -16180 -25127 82332 82983 28095 47053 98366 237607 261160
10266B61160j59214j22911p596J0921m4079J5723Q1240k8115r776K838J2896N0310
$$ 261160 101946 -20965 -28561 -17640 -61719 -45996 35244 7129 -2647 191 13087 63397
10254F3397K7471m6064m0903m7893l7982j5994P5920N0637J1184j2015r282L307
$$ 63397 90868 44804 3901 -43992 -81974 -97968 -22048 28589 39773 27758 18476 21783
10242B1783q743N2954j7829n6387P4965l2564n8582P3304q593R035O495q9185
$$ 21783 13040 65994 48165 -8222 66743 34179 -24403 48901 40308 49343 55838 -33347
10230c3347O719M399j9879O1123P7000K8452M3608j16651j62755l4186M5733P9200
$$ -33347 -26628 -22229 -42108 19015 96015 124467 168075 51424 -111331 -145517 -99784 -20584
10218b0584L7070o5196m6508M2318O0776L8001j01043j1995M930o0995J11000
$$ -20584 16486 -48710 -95218 -52900 7876 45877 -55166 -67161 -62231 -123226 -12226
10207a2226P0131j2276p8022o1636k5155j3206k6593Q2018J6764J2623L0715m8711
$$ -12226 57905 45629 -32393 -94029 -119184 -132390 -158983 -76965 -60201 -47578 -16863 -65574
10195f5574k1026m7262K2498L6946O6877K1536n1152k2673k4954j1050P8729O6920
$$ -65574 -86600 -133862 -111364 -74418 -7541 13995 -37157 -59830 -84784 -95834 -17105 49815
10183D9815q360n9744j7685J2152Q4299O2881j5868k5069o8569m7967q6869J2186
$$ 49815 41455 -18289 -35974 -23822 60477 123358 107490 82421 13852 -34115 -120984 -108798
10171a08798K1625N141l7372k7306K567n9933M4216Q8095O5190N2169Q9854L3643
$$ -108798 -87173 -82032 -119404 -146710 -144143 -204076 -159860 -71765 -6575 45594 135448 169091
10159A69091k7698J4734l9597j36861j7063o1067M2663L8278K959K8889m6569
$$ 169091 141393 156127 116530 -20331 -37394 -98461 -55798 -17520 -14561 14328 -32241
10148c2241m5970p2008O3263P8100p1448r4282j9691j0748M4089K7309j2484N9036
$$ -32241 -78211 -150219 -86956 -8856 -80304 -174586 -194277 -205025 -160936 -133627 -146111 -87075
10136h7075J42694Q4285j09123m64j4655j59407k7836M3494J3445L5129O1344
$$ -87075 55619 139904 30781 30317 15662 -143745 -171581 -128087 -114642 -79513 -18169
10125a8169r615L0643K6374m2313M3857K0234j31980n6804N5719M8721J5101k1338
$$ -18169 -27784 2859 29233 -13080 30777 51011 -80969 -137773 -82054 -33333 -18232 -39570
10113c9570L7742M5772k4451l6587M3005P3422J3401j08561o9800M063N2550N20
$$ -39570 -1828 43944 19493 -17094 25911 99333 112734 4173 -65627 -61564 -9014 -8494
10101h494K8084r0436m1115L0594K7668L7932J1309M9004M1546p736j5504n5814
$$ -8494 19590 -70846 -111961 -81367 -53699 -15767 -4458 44546 86092 78356 62852 7038
10089G038p2855l370P4598m3700l3860N0677K1740r3017o1708k3694J262M2131
$$ 7038 -65817 -69187 5411 -38289 -72149 -21472 268 -92749 -154457 -178151 -176889 -134758
10077a34758O9990Q6148J1190j9749L1717N5480K2394o3034p0203J25332Q615
$$ -134758 -64768 21380 32570 12821 44538 100018 122412 59378 -10825 114507 123122
10066A23122j14864j07055K9646j1110K2492M9998k6746n1627j1685L7257P8429
$$ 123122 8258 -98797 -69151 -80261 -57769 -7771 -34517 -86144 -97829 -60572 17857
10055A7857l0938n4972n3621O0807R4111k4859l4226M2584K6764J506j1939J13962
$$ 17857 -13081 -68053 -121674 -60867 33244 8385 -25841 16743 43507 45013 33074 147036
10043A47036q0143o1626r472J3875L7943j3172m5890K629O0600k1016j5316N1309
$$ 147036 66893 5267 -4205 9670 47613 34441 -11449 -8820 51780 30764 15448 66757
10031F6757J7299l4111n3062J6717l2943o731P9562j4031l808Q1870K3308j6075
$$ 66757 84056 49945 -3117 13600 -19343 -26074 53488 39457 35649 117519 140827 124752
10019A24752m4345l2064K9064m6581j6161j1947O8800M7218n0692L5931j1245
$$ 124752 80407 48343 77407 30826 14665 2718 71518 118736 68044 103975 92730
10008I2730j7846P9956L1685l5427k4503m2153k2631k0335n195l6966n0608J1384
$$ 92730 74884 154840 186525 151098 126595 84442 61811 41476 36281 -685 -51293 -39909
9996c9909Q2933J848J0811k6293M9303J3402q5509k1646L9781M3867K3916j6199
$$ -39909 43024 44872 55683 29390 78693 92095 6586 -15060 24721 68588 92504 76305
9984G6305M2308J4431j6308K2737P0147M6649M3203k0464j48381j1661Q485J7035
$$ 76305 118613 133044 116736 139473 209620 256269 299472 279008 130627 118966 127451 144486
9972A44486k7083K6888m1311m5042r9093J0777L4159m6329K3890P0163N514K4528
$$ 144486 117403 144291 102980 57938 -41155 -30378 3781 -42548 -18658 51505 57019 81547
9960H1547k9058o3659n961q2804P8109L3792j0569L7471l2447j04758m5207M5093
$$ 81547 52489 -11170 -17131 -99935 -21826 11966 1397 38868 6421 -98337 -143544 -98451
9948i8451K353P9299n6581Q951J3711K7413R072k520j1878P1797M4161k2931k8920
$$ -98451 -96098 -16799 -73380 -64429 -50718 -23305 -14233 -16753 -28631 43166 87327 64396 35476
9935C5476k1642K8308o5874p3278j3136P3166N2530L1025n563j896p7845l1308
$$ 35476 13834 42142 -23732 -97010 -110146 -36980 15550 46575 41012 39116 -38729 -70037
9923g0037P6722P5555j6652o1272j7805L1006M3697l2617r078l1826L3446K0571
$$ -70037 6685 82240 65588 4316 -13489 17517 61214 28597 19519 -12307 21139 41710
9911D1710p1556n298P0821k0070o5709k0182J35835M6490N6582J757k8998k1899
$$ 41710 -29846 -35144 35677 15607 -50102 -70284 65551 112041 168623 170380 141382 119483
9899A19483o2055K1642K1608M1156J0571r370K1470M6262K5972r842l8762k7290
$$ 119483 57428 79070 100678 141834 152405 143035 164505 210767 236739 226897 188135 160845
9887A60845j4756j0472P103j3111J5000k8312l6922K9672Q8579P04K2658K0462
$$ 160845 146089 135617 142720 129609 144609 116297 79375 109047 197626 198330 220988 241450
9875B41450L0816l3146j02226k2638N5170l2553n4826o065N2519l019n4520K128
$$ 241450 272266 239120 136894 114256 169426 136873 82047 75982 128501 125482 70962 73090
9863G3090p199Q609j5497m3296n088O2309K6497M3726j17846j4648N9121J07636
$$ 73090 65891 74500 59003 15707 10619 72928 99425 143151 25305 10657 69778 177414
9851A77414R5030P0752J08328J7009Q9960Q0464J20684J39871j264K86L9280J09615
$$ 177414 272444 343196 451524 468533 558493 638957 759641 899512 898248 898534 937814 1047429
9839A047429O9229N6003j04411j82148j58512j36575j02756r4675o4916j01451
$$ 1047429 1116658 1172661 1068250 886102 727590 591015 488259 393584 328668 227217
9829B27217Q3500J67660k3312m8519K2126J1547m4758j1318K158k3975j05716
$$ 227217 310717 478377 455065 406546 428672 440219 395461 384143 386301 362326 256610
9818B56610r0665K3437J5335L7245m119M7682K4490L7173L6121l725j290L3324
$$ 256610 165945 189382 204717 241962 237843 285525 310015 347188 383309 379584 378294 411618
9806D11618l1065j21652J9130J79369K34844N1058l3120J4061J6914K6011K0689
$$ 411618 380553 258901 278031 457400 692244 743302 710182 724243 741157 767168 787857
9795G87857J1718l3949l3832M2682J5897n9388n4017o8365r0918L7368K1150o5346
$$ 787857 799575 765626 731794 774476 790373 730985 676968 608603 517685 555053 576203 510857
9783E10857j8640J0289k8523k4769P5230j3893j765O4781o107N4720o9690p8310
$$ 510857 492217 502506 473983 449214 524444 510551 508786 573567 567460 622180 552490 474180
9771D74180r6104R3885p5099o3525n6804k0493O669k9116Q5842J87463M3171J52923
$$ 474180 378076 471961 396862 333337 276533 256040 262709 233593 319435 506898 550069 702992
9759G02992J38191l425L1897K5897j260j39992j12433o6762M5134N3540J927J8775
$$ 702992 841183 837758 869655 895552 894292 754300 641867 575105 620239 673779 675706 694481
9747F94481Q8712l7840o6301q1366j3286m1816k0382K5199M7816L495Q1908q062
$$ 694481 783193 745353 679052 597686 584400 542584 522202 547401 595217 598712 680620 672558
9735F72558q7837j64973m2390M8196J3560r4557j13255J0058K8518K098m8549
$$ 672558 584721 419748 377358 425554 439114 344557 231302 241360 269878 271976 223427
9724B23427n2460J16581J33987p1995m0627R3544P4909Q7473k039q268j58118
$$ 223427 170967 287548 421535 349540 308913 402457 477366 564839 562800 554532 396414
9713C96414n4309M163o8n2568J4895M4335O7709m9313r5698M210M4948N438n0631
$$ 396414 342105 346268 346200 293632 308527 352862 420571 371258 275560 279770 324718 330156 279525
9700B79525j4543K4032o313l2417j2536l471M9944k0564q2672M0037n2709j08138
$$ 279525 264982 289014 282701 250284 237748 234277 284221 263657 180985 221022 168313 60175
9688F0175r341K5432P7981J00069K6912o3367J3642m0680k477J40430J2768j12776
$$ 60175 50834 76266 154247 254316 281228 217861 231503 190823 188346 328776 341544 228768
9676B28768j35981m3347Q7289k8480o8008P239L2420J07095K1838q735K9215K982
$$ 228768 92787 49440 136729 108249 40241 47480 79900 186995 208833 200098 229313 232295
9664B32295l4276q3144m2699J03947l707L5119K6983p3829j3140M8046l9066L7867
$$ 232295 198019 114875 72176 176123 172416 207535 234518 160689 147549 195595 156529 194396
9652A94396m887q0965J0281M8281P7461K9990m5578r7250M437J7064L0844J5417
$$ 194396 189509 108544 118825 167106 244567 274557 228979 131729 136166 153230 184074 199491
9640A99491k3465m8922l462N405j07153j35274L7356J38256N4442K5197l0828
$$ 199491 176026 127104 123642 129047 21894 -113380 -76024 62232 116674 141871 111043
9629A11043N5369M1672K1455J3174l0568m9279p3761K0440Q5234R4849M5639l2336
$$ 111043 166412 208084 229539 242713 212145 162866 89105 109545 194779 289628 335267 302931
9617C02931l3397O360r4521q4808m5579l139N697R808P8123J6320o875L9936j8337
$$ 302931 269534 275894 181373 96565 50986 47847 53544 63352 141475 157795 150920 190856 172519
$$ [...]
##END NTUPLES=NMR SPECTRUM
##END=
