##TITLE=Analysis number 322042
Compound Code cc 50322
Book Reference 438/190
Project Code adrs
Chemist Name antons
##JCAMPDX= 6.0         $$ Bruker NMR JCAMP-DX V2.0
##DATA TYPE= NMR SPECTRUM
##DATA CLASS= NTUPLES
##ORIGIN= Bruker BioSpin GmbH
##OWNER= nmr
$$ XWIN-NMR		Version 3.5
$$ Mon Sep 11 12:33:03 2006 GMT Daylight Time (UT+1h)  MAYBRIDGE\nmr@NMR_250MHZ
##.OBSERVE FREQUENCY= 250.131544655141
##.OBSERVE NUCLEUS= ^1H
##.ACQUISITION MODE= SIMULTANEOUS (DQD)
##.ACQUISITION SCHEME= undefined
##.AVERAGES= 16
##.DIGITISER RES= 18
##SPECTROMETER/DATA SYSTEM= dpx250
##.PULSE SEQUENCE= zg30
##.SOLVENT NAME= CDCl3
##.SHIFT REFERENCE= (INTERNAL, CDCl3, 0, 16.522)
##AUDIT TRAIL= $$ (NUMBER, WHEN, WHO, WHERE, WHAT)
$$ ##TITLE= Audit trail, XWIN-NMR		Version 3.5
$$ ##JCAMPDX= 5.01
$$ ##ORIGIN= Bruker BioSpin GmbH
$$ ##OWNER= nmr
$$ C:\u/data/dgb/nmr/ADRS/430/pdata/1/auditp.txt
$$ ##AUDIT TRAIL=  $$ (NUMBER, WHEN, WHO, WHERE, WHAT)
(   1,<2006-09-11 12:32:42.63 +100>,<MAYBRIDGE\nmr>,<NMR_250MHZ>,
      <created by zg, POWCHK disabled, PULCHK disabled
       configuration hash MD5:
       E2 DF 36 D8 04 B2 41 60 5A D7 A3 38 5A 4B D0 FE
       data hash MD5: 64K
       9C 7D 2B 64 18 1B 1D 7A A1 88 D3 40 81 18 88 3B>)
(   2,<2006-09-11 12:32:54.32 +100>,<MAYBRIDGE\nmr>,<NMR_250MHZ>,
      <Start of raw data processing
       ef LB = 0.3 FT_mod = 6 PKNL = 1 SI = 32K 
       data hash MD5: 32K
       3F 13 28 22 0E AB B0 10 59 0B 16 3A 7F 63 4B 62>)
(   3,<2006-09-11 12:32:56.02 +100>,<MAYBRIDGE\nmr>,<NMR_250MHZ>,
      <apk 
       data hash MD5: 32K
       AE 80 06 89 E6 09 77 D8 94 DA D8 FB B1 55 4B F8>)
(   4,<2006-09-11 12:32:56.85 +100>,<MAYBRIDGE\nmr>,<NMR_250MHZ>,
      <abs ABSG = 5 
       data hash MD5: 32K
       87 3B DC BF AC D8 77 01 BC 7F E3 F8 93 01 32 55>)
$$ ##END=
$$ 
$$ hash MD5
$$ 71 D1 DA 45 57 90 7D 70 21 7F 91 4D F7 64 99 92
##$RELAX= 
##$RELAX= 
##$RELAX= 
##$RELAX= 
##$RELAX= 
##$RELAX= 
##$RELAX= 
$$ Bruker specific parameters
$$ --------------------------
##$DU= <C:\u>
##$EXPNO= 430
##$NAME= <ADRS>
##$PROCNO= 1
##$TYPE= <nmr>
##$USER= <dgb>
##$AMP= (0..31)
100 100 100 100 100 100 100 100 100 100 100 100 100 100 100 100 100 100 
100 100 100 100 100 100 100 100 100 100 100 100 100 100 
##$AQSEQ= 0
##$AQ_mod= 3
##$AUNM= <au_zg>
##$AUTOPOS= <25 >
##$BF1= 250.13
##$BF2= 250.13
##$BF3= 250.13
##$BF4= 250.13
##$BF5= 500.13
##$BF6= 500.13
##$BF7= 500.13
##$BF8= 500.13
##$BYTORDA= 1
##$CFDGTYP= 0
##$CFRGTYP= 5
##$CHEMSTR= <none>
##$CNST= (0..31)
1 1 145 1 1 1 1 1 1 1 1 1 1 1 1 1 1 1 1 1 1 1 1 1 1 1 1 1 1 1 1 1 
##$CPDPRG= <>
##$CPDPRG1= <>
##$CPDPRG2= <>
##$CPDPRG3= <>
##$CPDPRG4= <mlev>
##$CPDPRG5= <mlev>
##$CPDPRG6= <mlev>
##$CPDPRG7= <mlev>
##$CPDPRG8= <mlev>
##$CPDPRGB= <>
##$CPDPRGT= <>
##$D= (0..31)
0 1 0 0 0 0 0 0 0 0.06 0 0 0 0 0 0 0.0002 0 0 0 0 0 0 0 0 0 0 0 0 0 0 
0 
##$DATE= 1157974361
##$DBL= (0..7)
120 120 120 120 120 120 120 120 
##$DBP= (0..7)
150 150 150 150 150 150 150 150 
##$DBP07= 0
##$DBPNAM0= <>
##$DBPNAM1= <>
$$ [...]
##$SUBNAM7= <"">
##$SUBNAM8= <"">
##$SUBNAM9= <"">
##$SW= 20.6930455092707
##$SWIBOX= (0..15)
0 0 3 0 0 0 0 0 0 0 0 0 0 0 0 0 
##$SW_h= 5175.983436853
##$TD= 65536
##$TD0= 1
##$TE= 296.16
##$TE2= 300
##$TE3= 300
##$TEG= 300
##$TL= (0..7)
0 120 120 120 120 120 120 120 
##$TP= (0..7)
150 150 150 150 150 150 150 150 
##$TP07= 0
##$TPNAME0= <>
##$TPNAME1= <>
##$TPNAME2= <>
##$TPNAME3= <>
##$TPNAME4= <>
##$TPNAME5= <>
##$TPNAME6= <>
##$TPNAME7= <>
##$TPOAL= (0..7)
0.5 0.5 0.5 0.5 0.5 0.5 0.5 0.5 
##$TPOFFS= (0..7)
0 0 0 0 0 0 0 0 
##$TUNHIN= 0
##$TUNHOUT= 0
##$TUNXOUT= 0
##$USERA1= <user>
##$USERA2= <user>
##$USERA3= <user>
##$USERA4= <user>
##$USERA5= <user>
##$V9= 5
##$VALIST= <valist>
##$VCLIST= <CCCCCCCCCCCCCCC>
##$VD= 0
##$VDLIST= <DDDDDDDDDDDDDDD>
##$VPLIST= <PPPPPPPPPPPPPPP>
##$VTLIST= <TTTTTTTTTTTTTTT>
##$WBST= 1024
##$WBSW= 4
##$XGAIN= (0..3)
0 0 0 0 
##$XL= 0
##$YL= 0
##$YMAX_a= 401737
##$YMIN_a= -423007
##$ZGOPTNS= <>
##$ZL1= 120
##$ZL2= 120
##$ZL3= 120
##$ZL4= 120
##$ABSF1= 16.522
##$ABSF2= -4.171173
##$ABSG= 5
##$ABSL= 3
##$ALPHA= 0
##$AQORDER= 0
##$ASSFAC= 0
##$ASSFACI= 0
##$ASSFACX= 0
##$ASSWID= 0
##$AUNMP= <proc_1d>
##$AZFE= 0.1
##$AZFW= 0.1
##$BCFW= 0
##$BC_mod= 0
##$BYTORDP= 0
##$COROFFS= 0
##$CY= 12.5
##$DATMOD= 1
##$DC= 0
##$DFILT= <>
##$DTYPP= 0
##$F1P= 14.0000005364418
##$F2P= -0.99999901652339
##$FCOR= 0.5
##$FTSIZE= 32768
##$FT_mod= 6
##$GAMMA= 0
##$GB= 0
##$INTBC= 1
##$INTSCL= 1
##$ISEN= 128
##$LB= 0.3
##$LEV0= 0
##$LPBIN= 0
##$MAXI= 10000
##$MC2= 0
##$MEAN= 0
##$ME_mod= 0
##$MI= 0
##$NCOEF= 0
##$NC_proc= -4
##$NLEV= 6
##$NOISF1= 0
##$NOISF2= 0
##$NSP= 0
##$NTH_PI= 0
##$NZP= 0
##$OFFSET= 16.522
##$PC= 1
##$PHC0= 143.584
##$PHC1= 5.259495
##$PH_mod= 1
##$PKNL= yes
##$PPARMOD= 0
##$PSCAL= 4
##$PSIGN= 0
##$REVERSE= no
##$SF= 250.13
##$SI= 32768
##$SIGF1= 0
##$SIGF2= 0
##$SINO= 400
##$SIOLD= 32768
##$SREGLST= <1H.CDCl3>
##$SSB= 0
##$STSI= 32768
##$STSR= 0
##$SW_p= 5175.98343685301
##$SYMM= 0
##$S_DEV= 0
##$TDeff= 65536
##$TDoff= 0
##$TI= <Analysis number 999999
Compound Code 99
Book Reference 9
Project Code 9>
##$TILT= no
##$TM1= 0
##$TM2= 0
##$TOPLEV= 0
##$USERP1= <user>
##$USERP2= <user>
##$USERP3= <user>
##$USERP4= <user>
##$USERP5= <user>
##$WDW= 1
##$XDIM= 32768
##$YMAX_p= 486822974
##$YMIN_p= -111174
$$ End of Bruker specific parameters
$$ ---------------------------------
##NTUPLES= NMR SPECTRUM
##VAR_NAME=  FREQUENCY,     SPECTRUM/REAL,   SPECTRUM/IMAG
##SYMBOL=    X,             R,               I
##VAR_TYPE=  INDEPENDENT,   DEPENDENT,       DEPENDENT
##VAR_FORM=  AFFN,          ASDF,            ASDF
##VAR_DIM=   32768,         32768,           32768
##UNITS=     HZ,            ARBITRARY UNITS, ARBITRARY UNITS
##FACTOR=    0.157963299565203, 1,           1
##FIRST=     4132.6476996994, 0,             0
##LAST=      -1043.33573715361, 0,           0
##MIN=       -1043.33573715361, -111174,     0
##MAX=       4132.6476996994, 486822974,     0
$$ Real data points
##PAGE= N=1
##DATA TABLE= (X++(R..R)), XYDATA
$$ [...]
18639I409K5020r201k0048J8595r18n266j0976k0078k232J0961j5789r456K0477
$$ 9409 34429 25228 5180 23775 22857 17591 6615 -13463 -15695 -4734 -20523 -29979 -9502
18626i502J6910J2107o021j8625J8400J7016M28l544K390k7470j8109N177J9176
$$ -9502 7408 19515 13494 -5131 13269 30285 30713 27169 29559 2089 -16020 -10843 8333
18613H333j999k1460n764J7282N133J7700j019P433p326l867q956J3960k8991
$$ 8333 6334 -15126 -20890 -3608 1525 19225 18206 25639 18313 14446 5490 19450 -9541
18600i541l759L009J4095L8638j3765k3160m712j5192P939K3141J3521j40l936
$$ -9541 -13300 -10291 3804 42442 28677 5517 805 -14387 -6448 16693 30214 30074 26138
18587B6138J5655l21L281l2956j0169J5061Q42o25P853n168Q427j5641O29J9941
$$ 26138 41793 41472 44753 11797 1628 16689 17531 16906 24759 19591 28018 12377 13006 32947
18573C2947m960K489L2243K4531J6385J9978k591K5990M6229M6662N7802M2585
$$ 32947 27987 30476 62719 87250 103635 123613 121022 147012 193241 239903 297705 340290
18561C40290J9628M9907J8772K2819J0717O343J9120J2486J945j5773l8469l8806
$$ 340290 359918 409825 428597 451416 462133 468476 487596 500082 502027 486254 447785 408979
18549D08979k9724j3357j741k5059o0303o7098j2417j1183j0918l4538j8549k2962
$$ 408979 379255 365898 364157 339098 278795 211697 199280 188097 177179 142641 124092 101130
18537A01130M196J6731R943j4364k5192r49k0996j0990p262L8403J0059j3292
$$ 101130 105326 122057 132000 117636 92444 91495 70499 59509 52247 90650 100709 87417
18525H7417l841j9471p395J0301k2255j575k641n706M716J3618j8607k0105R19
$$ 87417 83576 64105 56710 67011 44756 43181 40540 34834 39550 53168 34561 14456 15375
18512A5375j602M5267K1737N136p130J7631J9087m7297j806N995q341q889j0399
$$ 15375 13773 59040 80777 85913 78783 96414 115501 68204 66398 72393 64052 55163 44764
18499D4764j6856j9035K0611q464k5292J2480K0957L2792k1885N523j0917k547
$$ 44764 27908 8873 29484 21020 -4272 8208 29165 61957 40072 45595 34678 32131
18487C2131K030q689k5323j4281j2779J8600J0691J1990K0242O906k8591L63K7889
$$ 32131 34161 25472 149 -14132 -26911 -8311 2380 14370 34612 41518 12927 13290 41179
18474D1179J9956n907J4441p497j3209j8164j1348j3755o678j2723p800j630k390
$$ 41179 61135 55228 69669 62172 48963 30799 19451 5696 -982 -13705 -21505 -23135 -25525
18461b5525J5097K172j4105R937K1663J5943o78k8702j444q549j2420K5077O155
$$ -25525 -10428 -8256 -22361 -12424 9239 25182 24504 -4198 -5642 -14191 -26611 -1534 4621
18448D621J105j213m365K4075J1505j4043n081J3680J1968j1379l166J9706j0745
$$ 4621 5726 4513 148 24223 35728 21685 16604 30284 42252 30873 27707 47413 36668
18435C6668l928r356J3823L695P890P833o743k8825j8273p974L6318L2650K2457
$$ 36668 32740 23384 37207 40902 48792 56625 49882 21057 2784 -5190 31128 63778 86235
18422H6235J0411l2116j4149j2447P230j5824K2736K4800j634k9536k7571J0350
$$ 86235 96646 64530 50381 37934 45164 29340 52076 76876 75242 45706 18135 28485
18410B8485K2243K117M405p450k8692K2239K6794l677n298m909k0553M41m076
$$ 28485 50728 52845 57250 49800 21108 43347 70141 66464 61166 56257 35704 36145 32069
18397C2069j3824J6111P548k3656l41R802L3365L3722j095m1625k2477q232L710
$$ 32069 18245 34356 41904 18248 17907 27709 61074 94796 93701 52076 29599 21367 25077
18384B5077K4125m882N085m783L353m911j0305j15L903p992j4391o31L3291J099
$$ 25077 49202 44320 49405 44622 47975 43064 32759 32644 36547 28555 14164 13533 46824 47923
18370D7923j1391O527K481j707O041K3966q422k1177k1417R954J223P819J2518
$$ 47923 36532 43059 45540 43833 49874 73840 65418 44241 22824 32778 34001 41820 54338
18357E4338L795j5119J0944P403k5912Q164J8540R941K059o170P549k585J597
$$ 54338 58133 43014 53958 61361 35449 43613 62153 72094 74153 67983 75532 72947 74544
18344G4544j948N527K6393j5899l997j5145j4411j4948K9926J8936L848k7226
$$ 74544 72596 78123 104516 88617 84620 69475 55064 40116 70042 88978 92826 65600
18332F5600m0135j5633l231n512J8498J1057J4945R658L243n296J712p827m465
$$ 65600 25465 9832 6601 1089 19587 30644 45589 55247 58490 53194 54906 47079 42614
18319D2614j9140L2285K5531l901j963o160O970J7490l489J9451K8395M5440L7722
$$ 42614 23474 55759 81290 77389 75426 69266 76236 93726 90237 109688 138083 183523 221245
18306B21245K5205L5101P731M141J8200j560j3451j2123l523J1250J0932J4033
$$ 221245 246450 281551 289282 293423 311623 310063 296612 284489 280966 292216 303148 317181
18294C17181L6182J2716l6439o2152n1532l6395J3858l4632l2344O35m352k2369
$$ 317181 353363 366079 329640 267488 215956 179561 193419 158787 126443 127078 122726 100357
18282A00357n240k0632L1364M9547M6338k834K7596M4467J4632M0474K8292j2126
$$ 100357 95117 74485 105849 155396 201734 198900 226496 270963 285595 326069 354361 342235
18270C42235j2060M988j2868j8791P674J3812P335O778J186j8698n5490n4780
$$ 342235 330175 335163 322295 303504 311178 324990 332325 339103 340289 321591 266101 211321
18258B11321j1936j6629r16k2665k7244K558n7l258J5943R170O823k2588K679
$$ 211321 199385 182756 181840 159175 131931 134489 134432 131174 147117 156287 163110 140522 143201
18245A43201Q343k6124j108j9828J3372M6299L9476J7785k0929l7656o826K0955
$$ 143201 151544 125420 124312 104484 117856 164155 203631 221416 200487 162831 156005 176960
18233A76960j1341R898J3494k2359l834j3142o90n78k9415k9652J6854L7528m401
$$ 176960 165619 175517 189011 166652 162818 149676 148986 148408 118993 89341 106195 143723 139322
18220A39322j2476n120j0707P311k092n83J856M885J8664k0066l577M110K524
$$ 139322 126846 121726 111019 118330 116238 115655 117511 122396 141060 120994 117417 121527 124051
18207A24051L088l184k588P970n852j2193j5664k2715m208P463L8782r375k5878
$$ 124051 127139 123955 121367 129337 123485 111292 95628 72913 68705 76168 114950 105575 79697
18194G9697j5611k104J7707J4448L966J4924l2840k4148J1778K4381L7982r098
$$ 79697 64086 61982 79689 94137 98103 113027 80187 56039 67817 92198 130180 121082
18182A21082k9134K8453M632L0527J3920K5120j4829R199K5168M0676J6767L1850
$$ 121082 91948 120401 125033 155560 169480 194600 179771 188970 214138 254814 271581 303431
18170C03431R855J3767M8346L8644Q75M178j41m008J9549o048J847j7459k2338
$$ 303431 313286 327053 375399 414043 414918 419096 418955 414947 434496 428448 430295 412836 390498
18157C90498j5541j8295m138l060K4320q131J5806O669M825k1026L068q640q829
$$ 390498 374957 356662 352524 349464 373784 365653 381459 388128 392953 371927 374995 366355 357526
18144C57526j2929j1561K8386K5336K6381J8418M077k570J5111J3537R492L738
$$ 357526 344597 333036 361422 386758 413139 431557 435634 433064 448175 461712 471204 474942
18132D74942L6097K8993J1371K1595K5007O3243M0259M3039Q5599Q5852J37690
$$ 474942 511039 540032 551403 572998 598005 661248 701507 744546 830145 915997 1053687
18121A053687J36312K10537K47344L54739O04055R81768J867214L435034M758327
$$ 1053687 1189999 1400536 1647880 2002619 2606674 3588442 5455656 8890690 13649017
18112A3649017M040334K176411J317904L98257J048015K812433k583005p420104
$$ 13649017 17689351 19865762 21183666 21581923 22629938 25442371 22859366 15439262
18104A5439262m898460k763239j651357j074099p37296n09119l71970k75056k14590
$$ 15439262 10540802 7777563 6126206 5052107 4314811 3805692 3433722 3158666 2944076
18095B944076j78366j43702j49368j22189j09319j29948r6773n2121n3014l1788
$$ 2944076 2765710 2622008 2472640 2350451 2241132 2111184 2014411 1962290 1909276 1877488
18085A877488k7385k9622l8978m9572k3462n3853j5973L4053R601J7255J0353
$$ 1877488 1850103 1820481 1781503 1731931 1708469 1654616 1638643 1672696 1682297 1699552 1709905
18074A709905N076N6124O1789N7804J16069J14807J25844J52186J92075K16592
$$ 1709905 1714981 1771105 1832894 1890698 2006767 2121574 2247418 2399604 2591679 2808271
18064B808271K62282K94377L47099M34461M58411N35621O39511Q47133J162535
$$ 2808271 3070553 3364930 3712029 4146490 4604901 5140522 5780033 6627166 7789701
18055G789701J662013K514273L833267N448460O632048O796895O368611O380296
$$ 7789701 9451714 11965987 15799254 21247714 27879762 34676657 41045268 47425564
18047D7425564P386267Q902102R204738O753563L751329K591957K795564L114863
$$ 47425564 54811831 63713933 72918671 79672234 83423563 86015520 88811084 91925947
18039I1925947K129363J32118j162268l252366o669927q039171o726943m793628
$$ 91925947 94055310 94187428 93025160 89772794 83102867 75063696 68336753 63543125
18031F3543125m591676o885247q859626q242590o204155m395943l105758k286597
$$ 63543125 58951449 52066202 43206576 34963986 28759831 24363888 21258130 18971533
18023A8971533j759031j418684j167401j003475q85670p97108o88408o15148n62512
$$ 18971533 17212502 15793818 14626417 13622942 12737272 11940164 11251756 10636608 10074096
18014A0074096n58930n33818m57723m03440l62693l33614l29705k88444k79651
$$ 10074096 9515166 8981348 8523625 8120185 7757492 7423878 7094173 6805729 6526078
18005F526078k68943k70073k45930k04276j80087j82192j94885j84157j49035
$$ 6526078 6257135 5987062 5741132 5536856 5356769 5174577 4979692 4795535 4646500
17996D646500j42482j38066j53309j33086j32046j43415j21836j30213j28916
$$ 4646500 4504018 4365952 4212643 4079557 3947511 3804096 3682260 3552047 3423131
17987C423131j07116r5048j33049r3802j01874q3478p7869j05850p7532m2092
$$ 3423131 3316015 3220967 3087918 2994116 2892242 2808764 2730895 2625045 2547513 2505421
17977B505421p5011q8836n2664m2671o8136n1233m3149r6665q4697m4746k5338
$$ 2505421 2430410 2341574 2288910 2246239 2178103 2126870 2083721 1987056 1902359 1857613 1832275
17966A832275n6762m0391o6009o2646k2844n7651l0450k5439k1980k5861k4471
$$ 1832275 1775513 1735122 1669113 1606467 1583623 1525972 1495522 1470083 1448103 1422242 1397771
17955A397771j6157o0653n8714l8410j4368k6816n5103n7806k9000l2679k6520
$$ 1397771 1381614 1320961 1262247 1223837 1209469 1182653 1127550 1069744 1040744 1008065 981545
17944I81545l7233k7797m670k3897K4620Q197j6037o286j8610k3502j9345k4739
$$ 981545 944312 916515 911845 887948 912568 920765 904728 898442 879832 856330 836985 812246
17932H12246m3868m1169l565q348j6420n679o677r034o2090l5720j7624l4342
$$ 812246 768378 727209 723644 715296 698876 693197 686520 677486 615396 579676 562052 527710
17920E27710k9273j9797k5639r754m4150n3395j6243j3524k5474k5341J6893n801
$$ 527710 498437 478640 453001 443247 399097 345702 329459 315935 290461 265120 282013 276212
17908B76212l9393L100P49L480K6854K8984M2827N610l5689l564j5923R553J8772
$$ 276212 236819 239919 240668 244148 271002 299986 342813 348423 312734 309170 293247 302800 321572
17895C21572J3763L0357r503j6351K1835o117k2494j7942J556j8428q145K826
$$ 321572 335335 365692 356189 339838 361673 355556 333062 315120 316676 298248 290103 292929
17883B92929L219k3740r421o252R495J4310J0355m919K169P961K6676r40K2360
$$ 292929 296148 272408 262987 256735 266230 280540 290895 285976 288145 296106 322782 321842 344202
17870C44202J7505R140j3264j1123M885J8224K842N318J6231J3449M1093k991
$$ 344202 361707 370847 357583 346460 351345 369569 372411 377729 393960 407409 448502 445511
17858D45511r935l0830l1899k5517k2859k3738J8130j4437L1595J0053r479j2814
$$ 445511 435576 404746 372847 347330 324471 300733 318863 304426 336021 346074 336595 323781
17846C23781k390j2545J6195k6133o844j76M662J1009q093K6834p41p550j2437
$$ 323781 321391 308846 325041 298908 292064 291888 296550 307559 299466 326300 325559 318009 305572
17833C05572j4160J4778K0538k0750j1169J7923O624k880J4770L7499J7793k758
$$ 305572 291412 306190 326728 305978 294809 312732 319356 316476 331246 368745 386538 383780
17821C83780k2442j346O100r283p900m468n721L0791L4055j3338o508k1258N0870
$$ 383780 361338 359992 366092 356809 348909 344441 338720 369511 403566 390228 383720 362462 413332
17808D13332N7879O221J9916L947J8418P3082J9565M2733P3199N7970K9195K4358
$$ 413332 471211 477432 497348 501295 519713 592795 612360 655093 728292 786262 815457 839815
17796H39815O6526R9771J14109J09220J46427J48961J60471J95076K23799K42940
$$ 839815 906341 1006112 1120221 1229441 1375868 1524829 1685300 1880376 2104175 2347115
17786B347115L02644L49979L95515N42481P26428R89260J504572K486212M071941
$$ 2347115 2649759 2999738 3395253 3937734 4664162 5653422 7157994 9644206 13716147
17777A3716147N939472O831079O044733M471346L284059L028012L973163L575014
$$ 13716147 19655619 26486698 32531431 37002777 40286836 43314848 47288011 50863025
17769E0863025N5744j919378j318733q20200p47389o30068j28220k42174l714463
$$ 50863025 50918769 48999391 47680658 46860458 46113069 45483001 45354781 45112607 41398144
17760D1398144p733795p626218n316863l438828k233209j461769j010816o99339
$$ 41398144 33664349 26038131 20721268 17282440 15049231 13587462 12576646 11877307
17752A1877307m04198j24287J14579L97277P97100J534549K823034M616294O052716
$$ 11877307 11473109 11348822 11463401 11860678 12657778 14192327 17015361 21631655 27684371
17743B7684371N981478M652434L301041K619098L145910L780405J441509j615922
$$ 27684371 33665849 38318283 41619324 44238422 47384332 51164737 52606246 50990324
17735E0990324j710317j039500r10323q81434n75324q5068j981486o525518q190750
$$ 50990324 49280007 48240507 47330184 46448750 45873426 45788358 43806872 37281354 29090604
17726B9090604o374970m250470k814106j969149j466552j141619q61513o65083
$$ 29090604 22715634 18465164 15651058 13681909 12215357 11073738 10212225 9547142
17718I547142n59343m79188m80400m71628m26293m31896l55330l18874l10839
$$ 9547142 8987799 8508611 8028211 7556583 7130290 6698394 6343064 6024190 5713351
17709E713351k76582k35321j98422k06726j86809j57442j70289j66205j53354
$$ 5713351 5436769 5201448 5003026 4796300 4609491 4452049 4281760 4115555 3962201
17700C962201j29828j37506j36417j27086j24359j19653j20086o0379j00928r4147
$$ 3962201 3832373 3694867 3558450 3431364 3307005 3187352 3067266 3006887 2905959 2811812
17690B811812o8963q2224n3268q1619j04211r6891q8318m6195m7534p0691r3357
$$ 2811812 2742849 2660625 2607357 2525738 2421527 2324636 2236318 2190123 2142589 2071898 1978541
17679A978541p4584o3718p2905m0409j9601l8940n3185m9977o2765l8409l5389
$$ 1978541 1903957 1840239 1767334 1726925 1707324 1668384 1615199 1565222 1502457 1464048 1428659
17668A428659r516j1444m4403m6035n1243m0252l1010n753m0619p9887n059k1330
$$ 1428659 1419143 1407699 1363296 1317261 1266018 1225766 1194756 1189003 1148384 1068497 1063438 1042108
17656A042108m1246l2044k5284j0849l6828l3739l6235n7925l5229j0001l928
$$ 1042108 1000862 968818 943534 932685 895857 862118 825883 767958 732729 722728 718800
17645G18800n923l3037l6149o3802j2948k963k4319k4608J608j986j9482n9306
$$ 718800 712877 679840 643691 579889 566941 563978 539659 515051 516659 514673 495191 435885
17633D35885l3699J2626J1791J6956l0896n41J8520l881m0050j4998j4828q111
$$ 435885 402186 414812 426603 443559 412663 412122 430642 426761 386711 371713 356885 348774
17621C48774Q405j2802L877L061M649j4957k2315p715n409m0850m1329k6753k3286
$$ 348774 357179 344377 348254 351315 355964 341007 318692 310977 305568 264718 223389 196636 173350
17608A73350j0398J192l448j0109r869p202K1778K157q106j4006K389K8378J2089
$$ 173350 162952 164144 160696 150587 140718 133516 155294 157451 149345 135339 137728 166106 178195
17595A78195j4275j5617k8494L025J6824N072P843j883m2641n912M609O415l335
$$ 178195 163920 148303 119809 122834 139658 144730 152573 150690 108049 102137 106746 113161 109826
17582A09826l0921o311K3498j1279L148m783M609J8258j604J9098J0438j9088
$$ 109826 78905 72594 96092 84813 87961 83178 87787 106045 104441 123539 133977 114889
17570A14889J0264J939l8746j1734k193l3069J1274K4121k0320l503k560K6860
$$ 114889 125153 127092 88346 76612 74419 41350 52624 76745 56425 52922 50362 77222
17558G7222O938j6396j4549R531j880O435q410p496J2964L4981P463j1804k7741
$$ 77222 84160 67764 53215 62746 60866 67301 58891 51395 64359 99340 106803 94999 67258
17545F7258j4265k424J0095q754L249J9169L7593J3520J6168k9324j3776l748
$$ 67258 52993 50569 60664 51910 55159 74328 111921 125441 141609 112285 98509 94761
17533I4761K4183K3681J6561L0951N0581N6351M2193K3880O1395N9545L93J4040
$$ 94761 118944 142625 159186 190137 240718 297069 339262 363142 424537 484082 484475 498515
17521D98515N3275K7516J1677J1640P567o875n4826l8019m3077n6833l7667n2074
$$ 498515 551790 579306 590983 602623 610190 603315 548489 510470 467393 410560 372893 320819
17509C20819m8748l9247m8456j5570k7218j8648j0107q087P42j053K1168J9709
$$ 320819 272071 232824 184368 168798 141580 122932 112825 104738 105480 104427 125595 145304
17497A45304R021q459m663j6449J764M352k0947k1949O844k3719P96r8k0455k3048
$$ 145304 154325 145866 141203 124754 126518 130870 109923 87974 94818 71099 71895 71797 51342 28294
17483B8294k857J468J2232K6876R018j8950l4163K025J1790m484K2430N146Q667
$$ 28294 25437 26905 39137 66013 75031 56081 21918 23943 35733 31249 53679 58825 67492
17470F7492m0450j5017l228R513J9352k0512k5282L803r790N656J9716m653j4379
$$ 67492 27042 12025 8797 18310 37662 17150 -8132 -4329 -14119 -8463 11253 6600 -7779
17457g779j5328P26J188N850k8501j306L0875K8502Q286j833J0421N9090L9184
$$ -7779 -23107 -22381 -21193 -15343 -43844 -45150 -14275 14227 22513 20680 31101 90191 129375
17444A29375O519j3569l6599L0819L4097k1106m4127j0707k2923n359P204j8865
$$ 129375 135894 122325 85726 116545 150642 129536 85409 74702 51779 46420 53624 34759
17432C4759k5494l198j027j9170j737j9326J145l079j1202J224j0498j632Q797
$$ 34759 9265 6067 5040 -14130 -15867 -35193 -34048 -37127 -48329 -47105 -57603 -59235 -50438
17419e0438J5921L5501j896k1525J3261n682J170K4600J7106K761n1260m2908
$$ -50438 -34517 984 -912 -22437 -9176 -14858 -13688 10912 28018 30779 -20481 -63389
17407f3389k0181O230K4487K7539M446J0198P763K22k0441k0649k877j1041M847
$$ -63389 -83570 -77340 -52853 -25314 -20868 -10670 -2907 -2685 -23126 -43775 -46652 -57693 -52846
17394e2846L0163n972K535n610K1477J3828k054O799J2021j0788j7897j037J627
$$ -52846 -22683 -28655 -26120 -31730 -10253 3575 1521 8320 20341 9553 -8344 -9381 -7754
17381g754N373J4463M490k6380j5477J2539K0532J8420m57k2533k6169k359J2075
$$ -7754 -2381 12082 16572 -9808 -25285 -12746 7786 26206 25749 3216 -22953 -25312 -13237
17368a3237k053q52j7379j8974R274K0858J8060P323M720K604k999l956j7953
$$ -13237 -15290 -16142 -33521 -52495 -43221 -22363 -4303 3020 7740 10344 7345 3389 -14564
17355a4564j1215j8144K7559J4610k3667k674J7334M8365j2713k2299J0755L3703
$$ -14564 -25779 -43923 -16364 -1754 -25421 -28095 -10761 37604 24891 2592 13347 47050
17343D7050l14p866l3550k2986J2774l972j6000k6757k768K5239L5234M261k3768
$$ 47050 46736 38870 5320 -17666 -4892 -8864 -24864 -51621 -54389 -29150 6084 10345 -13423
17330a3423N048j1467K93J8280j80j849k2207n232J6816K557k1576k481J5688
$$ -13423 -8375 -19842 -19549 -1269 -1449 -3298 -25505 -30737 -13921 -11364 -32940 -35421 -19733
17317a9733J4920M265j0134p412K961k1586K895j1067m1455N930L3364J2077k2157
$$ -19733 -4813 -548 -10682 -18094 -15133 -36719 -33824 -44891 -86346 -80416 -47052 -34975 -57132
17304e7132r68L01r82L1783J4409l574K8019n655k1547m055L1863L578k8443J8191
$$ -57132 -58100 -57799 -58781 -26998 -12589 -16163 11856 6201 -15346 -19401 12462 16040 -12403 5788
17290E788J267k355m224k2962k0468J5118O366K0833J7072k7808M825j0617Q662
$$ 5788 7055 4700 476 -22486 -42954 -27836 -21470 -637 16435 -11373 -6548 -17165 -8503
17277h503J5755p76J907K2769M320n3684o501K1742P700Q753j590k6711k3040
$$ -8503 7252 6476 8383 31152 35472 -18212 -24713 -2971 4729 13482 11892 -14819 -37859
17264c7859j1790J2415K869P208Q388J4156l955N09l142O455Q437j9240J5663
$$ -37859 -49649 -37234 -34365 -27157 -18769 -4613 -8568 -8059 -11201 -4746 3691 -15549 114
17251A14n871l3720l5673j2306L0512K6962K3340j2637J438L5892N8362K8576
$$ 114 -5757 -39477 -75150 -87456 -56944 -29982 -6642 -19279 -17841 18051 76413 104989
17239A04989K0161J9457k641l182M6359M9829K4591J2707j2644q451K3484l2200
$$ 104989 125150 144607 141966 138784 185143 234972 259563 272270 259626 251175 274659 242459
17227B42459j3870P295J9378J5448k1131o6242o7729k8475k4031L07R408O330
$$ 242459 228589 235884 255262 270710 249579 183337 115608 87133 63102 63409 72817 79147
17215G9147l9190j7559R629L367K6936K8205J4003K98J5936K3368J3648L666l823
$$ 79147 39957 22398 32027 35394 62330 90535 104538 104836 120772 144140 157788 161454 157631
17202A57631K0873L0652L9797O216m577q715J9871j2333k0401L156K9695m3126
$$ 157631 178504 209156 248953 255169 250592 241877 261748 249415 229014 232170 261865 218739
17190B18739p1068k4075k0361j3611J177O342j4116l483r074K5688J9002k189
$$ 218739 147671 123596 103235 89624 90801 97143 83027 79544 70470 96158 115160 112971
17178A12971k9023j4492k5611j4749N96l787l0218o16K0518R917j8457Q64K5650
$$ 112971 83948 69456 43845 29096 29692 25905 -4313 -4929 15589 25506 7049 7913 33563
17165C3563L439O786m2393j6322J6410K7525J0559L561k7933j0903R01p639K7707
$$ 33563 37002 43788 1395 -14927 1483 29008 39567 43128 15195 4292 5193 -2446 25261
17152B5261l1329q583K8937J9734k6026l9395q145K7273K1348O330k1299k1036
$$ 25261 -6068 -14651 14286 34020 7994 -31401 -39546 -12273 9075 15405 -5894 -26930
17140b6930K573J7062J2001K2370Q887j4364k002j5459J796j2454k1510k151J7924
$$ -26930 -24357 -7295 4706 27076 35963 21599 19597 4138 5934 -6520 -28030 -30181 -12257
17127a2257P351P39K709J2400j1073k1158Q204J7516j2891K896K634j2324p231
$$ -12257 -4906 -4167 -1458 10942 -131 -21289 -13085 4431 -8460 -5564 -2930 -15254 -22485
17114b2485K3685k052k524j9359q362j353J9047K083l249l92J8137k6189j9718
$$ -22485 1200 -852 -3376 -22735 -31097 -32450 -13403 -11320 -14569 -14961 3176 -23013 -42731
17101d2731o241M0679J7247p9J3961L224j5371l8709j4671K0736J3490l6786o770
$$ -42731 -48972 -8293 8954 8875 22836 26060 10689 -28020 -42691 -21955 -8465 -45251 -52021
17088e2021K0260J6299K0966J0846o853J3431J5200j8132l1060j6311N866K5346
$$ -52021 -31761 -15462 5504 16350 9497 22928 38128 19996 -11064 -27375 -21509 3837
17076C837J8734M71j2433J1808j6684k3355K1317J6796L7169l023j8026j8207
$$ 3837 22571 23042 10609 22417 5733 -17622 3695 20491 57660 54637 36611 18404
17064A8404j0640k220j3596j5929k893k002J1489j1227j4622j242k686r898J5198
$$ 18404 7764 5544 -8052 -23981 -26874 -28876 -17387 -28614 -43236 -44478 -47164 -57062 -41864
17051d1864j2459k7228K8281Q574L0844J1545J4350M888j1426j4532p258J5077
$$ -41864 -54323 -81551 -53270 -44696 -13852 -2307 12043 16931 5505 -9027 -16285 -1208
17039a208N486J672l7049j6310J3558L532k9707l1899J1163L5248J8569N334J7456
$$ -1208 4278 5950 -31099 -47409 -33851 -30319 -60026 -91925 -80762 -45514 -26945 -21611 -4155
17026d155k8248L138N98l1079l786J2108K4692J7401k792J5793Q56J340M260k2319
$$ -4155 -32403 -29265 -28667 -59746 -63532 -51424 -26732 -9331 -12123 3670 4526 5866 10126 -12193
17012a2193J5651Q811j9161p69m586j7199j6965n015M346J7530K7886o342o156
$$ -12193 3458 12269 -6892 -7661 -12247 -29446 -46411 -51426 -47080 -29550 -1664 -8006 -14162
16999a4162J7717P498k0743O868j0587J1090j1203m3838R248L8826J5089j0744
$$ -14162 3555 11053 -9690 -2822 -13409 -2319 -13522 -57360 -48112 -9286 5803 -4941
16987d941j5954j0695J643J4355l079K896n149O596K128O745J200J8070J6764
$$ -4941 -20895 -31590 -29947 -15592 -18671 -15775 -20924 -14328 -12200 -5455 -4255 13815 30579
16974C0579j833l5351j4273J4920k7193J0510R117J4421j4717J3009j6203j5502
$$ 30579 28746 -6605 -20878 -5958 -33151 -22641 -13524 897 -13820 -811 -17014 -32516
16962c2516j8623K483J1390J331j3509Q934J967R653K7034j0467k7593k725O001
$$ -32516 -51139 -48656 -37266 -35935 -49444 -40510 -38543 -28890 -1856 -12323 -39916 -42641 -36640
16949c6640L969j5532m395m994l367K6211K1282J2788m757j3144k870L480J1420
$$ -36640 -32671 -48203 -52598 -57592 -60959 -34748 -13466 -678 -5435 -18579 -21449 -17969 -6549
16936f549J5494o917J767J1209m60p825M71l6312p769J4100Q103J3617J9403K84
$$ -6549 8945 2028 3795 15004 14544 6719 7190 -29122 -36891 -22791 -14688 -1071 18332 18616
16922A8616j4043J8120j136R021j12k0775K018m851j2271l200m680j1003q935
$$ 18616 4573 22693 21557 30578 30466 9691 11709 6858 -5413 -8613 -13293 -24296 -33231
16909c3231K1836J5024R884J7997l003J0430Q502p146k5572k8541p900J0879m938
$$ -33231 -11395 3629 13513 31510 28507 38937 47439 40293 14721 -13820 -21720 -10841 -15779
16896a5779n074J3702K429q637j7589J3155N740j845n735k1077m674K715k5129
$$ -15779 -20853 -7151 -4722 -13359 -30948 -17793 -12053 -13898 -19633 -40710 -45384 -42669 -67798
16883f7798r319K4560J6577L4036L3645m158k1366l9283j0336P972M849K5636
$$ -67798 -77117 -52557 -35980 -1944 31701 27543 6177 -33106 -43442 -35470 -30621 -4985
16871d985j8900l400K3426J1440K1654j7176l080L526R837l808k5297j4317J8039
$$ -4985 -23885 -27285 -3859 7581 29235 12059 8979 12505 22342 18534 -6763 -21080 -3041
16858c041J7036k0903k9824j0701m371L3458R516L0329J9207M295k5985l0222
$$ -3041 13995 -6908 -36732 -47433 -51804 -18346 -8830 21499 40706 45001 19016 -11206
16846a1206k6817p227Q867J461j5161K014j862J654L740L72k2326J83P523M303
$$ -11206 -38023 -45250 -36383 -34922 -50083 -48069 -49931 -48277 -44537 -44165 -66491 -66308 -58785 -54482
16832e4482J544P186R929L9173J6348R027j0296l7319j16K8329j5300j5665j4372
$$ -54482 -52938 -45752 -35823 3350 19698 28725 18429 -18890 -19006 9323 -5977 -21642 -36014
16819c6014l201l131K0934Q004k2170K9099Q794j8020j1991P056J4536O358l2579
$$ -36014 -39215 -42346 -21412 -13408 -35578 -6479 2315 -15705 -27696 -20640 -6104 254 -32325
16806c2325l8811J5008J9327J4179L3757K8215j6922m1720M553J3261L3976N040
$$ -32325 -71136 -56128 -36801 -22622 11135 39350 22428 -19292 -14739 -1478 32498 37538
16794C7538l6457k3172o1j0206j206K484M8940P792j1414k9902J4610K53j5784
$$ 37538 1081 -22091 -22152 -32358 -33564 -31080 17860 25652 14238 -15664 -1054 -801 -16585
16781a6585k4933l6451P373K2166J9093J0993j4561P132O138M991p674j1342j3912
$$ -16585 -41518 -77969 -70596 -48430 -29337 -18344 -32905 -25773 -19635 -14644 -22318 -33660 -47572
16768d7572j7128R127K5938O853J4415J0691j1932P119m218k29j6906J1931M2210
$$ -47572 -64700 -55573 -29635 -22782 -8367 2324 -9608 -2489 -6707 -6936 -23842 -11911 30299
16755C0299j0048j0934n335J8775J6570k722j2189Q459q099k0813k4863j3072
$$ 30299 20251 9317 3982 22757 39327 36605 24416 32875 24776 3963 -20900 -33972
16743c3972K3532J9718K1919P375J8733L823l8980k0174n944J6892J5568j8079
$$ -33972 -10440 9278 31197 38572 57305 61128 22148 1974 -3970 12922 28490 10411
16731A0411J237j4189l830j2518k069j3193j5119m756K1113J0713K048r968j4816
$$ 10411 11648 -2541 -6371 -18889 -20958 -34151 -49270 -54026 -32913 -22200 -20152 -30120 -44936
16718d4936K0964L20k710J1765k41k4147k5077j1412N2500R799r06K1987k0038
$$ -44936 -23972 -23652 -26362 -14597 -14838 -38985 -64062 -75474 -22974 -13175 -14081 7906 -12132
16705a2132j1949j3702O673l413L861J1931K6653N96k1783r727M257J3443M521
$$ -12132 -24081 -37783 -31110 -34523 -30662 -18731 7922 8518 -13265 -22992 -18735 -5292 -771
16692g71m2145k4107Q561R657k094N952J7966j0803l159J7169n413k4574K9853
$$ -771 -42916 -67023 -58462 -48805 -50899 -44947 -26981 -37784 -40943 -23774 -29187 -53761 -23908
16679b3908R12N32p8j6135k855N715N370K960j3672J1707p164M548J860O885K4322
$$ -23908 -22996 -22464 -22542 -38677 -41532 -35817 -30447 -27487 -41159 -29452 -36616 -32068 -30208 -23323 999
16664I99M0216n021j9366k6519k6816J249K885k859o391J0283L3680L69m822k42
$$ 999 41215 36194 16828 -9691 -36507 -35258 -32373 -35232 -41623 -31340 2340 2709 -2113 -2355
16650b355o621j3870j1524R34O779J9179K0318j2316l0037q179j3978J4282J3922
$$ -2355 -8976 -22846 -34370 -33436 -26657 -7478 12840 524 -29513 -37692 -51670 -37388 -23466
16637b3466j423O785O184K4488J4232Q707l4558n1007j8767L7706L0355j2349
$$ -23466 -24889 -18104 -11920 12568 26800 35507 949 -50058 -68825 -31119 -764 -13113
16625a3113o972J6348l375k7129o719K2786j1960Q830R459n0309l2596m541M5613
$$ -13113 -20085 -3737 -7112 -34241 -40960 -18174 -30134 -21304 -11845 -62154 -94750 -99291 -53678
16612e3678L9218m039k3228j4088J768K7271J7920J9543n71j6593q499m2007k3417
$$ -53678 -14460 -18499 -41727 -55815 -54047 -26776 -8856 10687 10116 -6477 -14976 -56983 -80400
16599h0400L0544L9601J8332j9396m612J4216j7628j3438p391j0871O746R631
$$ -80400 -49856 -10255 8077 -11319 -15931 -1715 -19343 -32781 -40172 -51043 -44297 -34666
16587c4666L0754Q33l1277O783J6170J0136J3169j8467L334Q184L4049J1277k8998
$$ -34666 -3912 -3079 -34356 -27573 -11403 -1267 11902 -6565 -3231 4953 39002 50279 21281
16574B1281k7043j17R299k1984k0092K2134R544j6936J320J3874K7235j1257l7535
$$ 21281 -5762 -5879 3420 -18564 -38656 -16522 -6978 -23914 -22594 -8720 18515 7258 -30277
16561c0277L725O051K4964k528P747k8419m0841q631O727J0093K1673K4974N326
$$ -30277 -26552 -20501 4463 1935 9682 -18737 -59578 -68209 -61482 -51389 -29716 -4742 584
16548E84j1605J6963r959k3720Q012J3795n147j8893n661m930K3898j7806j6803
$$ 584 -11021 5942 -4017 -27737 -19725 -5930 -11077 -29970 -35631 -40561 -16663 -34469 -51272
16535e1272J5704l1393M462M2182J4025L407q908k3341L943N7L653K1130J2855
$$ -51272 -35568 -66961 -62499 -20317 -6292 -2885 -11793 -35134 -31191 -31134 -27481 -6351 6504
16522F504J2856J556m0269j5585Q948j2103J6782J0709m342p872j0526L577J2664
$$ 6504 19360 20916 -19353 -34938 -25990 -38093 -21311 -10602 -14944 -22816 -33342 -29765 -17101
16509a7101N015l393k061J2724P256P901K1697J0825L086j2971J0405l5835n8160
$$ -17101 -12086 -15479 -17540 -4816 2440 10341 32038 42863 45949 32978 43383 7548 -50612
16496e0612l4409J287K7429q06o402L5598K5715j4957k3630j8284J2662l991j6351
$$ -50612 -85021 -83734 -56305 -57111 -63513 -27915 -2200 -17157 -40787 -59071 -46409 -50400 -66751
16483f6751N740M0901L523j1624N802o159K481m083o722J7665J8911k7929j9851
$$ -66751 -61011 -20110 -16587 -28211 -22409 -28568 -26087 -30170 -36892 -19227 -316 -28245 -48096
16470d8096J0122K227O668R452k611Q875K4040j3468k4529o787j745K897p513
$$ -48096 -37974 -35747 -29079 -19627 -22238 -13363 10677 -2791 -27320 -34107 -35852 -32955 -40468
16457d0468n434K0590R737J8320J5841k6513j7689J5450M704K0794J1676j0367
$$ -40468 -45902 -25312 -15575 2745 18586 -7927 -25616 -10166 -5462 15332 27008 16641
16445A6641k392j7803j7340j835j1856J1237R428j3274j3057j2223J783J9516
$$ 16641 14249 -3554 -20894 -22729 -34585 -23348 -13920 -27194 -40251 -52474 -50691 -31175
16433c1175N62j5923o202J918L0880j3999j6397J0682K3715J0959P616n129m025
$$ -31175 -30613 -46536 -52738 -50820 -19940 -33939 -50336 -39654 -15939 -4980 2636 -2493 -6518
16420f518l6022L650q650N87P540j2878l0646J41L7117M090J6923J4982j2940
$$ -6518 -42540 -38890 -47540 -46953 -39413 -52291 -82937 -82796 -45679 -41589 -24666 -9684 -22624
16407b2624R652k7626q201K3346K5102j1995m2567J3198j2378K0397K1163k3645
$$ -22624 -12972 -40598 -48799 -25453 -351 -12346 -54913 -41715 -54093 -33696 -12533 -36178
16395c6178m780K5493l734r881o585K0670N51k4907J0810L5613r871n145j9767
$$ -36178 -40958 -15465 -19199 -29080 -35665 -14995 -14444 -39351 -28541 7072 -2799 -7944 -27711
16382b7711k2466J0545R634n378K0333J3215J1928P671K56R941O395l96j376k6658
$$ -27711 -50177 -39632 -29998 -35376 -15043 -1828 10100 17771 18027 27968 34363 33967 32591 5933
16368E933j4576N03p74r155j5709Q118J3922K5900j6718j1390J6541J897J5738
$$ 5933 -8643 -8140 -8914 -18069 -33778 -25660 -11738 14162 -2556 -13946 2595 4492 20230
16355B0230j368k0777n129k590k9171j9780j1827J2103L388j1045o470k5352J6101
$$ 20230 18862 -1915 -7044 -9634 -38805 -58585 -70412 -58309 -54921 -65966 -72436 -97788 -81687
16342h1687L4220J0591Q822j943K1378n95j5091J1069M260k0393R810K9164O412
$$ -81687 -47467 -36876 -28054 -29997 -8619 -9214 -24305 -13236 -8976 -29369 -19559 9605 16017
16329A6017p944k0934j4844l1376L287L5960j6394q446L0803o891q909k0225j3795
$$ 16017 8073 -12861 -27705 -59081 -55794 -19834 -36228 -44674 -13871 -20762 -29671 -49896 -63691
16316f3691J6K4635J710j3707r100J0590J7947K1442K8001k907j1221j0014J6795
$$ -63691 -63675 -39040 -37330 -51037 -60137 -49547 -31600 -10158 17843 14936 3715 -6299 10496
16303A0496J8035L7797r819m2707k0386J1269j0006J0030r831j7123j3894K918
$$ 10496 28531 66328 56509 13802 -6584 4685 -5321 4709 -5122 -22245 -36139 -33221
16291c3221R191J5112K7735o273k3615k257J1172Q834Q4p863m44n366j4477n554
$$ -33221 -24030 -8918 18817 12544 -11071 -13328 -2156 6678 6762 -1101 -1545 -6911 -21388 -26942
16277b6942J7996J4944r494j0436M5j732J4778j358j2212P461J97k9670k0200
$$ -26942 -8946 5998 -3496 -13932 -13887 -15619 -841 -2199 -14411 -6950 -6753 -36423 -56623
16264e6623K1799L0267K9283k0672n2675J0586K3965j1162j2396J3363J2459p304
$$ -56623 -34824 -4557 24726 4054 -48621 -38035 -14070 -25232 -37628 -24265 -11806 -19110
16252a9110J0223K8273j3392Q958K2764J3989q309k6000N492n284j652j5269o0216
$$ -19110 -8887 19386 5994 14952 37716 51705 43396 17396 22888 17604 15952 683 -59533
16239e9533k6906K7044J6655J0902J9478L903K0105K5468L810J5716o097n9470
$$ -59533 -86439 -59395 -42740 -31838 -12360 -8457 11648 37116 40926 56642 50545 -8925
16227h925j1722K8337j102m719N117k2849L533L503J4961j5010J267r881L7J2176
$$ -8925 -20647 7690 6588 1869 6986 -15863 -12330 -8827 6134 -8876 -7609 -17490 -17453 -5277
16213e277l511k87l329Q302J1541j1976m3408k0524O040L1457O081J7616k6k1454
$$ -5277 -8788 -9075 -12404 -4102 7439 -4537 -47945 -68469 -62429 -30972 -24891 -7275 -7301 -28755
16199b8755L972k796k058L7703J7083m047O486Q818m1324k4039j5143M894J8149
$$ -28755 -24783 -27579 -29637 8066 25149 21102 27588 36406 -4918 -28957 -44100 -39206 -21057
16186b1057K4434N593j5769m809r529L113N474J6758P753J3840j9405k6440P883
$$ -21057 3377 8970 -6799 -11608 -21137 -18024 -12550 4208 11961 25801 6396 -20044 -12161
16173a2161p38o366k4273J8150K7213n34J960j4377j1314Q777J9724j5023m070
$$ -12161 -12899 -19265 -43538 -25388 1825 1291 3251 -11126 -22440 -13663 6061 -8962 -13032
16160a3032L152q347J1410j7274j6620k1440n324m063J4061J4541O505K7648L0749
$$ -13032 -9880 -18227 -6817 -24091 -40711 -62151 -67475 -71538 -57477 -42936 -36431 -8783 21966
16147B1966K595j5772m32j8845l9721o852m764l5377L318L3394m50p279J7496
$$ 21966 24561 8789 8357 -10488 -50209 -57061 -61825 -97202 -93884 -60490 -60940 -68219 -50723
16134e0723L231J9178Q702Q645p97j8369J835P574M1Q639p613J6736P372j240
$$ -50723 -47492 -28314 -19612 -10967 -11764 -30133 -28298 -20724 -20683 -12044 -19657 -2921 4451 3211
16120C211j6531j1182O587Q347k4028k7703M588p530p587J6731O566J0681q6J5614
$$ 3211 -13320 -24502 -17915 -9568 -33596 -61299 -56711 -64241 -71828 -55097 -48531 -37850 -37936 -22322
16106b2322k4107r256l767J3220J6858Q756j2621m460J1463n404J4711J0507k972
$$ -22322 -46429 -55685 -59452 -46232 -29374 -20618 -33239 -37699 -26236 -31640 -16929 -6422 -9394
16093i394j628O620J0978N090l553q034n381r644j837P765p110q335K2221J6089
$$ -9394 -11022 -4402 6576 11666 8113 79 -5302 -14946 -16783 -9018 -16128 -24463 -2242 13847
16079A3847j0605k0471J923l422J9852l0418j2897J7066J8957J7017j5620N793
$$ 13847 3242 -17229 -15306 -18728 1124 -29294 -42191 -25125 -6168 10849 -4771 1022
16067A022J2353o082j2954J4720j7285N77J2934R64j8607q568j5780m027P392
$$ 1022 13375 7293 -5661 9059 -8226 -7649 5285 6249 -12358 -20926 -36706 -40733 -33341
16054c3341j0493k1299j7094K925J7001N8030L8147J0674k7396q891l477k5874
$$ -33341 -43834 -65133 -82227 -79302 -62301 -4271 33876 44550 17154 8263 4786 -21088
16042b1088k0305J0483K5757j8193J529O877j5996n595q203Q748j3116K256L438
$$ -21088 -41393 -30910 -5153 -23346 -21817 -14940 -30936 -36531 -44734 -35986 -49102 -46846 -43408
16029d3408k6676k4408p369K0686L1793K9748K007M744k2541j1086j571P001N110
$$ -43408 -70084 -94492 -101861 -81175 -49382 -19634 -17627 -12883 -35424 -46510 -48081 -41080 -35970
16016c5970J4507P908m654j2042r360j2615K4261P422l173m355R926J09j9128
$$ -35970 -21463 -13555 -18209 -30251 -39611 -52226 -27965 -20543 -23716 -28071 -18145 -18036 -37164
16003c7164j2344j0442N533M0784J0913j0338o708J529k4326r006J1264J1245
$$ -37164 -49508 -59950 -54417 -13633 -2720 -13058 -19766 -18237 -42563 -51569 -40305 -29060
15991b9060P918k6370J2577J3559J5533M461P438j7584k6692j1756K2084J8236
$$ -29060 -21142 -47512 -34935 -21376 -5843 -1382 6056 -11528 -38220 -49976 -27892 -9656
15979i656o806j7190j3110O032J589j972J6478J3171j8996J1558J5825j0487r513
$$ -9656 -16462 -33652 -46762 -40730 -39141 -41113 -24635 -11464 -30460 -18902 -3077 -13564 -23077
15966b3077j1611j084k246j1085N954J8339J6605j7251P93R855N619j4962j0925
$$ -23077 -34688 -35772 -38018 -49103 -43149 -24810 -8205 -25456 -24663 -14808 -9189 -24151 -35076
15953c5076O58j5774L0191Q241r954k1872m7952J7128L0773M1251J2708j1524
$$ -35076 -34418 -50192 -20001 -11760 -21714 -43586 -91538 -74410 -43637 -2386 10322 -1202
15941a202j2365k4259k421J2280l3729k3450l637L0958K1152J0215j0611l356
$$ -1202 -13567 -37826 -40247 -27967 -61696 -85146 -88783 -57825 -36673 -26458 -37069 -40425
15929d0425k293j7068l158K1114J959O731K1494K2428j7458j7248k8389j4484
$$ -40425 -42718 -59786 -62944 -41830 -39871 -33140 -11646 10782 -6676 -23924 -52313 -66797
15917f6797M4979j0020q987j6343j0095K822K8230M2676L263j4359k2219k3869
$$ -66797 -21818 -31838 -40825 -57168 -67263 -64441 -36211 6465 9728 -4631 -26850 -50719
15905e0719O318j118N480J1769L494J4937K6284j182J3163j063P829Q796k0920
$$ -50719 -44401 -45519 -40039 -28270 -24776 -9839 16445 15263 28426 27363 35192 43988 23068
15892B3068k7091j763J1511O514j3440j2836K3500J3808l5393k8208m72J4892
$$ 23068 -4023 -5786 5725 12239 -1201 -14037 9463 23271 -12122 -40330 -40802 -25910
15880b5910p170J9755K4939j5621R372L2665O031j3537l5148r594K5408M171k6325
$$ -25910 -33080 -13325 11614 -4007 5365 38030 44061 30524 -4624 -14218 11190 15361 -10964
15867a0964k872j4700J5412Q075k1781j6420M477J8578Q192j5703P369J733J7248
$$ -10964 -13836 -28536 -13124 -5049 -26830 -43250 -38773 -20195 -12003 -27706 -20337 -18604 -1356
15854a356N019j3690k1686O611j7444m593n160j0684j2891Q177K7986J587L8578
$$ -1356 3663 -10027 -31713 -25102 -42546 -47139 -52299 -62983 -75874 -67697 -39711 -38124 454
15841D54K9757j820k1615m344J2272j5538k6528k5720J9854K3458L497j946J4684
$$ 454 30211 28391 6776 2432 14704 -834 -27362 -53082 -33228 -9770 -6273 -8219 6465
15828F465k2895L481J0929j3368J0945j052j6094K135N676Q171j927R764l254
$$ 6465 -16430 -12949 -2020 -15388 -4443 -5495 -21589 -19454 -13778 -5607 -7534 2230 -1024
15815a024J2789k5523p603j8314k4368K6455J8664j8273m859k2884J80r79J0674
$$ -1024 11765 -13758 -21361 -39675 -64043 -37588 -18924 -37197 -42056 -64940 -64760 -65739 -55065
15802e5065K4764M253n385J7346Q641q055O870J0303l2725j9129q759M634K6120
$$ -55065 -30301 -26048 -31433 -14087 -5446 -13501 -6631 3672 -29053 -48182 -56941 -52307 -26187
15789b6187J5625M909j3531j5858R775P159J9731K5813j4093j2895j730j9344
$$ -26187 -10562 -5653 -19184 -35042 -25267 -18108 1623 27436 13343 448 -1282 -20626
15777b0626m660Q617O720n960J1366O313K408r249j9620j6793R849k393J1002
$$ -20626 -25286 -16669 -9949 -15909 -4543 1770 4178 -5071 -24691 -41484 -31635 -34028 -23026
15764b3026K1785J0730J9r990k093L249o361L163j963j9069k7360j6753J9696
$$ -23026 -1241 9489 9508 -482 -2575 674 -5687 -2524 -4487 -23556 -50916 -67669 -47973
15751d7973N521N292j1384n679J1215l777J2157Q350J8244K3426k019j7814j8775
$$ -47973 -42452 -37160 -48544 -54223 -43008 -46785 -34628 -26278 -8034 15392 13373 -4441 -23216
15738b3216J711o909j8244o227J1833J4734l176K4056K3260O989R72k3395k3805
$$ -23216 -21505 -28414 -46658 -52885 -41052 -26318 -29494 -5438 17822 24811 25783 2388 -21417
15725b1417Q800l7385P888J5625L193LJ6025L7022j3728k0534l501j3914p041
$$ -21417 -12617 -50002 -42114 -26489 -23296 -23293 -7268 29754 16026 -4508 -8009 -21923 -28964
15712b8964M135L6114J3431r325L8489K900j8552l0217O46m196K2857K3531p306
$$ -28964 -24829 11285 24716 15391 53880 56780 38228 8011 8657 4461 27318 50849 43543
15699D3543m4652k7776L28K11p196q890k1192j2594R207L8142L981l1090j2878
$$ 43543 -1109 -28885 -28557 -28346 -35542 -44432 -65624 -78218 -69011 -30869 -26888 -57978 -70856
15686g0856K8133O018j3768K8060R905j0934L832r812Q788J5104J8662J8083k7541
$$ -70856 -42723 -36705 -50473 -22413 -12508 -23442 -19610 -29422 -20634 -5530 13132 31215 3674
15673C674r409J6156j2478k3024m032j0093j5029K0073K0088k64j2054R987Q045
$$ 3674 -5735 10421 -2057 -25081 -29113 -39206 -54235 -34162 -14074 -14338 -26392 -16405 -8360
15660h360j0544k2157J6591N857m942k161P995o493J0531J3351m608R905R083
$$ -8360 -18904 -41061 -24470 -18613 -23555 -25716 -17721 -24214 -13683 -332 -4940 4965 14048
15647A4048j8099m8134n623K7808K8702n272j4925m240K268j4197k261K0017K7499
$$ 14048 -4051 -52185 -57808 -30000 -1298 -6570 -21495 -25735 -23467 -37664 -39925 -19908 7591
15634G591K862k2857J3312J2973J690K2851K862j7448l3263l287K089J3057M653
$$ 7591 10453 -12404 908 13881 15571 38422 41284 23836 -9427 -12714 -10625 2432 7085
15621G085J6621n205J066j9980q138l338m573K9179Q760l6766m635p23j6148k6792
$$ 7085 23706 18501 19567 -413 -8551 -11889 -16462 12717 21477 -15289 -19924 -20647 -36795 -63587
15607f3587K4951O109j9687j4802j1172P209J460N714K5151J0604O410J1946J5862
$$ -63587 -38636 -32527 -52214 -67016 -78188 -70979 -69519 -63805 -38654 -28050 -21640 -9694 6168
15594F168Q873j9646P673j3373j5924j54J6716j3264o945J4950L891R728O399
$$ 6168 15041 -4605 3068 -10305 -26229 -26383 -9667 -22931 -29876 -14926 -11035 -1307 5092
15581E092j4009L594K9251j3558l8601j9594q254Q877J4602J8924O615k93J2937
$$ 5092 -8917 -5323 23928 10370 -28231 -47825 -56079 -47202 -32600 -13676 -7061 -7354 5583
15568E583J5725J0953p615J7592o754j1470j4166j2808K4708Q311j5482r263j3592
$$ 5583 21308 32261 24646 42238 35484 24014 9848 -2960 21748 30059 14577 5314 -8278
15555h278o617j0776J3774J7960j4636J94o973J0205l027j5419N271K7558j7153
$$ -8278 -14895 -25671 -11897 6063 -8573 -8379 -15352 -5147 -8174 -23593 -18322 9236 -7917
15542g917J785O799j6561O693J9786q147P969m040P962L364j5815j1927k8319
$$ -7917 -6132 667 -15894 -9201 10585 2438 10407 6367 14329 17693 1878 -10049 -38368
15529c8368j7283o043q65J8510q485J8765N2039L965J3386K2719k6184k8831j6538
$$ -38368 -55651 -61694 -62559 -44049 -52534 -33769 18270 22235 35621 58340 32156 3325 -13213
15516a3213j13j2378J4087j3897r008J9988P919j9589M3033J5892k553k2248k4729
$$ -13213 -13326 -25704 -11617 -25514 -34522 -14534 -6615 -26204 16829 32721 30168 7920 -16809
15503a6809m136l34o468Q845k1240k2749K5780K0446j0130K6010j70j222k939
$$ -16809 -20945 -21279 -27747 -18902 -40142 -62891 -37111 -16665 -26795 -785 -955 -2177 -5116
15490e116o416J5756L848O889j7904n325J2050k3164l2296J9234P425J0234J7359
$$ -5116 -11532 4224 8072 14961 -2943 -8268 3782 -19382 -51678 -32444 -25019 -14785 2574
15477B574J8123J3192o982m1651j0877j8762k5419L1144M1623j0123j1991J7037
$$ 2574 20697 33889 26907 -14744 -25621 -44383 -69802 -38658 2965 -7158 -19149 -2112
15465b112l54o842P173J1471l2616n255r5K580k0174k5485K561J8000K7946J0290
$$ -2112 -2466 -9308 -2135 9336 -23280 -28535 -28630 -26050 -46224 -71709 -69148 -51148 -23202 -12912
15451a2912j2341m885o406r574J3571J4790J8235m847O991K2547r497n819n277
$$ -12912 -25253 -30138 -36544 -46118 -32547 -17757 478 -4369 2622 25169 15672 9853 4576
15438D576j5974K25k3846j3925J5353J0301j6290j7146m333p607K1526J0045Q424
$$ 4576 -11398 -11173 -35019 -48944 -33591 -23290 -39580 -56726 -61059 -68666 -47140 -37095 -28671
15425b8671M780J9170r898J1242J7527K3706j2633j3226j6927K317k6728K777
$$ -28671 -23891 -4721 -14619 -3377 14150 37856 25223 11997 -4930 -2613 -29341 -26564
15413b6564j1472J564J2589O583p359j1199K8429J3522m956J608m572j4553k9397
$$ -26564 -38036 -36472 -23883 -17300 -24659 -35858 -7429 6093 1137 2745 -1827 -16380 -45777
15400d5777j3168L6548n53k1153j7906K5620J2274J5270P76q961p864k3591P938
$$ -45777 -58945 -22397 -22950 -44103 -62009 -36389 -24115 -8845 -8069 -17030 -24894 -48485 -40547
15387d0547M7846j8185j6836k4190K0419K0359J7013n3N480Q411J0012j2393j1251
$$ -40547 7299 -10886 -27722 -51912 -31493 -11134 5879 5826 11306 19717 29729 17336 6085
15374F085o959j5306p100m012j2048L6901M6625K2142m466l9548k3258k371R150
$$ 6085 -874 -16180 -23280 -27292 -39340 -2439 44186 66328 61862 22314 -944 -3315 5835
15361E835J4992P981j3596o58K8743j6793J8204j6177l844o603n045j4058o936
$$ 5835 20827 28808 15212 14554 43297 26504 44708 28531 24687 18084 13039 -1019 -7955
15348g955j4675r742J8881P895j1806O145O101J3448n816k0141n364j0044Q153
$$ -7955 -22630 -32372 -13491 -5596 -17402 -11257 -5156 8292 2476 -17665 -23029 -33073 -24920
15335b4920q761o216P620N840r949j5849J8517J0928n363K2003Q115l0363L654
$$ -24920 -33681 -39897 -32277 -26437 -36386 -52235 -33718 -22790 -28153 -6150 1965 -28398 -24744
15322b4744J2412r958K5230J246q901j8047R538J2651J1753l866m1169j0329K6856
$$ -24744 -12332 -22290 2940 4186 -4715 -22762 -13224 -573 11180 7314 -33855 -44184 -17328
15309a7328r58l743j5598k5055O403R598j69p666M7901L5910q160k4403j7836
$$ -17328 -18286 -22029 -37627 -62682 -56279 -46681 -46850 -54516 -6615 29295 21135 -3268 -21104
15296b1104j4141r547j272J4971J4005j6435k852M5194Q747K6039j3545k7628
$$ -21104 -35245 -44792 -46064 -31093 -17088 -33523 -36375 8819 17566 43605 30060 2432
15284B432K881j6042K8602M898j5736K985k492J4657l4634j2516Q339j08L000
$$ 2432 5313 -10729 17873 22771 7035 10020 7528 22185 -12449 -24965 -16626 -16734 -13734
15271a3734P637l896M015q311M316j895P394j773k7820l62J996L5395J9228k2203
$$ -13734 -6097 -9993 -5978 -14289 -9973 -11868 -4474 -6247 -34067 -34429 -32433 2962 22190 -13
15257a3l6321j8464J5657L3182j0602J1160K64j0690K5439J0083k5684r22J8853
$$ -13 -36334 -54798 -39141 -5959 -16561 -5401 -5137 -15827 9612 19695 -5989 -6911 11942
15244A1942R230j2692L593J77P282J2020j4145l2234l294J8469R850j4541j0379
$$ 11942 21172 8480 12073 12250 19532 31552 17407 -14827 -18121 348 10198 -4343 -14722
15231a4722J0269j9955j4124J4089M0649J7331n6j6653j7298j5278q096k1444
$$ -14722 -4453 -24408 -38532 -24443 16206 33537 33481 16828 -470 -15748 -23844 -45288
15219d5288K832j1014J6707K6222k778p2J3239M725L304K6992j4944j0492q009
$$ -45288 -42456 -53470 -36763 -10541 -13319 -13391 -152 4573 7877 34869 19925 9433 1424
15206A424J0383L272J3482j0545k824j2997j9012J256J7067n374K3705k6501q605
$$ 1424 11807 15079 28561 18016 15192 2195 -16817 -15561 1506 -3868 19837 -6664 -15269
15193a5269N388r806r94k0882k1818K1605L5150M5882n762j6785l499k0128O0
$$ -15269 -9881 -19687 -20681 -41563 -63381 -41776 -6626 39256 33494 16709 13210 -6918 -6858
15180f858l199j9360k6302K0273L0073j4549k2120N522K5513J8862j0415k6443
$$ -6858 -10057 -29417 -55719 -35446 -5373 -19922 -42042 -36520 -11007 7855 -2560 -29003
15168b9003J301r547K7475M6193K670m657j4159k0797l7245k0999M768J1280l292
$$ -29003 -27702 -37249 -9774 36419 39089 34432 20273 -524 -37769 -58768 -54000 -42720 -46012
15155d6012j178J4360n21k787Q174K1699K2505q631q064P710O994j8514j4081
$$ -46012 -47190 -32830 -33351 -36138 -27964 -6265 16240 7609 -455 7255 14249 -4265 -18346
15142a8346p846q427R912J122R4l630j4575Q711M4801J561j6195M595j7379j4860
$$ -18346 -26192 -34619 -24707 -23585 -23491 -27121 -41696 -32985 11816 13377 -2818 1777 -15602 -30462
15128c0462J2117J1937K291N183J9330l54J5614M172k3327j6243r988M030j3257
$$ -30462 -18345 -6408 -4117 1066 20396 20042 35656 39828 16501 258 -9730 -5700 -18957
15115a8957k3651K2933L1388J2298j0283p009J6454l4915j8032J6879j1374j0622
$$ -18957 -42608 -19675 11713 24011 13728 6719 23173 -11742 -29774 -12895 -24269 -34891
15103c4891J9000O584k0861j503J614O571Q472q098K1021N270k055J3025o933
$$ -34891 -15891 -9307 -30168 -31671 -30057 -23486 -15014 -23112 -2091 3179 1124 14149 7216
15090G216j1639j3565j1822J7128Q596j0348J885j0000j6779J5797K4488o428
$$ 7216 -4423 -17988 -29810 -12682 -4086 -14434 -12549 -22549 -39328 -23531 957 -5471
15078e471m31O481K5402o331j7986l0122k9583r676K0737J6454K3907l788K674
$$ -5471 -5902 579 25981 19650 1664 -28458 -58041 -67717 -46980 -30526 -6619 -10407 -7733
15065g733j1412k2392O060L9998J5845l4884k2543K441J3105L5607K8975l3932
$$ -7733 -19145 -41537 -35477 4521 20366 -14518 -37061 -34620 -21515 14092 43067 9135
15053I135o039j2310J914j5450j1180O581L1560j709p666J2230J5149q307k6779
$$ 9135 3096 -9214 -7300 -22750 -33930 -27349 4211 2502 -5164 7066 22215 13908 -12871
15040a2871j8538J4175P567k1584J6126J7458O289J7027M528j8008l5899J0379
$$ -12871 -31409 -17234 -9667 -31251 -15125 2333 8622 25649 30177 12169 -23730 -13351
15028a3351p221j2546P32J1756N772P12r36J26m476j6494K0192L8446R403J7095
$$ -13351 -20572 -33118 -32386 -20630 -14858 -14146 -15082 -14956 -19432 -35926 -15734 22712 32115 49210
15014D9210j830k7431j9071M626J447M390J1801P457m0153j4340l7363j562J9583
$$ 49210 47380 19949 878 5504 6951 11341 23142 30599 -9554 -23894 -61257 -62819 -43236
15001d3236J246J3854K1105J9467p961P387P318P838J5712j1665m1537o345J7191
$$ -43236 -41990 -28136 -7031 12436 4475 11862 19180 27018 42730 31065 -10472 -16817 374
14988C74k470M651J2965K6293K461k5675K176N786m8488k3798K8588R055%j6964
$$ 374 -2096 2555 15520 41813 44274 18599 20775 26561 -21927 -45725 -17137 -8082 -8082 -25046
14974b5046J2973K7379n818q478J8138L304k8673k0698R495n745r601J0910p858
$$ -25046 -12073 15306 9488 1010 19148 22452 -6221 -26919 -17424 -23169 -32770 -21860 -29718
14961b9718J2552L254J7603J0896n864j7934J0278L744L490Q739j7350m908R462
$$ -29718 -17166 -13912 3691 14587 8723 -9211 1067 4811 8301 17040 -310 -5218 4244
14948D244N943j496o181j1752J6796K1204M299K5792k5133m6684J3966K0068R248
$$ 4244 10187 8691 2510 -9242 7554 28758 33057 58849 33716 -12968 998 21066 30314
14935C0314K4822J4433k1551k3040k1124P493K0112j113j4427j2039k9303p035
$$ 30314 55136 69569 48018 24978 3854 11347 31459 30346 15919 3880 -25423 -32458
14923c2458J8164j6026j2226J8963K4624Q817O674k1087p017O812r032J5386M5605
$$ -32458 -14294 -30320 -42546 -23583 1041 9858 16532 -4555 -11572 -4760 -13792 1594 47199
14910D7199l837l9456p728J1019j4090m727j3726J2658J526O253L891O652L5327
$$ 47199 43362 3906 -3822 7197 -6893 -11620 -25346 -12688 -11162 -4909 -1018 5634 40961
14897D0961R204k0083J2726j4247l6322l2269J5576L4232J0623k084J575n682
$$ 40961 50165 30082 42808 28561 -7761 -40030 -24454 9778 20401 18317 19892 14210
14885A4210j2992J6029r562r409L6758J8127J3855n626m931k0686q686m5321l8033
$$ 14210 1218 17247 7685 -1724 35034 53161 67016 61390 56459 35773 27087 -18234 -56267
14872e6267j67q970j990J6824n730O848N672J0345J8851K999l446K1626J7291
$$ -56267 -56434 -65404 -67394 -50570 -56300 -49452 -43780 -33435 -14584 -11585 -15031 6595 23886
14859B3886q588j9134k2400K5797M517k3362m717q947k192M369K4347o938k9968
$$ 23886 15298 -3836 -26236 -439 4078 -19284 -24001 -32948 -35140 -30771 -6424 -13362 -43330
14846d3330J3174J9278k2763l904K777K9697J6684K703O502O506j4573O333J4186
$$ -43330 -30156 -10878 -33641 -37545 -34768 -5071 11613 14316 20818 27324 12751 19084 33270
14833C3270n834j4165j8715j7071o216l473m392L1444J3827p493J563J374j2263
$$ 33270 27436 13271 -5444 -22515 -28731 -32204 -36596 -5152 8675 1182 2745 4119 -8144
14820h144J1387l030M19R566J937l1670q090J5852j437K186j2057N114J0915j7525
$$ -8144 3243 213 632 10198 12135 -19535 -27625 -11773 -13210 -11024 -23081 -17967 -7052 -24577
14806b4577p848k040J2653J1751j475r618N564J8228Q695R704M25j9670q265K2653
$$ -24577 -32425 -34465 -21812 -10061 -11536 -21154 -15590 2638 11333 21037 21462 1792 -6473 16180
14792A6180J9747q015p32j3072j861k253L0695M486l1702j0141N267j0440j5207
$$ 16180 35927 27912 27180 14108 12247 9994 40689 45175 13473 3332 8599 -1841 -17048
14779a7048k4857l041J7377J4587p956J9736R862j1224L3427Q090m530k3340L0945
$$ -17048 -41905 -44946 -27569 -12982 -20938 -1202 8660 -2564 30863 38953 34423 11083 42028
14766D2028j1780j1171P34r475m498j6225r193J0768m849k9741k062M770J9976
$$ 42028 30248 19077 19811 10336 5838 -10387 -19580 -8812 -13661 -43402 -45464 -40694 -20718
14753b0718M2080K7320j0258m165j6625m112M752k1727J3951j1509k674J620j5330
$$ -20718 21362 48682 38424 34259 17634 13522 18274 -3453 10498 -1011 -3685 -2065 -17395
14740a7395j7821j0191j3345L4069O128j7727L542j2780R196J4030k2242J5065
$$ -17395 -35216 -45407 -58752 -24683 -18555 -36282 -32740 -45520 -36324 -22294 -44536 -29471
14728b9471l924J0911J4888j2842k6431k1197L1196J5003j5095p83K9099K1791
$$ -29471 -33395 -22484 -7596 -20438 -46869 -68066 -36870 -21867 -36962 -37745 -8646 13145
14716A3145l31k8126j4641K0832J8927r991J1490J1524J1165J4644j5122k0799
$$ 13145 12814 -15312 -29953 -9121 9806 -185 11305 22829 33994 48638 33516 12717
14704A2717k890j1542j2754l414l150j3733K9532J0629j3931m649J4234N901j1051
$$ 12717 9827 -1715 -14469 -17883 -21033 -34766 -5234 5395 -8536 -13185 1049 6950 -4101
14691d101o773J645J163p667P282N6L5881p845L53j2061N001L616J0401J2442
$$ -4101 -10874 -9229 -8066 -15733 -8451 -8395 27486 19641 19994 7933 12934 16550 26951 39393
14677C9393m118j7251J6478J8039k8767k6158j8635j3279m010J7993J5082N378
$$ 39393 35275 18024 34502 52541 23774 -2384 -21019 -34298 -38308 -20315 -5233 145
14665A45J7335Q251j0709q030m252K0585p123O523J0253j9370k0928J2300m378
$$ 145 17480 25731 15022 6992 2740 23325 16202 22725 32978 13608 -7320 4980 602
14652F02L356p522k599k3684M610K5850k2317J1636O271j8171p28K2006L4307
$$ 602 3958 -3564 -6163 -29847 -25237 613 -21704 -10068 -3797 -21968 -22696 -690 33617
14639C3617J3749m62o73O80j895j9323j0136p729J0324M736j1592j582k1295k2320
$$ 33617 47366 46904 46231 46911 45016 25693 15557 7828 18152 22888 11296 9714 -11581 -33901
14625c3901K1166J5496p448J0588j8963J355J464p563L3320j0541N65K0091j3834
$$ -33901 -12735 2761 -4687 5901 -13062 -11707 -10243 -17806 15514 4973 5538 25629 11795
14612A1795k1826k6896j449k2281o077L6724P071J3525L5011m037j8685O720k5901
$$ 11795 -10031 -36927 -38376 -60657 -66734 -30010 -22939 -9414 25597 21560 2875 9595 -16306
14599a6306l6844O859J4137j3468N131J0756J0736j9M019j0539k2608l901K1029
$$ -16306 -53150 -46291 -32154 -45622 -40491 -29735 -18999 -19018 -14999 -25538 -48146 -52047 -31018
14586c1018K4840J2878k8526j6504J0397j9693Q72K6352L8557K4316j4769p00
$$ -31018 -6178 6700 -21826 -38330 -27933 -47626 -46754 -20402 18155 42471 27702 27002
14574B7002k805m805K7354J6404k6653j4267L283k1481k927K724j2631K1400Q295
$$ 27002 24197 19392 46746 63150 36497 22230 25513 4032 1105 3829 -8802 12598 20893
14561B0893r328N299p129j7381J2461k095l743L720J469J0916N213j5385j4576
$$ 20893 11565 16864 9735 -7646 4815 2720 -1023 2697 4166 15082 20295 4910 -9666
14548i666K0537J2468q98r973K7888k033k9309k4992q77J3923j1161j1504J6608
$$ -9666 10871 23339 22441 12468 40356 38323 9014 -15978 -16855 -2932 -14093 -25597 -8989
14535h989Q093m888J862o836J4327k79j9332p330j3855l555K1192K950r850K1264
$$ -8989 -896 -5784 -3922 -10758 3569 3290 -16042 -23372 -37227 -40782 -19590 -16640 -26490 -5226
14521e226K325N193J9147K382Q419k1456j3549P14k9862M748L1796P849k1946
$$ -5226 -2901 2292 21439 23821 32240 10784 -2765 -2051 -31913 -27165 4631 12480 -9466
14508i466o747N36J8855L0348J3841j7006l6687r076k8817J259J6205L3607k3041
$$ -9466 -16213 -15677 3178 33526 47367 30361 -6326 -15402 -44219 -42960 -26755 6852 -16189
14495a6189j4698N394J0025J5505J8526p919k2768P918K871K1391J2307P732j8637
$$ -16189 -30887 -25493 -15468 37 18563 10644 -12124 -4206 -1335 20056 32363 40095 21458
14482B1458l4436l3506J8525L9623J017j1242l126L541K7187L2033k6753M401
$$ 21458 -12978 -46484 -27959 11664 12681 1439 -1687 1854 29041 61074 34321 38722
14470C8722j6053p489K9034K8095L975k3984k9438m212J623K8700N388l1675k2692
$$ 38722 22669 15180 44214 72309 76284 52300 22862 18650 20273 48973 54361 22686 -6
14457fJ6397j3140n953P794K5712J2611n906m1125r9K0021M592J5126l871k4643
$$ -6 16391 3251 -2702 5092 30804 43415 37509 -3616 -3715 16306 20898 36024 32153 7510
14443G510l6800K408r737j1017J6168J6243k397k6966o893k344l337J7879N2332
$$ 7510 -29290 -26882 -36619 -47636 -31468 -15225 -17622 -44588 -51481 -53825 -57162 -39283 13049
14430A3049O159r557K582M903k0797m553k5659j8671Q999K0187J7283j5589Q257
$$ 13049 19208 9651 12233 17136 -3661 -8214 -33873 -52544 -43545 -23358 -6075 -21664 -13407
14417a3407Q891l629J2341J583m2068k6548J3851P305J1573J3336R623r835k1587
$$ -13407 -4516 -8145 4196 5779 -36289 -62837 -48986 -41681 -30108 -16772 -7149 -16984 -38571
14404c8571J3622K5587P160J5767r599L218m249k4879L915m542J810p451N735
$$ -38571 -24949 638 7798 23565 13966 17184 12935 -11944 -8029 -12571 -10761 -18212 -12477
14391a2477J2582M9587m4101n5393N769K3642J1610L883q843n184l9269Q691M5156
$$ -12477 105 49692 5591 -49802 -44033 -20391 -8781 -4898 -13741 -18925 -58194 -49503 -4347
14378d347J1467n535j2589m825J9186P521J6356k7777k1301j0400j3118j4123
$$ -4347 7120 1585 -11004 -15829 3357 10878 27234 -543 -21844 -32244 -45362 -59485
14366e9485J7217J7082O613K7249m852j0101J0387k2701l0297K5459L937j3089
$$ -59485 -42268 -25186 -18573 8676 3824 -6277 4110 -18591 -48888 -23429 -19492 -32581
14354c2581k7384K6270K4870k4839o928P1L1931K2295K382K2345M237l5995j433
$$ -32581 -59965 -33695 -8825 -33664 -40592 -40521 -8590 13705 16087 38432 42669 6674 5241
14341E241L146J0040k0609m07l1483J0513J9798J0868K9885j5112k9122J3073
$$ 5241 8387 18427 -2182 -2589 -34072 -23559 -3761 7107 36992 21880 -7242 5831
14329E831L4403Q665P759N609k2669l1730n246k653J1723J7516M446p502m983
$$ 5831 40234 48899 56658 62267 39598 7868 2622 -31 11692 29208 33654 26152 21169
14316B1169j5239P524l414l2258J7572J6607p627k9936l118L0073n761p122Q466
$$ 21169 5930 13454 10040 -22218 -4646 11961 4334 -25602 -28720 1353 -4408 -11530 -3064
14303c064K405m763J1082l842J5682j121j2760j9955J0788L034L492k7273J0962
$$ -3064 -659 -5422 5660 1818 17500 16379 3619 -16336 -5548 -2514 978 -26295 -15333
14290a5333J7371K1444N591j7572k6826j248J4529K4820j8002n050j0432j7930
$$ -15333 2038 23482 29073 11501 -15325 -16573 -2044 22776 4774 -276 -10708 -28638
14278b8638K89K2508O965j191j9152P671J3213l792p776j1521j0459P483k554
$$ -28638 -28349 -5841 1124 -67 -19219 -11548 1665 -2127 -9903 -21424 -31883 -24400 -26954
14265b6954p646J7470K4852P416m1196r779J3737R88l388o31Q935K6053K049j4001
$$ -26954 -34600 -17130 7722 15138 -26058 -35837 -22100 -21112 -24500 -25131 -16196 9857 11906 -2095
14251b095J6961J7109J0269K0485j5295k5786l452j4764j552N83j2545j6014L3947
$$ -2095 14866 31975 42244 62729 47434 21648 18196 3432 1880 2463 -10082 -26096 7851
14238G851Q827k5093j0728K0810J8949j997J6571J1023p738l1024j4078j6986
$$ 7851 16678 -8415 -19143 1667 20616 18619 35190 46213 38475 7451 -6627 -23613
14226b3613m102J1455J8827n076K0239P852p428j9067O437Q867J1710J0583L37
$$ -23613 -27715 -16260 2567 -2509 17730 25582 18154 -913 5524 14391 26101 36684 37021
14213C7021J1804n352j0642k683J308J8673k2258k5062p106Q379k6948q270M1701
$$ 37021 48825 43473 32831 30148 31456 50129 27871 2809 -4297 4082 -22866 -31136 10565
14200A0565J2922j3683J576O223j4416j4830Q688J5560J4137j9617J48k4632q276
$$ 10565 23487 9804 11380 17603 3187 -11643 -2955 12605 26742 7125 7273 -17359 -25635
14187b5635j1308j6987r608P21K687L5332l963k4834K0550K4800K1316r474k5785
$$ -25635 -36943 -53930 -63538 -62817 -60130 -24798 -28761 -53595 -33045 -8245 13071 3597 -22188
14174b2188k6337L2050K8449p078J456K5497K7428J2438j2478l4676l1612k532
$$ -22188 -48525 -16475 11974 4896 6352 31849 59277 71715 59237 24561 -7051 -9583
14162i583j375k341J0372Q548p143R652J8644K1j2932j135k148K5391p877l9010
$$ -9583 -10958 -13299 -2927 5621 -1522 8130 26774 26795 13863 12728 10580 35971 28094 -10916
14148a0916j7921K4722K9889L65n3726k963J35Q78O778N199m361j988P367o50
$$ -10916 -28837 -4115 25774 26139 -27587 -30550 -30415 -29537 -22759 -17560 -21921 -23909 -16542 -17192
14134a7192L6699n005o703o11k893M07o595k2391J6262O068k1593j0088l035K2655
$$ -17192 19507 14502 7799 7188 4295 4702 -1893 -24284 -8022 -1954 -23547 -33635 -36670 -14015
14120a4015N389J4085j5197j6666k2302K3276P108P115R345K0910J5429o089k3680
$$ -14015 -8626 5459 -9738 -26404 -48706 -25430 -18322 -11207 -1862 19048 34477 28388 4708
14107D708M452n898j1274j1426j369J0618j7906n354K4569m208J2718l831j8J4003
$$ 4708 9160 3262 -8012 -19438 -20807 -10189 -28095 -33449 -8880 -13088 -370 -4201 -4219 9784
14093I784M751R63J0525M042k2545k3253Q073m732n262M794K4007K063M70K1427
$$ 9784 14535 15498 26023 30065 7520 -15733 -7660 -12392 -17654 -12860 11147 13210 13680 35107
14079C5107q036j6647p527J5006m044K2546Q349j0025j1160M27n511K1408k2040
$$ 35107 27071 10424 2897 17903 13859 36405 44754 34729 23569 23996 18485 39893 17853
14066A7853j7002J7123L818J090k575k5021J4388K3868r180j4518j1329k8685
$$ 17853 851 17974 21792 22882 20307 -4714 9674 33542 24362 9844 -1485 -30170
14054c0170j3219J343J8616J6144J6515j0949j2746q253j6284m449K2491J7207
$$ -30170 -43389 -42046 -23430 -7286 9229 -1720 -14466 -22719 -39003 -43452 -20961 -3754
14042c754k0750j5174L422J2044k2648j0207L4565J536K024J8802n250k97K1315
$$ -3754 -24504 -39678 -36256 -24212 -46860 -57067 -22502 -20966 -18942 -140 -5390 -5687 15628
14029A5628J2651K0994j5872j3714k3782M828n709o877J3848J1377J4413P956
$$ 15628 28279 49273 33401 19687 -4095 733 -4976 -11853 1995 13372 27785 35741
14017C5741l4641l7083L617J5709K0556J7471K5383j2589q295k0968j1300J3846
$$ 35741 1100 -35983 -32366 -16657 3899 21370 46753 34164 25869 4901 -6399 7447
14005G447K9642j2668k2877N000L3697j1712k5677L548k3264L561Q961J9158N781
$$ 7447 37089 24421 1544 6544 40241 28529 2852 6400 -16864 -13303 -4342 14816 20597
13992B0597j2668l753j649J4046N90k2093L946K0575J8273l2320j9731j6149K852
$$ 20597 7929 4176 2527 16573 17163 -4930 -984 19591 37864 5544 -14187 -30336 -27484
13979b7484J1055o25K3272L1968j685J0076N916n0420l71M9031j36j3594j7689
$$ -27484 -16429 -17054 6218 38186 36501 46577 52493 2073 1702 50733 50597 37003 19314
13966A9314l006j968j2503K0092K1469p313k0155j6682j6109K6764l635j5465
$$ 19314 16308 14340 1837 21929 43398 36085 15930 -752 -16861 9903 6268 -9197
13954i197K60k865J6503K6200L733p763r474m259j2336j1769J5175K1275j5445
$$ -9197 -8937 -11802 4701 30901 34634 26871 17397 13138 802 -10967 4208 25483 10038
13941A0038L239J0934j9720J6854k2785P033j565J3615L1161K93m249q140j6891
$$ 10038 13277 24211 4491 21345 -1440 5593 4028 17643 48804 49097 44848 36708 19817
13928A9817l0749J611P119j805o70P418m458n001J6420j687p452N506k211O353
$$ 19817 -10932 -9321 -2202 -4007 -4677 2741 -1717 -6718 9702 8015 563 6069 3858 10211
13914A0211P635J9581K1041j2024j2680n717k0580k3922k531R424N3029K8685
$$ 10211 17846 37427 58468 46444 33764 28047 7467 -16455 -18986 -9562 43467 72152
13902G2152k2838k2717J4479K444p840r480k4019K5961Q454L24k0138o366J8038
$$ 72152 49314 26597 41076 43520 35680 26200 2181 28142 36596 36920 16782 10416 28454
13889B8454J0832l5013j5777j1341J7933L1229o052o442m134Q339J0975p194J0759
$$ 28454 39286 4273 -11504 -22845 -4912 26317 20265 13823 9689 18028 29003 21809 32568
13876C2568r329m1791j8302L6046J0452j188j3600q201J6287o61J4002j797O637
$$ 32568 23239 -18552 -36854 -808 9644 8456 -5144 -13345 2942 2281 16283 14486 21123
13863B1123o716j0153j9222J8681L6173K4180k2116J14k7275j0458O872k7358
$$ 21123 14407 4254 -14968 3713 39886 64066 41950 42064 14789 4331 11203 -16155
13851a6155J0103L7989J2208R196j4780k1873j1404J3296J5123j7128j4244k0946
$$ -16155 -6052 31937 44145 53341 38561 16688 5284 18580 33703 16575 2331 -18615
13839a8615K0098J0935K3324k3199n158k4632N636K1701J6176K045Q396j9604
$$ -18615 1483 12418 35742 12543 7385 -17247 -11611 10090 26266 28311 36707 17103
13827A7103k7186K296k544J4826J2970k4924j2829R548P778Q269k3822k4626J7174
$$ 17103 -10083 -7787 -10331 4495 17465 -7459 -20288 -10740 -2962 5307 -18515 -43141 -25967
13814b5967J9511J0204K1000K153j2419K179K6566M27k7433M194l1142K50J5414
$$ -25967 -6456 3748 24748 26901 14482 16661 43227 43654 16221 20415 -10727 -10477 4937
13801D937m423q514j297p730j9566K0617J3621L7043J0836J3261k7949P33K3975
$$ 4937 514 -8000 -9297 -17027 -36593 -15976 -2355 34688 45524 58785 30836 31569 55544
13788E5544j5068l3491N022L194K562l750R004J297n933j8937j3171K2381m181
$$ 55544 40476 6985 12007 15201 17763 14013 23017 24314 18381 -556 -13727 8654 4473
13775D473J8173P573q477L4403J8272k9010l6463n92J71J8301K6533R658j2491
$$ 4473 22646 30219 21742 56145 74417 45407 8944 8352 8523 26824 53357 63015 50524
13762E0524q821k382N126O999J6082j6509n276n833j3699j820p690j9175K7907
$$ 50524 41703 39321 44447 51446 67528 51019 45743 39910 26211 24391 16701 -2474 25433
13749B5433K7536n993j9012J5107j9687m0217k4223J4872K3219K0179K5602J891
$$ 25433 52969 46976 27964 43071 23384 -16833 -41056 -26184 -2965 17214 42816 44707
13737D4707n019K711k452m082m2833j9257K7565k1927L988K7152K5655n028j4314
$$ 44707 39688 42399 39947 35865 -6968 -26225 1340 -20587 -16599 10553 36208 31180 16866
13724A6866l0520R943O703K5646N143j3498j6296J5311J2371M136j3293j5792
$$ 16866 -13654 -3711 2992 28638 33781 20283 3987 19298 31669 35805 22512 6720
13712F720o838j8207J6872M8L0556k3227J3870J7639Q046O870J919Q992J3252
$$ 6720 -118 -18325 -1453 -1405 29151 5924 19794 37433 45479 52349 54268 63260 76512
13699G6512K2517k3113o2825k6967r497j0669k489o192J4722J3181L1240J8373
$$ 76512 99029 75916 13091 -13876 -23373 -34042 -36531 -42723 -28001 -14820 16420 34793
13687C4793J8195r774j1891j8911J0885K2464k214K2324k4204l4273p64o770L19
$$ 34793 52988 43214 31323 12412 23297 45761 43547 65871 41667 7394 6630 -140 179
13674A79Q013K6767o55o706J3002k48L770J0275m891P015P521l594o346k828j0800
$$ 179 8192 34959 34304 27598 40600 40352 44122 54397 49506 56521 64042 60448 54102 51274 40474
13659D0474L424J1820J678j4907M316J0975K163j938o615K3524j6580k2831j4447
$$ 40474 43898 55718 57396 42489 46805 57780 59943 58005 51390 74914 58334 35503 21056
13646B1056K0184J0866j3308n81K191j2179k4259J0904Q605J021O551J2126J1816
$$ 21056 41240 52106 38798 38217 40408 28229 3970 14874 23479 24500 31051 43177 54993
13633E4993j4434j0545M745m450N579L5189j136k3374Q172j893m0669l5017J7725
$$ 54993 40559 30014 34759 30309 35888 71077 69941 46567 54739 52846 12177 -22840 -5115
13620e115J5695J0383M294J6672l699J3596j4134p119K4418J3206Q274P802k4435
$$ -5115 10580 20963 25257 41929 38230 51826 37692 30573 54991 68197 76471 84273 59838
13607E9838l3786K050J0921J2921j0193J0598J6062k621j6073p366k352j467Q874
$$ 59838 26052 28102 39023 51944 41751 52349 68411 65790 49717 42351 39999 38532 47406
13594D7406J659m5230j3345K4516l106J8293K5802o564l2656j3397P978J1060
$$ 47406 49065 3835 -9510 15006 11900 30193 55995 49431 16775 3378 11356 22416
13582B2416J4164j774N138M745j2831J11n592L948k894o64J2695K9560K816j846
$$ 22416 36580 34806 39944 44689 31858 31969 26377 30325 27431 26767 39462 69022 71838 69992
13568F9992O182r452m90J2173J0855j0081L9075J6432r253J7889j402l4840k4292
$$ 69992 76174 66722 66232 78405 89260 79179 118254 134686 125433 143322 141920 107080 82788
13555H2788K651Q584o53k1864n306j137l508j5456P15K0892L8567k553j2612k4000
$$ 82788 85439 94023 93370 71506 66200 65063 61555 46099 46814 67706 106273 103720 91108 67108
13541F7108j9958j2898k029N997M707L197M328M252j0215J353J8147j3792O2J8189
$$ 67108 47150 34252 32223 38220 42927 46124 50452 54704 44489 45842 63989 50197 50259 68448
13527F8448O04r2k3351j605J3736R336K5008k4869j8098J9830K7800K2773p26
$$ 68448 69052 68960 45609 44004 57740 67076 92084 67215 49117 68947 96747 119520 118794
13514A18794j7785j7471k8288K162O296J5066l1262l5718K5281L0960o079j5962
$$ 118794 101009 83538 55250 57412 63708 78774 47512 11794 37075 68035 61956 45994
13502D5994M018K1356O916r476N564J0570j2155n894l138N570N541J2369j1193
$$ 45994 50012 71368 78284 68808 74372 84942 72787 66893 63755 69325 74866 87235 76042
13489G6042J583J7971m217J649j9339j3567p048Q515r010J6631J37j7098K8172
$$ 76042 77625 95596 91379 93028 73689 60122 53074 61589 52579 69210 69347 52249 80421
13476H0421J8399N395K2359Q418k8751l5737o900K8923J3176q008j3075q27k1960
$$ 80421 98820 104215 126574 134992 106241 70504 63604 92527 105703 97695 84620 83793 61833
13463F1833k989Q920L072P976P003k4090J207k8653J4130K965j6727o549K9505
$$ 61833 58844 67764 70836 78812 85815 61725 62932 34279 48409 51374 34647 28098 57603
13450E7603K898j6008J3229J4952p223l554o898r247J0363j3447r556K3836k426
$$ 57603 60501 44493 57722 72674 65451 61897 54999 45752 56115 42668 33112 56948 54522
13437E4522J6934J8378q683o894R35m423l1585q565M3094J7670j6923p459n993
$$ 54522 71456 89834 81151 74257 75192 70769 39184 30619 73713 91383 74460 67001 61008
13424F1008J9718q912j3002J0437K1047k2879j8273J4189J883j1305n348K818
$$ 61008 80726 71814 58812 69249 90296 67417 49144 63333 65216 53911 48563 51381
13412E1381J1369l930J1651L636k185K1347j0180j8474j7797n223R253k8517J325
$$ 51381 62750 58820 70471 74107 71922 93269 83089 64615 46818 41595 50848 22331 23656
13399B3656L922Q849K2044J867J3808J4856P565l3383M550Q888J471J5723l152
$$ 23656 27578 36427 58471 60338 74146 89002 96567 63184 67734 76622 78093 93816 90664
13386I0664j6673J772O107P398j5756L129K1116l627j7034n644J5939K399j7174
$$ 90664 73991 75763 81870 89268 73512 76641 97757 94130 77096 71452 87391 89790 72616
13373G2616J5633p195k5177k2940J6147K6923O181k5871j3116L808J8542J8482
$$ 72616 88249 81054 55877 32937 49084 76007 82188 56317 43201 47009 65551 84033
13361H4033N376Q4N137l1938O460J7424K2418R146M080k6766n094j5180k561O658
$$ 84033 89409 89493 94630 62692 69152 86576 108994 118140 122220 95454 90360 75180 72619 79277
13347G9277O533J6416K3167j3628q689J3344J9561M07r417K1287N717j8118p628
$$ 79277 85810 102226 125393 111765 103076 116420 135981 136388 126971 148258 153975 135857 128229
13334A28229m2582j7906L541J0157J0461K52J0450n087Q653K1252o368n2980P671
$$ 128229 85647 67741 71282 81439 91900 92152 102602 97515 106168 127420 121052 68072 75743
13321G5743M621n782j1849M937J317J660L126J0783N751k804l119M485k1202j9251
$$ 75743 80364 74582 62733 67670 68987 70647 73773 84556 90307 87503 84384 88869 67667 48416
13307D8416J3721K2589k401J4274J2082J4529K0777J7505l2207j2127k2195k3207
$$ 48416 62137 84726 82325 96599 108681 123210 143987 161492 129285 117158 94963 71756
13295G1756Q014J8027j3449K011K9329J1027l3698l0609J2459K8278J4347J9639
$$ 71756 79770 97797 84348 86359 115688 126715 93017 62408 74867 103145 117492 137131
13283A37131J1119j6108j1090L0357J5007n804K1715J6652m324Q534J3982L0158
$$ 137131 148250 132142 121052 151409 166416 160612 182327 198979 194655 203189 217171 247329
13271B47329L3041J6245K4267P0330Q2414R9624J54895K92277M17329M06317L06714
$$ 247329 280370 296615 320882 391212 473626 573250 728145 1020422 1437751 1844068 2150782
13260B150782J46309J20255N5069J46258q1905n47360n18105l59168k35771j43098
$$ 2150782 2297091 2417346 2472415 2618673 2536768 1989408 1471303 1112135 876364 733266
13250G33266j12496o8821l4122l3047j3720j8681l8466l2138k5511r836k8698
$$ 733266 620770 551949 517827 484780 471060 452379 413913 381775 356264 346428 317730
13239C17730j1646j9360k8293p998j3643K921k9650k6382j1605J7074J6851R365
$$ 317730 306084 286724 258431 250433 236790 239711 210061 183679 172074 189148 205999 215364
13227B15364k083k0705k9661p846j366J0045J2863P422j8088j8864O54j732Q866
$$ 215364 213281 192576 162915 155069 153703 163748 176611 184033 165945 147081 147735 146003 154869
13214A54869J5884j0507R544J2046j9976j278p091j7155M772j2928M2736p404
$$ 154869 170753 160246 169790 181836 161860 160582 153491 136336 141108 128180 170916 163512
13202A63512L4537M2544L4067J7932K4550P9214J30093J22610J68619J29980R5282
$$ 163512 198049 240593 274660 292592 317142 396356 526449 649059 817678 947658 1042940
13191A042940O2195O4212K3344n3024j52906j79330j50346j32151r6774o5378
$$ 1042940 1105135 1169347 1192691 1139667 986761 807431 657085 524934 428160 362782
13181C62782q940j9115j9238k5903l822j7515J8n595J659R530l4517k2553j3413
$$ 362782 353842 334727 315489 289586 285764 268249 268267 262672 264331 273861 239344 216791 203378
13168B03378K2983O890P451J5314J5586J4114N503O806K1632J4889K0557J4629
$$ 203378 226361 233251 240702 256016 271602 285716 291219 298025 319657 334546 355103 369732
13156C69732L8537L7401Q6015J33618K19402L26203M04929M83659M47164L11758
$$ 369732 408269 445670 531685 665303 884705 1210908 1615837 2099496 2546660 2858418
13146B858418K11633J35836R4808n2721l18529n31986n69997m54234k83721j67649
$$ 2858418 3070051 3205887 3300695 3247974 2929445 2397459 1827462 1373228 1089507 921858
13136I21858j16330o7016m6854o4044n9055m1658k7774l23k1518j8668j2465k570
$$ 921858 805528 738512 691658 627614 568559 526901 499127 498804 477286 458618 446153 443583
13124D43583n624N478l665o794M968j6271j106J7002L3463O881k578J0300L4997
$$ 443583 437959 443437 439772 432978 437946 421675 420569 437571 471034 477915 475337 485637 520634
13111E20634O4890R0192Q4678R5961J69065K92021M17720M85094M53967L48179
$$ 520634 585524 675716 760394 856355 1025420 1317441 1735161 2220255 2674222 3022401
13101C022401K38029J84753J43341K5622l13937n67976o26042n03860l28362j99749
$$ 3022401 3260430 3445183 3588524 3614146 3300209 2732233 2106191 1602331 1273969 1074220
13091A074220j39259r6829j10835o9687m6034l1091k3544m4085l3871m4269m2728
$$ 1074220 934961 838132 727297 657610 611576 580485 556941 512856 478985 434716 391988
13080C91988J6474k2266O793L636j8568L086N1589K0253j7862J098q46Q207k4925
$$ 391988 408462 386196 392989 396625 378057 381143 432732 452985 435123 436221 435375 443582 418657
13067D18657m984j0223m491K0313O929L2010J17990J78622J95016J47322J45820
$$ 418657 413673 403450 398959 419272 426201 458211 576201 754823 949839 1097161 1242981
13056A242981J04022O2768J05427P7621m0426k01512k38092j77570j06312o5340
$$ 1242981 1347003 1409771 1515198 1592819 1552393 1350881 1112789 935219 828907 763567
13046G63567l1302n5294r1534p8653l8844r068m5421j9751j1012j5050J7499J4114
$$ 763567 732265 676971 585437 506784 467940 458872 413451 393700 382688 367638 385137 399251
13034C99251k3310k860K4685K7600l4418l2538K8154N545m840m806Q525j383j8316
$$ 399251 375941 373081 397766 425366 390948 358410 386564 392109 387269 382463 390988 389605 371289
13021C71289J8612j7723m5334j2370j082n659j5262j408K3327J2524j256P544
$$ 371289 389901 372178 326844 314474 313392 307733 292471 291063 314390 326914 325658 333202
13009C33202K8562L6070M89m2111n4056K7148K4558K877k0071j5054n863j0716
$$ 333202 361764 397834 398323 356212 302156 329304 353862 356739 336668 321614 315751 305035
12997C05035k1323l4374l663k603M245J2290Q243J4821L8414N0163K6984L8291
$$ 305035 283712 249338 245675 243072 247317 259607 267850 282671 321085 371248 398232 436523
12985D36523J1605k5428k2285r639l4059l5474j1493j9652l7137L4347q232J796
$$ 436523 448128 422700 400415 390776 356717 321243 309750 290098 252961 287308 279076 280872
12973B80872k4756l2790M504L625m009J5692n455J4917J4148r715J933J0864n518
$$ 280872 256116 223326 227830 231455 227446 243138 237683 252600 266748 257033 258966 269830 264312
12960B64312j4244j4345k1332j4777l7265k1146O257j4759j095J563O641Q901
$$ 264312 250068 235723 214391 199614 162349 141203 147460 132701 131606 133169 139810 148711
12948A48711J9350J3540j2889r183L2800L6535K425k3846m1630o692p043K0855
$$ 148711 168061 181601 168712 159529 192329 228864 231289 207443 165813 159121 152078 172933
12936A72933L6422L0880P994L17K2250R0157J17409Q1663J93723K34885K01239
$$ 172933 209355 240235 248229 248546 270796 360953 478362 560025 753748 988633 1189872
12925A189872J55070J08622j5248m5455k0115j15667r2337j8044l4322j03456
$$ 1189872 1344942 1453564 1438316 1392861 1372746 1257079 1164742 1146698 1112376 1008920
12915A008920o5022n7728k5793j2722N299k9416j8174k880K1409K6121L7833R18
$$ 1008920 943898 886170 860377 847655 852954 823538 805364 802484 823893 850014 887847 888765
12903H88765l031J5119n169k2079Q986K0767J5592J1330j7716M9741O7494J07832
$$ 888765 885734 900853 895684 873605 882591 903358 918950 930280 912564 962305 1029799 1137631
12891A137631J20834J30181P9311N3747L1071K6038N1150Q2735j21513k45157
$$ 1137631 1258465 1388646 1467957 1521704 1552775 1578813 1629963 1712698 1591185 1346028
12881A346028j93274j02940k0859k0933p904k4281j0159O217K1219o607L856j5498
$$ 1346028 1152754 1049814 1028955 1008022 1000118 975837 965678 971895 993114 986507 990363 974865
12869I74865j8502L5590J521l647M9941N8506J2761K2213L9932J7173J3232N912
$$ 974865 956363 991953 993474 989827 1039768 1098274 1111035 1133248 1173180 1190353 1203585 1209497
12857A209497j9131L8675M2054N0268P3630R640j0596N8409N1107M0457N6021
$$ 1209497 1190366 1229041 1271095 1321363 1394993 1404633 1394037 1452446 1503553 1544010 1600031
12846A600031R029J3814J0815K1304P3096P3643P7332P0979R4822R1996P8664
$$ 1600031 1609060 1622874 1633689 1654993 1728089 1801732 1879064 1950043 2044865 2136861 2215525
12835B215525J08484J23103J25439J35430Q3877R8866J09991J64711K94010K99652
$$ 2215525 2324009 2447112 2572551 2707981 2791858 2890724 3000715 3165426 3459436 3759088
12825C759088K72773K78180L50257M51357N40125N72211O05163O24941O94814
$$ 3759088 4031861 4310041 4660298 5111655 5651780 6223991 6829154 7454095 8148909
12816H148909Q87461J044237J236021J560691J964712K275748K624384L136848
$$ 8148909 9036370 10080607 11316628 12877319 14842031 17117779 19742163 22879011
12808B2879011L810859N060246O906208R271411J3528270K2687624M0236159O7419977
$$ 22879011 26689870 31750116 38656324 47927735 61456005 84143629 124379788 191799765
12800A91799765Q6875383P3455909M2508362K5155706J1646583K0628339L4752927
$$ 191799765 278675148 352131057 394639419 419795125 431441708 452070047 486822974
12793D86822974m7832294j21468732r2357788n7211653l6002338k3681638j6352491
$$ 486822974 438990680 317521948 225164160 167952507 131950169 108268531 91916040
12786I1916040j2029290r189031p199775n590288m318818l689709l697080l436305
$$ 91916040 79886750 70697719 63497944 57907656 53588838 49899129 46202049 42765744
12778D2765744l015281k547550k198213j920625j699577j521125j349358j241972
$$ 42765744 39750463 37202913 35004700 33084075 31384498 29863373 28514015 27272043
12770B7272043j154084j143877j113636j065414j024962q88399p92927p89184
$$ 27272043 26117959 24974082 23860446 22795032 21770070 20881671 20088744 19299560
12762A9299560q18384p00334n77092n79841o11217n40519n12980n21822n16485
$$ 19299560 18481176 17780842 17203750 16623909 16012692 15472173 14959193 14437371 13920886
12753A3920886m59649m04452l70048l64553l71887l72765l64949l78519l33288
$$ 13920886 13461237 13056785 12686737 12322184 11950297 11577532 11212583 10834064 10500776
12744A0500776k73625l18539k84670l01536k64269k05881k30467k83960k44164
$$ 10500776 10227151 9908612 9623942 9322406 9058137 8852256 8621789 8337829 8093665
12735H093665k66686k62324k25806j94100j98459k10001j87442j81658j36046
$$ 8093665 7826979 7564655 7338849 7144749 6946290 6736289 6548847 6367189 6231143
12726F231143j29447j03364j13553j38006j29241j04287r6890j13769j16425j12128
$$ 6231143 6101696 5998332 5884779 5746773 5617532 5513245 5416355 5302586 5186161 5074033
12716E074033r7503j02622q4290r4794r7494j17711q5811j16938j04234j13719
$$ 5074033 4976530 4873908 4789618 4694824 4597330 4479619 4393808 4276870 4172636 4058917
12706D058917j00866j14436j35359j17905j07515q3652q3031r5482r6915n6800
$$ 4058917 3958051 3843615 3708256 3590351 3482836 3399184 3316153 3220671 3123756 3066956
12696C066956j5899o5200o3884k9885m4748m5545o2629r6392o0590j6417J1161
$$ 3066956 3051057 2985857 2921973 2892088 2847340 2801795 2739166 2642774 2582184 2565767 2576928
12685B576928Q515k0487l2040q2727r2683j08377q2801r3997j30606r5602j00740
$$ 2576928 2585443 2564956 2532916 2450189 2357506 2249129 2166328 2072331 1941725 1846123 1745383
12674A745383p2580o8287j48220j38247j23234q8708l2533p7578j29929j9021
$$ 1745383 1672803 1604516 1456296 1318049 1194815 1106107 1073574 995996 866067 847046
12664H47046j6368l519K5439K9977J5019k7231m0954j4084j4751k8753k7726l0094
$$ 847046 830678 827159 852598 882575 897594 870363 829409 815325 800574 771821 744095 714001
12652G14001l5225m0731m880N646L0720J2365l104M30J5872O241p426r13j5213
$$ 714001 678776 638045 633165 638811 669531 681896 678792 679222 695094 701335 693909 692996 677783
12639F77783p546j7079K013j5782j2117L142N913m3429l0428k4426J1167R251
$$ 677783 670237 653158 655171 639389 627272 630414 636327 592898 562470 538044 549211 558462
12627E58462l725K5498r392j7805p840j233M239L554O514k0059j2150j5046r13
$$ 558462 554737 580235 570843 553038 545198 543965 548204 551758 558272 538213 526063 511017 510104
12614E10104m8627n2613l0567j0918j1577m5882l0640m3051K3128K8178K8935
$$ 510104 461477 408864 378297 367379 355802 309920 279280 236229 259357 287535 316470
12603C16470M5756L000K0150K2892M316L2034j0367J7330j3595n4826l8680p868
$$ 316470 362226 365226 385376 408268 412584 444618 434251 451581 437986 383160 344480 336612
12591C36612j2797m071J9836J3444l7727q817R716L912k292L0016j3484k6679
$$ 336612 323815 319744 339580 353024 315297 306480 316196 320108 317816 347832 334348 307669
12579C07669J934R006J8065J2899K9312K0370j7790m6152q380m412J0197N351
$$ 307669 309603 318609 336674 349573 378885 399255 381465 335313 326933 322521 332718 338069
12567C38069q114j3108J9431J3771l0636J3185M8846P497K6405K3009Q918K2373
$$ 338069 329955 316847 336278 350049 319413 332598 381444 388941 415346 438355 447273 469646
12555D69646J4260r032R714R369j6324k7253q455r796P594Q29Q233R106K4925
$$ 469646 483906 474874 484588 493957 477633 450380 441925 432129 439723 440552 448785 457891 482816
12542D82816r285k4049j0084J3626J1K066l1048k0510k1223k104m216q416J4037
$$ 482816 473531 449482 439398 453024 453035 455101 424053 403543 382320 380216 376000 367584 381621
12529C81621L5265P892j0344l5555j9495J4349j853k0246l0548J3671J0476J2079
$$ 381621 416886 424778 414434 378879 359384 373733 371880 351634 321086 334757 345233 357312
12517C57312Q677p931l761N469L687O800J837l091j0061r613o343Q564M1223L0888
$$ 357312 365989 358058 354297 359766 363453 370253 372090 368999 358938 349325 342982 351546 392769 423657
12503D23657J2952k5022l3663J1923k9966l0659j3442l5484M468l387J9967Q813
$$ 423657 436609 411587 377924 389847 359881 329222 315780 280296 284764 281377 301344 310157
12491C10157j2089J4876J6190O301L538l668k2857j6577l099J8162J6565j5349
$$ 310157 298068 312944 329134 335435 338973 335305 312448 295871 292772 310934 327499 312150
12479C12150K881o705L70j0616K701J2514k892j0862P581R932J34M1488L0805
$$ 312150 315031 308326 308696 298080 300781 313295 310403 299541 307122 317054 317188 358676 389481
12466C89481K184J2097J4797n381j7043o145N023K1781K4855j3751j5287J1594
$$ 389481 391665 403762 418559 413178 396135 389990 395013 416794 441649 427898 412611 424205
12454D24205J5725J8294r286K9500q675l4195J8187N0680K9391L3535L49Q641
$$ 424205 439930 458224 448938 478438 469763 435568 453755 504435 533826 567361 567710 576351
12442E76351Q98P925J5784O281J9876K864p657o002J6422J8711L1570J6139q454
$$ 576351 577249 585174 600958 607239 627115 629979 622322 616320 632742 651453 683023 699162 690708
12429F90708J3696N948n161J7648K6649K1550J6325J8539K479J7941N164L0922
$$ 690708 704404 710352 705191 722839 749488 771038 787363 805902 808381 826322 831486 862408
12417H62408o555o790J0791L0076N1561K6336J1446M5298J3153K3634K5232L3162
$$ 862408 855853 849063 859854 889930 941491 967827 979273 1024571 1037724 1061358 1086590 1119752
12405A119752K3210K7551L5246K4102j7725K4073J6384n936K7337J5906q077N434
$$ 1119752 1142962 1170513 1205759 1229861 1212136 1236209 1252593 1246657 1273994 1289900 1281823 1287257
12393A287257M0585M2262L4528N3721P4739O3728L9318L3483J2063O131L8766
$$ 1287257 1327842 1370104 1404632 1458353 1533092 1596820 1636138 1669621 1681684 1687815 1726581
12382A726581L1696J2775L0626L5628K8331M6594K9416K9049K2896K6158M2249
$$ 1726581 1758277 1771052 1801678 1837306 1865637 1912231 1941647 1970696 1993592 2019750 2061999
12371B061999M8780N8838J3188L1054O4852N6852P8100Q4378Q5094P0287R2635
$$ 2061999 2110779 2169617 2182805 2213859 2278711 2335563 2413663 2498041 2583135 2653422 2746057
12360B746057J09812J18887J23028J03053J52894J56491J49826J84537K04234
$$ 2746057 2855869 2974756 3097784 3200837 3353731 3510222 3660048 3844585 4048819
12351D048819K35385K53634K50704K57084K59449K72242L07503L38866L90296
$$ 4048819 4284204 4537838 4788542 5045626 5305075 5577317 5884820 6223686 6613982
12342F613982L81098M32464N10737N89041P05625P71990Q31513R24909R99099
$$ 6613982 6995080 7427544 7938281 8527322 9232947 10004937 10836450 11761359 12760458
12333A2760458J094946J246915J407451J616761J791022J827152J962066K249184
$$ 12760458 13855404 15102319 16509770 18126531 19917553 21744705 23706771 25955955
12325B5955955K757727L479971M081213M220476M610230N122361N436503N452128
$$ 25955955 28713682 32193653 36274866 40495342 45105572 50227933 55664436 61116564
12317F1116564N123621M343774L167054J968679R90416J69784n56185j141532
$$ 61116564 66240185 70583959 73751013 75719692 76710108 76879892 76323707 75182175
12309G5182175j415025j380354j133726p48132l58856R1856N32346R67106J362432
$$ 75182175 73767150 72386796 71253070 70504938 70146082 70237938 70770284 71737390 73099822
12300G3099822J692740J930081K189186K451743K633696K779854K826074K807338
$$ 73099822 74792562 76722643 78911829 81363572 83997268 86777122 89603196 92410534
12292I2410534K746002K681191K661030K737961K892945L089036L194274L274725
$$ 92410534 95156536 97837727 100498757 103236718 106129663 109218699 112412973 115687698
12284A15687698L347726L264037L058614K673055K066027J123993O8907q88086
$$ 115687698 119035424 122299461 125358075 128031130 130097157 131221150 131290057 130401971
12276A30401971j657373k147750k430210k651265k822300k884817k778333k528755
$$ 130401971 128744598 126596848 124166638 121515373 118693073 115808256 113029923 110501168
12268A10501168k164669j788728j446819j324729j291606j320160j383371j395465
$$ 110501168 108336499 106547771 105100952 103776223 102484617 101164457 99781086 98385621
12260I8385621j348349j300208j292768j342025j442775j628175j804358j930265
$$ 98385621 97037272 95737064 94444296 93102271 91659496 90031321 88226963 86296698
12252H6296698k100667k282198k546442k903965l299889l593600l646376l526312
$$ 86296698 84196031 81913833 79367391 76463426 73163537 69569937 65923561 62397249
12244F2397249l367490l402874l467803l315239l034106k722036k451863k196639
$$ 62397249 59029759 55626885 52159082 48843843 45809737 43087701 40635838 38439199
12236C8439199j962929j817518j699658j634043j566222j486277j398021j311912
$$ 38439199 36476270 34658752 32959094 31325051 29758829 28272552 26874531 25562619
12228B5562619j250660j163414j104128j070851j008620r32556q32873p24305
$$ 25562619 24311959 23148545 22044417 20973566 19964946 19032390 18199517 17475212
12220A7475212o63505o18452n68461n33760m91120m28265m12440m38102m23784
$$ 17475212 16811707 16193255 15624794 15091034 14599914 14171649 13759209 13321107 12897323
12211A2897323l86925l83959l92741l65908l39323l57074l40915l09181l31482
$$ 12897323 12510398 12126439 11733698 11367790 11028467 10671393 10330478 10021297 9689815
12202I689815l27653k81488k75084k52462k70275k78346k55524k72652k59575
$$ 9689815 9362162 9080674 8805590 8553128 8282853 8004507 7748983 7476331 7216756
12193G216756k13414k26216k41223k28326k02224j86957j67617j62668j93128
$$ 7216756 7003342 6777126 6535903 6307577 6105353 5918396 5750779 5588111 5394983
12184E394983j86707j39524j41765j49374j45416j41501j14102r6937j38629j56888
$$ 5394983 5208276 5068752 4926987 4777613 4632197 4490696 4376594 4279657 4141028 3984140
12174C984140j26619j24332j12500j27565j00659j04393r4579j00975r8458n1489
$$ 3984140 3857521 3733189 3620689 3493124 3392465 3288072 3193493 3092518 2994060 2942571
12164B942571o6398o9822n6469q5831r1565j00375p2357p7751p0511n3172l0217
$$ 2942571 2876173 2806351 2749882 2664051 2572486 2472111 2399754 2322003 2251492 2198320 2168103
12153B168103o3339n0499q4488p1058n5853n6521p7408l1591n5560n1166n8019
$$ 2168103 2104764 2054265 1969777 1898719 1842866 1786345 1708937 1677346 1621786 1570620 1512601
12142A512601m2134k0908l4978m4304n5038o1801n0507n789j0752j9697k7775
$$ 1512601 1470467 1449559 1414581 1370277 1315239 1253438 1202931 1197142 1186390 1166693 1138918
12131A138918l9152l4231j1938R96m2831k1701k4229m045j982k0973P940m674
$$ 1138918 1099766 1065535 1053597 1054593 1011762 990061 965832 961787 959805 938832 946772 942098
12119I42098m5686k4397L469k7696l0164l3702Q825Q052k7879m6407j9991m808
$$ 942098 896412 872015 875484 847788 817624 783922 792747 800799 772920 726513 706522 701714
12107G01714j1790k4994n1934m4070j0201K0633n22j8687r501k3823l4305n59
$$ 701714 689924 664930 612996 568926 558725 579358 578836 560149 550648 526825 492520 491961
12095D91961j8806j5055j2953J1726O264K650n104m875j4896k8065p766K1114
$$ 491961 473155 458100 445147 456873 463137 465787 460683 455808 440912 412847 405081 426195
12083D26195j387P119k509j249m089q605k8395q311J2122J4178j1073p162o4153
$$ 426195 424808 431927 429418 428169 424080 415475 387080 378769 390891 405069 393996 386834 322681
12070C22681j2839J168J9129J9566J6457Q32n402M159Q16R058j1275l6689j7156
$$ 322681 309842 311010 330139 349705 366162 366994 361592 365751 366567 375625 364350 327661 310505
12057C10505o234j1698J3879p033l80k1218L274N313p083L1044J8620n4786k1286
$$ 310505 304271 292573 306452 299419 299039 277821 281095 286408 279325 310369 328989 274203 252917
12044B52917J2045J1118k603p372K807k4446l079J9613J459O3O295n549K9302
$$ 252917 264962 276080 273477 266105 268912 244466 241387 261000 262459 262522 268817 263268 292570
12031B92570M393p995k5721l3099J1723L2311J4355k9684j3732n919j3794j3373
$$ 292570 296963 288968 263247 230148 241871 274182 288537 258853 245121 239202 225408 212035
12019B12035L642O667M495j8952m1193P425J5055k810k7642O958J9136K468l4868
$$ 212035 215677 222344 226839 207887 166694 174119 189174 186364 158722 165680 184816 187284 152416
12006A52416j7151O358L172J8346q050j5803m445k3596j8199J1810J9491J3973
$$ 152416 135265 141623 144795 163141 155091 139288 134843 111247 93048 104858 124349 138322
11994A38322l3634l8013o996K3211K8588L63o035l0674p55J5327m335j643K4206
$$ 138322 104688 66675 59679 82890 111478 111841 105806 75132 74377 89704 85369 83726 107932
11981A07932p212k7381j6284k3864J5494J157j1662J9423p24m237m558J4702k1533
$$ 107932 100720 73339 57055 33191 48685 49842 38180 57603 56879 52642 48084 62786 41253
11968D1253J6441K2665l2736m7421R819K878j0372J0464K3907o746K1262K3912
$$ 41253 57694 80359 47623 202 10021 12899 2527 12991 36898 30152 51414 75326
11956G5326m436j5775J8167l486m8041m7932R247k428J8699J3110K6009O354k4803
$$ 75326 70890 55115 73282 69796 21755 -26177 -16930 -19358 -659 12451 38460 44814 20011
11943B0011M605j525o058k065k825J686R273K6782j399Q241j9928k7736J6923
$$ 20011 24616 23091 17033 14968 12143 13829 23102 49884 48485 56726 36798 9062 25985
11930B5985K2670J0619n000K1464L806k0507r363j018L0477q812k2036J3718j2023
$$ 25985 48655 59274 54274 75738 79544 59037 49674 48656 79133 70321 48285 62003 49980
11917D9980k1172R915j2691l3790r590K8971K3906J7052J8231K6521o99j9544
$$ 49980 28808 38723 26032 -7758 -17348 11623 35529 52581 70812 97333 96634 77090
11905G7090k580J2397L950p80R651P322J949j0269L362J5440M389o676J2505K6933
$$ 77090 74510 86907 90857 90077 99728 107050 108999 98730 102092 117532 121921 115245 127750 154683
11891A54683L1301J4550k6710J5348N4128J0489J3281M7001O708j7406j8813R369
$$ 154683 185984 200534 173824 189172 243300 253789 267070 314071 320779 303373 284560 293929
11879B93929M2743K1334R311j803j258N092J4157k521j0675j7985m963l128R788
$$ 293929 336672 358006 367317 365514 364256 369348 383505 380984 370309 352324 347361 344233 354021
11866C54021N1589M5441J7563k284K4281Q333J8404K4542N207r023K925l331J2078
$$ 354021 405610 451051 468614 466330 490611 498944 517348 541890 547097 538074 540999 537668 549746
11853E49746J0765M7105J7575J9312n858q941K1258K4112K6658K7934P610k8302
$$ 549746 560511 607616 625191 644503 638645 629704 650962 675074 701732 729666 737276 708974
11841G08974m7859q527k2864j6822j8929j8808j5698l559J227l38k2187m4685
$$ 708974 661115 652588 629724 612902 593973 575165 559467 555908 557135 556797 534610 489925
11829D89925j3372k114j3032J3468k401k3057m21m479k0285n015J144j9205j4110
$$ 489925 476553 474439 461407 474875 472474 449417 448996 444517 424232 419217 420361 401156 387046
11816C87046M158j1775l0289j9357m2821J1534J2782M435N977k6150o456k2587
$$ 387046 391204 379429 349140 329783 286962 298496 311278 315713 321690 295540 289084 266497
11804B66497l6850l2446l1540j7361K783L9093K4103r746m9513l7229m525J6314
$$ 266497 229647 197201 165661 148300 151083 190176 214279 204533 155020 117791 113266 129580
11792A29580p063j1255k7654j7098k185J4935m111j5988n904O023j8391j837K211
$$ 129580 122517 111262 83608 66510 64325 79260 75149 59161 53257 59280 40889 39052 41263
11779D1263O318j1535j4115j2651J0872J8293M431m774J3470J8562k2687J3798
$$ 41263 47581 36046 21931 9280 20152 38445 42876 38102 51572 70134 47447 61245
11767F1245K1312l5826p575K6090N963j0313k9222j0905N311K328J5839J5511
$$ 61245 82557 46731 39156 65246 71209 60896 31674 20769 26080 28408 44247 59758
11755E9758n081k2209J3180Q964N480l3354l2422J8849M451j2122r324J1015L4756
$$ 59758 54677 32468 45648 54612 60092 26738 -5684 13165 17616 5494 -3830 7185 41941
11742D1941j9709P110m275K814j978J9747J591k5110j7571o0028J1534K9704j1696
$$ 41941 22232 29342 25067 27881 25903 45650 47241 22131 4560 -55468 -43934 -14230 -25926
11729b5926J979j5923N101J2029j0195j6506J405J4059n961Q802j153L777J6874
$$ -25926 -23947 -39870 -34769 -22740 -32935 -49441 -48036 -33977 -39938 -31136 -32289 -28512 -11638
11716a1638R458N419M785P848k5894l1634K7319J0048j3171Q288J817K842j8953
$$ -11638 -2180 3239 8024 15872 -10022 -41656 -14337 -4289 -17460 -9172 -7355 -4513 -23466
11703b3466r167K1634P578k0867J4433K7509k3217k2357p849k72j147J8663j904
$$ -23466 -32633 -10999 -3421 -24288 -9855 17654 -5563 -27920 -35769 -36041 -37188 -18525 -20429
11690b0429n027K2784K5839k1228m1912j2182p286L5495J9587j7666J8118O921
$$ -20429 -25456 -2672 23167 1939 -39973 -52155 -59441 -23946 -4359 -22025 -3907 3014
11678C014M430k6540l1085J7068N978j1842J0836q148j46K0238K7179k2761J965
$$ 3014 7444 -19096 -50181 -33113 -27135 -38977 -28141 -36289 -36435 -16197 10982 -11779 -9814
11665i814j7245j6999R898m632j1314J9551J1490K814n789Q839K3410K4030k2974
$$ -9814 -27059 -44058 -34160 -38792 -50106 -30555 -19065 -16251 -22040 -13201 10209 34239 11265
11652A1265P566L1860l1198k4628p888k907r663j6833L768r36J7237Q75M444J2540
$$ 11265 18831 50691 19493 -5135 -13023 -15930 -25593 -42426 -38658 -39594 -22357 -21482 -17038 -4498
11638d498J1700J2866Q272j0844J0867l909j6127r804O701J8424j1009N250j1083
$$ -4498 7202 20068 28340 17496 28363 24454 8327 -1477 5224 23648 12639 17889 6806
11625F806q694K47J4006j0590J0474l1142j3918p400K0879M3503o024j3653k0587
$$ 6806 -1888 -1641 12365 1775 12249 -18893 -32811 -40211 -19332 24171 18147 4494 -16093
11612a6093J9012K3636j6081l4615j4330p00R814j1760M86n435j913R004j3060
$$ -16093 2919 26555 10474 -24141 -38471 -39171 -29357 -41117 -40631 -46066 -47979 -38975 -52035
11599e2035J4454M7807j3611j3462O042m5J1608o78r927J5164O537j8073j6496
$$ -52035 -37581 10226 -3385 -16847 -10805 -10850 758 80 -9847 5317 11854 -6219 -22715
11586b2715J2004l196p247O295l0730l1430J3670M0656Q028R550l7940k7092K7016
$$ -22715 -10711 -13907 -21154 -14859 -45589 -77019 -63349 -22693 -14665 -5115 -43055 -70147 -43131
11573d3131M8101J0669n033j1505k040O138j4180j949j1349n081K377J5026J1805
$$ -43131 4970 15639 10606 -899 -2939 3199 -10981 -12930 -24279 -29360 -26983 -11957 -152
11560a52p779p331J2749q640j879K5602k469k5186J4403n792O70k4277J5142j1699
$$ -152 -7931 -15262 -2513 -11153 -13032 12570 10101 -15085 -682 -6474 -5804 -30081 -14939 -26638
11546b6638J0153q195k6089N618K1576j3367J4721K8152j3988J3939J784J8462
$$ -26638 -16485 -24680 -50769 -45151 -23575 -36942 -22221 5931 -8057 5882 7666 26128
11534B6128R079Q514k1397k7791j3977q219J0872R053n339Q735M695j1780N381
$$ 26128 35207 43721 22324 -5467 -19444 -27663 -16791 -7738 -13077 -4342 353 -11427 -6046
11521f046J6012J0248k7034R302p038j771K851J19K0143O87p277p234O093o036
$$ -6046 9966 20214 -6820 2482 -4556 -6327 -3476 -3357 16786 17473 10196 2962 9055 3019
11507C019k1151o60l1937J7051K0809K8268K7793l1731j7101l907j5037p951J2623
$$ 3019 -18132 -18792 -50729 -33678 -12869 15399 43192 11461 -5640 -9547 -24584 -32535 -19912
11494a9912K3378J6464m2765l1637J5891N843k410j0654J0472K5048j9370k6376
$$ -19912 3466 19930 -22835 -54472 -38581 -32738 -35148 -45802 -35330 -10282 -29652 -56028
11482e6028R388R869J4642J0461j9294O674J3930p34P57j4125j233J7485k2111
$$ -56028 -46640 -36771 -22129 -11668 -30962 -24288 -10358 -11092 -10335 -24460 -25693 -8208 -30319
11469c0319j3467J9067L5641O80k9589j8973P997o562p317O938J4418J1242O76
$$ -30319 -43786 -24719 10922 11602 -17987 -36960 -28963 -35525 -42842 -35904 -21486 -10244 -9568
11456i568j7631k092M424R984J441O063J6438J3630j5440k3235K031K1411j5352
$$ -9568 -27199 -29291 -24867 -14883 -13442 -7379 9059 22689 7249 -15986 -13955 7456 -7896
11443g896k4535k6176l579J8618J6160J8484l857J364J829J2823J6395j2160l189
$$ -7896 -32431 -58607 -62186 -43568 -27408 -8924 -12781 -11417 -9588 3235 19630 7470 4281
11430D281J3758M247P839j8310q824m585p008J4309o858n629k681j6477J0608
$$ 4281 18039 22286 30125 11815 2991 -1594 -8602 5707 -1151 -6780 -9461 -25938 -15330
11417a5330K6744j9074k7178L2359K1056k5q852l2018j575J2428J1139N686j5507
$$ -15330 11414 -7660 -34838 -2479 18577 18552 9700 -22318 -23893 -11465 -326 5360 -10147
11404a0147m559Q608J8303j7872j0391K4428j6357n896m346l1791Q395K5211J6316
$$ -10147 -14706 -6098 12205 -5667 -16058 8370 -7987 -13883 -18229 -50020 -41625 -16414 -98
11391i8L388l7112j2853l339Q42L242K3193J9455o861l042J6775L133n952j0860
$$ -98 3290 -33822 -46675 -50014 -49172 -45930 -22737 -3282 -10143 -13185 3590 6723 771 -10089
11377a0089J3536r929j2357j644N999J4210J3444p243l5326k1033k7618K3124
$$ -10089 3447 -6482 -18839 -20483 -14484 -274 13170 5927 -29399 -50432 -78050 -54926
11365e4926K2342J6348K0569j3676l1309q805O050J7353K6291Q518j1453p016
$$ -54926 -32584 -16236 4333 -9343 -40652 -49457 -43407 -26054 237 8755 -2698 -9714
11353i714Q022K5283q8r767j2548J1483J4230K092M297o267j0928J194R497q526
$$ -9714 -1692 23591 23503 13736 1188 12671 26901 28993 33290 27023 16095 17289 26786 18260
11339A8260n078j221j2127j8836K187P418J6400P871P871Q310l4521l5777J1352
$$ 18260 13182 11961 -166 -19002 -16815 -9397 7003 14874 22745 31055 -3466 -39243 -27891
11326b7891K5595q719J7735j2487m777K1261K058l8415n8907J7184K7633j9873
$$ -27891 -2296 -11015 6720 -5767 -10544 10717 12775 -25640 -84547 -67363 -39730 -59603
11314e9603K0121J2200J5309K5956L347K657k411o125k7135k4198r08J7027J7528
$$ -59603 -39482 -27282 -11973 13983 17330 19987 17576 11451 -15684 -39882 -40790 -23763 -6235
11301f235L2118O787m689l7458p18K9460K7529J10k4534k8094k6553J8536k236
$$ -6235 25883 32670 27981 -9477 -10195 19265 46794 46904 22370 -5724 -32277 -13741 -15977
11288a5977n713m378L825J500k183M653j3430J2094M111k1428k2686J8503J8613
$$ -15977 -21690 -26068 -22243 -20743 -22926 -18273 -31703 -19609 -15498 -36926 -59612 -41109 -22496
11275b2496j3043o369L954K5665M7282J0779l1479j7861j6648k2014K6200R307
$$ -22496 -35539 -41908 -37954 -12289 34993 45772 14293 -3568 -20216 -42230 -16030 -6723
11263f723k3314L97P873R894P754k734o753r519l232j2104Q199K3717j0064j2792
$$ -6723 -30037 -29640 -21767 -11873 -4119 -6853 -13606 -23125 -26357 -38461 -30262 -6545 -16609 -29401
11249b9401J856k860J0113j3138n033J3029J5850J4653K0079k918n831j2554p807
$$ -29401 -27545 -30405 -20292 -33430 -38463 -25434 -9584 5069 25148 22230 16399 3845 -3962
11236c962J2181p55l657o972k1900l628J7222N578N261P793j5151L398J8978r914
$$ -3962 8219 7464 3807 -3165 -25065 -28693 -11471 -5893 -632 7161 -7990 -4592 14386 4472
11222D472J5667l833m1548P093J2991J346K5477l6k4851K0823K3162j5855q230
$$ 4472 20139 16306 -25242 -18149 -5158 -3812 21665 21629 -3222 17601 40763 24908 16678
11209A6678P018L410K0683K607r678j5368r136r281O785K0081k0456k9478J0664
$$ 16678 23696 27106 47789 50396 40718 25350 16214 6933 13718 33799 13343 -16135 -5471
11196e471Q548k4763L768J0350j3855M694K0236o215J9069K1888N718j5910Q137
$$ -5471 3077 -21686 -17918 -7568 -21423 -16729 3507 -2708 16361 38249 43967 28057 36194
11183C6194K3807m340k8063k5339k5588j5616P57N714p080J0066L0936J5939L551
$$ 36194 60001 55661 27598 2259 -23329 -38945 -38188 -32474 -39554 -29488 1448 17387 20938
11170B0938P15j7976l0090j2468N194j2196q403J5804K1731L543M902J1904j5684
$$ 20938 21653 3677 -26413 -38881 -33687 -45883 -54286 -38482 -16751 -13208 -8306 3598 -12086
11157a2086m1712L17L0760p804n393N0240L3052j0393L445q550K0990M924k4468
$$ -12086 -53798 -53481 -22721 -30525 -35918 14322 47374 36981 40426 31876 52866 57790 33322
11144C3322l0966m207J9793k398L971m1778k4519J4366k1772R331K9837K0708
$$ 33322 2356 -1851 17942 15544 19515 -22263 -46782 -32416 -54188 -44857 -15020 5688
11132E688J2061j9203j5015L404J0780J0420M64k5312l4334J4833K5155K2692
$$ 5688 17749 -1454 -16469 -13065 -2285 8135 8599 -16713 -51047 -36214 -11059 11633
11120A1633j6318k3525k401m614J1706P344j7217j5126J449J0329K3161P586J1495
$$ 11633 -4685 -28210 -30611 -35225 -23519 -16175 -33392 -48518 -47069 -36740 -13579 -5993 5502
11107E502M437o637J3445l2077K452J6366J3529O49o120q268N128j688J9259J4466
$$ 5502 9939 3302 16747 -15330 -12878 3488 17017 17666 11546 3278 8406 6718 25977 40443
11093D0443j9171l602j2881j017L372n315l647n454J2145k414k38K0338r275j8989
$$ 40443 21272 17670 4789 3772 7144 1829 -1818 -7272 4873 2459 2221 22559 13284 -5705
11079e705j9228R576l329m803K5136R505P59J1077o119n748q227N438M417M384
$$ -5705 -24933 -15357 -18686 -23489 1647 11152 11911 22988 16869 11121 2894 8332 12749 17133
11065A7133k8233j6939R335L787L2467K4724j023k2519k4978K4622O129k096k6256
$$ 17133 -11100 -28039 -18704 -14917 17550 42274 41251 18732 -6246 18376 24505 22409 -3847
11052c847J6775N688k622q133L104k1743j8176M678Q22J8546J1352J5526J4425
$$ -3847 12928 18616 15994 7861 10965 -10778 -28954 -24276 -23454 -4908 6444 21970 36395
11039C6395j0045m1097k5316J202J6164j297p289L112q74j5344L3031M0989K75
$$ 36395 26350 -14747 -40063 -38861 -22697 -23994 -31283 -28171 -29045 -44389 -11358 29631 29906
11026B9906k1258J700r627J4623J0862j3320k4182j2895K6562K0702l0042j1136
$$ 29906 8648 10348 721 15344 26206 12886 -11296 -24191 2371 23073 -6969 -18105
11014a8105J708k8318J2194J5878K2439K6210J4274L413n6874m0135O732R788
$$ -18105 -16397 -44715 -32521 -16643 5796 32006 46280 49693 -7181 -47316 -40584 -30796
11002c0796P980j1300J0566K45k906n145J4926J8252k922m515J8525n293k5994
$$ -30796 -22816 -34116 -23550 -23305 -26211 -31356 -16430 1822 -1100 -5615 12910 7617 -18377
10989a8377J3779P177N877k934J2308r170M49P813j3664j665J5080m491j8808
$$ -18377 -4598 2579 8456 5522 17830 8660 9109 16922 3258 1593 16673 12182 -6626
10976f626J7227J6415J785j3209J448j251l8365j4939J5267K1993K4272J9426
$$ -6626 10601 27016 28801 15592 17040 15789 -22576 -37515 -22248 -255 24017 43443
10964D3443J2631M892j6367j170m365k8030k137o495J2638K5743J6115Q127k4886
$$ 43443 56074 60966 44599 43429 39064 11034 8897 2402 15040 40783 56898 65025 40139
10951D0139l4654n766j2912K064K2849J4677l1055l4490K0573J7625l01j1723
$$ 40139 5485 -281 -13193 -11129 11720 26397 -4658 -39148 -18575 -950 -1251 -12974
10939a2974P628J7238Q988j5717J6242J8265q679o279k3808J6151m813J6267k5930
$$ -12974 -5346 11892 20880 5163 21405 39670 30991 24712 904 17055 12242 28509 2579
10926B579l762R220K0222j8839k0274K880j009j9806j9849j3808K0691J9403L1356
$$ 2579 -1183 8037 28259 9420 -10854 -7974 -8983 -28789 -48638 -62446 -41755 -22352 9004
10913I004q52l626J570l8j0201k2654j9809p508N601K9009L4168K7865k1312l9213
$$ 9004 8152 4526 6096 6058 -4143 -26797 -46606 -54114 -48513 -19504 14664 42529 21217 -17996
10899a7996N136J7485J0549L699p972j8702l853k0833R112P439J747M107K1317
$$ -17996 -12860 4625 15174 18873 10901 -7801 -11654 -32487 -23375 -15936 -14189 -10082 11235
10886A1235K1016k9665j5415P354k2619J6653N191N82J0329k798n19J9485j67
$$ 11235 32251 2586 -12829 -5475 -28094 -11441 -6250 -5668 4661 1863 1344 20829 20662
10873B0662O54j9688K354L775J003j6275j1410Q012N4317M4075m315k4662k7171
$$ 20662 21316 1628 3982 7757 8760 -7515 -18925 -10913 43404 87479 83164 58502 31331
10860C1331k5993N38L0556J7076m023j8651r539l816J1097J7928j3991k5273j8891
$$ 31331 5338 5876 36432 53508 49485 30834 21295 17479 28576 46504 32513 7240 -11651
10847a1651q507p680J8559J5373j1078k8656j0589R706M193q341L634J9195J6799
$$ -11651 -20158 -27838 -9279 6094 -4984 -33640 -44229 -34523 -30330 -38671 -35037 -15842 957
10834I57M516M587p866J5637J1373q046N628j0122j8671r839q478K9156J4340
$$ 957 5473 10060 2194 17831 29204 21158 26786 16664 -2007 -11846 -20324 8832 23172
10821B3172o966O178j776k7844L424K2066k4895j3934j4254P862J1155L864R928
$$ 23172 16206 22384 20608 -7236 -3812 18254 -6641 -20575 -34829 -26967 -15812 -11948 -2020
10808b020J3250K092k914r625k6147m08m879J4026J3607J2951j2528j1095K2444
$$ -2020 11230 13322 10408 783 -25364 -25772 -30651 -16625 -3018 9933 -2595 -13690 8754
10795H754K7918j3928l1602j1818K1766n5m529R637N948J4303j3718j5916n169
$$ 8754 36672 22744 -8858 -20676 1090 1035 -3494 6143 12091 26394 12676 -3240 -8409
10782h409Q284K6663n930k3417J90o612J0313J7116j6702j2897J9322k567j2829
$$ -8409 -125 26538 20608 -2809 -2619 -9231 1082 18198 1496 -11401 7921 5354 -7475
10769g475n378n885J8613n104J9422k916j322K5964M668j1797j5490n289L71n881
$$ -7475 -12853 -18738 -125 -5229 14193 11277 9955 35919 40587 28790 13300 8011 8382 2501
10755B501J0502j8462l6617K0913K7168R374l710j0260N24l1705q24j8570k0081
$$ 2501 13003 -5459 -42076 -21163 6005 15379 11669 1409 1933 -29772 -30596 -49166 -69247
10742f9247L1397J1303j3690j501L439M3013L0321J6110J9037j1057k9036p681
$$ -69247 -37850 -26547 -40237 -41738 -38299 4714 35035 51145 70182 59125 30089 22408
10730B2408j6515l3893k936j568J8026J1699L33n265l244j6436R086K0235J7058
$$ 22408 5893 -28000 -30936 -32504 -14478 -2779 -2446 -7711 -10955 -27391 -18305 1930 18988
10717A8988R407k0998m173o306J4272L5236K4248n807j8672k9825l7913M358L8949
$$ 18988 28395 7397 3224 -3082 11190 46426 70674 64867 46195 16370 -21543 -17185 21764
10704B1764K5679j6958K3632N871k7074k9715J4903J2807n724l9652j7688N0K3890
$$ 21764 47443 30485 54117 59988 32914 3199 18102 30909 25185 -14467 -32155 -32105 -8215
10691h215j227k019K1640O060K5966j2370l8381j0739k909K1496O504o156J631
$$ -8215 -9442 -11461 10179 16239 42205 29835 -8546 -19285 -22194 -698 5806 -350 1281
10678A281J1803j9736K776J4327K092p630J2001J945j3340o988K5400J8713p637
$$ 1281 13084 -6652 -3876 10451 12543 4913 16914 18859 5519 -1469 23931 42644 35007
10665C5007k1247R783J2134M158J5126K934k4559j7940J9995o078j6445k594q723
$$ 35007 13760 23543 35677 39835 54961 57895 33336 15396 35391 29313 12868 10274 1551
10652A551O81L1965L981k5035o389K622k0846n591J0487K1774j9915Q414r916
$$ 1551 2232 34197 38178 13143 6754 9376 -11470 -17061 -6574 15200 -4715 3699 -6217
10639f217O228J1474J2749r524J0815p839M639m112J1111j1955J595L425L444
$$ -6217 11 11485 24234 14710 25525 17686 22325 18213 29324 17369 18964 22389 25833
10626B5833k4549K106L6608J8967M87k158L558k6571k8224k237q255P880k719
$$ 25833 1284 3390 39998 58965 59452 57294 60852 34281 6057 3820 -4435 3445 726
10613G26L237l338j9651k59P847k1461J390J4389K3734j0616o016K0471K3500
$$ 726 3963 625 -19026 -19285 -11438 -32899 -31509 -17120 6614 -4002 -10018 10453 33953
10600C3953k3020j5031j4639Q938k567K1690K7993J8117j7811l729J6328m693
$$ 33953 10933 -4098 -18737 -9799 -12366 9324 37317 55434 37623 33894 50222 45529
10588D5529j5447m878J5261k0728k3270K694Q528k4272L1623J3564K832M554J0245
$$ 45529 30082 25204 40465 19737 -3533 -839 7689 -16583 15040 28604 31436 35990 46235
10575D6235k5683j1433K3117n670J3157j0075l2992J975J0560k3959K95J593k830
$$ 46235 20552 9119 32236 26566 39723 29648 -3344 -1369 9191 -14768 -14473 -12880 -15710
10562a5710J0972J3552Q409q08n812J1857K739p726k8156K5949M9593K4738m4086
$$ -15710 -4738 8814 17223 16415 10603 22460 25199 17473 -10683 15266 64859 89597 45511
10549D5511l1135R039K3570K0986J7236k5999J788l425p328n376k2444K216j8256
$$ 45511 14376 23415 46985 67971 85207 59208 60996 57571 50243 44867 22423 24639 6383
10536F383K3526O937J2675o559N217R424k2804Q625N447M614j1178k8378J2840
$$ 6383 29909 36846 49521 42962 48179 57603 34799 43424 48871 53485 42307 13929 26769
10523B6769j035R25j444k1828j6667J4834K9010L2980k1992k1130p228j4844k378
$$ 26769 25734 26659 25215 3387 -13280 1554 30564 63544 41552 20422 13194 -1650 -4028
10510d028J9700n460L663K475J897j153M846R794J0994J6557j8549k5607k5405
$$ -4028 15672 10212 13875 16350 18247 17094 21940 31734 42728 59285 40736 15129 -10276
10497a0276j2567K1957Q592J920Q495J8321J6260k2920j7264K0187M605R450Q175
$$ -10276 -22843 -886 7706 9626 18121 36442 52702 29782 12518 32705 37310 46760 54935
10484E4935j1847l60k288J1485o448J3356m745J3373j9981j682M007Q914K159
$$ 54935 43088 42728 40440 51925 45477 58833 54088 67461 47480 45798 49805 58719 60878
10471F0878o854O697j659J0747M33r080j8436q246r6L704J4449O141J3953R462
$$ 60878 54024 60721 59062 69809 70242 61162 42726 34480 34384 38088 52537 58678 72631 82093
10457H2093r37k7389j4526J1945P879J0383k2184j362j3350j5949j3025k696J0399
$$ 82093 81156 53767 39241 51186 59065 69448 47264 45902 32552 16603 3578 882 11281
10444A1281L5590J9561o678N974K6332J0561l8016j8183l8578L713K4322K3328
$$ 11281 46871 66432 59754 65728 92060 102621 64605 46422 7844 11557 35879 59207
10432E9207j3586Q412K1601J4032j1628j6691q086J7174J0754P46k6598k6278
$$ 59207 45621 54033 75634 89666 78038 61347 53261 70435 81189 81935 55337 29059
10420B9059N980m602R067j4617J6583J6083R451k1742j6451l938K025R603k4113
$$ 29059 35039 30437 39504 24887 41470 57553 67004 45262 28811 24873 26898 36501 12388
10407A2388m398M645J4209J5108Q190j2852j1934r932K157k2629l298o686L681
$$ 12388 7990 12635 26844 41952 50142 37290 25356 15424 17581 -5048 -8346 -15032 -11351
10394a1351K1550j1404J6232J4047J6945J0398q53L394r441p747q817L641L024
$$ -11351 10199 -1205 15027 29074 46019 56417 55564 58958 49517 41770 32953 36594 39618
10381C9618O414R43l4175p621l544R544J2572j944J0464o862K7745M200j0610
$$ 39618 46032 46975 12800 5179 1635 11179 23751 21807 32271 25409 53154 57354 46744
10368D6744N588J1370J6589Q503k5236r792J4399P785J7143J8937r339k7188k6166
$$ 46744 52332 63702 80291 88794 63558 53766 68165 75950 93093 112030 102691 75503 49337
10355D9337j9069j2074J6133Q252j156r948P919J5615k4039j22O535j3943q997
$$ 49337 30268 18194 34327 42579 41423 31475 39394 55009 30970 30848 37383 23440 14443
10342A4443J5215Q355K3391J1244K171j4523m6462q886O437K4258K0173J7951
$$ 14443 29658 38013 61404 72648 74819 60296 13834 4948 11385 35643 55816 73767
10330G3767K982Q408N732L724k0572n963j484j3599K0369m342K1978m551j5998
$$ 73767 76749 85157 90889 94613 74041 68078 66594 52995 73364 69022 91000 86449 70451
10317G0451L707N272k6582q618K173J0861J379m351k1571j724K3839J5078n734
$$ 70451 74158 79430 52848 44230 46403 57264 58643 54292 32721 30997 54836 69914 64180
10304F4180j0563j1428J4994P697J1453J561j3328P961J3748n780j2786J4274
$$ 64180 53617 42189 57183 64880 76333 77894 64566 72527 86275 80495 67709 81983
10292H1983J8670o91p30o463j4597j7135k4448n529J7761K6023O260J0582j4919
$$ 81983 100653 99962 99232 92769 78172 61037 36589 31060 48821 74844 81104 91686 76767
10279G6767j2050J2322Q153O304k1934k7930N851l848p957l753K2102J3303p475
$$ 76767 64717 77039 85192 91496 69562 41632 47483 43635 35678 31925 54027 67330 59855
10266E9855L414Q278k220m444J7420J5088K0986j6151q587q622j8296j44j9530
$$ 59855 63269 71547 69327 64883 82303 97391 118377 102226 93639 85017 66721 66577 47047
10253D7047R883M774J3598J0932j1927q112K8523N854j952K7950m26j1409Q526
$$ 47047 56930 61704 75302 86234 74307 66195 94718 100572 98620 126570 126144 114735 123261
10240A23261K7689J0983k4604j0664l1493m0972j359J1536J4031J3927L816n789
$$ 123261 150950 161933 137329 126665 95172 54200 52841 64377 78408 92335 96151 90362
10228I0362j833M422k366j845K7048j8656m668j1861k1055k3759Q335L899n08
$$ 90362 88529 92951 90585 88740 115788 97132 92464 80603 59548 35789 44124 48023 47515
10215D7515j0524l743J6961J1538l1213j8428j9235j5233K9743L9218J8105L2441
$$ 47515 36991 33248 50209 61747 30534 12106 -7129 -22362 7381 46599 64704 97145
10203I7145L526l3208j3473J8231j4876O647k412k4555J1883J6339j2764J6085
$$ 97145 100671 67463 53990 72221 57345 63992 61580 37025 48908 65247 52483 68568
10191F8568K1380K306m177P854k032p847K65j6507j6661m581q33l19j8795J6098
$$ 68568 89948 92254 88077 95931 93899 86052 86317 69810 53149 48568 47735 47416 28621 44719
10177D4719K3705J5184J5112j4682l7314N126J7995K6927J0738o061j0273j5237
$$ 44719 68424 83608 98720 84038 46724 51850 69845 96772 107510 101449 91176 75939
10165G5939K271j9214p107K2115l606k245Q522k015P880K2683m98l7522o020J1416
$$ 75939 78210 58996 51889 74004 70398 68153 76675 74660 82540 105223 104725 67203 61183 72599
10151G2599J1937j7938M033R846j2662Q226M43l2561K9324J5771p18j9136q233
$$ 72599 84536 66598 70631 80477 67815 76041 76484 43923 73247 89018 88300 69164 60931
10138F0931k7075K7259J5230M564q897N7J0922Q936k2791Q574K3382r677J647
$$ 60931 33856 61115 76345 80909 72012 72069 82991 91927 69136 77710 101092 91415 93062
10125I3062k4606N67J5126j2697M410r214k0990j8275J7281Q385J065O301K4247
$$ 93062 68456 69023 84149 71452 75862 66648 45658 27383 44664 53049 54114 60415 84662
10112H4662r341p057Q799K421o761q507L570J8740r607k2673J0638j7138M247
$$ 84662 75321 68264 77063 79484 72723 64216 67786 86526 76919 54246 64884 47746 51993
10099E1993L0123L509j3943k998L1623k922j5041k9207p717R066J8867R659J4262
$$ 51993 82116 85625 71682 68684 100307 97385 82344 53137 45420 54486 73353 83012 97274
10086I7274n214K7584J376q812j6278j6191q954K553J6954L7717P310k9642k2524
$$ 97274 92060 119644 121020 112208 95930 79739 70785 73338 90292 128009 135319 105677 83153
10073H3153j0484J4143Q541R517Q47k8060o182R947M795l611J1217J7560l134
$$ 83153 72669 86812 95353 104870 105717 77657 71475 81422 86217 82606 93823 111383 108249
10060A08249l6032j6030J162K0739K516n406J3832j1456k3347M737K6483J6902
$$ 108249 72217 56187 57349 78088 80604 75198 89030 77574 54227 58964 85447 102349
10048A02349J047K7548j543m586j0757j9785j662j4372J7637P342r40k477j9617
$$ 102349 103396 130944 129401 124815 114058 94273 92611 78239 95876 103218 102278 99801 80184
10035H0184P3L0017L6632J578k8941R232j465n571M291J6108K2505N542j2663
$$ 80184 80257 110274 146906 148484 119543 128775 127310 121739 126030 142138 164643 170185 157522
10022A57522q43n5721j4015L8659K4208j8228j2985J7365K6593K3485L645j0567
$$ 157522 156679 100958 86943 125602 149810 131582 118597 135962 162555 186040 189685 179118
10010A79118j3966J3715j3321k0049j6890k3648j5264J6432j1698r628J6530L448
$$ 179118 165152 178867 165546 145497 128607 104959 89695 106127 94429 84801 101331 104779
9998A04779j9381l965j4950J1282K3268L184k0855J5298o486j627O809J4952J5166
$$ 104779 85398 81433 66483 77765 101033 104217 83362 98660 92174 90547 97356 112308 127474
9985A27474Q303K7802K5736r521k1702l375l530k61j3588j9604m008k510R904
$$ 127474 135777 163579 189315 179794 158092 154717 151187 150926 137338 117734 113726 111216 121120
9972A21120N781J1550K5123m957q301j019j9127r945J0038L7009J847r87n032
$$ 121120 126901 138451 163574 158617 150316 149297 130170 120225 130263 167272 169119 168132 163100
9959A63100o701K6730j9361j7877K3980R307j4954R826L1849J2336P365j9327
$$ 163100 156399 183129 163768 145891 169871 179178 164224 174050 205899 218235 225600 206273
9947B06273k5749j5169k067L534m225j3141P546O328k2568N687J6788j7444n517
$$ 206273 180524 165355 163288 166822 162597 149456 157002 163330 140762 146449 163237 145793 140276
9934A40276L7533K4057j3342M831m05L0450j6508n6403j8463Q782l6084K5447
$$ 140276 177809 201866 188524 193355 192950 223400 206892 150489 132026 140808 104724 130171
9922A30171L8711K559j4696J5539N578k6727n444J2222K1176K3935N0836J997
$$ 130171 168882 171441 156745 172284 177862 151135 145691 157913 179089 203024 253860 255857
9910B55857k0588J4960J159m829P73J3188j5269l0477j6199k3796j4543L292N504
$$ 255857 235269 250229 251388 246559 247332 260520 245251 214774 198575 174779 160236 163528 169032
9897A69032L1007K5259O864k6324l070j317K109M058J0775K591k8024k2456K1035
$$ 169032 200039 225298 232162 205838 202768 201451 203560 207618 218393 220984 192960 170504 191539
9884A91539J0972k126K504M987k733P203J3822o030p567J956J2277K0900N029
$$ 191539 202511 200385 202889 207876 205143 212346 226168 220138 212571 214527 226804 247704 252733
9871B52733J5511N213k877j0343p191J2769J5703J0229K9179L4762N2260K5533
$$ 252733 268244 273457 270580 260237 253046 265815 281518 291747 320926 355688 407948 433481
9859D33481K2479K4190l644J3908J5532J7390L2787N0612K3143Q8204P3948O6460
$$ 433481 455960 480150 476506 490414 505946 523336 556123 606735 629878 718082 792030 858490
9847H58490J18358J75372K75787M41061P51729J318708K067354K463466K094721
$$ 858490 976848 1152220 1428007 1869068 2620797 3939505 6006859 8470325 10565046
9838A0565046J352194P87946O04520P61057J20521j703658l039828k814061j766494
$$ 10565046 11917240 12705186 13309706 14070763 14191284 12487626 9447798 6633737 4867243
9829D867243j060559o94670m96739l38154k63021j86336j49266r8226q0774p0620
$$ 4867243 3806684 3112014 2615275 2277121 2014100 1827764 1678498 1580272 1499498 1428878
9819A428878q2234o2512k7294l2819k6336k5016l0444k3756o9645o4734m5251
$$ 1428878 1346644 1284132 1256838 1224019 1197683 1172667 1142223 1118467 1048822 984088 938837
9808I38837o786k4846n1003n8892l1035k1145l667l2611j4032k174j1485j7762
$$ 938837 932051 907205 856202 797310 766275 745130 741463 708852 694820 692646 681161 663399
9796F63399j0861o082k8529q984j9889k5697j9925K0494j2508m1328j3240j6519
$$ 663399 652538 646456 617927 608943 589054 563357 543432 563926 551418 510090 496850 480331
9784D80331r440K1571O593K0371J0367K321j9547M625K258q175j4786J5059P444
$$ 480331 470891 492462 499055 519426 529793 532114 512567 517192 519450 511275 496489 511548 518992
9771E18992l1739m3815q39P11k0700j5667j6198M272j63k2261j868J1975P345
$$ 518992 487253 443438 442599 443310 422610 406943 390745 395017 394854 372593 370725 382700 390045
9758C90045m416J6021P83j4966q456K1656O256p952p528m003j1213J2958J4499
$$ 390045 385629 401650 402433 387467 379011 400667 406923 398971 391443 387440 376227 389185 403684
9745D03684r146j3537Q896K5367j4108k5857j474m476m068r10j0853J9102J0797
$$ 403684 394538 381001 389897 415264 401156 375299 373825 369349 365281 364371 353518 372620 383417
9732C83417j4392l118L169K9989P284j3792j7631L943j0214j1281Q030R813O710
$$ 383417 369025 365907 369076 399065 406349 392557 374926 378869 368655 357374 365404 375217 381927
9719C81927J3148R386j4811L1313L540l348J1890k178k1362q577j4421O697j4977
$$ 381927 395075 404461 389650 420963 424503 421155 433045 430867 409505 400928 386507 393204 378227
9706C78227J4772M9161N600j293J0382p676j0579r722J4855M087j1030l1043P262
$$ 378227 392999 442160 447760 446467 456849 449173 438594 428872 443727 447814 436784 405741 413003
9693D13003K7731o748M830L9501O527J8373J2791j5171j153n44J7410L3372J3384
$$ 413003 440734 433986 438816 478317 484844 503217 516008 500837 499684 499140 516550 549922 563306
9680E63306J1778K2165K2856j8909j611M263J3701K3938k8912k0666j2217j2562
$$ 563306 575084 597249 620105 601196 599585 603848 617549 641487 612575 591909 579692 567130
9668E67130l1028k9995N603K3227M8527J6273L7495J8843J196O448K4159J1341
$$ 567130 536102 506107 511710 534937 583464 599737 637232 656075 657271 663719 687878 699219
9656F99219K579J8752j9449j1648J8892M1420K1369J4932P972L150M6976M1755
$$ 699219 701798 720550 701101 689453 708345 749765 771134 786066 794038 797188 844164 885919
9644H85919L9468L2397K4573K9180K4495n357j2118j469p447N313k8770j8765
$$ 885919 925387 957784 982357 1011537 1036032 1030675 1018557 1017088 1009641 1014954 986184 967419
9632I67419j6818M284K7529k006j9307j4424k1778K3647K0608J3655K2876j41
$$ 967419 950601 954885 982414 980408 961101 946677 924899 948546 969154 982809 1005685 1005544
9620A005544J0890K3998J5091O165j0932M991K9003J5650m128K1997L5240K5582
$$ 1005544 1016434 1040432 1055523 1061688 1050756 1055747 1084750 1100400 1096272 1118269 1153509 1179091
9608A179091Q005k805K7990M5486j3044k7526O678k3445j0230j0977m997j9408
$$ 1179091 1187096 1184291 1212281 1257767 1244723 1217197 1223875 1200430 1190200 1179223 1174226 1154818
9596A154818k5230k9595l8494K404R858L2972J0347k544j6125j5204J1782K1162
$$ 1154818 1129588 1099993 1061499 1063903 1073761 1106733 1117080 1114536 1098411 1083207 1094989 1116151
9584A116151k5395n092k9265l923J0648J4053n24J3250J672j7818p828k8894L9018
$$ 1116151 1090756 1085664 1056399 1052476 1063124 1077177 1076653 1089903 1091575 1073757 1065929 1037035 1076053
9571A076053K8478J2519L144R032j1367R157J1397R090j6003j4134o232o636l1488
$$ 1076053 1104531 1117050 1120194 1129226 1117859 1127016 1138413 1147503 1131500 1117366 1111134 1104498 1073010
9558A073010q331K083j0009j4974k0446Q342j6862j5544r023j1237J2057K1004
$$ 1073010 1064679 1066762 1056753 1041779 1021333 1029675 1012813 997269 988246 977009 989066 1010070
9546A010070q223J1496P187J4470K2442q242j6031j8359k5389m458K084J1457
$$ 1010070 1001847 1013343 1020530 1035000 1057442 1049200 1033169 1014810 989421 984963 987047 998504
9534I98504L850j9022R451R280O611j4215M653P688J4793j8522p519N494k5213
$$ 998504 1002354 983332 992783 1002063 1008674 994459 999112 1006800 1021593 1003071 995552 1001046 975833
9521I75833J1696K0296j1083L143N644j1732j9407k695j1316R787K6940j2447
$$ 975833 987529 1007825 996742 999885 1005529 993797 974390 971695 960379 970166 997106 984659
9509I84659k7006k2150j1232J8768J6668K8990J9535p981k1532k5806J0441L1635
$$ 984659 957653 935503 924271 943039 959707 988697 1008232 1000251 978719 952913 963354 994989
9497I94989L5629k654j5801p23J4997M5480J0737J0086kj9609J1259K6934J6295
$$ 994989 1030618 1027964 1012163 1011440 1026437 1071917 1082654 1092740 1092738 1073129 1084388 1111322 1127617
9484A127617L558L035j3768M6513L408J5382J5541j4242l4759O857J4628K6594
$$ 1127617 1131175 1134210 1120442 1166955 1170363 1185745 1201286 1187044 1152285 1159142 1173770 1200364
9472A200364J600j6068Q313K669k1460J7420L6174K416k7950n855k5781k0380
$$ 1200364 1201964 1185896 1194209 1196878 1175418 1192838 1229012 1231428 1203478 1197623 1171842 1151462
9460A151462j7700K5084J7742J707P602j0067q934J0056O956P014k6394j9364
$$ 1151462 1133762 1158846 1176588 1178295 1185897 1175830 1166896 1176952 1183908 1190922 1164528 1145164
9448A145164K562J8463J3330P645j0744J0853r932q209k757j5527p18K3413L610
$$ 1145164 1147726 1166189 1179519 1187164 1176420 1187273 1177341 1169132 1166375 1150848 1150130 1173543 1177153
9435A177153j6318r778Q890J9347j5028J7699k606L971J7625J4226K0860L2749
$$ 1177153 1160835 1151057 1159947 1179294 1164266 1181965 1179359 1183330 1200955 1215181 1236041 1268790
9423A268790m040K422n151j9277k4311k6692m2333m0774k8792r64j5473K832j9498
$$ 1268790 1264750 1267172 1262021 1242744 1218433 1191741 1149408 1108634 1079842 1078878 1063405 1066237 1046739
9410A046739L4897M3129l814N63j8216p76M9548k2166l6986m596l539k1607l913
$$ 1046739 1081636 1124765 1120951 1121514 1103298 1102522 1152070 1129904 1092918 1088322 1084783 1063176 1059263
9397A059263K9127L232m640j3509l6812R177Q352r196J7122k641j0862l0975k4947
$$ 1059263 1088390 1091622 1086982 1073473 1036661 1045838 1054190 1044994 1062116 1059475 1048613 1017638 992691
9384I92691K2837K8488J3298q513j9462k8051K3532L7456J7936n049N751J4617
$$ 992691 1015528 1044016 1057314 1048801 1029339 1001288 1024820 1062276 1080212 1075163 1080914 1095531
9372A095531L7405J9050L9921J9327K9010M7030O7730N3840L2833K0672L3687
$$ 1095531 1132936 1151986 1191907 1211234 1240244 1287274 1355004 1408844 1441677 1462349 1496036
9361A496036K5022J2655K0673L2978K4860K8440L0907L3805L0149M4979N4023
$$ 1496036 1521058 1533713 1554386 1587364 1612224 1640664 1671571 1705376 1735525 1780504 1834527
9350A834527K5120M2671O3983L0428K3820M0339Q5628O5775O6177K7703J9763
$$ 1834527 1859647 1902318 1966301 1996729 2020549 2060888 2146516 2212291 2278468 2306171 2325934
9339B325934K5569N3127N1425K8427k0987K651j9412n9083J1680K080p186K5499
$$ 2325934 2351503 2404630 2456055 2484482 2463495 2466146 2446734 2387651 2399331 2401411 2394225 2419724
9327B419724L6184K8609K4021L8104K7200O4849M9137P0280N8268Q9416R4711
$$ 2419724 2455908 2484517 2508538 2546642 2573842 2638691 2687828 2758108 2816376 2905792 3000503
9316C000503R6182J08065J39637K02363J70561J11863J27322J28368J05289N2476
$$ 3000503 3096685 3204750 3344387 3546750 3717311 3829174 3956496 4084864 4190153 4242629
9306D242629M3439L9752K9291M7333N2474O6633Q1943Q9573L1052K5119M9213
$$ 4242629 4286068 4325820 4355111 4402444 4454918 4521551 4603494 4693067 4724119 4749238 4798451
9295D798451M9194P6700J13628J19170J50753J98567K41688K26617K20363K43587
$$ 4798451 4847645 4924345 5037973 5157143 5307896 5506463 5748151 5974768 6195131 6438718
9285F438718K50610K67218K31614K81158K77984K95396L04622L18412L69789M35377
$$ 6438718 6689328 6956546 7188160 7469318 7747302 8042698 8347320 8665732 9035521 9470898
9275I470898N09808N86440O86641P58868Q47111R00608R62017J004887J051279
$$ 9470898 9980706 10567146 11253787 12012655 12859766 13760374 14722391 15727278 16778557
9266A6778557J031136R94991R61393Q66096P94189P57326P16210P34453P33552
$$ 16778557 17809693 18804684 19766077 20632173 21426362 22183688 22899898 23634351 24367903
9257B4367903P93389Q56020J000268J204793J414124J674783K003940K441760
$$ 24367903 25161292 26017312 27017580 28222373 29636497 31311280 33315220 35756980
9249C5756980K911787L516541M400428N616143P224571R209956J1266271J2504866
$$ 35756980 38668767 42185308 46585736 52201879 59426450 68636406 79902677 92407543
9241I2407543J2564635J1974855J1297906J0920051J0539703Q876431N617431
$$ 92407543 104972178 116947033 128244939 139164990 149704693 158581124 164198555
9234A64198555L379698L354061M245174M952516N179155N049969M566285L782554
$$ 164198555 167578253 170932314 175177488 180130004 185309159 190359128 194925413 198707967
9226A98707967L142719K816544K790678K864735K997728L258150L452802L313376
$$ 198707967 201850686 204667230 207457908 210322643 213320371 216578521 220031323 223344699
9218B23344699K727162J746384O52413p17537k554952m368448n500760o135201
$$ 223344699 226071861 227818245 228470658 227753121 225198169 220829721 215328961 209193760
9210B09193760o421895o491888o578398o695474o684671o719137o934743p147646
$$ 209193760 202771865 196279977 189701579 183006105 176321434 169602297 162667554 155519908
9202A55519908p111036o875252o346826n457287m502631l709149l145505k662694
$$ 155519908 148408872 141533620 135186794 129729507 125226876 121517727 118372222 115709528
9194A15709528k167395j766120j642478j729576j976099k314566k808570l331420
$$ 115709528 113542133 111776013 110133535 108403959 106427860 104113294 101304724 97973304
9186I7973304l703213m030793m233540m283667m158300l891661l466129k960324
$$ 97973304 94270091 90239298 86005758 81722091 77563791 73672130 70206001 67245677
9178F7245677k360974j742231j192703q06343m69415k47295j99777l26107n83210
$$ 67245677 64884703 63142472 61949769 61143426 60674011 60426716 60226939 59900832 59317622
9169E9317622q81708j221230j545227j795983k051454k204664k258599k228907
$$ 59317622 58435914 57214684 55669457 53873474 51822020 49617356 47358757 45129850
9161D5129850k207806k141179k102762k017677j938239j791018j554516j325637
$$ 45129850 42922044 40780865 38678103 36660426 34722187 32931169 31376653 30051016
9153C0051016j078810q54655p17095o58927o10778n78519n83910n88049o06900
$$ 30051016 28972206 28117551 27400456 26741529 26130751 25552232 24968322 24380273 23773373
9144B3773373o52411p09593p46599p12779o58730n65997n25269m73224m26318
$$ 23773373 23120962 22411369 21664770 20951991 20293261 19727264 19201995 18728771 18302453
9135A8302453m08200m03709l48869l59400m12299n07522n61379n96536n51516
$$ 18302453 17894253 17490544 17141675 16782275 16369976 15862454 15301075 14704539 14153023
9126A4153023n53576n41288m92030m83360m18128l59065l43848l06440l37865
$$ 14153023 13599447 13058159 12566129 12082769 11664641 11305576 10961728 10655288 10317423
9117A0317423l48815l28608l06226k84740l08116l14892k81300k55067k28736
$$ 10317423 9968608 9640000 9333774 9049034 8740918 8426026 8144726 7889659 7660923
9108G660923k47209k32441k05497j94616j71000j74474j77788j28618j11769j38785
$$ 7660923 7413714 7181273 6975776 6781160 6610160 6435686 6257898 6129280 6017511 5878726
9098E878726j97127j99190j82126k04889j79674j94050k13703k43383k14296j50556
$$ 5878726 5681599 5482409 5300283 5095394 4915720 4721670 4507967 4264584 4050288 3899732
9088C899732j41628j54596j33716j60492j26455r1581r2667r8903j15941j13765
$$ 3899732 3758104 3603508 3469792 3309300 3182845 3091264 2998597 2899694 2783753 2669988
9078B669988o1980o9728q2429l8631l8882l2999o2743n4740m5518n2162p5087
$$ 2669988 2608008 2538280 2455851 2417220 2378338 2345339 2282596 2227856 2182338 2130176 2055089
9067B055089p2123o4386o0477m2360o0685l6631k1212k6094o8135m6366J1442
$$ 2055089 1982966 1918580 1858103 1815743 1755058 1718427 1697215 1671121 1602986 1556620 1568062
9056A568062l6466m9874l5369o749m1125n1542l8754k2980r010k2098l5832l4417
$$ 1568062 1531596 1481722 1446353 1439604 1398479 1346937 1308183 1285203 1276193 1254095 1218263 1183846
9044A183846m2959k3027l5093j9717j08k839j8393j5220J9833L743n485j9679
$$ 1183846 1140887 1117860 1082767 1063050 1062942 1060103 1041710 1026490 1046323 1050066 1044581 1024902
9032A024902k0601l1928l1207n0349m1809k1749K268l996r96n748L513K407n907
$$ 1024902 1004301 972373 941166 890817 849008 827259 829527 825531 824535 818787 822300 824707 818800
9019H18800l1784l3843k4299l2990k9497j0860m4552j2638k3852N902J9580L3112
$$ 818800 787016 753173 728874 695884 666387 655527 610975 598337 574485 580387 599967 633079
9007F33079k2300j9290j9026j5809j5255J9205P391k9224r528J8309N399j8551
$$ 633079 610779 591489 572463 556654 541399 560604 567995 538771 529243 547552 552951 534400
8995E34400M140n401m437l470J9914M1738K0080k0252m963j6756j2819o91J2453
$$ 534400 538540 533139 528702 525232 545146 586884 606964 586712 581749 564993 552174 551483 563936
8982E63936j0905M614L853l3220m2164L905o306j5099j7882O326j3792l321K2218
$$ 563936 553031 557645 561498 528278 486114 490019 483713 468614 450732 457058 443266 439945 462163
8969D62163Q102k3530J5679Q095J2567j7269o062j3644j0866j3026k8007m3233
$$ 462163 470265 446735 462414 470509 483076 465807 459745 446101 435235 422209 394202 350969
8957C50969k2467K0431K5189p772j7122P542k0078J1855J1813o798k0306L470
$$ 350969 328502 348933 374122 366350 349228 356770 336692 348547 360360 353562 333256 336726
8945C36726n679J4993P658l990j4174m1846k5008j521J2238Q355n538N792k6010
$$ 336726 331047 346040 353698 349708 335534 293688 268680 267159 279397 287752 282214 288006 261996
8932B61996l4215j5025k10m19j1311n694p978k2089J6822K2054l3778j5675j1326
$$ 261996 227781 212756 212546 212127 200816 195122 187144 165055 181877 203931 170153 154478 143152
8919A43152k561q759p98J2570J7101j1464k4843L361o759n54l508j3930J0946
$$ 143152 140591 131832 131034 143604 160705 149241 124398 127759 121000 120446 116938 103008 113954
8906A13954O1991J9254K394o045J2045Q35J4124J534k4921j6703J5413k011j3326
$$ 113954 175945 195199 197593 191548 203593 204428 218552 220086 195165 178462 193875 191864 178538
8893A78538l3189j0702j7057j847K483J7054J6736j0957K2381J8030l573j2795
$$ 178538 145349 134647 117590 115743 118226 135280 152016 141059 163440 181470 177897 165102
8881A65102k2992J1887K9293L8668L2686J6514j6318m3090m778K3834K8981N1814
$$ 165102 142110 153997 183290 221958 254644 271158 254840 211750 206972 230806 259787 311601
8869C11601M7211K4942M1506L4133J5029k1014l2326k178q260R58M902N794K0160
$$ 311601 358812 383754 425260 459393 474422 453408 421082 418904 410644 411602 416504 422298 442458
8856D42458J6478k3474j9841N811J6004l685j4295j0337P942J7438J2510n434
$$ 442458 458936 435462 415621 421432 437436 433751 419456 409119 417061 434499 447009 441575
8844D41575k6356j2411j2328L4371K7952N27M7358K7016K7960k297K0645M8339
$$ 441575 415219 402808 390480 424851 452803 453330 500688 527704 555664 553367 574012 622351
8832F22351J4456K7621J8028l361J0752J9588J8843k591M116j9840j0039j2330
$$ 622351 636807 664428 682456 679095 689847 709435 728278 725687 729803 709963 699924 687594
8820F87594j1070l7512n2657M417M2461j7542O776j6024n994j8269l642j4875
$$ 687594 676524 639012 586355 590772 633233 615691 622467 606443 600449 582180 578538 563663
8808E63663p45J1776K3009M4008K5946K3347j457j3310J9231N2987J3651k1312
$$ 563663 562918 574694 597703 641711 667657 691004 689547 676237 695468 748455 762106 740794
8796G40794l779j1735j4086l2563l1154k0498K3921m632l5403J928J2615l577
$$ 740794 737015 725280 711194 678631 647477 626979 650900 646268 610865 612793 625408 621831
8784F21831k0500m904k7884k1378K401J1815k4507k0338M659n440k4731j8262
$$ 621831 601331 596427 568543 547165 549566 561381 536874 516536 521195 515755 491024 472762
8772D72762k9067j3578Q059q366J1779L8269P597J979r801j1610j386J9922j8230
$$ 472762 443695 430117 438176 429810 441589 479858 487455 489434 479633 468023 466637 486559 468329
8759D68329m2023j5352r1J713k0326l9443j5140n471k1973j9756j5646K81q088
$$ 468329 426306 410954 410863 412576 392250 352807 337667 332196 310223 290467 274821 275102 267014
8746B67014k6210j4856j1145k70K972j9269j2455K9194j1765q623j036n435k2236
$$ 267014 240804 225948 214803 214533 217505 198236 185781 214975 203210 194587 193551 188116 165880
8733A65880j8011O564q057M677J2323j4067R263J2373o961J6290K277p234j6268
$$ 165880 147869 154433 146376 151053 163376 149309 158572 170945 163984 180274 182551 175317 159049
8720A59049M999Q690K023j3976j1775j3396L062J0023K2845l4199j3981l849O282
$$ 159049 164048 172738 174761 160785 149010 135614 138676 148699 171544 137345 123364 119515 125797
8707A25797k5197k2687l6135j4279o619Q171J4682N735J1258R254L978j4656q200
$$ 125797 100600 77913 41778 27499 20880 29051 43733 49468 60726 69980 73958 59302 51102
8694E1102j5739J6659j1254l4672j8730J4596J7030K6993O802k4208n577J2110
$$ 51102 35363 52022 40768 6096 -12634 1962 18992 45985 52787 28579 23002 35112
8682C5112n21m0903K3081K5776r358l4347pl85J1219J6587j3676m638L1186J9583
$$ 35112 34591 -6312 16769 42545 33187 -1160 -1167 -1552 9667 26254 12578 7940 39126 58709
8668E8709q122k3375J656l537J637j1312L789k1491N862j3315j1508K4158K7631
$$ 58709 50587 27212 28868 25331 26968 15656 19445 -2046 3816 -9499 -21007 3151 30782
8655C0782M1152K6468p188Q403J7276o249L0492L4845K8753M1443O7986R3822
$$ 30782 71934 98402 91214 99617 116893 110644 141136 175981 204734 246177 314163 407985
8643D07985Q9335J65344L19147N52618O65149N23895K91512J80189R7139K10416
$$ 407985 497320 662664 981811 1534429 2199578 2723473 3014985 3195174 3292313 3502729
8633C502729J96787n69191r24652o22461m00777k39323j58363n7099o5520j19043
$$ 3502729 3699516 3130325 2205673 1583212 1182435 943112 784749 727650 662130 543087
8623E43087o1483k7435m1111j5095j1535k8378R111j3230k5323K414N192k3780
$$ 543087 481604 454169 413058 397963 386428 358050 367161 353931 328608 331022 336214 312434
8611C12434k9059K3565M4325l917K3160L2590J2377M508J0111M1211O9965J02198
$$ 312434 283375 306940 351265 347348 370508 403098 415475 419983 430094 471305 541270 643468
8599F43468J04891J82637L28828N88374R86680J284594J119244O67667L80334
$$ 643468 748359 930996 1259824 1848198 2834878 4119472 5238716 5906383 6286717
8590F286717J74846L61623N67006q27031j857940j404790q58641n26910l19262
$$ 6286717 6461563 6823186 7390192 6563161 4705221 3300431 2441790 1914880 1595618
8581A595618k17522j48446j15851r8635p2306n8050n5674n2115n7230n7194m4522
$$ 1595618 1378096 1229650 1113799 1015164 942858 884808 829134 777019 719789 662595 618073
8570F18073l3932p865l501k8090k9989k417M907L525O365q024R52j4437m04J0565
$$ 618073 584141 576276 572775 544685 514696 512279 517186 520711 527076 519052 520004 505567 505163 515728
8556E15728J2121m289L6713R0783J46572K40472M38381N79629N34926L44455K24628
$$ 515728 527849 523560 560273 651056 797628 1038100 1476481 2056110 2591036 2935491 3160119
8545C160119J12333J15435K31526j61468q34087p42073n01209l12043j96452j23007
$$ 3160119 3272452 3387887 3619413 3457945 2623858 1881785 1380576 1068533 872081 749074
8535G49074q4194k8034p008l7786n563l0054p5500n1870k0078k9419J2289j2554
$$ 749074 664880 636846 629838 592052 586489 556435 480935 429065 408987 379568 391857 379303
8523C79303n5164k9425m860j4186j7399l8766p421j154R896q28q815k6165l575
$$ 379303 324139 294714 289854 275668 258269 219503 212082 210928 220824 219996 211181 185016 181441
8510A81441p835K6053j3939l4625j6131j1413J6085J5893o870k4674KQ04l883
$$ 181441 173606 199659 185720 151095 134964 123551 139636 155529 148659 123985 123987 124791 120908
8497A20908n428k718k253j2793J1066J943k7828Q261J1859J163p570m672R151
$$ 120908 115480 112762 110509 97716 108782 110725 82897 91158 103017 104180 96610 91938 101089
8484A01089J908j7136K0352J5474j4390j5011P426k0786l809O980N318j5758n385
$$ 101089 102997 85861 106213 121687 107297 92286 99712 78926 75117 82097 87415 71657 66272
8471F6272M015J159J7404J8599l1614o1610N679L2594J0406o780o914K259p916
$$ 66272 70287 71446 88850 107449 75835 14225 19904 52498 62904 56124 49210 51469 43553
8458D3553q035n177J4453J8931r764k242k283j4394j003K4125k059m4234j3497
$$ 43553 35518 30341 44794 63725 53961 51719 49436 35042 34039 58164 56105 11871 -1626
8445a626l608N384j1716j4533J0227J4844L4947K671K610k5574r803J353J3298
$$ -1626 -5234 150 -11566 -26099 -15872 -1028 33919 36590 39200 13626 3823 5176 18474
8432A8474k5954j3095J0118J3909R33k9105l965R752K6272J5857p538j3955l5443
$$ 18474 -7480 -20575 -10457 3452 4385 -24720 -28685 -18933 7339 23196 15658 1703 -33740
8419c3740l1441L7265O515n418q714k4516P035R952J6640P284K4264J0095k193
$$ -33740 -65181 -27916 -21401 -26819 -35533 -60049 -53014 -43062 -26422 -19138 5126 15221 13028
8406A3028l185j1545j6340j6285R874K6668K8367m160K0196k6915j9651k1380
$$ 13028 9843 -1702 -18042 -34327 -24453 2215 30582 26422 46618 19703 52 -21328
8394b1328o961K6814L1198J0025j4211j9078l446l3295k6638j1577L2539K7525
$$ -21328 -28289 -1475 29723 39748 25537 6459 3013 -30282 -56920 -68497 -35958 -8433
8382h433n240l46J1942j4706L820J8701l989J4283O549n684k1078k221K4976L761
$$ -8433 -13673 -14019 -2077 -16783 -12963 5738 1749 16032 22581 16897 -4181 -6402 18574 22335
8368B2335o493K1778n621j1342k578j8052l7741J5016K6648o562l738L082O012
$$ 22335 15842 37620 31999 20657 18079 27 -37714 -22698 3950 -2612 -6350 -3268 2744
8355B744K9240J2607l3152k7714O865M6506K4749k2594j3832q736j5642P369m868
$$ 2744 31984 44591 11439 -16275 -9410 37096 61845 39251 25419 16683 1041 8410 3542
8342C542l929j7563k3281j891M681m612L9767L2898J4542r343j7497j3622J052
$$ 3542 -387 -17950 -41231 -43122 -38441 -43053 -3286 29612 44154 34811 17314 3692 4744
8329D744o601O255j0232Oo283k2l44o171O443M0783P839j8857k2993J6139l0738
$$ 4744 -1857 4398 -5834 -5828 -12111 -12133 -12477 -18648 -12205 28578 36417 17560 -5433 10706 -20032
8314b0032l3840J17M978Q964J2884O424L53l122j1654K4596K271K1680J6383m863
$$ -20032 -53872 -53755 -48777 -39813 -26929 -20505 -20152 -23274 -34928 -10332 -8061 13619 30002 25139
8300B5139Q76k6928j6492L3012K3935k3203k7504m925R621J1967r336j8296j6142
$$ 25139 26015 -913 -17405 15607 39542 16339 -11165 -16090 -6469 5498 -3838 -22134 -38276
8287c8276L2280K5271J6024k743k2595K238j0382k5271q147J8458J9001M9k5840
$$ -38276 -5996 19275 35299 32556 9961 12199 1817 -23454 -31601 -13143 5858 5907 -19933
8274a9933j8110P423J0776j5224n696M4263J4263O059K5220j1525j0960j2609
$$ -19933 -38043 -30620 -19844 -35068 -40764 3499 17762 23821 49041 37516 26556 13947
8262A3947j6710j0326K3673J1051k8317k1975K221j0049m344O657j057K3388K6028
$$ 13947 -2763 -13089 10584 21635 -6682 -28657 -26436 -36485 -40829 -34172 -35229 -11841 14187
8249A4187k9295n660j649J0803q877M126K5719J6284P619M593L893m559M897k103
$$ 14187 -15108 -20768 -22417 -11614 -20491 -16365 9354 25638 33257 37850 41743 37184 42081 39978
8235C9978J1326M7555K1312R78L1486J4880J2603J2552L397Q116O06O63n8831
$$ 39978 51304 98859 120171 121149 152635 167515 180118 192670 196067 204183 204789 205452 146621
8222A46621o8234j9573k25j0670m844j6187O992P000K5893q253k2281J5019J228
$$ 146621 78387 58814 58589 47919 43075 26888 33880 40880 66773 58520 36239 51258 52486
8209E2486n784j8887j3959J4380K312l8012J4161K3520L633l1605m137J3058q907
$$ 52486 46702 27815 13856 28236 30548 -7464 6697 30217 33850 2245 -1892 11166 2259
8196B259N072J4327O15l7207L558J6846K0965N6659P6857O0508L4878J2983P743
$$ 2259 7331 21658 22273 -14934 -11376 5470 26435 83094 159951 220459 255337 268320 276063
8183B76063q541j4365l4871m2110l3899j7067n1305k3348j0558L11J0388k872
$$ 276063 267522 253157 218286 176176 142277 125210 73905 50557 39999 40310 50698 47826
8171D7826k0326j8365n612J2174l272q655l293P261M348K872R121j1687j1815
$$ 47826 27500 9135 3523 15697 12425 3770 477 7738 12086 14958 24079 12392 577
8158E77k7669j358J2781K2000M371k063J2032K0783n598m396j0643j5552R899
$$ 577 -27092 -28450 -15669 6331 10702 8639 20671 41454 35856 31460 20817 5265 15164
8145A5164j4633p597j0010J9561K4691j0732K0123L2303j0122m575k9435L64m483
$$ 15164 531 -7066 -17076 2485 27176 16444 36567 68870 58748 54173 24738 25102 20619
8132B0619J1494k0647p510L142l144Q987J4236j0845n014j1420j4537Q28K6793
$$ 20619 32113 11466 3956 7098 3954 12941 27177 16332 11318 -102 -14639 -13811 12982
8119A2982L614j6130l3694J636Q090N571J145J3458K0595m5j5594n687M190J1647
$$ 12982 16596 466 -33228 -31592 -23502 -17931 -16786 -3328 17267 17222 1628 -4059 131 11778
8105A1778q241p930r986O76m784M643k632J5084P820O702J9866J6055K4063k781
$$ 11778 3537 -4393 -14379 -13703 -18487 -13844 -16476 -1392 6428 13130 32996 49051 73114 70333
8091G0333j9081p865J3680k575m006L018K2669n350J4927m627k3601j4578N402
$$ 70333 51252 43387 57067 54492 50486 53504 76173 70823 85750 81123 57522 42944 48346
8078D8346R273o80k2444K264K1999k0943k5189l1377K5232J4459m337J1320j0850
$$ 48346 57619 56939 34495 36759 58758 37815 12626 -18751 6481 20940 16603 27923 17073
8065A7073j873J9648M553k0154j0051O173j6380L412L0423o865J6760J6193r356
$$ 17073 15200 34848 39401 19247 9196 15369 -1011 2401 32824 25959 42719 58912 49556
8052D9556j9960J0882J1742l460K9025j1400l9395N897J8309M582m6452j2225
$$ 49556 29596 40478 52220 48760 77785 66385 26990 32887 51196 55778 9326 -2899
8040b899J785Q125O653L4799J8300q273p798M261O775J736L223l0780l7217j4391
$$ -2899 -1114 7011 13664 48463 66763 58490 50692 54953 61728 63464 66687 35907 -1310 -15701
8026a5701k57P177P305K449O586L186q234j7352L193R937m031P820L2831J2523
$$ -15701 -15958 -8781 -1476 973 7559 10745 2511 -14841 -11648 -1711 -5742 2078 34909 47432
8012D7432p493q743l9458m5980K0643N4648J3255M993k4509Q334J6923r246l7004
$$ 47432 39939 31196 -8262 -54242 -33599 21049 34304 39297 14788 23122 40045 30799 -6205
7999f205P676Q686m587J6808J9056q450M621J6622q643j5976j6297j6610k0115
$$ -6205 1471 10157 5570 22378 41434 32984 37605 54227 45584 29608 13311 -3299 -23414
7986b3414L414K2450L0159J9844j348j2552l6890q192J33J0467K1983k773K5079
$$ -23414 -20000 2450 32609 52453 51105 38553 1663 -6529 -6396 4071 26054 23281 48360
7973D8360J7083k2709k8048M66p52k3243j3915P735j0004L2058L2716j5571r087
$$ 48360 65443 42734 14686 15152 14400 -8843 -22758 -15023 -25027 7031 39747 24176 15089
7960A5089k3753J0037J948k6473j0623K2436L1069j6354j5656R667J7606R099
$$ 15089 -8664 1373 3321 -23152 -33775 -11339 19730 3376 -12280 -2613 14993 24092
7948B4092o992r620k3956q59P930J9851k5793L4K8209J6396j8156J28J3249M587
$$ 24092 17100 7480 -16476 -17335 -9405 10446 -15347 -15313 12896 29292 11136 11264 24513 29100
7934B9100j3941J641j1847J828J9856R090r123j8762l2349J0279L6671L9329Q324
$$ 29100 15159 16800 4953 6781 26637 35727 26604 7842 -24507 -14228 22443 61772 70096
7921G0096m909r140l457k3474j0245j7378K2223K6466o918N806k3293p652q421
$$ 70096 65187 56047 52590 29116 18871 1493 23716 50182 43264 49070 25777 18125 9704
7908I704j5078J3929K5270J0160M185k5051k9879q138J697O535J7714J5087j3707
$$ 9704 -5374 8555 33825 43985 48170 23119 -6760 -14898 -13201 -6666 11048 26135 12428
7895A2428k1269j1460J3196j0745J2144K8510k121k020J6865J7525o616k7379
$$ 12428 -8841 -20301 -7105 -17850 -5706 22804 20683 18663 35528 53053 46437 19058
7883A9058M730O660m690j8732j6760J4140Q121j5156j34o737l3540R21l838J6860
$$ 19058 23788 30448 25758 7026 -9734 4406 12527 -2629 -2763 -9500 -43040 -42119 -45957 -29097
7869b9097L3791o193q73J519K1698K4218j2627J7050p40j0310j7887r752m98m62
$$ -29097 4694 -1499 -2372 -853 20845 45063 32436 49486 48746 38436 20549 10797 10299 9837
7855I837k2833N145K196j928k8460R49Q887K0817k586J329J3489K2294j5272l2109
$$ 9837 -12996 -7851 -5655 -7583 -36043 -35094 -26207 -5390 -7976 -6647 6842 29136 13864 -18245
7841a8245p519j5061j9261J0882K0373K5588P145L590j3671j200L0395J6112l195
$$ -18245 -25764 -40825 -60086 -49204 -28831 -3243 3902 7492 -6179 -7379 23016 39128 35933
7828C5933o77k5590R224J3008J809J200j5470j9693j1128J2036Q45j8563p94J7065
$$ 35933 35256 9666 18890 31898 33707 34907 19437 -256 -11384 652 1497 -17066 -17860 -795
7814g95m64k8205N056m909o037J6808j5648o006j3217o982K6350K2595J2437M322
$$ -795 -1259 -29464 -24408 -29317 -35354 -18546 -34194 -40200 -53417 -60399 -34049 -11454 983 5305
7800E305l0361j5088r921j1793J7401J1078j1713J6091J2368O734p792J4062n805
$$ 5305 -25056 -40144 -50065 -61858 -44457 -33379 -45092 -29001 -16633 -9899 -17691 -3629 -9434
7787i434J67m326p336o22n882K8549K5601j877O791k79k7704k5360l899m201P623
$$ -9434 -9267 -13593 -20929 -21551 -27433 1116 26717 24840 31631 31352 3648 -21712 -25611 -29812 -22189
7772b2189J6278K0112M240k3186k1818L194K3796O400n573j2753j8307J4727J5956
$$ -22189 -5911 14201 18441 -4745 -26563 -23369 427 6827 1254 -11499 -29806 -15079 877
7759H77j2606j4508j8594l924J7231J7452O000J6439p216k3361q534K3485j749
$$ 877 -11729 -26237 -44831 -48755 -31524 -14072 -8072 8367 1151 -22210 -30744 -7259 -9008
7746i008J0811n881n238j416L4611J6134l9687l8605p943Q901k4526R604K2717
$$ -9008 1803 -4078 -9316 -10732 23879 40013 326 -38279 -46222 -37321 -61847 -52243 -29526
7733b9526K2981k132j674J186l275J2951L0889J2984j1467j7321j7792n225J1927
$$ -29526 -6545 -8677 -10351 -9165 -12440 511 31400 44384 32917 15596 -2196 -7421 4506
7720D506j419J0601k5652k2396K3463L876n518N640N896J2414j0005l2929K7806
$$ 4506 3087 13688 -11964 -34360 -10897 -7021 -12539 -6899 -1003 11411 1406 -31523 -3717
7707c717J5408l375L730o877j0046O41j188M423r251K005k1158l5272L572L5277
$$ -3717 11691 8316 12046 5169 -4877 -4236 -5424 -1001 -10252 -8247 -29405 -64677 -61105 -25828
7693b5828J1627j5387k5789K518J7031L7898L443j9213l200J9987K850l1011O270
$$ -25828 -14201 -29588 -55377 -52859 -35828 2070 5513 -13700 -16900 3087 5937 -25074 -18804
7680a8804n04m548P921N747O365l398Q856m356k5304Q556L386N865k3335j0217
$$ -18804 -19308 -23856 -15935 -10188 -3823 -7221 1635 -2721 -28025 -19469 -16083 -10218 -33553 -43770
7666d3770j507p54J245m943K1757P032O580N325k2698N933R248K237J3171Q028
$$ -43770 -45277 -46031 -44786 -49729 -27972 -20940 -14360 -9035 -31733 -25800 -16552 -14315 -1144 6884
7652F884q083k9668k0102J8933R821J3041J18p638j939p97m689j3120n362J4420
$$ 6884 -1199 -30867 -50969 -32036 -22215 -9174 -9056 -16694 -18633 -19430 -24119 -37239 -42601 -28181
7638b8181J3347j2000j1338Q652j821M281m759Q913j1635n645K8113M322k6073
$$ -28181 -14834 -26834 -38172 -29520 -31341 -27060 -31819 -22906 -34541 -40186 -12073 -7751 -33824
7625c3824K9001K3329J567J3821j3176o196k4570j1504M336n333J2311K3066P781
$$ -33824 -4823 18506 20073 33894 20718 14522 -10048 -21552 -17216 -22549 -10238 12828 20609
7612B0609j7687q411j18k4990j7012J4079P98j4736l953N5275J7762l4657l1308
$$ 20609 2922 -5489 -5607 -30597 -47609 -33530 -32732 -47468 -51421 3854 21616 -13041 -44349
7599d4349p88K1044J7518j3464r917J1224L719j1735J4622N821L551j0406J8853
$$ -44349 -45137 -24093 -6575 -20039 -29956 -18732 -15013 -26748 -12126 -6305 -2754 -13160 5693
7586E693K0740k0582j4825j9526N049J4447q268k8022M165J6847K312n321O517
$$ 5693 26433 5851 -8974 -28500 -23451 -9004 -17272 -45294 -41129 -24282 -21970 -27291 -20774
7573b0774j027m1263k6944J4297K8524R223J2486J9685l340j0904p139J3187L3757
$$ -20774 -21801 -63064 -90008 -75711 -47187 -37964 -25478 -5793 -9133 -20037 -27176 -13989 19768
7560A9768j6614j6749K4975K8137J4768k6485P787j3961k172n221O847p190k9310
$$ 19768 3154 -13595 11380 39517 54285 27800 35587 21626 19454 14233 21080 13890 -15420
7547a5420k8268R832L4001j41k3870M60M0086m302k6528m1006n43n209j064j313
$$ -15420 -43688 -33856 145 4 -23866 -23406 16680 12378 -14150 -55156 -55699 -60908 -61972 -63285
7533f3285L3804J627l930J6273R97k6821J6892R587P929Q139l50k2795p681o95
$$ -63285 -29481 -27854 -31784 -15511 -14514 -41335 -24443 -14856 -6927 1212 862 -21933 -29614 -30309
7519c0309r47j764K4034L5246J4557k6776m1676Q194J1595r139l996M2568K3026
$$ -30309 -31256 -33020 -8986 26260 40817 14041 -27635 -19441 -7846 -16985 -20981 21587 44613
7506D4613Q50n90l1828o346j359l7209J0746J9426L2189j2731k3834l131K4768
$$ 44613 45463 44873 13045 6699 5340 -31869 -21123 -1697 30492 17761 -6073 -9204 15564
7493A5564R494j9885j0592K9339J5613K328l7313K653K6590K9277j7448q113k6871
$$ 15564 25058 5173 -5419 23920 39533 41861 4548 7201 33791 63068 45620 37507 10636
7480A0636j3393J7840Q14q251r568K0801K1588k255j0185j8352l268n953j4293
$$ 10636 -2757 15083 15897 7646 -1922 18879 40467 38212 28027 9675 6407 454 -13839
7467a3839Q095K1920l0632k2039J2082O267O813k940J5921J7364L096J812j2208
$$ -13839 -5744 16176 -14456 -36495 -24413 -18146 -11333 -14273 1648 19012 22108 23920 11712
7454A1712j9828j3264j2911l839j7764j8935J0248J275J0174P708P134Q734o49
$$ 11712 -8116 -21380 -34291 -38130 -55894 -74829 -64581 -63306 -53132 -45424 -38290 -29556 -30205
7441c0205K7845J6038j4475k8986p855o058K1549K4291j2600m6920J5284J2420
$$ -30205 -2360 13678 -797 -29783 -37638 -43696 -22147 2144 -10456 -57376 -42092 -29672
7429b9672K6071J581J479q889l007L218p097k8082M561M717J2445J3679j1397
$$ -29672 -3601 -2020 -541 -9430 -12437 -9219 -16316 -44398 -39837 -35120 -22675 -8996 -20393
7416b0393Q503j6047j9024K821K3963K853k6180j8089J0327J378N439J0941j3930
$$ -20393 -11890 -27937 -46961 -44140 -20177 -17324 -43504 -61593 -51266 -49888 -44449 -33508 -47438
7403d7438K8475N357k7257o693L1377K1112J7463Q144k0177l5298J8186L949n887
$$ -47438 -18963 -13606 -40863 -47556 -16179 4933 22396 30540 10363 -24935 -6749 -2800 -8687
7390h687k579L100n158j1258K522K020L051J7405K315k4281J8444K0998j9950
$$ -8687 -11266 -8166 -13324 -24582 -22060 -20040 -16989 416 2731 -21550 -3106 17892 -2058
7377b058k2039J5692j9628J0697L6140J2217m506k1346k2841j1996m285k1250
$$ -2058 -24097 -8405 -28033 -17336 18804 31021 26515 5169 -17672 -29668 -33953 -55203
7365e5203J370M601k552L0853J0238k891J3093l130r230n605l277j147l2167R47
$$ -55203 -53833 -49232 -51784 -20931 -10693 -13584 -491 -3621 -12851 -18456 -21733 -22880 -55047 -54100
7351e4100K0940J7544j3861J4447l602M552p765l0012J0922J226R738L2098P907
$$ -54100 -33160 -15616 -29477 -15030 -18632 -14080 -21845 -51857 -40935 -39709 -29971 2127 10034
7338A0034K0669j4240J646k0455M42K2968K4755J522j8574r780j6586m54N980
$$ 10034 30703 16463 18109 -2346 -1904 21064 45819 47341 28767 18987 2401 1947 7927
7325G927j2066O133K702o013N730m390k783J8877J2165K238m594k330j0897n775
$$ 7927 -4139 1994 4696 -1317 4413 23 -2760 16117 28282 30520 25926 23596 12699 6924
7311F924k3435J3046o553L423n243L402N800l0031n471J6050J516J6527J1181
$$ 6924 -16511 -3465 -10018 -6595 -11838 -8436 -2636 -32667 -38138 -22088 -20572 -4045 7136
7298G136J297k3202k3685Q75j3029R97J1441L0392L171O718k0703j6748J3035
$$ 7136 8433 -14769 -38454 -37579 -50608 -49611 -38170 -7778 -4607 2111 -18592 -35340 -22305
7285b2305J5254j4170m724K2031j6831j1344J1473J3911m759k2371L145J9793
$$ -22305 -7051 -21221 -25945 -3914 -20745 -32089 -20616 -6705 -11464 -33835 -30690 -10897
7273a0897M852k8189q697k090j374J3363J5229R300j5592j0942m951J0498L0021
$$ -10897 -6045 -34234 -42931 -45021 -46395 -33032 -17803 -8503 -24095 -35037 -39988 -29490 531
7260E31N2769r978j1866J0436Q579K161M046r726j4453kj9198k3693L082o454
$$ 531 53300 43322 31456 41892 50471 52632 56678 46952 32499 32497 13299 -10394 -7312 -13766
7246a3766j2064J5174n097o518K3784k0042o133O159K2484l064m902J9827q116
$$ -13766 -25830 -10656 -15753 -22271 1513 -18529 -24662 -18503 3981 917 -3985 15842 7726
7233G726N757r360j656J208n908r469m2594j6651K2339m210K1074Q210k3203J2906
$$ 7726 13483 4123 2467 3675 -2233 -11702 -54296 -70947 -48608 -52818 -31744 -23534 -46737 -33831
7219c3831J0279O257M026K5165n161m670J3933N35J0468j5157k1244l0840m01
$$ -33831 -23552 -17295 -13269 11896 6735 2065 15998 16533 27001 11844 -9400 -40240 -40641
7206d0641l171J001K2539K3762M28k5693k8130q81J3326N811j8834J8351K9926
$$ -40641 -43812 -42811 -20272 3490 3918 -21775 -49905 -50786 -37460 -31649 -50483 -32132 -2206
7193b206J2822l057m814J7964J1671J1530J233M156Q362j8011l5977k618O84k724
$$ -2206 10616 7559 2745 20709 32380 43910 45143 49299 57661 39650 3673 1055 1739 -985
7179i85j4840J0871J2509o097p519j1720k2148K938O588J2309k3732J0794K7870
$$ -985 -15825 -4954 7555 1458 -6061 -17781 -39929 -36991 -30403 -18094 -41826 -31032 -3162
7166c162O974L5328R643q568j0686q091M0j2139k3280l7250n721M4678j0478Q146
$$ -3162 3812 39140 48783 40215 29529 21438 21478 9339 -13941 -51191 -56912 -12234 -22712 -14566
7152a4566J3620J9119L832l8124l0266L851O116J6801J2038J680K8376j703N612
$$ -14566 -946 18173 22005 -16119 -46385 -42534 -36418 -19617 -7579 -5899 22477 20774 26386
7139B6386M366m674l399p037j021j2854r309m1696L618K8127J780J550k0855o222
$$ 26386 30752 26078 22679 15642 14621 1767 -7542 -49238 -45620 -17493 -15713 -14163 -35018 -41240
7125d1240O905J7551N1153k2800l7818k3783M318L0938k6543j1898J6549O962
$$ -41240 -34335 -16784 34369 11569 -26249 -50032 -45714 -14776 -41319 -53217 -36668 -29706
7113b9706K859j246k78K0172r934j2814K0177O32j1027O143K1416j6403j7318
$$ -29706 -26847 -28093 -28371 -8199 -18133 -30947 -10770 -10138 -21165 -15022 6394 -10009 -27327
7100b7327j2933J8195J3928K7169k0264l7723k556p137R951J1670K4335j0903
$$ -27327 -40260 -22065 -8137 19032 -1232 -38955 -41511 -48648 -38697 -27027 -2692 -13595
7088a3595o238J6519M949J4625j1632p226k0729l509R095J5036n468o795q72L2871
$$ -13595 -19833 -3314 1635 16260 4628 -2598 -23327 -26836 -17741 -2705 -8173 -14968 -15840 17031
7074A7031N092j0096R504j4465l3053K6140Q457j2361j2545j0807k478O317r028
$$ 17031 22123 12027 21531 7066 -25987 153 8610 -3751 -16296 -27103 -29581 -23264 -32292
7061c2292J3655k95j1486L34J0514P545R54k3369N263J4456J8156K139l0524M798
$$ -32292 -18637 -18932 -30418 -30084 -19570 -12025 -11071 -34440 -29177 -14721 3435 5574 -24950 -20152
7047b0152J3416m960j1413j6350n060L3506k044K9393q244R580j7143l4904j842
$$ -20152 -6736 -11696 -23109 -39459 -44519 -11013 -13057 16336 8092 17672 529 -34375 -36217
$$ [...]
##END NTUPLES=NMR SPECTRUM
##END=
