##TITLE=Analysis number 322168
Compound Code cc 50616
Book Reference 486/52
Project Code adrs
Chemist Name simons
##JCAMPDX= 6.0         $$ Bruker NMR JCAMP-DX V2.0
##DATA TYPE= NMR SPECTRUM
##DATA CLASS= NTUPLES
##ORIGIN= Bruker BioSpin GmbH
##OWNER= nmr
$$ XWIN-NMR		Version 3.5
$$ Fri Sep 15 08:19:03 2006 GMT Daylight Time (UT+1h)  MAYBRIDGE\nmr@NMR_250MHZ
##.OBSERVE FREQUENCY= 250.131544655141
##.OBSERVE NUCLEUS= ^1H
##.ACQUISITION MODE= SIMULTANEOUS (DQD)
##.ACQUISITION SCHEME= undefined
##.AVERAGES= 16
##.DIGITISER RES= 18
##SPECTROMETER/DATA SYSTEM= dpx250
##.PULSE SEQUENCE= zg30
##.SOLVENT NAME= DMSO
##.SHIFT REFERENCE= (INTERNAL, DMSO, 0, 16.522)
##AUDIT TRAIL= $$ (NUMBER, WHEN, WHO, WHERE, WHAT)
$$ ##TITLE= Audit trail, XWIN-NMR		Version 3.5
$$ ##JCAMPDX= 5.01
$$ ##ORIGIN= Bruker BioSpin GmbH
$$ ##OWNER= nmr
$$ C:\u/data/dgb/nmr/ADRS/740/pdata/1/auditp.txt
$$ ##AUDIT TRAIL=  $$ (NUMBER, WHEN, WHO, WHERE, WHAT)
(   1,<2006-09-15 08:18:37.94 +100>,<MAYBRIDGE\nmr>,<NMR_250MHZ>,
      <created by zg, POWCHK disabled, PULCHK disabled
       configuration hash MD5:
       E2 DF 36 D8 04 B2 41 60 5A D7 A3 38 5A 4B D0 FE
       data hash MD5: 64K
       6F B2 FB B3 12 CB 4B 3B 84 E8 51 2C D4 9D 31 7C>)
(   2,<2006-09-15 08:18:50.05 +100>,<MAYBRIDGE\nmr>,<NMR_250MHZ>,
      <Start of raw data processing
       ef LB = 0.3 FT_mod = 6 PKNL = 1 SI = 32K 
       data hash MD5: 32K
       D1 68 E3 16 92 66 90 AD A8 5B 6C 3E 5F EF 7C 77>)
(   3,<2006-09-15 08:18:51.75 +100>,<MAYBRIDGE\nmr>,<NMR_250MHZ>,
      <apk 
       data hash MD5: 32K
       55 A4 35 5D E6 79 C5 52 CB 1F 88 C5 A9 42 10 B3>)
(   4,<2006-09-15 08:18:52.53 +100>,<MAYBRIDGE\nmr>,<NMR_250MHZ>,
      <abs ABSG = 5 
       data hash MD5: 32K
       B0 D3 AD 2E A5 FC 18 EB 95 B4 7A 25 5E 03 57 ED>)
$$ ##END=
$$ 
$$ hash MD5
$$ D0 44 A4 73 A1 30 79 89 8D 80 6D E2 70 45 D0 27
##$RELAX= 
##$RELAX= 
##$RELAX= 
##$RELAX= 
##$RELAX= 
##$RELAX= 
##$RELAX= 
$$ Bruker specific parameters
$$ --------------------------
##$DU= <C:\u>
##$EXPNO= 740
##$NAME= <ADRS>
##$PROCNO= 1
##$TYPE= <nmr>
##$USER= <dgb>
##$AMP= (0..31)
100 100 100 100 100 100 100 100 100 100 100 100 100 100 100 100 100 100 
100 100 100 100 100 100 100 100 100 100 100 100 100 100 
##$AQSEQ= 0
##$AQ_mod= 3
##$AUNM= <au_zg>
##$AUTOPOS= <31 >
##$BF1= 250.13
##$BF2= 250.13
##$BF3= 250.13
##$BF4= 250.13
##$BF5= 500.13
##$BF6= 500.13
##$BF7= 500.13
##$BF8= 500.13
##$BYTORDA= 1
##$CFDGTYP= 0
##$CFRGTYP= 5
##$CHEMSTR= <none>
##$CNST= (0..31)
1 1 145 1 1 1 1 1 1 1 1 1 1 1 1 1 1 1 1 1 1 1 1 1 1 1 1 1 1 1 1 1 
##$CPDPRG= <>
##$CPDPRG1= <>
##$CPDPRG2= <>
##$CPDPRG3= <>
##$CPDPRG4= <mlev>
##$CPDPRG5= <mlev>
##$CPDPRG6= <mlev>
##$CPDPRG7= <mlev>
##$CPDPRG8= <mlev>
##$CPDPRGB= <>
##$CPDPRGT= <>
##$D= (0..31)
0 1 0 0 0 0 0 0 0 0.06 0 0 0 0 0 0 0.0002 0 0 0 0 0 0 0 0 0 0 0 0 0 0 
0 
##$DATE= 1158304716
##$DBL= (0..7)
120 120 120 120 120 120 120 120 
##$DBP= (0..7)
150 150 150 150 150 150 150 150 
##$DBP07= 0
##$DBPNAM0= <>
##$DBPNAM1= <>
$$ [...]
##$SUBNAM6= <"">
##$SUBNAM7= <"">
##$SUBNAM8= <"">
##$SUBNAM9= <"">
##$SW= 20.6930455092707
##$SWIBOX= (0..15)
0 0 3 0 0 0 0 0 0 0 0 0 0 0 0 0 
##$SW_h= 5175.983436853
##$TD= 65536
##$TD0= 1
##$TE= 295.16
##$TE2= 300
##$TE3= 300
##$TEG= 300
##$TL= (0..7)
0 120 120 120 120 120 120 120 
##$TP= (0..7)
150 150 150 150 150 150 150 150 
##$TP07= 0
##$TPNAME0= <>
##$TPNAME1= <>
##$TPNAME2= <>
##$TPNAME3= <>
##$TPNAME4= <>
##$TPNAME5= <>
##$TPNAME6= <>
##$TPNAME7= <>
##$TPOAL= (0..7)
0.5 0.5 0.5 0.5 0.5 0.5 0.5 0.5 
##$TPOFFS= (0..7)
0 0 0 0 0 0 0 0 
##$TUNHIN= 0
##$TUNHOUT= 0
##$TUNXOUT= 0
##$USERA1= <user>
##$USERA2= <user>
##$USERA3= <user>
##$USERA4= <user>
##$USERA5= <user>
##$V9= 5
##$VALIST= <valist>
##$VCLIST= <CCCCCCCCCCCCCCC>
##$VD= 0
##$VDLIST= <DDDDDDDDDDDDDDD>
##$VPLIST= <PPPPPPPPPPPPPPP>
##$VTLIST= <TTTTTTTTTTTTTTT>
##$WBST= 1024
##$WBSW= 4
##$XGAIN= (0..3)
0 0 0 0 
##$XL= 0
##$YL= 0
##$YMAX_a= 426478
##$YMIN_a= -460194
##$ZGOPTNS= <>
##$ZL1= 120
##$ZL2= 120
##$ZL3= 120
##$ZL4= 120
##$ABSF1= 16.522
##$ABSF2= -4.171173
##$ABSG= 5
##$ABSL= 3
##$ALPHA= 0
##$AQORDER= 0
##$ASSFAC= 0
##$ASSFACI= 0
##$ASSFACX= 0
##$ASSWID= 0
##$AUNMP= <proc_1d>
##$AZFE= 0.1
##$AZFW= 0.1
##$BCFW= 0
##$BC_mod= 0
##$BYTORDP= 0
##$COROFFS= 0
##$CY= 12.5
##$DATMOD= 1
##$DC= 0
##$DFILT= <>
##$DTYPP= 0
##$F1P= 14.0000005364418
##$F2P= -0.99999901652339
##$FCOR= 0.5
##$FTSIZE= 32768
##$FT_mod= 6
##$GAMMA= 0
##$GB= 0
##$INTBC= 1
##$INTSCL= 1
##$ISEN= 128
##$LB= 0.3
##$LEV0= 0
##$LPBIN= 0
##$MAXI= 10000
##$MC2= 0
##$MEAN= 0
##$ME_mod= 0
##$MI= 0
##$NCOEF= 0
##$NC_proc= -3
##$NLEV= 6
##$NOISF1= 0
##$NOISF2= 0
##$NSP= 0
##$NTH_PI= 0
##$NZP= 0
##$OFFSET= 16.522
##$PC= 1
##$PHC0= 136.424
##$PHC1= 10.65755
##$PH_mod= 1
##$PKNL= yes
##$PPARMOD= 0
##$PSCAL= 4
##$PSIGN= 0
##$REVERSE= no
##$SF= 250.13
##$SI= 32768
##$SIGF1= 0
##$SIGF2= 0
##$SINO= 400
##$SIOLD= 32768
##$SREGLST= <1H.DMSO>
##$SSB= 0
##$STSI= 32768
##$STSR= 0
##$SW_p= 5175.98343685301
##$SYMM= 0
##$S_DEV= 0
##$TDeff= 65536
##$TDoff= 0
##$TI= <Analysis number 999999
Compound Code 99
Book Reference 9
Project Code 9>
##$TILT= no
##$TM1= 0
##$TM2= 0
##$TOPLEV= 0
##$USERP1= <user>
##$USERP2= <user>
##$USERP3= <user>
##$USERP4= <user>
##$USERP5= <user>
##$WDW= 1
##$XDIM= 32768
##$YMAX_p= 327699445
##$YMIN_p= -89530
$$ End of Bruker specific parameters
$$ ---------------------------------
##NTUPLES= NMR SPECTRUM
##VAR_NAME=  FREQUENCY,     SPECTRUM/REAL,   SPECTRUM/IMAG
##SYMBOL=    X,             R,               I
##VAR_TYPE=  INDEPENDENT,   DEPENDENT,       DEPENDENT
##VAR_FORM=  AFFN,          ASDF,            ASDF
##VAR_DIM=   32768,         32768,           32768
##UNITS=     HZ,            ARBITRARY UNITS, ARBITRARY UNITS
##FACTOR=    0.157963299565203, 1,           1
##FIRST=     4132.6476996994, 0,             0
##LAST=      -1043.33573715361, 0,           0
##MIN=       -1043.33573715361, -89530,      0
##MAX=       4132.6476996994, 327699445,     0
$$ Real data points
##PAGE= N=1
##DATA TABLE= (X++(R..R)), XYDATA
$$ [...]
$$ plain form
14722 8063 18886 19074 9763 -18083 24565 20637 22049 2771 -1585 14118 8285 20741 14103
14709 14103 8190 5065 59 -17536 -30904 -48523 -18636 -10255 -9099 -28412 -34141 -16337 -8088
14696 -8088 -13130 -4112 4947 3598 -18101 -22205 -21075 -20801 -20638 -30144 -23864 -3142 -171 10803
14682 10803 10358 -4151 -12412 -10866 -24028 -44976 -61150 -50002 -15973 -15083 -5900 -6384 -26835
14669 -26835 -24725 2822 20626 7902 -16209 2202 17298 27325 1769 -5410 10995 1035
14657 1035 4431 21303 41961 44032 14122 8898 7450 14949 23056 -4904 1573 112 1915 4808
14643 4808 6295 -17633 -26944 -35429 -36600 -17639 -22242 -45593 -34157 -24901 -15814 15887 15711 14419
14629 14419 -3940 9168 21568 25135 13909 -2501 -26178 -34641 -6212 -2105 7481 1607 -25637
$$ packed form
14722H063J0823J88r311k7846M2648l928J412j9278m356J5703n833J2456o638
14709A4103n913l125n006j7595j3368j7619K9887Q381J156j9313n729J7804Q249
14696h088n042R018R059j349k1699m104J130K74J63r506O280K0722K971J0974
14682A0803m45j4509q261J546j3162k0948j6174J1148L4029Q90R183m84k0451
14669b6835K110K7547J7804j2724k4111J8411J5096J0027k5556p179J6405r960
14657A035L396J6872K0658K071k9910n224j448P499Q107k7960O477j461J803K893
14643D808J487k3928r311q485j171J8961m603k3351J1436R256R087L1701j76j292
14629A4419j8359J3108J2400L567j1226j6410k3677q463K8429M107R586n874k7244
$$ plain form
14616 -25637 -47595 -21699 -22336 -10391 -9539 -20656 -22055 -21354 6592 12941 9118 28552 19455 1835
14602 1835 -17701 -3634 8661 -24955 -23808 -26452 -32303 -25212 -33045 -38091 -7687 5463 -29314
14589 -29314 -34500 -12282 -2503 -7939 -12759 -7702 -884 2616 17762 12640 7835 422 6547 8632
14575 8632 991 -17800 -36446 -35989 -10024 -18318 -147 -1174 11758 23250 -7537 -15725 -31157
14562 -31157 -35936 -31693 -28514 -32370 -27138 -6958 -210 2857 11238 16972 -5709 -959 -6161 -5396
14548 -5396 1594 -15695 4267 -13126 -15377 -8666 2187 5425 63 3897 -7739 -3602 10834
14535 10834 28404 43769 43865 17783 -1166 -14780 -9231 -25715 -12676 -11399 -19897 -11882 -7785
14522 -7785 3858 16206 19540 -17672 -51683 -59797 -40823 -25927 -18770 3600 24572 24346 28732
$$ packed form
14616b5637k1958K5896o37J1945Q52j1117j399P01K7946O349l823J9434r097j7620
14602A835j9536J4067J2295l3616J147k644n851P091p833n046L0404J3150l4777
14589b9314n186K2218R779n436m820N057O818L500J5146n122m805p413O125K085
14575H632p641j8791j8646M57K5965q294J8171j027J2932J1492l0787q188j5432
14562c1157m779M243L179l856N232K0180O748L067Q381N734k2681M750n202P65
14548e396O990j7289J9962j7393k251O711J0853L238n362L834j1636M137J4436
14535A0834J7570J5365R6k6082j8949j3614N549j6484J3039J277q498Q015M097
14522g785J1643J2348L334l7212l4011q114J8974J4896P157K2370K0972k26M386
$$ plain form
14509 28732 26561 14024 -5076 -25077 -40717 -38841 -11548 1092 -4174 -7123 8677 4539 -11052
14496 -11052 -10166 -6114 11620 8595 -12382 -32596 -27615 -27322 -10335 12451 -3707 -21478 -15311
14483 -15311 -12120 -16538 1166 8516 1275 13130 2609 708 -8176 -29367 -40850 -9724 -12858
14470 -12858 -15557 -12484 4479 8267 2915 9850 1310 -18477 -32492 -8079 -15078 -46269 -38598
14457 -38598 -13553 8494 7325 10696 20098 -3979 -4115 4040 7437 -17569 -21559 -15542 -5746 2382
14443 2382 -721 -19892 -14642 -11806 -16600 -19159 676 20308 11241 -18101 -33058 -14109 5296
14430 5296 4038 2711 -18908 -12183 -13272 462 35134 35253 12387 -11148 7496 4186 -4879
14417 -4879 -12032 -13506 8567 23493 33168 21227 -1993 -6973 -7797 -2243 11268 18572 15983 11053
$$ packed form
14509B8732k171j2537j9100k0001j5640J876K7293J2640n266k949J5800m138j5591
14496a1052Q86M052J7734l025k0977k0214M981K93J6987K2786j6158j7771O167
14483a5311L191m418J7704P350p241J1855j0521j901q884k1191j1483L1126l134
14470a2858k699L073J6963L788n352O935q540j9787j4015K4413o999l1191P671
14457c8598K5045K2047j169L371R402k4077j36Q155L397k5006l990O017R796Q128
14443B382l103j9171N250K836m794k559J9835J9632r067k9342j4957J8949J9405
14430E296j258j327k1619O725j089J3734L4672J19k2866k3535J8644l310r065
14417d879p153j474K2073J4926R675j1941k3220m980q24N554J3511P304k589m930
$$ plain form
14403 11053 -2808 -8634 -29745 -31258 -7148 14073 15364 14168 17570 5862 -180 -6678 -13460
14390 -13460 -13656 -8638 -247 -5312 -14799 -539 -16339 -28597 -11000 -21963 -50555 -61965 -41328
14377 -41328 -50982 -34568 -15875 14319 20619 -15339 -56992 -38336 -23285 -22748 -34277 -41450 -46954
14364 -46954 -37401 -16716 -27392 -47814 -44980 -40591 -33354 -7629 -5925 -31908 -41569 -25317 -26050
14351 -26050 -13418 -4862 -11254 -12810 17565 35110 37615 30971 17626 -11707 -41467 -52240 -39540
14338 -39540 -16113 603 7746 29014 35968 26406 29571 26812 35701 41370 18612 13424 7406
14325 7406 2951 6702 -3972 -4812 -10228 -3314 -21489 -27166 -24886 -8808 17509 20096 21533 2601
14311 2601 -17955 -31099 -5860 11834 28446 22440 16814 -7978 -4956 -14303 -23718 -9196 -9457
$$ packed form
14403A1053j3861n826k1111j513K4110K1221J291j196L402j1708o042o498o782
14390a3460j96N018Q391n065r487J4260j5800j2258J7597j0963k8592j1410K0637
14377d1328r654J6414J8693L0194O300l5958m1653J8656J5051N37j1529p173n504
14364d6954R553K0685j0676k0422K834M389P237K5725J704k5983r661J6252p33
14351b6050J2632Q556o392j556L0375J7545K505o644j3345k9333k9760j0773J2700
14338c9540K3427J6716P143K1268O954r562L165k759Q889N669k2758n188o018
14325G406m455L751j0674q40n416O914j8175n677K280J6078K6317K587J437j8932
14311B601k0556j3144K5239J7694J6612o006n626k4792L022r347r415J4522k61
$$ plain form
14298 -9457 -5525 1669 4209 11077 29186 30464 30500 9324 -2011 -3860 -620 -5173 -19826 -11409
14284 -11409 4982 -1992 27964 29189 7632 -39189 -41871 -24461 -37270 -53504 -57449 -37321
14272 -37321 -25564 -1691 43090 40081 28788 33810 28323 29449 9614 -25081 -39398 -41770 -35963
14259 -35963 -29223 -2842 14550 281 666 4962 -16331 -2096 30331 16142 4899 31751
14247 31751 31583 17776 9670 3143 -1539 5879 12245 39882 29176 5379 -5161 -4153 -1115
14234 -1115 10407 12622 8676 18963 8686 20855 928 -10685 -8799 -8230 5500 14921 -8334
14221 -8334 -15183 -12118 -16310 -27227 -8886 21803 16394 17661 26574 40026 24734 7068 9090
14208 9090 44116 34328 7460 -16445 -16164 -6972 -8827 4604 -916 -8973 -22787 -27705 -35079 -37828
$$ packed form
14298i457L932P194K540O868J8109J278L6k1176j1335j849L240m553j4653Q417
14284a1409J6391o974K9956J225k1557m6821k682J7410j2809j6234l945K0128
14272c7321J1757K3873M4781l009j1293N022n487J126j9835l4695j4317k372N807
14259c5963O740K6381J7392j4269L85M296k1293J4235L2427j4189j1243K6852
14247C1751j68j3807q106o527m682P418O366K7637j0706k3797j0540J008L038
14234a115J1522K215l946J0287j0277J2169j9927j1613J886N69J3730R421k3255
14221h334o849L065m192j0917J8341L0689n409J267Q913J3452j5292j7666K022
14208I090L5026r788k6868k3905K81R192j855J3431n520q057j3814m918p374k749
$$ plain form
14194 -37828 -13823 12622 14802 14314 11956 2750 1585 11284 2111 -14784 -18956 -5375 -2958 21362
14180 21362 13008 15597 3930 1212 6286 11855 12233 2032 4198 -23275 -22887 -13903 -12883 -37571
14166 -37571 -35983 -16306 -7420 10143 25627 17779 7175 7919 -6223 -1597 10880 19659 22659
14153 22659 18975 -12331 -37305 -30158 -13707 -10845 -15654 -5594 11465 41183 36387 21567 16033
14140 16033 9398 2305 -4724 -23456 -37348 -17503 1354 -8653 -23245 -36981 -29599 -37507 -24830
14127 -24830 4281 3510 19355 -561 -1146 -1688 18555 17916 11916 23601 31805 15614 -5303 6127
14113 6127 4998 -7010 6998 1235 -4023 -527 11532 3014 1690 -14408 2525 8608 4489
14100 4489 -12942 -3021 15602 15739 24197 2894 -28043 -22660 9815 2567 5005 30267 22888
$$ packed form
14194c7828K4005K6445K180m88k358r206j165R699r173j6895m172J3581K417K4320
14180B1362q354K589j1667k718N074N569L78j0201K166k7473L88Q984J020k4688
14166c7571J588J9677Q886J7563J5484p848j0604P44j4142M626J2477Q779L000
14153B2659l684l1306k4974P147J6451K862m809J0060J7059K9718m796j4820n534
14140A6033o635p093p029j8732j3892J9845J8857j0007j4592j3736P382p908J2677
14127b4830K9111p71J5845j9916n85n42K0243o39o000J1685Q204j6191k0917J1430
14113F127j129j2008J4008n763n258L496J2059q518j324j6098J6933O083m119
14100D489j7431R921J8623J37Q458k1303l0937N383L2475p248K438K5262p379
$$ plain form
14087 22888 11005 -4560 -24260 -39559 -42023 -40841 -30422 -41271 -48752 -52470 -41998 -28497
14075 -28497 -21916 -9006 13268 32853 34776 32283 -4239 -26947 -12194 9616 19572 25533 26409
14062 26409 31145 23511 18154 30163 17744 4131 2031 5411 6951 -460 -6038 -24099 -32153
14049 -32153 -33860 -2677 17411 25577 37003 44427 54572 62928 32040 9209 6682 24027 29640
14036 29640 8311 14912 13598 -1800 -13052 -3977 4829 10845 -10998 -25544 -19548 -29607 -41442
14023 -41442 -52273 -40799 -25447 -13511 -11716 -29966 -36769 -21461 -10991 -13471 -7405 -5970 9927
14010 9927 24643 23439 -4152 -9125 -28196 -17005 -27001 -22517 5745 4964 3108 -7548 -5054
13997 -5054 5827 5736 1743 10228 1303 466 -3254 -6590 436 10535 17602 16609 3916 5977 15722
$$ packed form
14087B2888j1883j5565j9700j5299k464J182J0419j0849p481l718J0472J3501
14075b8497O581J2910K2274J9585J923k493l6522k2708J4753K1810R956N961Q76
14062B6409M736p634n357J2009j2419j3613k100L380J540p411n578j8061q054
14049c2153j707L1183K0088Q166J1426P424J0145Q356l0888k2831k527J7345N613
14036B9640k1329O601j314j5398j1252R075Q806O016k1843j4546N996j0059j1835
14023d1442j0831J1474J5352J1936J795j8250o803J5308J0470k480O066J435J5897
14010I927J4716j204k7591m973j9071J1191r996M484K8262p81j856j0656K494
13997e054J0881r1l993Q485q925q37l720l336P026J0099P067r93j2693K061R745
$$ plain form
13982 15722 4461 3165 17511 7117 6905 25063 7344 -24213 -4778 4264 -10063 -12893 -23230
13969 -23230 -24437 -18881 1233 30017 15186 -22656 -35219 -29998 -12138 -17389 -5453 -11858 -37047
13956 -37047 -33902 -26471 -19357 -12722 -15571 -14487 -15215 -7991 -16477 1095 22178 32553 20050 28350
13942 28350 29221 38359 37529 36368 6767 -8672 -23740 -22890 -9678 -6441 -20564 -18255 -1627 10922
13928 10922 7644 10066 18646 -6615 -32676 -9622 -15172 960 20180 9944 -9619 -13454 2455
13915 2455 19809 7105 -3309 1925 4823 -15981 -5083 20800 7561 -7378 -20589 3335
13903 3335 16928 20402 20562 -8810 -28453 -43102 -39010 -27272 -6778 13223 -23312 677 22595
13890 22595 -9050 -39907 -62968 -49097 -40220 -20346 -19454 -6519 5812 719 -4594 -9113 -1700
$$ packed form
13982A5722j1261j296J4346j0394k12J8158j7719l1557J9435R042j4327k830j0337
13969b3230j207N556K0114K8784j4831l7842j2563N221J7860n251J1936o405k5189
13956c7047L145P431P114O635k849J084p28P224q486J7572K1083J0375j2503Q300
13942B8350Q71R138q30j161k9601j5439j5068Q50J3212L237j4123K309J6628J2549
13928A0922l278K422Q580k5261k6061K3054n550J6132J9220j0236j9563l835J5909
13915B455J7354j2704j0414N234K898k0804J0898K5883j3239j4939j3211K3924
13903C335J3593L474J60k9372j9643j4649M092J1738K0494K0001l6535K3989K1918
13890B2595l1645l0857k3061J3871Q877J9874Q92J2935J2331n093n313m519P413
$$ plain form
13877 -1700 -10183 15163 23745 3248 -1607 9450 6117 -16222 -13094 647 2345 -5806 -7886
13864 -7886 3380 -7096 -1403 2674 390 -29641 -12993 16400 -6253 -41936 -38202 -6729 8154
13851 8154 14439 13324 42890 43503 42462 45444 30023 4750 -10147 2796 20702 26146 18665
13838 18665 17483 28466 26740 42890 32165 2063 13060 8649 -4469 4027 1265 -4043 -3149
13825 -3149 -8504 -31499 -18002 -18056 -13958 -11029 -30017 -43877 -26057 -21397 -9891 -19753 -14033 -17984
13811 -17984 -41580 -63403 -43133 -1181 7993 -14094 -20879 -20685 -14024 -23274 -39548 -45353 -37483
13798 -37483 -10534 17067 16920 14182 2388 17161 21170 33870 19909 26232 37467 39385 30566
13785 30566 2292 -41837 -22517 24801 36867 26848 29488 36160 21144 10361 13999 16378
$$ packed form
13877a700q483K5346Q582k0497m855J1057l333k2339L128J3741J698q151k080
13864g886J1266j0476N693M077k284l0031J6648K9393k2653l5683L734L1473J4883
13851H154O285j115K9566O13j041K982j5421k5273j4897J2943J7906N444p481
13838A8665j182J0983j726J6150j0725l0102J0997m411j3118Q496k762n308Q94
13825c149n355k2995J3497n4M098K929j8988j3860J7820M660J1506r862N720l951
13811a7984k3596k1823K0270M1952R174k2087o785J94O661r250j6274n805P870
13798c7483K6949K7601j47k738j1794J4773M009J2700j3961O323J1235J918q819
13785C0566k8274m4129J9320M7318J2066j0019K640O672j5016j0783L638K379
$$ plain form
13773 16378 19711 11520 -1693 -2058 -15495 -28504 3560 38709 51495 26822 26425 19785 21883
13760 21883 38794 42392 21604 49932 57619 28026 37734 36956 35566 43159 54474 49126 42734
13747 42734 18690 7792 15883 1312 -16730 -26526 -16646 13937 25339 15998 11259 10008 6851
13734 6851 1833 31323 23367 -937 -19075 -899 2803 13101 17456 14665 404 -9798 -4476
13721 -4476 -10761 13604 735 -22753 -26534 -9805 20973 20758 -16620 -13021 15260 17085 9619
13708 9619 7884 64 137 -13547 -27695 -20668 2469 9066 -7711 -3478 -11619 -27227 -27180 -31737
13694 -31737 -23540 -8246 20215 31636 19297 7546 14980 16008 96 -11927 -15199 -17260 -10999
13681 -10999 -3916 -11634 -9164 17134 36889 15104 12970 27312 29586 18487 2876 17688 26052
$$ packed form
13773A6378L333q191j3213l65j3437j3009L2064L5149J2786k4673l97o640K098
13760B1883J6911L598k0788K8328P687k9593R708p78j390P593J1315n348o392
13747D2734k4044j0898Q091j4571j8042r796R880L0583J1402r341m739j251l157
13734F851n018K9490p956k4304j8138J8176L702J0298M355k791j4261j0202N322
13721d476o285K4365j2869k3488l781J6729L0778k15l7378L599K8281J825p466
13708I619j735p820P3j3684j4148P027K3137O597j6777M233q141j5608M7m557
13694c1737Q197J5294K8461J1421j2339j1751P434J028j5912j2023l272k061O261
13681a0999P083p718K470K6298J9755k1785k134J4342K274j1099j5611J4812Q364
$$ plain form
13668 26052 10848 635 443 -26688 -28250 -18751 4884 3186 -10236 -1649 16003 33969 44886
13655 44886 37698 51741 46179 21681 768 -5843 -722 -10489 2245 47403 19621 -2824 10634
13642 10634 8650 12939 11103 20112 15507 -13700 -18191 -9297 -1698 11922 2719 7434 28585 30372
13628 30372 33472 29753 3735 19893 10815 4156 4365 -8931 -219 1146 3798 687 27613 44302
13614 44302 24441 8309 2204 17072 3314 -14818 151 16864 13827 -429 7358 17685
13602 17685 9644 11722 20132 19033 19024 25265 9537 6029 9337 10325 6331 -11935 -25510 -16530 14262
13587 14262 38863 8547 -29146 -16989 -12526 5936 10566 -15542 -23092 -4156 14963 58091
13575 58091 35972 25908 33468 8406 23870 19322 -5571 -7688 5268 4145 2340 9864 -4101
$$ packed form
13668B6052j5204j0213j92k7131j562R499K3635j698j3422Q587J7652J7966J0917
13655D4886p188J4043n562k4498k0913o611N121r767J2734M5158k7782k2445J3458
13642A0634j984M289j836R009m605k9207m491Q894P599J3620r203M715K1151J787
13628C0372L100l719k6018J6158r078o659K09j3296Q712J365K652l111K6926J6689
13614D4302j9861j6132o105J4868j3758j8132J4969J6713l037j4256P787J0327
13602A7685q041K078Q410j099rO241j5728l508L308R88l994j8266j3575Q980L0792
13587A4262K4601l0316l7693J2157M463J8462M630k6108p550J8936J9119M3128
13575E8091k2119j0064P560k5062J5464m548k4893k117J2956j123j805P524j3965
$$ plain form
13562 -4101 -9486 -17310 -11197 8461 2649 -15973 -20752 -15985 -20612 -10447 5661 8834 -12622
13549 -12622 -1821 12398 8845 9034 24150 9682 20556 50881 62277 58641 65024 50262 30094
13536 30094 31239 41938 49124 46105 37829 44152 40288 43855 36885 26967 21664 17161 4363 -28868
13522 -28868 -33358 -24792 -23383 -751 5997 -1768 25737 43770 68330 78472 71989 51615 46732
13509 46732 31253 2096 10949 19883 26590 47900 40781 35794 19957 14576 27236 36034 36407
13496 36407 38162 9055 4668 17635 29568 11313 -9450 -13631 -2295 6345 26781 40871
13484 40871 28435 12479 3842 13365 10644 9098 10472 34444 26669 7136 4480 8928 31546
13471 31546 25952 18147 32826 34358 13206 -9710 6325 650 7070 25516 -2190 -2625 -1448
$$ packed form
13562d101n385p824O113J9658n812j8622m779M767m627J0165J6108L173k1456
13549a2622J0801J4219l553J89J5116j4468J0874L0325J1396l636O383j4762k0168
13536C0094J145J0699P186l019q276O323l864L567o970r918n303m503j2798l3231
13522b8868m490Q566J409K2632O748p765K7505J8033K4560J0142o483k0374m883
13509D6732j5479k9157Q853Q934O707K1310p119m987j5837n381J2660Q798L73
13496C6407J755k9107m387J2967J1933j8255k0763m181J1336Q640K0436J4090
13484D0871j2436j5956q637R523k721j546J374K3972p775j9533k656M448K2618
13471C1546n594p805J4679J532k1152k2916J6035n675O420J8446k7706m35J177
$$ plain form
13458 -1448 5897 16605 1119 1685 8406 8154 -946 -15530 -21250 -19646 7186 10196 3542 2492
13444 2492 8914 15660 13703 21560 32673 42034 39001 36598 24440 38598 30118 30310 25875 10298
13430 10298 11285 21260 3338 19007 42417 16308 -3330 -8921 -20910 -3725 9734 10663 19312
13417 19312 13414 32816 25937 10425 -19825 -19327 -15293 4260 7547 -15751 80 -438 52 23368
13403 23368 37748 59704 56893 53269 50396 38118 15859 22693 14099 -5440 -12318 28367 51001
13390 51001 57850 51854 44140 15922 -2397 843 6555 -8131 -1859 -5685 -14694 -11284 4173
13377 4173 30104 6645 -9213 -5478 7438 19221 40594 18010 -8829 -6909 -6562 9400 8184
13364 8184 3094 -6405 11684 5987 32353 64479 75696 68427 39988 59102 79723 85819 58265
$$ packed form
13458a448P345J0708j5486N66O721k52r100j4584n720J604K6832L010o654j050
13444B492O422O746j957P857J1113R361l033k403j2158J4158q480J92m435j5577
13430A0298R87R975j7922J5669K3410k6109j9638n591j1989J7185J3459R29Q649
13417A9312n898J9402o879j5512l0250M98M034J9553L287k3298J5831n18M90K3316
13403B3368J4380K1956k811l624k873j2278k2259O834q594j9539o878M0685K2634
13390E1001O849n996p714k8218j8319L240N712j4686O272l826r009L410J5457
13377D173K5931k3459j5858L735J2916J1783K1373k2584k6839J920L47J5962j216
13364H184n090r499J8089n697K6366L2126J1217p269k8439J9114K0621O096k7554
$$ plain form
13351 58265 59303 39966 13619 1966 13317 8786 26995 54011 33009 21229 30508 30980 21303
13338 21303 10037 17062 38865 54345 60918 49936 32540 33104 29276 18560 27683 34627 7366
13325 7366 4648 350 -8573 4297 44075 40107 29295 24718 27081 1898 7150 39971 39365 14114
13311 14114 25779 28730 19386 -16934 -35045 -3709 4233 18240 28941 37745 32613 27188 30192
13298 30192 33058 60287 59262 30546 17461 -11833 -20253 -7119 12719 49597 57163 36252
13286 36252 29826 9212 3680 -124 14630 8083 12578 36422 36416 23934 38733 32703 12434 27302
13272 27302 54813 55640 36362 28338 32491 29368 19486 21740 19512 28230 32427 37513 39162 26339
13258 26339 18208 18569 34545 61812 75679 48937 393 79 21822 48164 47153 41431 38140
$$ packed form
13351E8265J038j9337k6347j1653J1351m531J8209K7016k1002j1780R279M72r677
13338B1303j1266P025K1803J5480O573j0982j7396N64l828j0716R123O944k7261
13325G366k718m298q923J2870L9778l968j0812m577K363k5183N252L2821o06k5251
13311A4114J1665K951r344l6320j8111L1336P942J4007J0701Q804n132n425L004
13298C0192K866K7229j025k8716j3085k9294q420J3134J9838L6878P566k0911
13286C6252o426k0614n532l804J4754o547M495K3844oj2482J4799o030k0269J4868
13272B7302K7511Q27j9278q024M153l123r882K254k228Q718M197N086J649j2823
13258B6339q131L61J5976K7267J3867k6742m8544l14K1743K6342j011n722l291
$$ plain form
13245 38140 -2718 2753 14781 19040 19613 38433 50516 68040 54992 42992 6606 -26578
13233 -26578 2719 39024 52437 34105 23603 35298 14246 -3323 -1544 -14137 26612 26744
13221 26744 30033 26110 31505 30342 12448 -208 11627 14765 40052 71572 70405 42194 13645
13208 13645 4468 -111 7803 16957 24669 33179 27627 11488 2195 5516 18019 16482 4660 5069
13194 5069 14132 26165 18301 39760 45460 21785 18015 21056 16860 23074 28278 31472 36196 24546
13180 24546 19565 30659 44892 47681 36809 52955 38666 28860 40066 28693 23188 33816
13168 33816 41908 66475 62410 47480 58737 83004 72290 57493 59408 56540 31684 25184 9011
13155 9011 17909 40473 33374 41457 52522 39362 48323 41467 10734 -917 12672 29319 39177
$$ packed form
13245C8140m0858N471J2028M259N73J8820J2083J7524j3048j2000l6386l3184
13233b6578K9297L6305J3413j8332j0502J1695k1052j7569J779j2593M0749J32
13221B6744L289l923N395j163j7894j2656J1835L138K5287L1520j167k8211k8549
13208A3645r177m579P914R154P712Q510n552j6139r293L321J2503j537j1822M09
13194E069R063J2033p864K1459N700k3675l770L041m196O214N204L194M724j1650
13180B4546m981J1094J4233K789j0872J6146j4289r806J1206j1373n505J0628
13168C3816Q092K4567m065j4930J1257K4267j0714j4797J915k868k4856o500j6173
13155I011Q898K2564p099Q083J1065j3160Q961o856l0733j1651J3589J6647R858
$$ plain form
13142 39177 41019 32066 32447 36859 37790 27430 23651 54682 70841 74878 78813 71518 66993 49195
13128 49195 36947 31282 48610 60845 63935 68609 65321 50332 22154 16342 13061 -4127 7740
13115 7740 17487 -10369 -2687 22472 37409 60082 69556 74918 69374 49701 36956 36485 45175
13102 45175 38557 35972 19804 22958 58564 50659 26596 5777 21064 25200 40628 28183 41347
13089 41347 8470 349 6272 39012 30821 27367 24422 10664 14837 19172 30405 33584 40183
13076 40183 74759 79709 52475 31239 47329 75991 64993 54792 38979 17118 28548 42127
13064 42127 35401 46506 55645 38945 29431 31541 31799 27133 41361 18243 8454 22533 29832
13051 29832 25104 49484 68813 62336 50742 68050 81443 73633 45568 45590 65759 43804 29237
$$ packed form
13142C9177J842q953L81M412R31j0360l779L1031J6159M037L935p295m525j7798
13128D9195j2248n665J7328J2235L090M674l288j4989k8178n812l281j7188J1867
13115G740R747k7856P682K5159J4937K2673R474N362n544j9673j2745m71Q690
13102D5175o618k585j6168L154L5606p905k4063k0819J5287M136J5428j2445J3164
13089D1347l2877q121N923L2740q191l454k945j3758M173M335J1233L179O599
13076D0183L4576M950k7234k1236J6090K8662j0998j0201j5813k1861J1430J3579
13064D2127o726J1105R139j6700r514K110K58m666J4228k3118r789J4079P299
13051B9832m728K4380J9329o477j1594J7308J3393p810k8065K2K0169k1955j4567
$$ plain form
13038 29237 34489 38707 28691 28084 7233 10511 26218 37241 50082 62277 74440 75495 54656
13025 54656 64711 64089 46277 40979 49125 49264 48387 57834 77643 79795 65899 58961 59130 39848
13011 39848 44268 43647 49469 54170 35051 37005 33825 34488 64337 67466 84015 68645 44515 30041
12997 30041 38841 54844 62668 77819 86269 74083 64507 58919 69483 58247 58299 51909 62692
12984 62692 73266 56124 43923 47360 46101 48345 19785 -2568 11727 -2900 -11898 -170
12972 -170 28650 41334 32791 19498 40476 56985 60563 71042 56335 41025 42823 53767 49880
12959 49880 46158 80326 85787 84842 72148 64505 69543 69087 61264 35622 15176 29719 32119 22319
12945 22319 30432 29600 36636 43218 43916 48687 38931 30537 19428 41547 43615 19475 21025 26078
$$ packed form
13038B9237N252M218j0016o07k0851L278J5707J1023J2841J2195J2163J055k0839
13025E4656J0055o22j7812n298Q146J39q77R447J9809K152j3896o938J69j9282
13011C9848M420o21N822M701j9119J954l180O63K9849L129J6549j5370k4130j4474
12997C0041Q800J6003P824J5151Q450j2186r576n588J0564j1236N2o390J0783
12984F2692J0574j7142j2201L437j259K244k8560k2353J4295j4627q998J1728
12972a70K8820J2684q543j3293K0978J6509L578J0479j4707j5310J798J0944l887
12959D9880l722L4168N461r45j2694p643N038m56p823k5642k0446J4543K400r800
12945B2319Q113q32P036O582O98M771r756q394j1109K2119K068k4140J550N053
$$ plain form
12931 26078 28800 12515 5722 13296 21829 41115 38750 41747 41388 72566 89760 92913 61859
12918 61859 42437 54743 47338 29241 20230 15612 23354 58483 90461 76529 64026 55284 69379
12905 69379 58642 44883 54091 61002 58475 49208 42943 68184 93031 75301 76810 58057 20050
12892 20050 23117 16121 37497 34500 35880 59040 69446 49585 48193 79614 77353 70200 39665
12879 39665 28877 37726 52107 86588 94109 66297 47354 43738 38284 35331 33616 48371 69556
12866 69556 75104 53296 56533 64297 49106 34132 53149 89058 94810 95736 94533 101482 108977
12853 108977 110458 102946 92683 40036 25020 14886 17951 15681 20149 48132 51689 35754 25474
12840 25474 33853 31121 3152 18887 33598 58903 43317 51068 56040 66073 86564 71360
$$ packed form
12931B6078K722j6285o793P574Q533J9286k365K997l59L1178J7194L153l1054
12918F1859j9422J2306p405j8097r011m618P742L5129L1978j3932j2503q742J4095
12905F9379j0737j3759R208O911k527r267o265K5241K4847j7730J509j8753l8007
12892B0050L067o996K1376k997J380K3160J0406j9861j392L1421k261p153l0535
12879C9665j0788Q849J4381L4481P521k7812j8943l616n454k953j715J4755K1185
12866F9556N548k1808L237P764j5191j4974J9017L5909N752R26j203O949P495
12853A08977J481p512j0263n2647j5016j0134L065k270M468K7983L557j5935j0280
12840B5474Q379k732k7969J5735J4711K5305j5586P751M972J0033K0491j5204
$$ plain form
12828 71360 49154 58926 76596 80006 81294 55512 62694 35081 27893 36552 40773 70309 87935
12815 87935 63475 71969 94958 91897 102848 111277 108192 75255 72152 79089 66334 70512 94039
12802 94039 109306 93233 92536 105777 109821 103101 112231 113457 127920 144958 160601 144020 130993
12789 130993 123267 121906 113632 111616 108957 114515 104224 99345 92480 80107 85368 105772 125657
12776 125657 127404 117422 104949 81512 91491 97934 92595 93552 90564 81262 91868 110225 132286
12763 132286 138123 148224 142135 156017 160165 148511 143190 144287 122488 117057 136134 165070 161662
12750 161662 145566 166456 180647 187175 195842 206753 208121 196629 186170 180618 197342 228768
12738 228768 216243 200701 211546 197411 186024 178976 197279 226732 236498 235283 239625 259771
$$ packed form
12828G1360k2206R772J7670L410J288k5782P182k7613p188Q659M221K9536J7626
12815H7935k4460Q494K2989l061J0951Q429l085l2937l103O937j2755M178K3527
12802I4039J5267j6073o97J3241M044o720R130J226J4463J7038J5643j6581j3027
12789A30993p726j361q274k016k659N558j0291m879o865j2373N261K0404J9885
12776A25657J747r982j2473k3437R979O443n339R57k988r302J0606J8357K2061
12763A32286N837J0101o089J3882M148j1654n321J097k1799n431J9077K8936l408
12750A61662j6096K0890J4191O528Q667J0911J368j1492j0459n552J6724L1426
12738B28768j2525j5542J0845j4135j1387p048J8303K9453R766j215M342K0146
$$ plain form
12726 259771 264589 263706 257791 231811 229766 249691 238406 234989 230816 254959 282977 291538 276206
12713 276206 244377 240235 252237 262489 266763 269106 282043 287051 301786 295445 285936 295703 288062
12700 288062 260486 257410 271538 266444 242682 225477 234114 224121 216129 232578 254348 259969 234920
12687 234920 215996 235841 222918 213897 237573 261622 276995 263489 270009 280523 269942 257363
12675 257363 263983 247123 227966 221392 209674 210874 221241 222159 213819 208902 198842 176457 178575
12662 178575 194594 205160 194102 176422 164387 163333 151751 133842 136352 134431 128900 136893
12650 136893 127674 131405 121223 132969 171554 185100 176396 169763 155322 147822 126579 117782 126733
12637 126733 125795 133916 110318 111711 114249 123075 115242 113513 124192 152624 148581 156903 153353 137711
$$ packed form
12726B59771M818q83n915k5980k045J9925j1285l417m173K4143K8018Q561j5332
12713B76206l1829m142J2002J0252M274K343J2937N008J4735o341r509R767p641
12700B88062k7576l076J4128n094k3762j7205Q637r993p992J6449K1770N621k5049
12687B34920j8924J9845j2923r021K3676K4049J5373j3506O520J0514j0581j2579
12675B57363O620j6860j9157o574j1718J200J0367R18q340m917j0060k2385K118
12662A78575J6019J0566j1058j7680j2035j054j1582j7909K510j921n531P993
12650A36893r219L731j0182J1746L8585J3546q704o633j4441p500k1243q797Q951
12637A26733r38Q121k3598J393K538Q826p833j729J0679K8432m043Q322l550j5642
$$ plain form
12623 137711 125564 116109 100556 105266 125634 113898 113597 129603 154692 163503 142735 135912 125741
12610 125741 124489 114420 94617 113874 126175 140940 149690 148142 129724 106178 93263 94120
12598 94120 121135 125083 161241 160987 145950 141354 129033 110520 104666 109682 119531 150354 156104
12585 156104 157582 191620 180090 156317 153899 160756 164680 156343 146877 136001 139201 132805 137665
12572 137665 143610 143165 157733 170720 193024 175748 167847 162317 175641 189990 161409 150985
12560 150985 146582 154588 150054 146764 163560 162355 143637 161771 162232 171698 201737 209369 199788
12547 199788 204258 210871 206104 206803 195890 187741 208743 212016 215493 190415 176746 205158 237689
12534 237689 236448 226819 228722 224923 220980 244732 231160 221466 223842 221360 219723 228175 227197 231633
$$ packed form
12623A37711j2147r455j5553M710K0368j1736l01J6006K5089Q811k0768o823j0171
12610A25741j252j0069j9803J9257J2301J4765Q750j548j8418k3546j2915Q57
12598I4120K7015L948L6158k54j5037m596j2321j8513n854N016R849L0823N750
12585A56104J478L4038j1530k3773k418O857L924q337r466j0876L200o396M860
12572A37665N945m45J4568J2987K2304j7276p901n530J3324J4349k8581j0424
12560A50985m403Q006m534l290J6796j205j8718J8134M61R466L0039P632r581
12547A99788M470O613m767O99j0913q149K1002L273L477k5078j3669K8412L2531
12534B37689j241r629J903l799l943K3752j3572r694K376k482j637Q452r78M436
$$ plain form
12520 231633 234297 223554 244005 265831 272718 272501 270202 266122 264617 261743 277469 277965 277364 281526
12506 281526 289886 310768 325771 330036 332115 332187 337589 339299 335646 370554 350600 334105 359362
12493 359362 376988 372375 396028 383497 387343 424386 432527 424626 407371 411368 437471 419313
12481 419313 394905 414436 429013 426376 420568 439338 449394 444563 429627 441589 448075 448262 453199
12468 453199 464280 456638 432575 439156 444111 436650 428631 429307 438182 440546 449560 448931 477921 483362
12454 483362 451522 443551 439164 454387 473638 471109 469279 479143 498438 470929 460826 484261
12442 484261 513776 529403 525756 532294 529633 526254 509662 517949 527187 521592 510485 523431 532950
12429 532950 541820 557218 569055 569584 548078 519522 524135 547439 555874 537746 513672 526051
$$ packed form
12520B31633K664j0743K0451K1826O887k17k299m080j505k874J5726M96o01M162
12506B81526Q360K0882J5003M265K079P2N402J710l653L4908j9954j6495K5257
12493C59362J7626m613K3653j2531L846L7043Q141p901j7255L997K6103j8158
12481D19313k4408J9531J4577k637n808J8770J0056m831j4936J1962O486J87M937
12468D53199J1081p642k4063O581M955p461q019O76Q875K364R014o29K8990N441
12454D83362l1840p971m387J5223J9251k529j830R864J9295k7509j0103K3435
12442D84261K9515J5627l647O538k661l379j6592Q287R238n595j1107J2946R519
12429E32950Q870J5398J1837N29k1506k8556M613K3304Q435j8128k4074J2379
$$ plain form
12417 526051 549021 572252 571416 561879 549904 547050 548454 539601 552001 577594 573348 584797 583800
12404 583800 580135 580431 593312 587205 587649 601231 610906 635636 651657 650040 651760 653671 656183 683114
12390 683114 691817 713783 706790 693470 681782 682700 702596 713225 715070 730487 769128 800670
12378 800670 808289 824541 853513 854745 852274 877463 910341 921822 925381 926983 936264 983022 997847
12365 997847 1023923 1056219 1095547 1106371 1108063 1127974 1148667 1164659 1186021 1220320 1252361 1254017
12353 1254017 1306090 1365243 1393298 1422638 1469774 1498215 1535011 1563524 1617704 1695915 1779538
12342 1779538 1859583 1961581 2053623 2126820 2220835 2331258 2466955 2601442 2773076 2971347
12332 2971347 3196680 3416700 3661942 3892413 4155368 4509428 4926885 5410007 5996639
$$ packed form
12417E26051K2970K3231q36r537j1975k854J404q853J2400K5593m246J1449r97
12404E83800l665K96J2881o107M44J3582R675K4730J6021j617J720J911K512K6931
12390F83114Q703K1966o993j3320j1688R18J9896J0629J845J5417L8641L1542
12378H00670P619J6252K8972J232k471K5189L2878J1481L559J602R281M6758J4825
12365I97847K6076L2296L9328J0824J692J9911K0693J5992K1362L4299L2041J656
12353A254017N2073N9153K8055K9340M7136K8441L6796K8513N4180P8211Q3623
12342A779538Q0045J01998R2042P3197R4015J10423J35697J34487J71634J98271
12332B971347K25333K20020K45242K30471K62955L54060M17457M83122N86632
$$ plain form
12323 5996639 6656462 7406930 8294624 9306032 10427286 11675747 13012705 14390235 15790034
12314 15790034 17154844 18455706 19639726 20686571 21541806 22213878 22671100 22875138 22823498
12305 22823498 22580847 22139801 21561233 20940518 20341532 19788167 19360795 19091806 19059774
12296 19059774 19292955 19804593 20626671 21726609 23104448 24708510 26473682 28251314
12288 28251314 30040323 31851706 33649336 35421302 37090148 38566093 39729549 40472390
12280 40472390 40813116 40760522 40440646 39907052 39236806 38457704 37624975 36738458 35878651
12271 35878651 35109211 34465147 34031250 33777142 33648217 33578368 33498790 33386073 33282996 33195109
12261 33195109 33123430 33033798 32893220 32621437 32229990 31741667 31302565 31080652 31172191 31670428
$$ packed form
12323E996639O59823P50468Q87694J011408J121254J248461J336958J377530J399799
12314A5790034J364810J300862J184020J046845Q55235O72072M57222K04038n1640
12305B2823498k42651m41046n78568o20715n98986n53365m27372k68989l2032
12296A9059774K33181N11638Q22078J099938J377839J604062J765172J777632
12288B8251314J789009J811383J797630J771966J668846J475945J163456P42841
12280D0472390L40726n2594l19876n33594o70246p79102q32729q86517q59807
12271C5878651p69440o44064m33897k54108j28925o9849p9578j12717j03077q7887
12261C3195109p1679q9632j40578k71783l91447m88323m39102k21913R1539M98237
$$ plain form
12251 31670428 32556084 33741006 35126034 36541345 37821430 38845333 39613822 40056787
12243 40056787 40172108 39955472 39340631 38285500 36728811 34709793 32321931 29691924
12235 29691924 27029068 24457036 22079556 19955289 18055229 16411355 15009662 13806455
12227 13806455 12746432 11816057 11033130 10361620 9751706 9195996 8711191 8293209 7939522
12218 7939522 7610435 7295603 6973077 6699970 6439205 6206856 5965494 5753154 5566525
12209 5566525 5373148 5193926 5022315 4893609 4773336 4668047 4534739 4409844 4305596
12200 4305596 4218045 4154118 4081111 4026806 4005297 4004074 3996462 3985287 3984769 4003232 4003031 3981244
12188 3981244 3949891 3904826 3889962 3866822 3833309 3800671 3755928 3694804 3637166 3563076 3504536
$$ packed form
12251C1670428Q85656J184922J385028J415311J280085J023903P68489M42965
12243D0056787J15321k16636o14841j055131j556689k019018k387862k630007
12235B9691924k662856k572032k377480k124267j900060j643874j401693j203207
12227A3806455j060023r30375p82927o71510o09914n55710m84805m17982l53687
12218G939522l29087l14832l22526k73107k60765k32349k41362k12340j86629
12209E566525j93377j79222j71611j28706j20273j05289j33308j24895j04248
12200D305596q7551o3927p3007n4305k1509j223p612j1175n18J8463k01k1787
12188C981244l1353m5065j4864k3140l3513l2638m4743o1124n7638p4090n8540
$$ plain form
12177 3504536 3444263 3401639 3387051 3382410 3364451 3335369 3331887 3348253 3346586 3320070 3301469 3297491
12165 3297491 3275281 3224832 3147179 3090930 3042725 2993630 2947062 2896300 2843916 2826049 2818801
12154 2818801 2798410 2805760 2813415 2820606 2820788 2837241 2854162 2876059 2925761 2976030 3039905 3104491
12142 3104491 3163999 3223802 3261866 3279172 3325575 3379488 3394891 3394748 3425429 3464139 3491264 3469360
12130 3469360 3427685 3412598 3388714 3347874 3324367 3320569 3344833 3367805 3401334 3430480 3475518
12119 3475518 3539131 3587811 3661239 3752857 3803030 3859744 3870616 3886832 3939990 3979273 4009394
12108 4009394 4048042 4051319 4030260 4013588 3981438 3957540 3951482 3942670 3902613 3885888 3877894 3847426
12096 3847426 3822319 3793937 3768377 3766602 3763968 3763059 3754908 3753036 3815409 3893634 3969292 4048764
$$ packed form
12177C504536o0273m2624j4588m641j7959k9082l482J6366j667k6516j8601l978
12165C297491k2210n0449p7653n6249m8205m9095m6568n0762n2384j7867p248
12154B818801k0391P350P655P191J82J6453J6921K1897M9702N0269O3875O4586
12142C104491N9508N9803L8064J7306M6403N3913J5403j43L0681L8710K7125k1904
12130C469360m1675j5087k3884m0840k3507l798K4264K2972L3529K9146M5038
12119C475518O3613M8680P3428R1618N0173N6714J0872J6216N3158L9283L0121
12108D009394L8648L277k1059j6672l2150k3898o058q812m0057j6725p994l0468
12096C847426k5107k8382k5560j775k634r09q151j872O2373P8225P5658P9472
$$ plain form
12084 4048764 4166229 4313866 4441182 4608370 4831210 5088906 5391594 5741495 6086785
12075 6086785 6477907 6934827 7490874 8104587 8804238 9594771 10499085 11557128 12759731
12066 12759731 14189336 15818450 17624474 19585792 21675161 23847357 26028649 28125233
12058 28125233 30033126 31730600 33177794 34361792 35218722 35765195 35990310 35871078 35437500
12049 35437500 34716662 33817159 32858683 31974580 31265737 30774693 30509957 30491095 30678153
12040 30678153 30976421 31299930 31626505 31962647 32364098 32747134 33113062 33418724 33635734
12031 33635734 33779199 33906873 34064169 34286043 34638677 35102022 35663245 36341576 37094406
12022 37094406 37843687 38577154 39257724 39824551 40209049 40384178 40298079 39933625 39276649
$$ packed form
12084D048764J17465J47637J27316J67188K22840K57696L02688L49901L45290
12075F086785L91122M56920N56047O13713O99651P90533R04314J058043J202603
12066A2759731J429605J629114J806024J961318K089369K172196K181292K096584
12058B8125233J907893J697474J447194J183998Q56930N46473K25115j19232m33578
12049C5437500p20838q99503r58476q84103p08843m91044k64736j8862J87058
12040C0678153K98268L23509L26575L36142M01451L83036L65928L05662K17010
12031C3635734J43465J27674J57296K21874L52634M63345N61223O78331P52830
12022C7094406P49281P33467O80570N66827L84498J75129q6099l64454o56976
$$ plain form
12013 39276649 38354858 37248419 36035957 34731615 33345132 31866122 30317043 28799966
12005 28799966 27350897 26040288 24952257 24073830 23449399 23067042 22884554 22872965 23027398
11996 23027398 23313028 23650252 24015913 24390667 24705939 24927120 25014932 24940049 24718892 24320748
11986 24320748 23746207 23004551 22112349 21101555 19976452 18768123 17525604 16281556
11978 16281556 15077574 13958925 12953242 12038754 11206162 10475463 9812530 9224371 8732114
11969 8732114 8296605 7890934 7532537 7227236 6948660 6707093 6503575 6305069 6110047
11960 6110047 5905862 5756166 5643561 5540687 5417158 5312338 5245759 5158486 5078057 5027629
11950 5027629 4968747 4920924 4894560 4914566 4932653 4950575 4985774 5035180 5119924 5216422 5333696
$$ packed form
12013C9276649r21791j106439j212462j304342j386483j479010j549079j517077
12005B8799966j449069j310609j088031q78427o24431l82357j82488j1589J54433
11996B3027398K85630L37224L65661L74754L15272K21181Q7812p4883k21157l98144
11986B4320748n74541p41656q92202j010794j125103j208329j242519j244048
11978A6281556j203982j118649j005683r14488q32592p30699o62933n88159m92257
11969H732114m35509m05671l58397l05301k78576k41567k03518j98506j95022
11960F110047k04185j49696j12605j02874j23529j04820o6579q7273q0429n0428
11950E027629n8882m7823k6364K0006J8087J7922L5199M9406Q4744R6498J17274
$$ plain form
11939 5333696 5467502 5598461 5743836 5952819 6218348 6506979 6857156 7265033 7749118
11930 7749118 8335738 9003721 9815722 10746398 11857305 13236932 14948423 17028805 19492489
11921 19492489 22400550 25650641 29045333 32272156 35100998 37303153 38898470 40002483
11913 40002483 40701464 40993010 40764772 39828330 38055273 35449839 32265035 28887575 25592643
11904 25592643 22592529 19966932 17737575 15856284 14269716 12915432 11814607 10868937
11896 10868937 10045584 9356765 8760431 8240649 7791228 7409671 7049199 6756985 6490381
11887 6490381 6239997 6040782 5878096 5704910 5517168 5343608 5186275 5037243 4877366
11878 4877366 4727757 4602973 4492116 4379264 4263850 4123957 3992693 3870665 3784389 3688191
$$ packed form
11939E333696J33806J30959J45375K08983K65529K88631L50177M07877M84085
11930G749118N86620O67983Q12001R30676J110907J379627J711491K080382K463684
11921A9492489K908061L250091L394692L226823K828842K202155J595317J104013
11913D0002483O98981K91546k28238r36442j773057k605434l184804l377460l294932
11904B5592643l000114k625597k229357j881291j586568j354284j100825r45670
11896A0868937q23353o88819n96334n19782m49421l81557l60472k92214k66604
11887F490381k50384j99215j62686j73186j87742j73560j57333j49032j59877
11878D877366j49609j24784j10857j12852j15414j39893j31264j22028q6276r6198
$$ plain form
11868 3688191 3578367 3504471 3437479 3366073 3303436 3220663 3146652 3077283 3021709 2967244 2936470
11857 2936470 2930803 2904556 2885845 2851775 2802414 2762711 2739105 2684431 2658086 2633597 2604808
11846 2604808 2561020 2509825 2463606 2426363 2370397 2329162 2331290 2314573 2272300 2230943 2171988
11835 2171988 2119121 2069937 2033441 2001143 1966017 1936991 1904088 1900355 1891700 1869442 1853262 1820676
11823 1820676 1803774 1776805 1757698 1742133 1754003 1753626 1736754 1718066 1692248 1659282 1646803 1606947
11811 1606947 1560692 1515372 1465038 1440460 1395886 1352779 1302954 1255708 1206885 1150344 1110931
11800 1110931 1071405 1027028 991025 952078 941680 914285 885122 860715 843889 833808 811782
11789 811782 793140 758568 763636 715567 686955 695870 686376 654098 652158 650154 644984 628542 592315
$$ packed form
11868C688191j09824p3896o6992p1406o2637q2773p4011o9369n5574n4465l0774
11857B936470n667k6247j8711l4070m9361l9703k3606n4674k6345k4489k8789
11846B604808m3788n1195m6219l7243n5966m1235K128j6717m2273m1357n8955
11835B171988n2867m9184l6496l2298l5126k9026l2903l733q655k2258j6180l2586
11823A820676j6902k6969j9107j5565J1870l77j6872j8688k5818l2966j2479l9856
11811A606947m6255m5320n0334k4578m4574m3107m9825m7246m8823n6541l9413
11800A110931l9526m4377l6003l8947j0398k7395k9163k4407j6826j0081k2026
11789H11782j8642l4572N068m8069k8612Q915r494l2278j940k004n170j6442l6227
$$ plain form
11776 592315 556442 536198 553786 527310 486041 493443 494033 459802 455770 429442 423621 411491
11764 411491 394922 385861 364191 334957 341092 339425 330699 312468 321049 323265 335573 353046 352500
11751 352500 342569 339278 336941 317823 314161 308547 279133 250183 252485 228846 235827 238148 253062
11738 253062 253039 273620 299142 282387 251591 238130 222659 228143 242331 229911 204075 197863
11726 197863 200935 180842 188770 216431 225280 217658 207365 190181 172600 152869 162663 156167 136673
11713 136673 147119 156087 143860 149732 163756 168186 146322 149908 146944 162015 154304 148328 149845
11700 149845 160470 167611 178763 169248 151124 128593 117186 123943 120083 130579 156307 170956
11688 170956 187420 171964 159589 149107 145997 139259 123933 119252 108678 103642 102925 108988 119988
$$ packed form
11776E92315l5873k0244J7588k6476m1269P402N90l4231m032k6328n821j2130
11764D11491j6569r061k1670k9234O135j667q726j8231Q581K216J2308J7473n46
11751C52500r931l291k337j9118l662n614k9414k8950K302k3639O981K321J4914
11738B53062k3K0581K5522j6755l0796j3461j5471N484J4188j2420k5836o212
11726A97863L072k0093P928K7661Q849p622j0293j7184j7581j9731R794o496j9494
11713A36673J0446Q968j2227N872J4024M430k1864L586k964J5071p711n976J517
11700A49845J0625P141J1152r515j8124k2531j1407O757l860J0496K5728J4649
11688A70956J6464j5456j2375j0482l110o738j5326m681j0574n036p17O063J1000
$$ plain form
11675 119988 129071 141134 140758 137312 130688 120091 119297 110156 107436 122611 143321 142695 141259 134194
11661 134194 109804 109272 122681 106840 100938 118381 122665 138802 127214 133599 133857 104702 93019
11648 93019 70058 50868 40013 42276 56320 84106 84148 86608 99680 98741 92966 61501 49033
11635 49033 80204 109258 93821 91569 108948 119509 101457 88376 104319 120427 143029 149124
11623 149124 160536 167572 185645 177382 152479 155845 159901 164692 190324 200777 208418 198679 194061
11610 194061 193121 202551 226528 233566 228441 244006 225080 213867 216289 220769 194285 189210 193127
11597 193127 180437 170557 171865 187981 221023 246802 231986 232015 246903 259276 261118 251549 238951
11584 238951 239510 239659 242488 255208 252263 251953 249738 237845 229538 225066 233861 267891 267728 250590
$$ packed form
11675A19988R083J2063l76l446o624j0597p94r141k720J5175K0710o26j436p065
11661A34194k4390n32J3409j5841n902J7443M284J6137j1588O385K58k9155j1683
11648I3019k2961j9190j0855K263J4044K7786M2K460J3072r39n775l1465j2468
11635D9033L1171K9054j5437k252J7379J0561j8052j3081J5943J6108K2602O095
11623A49124J1412P036J8073q263k4903L366M056M791K5632J0453P641r739m618
11610A94061r40R430K3977P038n125J5565j8926j1213K422M480k6484n075L917
11597A93127j2690r880J308J6116L3042K5779j4816K9J4888J2373J842r569j2598
11584B38951N59J49K829J2720k945l10k215j1893q307m472Q795L4030j63j7138
$$ plain form
11570 250590 207937 199200 223091 243319 231606 222500 211400 199104 179936 157858 134955 157509
11558 157509 171452 175188 171774 159544 138962 143361 173426 187879 197773 193358 186240 197137 200289
11545 200289 185739 168478 162406 167655 183915 189100 180300 170454 148567 149766 154097 115390 103336
11532 103336 94236 83110 88392 104515 90922 69977 70377 82963 85849 81490 67083 73435 85765
11519 85765 97136 103079 82043 79962 86785 67462 65678 80033 75044 76613 57059 53149 60389
11506 60389 72227 83509 74748 80915 90455 89208 71810 71904 75479 69487 77938 61564 60015 69150
11492 69150 66440 89459 99551 90216 92589 109847 111542 93350 79907 105628 107654 90819 88479
11479 88479 82434 81562 85802 93910 105159 119164 118599 108080 118585 131615 150552 116249 98778
$$ packed form
11570B50590m2653q737K3891K0228j1713r106j1100j2296j9168k2078k2903K2554
11558A57509J3943L736l414j2230k0582M399L0065J4453R894m415p118J0897L152
11545B00289j4550j7261o072N249J6260N185q800r846k1887J199M331l8707j2054
11532A03336r100j1126N282J6123j3593k0945M00J2586K886m359j4407O352J2330
11519H5765J1371N943k1036k081O823j9323j784J4355m989J569j9554l910P240
11506F0389J1838J1282q761O167R540j247j7398R4L575n992Q451j6374j549R135
11492F9150k710K3019J0092r335K373J7258J695j8192j3443K5721K026j6835k340
11479H8479o045q72M240Q108J1249J4005n65j0519J0505J3030J8937l4303j7471
$$ plain form
11466 98778 83398 111877 124587 130438 143096 147212 121733 110591 124262 128682 137797 175143
11454 175143 189374 212526 224055 257282 267214 312192 346273 371922 402162 439620 472769 528353
11442 528353 587896 674122 762634 862831 938817 1029242 1119499 1219257 1306087 1363881 1410453
11431 1410453 1453308 1478922 1487572 1488270 1437751 1388489 1339831 1268857 1225904 1179338 1132884 1107844
11419 1107844 1111545 1100177 1102667 1131000 1170422 1207705 1239713 1274293 1292992 1342135 1408118 1471807
11407 1471807 1519863 1580408 1623606 1648026 1703429 1779682 1835111 1876525 1895064 1927447 1947083
11396 1947083 1958046 1973412 1944811 1906514 1862559 1825741 1775881 1698015 1655820 1600521 1545184
11385 1545184 1477735 1421254 1350837 1305555 1273931 1235196 1215410 1177082 1155251 1155594 1161374 1195552
$$ packed form
11466I8778j5380K8479J2710N851J2658M116k5479j1142J3671M420R115L7346
11454A75143J4231K3152J1529L3227R932M4978L4081K5649L0240L7458L3149N5584
11442E28353N9543Q6226Q8512J00197P5986R0425R0257R9758Q6830N7794M6572
11431A410453M2855K5614Q650O98n0519m9262m8658p0974m2953m6566m6454k5040
11419A107844L701j1368K490K8333L9422L7283L2008L4580J8699M9143O5983O3689
11407A471807M8056O0545M3198K4420N5403P6253N5429M1414J8539L2383J9636
11396A947083J0963J5366k8601l8297m3955l6818m9860p7866m2195n5299n5337
11385A545184o7449n6481p0417m5282l1624l8735j9786l8328k1831L43N780L4178
$$ plain form
11373 1195552 1232203 1248876 1285593 1306835 1319546 1343956 1350673 1346854 1348998 1353954 1330981 1323234
11361 1323234 1296329 1245034 1181987 1108028 1020633 946361 884077 807342 728737 652152 592191
11350 592191 553691 507533 478435 424315 402382 398517 378641 347912 333203 313043 275697 265781
11338 265781 263967 245463 229740 212310 208971 219360 214676 194251 190040 197208 215405 206953 172406
11325 172406 139320 131695 127190 129871 97425 87805 121604 127233 118862 121735 133419 106733 86861
11312 86861 85718 72503 64500 77905 101559 87693 95636 80492 65680 50178 56502 70619
11300 70619 81069 93948 98690 100732 95390 74983 52344 57783 35227 24449 37028 38554 42811
11287 42811 47815 41488 23982 12621 9405 20352 45382 47942 49118 68551 84097 71060 69316
$$ packed form
11373A195552L6651J6673L6717K1242J2711K4410O717l819K144M956k2973p747
11361A323234k6905n1295o3047p3959q7395p4272o2284p6735p8605p6585n9961
11350E92191l8500m6158k9098n4120k1933l865j9876l0729j4709k0160l7346r916
11338B65781j814j8504j5723j7430l339J0389m684k0425m211P168J8197q452l4547
11325A72406l3086p625m505K681l2446r620L3799N629q371K873J1684k6686j9872
11312H6861j143j3215q003J3405K3654j3866P943j5144j4812j5502O324J4117
11300G0619J0450J2879M742K042n342k0407k2639N439k2556j0778J2579J526M257
11287D2811N004o327j7506j1361l216J0947K5030K560J176J9433J5546j3037j744
$$ plain form
11274 69316 45705 13447 23662 29517 40895 42488 24921 18302 14119 16217 7531 15881 21315
11261 21315 48513 57891 53011 61012 54343 40967 24972 13808 17572 46151 34865 -26275 -27126
11248 -27126 -7378 13785 18459 8644 22813 33742 27016 21702 41500 43401 37160 28048 20646
11235 20646 24756 35350 40370 34048 20021 18575 51585 56721 61693 54220 77215 75294 40600
11222 40600 48427 60480 21458 13354 19089 38876 50308 61721 75704 80789 71170 64393 57503
11209 57503 48979 59716 87856 96480 114450 129992 145801 152617 148502 166546 147118 155228 170216
11196 170216 179061 196514 185187 222212 254392 269411 299725 297876 334725 365374 385732 390705
11184 390705 414102 443468 462109 482518 483428 461598 444683 430267 393263 371208 351558 326228
$$ packed form
11274F9316k3611l2258J0215N855J1378J593j7567o619m183K098q686Q350N434
11261B1315K7198R378m880Q001o669j3376j5995j1164L764K8579j1286o1140q51
11248b7126J9748K1163M674r815J4169J0929o726n314J9798J901o241r112p402
11235B0646M110J0594N020o322j4027j446L3010N136M972p473K2995j921l4694
11222D0600P827J2053l9022q104N735J9787J1432J1413J3983N085r619o777o890
11209E7503q524J0737K8140Q624J7970J5542J5809O816m115J8044j9428Q110J4988
11196A70216Q845J7453j1327L7025L2180J5019L0314j849L6849L0649K0358M973
11184C90705K3397K9366J8641K0409R10k1830j6915j4416l7004k2055j9650k5330
$$ plain form
11172 326228 292565 270883 252374 240215 219100 222334 178512 134714 115163 111027 123023 128827
11160 128827 138479 146057 145700 121140 99413 61794 50668 59748 61492 76773 79642 58796 64989
11147 64989 88633 69836 54354 55468 53544 42662 54151 28734 -2052 4557 32880 49972
11135 49972 52302 45330 19483 14533 10910 24079 22963 23064 27778 45489 28177 38054 56600
11122 56600 58101 41467 21993 12288 1399 -8026 -14324 -26506 -33720 -6934 45939 52531 39235
11109 39235 7986 -5869 2416 2218 3768 -4841 11338 7383 5215 2358 13817 -833 17733
11096 17733 21861 10717 16698 38571 60314 56086 66549 65169 57721 44676 50477 39316 15242
11083 15242 23591 36995 52822 53346 40851 10116 -4491 6144 19827 -4068 -26810 10332
$$ packed form
11172C26228l3663k1682j8509j2159k1115L234m3822m3798j9551m136J1996N804
11160A28827R652P578l57k4560k1727l7619j1126R080J744J5281K869k0846O193
11147F4989K3644j8797j5482J114j924j0882J1489k5417l0786O609K8323J7092
11135D9972K330o972k5847m950l623J3169j116J01M714J7711j7312R877J8546
11122E6600J501j6634j9474r705j0889r425o298j2182p214K6786N2873O592j3296
11109C9235l1249j3855Q285j98J550q609J6179l955k168k857J1459j4650J8566
11096A7733M128j1144N981K1873K1743m228J0463j380p448j3045N801j1161k4074
11083A5242Q349J3404J5827N24j2495l0735j4607J0635J3683k3895k2742L7142
$$ plain form
11071 10332 19438 8464 6358 3323 -9832 -6043 24035 66739 66202 39009 31083 24240 17759
11058 17759 10234 4035 19511 10475 17718 28146 42605 71727 104685 94500 50838 34636
11046 34636 35844 52571 62214 54184 34644 47146 72285 60919 52978 86468 95274 64956 58749
11033 58749 62724 83878 80006 98643 105594 102590 117140 104871 93526 115920 108126 107259 101282
11020 101282 109025 121661 118613 97152 81309 69883 78825 72318 64559 87906 99509 94941 93296
11007 93296 103367 127787 113362 90391 59555 48820 54923 63889 66787 76934 82946 79188 75348
10994 75348 52663 38490 34164 23325 19530 29812 43894 33365 30675 34313 10684 26490
10982 26490 39415 22786 16476 37979 38101 33300 21692 16844 16090 10799 266 -896 3810 1422
$$ packed form
11071A0332R106j0974k106l035j3155L789L0078M2704n37k7193p926o843o481
11058A7759p525o199J5476r036P243J0428J4459K9122L2958j0185m3662j6202
11046C4636J208J6727R643q030j9540J2502K5139j1366p941L3490Q806l0318o207
11033E8749L975K1154l872J8637O951l004J4550j2269j1345K2394p794q67n977
11020A01282P743J2636l048k1461j5843j1426Q942o507p759K3347J1603m568j645
11007I3296J0071K4420j4425k2971l0836j0735O103Q966K898J0147O012l758l840
10994G5348k2685j4173m326j0839l795J0282J4082j0529k690L638k3629J5806
10982B6490J2925j6629o310K1503J22m801j1608m848p54n291j0533j162M706k388
$$ plain form
10968 1422 -4745 33195 46504 11091 7232 7510 23510 48350 59061 42118 28534 21945 21389
10955 21389 11218 40915 52309 48057 41025 26609 -7156 462 10682 4154 -3849 4912 4821
10942 4821 14986 15923 23702 13327 26421 53478 41911 15821 15852 14560 5212 7681 8135 25020
10928 25020 33508 30685 6718 3364 -1164 11997 39670 44765 10369 3865 22153 18601 14030
10915 14030 23042 19014 14844 4241 2395 8844 4105 -22371 -15971 -831 12987 128 379
10902 379 5950 11700 20901 1653 -19333 -40790 -27168 -38797 -49122 -39277 -34267 -40785 -32632
10889 -32632 -7794 -2616 -10876 309 -2799 -6527 -11136 7458 14501 761 -15078 -12232 -9534
10876 -9534 3112 149 -5697 18452 822 18695 8751 -14078 -19426 16210 41494 26617 17589
$$ packed form
10968A422o167L7940J3309l5413l859K78J6000K4840J0711j6943j3584o589n56
10955B1389j0171K9697J1394m252p032j4416l3765P618J0220o528q003Q761r1
10942D821J0165R37P779j0375J3094K7057j1567k6090L1j292r348K469M54J6885
10928B5020Q488k823k3967l354m528J3161K7673N095l4396o504J8288l552m571
10915A4030R012m028m170j0603j846O449m739k6476O400J5140J3818j2859K51
10902C79N571N750R201j9248k0986k1457J3622j1629j0325R845N010o518Q153
10889c2632K4838N178q260J1185l108l728m609J8594P043j3740j5839K846K698
10876i534J2646k963n846K4149j7630J7873r944k2829n348L5636K5284j4877r028
$$ plain form
10863 17589 30120 24150 12069 19959 19789 17883 15917 9056 16005 30215 60005 64919 43325
10850 43325 35762 32263 47408 45231 30442 37874 22450 8504 -13287 2572 23674 26267 24231
10837 24231 29894 25555 11770 -1213 19306 16459 4463 10477 21370 24923 41050 41923 33293
10824 33293 36692 38553 9889 6684 28982 13710 -14901 -40881 -41783 -19005 5315 13850 7411
10811 7411 16321 22167 17858 -1983 -6797 9993 21303 11076 -892 3133 -2896 16124 1364
10798 1364 -4431 5529 19733 28891 42059 48607 40156 25122 18647 13474 23612 31498 3627
10785 3627 7364 15772 13273 2810 -3076 24558 47796 66787 57728 54913 42930 33501 28641
10772 28641 5186 6511 33101 16348 28003 22181 22069 20709 30022 28454 36206 42930 41672 21621
$$ packed form
10863A7589J2531n970j2081P890j70j906j966o861O949J4210K9790M914k1594
10850D3325p563l499J5145k177j4789P432j5424j3946k1791J5859K1102K593k036
10837B4231N663m339j3785j2983K0519k847j1996O014J0893L553J6127Q73q630
10824C3293L399J861k8664l205K2298j5272k8611k5980r02K2778K4320Q535o439
10811G411Q910N846m309j9841m814J6790J1310j0227j1968M025o029J9020j4760
10798A364n795R960J4204R158J3168O548q451j5034o475n173J0138P886k7871
10785C627L737Q408k499j0463n886K7634K3238J8991r059k815j1983r429m860
10772B8641k3455J325K6590j6753J1655n822j12j360R313j568P752O724j258k0051
$$ plain form
10758 21621 22086 37808 30720 22865 24985 42809 49897 30225 8462 -25242 2399 48541 73731
10745 73731 84766 87998 54439 42862 44398 45482 57831 76197 81864 115733 124096 110170 98592
10732 98592 96722 104610 103401 95131 75482 73308 77546 88364 111820 114811 112960 101155 127933
10719 127933 143800 140090 127690 135259 142757 148231 133251 125476 113267 115187 124426 150693 169097
10706 169097 151848 144868 149233 150857 154089 157514 129439 111980 120421 155521 168536 140297 132594
10693 132594 150660 161253 169619 160851 149279 153894 154260 150270 138567 143020 169514 193103 209839
10680 209839 194054 201772 213367 222654 251366 257590 289468 313837 355958 376750 380466 412650
10668 412650 437731 466440 523700 594743 729941 966603 1363460 2046610 2854431 3221263
$$ packed form
10758B1621M65J5722p088p855K120J7824P088j9672k1763l3704K7641M6142K5190
10745G3731J1035L232l3559j1577J536J084J2349J8366N667L3869Q363j3926j1578
10732I8592j870P888j209q270j9649k174M238J0818K3456K991j851j1805K6778
10719A27933J5867l710j2400P569P498N474j4980p775j2209J920R239K6267J8404
10706A69097j7249o980M365J624L232L425k8075j7459Q441L5100J3015k8239p703
10693A32594J8066J0593Q366q768j1572M615L66l990j1703M453K6494K3589J6736
10680B09839j5785P718J1595R287K8712O224L1878K4369M2121K0792L716L2184
10668D12650K5081K8709N7260P1043J35198K36662L96857O83150Q07821L66832
$$ plain form
10658 3221263 3176172 3106772 3068909 3057104 3174734 3524067 4079683 4141888 3176827 2240364
10648 2240364 1669650 1317833 1101376 964409 908563 876965 833187 835896 840248 847940 846883
10637 846883 839887 875639 932637 984247 1027779 1087164 1174163 1298225 1425096 1586197 1814327
10626 1814327 2106273 2499596 2987553 3603387 4318636 5034293 5633980 6179637 6652725
10617 6652725 7129102 7664244 8315095 9083174 9955525 10850157 11791534 12780471 13665530
10608 13665530 14291168 14684472 15048389 15522807 16167038 17056724 18145855 19216270 20025640
10599 20025640 20664513 21280325 21731514 21882268 21811463 21722112 21756658 22034396 22560804 23192316
10589 23192316 23481699 23115462 22287904 21371639 20458967 19574384 18729224 17992350 17471425
$$ packed form
10658C221263m5091o9400l7863j1805J17630L49333N55616O2205r65061r36463
10648B240364n70714l51817k16457j36967n5846l1598m3778K709M352P692j057
10637H46883o996L5752N6998N1610M3532N9385Q6999J24062J26871J61101K28130
10626A814327K91946L93323M87957O15834P15249P15657N99687N45657M73088
10617F652725M76377N35142O50851P68079Q72351Q94632R41377R88937Q85059
10608A3665530O25638L93304L63917M74418O44231Q89686J089131J070415Q09370
10599B0025640O38873O15812M51189J50754p0805q9351L4546K77738N26408O31512
10589B3192316K89383l66237q27558r16265r12672q84583q45160p36874n20925
$$ plain form
10580 17471425 17206597 17124904 17049241 16711387 15861364 14693536 13514215 12473981 11581741
10571 11581741 10813334 10176695 9654495 9233145 8875815 8480851 7956706 7230693 6370976
10562 6370976 5563928 4872331 4323548 3894606 3573731 3286457 3076048 2898665 2735339
10553 2735339 2601715 2484576 2380003 2255209 2145074 2037624 1984031 1938061 1882928 1798131
10543 1798131 1708632 1627503 1577833 1523478 1469272 1413200 1373526 1346239 1292084 1259582 1215630
10532 1215630 1157279 1094535 1041253 1033537 1010239 960276 947933 946386 935555 931497 904787 859977
10520 859977 861464 832630 785120 759970 741459 701206 666391 686839 677930 676124 671188 646746
10508 646746 620841 578633 540785 513615 519325 532953 492330 462491 441566 419349 407220 381104
$$ packed form
10580A7471425k64828q1693p5663l37854q50023j167828j179321j040234q92240
10571A1581741p68407o36639n22200m21350l57330l94964n24145p26013q59717
10562F370976q07048o91597n48783m28942l20875k87274k10409j77383j63326
10553B735339j33624j17139j04573j24794j10135j07450n3593m5970n5133q4797
10543A798131q9499q1129m9670n4355n4206n6072l9674k7287n4155l2502m3952
10532A215630n8351o2744n3282p716k3298m9963j2343j547j0831m058k6710m4810
10520H59977J487k8834m7510k5150j8511m0253l4815K0448q909j806m936k4442
10508F46746k5905m2208l7848k7170N710J3628m0623k9839k0925k2217j2129k6116
$$ plain form
10496 381104 356969 358243 372588 370385 346343 352442 340205 317981 316900 304200 291158 278099
10484 278099 288846 279920 270864 276235 269088 251481 267190 270016 270728 268739 262912 247560 241149
10471 241149 231450 220686 211033 218201 205867 188565 178796 189297 191911 167421 166697 210938 202365
10458 202365 199111 212549 214313 192466 165724 161539 175123 193323 184064 162618 173273 169739
10446 169739 170136 159991 146859 159322 158634 153570 112026 104741 122871 136432 122646 112032 127599
10433 127599 141768 151355 149823 158932 173184 163724 143185 146417 159755 176705 176967 189168 190007
10420 190007 162097 150896 152408 154281 197207 222214 233707 243350 261386 273769 301108 350564
10408 350564 368716 387315 417739 420075 447652 475518 500727 529112 548360 547755 574088 614656
$$ packed form
10496C81104k4135J274J4345k203k4042O099j2237k2224j081j2700j3042j3059
10484B78099J0747q926r056N371p147j7607J5709K826P12j989n827j5352o411
10471B41149r699j0764r653P168j2334j7302r769J0501K614k4490p24M4241q573
10458B02365l254J3438J764k1847k6742m185J3584J8200r259k1446J0655l534
10446A69739L97j0145j3132J2463o88n064m1544p285J8130J3561j3786j0614J5567
10433A27599J4169R587j532R109J4252r460k0539L232J3338J6950K62J2201Q39
10420A90007k7910j1201J512J873M2926K5007J1493R643J8036J2383K7339M9456
10408C50564J8152J8599L0424K336K7577K7866K5209K8385J9248o05K6333M0568
$$ plain form
10396 614656 643574 629398 633290 629243 622889 614983 601690 595722 604097 613264 629354 616689 607593
10383 607593 612307 627017 639111 652055 660601 677865 683794 705382 742140 765442 791633 811921
10371 811921 820283 842717 849202 847537 854946 858478 870882 876533 890011 877575 856768 848920 835112
10358 835112 817305 776744 758379 733921 706897 690341 670007 654340 632673 627469 624524 636503
10346 636503 625505 601647 587086 583277 575169 582295 599680 608967 618216 625813 589256 580161 618023
10333 618023 631648 602884 592817 600434 574113 539236 506294 489449 467242 464168 426995 379802
10321 379802 348562 345413 318576 302222 284827 271070 258442 279265 274702 254802 218846 193887
10309 193887 178384 167068 154805 139820 143619 133711 105592 82363 85258 96891 108426 104564
$$ packed form
10396F14656K8918j4176L892m047o354p906j3293n968Q375R167J6090j2665r096
10383F07593M714J4710J2094J2944Q546J7264N929K1588L6758K3302K6191K0288
10371H11921Q362K2434O485j665P409L532J2404N651J3478j2436k0807p848j3808
10358H35112j7807m0561j8365k4458k7024j6556k0334j5667k1667n204k945J1979
10346F36503j0998k3858j4561l809q108P126J7385R287R249P597l6557r095L7862
10333F18023J3625k8764j0067P617k6321l4877l2942j6845k2207l074l7173m7193
10321C79802l1240l149k6837j6354j7395j3757j2628K0823m563j9900l5956k4959
10309A93887j5503j1316j2263j4985L799r908k8119k3229K895J1633J1535l862
$$ plain form
10297 104564 103688 96236 71408 88239 99631 93976 101552 111739 135706 134639 144484 145584 160389
10284 160389 153589 126655 114820 101178 50508 35592 63171 81230 88704 82665 77395 95311
10272 95311 129845 151715 138513 128199 124381 114205 110228 123653 142433 146587 128960 106341
10260 106341 96077 73938 71748 51355 39186 52904 59709 45383 17083 8616 17747 39772
10248 39772 34329 32291 61263 60551 48965 39695 43716 40521 28096 22526 18668 13529 23808 34987
10234 34987 31198 19613 -24468 -19677 -9703 -18832 -10914 13204 33647 43058 53875 66666 59549
10221 59549 47114 40378 45488 31574 2940 -1044 -1263 19291 33257 50294 33206 26611 28389
10208 28389 19723 7399 8081 23097 26653 22270 21234 38969 60959 51042 52374 51377 55137 75165
$$ packed form
10297A04564q76p452k4828J6831J1392n655P576J0187K3967j067R845J100J4805
10284A60389o800k6934j1835j3642n0670j4916K7579J8059P474o039n270J7916
10272I5311L4534K1870j3202j0314l818j0176l977J3425J8780M154j7627k2619
10260A06341j0264k2139k190k0393j2169J3718O805j4326k8300q467R131K2025
10248C9772n443k038K8972p12j1586r270M021l195j2425n570l858n139J0279J1179
10234C4987l789j1585m4081M791R974r129P918K4118K0443R411J0817J2791p117
10221E9549j2435o736N110j3914k8634l984k19K0554J3966J7037j7088o595J778
10208B8389q666j2324O82J5016L556m383j036J7735K1990r917J332r97L760K0028
$$ plain form
10194 75165 61271 22390 1063 21018 13554 -1828 8897 37371 34646 19216 12010 -6486
10182 -6486 -11230 -588 19048 10936 -8184 -9128 -4471 -1964 32609 59498 49125 66547 63766
10169 63766 94557 112220 102331 105627 83785 75938 90432 108948 133706 129242 128822 111794 118864
10156 118864 124703 134369 137204 144431 149291 157293 169013 163794 132466 130256 133989 115701 102338
10143 102338 103917 97363 97833 102195 128621 118411 106475 97578 76664 35083 19342 29855 37537
10130 37537 66482 61398 42174 32229 22697 26282 16100 31737 51252 46346 25520 5668 1501
10117 1501 -1315 6800 23267 27767 40886 55471 55969 36443 44130 43133 25795 32129 35377 32371
10103 32371 31463 13405 957 13998 33038 18755 21763 9906 -9268 -11926 4786 19720
$$ packed form
10194G5165j3894l8881k1327J9955p464j5382J0725K8474k725j5430p206j8496
10182f486m744J0642J9636q112j9120r44M657K507L4573K6889j0373J7422k781
10169F3766L0791J7663r889L296k1842p847J4494J8516K4758m464m20j7028P070
10156A18864N839R666K835P227M860Q002J1720n219l1328k210L733j8288j3363
10143A02338J579o554M70M362K6426j0210j1936q897k0914m1581j5741J0513P682
10130C7537K8945n084j9224r945r532L585j0182J5637J9515m906k0826j9852m167
10117A501k816Q115J6467M500J3119J4585M98j9526P687r97j7338O334L248l006
10103C2371r08j8058j2448J3041J9040j4283L008j1857j9174k658J6712J4934
$$ plain form
10091 19720 16775 39560 37081 48280 56469 38996 27144 10091 13167 25890 -1237 -23448
10079 -23448 -28904 -15012 4439 32446 34580 17523 4594 -10447 -15211 -21174 -38225 -37747 -30618
10066 -30618 -4888 11087 7542 -7730 -13398 -717 12706 27018 33361 8879 -5689 -6461 16484
10053 16484 4395 -16758 -8669 -11752 4938 28424 45772 15849 15447 4979 -13430 -14868 -17581
10040 -17581 -23546 -27737 2188 8025 -3637 -11339 -19590 -32612 -22298 -31221 -22528 -23415 -22707 -8078
10026 -8078 -1813 11209 13774 -1705 -13144 -14980 -11603 -18185 -23841 -34725 -14133 11153 33885
10013 33885 8747 7418 12173 -7786 -19954 -14650 3114 14118 24973 8078 -12903 -10932
10001 -10932 -9981 -20733 -6559 -719 6587 16650 -1289 -18298 -4765 22800 27176 13923 34968
$$ packed form
10091A9720k945K2785k479J1199Q189j7473j1852j7053L076J2723k7127k2211
10079b3448n456J3892J9451K8007K134j7057j2929j5041m764n963j7051M78P129
10066c0618K5730J5975l545j5272n668J2681J3423J4312O343k4482j4568p72K2945
10053A6484j2089k1153Q089l083J6690K3486J7348k9923m02j0468j8409j438k713
10040a7581n965m191K9925N837j1662p702q251j3022J0314q923Q693q87P08J4629
10026h078O265J3022K565j5479j1439j836L377o582n656j0884K0592K5286K2732
10013C3885k5138j329M755j9959j2168N304J7764J1004J0855j6895k0981J971
10001a0932R51j0752J4174N840P306J0063j7939j7009J3533K7565M376j3253K1045
$$ plain form
9988 34968 54009 48740 22113 9198 197 9727 1938 -3934 -25311 -9088 -2667 17474 17066
9975 17066 83 -2853 9267 -7203 -14766 -9203 4350 6710 1916 23354 51026 36227 3629
9962 3629 -3768 12371 29026 23157 15467 13271 1541 -5818 10345 -3602 15290 33218 45775
9949 45775 48015 58670 55117 34191 26779 30422 10686 20985 27316 8323 17173 47181 78529
9936 78529 75756 49002 28749 36150 21676 -827 8457 25093 42213 34029 19326 39056 46521
9923 46521 46773 44236 19692 -12715 -34717 -27433 -26728 -13586 3787 24351 42283 31914 24777
9910 24777 6084 15696 27220 28555 46276 49325 51936 41330 7419 5984 622 -8100 -22644
9897 -22644 -21602 10135 17809 21141 10519 -1184 5721 19646 13935 17921 2078 -23868 -36670
$$ packed form
9988C4968J9041n269k6627j2915r001R530p789n872k1377J6223O421K0141m08
9975A7066j6983k936J2120j6470p563N563J3553K360m794K1438K7672j4799l2598
9962C629p397J6139J6655n869p690k196j1730p359J6163j3947J8892J7928J2557
9949D5775K240J0655l553k0926p412L643j9736J0299O331j8993Q850L0008L1348
9936G8529k773k6754k0253P401j4474k2503R284J6636J7120q184j4703J9730P465
9923D6521K52k537k4544l2407k2002P284P05J3142J7373K0564J7932j0369p137
9910B4777j8693R612J1524J335J7721L049K611j0606l3911j435n362q722j4544
9897b2644J042L1737P674L332j0622j1703O905J3925n711L986j5843k5946j2802
$$ plain form
9884 -36670 -26072 -24986 -25244 -27122 -20646 -703 18520 25496 22746 20613 17828 35210 54765 47492
9870 47492 32467 10679 33767 53674 57524 55204 28207 44130 42112 33599 23139 27706 32496
9857 32496 20990 2591 13065 15471 -4859 -6285 9917 20420 33114 50272 37493 39052
9845 39052 44101 58987 57815 33859 27400 8886 11023 23133 37754 30253 33675 43254 32299
9832 32299 -13991 -49697 -23411 19078 29544 16639 37728 51668 28189 33467 35419 35661 32737
9819 32737 19978 3997 2982 806 -19392 -6440 13865 26345 18621 47456 39546 27347 52327
9806 52327 57397 69103 94719 118727 86522 76372 101887 130745 138052 137652 157308 185370 186237
9793 186237 187426 178742 176604 158942 119174 97871 94760 60620 41464 35328 51363 30317 28662
$$ packed form
9884c6670J0598J086k58j878O476J9943J9223O976k750k133k785J7382J9555p273
9870D7492j5025k1788K3088J9907L850k320k6997J5923k018q513j0460M567M790
9857C2496j1506j8399J0474K406k0330j426J6202J0503J2694J7158j2779J559
9845C9052N049J4886j172k3956o459j8514K137J2110J4621p501L422R579j0955
9832C2299m6290l5706K6286M2489J0466j2905K1089J3940k3479N278J952K42k924
9819C2737j2759j5981j015k176k0198J2952K0305J2480p724K8835p910j2199K4980
9806E2327N070J1706K5616K4008l2205j0150K5515K8858P307m00J9656K8062Q67
9793A86237J189q684k138j7662l9768k1303l111l4140j9156o136J6035k1046j655
$$ plain form
9780 28662 31361 31924 43645 67296 40555 41602 47306 46113 56583 70485 48029 42774 42670 53339
9766 53339 52576 18652 -4985 -9630 -2019 -8011 -9613 -1032 3970 12608 26254 24428 38802 49952
9752 49952 59985 32720 12628 12652 35020 41158 33133 9676 6058 10517 -3155 -16162 1160
9739 1160 2507 -6407 -18881 -4270 9752 20630 6364 -8447 3106 9011 18933 17562 16997
9726 16997 10676 17058 17102 21448 17906 16679 14166 -2838 2896 2680 13565 9329 -1449 1942 19726
9711 19726 24417 32293 10738 -13196 8713 10440 -15940 -1915 15120 23545 31203 49344 36606
9698 36606 19011 4863 2698 175 -15384 -39405 -20490 6712 -1123 -9430 483 4668 -12970
9685 -12970 -15768 550 11043 11513 -8683 -16393 -8157 -4159 4414 24062 19645 20392 10749 9632
$$ packed form
9780B8662K699N63J1721K3651k6741J047N704j193J0470J3902k2456n255j04J0669
9766E3339p63l3924k3637m645P611n992j602Q581N002Q638J3646j826J4374J1150
9752D9952J0033k7265k0092K4K2368O138q025k3457l618M459j3672j3007J7322
9739A160J347q914j2474J4611J4022J0878j4266j4811J1553N905R922j371n65
9726A6997o321O382M4M346l542j227k513j7004N734k16J0885m236j0778L391J7784
9711A9726M691P876k1555k3934K1909J727k6380J4025J7035Q425P658J8141j2738
9698C6606j7595j4148k165k523j5559k4021J8915K7202p835q307R913M185j7638
9685a2970k798J6318J0493M70k0196p710Q236L998Q573J9648m417P47r643j117
$$ plain form
9671 9632 8792 14533 19203 36831 34130 26665 25476 49092 57364 34889 35037 61468 85144 98347
9657 98347 99427 112838 122524 110774 99713 95318 97734 111029 127102 127821 93792 54791 43917
9644 43917 61259 56379 43820 30883 32034 26756 9878 -12853 -21831 -12932 8624 34456 41851
9631 41851 38623 46495 30001 15575 10118 11601 15203 18608 20970 16582 9885 23034 40043 28802
9617 28802 20054 24456 34818 39340 51574 29365 -12413 -37077 -10028 1059 -12675 8003
9605 8003 30155 46410 49309 40975 22170 28094 10783 15239 19695 10831 40738 55855 61264
9592 61264 52075 39606 33555 50592 48060 31641 10469 -2993 3067 22696 36645 32447 15310
9579 15310 16481 -9932 -28619 -33355 -21817 14306 1177 -4844 6668 16925 -2964 -12535 15101
$$ packed form
9671I632q40N741M670J7628k701p465j189K3616Q272k2475J48K6431K3676J3203
9657I8347J080J3411R686j1750j1061m395K416J3295J6073P19l4029l9001j0874
9644D3917J7342m880j2559j2937J151n278j6878k2731q978Q899K1556K5832P395
9631D1851l228P872j6494j4426n457J483L602L405K362m388o697J3149J7009j1241
9617B8802q748M402J0362M522J2234k2209m1778k4664K7049J1087j3734K0678
9605H003K2152J6255K899q334j8805N924j7311M456M456q864K9907J5117N409
9592F1264r189j2469o051J7037k532j6419k1172j3462O060J9629J3949m198j7137
9579A5310J171k6413j8687m736J1538L6123j3129o021J1512J0257j9889r571K7636
$$ plain form
9566 15101 34193 46863 30435 -343 -3548 11509 1437 12415 40194 48213 36700 25057
9554 25057 22226 29594 45489 39617 34966 18607 1109 4663 24753 32605 36422 18609 20843
9541 20843 10283 32421 54884 43534 18806 -3863 -13882 12597 15541 12434 16315 37956
9529 37956 36401 45351 65509 61167 82180 79636 63676 48628 50777 46536 32480 19419 28333
9516 28333 36878 41433 33806 23773 38415 58875 40958 24164 -3459 -4496 20010 42521 19975
9503 19975 18219 19104 18647 23414 18960 34198 48956 40071 16179 -20601 -28192 -23727 -228 29457
9489 29457 46337 70171 55161 29209 1333 3788 -2965 -10104 -19743 6879 34726 27635 -1392
9476 -1392 15594 24786 12217 4594 12349 10602 38274 65289 61455 57799 46668 20199 11615
$$ packed form
9566A5101J9092J2670j6428l0778l205J5057j0072J0978K7779Q019j1513j1643
9554B5057k831P368J5895n872m651j6359j7498L554K0090P852L817j7813K234
9541B0843j0560K2138K2463j1350k4728k2669j0019K6479K944l107L881K1641
9529C7956j555Q950K0158m342K1013k544j5960j5048K149m241j4056j3061Q914
9516B8333Q545M555p627j0033J4642K0460j7917j6794k7623j037K4506K2511k2546
9503A9975j756Q85m57M767m454J5238J4758q885k3892l6780p591M465K3499K9685
9489B9457J6880K3834j5010k5952k7876K455o753p139r639K6622K7847p091k9027
9476a392J6986R192j2569p623P755j747K7672K7015l834l656j1131k6469q584
$$ plain form
9463 11615 23561 41018 37631 45653 50371 56602 39173 40894 50581 66736 44133 55309 61216
9450 61216 71168 63824 50218 71658 78043 70872 76664 44357 28331 21686 15876 4710 13084
9437 13084 27500 44844 32659 30431 31090 30247 3883 12768 37345 61727 52174 55946 71752
9424 71752 59405 13760 -3476 4663 18480 38076 47392 60174 58833 51541 29588 22813 7236
9411 7236 15021 18425 28901 33638 35813 38358 45727 42817 23904 26373 22546 46889 53153 26375
9397 26375 45885 35859 43275 62380 70899 54493 33514 36532 64352 67576 53940 62118 75495
9384 75495 93688 82384 68624 36903 39073 52152 66412 61006 56807 44203 52734 53720 40203
9371 40203 48977 65141 50829 33522 43844 32766 49341 58478 53625 42253 38019 34876 30950
$$ packed form
9463A1615J1946J7457l387Q022M718O231j7429J721R687J6155k2603J1176N907
9450F1216R952p344j3606K1440O385p171N792l2307j6026o645n810j1166Q374
9437A3084J4416J7344j2185k228O59q43k6364Q885K4577K4382r553L772J5806
9424G1752j2347m5645j7236Q139J3817J9596R316J2782j341p292k1953o775j5577
9411G236P785L404J0476M737K175K545P369k910j8913K469l827K4343O264k6778
9397B6375J9510j0026P416J9105Q519j6406k0979L018K7820L224j3636Q178J3377
9384G5495J8193j1304j3760l1721K170J3079J4260n406m199j2604Q531R86j3517
9371D0203Q774J6164j4312j7307J0322j1078J6575R137m853j1372m234l143l926
$$ plain form
9358 30950 36870 53953 38143 32380 51623 59741 44478 55213 67619 77071 82257 90050 64107
9345 64107 55235 51758 60166 42240 24568 41193 49734 37616 26757 44401 60475 39568 31789
9332 31789 34912 37310 34145 -944 -17140 -5529 4104 17946 9009 805 29071 58320 58566
9319 58566 58008 65242 36918 56201 71838 70058 72495 63124 62867 78160 75947 73263 85396 100205
9305 100205 94103 113690 115789 99923 117356 121383 105156 130464 142934 179863 219108 229480
9293 229480 251460 292203 337357 380402 432954 511339 598879 668896 743995 853478 985692
9282 985692 1085464 1181324 1284522 1383590 1438659 1482401 1527100 1521991 1486479 1439594 1390465 1319474
9270 1319474 1212024 1112526 994795 885964 803987 748899 689062 624896 553008 507041 474053
$$ packed form
9358C0950N920J7083j5810n763J9243Q118j5263J0735J2406R452N186P793k5943
9345F4107q872l477Q408j7926j7672J6625Q541j2118j0859J7644J6074k0907p779
9332C1789L123K398l165l5089j6196J1611R633J3842q937q204K8266K9249K46
9319E8566n58P234k8324J9283J5637j780K437r371k57J5293k213k684J2133J4809
9305A00205o102J9587K099j5866J7433M027j6227K5308J2470L6929L9245J0372
9293B29480K1980M0743M5154M3045N2552P8385Q7540P0017P5099J09483J32214
9282I85692R9772R5860J03198R9068N5069M3742M4699n109l5512m6885m9129p0991
9270A319474j07450r9498j17731j08831q1977n5088n9837o4166p1888m5967l2988
$$ plain form
9259 474053 434591 423906 429147 418169 417895 388547 367725 338271 317079 297097 246785 237842
9247 237842 269211 238834 218877 221704 211840 205488 214520 187489 179520 187100 178254 173043 172191 182520
9233 182520 176409 162006 140992 146190 151316 163495 148820 134086 146112 149209 135750 134082 141544
9220 141544 159247 179023 180642 172975 158808 143359 118293 106751 105413 103223 92629 66685
9208 66685 84061 134233 147230 141289 144466 151790 138106 120001 130126 120881 106662 110023 100481
9195 100481 91360 107240 94014 76263 72008 62576 42663 41254 64494 79725 86517 96486 95176
9182 95176 84349 88342 105409 82649 78225 76201 75213 104790 119006 105141 86013 56921 62181
9169 62181 82094 79219 92986 101522 96661 101124 115748 106581 138207 152910 134136 120019 132074
$$ packed form
9259D74053l9462j0685N241j0978k74k9348k0822k9454k1192j9982n0312q943
9247B37842L1369l0377j9957K827r864o352R032k7031p969P580q846n211q52J0329
9233A82520o111j4403k1014N198N126J2179j4675j4734J2026L097j3459j668P462
9220A41544J7703J9776J619p667j4167j5449k5066j1542j338k190j0594k5944
9208F6685J7376N0172J2997n941L177P324j3684j8105J0125r245j4219L361r542
9195A00481r121J5880j3226j7751m255r432j9913j409K3240J5231O792R969j310
9182I5176j0827L993J7067k2760m424k024r88K9577J4216j3865j9128k9092N260
9169F2181J9913k875J3767Q536m861M463J4624r167L1626J4703j8774j4117J2055
$$ plain form
9156 132074 131200 111666 99197 123123 148864 142671 141585 135315 144978 148239 152072 154578 153808 165328
9142 165328 192708 225123 260016 288871 321342 328154 328965 345554 356689 357322 343945 355646 364675
9129 364675 342684 359161 389763 418806 419561 371403 339873 328573 315308 328483 323890 283471
9117 283471 282615 293884 300362 288280 276654 245080 230402 230236 214837 200008 202245 199666 201151
9104 201151 202275 190725 172465 151846 163695 158479 148053 153458 153719 164839 157848 157978 163091
9091 163091 155846 141602 142603 150564 154751 155003 176308 154440 166652 187920 203119 193693 190553
9078 190553 198703 197897 189620 194009 199716 202064 222903 238963 246932 252752 258404 231096 222753 219783
9064 219783 211512 259697 306332 287222 252863 248648 250871 263177 293913 299248 274766 285255
$$ packed form
9156A32074q74j9534j2469K3926K5741o193j086o270R663L261L833K506p70J1520
9142A65328K7380L2415L4893K8855L2471O812Q11J6589J1135O33j3377J1701R029
9129C64675k1991J6477L0602K9043P55m8158l1530j1300j3265J3175m593m0419
9117B83471q56J1269O478j2082j1626l1574j4678j66j5399j4829K237k579J485
9104B01151J124j1550j8260k0619J1849n216j0426N405K61J1120o991J30N113
9091A63091p245j4244J001P961M187K52K1305k1868J2212K1268J5199r426l140
9078A90553Q150q06q277M389N707K348K0839J6060P969N820N652k7308q343k970
9064B19783q271M8185M6635j9110l4359m215K223J2306L0736N335k4482J0489
$$ plain form
9052 285255 293546 283867 274002 269465 255960 239169 247297 259607 275652 273416 259721 252319 230805
9039 230805 225660 226635 210115 224619 261489 295104 266788 269432 278342 284400 291688 299442 308843
9026 308843 321627 327427 336515 348126 353259 363888 364871 363095 357658 383879 435040 462547 515578
9013 515578 549790 602092 684292 762953 841160 919356 974606 1042638 1073368 1113217 1162774 1208896
9001 1208896 1269874 1281799 1281418 1264225 1214717 1167872 1130389 1091820 1075084 1079806 1063768 1059256
8989 1059256 1080356 1080164 1045794 1046111 1070015 1099783 1116891 1124330 1152205 1153907 1144056 1119273 1141703
8976 1141703 1157535 1165465 1177998 1181520 1181114 1193428 1215912 1224901 1264171 1270643 1264101 1275440 1297373
8963 1297373 1304875 1326961 1342623 1351802 1357715 1381993 1391826 1398941 1401116 1413248 1453175 1488580 1528309
$$ packed form
9052B85255Q291r679r865m537j3505j6791Q128J2310J6045k236j3695p402k1514
9039B30805n145R75j6520J4504L6870L3615k8316K644Q910O058P288P754R401
9026C08843J2784N800R088J1611N133J0629R83j776n437K6221N1161K7507N3031
9013E15578L4212N2302Q2200P8661P8207P8196N5250O8032L0730L9849M9557M6122
9001A208896O0978J1925l81j7193m9508m6845l7483l8569j6736M722j6038m512
8989A059256K1100j92l4370L17K3904K9768J7108P439K7875J702r851k4783K2430
8976A141703J5832P930J2533L522m06J2314K2484Q989L9270O472o542J1339K1933
8963A297373P502K2086J5662R179N913K4278R833P115K175J2132L9927L5405L9729
$$ plain form
8950 1528309 1584788 1627881 1669986 1700657 1736917 1802523 1868563 1905341 1947820 2022237 2097238
8939 2097238 2158457 2255758 2322484 2388355 2475764 2569906 2665755 2753117 2857322 3004806 3139390
8928 3139390 3270382 3415130 3566526 3750234 3948260 4125968 4302025 4496362 4731503 4961053
8918 4961053 5223399 5487624 5790026 6119518 6491348 6874017 7313043 7798851 8335911 8939941
8908 8939941 9625118 10423064 11298782 12275521 13342981 14530765 15848640 17387802 19169393
8899 19169393 21228355 23651497 26446093 29631302 33220762 37348636 42246030 48252016
8891 48252016 55836639 65664753 78648673 96253527 120278470 152452622 192236889
8884 192236889 233078242 264431514 282134452 290821415 296159259 301420323 308880650 319213804
$$ packed form
8950A528309N6479M3093M2105L0671L6260O5606O6040L6778M2479P4417P5001
8939B097238O1219R7301O6726O5871Q7409R4142R5849Q7362J04205J47484J34584
8928C139390J30992J44748J51396J83708J98026J77708J76057J94337K35141K29550
8918D961053K62346K64225L02402L29492L71830L82669M39026M85808N37060O04030
8908H939941O85177P97946Q75718R76739J067460J187784J317875J539162J781591
8899A9169393K058962K423142K794596L185209L589460M127874M897394O005986
8891D8252016P584623R828114J2983920J7604854K4024943L2174152L9784267
8884A92236889M0841353L1353272J7702938Q686963N337844N261064P460327J0333154
$$ plain form
8876 319213804 327699445 322154122 293272372 248736454 203949229 166998715 138836167
8869 138836167 117866531 102450069 91318368 83384844 77564653 72783899 68504941 64664329
8861 64664329 61304061 58391364 55949635 53968735 52078919 49603890 46190391 42411366
8853 42411366 38980396 36130504 33809320 31807993 30006664 28397564 26903434 25560834
8845 25560834 24363653 23312597 22364010 21541054 20803930 20148989 19565974 19056645 18636364
8836 18636364 18313959 18158591 18198460 18406200 18683213 18781749 18673135 18402747 18085984 17785329
8826 17785329 17549775 17367493 17159904 16703523 15833107 14683954 13488605 12427174 11558757
8817 11558757 10836351 10224217 9692987 9247235 8867436 8518431 8187339 7902116 7636974
$$ packed form
8876C19213804Q485641n545323k8881750m4535918m4787225l6950514k8162548
8869A38836167k0969636j5416462j1131701p933524n820191m780754m278958l840612
8861F4664329l360268k912697k441729j980900j889816k475029l413499l779025
8853D2411366l430970k849892k321184k001327j801329j609100j494130j342600
8845B5560834j197181j051056r48587q22956p37124o54941n83015n09329m20281
8836A8636364l22405j55368L9869K07740K77013R8536j08614k70388l16763l00655
8826A7785329k35554j82282k07589m56381q70416j149153j195349j061431q68417
8817A1558757p22406o12134n31230m45752l79799l49005l31092k85223k65142
$$ plain form
8808 7636974 7415893 7175935 6926844 6693015 6500184 6294765 6104215 5922872 5740440 5572778
8798 5572778 5407836 5240215 5092903 4981464 4821495 4627916 4484638 4370943 4270910 4150171
8788 4150171 4029028 3930706 3834391 3728537 3634325 3539464 3441058 3355789 3235098 3152733 3097335
8777 3097335 3019126 2928303 2834630 2759022 2700274 2653686 2593582 2513133 2457149 2408529 2347859
8766 2347859 2261819 2227929 2163399 2121274 2088546 2045809 1996801 1986644 1980023 1975979 1946197 1880558
8754 1880558 1828074 1810963 1772133 1705059 1668996 1640474 1581860 1509996 1464902 1402883 1383744
8743 1383744 1362451 1330655 1300665 1273620 1243063 1180262 1107518 1064833 1034516 1023353 1006940
8732 1006940 969307 941829 931888 945757 932146 911959 879732 871673 860958 844537 840244 851640
$$ packed form
8808G636974k21081k39958k49091k33829j92831k05419j90550j81343j82432j67662
8798E572778j64942j67621j47312j11439j59969j93579j43278j13695j00033j20739
8788D150171j21143r8322r6315j05854r4212r4861r8406q5269j20691q2365n5398
8777C097335p8209r0823r3673p5608n8748m6588o0104q0449n5984m8620o0670
8766B347859q6040l3890o4530m2125l2728m2737m9008j0157o621m044k9782o5639
8754A880558n2484j7111l8830o7074l6063k8522n8614p1864m5094o2019j9139
8743A383744k1293l1796k9990k7045l0557o2801p2744m2685l0317j1163j6413
8732A006940l7633k7478r941J3869j3611k0187l2227q059j0715j6421m293J1396
$$ plain form
8720 851640 832722 804865 760421 742989 757618 737802 720561 739427 732969 717485 698070 684385
8708 684385 685822 673508 665382 662982 643761 639135 636095 613925 597956 591110 570900 562100 557882
8695 557882 550572 542927 530311 528961 531764 519679 506247 481992 505404 532314 539394 518983 510533
8682 510533 504777 497912 506257 516074 495712 472585 467927 479198 484883 485817 450381 419240 427444
8669 427444 423018 437524 457894 477964 478566 458674 434617 427184 428129 424578 413794 425628 415001
8656 415001 403628 399865 400478 372931 360084 364970 379792 365089 347257 328603 326215 349325 328998
8643 328998 324345 321909 346956 347810 327144 294655 282121 309596 322774 331741 338403 355441 373477
8630 373477 364709 354500 360118 378035 338256 319742 327231 339734 336869 332084 302880 281394 291154
$$ packed form
8720H51640j8918k7857m4444j7432J4629j9816j7241J8866o458j5484j9415j3685
8708F84385J437j2314q126k400j9221m626l040k2170j5969o846k0210q800m218
8695E57882p310p645j2616j350K803j2085j3432k4255K3412K6910P080k0411q450
8682E10533n756o865Q345R817k0362k3127m658J1271N685R34l5436l1141Q204
8669D27444m426J4506K0370K0070O02j9892k4057p433R45l551j0784J1834j0627
8656D15001j1373l763O13k7547j2847M886J4822j4703j7832j8654k388K3110k0327
8643C28998m653k436K5047Q54k0666l2489j2534K7475J3178Q967O662J7038J8036
8630C73477q768j0209N618J7917l9779j8514P489J2503k865m785k9204k1486R760
$$ plain form
8617 291154 279340 260529 248247 253476 251769 243131 250114 243536 238200 228329 246032 275577 252305
8604 252305 210963 213044 214773 225618 235386 229567 225149 211613 195057 193283 192089 196588 213012
8591 213012 212677 217447 222575 210428 204975 211333 245844 262219 247610 228481 197626 184809 191201
8578 191201 210615 226053 242773 232729 216779 216080 233579 226396 223135 201181 216755 240810
8566 240810 213791 201287 202125 198191 208224 222519 223374 195481 184382 171540 155870 123511 106570
8553 106570 106955 112477 110840 112646 130043 117096 106764 109951 128306 163536 186023 186690 189037
8540 189037 190014 169208 144680 138629 145640 137021 100767 88798 100016 96853 109699 107218 115011
8527 115011 108471 111137 127721 148956 138781 117935 125613 142300 154590 162118 156621 166824 151799
$$ packed form
8617B91154j1814j8811j2282N229j707q638O983o578n336r871J7703K9545k3272
8604B52305m1342K081J729J0845R768n819m418j3536j6556j774j194M499J6424
8591B13012l35M770N128j2147n453O358L4511J6375j4609j9129l0855j2817O392
8578A91201J9414J5438J6720j0044j5950o99J7499p183l261k1954J5574K4055
8566B40810k7019j2504Q38l934J0033J4295Q55k7893j1099j2842j5670l2359j6941
8553A06570L85N522j637J806J7397j2947j0332L187J8355L5230K2487O67K347
8540A89037R77k0806k4528o051P011q619l6254j1969J1218l163J2846k481P793
8527A15011o540K666J6584K1235j0175k0846P678J6687J2290P528n497J0203j5025
$$ plain form
8514 151799 136154 130659 172471 201176 191813 177276 182463 201676 171208 167514 153639 158344 177070
8501 177070 194424 204259 204061 214230 215870 234799 239739 242168 271161 322997 336431 372969 447846
8488 447846 507780 570977 652898 745531 836445 938282 1033037 1098033 1172786 1270387 1378828
8477 1378828 1454151 1501501 1517723 1540278 1533410 1478506 1400161 1293857 1187097 1107304 1003551
8466 1003551 894258 822580 761704 680657 619581 564001 547348 524555 485415 452816 415714
8455 415714 399849 393256 372872 362664 353270 347033 328835 319382 323415 296296 275663 280095 253178
8442 253178 251791 256910 238476 212192 230587 254570 272607 258842 240725 227328 219730 212760
8430 212760 212252 183849 170061 189450 205752 195619 185241 194451 190479 167131 151696 124512
$$ packed form
8514A51799j5645n495M1812K8705r363j4537N187J9213l0468l694j3875M705J8726
8501A77070J7354R835j98J0169J640J8929M940K429K8993N1836J3434L6538P4877
8488D47846N9934O3197Q1921R2633R0914J01837R4755O4996P4753R7601J08441
8477A378828P5323M7350J6222K2555o868n4904p8345j06304j06760p9793j03753
8466A003551j09293p1678o0876q1047o1076n5580j6653k2793l9140l2599l7102
8455D15714j5865o593k0384j0208r394o237j8198r453M033k7119k0633M432k6917
8442B53178j387N119j8434k6284J8395K3983J8037j3765j8117j3397p598o970
8430B12760n08k8403j3788J9389J6302j0133j0378R210l972k3348j5435k7184
$$ plain form
8418 124512 125795 89070 71103 76817 83528 103039 99748 104888 100864 77837 69192 76270 87623
8405 87623 79700 75107 66901 50984 40501 47905 60375 57295 50897 41589 43080 58389 72176
8392 72176 59609 73734 77343 71569 38389 32763 36696 63358 97423 91172 70958 53645 60345
8379 60345 54360 39625 43573 44328 52251 71315 81637 67082 40161 11830 10596 41000 49601
8366 49601 59815 47651 32883 41317 54846 72662 93674 103548 106809 116670 110960 89760 77313
8353 77313 49807 45553 56257 66849 78067 83214 96922 113496 92811 94063 85406 66778 67374
8340 67374 83553 58318 58094 53917 6089 -2334 14456 14984 25350 27676 42805 47296 30498
8327 30498 30965 34295 46431 42900 30059 23914 33960 23192 21100 17758 3067 3721 3556 13093
$$ packed form
8418A24512J283l6725j7967N714O711J9511l291N140m024k3027q645P078J1353
8405H7623p923m593q206j5917j0483P404J2470l080o398r308J491J5309J3787
8392G2176j2567J4125L609n774l3180n626L933K6662L4065o251k0214j7313O700
8379F0345n985j4735L948P55P923J9064J0322j4555k6921k8331j234L0404Q601
8366D9601J0214j2164j4768Q434J3529J7816K1012R874L261R861n710k1200j2447
8353G7313k7506m254J0704J0592J1218N147J3708J6574k0685J252q657j8628N96
8340F7374J6179k5235k24m177m7828q423J6790N28J0366K326J5129M491j6798
8327C0498M67L330J2136l531j2841o145J0046j0768k092l342j4691O54j65R537
$$ plain form
8313 13093 33357 32423 33409 20474 30861 43223 56428 54474 66879 61662 49044 41915 34385
8300 34385 13888 11262 12288 16931 20720 14586 33484 29579 13572 12295 14286 9960 18509 13095
8286 13095 6642 294 589 10568 15575 11932 30763 24055 2274 12456 25865 -2775 -8462 -8949
8272 -8949 -48 31288 26938 17764 25134 12573 15568 19662 41584 40416 30310 34905 44517 32746
8258 32746 43538 58608 68556 69149 41426 27840 24273 5648 4446 5689 525 4202 5383 6824
8244 6824 3093 1001 6720 14360 10175 20248 702 -3884 -25983 -41985 -39556 -13202 8471
8231 8471 3363 5808 12457 14757 40304 17024 13069 25514 18959 38022 32463 23174 35497 32456
8217 32456 41182 41697 30494 34908 7798 -14009 3468 11628 19145 48284 62522 61830 56379 50111
$$ packed form
8313A3093K0264r34R86j2935J0387J2362J3205j954J2405n217j2618p129p530
8300C4385k0497k626J026M643L789o134J8898l905j6007j277J991m326Q549n414
8286A3095o453o348K95R979N007l643J8831o708k1781J0182J3409k8640n687m87
8272h949Q901L1336m350r174P370j2561K995M094K1922j168j0106M595R612j1771
8258C2746J0792J5070R948N93k7723j3586l567j8625j202J243n164L677J181J441
8244F824l731k092N719P640m185J0073j9546m586k2099j6002K429K6354K1673
8231H471n108K445O649K300K5547k3280l955J2445o555J9063n559r289J2323l041
8217C2456Q726N15j1203M414k7110k1807J7477Q160P517K9139J4238o92n451o268
$$ plain form
8203 50111 38907 52082 51403 39271 38812 33505 59009 43159 35589 12208 -11251 -8828 -7939 -28099
8189 -28099 -15665 22660 27101 27963 27161 11529 1656 15407 22408 24294 29417 29561 33244 27455
8175 27455 30653 20526 26465 32945 34020 27328 32292 51690 54439 53297 54395 42973 34222 34522
8161 34522 32297 44035 42898 32559 27501 34475 56319 50913 55730 44044 20134 -2472 -22639
8148 -22639 -28618 -30086 -28638 -12345 24110 45144 24036 8453 5835 12590 6654 14415 27197
8135 27197 10201 -6253 -4096 -32371 -48594 -47333 -47986 -52531 -45550 -16432 22969 18018 12246
8122 12246 -4318 -2843 25895 41263 41807 18449 6910 4784 30241 45772 25110 9699 15195
8109 15195 23666 11404 3503 7795 12714 -4640 18858 31151 30756 16173 15079 33827 49321
$$ packed form
8203E0111j1204J3175o79j2132m59n307K5504j5850p570k3381k3459K423Q89k0160
8189b8099J2434L8325M441Q62q02j5632r873J3751P001J886N123J44L683n789
8175B7455L198j0127N939O480J075o692M964J9398K749j142J098j1422q751L00
8161C4522k225J1738j137j0339n058O974K1844n406M817j1686k3910k2606k0167
8148b2639n979j468J448J6293L6455K1034k1108j5583k618O755n936P761J2782
8135B7197j6996j6454K157k8275j6223J261o53m545O981K9118L9401m951n772
8122A2246j6564J475K8738J5368N44k3358j1539k126K5457J5531k0662j5411N496
8109A5195Q471j2262p901M292M919j7354K3498J2293l95j4583j094J8748J5494
$$ plain form
8096 49321 43775 51908 60765 47117 33648 41732 37949 45424 36036 8285 -14296 3637 21540
8083 21540 9892 23155 40807 48528 56681 53799 36162 3282 -1441 35254 45728 17980 26512
8070 26512 35226 5782 -7182 2148 13709 31017 37090 41601 61613 43315 21970 7283 2806
8057 2806 -10146 -24437 -27439 -1076 3880 15047 10562 35615 56636 47601 39321 17944 19930
8044 19930 8615 22294 19060 3076 -13290 -8117 8888 36300 26223 21314 33570 36527 36658
8031 36658 51933 48389 31241 16725 5305 2496 27846 63046 50965 39677 38080 48984
8019 48984 44904 30823 20694 18619 32249 34218 19937 30299 33406 39453 37557 32813 15040
8006 15040 15144 30078 40000 24118 22596 44088 42126 29425 27063 42529 54476 45060 47335
$$ packed form
8096D9321n546Q133Q857j3648j3469Q084l783P475r388k7751k2581J7933J7903
8083B1540j1648J3263J7652P721Q153k882j7637l2880m723L6695J0474k7748Q532
8070B6512Q714k9444j2964R330J1561J7308O073M511K0012j8298k1345j4687m477
8057B806j2952j4291l002K6363M956J1167m485K5053K1021r035q280k1377J986
8044A9930j1315J3679l234j5984j6366N173J7005K7412j0077m909J2256K957J31
8031C6658J5275l544j7148j4516j1420k809K5350L5200j2081j1288j597J0904
8019D8984m080j4081j0129k075J3630J969j4281J0362L107O047j896m744j7773
8006A5040J04J4934R922j5882j522K1492j962j2701k362J5466J1947r416K275
$$ plain form
7993 47335 51667 47939 46789 55845 41670 17308 18103 4978 12926 21020 13851 -9692 -1131 37305
7979 37305 52350 52382 49622 53392 50155 17666 7307 31296 19942 8626 1794 14798 16812
7966 16812 46272 51113 50733 51829 48044 41516 42345 38978 40786 48321 54229 41272 34561 21672
7952 21672 9737 14681 19009 31119 21408 193 21115 54082 48718 47166 46082 51598 57794
7939 57794 47892 12755 5968 16887 22336 16031 24345 21719 -8820 -10560 -2522 14321 45178
7926 45178 65500 45619 23139 23370 29373 26255 20968 11422 6641 12078 28979 26390 26570 8622
7912 8622 5705 18515 8629 -5703 9590 4873 17524 31371 40959 46962 71343 56925 32024
7899 32024 17351 11653 21821 -10555 -37748 -9008 25005 34914 46467 42566 36154 33016 27620
$$ packed form
7993D7335M332l728j150R056j4175k4362P95j3125P948Q094p169k3543Q561L8436
7979C7305J5045L2k760L770l237l2489j0359K3989j1354j1316o832J3004K014
7966A6812K9460M841l80J096l785o528Q29l367J808P535N908j2957o711j2889
7952B1672j1935M944M328J2110r711k1215K0922L2967n364j552j084N516O196
7939E7794r902l5137o787J0919N449o305Q314k626l0539j740Q038J6843L0857
7926D5178K0322j9881k2480K31O003l118n287r546m781N437J6901k589J80j7948
7912H622k917J2810r886j4332J5293m717J2651J3847R588O003K4381j4418k4901
7899C2024j4673n698J0168l2376k7193K8740L4013R909J1553l901o412l138n396
$$ plain form
7886 27620 38359 44516 28331 17441 33991 53279 35943 26421 29181 24638 21088 37715 39714
7873 39714 30050 -5227 -18438 -22966 -18389 -30284 -37386 -42775 -31263 -8906 -2178 -10517 -10633 -4329
7859 -4329 4454 25355 13609 9587 21254 18239 9518 18056 -5660 -4807 -4982 -19184 -26394 -29725
7845 -29725 -3501 16389 -4979 -32841 -32009 -22501 372 19201 19311 -43 -6368 -1011 -1595 -15477
7831 -15477 -57542 -32560 16473 47433 38473 32142 29230 27595 35747 30756 7401 4728 12357
7818 12357 6643 3160 4649 2653 -3276 6540 36151 61666 36503 8922 -10301 -38253 -16899
7805 -16899 -714 7205 -2822 -6147 13127 16431 -7035 -9779 8750 19402 21857 22174 25748
7792 25748 27612 31491 50118 39060 14009 -15968 -1616 24193 22168 22909 23148 17942 -2650
$$ packed form
7886B7620J0739O157j6185j0890J6550J9288j7336r522K760m543l550J6627J999
7873C9714r664l5277j3211m528M577j1895p102n389J1512K2357O728q339j16O304
7859d329Q783K0901j1746m022J1667l015q721Q538k3716Q53j75j4202p210l331
7845b9725K6224J9890k1368k7862Q32R508K2873J8829J10j9354o325N357n84j3882
7831a5477m2065K4982M9033L0960q960o331k912j635Q152m991k3355k673P629
7818A2357n714l483J489j996n929R816K9611K5515k5163k7581j9223k7952K1354
7805a6899J6185P919j0027l325J9274L304k3466k744J8529J0652K455L17L574
7792B5748J864L879J8627j1058k5051k9977J4352K5809k025P41K39n206k0592
$$ plain form
7779 -2650 -24811 -17065 -5880 -31169 -53358 -44188 -24525 -26353 -8315 16559 12756 11128 3297
7766 3297 -7771 -8601 -9613 -25425 -32258 -16700 -20542 -23578 -17143 -15535 7750 57311 51303 19321
7752 19321 46273 50724 21876 41562 45200 19111 7673 12583 10485 4401 8856 7312 3283
7739 3283 -1586 -20629 -12171 -13427 -6366 1059 292 10879 18285 28701 34387 23594 19012 21483
7725 21483 32585 13320 5151 14637 25865 36493 15722 25582 55625 44648 22836 -7907
7713 -7907 -648 6324 -3039 -6953 -31161 -33091 -26838 -20507 -19989 -6642 -12614 -35937 -26672 1903
7699 1903 8488 -6466 -5736 2679 3757 18037 10765 3054 -7590 -15864 -2629 1617 372 -5969
7685 -5969 -3662 30817 22817 10839 8632 -4712 -21108 -28560 -17401 2205 5929 11225 17545
$$ packed form
7779b650k2161P746J1185k5289k2189R170J9663j828J8038K4874l803j628p831
7766C297j1068q30j012j5812o833J5558l842l036O435J608K3285M9561o008l1982
7752A9321K6952M451k8848J9686L638k6089j1438M910k098o084M455j544m029
7739C283m869j9043Q458j256P061P425p67J0587P406J0416N686j0793m582K471
7725B1483J1102j9265q169R486J1228J0628k0771R860L0043j0977k1812l0743
7713g907P259O972r363l914k4208j930O253O331N18J3347n972k3323R265K8575
7699A903O585j4954P30Q415J078J4280p272p711j0644q274J3235M246j245o341
7685e969K307L4479q000j1978k207j3344j6396p452J1159J9606L724N296O320
$$ plain form
7672 17545 21935 298 -943 4489 11798 1369 -9143 -18552 -25652 -22850 -21853 874 9445 -3788
7658 -3788 -4397 -8661 -28569 -34612 -9494 -3409 -2336 20173 36960 31911 18899 -33257 -44580
7645 -44580 -20240 3050 24325 24941 3703 -2195 1441 -4964 -15101 947 12300 10519 10908
7632 10908 23323 16411 8613 6758 20014 35553 44177 39509 16751 -10788 -26846 -33464 -42561
7619 -42561 -42464 -42522 -52287 -49618 -26867 -6793 -11910 10023 11247 28512 28286 37320 26591 21215 6733
7604 6733 -3197 -3552 -14173 -8830 -10192 -21827 -39651 -24376 -8843 6099 22174 23104 8415
7591 8415 7926 9688 23366 32378 36890 15329 -4223 14179 13489 5372 3264 9701 -825 -17959
7577 -17959 -29823 -17342 10776 22286 13433 23106 26723 29046 32288 6517 -30599 -14140 20466
$$ packed form
7672A7545M390k1637j241N432P309j0429j0512r409p100K802R97K2727Q571j3233
7658c788o09m264j9908o043K5118O085J073K2509J6787n049j3012n2156j1323
7645d4580K4340K3290K1275O16k1238n898L636o405j0137J6048J1353j781L89
7632A0908J2415o912p798j855J3256J5539Q624m668k2758k7539j6058o618r097
7619d2561R7n8r765K669K2751K0074n117K1933J224J7265k26R034j0729n376j4482
7604F733r930l55j0621N343j362j1635j7824J5275J5533J4942J6075R30j4689
7591H415m89J762J3678R012M512k1561j9552J8402o90q117k108O437j0526j7134
7577a7959j1864J2481K8118J1510q853R673L617K323L242k5771l7116J6459L4606
$$ plain form
7564 20466 32716 14526 6429 -1918 -11432 10931 30624 639 -21476 -18417 -22749 -32120 -26324
7551 -26324 -40986 -16220 19087 33619 24476 46665 49058 26119 -6559 -34455 -28391 -28890 -12845
7538 -12845 -18110 -36224 -39728 -11059 -6463 7133 -16894 -12876 -7780 -8393 -27321 -26603 -11101 -8566
7524 -8566 -5505 -3019 -8581 -21626 -316 -7513 -14244 -22632 -18719 -6696 -11284 -18574 -16276 10140
7510 10140 -10831 -17107 -3304 -12692 -15673 22342 46309 20899 -10607 -12331 -1596 7412 23376
7497 23376 8703 811 -8382 -2548 14995 4402 -5704 14401 186 -17806 -24303 -13389 8
7484 8 3872 -5357 12093 16928 10010 3120 13179 18096 33158 26929 17288 13025 7583 18366 32756
7469 32756 20093 16972 27543 33157 37398 18406 5820 6872 13489 13748 12606 4218 -9384 10271
$$ packed form
7564B0466J2250j8190q097q347r514K2363J9693k9985k2115L059m332r371N796
7551b6324j4662K4766L5307J4532r143K2189K393k2939l2678k7896O064m99J6045
7538a2845n265j8114l504K8669M596J3596k4027M018N096o13j8928P18J5502K535
7524h566L061K486n562j3045K1310p197o731q388L913J2023m588p290K298K6416
7510A0140k0971o276J3803r388k981L8015K3967k5410l1506j724J0735R008J5964
7497B3376j4673p892r193N834J7543j0593j0106K0105j4215j7992o497J0914J3397
7484HL864r229J7450M835o918o890J0059M917J5062o229r641m263n442J0783J4390
7469C2756j2663l121J0571N614M241j8992j2586J052O617K59j142q388j3602J9655
$$ plain form
7455 10271 32732 13134 -8997 -17862 -18965 -128 26288 11299 11634 32598 9502 -7373 178
7442 178 21252 13892 465 7844 16785 12005 -403 -21168 -18954 -11996 -28684 -29275 -29831 -31313
7428 -31313 -8926 -23317 -35254 -5777 9374 15178 16796 6148 5164 -13110 -3433 28820 48324
7415 48324 47098 30391 18508 27200 15975 -10460 -28663 -12113 2126 5592 8784 -21572 -25797
7402 -25797 -12352 -10689 -5111 13317 20670 -5905 -14392 -6314 -12567 -6735 -5628 -25369 -21783 -14767
7388 -14767 -6420 -8182 2616 -543 -13483 -19826 -21386 -15790 6333 38658 41332 40294 50964
7375 50964 34674 3741 -19853 -24303 13786 28623 8482 791 -7623 -16856 4696 7786 -360
7362 -360 -25839 -24137 -21357 -29898 -24541 -20951 -26725 -2290 18000 8689 -20715 -32468 11016 28775
$$ packed form
7455A0271K2461j9598k2131q865j103J8837K6416j4989L35K0964k3096j6875P551
7442A78K1074p360j3427P379Q941m780j2408k0765K214O958j6688n91n56j482
7428c1313K2387j4391j1937K9477J5151N804J618j0648r84j8274R677L2253J9504
7415D8324j226j6707j1883Q692j1225k6435j8203J6550J4239L466L192l0356m225
7402b5797J3445J663N578J8428P353k6575q487Q078o253N832J107j9741L586P016
7388a4767Q347j762J0798l159j2940o343j560N596K2123L2325K674j038J0670
7375E0964j6290l0933k3594m450L8089J4837k0141p691q414r233K1552L090q146
7362c60k5479J702K780q541N357L590n774K4435K0290r311k9404j1753M3484J7759
$$ plain form
7348 28775 24986 17380 10074 -671 -8462 -10806 17389 14697 -3111 -29636 -23193 32319 54794
7335 54794 38943 20524 -8009 -30884 -56926 -42467 -46696 -33217 -21006 -11755 -15741 -18468 -706
7322 -706 3012 -2848 -8234 9644 17773 8626 10631 2958 7281 8060 4407 19194 34107 29958 11409
7307 11409 -17788 -27156 -24138 -21681 -15518 577 5875 -3504 -21824 -24619 -16508 -34540 -46055
7294 -46055 -26079 -2226 4019 -22337 -17157 -25489 -34151 -22830 -24385 -22284 -32380 -40392 -29590
7281 -29590 -21765 -15248 -9050 -6372 -33297 -9600 -9917 -26305 -33248 -15697 -4694 -13821 -615
7268 -615 13527 6667 4071 -51 19468 28497 31429 38906 39007 44532 31035 434 -21534 1683
7254 1683 4162 15786 11513 -7842 -472 13686 24538 25791 4465 -2609 19257 26236 12596
$$ packed form
7348B8775l789p606p306j0745p791k344K8195k692j7808k6525O443N5512K2475
7335E4794j5851j8419k8533k2875k6042J4459m229J3479J2211R251l986k727J7762
7322g06L718n860n386J7878Q129r147K005p673M323P79l653J4787J4913m149j8549
7307A1409k9197r368L018K457O163J6095N298r379j8320k795Q111j8032j1515
7294d6055J9976K3853O245k6356N180q332q662J1321j555K101j0096q012J0802
7281b9590P825O517O198K678k6925K3697l17j6388o943J7551J1003r127J3206
7268f15J4142o860k596m122J9519R029K932P477J01N525j3497l0601k1968K3217
7254A683K479J1624m273j9355P370J4158J0852J253k1326p074K1866O979j3640
$$ plain form
7241 12596 21129 21171 -1141 2842 5493 -3481 1136 -5580 -11551 4250 4954 1439 -9723 -2727 -2157
7226 -2157 31685 41242 32870 35576 23696 4527 477 25110 30800 29284 12249 15329 18194 -8188
7212 -8188 3081 17940 27568 28270 21919 17228 -3690 -30706 -31869 -25886 -36256 -53490 -41532
7199 -41532 -4294 724 -32132 -25144 -29546 -29271 -50390 -37831 -20864 -20172 -9880 15403 36604
7186 36604 18478 -8128 -49240 -58144 -28135 -15008 -4069 4335 6519 11248 9686 -12890 -42320
7173 -42320 -49936 -19169 23622 45934 34413 26487 -378 -15984 -907 -10449 -14937 -12935 -4108
7160 -4108 23629 23843 -8172 -19226 2263 20926 32527 15711 10431 10712 9133 11796 8173 14160
7146 14160 6110 5428 -2678 -13297 -21770 11929 27571 30703 19305 4501 -22249 -34040 -37782
$$ packed form
7241A2596Q533M2k2312L983K651q974M617o716n971J5801P04l515j1162O996N70
7226b157L3842R557q372K706j1880j9169m050K4633N690j516j7035L080K865k6382
7212h188J1269J4859R628P02o351m691k0918k7016j163N983j0370j7234J1958
7199d1532L7238N018l2856O988m402K75k1119J2559J6967O92J0292K5283K1201
7186C6604j8126k6606m1112q904L0009J3127J0939Q404K184M729j562k2576k9430
7173d2320p616L0767M2791K2312j1521p926k6865j5606J5077r542m488K002Q827
7160d108K7737K14l2015j1054K1489J8663J1601j6816n280K81j579K663l623N987
7146A4160q050o82q106j0619q473L3699J5642L132j1398j4804k6750j1791l742
$$ plain form
7133 -37782 -60080 -52796 -33567 -18414 12656 39975 18573 2972 -23365 -25815 6363 15645
7121 15645 2373 24298 26155 21584 12112 -1046 -1825 8394 24518 21759 6423 7189 -19968
7108 -19968 -28443 -16368 -11881 6698 -5018 -9328 -26092 -14419 676 886 -11191 -12462 7741
7095 7741 11584 12589 13610 9548 17607 -1424 -22836 -26262 -17415 -11571 -32707 -44894 -46020 -34728
7081 -34728 1886 18478 3842 7350 7561 27850 25090 17728 14244 19064 24431 26829 23577 17093
7067 17093 4479 -2133 -11083 13521 22043 164 -2408 -10160 -18678 -28121 -24442 7633 10661 -9115
7053 -9115 -16812 -18345 -15827 -17280 -12899 -11369 -25987 -23456 -25694 -43636 -45985 -28110 -14157 -11873
7039 -11873 -4350 -11308 -26660 -42701 -46148 -44431 -57190 -45321 -28896 -11025 -25152 -13390 24105
$$ packed form
7133c7782k2298P284J9229J5153L1070K7319k1402j5601k6337k450L2178R282
7121A5645j3272K1925J857m571r472j3158p79J0219J6124k759j5336P66k7157
7108a9968q475J2075M487J8579j1716m310j6764J1673J5095K10j2077j271K0203
7095G741L843J005J021m062Q059j9031k1412l426Q847N844k1136j2187j126J1292
7081c4728L6614J6592j4636L508K11K0289k760p362l484M820N367K398l252o484
7067A7093j2614o612q950K4604Q522k1879k572p752q518r443L679L2075L028j9776
7053i115p697j533K518j453M381J530j4618K531k238j7942k349J7875J3953K284
7039a1873P523o958j5352j6041l447J717j2759J1869J6425J7871j4127J1762L7495
$$ plain form
7026 24105 26943 7177 16289 -1654 7417 -5467 -16891 -16992 11515 26693 750 7889 12947
7013 12947 945 -16990 -13053 791 110 -17748 -30237 -48530 -47435 -23880 8267 29945 5220
7000 5220 -16933 -13874 -16746 -32016 -7184 11217 22937 -4139 -21864 -14911 -12896 -11139 -13781
6987 -13781 -8243 -15622 -5036 1483 17065 24299 24258 22070 21041 9163 4522 3127 17577 15610
6973 15610 16398 16506 -9487 -14474 -13382 -21549 -26831 -18688 -4631 14074 30374 25209 16138 7274
6959 7274 2332 -2908 -21148 -25853 -6033 6735 -6876 15856 15244 -8064 -4717 -9861 12598
6946 12598 28476 21568 13360 6456 -3584 -7894 -8893 -8711 13618 -10786 -12848 21492 29871 24841
6932 24841 16970 22318 23855 13816 7218 -3273 -31613 -28233 -8057 -11781 -21397 -19070 -13922 -24277
$$ packed form
7026B4105K838j9766R112j7943R071j2884j1424j01K8507J5178k5943P139N058
7013A2947j2002j7935L937J3844o81j7858j2489j8293J095K3555L2147K1678k4725
7000E220k2153L059k872j5270K4832J8401J1720k7076j7725O953K015J757k642
6987a3781N538p379J0586O519J5582P234m1k188j029j1878m641j395J4450j967
6973A5610P88J08k5993m987J092q167n282Q143J4057J8705J6300n165r071q864
6959G274m942n240j8240m705J9820J2768j3611K2732o12k3308L347n144K2459
6946A2598J5878o908q208o904j0040m310r99J82K2329k4404k062L4340Q379n030
6932B4841p871N348J537j0039o598j0491k8340L380K0176l724r616K327N148j0355
$$ plain form
6918 -24277 -19013 -6050 -19311 -2464 19276 16395 22734 19208 8567 -9120 -7515 -27972 -37557
6905 -37557 -10786 -1237 -16977 2143 17101 12727 20569 20072 13145 522 22866 21905 11391
6892 11391 6208 6187 3083 -14546 11217 8610 -16092 -11304 -1135 -12331 -35097 -53187 -11597
6879 -11597 11809 1513 12589 -4645 412 -8639 654 -4538 -25577 -14393 -4711 -6926 -10370
6866 -10370 -10207 -15766 -32054 -40068 -21371 -2080 -130 -2936 24500 52851 41293 28797 2697
6853 2697 -17699 -25607 -59226 -18917 30241 33958 33631 -647 -8970 6097 11503 99 20204
6840 20204 10546 14951 20590 12881 4606 14167 6081 10945 19639 39752 39279 24692 21976 14643
6826 14643 17839 47454 45456 32289 -8511 -3287 3464 -6718 -19242 -5661 272 528 -7198
$$ packed form
6918b4277N264J2963j3261J6847K1740k881O339l526j0641j7687J605k0457r585
6905c7557K6771R549j5740J9120J4958m374P842m97o927j2623K2344r61j0514
6892A1391n183k1l104j7629K5763k607k4702M788J0169j1196k2766j8090M1590
6879a1597K3406j0296J1076j7234N057r051R293n192k1039J1184R682k215l444
6866a0370J63n559j6288q014J8697J9291J950k806K7436K8351j1558j2496k6100
6853B697k0396p908l3619M0309M9158L717l27l4278q323J5067N406j1404K0105
6840B0204r658M405N639p709q275R561q086M864Q694K0113m73j4587k716p333
6826A4643L196K9615j998j3167m0800N224O751j0182j2524J3581N933K56p726
$$ plain form
6813 -7198 -11399 -7374 -5414 4339 5104 -14151 -34307 -22553 -6902 7966 18332 -1062 -34591
6800 -34591 -41340 -28955 -14065 2575 -5967 -6336 8910 790 -17931 -6293 -4768 -4676 12229 3794
6786 3794 21152 27204 26704 17903 22702 23952 31903 38739 4194 -2640 -629 4303 10083 -26706
6772 -26706 -54493 -35711 -32806 -4007 6721 4793 -3896 3349 -11508 -14102 -22478 -9318 -13711
6759 -13711 -16775 -4229 9370 -1606 -510 -18918 -15563 11412 -6552 -2370 -27653 -29762 -33752
6746 -33752 -35076 -21716 -13988 4958 10218 20151 12307 -10408 -41217 -65047 -47915 -36658 -13857
6733 -13857 -4442 1178 2782 21213 9974 -7585 -9629 -31157 -14165 -1797 74 18477 30348
6720 30348 9237 18994 16117 2676 -14032 564 5686 6985 -2039 -8108 -10391 -16198 -20575 28328
$$ packed form
6813g198m201M025J960R753P65j9255k0156J1754J5651J4868J0366j9394l3529
6800c4591o749J2385J4890J6640q542l69J5246q120j8721J1638J525R2J6905q435
6786C794J7358O052n00q801M799J250P951O836l4545o834K011M932N780l6789
6772b6706k7787J8782K905K8799J0728j928q689P245j4857k594q376J3160m393
6759a3711l064J2546J3599j0976J096j8408L355K6975j7964M182k5283k109l990
6746c3752j324J3360P728J8946N260R933p844k2715l0809k3830J7132J1257K2801
6733a3857R415N620J604J8431j1239j7559k044k1528J6992J2368J871J8403J1871
6720C0348k1111R757k877j3441j6708J4596N122J299r024o069k283n807m377M8903
$$ plain form
6706 28328 2062 -51510 -62350 -48234 -39858 -34596 -28328 -16184 -9911 -29718 -19664 -24009 -23994
6693 -23994 -15637 -776 24962 10504 2795 -12028 -24085 -24869 -17794 -12835 -13808 -6282 -14540 -35868
6679 -35868 -39966 -39969 -6284 1548 -10425 -21314 -15092 -1800 -8720 -23028 -15995 -17287 -13208 -1619
6665 -1619 10715 6006 -4813 -9665 -10927 -18582 -11486 13462 12275 7179 7469 -2862 -7617 5744
6651 5744 3486 -12547 -49 5512 13448 -9461 1297 35200 33097 8679 -14068 -24126 -6896
6638 -6896 6057 1029 -4839 -30132 -63241 -73487 -73114 -43968 -26069 -13495 -1340 -6813 -29328
6625 -29328 -32906 -28282 -21530 -6892 3110 26444 27030 14269 18988 4157 10763 8006 -1299 8448
6611 8448 17899 20728 -3084 10136 30293 25628 378 -17294 -11430 -735 -9281 -6707 -5372
$$ packed form
6706B8328k6266n3572j0840J4116Q376N262O268J2144O273j9807J0054m345J5
6693b3994Q357J4861K5738j4458p709j4823j2057p84P075M959r73P526q258k1328
6679c5868m098lL3685P832j1973j0889O222J3292o920j4308P033j292M079J1589
6665a619J2334m709j0819m852j262p655P096K4948j187n096K90j0331m755J3361
6651E744k258j6033J2498N561P936k2909J0758L3903k103k4418k2747j0058J7230
6638f896J2953n028n868k5293l3109j0246L73K9146J7899J2574J2155n473k2515
6625b9328l578M624O752J4638J0002K3334N86j2761M719j4831O606k757r305R747
6611H448R451K829k3812J3220K0157m665k5250j7672N864J0695q546K574J335
$$ plain form
6598 -5372 8064 8924 25671 37934 6348 -7964 -11446 -37976 -21977 -24637 -36608 -30781 -21866
6585 -21866 -9733 -29834 -37427 -36040 -23444 -23939 -20346 -20008 -14319 -10041 -16349 -21141 -30522 -6868
6571 -6868 -13551 -12740 -10371 128 -14349 -10178 -24103 -45767 -42913 -26288 -23850 -26350 -24168 -21591
6557 -21591 -14110 -21136 -18693 -14127 -12291 -7073 -12253 7328 37841 32381 23166 -1527 -18516 -15569
6543 -15569 -16969 -24185 -32858 -15825 -5424 -9156 -23831 -28923 -18057 -17909 -2682 12637 24924
6530 24924 18843 16688 16044 13582 3795 13010 16296 -10434 -17092 -4573 13721 23995 27868 14457
6516 14457 27311 28563 14091 876 -24296 -43502 -32964 -21765 -10945 -19146 -35745 -17202
6504 -17202 -762 -21169 -32855 -27424 -8681 -10270 -28083 -64968 -60612 -35296 -24603 -19339 -19050
$$ packed form
6598e372J3436Q60J6747J2263l1586j4312l482k6530J5999k660j1971N827Q915
6585b1866J2133k0101p593J387J2596m95L593L38N689M278o308m792r381K3654
6571f868o683Q11K369J0499j4477M171j3925k1664K854J6625K438k500K182K577
6557b1591P481p026K443M566J836N218n180J9581L0513n460r215k4693j6989K947
6543a5569j400p216q673J7033J0401l732j4675n092J0866J48J5227J5319J2287
6530B4924o081k155o44k462r787R215L286k6730o658J2519J8294J0274L873j3411
6516A4457J2854J252j4472j3215k5172j9206J0538J1199J0820q201j6599J8543
6504a7202J6440k0407j1686N431J8743j589j7813l6885M356K5316J0693N264K89
$$ plain form
6491 -19050 -8827 -20787 -19388 -25055 -23220 -13313 -5182 678 -25049 -48169 -37656 -15340 2469
6478 2469 917 -18503 -27297 -12264 8819 9202 3595 2566 -6543 -2095 -14421 -20947 -25313 -17145
6464 -17145 -26718 -45709 -52785 -45478 -28574 -29295 -21384 -9558 -12902 -25482 -23160 3337 -16498
6451 -16498 -37291 -36921 -51435 -49411 -40360 -11804 8752 14523 12183 18443 17133 -19800 -32300
6438 -32300 -18972 5681 6256 4389 -14151 -17671 -2403 4667 -22201 -26755 -19802 -809 8385
6425 8385 39013 36028 28003 24142 25034 19616 -6514 -21004 -12054 12700 8116 -3103 -10218 -3169
6411 -3169 16968 10821 15750 16620 506 -6039 3978 15274 3502 494 -3847 6890 626 -1210
6397 -1210 5613 -795 -13659 -36649 -55759 -53772 -40052 -47022 -59155 -60519 -46565 -9286 12008
$$ packed form
6491a9050J0223j1960J399n667J835R907Q131N860k5727k3120J0513K2316J7809
6478B469j552j9420q794J5033K1083L83n607j029r109M448j2326o526m366Q168
6464a7145r573j8991p076P307J6904p21P911J1826l344j2580K322K6497j9835
6451a6498k0793L70j4514K024R051K8556K0556N771k340O260j310l6933j2500
6438c2300J3328K4653N75j867j8540l520J5268P070k6868m554O953J8993R194
6425H385L0628k985q025l861Q92n418k6130j4490Q950K4754m584j1219p115P049
6411c169K0137o147M929Q70j6114o545J0017J1296j1772l008m341J0737o264j836
6397a210O823o408j2864k2990j9110J987J3720o970j2133j364J3954L7279K1294
$$ plain form
6384 12008 15398 -4690 -8492 -2635 -29073 -27030 -17066 -8452 -22972 -11739 3545 -6345 -1457
6371 -1457 -4574 6336 8289 -5528 -29852 -26810 -12155 -17166 -5155 14353 -10992 -24851 -11331
6358 -11331 24133 36851 12687 -11486 -2729 23821 37696 8607 -20200 -27980 -2342 14619
6346 14619 -12555 -15995 3569 -13520 -4483 -4514 -12346 -5103 -206 -26370 -37677 -43300 -50385 -37490
6332 -37490 -20501 -19428 -2018 -11081 -12847 -16919 -11458 -14653 -21084 4749 28541 41077 25199
6319 25199 15532 7583 21920 26014 1183 -7325 -3229 -2067 -14715 2445 10877 981 -9877
6306 -9877 -23812 -19739 -777 12729 7978 11901 9347 16450 17811 2848 8300 30799 54493
6293 54493 36823 19453 30236 12536 24311 23231 7251 -7114 7419 22301 35362 40000
$$ packed form
6384A2008L390k0088l802N857k6438K043R964Q614j4520J1233J5284r890M888
6371a457l117J0910J953j3817k4324L042J4655n011J2011J9508k5345j3859J3520
6358a1331L5464J2718k4164k4173Q757K6550J3875k9089k8807p780K5638J6961
6346A4619k7174l440J9564j7089R037l1p832P243M897k6164j1307n623p085J2895
6332c7490J6989J073J7410r063j766m072N461l195o431K5833K3792J2536j5878
6319B5199r667p949J4337M094k4831q508M096J162j2648J7160Q432r896j0858
6306i877j3935M073J8962J3506m751L923k554P103J361j4963N452K2499K3694
6293E4493j7670j7370J0783j7700J1775j080j5980j4365J4533J4882J3061M638
$$ plain form
6281 40000 22868 -3697 19133 41388 23082 -13434 -10172 -3751 -5523 650 21430 15565 5766
6268 5766 -1342 -5720 -16535 -5040 23156 9434 8688 20151 14139 5968 19658 11572 -2056
6255 -2056 12947 14298 10041 -9657 -39394 -19119 15090 15344 -16622 -22641 4859 3081 -14985
6242 -14985 -11819 30014 46424 46379 35235 4243 -14019 -11601 -24186 -32310 -25088 -13718 -11160
6229 -11160 -15679 -19555 -62311 -67432 -47317 -39888 -4370 1172 -11707 -39470 -37384 -31638 -37625
6216 -37625 -13417 2638 -14768 -13491 -19685 -29269 -48675 -53926 -32383 -16532 -19833 -17202 -43694
6203 -43694 -48980 -38783 -25667 -12064 3227 7552 13086 22094 8981 -10416 -3271 -14413 11628
6190 11628 32020 20226 13776 2212 1486 -5013 -19985 -23655 -33331 -26263 -36229 -27209 -19482 -13988
$$ packed form
6281D0000j7132k6565K2830K2255j8306l6516L262O421j772O173K0780n865r799
6268E766p108m378j0815J1495K8196j3722p46J1463o012q171J3690q086j3628
6255b056J5003J351m257j9698k9737K0275L4209K54l1966o019K7500j778j8066
6242a4985L166M1833J6410m5j1144l0992j8262K418j2585q124P222J1370K558
6229a1160m519l876m2756n121K0115P429L5518N542j2879k7763K086N746n987
6216c7625K4208J6055j7406J277o194r584j9406n251K1543J5851l301K631k6492
6203d3694n286J0197J3116J3603J5291M325N534R008j3113j9397P145j1142K6041
6190A1628K0392j1794o450j1564p26o499j4972l670r676P068r966R020P727N494
$$ plain form
6176 -13988 -14347 -26335 -35828 -10444 14229 25252 34559 34477 37696 28460 34140 32961 27071 19289
6162 19289 12163 -2604 -1480 13171 8012 14012 10477 7769 -11609 -5547 -11238 -12612 -2680 2811
6148 2811 -6105 -17267 -37006 -50189 -31124 -19010 -23354 -39251 -20408 10740 -6035 -3597 29177
6135 29177 21661 -3062 -4664 -2174 -2153 26302 31332 12996 10710 -3503 -13177 -42394 -30340 -32135
6121 -32135 -40740 -28803 -16076 -28110 -21023 1005 1832 -1928 -9987 -15268 633 5854 454 -3728
6107 -3728 947 -10990 -17838 -12971 9005 22228 31441 11492 -12879 -24073 -28198 -24184 -15371
6094 -15371 -26219 -13613 -15609 -8600 585 -15788 -40516 -19331 -8364 -14106 -11177 -1928 -20087
6081 -20087 -37405 -43294 -32008 -9502 6262 20113 22188 -3213 -32490 -27751 -22257 -25622 -44155
$$ packed form
6176a3988l59j1988r493K5384K4673J1023R307q2L219r236N680j179n890p782
6162A9289p126j4767J124J4651n159O000l535k708j9378O062n691j374R932N491
6148B811q916j1162j9739j3183J9065J2114m344j5897J8843L1148j6775K438L2774
6135B9177p516k4723j602K490K1K8455N030j8336k286j4213r674k9217J2054j795
6121c2135q605J1937J2727j2034P087K2028Q27l760q059n281J5901N221n400m182
6107c728M675j1937o848M867K1976J3223R213j9949k4371j1194m125M014Q813
6094a5371j0848J2606j996P009R185j6373k4728K1185J0967n742K929R249j8159
6081b0087j7318n889J1286K2506J5764J3851K075k5401k9277M739N494l365j8533
$$ plain form
6068 -44155 -36295 -29817 -24601 -323 24475 26284 -8967 -27753 -37198 -21104 1737 26826 16029
6055 16029 6479 -6457 -13845 -23741 -18204 -23837 -32751 -15729 -18322 -30476 -33837 -1977 32740
6042 32740 43653 29678 17841 41222 19780 -5528 18038 21487 21020 6937 3083 7455 -12133
6029 -12133 -12023 -40915 -37203 -30852 -25458 -8354 -3866 -18512 -16245 -11237 10479 17191 12086 -23407
6015 -23407 -40905 -21745 -1720 13739 7588 -14191 1390 17398 -21380 -33326 -35242 -29281
6003 -29281 -22733 -26310 -33530 -20655 7041 15393 -10357 -17958 -44813 -36247 -19969 -10514 7647
5990 7647 5732 -24559 -15276 -13742 -26242 -25560 -32741 -38682 -44943 -36532 -29661 -29188 -24272 -18676 50
5975 50 -10881 -57347 -40721 -16522 -31622 -28284 -17029 -21494 -30412 -31032 -19437 -21105 -24648 -4175
$$ packed form
6068d4155P860O478N216K4278K4798J809l5251j8786r445J6094K2841K5089j0797
6055A6029r550j2936p388r896N537n633q914J7022k593j2154l361L1860L4717
6042C2740J0913j3975j1837K3381k1442k5308K3566L449m67j4083l854M372j9588
6029a2133J10k8892L712O351N394J7104M488j4646K267N008K1716O712n105l5493
6015b3407j7498J9160K0025J5459o151k1779J5581J6008l8778j1946j916N961
6003b9281O548l577p220J2875K7696Q352k5750p601k6855Q566J6278R455J8161
5990G647j915l0291R283J534j2500O82p181n941o261Q411O871M73M916N596J8726
5975E0j0931m6466J6626K4199j5100L338J1255m465q918o20J1595j668l543K0473
$$ plain form
5961 -4175 24978 19396 8494 53 2999 17996 33963 9804 -13443 -6730 -19868 -5725 14514
5948 14514 18011 25759 19265 13162 -4313 -10716 11000 22666 37196 7458 -6388 -1001 -13308
5935 -13308 -4722 3871 7359 -14128 -21071 -16289 -9251 1779 -1572 -10603 -2837 -27598 -52088 -52836
5921 -52836 -46084 -22082 205 1623 -14115 -16012 -11076 -11381 -8000 -4044 888 -15946 -21658 -33984
5907 -33984 -23292 -11962 -25980 -24287 -9364 1415 4009 -11889 -6227 931 16921 17128 15216
5894 15216 24823 38216 26157 -100 -10430 11724 3155 642 14167 23229 24235 -6076 -29181
5881 -29181 -20181 -15914 -14995 -9555 -18369 -28986 -12219 6048 3369 24211 37811 34639 8426
5868 8426 21454 16278 30806 35695 40935 39911 35697 35841 23853 4275 5499 13357 7826 6423
$$ packed form
5961d175K9153n582j0902q441K946J4997J5967k4159k3247O713j3138J4143K0239
5948A4514L497P748o494o103j7475o403K1716J1666J4530k9738j3846N387j2307
5935a3308Q586Q593L488k1487o943M782P038J1030l351r031P766k4761k4490p48
5921e2836O752K4002K2287J418j5738j897M936l05L381L956M932j6834n712j2326
5907c3984J0692J1330j4018J693J4923J0779K594j5898N662P158J5990K07j912
5894A5216R607J3393j2059k6257j0330K2154q569k513J3525R062J006l0311k3105
5881b9181R000M267R19N440q814j0617J6767J8267k679K0842J3600l172k6213
5868H426J3028n176J4528M889N240j024m214J44j1988j9578J224P858n531j403
$$ plain form
5854 6423 23184 29570 17248 5154 1024 17865 15626 18399 9263 -2795 -4684 9542 15515
5841 15515 9203 19484 8662 -3529 -21076 -10277 -9109 -8248 6516 -3358 -2840 -1315 -1693 12292
5827 12292 19606 2525 -885 3433 -13071 5560 5288 22220 6165 -21415 -25286 -5697 25889
5814 25889 25416 6077 -5689 -10988 19204 26334 6043 4345 7651 9988 32992 49080 18640
5801 18640 4474 4864 1305 -18247 -6865 14016 29238 40818 15979 771 19512 32279
5789 32279 18872 13775 2102 -4950 16314 2735 10411 33394 32434 25345 13818 10098 15611
5776 15611 18511 18903 -7550 -6872 -16709 -14728 -19471 -17083 -12298 4927 2467 -6296 -20417 -25757
5762 -25757 -13539 -5960 -10935 -21105 -13851 -7583 -14774 -21483 -40688 -41727 -51284 -64573 -53535
$$ packed form
5854F423J6761O386j2322j2094m130J6841k239K773r136j2058j889J4226N973
5841A5515o312J0281j0822j2191j7547J0799J168Q61J4764r874N18J525l78J3985
5827A2292P314j7081l410M318j6504J8631k72J6932j6055k7580l871J9589L1586
5814B5889m73j9339j1766n299L0192P130k0291j698L306K337K3004J6088l0440
5801A8640j4166L90l559j9552J1382K0881J5222J1580k4839j5208J8741J2767
5789C2279j3407n097j1673p052K1264j3579P676K2983r60p089j1527l720N513
5776A5611K900L92k6453O78r837J981m743K388M785J7225k460q763j4121n340
5762b5757J2218P579m975j0170P254O268p191o709j9205j039r557j3289J1038
$$ plain form
5749 -53535 -28961 -15154 -8390 -28095 -19551 -1836 -9486 -18711 -30228 -28328 -22604 -24230 -33719
5736 -33719 -30851 -32455 -30777 -20674 -17693 -9614 -19968 758 7281 -3655 10472 22148 7981
5723 7981 9924 8989 -5181 -7368 -6393 8972 15926 -2332 -23108 -24187 -18465 -30056 -41898 -21450
5709 -21450 -22435 -22679 -16456 -18853 -25258 -13148 -9994 -13736 -24377 -36018 -37497 -6011 11460 -7477
5695 -7477 -16153 -16387 -26892 7139 36531 20491 32700 27276 37052 46429 44288 23672 -12389
5682 -12389 -45070 -41493 -25537 -21625 -35648 -23244 -13027 -10056 -17675 -9711 -19185 -24857 -15720
5669 -15720 4015 1796 -4281 -18387 -30891 -40357 -39239 -28505 -20133 -19854 -14886 -44828 -54651 -26787
5655 -26787 6239 -4523 -409 -3166 -584 -7429 -4697 -4409 -23021 -26742 -5674 6666 -3108 -2540
$$ packed form
5749e3535K4574J3807O764j9705Q544J7715p650r225j1517J900N724j626r489
5736c3719K868j604J678J0103K981Q079j0354K0726O523j0936J4127J1676j4167
5723G981J943r35j4170k187R75J5365O954j8258k0776j079N722j1591j1842K0448
5709b1450r85k44O223k397o405J2110L154l742j0641j1641j479L1486J7471j8937
5695g477q676k34j0505L4031K9392j6040J2209n424R776R377k141k0616l6061
5682a2389l2681L577J5956L912j4023J2404J0217K971p619P964r474n672R137
5669a5720J9735k219o077j4106j2504r466J118J0734Q372K79M968k9942r823K7864
5655b6787L3026j0762M114k757K582o845K732K88j8612l721K1068J2340r774N68
$$ plain form
5641 -2540 -1093 -8174 -31407 -27161 -43118 -57319 -29494 2039 -5422 -14475 -6219 -5206 8821
5628 8821 9553 1198 6446 -4726 -2365 7039 19859 18838 8476 3578 9248 4122 -3806 -13407
5614 -13407 -28479 -11230 1618 -11255 -28469 -39275 -6102 17439 3138 -4088 -1747 22902
5602 22902 11417 7797 16589 14216 32163 15778 4687 4959 -1727 -12625 -17782 -20170 -2305
5589 -2305 -7392 -23239 -12185 -12252 -16545 -15792 -9192 -24219 -32043 -21787 2986 -657 6337 12595
5575 12595 2854 -19884 -24367 -28824 -13384 -33218 -27927 -16318 -11389 -9016 -9624 -2524 13601 40158
5561 40158 41611 16863 15807 2928 -5703 7056 2893 8397 16160 13694 10703 15830 18559 -314
5547 -314 862 10100 509 -26099 -41465 -38708 -42948 -54800 -64478 -38828 -24520 -5482 4506 28845
$$ packed form
5641b540J447p081k3233M246j5957j4201K7825L1533p461r053Q256J013J4027
5628H821P32q355N248j1172K361R404J2820j021j0362m898N670n126p928r601
5614a3407j5072J7249J2848j2873j7214j0806L3173K3541j4301p226K341K4649
5602B2902j1485l620Q792k373J7947j6385j1091K72o686j0898n157k388J7865
5589b305n087j5847J1054o7m293P53O600j5027p824J0256K4773l643O994O258
5575A2595r741k2738m483m457J5440j9834N291J1609M929K373o08P100J6125K6557
5561D0158J453k4748j056j2879q631J2759m163N504P763k466k991N127K729j8873
5547c14J176R238r591k6608j5366K757m240j1852r678K5650J4308J9038R988K4339
$$ plain form
5533 28845 43196 34957 30522 22734 23461 10376 -6072 1290 -3960 -5883 -3190 -19369 -43808 -44874
5519 -44874 -20673 8670 18844 -4199 2839 -912 8683 22410 3558 17998 23810 -23206 -30686
5506 -30686 -39777 -43139 -16064 4627 5452 3457 5463 4251 21370 46642 61677 54353 59042 58235
5492 58235 52055 43537 8069 -2561 28832 31128 32866 11969 9251 -2577 -20499 -9317 -9724
5479 -9724 -4118 -34041 -31207 -4275 -4369 -20218 -31571 -236 -9694 -14561 -1481 5940 7398 3632
5465 3632 -3221 2651 10028 22816 14848 6236 10222 21418 25196 46381 37700 22344 10810 24884
5451 24884 23296 6884 10230 -5536 -16555 -15342 6252 19950 5241 -18573 11368 6060 -7772
5438 -7772 -1121 -25080 -42695 -37384 -47568 -37770 -38138 -32704 -22638 4652 4314 8496 22375 29308
$$ packed form
5533B8845J4351q239m435p788P27j3085j6448P362n250j923K693j6179k4439j066
5519d4874K4201K9343J0174k3043P038l751R595J3727j8852J4440N812m7016p480
5506c0686r091l362K7075K0691Q25j995K006j212J7119K5272J5035p324M689q07
5492E8235o180q518l5468j0630L1393K296J738k0897k718j1828j7922J1182m07
5479i724N606k9923K834K6932r4j5849j1353L1335r458m867J3080P421J458l766
5465C632o853N872P377J2788p968q612L986J1196L778K1185q681j5356j1534J4074
5451B4884j588j6412L346j5766j1019J213K1594J3698j4709k3814K9941n308j3832
5438g772O651k3959j7615N311j0184R798l68N434J0066K7290l38M182J3879O933
$$ plain form
5424 29308 31951 37616 48535 53007 54715 37921 26956 22441 27583 38445 18904 716 1381
5411 1381 -24162 -33556 -10053 924 35055 22562 10859 17726 23594 19797 21579 13511 10640
5398 10640 5675 8877 530 13635 23651 5114 -6911 -5722 -19909 -31426 -16592 14296 22204
5385 22204 20785 3173 -8535 -23921 -56907 -21020 852 -12750 -5519 -7749 -1853 14402 25837
5372 25837 32112 53438 39963 8628 -9670 -13612 10379 19844 6229 -6328 15118 31524
5360 31524 12894 -4467 774 25813 23044 28428 36223 25748 -3403 -16238 -3762 27694 25205
5347 25205 1748 6868 3658 -11383 -18107 -11256 18034 32340 35292 29884 22792 9736 7958
5334 7958 17341 29155 13150 2761 -20730 -34415 -35137 -39678 -39113 -24466 -27032 -24375 -5688 14362
$$ packed form
5424B9308K643N665J0919M472J708j6794j0965m515N142J0862j9541j8188O65
5411A381k5543r394K3503J0977L4131j2493j1703O867N868l797J782q068k871
5398A0640m965L202q347J3105J0016j8537j2025J189j4187j1517J4834L0888P908
5385B2204j419j7612j1708j5386l2986L5887K1872j3602P231k230N896J6255J1435
5372B5837O275K1326j3475l1335j8298l942K3991R465j3615j2557K1446J6406
5360C1524j8630j7361N241K5039k769N384P795j0475k9151j2835J2476L1456k489
5347B5205k3457N120l210j5041o724O851K9290J4306K952n408p092j3056j778
5334G958R383J1814j6005j0389k3491j3685p22m541N65J4647k566K657J8687K0050
$$ plain form
5320 14362 18634 13170 -9628 -28997 -6710 6570 15743 16913 14081 10498 14046 21916 1526
5307 1526 -5535 -12633 -25430 -15686 -11196 -18340 -10077 -2382 -23411 -38250 -6771 17735 24591 5584
5293 5584 -9509 -16042 -17954 -40186 -55295 -48182 -26874 -21693 -18897 -15454 -23135 -30859 -30801 12393
5279 12393 14637 -6283 -33281 -59747 -45846 -19303 -16784 -23499 -31565 -4094 25377 22331 5470
5266 5470 9204 18772 12408 14761 2539 5564 8688 -13429 -2982 6159 -11689 -5812 9744 11097
5252 11097 26102 41145 29023 28225 27504 23870 22345 32673 25982 9555 -5540 -32390 -31193
5239 -31193 -24616 -13999 -7701 -16790 -28880 -2193 23101 4019 7280 26178 28701 16224 -5240
5226 -5240 -4801 6004 -7043 1754 1995 -2798 14008 44913 50649 39287 46763 36423 17840 8717
$$ packed form
5320A4362M272n464k2798j9369K2287J3280R173J170k832l583L548P870k0390
5307A526p061p098j2797R744M490p144Q263P695k1029j4839L1479K4506O856j9007
5293E584j5093o533j912k2232j5109P113K1308N181K796L443p681p724N8M3194
5279A2393K244k0920k6998k6466J3901K6543K519o715q066K7471K9471l046j6861
5266E470L734R568o364K353j2222L025L124k2117J0447R141j7848N877J5556J353
5252A1097J5005J5043j2122p98p21l634j525J0328o691j6427j5095k6850J197
5239c1193O577J0617O298r089j2090K6687K5294j9082L261J8898K523j2477k1464
5226e240M39J0805j3047Q797K41m793J6806L0905N736j1362P476j0340j8583r123
$$ plain form
5212 8717 -8757 -20893 -26817 -32572 -15664 -19110 -15160 22556 37753 33547 8618 -21402 -15034
5199 -15034 -9 1347 -2070 -11311 -357 16308 25514 14462 9584 -11056 942 16119 38915
5186 38915 10136 -18878 -18300 -21611 -10509 18706 9792 11593 3908 -6726 -8153 -8625 2161 10002
5172 10002 15397 16896 16259 6929 6751 13474 19168 28296 25639 13301 -5523 -4777 -8887 -6801 -1855
5157 -1855 -23917 -44530 -49429 -34255 -32095 -33870 -31039 -32189 -40079 -27068 4489 16401 5367
5144 5367 -6348 -24520 -23397 -26331 -13569 20706 6903 -545 -31170 -39544 -38340 -39394 -35535
5131 -35535 -29545 -6499 8982 -3751 -5877 16699 19606 8444 12629 9606 17578 -7935 -5689
5118 -5689 -2858 -10714 -17057 -12080 6385 24710 7736 6468 1346 -8083 2507 17881 38478
$$ packed form
5212H717j7474j2136n924n755J6908l446L950L7716J5197m206k4929l0020O368
5199a5034J5025J356l417r241J0954J6665R206j1052m878k0640J1998J5177K2796
5186C8915k8779k9014N78l311J1102K9215q914J801p685j0634j427m72J0786P841
5172A0002N395J499o37r330j78O723N694R128k657j2338j8824P46m110K086M946
5157a855k2062k0613m899J5174K160j775K831j150p890J3011L1557J1912j1034
5144E367j1715j8172J123k934J2762L4275j3803p448l0625q374J204j054L859
5131c5535N990K3046J5481j2733k126K2576K907j1162M185l023P972k5513K246
5118e689K831p856o343M977J8465J8325j6974j268n122r429J0590J5374K0597
$$ plain form
5105 38478 7084 11087 14084 6952 -22579 -37348 -32024 -16745 -8031 -8987 -29730 -44067 -43813 -30950
5091 -30950 13290 18576 1462 19764 39308 41955 16708 4353 456 -2428 6125 30831 11383
5078 11383 -8432 1787 2942 10754 37265 78990 65418 26557 15047 12169 8474 5452 -9613
5065 -9613 -11759 -23684 -26753 -30466 -17459 8404 13383 24851 5099 -11341 -26088 -58326 -31153
5052 -31153 -14012 -17875 -17826 -21287 -1334 16612 17878 -6456 -40323 -36225 -32243 -5906 4662
5039 4662 3571 1194 -13187 -16726 896 169 -11814 -10526 -5265 -1938 1565 15032 22624 9024
5025 9024 -7107 -20175 -46619 -40266 -14122 -10157 -3888 -927 7390 -1327 -11897 -20817 -46125
5012 -46125 -45224 -25920 -4752 10852 18522 11547 20306 12362 5318 -4376 903 6813 30062 71518
$$ packed form
5105C8478l1394M003K997p132k9531j4769N324J5279Q714r56k0743j4337K54J2863
5091c0950M4240N286j7114J8302J9544K647k5247j2355l897k884Q553K4706j9448
5078A1383j9815J0219J155P812K6511M1725j3572l8861j1510k878l695l022j5065
5065i613k146j1925l069l713J3007K5863M979J1468j9752j6440j4747l2238K7173
5052c1153J7141l863M9l461J9953J7946J266k4334l3867M098L982K6337J0568
5039D662j091k377j4381l539J7622p27j1983J288N261L327L503J3467P592j3600
5025I024j6131j3068k6444O353K6144L965O269K961Q317q717j0570q920k5308
5012d6125R01J9304K1168J5604P670o975Q759p944p044r694N279N910K3249M1456
$$ plain form
4998 71518 86281 82392 51780 20751 7980 -6830 9711 23533 -8255 -22018 -4272 98
4986 98 144 -15300 -28542 -5071 7215 25284 20100 10655 1883 -8818 -23485 -21611 -3119 5153
4972 5153 -7335 -39 -3961 -9837 -9194 -4146 13787 -2349 -9166 -6723 -7983 9214 17690 18520
4958 18520 -1700 9957 12621 10922 -20253 -24628 -19563 -28237 -26613 -37263 -34074 -56728 -49785
4945 -49785 -43064 -43760 -48322 -46171 -35735 904 20924 29504 42214 19800 -3319 -9260 -5892
4932 -5892 24023 26791 -469 2444 4582 14418 18867 38223 35707 19558 51517 51088 18420 -4572
4918 -4572 15861 14398 6418 -4913 -6452 -12147 -8750 -22073 -31402 -35503 -21408 -14409 -7155 7595
4904 7595 18268 12674 28035 25635 112 16856 28112 28080 23486 8374 8870 4638 -6360 2754
$$ packed form
4998G1518J4763l889l0612l1029j2771j4810J6541J3822l1788j3763J7746M370
4986I8M6j5444j3242K3471J2286J8069n184r445q772j0701j4667J874J8492Q272
4972E153j2488P296l922n876O43N048J7933j6136o817K443j260J7197Q476Q30
4958A8520k0220J1657K664j699l1175m375N065q674J624j0650L189k2654O943
4945d9785O721o96m562K151J0436L6639K0020Q580J2710k2414k3119n941L368
4932e892K9915K768k7260K913K138R836M449J9356k516j6149L1959m29l2668k2992
4918d572K0433j463p980j1331j539n695L397j3323r329m101J4095O999P254J4750
4904G595J0673n594J5361k400k5523J6744J1256l2m594j5112M96m232j0998R114
$$ plain form
4890 2754 -12758 -23317 -8994 -15187 -35974 -27024 -11863 -5209 20065 33329 -6105 -36454 -32824
4877 -32824 -10888 12980 6969 2521 540 -1362 -5583 9063 -7477 -29364 -36289 -13504 6170
4864 6170 2515 -6937 -6894 -11764 -6330 -11411 -25478 -5434 -3661 -9661 -14766 -28763 -25070 -38148
4850 -38148 -10440 -6135 -15963 -12610 -14087 -12299 6600 16621 25103 8842 -12749 -28692 -34215
4837 -34215 -28932 -19908 -23125 -28912 -15759 -781 1121 -5772 -485 -16098 -17869 -22883 1360 22167
4823 22167 18857 24220 6039 1979 -3677 -3574 333 -22871 -22173 -20101 -9539 -22661 -56053 -52611
4809 -52611 -52475 -28823 -20312 -29699 -26203 -13115 -6826 -9759 -3979 -13020 -28435 -56720 -63250 -33714
4795 -33714 -17454 -43028 -59195 -26684 8497 2623 2389 -7748 -3516 7726 -11485 -4394 6563
$$ packed form
4890B754j5512j0559J4323o193k0787Q950J5161O654K5274J3264l9434l0349L630
4877c2824K1936K3868o011m448j981j902m221J4646j6540k1887o925K2785J9674
4864F170l655r452M3m870N434n081j4067K0044J773o000n105j3997L693j3078
4850c8148K7708M305r828L353j477J788J8899J0021Q482j6261k1591j5943n523
4837c4215N283R024l217n787J3153J4978J902o893N287j5613j771n014K4243K0807
4823B2167l310N363j8181m060n656J03L907k3204O98K072J0562j3122l3392L442
4809e2611J36K3652Q511r387L496J3088O289k933N780r041j5415k8285o530K9536
4795c3714J6260k5574j6167L2511L5181n874k34j0137M232J1242j9211P091J0957
$$ plain form
4782 6563 -17430 -36879 -37771 -19973 -29395 -10096 -7323 -3908 11054 11969 12821 10247 6105 10863
4768 10863 25063 20012 25726 6218 -1945 2435 15531 14745 5728 -339 -17920 -24570 4451 4517
4754 4517 22168 39431 36774 37804 8630 -10428 -12589 -22209 -31183 -11795 -7698 -10931 -2795 6794
4740 6794 16055 22824 26120 24712 24812 12352 -198 3447 24344 10194 -827 13590 11145 -12383
4726 -12383 -17868 -8669 -36154 -37050 -22335 -14607 -7972 -19057 -23388 -1923 25673 3282 -4247
4713 -4247 5498 -7169 10124 6701 7606 -3331 -34011 -31438 -19726 -15236 -8053 17168 24438 -7270
4699 -7270 -37713 -35659 3736 15636 9892 8325 -9809 -12478 -18459 -20478 -40206 -38103 -32261 -42797
4685 -42797 -47602 -30619 -1357 5528 -23558 -26240 -17374 -12522 -11624 -25315 -2753 -8072 -40969
$$ packed form
4782F563k3993j9449q92J7798r422J9299K773L415J4962R15Q52k574m142M758
4768A0863J4200n051N714j9508q163M380J3096p86r017o067j7581o650K9021O6
4754D517J7651J7263k657J030k9174j9058k161r620q974J9388M097l233Q136R589
4740F794R261O769L296j408J00j2460j2550L645K0897j4150j1021J4417k445k3528
4726a2383n485R199k7485q96J4715P728O635j1085m331K1465K7596k2391p529
4713d247R745j2667J7293l423R05j0937l0680K573J1712M490P183K5221P270l1708
4699g270l0443K054L9395J1900n744j567j8134k669n981k019j9728K103N842j0536
4685d2797m805J6983K9262O885k9086k682Q866M852Q98j3691K2562n319l2897
$$ plain form
4672 -40969 -22554 -14411 -2406 7312 31805 31450 22909 27069 22848 9087 -6621 -7699 244 10493
4658 10493 15370 11974 3740 7378 8344 6378 -6331 -12103 -24132 -23682 -15722 21768 28157 27521 17401
4643 17401 33581 33878 39737 42991 54097 46131 25220 12929 4763 -328 -6282 -20551 -11600 -864
4629 -864 -20407 -21956 -30249 -14743 10902 4752 3383 3553 8582 850 -32335 -47600 -66567 -47376
4615 -47376 -23444 -29347 -23496 -4025 -6257 5644 -3137 -15767 -14556 -37142 -31561 -17770 -9806
4602 -9806 -20573 -35839 -35162 -29729 -22521 -9861 -6016 -1408 -14464 -9012 -18740 -38027 -25267 -18543
4588 -18543 -22066 -37328 -34641 -23198 12001 13570 -15 -15052 -37740 -43620 -29304 5000 18793
4575 18793 1965 -22501 -28081 -7918 -9269 -25119 -33436 -3730 29297 17592 16992 26049 22393
$$ packed form
4672d0969J8415Q143J2005R718K4493l55q541M160m221j3761j5708j078P943J0249
4658A0493M877l396q234L638R66j966j2709n772j2029M50P960L7490O389o36j0120
4643A7401J6180K97N859L254J1106p966k0911j2291q166n091n954j4269Q951J0736
4629h64j9543j549q293J5506K5645o150j369J70N029p732l3185j5265j8967J9191
4615d7376K3932n903N851J9471k232J1901q781j2630J211k2586N581J3791P964
4602i806j0767j5266O77N433P208J2660L845M608j3056N452r728j9287J2760O724
4588a8543l523j5262K687J1443L5199J569j3585j5037k2688n880J4316L4304J3793
4575A8793j6828k4466n580K0163j351j5850q317K9706L3027j1705o00R057l656
$$ plain form
4562 22393 8470 -10913 -40447 -66598 -81929 -66421 -48372 -23473 -6404 -20496 -41818 -54956
4550 -54956 -49455 -29202 -42404 -26298 -24080 -47956 -55094 -49616 -50973 -40650 -34443 -62826 -55754
4537 -55754 -11841 8957 21271 9317 847 -575 3782 7837 -5339 -31118 471 20252 19376
4524 19376 17177 -11293 -26870 -29283 -31856 -47459 -54776 -24539 -17056 -13497 478 -18370 -17775
4511 -17775 -16112 -8119 -6410 7556 1674 2467 5502 11239 20150 31748 44589 31899 -18466 -24491
4497 -24491 -25624 -19962 -37873 -65120 -53237 -42182 -14661 -7593 -30568 -29789 -22269 -9706 -9657 -5151
4483 -5151 -2247 -1709 2709 31762 35443 29905 29010 10779 -12187 -10192 7273 17643 44454 53518
4469 53518 27288 18846 8530 -7826 -11114 -12570 -6690 -14373 -26314 -7273 9407 4368 23886
$$ packed form
4562B2393j3923j9383k9534k6151j5331J5508J8049K4899J7069j4092k1322j3138
4550e4956N501K0253j3202J6106K218k3876p138N478j357J0323O207k8383P072
4537e5754M3913K0798J2314j1954q470j422M357M055j3176k5779L1589J9781q76
4524A9376k199k8470j5577k413k573j5603p317L0237P483L559J3975j8848N95
4511a7775J663P993J709J3966n882P93L035N737Q911J1598J2841j2690n0365o025
4497b4491j133N662j7911k7247J1883J1055K7521P068k2975P79P520J2563M9M506
4483e151K904N38M418K9053L681n538q95j8231k2966J995J7465J0370K6811R064
4469E3518k6230q442j0316j6356l288j456N880p683j1941J9041J6680n039J9518
$$ plain form
4456 23886 17494 7082 -1774 -15512 -12657 16221 10972 -3721 -5268 -9419 -18687 -16378 -19826 -14127
4442 -14127 2174 5374 -7620 -17819 -22302 4848 19587 -5781 -16623 -30394 -35139 -10612
4430 -10612 7179 14244 16871 367 -14544 -25398 -34226 -18811 2356 13979 38216 40487 37905
4417 37905 31244 23779 -1918 -677 16280 17981 3790 -1910 -10495 -6678 -3367 -4252 21732 33153
4403 33153 -14776 -17565 5992 3855 7843 21325 14782 6851 11968 -4612 -39706 -24832 9900
4390 9900 -841 -12669 -5248 31058 35114 18021 12107 18368 29041 33772 18892 3933 -8559
4377 -8559 -2817 10672 16761 32977 17106 -29469 -33394 -19219 -41 14264 4402 -5821 781
4364 781 -8982 22434 34184 32370 20383 4295 -3661 -28435 -23124 -48040 -40630 -28609 -18973
$$ packed form
4456B3886o392j0412q856j3738K855K8878n249j4693j547m151r268K309l448N699
4442a4127J6301L200j2994j0199m483K7150J4739k5368j0842j3771m745K4527
4430a0612J7791P065K627j6504j4911j0854q828J5415K1167J1623K4237K271k582
4417C7905o661p465k5697J241J6957J701j4191n700q585L817L311q85K5984J1421
4403C3153m7929k789K3557k137L988J3482o543p931N117j6580l5094J4874L4732
4390I900j0741j1828P421L6306M056j7093n914O261J0673M731j4880j4959j2492
4377h559N742J3489O089J6216j5871m6575l925J4175J9178J4305r862j0223O602
4364G81r763L1416J1750j814j1987j6088p956k4774N311k4916P410J2021R636
$$ plain form
4351 -18973 -5302 -3784 -18619 -21008 -11019 3300 1584 24430 28528 18719 18185 9569 -23433 -51810
4337 -51810 -43234 -26760 -1936 4578 -4545 -9098 -19683 -21136 -17894 -6598 1271 27033 22443
4324 22443 13174 -4167 -22550 -11075 -10307 -6573 -5927 1079 -6109 -35320 -33626 -17447 7814 -22786
4310 -22786 -45261 -44205 -26533 2611 10025 2207 -6872 -25604 -31490 -46155 -41083 -22940 -28637
4297 -28637 -28264 -14196 5068 18223 9289 -16394 -39138 -27356 -22235 -26880 -16145 731 -9371
4284 -9371 -18942 -35686 -22195 -18410 -14612 2174 9755 17572 20753 8057 -6596 -24683 -15570
4271 -15570 -15802 -18739 -32483 -33613 -30856 -42097 -56288 -31933 -23007 -9960 -4054 5535 -5264
4258 -5264 -15230 -17326 -7179 3216 4766 -6474 -3456 13166 8764 4931 15601 2786 -2767
$$ packed form
4351a8973J3671J518j4835k389R989J4319j716K2846M098r809n34q616l3002k8377
4337e1810Q576J6474K4824O514r123m553j0585j453L242J1296P869K5762m590
4324B2443r269j7341j8383J1475P68L734O46P006p188k9211J694J6179K5261l0600
4310b2786k2475J056J7672K9144P414p818r079j8732n886j4665N072J8143n697
4297b8637L73J4068J9264J3155q934k5683k2744J1782N121m645J0735J6876j0102
4284i371r571j6744J3491L785L798J6786P581P817L181j2696j4653j8087R113
4271a5570k32k937j3744j130K757j1241j4191K4355Q926J3047N906R589j0799
4258e264r966k096J0147J0395J550j1240L018J6622m402l833J0670j2815n553
$$ plain form
4245 -2767 -6845 -16226 -18218 -3920 -4333 1940 7009 9794 -23839 -25950 -12711 3054 -1606 -11544
4231 -11544 -27690 -33084 -44422 -48878 -70814 -56967 -18961 3084 -3236 -20167 -31420 -32377 -30269
4218 -30269 -21322 -19159 -29134 -8766 -8777 -15358 -20548 -28436 -12007 -1244 14284 -5516 -29773 -14985
4204 -14985 17087 28569 -24169 -17503 -4877 9125 -9621 -16474 -5206 9661 20063 2767
4192 2767 -7846 23512 20998 -6994 -32687 -33745 -39874 -24769 -27493 6185 23572 17699 32896
4179 32896 41850 31240 2210 3890 12010 -9930 -41497 -29046 1707 5046 13739 -15059 -35371
4166 -35371 -17780 28 1395 3224 19988 11442 5779 21301 8028 -43864 -42848 -36665 -25971
4153 -25971 -3046 3813 -6270 -4833 -220 -8179 7659 -4235 2408 -1160 -6126 -8466 6950
$$ packed form
4245b767m078r381j992J4298m13O273N069K785l3633k111J3239J5765m660r938
4231a1544j6146n394j1338m456k1936J3847L8006K2045o320j6931j1253r57K108
4218c0269Q947K163r975K0368j1o581n190p888J6429J0763J5528j9800k4257J4788
4204a4985L2072J1482n2738O666J2626J4002j8746o853J1268J4867J0402j7296
4192B767j0613L1358k514k7992k5693j058o129J5105k724L3678J7387n873J5197
4179C2896Q954j0610k9030J680Q120k1940l1567J2451L0753L339Q693k8798k0312
4166c5371J7591J7808J367J829J6764q546n663J5522j3273n1892J016O183J0694
4153b5971K2925O859j0083J437M613p959J5838j1894O643l568m966k340J5416
$$ plain form
4140 6950 13764 -629 9431 27845 25608 34066 21648 9502 23537 22050 10052 859 6876
4127 6876 6634 4385 8235 10149 8995 -13558 -31197 -8579 8292 11736 -1967 -10649 -17452 -5819
4113 -5819 -2162 15897 22123 6926 -4428 3052 -4619 6312 22305 4437 -25431 -18273 -11567
4100 -11567 -11994 1273 3726 -6434 -17802 -12567 -9914 -18631 -39595 -29737 -25217 -12402 5201
4087 5201 -2107 2047 3380 -18202 -23454 -6637 -10902 -25942 -41598 -36848 -33162 -10280 13004
4074 13004 42250 13451 -12788 -19024 -3814 -19701 -6816 1699 -13169 -19644 -12154 -15154 -44452
4061 -44452 -53169 -42107 -25121 -11676 -11461 -24241 -25797 -42514 -47986 -30273 -39699 -32804 -900
4048 -900 -13006 -29822 -25446 -11241 11979 12038 -14659 -29663 -46671 -36443 -18935 -11449 -16891
$$ packed form
4140F950O814j4393J0060J8414k237Q458j2418j2146J4035j487j1998r193O017
4127F876k42k249L850J914j154k2553j7639K2618J6871L444j3703q682o803J1633
4113e819L657J8059O226j5197j1354P480p671J0931J5993j7868k9868P158O706
4100a1567m27J3267K453j0160j1368N235K653q717k0964R858M520J2815J7603
4087E201p308M154J333k1582n252J6817m265j5040j5656M750L686K2882K3284
4074A3004K9246k8799k6239o236J5210j5887J2885Q515j4868o475P490l000k9298
4061d4452q717J1062J6986J3445K15j2780j556j6717n472J7713r426O895L1904
4048i00j2106j6816M376J4205K3220N9k6697j5004j7008J0228J7508P486n442
$$ plain form
4035 -16891 7328 -6486 -933 19671 18613 -621 4432 11932 2499 -20672 -4450 15538 -2624
4022 -2624 -29674 -41443 -52390 -52468 -45611 -33044 -16895 -31664 -35420 -24025 -30094 -16430 -10009
4009 -10009 -21379 -43939 -19664 -2198 -16447 -10358 22038 28369 20285 19405 13805 -4861 -17565
3996 -17565 -28405 -27740 -52963 -42084 -21410 -19502 -23057 -14985 -36104 -51363 -62528 -44607 -19399
3983 -19399 -13889 -36668 -42018 -14803 -9241 -17774 -4789 -12366 -17560 -13928 -17315 941 8354 9775
3969 9775 -2522 3375 -4180 13507 24699 -565 -8699 6847 19674 20522 9215 501 -7545
3956 -7545 -72 -4516 -10709 12129 11330 -2851 -12251 -22962 -7524 15213 14888 6535 16372 4655
3942 4655 16708 13332 -2944 -29196 -33552 -24944 -26219 -1219 16589 4730 -4686 -1179 -3166
$$ packed form
4035a6891K4219j3814N553K0604j058j9234N053P500r433k3171J6222J9988j8162
4022b624k7050j1769j0947p8O857J2567J6149j4769l756J1395o069J3664O421
4009a0009j1370k2560K4275J7466j4249O089L2396O331q084q80n600j8666j2704
3996a7565j0840O65k5223J0879K0674J908l555Q072k1119j5259j1165J7921K5208
3983a9399N510k2779n350K7215N562q533J2985p577n194L632l387J8256P413J421
3969I775j2297N897p555J7687J1192k5264q134J5546J2827Q48j1307q714q046
3956g545P473m444o193K2838p99j4181r400j0711J5438K2737l25q353R837j1717
3942D655J2053l376j6276k6252m356Q608j275K5000J7808j1859r416L507j987
$$ plain form
3929 -3166 -5617 2070 -562 -2432 18100 21174 -5154 -26473 -23291 -8900 -25288 -30190 -18107
3916 -18107 -22956 -31493 -5002 18821 -6571 -18352 -4097 -9904 454 -10507 -29852 -10135
3904 -10135 -4354 -5911 -11474 7190 10071 15218 -520 6557 5952 -33770 -37808 -40392 -34927 -45166
3890 -45166 -36420 -29825 -43307 -33442 -41504 -23750 7242 -6370 -15669 11 3387 -4653 -23189
3877 -23189 -24178 -21928 -29822 -31062 -17513 24149 36876 18558 -1677 -3293 -11658 -20298 -11776 -2865
3863 -2865 -10631 -17763 -13534 8102 9667 -679 -5651 -9135 -33113 -34358 -45595 -58985 -46695
3850 -46695 -36575 -18020 -17287 -28545 -5942 17074 5076 -18663 -14050 22645 46462 16414
3838 16414 -3472 1437 21717 15780 18423 19155 11108 -5209 -7682 -4256 -3932 -39070 -42996 -28267
$$ packed form
3929c166k451P687k632j870K0532L074k6328k1319L182J4391j6388m902J2083
3916a8107m849q537K6491K3823k5392j1781J4255n807J0358j0961j9345J9717
3904a0135N781j557n563J8664K881N147j5738P077o05l9722m038k584N465j0239
3890d5166Q746O595j3482R865q062J7754L0992j3612r299J5680L376q040j8536
3877b3189r89K250p894j240J3549M1662J2727j8318k0235j616q365q640Q522Q911
3863b865p766p132M229K1636J565j0346m972l484k3978j245j1237j3390J2290
3850d6695J0120J8555P33j1258K2603K3016j1998k3739M613L6695K3817l0048
3838A6414j9886M909K0280n937K643P32q047j6317k473L426L24l5138l926J4729
$$ plain form
3824 -28267 -3564 -22923 -35309 -35317 -20364 -7712 -11481 -16055 6082 4517 -346 -418 -3302 1052
3810 1052 -14876 -26959 -41394 -17271 -9596 -8499 -2621 -23985 -6859 3528 -22573 -31989 -7941
3797 -7941 4550 19927 25220 41179 39881 14713 -16678 -17380 -903 1476 -5989 568 5432 2888
3783 2888 -19953 -23702 -10166 -26097 -28847 -33702 -10381 1369 -9213 -2996 28575 42785 21895
3770 21895 24180 -2168 -2857 18000 2984 2050 10792 -11828 -12112 15542 16955 21849 40868 28717
3756 28717 1439 -5254 11660 13765 22299 6352 -9643 2120 -5049 -24348 -43727 -51192 -22214
3743 -22214 -5313 -2180 -13658 -11623 -24980 -47510 -44387 -23535 -32625 -28449 -45486 -58427 -55967
3730 -55967 -45248 -38529 -46057 -30993 -23106 -47363 -59553 -39166 -19662 1255 14057 20136 39540
$$ packed form
3824b8267K4703j9359j2386qJ4953J2652l769m574K2137j565m863p2k884M354
3810A052j5928j2083j4435K4123P675J097N878k1364J7126J0387k6101r416K4048
3797g941J2491J5377N293J5959j298k5168l1391p02J6477K379p465O557M864k544
3783B888k2841l749J3536j5931k750m855K3321J1750j0582O217L1571J4210k0890
3770B1895K285k6348o89K0857j5016r34Q742k2620k84K7654J413M894J9019j2151
3756B8717k7278o693J6914K105Q534j5947j5995J1763p169j9299j9379p465K8978
3743b2214J6901L133j1478K035j3357k2530L123K0852r090M176j7037j2941K460
3730e5967J0719O719p528J5064P887k4257j2190K0387J9504K0917J2802O079J9404
$$ plain form
3717 39540 37868 37061 43909 39832 40540 51165 35692 6975 7269 -2322 14465 11870 -141 -6686
3703 -6686 -9008 -16906 -21376 -29089 -25176 -12691 -26700 -20158 -11947 -16139 9815 9884 -21649 -51697
3689 -51697 -41762 -31677 -47801 -43099 -21810 -10976 3461 2898 -7650 2260 10731 13975 7800
3676 7800 -9012 -5420 -2423 20052 12092 25065 -88 11877 17264 -753 -12960 -37796 -30240
3663 -30240 -16603 -7665 15384 9888 -10104 -15604 -7117 5345 15922 -1173 -10932 12889 45018
3650 45018 30470 3272 16004 32849 38245 40725 22031 -14959 -38776 -43837 -32090 -34105 -40021
3637 -40021 -21768 6624 23411 39569 6828 6519 19871 24610 27677 22577 17234 18582 18227 18674
3623 18674 15712 -18329 -15056 -9676 -14053 -18906 -20231 -5728 -10840 -3262 -1833 -11224 -10912 -579
$$ packed form
3717C9540j672q07O848m077P08J0625j5473k8717K94r591J6787k595j2011o545
3703f686k322p898m470p713L913J2485j4009O542Q211m192K5954O9l1533l0048
3689e1697R935J0085j6124M702K1289J0834J4437n63j0548R910Q471L244o175
3676G800j6812L592K997K2475p960J2973k5153J1965N387j8017j2207k4836P556
3663c0240J3637Q938K3049n496j9992n500Q487J2462J0577j7095r759K3821L2129
3650D5018j4548k7198J2732J6845N396K480j8694l6990k3817n061J1747k015n916
3637d0021J8253K8392J6787J6158l2741l09J3352M739L067n100n343J348l55M47
3623A8674k962l4041L273N380m377m853j325J4503n112P578J429r391L12J0333
$$ plain form
3609 -579 13641 23275 14368 -12867 -21853 -18395 -5402 -1066 13118 25415 37596 20016 -16346
3596 -16346 -61021 -56474 -47236 -41577 -22881 -21142 -17366 -23055 -21721 -3395 11503 -7174 -5580
3583 -5580 3349 -2660 -3181 -4796 -7626 -1282 6550 6680 5591 10801 16801 7885 14816 28947 37242
3568 37242 19496 11205 -9211 -21292 -2951 14776 27018 44882 36706 -4809 -3351 -1524 -11493
3555 -11493 1992 -5148 -25388 2321 18817 18945 15329 28994 22800 36165 23806 25287 36791
3542 36791 24761 22169 40227 45121 38496 8574 -22492 -15920 -9552 91 -5 -7577 198 4702
3528 4702 -6959 10325 4384 -16616 -25752 -8110 -5264 -22167 -22415 9398 22246 33338 21270
3515 21270 -12474 -25922 -24602 -29055 -11882 12844 7460 -23154 -43900 -31149 5623 30354
$$ packed form
3609e79J4220R634q907k7235q986L458J2993M336J4184J2297J2181j7580l6362
3596a6346m4675M547R238N659J8696J739L776n689J334J8326J4898j8677J594
3583e580Q929o009n21j615k830O344P832J30j089N210O000q916O931J4131Q295
3568C7242j7746q291k0416j2081J8341J7727J2242J7864q176m1515J458J827r969
3555a1493J3485p140k0240K7709J6496J28l616J3665o194J3365j2359J481J1504
3542C6791j2030k592J8058M894o625k9922l1066O572O368R643r6p572P775M504
3528D702j1661J7284n941k1000r136J7642K846j6903k48L1813J2848J1092j2068
3515B1270l3744j3448J320m453J7173K4726n384l0614k0746J2751L6772K4731
$$ plain form
3503 30354 19380 5343 -3436 -4540 2018 19809 19877 -500 -8117 -21952 -20949 -34635 -28302 1638
3489 1638 -6590 -19217 -28638 -38778 -40844 -16461 -2319 544 -14418 -6205 -6926 -16364 -31056 -34930
3475 -34930 -25096 -13081 2103 -12242 -13052 -6080 17855 -3669 -19258 -13086 18282 16066 20469
3462 20469 24607 -9585 -127 15495 -12172 -39446 -49165 -34056 -2784 8769 13315 11483 7100
3449 7100 18240 46201 48250 54932 9987 -24354 -39497 -38700 -55416 -48057 -16239 -9212 -23944
3436 -23944 -32368 -16430 21714 30588 20996 110 -14661 11937 35473 53511 29396 -5432
3424 -5432 1109 12161 29824 27119 14379 -2917 -17725 -16317 37660 40748 18891 20087 9510
3411 9510 -10040 -8063 -24892 -17496 -1379 12821 30286 21443 8252 10644 4057 14435 15342
$$ packed form
3503C0354j0974j4037q779j104O558J7791O8k0377p617j3835J003j3686O333K9940
3489A638q228j2627r421j0140k066K4383J4142K863j4962Q213p21r438j4692l874
3475c4930R834J2015J5184j4345q10O972K3935k1524j5589O172L1368k216M403
3462B0469M138l4192R458J5622k7667k7274r719J5109L1272J1553M546j832m383
3449G100J1140K7961K049O682m4945l4341j5143P97j6716P359L1818P027j4732
3436b3944q424J5938L8144Q874r592k0886j4771K6598K3536J8038k4115l4828
3424e432O541J1052J7663k705j2740j7296j4808J408N3977L088k1857J196j0577
3411I510j9550J977j6829P396J6117J4200J7465q843j3191K392o587J0378R07
$$ plain form
3398 15342 11314 17117 5628 3503 11753 14068 7716 -8534 -23241 -25010 -40824 -41916 -26014
3385 -26014 -21018 -24578 -3392 9284 13878 2266 9875 19810 17174 -10561 -17127 -13438 -10082 -9542
3371 -9542 -13835 -18404 -9472 6538 12423 -18109 -39269 -17868 -2791 4151 -7213 -13383 -4991
3358 -4991 -13590 -19992 -15821 -295 31099 8361 10223 19247 2549 14941 26762 3247 2772
3345 2772 7135 25305 35615 25371 15937 18824 23999 18141 8100 14764 13926 18532 24361 22623
3331 22623 6022 -31208 -57030 -72421 -45891 -20597 -30885 -20505 -2111 7177 18292 9521
3319 9521 3006 11672 -3966 -5064 -1849 5747 -8188 -5008 6568 -7439 -27079 -17270 953
3306 953 13166 9996 18253 5622 9729 7736 -6622 -15154 -11444 -18221 -5931 4311 21262 24823
$$ packed form
3398A5342m028N803j1489k125Q250K315o352j6250j4707j769j5814j092J5902
3385b6014M996l560K1186J2676M594j1612P609R935k636k7735o566L689L356N40
3371i542m293m569Q932J6010N885l0532k1160K1401J5077O942j1364o170Q392
3358d991q599o402M171J5526L1394k2738J862R024j6698J2392J1821k3515m75
3345B772M363J8170J0310j0244r434K887N175n858j0041O664q38M606N829j738
3331B2623j6601l7230k5822j5391K6530K5294j0288J0380J8394R288J1115q771
3319I521o515Q666j5638j098L215P596j3935L180J1576j4007j9640R809J8223
3306I53J2213l170Q257j2631M107j993j4358q532L710o777J2290J0242J6951L561
$$ plain form
3292 24823 8796 5784 4490 11744 7008 -2028 19553 27461 35234 17819 7391 15009 -8016
3279 -8016 -14557 -2015 -7935 -8540 -647 -10240 -34190 -35250 -27167 -6662 -2181 3638 19307 9665
3265 9665 11505 25245 20756 29091 32904 32043 -12260 -17898 -22103 -25479 -14768 -34829 -51116 -48409
3251 -48409 -38332 -24889 -10679 -11295 -14326 -14070 -25300 -19596 -15257 -12517 -6866 6178 -2967 -9213
3237 -9213 -6543 -572 787 8059 41813 24430 -7792 -39876 -50094 -52226 -24128 -4423 -18959
3224 -18959 -17096 -23073 -12718 5110 14698 38488 44151 50883 50191 29057 -17119 -47978 -36327
3211 -36327 -34392 -27564 -32177 -42864 -46126 -30744 -10953 -13790 -10454 3586 6726 6458 28424 23109
3197 23109 22047 16256 22682 31966 30506 27744 -3623 -14829 -21547 -25250 -27009 -13773 -16674 -20401
$$ packed form
3292B4823j6027l012j294P254m736r036K1581P908P773j7415j0428P618k3025
3279h016o541J2542n920o05P893r593k3950j060Q083K0505M481N819J5669r642
3265I665J840J3740m489Q335L813q61m4303n638m205l376J0711k0061j6287K707
3251d8409J0077J3443J4210o16l031K56j1230N704M339K740N651J3044r145o246
3237i213K670N971J359P272L3754j7383l2222l2084j0218k132K8098J9705j4536
3224a8959J863n977J0355J7828R588K3790N663O732o92k1134m6176l0859J1651
3211c6327J935O828m613j0687l262J5382J9791k837L336J4040L140k68K1966n315
3197B3109j062n791O426R284j460k762l1367j1206o718l703j759J3236k901l727
$$ plain form
3183 -20401 -18523 -13832 10861 24961 20274 -9322 -14272 -21316 -34442 -33445 -6038 -10577 -22863
3170 -22863 -18345 9187 21313 20183 15217 -1176 -1628 2680 5652 -9816 -27288 -13875 8812
3157 8812 41746 60721 34501 8169 -2092 -9870 -5663 16684 32525 28674 26052 13894 -8533
3144 -8533 -18147 -2051 3723 -934 1007 7449 -10507 -12495 -35780 -44841 -40265 -25729 -21434 -24540
3130 -24540 -27843 -30110 -30744 -44224 -51327 -25439 -6990 597 -10606 -10831 -12090 -29734 -24980 -13793
3116 -13793 6940 18013 8304 -13529 -25659 -845 14086 10327 -17359 -7035 -13494 -9645 -5872
3103 -5872 -19367 -29597 -17546 3492 14471 8993 11742 12401 11576 6222 -12722 -23695 -6139
3090 -6139 -1782 2303 -10914 -16742 -10442 -7867 -4527 5724 19680 -3606 -16516 9085 16928
$$ packed form
3183b0401J878M691K4693J4100m687k9596m950p044j3126R97K7407m539j2286
3170b2863M518K7532J2126j130m966j6393m52M308K972j5468j7472J3413K2687
3157H812L2934J8975k6220k6332j0261p778M207K2347J5841l851k622j2158k2427
3144h533r614J6096N774m657J941O442j7956j988k3285r061M576J4536M295l106
3130b4540l303k267o34j3480p103K5888J8449P587j1203k25j259j7644M754J1187
3116a3793K0733J1073r709k1833j2130K4814J4931l759k7686J0324o459L849L773
3103e872j3495j0230J2051K1038J0979n478K749O59q25n354j8944j0973J7556
3090f139M357M085j3217n828O300K575L340J0251J3956k3286j2910K5601P843
$$ plain form
3077 16928 15579 13784 24565 14701 6951 6165 -7161 -18573 -17760 4806 17495 -183 -12648
3064 -12648 10110 15658 30634 56488 34438 1514 -29946 -229 -6100 -22220 -13436 -37415
3052 -37415 -26934 -1323 -1949 2315 12812 6642 -22162 -37842 -23340 -12671 19387 5456 -15503
3039 -15503 319 -9787 -13005 -13775 -5709 -14163 -21011 -354 23212 23129 9545 -1657 -8260 -20128
3025 -20128 -22745 -17937 -9162 4534 16186 25882 19224 16910 9903 12554 15444 20037 17234 13870
3011 13870 5355 -6911 -17546 -9642 -8874 4320 28710 19083 11826 -1042 -16370 6139 -2111
2998 -2111 -4813 -4622 11114 7839 5749 5653 14999 11716 -1567 -16858 -1997 -1536 -17995 -33787
2984 -33787 -17424 -539 -12709 -22581 -17938 -22712 -28268 1105 19102 -31338 -56717 -58478 -31235
$$ packed form
3077A6928j349j795J0781r864p750p86j3326j1412Q13K2566J2689j7678j2465
3064a2648K2758N548J4976K5854k2050l2924l1460K9717n871j6120Q784k3979
3052c7415J0481K5611o26M264J0497o170k8804j5680J4502J0669L2058j3931k0959
3039a5503J5822j0106l218p70Q066q454o848K0657K3566q3j3584j1202o603j1868
3025b0128k617M808Q775J3696J1652R696o658k314p007K651K890M593k803l364
3011A3870q515j2266j0635P904P68J3194K4390r627p257j2868j5328K2509q250
2998b111k702J91J5736l275k090r6R346l283j3283j5291J4861M61j6459j5792
2984c3787J6363J6885j2170r872M643m774n556K9373J7997n0440k5379j761K7243
$$ plain form
2971 -31235 11601 32307 9024 -27625 -15476 11143 15148 13229 4225 -11321 -2993 1506 -30890
2958 -30890 -39110 -5481 -5473 -40694 -42277 -30823 -15045 -21838 -26978 -34037 -38367 -8988 7555 -5101
2944 -5101 -15995 -28583 -26072 -26317 358 4372 -29199 -46167 -47528 -26921 -34862 -32843 -33342 -27810
2930 -27810 -8428 641 932 7609 6730 13147 14287 18328 -11100 -41849 -39276 -31027 -8188 -28563
2916 -28563 -30079 -7936 428 -17869 -14549 7698 6157 14999 36767 42918 53166 33580 18147
2903 18147 21789 19887 34480 39979 28546 16556 9827 15868 14439 2307 -1188 12960 5816
2890 5816 -24307 -18856 -25211 -24329 343 14212 19904 35063 30261 24829 17297 22800 20445 34016
2876 34016 28127 -980 -6151 -7278 -39587 -40351 -40830 -22900 -12653 150 5617 15348 16678 -3975
$$ packed form
2971c1235M2836K0706k3283l6649J2149K6619M005j919r004j5546Q328M499l2396
2958c0890q220L3629Ql5221j583J1454J5778o793n140p059m330K9379J6543j2656
2944e101j0894j2588K511k45K6675M014l3571j6968j361K0607p941K019m99N532
2930b7810J9382R069K91O677q79O417J140M041k9428l0749K573Q249K2839k0375
2916b8563j516K2143Q364j8297L320K2247j541Q842K1768O151J0248j9586j5433
2903A8147L642j902J4593N499j1433j1990o729O041j429j2132l495J4148p144
2890E816l0123N451o355Q82K4672J3869N692J5159m802n432p532N503k355J3571
2876C4016n889k9107n171j127l2309p64m79J7930J0247J2803N467R731J330k0653
$$ plain form
2862 -3975 -7344 -8878 -8875 7412 -2763 -15675 -940 12251 19052 8584 2646 -4291 -5580 -1559
2848 -1559 14768 -5681 -49905 -45688 -21785 -34628 -44432 -58620 -39797 -18184 -12008 -15155 -18194
2835 -18194 -52263 -65344 -49495 -43130 -20889 -36509 -28280 -5970 -3217 -6106 6929 4817 8639
2822 8639 -1982 3251 -9907 -20619 -14587 -819 12725 -12066 -8762 10005 19181 31789 25590
2809 25590 28679 -1508 -34002 -33546 -15398 280 -7195 6964 16022 26192 32700 29312 33745
2796 33745 30472 22874 9083 26788 23071 15282 14553 4642 11598 11750 20722 27485 45684 49668
2782 49668 26527 13878 6760 -4409 4562 21735 51390 41149 18180 -3045 -1187 1556 11035
2769 11035 2403 22286 9691 -155 -27484 -35442 -24152 -36790 -30679 -15932 -1657 18381 29025
$$ packed form
2862c975l369j534LJ6287j0175j2912J4735J3191O801j0468n938o937j289M021
2848a559J6327k0449m4224M217K3903j2843r804j4188J8823K1613O176l147l039
2835a8194l4069j3081J5849O365K2241j5620Q229K2310K753k889J3035k112L822
2822H639j0621N233j3158j0712O032J3768J3544k4791L304J8767R176J2608o199
2809B5590L089l0187l2494M56J8148J5678p475J4159R058J0170O508l388M433
2796C3745l273p598j3791J7705l717p789p29r911O956J52Q972O763J8199L984
2782D9668k3141j2649p118j1169Q971J7173K9655j0241k2969k1225J858K743R479
2769A1035q632J9883j2595r846k7329p958J1290j2638O111J4747J4275K0038J0644
$$ plain form
2756 29025 32744 15895 15893 17693 12237 25843 42824 37111 27917 10596 29908 27983 35300 37860
2742 37860 21888 24735 2989 1432 9005 32843 77965 70771 51425 41292 57047 51810 50443
2729 50443 43254 46113 31934 20836 4908 -22855 -22430 3946 -2548 18836 -1593 -18961 -18476
2716 -18476 -6382 -4700 9466 -948 -29218 -37371 -30998 -34398 -27304 -29584 -30380 -26949 -20992 -17400
2702 -17400 -9330 -5764 -22711 -46528 -31360 -15698 -31063 -18084 -23692 -19902 1113 27537 18971
2689 18971 -10033 -21333 -9922 -5109 -9806 -25421 -42238 -13592 6829 18522 -2259 -20757
2677 -20757 1920 6611 17279 26957 -16730 -30033 -38858 -25099 -25795 -17022 7280 18266 12991
2664 12991 11573 22659 28959 5395 -20696 -28132 -26228 -26570 -25285 -14391 -11560 -2675 6509 -19407
$$ packed form
2756B9025L719j6849kJ800n456J3606J6981n713r194j7321J9312j925P317K560
2742C7860j5972K847k1746j557P573K3838M5122p194j9346j0133J5755n237j367
2729E0443p189K859j4179j1098j5928k7763M25K6376o494K1384k0429j7368M85
2716a8476J2094J682J4166j0414k8270q153O373l400P094k280p96L431N957L592
2702a7400Q070L566j6947k3817J5168J5662j5365J2979n608L790K1015K6424q566
2689A8971k9004j1300J1411M813m697j5615j6817K8646K0421J1693k0781j8498
2677b0757K2677M691J0668R678m3687j3303q825J3759o96Q773K4302J0986n275
2664A2991j418J1086O300k3564k6091p436J904l42J285J0894K831Q885R184k5916
$$ plain form
2650 -19407 -13480 -824 7128 5421 19203 49960 50492 42744 11985 -19643 -26082 2859 10861
2637 10861 270 -23934 -10902 -15312 -3770 -16272 -28429 -29163 -29132 -7543 -23339 -43760 -37071
$$ packed form
2650a9407N927J2656P952j707J3782L0757N32p748l0759l1628o439K8941Q002
2637A0861j0591k4204J3032m410J1542j2502j2157p34L1K1589j5796k0421O689
$$ [...]
##END NTUPLES=NMR SPECTRUM
##END=
