##TITLE=Analysis number 321956
Compound Code cc 50901
Book Reference 486/44/1
Project Code adrs
Chemist Name simons
##JCAMPDX= 6.0         $$ Bruker NMR JCAMP-DX V2.0
##DATA TYPE= NMR SPECTRUM
##DATA CLASS= NTUPLES
##ORIGIN= Bruker BioSpin GmbH
##OWNER= nmr
$$ XWIN-NMR		Version 3.5
$$ Wed Sep  6 12:05:41 2006 GMT Daylight Time (UT+1h)  MAYBRIDGE\nmr@NMR_250MHZ
##.OBSERVE FREQUENCY= 250.131544655141
##.OBSERVE NUCLEUS= ^1H
##.ACQUISITION MODE= SIMULTANEOUS (DQD)
##.ACQUISITION SCHEME= undefined
##.AVERAGES= 16
##.DIGITISER RES= 18
##SPECTROMETER/DATA SYSTEM= dpx250
##.PULSE SEQUENCE= zg30
##.SOLVENT NAME= DMSO
##.SHIFT REFERENCE= (INTERNAL, DMSO, 0, 16.522)
##AUDIT TRAIL= $$ (NUMBER, WHEN, WHO, WHERE, WHAT)
$$ ##TITLE= Audit trail, XWIN-NMR		Version 3.5
$$ ##JCAMPDX= 5.01
$$ ##ORIGIN= Bruker BioSpin GmbH
$$ ##OWNER= nmr
$$ C:\u/data/dgb/nmr/ADRS/260/pdata/1/auditp.txt
$$ ##AUDIT TRAIL=  $$ (NUMBER, WHEN, WHO, WHERE, WHAT)
(   1,<2006-09-06 12:05:13.13 +100>,<MAYBRIDGE\nmr>,<NMR_250MHZ>,
      <created by zg, POWCHK disabled, PULCHK disabled
       configuration hash MD5:
       E2 DF 36 D8 04 B2 41 60 5A D7 A3 38 5A 4B D0 FE
       data hash MD5: 64K
       E8 A5 25 33 48 0D B2 A8 0E D5 EA 69 59 64 D3 96>)
(   2,<2006-09-06 12:05:28.96 +100>,<MAYBRIDGE\nmr>,<NMR_250MHZ>,
      <Start of raw data processing
       ef LB = 0.3 FT_mod = 6 PKNL = 1 SI = 32K 
       data hash MD5: 32K
       4C B3 A2 EA E5 BE 81 F6 8E 3D 35 14 F2 94 4A 8C>)
(   3,<2006-09-06 12:05:30.64 +100>,<MAYBRIDGE\nmr>,<NMR_250MHZ>,
      <apk 
       data hash MD5: 32K
       E4 18 99 81 0E D6 8B D7 A2 22 A8 14 98 1B 63 D9>)
(   4,<2006-09-06 12:05:31.72 +100>,<MAYBRIDGE\nmr>,<NMR_250MHZ>,
      <abs ABSG = 5 
       data hash MD5: 32K
       81 86 96 D5 CD 31 0A AC 60 7F EE A2 8A B4 A0 90>)
$$ ##END=
$$ 
$$ hash MD5
$$ B1 77 CB DD FA B1 3D 04 FE 14 C9 E5 B8 85 E8 81
##$RELAX= 
##$RELAX= 
##$RELAX= 
##$RELAX= 
##$RELAX= 
##$RELAX= 
##$RELAX= 
$$ Bruker specific parameters
$$ --------------------------
##$DU= <C:\u>
##$EXPNO= 260
##$NAME= <ADRS>
##$PROCNO= 1
##$TYPE= <nmr>
##$USER= <dgb>
##$AMP= (0..31)
100 100 100 100 100 100 100 100 100 100 100 100 100 100 100 100 100 100 
100 100 100 100 100 100 100 100 100 100 100 100 100 100 
##$AQSEQ= 0
##$AQ_mod= 3
##$AUNM= <au_zg>
##$AUTOPOS= <11 >
##$BF1= 250.13
##$BF2= 250.13
##$BF3= 250.13
##$BF4= 250.13
##$BF5= 500.13
##$BF6= 500.13
##$BF7= 500.13
##$BF8= 500.13
##$BYTORDA= 1
##$CFDGTYP= 0
##$CFRGTYP= 5
##$CHEMSTR= <none>
##$CNST= (0..31)
1 1 145 1 1 1 1 1 1 1 1 1 1 1 1 1 1 1 1 1 1 1 1 1 1 1 1 1 1 1 1 1 
##$CPDPRG= <>
##$CPDPRG1= <>
##$CPDPRG2= <>
##$CPDPRG3= <>
##$CPDPRG4= <mlev>
##$CPDPRG5= <mlev>
##$CPDPRG6= <mlev>
##$CPDPRG7= <mlev>
##$CPDPRG8= <mlev>
##$CPDPRGB= <>
##$CPDPRGT= <>
##$D= (0..31)
0 1 0 0 0 0 0 0 0 0.06 0 0 0 0 0 0 0.0002 0 0 0 0 0 0 0 0 0 0 0 0 0 0 
0 
##$DATE= 1157540712
##$DBL= (0..7)
120 120 120 120 120 120 120 120 
##$DBP= (0..7)
150 150 150 150 150 150 150 150 
##$DBP07= 0
##$DBPNAM0= <>
##$DBPNAM1= <>
$$ [...]
##$SUBNAM6= <"">
##$SUBNAM7= <"">
##$SUBNAM8= <"">
##$SUBNAM9= <"">
##$SW= 20.6930455092707
##$SWIBOX= (0..15)
0 0 3 0 0 0 0 0 0 0 0 0 0 0 0 0 
##$SW_h= 5175.983436853
##$TD= 65536
##$TD0= 1
##$TE= 296.16
##$TE2= 300
##$TE3= 300
##$TEG= 300
##$TL= (0..7)
0 120 120 120 120 120 120 120 
##$TP= (0..7)
150 150 150 150 150 150 150 150 
##$TP07= 0
##$TPNAME0= <>
##$TPNAME1= <>
##$TPNAME2= <>
##$TPNAME3= <>
##$TPNAME4= <>
##$TPNAME5= <>
##$TPNAME6= <>
##$TPNAME7= <>
##$TPOAL= (0..7)
0.5 0.5 0.5 0.5 0.5 0.5 0.5 0.5 
##$TPOFFS= (0..7)
0 0 0 0 0 0 0 0 
##$TUNHIN= 0
##$TUNHOUT= 0
##$TUNXOUT= 0
##$USERA1= <user>
##$USERA2= <user>
##$USERA3= <user>
##$USERA4= <user>
##$USERA5= <user>
##$V9= 5
##$VALIST= <valist>
##$VCLIST= <CCCCCCCCCCCCCCC>
##$VD= 0
##$VDLIST= <DDDDDDDDDDDDDDD>
##$VPLIST= <PPPPPPPPPPPPPPP>
##$VTLIST= <TTTTTTTTTTTTTTT>
##$WBST= 1024
##$WBSW= 4
##$XGAIN= (0..3)
0 0 0 0 
##$XL= 0
##$YL= 0
##$YMAX_a= 328294
##$YMIN_a= -383956
##$ZGOPTNS= <>
##$ZL1= 120
##$ZL2= 120
##$ZL3= 120
##$ZL4= 120
##$ABSF1= 16.522
##$ABSF2= -4.171173
##$ABSG= 5
##$ABSL= 3
##$ALPHA= 0
##$AQORDER= 0
##$ASSFAC= 0
##$ASSFACI= 0
##$ASSFACX= 0
##$ASSWID= 0
##$AUNMP= <proc_1d>
##$AZFE= 0.1
##$AZFW= 0.1
##$BCFW= 0
##$BC_mod= 0
##$BYTORDP= 0
##$COROFFS= 0
##$CY= 12.5
##$DATMOD= 1
##$DC= 0
##$DFILT= <>
##$DTYPP= 0
##$F1P= 14.0000005364418
##$F2P= -0.99999901652339
##$FCOR= 0.5
##$FTSIZE= 32768
##$FT_mod= 6
##$GAMMA= 0
##$GB= 0
##$INTBC= 1
##$INTSCL= 1
##$ISEN= 128
##$LB= 0.3
##$LEV0= 0
##$LPBIN= 0
##$MAXI= 10000
##$MC2= 0
##$MEAN= 0
##$ME_mod= 0
##$MI= 0
##$NCOEF= 0
##$NC_proc= -4
##$NLEV= 6
##$NOISF1= 0
##$NOISF2= 0
##$NSP= 0
##$NTH_PI= 0
##$NZP= 0
##$OFFSET= 16.522
##$PC= 1
##$PHC0= 135.886
##$PHC1= 8.495646
##$PH_mod= 1
##$PKNL= yes
##$PPARMOD= 0
##$PSCAL= 4
##$PSIGN= 0
##$REVERSE= no
##$SF= 250.13
##$SI= 32768
##$SIGF1= 0
##$SIGF2= 0
##$SINO= 400
##$SIOLD= 32768
##$SREGLST= <1H.DMSO>
##$SSB= 0
##$STSI= 32768
##$STSR= 0
##$SW_p= 5175.98343685301
##$SYMM= 0
##$S_DEV= 0
##$TDeff= 65536
##$TDoff= 0
##$TI= <Analysis number 999999
Compound Code 99
Book Reference 9
Project Code 9>
##$TILT= no
##$TM1= 0
##$TM2= 0
##$TOPLEV= 0
##$USERP1= <user>
##$USERP2= <user>
##$USERP3= <user>
##$USERP4= <user>
##$USERP5= <user>
##$WDW= 1
##$XDIM= 32768
##$YMAX_p= 453234849
##$YMIN_p= -380734
$$ End of Bruker specific parameters
$$ ---------------------------------
##NTUPLES= NMR SPECTRUM
##VAR_NAME=  FREQUENCY,     SPECTRUM/REAL,   SPECTRUM/IMAG
##SYMBOL=    X,             R,               I
##VAR_TYPE=  INDEPENDENT,   DEPENDENT,       DEPENDENT
##VAR_FORM=  AFFN,          ASDF,            ASDF
##VAR_DIM=   32768,         32768,           32768
##UNITS=     HZ,            ARBITRARY UNITS, ARBITRARY UNITS
##FACTOR=    0.157963299565203, 1,           1
##FIRST=     4132.6476996994, 0,             0
##LAST=      -1043.33573715361, 0,           0
##MIN=       -1043.33573715361, -380734,     0
##MAX=       4132.6476996994, 453234849,     0
$$ Real data points
##PAGE= N=1
##DATA TABLE= (X++(R..R)), XYDATA
$$ [...]
16064D6872o0717J3136M165N3972O7710l2055K0482J0569l2916N661j0888n6905
16052B9086m7493o604K7121J9236j878L3607K4496K0845L684m5200J655j5352
16040D3203n2444l4293j4999K9088J9045O5142K2869p857j138n0149j37415R516
16028a09432O9559p467O8944P0527k3231j6173o1889l9644l6517L1963N6828L748
16016G216L67J5N2916M6256k0804p8831J6652J1244j7403j7782N624R1049k2922
16003G3597q4717l6969K2191l2712m2629K6388N0847N2512Q1241k741j44541j1484
15991d9017k249R384J960l2754M7064K7030M0574K7241J4019P761j6512l8999
15979C5502l549p184o6187J9594O0937k1598L5900J1667r2985m9241J1846N7748
$$ plain form
16064 46872 -13845 -709 3456 57428 125138 93083 113565 124134 91218 96879 85991 29086
16052 29086 -18407 -25011 2110 21346 19468 53075 77571 98416 102100 56900 58555 43203
16040 43203 -9241 -43534 -58533 -29445 -10400 54742 77611 69754 68616 18467 -118948 -109432
16028 -109432 -39873 -47340 21604 92131 68900 52727 -9162 -48806 -85323 -53360 3468 7216
16016 7216 7583 7598 60514 106770 85966 7135 23787 35031 17628 -154 5470 96519 73597
16003 73597 -11120 -48089 -25898 -58610 -101239 -74851 -24004 28508 109749 107008 -37533 -49017
15991 -49017 -51266 -41882 -39922 -72676 -25612 1418 41992 69233 83252 91013 74501 35502
15979 35502 31953 24769 -41418 -21824 39113 17515 53415 65082 -27903 -77144 -65298 -7550
15967g550J4027m2345N0911R0160N0113k2696q6192q2365j9001O6104N3464L2462
15955I7092p6868r4126n9414m5675L486M7760R0595J8201j5761N4559j9061m6140
15943d5352K6612k358N67Q3455L0447k9722p237J9690K9168K3292O8114K2945
15931B19621j28922n4455K051l1333R157p95j5990p289k6000l5508k0241J3700
15919g6004M9537N7737m5839k961P5260j6620m7885L9309J4462m2453l3393J7586
15907a1264M9141Q141N064q552J9412O158O990M6572l972p3779m2786p3714K1501
15894e1088l5080q000k858l3895J3865j3742K6274O6205L1510k4581l0764j1255
15882g3409l1018J2009P415O1153o492O2403M2618O9053j2293r630n0151p1845
$$ plain form
15967 -7550 6477 -35868 15043 105203 155316 132620 46428 -35937 -54938 11166 64630 97092
15955 97092 20224 -73902 -133316 -178991 -175505 -127745 -37150 -18949 -34710 19849 788 -45352
15943 -45352 -18740 -21098 -20531 62924 93371 63649 56412 76102 105270 128562 196676 219621
15931 219621 90699 36244 38295 6962 16119 15324 -666 -7955 -33955 -69463 -89704 -76004
15919 -76004 -26467 31270 -14569 -17530 57730 41110 -6775 32534 46996 4543 -28850 -11264
15907 -11264 37877 46018 51082 42530 61942 68100 75090 121662 117690 43911 1125 -72589 -51088
15894 -51088 -86168 -94168 -97026 -130921 -117056 -130798 -104524 -38319 -6809 -31390 -62154 -73409
15882 -73409 -104427 -92418 -85003 -23850 -30342 32061 74679 143732 131439 121809 71658 -187
15870a87j2178k4364n3786K5894J1207P189J6849J4583k1399j9144M205L8985
15858a2146M3888k929j8385k5723P18K0866k2955J3337l585K0758K2313J0562
15846D6719J7562n1108r2438l808L8851m5457J715Q894l614N3766K7967p741j2211
15833b0903K485J1842K5704l3655k26M4020k6729l8560m1396q85P6968J8628l5687
15820a8394l3880k4879P1781Q1084M7137l6602k1506j3142j2418k9253L0362K9878
15808G0168J241L2883n2382p7555k982m7300k7265k3870k6590K4442J5531l583
15796a17262L4492j56J5834J5910K6195k3363K9109M1706l0352j18037P0O6444
15784e9410K0562J9722J8289j6899N487p84l4532m4911L6689N378R427K5594J5402
$$ plain form
15870 -187 -12365 -36729 -90515 -64621 -53414 -46225 -29376 -14793 -36192 -55336 -51131 -12146
15858 -12146 31742 28813 10428 -15295 -14577 6289 -16666 -3329 -6914 13844 36157 46719
15846 46719 64281 13173 -79265 -83073 -44222 -89679 -87964 -79070 -82684 -28918 -951 -8692 -20903
15833 -20903 -18418 -6576 19128 -14527 -14753 29267 2538 -36022 -77418 -78303 -1335 17293 -18394
15820 -18394 -52274 -77153 -5372 75712 122849 86247 64741 51599 39181 9928 40290 70168
15808 70168 71409 104292 51910 -25645 -28627 -75927 -103192 -127062 -153652 -129210 -113679 -117262
15796 -117262 -82770 -82926 -67092 -51182 -24987 -48350 -19241 22465 -7887 -125924 -125854 -59410
15784 -59410 -38848 -19126 -837 -17736 -12249 -13033 -47565 -92476 -55787 -50409 -40982 -15388 14
15771A4Q933l8671J4306L0290R662J0784Q247l7297n240R693j3571Q16o7010j5217
15757h4261Q325N2173K3790n586K6817L1313K9554n0562r5907l3105M3530J9962
15745c3957j9839l2067L4947K1825n6603Q7047Q4754m40n285J7196k3197m3706
15733C0675l8065J0922q79j3838L2703l6214j742k3331L4048k634j6658L5010
15721I997N9065n805o078l5597k543J3318n2632R521l9151R131J4118l4344J8126
15708d2874N8895l4767n0730J3065L155K3253O7403m7115m9164j7658L1026M6771
15696A260N9841j7028n4984k6157o439L1915K2243l206n8890K2138L8022n8407
15684d9692k7788K5503K3861K5229P25l2023n0470N4293Q8058L1268N110n6113
$$ plain form
15771 14 8947 -29724 -15418 14872 24534 35318 43565 6268 1028 10721 -2850 -2034 -69044 -84261
15757 -84261 -75936 -23763 27 -5559 21258 52571 82125 31563 -64344 -97449 -53919 -33957
15745 -33957 -53796 -85863 -50916 -29091 -85694 1353 86107 85667 80382 97578 74381 30675
15733 30675 -7390 3532 2653 -11185 21518 -14696 -16438 -39769 -5721 -8355 -25013 9997
15721 9997 69062 63257 57179 21582 19039 32357 -20275 -10754 -49905 -40774 -26656 -61000 -42874
15708 -42874 16021 -18746 -69476 -56411 -53256 -30003 37400 -9715 -58879 -76537 -45511 1260
15696 1260 61101 44073 -10911 -37068 -43507 -11592 10651 7445 -51445 -29307 8715 -49692
15684 -49692 -77480 -51977 -28116 -2887 -2162 -34185 -84655 -30362 57696 88964 94074 37961
15672C7961j7488l8731J1555l831L7142L217j1473o6692N164P1740L4370q5599
15660b2665l1971J1913l6401M208M1669M1185j2243m1585J4092p25l0033m5406
15648a07962L4984J11327J614o6224j4278j6882o220k7632O3501N8682n454n0814
15636b5358o5650n0698K1463N5360L4747J1232J2136j7147N0496J4275p1988o7887
15624i9019M2023P3679j3238l1293q175r006Q0782J1001j3718r545L2945o0656
15612d220M1713P7498j0645n1273n8927L407M6581o910m9303l9885l838m5797
15600a01599k1787K2913J1809l9707J4486R0275m3812n9339N1010j4145K61N5609
15588c4026L1814n520m5386N198Q235L1523j3332r056j0596k0751j009p1309J2328
$$ plain form
15672 37961 20473 -18258 -6703 -10534 26608 29825 18352 -48340 -43176 28564 62934 -22665
15660 -22665 -54636 -42723 -79124 -74916 -33247 7938 -4305 -45890 -31798 -32523 -62556 -107962
15648 -107962 -72978 38349 39963 -26261 -40539 -57421 -63641 -91273 -27772 30910 25456 -25358
15636 -25358 -91008 -141706 -120243 -64883 -30136 -18904 -6768 -23915 26581 40856 -31132 -99019
15624 -99019 -56996 16683 3445 -27848 -36023 -45029 35753 46754 33036 23491 56436 -4220
15612 -4220 37493 114991 104346 53073 -5854 -2447 44134 37224 -12079 -51964 -55802 -101599
15600 -101599 -123386 -100473 -88664 -128371 -113885 -23610 -67422 -126761 -75751 -89896 -89635 -34026
15588 -34026 -2212 -7732 -53118 -47920 -39685 -8162 -21494 -30550 -41146 -61897 -62906 -134215 -121887
15575a21887M8744j525j9547L3266K0945J3858l4365j8954L397L4666K2427L581
15563a5394j8466j380M8422k7656L8781M0172j333o6784m1886J4862K9767M0986
15551D0091L2693M301k4492p542J2156O1324N0203m9609n8245l2809j6616k6823
15539a5368p4219N9959K2870j0570J0702J020k7899M1987O2375o1349m8072J5563
15527b3001J748J6898r431l1831P5937N0432l53k5005r6876j5420J5581N3213
15515A1892M1170m8917j16163L1919P0530N1651l7616n3122q24Q4234k166l2741
15503a53K3940L6643K7513J3261m6490q1544n6466O765M5261o6860J0412K7348
15491f0370O432K6956O299n1335K0368K5936k1816L4241K0121K7968k7399J0029
$$ plain form
15575 -121887 -73143 -74668 -94215 -60949 -40004 -26146 -60511 -79465 -76068 -41402 -18975 -15394
15563 -15394 -33860 -35240 13182 -14474 24307 64479 63146 -3638 -45524 -30662 -895 40091
15551 40091 72784 77085 52593 45051 57207 118531 168734 119125 60880 28071 11455 -15368
15539 -15368 -89587 -29628 -6758 -17328 -6626 -5606 -33505 8482 70857 9508 -38564 -23001
15527 -23001 -21253 -4355 -13786 -45617 30320 80752 80399 55394 -41482 -56902 -41321 11892
15515 11892 53062 4145 -112018 -80099 -9569 42082 4466 -48656 -49480 34754 32588 -153
15503 -153 23787 60430 87943 101204 54714 -26830 -83296 -76531 -31270 -98130 -87718 -60370
15491 -60370 -53938 -26982 -20683 -72018 -51650 -25714 -47530 -13289 6832 34800 7401 17430
15479A7430L271L609K8991q570l4481p572L901K9529L2275K4452j6188l3229n6988
15466a3570M201k1800k5460j3829m655l4179M9801P8448J1156J0513N6006l0989
15454F5643k7961j5011j0435r447o9711n1028M5617M2848L42k261J9953n8698
15442g0149O427J2745j2796J2264J5545R16M447l4515l3171O7864r562K8050R1527
15429G9592K2067n7793l0536k2442l7092R270Q3889M5599m6107m9789k6230j0439
15417d0011L4271K0203J2875M0569k4820m9933k5577k9685L947J3040l5283m468
15405h4872j9360P4237N7293m0443k5886P812J5401N8295o409j7232j2172K1827
15393B8491l6817L5480O296K6137j5042j4538j6542m4490j9867M645J1012j3065
$$ plain form
15479 17430 20701 24310 53301 44731 10250 2678 6579 36108 68383 92835 76647 43418 -13570
15466 -13570 -9369 -31169 -56629 -70458 -75113 -109292 -59491 18957 30113 40626 96632 65643
15454 65643 37682 22671 12236 2789 -66922 -117950 -72333 -29485 -29143 -31404 -11451 -70149
15442 -70149 -63722 -50977 -63773 -51509 -35964 -35048 -30601 -65116 -98287 -30423 -39985 -11935 79592
15429 79592 101659 43866 13330 -9112 -46204 -36934 46955 92554 46447 -3342 -29572 -40011
15417 -40011 -5740 14463 27338 67907 43087 -6846 -32423 -62108 -58161 -45121 -80404 -84872
15405 -84872 -104232 -29995 27298 -13145 -39031 -31219 -15818 42477 36068 18836 6664 28491
15393 28491 -8326 27154 33450 59587 44545 30007 13465 -31025 -50892 -46247 -35235 -48300
15381d8300l6573j2848R5136n903j8770K3162N0201J7522j064p110l1467j9991
15369C995l7687J2028M955M9359j9869j07875m7715Q8428N519L4187J07147K3121
15357A15593L1433r3170l7545L384k1702L7051K7663j9225m4621k8348n4145j6793
15345a00425L6723M9418m4235l4122L9989O8561O831J9792O6234p6515r1202R259
15333d9692K4670m7736j8305k5033O0869J26840J6456q1722o5165n5053L7611
15322g6260N4239L5857m2749j6273R622O3140O2767M213n4740m1377j8164q738
15310b8463N980M826m8562j5137j3344J9957l1936M2509L7858J5004L2392q3077
15298f1993o0986L1450K5086J8150P2289m6026m2201k076M4120N5619k9269m1163
$$ plain form
15381 -48300 -84873 -97721 -2585 -8488 -27258 -4096 46105 63627 62563 55453 23986 3995
15369 3995 -33692 -21664 -16709 32650 12781 -95094 -142809 -54381 -48862 -14675 92472 115593
15357 115593 147026 53856 16311 19695 -2007 35044 62707 43482 -1139 -29487 -83632 -100425
15345 -100425 -63702 -14284 -58519 -92641 -52652 15909 22740 42532 108766 32251 -58951 -49692
15333 -49692 -25022 -72758 -91063 -116096 -55227 71613 88069 6347 -58818 -113871 -76260
15322 -76260 -22021 13836 -28913 -45186 -35564 27576 90343 94556 39816 -1561 -19725 -28463
15310 -28463 -22483 -17657 -66219 -81356 -94700 -74743 -106679 -64170 -26312 -11308 21084 -61993
15298 -61993 -122979 -91529 -66443 -48293 23996 -22030 -64231 -66307 -22187 33432 4163 -37000
15286c7000L0473j9604o0558K2485P2143R0168M4681q5514m3028J3724j1898k6562
15274a0490n8944l3873o795K4645N5247P2508m48n3619r0360J4160M6954K3189
15262a7826Q0645J1031k5388l7674n8273n2101L8354L5054O4859P2769n8962l6056
15250A6432K861j04984l1213L5139j0296m5065n432L6169O0882K0936j51n4515
15238g9237j1240M4815J4232K8009l162n1426k5419K0203j00770p911L1364j953
15226a42495J8056O1500m11J5803r045k4527J2178n4393j3268M0230N3600l491
15214d6263o57r160K3216O6881P0144J6023q9813q7780M8221J7004r137j9065
15202b0386j6887k9847r564M4773N0952k1085k8921k8562o2321N9621R6925k7678
$$ plain form
15286 -37000 -6527 -26131 -86689 -64204 7939 98107 142788 57274 14246 27970 16072 -10490
15274 -10490 -69434 -103307 -110102 -85457 -30210 42298 41850 -11769 -102129 -87969 -41015 -17826
15262 -17826 62819 73850 48462 10788 -47485 -99586 -61232 -26178 38681 111450 52488 16432
15250 16432 19293 -85691 -116904 -81765 -92061 -137126 -142558 -106389 -45507 -24571 -24722 -79237
15238 -79237 -90477 -45662 -31430 -3421 -6583 -58009 -83428 -63225 -163995 -171906 -140542 -142495
15226 -142495 -124439 -62939 -63350 -47547 -56592 -81119 -68941 -123334 -136602 -96372 -42772 -46263
15214 -46263 -46920 -56080 -32864 34017 104161 120184 30371 -57409 -9188 7816 -1321 -20386
15202 -20386 -37273 -67120 -76684 -31911 19041 -2044 -30965 -59527 -121848 -62227 34698 7020
15190G020o3033l2905K4816M6691L9131p2790n9477J8704r71L488O3970l2461
15178e7817l965O5956J2938j5895p4995l4470j019R3937M5039L9649j994l0367
15166C6997O510m1679j1344K9721L0438j8561n4737j7113l6158N881j0058j5307
15154i5410P1654J7879K1372N46j7404j6018l3798n1071L5250K6087n4772n010
15142a00695R005k6935j0810N6283R7045J7009K8026N5253m5692l1173n4970k9053
15130c6707p6986o3503M5354P0989L0359J8025j4825l6587P8246o881q9375l6317
15118a18208l650K3543N0159N4478n0728L3349j8839M1147j9445j7197l0335J1103
15106d4623Q82M1383J5977K0261O4379l6652q8416J7644J6671k0302J9884q665
$$ plain form
15190 7020 -56013 -88918 -64102 -17411 21720 -51070 -110547 -91843 -92814 -89326 -25356 -57817
15178 -57817 -61782 4174 17112 1217 -73778 -108248 -109267 -15330 29709 69358 67364 36997
15166 36997 43507 1828 -9516 20205 50643 32082 -22655 -39768 -75926 -70045 -80103 -95410
15154 -95410 -23756 -5877 15495 16041 -1363 -17381 -51179 -102250 -67000 -40913 -95685 -100695
15142 -100695 -91690 -118625 -129435 -73152 23893 40902 68928 124181 78489 47316 -7654 -36707
15130 -36707 -113693 -177196 -131842 -60853 -30494 -12469 -27294 -63881 14365 7484 -81891 -118208
15118 -118208 -121858 -98315 -48156 6322 -44406 -11057 -29896 11251 -8194 -25391 -55726 -44623
15106 -44623 -43741 -2358 13619 33880 98259 61607 -26809 -9165 7506 -12796 7088 -1577
15094a577p0834M607K8676j4575l1513r754l4768K1759O0357M3611J8242j6548
15082b317k7493j4451m7641M1287L4827k2837R189n8717n1108Q3792O3416O1153
15070F9100n935p7675j8671N8432j9544p1210k4252l7821k3219J4099J6702P2472
15058d7522J4146P2321O0989o3163l5307K5440R0417r381q0814o8648Q7640R170
15046E5288j4959j1545n4022k9638j1110j1147O1358O4735K0562k7265k4122k8527
15034a0392n6017j7160K8524L6128j3821j9342n2146m4791k1869j2914Q5495R1593
15022f712m2853K1270R893m2614l3282P969J1038l5030L8414K0631L8964J7604
15010E292J5665Q9J1869n394q2107J4673P1534K9109m3018l3791K761p0985N680
$$ plain form
15094 -1577 -72411 -67804 -39128 -53703 -85216 -94970 -129738 -107979 -47622 -4011 14231 -2317
15082 -2317 -29810 -44261 -91902 -50615 -15788 -38625 -29436 -88153 -139261 -55469 7947 69100
15070 69100 63165 -14510 -33181 25251 5707 -65503 -89755 -127576 -150795 -136696 -119994 -47522
15058 -47522 -33376 38945 99934 36771 1464 26904 117321 107940 27126 -41522 46118 55288
15046 55288 40329 28784 -25238 -54876 -65986 -77133 -15775 48960 69522 42257 18135 -10392
15034 -10392 -66409 -83569 -55045 -18917 -32738 -52080 -104226 -149017 -170886 -183800 -98305 -6712
15022 -6712 -49565 -28295 -18402 -61016 -94298 -86329 -75291 -110321 -71907 -51276 -12312 5292
15010 5292 20957 21046 32915 27521 -54586 -39913 31621 60730 17712 -16079 -13318 -84303 -78623
14997g8623k2696r226L5761k120k1076j9857m285L593J6879k4129L8576J5360
14985g1843j3231J5257l9822M994N8891N3220l9194K5624M042q163j886J6940
14973D829o5746J3253P6631O662l0444N083m4234L9955L0300j0629r922O5538
14961H1276L5132q9038M895R234o2324o9191j01667K7233J1545P222P5225O6867
14949c591j4221j6885j107M9944M591o0280j0675N9444r92o4487j9068j823N9287
14936a9863j862j5135J6443K3145j2649P034j2432m6524N6964K4618J0356K048
14924C2143p5766k1204Q142p4598q928L627r742P1531P1100n2651k6050K0422
14912f1974m772N0203L9553n465n1605p7612N572M0643J3323j578j5690k3343
$$ plain form
14997 -78623 -101319 -110545 -74784 -76904 -97980 -117837 -122122 -118529 -101650 -125779 -87203 -71843
14985 -71843 -85074 -69817 -109639 -104645 -45754 7466 -31728 -6104 -2062 -10225 -12111 4829
14973 4829 -60917 -47664 28967 35629 5185 10268 -33966 5989 36289 25660 15738 81276
14961 81276 116408 27370 32265 41499 -20825 -90016 -191683 -164450 -152905 -145683 -70458 -3591
14949 -3591 -17812 -34697 -35804 14140 18731 -41549 -52224 7220 6228 -58259 -77327 -79150 -19863
14936 -19863 -21725 -36860 -20417 2728 -9921 -2887 -15319 -61843 -4879 19739 30095 32143
14924 32143 -43623 -64827 -56685 -131283 -140211 -136584 -146326 -74795 -3695 -56346 -82396 -61974
14912 -61974 -66746 -16543 23010 17545 -34060 -111672 -106100 -65457 -52134 -53712 -69402 -92745
14900i2745L4187P8877M948k448j8103m1854K694N8971J8550N360N6630l5257
14888F9810k6332m0217j654J3874L118j6499L0554l351q3911j53533N4158N9519
14876i4464n872N6300L9102l4023J991j6232j7823j9629J5070M3917K5766P594
14864A697o190n6764N612j0091k0051M932K935M223N1958J3920o585m9411O227
14851e7588N1961O4168k1855p4987l4819n6236J5944L0192J8893L3694J2293L5849
14839A7509J10049L1647j07577j9979L4901K552L3131q343o9407o7024k355l4391
14827g9287M4188N2012k1326m3715j4473K6168J0107m0902L1828O5053N5368j973
14815H3048j10776j6811Q133N602O8092K5092m9937n1915j1103P592r9J9035k1552
$$ plain form
14900 -92745 -58558 20319 25267 22819 4716 -37138 -34444 24527 43077 48437 105067 69810
14888 69810 43478 3261 1607 15481 18599 2100 32654 29303 -54608 -208141 -153983 -94464
14876 -94464 -100336 -44036 -4934 -38957 -36966 -53198 -71021 -90650 -75580 -31663 -5897 1697
14864 1697 -4493 -61257 -55645 -65736 -85787 -80855 -77920 -73697 -21739 -7819 -14404 -63815 -57588
14851 -57588 -5627 58541 36686 -38301 -73120 -129356 -113412 -83220 -64327 -30633 -18340 17509
14839 17509 127558 159205 51628 31649 66550 69102 102233 93890 24483 -42541 -44896 -79287
14827 -79287 -35099 16913 -4413 -48128 -62601 -36433 -26326 -67228 -35400 29653 85021 83048
14815 83048 -27728 -44539 -36406 -30804 37288 62380 12443 -39472 -50575 -42983 -43082 -24047 -45599
14802d5599n1033k5736N9606k5962P105J1773K6762j7039L4816m7283J1584M9125
14790a1881j3858j9108O8695k0149n4980n2650N488M7226J19576P0764p0755p7428
14778i060N185k9724J727K0468M5934j8025o0384j7958J0085n0118O817Q8087
14766f966M2477l2488K1049L0740o9349k6979o597K7100M2228j352J0907R283
14754D0053o4799m1250M7855L4622p351L359n4226L7850R304k7603K209M3133
14742B3156L0127m6744p3007K4881O4819j1560l0456j5238l0803R158R6022R0118
14730A30473k9805p0729N588R058j0018o4182k7614K7841K450O956M2723M5742
14718F8483J9089r696k8792n9359k4922J9290K8122k777K770M6393n2327o2118
$$ plain form
14802 -45599 -96632 -122368 -62762 -88724 -81619 -69846 -43084 -60123 -25307 -72590 -61006 -11881
14790 -11881 -25739 -44847 23848 3699 -51281 -103931 -98443 -51217 68359 139123 68368 -9060
14778 -9060 -3875 -33599 -31872 -11404 34530 16505 -43879 -61837 -51752 -101870 -95053 -6966
14766 -6966 35511 3023 24072 54812 -14537 -41516 -48113 -21013 21215 19863 30770 40053
14754 40053 -24746 -65996 -18141 16481 9130 12489 -41737 -3887 5417 -22186 -19977 23156
14742 23156 53283 6539 -66468 -41587 23232 11672 -18784 -34022 -64825 -55667 40355 130473
14730 130473 100668 29939 35527 44585 34567 -29615 -57229 -29388 -26938 -19982 22741 68483
14718 68483 87572 77876 49084 -10275 -35197 -15907 12215 9438 12208 58601 6274 -55844
14706e5844j1659N1661L3624p5185L1144M7555k1420j83M2326L8456l4158m1306
14694E011r238L8709K9205J3255r4137l3454P9143l4129k5422Q4111O7254n5688
14682F4620j12457m6596k8687L7123L8890m3060k536L9036j5641L7853P8650o4533
14670a7338k9643P9495r428K2279P2900k7779j11915r0969j3760r899l8452M3867
14658a30642r368m156J0153Q675O3779m9576l6828l584P2602Q9894K6488k0079
14646A7358l5609N8334J123j01955M34L5980K1024p509k7382J3613R5192l1884
14634C8719l9245N4628p076j00610j4432P0561j9647r5104K5823O2103K1833N0450
14622D8003K8519m266j6490k5348j5050k3665k8850O5940L8623n7051l773K8775
$$ plain form
14706 -55844 -67503 -15842 17782 -57403 -26259 21296 -124 -307 42019 80475 46317 5011
14694 5011 -4227 34482 63687 76942 -17195 -50649 28494 -5635 -31057 53054 120308 64620
14682 64620 -47837 -94433 -123120 -85997 -47107 -90167 -92703 -53667 -69308 -31455 47195 -17338
14670 -17338 -46981 32514 23086 45365 118265 90486 -21429 -112398 -126158 -136057 -174509 -130642
14658 -130642 -140010 -144166 -134013 -125338 -61559 -111135 -147963 -151547 -78945 10949 37437 17358
14646 17358 -18251 40083 41206 -60749 -60315 -24335 -3311 -10820 -38202 -24589 70603 38719
14634 38719 -526 54102 47026 -53584 -68016 2545 -17102 -112206 -86383 -24280 -2447 48003
14622 48003 76522 72256 55766 30418 15368 -8297 -37147 28793 67416 10365 6592 35367
14610C5367K7896L8388r121j5744K9178m2431m8587J0315k5627j1027l063K5594
14598A1138o2261j2600J3494l0273n3244J37021P6498n2591q3461O7221k8818
14587a7876l4393j1768J3901L4933J2562L0095L2083L17K0650L506j40934r2480
14575a49404J1246N0508O4659m9637J6327M8208N1007l8466q0638k1187L2374
14564f5003R028p4367j4991K8593p865P052J06305M5847k3922k5063M815M1368
14552C1797k0312K8583K4658J8180l9747k0012l5485j6422k7660M5798Q0663j8768
14540E1273n5762J3696k2829m0429J1297k0794l3763O4240N806o3932L723M3121
14528d4353p1470p846K5782P0427R7735L2627n0264N029q478o1460n8327M281
$$ plain form
14610 35367 63263 101651 92530 76786 105964 63533 14946 25261 -366 -11393 -14456 11138
14598 11138 -51123 -63723 -50229 -80502 -133746 3275 79773 27182 -56279 10942 -17876
14587 -17876 -52269 -64037 -50136 -15203 -2641 27454 59537 59854 80504 84010 -56924 -149404
14575 -149404 -138158 -87650 -22991 -72628 -56301 -8093 42914 4448 -76190 -97377 -65003
14564 -65003 -55975 -130342 -145333 -116740 -124605 -117553 -11248 34599 10677 -14386 -9571 31797
14552 31797 11485 40068 64726 82906 43159 23147 -12338 -28760 -56420 -10622 70041 51273
14540 51273 -4489 9207 -13622 -54051 -42754 -63548 -97311 -33071 -27265 -91197 -87474 -44353
14528 -44353 -115823 -123669 -97887 -27460 70275 102902 52638 57667 49189 -12271 -70598 -66317
14516f6317m552j6394L688K7432K345l5957O2283J5188J5260J4365j0221j2503
14504e383j7515l8851J4090K4172L4910J2500n6720J0180K6729m082R367P245
14492A6642p7591o4354J5426P9015J0618k2757M2323j2462k13l2304k3441K0977
14480d8121L9589O7909J5798l9757l1061l548k6260L9897J9701p217j5417j6305
14468d792K5130J8539l5731q041k8528M8387n6188j4611l345l9443P416R14m7209
14455a37502J8970l745M4364l2873L1374p38j849K8340O0741k2762p0616k9648
14443a15944P2011K6757K9832J2638O7669n7796j5933m2698o6407L6487N9526
14432F142k9815l5588M976J6554K6027p191J1649j6735o9455k7112N6799M5115
$$ plain form
14516 -66317 -70869 -87263 -83575 -56143 -53798 -89755 -27472 -12284 2976 17341 7120 -5383
14504 -5383 -22898 -61749 -47659 -23487 11423 23923 -32797 -22617 4112 30 9397 16642
14492 16642 -60949 -125303 -109877 -30862 -20244 -43001 -678 -13140 -13353 -45657 -69098 -48121
14480 -48121 -8532 59377 75175 35418 4357 809 -25451 14446 34147 26930 11513 -4792
14468 -4792 20338 38877 3146 -4895 -33423 14964 -41224 -55835 -59180 -98623 -91207 -90293 -137502
14455 -137502 -118532 -122277 -77913 -110786 -79412 -80150 -81999 -53659 7082 -15680 -86296 -115944
14443 -115944 -43933 -17176 12656 25294 92963 35167 19234 -23464 -89871 -53384 6142
14432 6142 -23673 -59261 -54285 -37731 -11704 -18895 -7246 -23981 -93436 -120548 -63749 -18634
14420a8634M9038n4980l6431q0179L3238N3061O2062m4045m4419m4000N9k0659
14408a45889P5720L4744o488M8593r853K2715Q4519n0213p9276m378j9639M4621
14396d824k2999J1743M4914j8562l8891m9718k019l685j0291K3954k8762j9402
14384a18542R0222O8071m485j6661l8595K8982K837p5370l2586J4783P4169M1336
14372C4161k9030R185L0599k3393n800l613j6600J5645J0186R473k0612p1747
14360f1546k4196L7738M6498M8781J9010l2884m3377r1706j08637K4155N8530
14349a27634P4451J2230K8004j3742o0268K8678M070K2566J5575K111L6365j3266
14337I140m377j0478K5789N7123m3171J4217j8239R050m9275m9941J3577O7396
$$ plain form
14420 -18634 30404 -24576 -61007 -141186 -107948 -54887 7175 -36870 -81289 -125289 -125230 -145889
14408 -145889 -70169 -35425 -41913 6680 -3173 19542 104061 53848 -25428 -29806 -49445 -4824
14396 -4824 -27823 -16080 28834 10272 -28619 -78337 -80356 -84041 -94332 -70378 -99140 -118542
14384 -118542 -28320 39751 35266 18605 -19990 8992 11829 -63541 -96127 -81344 -7175 34161
14372 34161 5131 14316 44915 21522 15722 12109 -4491 11154 21340 30813 10201 -61546
14360 -61546 -85742 -48004 -1506 47275 66285 33401 -9976 -101682 -210319 -186164 -127634
14349 -127634 -53183 -40953 -12949 -26691 -86959 -58281 -54211 -31645 -16070 -13959 22406 9140
14337 9140 4763 -5715 20074 77197 34026 48243 30004 39054 -10221 -60162 -46585 20811
14325B0811j3217l8034j0527r803M891L5673Q3649J5557m6496o4435j38545j2602
14313a73078K1129o545L2884N0358J43417L2218j08595o4634j2073R876K1212
14302e3831M4759m075j8445m9876k9252M9381O9972o4105K7091j25j046N0423
14290B0871O0535K3958J0595O972O486p9938n4884m0192k0594O1786L3021l7366
14278h750o4169L242L0868L5656k463J09940J6454k4608n7101j132k9713J1831
14266B0055n55K5948k0218k0941j09774k1530K3518J3690o861j0929m366J4228
14254i7735k092q522N1269j0952J4441Q4049J1193j0955l0768J9239r415n5020
14242d5268J6499M1195J0740J1395O377l0878j4600M7905n3061o4856n470N3441
$$ plain form
14325 20811 7594 -30440 -40967 -50770 -45879 -10206 73443 89000 42504 -21931 -160476 -173078
14313 -173078 -151949 -158494 -125610 -75252 68165 100383 -8212 -72846 -84919 -75043 -53831
14302 -53831 -9072 -13147 -31592 -81468 -110720 -61339 8633 -55472 -28381 -28506 -29552 20871
14290 20871 81406 105364 115959 122931 129417 49479 -5405 -45597 -66191 -4405 28616 -8750
14278 -8750 -72919 -69677 -38809 -3153 -5616 104324 120778 96170 39069 37937 8224 20055
14266 20055 19500 45448 25230 4289 -105485 -127015 -103497 -89807 -96668 -107597 -111963 -97735
14254 -97735 -99827 -108349 -57080 -68032 -53591 30458 41651 30696 -72 19167 9752 -45268
14242 -45268 -28769 12426 23166 34561 40938 10060 -4540 43365 -9696 -74552 -80022 -26581
14230b6581J5507J1053k382k680K6018o964n140k3083j5791m0011r506j9953J0393
14217h9120J13957q00l0424q1181o1848o2406O258P5626O4887Q0993O0012K6837
14205A02791Q532k016q1111k4673m2917k4064N84O191P634O65M6878K2286j310
14192A9470m0073k2873M2110L2637j03634o7175P6944P3710J0410j4006P5984
14181H3504P917n1132l5464j9328j2654r093O3317N719N5902l600r2663J5542
14169G967m2912J3990M9465M5704M0333o6463l1740K1768L7527l5009L907J4848
14157E9385n9084o9864m4854J04538P6756K3780k356O352q6481k8117R057r094
14145a9982q177j7443K1563J3521P991j3528m0696K4858M0378j487r223m0835
$$ plain form
14230 -26581 -11074 -21 -2403 -5083 20935 13971 8831 -14252 -30043 -70054 -79560 -99513 -89120
14217 -89120 24837 24037 -6387 -87568 -149416 -211822 -205564 -129938 -65051 15942 75954 102791
14205 102791 111323 109307 28196 3523 -39394 -63458 -62874 -56683 -49049 -48384 -1506 20780 19470
14192 19470 -20603 -43476 -1366 31271 -72363 -139538 -62594 11116 21526 7520 83504
14181 83504 91421 40289 4825 -14503 -27157 -36250 27067 32786 88688 85088 -7575 7967
14169 7967 -34945 -20955 28510 74214 114547 48084 16344 38112 75639 40630 44537 59385
14157 59385 301 -69563 -114417 -9879 66877 90657 88301 94653 8172 -19945 -10888 -19982
14145 -19982 -28159 -45602 -24039 -10518 -2527 -16055 -56751 -31893 8485 6998 -2225 -43060
14133d3060M1230m1237K9729K163R032m6641o8709O553J5576L292J9360J9478
14121e3234j6956K4167p270L7978L6997k1258q866r1481P231M2086J7437o584
14109c9753n448Q3022N5917j8594p8144m4704o910j4168k5100p6682K2681P2035
14097g5848N4534j4728M5744O3766k9069m7257l338M752j3586K0835P016O9028
14085H1849N7203n4445p0594J2513J2388N7390l0663j9827k0509l0918O7478l7352
14073B4513r7955k6676k0507k8769K7803N9326M2939k0737r262J1399L2212M6925
14061D1211o0499k9988J7843n9010j8755M6136K7981k462k6642j80J6955p946
14049e5356K2547J6115k7485K3167K1970k4243P6o9110r0974J6370O2800L2995
$$ plain form
14133 -43060 -1830 -43067 -13338 -11175 -2143 -48784 -117493 -110940 -95364 -92072 -72712 -53234
14121 -53234 -70190 -46023 -53293 -15315 21682 424 -8442 -99923 -92692 -50606 -33169 -39753
14109 -39753 -45201 37821 93738 75144 -3000 -47704 -54614 -68782 -93882 -170564 -147883 -75848
14097 -75848 -21314 -36042 9702 73468 44399 -2858 -6196 -1444 -15030 5805 12821 81849
14085 81849 139052 84607 14013 26526 38914 96304 65641 45814 25305 -5613 61865 24513
14073 24513 -73442 -100118 -120625 -149394 -121591 -62265 -19326 -40063 -49325 -37926 -5714 41211
14061 41211 -19288 -49276 -31433 -90443 -109198 -63062 -35081 -37543 -64185 -64365 -47410 -55356
14049 -55356 -32809 -16694 -44179 -21012 958 -23285 -23209 -92319 -183293 -166923 -104123 -71128
14037g1128k825k9246l6219N6171M2131j1578R705K5998l3508n3689M7094N4117
14025b977o436m3215k430j5948J349N2273N5487k0052l2430m6598o5569L4777
14013i1769M2766L1506R584L2142j6597p7567k6959L2762L0735M4211J1300j3139
14001H975M2262J2300j0171m3966p2454l2949M7850M5610R29k4010J3685P664
13989d275J8516m1369r244k9297n4901Q3268n6540k0395k281j4740M4966J9941
13977f6351N4439K270J4746p1614o9423K6484N3591M5035n6464m3437O9463R7971
13965E6710n6909o4186k6365J2151L112o0948K2635P5901J8240J088L4883j8419
13953b107K8145p6044m4019j9084O0719K1085j2740M061j9813L2318N6982O339
$$ plain form
14037 -71128 -73953 -103199 -139418 -83247 -41116 -52694 -42989 -16991 -50499 -104188 -57094 -2977
14025 -2977 -9413 -52628 -55058 -71006 -69657 -17384 38103 18051 -14379 -60977 -126546 -91769
14013 -91769 -49003 -17497 -7913 24229 7632 -69935 -96894 -64132 -33397 10814 22114 8975
14001 8975 51237 63537 53366 9400 -63054 -96003 -48153 -2543 -1614 -25624 -11939 -4275
13989 -4275 14241 -27128 -36372 -65669 -120570 -37302 -93842 -114237 -116518 -131258 -86292 -66351
13977 -66351 -11912 -9642 5104 -66510 -135933 -109449 -55858 -10823 -67287 -110724 -41261 56710
13965 56710 -199 -64385 -90750 -78599 -75487 -136435 -113800 -37899 -19659 -18571 16312 -2107
13953 -2107 26038 -50006 -94025 -113109 -52390 -31305 -44045 -39984 -59797 -27479 29503 35842
13941C5842l5431q1055o449P295o454L9062N9906K1566o2705k2827J9882m9775
13929h1143l8145K4096P738K9470j8285n126L2564j8613o2427o4866J6736K8420
13917a49581M6664j7822l8524L6922P3286M0830k4721K1468l2905J07092K5940
13906H8649p1899m202l7005K2708j3403j3145j9717l9564k5034L2411O5727j3602
13894b8076k3866k132l089M3390M9714p641n8052j7576k213j2527p941q9784M534
13881a55259M3191N1908O2410n6609m8305N9583j0161M4976K6638Q975K6770j6818
13869C7299j1610p3301q4188P3671N4223L5242m6530p086j4033o1486l5791K5401
13857a08189L9057K8330l7421j8733O2647K2008K2642k7547j3553K9106m9318
$$ plain form
13941 35842 411 -80644 -87093 -79798 -86252 -47190 12716 34282 -28423 -51250 -31368 -81143
13929 -81143 -119288 -95192 -87454 -57984 -76269 -81395 -48831 -67444 -129871 -194737 -178001 -149581
13917 -149581 -102917 -120739 -159263 -122341 -49055 -8225 -32946 -11478 -44383 62709 88649
13906 88649 16750 12548 -24457 -1749 -15152 -28297 -48014 -87578 -112612 -80201 -14474 -28076
13894 -28076 -51942 -54074 -57163 -13773 35941 28300 -29752 -47328 -49541 -62068 -70009 -159793 -155259
13881 -155259 -112068 -60160 2250 -54359 -102664 -43081 -53242 -8266 18372 27347 54117 37299
13869 37299 25689 -47612 -131800 -58129 -3906 31336 -15194 -22280 -36313 -97799 -133590 -108189
13857 -108189 -69132 -40802 -78223 -96956 -34309 -12301 10341 -17206 -30759 -1653 -50971
13846e0971m4742J66M4558l6188l2080o470M208J1494K2791k1572L9528j9854
13834h9132L7889O9513j7787j6839J5630l6769O7881M4102n2796n8446K9802J6004
13822I052p1461J4348l163m3324L9255L7752J2430k4356J8768O2935K3167l2794
13810D2609l7795k3592k097K2521p183k4302P236N6025j1458r7772p1173n9486
13798b06467P0430P2946O7971n5859o65k8821K7849O1872O1432n824k3698j1239
13786B9927p3216n7621K9755M1677n8126J4400N5584K3233j584P650N9240k7175
13774D3744q3494o1397N722M1164o078O1466L8514m333k7917k8540n6242N3489
13762b3902L9446J454j8983j3610p518K3337M5264L5604l1398m5434l8986J0662
$$ plain form
13846 -50971 -95713 -95547 -50989 -87177 -119257 -125727 -121519 -110025 -87234 -108806 -69278 -89132
13834 -89132 -51243 18270 483 -16356 -726 -37495 30386 74488 21692 -36754 -6952 9052
13822 9052 -62409 -48061 -51224 -94548 -55293 -17541 -5111 -29467 -10699 52236 75403 42609
13810 42609 4814 -18778 -20875 1646 -5537 -29839 -22603 33422 21964 -75808 -146981 -206467
13798 -206467 -136037 -63091 4880 -50979 -51644 -80465 -52616 9256 70688 64864 41166 29927
13786 29927 -43289 -100910 -71155 -29478 -87604 -73204 -17620 5613 4029 11679 70919 43744
13774 43744 -39750 -101147 -95425 -54261 -60339 1127 39641 35308 7391 -21149 -77391 -23902
13762 -23902 15544 16998 -1985 -15595 -23113 224 45488 81092 49694 4260 -34726 -24064
13750b4064J2164L4208m1723k1644l7295j8425J7684K3206L4701P4702m21j2498
13738D0595m3708M9589O6200q166q4080j04194m9712O0104M7820j5402M3157M8568
13726E0771j4388o3904o2453M6288l8283J2077Q6755K2335j0162k6489K5236M5345
13714G3128k2898l1600l2459n0723k0532L7836O67l5043K5866K2585K8183K1592
13702A6602M9669k0370p7743M577M1436j317j3642k5394l1253l8284M2981P264
13690d5474k0308L8488K9787k2613p2470K0356L6926Q548r009j0437l7468k5706
13678a09380o4449P422R74N0994P5400K256k7644l4521n293K6509N8830J4901
13666d001j3604L5613J2091J2254j5852j0788M5111M611r1369j0546L8860q915
$$ plain form
13750 -24064 -11900 22308 -19415 -41059 -78354 -96779 -79095 -55889 -21188 53514 53093 40595
13738 40595 -3113 46476 112676 104510 20430 -83764 -133476 -73372 -25552 -40954 2203 50771
13726 50771 36383 -27521 -89974 -43686 -81969 -69892 16863 39198 29036 2547 27783 73128
13714 73128 50230 18630 -13829 -64552 -85084 -47248 -46581 -81624 -55758 -33173 -4990 16602
13702 16602 66271 45901 -31842 -27265 14171 12854 -788 -26182 -57435 -95719 -52738 -45474
13690 -45474 -65782 -27294 2493 -20120 -92590 -72234 -35308 -26760 -35769 -46206 -83674 -109380
13678 -109380 -173829 -166407 -165433 -114439 -39039 -36783 -64427 -98948 -104241 -77732 -18902 -4001
13666 -4001 -17605 18008 30099 42353 26501 15713 60824 65435 -25934 -36480 2380 -6535
13654f535k7992O147K600j9696j1475R173J2346p373L1949o3704q6330m2659N7516
13641a46033P0568K0910l9555k4058J9267K6416L5851J9776j1582k3644k2998
13630g5082J1491j0403l7373n0333j297J1942R1510J1300j834j6294K1414N0061
13618E102J3280j3658k5815o209K4492j7103m6330n1845j0195j0914K7320J1648
13606a00227j5839p627J3486L5421R2146J5908j2002P948j1720k8565m0435n1427
13594a02933J9055O1346P670J827o445j5345J7397k6988K7130N5756J0780r7n0806
13581a653P253l1327n855k3466L8023P3851j0477o4178N3403N0876o3538n2744
13569b9832j1070N3802q855J3677m5776P1452L6002k7007k1532l471L3619R014
$$ plain form
13654 -6535 -34527 -28380 -25780 -45476 -56951 -47778 -35432 -42805 -10856 -74560 -160890 -203549 -146033
13641 -146033 -75465 -54555 -94110 -118168 -98901 -72485 -36634 -16858 -28440 -52084 -75082
13630 -75082 -63591 -73994 -111367 -161700 -162997 -151055 -59545 -48245 -50079 -66373 -44959 5102
13618 5102 18382 4724 -21091 -27300 -2808 -19911 -66241 -118086 -128281 -139195 -111875 -100227
13606 -100227 -116066 -123693 -110207 -74786 17360 33268 21266 29214 17494 -11071 -51506 -102933
13594 -102933 -83878 -22532 -14862 -13035 -19480 -34825 -17428 -44416 -17286 38470 49250 49153 -1653
13581 -1653 5600 -25727 -31582 -55048 -17025 56826 46349 -17829 35574 86450 22912 -29832
13569 -29832 -40902 12900 4045 17722 -28054 43398 79400 52393 30861 27390 61009 70023
13557G0023k2735o0158O0386l9721n2245m6315N9157L219k4322j0413O0672Q145
13545E693k7513p753J1258K2684P516m9784P6977J7992l0600m6523M5185K1744
13533D6876l8199n978L1651j6832n7875l4227j3527M1144l3206m193O5366J8192
13521h08K722J4657J9321J4308m5786P4437n11l392r871j6561n2041k8017J9558
13508a1984J398M3813Q711p428Q9697M7457j4690n2749o8117j0645j6841M2122
13496E0744J6790J4932J3861m8047m3186J9945k4574M894M8634P6214M5742n7087
13484A18862p9048k9950m2919l0693l0845l0653K4912R3234N1438j1816k5442
13473G080k2324L0741M0881p0880n1130n5381o0952K2263P7044P0225J1662M8893
$$ plain form
13557 70023 47288 -12870 47516 7795 -44450 -90765 -31608 -28389 -52711 -63124 -2452 5693
13545 5693 -21820 -29573 -18315 4369 11885 -37899 39078 57070 26470 -20053 25132 46876
13533 46876 8677 2699 34350 17518 -40357 -74584 -88111 -46967 -80173 -84366 -19000 -808
13521 -808 1914 16571 35892 50200 4414 78851 78340 74948 65077 48516 -3525 -31542 -11984
13508 -11984 -10586 33227 41938 34510 124207 171664 156974 104225 36108 25463 8622 50744
13496 50744 67534 82466 96327 48280 5094 25039 465 5359 53993 130207 175949 118862
13484 118862 39814 9864 -33055 -63748 -94593 -125246 -100334 -7100 44338 32522 7080
13473 7080 -15244 15497 56378 -14502 -65632 -121013 -181965 -159702 -82658 -12433 -771 48122
13461D8122q377l7528r731n8979l7832O7120m7239O6286M8070j6489m9141L9993
13449D275N765j0185k1056L9184j9517o824L4670q861l6506k3006n1317q791l4305
13436a36474L0061Q1504J9896L0075l3915j7828k9235R572k245L420m9846k0686
13424a15701M3459J2275L1148K402l3914j1253l0827j3302L7892J046p432L225
13412h0982N0657J8085q670j7005Q631R5748K864k3969P5994j8286o1999m844
13400C6224j13p5754l9772P751K5099j410M6279O4313P918p8949k4853J3668M555
13387a5044k2481M9750n894o4957L2428J6324M2456o1216n5571M3216P6177j2863
13375B2325L528n1252r2415k827O9533L7529l0880q829L3713L2827k1926J8644
$$ plain form
13461 48122 39745 2217 -7514 -66493 -104325 -37205 -84444 -18158 29912 13423 -35718 4275
13449 4275 10040 -145 -21201 17983 -1534 -8358 26312 17451 -19055 -42061 -93378 -102169 -136474
13436 -136474 -106413 -24909 -5013 25062 -8853 -26681 -55916 -46344 -48589 -45169 -95015 -115701
13424 -115701 -72242 -59967 -28819 -26417 -60331 -71584 -102411 -115713 -77821 -76775 -84207 -80982
13412 -80982 -30325 -12240 -20910 -37915 -29284 66464 69328 45359 121353 103067 41068 36224
13400 36224 36111 -39643 -79415 -71664 -46565 -47975 -1696 62617 70535 -8414 -33267 -19599 -15044
13387 -15044 -37525 12225 6331 -58626 -26198 -9874 32582 -28634 -84205 -40989 35188 22325
13375 22325 25853 -25399 -117814 -120641 -51108 -13579 -44459 -53288 -19575 13252 -8674 9970
13363I970K9167m2078k7098n696J6772O0517l5913p3944N2954P7282J0054j9235
13351E2752O0123m7476l483l147Q84n7433m4466l0640O951J8208M0064o3066N7967
13338a2762N8692j4855K1390l6615n4659j09555l7500J03175P7750o318q558o6607
13326h6422j2578M0240j9237j2627Q2377J4934J5035j6291K9381J9021K399J3592
13314F9824o5120m0131K7698P2245N9839m707K495l3019j2081J6836m7918j7887
13302B8074k3714k4317K0111m3945M0141P0009j8484o3768q9142M1907J0893k5337
13290g7572N6783M606o6417o5022K3404K9527N2544j4702m4156L9332K7127J9398
13278a5148M002L5335J109J4679R2082j1625j37178m5415K2871l3996O892O9155
$$ plain form
13363 9970 39137 -2941 -30039 -35735 -18963 41554 5641 -68303 -15349 61933 71987 52752
13351 52752 112875 65399 61916 58769 59653 2220 -42246 -72886 -65935 -47727 -7663 -70729 -12762
13338 -12762 45930 31075 52465 15850 -38809 -148364 -185864 -82689 -4939 -11257 -19815 -86422
13326 -86422 -99000 -58760 -77997 -90624 -8247 6687 21722 5431 34812 53833 56232 69824
13314 69824 4704 -35427 -7729 64516 124355 119648 122143 89124 77043 93879 45961 28074
13302 28074 4360 -19957 154 -43791 -3650 66359 47875 -15893 -105035 -63128 -52235 -77572
13290 -77572 -20789 -16183 -82600 -147622 -124218 -94691 -42147 -56849 -101005 -61673 -34546 -15148
13278 -15148 -11146 24189 25298 39977 132059 120434 -16744 -62159 -39288 -73284 -66392 2763
13266B763O2078l697k3358k2809N3931m6015k3270K6838k506l8973K6224K6622
13254C7828M4593r9011k3103n004m2609N2970M6381M5976k8039j5263m1279o568
13242c3128M8926j8117j9356j082Q153J7054k4469l288l654K3438R7194K2635
13230A14306j8141k2721l5943L0491j9048m2829l1063L8714J9891l3971q1422
13219h1736n6535N2615K0065r302R599M2458M2814M7120J6309k0199k2974R556
13207D9790n0045m1364P8907Q6908j964q1884j8479k5268j9380J5432J4186K957
13195I796k6260N2375M7828k6l1108k3786L3402m7643J7521J0145J7548k4253
13183C5539m0232k0949o1617K0202K8117k2611J7828k2739r277N2654Q5116l138
$$ plain form
13266 2763 64841 61144 37786 14977 68908 22893 -377 26461 23955 -15018 11206 37828
13254 37828 82421 -16590 -39693 -44697 -87306 -34336 12045 58021 29982 14719 -26560 -33128
13242 -33128 15798 -2319 -21675 -22757 -14604 2450 -22019 -25307 -28961 -5523 91671 114306
13230 114306 96165 73444 37501 67992 48944 6115 -24948 13766 33657 -314 -81736
13219 -81736 -138271 -85656 -65591 -74893 -65294 -22836 19978 67098 83407 63208 40234 49790
13207 49790 -255 -41619 37288 124196 122232 40348 21869 -3399 -22779 -7347 6839 9796
13195 9796 -16464 35911 83739 83713 52605 28819 62221 14578 32099 42244 59792 35539
13183 35539 -4693 -25642 -87259 -67057 -38940 -61551 -43723 -66462 -75739 -23085 62031 58893
13171E8893n5776n001n3576L1293P9881n9670p1425j8648M8178K64k8320Q8487
13159A4580j3809r040j7299l7481k033K9591J12892N4181n3994m0715p0223k4381
13147e7731N5009k9262J9048K2923M8253j1421k9751q5246l0242K6834K0453L1068
13135b0065l3707L3012O7455l1284l2350j2020k7050n2614m7470J8270o5252K5258
13123a77817L5552O6312j092k8049K6928J7047J3261R236q964O6987K1136M379
13111D4916q1417q9213m629N2086M939j8199j4021K8853N0236m3687l8420J5205
13099i3351P149j1972o183N9370O096l114l6503j7079N1580M5958J5083P520M6644
13086G1198p4342k1831o725L532l8122J1765L0853k5146K7685J6117k4363q240
$$ plain form
13171 58893 3117 -1884 -55460 -24167 55714 -3956 -75381 -94029 -45851 -45587 -73907 14580
13159 14580 771 -8269 -25568 -63049 -65082 -35491 77401 131582 77588 36873 -33350 -57731
13147 -57731 -2722 -31984 -12936 9987 58240 46819 17068 -68178 -98420 -71586 -51133 -20065
13135 -20065 -53772 -20760 46695 15411 -16939 -28959 -56009 -108623 -156093 -137823 -203075 -177817
13123 -177817 -142265 -75953 -77045 -105094 -78166 -61119 -47858 -38622 -47586 19401 40537 44916
13111 44916 -36501 -125714 -130343 -78257 -73318 -91517 -105538 -76685 -26449 -70136 -108556 -93351
13099 -93351 -86202 -98174 -104357 -44987 -38891 -42005 -78508 -95587 -44007 1951 17034 24554 71198
13086 71198 -3144 -24975 -31700 -28168 -66290 -54525 -23672 -48818 -21133 -5016 -29379 -37619
13074c7619J7435L4238M1651k238m9626k2137l5972k4232R106L8953O7651k9595
13062G615r5876j5978L4489N5581J8614n3964L5310n516K1609J8574m2856l9754
13050f2152L4845K7435o7213O2318M8756k3246q5905j1209O2546j6452n8699k585
13038i1561O7959K2327k540O5819k8453n2752M5323R223j9286l5774K1894M4289
13026D6468L798Q4650N3774j8600n9514o2700p3078m0462J2728M7051M6712M3323
13014H4150J3059k8538m7707n4583J2732J9485o710L4766O22l2017L4623M7721
13002G7603k4591o1841o6149M6978j7829k0314l285N2286R462j9114M1067p705
12990F568r098P2230N5021L9636o3228o2501n5928M752J5370J4310L8274j5654
$$ plain form
13074 -37619 -20184 14054 55705 53467 3841 -18296 -54268 -78500 -69394 -30441 37210 7615
13062 7615 -88261 -104239 -69750 -14169 4445 -49519 -14209 -19725 1884 20458 -22398 -62152
13050 -62152 -27307 128 -67085 -4767 43989 20743 -65162 -76371 -13825 -30277 -88976 -91561
13038 -91561 -23602 -1275 -3815 62004 33551 -19201 26122 35345 16059 -19715 2179 46468
13026 46468 50266 134916 188690 170090 110576 47876 -25202 -65664 -52936 -5885 40827 84150
13014 84150 97209 68671 20964 -33619 -20887 -1402 -8112 26654 27276 -4741 29882 77603
13002 77603 53012 -8829 -74978 -28000 -45829 -66143 -69428 -17142 -7680 -26794 14273 6568
12990 6568 -2530 69700 124721 164357 101129 38628 -17300 -12548 2822 17132 55406 39752
12978C9752m673K2416k3076k3368l3332k7167J5061O72Q04R9668L8467j9481l879
12965H1864n303r308m8982K6954k6421q5480o0454j3655L6957M3587R085N525
12953d5631k932m3262j9850p194L4105k2222j5637N642p6450l5789k597Q0463
12941a51354Q3614l3921K1235N5051L0313m6460k0032J5449K6932K2234L5698
12930C8759p1026L8829j2576l7763O0086l985l8749R461q758m3695J9292k1028
12918g1153j9320N6022l1455o4744K1904M2805O6908P2709K756l156M3067K6772
12906A43115m6048p6798p1139n1424k6890K6493M5839M5290L5212K6159j3243
12895C6566q1596J091L9489P700L0070O3040r143l3289l714l745J4631K7813N436
$$ plain form
12978 39752 35079 57495 34419 11051 -22281 -49448 -34387 -33715 -32911 66757 105224 85743 81864
12965 81864 76561 67253 18271 45225 18804 -66676 -127130 -140785 -103828 -60241 -51156 -45631
12953 -45631 -48563 -91825 -111675 -118869 -84764 -106986 -122623 -116981 -193431 -229220 -231817 -151354
12941 -151354 -67740 -101661 -80426 -25375 4938 -41522 -61554 -46105 -19173 3061 38759
12930 38759 -32267 6562 -6014 -43777 16309 12324 -26425 -16964 -25722 -69417 -50125 -71153
12918 -71153 -90473 -34451 -65906 -130650 -108746 -65941 967 73676 76432 73276 116343 143115
12906 143115 97067 20269 -50870 -102294 -129184 -102691 -56852 -11562 23650 49809 36566
12895 36566 -45030 -43939 -4450 3250 33320 96360 87217 53928 50214 46469 61100 88913 94349
12882I4349l0062j3578P6792J2571l8055n8532L1453j475n0634l9419l1446o5935
12870a13971j4045K175N6657O4719L0036J5551N4085j02722o1028K7794L5298
12859e451P7378K1850o524o4940r6273n3941J4497M6555M668J5110K6749J7635
12847b687O899k6593L2765k232o0267o8773n0384L546N9649Q1294L1917p501m526
12834f893N249m8535Q1862J16256L3313k5276n905o2850o5119j0324J9934l2260
12822e48K1784M9517N2738k5994n0576m0995K7279K1942p8770p1372R534j892
12810h7353R7554L6521o972j4903n9215J9179M0373M3359n097j00761k4560K3815
12798c8060K8483j3047N4106n6748k9807N4772J27411N7860n5621n0414J106K7654
$$ plain form
12882 94349 64287 50709 127501 140072 102017 43485 74938 73463 22829 -16590 -48036 -113971
12870 -113971 -128016 -125841 -69184 -4465 25571 41122 95207 -7515 -68543 -40749 -5451
12859 -5451 71927 93777 87253 22313 -73960 -127901 -113404 -66849 -62181 -47071 -20322 -2687
12847 -2687 4212 -22381 10384 8152 -52115 -120888 -171272 -167726 -108077 -26783 5134 -2367 -6893
12834 -6893 -1644 -50179 31683 147939 181252 155976 150071 87221 22102 11778 31712 -548
12822 -548 21236 70753 123491 97497 46921 5926 33205 55147 -23623 -94995 -85461 -87353
12810 -87353 10201 46722 39750 24847 -34368 -15189 25184 68543 63446 -37315 -61875 -38060
12798 -38060 -9577 -22624 31482 -25266 -55073 -301 127110 184970 129349 78935 80041 107695
12786A07695J2459P438P1334o8841p6365p856k746q3580k2085q08R0571R5230
12774A22446K3682j3096l0362j5462N4341q1786m7382K294L1762q359n4265j4687
12762c0874J2929l0723l9429j3514O9576N6831K4230k4216K6024N5656K5491M4431
12750A76412m1782q4482R996J8902K9056j6152p606m3052J0346n597L0828L4462
12738A11331p6880l1201o441P7508P6296k1295l0051K3043r185q745l2022o1483
12726A0875p8352Q790N7747K8092L3046q919l612J3082L7599K4070J6253j5776
12714A22895j02502k0054R5745p8543j2917P9801J5624K6369j1384j4122k3171
12703G7741k3277L4910l1355L5103l2994K5052J80l4496o6461k090K383L4968
$$ plain form
12786 107695 120154 127592 198926 130085 53720 45864 43118 -40462 -62547 -63355 27216 122446
12774 122446 146128 133032 102670 87208 141549 59763 12381 14675 46437 38078 -16187 -30874
12762 -30874 -17945 -48668 -88097 -101611 -32035 24796 49026 24810 50834 106490 131981 176412
12750 176412 134630 50148 60144 79046 108102 91950 84344 41292 51638 46041 76869 111331
12738 111331 34451 3250 -3191 74317 150613 129318 99267 122310 113125 104380 72358 10875
12726 10875 -67477 -58687 -940 27152 60198 51279 47667 60749 98348 122418 138671 122895
12714 122895 20393 339 96084 17541 4624 84425 100049 126418 115034 100912 77741
12703 77741 54464 89374 58019 93122 60128 85180 85360 50864 -15597 -17687 -15304 19664
12691A9664K7521J7135q687j3542l1669J4579p097L3316j8913K3737O0746n0488
12679F6302q0329r0767j2043j6896j0943N1923J39170O9493L0637n1451k6003
12668F9093L9238J626l0289j2550p5197k9654P3759P3529n6317k6108O761O0627
12656I4518k4353j18139j1006J08859J5432Q86Q506M0875o865p055l9676o004
12644E5978r4968j1284N8599Q0476J07624M8332k0580j23993j01317K2689j3551
12633H005L527q619L3955N6496p6035k31L2270K4360l9016o2637l460O7220K8086
12620F3921m0815l6302J250K4282K9123K7913P376l330l1792N0821K1425l1678
12608H2194N471P8426k6343J1680K3799p8859k1579P311k086m7156n8487J467
$$ plain form
12691 19664 47185 64320 55633 42091 10422 25001 17904 51220 32307 56044 116790 66302
12679 66302 -14027 -104794 -116837 -133733 -144676 -92753 46417 115910 146547 95096 69093
12668 69093 108331 109957 79668 67118 -8079 -37733 36026 109555 53238 27130 33891 94518
12656 94518 70165 -47974 -58980 49879 65311 66197 74703 115578 108713 101658 61982 55978
12644 55978 -38990 -50274 8325 88801 196425 244757 224177 100184 -1133 21556 8005
12633 8005 11532 2913 36868 93364 17329 17098 49368 73728 34712 -27925 -31385 35835 63921
12620 63921 23106 -13196 -11946 12336 41459 69372 76748 73418 41626 92447 113872 82194
12608 82194 87665 166091 139748 151428 175227 96368 74789 82100 80014 32858 -25629 -24162
12596b4162O5205P5479o713k7251K7517l8787p2677J3551J6304k0645K9585j5784
12584B1622j5085L1896N5363L1921L9828L4537K2950J8440k3581o8964o2143o068
12572H0716M3464P1746k2336l9522k4365K4750J4778O218j2936j706m1786j1128
12560H7893j7786l0360J5732N0883N9136l7507k1031o699N9621n9086p336L6842
12548A30302O6443j4441l8044n676l515L919p1149k9851j0061n7060N2402M7984
12536G1253P197k462K4680K4830o816J9697j7481O5643M1460m379n0341L199k1269
12523A55211O487j07395J6288L7371n4300m4163N0763l4656l9327j9935P8461
12512D4805M5437k0568L962K5880J1467k3758R927N2112m678p947O3733l5567
$$ plain form
12596 -24162 41043 116522 109809 82558 110075 71288 -1389 12162 28466 7821 37406 21622
12584 21622 6537 38433 93796 125717 165545 200082 223032 241472 217891 148927 86784 80716
12572 80716 124180 195926 173590 134068 109703 134453 149231 155449 142513 140807 99021 87893
12560 87893 70107 39747 55479 106362 165498 127991 106960 100261 159882 100796 93460 130302
12548 130302 196745 182304 144260 138584 135069 138988 67839 37988 27927 -29133 23269 71253
12536 71253 78450 75988 100668 125498 118682 138379 120898 186541 228001 223622 173281 176480 155211
12523 155211 161698 54303 70591 107962 53662 9499 60262 25606 -13721 -33656 44805
12512 44805 90242 69674 73636 99516 110983 87225 97152 149264 144586 136639 200372 164805
12500A64805l0177J1600k1418N8139M9580k5023j04219k2523O1005L5725K394
12489A79888n1056N9839l947J564l6666J15045O1330O935J7055n0202n3286p2937
12477A73562K5010P85q9943n8628l7071K482Q2161j074M992L2111n2562J2986
12465I4811P9115J9703n2710M5697P1263R788l1444j6518n3924m4400O1853O9101
12453B52335J9751L633k1532j9946q4288r231O2005N9273p0813l0763n5331j5104
12441H9989l7526n503k6129O7881O5965j9220m5473J0667O8069l8205q24L2736
12429A62427q093j957l6167n495j9701q303M6764J8462N134P335O6749K45n7597
12416A69803r848k8523m1412k942M2752P5224K8599O103o1802Q50N9822k402k4652
$$ plain form
12500 164805 134628 146228 124810 182949 232529 207506 103287 80764 141769 177494 179888
12489 179888 128832 188671 184724 186288 149622 264667 325997 332932 349987 299785 246499 173562
12477 173562 198572 199357 109414 50786 13715 16197 98358 97284 102276 134387 81825 94811
12465 94811 173926 193629 140919 186616 257879 267667 236223 219705 165781 121381 183234 252335
12453 252335 272086 275719 254187 234241 149953 140722 202727 262000 191187 160424 105093 89989
12441 89989 52463 46960 20831 88712 154677 135457 89984 100651 168720 130515 129691 162427
12429 162427 154334 152377 116210 110715 91014 82711 129475 147937 153071 160406 227155 227400 169803
12416 169803 159955 131432 90020 87078 129830 205054 233653 239756 177954 178804 238626 236224 211572
12403B11572j9542k8027j02116J0379N1745P4114J7550L7516M546L5502k2974
12392B70265k3701l6565j1929J7541J6959j0347n4731L4579O9810r871n6447p50
12380B04813N9109J7000l1595j6329k1136q798L1576K4609l9917p1091p118N9799
12368B00922P4781k2547j7524l0476p8687J079O8145K6404L8501J4656L1738k7326
12356B79666k0932o4793q4627o837L4882M0112J7809K9072K3927p3698J2928L0464
12344B17973r980K2267J6108L661K5217J9700n0409p1906n3063L8701N7155L4794
12332B50218K3219K3000J0350P964M7079n824o4351j5651K3858R6719K8340m6711
12320C78210o6072o271N1839k1285l7466m7069L0469K7250O097O1265K7924J00280
$$ plain form
12403 211572 192030 164003 61887 72266 124011 198125 215675 253191 257737 293239 270265
12392 270265 246564 209999 198070 215611 232570 222223 167492 202071 271881 262010 205563 204813
12380 204813 263922 280922 249327 232998 211862 203064 234640 259249 219332 148241 141123 200922
12368 200922 275703 253156 235632 205156 126469 127548 195693 222097 260598 275254 306992 279666
12356 279666 258734 193941 109314 102477 137359 177471 195280 224352 248279 174581 187509 217973
12344 217973 207993 230260 246368 250029 275246 294946 244537 172631 119568 158269 215424 250218
12332 250218 273437 296437 306787 314751 361830 356006 291655 276004 299862 396581 424921 378210
12320 378210 312138 305867 357706 336421 298955 251886 282355 309605 315702 376967 404891 505171
12308E05171K3035p6592n2755m6953n5144n2753P225L5534N7594O1888k9392m3689
12296C33169L9164K5665M9308J5500Q292k9944q1515K7507R3121Q8357p3502o1614
12284D33508m6455K723N980J6388m6811k4603L2416K2222J3787K1202l9187k0130
12272C71040l0886K9708M4865p807J5581m678N8585L6464R351n155l5849j4218
12260D67001K2941P7352O5212j5773n0985J5690r287J7912M989l8565m0003J8078
12248E34562N2251R440K5203r641k1255r657j9465M6414K1329k0401l1338m5234
12236E32208Q536K7987M9082M3975M8318l1500m4584P852K1363j0214Q352O2419
12224G23794r248k2619k9336k7092m4723j8808R499j3702J8653R8048L6600L2323
$$ plain form
12308 505171 528206 451614 398859 351906 296762 244009 251234 286768 344362 406250 376858 333169
12296 333169 372333 397998 447306 462806 471098 441154 359639 387146 480267 568624 495122 433508
12284 433508 387053 389776 395756 412144 365333 340730 373146 395368 409155 430357 391170 371040
12272 371040 340154 369862 414727 406920 422501 417823 476408 512872 522223 517068 481219 467001
12260 467001 489942 567294 632506 616733 565748 581438 572151 590063 595052 556487 516484 534562
12248 534562 586813 596253 621456 611815 590560 580903 561438 607852 629181 608780 577442 532208
12236 532208 540744 568731 617813 661788 710106 678606 634022 641874 663237 653023 661375 723794
12224 723794 714546 691927 662591 635499 590776 571968 581467 567765 586418 684466 721066 753389
12212G53389q565n6750K3955K9633j7819k981N188R744J8097k1909Q0371P8371
12200H90724K4050l6537k5569o5148r045P4169N888K8537j6920m6551r851L4553
12188H48300N6985J7730J7986L13n108K704M6882l8919l930m270m2511P0898K4855
12175I91915m1857j34493J5199O5805j718K1135K3879K9635j4745m9887P5429
12164I80297P3648m4195l7096j5888N1896K8221L474L9550K3103p615L6604L233
12152A135232l0868o938K2157K848k3548L633P8823N3530M7815M7106j4467J5596
12140A330919L5313j7342K4733k6957m6188N0442P0696J6393m4457m3337j6432
12129A333783L3388Q4036P4907L7153r779o1268l4565M8655k1592N5942Q8378
$$ plain form
12212 753389 744824 688074 712029 741662 723843 720862 726050 735794 753891 731982 812353 890724
12200 890724 914774 878237 852668 787520 778475 852644 858532 887069 870149 823598 813747 848300
12188 848300 905285 923015 941001 941314 936206 938910 985792 946873 942943 938673 896162 967060 991915
12175 991915 950058 815565 830764 896569 894851 915986 939865 969500 954755 904868 980297
12164 980297 1053945 1009750 972654 956766 1008662 1036883 1040357 1079907 1103010 1095395 1131999 1135232
12152 1135232 1104364 1097426 1119583 1122431 1098883 1102516 1181339 1234869 1282684 1329790 1315323 1330919
12140 1330919 1366232 1348890 1373623 1346666 1300478 1350920 1421616 1438009 1393552 1350215 1333783
12129 1333783 1367171 1451207 1526114 1563267 1553488 1492220 1457655 1506310 1484718 1540660 1629038
12118A629038M7924J5948J7051k8291r333m8759n4830M655L2312Q4625P8034K8746
12106A797120k6921L6606L9946r364M4665N2005L5854k2645N947O199M9491K2383
12094B031286L773k2754O6360P751K0106L257o192P6006J78507N4798N6124o4024
12082B404998K9201j337n322Q6408J35937N8238J4195j1793J3229L317R0337J9684
12070B837092j9485K9606M6977Q7037k2638L2712J15361O0620J12151P3117P0176
12059C422726P050J4362M0499J0601J5593N2592Q9607O0823N0349N1244L0521
12048C845967N7531J15175Q3154M3307J54716P2867L3866K6182O5702R0350J12448
12037D701265M9740N0767J14575O9885J04375Q5118Q2802R2289P3045P4977P6303
$$ plain form
12118 1629038 1676962 1692910 1709961 1681670 1672337 1623578 1568748 1573403 1605715 1690340 1768374 1797120
12106 1797120 1770199 1806805 1846751 1837387 1882052 1934057 1969911 1947266 1953213 1959412 2008903 2031286
12094 2031286 2035059 2012305 2078665 2086416 2106522 2109779 2103587 2179593 2358100 2412898 2469022 2404998
12082 2404998 2434199 2432862 2427540 2513948 2649885 2708123 2722318 2710525 2723754 2727071 2817408 2837092
12070 2837092 2817607 2847213 2894190 2981227 2958589 2991301 3106662 3167282 3279433 3352550 3422726
12059 3422726 3429776 3444138 3484637 3495238 3510831 3563423 3653030 3713853 3764202 3815446 3845967
12048 3845967 3903498 4018673 4101827 4145134 4299850 4372717 4406583 4432765 4498467 4588817 4701265
12037 4701265 4751005 4801772 4916347 4986232 5090607 5175725 5258527 5350816 5423861 5498838 5575141
12026E575141P5292J02547J43747J57208J22430J20389J28351J19863J66458J10980
12016F822406J47707J47630Q1804J19430K06508J06573J64232J63116J87579J54058
12006H301043J84470J68187K02419J56595J56305K22119K05788K95857K89800
11997A0182583K22124K13277K04056K23761J94448K04379K83275K54024K65305
11988A2247232K67613K98012L28809L55851L32081K90458L04031L07051M06361
11979A5137499L97508L94963L62518M41679M56168M51293M39233M07204M65529
11970A8953594M55687M43935M69400N12056M99781M73408M99593M90008N25401
11961B3322863N45775N60809O03476N74541N50981N17567M87791N19821O25440
$$ plain form
12026 5575141 5650433 5752980 5896727 6053935 6176365 6296754 6425105 6544968 6711426 6822406
12016 6822406 6970113 7117743 7199547 7318977 7525485 7632058 7796290 7959406 8146985 8301043
12006 8301043 8485513 8653700 8856119 9012714 9169019 9391138 9596926 9892783 10182583
11997 10182583 10404707 10617984 10822040 11045801 11240249 11444628 11727903 11981927 12247232
11988 12247232 12514845 12812857 13141666 13497517 13829598 14120056 14424087 14731138 15137499
11979 15137499 15535007 15929970 16292488 16734167 17190335 17641628 18080861 18488065 18953594
11970 18953594 19409281 19853216 20322616 20834672 21334453 21807861 22307454 22797462 23322863
11961 23322863 23868638 24429447 25032923 25607464 26158445 26676012 27163803 27683624 28309064
11952B8309064N44343N93445N87050M10199M29090N72352N36521N08451M10817
11943C2901332L85906L63378K50963L45431L24506L19773K70551K16007J68658
11934C5546505J72900J00853O8372o49K2641k0186p2619j90859j87120j58550
11924C5281288j92841k11827k90187l88516l13162k64956l77239m14965m37993
11915C2389602m23074m27382l80582m76541n60057m27416m75084m86142m49178
11906B8284146m45925n46809n92069m70079m38802n24035m52383m26519l88638
11897B3998887m85318n09767n23239m66675m09910m27094m42897m03190l49216
11888A9981581l94487l32883l36258l20279l90551m14650l41750l04295l40068
$$ plain form
11952 28309064 28853407 29446852 30033902 30444101 30873191 31445543 31982064 32490515 32901332
11943 32901332 33287238 33650616 33901579 34247010 34571516 34891289 35161840 35377847 35546505
11934 35546505 35719405 35820258 35888630 35887981 35910622 35890436 35817817 35626958 35439838 35281288
11924 35281288 35088447 34876620 34586433 34197917 33884755 33619799 33242560 32827595 32389602
11915 32389602 31966528 31539146 31158564 30682023 30121966 29694550 29219466 28733324 28284146
11906 28284146 27838221 27291412 26699343 26229264 25790462 25266427 24814044 24387525 23998887
11897 23998887 23513569 23003802 22480563 22013888 21603978 21176884 20733987 20330797 19981581
11888 19981581 19587094 19254211 18917953 18597674 18207123 17792473 17450723 17146428 16806360
11879A6806360l03466l65627k90209k49511k41209l38311l39538k82149l17828
11870A4078512k05875k56153k63569k52558k37113j84920l02095l54429k99898
11861A1721902j97894j85118j96107j28471j74226k08092j63773j40997j46961
11852A0180263k19856j64348k23126k04125j20171j18636j77087j35965j82003
11843H634946k03031j22397j00319j99361j26261j06152l1204j02948k37018j31477
11833G274778r8533k07873j72000n0898j38036j13422r3694q4261p3483p7433
11823F165145j02104q1327n7184L01n0403n6628r8302j31390j08450r2387j13693
11812E273578j08915m4568p0313j09922j11369m1442l9776l230l3905j25565n2855
$$ plain form
11879 16806360 16502894 16137267 15847058 15597547 15356338 15018027 14678489 14396340 14078512
11870 14078512 13872637 13616484 13352915 13100357 12863244 12678324 12376229 12021800 11721902
11861 11721902 11524008 11338890 11142783 11014312 10840086 10631994 10468221 10327224 10180263
11852 10180263 9960407 9796059 9572933 9368808 9248637 9130001 8952914 8816949 8634946
11843 8634946 8431915 8309518 8209199 8009838 7883577 7777425 7746221 7643273 7406255 7274778
11833 7274778 7176245 6968372 6796372 6745474 6607438 6494016 6400322 6316061 6242578 6165145
11823 6165145 6063041 5981714 5924530 5924831 5874428 5817800 5719498 5588108 5479658 5387271 5273578
11812 5273578 5164663 5120095 5049782 4939860 4828491 4787049 4747273 4744043 4710138 4584573 4531718
11801D531718o2867o3343j14910p5828n9115n4143k592j05598j12249q019L6200
11790C909254J516q2054o0682o0071j01650r0020k2990m6282p5097l9214Q096
11779C340806k4847L735o1275r2287p6304p5960m1278M3033o1164m4082n9264
11768B851113r6797j8674N682j6203k8886k2582k4305p0621l5040o31j8643k1572
11756B502841k2459k6456M329k9027q723K4894j6057p8408m4407o9921J255J4164
11744B252025r4087n3482Q7166K5707l4056q6738m3759n2756N4206J04225l8770
11733B119681j10188q2042M94j0615l2770m6403p5243K787K7306L5152J857o4057
11721A765959k9242j5878p323p151j398L3126k0128r4564l2260J2409k3031K1131
$$ plain form
11801 4531718 4468851 4405508 4290598 4214770 4155655 4101512 4098920 3993322 3881073 3873054 3909254
11790 3909254 3910770 3828716 3768034 3707963 3606313 3516293 3493303 3447021 3371924 3332710 3340806
11779 3340806 3315959 3319694 3258419 3166132 3089828 3013868 2972590 3015623 2954459 2910377 2851113
11768 2851113 2754316 2735642 2741324 2725121 2696235 2673653 2649348 2578727 2543687 2543056 2524413 2502841
11756 2502841 2480382 2453926 2458255 2429228 2420505 2445399 2429342 2350934 2306527 2236606 2237861 2252025
11744 2252025 2157938 2104456 2191622 2217329 2183273 2096535 2052776 2000020 2054226 2158451 2119681
11733 2119681 2009493 1927451 1927945 1917330 1884560 1838157 1762914 1765701 1793007 1828159 1830016 1765959
11721 1765959 1736717 1720839 1713516 1706365 1704967 1738093 1717965 1623401 1591141 1603550 1580519 1601650
11709A601650n8444k9260j6950j02320m8719m0641k2726K4590O9707L2972j3923
11698A395936j6660O020r2040k6685O7595j4858p816O044r1145m0236m9548L4422
11686A171029R0229L1760m7882l863M1028p5652j44232n4395K9727j3079L2600
11675A057270L8455K82o6905K1903K5375j9411K948K3490k0302n0416K2864K0351
11663A055904J2690K0787l6279n0278k6800n1090j8489j9005N037N1896K9211
11652I73584J0314R883J1178M9752J1070k1042j8258K3804M5793l5341r9514l6666
11640I24557O6680L7631J04955J43537J23174K1086L476p4587k3052k5981j43380
11629A158096r5827k1166q2068j05889n416q781o628j9424L006n2678K991j8062
$$ plain form
11709 1601650 1543206 1513946 1496996 1394676 1345957 1305316 1282590 1307180 1376887 1409859 1395936
11698 1395936 1379276 1385296 1293256 1266571 1334166 1319308 1311492 1317536 1226391 1186155 1136607 1171029
11686 1171029 1261258 1293018 1245136 1241273 1282301 1206649 1062417 1008022 1037749 1024670 1057270
11675 1057270 1095725 1096007 1029102 1051005 1076380 1056969 1059917 1083407 1063105 1012689 1035553 1055904
11663 1055904 1068594 1089381 1053102 1002824 976024 924934 906445 887440 892477 944373 973584
11652 973584 983898 993781 1004959 1054711 1065781 1044739 1026481 1050285 1096078 1060737 961223 924557
11640 924557 991237 1028868 1133823 1277360 1400534 1421620 1425096 1350509 1327457 1301476 1158096
11629 1158096 1062269 1041103 959035 853146 847730 838949 832321 812897 815903 763225 766216 748154
11617G48154q6804j0801k017K1697K1623m920l6760m3775J5844O1383K2169j2117
11605F93676j0716k6716K9624p554m6243o7948j0564M6280o1573L0278J09130
11594F77674J3239p7477n0616m3754N8480J3150r700Q604P6541k5650m0199o8581
11582E31711n5217l154q814J5005P2661J274l3055q458K5100L9119j1997M539
11570E68714j4755K5799K3658m5288K1852j7513l4k3318k1712j272r56j6836J5390
11557E13729n4233n0071K0604l9957J1276P4366P0R709M1854p0635r9271R699
11545C67140M1491j7726q1989m13L8995r212n8847J45604J11066K7836n7759q4200
11533D21986m2396n2196k6530K0556R3307m4326j7105k4280j344M4897J7744L5547
$$ plain form
11617 748154 661350 650549 648532 670229 691852 686932 650172 606397 622241 683624 705793 693676
11605 693676 682960 656244 685868 678314 632071 564123 553559 599839 538266 568544 677674
11594 677674 690913 613436 562820 519066 577546 590696 580996 589600 666141 640491 600292 531711
11582 531711 476494 473340 464526 479531 552192 553466 520411 511953 537053 576172 564175 568714
11570 568714 553959 579758 603416 558128 579980 562467 562433 539115 517403 516131 515175 498339 513729
11557 513729 459496 409425 430029 390072 401348 475714 475784 485493 527347 456712 357441 367140
11545 367140 408631 390905 308916 308503 347498 338286 279439 425043 536109 563945 506186 421986
11533 421986 379590 327394 300864 321420 414727 370401 353296 329016 327672 372569 390313 425860
11521D25860j1532J282K1929p118K6246L4586k7969l6458l7731n9961L5601M8208
11509D12943n578m7415k2564L765j9017J1028k0226O592O2192j8337M586m596
11497C63373L6285o683r6517o4628L8419P7674J905m1256J5860L1666m2582n1678
11485B61838p8794J1196J5200m2175M2526N0693J9968r381J5169M5036j1958j0832
11473C08486L5715o140K5507k2904n0040m4701k3772k8958o1053N6128R5221K3918
11461C07407K9487j6945r316k752l6158n4453j4896j3462M3600L1511J5740J3479
11449B93242m1402n0628J6680J047k0346N5885O1687l812Q217L383j9273J2597
11437C17277n5389M601j681o5308m6477L609O4506K8653k9216l0323M1386j3909
$$ plain form
11521 425860 414328 415610 437539 430421 456667 491253 463284 426826 389095 329134 364735 412943
11509 412943 407365 359950 337386 341151 322134 333162 312936 319528 381720 363383 367969 363373
11497 363373 399658 392975 296458 231830 270249 347923 349828 308572 324432 356098 313516 261838
11485 261838 183044 194240 209440 167265 209791 260484 280452 271071 286240 331276 319318 308486
11473 308486 344201 338061 363568 340664 290624 245923 222151 193193 132140 188268 283489 307407
11461 307407 336894 319949 310633 307881 271723 217270 202374 188912 232512 264023 279763 293242
11449 293242 251840 201212 217892 218939 198593 254478 316165 312353 320570 323953 304680 317277
11437 317277 261888 266489 264808 199500 153023 156632 221138 249791 220575 190252 231638 217729
11425B17729j2684K23q016k2972R513p091r980L7165N7198j3227m4390m5330m1854
11412A16284m0844N3469P4801K6563M94N015k0464m9005P449J458p6311L0306
11400A29215N8763l279l2229k9858K96L1504K2808n6620j8965Q3270p868l4947
11388A42090j3915N2251K2796K7603q0388n4711O8111M9418J638l8774k7613K5858
11376A74364l2601m228P3122N3599l3933m6156J6322K9111o864p0581n2141J8070
11364A18084K5324M6471o6948m4597j3226Q4403N6023N278j7412N820P855j0004
11352A97071q223j1225m6135K7822J3425J3763k3626J1396J9934K5452k5710m217
11340A89727m1792n3841K7509L3525K6117K1631l31k5665o6768K2908J05138N5507
$$ plain form
11425 217729 205045 205268 197252 174280 183793 176702 166722 203887 261085 247858 203468 158138 116284
11412 116284 75440 128909 203710 230273 230767 235782 215318 166313 173762 175220 98909 129215
11400 129215 187978 184699 152470 122612 122908 154412 177220 120600 101635 184905 177037 142090
11388 142090 128175 180426 203222 230825 150437 95726 163837 213255 214893 176119 148506 174364
11376 174364 141763 137535 210657 264256 230323 184167 200489 229600 222736 152155 100014 118084
11364 118084 143408 189879 122931 78334 65108 149511 205534 210812 193400 199220 207075 197071
11352 197071 188848 177623 131488 159310 172735 186498 162872 174268 194202 219654 193944 189727
11340 189727 147935 94094 121603 155128 181245 202876 202545 176880 110112 133020 238158 293665
11328B93665M773k2401l8339l515M299m0805p496N0583k1230j5951K331R011l9360
11315A75565j2653k8371j7739m5520L482m6493J8842P524m7058J3046J6304N4091
11303I1020j9179k4944P735O9685L1258J0806l3511o587j0655j0552p207K6893
11291A24762J7021J6199P090j6687q508M7579l7737l7230P870N779L6268j1088
11279A51318P330k0484j4432K521j8696J080N264L4021M0853l2024k2429j9883
11267A14439M766N560j2207L2920K712l7622n9981k4728L0416J5346q0079J0369
11255A911N9107k9998O2765Q9193m3412j3325L1450l9778l3689r315k5423k3653
11243B5833J3098L1480k7222k0459N7054O1368k658j7583K2951J4662K3142L2286
$$ plain form
11328 293665 298438 276037 237698 234183 238482 197677 190181 240764 219534 203583 205914 214925 175565
11315 175565 162912 134541 116802 71282 74764 28271 47113 54637 7579 20625 36929 91020
11303 91020 71841 46897 54632 124317 155575 166381 132870 126283 115628 105076 97869 124762
11291 124762 141783 157982 165072 148385 139877 187456 149719 112489 120359 126138 162406 151318
11279 151318 158648 138164 123732 126253 107557 108637 113901 147922 188775 156751 134322 114439
11267 114439 119205 124765 112558 145478 148190 110568 50587 25859 56275 71621 -8458 1911
11255 1911 61018 31020 93785 182978 139566 126241 157691 117913 84224 74909 49486 25833
11243 25833 38931 70411 43189 22730 79784 141152 138494 120911 143862 158524 181666 213952
11231B13952L549o305n6253L347J3872j10189q9540L245n0409k8476O2307Q2456
11219D1556O3664q148n9932l6225m157L289j7650J5036K7693M3113j8290r346
11207D0603J3237M1348k2226j1285j5105L9530R234l1736l3339j1485l8547K3405
11195C634J22564R51k9916L8971K2537K686m776o9271k4485j7274l856L5068l4730
11182D2103l5919M317L2903K9501k6574O126n222Q281j689j1894k4579K7049L0450
11169G4853K9278k0981j5121k3052m9786M0817K6087k5510L1720L9518P2730m5029
11157A35524j10636J0343Q1809J7634p346l6800j01647j5639j3025l844j5760
11146e9387M2117M7910j8149k5711N3421N6947M3670j2423m2010m7074q447K6465
$$ plain form
11231 213952 217501 211196 154943 158290 172162 61973 -27567 -24322 -74731 -103207 -40900 41556
11219 41556 105220 97072 37140 915 -3242 47 -17603 -2567 25126 68239 49949 40603
11207 40603 53840 95188 72962 61677 46572 86102 95336 63600 30261 18776 -19771 3634
11195 3634 126198 127149 97233 136204 158741 161427 156651 87380 62895 45621 41765 76833 42103
11182 42103 6184 10501 43404 72905 46331 52457 47235 55516 53827 41933 17354 44403 74853
11169 74853 104131 83150 68029 44977 -4809 36008 62095 36585 68305 107823 180553 135524
11157 135524 24888 35231 117040 134674 127328 90528 -11119 -26758 -39783 -43627 -59387
11146 -59387 -17270 30640 12491 -13220 40201 97148 140818 128395 86385 39311 30864 57329
11134E7329k9081L6874L7844N873K1470l0519o767n5279n315M4980P377o6897
11122A7889j9476N1610m8792j9464N0061Q7629J1368j9212m0674m0983j8127J4363
11110B6192j4632N927J2555n1672M0817J5802j505J1592p4456L2622N8042K0659
11098H1943j3527n7920j0844K4678N2321k0458j8280J3735j1226j1328k2844j5121
11086h871m2440L7927L8186N8028J8680N2132q9821n3644L4016M331n5784J8802
11074A1542j2089L6444p17K3101j3864l0550L327l3760K094o6044j3486L4978
11062e9024Q200j1881K1020N7139N9194L4752J0539M1157o6540k9724l9485p4451
11050d9104n5470O865Q2809O2429n223k0326K4301K7266q34j5856n8962O6535
$$ plain form
11134 57329 28248 65122 102966 108839 130309 99790 93023 37744 32429 77409 84786 17889
11122 17889 -1587 50023 1231 -18233 31828 119457 130825 111613 70939 29956 11829 26192
11110 26192 11560 17487 30042 -21630 19187 34989 33484 45076 -29380 3242 61284 81943
11098 81943 68416 10496 -348 24330 76651 56193 37913 51648 40422 29094 6250 -8871
11086 -8871 -51311 -13384 24802 82830 101510 153642 63821 10177 44193 48524 -7260 11542
11074 11542 -547 35897 35180 58281 44417 13867 17194 -16566 -14472 -80516 -94002 -59024
11062 -59024 -50824 -62705 -41685 15454 74648 109400 119939 161096 94556 64832 25347 -49104
11050 -49104 -104574 -97709 -14900 47529 42306 21980 46281 73547 72713 56857 -2105 64430
11038F4430P0846l3166k2796j5118L715O5767K1337O5349l791K4493K5294J02651
11026C69011P7394M2004K5047k4289j23624o7599j5326k4035L4128K7459N4819
11015C74989J7259M5654L9383J9411n3359J8850j4138k2831m8837j04044J6129
11004B88466R030K081k3348K7824M3722J7421K397k9599j8657j1513m3580O051
10992B70295J0004m1338m8315Q1399M5764j14923p5858k4182m1380j9721N61j7565
10980B4741r931O2669L417M2792L3214o3400n0062L728j7876J9828n1450m6284
10968d8614L2945L6239M3199M6097R161K3121K0591n5783q3224k6983k0269n2474
10956g5994M1801k613L1948m829N1394l710n7172q917R071Q00O7835q910p0647
$$ plain form
11038 64430 135276 102110 79314 64196 67911 133678 155015 220364 216573 241066 266360 369011
11026 369011 446405 488409 513456 489167 365543 297944 282618 258583 292711 320170 374989
11015 374989 392248 437902 477285 496696 443337 462187 448049 425218 376381 272337 288466
11004 288466 297496 299577 276229 304053 347775 365196 367593 337994 319337 307824 264244 270295
10992 270295 280299 238961 190646 272045 317809 202886 127028 102846 61466 41745 42306 24741
10980 24741 14810 77479 80896 123688 156902 93502 43440 47168 29292 49120 -2330 -48614
10968 -48614 -15669 20570 63769 109866 119027 142148 162739 106956 23732 -3251 -23520 -75994
10956 -75994 -34193 -36806 -4858 -9687 41707 37997 -19175 -28092 -19021 -18221 49614 40704 -29943
10943b9943O845M443j2489j1510j8882m3032O3416P9880m3335M9021m0972o6429
10931f2987n999L615O98k6064K6469J034N068L6063Q4811j6951n868K4780L6606
10918A01275r978o1066k2922j209K886j394j1974K1278J3054Q1L5030M0649R1575
10905A97285J37319P8385O9794R2493K39209K36012K39859L64085K71407J51267
10895B077115J32665K8950r6967k38520l19828k81329k35853j56099j91692j51101
10885E67341p0399o2455j6746j5090j6728m6379m4927m1530n0960q8344K563J5516
10873A31862J0644j7240k0095r652O5567M331j1848J3014m3302n1073j7931p368
10861D6909q5179k5078P9875N0950j0851j0975J8262P012o2187k6928L7746L1664
$$ plain form
10943 -29943 -23098 -18655 -31144 -42654 -61536 -104568 -41152 38728 -4607 44414 3442 -62987
10931 -62987 -68986 -65371 -64673 -90737 -64268 -63234 -58166 -22103 62708 45757 39889 64669 101275
10918 101275 91297 30231 7309 6100 8986 7592 -4382 16896 29950 30031 65061 105710 197285
10905 197285 334604 412989 482783 575276 814485 1050497 1290356 1654441 1925848 2077115
10895 2077115 2209780 2238730 2141763 1903243 1583415 1302086 1066233 910134 718442 567341
10885 567341 496942 434487 417741 402651 385923 339544 294617 253087 202127 113783 116346 131862
10873 131862 142506 125266 105171 95519 161086 165417 153569 166583 123281 72208 54277 46909
10861 46909 -38270 -63348 16527 67477 56626 45651 63913 70925 8738 -18190 19556 51220
10849E1220O9955M8502m340n7877J3079o5967l2146P800J6364N5601M8673j0890
10837A39974m2661j1377k3929O481L4729n7761j24062P009N7614Q490j807j9583
10825b6883J676M0240r819M208k4379L6651J8428j1909L4858k7346l5397J3068
10813A3396l886K2787M1391K5633q6205r7932l384R031M8134J27298L7822j0071
10801A24014m9504o7168q6840q139K2745O0585l0148n0407k3353K669M2193L2315
10789c1038l7543m8689K9864R394N5635m0082O410L502p139L7124O081l1407M0561
10776g327K03j4900n3134m8352Q2886L9122p7895k3912J09261Q183K4220j2893
10764B5462q9215l8179J7963J3826R9605J8424m53j1301q4151k5408L2923R5420
$$ plain form
10849 51220 121175 169677 165337 107460 120539 54572 22426 30226 46590 102191 150864 139974
10837 139974 97313 85936 62007 68488 103217 45456 -78606 -71597 -13983 -5493 -7300 -26883
10825 -26883 -25207 15033 5214 9422 -14957 21694 40122 28213 63071 35725 328 13396
10813 13396 9510 32297 73688 99321 13116 -84816 -88200 -79169 -31035 96263 134085 124014
10801 124014 74510 7342 -79498 -87637 -64892 -4307 -34455 -84862 -108215 -105546 -63353 -31038
10789 -31038 -68581 -117270 -87406 -78012 -22377 -62459 -56049 -52547 -59686 -22562 -16481 -47888 -7327
10776 -7327 -7124 -22024 -75158 -123510 -40624 -1502 -79397 -103309 5952 14135 38355 25462
10764 25462 -63753 -101932 -83969 -70143 29462 47886 47433 36132 -48019 -73427 -40504 54916
10752E4916j9667j01205k2213J5633j2218J6493P9679j6881j3033M4809M8226
10741G4539M9543J9512j07165k9538P7320J9379o488Q865k054m1702K1865k9258
10729E4818q293K4287K659l3228L3508K8254k4835n5190j8291K9672M4586k9350
10717D8597p5884K9085J0588j5925J1559R3805Q0974K6905n3334p5233m3290P981
10705D5828M6212K2256O2137j7386r4599q8251p3814K3145M3268j4530q1879N8958
10693f8655L0983k5921k687N1270j3826K2337n5842k0763Q543J1850J0324O5785
10681A3398M9650M2252j4200j9370n8891k3300J7714m3918j010Q064J9013m3601
10669e4199M2292R0600N1250m4181l7706L7633n993k2381P709M7630r344k1384
$$ plain form
10752 54916 35249 -65956 -88169 -72536 -84754 -68261 11418 -5463 -18496 26313 74539
10741 74539 124082 143594 36429 6891 84211 103590 97102 105967 103913 62211 84076 54818
10729 54818 46525 70812 73471 40243 73751 102005 77170 21980 3689 33361 77947 48597
10717 48597 -27287 1798 12386 -3539 8020 101825 182799 209704 156370 81137 37847 45828
10705 45828 92040 114296 176433 159047 64448 -23803 -97617 -74472 -31204 -45734 -127613 -68655
10693 -68655 -37672 -63593 -66280 -15010 -28836 -6499 -62341 -83104 -74561 -62711 -52387 13398
10681 13398 63048 105300 91100 71730 12839 -10461 7253 -36665 -37675 -29611 -10598 -54199
10669 -54199 -11907 78693 129943 85762 48056 85689 79696 57315 65024 112654 103310 81926
10657H1926K5456n3512m9064l8259j2807L5332J11632J6968M1066j6123J3588
10646A56203O5803Q0287P5040J0973o53L2956m6934r1368k354M9659P0104P9164
10634D78880R6104O4761M9209J33525J84296J79224K13445K07432K62141K65942
10624B134959K58444K69589K35529K09920K82759M32350N68337Q67598J146223
10615F405708J468576J839163K484468L114849L540522L518945L139231K705365
10607B8216827K344593J798454R76567L83735N17157J511198L136714M878117
10599D3763362N910917N934857N133924M323726L321130J765716m50013k335317
10591F7368302k314298l49545K517082N237030O945734O725066N473212L946305
$$ plain form
10657 81926 107382 53870 4806 -33453 -46260 -10928 100704 117672 158738 142615 156203
10646 156203 222006 302293 377333 388306 387653 420609 373675 282307 279953 329612 399716 478880
10634 478880 574984 639745 688954 822479 1006775 1185999 1399444 1606876 1869017 2134959
10624 2134959 2393403 2662992 2898521 3108441 3391200 3823550 4391887 5259485 6405708
10615 6405708 7874284 9713447 12197915 15312764 18853286 22372231 25511462 28216827
10607 28216827 30561420 32359874 33336441 33720176 34237333 35748531 38885245 43763362
10599 43763362 49674279 55609136 60743060 65066786 68387916 70153632 69703619 67368302
10591 67368302 65054004 64704459 67221541 72458571 79404305 86129371 91602583 95548888
10583I5548888K102054p16270m229696p111169p281741n120707k156709M57829
10575G1492479K025383K152774J471126N21065o93352k637045n023116o660973
10567F2648341o532434m947673k960403j458220o76139l93064o67078j111222
10559D3902108j636028k409188l323978l974400l972929l390232k699546k064831
10551B0430976j567327j248376j105721q81726p71509o64214n19683n06184m65040
10542A2701196n38041l96064k98614k73244k46613k97541k68579k57789k07708
10533I917003j89117j50904j40837j42195j46391p8328R357j3230k7000j7638
10523I020720L3127p3615n8574M558N6995J60660K80226L37939M68523N85390
$$ plain form
10583 95548888 97650942 96934672 92704976 85593807 78312066 73191359 71034650 71492479
10575 71492479 73517862 75670636 77141762 77662827 76969475 74332430 69309314 62648341
10567 62648341 56115907 51168234 48207831 46749611 46073472 45680408 45013330 43902108
10559 43902108 42266080 39856892 36532914 32558514 28585585 25195353 22495807 20430976
10551 20430976 18863649 17615273 16509552 15627826 14856317 14192103 13672420 13166236 12701196
10542 12701196 12163155 11767091 11468477 11195233 10948620 10651079 10382500 10124711 9917003
10533 9917003 9727886 9576982 9436145 9293950 9147559 9069231 9078588 9065358 9038358 9020720
10523 9020720 9053847 8980232 8921658 8926216 8983211 9143871 9424097 9762036 10230559 10815949
10513A0815949O42462Q65251R21095R21138R32769J080748J123165J100206J082472
10504A9485255J090473J408000J900508K490571L137864M012245N053238O519656
10496D5097810Q541643J1492222J5624850K1652538L0936683M3887672N9431131
10489B36664549O9877240O2033630L9936361K8352505J6370564m178249m0687295
10482D08369305p5107462p3303855n4206469l8010044k7009033j9748970j4937807
10475A06045665j1676836r344730p614157o260358n204527m458704l899845l368662
10467E4217846k845759k384725j973391j685024j605476j671645j748847j724649
10459C8578330j733338j778015j734046j647103j559138j329548j103765j066518
$$ plain form
10513 10815949 11458411 12323662 13244757 14165895 15098664 16179412 17302577 18402783 19485255
10504 19485255 20575728 21983728 23884236 26374807 29512671 33524916 38578154 45097810
10496 45097810 53639453 65131675 80756525 102409063 133345746 177233418 236664549
10489 236664549 306541789 368575419 408511780 436864285 453234849 449056600 408369305
10482 408369305 333261843 259957988 205751519 167741475 140732442 120983472 106045665
10475 106045665 94368829 85024099 77409942 71149584 65945057 61486353 57586508 54217846
10467 54217846 51372087 48987362 47013971 45328947 43723471 42051826 40302979 38578330
10459 38578330 36844992 35066977 33332931 31685828 30126690 28797142 27693377 26626859
10451B6626859r95284r14050r32510r37065q73203o90352o56878p06754n59712
10442A9361051n17679n49660m58983m75838n67766m90170m93371m89598m99200
10433A4818786m27510m87599m85345l29318k03870k24761l26558l27276l09485
10424A1697064l43815l23297k90124k71565k83253k66499k59560k30450k17592
10415I210909j96508j34068j73285j97787l02515k50517j60841j80681j79189
10406G435518j41597j37867j87878k20260r5566j74501j68544j06459j15666j33421
10396E953759k42295k13590j38276p4379j10016j05616j23169j12050j23001j70946
10386D540421q2541m0087p6662m9234q1370j30995j6628q0565o8904l3829j46646
$$ plain form
10451 26626859 25631575 24717525 23785015 22847950 21974747 21284395 20627517 19920763 19361051
10442 19361051 18843372 18293712 17834729 17358891 16791125 16300955 15807584 15317986 14818786
10433 14818786 14391276 13903677 13418332 13089014 12885144 12660383 12333825 12006549 11697064
10424 11697064 11353249 11029952 10739828 10468263 10185010 9918511 9658951 9428501 9210909
10415 9210909 9014401 8880333 8707048 8509261 8206746 7956229 7795388 7614707 7435518
10406 7435518 7293921 7156054 6968176 6747916 6652350 6477849 6309305 6202846 6087180 5953759
10396 5953759 5711464 5497874 5359598 5285219 5175203 5069587 4946418 4834368 4711367 4540421
10386 4540421 4457880 4417793 4341131 4291897 4210527 4079532 4062904 3982339 3913435 3879606 3732960
10375C732960j1836m5455j01913j36466l9984L84l4417m3198q6187q8431p0922
10364C074535j7371J6544k7936m2331n1284k8090o4730o2669O377Q3343m1895
10353B844493m4816k245m6025m7381q6872l4055k1611m7062n9327o9121j48105
10342B237873q8682O146r7781j16468k4719J7621k9266o7478k419n228l6506j8350
10330A774743p9642q9231n9183J03707P5313m8164p5719J0711k9905o0675l4399
10319A487556o9761o2283n9172r568P654k7429k0894n6388p789o234k0376M4849
10307A200165m3582j8386j4835j6551k6215K381l6374j4696J3102k4452j7028
10296A003529L799N6236q3170l5610J6031M2972N8086N741l2359Q367n3899J3475
$$ plain form
10375 3732960 3721124 3675669 3573756 3437290 3397306 3397690 3363273 3320075 3233888 3145457 3074535
10364 3074535 3057164 3073708 3045772 3003441 2952157 2924067 2859337 2796668 2803045 2886388 2844493
10353 2844493 2799677 2797432 2751407 2704026 2617154 2583099 2561488 2514426 2455099 2385978 2237873
10342 2237873 2149191 2155337 2057556 1941088 1916369 1933990 1904724 1837246 1834827 1829599 1793093 1774743
10330 1774743 1695101 1605870 1546687 1650394 1725707 1677543 1601824 1612535 1582630 1521955 1487556
10319 1487556 1417795 1355512 1296340 1286772 1294426 1266997 1246103 1189715 1181926 1175692 1155316 1200165
10307 1200165 1156583 1138197 1123362 1106811 1080596 1082977 1046603 1031907 1045009 1020557 1003529
10296 1003529 1007328 1063564 980394 944784 960815 1003787 1061873 1067614 1035255 1043622 989723 1003198
10284A003198r2947l6466j410o6694L6030j6345K0669k098n0435n0140q490j1883
10272G22989m7618o9683j2661L1743M5853N1781l4740m364L347k9622p9688J7712
10260E95049J6634M2051k3530k5327j3741J8325P456N009k4604m3677M942J6225
10248E74812O4703n444j5204K0558K1370O482l1896J7742J3891n1154q8178K5639
10236E53321K2163K2148k9225m696m950M3605K1011N371q4309j7030K0614O3928
10224F11951O0741M4401j518l5180K3919M294k9769l6340n1938k8395n993M4733
10212F00906m2183m2392K3003Q5092M3273L317n7871J6450o0044j8561K4188p1091
10200E04087l5557N467j401M269L4869K920j0721j0290m549K1793m5923r529R163
$$ plain form
10284 1003198 910251 873785 872375 805681 841711 825366 846035 843937 793502 743362 734872 722989
10272 722989 675371 605688 593027 624770 670623 722404 687664 683300 686647 657025 577337 595049
10260 595049 611683 653734 630204 604877 591136 609461 616917 621926 597322 553645 558587 574812
10248 574812 639515 634071 618867 639425 660795 667277 635381 653123 667014 615860 527682 553321
10236 553321 575484 597632 568407 563711 558761 602366 623377 628748 544439 527409 548023 611951
10224 611951 672692 717093 715575 680395 704314 708608 678839 642499 590561 562166 556173 600906
10212 600906 558723 516331 539334 624426 667699 671016 613145 629595 569551 550990 575178 504087
10200 504087 468530 473997 472596 476865 511734 514654 503933 493643 489094 510887 464964 455435 464598
10187D64598M3386K4977o1758q5196k8102P5748o650p350k8401k9989J01771M5193
10175E08227J648K8589m0103n6642k2898J3512Q9227J03830k8202m3297K468k2702
10163E33657k0204J09524P7096p4735l7658O6761L1642M0049l7653q330L4602
10152G14751K7343N7467Q5246j4370n1313M8980O6712J1290K438n2975l7442k3389
10140H34738k9801j7703j1601j0580K9180p934p1530J2736j2872l6109q7943j01070
10128D89511k7408K6290j923M8543J2055l8882K0012l3896p1755o9032l8170J24646
10116D39991L7911m0174l6006q405n713j4764k9461J1662q828K4343J0710m368
10104C76898p607M9007K7536K7358m3862r633K9217j8044r247j6619M4289L6785
$$ plain form
10187 464598 507984 532961 471203 386007 357905 433653 427003 419653 391252 361263 463034 508227
10175 508227 509875 538464 498361 441719 418821 432333 521560 625390 597188 553891 556359 533657
10163 533657 513453 622977 700073 625338 587680 654441 686083 726132 688479 680149 714751
10152 714751 742094 799561 884807 870437 819124 868104 934816 946106 948544 895569 858127 834738
10140 834738 804937 787234 775633 765053 794233 786299 714769 727505 714633 678524 590581 489511
10128 489511 462103 488393 486470 535013 547068 508186 528198 494302 422547 353515 315345 439991
10116 439991 477902 437728 401722 393317 387604 372840 343379 355041 346213 370556 381266 376898
10104 376898 369291 418298 445834 473192 429330 419697 448914 430870 421623 405004 449293 486078
10092D86078r3103O057R5745L5346p7851K2892K3816M187M1704K9978l141J05013
10080F76721N5900L8914J66631J65692J87284L21109K86998K65368K33100J87790
10070B585507K2179q0857j37547l39442m38969k65528j81557j24557j06739j13147
10060H19343k5748p721q9069k7901p7153p9230l0058M967m965L5050N1252j4157
10048E54610Q8099Q5494m4254j01116k5405n8131m680k7535k306k7863p3187q0418
10036B83308k5138N4951n138k0888J2887L6187p2087q1576J1485K2134K8184L7269
10024B81578N1845P954n41j0833J9704o285j7695J2181p3154l1901M4846l6802
10012B40897k2174L23J6974P7590r684n3891J5579N5646M9070j6300L834M3915
$$ plain form
10092 486078 392975 399032 494777 530123 452272 475164 498980 503167 544871 574849 571708 676721
10080 676721 732621 771535 938166 1103858 1291142 1612251 1899249 2164617 2397717 2585507
10070 2585507 2607686 2526829 2389282 2049840 1610871 1345343 1163786 1039229 932490 819343
10060 819343 793595 785874 696805 668904 591751 512521 482463 487430 482465 517515 568767 554610
10048 554610 642709 728203 683949 582833 557428 499297 494617 467082 464776 436913 363726 283308
10036 283308 258170 313121 307983 287095 299982 336169 264082 182506 193991 216125 244309 281578
10024 281578 333423 341377 340836 330003 349707 343422 325727 337908 264754 232853 277699 240897
10012 240897 218723 219046 236020 313610 303926 250035 265614 321260 370330 354030 357864 401779
10000D01779o2416l418n7191j05826j1154M4677P162L2967J2118j0761m7684m924
9988A95329K7094K3692M2961k9736J3695k1327K5850k7182q2556R598N5936J8208
9976B51562q244M6008k9540n9936K393j2773j4678J8758Q194l238O4835r018m8009
9963B06314n1201J0496K2546L4600l701O7763R409r9711j7337K7807M0897K8584
9951B76466J6787M466r1185k8442J0680K5697m4117J0488P8150k9641j2716J8940
9939B35573k8676K9844m3576n3362m4087O2888O0823m1042J1851j5114R488m659
9927A79951L5381K3104J1282l7801L2601j4909K1925m5851j1558P376P4604L7319
9915C13424p0798n2457j6686q422k17J479J2083M840j0295j5120N411q987R735
$$ plain form
10000 401779 339363 335945 278754 172928 161774 206451 213613 246580 258698 247937 200253 195329
9988 195329 222423 246115 289076 259340 273035 251708 277558 250376 167820 177418 233354 251562
9976 251562 243318 289326 259786 199850 202243 189470 174792 193550 201744 198506 263341 254323 206314
9963 206314 155113 165609 188155 222755 219054 286817 296226 196515 179178 206985 247882 276466
9951 276466 293253 297719 206534 178092 188772 214469 170352 180840 258990 229349 216633 235573
9939 235573 206897 236741 193165 139803 95716 158604 219427 178385 190236 175122 184610 179951
9927 179951 215332 238436 249718 211917 244518 229609 251534 205683 194125 201501 276105 313424
9915 313424 242626 190169 173483 165061 164844 166323 178406 183246 172951 157831 163242 154255 163990
9902A63990j7620R148M5330n250j5182l846n9124j6146l5725N2295N3659N7760
9890B29289l854j22509J3580O7153m1793l3907J3032J25606J6075j1396j2928
9879B38348p7006q7957K9547J525L1983m1688l7496N6252N6835K1053k6882m9550
9867A14964p527J2613P3888K8410l9648l7332p5549J380P477Q0686J54r483k2516
9854A27517n5876j8197K227J03828N6010p1776n0407k8292J3463J8871J8526L9851
9842A55745k5230L2100J885n8527m3176j1734L3012P4377m1111M7756J4413l7534
9830A41976n4866M9179M8051Q8361k573j00584j9531N7951m9214n0881j2602L0162
9818A25429O019m4771J1618O6404R1948j0521l5359q3943p3174O2836O3639l2403
$$ plain form
9902 163990 146370 155518 200848 195598 180416 176570 117446 101300 65575 117870 171529 229289
9890 229289 225435 102926 116506 183659 141866 107959 120991 246597 262672 251276 238348
9879 238348 161342 73385 102932 104457 136440 94752 57256 113508 170343 191396 164514 114964
9867 114964 107437 120050 193938 222348 182700 145368 69819 71199 78676 159362 159516 150033 127517
9854 127517 71641 53444 55671 159499 215509 143733 93326 65034 78497 97368 115894 155745
9842 155745 130515 162615 164500 105973 62797 51063 84075 158452 117341 165097 179510 141976
9830 141976 87110 136289 184340 272701 270128 169544 150013 207964 158750 107869 95267 125429
9818 125429 131448 86677 98295 164699 256647 246126 210767 126824 53650 116486 180125 147722
9806A47722k1188l767J8549j4085L1686r269K0288K4421q9461k9944J9253K9592
9794A23797k478j2783L8727M5953L1527K2063l2296n426N1276j6755l090r847
9782B30668m8060K5334m8719o1207L3598N066o3901N869k1647K6489j1907p7574
9770e991j01430O419Q4372L4657P1286j4832M6558J4813j6557K6535R90j7308
9758A29512M6101K5630m6119j3347l7646l079L4738O1456L5204J7393k5804o0671
9746A63368j627k7569k1430K8852l737k9439J53k384J0854R091J7030l941Q1678
9733B20899K8366m9757o6801p7059n3795L2425R3070L5965j8247m2112K1723P1828
9721A96505N939n7339n1417J4219j3631o019l5467p9676P2814L179m8418N936
$$ plain form
9806 147722 126534 122767 141316 127231 158917 149648 169936 194357 104896 74952 94205 123797
9794 123797 121319 108536 147263 193216 224743 246806 214510 209084 260360 243605 240515 230668
9782 230668 182608 207942 159223 98016 131614 136680 72779 78648 57001 83490 71583 -5991
9770 -5991 -107421 -101002 -16630 18027 89313 74481 121039 135852 119295 145830 146820 129512
9758 129512 175613 201243 155124 141777 104131 101052 135790 197246 232450 249843 224039 163368
9746 163368 161741 134172 112742 141594 137857 108418 108571 106187 117041 126132 143162 139221 220899
9733 220899 249265 199508 132707 55648 1853 34278 127348 163313 145066 102954 124677 196505
9721 196505 202444 145105 93688 107907 94276 88257 52790 -26886 45928 49107 689 6625
9709F625Q5665O5178M3958M1579p7507m309M2623O605M2374k6370l9355K0549
9697B07615m474j3003K2022n2242r331n0740l0701L3280q2386k4171K9524M923
9685C0316j3462Q8330j9306r584O3775k8743q9194l417k4914j4925o108O1167
9673C3935M2316O693j2946L6153m0215l6879M0087m8504m1819L1827n4861K4439
9661a9774K7448K1215K1878R274m4276L1140O9590N8162l0091o5026k8086K3263
9649G4717O5308M4490p3893m4484n323J8061J6620J6673k5421q6933m4143N6597
9637A2269J8720n9672K9081P8750N2971r562n3888o8007P5146P8596o6361M635
9625I2678M6293M6058l1121l9881K378k8876l9421L7011K62n3505K8058J1703
$$ plain form
9709 6625 92290 157468 201426 243005 165498 161189 203812 210417 252791 226421 187066 207615
9697 207615 203141 190138 212160 159918 150587 99847 69146 102426 20040 -4131 25393 30316
9685 30316 16854 105184 85878 76294 140069 111326 22132 18715 -6199 -21124 -27232 33935
9673 33935 76251 82944 69998 106151 65936 29057 69144 20640 -21179 10648 -44213 -19774
9661 -19774 7674 28889 50767 60041 15765 46905 116495 174657 144566 79540 51454 74717
9649 74717 140025 184515 110622 66138 60815 78876 95496 112169 86748 -185 -44328 12269
9637 12269 30989 -28683 398 79148 132119 122557 68669 662 75808 154404 88043 92678
9625 92678 138971 185029 153908 114027 116405 87529 48108 85119 85381 31876 59934 71637
9613G1637L3206l1444N4779L2364k4889m1849n9787J8013P7264m3551r52L4568
9601A19359k5106J0680P193Q3696L6668n9787o3742k4621m0512O8338L4241J179
9589A47586k0126o7320j5740J1039J6878N4191K3997q4405n7205k2449J7751Q0671
9577H4868J9873K5854l5385m4115l8810r380K4470L4580L1329j8571o685J3639
9565H1667O5715k0197J6650n332m506L1901Q5681m069p8841m0102L4459J4441
9553A77467J1090r026m3510m1817K4921M0412L561p4108m5130M0198J57l219k2497
9540E8499L4241L2985r172m9731L7509J2275M0766K1397l7098l6571k9839n2658
9528B2603J8581j4364L3743N452l6014J0912J6087k1241m972m4836O8852l003
$$ plain form
9613 71637 104843 73399 128178 160542 135653 93804 34017 52030 129294 85743 84791 119359
9601 119359 94253 104933 112126 195822 232490 172703 108961 84340 43828 112166 146407 147586
9589 147586 127460 60140 44400 55439 72317 126508 150505 66100 8895 -13554 4197 84868
9577 84868 104741 130595 95210 51095 12285 2905 27375 61955 93284 74713 68028 81667
9565 81667 147382 127185 143835 138503 133997 165898 251579 247510 168669 128567 163026 177467
9553 177467 188557 179531 136021 94204 119125 159537 163098 88990 43860 84058 84215 80996 58499
9540 58499 92740 125725 116553 66822 104331 116606 157372 178769 141671 105100 75261 22603
9528 22603 41184 26820 60563 66015 30001 40913 57000 35759 30787 -14049 54803 51800
9516E1800J299O2849k0310k7936L6558n148N4706K2294J3067m7613r638m1301
9504I0627J1320Q98L9980J1995R476o7928J54j2373L3881m0800p7822L9701M3444
9491H2553O914j17917p992J11681Q2735O229K7103K2056n654j8205j00252l7591
9479E1660r056M9508l672o477r140m1289L7076j2591m604j6465n3772M1586O1282
9466H4046j1489k4817m3430K6223M2386J1201m767P462L684j8538k0632L1716
9454H3045p3437j9158J22431K5289l9953j5643J6245M4952m5921o1583K7220j1557
9442E1930k3068p8200K428J4389J2260L4669j4001K3055Q994j6119m0122K9302
9430E517N7404L7306M2580J8332k3081l909J954o1603n8477l1085M7848L8936
$$ plain form
9516 51800 53099 115948 95638 67702 104260 99112 153818 176112 189179 141566 131928 90627
9504 90627 101947 102845 142825 154820 164296 96368 96522 84149 118030 77230 -592 39109 82553
9491 82553 89467 -28450 -36442 75239 157974 164203 191306 213362 207708 189503 89251 51660
9479 51660 42604 92112 88440 81963 72823 31534 68610 56019 51415 34950 -18822 22764 84046
9466 84046 72557 47740 4310 30533 72919 84120 79353 86815 90499 71961 51329 83045
9454 83045 9608 -9550 112881 138170 98217 82574 98819 143771 97850 36267 63487 51930
9442 51930 28862 -49338 -46910 -32521 -20261 14408 407 23462 32456 16337 -23785 5517
9430 5517 62921 100227 142807 161139 138058 134149 136103 74500 16023 -15062 32786 71722
9418G1722K3347j01243l1389K1779K8481p831M955o1842J3261R8784l3146M4314
9406G1192j1198K2933L7952K5721L2723R325K6596p0158q143k3238o0850l0485
9394B2370J3043M3847N3706P2170J0084J3684L4923M3367n8480r4156m9771p2339
9382C2448k6907l7885M848O2454j8230k4394J9543K6191k628o093j8103J7916
9370B9160M6927M2868N145k182j6668m5251r1557l7157Q6061L7358m9451m1748
9358c6495o6882O5660N4020k0317R772Q5556L9499k4529j5146j7611j8075R2699
9346A48151M3246m9328J35L421p1623L059N9549j2215l0992n1554m5520l2190
9334c5861K7336n595J2805M1356N2935k7984p6786P312o647p2564J3302P7961
$$ plain form
9418 71722 95069 -6174 -37563 -15784 12697 4866 9821 -52021 -38760 60024 26878 71192
9406 71192 59994 82927 120879 146600 179323 188648 215244 145086 136943 113705 52855 22370
9394 22370 35413 79260 132966 205136 215220 228904 263827 307194 248714 154558 104787 32448
9382 32448 5541 -32344 -27496 34958 16728 -7666 11877 38068 35440 29347 11244 29160
9370 29160 76087 118955 124100 121918 105250 59999 -31558 -68715 17346 54704 5253 -36495
9358 -36495 -103377 -37717 16303 -4014 5758 91314 130813 106284 91138 73527 55452 148151
9346 148151 191397 142069 142204 145625 74002 77061 136610 124395 93403 41849 -3671 -35861
9334 -35861 -8525 -14120 -1315 40041 92976 64992 -11794 -4482 -11129 -83693 -70391 7570
9322G570N27J6525J2507j8851k3570K5129j8884J3050K153L7975J4243J0257r290
9309F9341J7211k4987k1703K973q473K6395M2008N8129l8304j16617j7991K2316
9297A0298N9978p397n9378m2466J07325j6786M772P846k5002j587M5490J7786
9285A00879j3052m4374q8424j12557J9141J26109L236L264P3666P925m9077M050
9273C0786n483L5032n8396r555N1065N032K6136l0172j9558j8087K5376o793K8322
9260E3705J7k3096O3440L037j7491m016K9954L7170p2031j06881o2186M2612N2468
9247c298l1058J6517M2260m117K4685K0779o353L2334m7321m0571L2988K9584
9235F6429L8640J6110M4597P86M177n3665l5699L3386L3749l3448q6162j860J0694
$$ plain form
9322 7570 8097 24622 37129 18278 -5292 19837 953 14003 16156 54131 68374 78631 69341
9309 69341 86552 61565 39862 42835 34362 60757 102765 160894 122590 5973 -12018 10298
9297 10298 70276 62879 3501 -38965 68360 51574 56346 64192 39190 37603 83093 100879
9285 100879 87827 43453 -44971 -157528 -138387 -12278 -9042 -5778 67888 75813 26736 30786
9273 30786 25303 60335 1939 -7616 43449 48481 74617 44445 24887 6800 32176 25383 53705
9260 53705 53722 30626 94066 97103 79612 75596 105550 142720 70689 -36192 -98378 -55766 -3298
9247 -3298 -34356 -17839 24421 20304 44989 65768 59415 91749 44428 3857 36845 66429
9235 66429 105069 121179 165776 166562 170739 117074 81375 114761 148510 115062 28900 27040 37734
9222C7734j3336l6859K92k6188M6346M4964M8819Q176n2665J4933P922M4583j2915
9209A11806q6533L7138O0030n5570l3640m4506k8589L8044K1727R349P0563L5768
9197A35587N950J4320l1124l4227m6068j0943N4708l6209k1183L5488K2345m54
9185H8190K427R427J9091o1801L215m43K4774O6590j286n1454p5562n8563k6421
9172f1816j375K3636J7115N7656N374k7504m1701N005L791L3400m2932l5276j0088
9159g4715K3710M8358j1558K155j1983l6013n5586o8265O7516N6644M9558j412
9147a1591O2677J1109r4457k271k1969K8705J9688M0075O3190L3437J1838m290
9135A36141l0412k0855j1069l8173K0910o710k1205j8431J5749L2280k2801j580
$$ plain form
9222 37734 24398 -12461 -12169 -38357 7989 52953 101772 109948 57283 72216 80138 124721 111806
9209 111806 25273 62411 122441 66871 33231 -11275 -39864 -1820 19907 29256 99819 135587
9197 135587 141537 155857 124733 90506 44438 33495 88203 51994 30811 66299 88644 88190
9185 88190 90617 100044 119135 57334 60549 60106 84880 151470 150184 98730 23168 -35395 -61816
9172 -61816 -63191 -39555 -22440 35216 40590 13086 -28615 -23610 -19819 13581 -29351 -64627 -74715
9159 -74715 -51005 -2647 -14205 -12050 -24033 -60046 -115632 -183897 -116381 -59737 -10179 -11591
9147 -11591 51086 62195 -32262 -34533 -56502 -27797 -8109 31966 95156 128593 140431 136141
9135 136141 105729 84874 73805 35632 56542 49832 28627 10196 25945 58225 35424 33844
9123C3844j0826j6395P1814L6605r7N4001m524m0181m4338j07568l4735K7657
9111c4743J21960J1900p6978j9832Q8405J5392l5346j19468J2966N9155J3446
9100C6857M693m5773L8090L1850n7000o4128J967k5723l1996L7058Q6378O6387
9088G8660j5293j564O7684K4545n8839q921r373J1221l0398k5663l0642K6961
9076B8378k4256K8660J3695K3479L4086l9043o9743O197l1862m0292O9202K5794
9064B4295m357M738m7547j238l2717j4945R8121M3570q7035l8444k5031M987P5259
9051c44L3278J08157k7657n2254o3801k6011J01884P8218j32061j41251O562J08392
9039f888L5247J5654R782j453J8035j0844o1044l2648r608J3238L5911m756p1230
$$ plain form
9123 33844 23018 6623 78437 115042 114945 168946 164422 124241 79903 -27665 -62400 -34743
9111 -34743 87217 99117 22139 2307 90712 106104 70758 -48710 -35744 23411 36857
9100 36857 41550 -4223 33867 65717 8717 -55411 -53444 -79167 -111163 -74105 12273 78660
9088 78660 63367 61803 129487 154032 95193 86272 76899 88120 57722 32059 1417 28378
9076 28378 4122 32782 46477 69956 104042 64999 -4744 1453 -30409 -70701 -1499 24295
9064 24295 19938 24676 -22871 -24109 -56826 -71771 26350 69920 -17115 -55559 -80590 -75603 -344
9051 -344 32934 141091 113434 61180 -2621 -28632 73252 151470 19409 -121842 -115280 -6888
9039 -6888 28359 44013 53795 52342 70377 59533 -1511 -34159 -43767 -30529 5382 626 -70604
9026g0604m6539N7441L7865N3220M841l0626k2405P1376P1664l0355l7806j2361
9014D5711k6110j4164k7342P3593O1368K7464l0232l3599R7395L1649m3548J5126
9002A77311o8579j0148k55q474m2282N9633J12601o2903k9203j1482m2122N3607
8990A27704k9118J3904O456m9224J2386r835Q662m0549l7494r957j2426K9817
8978A0326N6997J7402M1193K6571K96m355k5739P33j1445n5942M5814k0027j7574
8965F4250O3156L7799n4704r865L3056J121k7314K1458J4453m8097j1319P947
8953I1941M695L7659o6226R4800L920J9961m7636n7130j4705j8489l3167j4069
8941A554J8272l1470l4544K2908M6693M1929j2093j6402Q860M0743j7256m398
$$ plain form
9026 -70604 -117143 -59702 -21837 31383 36224 5598 -16807 54569 126233 95878 58072 45711
9014 45711 19601 5437 -21905 51688 113056 140520 110288 76689 174084 205733 162185 177311
9002 177311 108732 98584 98329 89855 47573 107206 219807 156904 127701 116219 74097 127704
8990 127704 98586 112490 118946 69722 82108 72273 80935 40386 2892 -7065 -19491 10326
8978 10326 67323 84725 125918 152489 152785 148430 122691 123424 111979 56037 101851 81824 64250
8965 64250 127406 165205 110501 100636 133692 134813 107499 128957 143410 95313 83994 91941
8953 91941 96636 134295 68069 162869 166789 186750 139114 81984 67279 48790 15623 1554
8941 1554 19826 -11644 -46188 -23280 23413 65342 53249 36847 45707 86450 69194 64796
8929F4796l7727p2210q556M5432N5266O0816R797r2081o1858N0601R115J2L3402
8916E6805q724K8470M5600o8029j1872K7854J1077p3206l2892L7157J5078J410
8904B8728l1476j4829M6337o1716M6025m875L4456K9014k8004m5453O623J1441
8892A6271l9883K9243M9023l4626l0739J1307J6121k5910k0631L9185L1670j3415
8880B7616q2778P922J0643k595K4922J09271K7536o3797j04012j7232j4552J2816
8868f4240N9822l1677P5171L2994j1857m0372o9975K667q171j0587L4805J6382
8856a5038O491k6642j8052K0477K6594J822k492J405l0557L3811j3178o9088m1833
8843a26280n2518O8266O9745J465K2662O853L7025K0814K3301n2968N966l6509
$$ plain form
8929 64796 27069 -45141 -53697 -8265 47001 107817 117614 25533 -36325 14276 23391 23403 56805
8916 56805 48081 76551 122151 54122 42250 70104 81181 7975 -24917 12240 27318 28728
8904 28728 -2748 -17577 28760 -32956 13069 8194 42650 71664 43660 -1793 4830 16271
8892 16271 -23612 5631 54654 20028 -10711 596 16717 -9193 -29824 9361 41031 27616
8880 27616 -55162 -47240 -36597 -39192 -14270 95001 122537 58740 -45272 -62504 -77056 -64240
8868 -64240 -4418 -36095 39076 72070 60213 19841 -50134 -47467 -55638 -66225 -31420 -15038
8856 -15038 -8547 -35189 -53241 -32764 -6170 -4348 -6840 -5435 -35992 -2181 -15359 -84447 -126280
8843 -126280 -178798 -110532 -40787 -39322 -16660 -9807 27218 48032 71333 18365 24331 -12178
8831a2178L243K1423k8053J1687l4844M4438k619k5468M9294O0l2785n8785K212
8818f2375l0964R374N1016O906k3403j3359M6616L3418q3017M5205M4599l2262
8806h246m7388O1556N333l5177J0836o2759j6948p892p568R0913J1309m0125j3346
8793e9502Q3319L5539Q769O627m6222k9187N6285j4610m7914j8787k892K3254
8781e321j7239N778K6540L9080O361q669p0614L2364k8109j3252O060n7429n9313
8768a43763O8716L7926l7573N1419l0986l7170N6m9545O8804N0079K337m1400
8756f1100l2595M5576O8140L9686J9239Q1799m7500r0987l5063K4670L2213n002
8744C9076L81P0849J8441m9027k3349R414O4210j2948l4792n9365l398N7134j8353
$$ plain form
8831 -12178 -8935 12488 -15565 -3878 -38722 5716 3097 -22371 26923 26983 -5802 -64587 -62375
8818 -62375 -93339 -83965 -32949 -26043 -49446 -62805 -16189 17229 -65788 -20583 24016 -8246
8806 -8246 -55634 5922 11255 -23922 -13086 -75845 -92793 -100685 -108253 -17340 -6031 -46156 -59502
8793 -59502 23817 59356 68125 74752 28530 -657 55628 41018 -6896 -25683 -28575 -5321
8781 -5321 -22560 -16782 9758 48838 55199 46530 -24084 8280 -19829 -33081 -27021 -84450 -143763
8768 -143763 -75047 -37121 -74694 -23275 -54261 -91431 -91375 -140920 -72116 -22037 -19700 -61100
8756 -61100 -93695 -48119 20021 59707 78946 160745 113245 22258 -12805 11865 44078 39076
8744 39076 39457 110306 128747 79720 56371 65785 129995 117047 82255 22890 19492 76626 58273
8731E8273n6737n0287N9099M2979l6556J0434N6030k7422n8690J97J4825L1840
8719D3985l4135p1799k4331J01183O8328k2631q17K7574n8968o4803l1736K1387
8707d6763K6593j6738j0500L3945k0565j7343j1540j0532j5581R700K7337k2813
8695g4800k5562M88L2327L7835M4285k5073o514M4297L6019j2958k1668n781R863
8682C2758k8484n6615j8618L6082k3081o7152j9519J02148L0086k208j486k1064
8670c7153l5673M3145R2353q190J6271J204R047k3770l3006k6867M4037k2432
8658A8966O544R7171N031n5391j09775q9592N4663O4326l041o1509j1825J05129
8646B0697P8187j974P122k1528q484N4856K1376n9542k8365j614l1930j3586O3784
$$ plain form
8731 58273 1536 -48751 10348 53327 16771 27205 83235 55813 -2877 -2680 12145 43985
8719 43985 9850 -61949 -86280 14903 83231 60600 59783 87357 28389 -36414 -68150 -46763
8707 -46763 -20170 -36908 -47408 -13463 -34028 -51371 -62911 -73443 -89024 -79324 -51987 -74800
8695 -74800 -100362 -99874 -67547 -29712 14573 -10500 -17014 27283 63302 50344 28676 22895 32758
8682 32758 4274 -52341 -70959 -34877 -57958 -125110 -144629 -42481 -12395 -14603 -16089 -37153
8670 -37153 -72826 -29681 62672 54482 70753 71957 81004 57234 24228 -2639 41398 18966
8658 18966 25510 122681 127712 72321 -37454 -127046 -72383 -8057 -11098 -72607 -84432 20697
8646 20697 98884 96910 104032 82504 74020 128876 150252 90710 62345 60731 28801 15215 78999
8633G8999K4234n1725r164m6584l4722M9635R2153J7449j0161j0574l6236l2743
8621C0561o5604J4818M7334N4689p5504m2128n6130J8581N2560P714K1586L636
8609A2113L032J9291J8000j08088K2601P2414N5081j3194r979l7623n6019p17
8597b3088K2577l2110J3109j417j8440J5359m0491L9746K7107K7320L567N546
8585C8785P0517l5279j06639J998k7243L026L2538N463K7557k3253O345j5922
8573b2107m4732J1464P7251L1299k8538k3070R391N042M475J5179j4018j7731
8561C905P3518m1030l3688k3050k5997M2726O796L1713M3275l2953k4351J8658
8549C9522N587L3293N3320L5129L7661M352r581j8106m8100Q7977m6844o8387
$$ plain form
8633 78999 103233 51508 42344 -4240 -38962 10673 102826 120275 110114 99540 63304 30561
8621 30561 -35043 -20225 27109 81798 6294 -35834 -91964 -73383 -20823 -13109 8477 12113
8609 12113 15145 34436 52436 -55652 -33051 39363 94444 81250 71271 33648 -22371 -23088
8597 -23088 -511 -32621 -19512 -20929 -39369 -24010 -64501 -24755 2352 29672 33239 38785
8585 38785 109302 74023 -32616 -30618 -57861 -54835 -22297 -16834 10723 -12530 -6185 -22107
8573 -22107 -66839 -55375 21876 53175 24637 1567 10958 16000 20475 35654 21636 3905
8561 3905 77423 36393 2705 -20345 -46342 -3616 3180 34893 78168 45215 20864 39522
8549 39522 45109 78402 131722 166851 204512 208864 199283 181177 133077 221054 174210 105823
8537A05823Q34k0203q1796m5541L6468M1540R722M6899k9505n8706k2861M5047
8525B7721P702q3363j8317K1954R7541o957l3129N9235o074j9398K3644K7398
8513I7957l9456J6279N5005n3192o4201L0270k6761j6429K5Q1297K5616l9912
8501F6498k3919o3844o9561L5494J8776J5913K4374L9886j7663M216P6682L4924
8489A41776j5008o1689m2488l2717M5139P640K2071N4741l0047l8241j488k1366
8477B8323K5003O3629O616n0966M3388p810k5167l440p923j5263k6813J6634N0286
8464I6497M1753j1191j545j1266k0981K6009r419m4908k7896J1208J0619Q0094
8452A38974K106p1852n713m1423n7082l6900K9707l3923K8850P0129K3231l4429
$$ plain form
8537 105823 106657 86454 4658 -40883 -4415 37125 46847 93746 64241 5535 -17326 27721
8525 27721 35423 -47940 -66257 -44303 53238 46281 13152 72387 66313 46915 70559 97957
8513 97957 58501 74780 129785 76593 12392 42662 15901 -528 -503 80794 106410 66498
8501 66498 42579 -21265 -90826 -55332 -36556 -20643 3731 43617 25954 30170 106852 141776
8489 141776 126768 65079 22591 -10126 35013 42653 64724 119465 89418 51177 49689 28323
8477 28323 53326 116955 123571 72605 115993 108183 83016 79576 71653 56390 29577 46211 96497
8464 96497 138250 127059 125514 114248 93267 119276 109857 64949 37053 48261 58880 138974
8452 138974 141080 69228 63515 22092 -34990 -71890 -42183 -76106 -47256 22873 46104 11675
8440A1675n0462N1220J03900J689M5774o2779r7895l2392M3375j6308L297j71
8428I23J9159M3825O027m1377k8302l3834J1833L2855p798k6546l2373j662q517
8415f5787k3641N4108O0843M4586k0021k6778N9931k1651o1961n0150K7152J0249
8403a3120j8802l2429o732N0362L6953k7374o1709j118N9133M1196J9957J5186
8391F1503o413k5500k233r395j2903n2685N619K5254L5377J29488J5723n7891
8379A05944l4386K6774k7226k7653P257O0227P7973j1121r8781l8748j0649j4113
8367A5498j5497K8608R2751N278p6949p3354j0601P679N230P9691j0577m0797
8355F960l5101K8636R8202o7607m4017Q063m3267l1244R7937R7272N6849j8169
$$ plain form
8440 11675 -38787 12433 116333 118022 163796 101017 3122 -29270 14105 -2203 1094 923
8428 923 20082 63907 69934 28557 255 -33579 -21746 11109 3311 -23235 -55608 -57270 -65787
8415 -65787 -89428 -35320 25523 70109 50088 23310 83241 61590 -371 -50521 -23369 -13120
8403 -13120 -31922 -64351 -71083 -20721 16232 -11142 -72851 -73969 -14836 26360 46317 61503
8391 61503 55090 29590 27357 17962 5059 -47626 -42007 -16753 18624 148112 163835 105944
8379 105944 71558 98332 71106 43453 50710 110937 188910 177789 79008 40260 29611 15498
8367 15498 1 28609 121360 126638 49689 -23665 -34266 -26587 -21357 58334 47757 6960
8355 6960 -28141 495 98697 31090 -12927 -4864 -48131 -79375 18562 115834 172683 154514
8343A54514o5208l2132n1023J7386k2268N073O3739Q443J9536k7243K2301k3867
8331F9251k97l9324j010L7476R006J4155j07382r2230l0855O8617Q3853K6649
8319C7909j1491p1711j1313K0154L4853Q91m0095m0357k6562l8756J8882N9349
8307f8247J0941K6030k0064J1125J1439M9182m5019o3467J9692M0574J244r840
8295c6410O5815M1382M118l3207n6196n0843j9527n2750n515Q8050L0108J4163
8283a0812o6781p5145m053P3021m2066O266p452l774K8615J08115O4630K4764
8271I5328k525q0613r355k0710n6010O590K5463L5831K4058J8533l0655j183m3257
8258c8505j7244L2707K2810O3481n4101R204r414j4917L6157j9694O335K2677
$$ plain form
8343 154514 89306 57174 6151 23537 1269 6342 70081 78524 98060 70817 93118 69251
8331 69251 68954 29630 28620 66096 75102 89257 -18125 -110355 -141210 -72593 11260 37909
8319 37909 26418 -45293 -56606 -36452 -1599 -708 -40803 -81160 -107722 -146478 -127596 -68247
8307 -68247 -57306 -31276 -51340 -40215 -28776 20406 -24613 -88080 -68388 -27814 -26570 -36410
8295 -36410 29405 70787 74905 41698 -14498 -65341 -84868 -137618 -143133 -55083 -24975 -10812
8283 -10812 -77593 -152738 -156791 -83770 -125836 -119570 -127022 -130796 -102181 5934 70564 95328
8271 95328 92803 12190 2835 -17875 -73885 -67295 -41832 -6001 18057 36590 5935 4752 -38505
8258 -38505 -55749 -23042 -232 63249 9148 18352 8938 -5979 30178 10484 16819 39496
8246C9496Q033K550O2127o1550l8567l6102l8366N8996N1916J3236r4639K5423
8234g447N9957j8954j4928k4157m2195j4966K8322O3572k1251L5073J0672K8906
8222H2604m5838q9941j6812j0793k1204P3167Q8776O4410j9219n0966k0326j7339
8210A6519l5975K1830M8178m3570o5544n3849k0704J5112p233R7873O8741n9165
8198a7787J3515J6109k0498o4317P818L4809L4394j3309K4311O2197N156n0640
8186C1758j2835l3172m8711M3608K0193L5860J8436K4270m1109m4548l8894j8246
8174f3390J2064J9595r729j5333l8287N3339k937n1874L8850j8916L0322K1903
8162b4393J0780P1850o864j0935M1034M1678q4218p1536k4753M4407M990L080
$$ plain form
8246 39496 47529 50079 112206 50656 12089 -24013 -62379 -3383 48533 61769 -32870 -7447
8234 -7447 52510 33556 18628 -5529 -47724 -62690 -34368 29204 7953 43026 53698 82604
8222 82604 36766 -53175 -69987 -80780 -101984 -28817 59959 124369 105150 54184 33858 16519
8210 16519 -19456 2374 50552 6982 -58562 -112411 -133115 -118003 -125236 -27363 41378 -17787
8198 -17787 -4272 11837 -8661 -72978 -65160 -30351 4043 -9266 15045 77242 82398 31758
8186 31758 18923 -14249 -62960 -19352 841 36701 55137 79407 38298 -6250 -45144 -63390
8174 -63390 -51326 -31731 -41460 -56793 -95080 -41741 -44678 -96552 -57702 -76618 -46296 -24393
8162 -24393 -13613 58237 51373 40438 81472 123150 38932 -32604 -57357 -12950 -7960 -4880
8150d880O2930Q3337r20k121r5513m0229J0625N136J2762m1084J2039n6446m1660
8137i6024K1408N0464L3460m6355L0113O0250k5631j5988J3900l8431j0749M7256
8125B3673J6630j9145n8446l4162Q6909N3937L2429J1540k0516P735P169p6191
8113C1562J847J7781M3345n5343k9590K1281O0001j4557l9900p989l367J8513
8101D3584J2115k8532l450K6684l1386l021l7183j9230M2492N2456R722J1009
8089G5260n3511n6146O5016N9751k9665j8402j0921K2263K6115J7850m8700o041
8077D2869p4204j0588L4942k0776m2033K5592J8470M4917L7522M3920J6285L353
8065A20269j0445lJ288j1889l8362k9732J8811M5278l3548k3992l0013L6767K1978
$$ plain form
8150 -4880 58050 141387 140467 138346 42833 2604 13229 18365 31127 -9957 2082 -54364 -96024
8137 -96024 -74616 -24152 9308 -37047 -6934 53316 27685 11697 25597 -12834 -23583 23673
8125 23673 40303 21158 -37288 -71450 15459 69396 101825 113365 92849 100584 107753 31562
8113 31562 33409 51190 94535 39192 9602 30883 90884 76327 36427 28438 25071 43584
8101 43584 55699 27167 23717 50401 19015 15994 -21189 -40419 2073 54529 64251 75260
8089 75260 21749 -34397 30619 90370 60705 42303 31382 53645 79760 97610 48910 42869
8077 42869 -31335 -41923 -6981 -27757 -69790 -44198 -25728 19189 56711 100631 116916 120269
8065 120269 109824 109821 111109 99220 60858 31126 49937 95215 61667 37675 7662 44429 66407
8052F6407j5653J6728j3121Q198K7978l8034k9372l7793J2833N3338K4665n1159
8040B5015r3364k3065P9777k0867o327N2528j4252n8888L451J8109l504m1744
8028h3131K6539R4986P6125m591p0779m4133j2222L8114J5514n5299N788j6257
8016b9346m6214K469k53K9072R346n905L4191N4906M4716k3027l6764k7823K2614
8003B7982l8934j3289M460P2095Q3896k7159q3541l8438K4033m464p40N8984P9992
7990A44877n4511o8036l7514M4016N1981k0083n8729K2958M2221k5234J4813q8840
7978c2081K1101j058J8104M0844l4640M9299L6429p0968m0600K5049l083r027
7966f31l2552O1507R930K5816o4067n6015j9200J5876K0606Q9485Q6257m0076
$$ plain form
8052 66407 50754 67482 54361 62559 90537 52503 23131 -14662 -1829 51509 76174 25015
8040 25015 -68349 -91414 -11637 -32504 -38831 13697 -555 -59443 -55992 -37883 -41387 -83131
8028 -83131 -56592 38394 114519 109928 39149 -4984 -17206 20908 36422 -18877 -13089 -29346
8016 -29346 -75560 -73091 -73344 -44272 -34926 -40831 -6640 48266 92982 69955 33191 5368 27982
8003 27982 -10952 -24241 -19781 52314 136210 109051 25510 -12928 11105 6641 5901 64885 144877
7990 144877 90366 22330 -15184 28832 80813 60730 2001 24959 67180 41946 56759 -32081
7978 -32081 -10980 -12038 6066 46910 12270 61569 97998 27030 -13570 11479 8396 -631
7966 -631 -33183 28324 38254 64070 3 -56012 -75212 -59336 -38730 50755 137012 96936
7954I6936q2313J0029K1567Q0230J3765j05035p164O1117J6417k4055o654k0758
7942E4082j02219m0111K4265L5731k8507n1702M3625Q7305Q771J0959R2666J0330
7930A45195p0555N641k1040N5890q960m2561J1101l1499p2096p0799K6108q302
7918h1877M2679P0206j2828r4929N7721K3302k2136Q85K0476K0054p99j5811j909
7905E034j6449L443K2847K9474K388N7213J7303m8412o0861l5983m8189k4627
7893i6819j8596P6878K5098O943P993K2347L7363O3038n9933p7034L9019J1266
7881C7563k3536p012o8303K6461R525K8981K6548p0192k7241P0635j111p940L2107
7868B6485n8181l4366m844P2550M7346n5906M464j8082K0474O6001J3880r4940
$$ plain form
7954 96936 14623 24652 46219 126449 140214 35179 28015 89132 105549 81494 74840 54082
7942 54082 -48137 -88248 -63983 -28252 -56759 -108461 -64836 22469 31240 42199 134865 145195
7930 145195 74640 80281 59241 115131 106171 63610 74711 43212 -28884 -99683 -73575 -81877
7918 -81877 -39198 31008 18180 -76749 -19028 4274 -17862 -16977 3499 23553 22754 6943 5034
7905 5034 -11415 -7972 14875 44349 46737 103950 121253 72841 11980 -24003 -72192 -96819
7893 -96819 -115415 -38537 -13439 -6496 1497 23844 61207 124245 64312 -12722 26297 37563
7881 37563 14027 7015 -61288 -34827 -25302 3679 30227 -39965 -67206 3429 2318 -5622 26485
7868 26485 -31696 -66062 -70906 1644 48990 -6916 -2452 -20534 -60 65941 79821 -15119
7856a5119q856M701K957O2037o3477o8162J5974J5407J03530P578p0144J6321
7844B747Q0805M2110l0567k4167L6614L0766o3409n9556p1118k9216P2634L1492
7832A9135r269k2452J1278k5296l816N1124K5378k3414J4972K125j5228L5987
7820F0524l1556R067O343L7376k8342L036K2737j9680L2845P7335M6661j2480
7808B03866p0097o0094K9976o434K2981o314l027p624l3334p0728M3026P3914
7796A16111n4330l2794n344J4281j3624o7831o1637Q3875Q8385j7010j1483J3277
7784E1876m51K1397k6912n3340J3142L5315K9656J6835p5316o6987p0637J0943
7772a14479R2889Q341O270K7822k1343j4624J7057J9726L7227O023j4844j1240
$$ plain form
7856 -15119 -23975 -19274 -16317 45720 -17757 -85919 -69945 -54538 48992 56570 -13574 2747
7844 2747 83552 125662 95095 70928 107542 138308 74899 15343 -55775 -84991 -12357 19135
7832 19135 9866 -12586 -1308 -26604 -30420 20704 46082 22668 37640 39765 24537 60524
7820 60524 28968 38035 44378 81754 53412 56448 79185 59505 92350 169685 216346 203866
7808 203866 133769 73675 103651 97217 120198 113884 110857 103233 69899 -829 42197 116111
7796 116111 61781 28987 23643 37924 24300 -43531 -105168 -21293 67092 50082 38599 51876
7784 51876 51425 72822 45910 -7430 5712 41027 70683 87518 12202 -54785 -125422 -114479
7772 -114479 -21590 -13249 -6979 20843 -500 -15124 1933 21659 58886 64909 50065 38825
7760C8825n0128J4535K4869q3289p760L4484K5402L3261l1856m9526K9397j6190
7748c7976j4777J1875j2513p804J8310K2831L247J8164j11998k4266N0221J5807
7736f8879L7700J1670P2797J5038q7297o4260k6218N7183M3432O3841O3606r640
7724A08973j8689M3104j9005m9528k5868n2475o6930L3360j482J4714j7459K874
7712d8411J6871N7870r562j3906L2363r686j6963m5710J7416o8295p7420L1173
7700a34260J4417O7318O1033J0670l7819J9391l230J5391L4256p8375k9640M9355
7688a1493r615m4576l263L3609k0144m3397j1751K0193P1162R6593J197l0646
7676D7869n2422N04p908j5966N0431L7899n6455O0771J7297l2725j6370R695j5573
$$ plain form
7760 38825 -11303 3232 28101 -55188 -62948 -28464 -3062 30199 -1657 -51183 -21786 -37976
7748 -37976 -52753 -40878 -53391 -61195 -42885 -20054 -16807 1357 -110641 -134907 -84686 -68879
7736 -68879 -31179 -19509 53288 68326 -18971 -83231 -109449 -52266 -8834 55007 118613 108973
7724 108973 90284 133388 114383 64855 38987 -13488 -80418 -47058 -48540 -33826 -51285 -48411
7712 -48411 -31540 26330 16768 2862 35225 25539 8576 -37134 -19718 -88013 -165433 -134260
7700 -134260 -119843 -52525 8508 19178 -18641 750 -2480 12911 47167 -31208 -60848 -11493
7688 -11493 -21108 -65684 -68947 -35338 -55482 -98879 -110630 -90437 -19275 77318 78515 47869
7676 47869 -4553 -4049 -11957 -27923 22508 60407 3952 64723 82020 49295 32925 42620 27047
7663B7047J1649j7527P5158K2354m8811j8771m5052L0964J6020n8974l3498q4551
7651a23992K8971j5181Q937N5743K5712k6574P70O0702L6906o7400K2215L2233
7639C9042N9865K9647k2117p6251m2622k2996l0227N4046k209j692P826K6607
7627A8919N5880o0979J1901N1082k6319L063K5803L179l550k9105k5619J7066
7615D1321M8603L2914j5897j6179n163j25611j6354J1403J5872Q0060N4188k8992
7603G6165l8954k8309R266j2012p894M3241N7162j0839K5832m9654p1437l0019
7591c7452O6137L3960j3685q3089n075M1415J4473k7449k7633J1558k3670m3265
7579i3775m648Q9120J3514n3105L1262M5931j0431M241k7704K7724l6036J5548
$$ plain form
7663 27047 38696 21169 96327 118681 69870 51099 6047 37011 53031 -5943 -39441 -123992
7651 -123992 -95021 -110202 -101265 -45522 -19810 -46384 -45614 15088 51994 -15406 6809 39042
7639 39042 98907 128554 106437 30186 -12436 -35432 -65659 -11613 -13822 -15514 -7688 18919
7627 18919 74799 13820 25721 76803 50484 53547 79350 82529 78979 49874 24255 41321
7615 41321 89924 122838 106941 90762 85599 -40012 -56366 -44963 -29091 50969 105157 76165
7603 76165 37211 8902 18168 6156 -1738 41503 98665 87826 113658 64004 -7433 -37452
7591 -37452 28685 62645 48960 -34129 -39204 2211 16684 -10765 -38398 -26840 -50510 -93775
7579 -93775 -98423 -9303 4211 -48894 -17632 28299 17868 22109 -5595 22129 -13907 1641
7567A641j3946k1351j2061j4104k0175l3871K8905M7110n994n9713M7525N0679
7555e355N7160q175r2820l2873n96k6446J2602k7940L0758P1700J02775M962l8911
7542D6841J2898J2022j5904O702L5652j8701p5145r0884l8738M7362L5777N3349
7530A1231o37j5478o8124r440K09K0246M5354K3988J7772J7185K8762m0065o2177
7517c1174o761K9200k5149O4398M6891L3671O088n5110k1777l8662K6650J7958
7505D6223r0778m3580J02729N3217M1342j14700r257k4123j3089q527K7039K0089
7493a3415P004O375K7218L9696l1517L165L5627l1057m2997r493K9161k2304k356
7480d893J2610L4145j6154j878J2023K1318r2121k7246M002n0986n3037K8476
$$ plain form
7567 1641 -12305 -33656 -45717 -59821 -79996 -113867 -84962 -37852 -43846 -103559 -56034 -5355
7555 -5355 51805 43630 -49190 -82063 -82659 -109105 -96503 -124443 -93685 -21985 80790 85752 46841
7542 46841 59739 71761 55857 62559 98211 79510 4365 -86519 -125257 -77895 -42118 11231
7530 11231 10594 -4884 -73008 -82448 -82239 -61993 -16639 7349 25121 42306 71068 31003 -31174
7517 -31174 -37935 -8735 -33884 30514 77405 111076 117164 62054 40277 1615 28265 46223
7505 46223 -44555 -88135 14594 67811 109153 -5547 -14804 -38927 -52016 -60543 -33504 -13415
7493 -13415 -6411 -36 27182 66878 35361 38526 74153 43096 99 -9394 19767 -2537 -4893
7480 -4893 7717 41862 25708 23830 35853 57171 -34950 -62196 -58194 -109180 -162217 -133741
7468a33741Q9076R1169M6557r447N5714o732m7567J968n3208j6410o289q8119
7456g7029j4343M3904l4775K7531J6961j1889n8103M95O7298O892k5022J6336
7444d1744O527J72k9758k1093j495J9804n3001N5336j1119j5923O5927O2295N1419
7431H7347L2029k0434m1677m8981n1961M1570k3427J2527k0715j1294N2577K2428
7419B9989L115N6267r4147m5432j5885M896O1031J6740L3947O8872M329o5206
7407E8516o7939L1728N4820k0556l490l134n1910l6745k2614l388Q4421M4549
7395F4258K993K5112m5731o488J9012L6993k4986p4291q5682L1277J11232j1956
7383D1743m7948l0074j3752L4401L6340q030n380K2316J1450M2771l2141o4274
$$ plain form
7468 -133741 -44665 46504 93061 83614 139328 132596 85029 86997 33789 17379 11090 -77029
7456 -77029 -91372 -47468 -82243 -54712 -37751 -49640 -107743 -107248 -39950 -33058 -58080 -41744
7444 -41744 -35217 -35045 -64803 -85896 -87391 -67587 -120588 -65252 -76371 -92294 -26367 35928 87347
7431 87347 119376 98942 57265 8284 -43677 -2107 -25534 -13007 -33722 -45016 7561 29989
7419 29989 33104 89371 -4776 -50208 -66093 -61197 -166 16574 50521 119393 123722 58516
7407 58516 -9423 22305 77125 56569 53079 49945 -1965 -38710 -61324 -64712 19709 64258
7395 64258 67251 92363 46632 40144 59156 96149 71163 -3128 -88810 -57533 53699 41743
7383 41743 -6205 -36279 -50031 -15630 20710 12680 7300 29616 41066 83837 51696 -12578
7371a2578n6741m6698N9268J13744K5731K199L0531o2619l3852L9761l039j5159
7359D0548j9017m1750j0516K9763K0044Q303j0403j9411J3460J7260n2666l4814
7347e9199j3342n745J3525L5730j5865k7537k4995R1102P9804K1391P939M032
7335A06840m612r6487n7474O3823P453o7546p9593j7984L2514K5727J8261L3827
7323c5251m0938P848j1880K4797J6960j9170k2390O2542J02934j0878j9457P6712
7311A31829j9419Q968k294k449o5521m3336L1732n763o4310J5384m4688j433K6286
7298c5014k7588P237J7278q6043M9409M1505j8503O4201R081O445k916q3535q3670
7285a42113J4032K7638L0260K8265o2139o3753Q1583R4812J9445j1693j3877M9262
$$ plain form
7371 -12578 -69319 -116017 -56749 56995 82726 84925 115456 52837 18985 58746 55707 40548
7359 40548 21531 -20219 -30735 -972 19072 27375 16972 -2439 11021 28281 -24385 -59199
7347 -59199 -72541 -78286 -64761 -29031 -44896 -72433 -97428 -6326 73478 94869 102808 106840
7335 106840 102228 5741 -51733 12090 19543 -48003 -127596 -145580 -113066 -87339 -69078 -35251
7323 -35251 -76189 -68341 -80221 -55424 -38464 -57634 -80024 -17482 85452 74574 55117 131829
7311 131829 112410 121378 119084 116635 51114 7778 39510 33747 -30563 -15179 -59867 -61300 -35014
7298 -35014 -62602 -55365 -38087 -124130 -74721 -33216 -51719 12482 21563 28008 25092 -58443 -142113
7285 -142113 -128081 -100443 -70183 -41918 -104057 -167810 -86227 8585 28030 16337 2460 51722
7273E1722m4207n6028Q804n763l0109M7768K4182K6698m6985k1929k4860K4448
7261d6259k427J1775k3337J6275Q9614O2996M9481p2229n5530o0289m0247J0374
7249e9803M961j4977o7899J9473M489J352J6675L6600j2554r622K9361J9752j0137
7236d2329j2763K90l216J0722m3436M6919J2946L272L0049J9517k2661j3435M0424
7223B6299l713J6909n2589m9661J3311J9134j2899K4740q628q403l2349l878p3177
7210a44904N047N1852j1091K5061P7144M4102r352m8181o473L9181j887J2975
7198C3474N133k7981J6308L8154J5201j5338n5390R735M1324K872K9973K9908
7186A23373k4746k7413j1896j5030p126m0870m5596l326K1290m855M1333k4705
$$ plain form
7273 51722 7515 -48513 -39709 -45472 -75581 -27813 -3631 23067 -23918 -45847 -70707 -46259
7261 -46259 -48686 -36911 -60248 -43973 45641 108637 158118 85889 30359 -29930 -70177 -59803
7249 -59803 -54842 -69819 -137718 -118245 -113756 -112404 -95729 -59129 -71683 -81305 -51944 -32192 -42329
7236 -42329 -55092 -54802 -58018 -47296 -90732 -43813 -30867 -27595 2454 21971 -690 -14125 26299
7223 26299 22586 39495 -13094 -62755 -49444 -30310 -43209 -18469 -27097 -35500 -67849 -71727 -144904
7210 -144904 -139857 -88005 -99096 -74035 3109 47211 37859 -10322 -16795 22386 20499 33474
7198 33474 38607 10626 26934 65088 80289 64951 9561 19296 60620 63492 93465 123373
7186 123373 98627 71214 59318 44288 37162 -3708 -49304 -52630 -31340 -36195 5138 -19567
7174a9567j7411L0950M3218r5389k5284L1261N5836P6577K8283j1525N621m8196
7162E4374j04669k8205l6038K4861J3013J0947P428L3793L0883J5544k1984k6250
7150b6303K1668p092M3650L0654J3436j0348q33J0574l3399k5497m3241K203k787
7137b7315J1450l16m8837J8030j052l717N2364p9899J2240P2511J3649L5368m9304
7124E172M263K8715K5875N8269q662l9659J2336j4559k6507L3488j183p8355m565
7111e372K0706j8081k2683K1319K5013j2768p8539j5240k6235L4423R5988R5039
7099A13570K3503r6064k7800k8039n1978K3367J1037M5567k0171n349l3273O4106
7087A8476N7965M8505n0106k7481m3582r2374l6760L9161O9613k3184M8301K6126
$$ plain form
7174 -19567 -36978 -6028 37190 -58199 -83483 -52222 3614 80191 108474 96949 102570 54374
7162 54374 -50295 -78500 -114538 -89677 -76664 -65717 -58289 -24496 6387 21931 -53 -26303
7150 -26303 -4635 -11727 31923 62577 76013 65665 64832 75406 42007 16510 -26731 -24528 -27315
7137 -27315 -15865 -16181 -65018 -46988 -48040 -51757 607 -79292 -67052 5459 19108 54476 5172
7124 5172 9435 38150 64025 122294 113632 73973 86309 71750 45243 78731 77548 -807 -5372
7111 -5372 15334 -2747 -25430 -4111 20902 8134 -70405 -85645 -111880 -77457 18531 113570
7099 113570 137073 41009 13209 -14830 -66808 -43441 -32404 13163 -7008 -12357 -45630 18476
7087 18476 76441 124946 74840 47359 3777 -88597 -125357 -86196 -16583 -39767 8534 34660
7075C4660j5884j5866l1464K4959n827j8489l6546m2931J4897L5301L201k8142
7063h2131K1817J1165j4939N4045K4326n7704q5560p392P2076P2137P6641P520
7051I2001p7700k2130M7292o4233M470M0006K4280K3689p1382r4851m1370O852
7039a33076N534k3203J3010M5204m7794k1644P5293R2445L5372K796J3601n1331
7027F207K2158K6797m0833l0717M6868J2883K1676q5976o9104M1207O6804P151
7015B5121K7209K1967q0692n1728P294m598N4229L2900K8324L1557Q465m0612
7003E9436n384j2055j1459p1396m2661j6851J4990J11990k4708j7404k3803k7947
6991f7252j3328j4848R51K6956N109J6794k8133q41M9615N6015o635l7505K1327
$$ plain form
7075 34660 18776 2910 -28554 -3595 -9422 -27911 -64457 -107388 -92491 -57190 -53989 -82131
7063 -82131 -60314 -49149 -64088 -10043 14283 -43421 -128981 -136373 -64297 7840 84481 92001
7051 92001 14301 -7829 39463 -24770 -20300 19706 43986 67675 -3707 -98558 -139928 -133076
7039 -133076 -127542 -150745 -137735 -92531 -140325 -161969 -86676 5769 41141 43937 57538 6207
7027 6207 28365 55162 14329 -16388 30480 43363 65039 -20937 -90041 -48834 17970 25121
7015 25121 52330 74297 -6395 -58123 -50829 -55427 -1198 31702 60026 91583 100048 59436
7003 59436 54052 41997 30538 -40858 -83519 -100370 -85380 26610 1902 -15502 -39305 -67252
6991 -67252 -80580 -95428 -94477 -67521 -62412 -45618 -73751 -74592 -24977 31038 24403 -13102 8225
6978H225M2602N914k7374J1139J5250N195K254l7168L1236k0212l9435K5821N8078
6965H1525j0117p130J4591Q554L8619k2077n3238m1864j9475j7230k8861o1268
6953a17971m8587l9800J0081P7750M6710R0616q247j0557j7143K7154N5412l1959
6941C3459J0536O252k8731k2722L4820O999K8658j6025j9763k3346j3911M1124
6929C7350M6733K1523j1911j2929q6348k0790k6259m5184L8614M7297L9111R943
6917C7150M1220J1600J3658q6018q57L2218p5752m6223K1093m9889M798R0471
6905f531L1872N116q497n6177j790J3418N9160M8366M450L1644j2202l5416n225
6892F8188j4763R436K4015J0809O059n3956j1830p210k8914l1211J2037m951M8788
$$ plain form
6978 8225 50827 56741 29367 40506 55756 60951 63205 26037 57273 37061 -2374 23447 81525
6965 81525 71408 64278 78869 87423 126042 103965 50727 8863 -10612 -27842 -56703 -117971
6953 -117971 -166558 -206358 -196277 -118527 -71817 18799 10552 -5 -17148 10006 65418 33459
6941 33459 43995 50247 21516 -1206 33614 40613 69271 53246 33483 10137 -3774 37350
6929 37350 84083 105606 93695 80766 -5582 -26372 -52631 -97815 -59201 -11904 27207 37150
6917 37150 78370 89970 103628 17610 16753 48971 -26781 -73004 -51911 -101800 -97002 -6531
6905 -6531 25341 30457 21960 -34217 -36007 -22589 36571 84937 89387 121031 108829 73413 68188
6892 68188 53425 62861 86876 97685 103744 49788 37958 30748 1834 -29377 -17340 -22291 26497
6879B6497M1563J0538P02r663j7046l2234j4548j9211r658p2862k6846l9382O801
6866a55349O0320N5429Q116n4K5985M1949P7242j1377j9040J6531R760K868j17431
6853e051j6005L0236K531m1316k8635j0249K8673M9257M8371k6743k1340l9951
6841c0222L7198m4948m0732M0140Q292R03j793l961j8487L6148L9329l7216p5641
6828i0990J5356m903k5072j6584J5058J8489M6554J2605J8289n9054k3453o5363
6816a59068K8584R2866L7076l6433J9696j1930L3474Q6192k881n9761n6979j8485
6804d7649q803K7119K271l371l3026l5841L920L7819m8376J8945R1321J4551p120
6791A1760q777p1617O2550O6825L1913n1778j3789k1392j9358j967L2920L540
$$ plain form
6879 26497 68060 78598 79300 69637 52591 20357 5809 -13402 -23060 -95922 -122768 -162150 -155349
6866 -155349 -95029 -39600 -31484 -31538 -5553 36396 113638 102261 83221 99752 109512 112380 -5051
6853 -5051 -21056 9180 11711 -29605 -58240 -68489 -39816 9441 57812 31069 9729 -30222
6841 -30222 6976 -37972 -78704 -38564 -30272 -29369 -31162 -35123 -53610 -17462 21867 -15349 -90990
6828 -90990 -75634 -80537 -105609 -122193 -107135 -88646 -42092 -29487 -11198 -70252 -93705 -159068
6816 -159068 -130484 -37618 -542 -36975 -17279 -29209 4265 90457 87576 27815 -29164 -47649
6804 -47649 -56452 -29333 -27062 -30433 -63459 -99300 -95380 -57561 -105937 -86992 4329 18880 11760
6791 11760 2983 -68634 -6084 60741 92654 40876 27087 5695 -13663 -15630 17290 20830
6779B0830j9495L1728P256L233j4042P875Q761j4739l439K9204j042l8486Q793
6766B6437l409j3096j03808K9017J3521j7215J2507P0989k2432l7839o0866P4315
6754c1879R6216P889m5723m1403J3837N5689P2511p962M6301j0322o4498O078
6742I6734n8878K8147P869k6191J8464l3020p7285k5085J6886K3669m3525L2428
6730c9787J0753L2064L6736K2323o387q3180j37174j8801O690k4443O4073J05981
6718c1152K0758p0832J8595Q180k0918P923J3681K9464N1503J217n5331k0258
6706d7170m558o0184L7637j7212m4598K6228J14411K9848l8190L063j7708L3686
6694A5253m2505j7990R596j0261n806k6137K0615k1343N9617O1976O3081j2746
$$ plain form
6779 20830 1335 33063 40319 43552 29510 37385 46146 31407 27968 57172 56130 17644 26437
6766 26437 23028 9932 -93876 -64859 -51338 -68553 -56046 14943 -7489 -45328 -106194 -31879
6754 -31879 64337 72226 26503 -14900 -1063 54626 127137 119175 165476 155154 90656 96734
6742 96734 37856 66003 73872 47681 66145 33125 -44160 -69245 -52359 -28690 -72215 -39787
6730 -39787 -29034 3030 39766 62089 55702 -27478 -164652 -183453 -176763 -201206 -137133 -31152
6718 -31152 -10394 -81226 -62631 -54451 -75369 -67446 -53765 -24301 27202 28419 -26912 -47170
6706 -47170 -51728 -111912 -74275 -91487 -136085 -109857 4554 34402 -3788 -725 -18433 15253
6694 15253 -27252 -45242 -35646 -45907 -51713 -77850 -57235 -78578 -18961 43015 106096 93350
6682I3350n3453j74L1538K8601m137m3645o9566j2708J5530N205q085j4119l6514
6669f8177J1628N6458p24k5903q486n2579j4543P4706M8272l0643j9606n7513
6657h7110j185l286M6336M4530M3040j9081J331l263Q747k3466k8933J1972Q3880
6644G3512q363m2912k1839J2433J0435q6210j5354M2615j6092M0403J4065o8830
6632f6137m3832M6832L2532m459l7322K6030N6075j5149o785j6109K4323P6892
6620G2891j2857m5351k5979j6841M814K48k3710M8336N8791R247L3401j40508
6608c7518n3199K3538l1218j0114L7206M4422L8944l6595l4143L8211P7544K6859
6596H3937l4037j32827j4274O3483L5816J9889M241n2498l1680N390j2165L8251
$$ plain form
6682 93350 39897 39723 71261 99862 95725 52080 -17486 -30194 -14664 -9459 -17544 -31663 -68177
6669 -68177 -56549 -91 -815 -26718 -35204 -87783 -102326 -27620 20652 -9991 -29597 -87110
6657 -87110 -88295 -91581 -45245 -715 42325 23244 24575 21312 30059 6593 -22340 -10368 73512
6644 73512 65149 22237 398 12831 23266 -62944 -78298 -35683 -51775 -11372 2693 -66137
6632 -66137 -109969 -63137 -30605 -35064 -72386 -46356 9719 -5430 -12215 -28324 -4001 72891
6620 72891 60034 14683 -11296 -28137 -23323 -23075 -46785 1551 60342 69589 102990 -37518
6608 -37518 -90717 -67179 -98397 -108511 -71305 -26883 12061 -24534 -58677 -20466 57078 83937
6596 83937 49900 -82927 -97201 -33718 2098 21987 26228 -26270 -57950 -52560 -64725 -26474
6584b6474l5598N8465P1917l0659m4064r3157M1409L2879j089J1413l1019l8957
6572h4934k1434M126m8046J3601M1627j414Q752J9182Q643J085n0729j6926L2094
6559i4373M5223m3380j3179N3060P9433p1006m6009o609N4130m156l2900j5469
6547i5235Q854L1413L4586L6389k6155l5119O301k8239o4192K1242N4536J900
6535e3719N5296m6729k9322n350p7904j5473L8135P1856M4102J035K645p019n566
6522b8013J8120K0196o0657K425M3948J1790k7917n8666M5022P5525p166j3719
6510B0888l8126n7897j4938M3860Q6745J0953R163o6834o3659J6677M5356L1427
6498B3615l5315j9899k6334J008l301R2809N0297m2697R594K8305N0334J4131
$$ plain form
6584 -26474 -62072 -3607 68310 37651 -6413 -99570 -58161 -25282 -26371 -14958 -45977 -84934
6572 -84934 -106368 -102242 -150288 -136687 -95060 -96474 -87722 -68540 -59897 -58812 -109541 -126467 -94373
6559 -94373 -49150 -92530 -105709 -52649 26784 -44222 -90231 -96840 -42710 -46866 -79766 -95235
6547 -95235 -86381 -54968 -20382 16007 -10148 -45267 -38966 -67205 -131397 -110155 -55619 -53719
6535 -53719 1577 -45152 -74474 -79824 -157728 -173201 -135066 -63210 -19108 -18073 -15428 -22447 -28013
6522 -28013 -9893 10303 -50354 -47929 -3981 7809 -20108 -78774 -33752 41773 34607 20888
6510 20888 -17238 -75135 -90073 -46213 40532 51485 60648 -6186 -69845 -53168 -7812 23615
6498 23615 -11700 -31599 -57933 -56925 -60226 32583 82880 40183 49777 78082 128416 142547
6486A42547j3440j2320m2497l7685l590k375n866l7486k4168N8257K5831m8614
6474a406o671L312K9673O652n7160K1710r774l8128K2996L5086n365j395l3353
6461c3823n5462r180L9822L1880j2820J529K7560n8040n4019l282j1669M2480
6449i5024O1741n82o731J952l9334K1937J5149O6942N2955q8442n5418J0628N1199
6436c028N1325j6243l4109l5405k4037M9530M259r0372m0453Q9433Q4198j116
6424C3982J0351l6467l8568j718l284J9246k2182k8767J4551M0482J3245j7213
6412a6342L6365L1424n6162K1342J2134o9405k1937n486M6612r040n924K6407
6400a0012N393P002N530K8561j5105K4851n813o1795L1628K8002k8486o0633j5710
$$ plain form
6486 142547 129107 116787 74290 36605 33015 30640 24774 -12712 -36880 21377 47208 -1406
6474 -1406 -8077 -4765 24908 31560 -25600 -3890 -13664 -51792 -28796 6290 925 -470 -33823
6461 -33823 -89285 -98465 -58643 -26763 -39583 -38054 -10494 -68534 -122553 -125835 -137504 -95024
6449 -95024 -33283 -33865 -40596 -38644 -77978 -56041 -40892 26050 79005 -9437 -64855 -54227 -3028
6436 -3028 48297 32054 -2055 -37460 -61497 -11967 -7708 -98080 -138533 -49100 35098 33982
6424 33982 44333 7866 -30702 -32420 -35704 -16458 -38640 -67407 -52856 -12374 871 -16342
6412 -16342 20023 51447 -4715 16627 28761 -40644 -62581 -68067 -21455 -30495 -36419 -10012
6400 -10012 -4619 2383 7913 36474 21369 46220 40407 -21388 10240 38242 9756 -50877 -66587
6387f6587l7582r745r462K6339k2616L0122N5517J7928m20l7159p2943q64j5464
6374a42936Q0088Q5279P0132R585m9728l6884J7917l7428J7728L91J4663k253
6362B6554k5011l0082J7225M9630l7068n6833l2296K0280J5651j2045K6284R435
6350b8276k1526j12588n0934O5035O4522P4488j765m9134r8405K224O279M1033
6338a09047k5304L1316k1986P6328P1476j1496k2490J8906N2658J5048K2712M4421
6326A42542q0402l6206J1650L9403k7932l2139m3006l0144j7512K5394L1919K3106
6314F673q7285k8465l296K6783J5693J1002L7454m7481r898N802J0155P9087l4937
6301a8713m3920m1219L479M5746O9839L7746O6645l9911q9638k5805K4144k9268
$$ plain form
6387 -66587 -104169 -113914 -123376 -97037 -119653 -89531 -34014 -16086 -16506 -53665 -126608 -127472 -142936
6374 -142936 -62848 22431 92563 102148 52420 15536 33453 -3975 13753 14144 28807 26554
6362 26554 1543 -28539 -11314 38316 1248 -55585 -87881 -67601 -51950 -63995 -37711 -28276
6350 -28276 -49802 -162390 -213324 -148289 -83767 -9279 -11044 -60178 -158583 -156359 -150080 -109047
6338 -109047 -134351 -103035 -125021 -48693 22783 11287 -11203 7703 60361 75409 98121 142542
6326 142542 62140 25934 37584 76987 49055 16916 -26090 -56234 -73746 -48352 -16433 6673
6314 6673 -80612 -109077 -112373 -85590 -69897 -58895 -21441 -68922 -78820 -73018 -62863 16224 -18713
6301 -18713 -62633 -103852 -100373 -54627 15212 52958 119603 79692 -9946 -35751 -11607 -40875
6289d0875k928j6373R096O6605J3155j24204J6147P6209L0032K361j6973l2660
6277b0408m527J3574j7993j1034m6690k3674P5974K5215l0125r420O8107q703
6265A0296k7718O9994n3117r5473k3088l928L1462M7912l782n299l5841M6909
6253d1673k195j2938m7954k7713R1896M2568l9490l8889M7771M5521l9376j5001
6241c7473m6396r032L4090P5865M1158k455q5609P919N2652L4995L87n8705p1915
6228f4519l0400l2970J9561j9415Q634P7261J6259M6198J4881m7O677j8811o1436
6215c8127Q277K0820j7092O9623M0374p4646m3966J0931J1291J479l7856j5106
6203f3998j7866M7469m1788l3003j2058k0750J15079n853l1861j0764J431m4647
$$ plain form
6289 -40875 -43803 -60176 -51080 15525 28680 -95524 -79377 -3168 26864 29225 12252 -20408
6277 -20408 -24935 -11361 -29354 -40388 -87078 -110752 -34778 -9563 -39688 -49108 18999 10296
6265 10296 -17422 52572 -545 -96018 -119106 -123034 -91572 -43660 -47442 -52741 -88582 -41673
6253 -41673 -43868 -56806 -104760 -132473 -40577 1991 -37499 -76388 -28617 16904 -22472 -37473
6241 -37473 -83869 -92901 -58811 17054 58212 55757 -29852 -21933 30719 65714 66101 7396 -64519
6228 -64519 -94919 -127889 -108328 -127743 -119109 -41848 -25589 20609 35490 35443 42120 23309 -38127
6215 -38127 -29850 -9030 -26122 43501 83875 9229 -34737 -23806 -12515 -11036 -48892 -63998
6203 -63998 -81864 -34395 -76183 -109186 -121244 -141994 -26915 -32768 -64629 -75393 -73962 -118609
6191a18609R861p015P6108O3301k7893J0353J2571p4595k6276m383L7533m8228
6179i7272n5625L5000O3112K0398J7769l0580o806j1547J0380K9640l195q485
6167c7211j8580j6994R335K8010m9474n7870R2418M0411r0921O2753M9160q5175
6155g4138l6787L0845N5163J8561J1352k7887j3659r170n207K0983L9088N7864
6143F7008J012k6931k4430j8433n9783l7434L6488l5288L3765K4523J466l1980
6131g0017k6219m2141j7341K9865O9638K8662N4884K915k2692j14697l6741l668
6119a47552P609P1763J08979r492j14659Q0238J9570m7253n0142J3205N1060O8931
6107E2257l452r7540j6092k4716L1019N7796n1285J7608J5848l2176p330L0266
$$ plain form
6191 -118609 -108748 -115763 -39655 23646 -4247 6106 18677 -55918 -82194 -86577 -49044 -97272
6179 -97272 -152897 -117897 -54785 -34387 -16618 -47198 -54004 -65551 -55171 -25531 -28726 -37211
6167 -37211 -55791 -72785 -63450 -35440 -84914 -142784 -50366 -9955 -100876 -38123 11037 -74138
6155 -74138 -110925 -80080 -24917 -6356 4996 -22891 -36550 -45720 -50927 -29944 9144 67008
6143 67008 68020 41089 16659 -1774 -61557 -98991 -62503 -97791 -64026 -39503 -38037 -70017
6131 -70017 -96236 -138377 -155718 -125853 -56215 -27553 27331 30246 7554 -107143 -143884 -147552
6119 -147552 -139943 -68180 40799 31307 -83352 -3114 16456 -30797 -80939 -67734 -16674 52257
6107 52257 48805 -48735 -64827 -89543 -58524 -728 -52013 -34405 -18557 -50733 -58063 -27797
6095b7797j1551k6275Q715k900L9004o455P4238K1700n8944k7565p1827k0092
6083a09749k5643K2051O6k7046L5018N3754K0765q277q844q948K7580n503j6964
6070e1740O643M8707M4600J411n97K7653R648n3929o2219P7786q711o2055o1887
6057h4690J6339O3120n7891j6257O6855N3637j436j13291k2008N4144K8492R741
6045c245m1439N5089K4566q4045J4150N3024R1529n5031n4634L2282K289j1154
6033B3381o0715J5215O9989K5220k2287l2014m8049m8653k8067L2150M9199J0314
6021a4317m1960j0368M2639L9077q815P942J031o4961O426P1329o178k6868J4214
6008I191K0360k5460k9908j9886K9935o6482j0573P1516P6155q124k4605k6653
$$ plain form
6095 -27797 -39348 -65623 -56908 -59808 -20804 -27259 46979 68679 9735 -17830 -89657 -109749
6083 -109749 -135392 -113341 -113275 -140321 -105303 -51549 -30784 -39061 -47905 -56853 -29273 -34776 -51740
6070 -51740 -45097 3610 48210 49621 49024 76677 86325 32396 -29823 47963 39252 -22803 -84690
6057 -84690 -68351 -5231 -63122 -79379 -12524 41113 39677 -73614 -95622 -41478 -12986 -3245
6045 -3245 -44684 10405 34971 -49074 -34924 18100 109629 54598 -36 32246 34535 23381
6033 23381 -37334 -22119 47870 73090 50803 18789 -29260 -77913 -105980 -73830 -24631 -14317
6021 -14317 -56277 -66645 -24006 15071 6256 14198 15229 -49732 -43306 28023 21845 -5023 9191
6008 9191 29551 4091 -25817 -45703 -15768 -82250 -92823 -21307 54848 46724 22119 -4534
5996d534N6749q666m1065J2311K9240k3303m874J2334K0387K4967l5120k7329
5984A1097L4741L973k6289J7712j1882m4367j548l0202L894L2119O383p1567q5566
5971a61502m724M9539J06894L5910o4736M491K0447J2518m907j9418m5168L1109
5959c9547M5820k5947p330K8126l0796p4239J0832K5234J483m6024R527K257J9028
5946h1576K8681J2967j0854J1607J6375K9161q961q2132l9556N0002P7206k6532
5934b3612o903L762K3851k1229j3551P784n214o753J0007p3560k5229Q675Q7844
5921c4128L3137N135M3908k1327m6781J7392j7663N1925l0040J539k3693m6M9621
5908B8979J6435o5638Q638L0576m5252L4954N7403N9142l1910q3045m0759o018
$$ plain form
5996 -4534 52215 43549 2484 14795 44035 20732 15858 28192 48579 73546 38426 11097
5984 11097 45838 49811 23522 41234 29352 -15015 -16563 -46765 -42871 -10752 -4369 -75936 -161502
5971 -161502 -166226 -116687 -9793 26117 -38619 -34128 -13681 -1163 -6070 -25488 -70656 -39547
5959 -39547 6273 -19674 -27004 1122 -29674 -103913 -93081 -67847 -66364 -112388 -102861 -100604 -81576
5946 -81576 -52895 -39928 -50782 -39175 -22800 6361 -2600 -84732 -124288 -74286 2920 -23612
5934 -23612 -30515 -26753 -2902 -24131 -37682 -29898 -35112 -41865 -31858 -105418 -130647 -121972 -34128
5921 -34128 -991 4144 48052 26725 -20056 -2664 -20327 31598 1558 3097 -20596 -20642 28979
5908 28979 45414 -20224 -11586 18990 -26262 8692 66095 125237 93327 10282 -30477 -36495
5896c6495J9144L5358Q652L551J7640k483J28K4231K835o716o2323l7433k9315
5883f3226N0638M6087K1880p8648j2837j8900M476J1960l3107J0292L0092O6781
5871C5488l7664m7158n804J7447P6006l4523j8218R140K7603p094P730k6750l3956
5858c7753j42318j1895L8832P324K9104K5154L0751Q35L1295L5774j1568m2974
5846d7439J6030L0173n5397J8028l9228r8639k5656M2029K8985m444N747K5818
5834a03993N50L5597K2822O8681Q852o0077q3697k1283R9564N7544l0833K7375
5822B1102m123m3300K5118j6579n2229n031r16K024M9595r487r8167N0162J083
5809h0748L4404K6025l543k5136k1744j0850K5351m6659k6778K2992k8558l0501
$$ plain form
5896 -36495 -17351 18007 26659 30210 47850 45367 45495 69726 72561 65845 3522 -33911 -63226
5883 -63226 -12588 33499 55379 -23269 -36106 -55006 -50530 -38570 -71677 -61385 -31293 35488
5871 35488 -2176 -49334 -55138 -37691 38315 3792 -14426 -5286 22317 15223 22953 -3797 -37753
5858 -37753 -180071 -191966 -153134 -145810 -116706 -91552 -60801 -59966 -28671 7103 -4465 -47439
5846 -47439 -31409 -1236 -56633 -38605 -77833 -176472 -202128 -160099 -131114 -135558 -129811 -103993
5834 -103993 -103443 -67846 -45024 23657 32509 -27568 -111265 -132548 -32984 24560 -6273 21102
5822 21102 16979 -26321 -1203 -17782 -70011 -75042 -75958 -73934 -24339 -33826 -131993 -81831 -80748
5809 -80748 -46344 -20319 -23862 -48998 -70742 -81592 -56241 -102900 -129678 -106686 -135244 -165745
5797a65745m2517L9470P4605O1697j7425P4365N2949l2941l0780m4398k834n6900
5785i0454K8416k2186M0811M3181P575K477l982o2684K0327j245n2553p2884P5404
5772h7797P3746k9151l1362L0299Q4934L7235l6568o0958r464j4067l3083j0494
5760h6730J9079L9896r215k9520L642N0873M136k9526J2429N5769N7061j8400
5748F9494o6749J5339M3320N873O391j20330p3228J5845N0084M0391n502j5192
5736c4264P2549J6511n5921K9152k1422m8413L6954j0983q260J1221L9434k8813
5724b255L6288j5534m1185o1973J0972R7023N2929k4944k3162k4309J5058j6164
5712B744p7417L7641N6847o07P05k015K2774k315m347j8226m9104l796O7302k492
$$ plain form
5797 -165745 -208262 -168792 -94187 -32490 -49915 24450 77399 44458 13678 -30720 -33554 -90454
5785 -90454 -62038 -84224 -43413 -232 7343 9820 5838 -56846 -36519 -37764 -90317 -163201 -87797
5772 -87797 -14051 -43202 -74564 -44265 40669 77904 41336 -19622 -29086 -43153 -76236 -86730
5760 -86730 -67651 -27755 -36970 -66490 -62848 -11975 -7839 -37365 -24936 30833 87894 69494
5748 69494 2745 18084 61404 67277 73668 -46662 -119890 -104045 -53961 -13570 -19072 -34264
5736 -34264 38285 54796 -1125 28027 6605 -41808 -4854 -15837 -24097 -12876 26558 -2255
5724 -2255 34033 18499 -22686 -84659 -73687 23336 76265 51321 28159 3850 18908 2744
5712 2744 -74673 -37032 19815 19208 19913 17898 40672 38357 34010 15784 -33320 -37116 30186 27694
5698B7694k1035O5525J6374k1372j4557j8226Q511q6094R825P5918o0320j5087
5686c2844M5403N318J1556J3073J6044n150N564n6494j3699J7142K9930N1349
5674H7192n7876l4292N3761Q741J5050m3161M1129K1978j8472k7570k6136O79
5662B1023k6970k9565P2467j6269j8081p319q9709p0630M0009R0649k2765k906
5650f0066J1516J9290j3034J2385J2860k6592k3928j7306L3663j5038J9837P2829
5638B6416l6943q992l759j797l7992j1228N3821J3042o9398k8138M418J2118p6136
5625a64568L3093K2472M7402J642J8490N5287m8472l286j1695P574k2578M1424
5613b3215O8405K0o5712o5955j5304Q4623L8658o947r1327m7294R5739J4450K8333
$$ plain form
5698 27694 6659 72184 88558 67186 52629 34403 42914 -43180 -33355 42563 -17757 -32844
5686 -32844 12559 17877 29433 42506 58550 53400 58964 2470 -11229 5913 35843 87192
5674 87192 29316 -4976 48785 57526 72576 29415 70544 92522 74050 46480 20344 21023
5662 21023 -5947 -35512 36955 20686 2605 -4714 -94423 -165053 -125044 -34395 -57160 -60066
5650 -60066 -48550 -29260 -42294 -29909 -17049 -43641 -67569 -84875 -51212 -66250 -46413 26416
5638 26416 -10527 -19519 -23278 -25075 -63067 -74295 -20474 -7432 -76830 -104968 -100550 -88432 -164568
5625 -164568 -131475 -109003 -61601 -59959 -41469 13818 -34654 -37940 -49635 -42061 -64639 -23215
5613 -23215 45190 45210 -20502 -86457 -101761 -17138 21520 14573 -76754 -124048 -28309 -13859 14474
5600A4474J4504l4872n7696J65l6246M311N3561j1310J1812j440m8155m8850N712
5587a34030k8505O2489L0132N0093M6239k6418J3155K7218M272L2142L3986p1412
5575C9361l9130k6927j9480K0735M0870L2056o9127m2580Q3284k179l6195l2218
5563e1530K3418o578K8382N4784M5941l8833m0806j9533l175j3095O5703O3042
5551A07720l6247q4374m4817k6290m4255N8985M8095O2750j8422r4064n986J5502
5539f1403N2255l5272L708N8877M5557m5414n9343l6817J12137M4743m7478m2939
5527a1389k2449J3482j24J0375k8846M6316J2123K075r4695r445O1082L6174n3672
5514c8993o424K6208m543k757J12298n0766m1259k4218J5024L6564p0769k798
$$ plain form
5600 14474 28978 -5894 -63590 -63425 -99671 -95360 -41799 -53109 -41297 -42737 -90892 -139742 -134030
5587 -134030 -162535 -100046 -69914 -19821 26418 0 13155 40373 44645 76787 110773 39361
5575 39361 231 -26696 -46176 -25441 15429 47485 -21642 -64222 19062 16883 -19312 -51530
5563 -51530 -28112 -34690 -6308 48476 94417 55584 14778 -4755 -7930 -21025 44678 107720
5551 107720 71473 -12901 -57718 -84008 -128263 -69278 -21183 41567 23145 -70919 -76905 -61403
5539 -61403 -9148 -44420 -40712 18165 63722 18308 -41035 -77852 34285 79028 31550 -11389
5527 -11389 -33838 -20356 -20480 -10105 -38951 7365 19488 21563 -73132 -82577 -21495 14679 -38993
5514 -38993 -45417 -19209 -23752 -26509 85789 35023 -6236 -30454 -15430 21134 -49635 -52433
5502e2433O9562O502L0152p4390n6406k7034K3346N7919R163n7487j5591M247
5490h2450K876N6876K6548M419k4762m2334J9135Q0365Q557Q263r4031N5108O0213
5477G8783j6717O578r771j6668K9438q3530l9549l5253k9188N8219L6427L5527
5465A4296l8150n2987m1583K77J8810O3696M6753m0972m182j2388K4217O8444
5453D6231k9727r5707k5904L0869k2039j3503Q2122Q106J1946O4513o3433m1041
5441d7567O253M6615K8053L8808k7751o6423m3233L1341L1102l7155K1264o476
5429b5169Q8584k0433m8111N649o5745L2570M3402P7184O0780l3681k7525j7146
5417G0359p4052p8720j8282O4456m628n922N7298O9888l3772o6350j7467L1232
$$ plain form
5502 -52433 17129 23631 53783 -20607 -77013 -104047 -80701 -22782 -13619 -71106 -86697 -82450
5490 -82450 -79574 -22698 3850 8269 -16493 -58827 -39692 40673 49230 57493 -36538 18570 78783
5477 78783 62066 68644 58873 42205 71643 -11887 -51436 -86689 -115877 -57658 -21231 14296
5465 14296 -23854 -76841 -118424 -118147 -99337 -35641 11112 -29860 -34042 -46430 -22213 46231
5453 46231 16504 -79203 -105107 -74238 -96277 -109780 -27658 -19552 -7606 56907 -6526 -47567
5441 -47567 -41314 5301 33354 72162 44411 -22012 -65245 -33904 -2802 -39957 -18693 -25169
5429 -25169 63415 42982 -5129 520 -65225 -32655 10747 87931 148711 115030 87505 70359
5417 70359 -3693 -82413 -100695 -36239 -40867 -46789 10509 80397 46625 -19725 -37192 -5960
5405e960l4992J0298K4563M102l5172o1254m9106M2510J3608N1667J9056N3423
5393C2743Q258k0588m076l6397n5944k6189K5629N5665O531l7077k918M3781L1897
5380B1315n900o4390m735J7614Q388o802Q0862r010J5563j5070J0427M1512p1172
5367A8602l7507n3877K2668q861K57M711M7269k5835n3342L7339O1862k8706N6728
5354D1308O3566p574j2362m9001K1222r530N7542K8493m6186o0866l6749o8796
5342g8933K7749L5096J8153K4793j6489k6084J9771J2187k1681o8376q3078j6254
5330a73146L9415k5728O653P3010M844l0209n1333R4239J05902j3041m3937m682
5318a8013K709j7040L138l8013K353J3566l059P4014K5955r227l0183k5561l4175
$$ plain form
5405 -5960 -40952 -30654 -6091 -1989 -37161 -98415 -147521 -105011 -91403 -39736 -20680 32743
5393 32743 41001 20413 16337 -20060 -76004 -102193 -76564 -20899 -14368 -51445 -54363 -10582 21315
5380 21315 15415 -48975 -53710 -36096 -27708 -34510 46352 37342 52905 37835 48262 89774 18602
5367 18602 -18905 -72782 -50114 -58975 -58718 -54007 -6738 -32573 -85915 -48576 13286 -15420 41308
5354 41308 104874 97300 84938 35937 57159 47629 105171 133664 87478 26612 -10137 -78933
5342 -78933 -51184 -16088 2065 26858 10369 -15715 4056 16243 -5438 -73814 -156892 -173146
5330 -173146 -133731 -159459 -152806 -79796 -74952 -105161 -156494 -62255 43647 30606 -13331 -18013
5318 -18013 -15304 -32344 -29206 -67219 -64866 -51300 -54359 19655 45610 36383 6200 -19361 -53536
5305e3536l8659k2813K1566p215O5840M8801l2983p3475O086J1379j737k8012
5293a04758J3008p048k0052L1420K6145Q605N475M467R727J222k7318k9889o1893
5280a50889J9051K5709K2066J8860P398J5732J9332P7906n8100Q55J6541l0819
5268a6358l3195J4916j3905M8599J8635j8739M1801Q659o1972j1096k0871l4356
5256g7882M0168K4841j7388l1309J367o623J3370M6895O5692M1179n0518m7455
5244B337p91P5105o375n9717r1588k8687J7481K8007M6588N666K1006k6890L7038
5231A9180J272j3843l6391m4819O1608M6119j414l4996J5998k0516k8537n616
5219d1955k3588J1335M0799j8856j991K3289J2878N9104j6739o2741k0386q567
$$ plain form
5305 -53536 -92195 -115008 -93442 -100657 -34817 13984 -18999 -92474 -86388 -75009 -76746 -104758
5293 -104758 -91750 -98798 -118850 -87430 -61285 -52680 -47205 -42738 -33011 -31789 -59107 -88996 -150889
5280 -150889 -131838 -106129 -84063 -65203 -57805 -42073 -22741 55165 -2935 -2080 14461 -16358
5268 -16358 -49553 -34637 -48542 57 18692 -47 41754 50413 -11559 -22655 -43526 -77882
5256 -77882 -37714 -12873 -30261 -61570 -60203 -66826 -53456 -6561 59131 100310 49792 2337
5244 2337 1546 76651 70276 10559 -81029 -109716 -92235 -64228 -17640 -11974 9032 -17858 19180
5231 19180 20452 6609 -29782 -74601 -12993 33126 31712 -3284 12714 -7802 -36339 -41955
5219 -41955 -65543 -54208 -13409 -32265 -34256 -10967 1911 61015 44276 -18465 -38851 -47418
5207d7418K5659K5139Q77n9037M612M7297k9508p990N4456N9474q2296r5356r611
5194a13702N9369N862p9923k1739O2332M4336q367k9604L3456N847n8083L0264
5182f9952k0796M1310M5442o0401j3502m5511O0571K2121K9073m0917j3515K1296
5170d4781K2424J3086m4967R967J9748L7846l5926J8429j733L2019j4082L832
5158A5862l8062p9774J0884j912J8658M4328J2245j5423K4889k5110k0384l3822
5146h7621n967M0530J7439K5566Q1308k823m1969m784p271j6338n5741o6167Q586
5133a15252j4423k1307J17376Q3537n3483j01187K8863J5272J9726k1281O2423
5122B64N2732J1491q2238m8747J1213P405J1314L0591K7874o2107o1332M38K7685
$$ plain form
5207 -47418 -21759 3380 4257 -54780 -50168 -2871 -32379 -40369 14087 73561 -8735 -104091 -113702
5194 -113702 -54333 -48471 -128394 -150133 -87801 -43465 -51832 -81436 -47980 -42133 -100216 -69952
5182 -69952 -90748 -49438 -3996 -64397 -77899 -123410 -62839 -40718 -11645 -52562 -66077 -44781
5170 -44781 -22357 -9271 -54238 -44271 -24523 13323 -22603 -4174 -5907 26112 12030 15862
5158 15862 -22200 -101974 -91090 -93002 -74344 -30016 -17771 -33194 -8305 -33415 -53799 -87621
5146 -87621 -93588 -53058 -35619 -10053 71255 68432 26463 21679 14408 -1930 -57671 -123838 -115252
5133 -115252 -129675 -150982 -33606 49931 -3552 -104739 -75876 -60604 -40878 -62159 264
5122 264 52996 64487 -17751 -66498 -55285 -47880 -36566 -5975 21899 -40208 -101540 -101102 -73417
5109g3417K2757K2814k9168j391R0887J0698j9598m8011K4569K7496q4159j2018
5097f8541m3312P377M2942M5941l079j7839J5612J7946o074j719K6842j8333p5707
5084g7944M1268L1126P1790O3138j4327l6991j8337o4445k4650n178J9981p9801
5072i4370q9592N8081R1794j3024q46K9511J1885o0366p287L6374j3831k5364
5060g7035J6361P0455k5726j9308K8202O071p552o5630k9362M2444o0990K2394
5048i9676O1283O283L1199o295k6548k6177o7159j7552N5437R7920J0523k5317
5036f079o182k018J2385n9216l3750K6784m9165N9036k4866n5155M0507L7071
5024f0648J6305l35j7031n1422q297k5049L5657M2623N3345k8901o9483K5310
$$ plain form
5109 -73417 -50660 -27846 -57014 -58405 32482 43180 23582 -24429 140 27636 -56523 -68541
5097 -68541 -111853 -104476 -61534 -15593 -18672 -36511 -20899 -2953 -9027 -10746 16096 -2237 -77944
5084 -77944 -36676 -5550 66240 129378 115051 78060 59723 -4722 -29372 -34550 -14569 -94370
5072 -94370 -183962 -125881 -34087 -47111 -47957 -18446 -6561 -66927 -74214 -37840 -51671 -77035
5060 -77035 -60674 9781 -15945 -35253 -7051 -980 -8532 -74162 -103524 -61080 -122070 -99676
5048 -99676 -38393 -32110 -911 -7206 -33754 -59931 -127090 -144642 -89205 8715 19238 -6079
5036 -6079 -12261 -14279 -1894 -61110 -94860 -68076 -117241 -58205 -83071 -138226 -97719 -60648
5024 -60648 -44343 -44678 -61709 -113131 -121428 -146477 -110820 -68197 -14852 -43753 -113236 -87926
5012h7926N0883l2185k8305P653N9708N851M4254p0019l5931M9095l567R5566
5000E5077K3835o7431k4906J9513J13915k6537k6029J210j4327k9548n5740k7069
4988e8037J0062L2029P124M272J84j14431m043O1576Q4448j1430o0865o4398O0605
4975e2904P3941J5726n7339q1958M2904N4714M2466j0798j4503L7616m1084N2821
4963F1602M148l2251o1506n2154r941R452O1404N2104p204n3156N2694j5872J6290
4950B5610K8631l8342l6219l5724j4331L4727l723J1122j4405K0550K4249l036
4938h91J5716m9833p5695o1019O2714Q7856l9718r5844K6488L8274L4774J3390
4926d3788K4903Q194m5200j3835r834N8305J8817N5497l0091r9844J3645n8874
$$ plain form
5012 -87926 -37043 -69228 -97533 -89880 -30172 -24321 19933 -50086 -86017 -36922 -40489 55077
5000 55077 78912 11481 -13425 6088 120003 93466 67437 68647 54320 24772 -30968 -58037
4988 -58037 -47975 -15946 -8822 -4550 -4366 -118797 -122840 -61264 23184 11754 -49111 -113509 -52904
4975 -52904 21037 36763 -20576 -102534 -59630 -4916 37550 26752 12249 49865 8781 61602
4963 61602 65750 33499 -28007 -80161 -90102 -80650 -19246 32858 25654 -27502 25192 9320 25610
4950 25610 54241 15899 -20320 -56044 -70375 -35648 -39371 -28249 -42654 -22104 2145 -891
4938 -891 14825 -35008 -110703 -171722 -109008 -21152 -60870 -156714 -130226 -91952 -57178 -43788
4926 -43788 -18885 -10691 -55891 -69726 -79560 -21255 -2438 53059 22968 -76876 -63231 -122105
4914a22105q2502l993O42k5450Q9381M6886k4620M8083M06q166M5382K0043j2371
4901b8384M3657J1240n642o1405m3570Q8363J0731k0270R3746o441j02586L5570
4889A5009M6110j3300K0782O1120K9623n9239o7008K3428K8498o6047k9039M1282
4877C1219l4130m0064Q559k6123j4441J0805J7491M908J9879k9117M0358J6959
4865F303r7302k3417O0731J16639Q379o3626j9186J2407r346J4089M5745Q417
4853E9833k4634l4531r6889K2191M99K4541j8844r323k1266k549M6882O430J4780
4840c2880J03623L6773r0757m9053L289j7563K2188P0795J7069m3190j1379P558
4828A6473O160j2597P80j00k615p8862j0299P3436K7688j2413M0121m3834k1451
$$ plain form
4914 -122105 -204607 -208600 -207958 -233408 -144027 -97141 -121761 -73678 -73272 -81438 -36056 -16013 -28384
4901 -28384 15273 26513 20871 -40534 -84104 4259 14990 -5280 88466 82025 -20561 15009
4889 15009 61119 47819 68601 129721 159344 100105 33097 56525 85023 18976 -10063 31219
4877 31219 -2911 -42975 -34416 -60539 -74980 -64175 -46684 -41776 -21897 -51014 -10656 6303
4865 6303 -90999 -114416 -53685 62954 71333 7707 -11479 928 -8418 5671 51416 59833
4853 59833 35199 668 -96221 -74030 -73531 -48990 -67834 -77157 -98423 -100972 -54090 -47660 -32880
4840 -32880 70743 107516 16759 -32294 -29005 -46568 -24380 46415 63484 20294 8915 16473
4828 16473 22633 10036 10816 10716 8101 -70761 -81060 -7624 20064 7651 47772 3938 -17513
4815a7513P620K7501L33o2948k224j0089J152K5685q6155q6265Q6301N1860K8243
4802c6499l5038L752k9417n9405L1642Q6564L7880K3167j956J1419R719m5042
4790c214j09408k9815O3219O5327p1605K380j9796N1489J00418o3284m3306N0136
4778g459Q1479L148n3280l4088K2971J6625k2927N190J5370J03433j5805k1819
4766I2838N1564m8121l7674K3199L9838k7009n8871j105L280l3805N121m9837
4754d0582K9070K920n782k6927M2010j3753P0121J6744l3527m5240K3749K5445
4742D4248l8116j102m1213j5828N5292K5719J9447k1451q2722l6239K9050j1503
4730g4418P144J1646K5769p191K5399L2339k3105J7658K4822j7385K5124M4605
$$ plain form
4815 -17513 -9893 17608 17941 -45007 -47231 -57320 -56168 -30483 -116638 -202903 -116602 -64742 -36499
4802 -36499 -71537 -67785 -97202 -156607 -124965 -38401 -521 22646 20690 32109 41828 -3214
4790 -3214 -112622 -142437 -79218 -13891 -85496 -83116 -102912 -51423 48995 -14289 -57595 -7459
4778 -7459 74020 77168 23888 -10200 12771 29396 6469 11659 27029 130462 114657 92838
4766 92838 144402 96281 58607 81806 121644 94635 35764 34659 37939 4134 9255 -40582
4754 -40582 -11512 -8592 -14374 -41301 709 -13044 57077 73821 40294 -4946 18803 44248
4742 44248 6132 5030 -36183 -52011 3281 29000 48447 26996 -55726 -91965 -62915 -74418
4730 -74418 -67274 -55628 -29859 -37050 -11651 20688 -2417 15241 40063 22678 47802 92407
4718I2407k1023o0429M19R98P2475P4952O2085r2496q2686n0823k7925J4617R591
4705g838j5588q367k2637k6534Q2395K6542O3463p448j03998Q385L2614r5681
$$ plain form
4718 92407 71384 10955 11374 12372 84847 159799 221884 129388 46702 -4121 -32046 -17429 -7838
4705 -7838 -23426 -31793 -54430 -80964 1431 27973 91436 83988 -20010 -11625 20989 -74692
$$ [...]
##END NTUPLES=NMR SPECTRUM
##END=
