##TITLE=Analysis number 322054
Compound Code cc 50902
Book Reference 486/50
Project Code adrs
Chemist Name simons
##JCAMPDX= 6.0         $$ Bruker NMR JCAMP-DX V2.0
##DATA TYPE= NMR SPECTRUM
##DATA CLASS= NTUPLES
##ORIGIN= Bruker BioSpin GmbH
##OWNER= nmr
$$ XWIN-NMR		Version 3.5
$$ Mon Sep 11 14:21:27 2006 GMT Daylight Time (UT+1h)  MAYBRIDGE\nmr@NMR_250MHZ
##.OBSERVE FREQUENCY= 250.131544655141
##.OBSERVE NUCLEUS= ^1H
##.ACQUISITION MODE= SIMULTANEOUS (DQD)
##.ACQUISITION SCHEME= undefined
##.AVERAGES= 16
##.DIGITISER RES= 18
##SPECTROMETER/DATA SYSTEM= dpx250
##.PULSE SEQUENCE= zg30
##.SOLVENT NAME= CDCl3
##.SHIFT REFERENCE= (INTERNAL, CDCl3, 0, 16.522)
##AUDIT TRAIL= $$ (NUMBER, WHEN, WHO, WHERE, WHAT)
$$ ##TITLE= Audit trail, XWIN-NMR		Version 3.5
$$ ##JCAMPDX= 5.01
$$ ##ORIGIN= Bruker BioSpin GmbH
$$ ##OWNER= nmr
$$ C:\u/data/dgb/nmr/ADRS/440/pdata/1/auditp.txt
$$ ##AUDIT TRAIL=  $$ (NUMBER, WHEN, WHO, WHERE, WHAT)
(   1,<2006-09-11 14:21:02.13 +100>,<MAYBRIDGE\nmr>,<NMR_250MHZ>,
      <created by zg, POWCHK disabled, PULCHK disabled
       configuration hash MD5:
       E2 DF 36 D8 04 B2 41 60 5A D7 A3 38 5A 4B D0 FE
       data hash MD5: 64K
       CD EB D7 3A 09 B3 48 1B EB CB C2 F2 EE 76 6C 3B>)
(   2,<2006-09-11 14:21:13.61 +100>,<MAYBRIDGE\nmr>,<NMR_250MHZ>,
      <Start of raw data processing
       ef LB = 0.3 FT_mod = 6 PKNL = 1 SI = 32K 
       data hash MD5: 32K
       A1 00 1A 5B A3 78 8E FF 21 53 4A 6F 23 28 43 54>)
(   3,<2006-09-11 14:21:15.39 +100>,<MAYBRIDGE\nmr>,<NMR_250MHZ>,
      <apk 
       data hash MD5: 32K
       FE 5F E6 A5 B7 E5 8A D0 56 11 47 39 07 4E EC 6F>)
(   4,<2006-09-11 14:21:16.27 +100>,<MAYBRIDGE\nmr>,<NMR_250MHZ>,
      <abs ABSG = 5 
       data hash MD5: 32K
       C0 09 B6 60 3D AD 93 AF F6 70 8E 69 C1 AB 95 9C>)
$$ ##END=
$$ 
$$ hash MD5
$$ 90 37 63 EB 9F A8 7D 27 6B 64 00 FD C1 D2 7F FB
##$RELAX= 
##$RELAX= 
##$RELAX= 
##$RELAX= 
##$RELAX= 
##$RELAX= 
##$RELAX= 
$$ Bruker specific parameters
$$ --------------------------
##$DU= <C:\u>
##$EXPNO= 440
##$NAME= <ADRS>
##$PROCNO= 1
##$TYPE= <nmr>
##$USER= <dgb>
##$AMP= (0..31)
100 100 100 100 100 100 100 100 100 100 100 100 100 100 100 100 100 100 
100 100 100 100 100 100 100 100 100 100 100 100 100 100 
##$AQSEQ= 0
##$AQ_mod= 3
##$AUNM= <au_zg>
##$AUTOPOS= <37 >
##$BF1= 250.13
##$BF2= 250.13
##$BF3= 250.13
##$BF4= 250.13
##$BF5= 500.13
##$BF6= 500.13
##$BF7= 500.13
##$BF8= 500.13
##$BYTORDA= 1
##$CFDGTYP= 0
##$CFRGTYP= 5
##$CHEMSTR= <none>
##$CNST= (0..31)
1 1 145 1 1 1 1 1 1 1 1 1 1 1 1 1 1 1 1 1 1 1 1 1 1 1 1 1 1 1 1 1 
##$CPDPRG= <>
##$CPDPRG1= <>
##$CPDPRG2= <>
##$CPDPRG3= <>
##$CPDPRG4= <mlev>
##$CPDPRG5= <mlev>
##$CPDPRG6= <mlev>
##$CPDPRG7= <mlev>
##$CPDPRG8= <mlev>
##$CPDPRGB= <>
##$CPDPRGT= <>
##$D= (0..31)
0 1 0 0 0 0 0 0 0 0.06 0 0 0 0 0 0 0.0002 0 0 0 0 0 0 0 0 0 0 0 0 0 0 
0 
##$DATE= 1157980860
##$DBL= (0..7)
120 120 120 120 120 120 120 120 
##$DBP= (0..7)
150 150 150 150 150 150 150 150 
##$DBP07= 0
##$DBPNAM0= <>
##$DBPNAM1= <>
$$ [...]
##$SUBNAM6= <"">
##$SUBNAM7= <"">
##$SUBNAM8= <"">
##$SUBNAM9= <"">
##$SW= 20.6930455092707
##$SWIBOX= (0..15)
0 0 3 0 0 0 0 0 0 0 0 0 0 0 0 0 
##$SW_h= 5175.983436853
##$TD= 65536
##$TD0= 1
##$TE= 296.16
##$TE2= 300
##$TE3= 300
##$TEG= 300
##$TL= (0..7)
0 120 120 120 120 120 120 120 
##$TP= (0..7)
150 150 150 150 150 150 150 150 
##$TP07= 0
##$TPNAME0= <>
##$TPNAME1= <>
##$TPNAME2= <>
##$TPNAME3= <>
##$TPNAME4= <>
##$TPNAME5= <>
##$TPNAME6= <>
##$TPNAME7= <>
##$TPOAL= (0..7)
0.5 0.5 0.5 0.5 0.5 0.5 0.5 0.5 
##$TPOFFS= (0..7)
0 0 0 0 0 0 0 0 
##$TUNHIN= 0
##$TUNHOUT= 0
##$TUNXOUT= 0
##$USERA1= <user>
##$USERA2= <user>
##$USERA3= <user>
##$USERA4= <user>
##$USERA5= <user>
##$V9= 5
##$VALIST= <valist>
##$VCLIST= <CCCCCCCCCCCCCCC>
##$VD= 0
##$VDLIST= <DDDDDDDDDDDDDDD>
##$VPLIST= <PPPPPPPPPPPPPPP>
##$VTLIST= <TTTTTTTTTTTTTTT>
##$WBST= 1024
##$WBSW= 4
##$XGAIN= (0..3)
0 0 0 0 
##$XL= 0
##$YL= 0
##$YMAX_a= 316880
##$YMIN_a= -366168
##$ZGOPTNS= <>
##$ZL1= 120
##$ZL2= 120
##$ZL3= 120
##$ZL4= 120
##$ABSF1= 16.522
##$ABSF2= -4.171173
##$ABSG= 5
##$ABSL= 3
##$ALPHA= 0
##$AQORDER= 0
##$ASSFAC= 0
##$ASSFACI= 0
##$ASSFACX= 0
##$ASSWID= 0
##$AUNMP= <proc_1d>
##$AZFE= 0.1
##$AZFW= 0.1
##$BCFW= 0
##$BC_mod= 0
##$BYTORDP= 0
##$COROFFS= 0
##$CY= 12.5
##$DATMOD= 1
##$DC= 0
##$DFILT= <>
##$DTYPP= 0
##$F1P= 14.0000005364418
##$F2P= -0.99999901652339
##$FCOR= 0.5
##$FTSIZE= 32768
##$FT_mod= 6
##$GAMMA= 0
##$GB= 0
##$INTBC= 1
##$INTSCL= 1
##$ISEN= 128
##$LB= 0.3
##$LEV0= 0
##$LPBIN= 0
##$MAXI= 10000
##$MC2= 0
##$MEAN= 0
##$ME_mod= 0
##$MI= 0
##$NCOEF= 0
##$NC_proc= -3
##$NLEV= 6
##$NOISF1= 0
##$NOISF2= 0
##$NSP= 0
##$NTH_PI= 0
##$NZP= 0
##$OFFSET= 16.522
##$PC= 1
##$PHC0= 152.2047
##$PHC1= 0
##$PH_mod= 1
##$PKNL= yes
##$PPARMOD= 0
##$PSCAL= 4
##$PSIGN= 0
##$REVERSE= no
##$SF= 250.13
##$SI= 32768
##$SIGF1= 0
##$SIGF2= 0
##$SINO= 400
##$SIOLD= 32768
##$SREGLST= <1H.CDCl3>
##$SSB= 0
##$STSI= 32768
##$STSR= 0
##$SW_p= 5175.98343685301
##$SYMM= 0
##$S_DEV= 0
##$TDeff= 65536
##$TDoff= 0
##$TI= <Analysis number 999999
Compound Code 99
Book Reference 9
Project Code 9>
##$TILT= no
##$TM1= 0
##$TM2= 0
##$TOPLEV= 0
##$USERP1= <user>
##$USERP2= <user>
##$USERP3= <user>
##$USERP4= <user>
##$USERP5= <user>
##$WDW= 1
##$XDIM= 32768
##$YMAX_p= 456599248
##$YMIN_p= -363607
$$ End of Bruker specific parameters
$$ ---------------------------------
##NTUPLES= NMR SPECTRUM
##VAR_NAME=  FREQUENCY,     SPECTRUM/REAL,   SPECTRUM/IMAG
##SYMBOL=    X,             R,               I
##VAR_TYPE=  INDEPENDENT,   DEPENDENT,       DEPENDENT
##VAR_FORM=  AFFN,          ASDF,            ASDF
##VAR_DIM=   32768,         32768,           32768
##UNITS=     HZ,            ARBITRARY UNITS, ARBITRARY UNITS
##FACTOR=    0.157963299565203, 1,           1
##FIRST=     4132.6476996994, 0,             0
##LAST=      -1043.33573715361, 0,           0
##MIN=       -1043.33573715361, -363607,     0
##MAX=       4132.6476996994, 456599248,     0
$$ Real data points
##PAGE= N=1
##DATA TABLE= (X++(R..R)), XYDATA
$$ [...]
29668 -102354 -76045 -52423 4697 29136 -20359 -18970 -21318 -24341 -43917 10073 40320 146797
29656 146797 71523 106602 110449 134790 112103 116076 54648 -85960 -111796 -96813 -125969 -121321
29644 -121321 -151383 -197076 -202680 -231161 -139238 -43454 2814 -27402 -8053 -18272 34679 67317
29632 67317 12872 35227 155108 151218 106856 116910 141438 152063 77613 12282 80969 131076
29620 131076 68346 129612 145019 39731 -25444 -116833 -147120 -74762 -57358 -30542 -66402
29609 -66402 -90812 -32613 -82135 -126575 -30640 72865 18875 -8797 -10075 74130 82047 105374
29597 105374 71296 -34941 45252 8143 -78562 -139972 -72110 -89281 -68267 19670 -12941
29586 -12941 -31910 -28077 -104530 -34700 37800 25189 -52255 -121339 -92981 -18412 64758 59257
29574 59257 -25435 -73123 -8121 -25240 -17693 10434 35465 88592 64335 20241 -64134 -56130
29562 -56130 -15547 -1740 13464 -15304 -70699 -61355 35124 89439 56946 -257 8487 -3889
29550 -3889 -61301 -86073 -43389 -13086 -14795 63938 89861 55980 -42546 -188835 -209655 -91588
29538 -91588 75776 84270 12056 -71492 -48890 -73061 -17758 23827 79910 41867 70539 53888
29526 53888 26228 -73568 -122956 -75652 -11524 7350 -38512 -43140 43411 93828 78659 21748
29514 21748 11685 -5282 -28024 -12678 -10580 -27725 -59397 -155063 -110877 -9438 -12689 34857
29502 34857 131146 142215 69149 11706 52976 -6039 31079 25312 28927 -11078 42921 36264
29490 36264 -29186 -48850 -17868 10588 4253 47414 61456 35204 88130 37262 -25046 -127217
29478 -127217 -65666 -74394 -66452 -78109 -21693 48905 -8891 -54457 -82797 -98806 -103021 -111253
29466 -111253 -104899 -163887 -146754 -55917 46022 68120 464 6350 7924 -1384 -24685 -10101
29454 -10101 3155 -115116 -86141 32724 74442 106081 21013 -88158 -91693 -9300 42135
29443 42135 78370 95438 138622 184999 140755 128375 87099 78708 19837 16260 51778 27960
29431 27960 27414 38678 -8551 -42042 -27934 1301 77008 31334 -18092 25965 59351 65455
29419 65455 59791 4905 82777 198253 142663 83367 97720 83282 36755 -31760 -79951 -23903
29407 -23903 15712 19664 -42276 8939 90188 43292 -117155 -104095 -6455 -23735 -11343 -37625
29395 -37625 -11091 28037 78574 97524 108934 173245 127968 84691 16830 -9492 3897 -3153
29383 -3153 4253 1396 36955 -58887 -103763 -35569 -12332 49664 107636 4217 -37901 -42747
29371 -42747 -78015 -200214 -215279 -142048 -62378 29864 56329 33040 86719 100538 24591
29360 24591 -64357 -108303 -59535 -16179 3589 42293 61575 26549 -52819 22541 42217 17711
29348 17711 -1303 17272 -14211 -91610 -82712 -125216 -134055 -103336 -26646 -39908 -39738 2932
29336 2932 46204 82469 48731 2280 -3083 61047 105917 -14624 -97688 -106868 -53516 -4048
29324 -4048 -44764 -76726 72409 94484 124178 145842 46171 -21392 16602 48306 21553 -33934
29312 -33934 -102663 -105968 -131487 -84767 -71085 -64785 -9566 -135120 -139896 -64207 -9315 8197
29300 8197 51057 60509 -22785 -72161 -5813 25749 63045 85672 -344 -15089 -5896 19406
29288 19406 -34170 -11995 -26488 -96878 -108087 -71964 -65235 -30579 -59056 -28510 68343 72918
29276 72918 31759 87599 27002 38124 62561 -6949 34156 55971 36113 87345 56022 13047
29264 13047 -44168 -75165 -72212 -32491 -90245 -73739 36114 24648 -2309 43655 42131 39529
29252 39529 17926 31018 131262 184348 150200 97320 -11735 -109071 -97311 -11419 42896
29241 42896 -24277 -65172 -22007 -16831 -18955 -41366 59988 87212 51254 6377 71089 105457
29229 105457 136849 95610 40433 83882 51994 39716 121144 59452 -49734 -64567 -29362
29218 -29362 -10890 3886 -45886 -30918 52087 44322 5506 -37628 -24087 60874 26062 81299
29206 81299 157101 117255 102892 123876 127945 96233 182030 141249 130721 146139 176448 135850
29194 135850 49729 69096 114204 189295 96753 -15499 -67955 -50171 -82171 -98934 -43848
29183 -43848 -49048 -41030 1458 26132 -7712 -38584 -39069 6521 38390 40514 28102 25443 56799
29170 56799 38073 60160 57364 13770 65179 15918 -14956 48894 39982 40239 16929 -17223
29158 -17223 -67649 26247 84648 62537 39815 -25993 -94733 -84351 22648 -18068 -47697
29147 -47697 17550 94044 141345 54982 79156 116275 158525 73728 -446 -46092 -55136 -1386
29135 -1386 44041 -19668 -24904 -15098 -2035 -72823 -71664 -2508 31671 4436 44624 112395
29123 112395 129799 136240 144587 144389 166721 140074 161288 119902 8887 52913 62304 1685
29111 1685 4078 -59390 -122021 -53512 30143 29373 16479 16381 -4510 29137 72189 134750 104200
29098 104200 5656 -51265 -75398 20812 39867 -55663 -103278 -96138 -91972 -65319 -55670 -12836
29086 -12836 59963 44144 -2933 31562 -96693 -147996 -125981 -34187 -11410 -16318 13195 51836
29074 51836 -38285 -18902 45702 -1659 -55520 -66617 -45786 8372 9580 -65800 -10796 -14195
29062 -14195 -37003 -32887 -41868 8466 62748 21322 -26773 -30620 -22014 26721 32177 43099 77752
29049 77752 4324 -21613 -34246 -37763 -31907 -24869 1256 31483 88722 -13143 -115704 -90998
29037 -90998 33044 -15157 -47982 14115 49447 -8317 -47767 25341 60012 53634 74552 80063
29025 80063 70827 85446 132005 80810 105965 126471 54950 58916 12 -138143 -154590 -120173
29013 -120173 -81823 -76792 -79546 -153665 -119399 -133453 -80561 -18673 -39836 -80250 -58456 -43395
29001 -43395 18576 50171 107608 57895 -41221 -64764 -30419 -14690 28030 55242 47114 63449
28989 63449 96635 124667 142515 81163 11595 -32762 13411 10455 22665 -32028 -75927 -70926
28977 -70926 -44436 -9263 -33356 38526 117912 84764 58024 73924 -40837 -124653 -107610
28966 -107610 -31992 -8655 -13714 -64096 65877 136028 125220 79878 95928 -15745 -77959
28955 -77959 9920 77735 68679 91598 80759 83552 112377 45032 -96715 -160273 -133634 -162542
28943 -162542 -147389 -156178 -153423 -87794 -50921 -108773 -80406 4130 53168 63760 -6867 75651
28931 75651 102700 9972 18287 79356 110592 112428 33490 11031 -80900 -83131 -44583 -109869
28919 -109869 -109922 -50000 -92865 -28582 -25802 -144840 -150048 -46203 33175 -17804 -53698 -46396
28907 -46396 40753 -15058 -38047 -21719 47911 8358 -22542 -75833 -106613 -58613 5260 72649
28895 72649 81990 62801 14623 -62548 -47648 28150 67740 65840 74243 -10139 -41570 28051
28883 28051 59938 150605 181661 67873 30688 -19984 15181 25492 -8751 -26325 -26136 -30625
28871 -30625 -122173 -163329 -96063 -59828 -54864 -77709 -44068 -71055 -22007 -12305 50558 39512
28859 39512 -83378 -116361 -84262 -61106 -95636 -59106 -46588 42619 90480 92050 44343 49222
28847 49222 12158 9490 27839 4095 -50520 -28553 95039 108553 63876 77259 88586 123380
28835 123380 105649 -8774 -48514 -561 -14441 -46566 -117474 -27821 60009 -38837 -108562
28824 -108562 -94611 -130022 -123100 -26256 11628 44918 -3226 -58876 -52730 -92225 -95309 -47791
28812 -47791 -23452 -4091 16514 -5684 -66854 -11613 29362 84793 57227 14777 -35421 13017
28800 13017 39186 -95141 -270697 -299419 -208213 -177470 -128635 -68968 -32330 -46242 61607
28789 61607 195028 146120 90446 70735 28135 -20059 -49046 -59513 8435 63428 65239 -71073
28777 -71073 -77575 31444 62855 92698 36282 28249 28263 -9253 -59298 -41158 -13755 2490
28765 2490 78838 108984 115090 131122 62086 39814 96978 -28067 -64106 17231 25893 3465
28753 3465 -37829 -61678 -109849 -188844 -237591 -172846 -139619 -44181 6775 7767 -53438 -44229
28741 -44229 -103517 -138856 -167876 -149897 -143903 -83669 -69772 -76831 -90789 -35696 -25952 -74183
28729 -74183 -68849 8425 -3264 -41247 -22400 87464 180971 199768 132299 -67282 -73536 -14019
28717 -14019 36572 23421 -25268 -50099 -96283 -75871 -60818 -70114 7894 -4431 -35532 36554
28705 36554 78939 58142 121613 127622 65104 17177 78374 85106 100043 71619 1790 -32298
28693 -32298 -1080 49710 1687 -10368 -16901 73298 179293 111139 7850 -30648 -38815 28070
28681 28070 44284 21400 85191 110018 177545 143950 95688 93326 21000 42268 -270 -12565
28669 -12565 97581 45693 76471 79405 -15455 -8725 5613 8877 20485 54596 44040 -30719
28657 -30719 -36544 -50502 -21600 -13918 -74414 -43446 18647 88944 9126 24540 -1846 25612
28645 25612 22656 -28156 -22239 -32647 -79746 -128499 -131557 -48483 57644 -4041 -39094 -6502
28633 -6502 23536 -18200 -73673 -18739 13865 -23803 10101 102473 116398 81444 55654 29574
28621 29574 41999 -1565 -41256 -10915 17567 56801 51981 -61517 -30490 -52874 -169354
28610 -169354 -132756 17782 84091 67139 63300 62403 17320 79466 36000 73106 196852 216271
28598 216271 119933 95862 149347 95589 93361 26124 -59442 -111444 -78395 -4365 -57862 -76146
28586 -76146 -56101 -70437 -20560 59094 -47509 -119791 -49570 -7254 2260 55127 82534 141367
28574 141367 188105 168719 135628 112345 47529 -5668 -35321 19204 7971 -29086 924
28563 924 99102 88683 75375 80165 61683 30868 39000 107701 163979 149158 138487 90046
28551 90046 2942 -12251 -21903 -16727 -43448 22478 79738 78261 91847 71073 -29280 -85888
28539 -85888 -28987 -56856 -2755 -46485 -62893 -23866 -16139 -43116 -20905 -40114 -15461 90739
28527 90739 78623 87869 83414 88200 72687 46567 -11212 -50386 -95860 -45996 -74822 -98312
28515 -98312 -25209 61248 113883 136281 108028 148047 142008 10205 -98309 -162636 -124539
28504 -124539 -7812 49365 21642 -10171 -7137 -66890 -2825 44092 69499 71919 -25673 -103281
28492 -103281 -29891 37566 100720 116555 59139 -10872 28883 -18838 -96572 -85621 -42683
28481 -42683 -60808 -50106 9497 12728 -13433 -28686 80731 136071 97302 50912 14844 43808
28469 43808 53610 59682 38329 62466 82127 2804 -37581 -37529 -69271 -94847 33712 149788
28457 149788 150039 34765 -10915 12474 50883 116822 60975 29066 57216 101049 85679 21931
28445 21931 -13860 -24353 82467 89154 29190 -6534 10138 36182 51233 78756 86111 -19768
28433 -19768 -86066 -156566 -110399 -59411 -96595 -44216 9099 -49855 -80441 14195 13145 37870
28421 37870 103960 122905 66962 -31702 -56990 -46635 -70450 -26580 14765 50703 86506 18003
28409 18003 -8788 -50918 -94026 -63414 -68635 -119106 -157362 -175777 -264623 -268770 -194367 -101436
28397 -101436 -79390 -41355 -10144 -10482 5111 3080 -25361 -73328 8735 32566 60312 103257
28385 103257 66010 25265 -34200 -36437 -72449 -119905 -144336 -79890 -60813 -64248 -19261 -8693
28373 -8693 -1442 -61815 -163962 -223516 -174929 -102259 19066 100973 102939 57506 67351 74911
28361 74911 48376 36614 111192 195399 185221 148083 460 -42750 45818 87580 66710
28350 66710 41309 9251 20483 50188 25644 5701 21047 276 -38711 -38672 -49583 -89685
28338 -89685 -40780 -31877 -16439 -99668 -50646 -12131 -30384 -20097 3703 11212 115898 175853
28326 175853 214274 116256 51265 13545 20989 77016 88174 53311 -20255 -76193 -71900 -57315
28314 -57315 -35815 81970 109780 36074 -53113 22049 83460 56577 101797 63764 16758
28303 16758 -2298 -7948 8705 29529 78356 113268 87975 28096 84901 139855 155951 132988
28291 132988 68065 35381 21428 17350 5462 -20695 -41087 -81373 -78409 493 90219 113010
28279 113010 50436 20704 -33847 -24206 460 2004 -52276 -18626 27540 32496 113953 102550
28267 102550 117712 122544 35607 -39002 -68968 4419 79697 57119 74297 54421 -36879 -101273
28255 -101273 -125186 -54159 -16156 -112581 -147880 -104492 -61123 -24913 3338 5517 72599 67113
28243 67113 35910 25012 -4638 -23115 3152 91135 153400 103120 54335 38163 -18164 -99824
28231 -99824 -18081 55769 54262 60358 70148 129709 154547 134839 105955 99608 105146 -8603
28219 -8603 -75461 -54192 -10719 -11925 45511 -5416 -26986 -51144 -77609 -56525 -69183 -66895
28207 -66895 34 -5827 -8116 79936 157588 179943 144709 160228 107978 -12168 -22293 27412
28195 27412 48283 98452 152781 137488 120192 120239 124770 156239 127234 88361 111068 142354
28183 142354 102104 3613 -6232 -52257 -34657 22367 23255 -44639 -34322 -49769 -48471 16717
28171 16717 12391 -27218 5232 22968 60608 83927 123189 106796 138376 100189 -59617 -88382
28159 -88382 -27281 -64616 -170009 -171061 -100313 -126479 -135447 -126161 -88239 -49883 -78445 -111096
28147 -111096 -37455 -1741 4196 -13598 -83347 -76215 -81083 -72548 -45869 -51750 -54695 13398 44729
28134 44729 77172 9956 -75578 -163207 -71987 -18898 18683 65611 65099 805 -33848 -59778
28122 -59778 -109914 -65025 -49934 -79485 -32626 1126 10113 39106 68766 96239 128059 81237
28110 81237 42072 74294 99675 126437 75027 53769 37707 -7757 -78439 -77983 -53512 -53530 -11949
28097 -11949 18040 14505 -4015 -16031 58120 64744 12065 20668 91176 11105 3709 92812
28085 92812 47860 -30587 -34983 -59040 -21126 -15059 140 -8658 4202 81208 64714 -20294
28073 -20294 -48871 -54214 -104693 -90449 -56462 -99752 -92778 -13537 36630 132612 163201 169209
28061 169209 166813 151253 167595 45191 -60021 -95437 -3596 71229 67766 90957 96540 166245
28049 166245 154431 35973 25461 -21467 -103359 -24164 80190 71524 8464 110324 205694
28038 205694 115550 -36352 -24349 10373 16796 18667 21484 10937 4138 14620 -26387 -27317
28026 -27317 20356 22861 26993 -5913 -47290 -108034 -168634 -154681 -43910 58254 51952 3611
28014 3611 -9240 -126439 -154999 -17863 4837 -14404 42229 73739 56120 120187 104796
28003 104796 61569 10198 -7859 -25626 15679 47760 51618 114125 94872 73590 9773 967
27991 967 6351 -43584 -78647 -35993 -23460 18379 -10013 88395 40873 25880 69312 82029
27979 82029 50100 88202 131123 63011 44024 92621 115367 122060 72122 53282 37103 17245
27967 17245 9404 19609 -21054 16296 25976 68449 120882 136666 104209 66068 97115 81327
27955 81327 44001 -46380 -73255 -126618 -49904 85937 2676 78018 127230 121334 155719 111976
27943 111976 64622 -12883 -38276 -28919 4833 27548 59852 114657 112874 35326 -24189 11677
27931 11677 61921 39858 -2537 61417 56798 72123 133794 68420 -89251 -167620 -124828 -84892
27919 -84892 -95884 -127443 -105395 -63400 -3244 -73050 -72718 -51412 -39565 -12230 46560 20205
27907 20205 70162 115930 39207 34440 28110 97635 178054 137370 154141 179733 165720 71807
27895 71807 57378 168091 200215 181769 208617 156171 114820 60552 37564 7626 130831
27884 130831 189790 188099 239114 194648 86411 77117 113917 186135 185412 175809 122905 85955
27872 85955 125823 122772 96324 162369 121964 100276 126083 90003 10545 -23024 68556 91765
27860 91765 26049 23078 4520 -29737 -1598 45632 -49893 -88417 -64640 5816 -9026 29748
27848 29748 -49649 -151344 -130650 -146335 -131181 -66569 -15395 -20940 -58919 -86575 -26167 1675
27836 1675 -7907 -60137 -76724 -20052 -13737 -38335 -37355 48842 40847 -79882 -150969 -210766 -117711
27823 -117711 -86567 -7415 35663 -25320 -121460 -111463 -15827 41085 -104182 -124144 -51956
27812 -51956 49319 160304 164483 196559 200252 112527 -11554 -112539 -32230 86056 46237
27801 46237 63051 62823 81376 215 -45842 -7575 43238 20223 13060 -48204 35199 45323
27789 45323 73900 64993 19129 -11835 -40949 -7963 29148 6032 7166 40998 34529 -10673
27777 -10673 43407 2687 -48710 2416 14280 53240 170839 124255 37761 -50357 18363
27766 18363 -33424 -35610 -91600 -27562 3434 17253 49416 171546 85083 65558 81325 -11182
27754 -11182 -14729 108260 178579 128761 33597 119342 245388 126690 107624 78802 57993
27743 57993 -1954 12409 58322 155092 191967 103117 29539 -33659 -105165 -56922 -17522 4474
27731 4474 21911 -33249 7312 -62436 -80814 -60299 -9646 21703 -18766 28268 45967 106215
27719 106215 99447 39992 29571 89418 37934 9136 -31867 -48345 -68231 -42107 -13757 -1366
27707 -1366 18836 31727 -31148 -96717 17240 121909 105894 80696 3700 -12214 35100
27696 35100 8313 33335 166029 120964 2366 28342 59184 18725 43884 -9605 4168
27685 4168 -21258 75679 131267 112731 147348 74250 50563 63107 30803 68067 100220 65651
27673 65651 -32110 -22046 80995 100571 98344 31905 48410 41298 -525 -29977 -40971 -69842
27661 -69842 -35332 6338 49677 57477 51395 46951 88880 10847 -51655 -68974 -2006 55688
27649 55688 83735 37125 9666 12081 32135 7821 71399 152342 162899 211945 151017 75882
27637 75882 2642 3145 14742 10934 -30256 -33133 -16017 -11612 73695 30855 -27316 84980
27625 84980 85045 150887 119232 104112 103170 33219 -47331 -120611 -114964 -42831 4901 35752 36855
27612 36855 50386 81611 148833 142955 124484 48312 55486 54948 50088 124828 62504 -28797 -88854
27599 -88854 -147304 -123475 -78519 9933 170960 216733 189058 128233 83960 65017 -7882
27588 -7882 -33621 -12622 58597 42701 -7017 74892 83089 -14398 -11947 49326 -85494 -102877
27576 -102877 -116603 -100267 -93033 -52855 -5434 41956 39198 135607 167168 159634 132927 157001
27564 157001 225563 278787 209249 120789 97375 17466 -27012 -36048 -84144 -64202 -50632 -53377
27552 -53377 45236 6565 14531 19120 -26137 4684 24091 -36245 -78478 15429 49998 33446
27540 33446 -1472 -44889 -26984 -44711 -116074 -122842 -16886 108905 56533 -17643 -67557
27529 -67557 -27091 50077 55134 15547 12909 7814 17265 83611 118985 138620 190382 177830
27517 177830 171145 130479 -5859 -21841 59856 53375 18655 29852 3555 61353 21173 -35001
27505 -35001 5499 67989 112400 47 43113 42044 -1437 -32203 79752 64410 -8033
27494 -8033 133160 240874 190801 133424 94693 48707 -57243 -85423 -117305 -60651 -27406
27483 -27406 -15793 -17755 -78880 -148332 -79618 1801 21229 13707 50878 135046 138550 67878
27471 67878 -44953 -27787 38106 36930 -35133 -79009 -50297 -38998 -79283 -40102 -76111 -115561
27459 -115561 -114346 -142927 -174410 -162691 -190317 -139379 -75866 -102709 -101290 -15157 28442 39391
27447 39391 76459 62304 70230 68024 102332 63811 1524 -69455 -96919 -62262 -116852 -112766
27435 -112766 -62221 -45426 -46918 -31666 22107 6011 -14940 -47610 -83103 2254 3481 -88658
27423 -88658 -38675 20895 65951 61782 18141 1321 43714 47592 86407 77797 19843 -11728
27411 -11728 -93341 -34747 -9633 -114146 -149880 -127189 -48359 -47870 27272 13889 -34887 -81918
27399 -81918 -37126 -40972 -13533 14222 28192 9130 -20290 12960 -60741 -58788 -51756 -147912
27387 -147912 -80972 -48040 -68140 -15415 35031 37502 -27510 -43208 47628 -28844 -132372
27376 -132372 -137692 -80736 -102839 -128516 -65167 -47286 -167391 -153265 -15258 10554 -37528
27365 -37528 -106935 -152973 -121730 -41686 17714 46647 24540 -25807 -7853 39510 -14473 -42357
27353 -42357 -104720 -48233 -2991 47205 -58651 -150133 -60341 -20963 -22968 -61756 -140410 -164121
27341 -164121 -78793 27702 146820 129146 104523 64794 13235 81698 68518 -39639 28308
27330 28308 60980 100035 30670 41050 60396 24937 -11796 -30554 -88660 -114644 -101995 -34086
27318 -34086 -19290 -16415 -2419 -577 10035 97663 84835 -9307 -4907 -32541 -10226 98171
27306 98171 113506 22754 -88727 -98794 -105211 -104330 -112793 -35326 26347 34930 48357 -27835
27294 -27835 -157878 -105347 -25475 -55840 -48599 8100 65199 43538 -20139 -127289 -164958
27283 -164958 -28315 40101 23895 -49510 -13052 -29905 -34992 -1510 22141 52648 -20218
27272 -20218 -141086 -85778 -40141 -79383 -3819 -11260 -63096 -128093 -49786 -34821 -71307 3588
27260 3588 37270 7012 73675 137031 140677 145949 96406 71993 6682 -18739 -157169 -180696
27248 -180696 -38696 -23089 -123626 -173727 -120827 -52159 -45627 -50304 41494 45673 -8011 25888
27236 25888 31034 20409 45072 139772 167461 146195 44229 -10577 -39421 -48587 -82278 -65387
27224 -65387 18594 27633 14373 -33110 -131884 -207664 -175426 -119329 -37287 -64028 -113575 -14142
27212 -14142 -9866 -42833 -51363 -7084 24676 -1669 -34164 24452 81418 14269 -70404 -14861
27200 -14861 49999 17495 -7955 -37149 -28253 -5836 -6036 -79535 -134997 -93172 -52381 3649
27188 3649 5221 -28826 2738 43925 -3842 -60083 -7853 40693 7404 -52693 -25215 53512
27176 53512 91328 4160 -45396 -75617 -124797 -119493 -75420 -125470 -59862 -43808 -50793 -31731
27164 -31731 -2426 -21859 -102350 -87486 -20193 -13993 -58369 -123006 -130144 -26469 -645 35106
27152 35106 57116 53457 -10574 -72206 -75879 5048 61344 93606 117138 142002 205106 204536
27140 204536 169824 112749 127634 165441 76387 71159 91620 126058 64280 54991 98765 146379
27128 146379 165654 131466 99099 31342 16317 48729 48562 -28076 -74876 -29085 -65747 -36652
27116 -36652 -45424 -54247 -60197 -109099 -122496 -61647 -43323 -5588 27398 28429 45254 115937
27104 115937 118136 123529 123449 60051 19200 -51660 -36373 59612 151826 117614 27848 2262
27092 2262 10712 -110625 -186040 -163446 -77388 6638 64897 -5880 -37165 -15165 -65450 -48872
27080 -48872 -82883 -101495 -43006 40608 42594 63594 -67494 -190893 -198704 -153239 -120420 -38026
27068 -38026 -22322 -65885 -15027 1719 -58825 -97154 -168304 990 39544 11028 -33441
27057 -33441 -290 -17282 -23737 -28033 -10919 -34452 -127076 -86605 -115260 -99454 -51157 -104334
27045 -104334 -23167 30660 10603 57488 89540 137011 81402 -4182 33716 162822 188806
27034 188806 129805 94099 41607 -15755 40467 85449 52002 67312 37561 39281 80110 126438
27022 126438 72962 -24415 -60931 -22948 60545 117086 117282 66914 111846 104163 32059 -63267
27010 -63267 -77873 315 -74935 -189872 -215409 -125208 44251 96855 121601 110957 83942
26999 83942 70562 28484 -4377 -55671 -80318 -119108 -84030 -45454 -63999 -47251 -43028 -38506
26987 -38506 15308 56729 50120 -3515 -55194 17719 -20433 -21758 -35701 -30097 -52625 -21870
26975 -21870 -41692 -51131 44654 90807 79143 102890 75997 19409 -68984 -56364 -35993 -80684
26963 -80684 -41199 44182 73425 59364 21794 -19204 -24878 -8863 84265 57717 18046 -561
26951 -561 7080 11258 -35436 -6762 53507 13217 80456 118317 79233 76136 40905 8601 5528
26938 5528 41981 90349 91242 126024 229754 259439 235563 193114 72322 41562 39744 32377
26926 32377 21044 81566 84419 8393 31857 -26142 -142160 -100319 46315 60886 26315
26915 26315 28790 58373 -33790 -167762 -110456 -28077 849 32075 3360 24184 83155 97945
26903 97945 57938 -19249 -39170 3693 54232 160021 144003 39186 16903 19494 8337
26892 8337 -2142 10975 7547 -17819 10770 97275 105504 153098 123465 50692 -7882 -65415
26880 -65415 -72162 -45040 -106202 -169438 -91947 -3843 -1980 22439 101520 146035 133156 26950
26868 26950 -22456 -24765 -91748 -96718 -27688 -76345 -173444 -156265 -47553 19515 -31241 34451
26856 34451 158444 159412 110371 158670 106677 96596 51141 -41216 -42743 -47245 -108405 -72644
26844 -72644 26491 -113 -39574 -71225 -100608 -13078 21164 -26700 -68448 14159 -30828 -78292
26832 -78292 -68045 -131297 -78391 74877 84383 65690 5142 5096 11355 -70992 38216 126180
26820 126180 41310 27886 -3185 -54664 -43961 -39122 -28715 -63611 -136309 -203623 -151987 -149413
26808 -149413 -119991 -114709 -113198 -150513 -136553 -12019 29950 13611 -13964 -22423 -31715 53469
26796 53469 100749 88363 42933 112002 123748 12746 18646 21516 -11966 -110013 -126292 -48135
26784 -48135 -65996 -77394 -84350 -72776 14374 40505 -18104 -40699 28904 87684 66354 41920
26772 41920 7832 -2388 -104103 -117497 23110 133254 120931 74723 43903 -18386 -61824
26761 -61824 -80387 -19896 12399 18560 6638 26973 87817 90908 41356 -34670 -25477 -13107
26749 -13107 -61555 -84065 -99871 -58760 11597 27017 -9513 -5736 29620 40986 9870 -52198
26737 -52198 -74593 -51849 -121602 -184145 -77021 -28574 -49108 -33947 4658 9963 -122040
26726 -122040 -233440 -178286 -119581 -124399 -143583 -123122 -59666 76690 154802 35896 -12258
26715 -12258 -8657 30051 73744 131368 187040 150194 118589 133067 42620 -34614 -55440 -23915
26703 -23915 82154 95750 79762 36267 12372 -35843 -44631 24534 76515 55451 -11127 -55450
26691 -55450 -45767 16855 -14537 -59823 -88936 -48467 17415 17705 -29030 35855 122722 159613
26679 159613 109615 81503 88112 70548 6133 -9094 69734 71449 43352 12946 45820 53791
26667 53791 86422 46593 18564 8742 4964 -77694 -120854 -67836 -4541 19064 37368 49221
26655 49221 43049 49054 23288 26124 156472 175480 148054 121631 130656 77463 -55056 -119156
26643 -119156 -70684 -21701 -4843 -56804 -42669 67122 69147 43043 -35881 -66870 14008
26632 14008 101562 59475 33449 4347 -30814 -49125 -1631 -16373 -15646 -56855 -9597 -52514
26620 -52514 2757 38344 15655 -25978 -40922 23572 24849 -19569 -59932 -167348 -225021 -191534
26608 -191534 -130298 -38029 -93436 -2484 -2112 -56277 -89072 -41740 74042 59745 10997 -47985
26596 -47985 -81609 -2064 76714 65960 34496 48257 13911 45156 48383 65727 81315 37784
26584 37784 -69741 -144058 -229857 -199162 -151975 -23243 83812 49577 53032 53490 43861 16718
26572 16718 52704 126056 101551 99479 182646 57512 13307 4847 -45856 18547 87413 238635
26560 238635 173684 84115 64853 74306 29630 80808 123808 62394 40661 66449 63691 71208
26548 71208 126659 105328 36191 112356 104839 113174 118103 59665 -43610 -88161 -33741 -70198
26536 -70198 -64286 -4313 -23938 66528 111857 151303 171781 97284 -40047 -92553 -81001 -12192
26524 -12192 51930 71938 44531 158198 244281 165034 86583 46441 -1650 -31715 -88782
26513 -88782 -71761 2637 -18919 -70421 46801 100539 50914 20338 29690 -10402 -25919 41626
26501 41626 25010 -39154 20682 37047 37790 76945 97206 80185 88376 131194 70201 15759
26489 15759 -78252 -131402 50529 113872 51019 8936 64207 16289 -78174 -126505 -82617
26478 -82617 15288 8676 -27864 -21537 -12312 -89185 -111284 -50418 62172 97148 146548 120299
26466 120299 -27046 -95846 8461 60486 81848 137386 188560 115629 118429 143512 96649
26455 96649 127274 161814 83680 65111 80786 34526 -13755 -26636 27483 -5029 -31533 8417
26443 8417 43651 67107 84897 19556 24897 61848 50442 3586 54361 153967 149741 109975
26431 109975 97780 98577 107187 97847 67149 118860 104309 47808 41977 -42606 -38453 424 42045
26418 42045 64085 41236 -12606 47806 4159 -29397 43355 75032 49243 29952 29860 63564
26406 63564 91438 84670 62154 65404 -4589 26290 37761 70456 23939 -83178 -49942 32586
26394 32586 76807 -24753 -67188 -94439 -143822 -95823 -27505 -5588 14828 -9346 -28943
26383 -28943 -16610 -15217 -10517 -118369 -252754 -195293 -125322 -123408 -67923 -22458 -22862 43528
26371 43528 6104 -23704 -12476 56288 20533 15754 -35426 -42285 -39038 -2622 61806 1885
26359 1885 15389 54796 80897 99370 138144 88248 127280 160639 171861 86072 72934 60380
26347 60380 55818 32581 84849 53346 83742 120934 141933 85976 -15554 26360 89213 106400
26335 106400 81493 26908 14373 84128 118011 139862 107929 93508 55695 -24908 -11306
26324 -11306 -86358 -118269 -67717 -22804 -25815 24127 -2770 -93700 -107479 -82622 -44585 58000
26312 58000 53266 -16258 -75011 -141956 -89345 -93320 -65786 -57439 -85229 -19155 114610 71353
26300 71353 24936 80456 76155 -707 57352 67223 88233 52872 -5443 8574 -8140 62776
26288 62776 116057 69338 5696 -50553 -32764 57717 90164 84491 100114 91948 64598 38404
26276 38404 20071 -24124 19910 61445 104498 127158 114015 52753 60461 42766 -4344 9669
26264 9669 6533 51144 86083 98677 61076 3251 -1747 43012 64432 44073 39919 -68541
26252 -68541 -50447 16392 10472 -66819 10466 33359 86743 84132 42143 88729 87154 143747
26240 143747 133983 13326 -137160 -169350 -123566 -115455 -54790 -122933 -124428 -126270 -181654 -85822
26228 -85822 -64732 -77646 -86267 -66857 -33051 29159 57192 147873 106467 -3361 -78790 -100282
26216 -100282 17000 42296 -28240 -61904 -67636 -64548 -43747 -15278 -57590 -153041 -149695 -130815
26204 -130815 -57413 -36162 -24433 -55476 8645 10897 -33696 -38557 11851 -3101 -73465 -679
26192 -679 234 -5140 -13103 -97825 -118070 -35797 70786 100897 161245 131769 84351 31639 -25389
26179 -25389 -9178 11032 11982 -9924 -16813 24283 23482 -35856 -30240 34976 -34919 -47819 -7474
26166 -7474 -774 -58668 -84019 -72753 -9297 6584 127190 124990 73683 29979 93511 103800
26154 103800 23658 -5143 22923 7385 -32898 -52261 -55616 -27105 -68738 -96031 -51711 94777
26142 94777 153796 146549 180168 199099 146686 68109 12844 44404 122237 145416 85017 -62327
26130 -62327 -146564 -95034 47902 101541 55007 -25393 4880 8570 -14790 44129 -81759
26119 -81759 -153451 -120689 -54148 -6368 -38463 -30368 -47633 -72266 -129308 -126434 -172181 -194126
26107 -194126 -102138 -56106 -92475 -119086 -96835 -113441 -62088 -57072 46986 110750 124970
26096 124970 77034 5488 -8826 -53637 -152388 -101453 -103803 -97564 -115735 -120536 -115744 6648
26084 6648 82030 71604 30406 -9575 43060 121210 88995 45440 -58780 -131308 -86490 -57098
26072 -57098 -55959 -82164 -45441 -14180 33661 36707 -23813 -8326 -89256 -55361 -52413 -79071
26060 -79071 -72980 -29825 104892 172258 108184 21566 -20566 -412 30651 51502 -14713 -19220
26048 -19220 114265 66537 -6881 8316 -16272 -20565 -4252 3497 71407 74433 7444 43941
26036 43941 -45705 -96816 -112738 -123076 -37892 44406 89635 141357 -251 -8086 4106 -30627
26024 -30627 -48576 -72949 -56260 -47494 51195 95225 111670 39236 58200 47790 -62668 -50310
26012 -50310 23011 131354 104639 -25714 -98739 -30636 52891 115963 129398 150006 156488
26001 156488 94581 75537 127058 135801 30316 -39567 -111353 -148998 -89830 -44099 15083
25990 15083 41338 63157 9457 31547 32823 -23620 37150 16662 28187 -4650 -68112 -63515
25978 -63515 -41558 -34276 -50658 -40302 -77091 -133477 -87842 -53008 -82476 -127847 -119580 -87230
25966 -87230 23237 6046 -24259 14562 -30614 9699 70887 89547 213880 216025 162532
25955 162532 101351 27443 65727 103704 74771 55476 55557 125833 147429 105407 16832 -48728
25943 -48728 -101234 -115926 -72079 31534 86088 77247 40905 17718 15518 29337 97028 206657
25931 206657 200764 41699 -78305 -95671 13575 43875 -2644 -26066 -45811 -53138 28558
25920 28558 6557 -20709 28674 89790 36711 -4136 -2659 -7709 -17472 -18214 -92714 -122150 11992
25907 11992 81520 56147 4525 16842 69383 30108 -16274 -49549 -10287 37235 43809 103669
25895 103669 141996 193702 135371 15776 22946 88719 119050 46383 -84395 -190591 -147557
25884 -147557 -52348 -36997 -136120 -206597 -214315 -205130 -129536 -95144 -120685 -71015 23855 44002
25872 44002 -3497 -71338 -54766 -31769 -9090 32368 -70065 -135462 -147780 -84111 -140805
25861 -140805 -113385 -55831 -41271 57511 78468 24526 -26670 10592 -40286 -116582 -55857
25850 -55857 20600 44691 22654 -8651 -13438 3239 15339 45498 37932 26188 -41832 -62405
25838 -62405 -17899 -10864 50656 15240 60797 102772 19742 15006 66397 39476 13232 -13049
25826 -13049 7179 70877 136157 240300 218752 159206 50544 -20860 -61630 -91630 -62502
25815 -62502 3430 49597 23840 85369 80959 94604 66602 8406 -141800 -157644 -85424 -14773
25803 -14773 7299 -32162 -35005 -15953 32540 -24494 3112 31950 61909 116528 49985 75975
25791 75975 30379 -7915 -63478 -30817 30196 67363 91925 102022 151282 107993 138297 101832
25779 101832 37571 12598 2804 65118 73456 22920 3632 -1928 -57809 -179466 -102705 52060
25767 52060 55063 18097 41984 20316 26998 -4722 -59188 -67444 -16935 53943 126374 157281
25755 157281 97621 -6522 -64500 -62226 -2068 52922 72260 127914 85437 99730 128453
25744 128453 31236 20746 43414 20514 -7858 -12130 -27563 -105985 -93066 -66497 -107358 -114616
25732 -114616 -72527 -33983 45888 129439 169055 122715 134248 174050 99714 -11840 -56455
25721 -56455 12890 102647 115573 122248 112376 68577 106841 85917 -36195 -98995 -91326 -46407
25709 -46407 -30414 -16507 -41372 -164141 -89214 37360 112272 112972 90468 1943 -14715 1938
25697 1938 -3119 37407 14441 -10613 292 -41130 -85626 -75097 5821 -22140 -69023 -76123
25685 -76123 -100056 -172914 -181884 -91419 14029 20914 -19625 -36394 14614 56553 93992 92224
25673 92224 -10069 -46392 -47073 -19821 -10428 -38938 -23685 20709 40762 21395 -83818 -138140
25661 -138140 -73842 -109587 -131950 -98014 -125256 -160816 -97201 -68306 -35519 33026 46958
25650 46958 24945 28958 98421 139983 117097 -8730 -66357 -58595 -61553 -59143 9288 43245
25638 43245 99018 213378 194971 71454 61582 33415 16625 -39347 -107609 -59418 -57996 -136455
25626 -136455 -150462 -111243 -53106 -26120 -3788 55867 84364 71165 14008 -18998 -3382
25615 -3382 20416 -26844 -23094 -52596 -61389 -21574 31779 113819 51933 13709 -13534 -13314 8391
25602 8391 48751 27589 41674 30808 13845 -35695 -2907 -9087 -81158 -33713 15752 -18776
25590 -18776 12857 -13394 -5957 -9680 56620 106010 109327 114230 94480 170998 94254 54486
25578 54486 51617 29917 119364 135031 132332 95972 31275 12795 58798 39729 -31661 2621
25566 2621 27023 46910 23347 52582 20743 -10519 -35076 -19879 14978 19891 47675 73984
25554 73984 47972 34147 41197 93879 109967 135880 136508 146467 122545 70306 12835 -23330
25542 -23330 -23844 -14872 -53533 -80619 -44959 -111659 -111171 -37966 31623 24774 10415 -33282 -95156
25529 -95156 -154385 -151454 -126682 -171131 -145012 -56826 -19305 17547 67942 96992 106794 62192
25517 62192 60937 7679 124555 128964 29100 -10427 13442 -105259 -149678 -112195 -88270 -24397
25505 -24397 -53339 -4925 54375 61511 71495 29076 -15729 29492 108317 29320 -61403 -89563
25493 -89563 -105320 -87591 -107980 -57126 50492 61218 48483 -281 -9012 -62080 -14812 -55909
25481 -55909 -96029 -37517 11833 28420 16243 -26346 3128 21545 31879 2025 -110212
25470 -110212 14372 47906 59052 94531 60235 -47219 -37942 21911 43932 25861 -15311
25459 -15311 11071 15135 -24322 -83044 -82299 47249 25650 10337 43227 36442 20883 10376
25447 10376 -97277 -116098 -75819 -93960 -87117 -34697 -80937 -66207 -427 47691 20502 -8645
25435 -8645 -4398 10673 -20326 21168 36222 -12491 -100271 -85049 -16707 16040 47052 -27171
25423 -27171 -92545 -110246 -179110 -175731 -140859 -173764 -103638 -118518 -16915 16113 -31814 -50327
25411 -50327 23687 7638 -5224 -9653 -20791 -9855 18729 -27483 -59039 -123339 -140701 -31503
25399 -31503 -21271 -115931 -114994 -122660 -109250 -97721 -153216 -252932 -218802 -114737 -111552 -51193
25387 -51193 400 -49138 -84268 -60191 -97986 -71619 -38401 -148104 -63353 29728 -65149
25376 -65149 -63411 -10659 34681 55562 76020 43403 82286 32313 -55337 -23607 -15249 -863
25364 -863 26432 18252 -3858 -5098 -37717 -105978 -51023 26057 25034 -15571 2807 16692 51808
25351 51808 16171 21629 87935 117192 99536 163691 186664 114847 35881 17074 -17347 -100264
25339 -100264 -53975 -5595 28421 19234 -76972 -44758 -10670 694 -29597 -13635 47847 38265
25327 38265 -22210 -386 69412 155178 127924 122725 72616 68163 54234 62108 -11422 -82803
25315 -82803 -40766 34679 -1371 -7926 34128 20321 -65317 -168827 -177291 -95638 29846 29592
25303 29592 4417 54385 147909 181197 210289 176434 31727 -35140 7881 9104 63388 6565
25291 6565 -39000 -19800 13895 44545 75639 22228 34079 120498 121692 35841 -21931 3714
25279 3714 -20429 -32489 -47151 14454 -35506 -72995 -30714 27291 45909 -9645 -48686 -108786
25267 -108786 -140531 -108014 -118749 -53384 54973 40002 31029 1523 -33458 -55497 -20572
25256 -20572 12551 -62069 -101161 -101305 -121646 -100910 -38398 -46576 -79263 -162240 -189040 -127179
25244 -127179 -100813 -161068 -156806 -59490 4753 -63281 -42263 774 22115 -45487 -66450 -94934
25232 -94934 -87057 -27443 16868 -47487 -100129 -115787 -136374 -124574 -25528 33599 113415 85691
25220 85691 45287 61237 10333 -38388 31844 86482 30973 11865 -3093 40112 80928 94881
25208 94881 65222 -19455 -35531 27931 66267 41025 50180 24402 44922 84262 100765 164571
25196 164571 167707 147468 68313 -17375 -41288 31177 58636 99308 64097 86823 91291 101085
25184 101085 68689 25768 62036 31475 -22754 20961 60704 -30256 -35943 -75190 -114762 -83878
25172 -83878 -71172 -67776 -15821 78150 114030 34614 6029 -63396 -40870 -74378 -95623 -45164
25160 -45164 -58596 3208 39988 23066 -35655 -40011 14125 9453 -11130 -89476 -189233 -144152
25148 -144152 -80861 -59561 -62684 51528 138299 167746 70293 81260 141498 225419 143955
25137 143955 52418 -87168 -110634 -68304 -25353 -62089 -24357 21545 -21952 36085 65491
25126 65491 53687 43423 -14343 -32989 -31096 -55497 -62494 7303 19507 24121 33313 63389
25114 63389 111982 106773 95987 95939 135497 153108 222185 192954 89471 48638 52495 68728
25102 68728 53880 -272 -129471 -153902 -77779 -31587 6378 21451 924 -8152 -18293 46383
25090 46383 18887 78125 128773 69795 158257 126141 89216 30335 16851 46381 46201 34193
25078 34193 88889 132689 50621 -44791 -56768 -68479 -130407 -75962 -53877 -22882 -6042 3702
25066 3702 -22287 -48845 40118 19031 -18752 -16578 -19600 33310 57191 53964 11167 -139487
25054 -139487 -210093 -189172 -91226 -50721 -67190 24627 21831 -8698 53984 101083 65659 26756
25042 26756 -46787 -65681 43265 86015 16221 -22597 -31646 -91748 -45076 -20541 -19605 -28467
25030 -28467 -60386 -62634 -32665 35907 50778 -17228 109036 115473 13227 -156260 -218077
25019 -218077 -97625 -44242 49803 66587 -29854 55055 92676 32988 67405 45424 65302
25008 65302 67657 -5772 -52601 -43105 13255 -21069 -12832 -49634 -48822 -56884 -69696 -82847 -42051
24995 -42051 38212 20404 48242 58568 41325 19198 60708 119258 90916 99154 33894 -43219
24983 -43219 -42622 6286 55370 153573 76705 -52183 38473 115762 99499 116629 101237 589
24971 589 7004 32685 60455 96641 85526 43260 24211 -24343 -27995 -14369 27288 23781 7647
24958 7647 75385 29348 18074 29248 140887 225369 136963 90573 89007 81916 45440 -22903
24946 -22903 -28990 60283 51242 61692 -7755 -20349 21103 38395 -22148 -10445 51565 10526
24934 10526 -32213 5061 72867 12531 -52958 12258 71802 -711 3396 16351 -9660 56865
24922 56865 49004 -104366 -115026 -79692 -114477 -36551 68195 57163 53509 36223 16442 58774
24910 58774 83790 60298 19924 46786 20448 40882 -47351 -69567 -73153 -24144 50571 86632
24898 86632 61296 53916 26474 55291 69738 -3830 -125178 -69928 -52951 -22324 14244 7709
24886 7709 34930 19215 18824 17712 41780 44077 14584 -44686 -101123 -46480 7365 56261 4599
24873 4599 881 20587 7054 -22872 35252 69599 123212 154618 86242 -31306 -49471 86222
24861 86222 139463 127761 103701 49077 -42071 -24006 55186 -7048 -10204 -19223 30485 12993
24849 12993 -1513 -31710 -42982 24641 129219 129305 160586 188990 151804 42020 23030 71192
24837 71192 43937 63351 102562 95044 70248 68451 -34678 -82525 -77273 -148460 -315912 -244736
24825 -244736 -44020 5119 -739 -7359 -9923 -75256 -140085 -145874 -126667 -102813 -44420 -55811
24813 -55811 -128304 -113481 -88469 1650 62901 51353 49033 57098 32029 100117 93196 125637
24801 125637 110988 100323 44165 62699 36182 -24621 -32381 -93207 -60859 11231 -4660 -14240
24789 -14240 -34206 11194 -25895 -58733 -47343 -45401 -31340 -526 -67219 -67115 2206 8244
24777 8244 43460 -98117 -163332 -92205 -117804 -138705 -109831 -55714 -25589 32584 108689 143348
24765 143348 183885 237396 178865 88559 52929 100005 26617 78741 93109 -26301 16846
24754 16846 122496 86882 20147 -27683 -41422 26116 104431 143969 133136 90810 121042
24743 121042 138584 127704 79716 94627 20263 38235 103868 90636 122379 106027 158402
24732 158402 99357 -3807 43325 91987 113902 11079 -39322 117 -45156 41331 154810
24721 154810 115140 -5593 -22406 -13906 -1328 70622 23688 -36738 -7050 38406 2539
24710 2539 -94093 -35634 17751 43026 -33729 -85339 -115290 -103121 -49986 -18580 38884 8707
24698 8707 -82775 -37230 -59312 -144814 -97765 -64604 -77041 -89362 -53425 -9259 -49467 -96830
24686 -96830 -93147 -83699 -86204 -86049 -40619 -36135 12248 83387 105568 103078 126279 102422 -42963
24673 -42963 -112262 -114494 -142967 -81673 -39233 -5671 6976 77272 94841 80122 69390 -19572
24661 -19572 -71126 2952 93079 46713 -10445 -42578 -82853 -119187 -71928 -16042 -19999 -40581
24649 -40581 -80087 -114297 -196042 -257506 -312805 -344150 -297195 -181050 -26948 19360 -44732
24638 -44732 27373 71235 5901 -12393 60002 3248 -19000 -12927 77505 67812 11808 -110904
24626 -110904 -114498 -90490 -155035 -144618 -132159 -27918 -11260 13515 -2548 9196 67577
24615 67577 -14058 -69543 -72206 -41847 19279 57331 11354 15 2442 -51798 -56711 -79009
24603 -79009 -58747 8018 137415 91605 86961 76538 -3165 -97071 -130075 -80535 3440 120427
24591 120427 26514 -16100 -21031 -29732 -8953 -20063 -18974 -21503 -74547 -121620 -156562 -99951
24579 -99951 -16826 -67860 -71716 -10027 6054 29675 -20963 -75748 -60582 -1451 40124 71588
24567 71588 189023 243111 241457 209135 119682 75983 9031 46912 59866 11757 -10709 -34086
24555 -34086 -17982 64669 60740 13897 91152 84181 -13763 -79346 -62341 -15034 23273 -22229
24543 -22229 -21566 -82265 20340 34797 125230 115896 57802 120932 98707 144311 111922 180835
24531 180835 208322 127774 43767 18703 77359 13584 -13104 -22090 15578 77986 45690 41010
24519 41010 -47857 -75327 -79902 -2986 58308 107016 9977 -38013 -62295 1527 34029 83648
24507 83648 75172 33830 4640 -9175 -78771 -60797 -100205 -97435 -170908 -73887 -66907 -108394
24495 -108394 -53511 -64638 -50941 -40375 -101458 -70810 -42267 -24346 -45356 -33209 -61948
24484 -61948 -55899 13480 90399 64809 12232 3967 -10035 -27540 3806 7501 -11630 36948
24472 36948 62562 -2842 -7529 40543 -23523 -13272 45342 3545 -80932 -119413 -66236 -25150
24460 -25150 -74261 -72560 -41694 -73388 -115021 -66199 -62488 -83497 -32514 61533 110937 61824
24448 61824 107866 73103 -773 2291 -19026 -7455 -94451 -128688 -5229 45326 11438 39077
24436 39077 26331 -49096 -53175 20698 71660 32445 42996 -2756 683 43187 30896 -44822
24424 -44822 9850 40608 12259 18500 49960 -35214 -131888 -120834 -30996 80504 -29755
24413 -29755 -158064 -103571 -14301 41149 25699 -64898 1151 -33868 -110357 -49673 9452
24402 9452 -19737 46972 162820 260060 237626 196559 181239 123464 58002 4887 -32770 -7017
24390 -7017 33130 104776 130923 30472 -29003 -59308 -17545 62059 63284 72210 -1547 13902
24378 13902 15808 41334 94330 65931 94089 86082 74610 26597 29736 76783 81603 28203
24366 28203 1765 50009 56716 -28551 -28187 95060 122498 -46849 -7743 119010 137009 81720
24354 81720 17640 -34854 -17196 -58110 -162081 -187899 -131946 14842 51552 22840 -27078
24343 -27078 49523 33209 36429 -1991 -20501 -13570 -16653 -97855 -95101 -65901 -52192 -25912
24331 -25912 -27086 -22921 -60541 -118180 -69382 -29251 -64412 -119518 -148062 -121443 -83014 -89557
24319 -89557 -88218 -71896 -58286 -61889 -45073 32632 54827 69978 43822 826 19526 10771
24307 10771 34850 30106 38608 -58532 4434 -20146 -84225 -39284 137561 158120 142453 115244
24295 115244 101381 87845 -14628 -102985 -38833 -44177 -101978 -162105 -153206 -118488 -51344 -49937
24283 -49937 -69608 -93070 -23386 54022 14104 -17752 -63572 -65962 -64813 -80259 -96682 -134704
24271 -134704 -106699 -10178 27629 11664 -59790 -95553 -71370 -82427 -59324 -34743 -9423
24260 -9423 55613 33270 -53906 -62880 -82201 -40002 -52070 -105837 -56858 -116479 -36769 84299
24248 84299 77297 -10552 76936 114268 193151 171381 32338 -70254 -38979 -67200 -140201
24237 -140201 -143732 -78598 -13324 -62262 -90060 -78706 -102225 -135719 -132011 -71734 20027 40750
24225 40750 119104 91994 150989 97808 -31459 -66382 -134667 -82888 -23691 -776 11056
24214 11056 4825 10982 32629 -21110 -48560 -66366 -76204 -41780 -88230 -21433 21977 -6861
24202 -6861 -125139 -65019 87129 22427 -21040 -99308 -144112 -178335 -159053 -50828 -2564
24191 -2564 6578 -52770 1263 79588 109796 107412 52851 32553 -35514 -115511 -146832 -155823
24179 -155823 -117661 -111081 -73913 94899 103508 101951 37662 -45745 -85613 -125647 -109652 -57745
24167 -57745 -857 10026 -5633 -36758 11417 -38696 -45431 -25385 60918 39753 3882 -30278
24155 -30278 -48769 -16605 -7895 -19562 -138301 -123584 15940 51356 6825 -17388 35203
24144 35203 51995 52206 60281 29490 385 86543 108570 80577 17183 -53922 -61111 -50805
24132 -50805 48872 87643 90209 27239 -90458 -22931 8194 65737 19204 -117023 -199888
24121 -199888 -151118 -123246 -37288 34430 46413 16130 84241 68507 41113 -24929 -104628
24110 -104628 -169130 -220292 -219055 -137853 -8119 -12917 -42072 65798 126498 72878 21799
24099 21799 2023 79349 97801 38622 -14355 -11848 -40956 -22532 -43007 -76202 -63962 -34945
24087 -34945 -76917 -128964 -114022 -117369 -150026 -152566 -105163 -24448 37271 55282 46542 46900 55336
24074 55336 81025 43053 -13957 27295 37117 -17844 -5128 -45501 -5636 4405 27325 7327
24062 7327 -37934 -86807 -143802 -155505 -13378 47142 -44059 -46147 -134680 -212913 -147312 -63809
24050 -63809 -60467 -108239 -113051 -29310 -13848 -7601 -16199 -57663 -75880 -119174 -179612 -146681
24038 -146681 -169445 -186823 -102868 -58270 1546 -56102 -115246 -187126 -107661 -161348 -69842
24027 -69842 9735 49951 -2206 -36187 -26695 -19356 25971 30068 6721 -20647 -6751 -36726
24015 -36726 -82886 -17193 46000 30577 8033 -28523 -2690 -71614 -172636 -190062 -89751
24004 -89751 35738 1650 -8860 58572 26004 -5903 94444 196815 124628 98457 45226
23993 45226 -59761 -162668 -82041 21723 74347 61071 -28013 6250 125099 56736 -35864
23982 -35864 3732 1504 12918 -36156 -51181 -55651 -36247 -1292 -12852 24405 101763 152492
23970 152492 132456 58045 37313 37337 19219 -48430 -124196 -111510 -50012 -68891 -133222 -80902
23958 -80902 -84466 -102995 -50014 23587 17212 16928 96181 84860 92369 139959 110451 -1258
23946 -1258 -62016 -117830 -96026 -149874 -177064 -104112 -77355 -86491 -71120 1237 11767 27775
23934 27775 3174 -1568 64758 121804 42036 -4200 -9212 -3954 43376 108958 85782 42318
23922 42318 46312 56120 852 -13517 -7907 13635 17950 51302 19250 -27971 -129109 -40217
23910 -40217 99331 181419 125610 85610 125918 142790 144333 177706 90144 38315 8036 -19633
23898 -19633 -20791 15220 5939 47801 41080 -3927 -1046 92464 71158 53434 103750 79456
23886 79456 20451 -11440 -35689 -36331 20999 77565 -3396 -61486 -19359 -61895 -75580 -3487
23874 -3487 82905 61650 19186 -68811 -129864 -99666 -62180 -10473 -68536 -26373 23642 -39523
23862 -39523 -62679 -78495 -93527 11578 -39928 -107697 -29911 450 -25416 -108418 -123953
23851 -123953 -20181 -82822 -146376 -132078 -167901 -143276 -55599 -10859 -2148 23071 91456
23840 91456 127635 162905 48821 -32417 -24875 41332 -21171 2459 -24060 -34835 -3772 9376
23828 9376 9391 -54003 -71210 18821 62695 28213 -22844 -77701 -34734 -18062 -9080 34391 -12896
23815 -12896 13155 94166 60362 35313 22627 54124 -14710 -18843 26854 27540 21965 81867
23803 81867 92613 84032 125643 88089 28306 98119 81459 17695 46439 11385 87410 169599
23791 169599 128689 23890 -110720 -112457 -100096 -33605 -59753 -68525 -75625 -103440 -124908 -97434
23779 -97434 -68436 -63286 -47591 -29382 3930 55867 93359 20864 -72562 -143267 -99221 -27320
23767 -27320 13861 57139 -6559 92625 116856 83597 70814 138608 169445 990 -31457
23756 -31457 36841 30091 -69862 -53572 23002 130211 179780 182718 28302 -15921 -6203 -31930
23744 -31930 -26680 -31714 -32350 -93289 -93724 25714 30819 3715 38714 51091 7470 -64950 -15243
23731 -15243 16206 12520 44209 47411 13862 7833 57803 2362 21191 -34050 -59743 -112434
23719 -112434 -119796 8023 79208 126127 131597 95890 -44542 -107028 -83705 -18870 -23097 -27313
23707 -27313 -151715 -77600 21196 57655 75819 20965 39413 45429 3227 -12366 29390 61133
23695 61133 86773 40168 22358 -4225 -26708 -47595 10315 102393 6418 -78473 -88725 -58845
23683 -58845 27647 10362 42666 54887 42381 -7614 -17593 -43572 -90156 11829 5997 -4379
23671 -4379 11386 33034 49553 31686 -29124 -103274 -162766 -122126 -64692 -80480 -125757 -178229
23659 -178229 -147148 -131695 -75882 -18682 32800 -36990 -75153 -73370 9592 49150 1155 36921
23647 36921 30587 -28007 -12360 9001 29262 30256 13944 -34605 -41098 4676 -20681 -45516
23635 -45516 -54983 -103913 -78223 -109570 -72547 -18967 -786 70012 174395 151116 76144 51665
23623 51665 2935 19771 47772 8764 -20819 -76626 -20515 -12104 -49070 -16364 -33024 77628
23611 77628 84222 -109249 -203589 -225321 -220293 -148279 -126652 -114483 -155516 -112310 -71582 -35926
23599 -35926 61383 122759 197890 177922 52937 -23065 -28512 -17688 26047 -2628 -86246 -77310
23587 -77310 -26416 -6763 4845 36538 -18488 -15664 -47097 -39148 29395 54284 -26896 5048
23575 5048 88045 47158 -67259 -67473 -70871 -91 -7995 -105444 -42525 -46778 -92867 -64885 -10078
23562 -10078 -45451 -56736 24511 6804 38811 33563 14224 -24906 -67078 -18089 44897 23
23550 23 -63580 -19231 -52306 -97630 -123593 -111584 -27713 7186 -8822 15018 -39133 -71582
23538 -71582 -113078 -59576 -1153 42906 59312 180790 140737 103251 76594 59213 13597
23527 13597 -55865 -137349 -185941 -175951 -97063 29461 104419 102079 -2180 11547 63538 41088
23515 41088 -23318 -38546 -82118 -80493 -13637 1246 -10721 -30804 9479 21731 -16200 -44087
23503 -44087 -23682 30721 58557 85993 117291 46030 -42935 -149877 -267012 -247570 -204066
23492 -204066 -105318 42627 11761 -76053 -21316 31757 26516 -18003 10693 31187 48104
23481 48104 74885 -43238 -135625 -132394 -117788 -129844 -110990 -112199 6912 35496 -28344 -86345
23469 -86345 -4182 64398 15765 -48019 3477 135 12235 -26667 30361 57673 -14944 -81609
23457 -81609 -48761 -112702 -68376 -42360 -49669 31084 103337 47704 -66746 -97780 -121250 -141276
23445 -141276 -64322 -49496 -22114 5695 -37718 -73559 -8753 -99827 -209016 -158118 -47112
23434 -47112 54814 43951 26842 14735 -42226 -93280 -128331 -43239 -39282 -78926 -95779 -75605
23422 -75605 -114433 -127828 -115300 -123193 -100893 -74513 -4829 126591 154195 98773 104767 48427
23410 48427 5956 72366 122998 12588 -69506 -42738 -90363 -105320 -130815 -123351 -137150 -192538
23398 -192538 -138899 -150961 -88594 -11844 -21992 -59712 -116447 -87486 -51879 -20701 -181986
23387 -181986 -199354 -50757 32143 10457 20281 -34252 54978 122986 138162 112407 133227
23376 133227 116987 138088 99538 -55728 -78338 -79645 -91303 -63674 -48580 -66317 -58837 -110635
23364 -110635 -114441 -97197 -5303 -12270 4456 -4089 -46489 -66981 -50157 -66569 -41940 -6676
23352 -6676 -7092 -7503 -100312 -104389 -45673 -10151 26502 -8560 -19821 -5482 -57683 -36052 -28157
23339 -28157 -91827 -60143 6121 -3192 -25594 -115281 -142469 -75113 -32952 -21594 -75287 -44817
23327 -44817 -47793 -17542 -14182 32533 7934 -33288 -110483 -79245 30120 47290 34561 -83882
23315 -83882 -95037 -152853 -100519 -20591 40686 -39253 -87763 -53744 -17877 -68116 -66020 2643
23303 2643 15375 -45352 -110976 -130378 -172490 -70022 15612 93654 95034 171945 159701 74757
23291 74757 -11516 -40062 -23701 -10842 39764 137459 159909 125342 103873 69017 46767 33738
23279 33738 -67320 -119339 -53342 -23786 10540 56218 117940 90282 43555 50111 74738 120496
23267 120496 39752 -22598 20618 -10718 -9221 55613 113139 70804 52744 -18342 -73383 -70799
23255 -70799 -69696 -14134 73607 24015 -35658 -9527 -14159 -18577 50408 74832 61243 -44825
23243 -44825 -115707 -83110 -67136 19583 94903 97666 103553 73581 513 -20645 -77292 -99651
23231 -99651 -24577 14256 16320 -60707 16080 77661 19939 -18475 -23899 37205 42200 -90002
23219 -90002 -144405 -126225 -9232 -58652 -127699 -102075 -52036 33585 122175 142429 89415
23208 89415 -8417 -28431 -100179 -110489 -91567 -31476 -81492 -92917 -84583 -84396 -109664 -152911
23196 -152911 -64760 49343 93069 102519 109605 99141 82981 75642 16999 -95079 -58586 32844
23184 32844 47709 7261 61064 88235 153568 211807 165816 77860 48252 21978 64299 114103
23172 114103 75525 11026 47500 73938 18351 36909 110578 128756 165541 173725 134790 33388
23160 33388 45612 13249 -98565 -127373 -123814 -97826 -67325 5185 32855 45053 23489 -46129
23148 -46129 -30148 -25413 -24798 17060 62013 66275 75958 140660 80754 81488 110262 77765 35829
23135 35829 -22295 15915 37776 37993 13647 15866 52770 47509 -42730 40880 83193 86502 56460
23122 56460 -11526 26571 24733 -30777 -48950 -93775 -23578 23871 103859 104700 11332 -33758
23110 -33758 -140616 -153543 -133845 -16505 25746 -19511 -39111 -53127 -20760 -2603 -44863
23099 -44863 -69835 -87902 -11539 16821 -36348 -12307 61289 162020 158921 74027 18939 147233
23087 147233 175176 158544 74852 -29009 -22180 2646 23539 -60764 -53281 35151 48477 32905
23075 32905 40439 -1101 -74655 -71270 -20465 -23010 8667 33056 53526 49720 27394 -44253
23063 -44253 -70058 -6908 58940 92835 115388 121148 143170 142346 71275 -32581 17476 1579
23051 1579 -59226 -33620 637 16360 91086 80740 9205 -31776 -98147 -124560 -39723 -34687
23039 -34687 -60869 38349 53954 55603 -56671 -43984 -19950 -15071 9292 -2808 66918 22444
23027 22444 65889 35432 5808 -27221 3809 16132 8861 6041 -12967 16290 -35703 -64202
23015 -64202 -107015 -53070 -761 19491 29827 23079 30377 -581 -68723 -53384 64258 3677
23003 3677 -79063 -112390 -71736 45879 65079 5004 -27058 -112661 -102448 -33511 55674 -44462
22991 -44462 -94937 -91870 -29687 -70546 -144699 -166030 -131750 -73706 -674 56221 50109 6324
22979 6324 -55619 -136385 -114055 -90388 -39966 -56002 -106474 -153179 -170319 -104282 28907 -1896
22967 -1896 -78878 6825 -10065 4200 83911 138327 146043 126856 77465 26551 15662 63858
22955 63858 88586 66320 19626 -6947 -93449 -45721 16910 35465 97203 144456 72783 17267
22943 17267 -22652 -19520 -52211 -24397 22416 13813 -1420 -39854 -23702 -66731 -72608 -71278
22931 -71278 -83485 -52704 -15514 55286 -22060 -24440 24958 -63957 -92045 -42374 12900 20134
22919 20134 19615 -43179 -55221 6464 45905 128714 79574 19020 9522 -16155 -103178 -150161
22907 -150161 -66637 -52106 -124231 -131918 -109888 -141106 -192968 -175644 -53475 -26041 -82116
22896 -82116 -44482 -70340 -71804 -3496 -23886 -98919 -170814 -163676 -107489 -24873 111558 138253
22884 138253 112177 51879 13560 50098 -11650 -37589 -7763 -5846 -46763 -26863 -51135 -178585
22872 -178585 -189165 -168715 -90979 -79624 -38039 -20819 -75060 -43919 18929 13330 -6328 72050
22860 72050 82026 65375 23672 63286 16131 -32721 43140 56409 34022 -17728 30060 23646
22848 23646 22924 5897 -18942 47147 110051 85296 40841 135244 21441 -3505 60776 118342
22836 118342 143213 75441 98397 73461 74096 54570 62891 22707 -19753 19740 15934 25266
22824 25266 19519 -45596 -66028 366 67676 112706 155737 110035 59188 41818 64995 96622
22812 96622 95856 65435 -34216 -125926 -135051 -185043 -97241 -62786 -11152 22860 77943 85927
22800 85927 5918 13967 90325 98721 58138 -28774 43517 86873 41979 -103564 -132686 -176965
22788 -176965 -107081 -51394 48524 49970 59042 4567 1533 -46498 -99060 -78078 26100 31298
22776 31298 23073 30574 -28504 -59496 -65592 -74215 -81811 -134164 -100499 -136315 -120687 23667
22764 23667 82801 8450 -88750 -66341 -65642 -103193 -26973 -9394 -30552 28816 77825 60165
22752 60165 -58080 -148874 -163646 -124333 -104668 -193789 -133410 -55065 -24873 -40969 -19313
22741 -19313 -78827 -133614 -81484 -31766 -115230 -110289 -73037 -55364 -77173 -174076 -206855 -71126
22729 -71126 37305 49985 69591 25561 37302 -13451 -19129 -81453 -199018 -311201 -180685
22718 -180685 -83902 27539 -14781 -65006 -89893 -111968 -68058 -39302 6621 87011 131031
22707 131031 98576 61399 75743 52714 1752 -82743 -17807 24309 23396 -47611 -58614 -27363
22695 -27363 -54974 -63778 -10172 13245 89899 123035 175697 114563 73019 47740 43186 11832
22683 11832 3866 7602 -33721 -23730 -57181 -88669 -138649 -141619 -119573 -51485 -75578 -59128
22671 -59128 56423 11476 -44983 -55371 -110364 -106762 -113103 -89803 -64455 -68461 -123746 -96951
22659 -96951 -53333 -52504 -78633 -110058 -68876 -10270 1476 37139 31527 -44616 -81610 -81542 -104464
22646 -104464 -103721 -46272 12799 -85847 -114202 -83195 -97873 -86174 -28392 -24020 -72007 -67767
22634 -67767 -48827 -31799 -124742 -154184 -184630 -112303 -97121 9203 -28582 -64112 -111951
22623 -111951 -182162 -211414 -187883 -74661 -127697 -127454 -37867 21403 20459 50191 91259 158526
22611 158526 92951 -12351 -62631 -54904 -70424 -100228 -62135 -47470 -8189 21532 12091 -57292
22599 -57292 -51814 2525 -17732 -14860 -28048 -73071 -47839 -5248 -29984 -65237 14738 17590
22587 17590 38057 57860 44895 30707 52111 37974 1401 15439 -49836 -94489 -21515 20238
22575 20238 2664 -12896 -131278 -117088 -90049 -87237 -50098 -161256 -247507 -209887 -122556
22564 -122556 -57435 -28511 -19976 44684 40710 -33227 -59793 -5687 -17010 -6284 -115649 -247820
22552 -247820 -206046 -126239 -100429 -54253 -55407 -97006 -112631 -78758 -53466 -54318 -45479 -35380
22540 -35380 31096 59075 17269 -19806 21509 33792 -73614 -70107 48689 111356 89975
22529 89975 155929 170078 115875 38626 -30750 -30400 5596 -33054 -54787 -9002 -25377 -68536
22517 -68536 -117922 -83466 -35381 -40091 -113338 -222665 -197220 -114411 -52023 -21294 11781 31050
22505 31050 21020 -41174 -76143 -51092 -24584 -15221 -75683 -75941 -53431 -31526 -80277 -98252
22493 -98252 -143780 -101489 -8321 50414 27453 91079 146384 88379 -58211 -152115 -160864 -142846
22481 -142846 -94580 -10033 -39951 -29688 25006 75555 88198 112946 158663 167062 52863
22470 52863 42333 53876 -36164 11565 -23051 -2595 -21432 -66460 -47665 40395 -62619
22459 -62619 -44003 -57038 -45519 -25512 -99424 -145686 -144108 -6198 124004 79671 -2781
22448 -2781 -109573 -98227 -4870 43505 2405 -118546 -119388 630 39154 74493 87840 47329
22436 47329 73161 65611 11506 35548 9172 27139 -21003 -89721 -120134 -57204 -42250 -45053
22424 -45053 -13007 -2145 6974 -60146 -54722 22182 98814 128610 154432 84285 46231 19306
22412 19306 4671 19290 2350 -12084 -84417 -104631 -49356 5997 -28372 7957 110478
22401 110478 95758 67460 5769 33923 44322 22696 8476 -15284 -8801 -66593 -143269 -164046
22389 -164046 -59962 -39438 -18882 56617 48622 10924 59982 19863 -48689 -85338 -76387 -42309
22377 -42309 -16102 13215 46248 29801 -50 9097 33935 80960 109472 122605 69635 72447
22365 72447 66322 8268 -51692 -33168 21293 15218 15448 44110 4570 -91567 -124282 -154359
22353 -154359 -159852 -150668 -150884 -50679 -6878 -46413 -43513 8084 84784 16032 5693 64328
22341 64328 132625 164654 184211 192060 158775 1255 -88968 -69706 -65552 -149275 -58830 91632
22329 91632 128596 126486 57197 55412 137363 103138 -10480 -137771 -86962 -45659 -57075 -24905
22317 -24905 22273 15323 25524 79763 146680 161890 90128 110277 186551 126974 57098 30114
22305 30114 -42656 -26268 -11121 -36547 23486 -16827 -58003 -123149 -59663 -37082 -50323 -134745
22293 -134745 -127086 -100877 -64741 -76215 -88438 -48014 -88564 -104394 -460 -32903 -63378
22282 -63378 -37485 -69066 -63576 -17884 24169 30106 28915 35350 69004 19407 -71785 20072
22270 20072 45358 52893 62104 14784 -25926 -6539 62776 17148 -35589 -44500 -65259 -32106
22258 -32106 72778 138915 218293 188637 143273 134052 123402 31951 90992 55102 -9837 -11944
22246 -11944 34350 51939 79784 4652 -21362 15485 99085 117135 100531 37997 7340 42839
22234 42839 42516 7524 -5324 -9365 72617 107648 81985 90862 36405 -41181 -82848 -98676
22222 -98676 -100208 16858 46591 -11428 -81139 -96094 -105421 -111003 -120301 -95908 -93677 -86693 -7331
22209 -7331 -57735 -84099 -6177 -25332 -31939 -48428 -90978 -84135 -35334 19445 -24358 -1960
22197 -1960 28157 -334 6878 34910 47341 55132 41546 -53026 -145615 -162741 -172650 -262555
22185 -262555 -203989 -97681 -80511 -62255 -63795 -33681 5853 65484 16355 -46258 -154707
22174 -154707 -210016 -129088 -22514 42973 120028 167070 164636 53914 55369 63321 10132 37278
22162 37278 90243 48834 73121 24050 -14341 42368 43636 54772 66842 92198 11119 -87921
22150 -87921 -85677 -33578 -47487 -86299 -145326 -139929 -147899 -86023 -16974 -8542 8294 -70690
22138 -70690 -84134 -69549 -14931 -23396 -86963 -63100 -17605 30708 137923 58646 -18251 27582
22126 27582 15754 -72317 -59383 -118403 -114898 -1335 35297 -1349 -48366 -61976 36603 65605
22114 65605 68424 61183 13624 10824 -22589 -15493 31510 73332 106009 59909 45205 7688
22102 7688 -26946 27795 110314 82483 39005 18804 91041 105956 78586 144547 122794 -4726
22090 -4726 -32138 -44713 -108530 -184935 -69364 6064 -42678 -83784 -164823 -187084 -86675
22079 -86675 -121539 -196852 -85957 -2924 76417 67198 11022 13209 -5667 -1911 23997 -50754
22067 -50754 -51429 -13711 -21274 -3355 5857 -40246 -74181 14050 20125 -17964 21279 -1982 -48374
22054 -48374 -51091 -12093 58720 70942 158152 189730 145598 52569 -58891 -95019 -17655 -18476
22042 -18476 -44090 -92783 -85423 -70285 -97880 -158473 -177279 -141704 -74418 -123201 -163004 -124362
22030 -124362 -124237 -91131 -35841 -19802 -30899 -89903 -169344 -151572 -132110 -96664 -49410 -40768
22018 -40768 -75145 -7156 -9643 -1612 59746 73405 16898 14245 51660 112796 118535 -30414
22006 -30414 -89034 3314 62000 122284 82452 -59847 -123004 -74713 22712 -2028 -58166
21995 -58166 -71978 -143489 -149982 -104515 -44049 -47745 -43648 -128408 -245483 -243861 -228833 -204351
21983 -204351 -124348 -71770 -105392 -43251 24477 -39297 4886 40876 -37851 -130630 -110490
21972 -110490 -113703 -96796 -92260 -55127 85772 67551 -16384 -62418 10741 13330 23605 100043
21960 100043 127808 43527 30517 44310 -31094 -97491 -104144 -77130 -32524 -2596 -23629 -98845
21948 -98845 -143044 -237012 -207484 -162595 -217966 -292639 -216765 -126409 -57339 -61590 -77259 -129789
21936 -129789 -130708 -98804 -52503 22490 46649 30803 -66425 -51516 -84379 -100686 -31964 6715
21924 6715 -122621 -111579 -83761 -97505 -119358 -76618 -34502 -15641 32759 40114 69897 90873
21912 90873 20697 22112 125472 56515 17743 5618 -18599 -10555 74479 90842 100400 80509
21900 80509 -26270 -96545 -41996 -14004 -55102 -23818 12720 75826 110554 101486 -2543
21889 -2543 -52969 -69187 -132835 -184217 -158403 -94207 -85439 -16257 56624 77438 30104 27715
21877 27715 -5755 -52778 -39345 -14531 -61971 -90735 -24879 -49583 -54225 -68373 -90085 13494
21865 13494 129005 118155 37426 -114459 -134535 -45731 -50102 -67660 51359 104606 157863
21854 157863 141625 77632 -13559 -38341 7289 35037 79587 141023 150273 125338 21950
21843 21950 19154 73235 9642 36861 84404 143624 138674 133242 53281 9128 50381 82832
21831 82832 60983 9571 27151 73990 61349 121721 121223 77382 154550 199168 97470 -32531
21819 -32531 -53338 19309 -86104 -106493 -165223 -212577 -151228 -55071 -7978 63613 67085 -31742
21807 -31742 -44965 -75295 -98638 -66678 36811 102280 100853 29692 91465 169402 127481 92908
21795 92908 146377 136634 50839 168 -66689 -95557 -71337 -81420 -129954 -67047 -51045 -125561
21783 -125561 -159887 -119788 -47448 3770 17705 94678 43587 27878 35272 20690 32231 27610
21771 27610 28776 -23391 -95598 -130593 -42161 5143 39606 40679 -3404 50107 96139 73727
21759 73727 40995 53036 59918 21933 12516 11479 6107 -19930 39087 -3218 -15514 102174
21747 102174 137656 176623 124697 -92789 -171603 -33085 108871 104082 168763 136527 103098
21736 103098 48941 31862 -12685 -62024 -145893 -203572 -136788 -75736 -27583 -42577 -11474
21725 -11474 2778 -61828 -61997 -167849 -191897 -109303 -33666 5098 75998 55051 -60295 -103535
21713 -103535 -109423 -99058 -85113 -37902 -63954 -75787 -18739 54356 79217 -34271 -70878
21702 -70878 -30174 -21699 -22730 -63139 -111899 -71481 -29394 31354 37306 42598 27169 -28358
21690 -28358 -15342 28370 86071 115154 79541 -4768 -89973 -493 46873 -7198 -59014 -108488
21678 -108488 -27019 20163 8414 86991 73152 -9386 -29594 53720 27605 -43249 -46778 40196
21666 40196 33309 14204 29683 -59802 -34785 -480 -10205 20923 100002 71000 -5203 38733
21654 38733 -10245 -46533 -60718 -72923 -24111 8188 -92406 -106921 -105735 472 215227
21643 215227 197654 168149 113220 100861 104720 20731 21775 60065 98302 103060 41427 1299
21631 1299 -40542 -19644 -44230 -129881 -161765 -95903 -97423 -77050 -85237 -37998 13434 5335
21619 5335 4687 -61842 -138948 -167090 -154358 -128931 -160828 -113191 -117504 -27438 18522 29892
21607 29892 51478 4583 10417 3665 -18379 -59000 -83125 -79869 -161133 -167701 -98918 -50954
21595 -50954 -39152 -10758 -7760 -11950 -41597 1600 -18265 -126977 -151748 -21783 42286 99198
21583 99198 52279 40231 75670 89639 138329 116910 18750 -94009 -133827 -93326 -164908
21572 -164908 -155487 -123344 -122211 -70990 -58171 -49966 -50100 162 79931 107003 36943 22654
21560 22654 4118 -41225 -95273 -80877 -7087 51431 63584 -35745 -73463 -87138 -29198 15127
21548 15127 26835 50252 76883 66218 -28735 -37048 21219 31753 87937 146025 51008 -44623
21536 -44623 -10286 -18970 -66662 -100390 -21134 83485 54074 19631 -29193 -29895 23874 100339
21524 100339 62292 -34618 -22894 142149 145425 53120 21465 45363 80068 65196 23573
21513 23573 34117 19774 -45438 -111999 -132577 -80858 -38045 -40747 -18009 18971 -10402 -91424
21501 -91424 -100734 -85403 -158963 -78271 -38745 -44550 -91391 -68250 -48321 -95365 -89342 -141959
21489 -141959 -141764 -73433 10420 136798 89570 -76996 -69626 -11248 32369 68797 142059 136952
21477 136952 104067 53881 28065 11030 -3316 -28784 -38666 161185 288964 207268 172103
21466 172103 129726 42707 -87831 -79071 8568 -13798 -17538 47093 19091 -55077 -21174 -52517
21454 -52517 -112213 -140562 -33216 39251 14053 -18871 -80151 -120743 -138012 -210967 -106728
21443 -106728 -32091 -32917 5829 64692 38434 -7679 -61477 -40448 -41882 -92298 -137025 -140126
21431 -140126 -5428 12696 -59279 -97135 -78026 -80752 -123585 -23411 1020 119775 150638
21420 150638 81469 -29043 -74665 -64300 -22732 -59214 -82517 -78590 -60632 -93265 -35319
21409 -35319 -76169 -70225 8587 44127 14069 9799 -19236 62676 2793 -23307 -8206 21112
21397 21112 7921 -6125 12111 25030 -21713 -113756 -137111 -106247 -88806 -24636 -77133 -143770
21385 -143770 -177268 -212443 -187836 -170318 -127866 -57627 -44064 -21390 -62967 -114057 -59855
21374 -59855 -42972 -67356 -52808 1673 19462 -53287 -195370 -193013 -160232 -201191 -219194 -179690
21362 -179690 -159178 -151352 -173727 -93537 82400 157366 116191 52853 -49646 -1627 22060
21351 22060 83522 165051 101954 57772 89329 82792 72483 77025 54890 79390 145306 132492
21339 132492 18156 -43315 2765 8152 30182 2380 -49985 -53956 14848 29719 74288 33127
21327 33127 -57052 -91104 -60378 -117865 -201623 -195310 -175185 -169724 -57631 -9593 27024 -59690
21315 -59690 -73420 -102643 -85735 -22478 -61176 -124836 -132899 -107316 -63888 -67511 -51518 -67270
21303 -67270 -74475 -32691 11718 24093 17076 47425 57532 42604 196637 189731 152321 131832
21291 131832 119158 88148 -4825 -53656 -91930 -57289 14917 30946 39185 76504 56176 103641
21279 103641 130244 64849 48807 10107 -21303 -102445 11164 35302 -74704 -18033 44617
21268 44617 46253 -12542 -25336 -74339 -85602 -70599 -79495 -117704 -89784 -103375 -45850 -64500
21256 -64500 -82456 -110495 -76901 12251 35029 32242 35086 -32660 -30970 -13389 51455 78832
21244 78832 70480 62957 55472 50115 93978 90031 41800 46450 21020 60133 130629 62130 26197
21231 26197 48675 46329 93420 156995 183038 120010 35696 54171 79700 53098 -1838 -12439
21219 -12439 62475 162792 152267 36658 -55845 -117512 -86085 -101189 -15872 53592 107373
21208 107373 8589 -58220 -55971 -50609 -59401 -17157 52744 38296 -49339 -96033 -16224 -57429
21196 -57429 -86924 -112098 -11192 6268 2289 -10359 19097 60552 63368 31445 65252 55580
21184 55580 -8888 -86475 -95699 -163206 -214864 -152408 -94736 -279037 -363607 -345547 -284472 -255429
21172 -255429 -97956 -20423 -64604 -95609 43095 152230 182507 131559 25503 -109198
21162 -109198 -100569 -146651 -151410 -93581 -154553 -72434 566 -23510 -60594 -21480 -52477 -62775
21150 -62775 58884 119916 107276 90636 12553 -12880 -39704 -47077 -14724 -47682 -85337 -117463
21138 -117463 -139423 -76151 -92213 -58602 -26973 37240 23048 4358 24397 -48203 -59670
21127 -59670 -39868 342 41798 89148 12761 -19570 24947 -16741 -35753 11511 2984 -37402
21115 -37402 -87700 -34340 32720 -58756 -176218 -206988 -147375 -172278 -113781 -32006 -44815
21104 -44815 8951 52459 -18478 19721 3640 -27833 40978 54637 69749 9452 -72450 -120410
21092 -120410 -120395 -72740 -65690 -19625 49931 -18698 -5680 -9678 32346 76812 37077 9378
21080 9378 -87046 -93626 -115010 -144228 -194998 -127109 -71179 -103329 -85053 -63252 -10528 18959
21068 18959 -9821 -2082 -18272 -3335 27339 39387 14403 -76152 -193837 -165677 -108490 -111230
21056 -111230 -17696 -68547 -7164 -25619 -69073 -41155 1236 43544 75682 94259 32163
21045 32163 -33330 -52143 -66227 -53016 -46986 -18136 -62401 -15086 34434 -9038 -82247 -68717
21033 -68717 12200 40347 52209 83344 9391 -25632 49826 84706 11978 -44325 71624
21022 71624 117988 24987 29780 21128 70816 44336 25859 76110 48486 -17872 -11671 -20951
21010 -20951 -61365 -58329 -47512 -62367 -31649 -30609 -35191 -89600 -20317 20797 13562 -9279
20998 -9279 -43379 -75420 -47020 35529 46004 57624 27223 27435 13778 9829 13048 34281 -33059
20985 -33059 19062 49882 27644 -28606 -72752 -99319 -28252 -13354 -1350 48026 80562 52078
20973 52078 38792 -35578 -12000 31143 69464 15689 -12125 -62642 -58748 -25074 -71698 -85453
20961 -85453 -38441 -4118 -9199 -77652 22236 -3216 -38675 -96101 -27485 6092 -11795 -123993
20949 -123993 -267933 -230056 -155599 -106340 -93732 -96500 -86070 -61088 -106472 -185133 -132073
20938 -132073 -39585 5433 46402 21273 -30215 -72350 -71429 -29102 -30678 22500 67 9493
20926 9493 40929 -11888 -18789 -36557 -4230 -9481 22569 23505 77676 58577 14590 10816 -28195
20913 -28195 -51605 -14650 -57731 -22612 72369 130294 87492 8314 -67723 -117719 -155680 -224473
20901 -224473 -214879 -206468 -157297 -154279 -118914 -156613 -174379 -171124 -158685 -203529 -246834 -238104
20889 -238104 -185175 -99857 -101251 -123349 -140033 -120678 -47653 25282 37833 27803 87851 57680
20877 57680 -31398 -104902 -104197 -5819 85565 98086 46788 -51838 -124716 -176836 -92073 38968
20865 38968 73341 95991 78508 16620 31250 -31091 -114023 -87317 -75846 44786 129598
20854 129598 89437 4156 52752 60796 97220 42892 135615 102292 19175 -74392 -87057 -10929
20842 -10929 -31809 -36598 -125166 -167066 -163219 -58344 -50940 -101 1089 -32825 -25907 -28825 62856
20829 62856 44411 -3082 -12344 7740 -89473 -111709 96255 150987 121098 28486 -30511 -40187
20817 -40187 -11758 -19818 -66409 -92511 -41552 52364 95510 32746 -23869 -13046 87667 36835
20805 36835 -40931 39540 128474 123840 -5092 25603 49212 56698 67915 27287 -1270 -30341
20793 -30341 8942 -22092 3801 45979 -30108 -99055 -89799 -72698 -46515 -106634 -116406 -74541
20781 -74541 -66530 -24480 -11619 -26983 27470 100377 67891 18987 -68199 -112309 -77472 -126637
20769 -126637 -160966 -130623 -91262 -85216 -120601 -94065 -3486 57540 88524 37821 79105 134791
20757 134791 144931 151056 92917 85649 144282 139010 85948 33551 2797 19128 -46463 -80682
20745 -80682 -105831 -96781 -74786 -54977 -119060 -139126 -40534 1679 37074 -1198 -47571 -175342
20733 -175342 -217356 -100971 -45487 -29732 -37114 10327 71577 85541 130981 64306 40008
20722 40008 74049 103714 88106 75637 77138 32733 -38679 -36242 -25087 -76955 -135678 -132619
20710 -132619 -86548 -70413 -116700 -166646 -72074 -65952 -99568 -127607 -171508 -70907 46606
20699 46606 58278 -32377 -24332 -44661 -22535 -47111 -69022 -74123 -995 -37743 -77803 -38842
20687 -38842 -68254 -118226 -143670 -59845 -71304 -36315 63304 143128 173049 149572 143215 126826
20675 126826 607 -52365 44790 19620 96831 65318 -20517 -48735 -84657 -72634 -78352
20664 -78352 -48978 -18201 -24399 -55508 -119986 -150329 -165066 -144143 -74491 7959 39047 32435
20652 32435 -8868 -19561 -23124 -61782 44884 37308 -39882 -38493 -27065 -45009 -2213 104144
20640 104144 79897 22500 -11229 -82134 -147446 -136411 -162635 -169320 -48804 -27404 -67779
20629 -67779 -38824 22623 18384 31510 15074 -7502 -78015 -103772 -169404 -211475 -184268 -151921
20617 -151921 -123899 -53272 -35018 -97010 -55070 -62849 -39451 9706 40235 100541 77324 54480
20605 54480 22266 77376 149054 173498 99158 -8456 65626 69805 55493 50662 54229 126714
20593 126714 157960 144880 162136 151266 163460 124912 60152 27706 45296 194640 259897
20582 259897 104903 22398 34217 7912 -3885 4045 28826 80357 34221 48640 125263
20571 125263 109336 96957 81617 128115 149924 135172 21600 19193 33694 11680 -16466
20560 -16466 64370 158794 159963 92643 -15965 3555 -10925 -59829 -47148 -57359 -72862 28027
20548 28027 87841 109691 168095 87096 -32664 57012 81740 65911 233 -29674 594
20537 594 88565 57054 17179 16991 29415 70282 121188 160740 244451 228181 159034 154411 100106
20524 100106 81777 65234 31712 12940 51966 36308 78815 45238 23489 77834 3381
20513 3381 -59059 -63318 -62723 -98932 -91958 -127236 -166093 -101859 -69873 1750 82625 100527 155025
20500 155025 124534 -25748 -121873 -138139 -81967 -100002 -161907 -94285 -2040 -27003 -9526
20489 -9526 72764 45070 76927 133764 80015 -29730 3040 51613 43171 -58363 -102463 -91008
20477 -91008 -26162 -30145 -51646 22357 46537 36031 56681 115380 144459 64750 22496 8280
20465 8280 8833 47861 94162 41658 13360 83564 79653 58374 82185 21846 52208 24567
20453 24567 12718 48141 138424 97356 91230 140126 136819 174163 235447 260649 180168 136216
20441 136216 49735 87968 81731 175073 168672 133728 36003 -27801 -133821 -126163 -74118 -33301
20429 -33301 20448 -28696 -43489 6460 116178 189046 197737 183098 86976 52355 63379 35282
20417 35282 36722 75280 59945 8547 5806 115239 57094 -28685 -122829 -110109 -68770 -31652
20405 -31652 72423 56794 -1066 -50589 -48961 48814 103200 73741 10733 -28996 43899 -7039
20393 -7039 -1054 36067 -54090 -7691 22074 -61002 -76931 -19867 -49735 -22882 25453 54914
20381 54914 18361 -40178 -135039 -150053 -83799 -75863 -68189 -121409 -95147 -12503 -16556 -134849
20369 -134849 -94590 -37421 -81217 -58435 -64507 -59537 -86511 -44650 -34900 -32621 42308 27850
20357 27850 3331 -13075 -29868 -2622 25143 24121 -12917 -71711 -33163 -13812 -18077 -20424
20345 -20424 -42746 -14656 -17297 -55262 -29601 -46970 -55083 -144487 -233569 -180780 -109723 -68512
20333 -68512 -152285 -231724 -193635 -65107 -33409 -67271 -117072 -90901 -28591 31703 29176 -51691
20321 -51691 -64260 -68219 -89926 -79704 -2324 -73905 -144559 -128939 -88354 -85729 -85998 -75306
20309 -75306 -11171 -41637 -14905 52086 43129 7686 -40541 -7655 -30095 15927 75738 52024
20297 52024 26844 29468 43218 4161 -65859 3982 68102 66860 -28400 20730 26073 34204
20285 34204 70227 27078 -13723 -64522 26832 142113 274942 334883 337880 238886 105784
20274 105784 72451 106119 188547 234922 325869 301425 230655 191769 219558 273527 331053
20263 331053 315744 327776 345441 369439 395811 393802 449508 434006 395595 382965 403223 319882
20251 319882 352960 249552 213836 187812 175798 209796 213167 319290 256253 149482 114888
20240 114888 135241 119397 49154 -6412 46344 143204 160591 114635 234874 360859 315659
20229 315659 243882 228564 202875 179521 232477 357200 324201 344366 341589 296757 254779
20218 254779 261655 302374 418104 524800 487242 453887 460333 499219 483434 368801 361825
20207 361825 382427 319183 302063 429548 473683 436521 431738 313665 276084 296829 326841
20196 326841 264961 221418 153708 83746 66005 29449 -16720 -43321 -7540 47029 132150
20185 132150 132728 93431 29742 45249 54292 27103 28660 61670 117506 128527 195056 168870
20173 168870 150238 85201 66748 27172 59196 121486 63862 60157 9678 -26602 -68661 -43457
20161 -43457 -19650 -8362 -26664 -16003 3655 -16917 -78874 -113452 -87874 -95147 -57525 -30627
20149 -30627 -99132 -86202 -42057 -4815 -611 18749 6814 47180 45030 -35081 -15681 -13713
20137 -13713 -14238 97800 65016 37178 60346 75789 -6176 -127286 -136795 -117987 -54699 8737
20125 8737 100184 41629 53775 86903 67474 18073 15478 41513 114250 150307 106124 120143
20113 120143 97950 28272 20572 9289 -7752 41341 44603 -17245 8416 60464 93292 3241
20101 3241 29678 86556 16256 50828 109658 173449 172044 134352 111806 122840 118590 55230
20089 55230 12981 26274 -4823 -21057 -18943 -85141 -105556 -142394 -81379 -38586 -16260 -7660
20077 -7660 33822 75502 53799 -25448 13013 81956 85056 66447 17155 -37142 30362 53559
20065 53559 29549 17377 -7167 -38061 -39803 36862 30474 -16028 -44945 -79526 -70944 81201
20053 81201 65323 43743 -8906 -71614 -128269 -197350 -95249 -76373 -43346 -60139 -106808
20042 -106808 -96538 -29522 67290 91421 69950 -92 -80701 -11572 45765 19956 43305
20031 43305 44036 94202 80754 40077 40068 86891 118786 40255 -35160 -115221 -125905 -132632 -129416
20018 -129416 -104957 -18385 42832 -24408 -19946 63958 86042 128825 107788 94297 9827 -22320
20006 -22320 47021 81265 108408 126547 83160 40354 -52547 -32401 -21035 2559 26990 57856
19994 57856 53573 -19913 51634 99126 160657 120447 41833 76813 56162 51066 119076 182834
19982 182834 128710 140028 93847 66380 67410 -43901 -100759 -86131 -64614 -5589 53301
19971 53301 71633 130674 143718 169706 236184 282330 269600 268832 254852 295463 314461 272350
19959 272350 208662 147828 63115 -10970 88724 205003 213180 167361 147717 154194 204536 200342
19947 200342 182995 122210 103511 141411 215406 264088 199137 215062 256060 210276 121329
19936 121329 28788 -41691 325 52212 26117 -3845 53751 55005 61230 38346 118627 204565
19924 204565 124317 59066 17548 94991 102798 66269 165205 236050 177613 79150 77056 96342
19912 96342 50929 26403 11263 48173 74475 71180 65371 27673 -48016 -102368 -52498 -134236
19900 -134236 -121302 -34593 -3000 15070 22934 -66227 -92265 14158 69996 52769 -11767
19889 -11767 -30776 -2386 -48701 -35941 -36825 -86879 -117420 -60771 -24075 -7602 -17107 -37569
19877 -37569 -143949 -125687 -98634 -42985 -370 -3206 -59465 96942 125314 73976 -38240
19866 -38240 -51400 51037 -51110 -57008 28982 56716 4518 35300 141663 188900 209477
19855 209477 123614 89846 79759 69788 30717 -38912 28324 95750 69774 91253 189474 186997
19843 186997 77428 115576 230830 386350 555489 596686 546085 648044 786338 667405
19833 667405 530333 485682 402039 433941 580011 608423 523740 487791 433621 391733 487135
19822 487135 558305 610234 494031 399669 423370 466449 524374 469055 477956 479581 385680 384638
19810 384638 449455 452377 431553 382170 356791 420686 520381 598742 649383 656346 582194 576099
19798 576099 583463 515387 553957 588147 607122 602782 527117 575326 640346 645153 567451 608806
19786 608806 660112 703577 704472 751838 774278 723397 791796 808899 888025 946852 974803 1126877
19774 1126877 1341891 1658897 1898193 2150863 2395202 2739074 3035828 3032769 2751562 2479288
19764 2479288 2359490 2367341 2425215 2529550 2642571 2521642 2251757 2082107 1986300 1916390
19754 1916390 1841862 1885866 2110418 2364882 2588184 2847712 3037188 3323110 3450431 3510308
19744 3510308 3527035 3495406 3567699 3804904 4169333 4569157 4945235 5412367 6015896 6697653
19734 6697653 7465130 8294619 9154066 10109226 11461582 12932466 14530655 16402862 18607473
19725 18607473 21252301 24392401 28246511 32992745 39162826 47604339 60021711 79712134
19717 79712134 111456119 159767945 220331698 278023197 326801249 380724212 438698764
19710 438698764 456599248 388824231 283320275 204026153 155907621 126260154 106261354
19703 106261354 91425239 80034548 71213506 64433478 58999327 54421050 50685517 47337408
19695 47337408 44226151 41524706 39155682 37139164 35388570 33768964 32161508 30783943
19687 30783943 29632499 28519642 27393767 26311143 25367002 24401982 23146184 21954441
19679 21954441 21010090 20228283 19604761 19001234 18456002 17814354 17122855 16519469 15974741
19670 15974741 15459110 15050737 14541028 14043752 13683425 13397922 13122116 12799400 12577587
19661 12577587 12454574 12281526 11863587 11494894 11407874 11339822 11287923 11165818 11046269 10881469
19651 10881469 10502861 10312754 10437662 10589509 10771923 10989485 11149103 11114964 10524358
19642 10524358 9543060 8600411 7823513 7230160 6807413 6518745 6275446 5987995 5722740
19633 5722740 5461307 5258001 5086121 4963151 4875943 4725951 4664713 4551990 4429535 4390759
19623 4390759 4341655 4185171 4024330 3866412 3745941 3665236 3511590 3400911 3292903 3189509
19613 3189509 3060497 3027845 2985225 2957685 2850990 2767954 2749686 2738609 2618183 2521128 2488588
19602 2488588 2476287 2394717 2296370 2209034 2150720 2137426 2182876 2130890 2041051 2022976 2039605
19591 2039605 2007872 1996464 2004181 2083093 2041148 2047228 2094859 2028414 1877456 1643881 1556224
19580 1556224 1499132 1500718 1388799 1282503 1287487 1269329 1248131 1197761 1045127 892160 862240
19569 862240 857764 805858 802348 822580 779065 826805 842967 816699 857100 870672 757133 727695
19557 727695 644250 615372 612320 625440 522196 471577 480030 445881 407767 457104 515640 559354
19545 559354 572381 665405 651741 660756 681280 712595 756110 727295 687602 641165 543560 457706
19533 457706 507127 499125 383629 418805 493168 480988 445294 492824 491962 513264 442156 408736
19521 408736 458428 438634 524981 532519 521952 530886 494749 476051 402796 391115 390486 336348
19509 336348 292210 426521 466427 388446 333583 376897 399120 322712 242008 216734 191652
19498 191652 195577 225574 324302 473559 362633 339688 301408 237882 213712 162813 137009
19487 137009 153801 203209 247453 303143 348252 361623 310724 313699 421474 454664 459759 415079
19475 415079 390733 435173 427387 409620 341444 278002 222199 186849 234904 298684 347261 337871
19463 337871 335584 297756 336894 294188 255978 326052 366349 360082 410320 380337 351694 291709
19451 291709 307218 254955 316305 301751 303838 366139 371242 342060 332739 234459 280614 285700
19439 285700 257710 216883 263355 335855 366413 299899 216923 221294 212173 219696 187230 170747
19427 170747 70663 68415 90968 104460 169538 180818 224083 281087 289601 234474 298054 353546
19415 353546 214032 152718 143497 111145 84315 72882 27731 44364 87844 213691 277635
19404 277635 238272 263116 222971 176306 105329 78626 118873 155341 160409 173616 85112 26926
19392 26926 39544 32207 22491 53693 -39399 -89968 54021 24996 35747 149732 167669 158331
19380 158331 142793 110944 155493 243967 182178 131410 93397 46795 127612 145253 104759
19369 104759 115919 107791 193811 154834 119756 113440 156499 191114 259811 254317 222479 227377
19357 227377 122816 83218 129490 148998 126033 148336 99095 106994 150781 217296 175655
19346 175655 141206 61949 35025 65358 57371 81848 42021 44338 23227 3641 47320 53250
19334 53250 60954 124088 109053 101723 155012 169515 188306 141316 100638 57937 30022 53826
19322 53826 140156 84904 8878 25200 32874 107688 133520 134062 47482 -14223 -4599 -4982 34465
19309 34465 109115 167947 216967 260403 149705 87331 80204 179244 155380 57362 4421 -53057
19297 -53057 -5956 9410 98437 155048 183806 171401 140417 140815 82507 30010 37338 61959
19285 61959 90629 128124 204265 226098 147886 164782 125592 177141 78967 92389 160810 139017
19273 139017 197621 247916 173776 198467 151011 135794 242240 296039 256652 288101 337863
19262 337863 344953 249283 104377 23246 52109 147629 100490 26039 50058 65165 103376
19251 103376 180069 120602 168000 187607 191826 170956 184528 118314 69682 65651 110728 162834
19239 162834 123245 48838 63984 47659 73514 85187 23937 -27924 -21703 101933 192669
19228 192669 192413 119659 80765 93948 99214 121330 196618 309793 352941 403620 365128 262405
19216 262405 233004 312843 383797 425772 471416 483969 508053 571360 495691 508165 623151
19205 623151 671047 737395 605574 531756 537398 562196 646966 683702 638849 528239 407904
19194 407904 372825 407707 357898 342643 425770 385826 321997 238783 237758 237292 272194 231937
19182 231937 232651 152629 185342 119775 133068 209565 142991 53931 21896 -65731 52241 147635
19170 147635 163478 171819 250315 222551 316350 385376 396850 419755 358422 379983 460847 487998
19158 487998 606185 597815 565539 478818 477858 472764 504151 435069 304473 329498 400507 454110
19146 454110 460181 404274 324036 285300 262048 254513 348524 464495 467345 403672 393835 407467
19134 407467 322554 184174 49450 -121601 -118118 -27647 -17612 -23906 -28944 14455 61594
19123 61594 64988 33843 61372 139116 157780 12538 12169 142952 157630 143957 81406 55126
19111 55126 4938 42328 166018 188217 158391 116517 65014 25344 78467 -928 -56959
19100 -56959 -6667 13146 -29688 -41781 38438 5941 55647 82635 42001 78466 29975 28532
19088 28532 97658 120317 93262 19239 -19195 27824 72905 98475 168072 212891 133580 26264
19076 26264 18346 54727 8059 -35364 -55319 -24773 -60056 20035 21966 -8819 32916 57237
19064 57237 51586 6167 -1177 -24976 -8381 61968 127395 52519 -29586 10148 138039 219626
19052 219626 155130 29476 36075 128897 183742 181398 109590 115568 72098 11859 63442 101914
19040 101914 92057 90553 126731 192415 103804 58011 53270 102612 72116 32403 -16100 -12519
19028 -12519 18971 -13285 -6186 11326 72157 43997 30890 39178 -10571 -73813 -10878 3719
19016 3719 -1042 -68746 -38735 -706 -3286 33606 52711 34602 48580 100895 100441 157825 123613
19003 123613 82003 121295 111996 38649 108669 186318 166089 173217 167462 54310 -57532 -25911
18991 -25911 47506 59236 -2228 -1898 37790 59515 85971 117106 161568 179771 188987 120967
18979 120967 26608 9756 -27505 -42283 2994 60051 26888 -8432 85000 42752 12463
18968 12463 -48830 -1322 6216 -85628 -131818 -130610 -81789 -108917 -126443 -57931 -45420 -60890
18956 -60890 -89547 -91704 -126646 -55454 49442 121223 212847 144711 91356 147368 173173 164271
18944 164271 31750 -38348 56719 114899 125182 149587 85716 37814 29148 -13012 45166
18933 45166 76688 114541 40053 16967 48913 -30698 -10348 24320 51931 82464 116883 74855
18921 74855 -36632 -9593 3813 22735 29998 38511 54616 35476 51806 -38875 -67631 -53122
18909 -53122 -98237 -140570 -111419 -42760 40860 147567 191880 148890 50405 -22651 -13675 -23320
18897 -23320 -16831 41991 77215 62294 152469 140344 45775 7557 26225 104425 101951 70496
18885 70496 16648 -21008 -12815 66225 83883 -59426 -104466 -30614 51862 52594 -25207 -47217
18873 -47217 56061 179169 139810 49250 -2239 -12061 39063 146189 176842 213364 225956
18862 225956 197865 59265 31875 27986 -19625 -68313 -21361 13473 54925 32141 21635
18851 21635 78667 50901 34744 5030 -325 -36252 5638 122923 150852 100583 82636 118935
18839 118935 106457 43881 48027 58447 69278 80756 55559 39989 81707 130130 120302 55161
18827 55161 133 -43644 19555 61997 107995 120681 85897 68160 56469 63301 44696 -56904
18815 -56904 35119 117244 73577 -10143 -81158 -50957 13714 -14137 36673 17524 -31415 -57721
18803 -57721 -30152 6814 -41328 -62666 -69415 18045 87951 160765 174499 100281 26252 -25049
18791 -25049 13263 41583 -30979 -44789 31056 108005 54819 -35764 41779 104453 139370 135724
18779 135724 152985 163550 179323 111850 70138 56171 50848 100271 226080 255879 293863
18768 293863 353672 384819 377134 315134 217640 106876 71375 101330 57009 43840 52214 54425
18756 54425 2473 -2668 77228 121545 48674 -17695 -1120 -21820 -15871 34079 30675 36119
18744 36119 115579 146220 76319 -12129 -52154 -19972 -6591 -8704 -15990 -68354 -118486 -62676
18732 -62676 -47786 59525 149539 111758 49346 29285 26156 17203 14979 12485 81163 8390
18720 8390 -85132 -45089 -2836 -27966 24853 -8045 -14155 -6901 4166 5853 -1006 -27542 -30482
18707 -30482 50607 52775 592 -6541 75542 183029 210601 206843 162803 13638 -134688 -156186
18695 -156186 -167888 -135767 7239 124992 101741 60052 104822 21244 3071 75465 86964
18684 86964 54284 60310 1020 -18014 -61921 -12578 26513 -37820 -31807 -10376 19106 52128
18672 52128 5193 -13351 -84099 -89835 -80708 -72553 -34681 40707 16615 20245 39093 27992
18660 27992 -6563 -25190 -63053 -29863 8947 28726 44625 -43316 -46618 -87894 -96481 -88191
18648 -88191 -27367 -25566 -103304 -88953 -51801 26212 20182 25651 61506 63709 28846 -24755
18636 -24755 44396 119025 40536 11088 -1669 -9890 -17010 -35533 63118 57277 -26702 -82533
18624 -82533 -77646 -47765 -95979 8732 -24299 -43168 -102935 -169085 -148999 -68579 -28499 -31712
18612 -31712 -36964 -20335 10693 50856 -7033 -106486 -145405 -93635 -25208 -12481 -37795 -25369
18600 -25369 11835 11724 -10042 -124954 -220110 -106950 -20729 -46071 -16824 -46220 -57114 -14002
18588 -14002 48110 -11320 -93608 -116283 -142084 -77646 -24377 17820 -35529 -72468 -64647 -43960
18576 -43960 55126 88573 97312 102014 27919 45227 -3592 11196 57863 72129 30469 72419
18564 72419 -48736 -57473 59248 41831 66751 119784 94522 60197 78104 117237 85991
18553 85991 74822 86416 44812 2179 22864 -1174 52181 139883 118396 27256 -51820 -60374
18541 -60374 -17643 57028 39734 -5010 -46398 29497 122995 146910 114968 59067 32871 23704
18529 23704 -4546 58250 10546 29767 -14151 -47774 -71154 -118079 -85116 5995 -18718 -27914
18517 -27914 -81579 -131941 -67534 -3182 -57614 -32601 18244 92950 25266 -4222 -72268 -125105
18505 -125105 -94339 -10223 -38795 -6003 68303 179733 167451 58728 13071 57881 72281
18494 72281 13208 29021 4285 -68292 -129792 -75673 52091 79979 -30025 -185063 -126680
18483 -126680 -8874 -37688 -2548 19123 25528 -30083 -52323 -56499 -50830 -163930 -207382 -178679
18471 -178679 -85541 -21607 -14128 12622 -48361 -114150 -131039 -73099 -68476 -41203 -46481 -45515
18459 -45515 -29053 61405 148600 148591 73359 11936 -31640 -18137 -70121 -29083 7604 -42210
18447 -42210 -20705 -79388 -175947 -184472 -208260 -127946 -123242 -112999 -65640 -55904 -52875 -42772
18435 -42772 12555 24502 4571 29754 89464 96014 67965 69309 52448 22267 -21369 -68286
18423 -68286 -40236 -21733 -68277 -5237 -8049 -13087 -29131 55041 57723 -50020 -78092 -27623
18411 -27623 -37129 -49581 1494 -27591 -74248 -103511 -72705 -10396 -27090 -129278 -121382 -37644
18399 -37644 54126 40819 -16630 -58781 -72502 -29737 -43300 -56233 -114346 -125307 -114364 -40658
18387 -40658 -72455 -113177 -49672 -34781 -26605 10293 11646 -1801 41546 3035 -14423 -19407
18375 -19407 -20505 -39613 30050 43446 23999 48738 56554 96431 120419 112677 87423 34005
18363 34005 -30487 13173 31264 32144 61888 77297 56578 51902 12539 42769 -17677 -39760
18351 -39760 -19783 -114896 -126136 -86507 -62599 17277 51012 36581 69311 43060 11409 79978
18339 79978 190678 101411 -61420 -31205 -30632 -26710 -9877 11987 -11994 4566 55004 137792
18327 137792 81896 20750 2959 -3579 919 92297 47689 -69166 -65318 44372 92040 107654
18315 107654 114716 97885 101899 127516 88872 72370 55753 4513 21028 3392 41368 6606
18303 6606 12970 9597 72600 176715 148085 81240 72599 164667 180368 121741 38147 -28885
18291 -28885 -53762 -12963 11956 16233 111655 79466 33190 -2364 -26387 -9988 526 18760
18279 18760 11985 -17589 11373 -39174 -37648 -61165 -75417 -88579 -47699 -86733 -65083 -18805
18267 -18805 -43985 -166146 -220135 -123167 -65857 -63954 -29833 -80998 -72973 -55408 12920 20705
18255 20705 -57954 -64136 -94192 -101531 -31752 -24289 -93639 -122567 -147125 -220217 -146324 -110625
18243 -110625 -76169 -104597 -66894 -9135 -12926 22147 -18730 -39149 -33020 117406 264487
18232 264487 206115 52780 -55125 -3055 10574 -46654 -94411 10679 43008 13094 -23185
18221 -23185 3329 53474 140376 186648 152307 81877 105233 61085 36426 -12077 -62810 -29609
18209 -29609 5812 -28066 -5890 42191 62203 145870 202005 135820 78776 101354 71729 79159
18197 79159 67154 90051 54297 79240 86544 55159 12736 62298 101055 158302 150835 100168
18185 100168 83227 93151 109250 103881 116824 113763 138849 107869 83955 7588 12210 6235
18173 6235 7314 13867 74917 123095 215875 151257 45111 15237 10986 11907 63266 96768 124579
18160 124579 232654 278358 245369 248852 319794 301048 234763 198597 169295 139316 129308
18149 129308 206946 282148 281146 240735 206159 287563 292562 258598 313719 310325 394654 389462
18137 389462 332140 382601 436613 479189 617646 732668 833735 914786 937805 1073053 1321805
18126 1321805 1575044 1797228 2093345 2447036 2865025 3358326 4069609 5024089 6291114
18117 6291114 8210459 11400157 16664781 25168666 36811284 48497769 57286436 66737381
18109 66737381 79203911 87875379 76579781 53174425 36854375 27528151 21898789
18102 21898789 17992337 15114172 12995070 11299452 9975296 8976440 8230921 7716653
18094 7716653 7226913 6750200 6371280 6077820 5858574 5563270 5287754 5038373 4858660
18085 4858660 4721521 4594361 4342695 4035760 3781034 3659658 3559654 3366871 3166564
18076 3166564 3035790 2972585 2838489 2698393 2672719 2669898 2652626 2532920 2461224 2459827 2326524
18065 2326524 2134770 2080018 2081557 2007977 1910216 1874196 1813726 1901666 1924277 1875999 1760740
18054 1760740 1710637 1643152 1566295 1411040 1439881 1486236 1445393 1354612 1250591 1215862 1212503
18043 1212503 1225206 1203925 1148056 1064080 1039993 1033773 941454 913188 924517 957312 954996 888500
18031 888500 857679 903564 870365 815539 756235 719312 744106 672280 565618 647233 710734
18020 710734 689641 642914 641562 578756 523740 501237 477090 498292 592101 581732 470315
18009 470315 382904 294883 315174 371032 380363 381074 420602 379084 345119 365684 368455 377656
17997 377656 481713 506975 487354 519490 535186 548936 528411 513660 549987 524452 480021
17986 480021 544350 549231 453437 407690 463178 411118 324497 256441 208092 171729 203160 235744
17974 235744 187871 175184 114855 164842 230721 91761 115304 202900 248518 173998 110367
17963 110367 154371 129279 101590 150675 115569 76372 135434 95409 188198 238454 268685
17952 268685 320004 304908 279167 242373 263104 252202 198986 213630 288130 303441 297504 262690
17940 262690 237936 180564 240269 259366 188799 210837 256016 285091 264607 141189 144150
17929 144150 224903 264272 249911 245792 225794 144560 122585 82718 -3007 40858 83035 -72759
17917 -72759 -87933 70219 168779 245628 232717 135198 111214 92938 33716 20693 -23504
17906 -23504 -26869 55331 100057 -199 52438 95343 191488 171343 145484 171581 118158 79359
17894 79359 50093 -25152 -89459 19537 132512 173598 183205 177911 130075 180719 167129 72290
17882 72290 30329 7087 -74912 -57459 -4911 29757 185331 323299 344670 198755 136503
17871 136503 147440 161126 124634 226358 290620 244403 111387 127025 103222 133048 239777
17860 239777 227480 154308 124267 38176 -2207 -47411 -55934 -33416 -34455 -31640 -47889 21875
17848 21875 78131 78824 113645 136267 104029 49062 64752 182298 172748 171470 229167 202000
17836 202000 143196 47754 52188 21329 -18840 -58509 -41429 -31099 20793 76506 72717 110315
17824 110315 181706 166209 144178 97455 120502 116460 59667 57341 -59230 -55499 16216 58730
17812 58730 -1742 47022 32479 42070 58423 104681 148743 61817 -36101 -5181 23825 48407
17800 48407 -18924 -69533 -73504 -151385 -95146 -40757 -24135 -31744 22269 69861 -24689 -109913
17788 -109913 -23950 19652 -130911 -206471 -168641 -84782 54473 50666 -36292 -52716 -482
17777 -482 17683 -649 71526 131019 101080 130912 89348 28516 15774 22926 63859 5736
17765 5736 50043 122709 36463 -45195 -80449 -82654 -21220 78052 131752 88582 186214 204459
17753 204459 109067 27682 -102620 -111987 372 -11195 -25321 -44419 -8310 -49518 44311
17742 44311 69302 -23699 -108818 -108778 -55522 -14254 35643 65506 32919 56012 100315 156642
17730 156642 102933 81465 83898 30256 -15709 -33121 -14292 -115371 -165074 -172380 -132342 -148369
17718 -148369 -87033 -52362 -148230 -145323 -151222 -126501 -51563 -24916 -58567 -140472 -139808 -203213
17706 -203213 -207959 -86554 -43108 -38953 39783 56267 23367 118910 83861 66840 64609 64510
17694 64510 1532 -65368 -102125 -123991 -73931 -64221 -23679 35560 115271 54766 26926 45412
17682 45412 26890 51606 88139 144591 132058 170847 104252 -38224 -41614 23498 61365 52771
17670 52771 14898 -79924 -70545 10090 95844 113906 48353 -36529 -9481 81685 118944 23958
17658 23958 -37247 36213 98601 638 -70040 -63985 21674 86001 -12296 -69333 -63580 -97248
17646 -97248 -38023 -125883 -88299 -47063 -34598 -81705 -50402 -34973 8028 54050 60894 44489
17634 44489 4791 -68273 -74990 -89615 -164755 -134628 -76987 -39326 39197 48351 33035 42725
17622 42725 -18077 -88372 -85978 -101860 -83525 42055 118239 98360 17758 -11492 -27274 5131
17610 5131 85346 103642 -51551 -101953 -75737 -46093 52928 82175 134624 164422 58819
17599 58819 45965 -13132 -21784 -25182 -41245 -79094 -64983 -2192 22214 -36880 -46371 -19434
17587 -19434 6617 -2489 -34743 -101908 -52101 75481 103825 12028 -56855 -71575 -103786 -98655
17575 -98655 -103280 -19277 37119 -16917 -89514 -99300 -64929 -13911 28118 -31757 -88238 -108952
17563 -108952 -91483 -15511 -47506 -125546 -115465 -72263 -33531 -16671 -16108 -33233 10539 26739
17551 26739 98251 45386 36154 81802 87934 141502 97141 76728 47640 24760 76595 115290
17539 115290 128901 109587 12669 -34799 -13555 -56895 -24655 -72378 -65452 -37885 -66580 -97164
17527 -97164 -43207 54396 80481 112616 113620 55084 86691 87361 70940 -7048 52784 59562
17515 59562 3278 4833 -70659 -21577 17373 -22314 -30735 -58701 -66326 -105847 -57851 -44402
17503 -44402 22680 136525 156327 66680 -14457 4610 -15807 50088 102408 137336 122406
17492 122406 66983 51205 183890 158759 -1153 -138981 -133721 -7220 95703 35716 11012
17481 11012 5295 24262 71339 10325 -49656 -29802 -79965 -25524 -24715 -46245 -5258 58905
17469 58905 99172 116535 136695 89618 87049 74963 50331 -16741 -83805 -86910 -48716 -64322
17457 -64322 -67994 -126169 -74810 -137294 -115932 -3687 -15100 -654 70124 60486 142856 269668
17445 269668 402858 496736 521175 534767 445183 359194 265096 42181 -47736 -49014 -51008
17434 -51008 -36680 -439 -72299 -47328 -105303 -151789 -103947 -99755 -22769 -35239 -54010 -84950
17422 -84950 -44912 -19385 -12817 6843 -23583 4572 -6848 -36598 -70920 -112547 -48644 61109
17410 61109 49921 38558 41809 -57441 -96864 -46980 126704 102027 53594 102298 82659 32711
17398 32711 -11851 33819 84869 28113 61161 51849 -85549 -136947 -92199 -4700 -17634 -65885
17386 -65885 -127720 -141477 -133703 -114315 -47916 -37228 -80682 -65269 -9596 -60651 -72588 -6176
17374 -6176 -22046 16984 52811 42001 -40727 52234 91654 12148 4940 57222 50462 27709
17362 27709 24343 7490 15269 8018 81486 133148 166093 137540 77196 45956 49904 -40288
17350 -40288 -66322 44365 120773 47373 -29038 -39638 -68971 -865 -44197 -31171 43024
17339 43024 16284 -125527 -191016 -148780 -38232 -21583 -105975 -149800 -119226 -131349 -103530
17328 -103530 -144708 -182452 -102772 -69176 -17435 -30949 -1510 66729 76491 -9543 14036 45578
17316 45578 107095 161251 59585 -21779 3925 26190 33626 54339 47649 58607 34527 -24109
17304 -24109 -52659 -3454 111015 106065 45056 -14875 -81724 -88638 -119511 -78467 -84750 -65110
17292 -65110 -1667 37412 -43304 -164643 -168040 -187025 -189119 -192373 -131313 -163644 -147789 -200091
17280 -200091 -132147 -71390 -74291 -19400 34887 30236 -24005 -62875 -83104 -80121 -61268 -87748
17268 -87748 -162270 -178020 -220287 -138169 -170825 -107337 6678 -46573 -69183 1845 -524 19762
17256 19762 -25498 -32793 -40697 -27002 -72986 -16504 -21252 -57210 -112972 -119662 -1762 29385
17244 29385 8897 -44068 -46289 -22443 34141 72781 22457 8057 28786 23512 18460 111771
17232 111771 142770 136685 75725 55830 -10076 -27408 -26387 25365 -29008 -43302 -34815 -37615
17220 -37615 -30915 -68753 -102273 -86504 -57747 -54833 -51670 -73757 -76647 -81039 -29250 39134 47525
17207 47525 22787 70778 101828 74387 79907 77934 -41861 -29658 -22883 -65824 -24107 95603
17195 95603 69632 9466 -83500 -27639 -23333 -19384 61652 125597 82246 29566 19200 105721
17183 105721 104813 73865 489 20892 -53743 -48263 -24046 -69660 -91323 -25194 38544 -5699
17171 -5699 -112102 -168133 -101157 16688 96289 56541 -4365 20196 80037 119203 75019
17160 75019 -48941 -30428 134073 117059 89239 25758 -86172 -136625 -79532 5868 -46180
17149 -46180 -120115 -130705 -145671 -99909 -129477 -133122 -80977 6482 -26096 3395 -32280 -150842
17137 -150842 -210432 -159380 -39261 -36344 -57028 -30290 14804 -10717 -50973 -98029 -29294
17126 -29294 -23823 -35783 -37594 -56151 -85502 -61688 -42873 -70906 39683 51357 41675 22612
17114 22612 40098 14088 -71345 -102819 -95231 -37759 -80407 -112283 9595 24869 -13832 -86761
17102 -86761 -107035 -93674 -119435 -185240 -187228 -121976 40962 37251 9725 127961 144485 46380
17090 46380 47430 23762 43407 43662 64364 -5847 -12250 -7657 -24694 23067 73576 44412 56804
17077 56804 -490 -54520 -163072 -188048 -141374 -54592 -19940 -8239 -68837 -121099 -144478
17066 -144478 -122355 -98796 -132985 -151961 -117455 -95113 19611 -40907 -65466 -68514 10575
17055 10575 81763 85999 -23978 -89124 -92638 -97429 -75574 -87198 -41738 14562 -13362 32003
17043 32003 10509 -78916 -132339 -100885 -37595 -35631 -41641 -38193 -73322 -42775 77112 123546
17031 123546 132845 10209 -202502 -109562 -66473 -135502 -108358 -58416 -26075 2335 -36212
17020 -36212 -19768 7864 54386 143911 147358 30960 -44084 -25238 55523 38940 6446 -62890
17008 -62890 -139853 -135691 -28091 -34299 -72047 -46440 -34176 -9935 -50782 -129372 -168153 -123170
16996 -123170 -64960 -79097 -35650 -64248 -108624 -159037 -120870 -117050 -68888 9412 -17600 -22602
16984 -22602 21117 106916 112861 88426 82228 84165 101777 89123 79783 49151 50095 57044 85121
16971 85121 19452 31804 59270 27692 31805 27291 -12896 -77402 -120266 -139233 -34869 37398
16959 37398 -7638 -30808 -3980 -17748 -48726 16887 28424 23887 -35877 -186587 -164277 -56676
16947 -56676 -70965 -127523 -128174 -63739 -66152 -14719 25142 -30286 -39011 -78622 -17031 -103788
16935 -103788 -145966 -136203 -80591 -59236 28373 66878 78016 80800 72694 82208 36657 13194
16923 13194 5416 -13397 -56286 -67295 46775 58296 8595 -87579 -78025 -57085 -65635 -24708
16911 -24708 -54846 -49278 -56073 -54233 -16605 22144 50734 60565 4173 -6971 -23098 -23275 48869
16898 48869 88753 185823 163170 39503 -2679 -57930 -86911 -58403 -4194 -5879 -42551 -55482
16886 -55482 37582 17646 -9568 44339 5564 21794 100491 147550 109571 78364 76880 62556
16874 62556 51455 89229 71741 23594 100249 95136 9045 53501 78362 -30262 -31551 65064
16862 65064 125805 2178 -44390 19171 47737 -857 -100985 -116372 -101794 -171681 -181367
16851 -181367 -140062 -107983 -94149 -84090 -20014 3948 41508 45208 110466 82662 90280 81000
16839 81000 54443 -804 -16858 -74384 -108221 -64001 26901 187843 224592 96639 7866
16828 7866 -39716 -26079 -1982 -45065 -142481 -82502 -17354 -59167 -116138 -114307 -99276 -98781
16816 -98781 -47646 -7536 -12585 -5511 30560 -66827 -143033 -109822 -72561 -72218 -46762 -34425
16804 -34425 28174 2838 -32657 -28179 -70676 -157992 -196071 -162707 -177237 -113482 -62852 -80550
16792 -80550 -63055 8677 48754 82135 8359 -127785 -150809 -119851 -6412 23856 7290
16781 7290 -10825 51001 124025 28886 -59055 34319 78566 72516 -8797 -37319 48372 88087
16769 88087 89460 122492 101835 74247 42432 18736 30078 56125 57380 61031 89372 8898
16757 8898 -8145 -16443 -17837 3589 47222 17005 -92062 -158838 -244307 -275513 -211237 -125210
16745 -125210 -39562 1291 -35860 -56867 -50800 -3692 -18683 -2000 -2753 4649 62816 -9876
16733 -9876 -23913 -34598 -34646 -70976 -103702 -170878 -60276 -30069 -20934 -122011 -155655 -9897
16721 -9897 49616 79037 24332 23379 6887 -27889 -8673 11740 -28755 -19284 79477 64127
16709 64127 -15518 -96857 -78885 -47338 -51832 -108558 -130506 -80049 -37255 -35364 -28213 4353
16697 4353 -87767 -55648 -43523 -45325 -64442 -98740 -10530 9702 67746 61972 23241 -87298
16685 -87298 -148442 -95085 -57212 -59416 64613 136648 88084 15613 20402 -50787 -75836 -89657
16673 -89657 -117476 -157265 -149098 -168918 -118615 -78238 -22097 45638 16131 -39718 12259 116835
16661 116835 26955 -52201 56348 32269 34003 23789 -57408 -113470 -101775 -107568 -28154 4149
16649 4149 -70205 -72175 49186 88158 57185 26784 21466 10571 1478 -37303 -18974 24801
16637 24801 -30288 12018 -71744 -100154 -79670 -75794 -124214 -71590 49196 75606 59878 -48985
16625 -48985 -117439 -161271 -215018 -105086 -71152 -137354 -127017 -46890 -49813 -166073 -175325 -93968
16613 -93968 -10695 8668 -20529 -11563 -11427 -33767 -78800 -47312 -61533 -72417 -61143 -25729
16601 -25729 32534 47879 -7822 -55368 -8328 2406 -42668 79587 76186 13219 -18753 -9273
16589 -9273 -10276 -4365 -15173 -19329 27969 33854 103692 72896 40341 18603 104 -129817
16577 -129817 -158018 -77578 -26712 -37356 -14965 -9521 -33011 -57242 -62638 -34033 -12930 -23464
16565 -23464 10373 65017 21513 -47592 -12132 67203 23458 -58418 -74896 -28074 53078 46208
16553 46208 50479 36485 10747 -67943 -156044 -112133 -45813 -37107 -54584 -86424 -111868 -110583
16541 -110583 -68095 -92750 -35554 22031 25522 52741 6291 10970 92776 74242 -14392 -90909
16529 -90909 -78774 -77370 -49116 -46158 -19907 28569 136889 146496 164218 56457 -6918 70596
16517 70596 112430 19246 11077 57457 -12362 -2833 5263 74287 112261 90461 139395 151828
16505 151828 110125 133930 84738 36778 6577 -79181 -156325 -203704 -166031 -144820 -131843
16494 -131843 -134244 17031 63476 104251 91979 -32198 -81156 -141386 -137316 -129961 -97565 -53460
16482 -53460 -38789 -14486 -47082 -63098 -69569 -66068 19346 96521 130014 79577 123725 116596
16470 116596 45962 -11286 25543 67481 164802 198782 177616 74792 12299 -40118 -39640 37567
16458 37567 85715 70624 34563 -25460 -118538 -39344 78195 76117 -20124 -126400 -70343
16447 -70343 -6695 29684 -43783 -94312 -135991 -82131 -113916 -201430 -160385 -94968 -48247 -3248
16435 -3248 -6831 -42915 -34660 -56248 -97989 -71287 -101353 -111745 -78716 -104323 -65443 -22592
16423 -22592 255 18813 -16110 -40677 -56890 -106269 -124059 -23064 53510 97484 100261 76163
16411 76163 40009 -2880 33840 38916 45706 50589 103266 107118 67237 11595 -25734 -62609
16399 -62609 -64886 -17013 -32652 -86438 -92860 -47367 -24062 -122901 -108060 -44880 8724 91310
16387 91310 12561 -60140 -147457 -160675 -177545 -222336 -223803 -137945 -23157 -37343 -21992 -66342
16375 -66342 -34158 32089 -12319 -77307 -45925 -29095 -28896 71711 55265 -37203 -121122 -135844
16363 -135844 -113050 -84804 -40484 -30160 1352 44913 56431 63453 91035 55277 53623 51478
16351 51478 5269 -18668 -83259 -58595 -33033 32876 5249 -62753 -105390 -107807 -93480 -17980
16339 -17980 -73172 -120901 -28991 46154 69420 44696 -59691 -43369 -21733 49307 58856 44266
16327 44266 9386 28056 43684 1753 -19562 36508 -6153 62846 152699 184598 200749 190293
16315 190293 134633 66718 -31244 -70023 -84889 -19503 93507 94028 40438 29462 48523 65748
16303 65748 21799 75921 52153 52562 5135 30344 9507 25446 31829 56114 -41449 -25663
16291 -25663 -13714 -37860 -89525 -140494 -87497 -30482 -6154 -31228 2683 55496 124043 150079
16279 150079 122290 12896 7974 -24865 -70368 26900 75237 64186 -1448 58037 -10479
16268 -10479 60570 81685 105006 129020 104274 45129 -27660 -85467 -23644 1067 -35766 -25743
16256 -25743 -43877 -93892 -153194 -212253 -156550 -11815 67277 46830 -3542 -82447 -90929 -21572
16244 -21572 -53769 -126816 -62355 -54120 -76732 -40633 -61320 -78170 -45295 11496 -31666 -91412
16232 -91412 -95171 -36195 -33399 -68997 -100872 -90968 -65917 -22253 70645 12096 15354 65363
16220 65363 130599 171254 125323 84264 2065 -94285 -113094 -59801 3633 4409 29089 68905
16208 68905 90634 105535 132129 111267 57443 15810 -40939 -61046 -40642 -49850 37723 20311
16196 20311 44689 100936 111890 47119 -56138 -16371 61301 29058 -14038 -4211 13437 20849
16184 20849 -53269 -30537 29039 30765 -29745 -58636 -53935 -48215 30678 85776 106738 71702
16172 71702 -2002 -28895 -69154 -107737 -28960 2635 -64002 -152955 -93176 7128 26827
16161 26827 -6793 -46817 17838 -33834 -72046 20260 -30942 -90748 -38281 50079 82832 33593
16149 33593 -94298 -164923 -142635 -134958 -82699 -13913 2506 39455 140119 124099 68361
16138 68361 -56542 -108966 -28667 10804 -82601 -43386 43009 69552 30956 17594 76526
16127 76526 58389 13182 7281 56250 76626 149192 161727 42881 6664 -15942 10193 37168
16115 37168 74997 91853 35195 46129 102389 31713 -35233 -43315 -27100 11592 91300 85321
16103 85321 128907 169325 87946 42394 56876 37829 58043 -33241 -23418 38705 108556 168698
16091 168698 110586 54965 14292 -45032 -27622 16427 77562 180338 241192 219550 118523
16080 118523 52816 49055 83350 72782 39748 66439 172328 176269 170308 173454 93568 66916
16068 66916 29636 38872 92578 143470 164147 83512 33815 1498 343 -101231 -186760 -92549
16056 -92549 -60285 -35534 116838 9234 -53554 -26584 -80416 -48375 12035 51493 118617
16045 118617 85084 25432 -43854 -1974 67831 81357 38255 -11538 3582 41513 -28521
16034 -28521 -51228 -41961 -33011 -59859 -14543 7405 -1421 -98367 -102014 -25547 1000 -44769
16022 -44769 -97919 -62470 1492 -10836 39129 51424 -35293 -93101 -118661 -76803 -67378 -84778
16010 -84778 -82519 -47506 47890 170597 180845 125504 137645 120498 93777 102086 129452 80574
15998 80574 9835 61302 46737 90311 -3957 27834 61282 36609 48532 5103 -50986 -27204
15986 -27204 56614 38718 -9105 -7522 -38920 -46826 48554 -5051 -106396 -96885 -95956 -64826
15974 -64826 -23296 -35730 6557 73031 110596 48092 11289 32011 15689 5102 -89633 -156021
15962 -156021 -115536 -16824 5729 -15709 5221 20362 -87483 -113531 -60139 -128916 -144174
15951 -144174 -67768 -88443 -97875 -90631 -46115 -31280 -82629 -139531 -154053 -55663 -45777 -48158
15939 -48158 -49935 -1641 53672 32149 56707 65348 9934 32514 9869 -19042 12399 57070
15927 57070 116990 124486 153763 163415 178280 198166 201859 246001 178716 146360 4517 -70313
15915 -70313 -21018 34518 -21495 7518 107592 84237 -38008 -42168 -16686 -25026 -22522 61147
15903 61147 71012 3284 -35698 -129119 -65521 -60848 -95874 -29883 11538 -32547 -39290 104968
15891 104968 89110 63728 -17250 42638 131797 103153 126300 147316 107952 94360 138008
15880 138008 190226 177711 158205 157243 161926 154171 109527 71266 32794 -11035 -7764 -18145
15868 -18145 -15699 65974 68133 46407 23058 -17710 15977 56017 124578 107937 94767 159047
15856 159047 182725 84085 15777 -8009 -58743 -6620 13640 3056 28119 93103 101202 -10840
15844 -10840 -40562 -60859 -76503 -99509 -71750 -89913 -124147 -71129 -53985 -48228 -84523 -116977
15832 -116977 -105668 -63692 -75862 -104721 -38406 132347 113225 89249 57672 101767 86054
15821 86054 60773 -22624 -52669 -50072 42571 68603 16706 -18023 -67000 -33885 42398 -17317
15809 -17317 -2258 6818 62665 108924 67363 -41668 -95077 -95377 -42286 -10149 -2849 -6745
15797 -6745 -58571 -118157 -86848 -22870 -35695 -131936 -155406 -173963 -174740 -197817 -150205 -55633
15785 -55633 -73764 -36158 -15532 -28452 -77572 -24547 28699 167076 181519 94829 75102
15774 75102 58914 -8854 -70771 -59158 7775 14854 20106 53785 118409 118683 62687 -46414
15762 -46414 -114361 -32645 12626 -20920 -66968 -168852 -176241 -111418 -107062 -102699 -91054 -14358
15750 -14358 55794 49223 67763 36032 -19354 -23345 -36532 19400 42629 118058 96778 32917
15738 32917 -63846 -79554 19544 74239 17537 -63496 5167 -22192 -76463 192 93870 104664
15726 104664 58687 23568 31821 14296 2840 -1266 65645 22709 -12113 -30868 -93970 -70996
15714 -70996 1629 81308 127840 50958 36030 2724 -73992 -92037 -56888 -156739 -200693 -197868
15702 -197868 -117766 -24027 47732 44633 -49361 -108378 -38000 -30803 24149 49866 43218 48780
15690 48780 10034 -29161 1287 -32482 -51948 -68347 -107964 -68460 -42982 -6212 55050 44539
15678 44539 2007 -16537 -109324 -130152 -100736 -105501 -155744 -166095 -54550 -25291 -9213 -109461
15666 -109461 -120128 -103776 -47103 68802 108358 161271 57263 5445 36387 37376 36847 -96
15654 -96 4794 4108 112924 187544 211694 142226 79148 -17825 -10054 7939 -7384 27871 -9893
15641 -9893 18901 57590 27364 22725 -12898 -14568 -753 46472 142433 96821 133675 61969
15629 61969 17694 -15633 -8094 45000 24197 -43919 -41343 -3502 929 45599 -39277 -52706
15617 -52706 -26580 -10090 -12192 -107678 -108423 -115068 -77704 -16783 -10662 -28798 -23446 -7072 -2703
15604 -2703 60638 14618 -19518 -72548 -47201 -12878 9545 50900 15074 -14564 -35601 -50513
15592 -50513 -37675 -34259 -2627 11291 3168 -16731 3380 -29144 -74263 -82159 34840 172995
15580 172995 198185 157482 79565 34772 8770 53393 14230 -2110 -30281 -76162 -79264 -61685
15568 -61685 -78808 -92919 16729 73306 89794 58232 109082 52686 15925 7517 -12350 -39762
15556 -39762 -30239 -23248 11585 22507 17823 -30238 -53178 -64689 -107330 -89853 54516 33537
15544 33537 -60108 -106455 -151310 -149356 -87442 24435 56651 -21989 -27774 -6753 -1873 29376
15532 29376 33460 -26469 -92077 -56929 -17080 -48659 -33109 -25419 -37038 41234 66577 -25903
15520 -25903 -21047 4597 7137 2301 38392 66775 6768 -58235 -31553 44592 113942 73986
15508 73986 -12505 -25314 -3929 -37553 -6325 -18659 -13875 89355 151640 184762 119912 109920
15496 109920 63585 -6624 -83644 -103713 -105390 -18148 82189 10885 45607 56073 -2172
15485 -2172 -41431 -23050 9237 -33959 -42969 -14476 10458 -4783 -18311 -55546 -67857 -46841
15473 -46841 -36020 -7325 -38604 -141644 -230939 -227555 -88626 -7582 35847 92876 78122
15462 78122 48136 -77175 -175839 -194564 -163984 -109832 -55763 -72739 48076 128087 38283
15451 38283 -7898 40963 39351 -31469 -78399 -69991 2794 97738 140352 115586 146474 114803
15439 114803 25618 -22406 -74024 -56287 -78957 -98921 -97598 -1096 -16821 -24351 82832 193490
15427 193490 155350 68776 67480 20326 -57911 -84467 -122227 -97363 -118171 -56525 -75488 -122777
15415 -122777 -105856 -39674 68025 81575 66015 24275 -6145 -65363 -140233 -133967 -63243
15404 -63243 17248 11063 -34313 -114771 -64598 102205 109077 59067 29099 -37776 -33505 -146252
15392 -146252 -154981 -174677 -142205 -145380 -82796 -40258 -23137 -9171 -9995 -76540 -101752 -165526
15380 -165526 -125761 -127253 -58356 -37630 -32997 -64688 -50437 -4298 -44488 -92734 -138519 -107334
15368 -107334 -55728 -39990 -24823 10703 -31105 -34550 -69018 -65682 -93810 -83726 -105280 -62681
15356 -62681 -64121 -36996 -41529 76818 121495 16640 18231 17493 70123 90973 123409 59847
15344 59847 -2141 -70337 -82210 -12258 7409 27905 88178 123508 46405 -30824 -9068 43835
15332 43835 44215 7751 -67718 -81616 -51043 -12209 -27936 -51228 -37457 -41176 14669 90282
15320 90282 68344 -52778 -135159 -110492 -110255 -151583 -72239 -116549 -78597 7545 116636 111050
15308 111050 29976 21487 5010 13010 12595 -38901 11162 12432 31113 -3703 -36379 -15098
15296 -15098 -83094 -179306 -138275 -27886 36065 51557 18590 50036 102570 105267 87667 60906
15284 60906 24509 -26134 -73725 -3245 -30074 51918 170309 200742 174426 117150 54741
15273 54741 32372 126215 141420 71601 63580 51798 41794 14191 60676 106500 75826 69583
15261 69583 101474 55489 10587 69840 25491 -40011 1989 55230 -30213 -30625 19175 -60132
15249 -60132 -142245 -118346 -64208 2880 71005 100768 90435 34256 -18110 66088 24359 -25500
15237 -25500 40886 63953 27804 -5965 -111368 -165070 -120207 -40183 -45693 -62165 -25594 -28898
15225 -28898 -62609 -139299 -192947 -94957 -19389 1811 77841 90741 -2056 8890 -95290
15214 -95290 -71903 -49114 -45162 -91072 -112452 -135625 -87545 -6375 61422 48172 6865 -91684
15202 -91684 -101154 -55710 -7412 17575 -52079 -128259 -161299 -177206 -150059 -70253 -9317 6772
15190 6772 6889 -33807 -97777 -57414 20019 -47899 -68259 -47521 -19227 -8212 17835 56125
15178 56125 9544 18240 -100502 -114978 -107346 -97644 -71864 -5741 56307 -7719 -54226 -29212
15166 -29212 11380 10403 24355 -8906 22186 40179 -45308 -53387 6010 -4366 -73723 -23311
15154 -23311 -7775 21153 -70633 -53884 -4341 70657 58563 -6315 32455 12298 -42241 -43648
15142 -43648 -6935 27861 115596 123566 158422 95704 49467 40657 -3555 -40953 -3757 66172
15130 66172 61175 82621 55292 3557 -17685 50058 77262 37719 -27197 -27552 30509 77160
15118 77160 15607 3765 -34967 -90264 -110788 -26926 20516 -82139 -109745 -50587 -64265
15107 -64265 -120175 -140158 -106779 -111066 -114943 -73285 2327 1757 5359 31031 -48889 -108628 -221679
15094 -221679 -243137 -41018 135753 153570 129481 124922 113550 119546 162261 135306 119263
15083 119263 79068 26783 -13163 40484 -522 65078 64072 55904 9750 10619 31282 1388
15071 1388 3579 -11117 -39395 -22768 -38185 7958 -4320 2245 -49661 -7516 8514 27804
15059 27804 47575 105814 94487 92082 41262 58846 53204 46107 66995 29647 9106 -6932
15047 -6932 78230 11002 -27065 3772 6982 -35487 -9123 6534 -36830 -34490 -69037 -34354
15035 -34354 5663 13786 50544 145983 108553 30418 -16966 -57105 -107082 -78586 -73398 -40381
15023 -40381 -13531 -83820 -119019 -68806 2432 8481 80414 132183 139100 138777 144553 133610 109398
15010 109398 79606 101688 74335 26765 16756 -14472 -25849 -19143 -34964 -81451 -27583 12041
14998 12041 1843 -3927 -88204 -84549 20692 54974 57577 47330 37624 29687 14092 20914 24663
14985 24663 29598 81821 76253 66240 88958 96323 8047 -46469 -93528 -100105 4488 -26317
14973 -26317 -57896 -21077 -11742 -79228 -31670 37363 63652 10017 12542 -28436 -110989 -59329
14961 -59329 -42575 -93221 -81567 -15854 -34398 6122 10401 -1590 64763 62839 7254 60980
14949 60980 144739 86300 37680 9013 43803 -33194 -89039 -140078 -158629 -97329 155 79021
14937 79021 98535 91429 133524 105100 43642 87243 143163 100948 -413 26792 74100 -20846
14925 -20846 -139453 -97031 -23744 -22595 -62628 -115654 -22142 -41065 -46099 -118720 -89899 -108799
14913 -108799 -56985 36745 16942 186 38160 75768 103581 147966 131925 39572 -32838
14902 -32838 -30025 -16523 34170 74725 102466 3338 -71664 -156661 -88459 -84187 -163835 -57201
14890 -57201 74256 155500 60869 -18781 79016 67259 -3318 -46197 4688 40261 -9377
14879 -9377 -49314 -116208 -136328 -58786 -14185 10014 26618 -24216 7848 9974 -51690 -77067
14867 -77067 -46355 -60686 -34824 -90935 -124832 -41491 -23329 24550 13056 40066 150995
14856 150995 64061 17497 30797 29748 -44494 -50545 -7614 59524 26681 -4246 -56734 7027
14844 7027 60082 -18745 -22195 -50842 -85753 -124169 -132157 -40384 -31244 -71720 -75277 4021 -47873
14831 -47873 8873 -22429 -66022 -47731 35927 88173 108556 209414 226459 130637 116891
14820 116891 165076 132199 39683 -102199 -188520 -144283 -96678 -85304 -28916 18084 72547
14809 72547 125525 136540 103196 42575 -17283 -58241 -65727 -30951 -8023 -57070 -163278 -172171
14797 -172171 -21739 34863 -105051 -27698 43937 73523 78697 109543 2242 -51837 15512
14786 15512 46047 -24093 -87003 -25711 -22752 -53353 41321 97087 6061 -15994 -3027 36693
14774 36693 34860 -22279 -56226 4390 62872 81594 1832 -36859 -105852 -118960 -27568 -11140
14762 -11140 -30626 -21073 -41571 38948 67091 87296 94325 50067 85220 47139 50012 71753
14750 71753 27276 -28198 -23130 27609 48339 30565 -14902 -114259 -82026 -157170 -119580 -24570
14738 -24570 -9516 -131017 -126844 -39204 -13448 -34293 27597 -1907 -34154 50560 115645 106110
14726 106110 48032 38502 30619 78069 94876 123239 132507 111691 48026 7915 -35231 -56507
14714 -56507 -72685 -87416 -18503 -9627 -94091 -174693 -133928 -78394 -108684 -6486 7685 8572
14702 8572 47072 45582 20604 25497 55211 4035 -102272 -98794 1534 48125 42493 34990
14690 34990 27824 48549 59797 62039 102208 151967 106072 49792 40337 45210 50059 4351 12949
14677 12949 -26119 -60375 -67927 -35741 -28937 -14954 18541 28394 94414 73375 40738 72042
14665 72042 118176 164772 100719 110965 187766 158095 105037 139407 132273 55067 -26895 -49057
14653 -49057 50207 42386 19150 -13155 -79674 -130618 -95609 -49340 -46103 23332 -8943 -86788
14641 -86788 -84177 -102835 -56187 -17045 -22093 -6127 74 6127 14389 -88282 -55088 -37279
14629 -37279 22379 20965 26880 42243 -18239 -60091 13876 -9309 -66330 -14162 45096 -60581
14617 -60581 -77725 -40240 -10339 85567 127619 69457 46481 23285 19516 -54171 -150788 -169513
14605 -169513 -171298 -87948 -142268 -109421 -56952 14656 -12193 48691 77451 -4153 60080 88815
14593 88815 74855 85998 119532 138347 42061 24400 17235 -13299 -127735 -120902 -89319 -97033
14581 -97033 -75967 -9572 -89535 -51886 60207 97771 24826 -33197 -71918 -83929 -55479
14570 -55479 27662 31217 -49004 -70943 -61671 -51077 -74674 -12503 2149 17482 27596 27333
14558 27333 39403 -37918 21450 85716 112064 74417 17579 31992 -15547 -68216 -98873 -37734
14546 -37734 -31137 -42926 -96078 -81339 -59006 -84764 -136168 -155336 -57412 59382 39846 -56596
14534 -56596 -75897 -130912 -132751 -144516 -58471 75286 32823 14709 -36545 -80523 -19128 10397
14522 10397 31416 -17142 -2200 -84173 -61050 -53047 -64240 -37386 -73863 -106953 -114151 -56137
14510 -56137 15608 40961 -7295 -9711 -5015 -69436 -136007 -190024 -117612 -96790 -131009 -137520
14498 -137520 -86713 -74714 -45858 59570 34289 -27693 -13292 48561 20882 11504 -3844
14487 -3844 39981 36084 62511 45162 -23577 49362 37260 -19469 -11661 75835 142310 85271
14475 85271 43601 88904 92030 64564 37377 71988 82806 16154 -30084 12073 83860 29840
14463 29840 -24212 64628 31753 4527 22542 33164 -32353 -67561 -13688 35177 -15002 -82215
14451 -82215 -70684 -762 21892 112947 185081 188717 135384 72990 139401 144546 125412 128628
14439 128628 146956 55173 -39101 -27094 -35449 -49444 -92996 -103459 -122983 -133914 -103684 40703
14427 40703 99038 82785 59367 9384 -40226 -91228 -69226 -50617 -89232 -34055 -37934 -118913
14415 -118913 -82406 -1072 109521 116397 43036 -23622 -3429 34202 -21945 -86024 -72372
14404 -72372 28146 66067 59491 12043 8800 91413 119387 73990 40610 30360 63927 74011
14392 74011 25753 -40511 -59639 -99854 -129751 -49825 287 -71242 -75815 -44981 14200 126924
14380 126924 173553 76815 43206 50065 -4774 -5640 -27201 36854 78212 102139 119219 109023
14368 109023 121019 122486 63652 36299 29464 77645 54544 -50140 -138630 -156385 -86670 -116230
14356 -116230 -21872 43664 12660 -127098 -117885 2773 43396 38187 -11991 -35905 5608
14345 5608 41804 59843 79018 97876 38766 113175 82398 3002 -73929 -101659 -67101 -55086
14333 -55086 -65242 20722 14846 -127387 -142775 -40283 57492 44520 27043 122083 118541 19446
14321 19446 -44413 -64258 -26508 26279 88876 100169 113818 104143 145003 148347 -14216 -109392
14309 -109392 -39450 -79335 -120956 -144360 -167068 -166829 -101848 -33172 65929 -31840 -93166 -127857
14297 -127857 -128967 -21211 9858 10469 72329 79036 34593 6203 -3360 31923 -10129 13829
14285 13829 19434 -59993 -82952 -83047 -46511 37355 45344 5579 34626 95419 158906 153033 92822
14272 92822 92986 91718 23219 -28034 -108126 -88405 -27238 -10911 -45534 -63232 -106167 -105127
14260 -105127 -11125 53412 9422 97272 115371 63306 24143 74572 38016 -8930 32540
14249 32540 18826 52798 67600 66007 1779 -64295 -48159 -43639 -74776 -150774 -106829 -123158
14237 -123158 -68868 -38022 -48956 41053 82488 18792 -61909 -58087 -69419 -24805 -54476 -129360
14225 -129360 -72122 -53018 -19937 -50200 -196359 -114608 -43792 -117591 -114015 -64739 -78835
14214 -78835 -97650 -66624 41317 6119 -9177 95012 122670 99488 58963 -33652 -94895
14203 -94895 -40109 22311 14040 -76161 -148707 -183820 -192151 -136691 -24748 61759 -7186 -91577
14191 -91577 -85268 -14613 41793 -36715 -61275 -74487 -26484 -58793 -124623 -50035 -82905 -140438
14179 -140438 -190374 -165942 -64813 -8872 5561 68355 93485 62103 25653 -403 -34937
14168 -34937 -17306 -79212 -54034 -20943 -67297 -32249 -4050 71134 67478 104187 37098 42030
14156 42030 58398 21289 -27571 -47757 -97154 -52949 -78469 -144823 -158848 -143590 -109585 -153307
14144 -153307 -154748 -118823 -107760 -76628 -57625 -87738 -28235 7769 -8364 -31177 -38478 -86718
14132 -86718 -30955 -44321 -95837 -73026 77615 99383 -10703 -95260 -142739 -56301 44340
14121 44340 92587 110894 120762 72897 45562 14328 -17510 -17930 -21045 30878 116862 167377
14109 167377 169535 196325 147090 148582 226292 149002 29206 -47806 -78330 -17715 -2618 40519
14097 40519 50985 66473 53461 85270 98322 -29361 -109652 -32360 60840 122425 113971 58448
14085 58448 87633 103781 65363 -43495 -45086 -18694 -36087 -35170 848 40155 -50551 -52520
14073 -52520 -47971 -166234 -245428 -240194 -121408 -42009 -47542 6313 -15636 -82293 -111777 -131352
14061 -131352 -93666 -18882 -13706 -30356 66452 95239 126217 174256 177260 174489 152685 160997
14049 160997 131578 137355 156374 127793 54089 -17540 19220 73916 135660 113104 56118 7656
14037 7656 -39063 -35814 -37107 9895 28361 -13400 -17671 6976 9310 -13505 -90282 -96487 -52309
14024 -52309 -104784 -93116 -89107 -90094 -41922 38991 108004 88447 -51457 -58996 3234 14304
14012 14304 35548 -6627 -80513 -71725 -13045 16548 -18946 6204 28333 -34401 -12241 -9278
14000 -9278 73963 46629 6141 5489 51883 36407 66053 116691 152394 198668 39550 -836
13988 -836 45191 64296 -528 212 -5141 -26868 -3413 85722 230991 151276 96118 189170
13976 189170 206434 188107 86900 6362 25196 56746 59171 57249 18867 -50293 -71595 -44102
13964 -44102 51840 146606 186775 120697 128309 139618 132149 61832 1719 -47225 -94905 -88025
13952 -88025 -90203 -37963 69808 129254 117754 96451 30948 -4872 -10258 -89594 -105075 -65465
13940 -65465 -30644 -21551 -26906 -28358 -6323 31518 50263 10516 60529 40840 -17112 -8396
13928 -8396 50797 42369 21173 87975 59400 -17949 24506 25375 24467 30873 32389 -15337 -1532
13915 -1532 3344 -25658 -39416 -59448 -103558 -49440 -65524 -9215 34962 38734 -80778 -232201
13903 -232201 -175869 -146937 -136145 -155631 -110084 -14923 4491 -12607 19238 -46268 -10285
13892 -10285 -14146 -11020 -44520 -64967 -13900 11921 -66808 -154736 -132537 -109888 -194915 -225033
13880 -225033 -203399 -170212 -158648 -123038 -144489 -123471 -86065 -76130 -107918 -69192 -64518 26713
13868 26713 136858 132229 98545 79775 58270 33320 49857 99282 79481 8879 -45418 -20533
13856 -20533 82765 78810 3320 -41628 -25530 9982 -146560 -188374 -55688 13303 -2853
13845 -2853 46656 37530 65964 177882 107195 40738 -14832 4622 -35426 -20972 -6596 48345
13833 48345 39540 -24446 65855 75208 50813 91104 55245 44122 15309 34117 8808 -78565
13821 -78565 -157343 -101452 -45664 55715 77553 32088 -50805 -23876 -8013 15303 105403
13810 105403 46841 -12165 -46517 -77886 -2402 -973 -50416 28051 -43142 -121945 -165445 -101887
13798 -101887 -40291 -63760 19431 78175 130558 115849 103738 60485 57834 15662 -9432 13315
13786 13315 -14529 -43916 -74543 -35416 9469 -25317 -14529 8542 53929 4557 -63452 -98890
13774 -98890 -46960 -65708 -71448 -271 -16247 86129 126813 126188 101407 120469 60190 -51999
13762 -51999 5571 5137 53364 52890 -10764 -5718 -31744 -27678 724 20615 7062 -80025 -78267
13749 -78267 -17262 78761 121448 90744 88655 74048 -19933 -25202 -63770 -110739 -132431 -49166
13737 -49166 -56525 -46588 12798 14048 14574 92850 150754 76006 -24049 -11866 120381 58366
13725 58366 70976 84725 20298 -24066 39805 -18466 -14821 -23518 -61304 -58361 -79771 -86840
13713 -86840 -47216 -90854 -152435 -132852 -38877 -87188 -108784 -85959 -194902 -246600 -147144
13702 -147144 -53486 11611 99889 27940 -27388 -43892 -41243 10960 -29120 8915 17180 -4700
13690 -4700 -29041 37362 21874 26774 28362 -37351 -112176 -104653 -50103 1923 24662 -4210
13678 -4210 11024 -4458 -72889 -82125 26173 144569 117861 153148 133314 42483 -58207
13667 -58207 -137257 -164495 -137615 -62480 63191 -9986 -79697 -81008 -61760 -63776 -43816 -33660
13655 -33660 -4178 -70916 -109265 -82760 -20191 -61084 -95908 -66827 25867 17250 -6019 -27493
13643 -27493 -44134 -85144 -104668 -138116 -97506 -36987 -40371 -61506 4481 89145 40939 1378
13631 1378 -52374 -30944 -14461 16833 -1657 -46413 -24619 8805 36938 10363 -34609 -44204
13619 -44204 59984 39542 -5691 -34160 -45011 -65177 -45961 17965 -54637 -117190 -23872
13608 -23872 35009 61900 92431 83195 97311 134989 195683 228344 182534 127932 59872 20641
13596 20641 -35143 -11624 43535 13081 -61595 -131846 -65887 -46860 -15510 -325 37864 94437
13584 94437 32935 -87375 -123783 -103929 -67987 -51502 15996 42050 82331 81293 81643 131984
13572 131984 106185 55222 53531 60140 147075 133033 101761 138988 175087 168594 75104 -2091
13560 -2091 -37072 27652 -9466 -25369 78322 145843 94508 51041 49014 67112 101569 55692
13548 55692 -144160 -64796 17498 2606 -27539 2024 -33034 -55280 -100284 -29670 25601
13537 25601 54788 30923 -36579 -33009 -62693 -109588 -88601 -32068 13486 -18552 -6288 61912
13525 61912 13010 27097 34164 121150 125711 101011 127831 76746 -25532 -61426 -45727 -23942
13513 -23942 -12789 -86592 -69187 -57537 12804 146 -79034 -119656 -76211 -90423 -104879 -84180
13501 -84180 -117566 -91649 33138 82459 27222 57810 40292 -44790 -61495 11559 118522
13490 118522 188352 157405 146521 100340 27784 25211 79285 119297 86210 21976 -18165 -28933
13478 -28933 12065 59093 11997 -91440 -86682 -100653 -74926 -88554 -115884 -117378 -88387 -93566
13466 -93566 -203148 -217203 -178998 -129323 -46049 58676 53880 87120 120346 80421 50511
13455 50511 71871 43226 69199 165631 204215 156132 164222 24631 80410 126933 55798 6835
13443 6835 -12527 -40438 -41026 -63391 -16904 104144 97388 128765 162380 85347 44826 137637
13431 137637 190201 157163 163030 115667 51835 -2702 -25760 17198 26869 75450 6808 45068
13419 45068 91454 75287 164500 126801 -30864 -101178 -88539 -76237 -93471 -141231 -179247
13408 -179247 -159495 -133856 -134838 -330 29173 -10801 -7889 31386 76722 -9524 14273 111628
13396 111628 75992 91066 54753 46060 94451 110829 32578 76754 143671 85786 57436 57908
13384 57908 -7464 -6994 -24163 -93569 -21044 59070 51252 30615 -8241 -66940 -144686 -189241
13372 -189241 -165484 -62929 50110 578 -70232 -147360 -83873 -3365 -45506 -50895 5669
13361 5669 -48451 -113108 -160053 -145964 -64369 27278 35763 8824 -61322 -97122 -42437 -52717
13349 -52717 -86025 -90061 -60860 -21801 -2020 51183 156105 72845 64727 -34545 -116013 -107096
13337 -107096 -74246 -32074 42383 118090 156801 207615 200542 106027 88400 50683 82336 -23679
13325 -23679 -59166 -40347 -75820 -122401 -186470 -167235 -98862 -57075 -98603 -153084 -112245 -61691
13313 -61691 -54014 -108341 -103481 -66850 -13360 -56137 16972 -1430 -43934 752 22171 -56788
13301 -56788 -64511 -46342 23734 21025 -34616 -41496 -38083 -46599 -100502 -142416 -103495 -14213 -42918
13288 -42918 -67572 -31741 27230 62397 168678 174939 96827 58333 62824 70782 -25311 -109463
13276 -109463 -152434 -95866 -129732 -65628 4275 39237 21642 1479 -21516 -42601 -14368
13265 -14368 -88526 -162335 -144074 -86477 -29651 -8080 -103011 -123011 -25010 -26642 30262 11872
13253 11872 38062 70299 100327 99641 116932 148042 148692 90526 62685 27267 48141 65284
13241 65284 74278 67922 132587 91367 -32007 9875 24124 -83038 -114661 -141579 -207548 -228672
13229 -228672 -200329 -113511 28623 46575 59791 30361 -105255 -124961 -26419 18903 -43787
13218 -43787 -76286 -44317 -95674 -146642 -174121 -123044 -148057 -160866 -6434 84634 61413
13207 61413 -7117 -73677 -106648 -122520 -125886 -9450 107722 103035 118776 43643 -22263 -37105
13195 -37105 -14939 -41898 -25184 -61064 4571 -31063 -71518 3918 -5836 -47780 -45465 30528
13183 30528 776 45371 144143 249341 165851 25305 -16933 -22016 -22129 -10508 -22373 8793
13171 8793 -27768 -36760 -47864 -60656 -68646 -95475 -93450 -80483 -34972 85306 28074 -40374
13159 -40374 -29235 -55876 -47469 -26433 -52357 -24037 101586 169833 164906 56047 57817 125783
13147 125783 96094 103396 107316 -9070 -84408 15277 12853 9408 105060 180391 217099 145779
13135 145779 43701 -44043 -7578 -5123 -4521 1320 68327 78279 114256 96182 -3053 20662
13123 20662 20550 -7388 11318 -29141 -29739 4333 42383 -13808 -46729 -78175 -109336 -50991
13111 -50991 20775 10413 -39454 15570 -21782 -64178 -76702 -52938 -64757 17217 82424 -29380
13099 -29380 -95615 -94509 -43543 -75965 -100168 -68645 -84721 -7624 48954 13190 -1418 -65974
13087 -65974 29725 140116 55642 64751 75797 154389 122126 30092 -85400 -56909 -39529
13076 -39529 63694 86127 -33297 -116546 -43795 -14300 -45255 -64582 -6165 -11033 7959
13065 7959 -1670 9929 61566 69069 59345 109907 111507 57037 38391 15642 1052 25936 -28954
13052 -28954 50955 158512 162837 36835 -112041 -128515 -94700 -41986 -26088 22593 -77214
13041 -77214 -93361 -73714 -72131 16154 97711 84538 95569 78835 69459 -64238 -130466 -113850
13029 -113850 -163554 -143884 -72906 -28147 10896 -10989 1273 7139 -48470 -58750 -22320 -43602
13017 -43602 -54061 7445 -8030 -50835 -9806 4533 5317 47691 95269 81040 35672 71625
13005 71625 93614 40402 -70686 -8847 24549 -20799 -79236 -51320 -49557 42742 76354 38090
12993 38090 -80318 -115343 -89276 -104009 -117279 -109120 -79783 -94746 -115563 -114023 -92152 -107194
12981 -107194 -105404 -45809 -61231 -66919 -37144 4433 58433 28457 -39773 -36545 25340 34410
12969 34410 85217 69512 -35347 -76233 -83985 -112619 -110250 -83383 -139649 -154610 -91636 -17739
12957 -17739 -27695 -50850 -46422 -36947 10790 55148 26737 -74869 -87215 -88381 -74446 -38166
12945 -38166 -18806 -53823 -87355 -79727 -104363 14863 34168 496 -9083 -9581 3970 -37359
12933 -37359 -73373 -44568 24842 149025 83564 -16947 33395 15086 -19815 -18807 -118570
12922 -118570 -134936 -35487 -382 9418 -68917 -107151 -58815 -58929 -57618 -82701 -108258 -107901 -167394
12909 -167394 -123517 -50230 -12370 -31523 -27888 -48204 -19152 -50006 35855 207 17446 69244
12897 69244 87127 7946 -3515 15613 -31942 -75447 7297 63920 52087 29134 -57889 -178272
12885 -178272 -210723 -150893 -86726 -20783 19277 72354 38122 36327 -21398 1405 74031 108168
12873 108168 138561 143088 36016 -28016 3539 68564 93556 4627 -58764 12152 50359
12862 50359 55889 137321 154287 101642 86969 110884 68054 -26718 -20975 -31703 55576 145202
12850 145202 84540 -8632 3527 85168 117761 73566 16958 -4090 1206 11284 -80592 -80273
12838 -80273 72552 204278 143870 79379 54784 -35329 -7936 28074 -42318 -114347 -70342
12827 -70342 2442 76922 49256 -45233 -69388 -69251 -21231 34398 28831 28794 57001 -6469 -48484
12814 -48484 -75071 -109881 -174801 -72287 -47837 8057 56171 95881 91950 117313 123103 132878
12802 132878 66853 -11683 -43106 -83991 -63886 -28454 -74204 -136217 -204168 -166462 -48588
12791 -48588 2566 53635 117592 94018 12216 16663 -30178 -38981 -51213 -61047 -57360 -9688
12779 -9688 36295 -57379 -75770 -61349 59476 13263 -100125 -87995 -79922 -53233 -44118 -66429
12767 -66429 -76179 -58391 -65379 -92007 -97957 -31338 31286 -242 -88428 -96693 -54736 -42565
12755 -42565 -25224 -14136 11304 14678 -20797 -69063 -100136 -86917 -143657 -171503 -78838 -35652
12743 -35652 -88279 5376 4513 -28535 -104475 -151840 -45324 63587 105171 96192 143021 136634
12731 136634 30107 -42201 -50032 -38894 20268 35980 33257 43525 -4877 -39668 3340 24788
12719 24788 18387 39561 108505 118298 67971 87077 121940 49533 -32598 -108819 -94816 -61762
12707 -61762 -57038 -1645 -10764 42903 32220 -24082 -36832 -39820 -12515 18400 3536 6027
12695 6027 53201 86332 37527 -10606 -11745 18807 20903 6653 27244 -72855 -190979 -120102
12683 -120102 32946 16351 38883 86519 34671 -42858 -68536 -53321 -8422 -32775 -30356
12672 -30356 11421 58479 21355 -41863 -16423 65801 11024 -79601 -106404 -89570 -63271 -39393
12660 -39393 -80363 -117010 -86384 29942 75375 97575 169411 212147 198397 121341 84210
12649 84210 1273 27408 54621 -15575 -22961 -3887 -48157 -109465 -96255 4871 28787 5624
12637 5624 -8544 -13389 -16553 12581 33762 41090 16194 1772 13140 -35003 -12769 -20517 15133
12624 15133 7049 81067 11664 -45503 -9727 93609 110068 107118 25016 32043 34482 16047
12612 16047 59190 74232 56487 47724 62831 76541 129661 101712 33808 84250 137894 82698
12600 82698 92600 28957 -13746 31776 18802 73018 76957 130729 150423 192743 251984 139670
12588 139670 37956 -27493 -30163 12350 -29034 -1159 68323 74343 47412 62869 68914 62809
12576 62809 -2300 18066 -3498 36709 75973 34000 -28837 -129302 -91248 15705 -2195
12565 -2195 -23798 3001 27201 38048 13675 -26788 47265 99663 105551 48934 17783 19108
12553 19108 -8720 -29632 -13460 -30834 -92200 -70646 -42563 -141334 -120742 -84545 -54270 -40474
12541 -40474 6541 -1728 -44074 -77209 25918 30330 52269 -5682 14414 109516 124945 131786
12529 131786 43991 -47617 -58508 -26800 60170 82755 56816 154 -54813 8769 -17176
12518 -17176 -61901 -33246 -20339 -19286 -14161 -35124 -34507 29035 41181 -26417 -96160 -144844
12506 -144844 -151895 -122643 -114751 -140939 -116565 -95189 7049 62841 -19778 33731 115496 129295
12494 129295 134576 116162 106729 43409 10324 35277 -20170 52551 153037 89581 8446 -125415
12482 -125415 -187585 -142181 -82184 -16509 -27693 -93051 -144700 -128012 -77688 -69994 -36080 -26537
12470 -26537 -16994 -91383 -148240 -242126 -194915 -124484 -75083 10259 -21928 15528 -29289 -52546
12458 -52546 -83589 -72961 -107316 -77131 -97806 -84898 22439 1995 -57914 20576 132663
12447 132663 183085 123481 60088 49656 -13772 -59680 7624 87194 86483 25155 -5689 -16804
12435 -16804 31686 73147 103652 105709 83129 12532 22981 -32433 16176 -11812 -51852 16241
12423 16241 58592 12758 5408 -72478 -72787 -68823 41756 37813 36033 115062 83982 47393 -79526
12410 -79526 -33871 -12029 -36643 42372 66763 70451 118286 112782 54759 129654 165771 76117
12398 76117 1294 -54858 -101333 -179220 -179289 -58143 68896 59146 -2548 -51801 2703 76345
12386 76345 137291 91561 64189 108568 96167 15301 -66005 -75973 -24918 -32368 -62916 -9005
12374 -9005 -19480 -30107 -60416 -63734 -22341 17888 -11582 -40201 -70461 -62861 -35631 -71167
12362 -71167 -85531 -100318 13233 25820 -32353 -6868 2248 49730 12343 18728 19172 3240
12350 3240 47275 -83124 -136884 -73133 26110 78246 22604 6390 23758 34888 26348 76608
12338 76608 24746 17508 -61 -50827 47885 77553 56725 22556 71936 82614 71826 112855
12326 112855 105860 24293 -37755 9614 -18900 -75228 -10198 -64709 -78440 -12797 28847 40864
12314 40864 40337 -45944 -58442 -56981 -40806 -8170 25683 137336 107018 93316 116726 97315
12302 97315 58317 -93106 -120816 6741 67691 24249 27621 34161 48017 40485 60812 100774
12290 100774 119526 58202 -31581 -103168 -79600 1899 74733 68587 -10808 -20137 -66471 -9490
12278 -9490 67649 61427 89546 80596 71475 16343 40184 44759 -35577 -114892 -91503 -51976 -55639
12265 -55639 -52975 27445 43427 -15609 -48212 -140936 -179512 -152787 -69999 -36861 -64444 29105
12253 29105 82089 34236 -45943 -59712 -36522 -25916 9205 73990 146508 161207 51917
12242 51917 -10740 72939 142879 147938 156388 124977 132468 46512 -32643 -5587 -29052 -74385
12230 -74385 -1506 15814 43672 111434 79136 81853 140943 59618 24873 -33486 -128469 -58189
12218 -58189 56820 113387 165603 119338 94108 82060 79933 82513 47925 41726 74996 85740
12206 85740 73321 -23857 -105852 -9395 35268 48704 15989 15710 63660 53262 105554 60675
12194 60675 7458 1182 -18429 66148 115550 62746 10080 -40937 -19877 -30955 -11179 -24052
12182 -24052 -90970 -81606 26828 105122 130280 89539 21422 24228 59622 7987 -38148 -54336
12170 -54336 -80163 -41102 -53727 -101552 -73202 -22551 6648 13525 5871 -88028 -16856 -12404
12158 -12404 -25480 -43939 -128084 -4060 137502 157582 72103 -26572 -38942 -111370 -123076
12147 -123076 -104939 20677 86048 11724 9769 73299 75804 61042 67471 582 22921 12898
12135 12898 -82731 -124287 -169970 -164778 -56981 -77861 -109278 -108851 -105740 -69841 -11956 331
12123 331 67319 10175 -96551 -139696 -122025 -115080 -116981 -85096 -55375 -21135 -92833 -48365
12111 -48365 -3665 7101 24076 -17667 63455 72787 42479 -33834 -88685 -128333 -77342 -69410
12099 -69410 -11039 -21595 -3106 19123 103375 144542 106711 40694 39093 18623 55725 108559
12087 108559 54181 4087 7106 -59587 -103964 -76007 -23435 -35326 -86343 -100143 -145004 -210495
12075 -210495 -185952 -162846 -124767 -48176 -8119 -82531 -96630 -72543 -49385 -5884 22142
12064 22142 -3995 -26078 17102 90911 81777 22289 -33339 -114077 -211001 -194540 -135495 25286
12052 25286 -17040 45250 135501 168112 136692 31235 38196 79471 33859 -42091 -13194 -51260
12040 -51260 -45747 -34967 -13067 19657 40783 53998 41505 75847 126889 61828 8295 -9794
12028 -9794 -18489 -14379 2640 -27586 -26753 -45721 -61713 -98978 -64876 3878 17521 -13039 -91057
12015 -91057 -118020 -66699 -29537 44696 56320 35407 7167 76469 103741 102913 34503 14345
12003 14345 9996 27973 11911 5391 -80868 -141031 -120899 -44590 -19762 -42016 -105025 -36417
11991 -36417 -38861 -48278 25893 122987 135915 -17515 -74897 -52848 -36760 -1426 12713 -89778
11979 -89778 -169213 -142918 -80775 -5991 -27564 -45515 -34032 -51770 -67119 28002 83420 14078
11967 14078 -39583 -11195 2969 -10520 -123770 -166023 -164589 -111562 -67291 30385 84743 56733
11955 56733 15079 11112 13579 -25437 -19369 -7506 -18452 19145 32577 18615 -52815 -70534
11943 -70534 9842 19397 37676 69009 150029 175554 129299 46638 -26480 -62765 25746 32066
11931 32066 -45111 -59467 -19263 66151 101661 6576 36930 104697 119564 95885 67331 1443
11919 1443 -115771 -119824 -61440 -54400 -93569 -92860 14246 45683 35563 -40717 -126867 -101615
11907 -101615 -95175 -11682 -28078 -76219 -107855 -88783 -64543 -25712 -934 -11119 -1496 16981
11895 16981 -14093 43309 38787 11314 -29450 -26103 -18460 15583 62538 80576 123428 173338
11883 173338 180510 196408 204541 49007 85315 103765 31024 19830 17818 30693 26179 60577
11871 60577 127160 123292 159952 154021 120073 94091 114695 97485 110758 171054 194693 103470
11859 103470 15919 48196 20913 10156 3637 29831 -15114 -64683 -130220 -109023 -115849 -106406
11847 -106406 -78502 -40060 6558 78523 71187 36901 -69000 -124174 -41323 114919 103625
11836 103625 21887 14380 41134 -7010 -11496 -50761 -54792 -17227 -42664 -66895 -37003 -81129
11824 -81129 -68846 30589 73722 137880 91880 53156 20383 -3092 -54718 -46747 -5572 121920
11812 121920 111067 68205 41266 27556 51744 105460 50099 -33442 -40010 5754 -2598 4862
11800 4862 -15911 -55399 -30993 45132 95159 62011 -13373 48494 86095 36616 35487 38493
11788 38493 31627 -2499 -57860 -146384 -129618 -110246 -94365 -45559 -32817 64908 36553 -16505
11776 -16505 -108436 -20050 5710 -34708 -24535 -63090 -5195 71271 65836 -5455 -65217 -30387
11764 -30387 -21790 -58275 17403 662 -102062 -168310 -111394 -92193 -73542 31447 36324 72433
11752 72433 39036 97419 74070 55337 96586 184387 159064 97093 43737 76353 7950 -14571
11740 -14571 24135 17907 7736 6275 -20387 -53077 -41313 60663 52727 6615 -14206 60740
11728 60740 84212 3687 23949 -63168 -136793 -167556 -150831 -139569 -167385 -249450 -274898 -232787
11716 -232787 -150353 -100715 -10160 11842 54534 46465 -18297 -17636 -33211 37137 96248 44535
11704 44535 26623 -47695 -9351 -6398 -13512 36214 54886 98747 153278 63953 46624 43563
11692 43563 20924 -19524 -64824 -30216 44519 99172 12082 58333 105329 68599 87553 56245
11680 56245 58165 103841 199379 140732 34960 13653 75638 143722 69648 -11899 25690 82548
11668 82548 45355 120387 75681 -3184 -71388 -71818 -43265 66514 102737 63002 99124 231239
11656 231239 273865 125818 57899 9603 -8625 25491 141755 110131 56739 37045 27997
11645 27997 36944 14218 6481 40301 10960 -30799 -75065 -56258 -94669 -106666 -74802 -68832
11633 -68832 -122157 -42209 46043 106723 142065 181536 192190 121912 31498 -10394 -40937 -36768
11621 -36768 52882 71362 90100 96106 24765 -49019 -53552 -73468 -16017 84494 190585 168020
11609 168020 84675 23829 95283 58572 -48959 6671 10073 29676 11967 -50960 -10310
11598 -10310 -46973 -38331 -59311 -45685 27697 95146 86618 78819 41855 -5034 47299 200679
11586 200679 182686 147484 84476 74716 35593 -18682 -3221 45265 53166 70186 15343 12578
11574 12578 -68772 -144048 -143274 -47360 33900 93217 148098 201709 175921 127245 117996 129021
11562 129021 119727 133369 156362 124582 11773 -20226 -30359 25610 75764 155004 116505
11551 116505 84396 -37870 -47451 33623 46567 29579 46852 32854 52624 12867 -70095
11540 -70095 -85219 -111864 -121368 -33112 4321 40472 116819 118648 71456 86313 103920 99420
11528 99420 69242 43853 -1351 -16683 1642 64287 34412 43469 76979 1305 14494 52231
11516 52231 22021 -50917 25762 94340 151288 122245 46467 2466 -39646 -51366 -15902 2989
11504 2989 20019 57995 168310 73492 -25700 -30668 21443 76597 15782 102972 126122 2943
11492 2943 -40878 -975 92091 51095 -81791 -110258 -132522 -145293 -16795 313 -79710
11481 -79710 -45726 -34042 -95521 -114340 -21813 -24013 -48262 -53980 -46357 -108457 -85819 14702
11469 14702 81419 58974 103859 106007 28628 20114 -4750 -35808 -55700 -19234 10925 -16374
11457 -16374 23315 3040 -16006 15859 13447 64506 82836 28436 -7311 8905 57268 85328
11445 85328 120554 149076 124721 78147 73548 49038 49999 86649 114953 126999 40062 -39436
11433 -39436 37854 119843 43290 -27188 -51802 -66248 42324 63884 56808 87945 80153 6950
11421 6950 30003 121021 139694 110599 92204 38151 -49154 -86327 -4397 31435 -27128 -137873
11409 -137873 -154948 -88993 -62374 43281 91842 139302 105072 72048 -18726 6982 54069
11398 54069 34582 77542 100896 103663 115484 114963 99024 13439 -92072 -53252 -62596 -21698
11386 -21698 -50747 -10126 6178 10114 -70267 -72072 14704 95526 84293 27987 1460 -841
11374 -841 57236 170025 205797 224306 226219 137223 101650 58043 82447 65146 -26427 -46556
11362 -46556 -40699 21613 64274 66295 196294 185051 157502 144176 155339 165046 149059 155106
11350 155106 118031 83648 111604 147881 160481 169453 239642 188285 97487 75385 102240 127189
11338 127189 109241 42082 120452 105126 49525 69757 68677 10595 968 -61649 -60610 -32434
11326 -32434 -8478 14976 46589 74653 119027 26058 -81663 -20853 39967 -28886 -40577
11315 -40577 -92445 -134362 -116801 -41942 14688 -65712 -108655 -97490 10238 15840 -31678 -7891
11303 -7891 30072 -26898 -91168 -37349 -12905 5831 63362 126682 112330 55384 40427 7274
11291 7274 15213 44388 37929 31161 19868 39165 18713 818 9677 -41887 -48879 -62176 -44418
11278 -44418 -38967 -29160 -55258 -42935 -32944 -46377 -96072 -127226 -104295 -30775 -48076 14067
11266 14067 162537 294136 216581 109890 61885 75491 72309 77756 15384 22982 17313 14
11254 14 9671 -535 30773 38694 33280 80155 92486 64033 73390 121231 73754 87374 125968
11241 125968 87719 172540 252881 313949 270615 175838 148409 131943 109319 157125 174927
11230 174927 202123 156598 175432 175586 158522 188647 215273 110848 101903 82137 22857 33072
11218 33072 -75632 44823 173021 126894 32933 -21681 -78866 -69311 -14283 -19931 -61924
11207 -61924 -95843 -57112 -13484 -36715 -47278 -65896 -17535 29032 -2556 -34468 -7796 52645
11195 52645 84353 59689 26037 67049 42067 -12073 36418 83993 41053 21870 21653 85036
11183 85036 97077 88105 55206 42245 62244 154183 178519 139206 97053 83981 82271 128874
11171 128874 164538 164576 123513 86604 85036 81623 70158 98706 123740 73530 80599 6693 26837
11158 26837 -56432 -114097 -43569 -55023 -26990 34618 53747 -317 -22474 -16294 54791 106964
11146 106964 109515 105621 81016 -32997 -105622 -107443 -28903 -31199 13925 59645 -1750 -65369
11134 -65369 -43033 -43672 635 -116493 -97629 -43666 10720 53432 20206 4773 -3833 -19607
11122 -19607 58798 95959 139848 140450 172918 168253 118095 47602 27819 24706 14696 54444
11110 54444 -40326 -26624 61134 48865 119323 215097 169928 120417 96022 76915 154562 184221
11098 184221 169147 77043 -1647 8125 -58427 -64481 3006 4121 45141 36352 80952 48428
11086 48428 -12301 393 63318 69719 62756 31162 49895 43574 110150 55721 -15784 8894
11074 8894 -27799 -71861 -24928 -46920 -87600 -54097 9775 19310 51266 73515 111697 95668
11062 95668 98161 63987 45353 19969 18895 15077 66371 147659 140462 145300 146134 182498 134931
11049 134931 72950 69327 110167 85559 141680 81584 34925 54265 113785 163137 210224 244753
11037 244753 242615 194481 106393 41346 62456 111420 262644 253969 206132 183178 162134 212456
11025 212456 164122 123282 90175 14803 120438 199082 171125 99506 159382 264642 236183
11014 236183 305155 326750 403116 425696 467175 529712 706582 882321 1091468 1305661 1547242
11003 1547242 1800653 1899626 1881057 1638604 1290789 999821 881335 788119 681522 567167
10993 567167 464070 374250 383031 372983 362451 332546 432567 401000 299023 215781 260098
10982 260098 316701 342408 341710 303647 267518 214154 242757 243599 233330 252976 277135 257201
10970 257201 208340 234297 275575 156688 105975 103874 170634 147728 180040 243652 300059
10959 300059 276914 192744 182493 253794 281585 269416 206162 134021 73673 78805 140868 95436
10947 95436 20508 -3967 140833 211990 154409 152758 177151 199753 186057 274895 248132 185187
10935 185187 210042 172110 163496 225862 229020 195904 110319 127672 88295 49767 31456 83187
10923 83187 139764 113221 97779 27527 9903 63859 80347 102451 182962 160898 68733 27740
10911 27740 91382 65246 80296 158850 223061 288160 225793 127052 77211 45025 -55581
10900 -55581 -131522 -109303 -48353 -72097 -76256 -36920 3751 84841 151159 37135 -36187 -5639
10888 -5639 15872 32057 60374 77565 47943 36170 102991 250804 283552 226983 205835 208718
10876 208718 164009 129114 91138 -6531 -1736 78307 151866 130683 57327 45226 62615 33151
10864 33151 76489 59930 38520 88611 86504 157438 112221 35242 2107 84225 145515 109516
10852 109516 178454 206522 210681 133348 192751 257677 316710 367807 391876 368081 299325 290697
10840 290697 314680 358931 336061 290846 345669 296517 316504 382301 378713 364017 353196 314883
10828 314883 244741 179620 202377 218852 263663 297783 250216 168547 114804 56393 64144 153354
10816 153354 187203 241270 298747 263992 194865 151258 133841 160464 290683 399180 440853
10805 440853 388777 301450 190657 183351 347354 415311 376076 451354 366358 368469 299745
10794 299745 308806 267034 160401 126695 196304 179591 93592 101666 129837 145529 241639 208765
10782 208765 233668 247523 270571 258831 198788 210809 166107 189129 238667 229910 166093 191262
10770 191262 220305 205529 182641 164370 171640 165121 179348 217636 257605 326684 346294 342148
10758 342148 360115 364864 373919 334094 273715 246128 311564 237328 213710 174079 143358 177306
10746 177306 200918 252766 278632 192587 189031 226128 312886 358530 393941 462607 491510 419714
10734 419714 371484 429586 399977 379759 374941 395469 432550 440196 473372 533563 498211 448541
10722 448541 519993 648172 788431 733751 629735 702415 780756 764103 807931 845265 797186
10711 797186 713173 654575 697361 744659 744754 687360 646291 610628 572660 595657 618851 607884
10699 607884 629876 659296 661666 789338 876430 922029 835797 819619 799267 828530 889523
10688 889523 876270 833409 779863 769937 816796 809379 777733 760560 815963 867558 835597 841804
10676 841804 817474 845682 767142 822902 857227 947078 1016766 1111449 1081826 984159 953817
10665 953817 1004132 1020978 1142855 1225752 1238708 1231966 1166342 1100920 1138942 1156484 1198069
10654 1198069 1201278 1252145 1236969 1262368 1311362 1323868 1315746 1347768 1424608 1427189 1373995 1473371
10642 1473371 1556932 1458876 1568359 1808320 1906046 1994017 2010858 2017362 2038873 2117393 2106958
10631 2106958 2196542 2344608 2476395 2540301 2620340 2817501 2998350 3136458 3368468 3709069
10621 3709069 4049971 4444185 5042792 5761110 6424666 7035236 7721564 8457376 9083758
10612 9083758 9407538 9775824 10355624 11189372 12218104 13794748 15716066 18108386 21056846
10603 21056846 24930457 30186713 37483535 48005275 64243959 89481170 127044712
10596 127044712 174360717 219876748 256350890 295344342 338230621 356706295 306138131
10589 306138131 223063220 161319752 122677221 98119495 81281859 69000787 59612065
10582 59612065 52515695 47137421 42966855 39799253 37310024 35247660 32989778 30692517
10574 30692517 28739624 27159213 25926104 24899783 23905058 22979531 22174895 21396605 20315235
10565 20315235 18946786 17771266 16786475 15864761 15104008 14358826 13774804 13300789 12815853
10556 12815853 12257960 11792509 11380266 11076841 10837050 10497898 10144194 9748794 9378036
10547 9378036 9083064 8707806 8379356 8104094 7804373 7451283 7186460 6925540 6711773
10538 6711773 6574907 6427039 6114787 5808641 5629883 5459098 5287383 5102957 4976927
10529 4976927 4888974 4788145 4569794 4419321 4306051 4242392 4151044 4015694 3896423 3731408
10519 3731408 3715438 3581835 3459385 3358853 3296103 3194347 3110668 3001101 2895600 2811305
10509 2811305 2702663 2614686 2537604 2530362 2439793 2329995 2279989 2218565 2149033 2098382 2086212
10498 2086212 2073905 1879488 1772105 1739560 1717886 1652349 1593746 1547028 1481283 1417326 1404780
10487 1404780 1334925 1320977 1300766 1320418 1397311 1357924 1254254 1146905 1123462 1073122 1151598
10476 1151598 1134152 1144364 1125627 1057996 1011498 1058866 1087617 1108131 1065104 1037851 1089492
10465 1089492 974693 835239 783995 750302 649627 628158 588646 503974 422623 553169
10455 553169 648090 662486 483079 343611 345500 328746 235634 258324 255783 285527 273897
10444 273897 271019 261179 274881 257924 259610 256379 246630 221789 233468 191414 172520 295262
10432 295262 328886 275376 220459 143656 104471 141606 38769 47342 78089 39929 82973
10421 82973 206411 289106 210186 188366 138343 66570 11030 81182 121331 146462 175792
10410 175792 195710 159015 203521 273320 245309 189141 165765 95157 113411 188563 216738
10399 216738 230278 276258 338729 449379 390420 225240 163437 136722 124676 77308 46358
10388 46358 80497 113145 157558 180380 233089 169053 171347 185317 129129 131186 121600 27237
10376 27237 87847 169943 199213 99666 12697 37215 14811 -18295 42544 106738 91600 81876
10364 81876 81726 98329 20535 22763 89475 144873 80320 92359 80671 76781 96142 45253
10352 45253 103906 95639 87348 67675 183786 284350 181834 246269 387771 492315 528837
10341 528837 530519 525381 541793 554785 606071 665753 614279 456729 381852 316774 269889 225825
10329 225825 165043 196667 290207 329296 269997 146115 131006 109268 106798 46905 -20983
10318 -20983 65169 99776 63424 42563 26928 32117 46843 141105 168649 93484 14359 -54278
10306 -54278 -41534 71393 46006 -110182 -98086 -24419 -11791 5813 -51243 -43521 -8244
10295 -8244 45120 54938 -8422 -45245 -119202 -54062 -106425 -107535 27988 73415 67279 91765
10283 91765 70495 55615 39947 -3901 -109661 -41286 50830 77978 85707 90550 64202 41652
10271 41652 33885 39512 42 -61761 -149224 -164420 -119819 -35114 -83713 -84907 -105642 -130735
10259 -130735 -102274 -55585 -11443 39298 73623 81286 32426 -2674 -45328 -15480 -115253 -127180
10247 -127180 -79899 11522 25511 -34410 -47518 -71880 -66616 -60434 -110134 -212399 -195336 -58249
10235 -58249 -10212 -22298 7761 -3331 -147786 -256419 -187254 -77171 -117399 -102735 -68159
10224 -68159 -120010 -124697 -94674 -24150 -41755 8333 -4840 -11971 -925 -19970 -8525 -82358
10212 -82358 -103699 -145288 -72104 -38093 -129439 -191149 -132029 65150 137477 151454 146498 65426
10200 65426 2988 -99282 -89704 -94563 -16889 15319 67779 98772 165178 183605 108528 56936
10188 56936 -12348 84531 155601 232252 329835 344110 479921 621374 869291 1127473 1337327
10177 1337327 1559715 1782101 1679630 1281806 952174 708257 570143 452443 378291 389676
10167 389676 367798 237606 248223 315237 242247 195785 84124 27677 -75172 -12827 117222
10156 117222 77957 29294 67903 21373 109476 104419 -20043 -93967 -98273 -39561 -71256 -100711
10144 -100711 -175121 -95625 -13759 48778 40802 35964 46158 88449 43112 -35927 41194 113286
10132 113286 142815 107200 22154 -3092 54857 64925 26893 -22753 -127844 -116427 -40629
10121 -40629 33981 30593 -3774 52577 140697 141249 94340 58423 57653 1314 -24246 45418 100191
10108 100191 55163 -27702 -49414 -26385 -3851 -26426 27038 59135 -62299 -78516 -89404
10097 -89404 -30845 -89966 -104310 -94637 -56987 4499 561 -88490 -109147 -86971 -53756 -76300
10085 -76300 -147095 -189866 -176931 -167211 -51020 -30430 -21438 -34525 -39627 33410 32046 -25288
10073 -25288 -75908 -104812 -56638 -43398 -22141 11398 -46316 -52894 23472 65375 8485 -43314
10061 -43314 -104452 -165601 -131454 -123488 -81974 -83616 -129931 -160582 -123704 -137954 -137939 -94280 -72991
10048 -72991 -34903 -9786 -12420 -8227 10809 69792 116235 110164 99219 73055 23551 -48678
10036 -48678 -95872 -58506 -63727 -94732 -59966 -42670 -35850 -113339 -124927 13630 132043 132880
10024 132880 -40020 -103014 -68431 3023 -50839 -47347 -34050 -32396 -87338 -116025 -155672 -151208
10012 -151208 -150180 -141366 -101203 -110580 -143217 -116998 -111055 -127548 -81547 17264 1364 -8814
10000 -8814 75658 87405 38197 79884 42471 69452 13903 24234 76113 102743 88192 105484
9988 105484 44231 -52785 -17282 -14461 -102865 -140151 -87388 -22392 -18850 2930 -32607 -72236
9976 -72236 -67877 -30754 62114 77983 47800 16703 18411 -47804 -27956 63642 66849 34089
9964 34089 81471 102034 91002 63387 87405 -8551 -22351 8765 41270 145702 188721 164608
9952 164608 100680 144196 143076 114813 82133 14117 17701 -45890 -79616 -73261 -85343 -77783
9940 -77783 -59279 12532 26378 6869 -22045 -31371 -26793 30155 127574 100898 -32753 -96397
9928 -96397 -34324 18939 122690 155017 67770 28248 40768 30384 36605 -30638 -9374 -89832
9916 -89832 -105978 -188769 -121861 -119288 -97224 -59008 -29285 -35718 -26996 64780 93762 55571
9904 55571 -7631 -356 -56563 -22461 -45916 -50234 -52467 -79668 -124505 -69985 -15733 -29648
9892 -29648 44660 74877 92286 104483 25060 26151 113710 84482 16814 -3868 -4694 -3677 -11270
9879 -11270 57533 129133 54485 1320 -55645 -33349 -128614 -162800 -56392 -18811 -35094 -86857
9867 -86857 -62312 -63443 -18199 -71472 -35003 67310 103279 44397 67663 129145 94397 -54646
9855 -54646 -94453 -95416 -17778 24081 52275 85239 60358 1322 -70317 -34908 87999 93094
9843 93094 84130 57511 -592 -53993 -58790 -92177 -75118 52527 119806 140317 102715 9690
9831 9690 -42339 -95761 -63571 12862 41241 58548 68314 43786 21109 -19923 -57082 -34615
9819 -34615 -77098 -4189 122093 170886 228513 233290 195607 144435 106168 5979 66289 36284
$$ [...]
##END NTUPLES=NMR SPECTRUM
##END=
