##TITLE=Analysis number 322224
Compound Code cc 54609
Book Reference 494/48/3
Project Code adrs
Chemist Name craigr
##JCAMPDX= 6.0         $$ Bruker NMR JCAMP-DX V2.0
##DATA TYPE= NMR SPECTRUM
##DATA CLASS= NTUPLES
##ORIGIN= Bruker BioSpin GmbH
##OWNER= nmr
$$ XWIN-NMR		Version 3.5
$$ Mon Sep 18 09:46:37 2006 GMT Daylight Time (UT+1h)  MAYBRIDGE\nmr@NMR_250MHZ
##.OBSERVE FREQUENCY= 250.131544655141
##.OBSERVE NUCLEUS= ^1H
##.ACQUISITION MODE= SIMULTANEOUS (DQD)
##.ACQUISITION SCHEME= undefined
##.AVERAGES= 16
##.DIGITISER RES= 18
##SPECTROMETER/DATA SYSTEM= dpx250
##.PULSE SEQUENCE= zg30
##.SOLVENT NAME= CDCl3
##.SHIFT REFERENCE= (INTERNAL, CDCl3, 0, 16.522)
##AUDIT TRAIL= $$ (NUMBER, WHEN, WHO, WHERE, WHAT)
$$ ##TITLE= Audit trail, XWIN-NMR		Version 3.5
$$ ##JCAMPDX= 5.01
$$ ##ORIGIN= Bruker BioSpin GmbH
$$ ##OWNER= nmr
$$ C:\u/data/dgb/nmr/ADRS/920/pdata/1/auditp.txt
$$ ##AUDIT TRAIL=  $$ (NUMBER, WHEN, WHO, WHERE, WHAT)
(   1,<2006-09-18 09:46:05.45 +100>,<MAYBRIDGE\nmr>,<NMR_250MHZ>,
      <created by zg, POWCHK disabled, PULCHK disabled
       configuration hash MD5:
       E2 DF 36 D8 04 B2 41 60 5A D7 A3 38 5A 4B D0 FE
       data hash MD5: 64K
       33 C0 82 0C 2C E4 0C A9 91 5A 32 15 DB BD FB 83>)
(   2,<2006-09-18 09:46:23.85 +100>,<MAYBRIDGE\nmr>,<NMR_250MHZ>,
      <Start of raw data processing
       ef LB = 0.3 FT_mod = 6 PKNL = 1 SI = 32K 
       data hash MD5: 32K
       05 13 77 13 91 F1 25 7E A4 04 92 22 64 95 34 9C>)
(   3,<2006-09-18 09:46:26.45 +100>,<MAYBRIDGE\nmr>,<NMR_250MHZ>,
      <apk 
       data hash MD5: 32K
       56 45 B6 AC 49 82 42 EF 43 B5 DD 3E 0A 68 A7 93>)
(   4,<2006-09-18 09:46:27.21 +100>,<MAYBRIDGE\nmr>,<NMR_250MHZ>,
      <abs ABSG = 5 
       data hash MD5: 32K
       D8 4D 22 EA 2C AA 38 6F 85 FD 51 B7 70 EE 9F BA>)
$$ ##END=
$$ 
$$ hash MD5
$$ 01 3E 2C F7 F8 1F 8E F7 E3 F9 1F 53 D7 32 4F A8
##$RELAX= 
##$RELAX= 
##$RELAX= 
##$RELAX= 
##$RELAX= 
##$RELAX= 
##$RELAX= 
$$ Bruker specific parameters
$$ --------------------------
##$DU= <C:\u>
##$EXPNO= 920
##$NAME= <ADRS>
##$PROCNO= 1
##$TYPE= <nmr>
##$USER= <dgb>
##$AMP= (0..31)
100 100 100 100 100 100 100 100 100 100 100 100 100 100 100 100 100 100 
100 100 100 100 100 100 100 100 100 100 100 100 100 100 
##$AQSEQ= 0
##$AQ_mod= 3
##$AUNM= <au_zg>
##$AUTOPOS= <41 >
##$BF1= 250.13
##$BF2= 250.13
##$BF3= 250.13
##$BF4= 250.13
##$BF5= 500.13
##$BF6= 500.13
##$BF7= 500.13
##$BF8= 500.13
##$BYTORDA= 1
##$CFDGTYP= 0
##$CFRGTYP= 5
##$CHEMSTR= <none>
##$CNST= (0..31)
1 1 145 1 1 1 1 1 1 1 1 1 1 1 1 1 1 1 1 1 1 1 1 1 1 1 1 1 1 1 1 1 
##$CPDPRG= <>
##$CPDPRG1= <>
##$CPDPRG2= <>
##$CPDPRG3= <>
##$CPDPRG4= <mlev>
##$CPDPRG5= <mlev>
##$CPDPRG6= <mlev>
##$CPDPRG7= <mlev>
##$CPDPRG8= <mlev>
##$CPDPRGB= <>
##$CPDPRGT= <>
##$D= (0..31)
0 1 0 0 0 0 0 0 0 0.06 0 0 0 0 0 0 0.0002 0 0 0 0 0 0 0 0 0 0 0 0 0 0 
0 
##$DATE= 1158569163
##$DBL= (0..7)
120 120 120 120 120 120 120 120 
##$DBP= (0..7)
150 150 150 150 150 150 150 150 
##$DBP07= 0
##$DBPNAM0= <>
##$DBPNAM1= <>
$$ [...]
##$SUBNAM7= <"">
##$SUBNAM8= <"">
##$SUBNAM9= <"">
##$SW= 20.6930455092707
##$SWIBOX= (0..15)
0 0 3 0 0 0 0 0 0 0 0 0 0 0 0 0 
##$SW_h= 5175.983436853
##$TD= 65536
##$TD0= 1
##$TE= 295.16
##$TE2= 300
##$TE3= 300
##$TEG= 300
##$TL= (0..7)
0 120 120 120 120 120 120 120 
##$TP= (0..7)
150 150 150 150 150 150 150 150 
##$TP07= 0
##$TPNAME0= <>
##$TPNAME1= <>
##$TPNAME2= <>
##$TPNAME3= <>
##$TPNAME4= <>
##$TPNAME5= <>
##$TPNAME6= <>
##$TPNAME7= <>
##$TPOAL= (0..7)
0.5 0.5 0.5 0.5 0.5 0.5 0.5 0.5 
##$TPOFFS= (0..7)
0 0 0 0 0 0 0 0 
##$TUNHIN= 0
##$TUNHOUT= 0
##$TUNXOUT= 0
##$USERA1= <user>
##$USERA2= <user>
##$USERA3= <user>
##$USERA4= <user>
##$USERA5= <user>
##$V9= 5
##$VALIST= <valist>
##$VCLIST= <CCCCCCCCCCCCCCC>
##$VD= 0
##$VDLIST= <DDDDDDDDDDDDDDD>
##$VPLIST= <PPPPPPPPPPPPPPP>
##$VTLIST= <TTTTTTTTTTTTTTT>
##$WBST= 1024
##$WBSW= 4
##$XGAIN= (0..3)
0 0 0 0 
##$XL= 0
##$YL= 0
##$YMAX_a= 434987
##$YMIN_a= -442320
##$ZGOPTNS= <>
##$ZL1= 120
##$ZL2= 120
##$ZL3= 120
##$ZL4= 120
##$ABSF1= 16.522
##$ABSF2= -4.171173
##$ABSG= 5
##$ABSL= 3
##$ALPHA= 0
##$AQORDER= 0
##$ASSFAC= 0
##$ASSFACI= 0
##$ASSFACX= 0
##$ASSWID= 0
##$AUNMP= <proc_1d>
##$AZFE= 0.1
##$AZFW= 0.1
##$BCFW= 0
##$BC_mod= 0
##$BYTORDP= 0
##$COROFFS= 0
##$CY= 12.5
##$DATMOD= 1
##$DC= 0
##$DFILT= <>
##$DTYPP= 0
##$F1P= 14.0000005364418
##$F2P= -0.99999901652339
##$FCOR= 0.5
##$FTSIZE= 32768
##$FT_mod= 6
##$GAMMA= 0
##$GB= 0
##$INTBC= 1
##$INTSCL= 1
##$ISEN= 128
##$LB= 0.3
##$LEV0= 0
##$LPBIN= 0
##$MAXI= 10000
##$MC2= 0
##$MEAN= 0
##$ME_mod= 0
##$MI= 0
##$NCOEF= 0
##$NC_proc= -3
##$NLEV= 6
##$NOISF1= 0
##$NOISF2= 0
##$NSP= 0
##$NTH_PI= 0
##$NZP= 0
##$OFFSET= 16.522
##$PC= 1
##$PHC0= 150.4024
##$PHC1= -1.720352
##$PH_mod= 1
##$PKNL= yes
##$PPARMOD= 0
##$PSCAL= 4
##$PSIGN= 0
##$REVERSE= no
##$SF= 250.13
##$SI= 32768
##$SIGF1= 0
##$SIGF2= 0
##$SINO= 400
##$SIOLD= 32768
##$SREGLST= <1H.CDCl3>
##$SSB= 0
##$STSI= 32768
##$STSR= 0
##$SW_p= 5175.98343685301
##$SYMM= 0
##$S_DEV= 0
##$TDeff= 65536
##$TDoff= 0
##$TI= <Analysis number 999999
Compound Code 99
Book Reference 9
Project Code 9>
##$TILT= no
##$TM1= 0
##$TM2= 0
##$TOPLEV= 0
##$USERP1= <user>
##$USERP2= <user>
##$USERP3= <user>
##$USERP4= <user>
##$USERP5= <user>
##$WDW= 1
##$XDIM= 32768
##$YMAX_p= 365474127
##$YMIN_p= -78474
$$ End of Bruker specific parameters
$$ ---------------------------------
##NTUPLES= NMR SPECTRUM
##VAR_NAME=  FREQUENCY,     SPECTRUM/REAL,   SPECTRUM/IMAG
##SYMBOL=    X,             R,               I
##VAR_TYPE=  INDEPENDENT,   DEPENDENT,       DEPENDENT
##VAR_FORM=  AFFN,          ASDF,            ASDF
##VAR_DIM=   32768,         32768,           32768
##UNITS=     HZ,            ARBITRARY UNITS, ARBITRARY UNITS
##FACTOR=    0.157963299565203, 1,           1
##FIRST=     4132.6476996994, 0,             0
##LAST=      -1043.33573715361, 0,           0
##MIN=       -1043.33573715361, -78474,      0
##MAX=       4132.6476996994, 365474127,     0
$$ Real data points
##PAGE= N=1
##DATA TABLE= (X++(R..R)), XYDATA
$$ [...]
16730c130k013k121L448J3553N214N835J4269J5015q362k0867j982j6191r893
16717g225R834r132j1261J5783L6674J3041n747O816r800j7771M88o438J3287
16704B8549Q37m585p710J2498k529l664J0048J0532p111P03M972L51j734j8377
16690B2780p712j3550k482k822M471L921J4483J1372r323j6833J2773J2822r515
16677B0385j0756J875l387j1101J455R972J0120j5024j5593K1397J5806N260j4755
16664A5654j1232K880q119j3606m690J0569J3873M615O707m174j0828l255m36
16651b042j2726n251p295J3842J5328j6956r833l232l081J5929K3312J0721o317
16638A2399j8910k0845P391O04o7J1611P352m014M935Q233Q815N484J2633k1326
$$ plain form
16730 -3130 -5143 -7264 -3816 9737 14951 20786 35055 50070 41708 20841 18859 2668 -7225
16717 -7225 2609 -6523 -17784 -2001 34673 47714 41967 48783 38983 21212 21700 15262 28549
16704 28549 29386 24801 17091 29589 27060 23396 33444 43976 36865 37568 42540 42891 41157 22780
16690 22780 15068 1518 -964 -3786 685 4606 19089 30461 21138 4305 17078 29900 20385
16677 20385 9629 11504 8117 -2984 -1529 8443 18563 3539 -12054 9343 25149 30409 15654
16664 15654 4422 7302 -817 -14423 -19113 -8544 5329 9944 16651 12477 1649 -1606 -2042
16651 -2042 -14768 -20019 -27314 -13472 1856 -15100 -24933 -28165 -31246 -15317 7995 18716 12399
16638 12399 -6511 -27356 -19965 -19361 -19428 -7817 -465 -4479 456 8689 17504 22988 35621 14295
16624A4295j0343l67q729j5614O99J7645j0794K3666K1533j3244o198J3859j0386
16611A6022r392j6783l394J3828J1603n545j5786p605r817p297J169P318J9283
16598f396N289J4172K4872l554j4564j3238j7787n897M411j3112n843P660L7J5607
16584h343K8066Q666m150j7593k2401R701j125J1305r016L165M695j6771J4555
16571G54Q425j2714q724J0845q896j1173O436k300M533N39l08n763K910J9895
16557D459L199k1052P659L988J0434q499M288K202K2445m757k8779j1014l925
16544a9352j1078J966J2339J5994K1014m202K074O151p108j5796l641J1695O032
16531A6088o873K777J0007j4202j1575j2142J0119J5081R230n478o022j2452J3511
$$ plain form
16624 14295 3952 3585 -5144 -20758 -20059 -2414 -13208 10458 31991 18747 12549 26408 16022
16611 16022 6630 -10153 -13547 281 11884 6339 -9447 -17052 -26869 -34166 -32997 -25679 -6396
16598 -6396 -1107 13065 37937 34383 19819 6581 -11206 -17103 -12692 -25804 -31647 -23987 -23950 -8343
16584 -8343 19723 28389 24239 6646 -15755 -6054 -7179 4126 -4890 -1725 2970 -13801 754
16571 754 9179 -3535 -12259 -1414 -10310 -21483 -15047 -17347 -12814 -12275 -12583 -18346 -15436 4459
16557 4459 7658 -13394 -5735 -1747 8687 188 4476 6678 29123 24366 -4413 -15427 -19352
16544 -19352 -30430 -28464 -16125 -131 20883 16681 18755 24906 17798 2002 -1639 10056 16088
16531 16088 9215 11992 21999 7797 -3778 -15920 -5801 9280 18510 13032 7010 -5442 8069
16518H069r5J1348j1745j4800J8922M950m723o417M643J1543O585J2086N462j8346
16504B7482k3618q887j140J0584O936k728l25J5445p896l773q142J0298N648N166
16490B5050j1771j4102M627J3239r582o745J7993m64k222j7590J423J079m086
16477c151N797K0612j8022j3165J0985j6951q297M190L989O595r65J799o578J5948
16463B786J0436R78n902j1963L36J0830J7195n339k3040j181J842J5737J1422
16450B4137J5436j9015k1759K522k780j589K0464m064j8466P010J3630L144k256
16437A6414j4722j3799J4198p580j3668O406M691q189j156K4505K180p333R072
16424A1019M956q565j397J281J8146K378j7572J2749q49k2997j2858P927J8634
$$ plain form
16518 8069 7974 19322 7577 -7223 11699 16649 11926 5509 10152 21695 28280 40366 45828 27482
16504 27482 3864 -5023 -6163 4421 11357 8629 8304 23749 15853 12080 3938 14236 19884 25050
16490 25050 13279 -823 3804 17043 7461 716 18709 18245 16023 -1567 -144 935 -3151
16477 -3151 2646 23258 5236 -7929 3056 -13895 -22192 -18002 -14013 -7418 -8383 -6584 -13162 2786
16463 2786 13222 14200 8298 -3665 -3329 7501 24696 19357 -3683 -4864 -3022 12715 24137
16450 24137 39573 20558 -1201 1321 -1459 -3048 17416 13352 -5114 1896 15526 18670 16414
16437 16414 1692 -12107 2091 -5489 -19157 -12751 -8060 -16249 -17405 7100 9280 1947 11019
16424 11019 15975 7410 6013 7294 25440 27818 10246 22995 22146 -851 -13709 -5782 12852
16411A2852J9094j1791j6582L134L570q91p379M616J184j1641J1161J9j0013m121
16397f788j0067M724q859l094m603J9017L0194P589k4209j8361O245Q294j2247
16384a2165n032K32J99J8820J3324M589p190k0352n006O222O073O769j6447o78
16370a0642K7247N731k866j7289k0123N372J662q481K602J7651M678J350k2316
16357a5424j5202l149J1505K1567J4609q057j9612j3186K563M602K5086P174L709
16344A6185M391J5962o187k2055n12N666j5048r009N088O883l141J2514J2193
16331B2930j4961p941N144p559r979J492N194R532K352n262J1877J4431o061j8210
16317B979k1706p845L6310O834O947r727k1402n506k887p789l753K999j214K117
$$ plain form
16411 12852 31946 20155 3573 6707 10277 9386 2007 6623 7807 -3834 7327 7346 -2667 -6788
16397 -6788 -16855 -12131 -20990 -24084 -28687 -9670 20524 28113 3904 -14457 -8212 82 -12165
16384 -12165 -17197 -16965 -16766 2054 15378 19967 12777 -7575 -12581 -6359 -286 6483 -9964 -10642
16370 -10642 16605 22336 19470 2181 -17942 -12570 -10908 -19389 -16787 864 5542 6892 -15424
16357 -15424 -30626 -33775 -22270 -703 13906 5849 -13763 -26949 -24386 -19784 5302 12476 16185
16344 16185 20576 36538 30351 8296 7784 13450 -1598 -10607 -5519 1364 -1777 10737 22930
16331 22930 7969 28 5172 -2387 -12366 -10874 -5680 3852 6204 942 12819 27250 21189 2979
16317 2979 -18727 -26572 9738 16572 23519 13792 -7610 -13116 -16003 -23792 -27545 -24546 -25760 -23643
16303b3643j178k1013J3027J3930m817l504K3755j0687J0450K474N800j289j1594
16290h289J597m766l923J171M380Q025N688J3743J3598j4554l4871j7776m37k06
16276c6620L435p37j1277K748K2006J2321j87L451j0578N805O09j7701q094J0899
16262b3920J3310J427j3642j1829R525L7859K047j9493o619O417j756J1318m692
16249d8o40P1J4055J6037o928n595k2108j4100K0383P815O01J2502M564j7504
16235I105r183J0768n96j5983l137l687q154L732L388K085J3283J6527m925o945
16221F278j0868o597M776J3668J2724K674l962J400r274j7146K833j2111l519
16208a9124J9674k559K123P111j5716o983J7502J330l531J5712K0824n408k096
$$ plain form
16303 -23643 -24821 -45834 -32807 -18877 -23694 -27198 -3443 -14130 -3680 -1206 4594 3305 -8289
16290 -8289 -6692 -11458 -15381 -14210 -9830 -1805 3883 17626 31224 16670 -18201 -35977 -36414 -36620
16276 -36620 -33185 -33922 -45199 -42451 -20445 -8124 -8311 -4860 -15438 -9633 -9024 -26725 -34819 -23920
16262 -23920 -10610 -9183 -22825 -34654 -25129 12730 14777 -4716 -11335 -4918 -6674 4644 -48
16249 -48 -688 -617 13438 29475 22547 16952 -5156 -19256 1127 8942 9543 22045 26609 9105
16235 9105 -78 10690 10094 -5889 -9026 -12713 -20867 -17135 -13747 -11662 1621 18148 13223 6278
16221 6278 -4590 -11187 -6411 7257 19981 22655 18693 20093 10819 -6327 -3494 -15605 -19124
16208 -19124 550 -2009 114 7225 -8491 -15474 2028 3358 -173 15539 36363 30955 28859
16195B8859k95p524k4620r312l848O296J8374J1454n865q548r623k101j7624j963
16181b6340Q701J1386m335m947j0173L084J5374n537j1195J0101N333j236J4257
16168D473j587j0370j7570j8708L137K987J5687l185J900P127J1197O126J83m031
16154b634l674O665r469n03K0400q469J876L234K195j0995j8425M130j649j3183
16140c0501J6960J1239L985J1330q25r247q072j604j3866Q886j851J0719m873
16127g720K0408J2975j6213k1482j230J1288J8104l238J950N41m095n011n085
16114A192j6001j231N330j529L118K039P32j1836n758N281m428K348Q503m264
16100a6504J0795K4744j5587j0617K4956r028l1112M662J3204J2579j1091k2230
$$ plain form
16195 28859 28564 21040 -3580 -12892 -16740 -10444 7930 19384 13519 4971 -4652 -6753 -24377 -26340
16181 -26340 -17639 -6253 -10588 -15535 -25708 -22624 -7250 -12787 -23982 -13881 -8548 -9784 4473
16168 4473 2886 -7484 -25054 -43762 -40625 -37638 -21951 -25136 -23236 -16109 -4912 1214 1397 -2634
16154 -2634 -6308 357 -9112 -9615 10785 2316 4192 7426 9621 -1374 -19799 -15669 -17318 -30501
16140 -30501 -13541 -2302 1683 13013 12188 2941 -5131 -6735 -20601 -11715 -13566 -2847 -7720
16127 -7720 12688 25663 9450 -12032 -13262 -1974 16130 12892 14842 15383 11288 6277 1192
16114 1192 -14809 -16040 -10710 -12239 -9121 -7082 -6350 -18186 -23944 -18663 -23091 -20743 -12240 -16504
16100 -16504 -5709 19035 3448 -7169 17787 8759 -22353 -17691 -4487 8092 -2999 -25229
16088b5229K2533L467n982J2912J1373J458j7591k5713K166l322J1164r296o172
16075b8232J1026K7758J8900l816j1025j1918m841P767m884Q02j7120o164J8787
16062b960K287J0335J528m287p192J1776o260j8550j9885j0896K780J5926J0638
16049a4760J268o054j1486j4074j379N784J1165n25L976n192q989K591l761L307
16035c8129R146J1580j8075R40L4618O571J7531J0805m872j1931j7174j0689k6472
16022c6151o261K2617K3496O008j677k3106j3646L110j3138N858J349L541k445
16009c0445P499R844O07K2392J359J801Q539n343k0511J1413N39j460J5396N328
15995B6958k9384j2270J1994n9O211J1064N461J790r72j6481k1266k022N355O395
$$ plain form
16088 -25229 -2696 771 -5211 7701 19074 20532 2941 -22772 -20606 -23928 -12764 -22060 -28232
16075 -28232 -17206 10552 29452 25636 14611 2693 -2148 5619 735 1537 -15583 -21747 -2960
16062 -2960 -673 9662 11190 6903 -289 11487 5227 -13323 -33208 -44104 -41324 -25398 -14760
16049 -14760 -13492 -19546 -31032 -45106 -46485 -40701 -29536 -30061 -26085 -31277 -40266 -37675 -41436 -38129
16035 -38129 -28983 -17403 -35478 -34538 80 6651 24182 34987 30115 18184 1010 -9679 -36151
16022 -36151 -42412 -19795 3701 9709 8032 -15074 -28720 -25610 -38748 -32890 -31541 -28000 -30445
16009 -30445 -22946 -13102 -12495 9897 11256 13057 21596 16253 -4258 7155 7694 6234 21630 26958
15995 26958 -2426 -14696 -2702 -2761 3450 14514 19975 21765 20793 4312 -16954 -18976 -13621 -7226
15981g226p411j237Q475q184o957N398J4479n963l892M665j140p791L770O140
15967f874q69J6439j0672K693k558j5088O090J6623J3940j5603j769P261L056
15954A2669l4l671O650q739k3897k530j0366k6233J0455M736Q256J5436J3181
15941d087r411q575k294J457J4913l047q853r015j7855j2341K137L9726P471j0767
15927b0541Q314J6090K061K134j0707N422L114j2233R314J0170Q11K4215p1l021
15913C5072J7334J8460j3418m811L143J2915J0663K519q371j5391p748j9528j999
15900B8840Q973p943O280r188N892L112P786n450j4710m842j4147l490L462j95
15886D380j2972K2376P884k0357n330J4854j4422m372m634L113K920J7719p557
$$ plain form
15981 -7226 -14637 -15874 -7399 -15583 -22540 -17142 -2663 -8626 -12518 -7853 -8993 -16784 -13014 -6874
15967 -6874 -7743 8696 -1976 717 -1841 -16929 -10839 5784 19724 4121 2352 9613 12669
15954 12669 12635 8964 15614 6875 -17022 -19552 -29918 -56151 -45696 -40960 -32704 -17268 -4087
15941 -4087 -13498 -22073 -24367 -22910 -7997 -11044 -19897 -28912 -46767 -59108 -56971 -17245 -9774 -20541
15927 -20541 -12227 3863 5924 8058 -2649 2773 5887 -6346 2968 13138 13949 38164 38093 35072
15913 35072 52406 70866 57448 52637 55780 68695 79358 81877 73506 58115 50367 30839 28840
15900 28840 37813 29870 36150 26962 32854 35966 43752 38302 23592 18750 4603 1113 4575 4380
15886 4380 -8592 13784 21668 1311 -4019 10835 -3587 -7959 -12593 -9480 -6560 11159 3602
15873C602l2925j1143J6253J3252O839j4383j6J8604J2726r89O696J7229j0696
15860B5049k8072N766R105m264L98p824q010j0031n404P738O798J4290J161R204
15846A5904J7198m90l8535l982J6571J2394J7536J726n610J8294m955j4945k4843
15833F263q991J1521o89q425J9419o70j4511p020r460J4720J0255k458r595r550
15819i191m317q42M68q951K156J7418J6758k3264o841O207K250m431l628p366
15805b3574P536N616n573J2372J428k571P253j5751J0688L273K2817J881l356
15792B2039j5770j0081j7051o535J5435J7912J6691J0194O926o86q671k8826q685
15779g108L664N31J1449l389j4082k226m69O023N455J5402J1088O506r418N523
$$ plain form
15873 3602 -29323 -40466 -24213 -10961 -4122 -18505 -18521 83 12809 11820 18516 35745 25049
15860 25049 -3023 2743 11848 7584 7982 158 -7852 -17883 -23287 -15549 -8751 5539 6700 15904
15846 15904 33102 32612 -5923 -9905 6666 19060 36596 38322 32712 51006 46051 31106 6263
15833 6263 -2728 8793 8104 -321 19098 18428 3917 -3103 -12563 2157 12412 9954 359 -9191
15819 -9191 -13508 -14350 -13882 -22833 -20677 -3259 13499 -9765 -16606 -10399 -8149 -12580 -16208 -23574
15805 -23574 -16038 -10422 -15995 -3623 -2195 -4766 2487 -13264 -2576 697 23514 25395 22039
15792 22039 6269 -3812 -20863 -27398 -11963 5949 22640 32834 39760 39074 30403 1577 -7108
15779 -7108 -3444 -2913 8536 5147 -8935 -11161 -11630 -5607 -152 15250 26338 32844 23426 28949
15765B8949Q095n285q931j4423J0458R897q293j1050R866J7369k4948j120K2848
15752C3432m593R993L091j6280l03K4243j2789P917J3027k0290P692j4543j1730
15739A8867j8955J0289J5710k274R658K98j3850N509n933o712k3658J762l273
15726a2562J0916M750J8017l852n581J4314M766l754m888l333J787J8407j5024
15713B3963l377j2727J5822J7779j3656j4723j0218m424K1385Q896j6121p692
15701D907M862q500R205j313k591L602n827J5262J0221L688q145q007j052j1814
15687D498j3393L159Q978J3565J3917N23J0253l5266k2989M760J7069J254j6216
15674i888J4256j4537K354j241k305P134p249n805j336O769N232J4867K060j3870
$$ plain form
15765 28949 37044 31759 22828 8405 18863 28760 20467 9417 19283 36652 11704 10584 33432
15752 33432 28839 38832 41923 25643 25340 49583 36794 44711 57738 37448 45140 30597 18867
15739 18867 -88 10201 25911 23637 33295 33593 19743 25252 19319 12607 -11051 -9289 -12562
15726 -12562 -1646 3104 21121 17269 11688 26002 30768 27014 22126 18793 20580 38987 23963
15713 23963 20586 7859 23681 41460 27804 13081 2863 -1561 19824 28720 12599 4907
15701 4907 9769 1269 10474 9161 6570 10172 4345 19607 29828 33516 25371 17364 16312 4498
15687 4498 -8895 -5736 3242 16807 30724 31247 41500 6234 -16755 -11995 5074 6328 -9888
15674 -9888 4368 -10169 -7815 -9056 -11361 -4227 -11476 -17281 -18617 -11848 -6616 8251 10311 -3559
15660c559j792p097L109P726j8955K0333Q163l575j842P99j6979K3914k673j1178
15646c606q509j6949j616J5637K1921N653j0764J064m416q701n888J3513J779
15633h82K387J561N217K3278r28k0637k0560Q380n414p160J6689J4084j587l3543
15619a9115k304J0184J665J0355M972j9662k812o487k954Q507l27K988K3253l809
15605D454L314o165j9074o887J6684k608O579n668m535J1109j4888Q198M895p486
15591a2078Q406O479R29J1916M567j0135j3102K424n205L571M533j286J50j037
15577A32j0964J450J1800K421j1125j2638r30K4431J3286j8498J777k85j4937
15564a4080j2519j0631k893J2799L31J2122J0912j6523J292J0868M91J0698k818
$$ plain form
15660 -3559 -5351 -12448 -9339 -1613 -20568 -235 7928 4353 2511 3310 -13669 10245 7572 -3606
15646 -3606 -12115 -29064 -30680 -15043 6878 12531 1767 2831 -1585 -10286 -16174 -2661 -882
15633 -882 1505 3066 8283 31561 30633 9996 -10564 -2184 -7598 -14758 1931 16015 14428 -19115
15619 -19115 -21419 -11235 -9570 785 5757 -13905 -16717 -23204 -26158 -17651 -17978 -14990 8263 4454
15605 4454 7768 1603 -17471 -24358 -7674 -10282 -3703 -9371 -13906 -2797 -17685 -9487 -4592 -12078
15591 -12078 -3672 2807 3736 15652 20219 10084 -3018 -594 -5799 -2228 2305 1019 1169 132
15577 132 -10832 -9382 2418 4839 -6286 -18924 -19854 4577 17863 -635 1142 857 -14080
15564 -14080 -26599 -37230 -40123 -27324 -26993 -14871 -3959 -20482 -19190 -8322 -7831 2867 49
15551D9j0001q764R005N816p979K573j257J4514J7020q623k7964j5933K2436K6555
15537A7447k206r312p404k6693o879K0749j1230k5748J3683N845m004M99L655
15524c1598J3413M869k305J1687r326n126j594J2170J9364K2313j2169k1543j4092
15511a3937j0115J0037K6855J3211L020j799k1609j745K2491L119j6364j4146
15499i82k2445r133J2065J7017P205j784l59p665o166J9160J1835k603j7764K740
15485A121j0131J3487o357j6849M572O768R966P460R48L685m391j6085J994M133
15471C21q317m404q465m250R227Q667q186l503L630q339j907n494m723K4307K1282
15456I846o73k6119J0570K774j9064N300J6504J1518j538m326o876k412j6480
$$ plain form
15551 49 -9952 -18716 -9711 -3895 -11874 -9301 -10558 3956 20976 12353 -15611 -31544 -9108 17447
15537 17447 15241 5929 -1475 -28168 -35047 -14298 -25528 -51276 -37593 -31748 -35752 -35253 -31598
15524 -31598 -18185 -13316 -15621 -3934 -13260 -18386 -19980 -7810 11554 33867 21698 155 -13937
15511 -13937 -24052 -14015 12840 26051 29071 27272 5663 3918 26409 29528 13164 -982
15499 -982 -23427 -32560 -20495 -3478 3727 1943 1584 -6081 -12247 6913 18748 16145 -1619 1121
15485 1121 -9010 4477 -1880 -18729 -14157 -7389 2577 10037 10985 14670 10279 -5806 -3812 321
15471 321 -7996 -12400 -20865 -25115 -15888 -7221 -15407 -18910 -15280 -23619 -25526 -31020 -35743 -11436 9846
15456 9846 9173 -16946 -6376 -3602 -22666 -17366 -862 10656 9118 4792 -2084 -4496 -20976
15443b0976k0975Q963l746J0044J4226N520p040Q382j8016M456j783K27L186O954
15429a0578j176j1650q692K1357J6966m678j2994K053K2978Q422j1984k0093j4497
15416b4566l47K466l089R242Q802K569O064Q687O568L103n371J6410J1164l924
15402C7778n625k2532j1484J3111p851p855n433J4465J1783R55p512j0479j1022
15389a1701n200J929J852J0555L529l743j6010R332j788j581k671p783P754J2658
15375b868P064P06l341m015R371R555k271j3844K175l088n802O99l293L646n509
15360a0815J5560K98K904o565r537L465n477J4029P902L993j827m633l1611j3273
15346c5587J6828J3706p831k053L5558O321j4937j7868j524M049p800l782K6246
$$ plain form
15443 -20976 -41951 -32988 -36734 -26690 -12464 -6944 -13984 -5602 -23618 -19162 -20945 -20718 -17532 -10578
15429 -10578 -11754 -23404 -32096 -10739 6227 1549 -11445 -9392 13586 22008 10024 -10069 -24566
15416 -24566 -24913 -22447 -25536 -16294 -7492 -4923 1141 9828 16396 19499 14128 30538 41702 37778
15402 37778 32153 9621 -1863 11248 3397 -4458 -9891 4574 16357 17312 9800 -679 -11701
15389 -11701 -16901 -14972 -13120 -2565 964 -2779 -18789 -9457 -11245 -12826 -15497 -23280 -15526 -2868
15375 -2868 4196 4902 1561 -2454 6917 16472 14201 357 2532 -556 -6358 -5659 -8952 -5306 -10815
15360 -10815 4745 5043 7947 1382 -8155 -4690 -10167 3862 11764 15757 13930 9297 -22314 -35587
15346 -35587 -18759 -5053 -12884 -14937 20621 26942 12005 -5863 -7387 -3338 -11138 -14920 11326
15333A1326N382k846R350j5119o542j1567o159K914n203L181J2302L431j0382
15320i932P164M12M020o339J440q896o619J9097J9037j7628q853J3132O038j9529
15306g456J4883J4703L322q975j5876o904j5711M129P155J4998j5784n938L882
15293a3572j2522j2068k74q2O952p608m994J6166J429j747k2208J0607K1676J7487
15279g58k100J2066J3654j977k1505l970q153J3514J0396K0947J2435L1m384r651
15265C0545j1317j2405j9600r119P424O664P67j182o397j1198K797J7162R341
15252C482J6462L17q990j2292N820L31J479p713j2508K0707l591k0798q704K162
15238b3836J6013N426J6883m933P273N917j268j1859o081r874j6191R326j3415
$$ plain form
15333 11326 16708 13862 23212 8093 1551 -10016 -16175 -13261 -18464 -15283 -2981 450 -9932
15320 -9932 -2768 -2356 1664 -4675 -3235 -12131 -18750 347 19384 1756 -7097 6035 12073 -7456
15306 -7456 7427 22130 25452 16477 601 -6303 -22014 -17885 -10730 4268 -11516 -17454 -13572
15293 -13572 -26094 -38162 -38436 -38518 -31566 -39174 -44168 -28002 -26573 -28320 -50528 -39921 -18245 -758
15279 -758 -2858 9208 22862 20885 -620 -4590 -12743 771 11167 32114 44549 44580 40196 30545
15265 30545 19228 6823 -12777 -21896 -14472 -7808 -7041 -8223 -14620 -25818 -23021 -5859 3482
15252 3482 19944 20261 11271 -1021 4799 5130 6609 -1104 -13612 7095 3504 -17294 -25998 -23836
15238 -23836 -7823 -2397 14486 9553 16826 22743 21475 9616 3535 -6339 -22530 -13204 -26619
15225b6619J2948j292P881L989l503J1757K878O670J3831J820j4560o23K757j0130
15211G804j8099N89N804m619k99j3696R770K0394j379l352J2829J283K2027K6189
15197F5245M912j7157p688j1669l767l466o312j3543n181L364K1161m473j0318
15184A1108L0q28J805J457j6969p26J152p97p285O479K4509R338l87j3830Q941
15169B3997K3244P279k31o354O314k419k2282p873R084K478o760j1034p408k5246
15155a7211l420L018r340J967O268K2225J0207M663K01k2492J0955J053K284J4456
15141B4834k779O793K0103j7473j0784k5209j1261j150j251J6487j2220M573M605
15128d732L378j1880j0925l718j617j2350n587M463J3556J4518R908o121O169
$$ plain form
15225 -26619 -13671 -14963 -7082 -3093 -6596 5161 8039 14709 28540 30360 15800 15177 17934 7804
15211 7804 -10295 -9706 -3902 -8521 -8820 -22516 -12746 7648 6269 2917 15746 17029 39056 65245
15197 65245 70157 53000 45312 33643 29876 26410 20098 6555 1374 4738 25899 21426 11108
15184 11108 11138 10310 12115 13572 -3397 -4123 -2971 -3768 -11053 -4574 19935 29273 28886 15056 23997
15169 23997 47241 54520 54289 47935 54249 51830 29548 21675 30759 33237 26477 15443 8035 -17211
15155 -17211 -20631 -17613 -26953 -24986 -18718 3507 13714 18377 18578 -3914 7041 8094 10378 24834
15141 24834 22055 28848 48951 31478 20694 -4515 -15776 -16926 -18177 -1690 -13910 -9337 -4732
15128 -4732 -1354 -13234 -24159 -27877 -29494 -41844 -47431 -42968 -29412 -14894 -4986 -11107 -4938
15115d938j762P314J2978n939q636P525j1300J6591J521j1864K1687k956k3082
15102b861r211J2121m941j0856k524Q177K3067P671j5327J20J139m102P271N203
15088A4947K0949k352j9760j0537J512J0709L24k7557j997j0472J2829K3985N749
15075A8329n144q24n910j7079l0264j7016N097J4803J2408J9176k45j0435P244
15062i860J6747j129q906M423J7706k175j0114n958k0731k3947J6048K0985j2717
15049a9628R256J0865J4779J4750k338j1836j7818K768J6927l843N755J0401R254
15036C9292q896k3550N768L88r094j0955j121J358p149j4451n483J5978K524l43
15022a5734K2050O055o969k2113J2229R076p874j1140J284N160J412j2186n712
$$ plain form
15115 -4938 -6700 614 13592 7653 -983 6542 -4758 11833 13354 1490 23177 20221 -2861
15102 -2861 -12072 49 -4892 -15748 -18272 -10095 12972 20643 5316 5436 6575 2473 9744 14947
15088 14947 35896 33544 13784 3247 4759 15468 15792 -11765 -13762 -24234 -11405 12580 18329
15075 18329 13185 12361 6451 -10628 -40892 -57908 -52811 -38008 -25600 -6424 -6669 -17104 -9860
15062 -9860 6887 5758 -3148 1275 18981 16806 6692 734 -19997 -43944 -27896 -6911 -19628
15049 -19628 -10372 493 15272 30022 27684 15848 -1970 798 17725 13882 19637 30038 39292
15036 39292 30396 6846 12614 13002 3908 -7047 -8168 -6810 -13959 -28410 -33893 -17915 -15391 -15734
15022 -15734 6316 12371 5402 -16711 -4482 4594 -3280 -14420 -13136 -7976 -6564 -18750 -24462
15009b4462O11J7044M447j2846Q716J4632o4j0047p995J191L70R63O28P695m052
14994c169j0962q783J5126K0207p392r117J5475K868k304J2028j845k9183j7490
14981b4541O040j0801j0227J3128J0885o402Q673J2441J1450o234q783N438K5284
14968B6351o236j2929k0385j2138R362P355K728p085J811Q913K279M306j912R806
14954A2226j2040Q7J4841J1910m605r43n628r857j3762j3247j8847K1078N156
14941a3631l267J4804Q995R502j035k386j320J3424k0421m771Q708n568q212o981
14927a2159m485L305k246J0537p061O623J1719N408j7821j0666m579L768J2750
14914d907q12J915J657j2817q472N548J2442m613p046N645R055K1588n025j8558
$$ plain form
15009 -24462 -23851 -6807 -2360 -15206 -6490 8142 8078 -1969 -9964 -8773 -8403 -7440 -6812 883 -3169
14994 -3169 -14131 -22914 -7788 12419 5027 -4090 11385 14253 11949 23977 22132 -7051 -24541
14981 -24541 -18501 -29302 -39529 -26401 -15516 -21918 -13245 -804 10646 4412 -4371 1067 26351
14968 26351 20115 7186 -13199 -25337 -15975 -8620 -5892 -12977 -11166 -2253 26 4332 2420 12226
14954 12226 186 273 15114 27024 22419 21476 15848 5991 -7771 -21018 -39865 -18787 -13631
14941 -13631 -16898 -2094 6901 16403 15368 12982 11662 25086 4665 -106 8602 3034 -5178 -12159
14927 -12159 -16644 -13339 -15585 -5048 -12109 -5486 6233 11641 -6180 -16846 -21425 -17657 -4907
14914 -4907 -5719 -3804 -2147 -14964 -23436 -17888 -5446 -10059 -17105 -11460 -2405 19183 14158 -4400
14900d400j1924O939r587K7498P959k8907r292n274j2043j9068K0272K8303o214
14887a5738j3349K2457O383J818j0631p936p873J1738Q22j6740K406K6228K030
14874A615p746L14l600K679J4314O615j4285J1157M073j6692p478l21j345J2722
14860B022j1015l939j1881N688R422N335J0624n573k0653q615J976N950J6536
14847d123Q111j3023j5216j1985n174n2J5865N097J9855l773j6605l363L7650
14834A3264M791k0398j1214m352p459Q814J9478r591j0328J2344K747m507r68
14821g379J7324m617j5881j6243J0715K3690l579j5178K372J0457L528o868K2847
14808B1188m130j9650O782j027j4896N251J0691j9989j6489P374J2978J052r648
$$ plain form
14900 -4400 -16324 -9385 -18972 8526 16485 -12422 -21714 -26988 -39031 -58099 -37827 -9524 -15738
14887 -15738 -29087 -6630 -247 1571 -9060 -16996 -24869 -13131 -12309 -29049 -26643 -415 1615
14874 1615 -6131 -5817 -9417 -6738 7576 14191 -94 11063 15136 -1556 -9034 -9355 -10700 2022
14860 2022 -8993 -12932 -24813 -19125 -9703 -4368 6256 683 -19970 -28585 -26609 -20659 -4123
14847 -4123 3988 -9035 -24251 -36236 -41410 -41462 -25597 -20500 -645 -4418 -21023 -24386 13264
14834 13264 18055 -2343 -13557 -17909 -25368 -16554 2924 -6667 -16995 -4651 -1904 -6411 -7379
14821 -7379 9945 5328 -10553 -26796 -16081 7609 4030 -11148 -8776 1681 5209 -1659 21188
14808 21188 17058 -2592 4190 3163 -11733 -6482 4209 -15780 -32269 -24895 -11917 -10865 -20513
14795b0513j3503p590L1622K0216k0303l950k701j0209K8089K965p711j2155Q297
14782g446J1440n944p859J6888J1376j8669k3241K193J1817O107O818m031n583
14769f134P511k0248n295J7404J2964M817j1857l919l601p863r729M853O381j1103
14755b5819j4342l469l442O272l706n459K6759J7104J426J2906l432q165M330
14742I63J0830O935k2182o062J0723Q559m283L448M350j0122j6575J7551O950
14729A1085n061K566l084j8110j2925J526r940P500K1827J0255m500j8261q126
14716b5248Q155m742q678n577K0576K7529m625j1364j4082m441n770l549J5214
14703a6602N832j2954K356O769R717J958J0118n543J1060j6004q668q847J1030
$$ plain form
14795 -20513 -34016 -41606 -9984 10232 -10071 -14021 -16722 -26931 1158 4123 -3588 -15743 -7446
14782 -7446 3994 -1950 -9809 7079 18455 -214 -23455 -21262 -9445 -3338 3480 -551 -6134
14769 -6134 1377 -18871 -24166 -6762 6202 11019 -838 -4757 -8358 -16221 -25950 -21097 -14716 -25819
14755 -25819 -40161 -43630 -47072 -40800 -44506 -49965 -23206 -6102 -4676 8230 4798 -3367 963
14742 963 11793 18728 -3454 -9516 1207 9766 5483 8931 13281 3159 -13416 4135 11085
14729 11085 6024 8590 5506 -12604 -25529 -24003 -33943 -26443 -4616 5639 1139 -17122 -25248
14716 -25248 -17093 -21835 -30513 -36090 -15514 12015 7390 -3974 -18056 -22497 -28267 -31816 -16602
14703 -16602 -10770 -23724 -21368 -14599 -4882 -2924 7194 1651 12711 -3293 -11961 -20808 -9778
14690i778K047R628J0067J395l725j9231l037J5531o718P503K951l54p842m181
14676e744j5766k41J2114N972R319P691o636r721j644o223j4499P139N649J2101
14662d89P28j7009j1319J3113m519Q389O495l855j221n207J1409m120R77k014
14648h642J92K6995J0111n366k661j4747k146J6836o62j5197J169l74r753j1163
14634a5408l848J6760J6964Ok0109k0536J6003r307n394j754n922m852K3128J0219
14620d050n471k1261O710K8196K3860j618j1425N050K266p737j1839j7904j1375
14607b6598J889P510J7034J1942j0489p558j1604r407P046K1987r646L504K534
14594a856j512J6477p477j594r689O364O641j4954q463j3983J7978J2883j1665
$$ plain form
14690 -9778 -7731 1897 11964 13359 9634 -9597 -12634 2897 -3821 3682 6633 6279 -1563 -5744
14676 -5744 -21510 -21751 -9637 -3665 5654 13345 6709 -3012 -4656 -10879 -25378 -18239 -12590 -489
14662 -489 239 -16770 -28089 -14976 -19495 -11106 -4611 -8466 -9687 -14894 -3485 -7605 -6628 -8642
14648 -8642 -8450 18545 28656 23290 20629 5882 3736 20572 19910 4713 5882 5508 -4245 -15408
14634 -15408 -19256 -2496 14468 14474 -5635 -26171 -10168 -19475 -24869 -26623 -32545 -37397 -14269 -4050
14620 -4050 -9521 -30782 -24072 4124 27984 26366 14941 19991 22257 14520 2681 -15223 -26598
14607 -26598 -24709 -17199 -165 11777 1288 -6270 -17874 -27281 -20235 1752 -7894 -4390 -1856
14594 -1856 -3368 13109 5632 4038 -5651 713 7354 -7600 -16063 -30046 -12068 815 -10850
14581a0850m17J6389j3662p708m95K5580Q197p272j3600K0542q225j2119j5452
14568a9092N125L0275Q550k4411j8134l495J5535J1280j9392N968K4279j161p335
14555G992k3210n54K1188K9957K026k1173j2922j84R352M19k0644k2961L505K5220
14541a989J3481L7k1617J726R491L440L174k160N585J6819l396o471l635k691
14527A1794J7634m42p404j0192l648J5307o73j7599j4311P068K2140K4630P524
14514E1828k4822j6819n064k2694j5501J1115J2388K5633P514M282j5475k3597
14502a1212j2413K107J7087L400n918j3925Q163O184j4256l98P424j329J4886
14489b00J1603r00n038j4692j6646J346R513j6874J1024J9551J0851j1875j5676
$$ plain form
14581 -10850 -11267 5122 -8540 -16248 -16743 8837 17034 9762 -3838 16704 8479 -3640 -19092
14568 -19092 -13967 16308 24858 447 -17687 -21182 -5647 5633 -13759 -7791 16488 15327 7992
14555 7992 -15218 -15772 5416 35373 37399 16226 3304 3120 12472 12891 -7753 -30714 -27209 -1989
14541 -1989 11492 11529 -10088 -8362 1129 4569 7743 5583 11168 27987 24591 18120 14485 11794
14527 11794 29428 28986 21582 11390 7742 23049 22376 4777 -9534 -2466 19674 44304 51828
14514 51828 27006 10187 5123 -17571 -33072 -21957 -9569 16064 23578 27860 12385 -11212
14502 -11212 -23625 -21518 -4431 -1031 -6949 -20874 -12711 -6527 -20783 -21181 -13757 -15086 -200
14489 -200 11403 10503 5465 -9227 -25873 -24527 -15014 -31888 -20864 -1313 9538 -2337 -18013
14476a8013R94P629j210K934n29J4670k887n493j958R626J2411j9081j0855J8809
14462G047P218k6583R147K620n513K0503J5487k6473J3676J674k6363j792J7378
14449H026j799J002j7134r651O929K3548N035J8286Q558k8418l6698j6476J8375
14436b0417K2966L048L712j460J0740n384j2020k2393m353J1016J8033l592o371
14423f475p431j676M409Q041j242R50O054P193O47l585M67N792M70j7157k9355
14408c2898j6979P175L1718J6374l084p607N467l675j3089L3020j927j1810l592
14395i07J7192q79j3416j7369Q550O275j363l303K781J7425R322j8920m970J5108
14381A5526P038k6950o620R908m561J80r502J4616J5085O34j1713j417P048O11
$$ plain form
14476 -18013 -17019 -9390 -10600 -7666 -8195 6475 3588 -1905 -3863 5763 18174 -907 -11762 7047
14462 7047 14265 -12318 -3171 -551 -6064 14439 29926 3453 17129 18803 -7560 -9352 8026
14449 8026 6227 7229 -9905 -19556 -12627 10921 15956 34242 42800 14382 -22316 -38792 -20417
14436 -20417 2549 5597 9309 7849 18589 13205 1185 -21208 -25561 -14545 3488 -104 -6475
14423 -6475 -13906 -15582 -11173 -3132 -4374 -3424 2630 9823 10470 6885 7352 13144 13614 -3543 -32898
14408 -32898 -49877 -42702 -10984 5390 2306 -5301 166 -3509 -16598 16422 14495 2685 -907
14395 -907 16285 15406 1990 -15379 -6829 -554 -1917 -5220 -2439 14986 24308 5388 418 15526
14381 15526 22564 -4386 -11006 -1098 -5659 -5479 -14981 -365 14720 15354 3641 2224 9272 9883
14367I883M08L43j9748j0521P642n937K246l921K072K915N185P38j5891j0676
14353c5262L0856Q917l358R857P331m991k847J0512n438j4583M322j3974N822
14340b836o60K439q192j3978Q714J5268r241m806J0837o891J215L606O183Q135
14326I793K557J1724O203r807j1648j904M173j4991M47L636k865J2513R832k3203
14312c540J9198L575j3536j0275l08k0346K1320M1640J1678k8414r553M795j3918
14299B316k3370J0084J8436j1430Q693Q627K930J0646L395j1111N624N848j385
14286B9303q315L083O104n555k2188q140L320k948j741r91q210J1534O791k4k7039
14271b5016k2006J2614K4452J2797L505n707Q042P07M713O101K940r890K419l931
$$ plain form
14367 9883 10291 10634 -9114 -19635 -11993 -17930 -15684 -19605 -17533 -14618 -9433 -8695 -24586 -35262
14353 -35262 -4406 4511 1153 11010 18341 13350 10503 21015 15577 994 5316 -8658 -2836
14340 -2836 -3496 -1057 -9249 -23227 -14513 755 -8486 -13292 -2455 -9346 -8131 -4525 1658 9793
14326 9793 12350 24074 30277 20470 8822 6918 11091 -3900 -3453 183 -2682 9831 19663 -3540
14312 -3540 15658 19233 5697 -4578 -4886 -25232 -3912 37728 49406 20992 11439 16234 2316
14299 2316 -21054 -10970 7466 -3964 4729 13356 16286 26932 30327 19216 24840 30688 29303
14286 29303 20988 24071 30175 24620 2432 -5708 -2388 -5336 -7077 -8068 -16278 -4744 2047 2023 -25016
14271 -25016 -47022 -34408 -9956 2841 6346 639 8681 9388 14101 20202 23142 13252 15671 11740
14257A1740R160K855j0612N2j7284o258J8686M015r465R812J4182j0007p502K771
14243A2145Q286j5653m493J4088Q399j0613j1037O839J7823J2469j7393r857O744
14230A7747j2464o634j3066N604R450m434J3497K562Q733j1301R450P090q331
14217A7903m53R479J126l720J2508M86k2557l14J996j5695m455Q92J5970J8415
14203C1581K3848l617o890k0103j0922o03r488J6819M517O753N164m400j5219
14190A7440q938N722J3128j2995j2883n969M896J5067N265k3278N419K196M717
14177I787J452J956O683r527k809J100R3N943k193p988J0132O245J0577m746o678
14162B0027q859p089k828J2487J4961L069L157o75J4076j673j7429j8344r004
$$ plain form
14257 11740 20900 23755 13143 13195 -4089 -10347 8339 12354 2889 12701 26883 16876 9374 12145
14243 12145 20431 4778 285 14373 22772 12159 1122 7961 25784 38253 20860 11003 17747
14230 17747 5283 -1351 -14417 -8813 637 -3797 9700 12262 20995 9694 19144 26234 17903
14217 17903 17450 26929 28055 24335 36843 37329 14772 14458 16454 759 -3696 -2804 13166 31581
14203 31581 55429 51812 44922 24819 13897 13294 3806 20625 25142 31895 37059 32659 17440
14190 17440 8502 14224 27352 14357 1474 -4495 401 15468 20733 -2545 2874 5070 9787
14177 9787 11239 13195 19878 10351 7542 8642 8735 14678 12485 4497 14629 20874 31451 26705 20027
14162 20027 11168 4079 1251 13738 28699 31768 34925 34250 48326 46653 29224 10880 1876
14149A876l593k7452j691J2209K0668M187N391p399K138N503N31j7537k2526O201
14135b1494J0533J1347J1799r474j8132J0418k110n659j2157l041j539K669K0561
14122f279J7818o614k99p164j4474k529K401K4228J2838Q015l595L715J0053j2471
14108B5643J58J1874N644J4309k8399l0723L867P463K008l886K5914J3677j8291
14095B9258j0868J1614J1596L949o611o461j7279K0675K997k603j6759r973l370
14082F165J4775J8446P383k7088Q04J5747M395k4055j515o569j4777M262Q995
14069F968J5739p5K746j3128j0595j3336j3978o653J744M032J1777L311O639J9051
14055A4242j1884O578L151L271n350p762r064p685j22J6878P021j1523j2237j3501
$$ plain form
14149 1876 -1717 -29169 -30860 -18651 2017 6204 11595 4196 6334 11837 12368 -5169 -27695 -21494
14135 -21494 -10961 386 12185 2711 -15421 -5003 -7113 -12772 -24929 -27970 -29509 -26840 -6279
14122 -6279 11539 4925 4626 -2538 -17012 -19541 -17140 7088 19926 27941 24346 28061 38114 25643
14108 25643 25801 37675 43319 57628 29229 -1494 2373 9836 11844 7958 33872 47549 29258
14095 29258 18390 30004 41600 45549 38938 32477 15198 35873 38870 36267 19508 9535 6165
14082 6165 20940 39386 46769 19681 20485 36232 40627 16572 15057 8488 -6289 -2027 6968
14069 6968 22707 22632 25378 12250 1655 -11681 -25659 -32312 -30568 -26536 -14759 -11448 -4809 14242
14055 14242 2358 8936 12087 15358 10008 2246 -6818 -14503 -14625 2253 9274 -2249 -14486 -27987
14041b7987P080k262K954J7902m474k977m395l892J3078J0195l173R101J8222
14028B9372j0144j7947K1844J5978j8865p945K028j8282j866J4978J0298j2720
14016F729n264P290m959j2723j3261L323Q801J6047P596L739L608m013j5883j0590
14002i560N596k923J631o198q062n522Q458J0724L178J2311L1771l731j3770j3350
13988A0553L842J5851J700o788n316o785N775J275o299p858j3012L268J2366M848
13974A3420M921j1263O367J3102m997J3911K1157j4799k3613N28j4554n111J6939
13961A6008j690O577l74l697P070M800l1873j6871L0j55J237K7029J9938j2445
13947A5584R601J3562N192k1542j5431p296J5134J6897J9144j9887l2216J3239
$$ plain form
14041 -27987 -20907 -23169 -20215 -2313 -6787 -9764 -14159 -18051 -4973 5222 2049 11150 29372
14028 29372 19228 1281 23125 39103 20238 12293 14321 -3961 -5827 9151 19449 6729
14016 6729 1465 8755 3796 -8927 -22188 -18865 -10064 5983 13579 17318 20926 16913 1030 -9560
14002 -9560 -3964 -6887 -5256 -11454 -19516 -25038 -16580 -5856 -2678 9633 41404 37673 23903 10553
13988 10553 14395 30246 31946 25158 19842 13057 18832 20107 13808 5950 -7062 -3794 8572 13420
13974 13420 18341 7078 13445 26547 21550 35461 56618 41819 18206 18734 4180 -931 16008
13961 16008 14318 20895 20521 16824 23894 28694 -3179 -20050 -20020 -20175 -18938 8091 28029 15584
13947 15584 25185 38747 43939 22397 6966 -330 14804 31701 50845 30958 -1258 11981
13935A1981J2266r338k8608l996J0186J6547M701j1725k338L6r575Q219R330j6382
13921h696Q769M177n79J5618R352k39K364j721l193j3517j7392N908o146K076
13907c219J8431M301j8728k108l964l305M226P815J9862j6991j6985K1593J1616
13894B2544j0212J10j2597J0082k964J1370j968n235L05j5525k333q432K895P129
13880d831Q434J5344J6118J2316o962j4928K840N063p355n088M523q34n648P715
13866B6707R804J7323j6828k4444j6825k351J462o895j2214R284Q685O5J4131
13853G904M790J5429p765k5775j9583L097M646J2635J4081K3191k047l324j645
13840B5634j224l404k373n719p564k0285k48J7597N04j609K131p890J1173M562
$$ plain form
13935 11981 24247 14909 -13699 -17695 -7509 9038 13739 2014 -324 -288 -9863 -1644 7686 -8696
13921 -8696 73 4250 3671 19289 28641 28402 30766 29045 25852 12335 -5057 851 -5295 -3219
13907 -3219 15212 19513 785 -1323 -5287 -8592 -4366 3449 23311 6320 -10665 10928 22544
13894 22544 12332 12442 -155 9927 6963 18333 16365 11130 11435 -4090 -6423 -14855 -11960 -4831
13880 -4831 3603 18947 35065 47381 40419 25491 28331 33394 26039 20951 25474 24640 18992 26707
13866 26707 36511 53834 37006 12562 -4263 -6614 -5152 -12047 -24261 -14977 -6292 -6227 7904
13853 7904 12694 28123 20358 -5417 -25000 -21903 -17257 -4622 9459 32650 30603 27279 25634
13840 25634 24410 21006 18633 12914 5350 -14935 -15183 2414 2918 1309 3440 -4450 6723 11285
13826A1285k2596J2188J4329J057k127J3352o782j9525k270K507l412J7557R31
13813A6494l467m842R810O715M397J0864o035l748n27j4676k526o183l081J030
13799D225k850o322r627k09M474P650J181K338R46j1268n582P466L725J0671J0350
13784A7168O513r297k107o402R773M068P531L13j8629j3104L904M874J0603P751
13770B2959J000j1858o010R623R565O952p28j2056j6399J0707O131J5117r555
13757B5448M243K134J3378j054j664m693N123k2699j3132L002j0988l607r161
13744a3670j949Q201J4345J4272j6342k2924l128P788Q199K1460P520q986j0972
13731C814J1676L486k13N41q328k069M946M629R806N957Q608j1441j5293O303
$$ plain form
13826 11285 -11311 877 15206 16263 14136 27488 20706 1181 -1089 1418 -1994 15563 16494
13813 16494 13027 8185 17995 24710 29107 39971 33936 30188 29661 14985 12459 6276 3195 4225
13799 4225 1375 -4947 -14574 -14783 -10309 -2659 -1478 860 1806 -9462 -15044 -7578 -3853 6818 17168
13784 17168 23681 14384 12277 5875 15648 19716 27247 27560 8931 -4173 -269 4605 15208 22959
13770 22959 23959 12101 6091 15714 25279 32231 31503 19447 3048 13755 19886 35003 25448
13757 25448 29691 31825 45203 44149 42485 37792 42915 20216 7084 10086 -902 -4509 -13670
13744 -13670 -15619 -7418 6927 21199 4857 -18067 -21195 -13407 -5208 16252 23772 14786 3814
13731 3814 15490 18976 18763 19304 10976 8907 13853 18482 28288 34245 42853 31412 16119 22422
13717B2422M819j1004p028q777N719K1660J6606j1997m448o211j9893j5900l910
13704a7942K0229K1501J3061k289L151R709j9050j894N43j5660K562N899k430
13691A7390j0810O376L04P365N095j6213R761j469n287M739n644j2794l07q65
13677b359J192L323L716R439Q66O677K9299J2459J6456J7800m401k6006J5694
13664H4155J9015J398q185j6779j55n997l2553L590R599r581p886p748J607K255
13650C2735o275o832r679o269q625K2378J0285R736k577P530k956j9993j5505
13637C953J5838N714J7419P054M860j3837J1598J3717K8640L1637K6732J4509
13625A67834J9100L1743J2517J0804p70k9378l4145l9098k2677j7036j2077m24
$$ plain form
13717 22422 27241 16237 9209 432 6151 27811 44417 32420 27972 21761 1868 -14032 -17942
13704 -17942 2287 23788 36849 34560 37711 47420 28370 26476 27019 11359 13921 19820 17390
13691 17390 6580 12956 13260 20625 25720 9507 19268 17799 12512 17251 11607 -1187 -1494 -2359
13677 -2359 -1167 2156 5872 15311 16177 22854 52153 64612 81068 98868 94467 68461 84155
13664 84155 103170 104568 96383 79604 79449 73452 40899 44489 54088 44507 36621 28873 30480 32735
13650 32735 26460 19628 9949 3680 -4945 17433 27718 37454 34877 42407 39451 19458 3953
13637 3953 19791 25505 42924 49978 54838 41001 52599 66316 94956 126593 153325 167834
13625 167834 186934 218677 231194 241998 241228 211850 177705 138607 115930 98894 86817 86393
13613H6393q872m101l0546J4243o177K714j097J643j3513r543O426P565j6474
13600B8661m715K915q8J6728m531k872r28P415p020p449l589Q307J0795L8560
13586H2189J5037P991J5115M105q389J064K0636J5153j3252j8275j0930j8600
13574I1844k2734o855l054j3804j4991r139m090N834J1786j6428j1519J955l276
13561E529q332k781K8406J5677j1403J0482J3694p037o345K1079J156j1476o97
13548D7952j143N392R130j7426k3332J1356J7553L188n960N28n667j3218n930
13535B2423j87J4412J5713j2139J380N738j423J970k320q504J8444P398j5450
13522D7455k4401j0697L478J5967O983j2211j0396J1181K8142m427j5001P040
$$ plain form
13613 86393 77521 73420 42874 57117 50940 53654 52557 54200 40687 31144 37570 45135 28661
13600 28661 23946 26861 26773 43501 38970 36098 35170 42585 35565 28116 24527 32834 43629 82189
13586 82189 97226 105217 120332 124437 116048 117112 137748 152901 139649 121374 110444 91844
13574 91844 69110 62255 59201 45397 30406 21267 17177 23011 34797 18369 6850 8805 5529
13561 5529 -2803 -5584 22822 38499 27096 37578 51272 44235 37890 58969 60125 48649 47952
13548 47952 46809 52201 61331 43905 20573 31929 49482 52670 46710 47238 41571 28353 22423
13535 22423 22236 36648 52361 40222 41602 47340 45917 47887 45567 37063 55507 62905 47455
13522 47455 23054 12357 15835 31802 38785 26574 16178 27359 55501 51074 36073 43113
13510D3113P520j2554n049K114K0161j0084m0500p276J5475J3875K0456K731p787
13497D2195k7059P20J4550J248j639L188O414O937O014P07n857o413j0959J5288
13483D5334O503n782K4537r73O675K4762O55j8143j4026r606J4624M418m102P262
13469H2138l388N776R85j7497j5375O525J392n934M020R138L191L201r412q12
13455F3948j1457k227J502j0252K697J6122p39j8218q772J067j064P905P0k635
13441C7947o593J7539P542L939K374j888j1628q179L899J0858j3801q778K2255
13428E5486P947L532P791p06j4505k3646j9704O201J8336K0791O337j0318J4701
13415G2243p253k883j708J2281n412k3486j8463K303J649J7422K3672j0823p140
$$ plain form
13510 43113 50633 38079 33030 35144 55305 45221 4721 -2555 12920 26795 47251 49982 42195
13497 42195 15136 15856 30406 31654 30015 33203 39617 46554 52568 53275 47418 41005 30046 45334
13483 45334 51837 46055 70592 69619 76294 101056 101711 83568 69542 59936 74560 78978 74876 82138
13469 82138 78750 84526 85511 68014 52639 59164 60556 54622 58642 67780 70971 74172 64760 63948
13455 63948 52491 50264 51766 41514 44211 60333 59594 41376 32604 33671 32607 40512 40582 37947
13441 37947 31354 48893 56435 60374 62748 60860 49232 41053 44952 55810 42009 33231 55486
13428 55486 63433 66965 74756 74050 59545 35899 16195 22396 40732 61523 67860 57542 72243
13415 72243 64990 62107 60399 72680 67268 43782 25319 27622 29271 46693 70365 59542 52402
13402E2402R916Q640j5138j5936k980J750p64k064M762O263j122m941J4414J0981
13388F6183m990j0641J2734n527m853R453J1909j4787j8834J0609K0635K976m125
13375G0742M743k690J5920L00k3629l154n247K771M563J0210k84k3681j431Q036
13361E7169L785j355j0828m950R889Q854L696j2693r83O38Q313J2708j7963J4624
13347G0904J1133j0134L583r98n792K319R050o184m981J874n340j1572M056J6694
13333G4612m359j2622K862M7o881k283q942Q554J6797K8876j1459R73J4892N23
13319A01590j5032r344o688r961J0515J2267k633J2168J1774K3268l150j7638
13307A07136r946K5546L6291J6446K388N933j2830k8624o506P975J9806L569p537
$$ plain form
13402 52402 62318 70958 55820 39884 36904 38654 37890 35826 40588 46851 45729 40788 55202 66183
13388 66183 61193 50552 63286 57759 52906 62359 74268 59481 40647 51256 71891 74867 70742
13375 70742 75485 72795 88715 89015 65386 62232 56985 59756 64319 74529 74245 50564 49133 57169
13361 57169 60954 59599 48771 43821 53710 62564 66260 53567 52584 53222 61535 74243 56280 70904
13347 70904 82037 71903 75486 74488 68696 71015 80065 73881 68900 70774 65434 53862 57918 74612
13333 74612 70253 57631 60493 60540 53659 51376 42434 50988 67785 96661 85202 86175 101067 101590
13319 101590 86558 77214 70526 60565 71080 83347 80714 92882 104656 127924 124774 107136
13307 107136 97190 122736 159027 175473 177861 183794 170964 142340 135834 143809 163615 167184 159647
13294A59647m618j2706o867J4388J5646k85n382J4P370L662N764N685R782N703
13280A97803j1123j3648J1984p788L5360K4613J3492J1428o759k027K890m782
13268B51443P297K075o597J1264J8829J3275j6358k1595J3492R904m193L211J9919
13255C01966K4707n992n764P168J448j2965j6281J0111K4547L524j9664q795o148
13242B97862j579j8048j3917Q821L454J0358L436r460k5426k3706N628J2026J4186
13229B63635j3666r540N754q994j2479j7994j9383K1417K4634K077j7534j9013
13217A98914Q557O860L545P691J0537n760J5608j4261J27l635j2048J798m933
13204B13000n089L036l604k5297j2674j2683m394m343j0652j7455j0265k120L89
$$ plain form
13294 159647 155029 142323 135456 149844 165490 165205 159823 159837 167207 170869 176633 182318 192100 197803
13280 197803 186680 173032 185016 177228 212588 237201 250693 262121 255362 253335 256225 251443
13268 251443 258740 260815 254218 265482 284311 297586 281228 259633 273125 283029 278836 282047 301966
13255 301966 326673 320681 314917 322085 323533 310568 294287 304398 328945 332469 312805 304010 297862
13242 297862 296283 278235 264318 273139 276593 286951 290387 280927 255501 231795 237423 249449 263635
13229 263635 249969 240429 246183 237189 224710 206716 187333 208750 233384 235461 217927 198914
13217 198914 207471 214331 217876 225567 236104 230344 245952 231691 231818 228183 216135 217933 213000
13204 213000 207911 210947 207343 182046 169372 156689 152295 147952 137300 119845 109580 107460 107849
13191A07849j638j0381M519N856J2533P392o138p549j2052n033k0772j9495q027
13178D7064K3846P565r136j6161J1303J1271Q06J9198J8168Q849n324j067k6797
13165H9585k4585p080J827L744Q135n485P540m449j0377j7329J83J5592J1666
13152F8967m196Q578Q068k050j6695k5358K132K4105K9258k645q519P362L379
13139I2386l112l867n86o370j0745O438J437R6P79k993m026m493N808R167J8734
13124I8653Q147m361n796q282J9123j743k1825J595O247K1848N382r506j6058
13111I3424O84J0755J0325q640L886J3147k88k440j7654j4195Q243L616K0058
13098A20921J1094j3943J720J1443P258O247j3013J1280J424j0920M363J5229
$$ plain form
13191 107849 106211 95830 100349 106205 118738 126130 119992 112443 100391 95358 74586 55091 47064
13178 47064 70910 78475 69339 53178 64481 75752 76558 95756 113924 122773 117449 116382 89585
13165 89585 65000 57920 59747 63491 71626 66141 73681 69232 58855 41526 41709 57301 68967
13152 68967 64771 73349 81417 79367 62672 37314 39446 63551 92809 90164 81645 89007 92386
13139 92386 89274 85407 84821 78451 67706 74144 75581 75677 76456 73463 69437 64944 70752 79919 98653
13124 98653 106800 102439 96643 88361 107484 105741 83916 85511 91758 113606 118988 109482 93424
13111 93424 94108 104863 115188 106548 110434 123581 123293 120853 103199 89004 97247 100863 120921
13098 120921 132015 118072 119792 131235 138493 144740 131727 143007 144431 133511 137874 153103
13086A53103p170m713O74n95J699j1493l781N522K417J825M578O668N956J0315
13072A65005n02P241Q156O69o63n66q73j064j7821L225J4261J644K3093J3695
13058B15500j6505M415P326o589n740j2521J1579o405o378o86k29Q957P383j118
13044A98989l690j5068R552J5594p554J6236J955k555q652n6J001J3076J6108
13031B34936K53r387K903k758j5822N631p593k8318k886j1059P741J6056j7855
13018A71842J5423J7165p353o022J2934J2344K0327J8079M262j9321k2469p155
13006B10056q730R399J0594n434o608k520O777J37o351J2780m038j7630j483L0017
12992B26966r954l478o423R705J0095J6039J7446j070l722k2557J018Q261N351
$$ plain form
13086 153103 145933 141220 141894 141299 142998 131505 127724 133246 135663 137488 142066 148734 154690 165005
13072 165005 164503 171744 179900 180569 179906 179340 178467 177403 159582 162807 177068 178712 201805 215500
13058 215500 198995 203410 210736 204147 198407 185886 197465 191060 184682 183996 183767 192724 200107 198989
13044 198989 195299 180231 189783 205377 197823 214059 216014 213459 204807 204751 205752 218828 234936
13031 234936 235189 225802 228705 225947 210125 215756 208163 179845 176959 165900 173641 189697 171842
13018 171842 187265 204430 197077 191055 203989 216333 236660 254739 259001 239680 217211 210056
13006 210056 201326 210725 221319 215885 209277 206757 213534 213671 207320 220100 216062 198432 196949 226966
12992 226966 217012 213534 207111 216816 226911 242950 260396 259326 255604 233047 234065 242326 247677
12979B47677J4091j789K966k34P04P155J1332J2598J573J1179m65j531K1096J9760
12965C46112l242r70M152j5432p270q740n30J272K4468L949j7618K568j3299O645
12951C22065j250R15O81J8778K6450n552l1049k0672J3512M4440J1408j3223l501
12938C63002K1147J3235P150N270n106m94J5712J1747N53r383R711R924j586P93
12924D41675J1877m710M996J3238K4183L3661J6159j5481n238O790J0074J0068
12912E47292o169o814K0211L7418K4458N438J4979L4423Q436M919J1407J0033
12900G06031K3357R791J6262L3685M6292L2844M3011M2874L6866M2128M3086M4161
12888A120388M6227O0120P0512P8924P7207Q6243R6127J03922J07865J22998J34272
$$ plain form
12979 247677 261768 259979 262945 262711 263415 270570 281902 294500 296073 307252 306787 305256 326352 346112
12965 346112 342870 341900 346052 330620 323350 314610 314080 315352 339820 343769 326151 328719 315420 322065
12951 322065 320815 321730 322411 341189 367639 362087 331038 310366 323878 368318 379726 366503 363002
12938 363002 384149 397384 404534 409804 404698 404204 419916 431663 432216 422833 432544 442468 440882 441675
12924 441675 453552 448842 453838 467076 491259 524920 541079 525598 520360 527150 537224 547292
12912 547292 541123 534309 554520 591938 616396 621834 636813 671236 679672 684591 695998 706031
12900 706031 729388 739179 755441 789126 835418 868262 911273 954147 991013 1033141 1076227 1120388
12888 1120388 1166615 1226735 1297247 1376171 1453378 1539621 1635748 1739670 1847535 1970533 2104805
12877B104805J56974J69389J84727K27986K43508K43068K74876L39411L90592
12868D335336M22099M12568M87320N51767N94648O53886O92751P44876P69049
12859I664300P99464P82343P56179P45484P02980O62167O07335N67057M78071
12850A5765380L95596L66630L25110L00513K66502K41629K58508L00602L31434
12841A8551904L71801M01936M51595M77342N43407O12145O81813P32043P64303
12832B3588289Q04512Q49512R08740R25241R63777R77938R54357R30860Q95932
12823C1799158Q73235Q23421P51489O63316N51986M71065L63585K75589J91999
12814C6764843R9368K7796m2052j04295j24621j25235j24273r5964m8506O829
$$ plain form
12877 2104805 2261779 2431168 2615895 2843881 3087389 3330457 3605333 3944744 4335336
12868 4335336 4757435 5170003 5657323 6209090 6803738 7457624 8150375 8895251 9664300
12859 9664300 10463764 11246107 12002286 12747770 13450750 14112917 14720252 15287309 15765380
12850 15765380 16160976 16527606 16852716 17153229 17419731 17661360 17919868 18220470 18551904
12841 18551904 18923705 19325641 19777236 20254578 20797985 21410130 22091943 22823986 23588289
12832 23588289 24392801 25242313 26151053 27076294 28040071 29018009 29972366 30903226 31799158
12823 31799158 32672393 33495814 34247303 34910619 35462605 35933670 36297255 36572844 36764843
12814 36764843 36864211 36892007 36849955 36745660 36621039 36495804 36371531 36275567 36227061 36233890
12804C6233890N9645J22480J90870K58632L06961L64894L89649M07076M13769
12795C8747866L99295L66661K92011K07665J07688J4637o2177k07306l39492m27613
12785C9099235n20215n92420o75948p40965p62395q05388q27094q59076q83405
12776C2432329q50971q28277p91037p62902o83988o17052n75863n15190m64383
12767B6342666m29865l42461k98901k76434k48277k10648j91846k21477k49879
12758B3872878k46782k82602l44606m14755m97379n56610o71904p28985q08985
12749A9320270q46476r02096r08721q96462q88150q76314q42902p90360p54580
12740A1614209o90564o45280n91066n57294m94482m27608m13869m02983l55162
$$ plain form
12804 36233890 36293535 36416015 36606885 36865517 37172478 37537372 37927021 38334097 38747866
12795 38747866 39147161 39513822 39805833 40013498 40121186 40135823 40073646 39866340 39526848 39099235
12785 39099235 38579020 37986600 37310652 36569687 35807292 35001904 34174810 33315734 32432329
12776 32432329 31581358 30753081 29962044 29199142 28515154 27898102 27322239 26807049 26342666
12767 26342666 25912801 25570340 25271439 24995005 24746728 24536080 24344234 24122757 23872878
12758 23872878 23626096 23343494 22998888 22584133 22086754 21530144 20858240 20129255 19320270
12749 19320270 18473794 17571698 16662977 15766515 14878365 14002051 13159149 12368789 11614209
12740 11614209 10923645 10278365 9687299 9130005 8635523 8207915 7794046 7391063 7035901
12731G035901l47361l25037k92190k91887k74603k32118k16939k04167j85591
12722D666008j62500j52908j80850j67069j37313j21996j49100j51101j11129
12713C332042r2380j07109j11968q5621p7536r2055o3713o2322r7996p8241p4155
12702B388946p3207o6560o7048q2675q2690n4822m5597m8525n0513m4794m9165
12691A723350m7453n5020l6478n3527l2785k0873m0901l8814k1028m3004m4954
12680A288513l8266l5071l2539l3934k5149q628j3309k4187k9314l3959j6173
12669I97984l7515k1438q03j7945j7980l2802k8482j7795o380r889j5979q916
12657G82060k3419k2026n860p477k1210r394j7628j7603M732L418k3912k0861
$$ plain form
12731 7035901 6688540 6363503 6071313 5779426 5504823 5272705 5055766 4851599 4666008
12722 4666008 4503508 4350600 4169750 4002681 3865368 3743372 3594272 3443171 3332042
12713 3332042 3239662 3132553 3020585 2934964 2857428 2765373 2701660 2639338 2541342 2463101 2388946
12702 2388946 2315739 2249179 2182131 2099456 2016766 1961944 1916347 1867822 1817309 1772515 1723350
12691 1723350 1675897 1620877 1584399 1530872 1498087 1477214 1436313 1397499 1376471 1333467 1288513
12680 1288513 1250247 1215176 1182637 1148703 1123554 1114926 1101617 1077430 1048116 1014157 997984
12669 997984 960469 939031 938228 920283 902303 869501 841019 823224 816844 806955 790976 782060
12657 782060 758641 736615 730755 723278 702068 692674 675046 657443 662175 665593 641681 620820
12645F20820r708k9468m6896j8673K5280j4272k2091l936kJ557j0122k5310l864
12632D63315M602J0800n103p879o537j6393k307q456k26j6530l1391K264J3889
12619D00048l751p128j4539k227j3239j1079k599j4128o396o91j0002j4148J0238
12606C10359n907j3152J1467L634P983R026j1855j9084q377j695M951j866J3169
12593B98653M398j8483l822J037m787P310J9451R900J4474l70n353l610L823K0119
12579C42740J4961L540K2040K1362J7836L3642M3803L1328L6737K9105M7178K9532
12567F73804J6887k7848n6328l6269j8879k1683m6523m4412k7503l5886m0255
12556C35105m4962k5626j1915p61K142J5027J1378r371j0444p273j0306l0215
$$ plain form
12645 620820 611112 581644 534748 516075 541355 527083 504992 501056 501054 502611 492489 467179 463315
12632 463315 467917 478717 473614 465735 459198 442805 440498 432042 431816 415286 383895 386159 400048
12619 400048 396297 389169 374630 372403 359164 348085 345486 331358 324962 324271 314269 300121 310359
12606 310359 304452 291300 302767 306401 314384 323410 311555 292471 284094 282399 287350 285484 298653
12593 298653 303051 284568 280746 281783 276996 284306 303757 313657 328131 327761 322408 318798 322621 342740
12579 342740 357701 361241 383281 404643 422479 456121 499924 531252 567989 597094 644272 673804
12567 673804 690691 662843 606515 570246 551367 529684 483161 438749 411246 375360 335105
12556 335105 290143 264517 252602 251841 253983 269010 280388 271017 260573 253300 242994 212779
12544B12779o809J8988K782j2139j4240N619Q899n29j1411o804k256j6344J9090
12531A97625J1337m674j3259j7890o761n457q387P30J6279j691J8494n683r749
12518A70914j1668R096o277j6954J1148J2993l162n380K383k069q618j0484m290
12505A37632Q337O36L738j5282p595R346M662L473J3394j5332o95m891j0872O620
12491A33171O276p575j3854J743l284O403O835j1560k7663K759J3326K87N738
12478A12602M18j046p59j6915N077P097N986R822l077j3290j2943P323j563J5333
12464A14065p923j269J9142J721k2000J3237J7481Q724k0775k4661k59K0955R627
12451A28065J0883l407j546m443j1501q439K46M49m321j281m152R377P604o647
$$ plain form
12544 212779 205970 224958 227740 215601 201361 206980 215879 215350 203939 197135 194879 178535 197625
12531 197625 208962 204288 191029 173139 166378 160921 152534 153264 169543 167852 186346 180663 170914
12518 170914 159246 168342 162065 145111 156259 169252 166090 160710 163093 161024 152406 141922 137632
12505 137632 145969 146605 150343 135061 127466 136812 141474 144947 158341 143009 142314 137423 126551 133171
12491 133171 139447 131872 118018 119761 116477 122880 129715 118155 90492 93251 106577 106864 112602
12478 112602 113020 111974 111215 94300 99377 106474 112460 122282 119205 105915 92972 100295 98732 114065
12464 114065 106142 104873 124015 125736 103736 116973 134454 143178 122403 97742 97483 118438 128065
12451 128065 138948 135541 133995 129552 118051 109612 109858 110307 105986 104705 100553 109930 117534 110887
12437A10887o443J2284Q996J0944J4825J0600k6203k6793O064K0926M407j293
12425A39201K66L742j1523j305R769O06P602n816o216j5384o953Q727N720J2700
12411A41136J1789J598j2873M47J0951J4901Q453N967J842j3131j3946j1773L1851
12398A77212K6372j5753j4202K1694M169j2173j666K8989J7201n024J1815J9737
12386B58371k1281j1039L239j498N215K717k400p388k808Q563k103j2241L227
12373B20574J3048K2533p74K122J681J1189N828J100L192P172Q785j880J0412
12360C04982K3835j143o817r490J4546J3942n101k3050o750j2159J3864N155r716
12347C02098k15P19p139K956K0462J5796R766R848J628j2845N909J867p599N944
$$ plain form
12437 110887 104444 116728 125724 136668 151493 162093 135890 109097 115161 136087 140494 139201
12425 139201 139467 143209 131686 130381 140150 140756 148358 142542 136326 120942 113989 122716 128436 141136
12411 141136 152925 154523 141650 142097 153048 167949 176402 182369 184211 171080 157134 145361 177212
12398 177212 203584 187831 173629 195323 199492 187319 185653 214642 231843 226819 238634 258371
12386 258371 237090 226051 229290 227792 233007 235724 233324 225936 223128 231691 229588 217347 220574
12373 220574 233622 256155 255381 257503 259184 270373 276201 277301 280493 287665 296450 294570 304982
12360 304982 328817 327674 320857 311367 325913 339855 334754 311704 304954 292795 306659 311814 302098
12347 302098 301883 302602 295463 298419 318881 334677 344443 354291 355919 343074 348983 350850 343251 349195
12333C49195J7874n035j4980j6726J3131j650q53o128l563n040r79K079o186j2937
12319C08202m445j40J8436j1254j544M931J0628j1913j3464N090R965k7673J331
12306B88150L288j9173j8297M503Q258n351P811K6916q356J0585P247k7599p346
12293B70636l438q421r731M979O75J0634o360n25k243r12N741R562k3635j9384
12279B27578n876j2026J8617K7291j488k2453J131J3398k0901j4373J707L620
12267B16225L550J2137Q205M470O569j4581L427J140j0003O20M185j562k507k8761
12253B03114l275L553J5149N113L182M67M350m822J0737J8650J0597M570J1369
12240B82754r895o720r98j4756J0975J876r092k302j7487Q269K5749Q825o669
$$ plain form
12333 349195 367069 362034 347054 330328 343459 341809 340956 334828 331265 326225 325246 327325 321139 308202
12319 308202 303757 303617 322053 310799 309255 314186 324814 312901 299437 304527 314492 286819 288150
12306 288150 291438 272265 253968 258471 266729 261378 269189 296105 287749 298334 305581 277982 270636
12293 270636 267198 258777 249046 254025 254700 265334 258974 258449 256206 255294 261035 270597 246962 227578
12279 227578 221702 209676 228293 255584 254096 231643 232774 246172 225271 210898 212605 216225
12267 216225 219775 231912 240117 244587 251156 236575 240002 241142 231139 231759 235944 234382 231875 203114
12253 203114 199839 203392 218541 223654 226836 227303 231653 226831 237568 256218 266815 271385 282754
12240 282754 272859 266139 265141 250385 261360 263236 254144 251842 234355 242624 268373 277198 270529
12227B70529p347q364r135J2834J4918k763q643K042j0281R054J8682N849J5915
12214C03290J6148M492j3293L946K245Q686J6149r79J1957m409l117l911r868
12201C31336j1457J0710K4779j230k087j3886n868K2974K9223j3089L997K5261
12189D00663L0277q78N861L330n993r818P168J7204j302N860J5410r238M079K50
12175D62873J5386J3050J028j0913J3936M0698R012J4036J9255J1672J4460j2021
12163E92472Q606J3286J4533J3562Q440j533J7051O487J5265K7175J3654J3232
12151G42230K2922J1943J2136Q200N555J9431J2283J8898J1852J2629K6388J2323
12139I16790J6034L7602K1117J2712J8914K4099R799K8832K7829K5410L0356L2973
$$ plain form
12227 270529 263182 254818 245683 258517 273435 270672 262029 264071 253790 262844 281526 287375 303290
12214 303290 319438 323930 310637 314583 316828 325514 341663 340684 352641 348232 345115 341204 331336
12201 331336 319879 330589 355368 354138 352051 338165 332297 355271 384494 371405 375402 400663
12189 400663 430940 430062 435923 439253 433260 423442 430610 447814 446512 452372 467782 458544 462623 462873
12175 462873 478259 491309 492337 481424 495360 536058 545070 559106 578361 590033 604493 592472
12163 592472 601078 614364 628897 642459 650899 649366 666417 672904 688169 715344 728998 742230
12151 742230 765152 777095 789231 797431 802986 822417 834700 853598 865450 878079 904467 916790
12139 916790 932824 970426 991543 1004255 1023169 1047268 1057067 1085899 1113728 1139138 1169494 1202467
12127A202467M7890L4814K6712L3465L8157M4411O0313M7475K6063L8880P1471
12116A672118P0580O4451N8220N8545N6867O7113R7891R9192Q5155Q4724R6062
12105B510918Q9917Q9441J27231J27472J31882J44331J59395J27919J47308K04153
12095C859967K11809K00178K31475K25722K38265K64710K74108K89451K93847
12086F089532L23426L33472L20583L35395L73468L59850L49609L73794L50260
12077I209389L32296L44600L25645L06980L08860K97484K88995K66494K33294
12068A1914037K17881K30933K02221J76896J79601J85969J82458K11271K20756
12059A3722023K35990K35668K57683K79172K84097K94908L18054L55518L93380
$$ plain form
12127 1202467 1250357 1285171 1311883 1345348 1383505 1427916 1488229 1535704 1561767 1600647 1672118
12116 1672118 1742698 1807149 1865369 1923914 1980781 2047894 2145785 2244977 2330132 2414856 2510918
12105 2510918 2600835 2690276 2817507 2944979 3076861 3221192 3380587 3508506 3655814 3859967
12095 3859967 4071776 4271954 4503429 4729151 4967416 5232126 5506234 5795685 6089532
12086 6089532 6412958 6746430 7067013 7402408 7775876 8135726 8485335 8859129 9209389
12077 9209389 9541685 9886285 10211930 10518910 10827770 11125254 11414249 11680743 11914037
12068 11914037 12131918 12362851 12565072 12741968 12921569 13107538 13289996 13501267 13722023
12059 13722023 13958013 14193681 14451364 14730536 15014633 15309541 15627595 15983113 16376493
12050A6376493M10069M27714M24916M29851M31252M18164M01646L74960L43287
12041B0038352L11694K58372K14135J45406N2164l0639j00936j66716k24859k57498
12031B0239475l11789l51273l90015m13366m28270m47200m57876m21972l99700
12022A6618014l88062l81762l44438l53610l33150l29063k99889k64372k33513
12013A3690155k51185k30710k08833k08230k02247k03675j86908j79470j97397
12004A1821500k15983k19706k29481k22222k24773k27246k61687k73469k69990
11995I676943k74756k73051k69179k72223l02086k88263k65967k57954k84367
11986G189097k58686k50402k38693k41366k30501k14027k07354j94669j81891
$$ plain form
12050 16376493 16786562 17214276 17639192 18069043 18500295 18918459 19320105 19695065 20038352
12041 20038352 20350046 20608418 20822553 20967959 21020123 20989484 20888548 20721832 20496973 20239475
12031 20239475 19927686 19576413 19186398 18773032 18344762 17897562 17439686 17017714 16618014
12022 16618014 16229952 15848190 15503752 15150142 14816992 14487929 14188040 13923668 13690155
12013 13690155 13438970 13208260 12999427 12791197 12588950 12385275 12198367 12018897 11821500
12004 11821500 11605517 11385811 11156330 10934108 10709335 10482089 10220402 9946933 9676943
11995 9676943 9402187 9129136 8859957 8587734 8285648 7997385 7731418 7473464 7189097
11986 7189097 6930411 6680009 6441316 6199950 5969449 5755422 5548068 5353399 5171508
11977E171508j90654j91375j67201j72379j44737j39270j26550j28356j30276
11968C780710j34029j16825j15716j09952p4012q4020q1463p9510p5518r7647
11958B812018r5334r6628p4195o8541p0821p3613o8530o3705n4114l5261l8572
11947B072704n8159n6012n5075l7593p0142m2292k8733m2567n5445k4127k3123
11936A579436l1304l5866l5985l4066m9450o3404l8524k4750j0519l0142j1747
11925A213679k4631k6876l6751k0192k6784k4337k6840k4617l1591j4278k862
11914I53920j8908k4833j6101k0882k8805q735l2326l813O589j1510K779o59m644
11901G92072j1912k7342k4710k9939k9728j8380q432j1809k0447O704N102j0736
$$ plain form
11977 5171508 4980854 4789479 4622278 4449899 4305162 4165892 4039342 3910986 3780710
11968 3780710 3646681 3529856 3414140 3304188 3230176 3146156 3064693 2985183 2909665 2812018
11958 2812018 2716684 2620056 2545861 2477320 2406499 2332886 2264356 2200651 2146537 2111276 2072704
11947 2072704 2014545 1958533 1903458 1865865 1795723 1753431 1724698 1682131 1626686 1602559 1579436
11936 1579436 1548132 1512266 1476281 1442215 1392765 1329361 1290837 1266087 1255568 1225426 1213679
11925 1213679 1189048 1162172 1125421 1105229 1078445 1054108 1027268 1002651 971060 956782 953920
11914 953920 935012 910179 894078 873196 844391 835656 803330 799517 806106 794596 797375 796716 792072
11901 792072 780160 752818 728108 698169 668441 650061 641629 629820 609373 616077 621179 610443
11889F10443j6179n414j2094K135j3913j0332j6235m207J050Q28q13k6040r504
11876D99725J0068j278j8119j9629j5986m067M881l027O523q216j4336j1597j9630
11863D05312j6001P679R522k159j2592p244L529m736o893k9558J2684O259k490
11850C63312m75k988q379k0285j5428J3185q14j4716R459K6245J301q020l5665
11837C06732j6520k378Q328q351m443r188j0485J6196K2611j926k8828k178R066
11824B78636J1669p970O05m714l174j2003j5345p357L35l839P646J6027K0310
11811B80826p760k162J0009O031j5635j6673j5828j0575Q351q238N397r391j0354
11798B13998j167J8090R481m45n285l246l290m390R923j0476j4776o264o713K5984
$$ plain form
11889 610443 594264 588850 576756 578891 564978 554646 538411 534204 535254 536082 535269 509229 499725
11876 499725 509793 508515 490396 470767 454781 450714 455595 452568 459091 450875 436539 424942 405312
11863 405312 389311 396990 406512 404353 391761 384517 388046 383310 376417 346859 359543 365802 363312
11850 363312 362837 359849 351470 331185 315757 328942 328128 313412 322871 349116 350417 342397 306732
11837 306732 290212 287834 296162 287811 283368 274180 263695 279891 302502 300576 271748 269570 278636
11824 278636 290305 282335 282940 278226 275052 263049 247704 240347 240682 236843 244489 260516 280826
11811 280826 273066 270904 280913 286944 271309 254636 238808 228233 236584 228346 233743 224352 213998
11798 213998 212831 230921 240402 239957 234672 231426 228136 223746 233669 223193 208417 202153 195440 221424
11784B21424O367k2894n911O619n631J0592K0467L850o184r579p274J6k882j9617
11770A89363M963l453p105L035J0430J655L06p053n198Q003n899p580k1030K456
11756A62893L5600j876k0633j0717r240o756J6169R383j784P812R893N330J0730
11743B06804m040j2291Q148r11P25J6570J1601m078j2932j9622k3995j2343R860
11730A63496J0258K4276J3033k619l4464m261N068k1824J821k247p656J2312J6144
11717A73337O604M430j023k845N455P901j1671l662P484N335q303J4905M2181
11704B40128K2686J0296K7705M9398J8426L22J9035K1672n617k6033r171J7395
11692C86242j3318k7503j3677j6852q719n373k1642l7758j8041j1614J1885k411
$$ plain form
11784 221424 227791 204897 198986 205605 199974 210566 231033 234883 228699 219120 211846 211862 208980 189363
11770 189363 194326 190873 183768 186803 197233 198888 199194 192141 186943 194946 189047 181467 160437 162893
11756 162893 198493 196617 175984 165267 156027 149271 165440 174823 173039 180851 190744 196074 206804
11743 206804 202764 190473 198621 197710 198435 215005 226606 222528 209596 189974 165979 153636 163496
11730 163496 173754 198030 211063 208444 173980 169719 174787 152963 154784 152537 144881 157193 173337
11717 173337 179941 184371 183348 180503 185958 193859 182188 178526 186010 191345 183042 197947 240128
11704 240128 262814 273110 300815 350213 368639 368961 387996 409668 404051 378018 368847 386242
11692 386242 372924 345421 331744 314892 306173 300800 279158 241400 223359 211745 223630 221219
11680B21219k2829j2671O25M11R064J5518J6199j2983k335K4584K7707L6267L9308
11667C40084L8249K1859M2008M0306N3911M8129J7818J6774Q812r084k1161n8712
11655E38993m9331k2792k6242k8179n4635l6954j4429n209j3067p940k1412p425
11643B51378l464K853o086m236j1652R858j1782l252J370J7448K5383J4761K3916
11630C06495J2764K8810L1206J0149K1283L975J8834m746j7246k5636m233O559
11618C88214j9345k9636l0770k6470n269J09p294K193j18l6075k6823q311J3631
11605B14036J3336p627l82k076o28l608j4164m754n032j0952o706n044m619K326
11591A64106r577o01P477j2185k711J2246J5505P697o036r034K345R93K3117m833
$$ plain form
11680 221219 198390 185719 186344 186755 195819 211337 227536 214553 212218 236802 264509 300776 340084
11667 340084 378333 400192 442200 482506 536417 584546 602364 619138 627950 618866 597705 538993
11655 538993 489662 466870 440628 412449 357814 320860 306431 301222 288155 280215 258803 251378
11643 251378 247914 250767 244681 240445 228793 238651 226869 223617 224987 242435 267818 282579 306495
11630 306495 319259 348069 379275 389424 410707 414682 433516 428770 411524 385888 381655 388214
11618 388214 368869 339233 308463 281993 276724 276833 269539 271732 271614 235539 208716 200405 214036
11605 214036 227372 219745 219363 217287 216659 213051 198887 194133 189101 178149 171443 166399 161780 164106
11591 164106 154529 153928 161405 149220 146509 158755 174260 181957 175921 166887 169232 170225 193342 188509
11577A88509j9926n18R806L4770k637j3140j044P384k813Q752k0297k1683O698
11564A73861J2529j397j8208r286J6837J4502O625n366R606K5749K345k3528j0308
11551A93961L840m826J0104J0960n194k5019j3065j870R558K1283l487l22j0262
11538A85661k4571J4094P770P336o647o485m528k155R484j517n405K4341J9816
11525B17194m824j116K717R396K5030O68l10J4223j274L240J2783q353l750K162
11511B67786J3581j9640k6925J6887L8042L813j3562j1518P681L288P252j2271
11499B74414j851J8312R674l827j4256o469k5748o953Q057J0956J7526n035j9005
11486B55795J1804K190J0516K7005J0840j8314m963J7313J723o177J3895O173
$$ plain form
11577 188509 168583 168065 177871 212641 210004 196864 195820 203204 200391 209143 188846 167163 173861
11564 173861 186390 184993 166785 157499 174336 188838 195463 190097 199703 225452 227797 204269 193961
11551 193961 197801 192975 203079 214039 208845 183826 170761 168891 178449 199732 196245 195923 185661
11538 185661 161090 175184 182954 190290 183643 177158 172630 170475 179959 178442 173037 197378 217194
11525 217194 212370 211254 213971 223367 248397 249065 248755 262978 261704 264944 277727 269374 265624 267786
11511 267786 281367 261727 234802 251689 289731 293544 279982 268464 276145 279433 286685 274414
11499 274414 272563 290875 300549 296722 282466 275997 250249 243296 251353 262309 279835 274800 255795
11486 255795 267599 269789 280305 307310 318150 299836 294873 312186 313909 307732 321627 327800
11474C27800j424j4962l7923j7841R997M327n988J6294J0744L383O963K1406M4529
11461C67305r431l373L9508K5056K6066M080q391l940M581P44j8049k9157l1305
11448C63694j8158j8090l10N917R459J3515N769P49J0689m182j7918J3961L342
11435C68437q057m151l599j7051M878J9130L733Q261N062q748k1929K7639L8934
11422D12539K4611R43J6132J1478J4507j1169K874J5372k286J5458k2706l2877
11410D44876m551L604J3975J44l442r90J0207M90M210K187J4060j120k156m53
11396D81041K3903m708p539J348K4869N238l59J3563j79l721N957O039L707n640
11382E43519k2380j224j3294K0967J2431J1854K1235J2564j2226o281J4597J7067
$$ plain form
11474 327800 326376 311414 273491 255650 265647 269974 263986 280280 291024 294407 301370 322776 367305
11461 367305 357874 354501 394009 419065 445131 449211 440820 436880 441461 442205 424156 394999 363694
11448 363694 345536 327446 327136 333053 342512 356027 361796 362545 373234 369052 351134 365095 368437
11435 368437 360380 356229 352630 335579 340457 359587 363320 371581 376643 367895 345966 373605 412539
11422 412539 437150 438093 454225 465703 480210 469041 471915 487287 485001 500459 477753 444876
11410 444876 440325 443929 457904 458048 454606 453616 463823 464313 468523 470710 484770 483650 481494 481041
11396 481041 504944 500236 492697 494045 518914 524152 523793 537356 537177 533456 539413 545452 549159 543519
11382 543519 521139 519915 506621 527588 540019 551873 573108 585672 573446 567165 581762 598829
11370E98829j725P084K1115o983Q746K1412J1617J9223L6129J7815r625K2169
11358G45806k529o259J6392J3026J1357K9319K3223Q65J1447J3020K661J6384
11346H74712m902J9790Q490L452J3901J6028J7649J7651J6471L9106K2199K3066
11334A067613M7159K3056L9142L8952K6778L7176N2670O7010O1683O7395N9735
11323A588369P7943J18195J11803J54374J78823J67170K02200K47651L07129L26931
11313C480588L24894L63551M61226N72324O92261Q84372J175459J644956K390381
11304A1990012L388705M444819N041052M834333M343542M298670M751396N029546
11296D8122075L663251L66273k387754k942035k290200j891963l006502n043577
$$ plain form
11370 598829 597104 604188 625303 618320 627066 648478 660095 679318 715447 733262 723637 745806
11358 745806 743277 737018 753410 766436 777793 807112 830335 831200 842647 855667 858328 874712
11346 874712 869810 889600 898090 901542 915443 931471 949120 966771 983242 1022348 1044547 1067613
11334 1067613 1114772 1137828 1176970 1215922 1242700 1279876 1332546 1399556 1461239 1528634 1588369
11323 1588369 1666312 1784507 1896310 2050684 2229507 2396677 2598877 2846528 3153657 3480588
11313 3480588 3805482 4169033 4630259 5202583 5894844 6779216 7954675 9599631 11990012
11304 11990012 15378717 19823536 24864588 29698921 34042463 38341133 43092529 48122075
11296 48122075 51785326 52151599 49763845 46821810 44531610 42639647 39633145 34589568
11288C4589568n888405m989354l581370k425812j647595j167535r01096o52526
11280A3335875m19507k28239j1726J60904L05007M38256O17567R48607J413978
11271A6560722K098975L003386M044909M998469N900752P024628Q097033Q739502
11263F0468376Q576781P139789N435153M583557L484106J187916k126345n468798
11255H3280535o864768o600220o762435p603176q343702q089674o589762m759442
11247B7667356l306304k313798j698223j273771r51470p41550n63627m47858k74306
11238A6096449j10448O1330K34422M28010O97690J156759J876160K824776L700568
11229B6965716M082592L828459L424123L379610L716961L830675K491466m48162
$$ plain form
11288 34589568 28701163 23711809 20130439 17704627 16057032 14889497 13988401 13335875
11280 13335875 12916368 12688129 12676403 12837307 13142314 13580570 14198137 15146744 16560722
11271 16560722 18659697 21663083 25707992 30706461 36607213 43631841 51728874 60468376
11263 60468376 69045157 76184946 81620099 86203656 89687762 90875678 88749333 83280535
11255 83280535 76415767 69815547 63053112 55449936 47106234 39016560 32426798 27667356
11247 27667356 24361052 22047254 20349031 19075260 18123790 17382240 16818613 16370755 16096449
11238 16096449 15986001 16047331 16281753 16709763 17407453 18564212 20440372 23265148 26965716
11229 26965716 31048308 34876767 38300890 41680500 45397461 49228136 51719602 51271440
11221E1271440k825520l278366k650252k320928l270441m961735n580876m714259
11213B1669063l433380k396178j704480j285495j005452q17112o80342n92300
11205I754324n25053m68672m31816m06960l64250l44410l51589l20528k75754
11196F265292k78532k64881k37007k08821k15625k14450k03834j83655j69064
11187D289423j69813j47749j31408j26188j22438j13053j07518j10515q5082p8815
11177C096844j04274r2309p6580q0457o3068p4352q1726q8539n9964p1668p2475
11166B231432o3955m4674p0706n7224o4251n2586n9049m6812m6243k4001l8987
11155A662944m1905l9742k2753k7224k7157m1212j9139l5095m7143k1817j8284
$$ plain form
11221 51271440 48445920 45167554 42517302 40196374 36925933 31964198 26383322 21669063
11213 21669063 18235683 15839505 14135025 12849530 11844078 11026966 10346624 9754324
11205 9754324 9229271 8760599 8328783 7921823 7557573 7213163 6861574 6541046 6265292
11196 6265292 5986760 5721879 5484872 5276051 5060426 4845976 4642142 4458487 4289423
11187 4289423 4119610 3971861 3840453 3714265 3591827 3478774 3371256 3260741 3175659 3096844
11177 3096844 2992570 2900261 2823681 2743224 2680156 2605804 2524078 2435539 2375575 2303907 2231432
11166 2231432 2167477 2122803 2052097 1994873 1930622 1878036 1818987 1772175 1725932 1701931 1662944
11155 1662944 1621039 1581297 1558544 1531320 1504163 1462951 1443812 1408717 1361574 1339757 1321473
11144A321473k8900m6470n2652m0614l7040o0001m1344j4053j5015j3798J0857
11133I82443j859l0476j6038j0199k7527j8938j3573j4428j2866j6384k5408k9727
11121G65020j6277j0537j1553j72J1866r569j6513n715J15J1491J7701j2156Q781
11108G32482M237M9770Q5288P6981j0181m3498k3264n851K2016N0994J6875q9259
11096H66590q1424o3868n9433l9770k9708J197m539k5585k1550j6525l2076k4395
11084D68914k9684m712P355k3872q470K3744P905N954J036J4511j1623J6113J1904
11071D79075J1662K0377J8115P962K015K116k3562k6989l6644k9827K2217K4178
11059D70695j6722l3127k7642j7701J7176K6372Q937o360k1827k0377j570M909
$$ plain form
11144 1321473 1292573 1246103 1193451 1152837 1115797 1055796 1014452 1000399 985384 971586 982443
11133 982443 980584 950108 934070 923871 896344 877406 863833 849405 836539 820155 794747 765020
11121 765020 748743 738206 726653 726481 738347 728778 712265 706550 706665 718156 735857 723701 732482
11108 732482 736719 786489 871777 948758 938577 895079 871815 865964 887980 938974 955849 866590
11096 866590 785166 721298 661865 622095 592387 593584 589045 563460 541910 525385 493309 468914
11084 468914 439230 434518 441873 418001 409531 433275 441180 447134 448170 462681 451058 467171 479075
11071 479075 490737 511114 529229 537191 539206 541322 517760 490771 454127 424300 446517 470695
11059 470695 453973 420846 393204 375503 392679 419051 427988 421628 399801 379424 377854 382763
11047C82763m90J7676P112K399L4793M5248J8489J6905J4271l283k887K8626L2409
11034E94031K1950J0754j7394J94R43j7064j1529o409o457j822k2024k3884j728
11021E19561N676J481l294R677M386j7554m637Q199L722n46K534j2953j2757j0350
11007D93145o143l036k3992j7637L712n512k235l1375k0096J7122L0633J9526
10995D54112O874J1370J3502J7001n89J7076Q912k050o494J5273J9969k386k3707
10982E28863k4233J7662L2301O8749J10109P0291J4410k0976l1866n1681j6753
10971F96876J1049L6296M235J3639k144R84J4865l708K1760O798J459L671J4963
10958H20743L8978K8639K8921R196K4789J4570p41J3792L5902J7442J719Q897
$$ plain form
11047 382763 382273 399949 407061 409460 444253 489501 507990 524895 539166 535883 532996 561622 594031
11034 594031 615981 626735 609341 609535 610478 593414 581885 575476 569019 567197 545173 521289 519561
11021 519561 525237 526718 523424 533101 537487 519933 515296 523495 527217 526671 529205 516252 503495 493145
11007 493145 487002 483966 459974 442337 446049 440537 438302 406927 386831 403953 434586 454112
10995 454112 460986 472356 485858 502859 502270 519346 528258 526208 519714 534987 554956 552570 528863
10982 528863 504630 522292 554593 623342 733451 803742 818152 797176 765310 713629 696876
10971 696876 707925 744221 748456 762095 759951 760935 775800 772092 793852 800650 802109 805780 820743
10958 820743 859721 888360 917281 926477 951266 965836 965095 978887 1014789 1032231 1033950 1042847
10946A042847j4418J596O6J4218j6745l1626n52k449P189j5561k1589q69J9627
10933I81734K7768L8407L2962J1882J5811K0246K0396M6315M3691M3422K9961
10922A312595L4658M3821N6236N1056L8409K9982O6277N6313M2885K3102J4111
10911A769445K5511K6812L3269J4200J6207n879l1897j8031r457L247K7067N0291
10899A900785M9375O3405J11332J15174J03964J21244R9975J29786J62742J37980
10889B995762J44918J58805J38245J30835J28911R9895J07402J28170J45182J69433
10879D347558K37968L30574M10136N55582O77111P12713O73128O66055O56232
10870I267057P11299Q08390P47208O09282P99783J199888J610477K024271K598701
$$ plain form
10946 1042847 1028429 1030025 1030091 1044309 1027564 995938 995386 992937 1000126 984565 962976 962107 981734
10933 981734 1009502 1047909 1080871 1092753 1108564 1128810 1149206 1195521 1239212 1282634 1312595
10922 1312595 1347253 1391074 1447310 1498366 1536775 1566757 1633034 1689347 1732232 1755334 1769445
10911 1769445 1794956 1821768 1855037 1869237 1885444 1879565 1847668 1829637 1820180 1823427 1850494 1900785
10899 1900785 1950160 2013565 2124897 2240071 2344035 2465279 2565254 2695040 2857782 2995762
10889 2995762 3140680 3299485 3437730 3568565 3697476 3797371 3904773 4032943 4178125 4347558
10879 4347558 4585526 4916100 5326236 5881818 6558929 7271642 7944770 8610825 9267057
10870 9267057 9978356 10786746 11533954 12143236 12943019 14142907 15753384 17777655 20376356
10861B0376356L363640M328299N664031P755360J0931232J6148792K4841338L8311818
10853A31720866N4490024O0566060M4946208K6823391J8521098J2599188J5398201
10846C65065036M09091n5164488q1356986o2872888m0734057k6406527j7493502
10839H1445679j1956722q588907o536746n299117m402751l564611k765108k198073
10831C6133644j865265j617512j389709j251170j222710j202476j160937j095036
10823B5328829r55259r47875j223232j402885j251296j018757q91365q35876p92359
10814A6009925p22251o50922o00876n50310n13434m79324m37557l72720l44541
10805A1337990l44576l69819l74976l74551l84451l66368l12164k58043k50351
$$ plain form
10861 20376356 23739996 28068295 33732326 41487686 52418918 68567710 93409048 131720866
10853 131720866 186210890 246776950 291723158 318546549 337067647 349666835 365065036
10846 365065036 365474127 310309639 228952653 166079765 125345708 98939181 81445679
10839 81445679 69488957 60900050 54363304 49064187 44661436 41096825 38331717 36133644
10831 36133644 34268379 32650867 31261158 30009988 28787278 27584802 26423865 25328829
10823 25328829 24373570 23425695 22202463 20799578 19548282 18529525 17638160 16802284 16009925
10814 16009925 15287674 14636752 14035876 13485566 12972132 12492808 12055251 11682531 11337990
10805 11337990 10993414 10623595 10248619 9874068 9489617 9123249 8811085 8553042 8302691
10796H302691k33215k28943k76511k95663k53465k08666k15847k10476k02081
10787F177824j97095j49010j35694j47174j52792j56861j27210j37939j26321
10778D847728j01330q4858p7429q0179j08829j38105j04217q4406q6921r8994
10768C882460j37285j37611j28618j27681r8912q9868q4441r1049p8442q3809
10758B824744j04915j16113r9095q7312r1041q0717q2399n9519m6709m2554k9744
10747A984626m1030j2174Q785j3117j5017j5185j6927k2508n8151n4294q0902
10736A664106q9450p6029o1581p6174m9136o8257n6326j0138j8446n59K4185J2916
10724A195111p464M5419p880n3859m9267l3016j09289j06375p5342o1970m4099
$$ plain form
10796 8302691 8069476 7840533 7564022 7268359 7014894 6806228 6590381 6379905 6177824
10787 6177824 5980729 5831719 5696025 5548851 5396059 5239198 5111988 4974049 4847728
10778 4847728 4746398 4661540 4584111 4503932 4395103 4256998 4152781 4068375 3981454 3882460
10768 3882460 3745175 3607564 3478946 3351265 3252353 3162485 3078044 2986995 2908553 2824744
10758 2824744 2719829 2603716 2504621 2417309 2326268 2245551 2163152 2103633 2056924 2014370 1984626
10747 1984626 1943596 1931422 1940207 1927090 1912073 1896888 1879961 1857453 1799302 1745008 1664106
10736 1664106 1574656 1498627 1437046 1360872 1311736 1243479 1187153 1177015 1158569 1158010 1182195 1195111
10724 1195111 1187647 1233066 1225186 1171327 1122060 1089044 979755 873380 798038 736068 691969
10713F91969k5890l9953l7823j0127k1420j5672q261k6070q984K9456n7O497Q559
10700E42224j3014j5763j1382O1j9298q855K7774L5764L292j1597k5105j995j5890
10687D86216k4816j1712K371K5351J1398r783j3444L071j0585j185L990M557j4541
10674D50888o400j2250k2638L086m734j0260k6301o1633m6415n228m835j2031
10662B41249k3663J8484j6485k087K3869M8031L6046J030j7434J4783M759j194
10650C27388N535L0150K0577j6711J4404J9478K540J3891r577k694k4954j9291
10638C60736j5933k3222O391P631k6563k8094j3053l6815k7815M38J124l0314
10626A74511k3008J951K0525K3427J9791L2784N018K9468J0331P617p860k641
$$ plain form
10713 691969 666079 626126 588303 578176 556756 541084 532823 506753 497769 527225 527168 533665 542224
10700 542224 529210 513447 502065 502126 482828 473973 501747 537511 540803 529206 504101 502106 486216
10687 486216 461400 449688 452059 477410 488808 479025 465581 468652 458067 456882 460872 465429 450888
10674 450888 444488 432238 409600 412686 407952 397692 371391 309758 263343 258115 253280 241249
10662 241249 217586 236070 219585 217498 241367 289398 325444 326474 309040 323823 328582 327388
10650 327388 332923 363073 383650 366939 381343 400821 403361 417252 407675 404981 380027 360736
10638 360736 344803 321581 327972 335603 309040 280946 267893 231078 203263 203701 204825 174511
10626 174511 151503 153454 173979 197406 217197 249981 254999 284467 294798 302415 294555 291914
10614B91914J1552J1342M10k5448k8994j1949J810r012j4905r31K1313K590j0391
10601B39301L66k7689j8093J1898K4470K2560l6074m5505l7535n1988k493K1810
10589A01028n215k1397q926n158K670R461R898J4418J5825l395j1898j2643j4928
10576F9740K332J1696j0750r576M316j620J8785J6270r182K415K646M221K2868
10563A24161J6994K3802k0447j5134j1290j8162j2776k0273j1608k2562O910J878
10551D1493q397J3064J9421o844k0654j0576j1589J8595J2037L428O420l88N355
10538F1365O664O789q72j4226L632K756j2358p874r099j0092J2799j16J077j820
10524C8625j1761j4735k816k805J4316K0746R515n11j9597p605J5320j456j1627
$$ plain form
10614 291914 303466 314808 315218 289770 260776 248827 250637 241625 226720 225789 247102 249692 239301
10601 239301 239667 211978 193885 205783 230253 252813 216739 171234 133699 81711 79218 101028
10589 101028 95813 74416 65490 60332 63002 72463 82361 96779 112604 109209 97311 84668 69740
10576 69740 72072 83768 73018 63442 67758 66138 84923 101193 92011 94426 97072 101293 124161
10563 124161 141155 164957 144510 129376 118086 99924 87148 66875 55267 32705 39615 41493
10551 41493 33096 46160 65581 58737 38083 27507 15918 34513 46550 49978 56398 56010 61365
10538 61365 68029 74818 73946 59720 63352 66108 53750 45876 36777 26685 39484 39368 40445 38625
10524 38625 26864 12129 9313 6508 20824 41570 51085 50574 30977 23372 38692 37236 25609
10511B5609j4471J8601J5187J454n419L445R379q313l256n212p568l158P751K3291
10497E7320p884j4227K231J1488J8437M717K4478L4533K5362O233L5043K6057
10485B23788L9252N2725N0408M3349J1647K7530O714k5112m32n6521m7513m6719
10473B79116m8115j1146k6668n7785n632J0338o753j4854m38l726K124m66j8411
10460I7584J679M944k044l407K3182K974k1168K504K1200M2j2651J1939L3419
10447A60197J9699J2693N7564O2665O3105R3363J57433K22881L06315L05316K30700
10436A691931J43770Q7832O5633P0025n9439l53165m39685l23935k00273j18729
10426E63965p6859o1945l9433m3479k9208q255k6810l6437l7599l2445o493Q328
$$ plain form
10511 25609 11138 29739 44926 46380 40961 44406 53785 45472 42216 37004 29436 26278 34029 57320
10497 57320 49436 35209 37440 48928 67365 72082 96560 131093 156455 162688 197731 223788
10485 223788 263040 315765 366173 409522 421169 448699 455413 430301 429869 373348 325835 279116
10473 279116 231001 219855 193187 135402 129770 140108 133355 118501 118063 114337 116461 115995 97584
10460 97584 99263 104207 102163 98756 121938 124912 103744 106248 127448 127490 114839 126778 160197
10447 160197 179896 192589 250153 312818 375923 469286 626719 849600 1155915 1461231 1691931
10436 1691931 1835701 1923533 1989166 2059191 1999752 1646587 1206902 882967 682694 563965
10426 563965 487106 425161 385728 342249 313041 304786 277976 241539 203940 171495 165002 173330
10414A73330R376q386o522k5867j2673q137N329n208Q27N669j4261R16j3655K1696
10400A22434R240j3836o392J1992l606p982O482j414k0548l553O649M680J4236
10387A18382r218k2661j6417N32O452k0464k8220K1004J5035J877j5339j2646
10375C8317J4300J610l1498k1219K201K0389J114L4511j8557o236L057j2824j285
10362B3880M578l526M825J4644J819J4450k308k8587R717L777m752k1954r750
10349F813O630J1792j011o815k868o656R468n244k078r697j260l977r223J3425
10335g01M436K87J3084K0278J1041j5048j3702k834m379O414Q94J634O692K9245
10321E7341L0446K666j986r548k0763j1157Q362q422j3184J5152J2102j7073k4088
$$ plain form
10414 173330 182706 174320 167798 141931 129258 121121 126450 121242 122069 127738 113477 114393 100738 122434
10400 122434 131674 117838 111446 123438 119832 111850 118332 116918 96370 92817 99466 104146 118382
10387 118382 109164 86503 70086 70618 77070 56606 28386 49390 64425 66302 50963 38317
10375 38317 52617 54227 22729 1510 3711 24100 25214 59725 41168 34932 37989 25165 23880
10362 23880 28458 24932 29757 44401 46220 60670 58362 29775 39492 43269 38517 16563 6813
10349 6813 13443 25235 24224 17409 14541 7885 17353 12109 10031 334 -926 -4903 -14126 -701
10335 -701 3735 4022 17106 37384 48425 33377 19675 16841 12462 18876 19770 21404 28096 57341
10321 57341 87787 90453 88467 78919 58156 46999 55361 46939 33755 48907 61009 43936 19848
10308A9848j6788M678J5543M427P711k0156k3640J2955J3350L744O762l575O699
10295C1558J6159j2630k022j4465j2189M044m520J701m480P178N917j6686R488
10282I053K8179k4668k2322L186Q470J0735j823l069J6461Q948J893j6326O225
10269B4942L993k753Q88p879Q26K4k145j8202R556m910m616k421K754J4965R83
10254A6005L292O181k730k1732j0978o95J2068q230J833J1536Q602J7901R074
10241D2127R083P235J618q036k3224k1566k1452p475L838J0603P27O210J7655
10228A7343m238j1378O985j514J2252J7469O422l477N233j3416o402J2799o986
10215C1092j4836j4160K469J1111K1956P915k882j7723l741j5134l249J9110Q447
$$ plain form
10308 19848 3060 7738 23281 27708 35419 15263 -8377 4578 17928 21672 28434 24859 31558
10295 31558 47717 35087 33065 18600 6411 10455 5935 7636 3156 10334 16251 -435 9053
10282 9053 37232 12564 -9758 -6572 1898 12633 10810 7741 24202 33150 35043 18717 24942
10269 24942 28935 26182 27070 19191 20017 20041 17896 -306 9250 4340 -276 -2697 57 15022 16005
10254 16005 19297 25478 22748 1016 -9962 -10657 1411 -6819 -4986 6550 15152 33053 42127
10241 42127 51210 58445 60063 52027 28803 7237 -14215 -21690 -17852 -7249 -6522 -312 17343
10228 17343 13105 1727 8712 7198 19450 36919 43341 39864 45097 31681 25279 38078 31092
10215 31092 16256 2096 4565 15676 37632 45547 42665 24942 21201 6067 2818 21928 30375
10202C0375j0292J867J2351j2893j3478P685j655J78j0246n302m461J2419j6695
10189a0147m562R418J4478L759K031K2197J0122j4791j8447M104R592n075J1068
10176C3747N206r935l455J5322l42p174Q032n11n98j4005o129j6786O62m712L915
10161C237M951J2620N399j623L009M535J0239k077M188M615J7794l2106r041j3850
10147A1890J1500K3015n942l7375j2374Q917K5041R139M615j2994M868j3505J1034
10134B7829L640j2495M978O187k406k1674P508L250r572l036N294M174J7076J228
10120C1981J1695p221j6891O14M249K2304J5532q208J445j1714j3135R086M157
10107D3894k100n668M614J0579r978K071L073p448J1088K211L309J8351M378j7083
$$ plain form
10202 30375 20083 21950 34301 21408 7930 15615 13960 14138 3892 -1410 -5871 6548 -10147
10189 -10147 -14709 -5291 9187 12946 14977 37174 47296 32505 14058 18162 27754 22679 33747
10176 33747 38953 29018 25563 40885 40543 33369 41401 40890 40292 26287 20158 3372 4034 -678 3237
10161 3237 8188 20808 26207 24584 27593 32128 42367 40290 44478 49093 66887 34781 25740 11890
10147 11890 23390 46405 40463 3088 -9286 -369 24672 33811 38426 25432 30300 16795 27829
10134 27829 31469 18974 23952 30139 27733 6059 13567 16817 7245 4209 9503 13677 30753 31981
10120 31981 43676 36455 19564 20178 24427 46731 62263 54055 55500 43786 30651 39737 43894
10107 43894 41794 36126 40740 51319 41341 43412 46485 39037 50125 52336 55645 73996 78374 61291
10093F1291q725k076l452N73J3950K0954K387j2101j3179l487p782k0168M618
10080C2803K3159N67p352j8729l49l1116k2561P066o449K0429L195l39K2711N104
10066B8139j4105R23j439Q02K7444J5479j457L305M440M939L482m636p89j0564
10052E5963j7173K767k34J745M426L457n148j7420K34R217l095K555J064J0648
10038D9006k746Q805K492J357j184o897K7318Q383j588j3701l279p489R692O791
10024G6960k0072j8737j3333q044k08J6952J318k8965M525R841J4462L846q193
10011C0352M904n612j2071R74J9557L1138Q682k880N155q600j0460n393j681K2002
9997G6067M90k634k3015o392j3860o521J5544j871l226M833r196j2538J7029K0078
$$ plain form
10093 61291 52566 50490 47038 47611 61561 82515 84902 72801 59622 56135 48353 28185 32803
10080 32803 55962 56529 49177 30448 30099 -1017 -23578 -16512 -22961 -2532 663 324 23035 28139
10066 28139 14034 14957 13518 14320 41764 57243 55786 59091 63531 68470 71952 67316 66527 55963
10052 55963 38790 41557 41323 43068 47494 50951 45803 28383 28617 37834 34739 37294 38358 49006
10038 49006 46260 55065 57557 58914 57730 50833 78151 86534 84946 71245 67966 60477 70169 76960
10024 76960 56888 38151 24818 16774 16566 33518 34836 5871 10396 20237 34699 38545 30352
10011 30352 35256 29644 17573 18547 38104 69242 77924 75044 80199 71599 61139 55746 54065 76067
9997 76067 76557 73923 50908 44516 30656 24135 39679 37808 34582 39415 30219 17681 34710 54788
9983E4788J0715K920J094J8788J6217J1269r406j6284m635R882L230j3718k1129
9970F3731j5847K0627J8260k992k0537j5079K156K213p762j516j3457R118J2042
9957E0957n245L46p136J4929q0J9031k706k741K988j0880j136j0070k2281k02
9943B5774q991j5634J0020M367L29J3863P366k828J0896K6902M552k4766M589
9930E6439j687J5316m658l950J218l655j5779q788m15K6370O589M111p168J8902
9916H2845n469k5303J225J5795J6376q566k6825j1291P255K5330M760N626O757
9903H8515j5040J9653J0549k2946L509r189j4544J5990L6954J743k9865J056M857
9890I1242N136O046J1108K713N92j882j6716j5156J1006J9373J0900j1120l573
$$ plain form
9983 54788 65503 68423 69517 88305 104522 115791 106385 90101 85466 95348 98578 84860 63731
9970 63731 47884 68511 86771 83779 63242 48163 50319 52532 44770 43254 29797 38915 50957
9957 50957 45712 46058 38922 53851 53771 72802 70096 67355 70343 59463 58327 48257 25976 25774
9943 25774 16783 1149 11169 15536 15865 29728 37094 34266 45162 72064 76616 51850 56439
9930 56439 54752 70068 65410 61460 62678 59023 43244 34456 34041 60411 67000 71111 63943 82845
9916 82845 77376 52073 53298 69093 85469 76903 50078 38787 46042 71372 76132 81758 88515
9903 88515 73475 93128 103677 80731 84240 75051 60507 76497 113451 115194 85329 86385 91242
9890 91242 96378 102424 113532 116245 116837 114955 98239 83083 94089 113462 124362 113242 109669
9877A09669Q392O249M140k2028j4612K3175J6266J1655L5740L4907J0943M463
9865B28959J1063J079J5747J6216l5056m9574k1309j5079Q563O873K371j7846
9853A52007n922O020J590k0141q198R233J4887o166n388K5675J4133j8489j9420
9840A39821Q373J5027j003j1673q266q331n598Q624K7451J7447M162Q4j1245M573
9826A79446l384p889R500j4049J37J4527J651j9808J2133K2292M17j1441m171
9813A79361R742k567p949j568Q062k709O1j565M992K6598J731M473j6549j2576
9799A89537Q21l076n480k7015o014J6867K4848K5190M419j2687j6163J531K7702
9786B20480J3702j373o581j1026Q670P948K659J4398L28j1742q521J160N643q97
$$ plain form
9877 109669 118061 124310 128450 106422 91810 114985 131251 142906 178646 213553 224496 228959
9865 228959 240022 241101 256848 273064 238008 188434 167125 152046 160609 167482 169853 152007
9853 152007 146085 152105 153695 133554 125356 134589 149476 143310 137922 163597 177730 159241 139821
9840 139821 148194 163221 162218 150545 142279 133948 128350 136974 164425 181872 186034 186118 174873 179446
9826 179446 176062 168173 177673 163624 163761 178288 179939 160131 172264 194556 194973 183532 179361
9813 179361 189103 186536 178587 177019 185081 182372 182433 180868 185860 212458 214189 218662 202113 189537
9799 189537 190358 187282 181802 154787 148773 165640 190488 215678 220097 207410 191247 192778 220480
9786 220480 234182 232809 226228 215202 223872 231820 234479 248877 249205 237463 228942 230102 235745 234848
9772B34848J954K192O96j469j057L0304l689o80K728j8503n980K1089k317q491
9758B51625j9189k853J160L4302J2002k389J5849J4857l226K2617J1728P673J0841
9745C54997q585M261m873k998R383N731j13k014n797P946K9338r508j5217L132
9731C65683P70j3560o532L1213P990L09Q951O353J8751L0527J8850k5270j8300
9718D25735J7539Q5J738j5313j7560k700J6290J635N970K4475J6629O125L8726
9705E19374M859j4211K213K3383J3794O702M604J4258J8117J806O770N539Q341
9692F15549r4o243P195J3925J6160n313M392J5285R123R143K46n98n034J728K5146
9677G00610J5302J8311n86J7715J8112J5117j855N412J7154K4268r024M51j4352
$$ plain form
9772 234848 236802 238994 239690 238221 237164 267468 263779 263099 265827 247324 241344 262433 260116 251625
9758 251625 232436 229583 230743 265045 277047 274658 290507 305364 302138 324755 336483 344156 354997
9745 354997 346412 350673 345800 342802 352185 357916 357803 355789 349992 357938 387276 377768 362551 365683
9731 365683 366453 352893 346361 377574 385564 385873 394824 401177 419928 450455 469305 444035 425735
9718 425735 443274 443359 445097 429784 412224 409524 425814 427449 433419 457894 474523 480648 519374
9705 519374 524233 510022 512235 535618 549412 556114 560718 574976 593093 594899 601669 607208 615549
9692 615549 615455 609212 616407 630332 646492 641179 645571 660856 669979 679122 679368 678770 673736 675464 700610
9677 700610 715912 734223 733637 751352 769464 784581 782726 788138 805292 829560 820536 820987 806635
9664H06635P299O550M915j3364J055J0872M182J755J2839K4629P473r746N883
9651H70977l657p47P644n946K491Q092K584r112k9948k962N121J8938O255k350
9637H67380K438J432O10o943j2607j7915p068N446N095j5842r634l158k3718k2309
9623G63207L145P412P134j5584L417o588k4297j5336n987r037K2023J1714k0235
9610G20988j3727p222j612m998k4319j9421J7625J1875r1n777l601k5756j1578
9597F32386k049k4516q803j2749r361j9299k2243q300l264o229l096N278M37j0492
9583E07700j5334r892l454k328P260l118n628l4245n170r377j8192M10n479N153
9569D08306J8874J668j8122j7060L209j4120j6597m675j947R28M918L511P277
$$ plain form
9664 806635 813934 820484 825399 812035 813090 823962 828144 829899 842738 867367 874840 865094 870977
9651 870977 867320 866573 874217 868271 870762 878854 881438 872326 842378 839416 844537 863475 869730 867380
9637 867380 869818 871250 871860 864917 852310 834395 827327 832773 837868 822026 812392 809234 785516 763207
9623 763207 766352 773764 780898 765314 768731 762143 737846 722510 716523 707486 729509 741223 720988
9610 720988 707261 700039 698427 693429 669110 649689 667314 679189 679098 673321 669720 643964 632386
9597 632386 630337 605821 597018 584269 574908 555609 533366 525066 521802 515573 512477 517755 518192 507700
9583 507700 492366 482474 479020 476692 483952 480834 475206 440961 435791 426414 408222 408632 403153 408306
9569 408306 427180 428848 410726 393666 396875 382755 366158 361483 359536 360464 365382 368893 376170
9556C76170j1631k3028j051j0551J2932m453j1746P520q585J0160J2582j835j2578
9543C33906l3428j6530l194j4757k8562j028L131M629J2137M697K624j049l281
9530B59295K146J921k4887j0134r917q0J5891j1363j3858Q797J2895l478r924
9517B17304j0555M707M88j9108j7382m02P770m03K56j5980P061m789j477l661
9503A63829k1592M72J4271K1576M824r829N000N444l826l1513j2489l226j7176
9490A15765M771N277O491j225k209k924O11K166K8191J8339k107K573P668l630
9476A79757K0049K2155J6383l767J0117K4602J3039K5417J0434k861P265O658
9464C29248J3694j2545l0567k7570j3594j9861k3788j4514o829m486J9034R565
$$ plain form
9556 376170 364539 341511 340460 329909 342841 338388 326642 334162 325577 335737 348319 346484 333906
9543 333906 300478 283948 280754 265997 237435 236407 239538 244167 256304 261001 263625 262576 259295
9530 259295 261441 263362 238475 228341 218424 218344 234235 222872 209014 217811 230706 227228 217304
9517 217304 206749 211456 211944 192836 175454 175052 182822 182419 182675 166695 173756 168967 167490 163829
9503 163829 142237 142709 156980 178556 183380 173551 178551 183995 180169 148656 136167 132941 115765
9490 115765 120536 125813 132304 131079 128870 125946 126557 128723 156914 175253 173146 175719 183387 179757
9476 179757 199806 221961 238344 234577 244694 269296 282335 307752 318186 315325 322590 329248
9464 329248 342942 330397 299830 272260 258666 238805 215017 200503 193674 189188 208222 217787
9452B17787j5561l2459k2246o472R958l750k1747l655N240j0865O049J1498k5020
9439A08757j7597q397R790l128n623p173J0402P754J000J4386L02j3941P969P676
9425A12177j2449j4147L403k025q215k0703R281J5348K0648j0957l753n836N816
9412H8588N00p289R222J8193m055m147k3015k5361n486Q479Q141O700j2868l276
9398E4326k244N678n092j506p526o739J2026j1746R269N888M628J9520k2451j787
9384E2244m021M157k029m66m936R339K854m071J2399m06K649J811q369J7569K664
9369H1388q005l035R728r569m088J1316p992k6164M79K65J0304J0265j8036j9376
9355B7480o50J994J573J4887J5691N415R601N791o996k962p892O773P160k565
$$ plain form
9452 217787 202226 169767 147521 141049 151007 147257 125510 121855 127095 116230 122279 133777 108757
9439 108757 91160 82763 92553 89425 83802 76629 87031 94785 95785 110171 110473 96532 104501 112177
9425 112177 99728 85581 88984 86959 78744 58041 67322 82670 103318 92361 88608 82772 88588
9412 88588 89088 81799 91021 109214 105159 101012 77997 52636 47150 55629 63770 70470 57602 54326
9398 54326 52082 57760 52668 51162 43636 36897 48923 37177 46446 52334 56962 76482 54031 52244
9384 52244 48223 52380 50351 49885 44949 54288 57142 53071 65470 65064 67713 69524 61155 78724 81388
9369 81388 73383 70348 80076 70507 66419 77735 69743 43579 44058 44323 54627 64892 46856 27480
9355 27480 26830 28824 30397 45284 60975 66390 75991 81782 74786 71824 63932 70705 77865 75300
9341G5300k6133o738J3069J704Q808Q661M058N656J3563K64N352q140J338j4094
9327H2668N535R46o073k3200J0741J9805R208J0496j4428l2175j1249J6047J2462
9314H0783j8115l338P699R253J0161o410j6363j2927M189O841J5164R511q936
9301G7512J8088R152O535k556j0199Q739K6088o132k3007l6311l121J7733n260
9288G7261j7181r912k1042p752M35K5572K5080m97O255j0568j2981L773j0n6k191
9273E6186K85P410R367J1970k750k483R574K3959p638j52K136K81q642p42J9430
9258A18191q789k9781j9414q07r19R551N567n158j8012q658K517J9254P344p915
9244F2971j6175k094j1192P687R038j0115M430J2581L278J2122j2791K07M828
$$ plain form
9341 75300 49167 42429 55498 57202 66010 74671 78729 84385 97948 98212 103564 95424 96762 82668
9327 82668 88203 89149 83076 59876 70617 90422 99630 110126 95698 63523 52274 68321 80783
9314 80783 62668 59330 67029 76282 86443 80033 63670 50743 54932 61773 76937 86448 77512
9301 77512 95600 104752 111287 108731 98532 107271 133359 127227 104220 67909 64788 82521 77261
9288 77261 60080 50168 29126 21374 21809 47381 72461 71964 78219 67651 54670 58443 58433 58377 56186
9273 56186 56471 63881 73248 85218 82468 79985 89559 113518 105880 105728 107864 108145 99503 98761 118191
9258 118191 109402 79621 60207 59400 58481 68032 73599 68441 50429 41771 44288 63542 70886 62971
9244 62971 46796 44702 33510 41197 50235 40120 44550 57131 60409 72531 59740 59947 64775
9231F4775R259o253q563p305J43j1510l693K0633M408j0181j1262K325L959J1672
9217E8407q593k7217J951J4341J1490r779P019l969N548K450m143n636q34O073
9203D7108m352P123j840R218K901j517k395j1214J935M44M684m395j606j0299
9189C5795K114j1949J636Q343k951N376L027L898O11k1320j3373n151M959K8162
9175C9177k143o679p278O188P448K798j1273J5364J4590k1716j0114Q687O56m421
9161C1284q168K554l491p471L0639J9749R829k3069j454M167r729j1261n085J549
9147C0043o158n589r376J7859r621j1415J4268r398l750J623J170j3020p754M812
9133f306J7505n566P469J0375k08n31K8424N48j1549Q717m622j1354j3866J743
$$ plain form
9231 64775 74034 67781 59218 51913 52056 40546 36853 57486 61894 51713 40451 42776 46735 58407
9217 58407 49814 22597 24548 38889 50379 40600 47619 43650 49198 51648 47505 41869 41035 47108
9203 47108 42756 49879 48039 57257 60158 58641 56246 45032 46967 47411 52095 47700 46094 35795
9189 35795 37909 25960 27596 35939 32988 38364 41391 45289 45900 24580 11207 6056 11015 39177
9175 39177 37034 30355 23077 29265 36713 39511 28238 43602 58192 36476 26362 35049 35705 31284
9161 31284 23116 25670 22179 14708 45347 65096 74925 51856 50402 54569 44840 33579 28494 30043
9147 30043 23885 18296 8920 26779 17158 5743 20011 10613 6863 8486 9656 -3364 -11118 -6306
9133 -6306 11199 5633 13102 23477 23269 22738 51162 51710 40161 48878 44256 32902 19036 20779
9119B0779j4797j5884J1410J2437J0276N36j9951m098M685J4273J2599j648O50
9106C1267L813r398j6494m780J1026o08m697j4918J4223N971J7943J2867n809
9093D0406j0295L675o763O134j0435J0833l265j2024m912Q970j2977L663J8850
9080C1860L930J5890Q043j6971l4864j5884n210n067J6812K58j1714N191n009
9067a2735L902O811J9860K2602J5576j415j4547l133J2789j3515k1236p156K163
9054I966k5758j4042J21P803K6607K0036P691p333j0319l432Q898L334o40j1179
9040A1753O450K0905r714M532j2262j2367N17M679n948Q592K667l673j007J7189
9026C2313o944j0053M464k020o304J2780P622j0104p423r93j8699J3164M1687
$$ plain form
9119 20779 5982 -9902 1508 13945 24221 24757 4806 708 5393 19666 32265 30617 31267
9106 31267 35080 25682 9188 4408 15434 14826 10129 -4789 9434 15405 33348 46215 40406
9093 40406 30111 33786 27023 33157 22722 33555 30290 18266 13354 22324 9347 13010 31860
9080 31860 35790 51680 59723 42752 7888 -7996 -13206 -18273 -1461 -1203 -12917 -7726 -12735
9067 -12735 -8833 -2022 17838 40440 56016 54601 40054 36921 49710 36195 14959 7803 9966
9054 9966 -15792 -29834 -29713 -21910 4697 24733 32424 25091 14772 11340 20238 23572 22932 11753
9040 11753 18203 39108 29394 33926 21664 9297 9814 14493 8545 17137 19804 16131 15124 32313
9026 32313 25369 15316 19780 17760 11456 24236 31858 21754 14331 13338 -5361 7803 49490
9013D9490q2M398j3313P685J7449K863n589o951J4541j2769j4736N218j0823j3864
8999B3517n676J6274j570k7372j977n699k419j2980j2J5947J4355M631K3484K293
8985D2796q758J225J4140J596k3491J00P894j0088n642o62N595N100j074j0166
8971A8565Q423J01L975r500J9236p121k1898J9793p753O995K5642O512j8239j5940
8957B8791M268J1883j4069j7238o50p961j6338r154J538j777K1370J4155m089
8944A0729j936l713P138Q36J9627K566j3654P265n33L109k2679j5923K020j0639
8930a5787N913K0925J4019K9307q548M078J2581j4232k4459j1164l545J913L367
8917A4368J0064K5262K53k1467q932K0176m636j3425q178j0552M963k697P035
$$ plain form
9013 49490 49408 53806 40493 48178 65627 68490 62901 55950 70491 57722 42986 48204 37381 23517
8999 23517 17841 34115 32545 5173 3196 -2503 -4922 -17902 -17914 -1967 12388 17019 40503 42796
8985 42796 34038 35263 49403 50999 27508 27608 35502 25414 19772 19110 24705 29805 28731 18565
8971 18565 26988 27089 31064 21564 40800 33679 11781 31574 23821 30816 56458 62970 44731 28791
8957 28791 33059 44942 30873 13635 12985 5024 -11314 -20468 -18930 -20707 663 14818 10729
8944 10729 8793 5080 12218 13054 32681 35247 21593 28858 28325 31434 8755 -7168 -5148 -15787
8930 -15787 -9874 11051 25070 54377 45829 49907 62488 48256 23797 12633 9088 11001 14368
8917 14368 24432 49694 49947 28480 19548 39724 35088 21663 13485 2933 7896 5199 12234
8904A2234k720N250K0487J0754R098j9069j418j6412p358K0469J466L394Q656
8891D4831J3281P321j2019q016O72o103j0402l80J8209J6293J6705k4190j4114
8878D2088J1609J0798L907j0669j0572p634J556J2619j3518j481R475K836o757
8865D4257n491J1532j0384O403J7341j8026k0009J3984J0001P045m965Q245N521
8852F5454k3583m937J5984J1722J5373J0500n348N76j1j2318M292M8824J6722
8839A43250l640l471j1143P854j393j6057j5548n397j2490l15n869j4321J237
8826F2697ok540q213P719J2332K819j984r93J0104r494q097k1262p927r121O878
8811C2912M961j2769J672k761r329Q526J4682J9119n343o951N029L209J3858K4577
$$ plain form
8904 12234 9514 14764 35251 46005 55103 36034 34616 18204 10846 31315 32781 36175 44831
8891 44831 58112 65433 53414 45398 46070 39967 29565 29185 47394 63687 80392 56202 42088
8878 42088 53697 64495 68402 57733 47161 39527 41083 53702 40184 38703 48178 51014 44257
8865 44257 38766 50298 39914 46317 63658 45632 25623 39607 49608 56653 51688 59933 65454
8852 65454 41871 36934 52918 64640 80013 90513 85165 85741 85730 73412 77704 126528 143250
8839 143250 139610 136139 124996 132850 131457 115400 99852 94455 81965 81650 75781 61460 62697
8826 62697 62691 60151 51938 59657 71989 74808 72824 71831 81935 72441 64344 43082 35155 26034 32912
8811 32912 37873 25104 26776 24015 14686 23212 37894 57013 51670 44719 49748 52957 66815 91392
8797I1392o620r297l036l653n14p049p39p571k1175J8127J6877m57j0274j5621
8783D0390k2183R222J2603p531O714r232k442p66J2772M428O080n960n967P317
8769D5445J375O20j9535J455L455J9218k117Q84N695o07j2702p128k161M157j9059
8754A8995j9556K7470k231J5540n71r075q774J6444J593l596o770m161R893J1395
8740D6596J1686m231j8389q351j0348m866O777L5063p575L690J9279l355K983
8727F8959m998j5694k298M364R052J3525o256R332m980k5212j1387P224N191P081
8713E3903L245j2516k9918r433j050J2154L2039R735n978j235P702N390J402j6271
8699D9169L230J4386J0038j95k9103p524N226M427K4248P686k86j8020J388J1079
$$ plain form
8797 91392 84772 75475 72439 68786 68272 61223 60484 52913 31738 49865 66742 66285 56011 40390
8783 40390 18207 27429 40032 32501 39215 29983 27541 26775 39547 43975 50055 44095 38128 45445
8769 45445 46820 47440 27905 29360 32815 52033 49916 50800 56495 55888 43186 36058 33897 38054 18995
8754 18995 -561 26909 24678 40218 39647 30572 21798 38242 39835 36239 29469 25308 35201 46596
8740 46596 58282 54051 35662 27311 16963 12097 18874 53937 46362 50052 69331 65976 68959
8727 68959 63961 48267 45969 50333 59385 72910 66654 75986 71006 45794 34407 41631 46822 53903
8713 53903 57148 44632 14714 5281 4231 16385 48424 58159 52181 50946 58648 64038 65440 49169
8699 49169 52399 66785 76823 76628 47525 40001 45227 49654 73902 81588 81302 63282 64670 75749
8685G5749p815m621j690J2531J578M342q704Q683k0716l874l650R854K1502n160
8671G8009j4803o012J0105K184j9869m27K2262Q047q646L035N300m536K05j3525
8657F1329R91J7302J6861J4046P590M423N641j6937j0000j011j1957k578K1922
8644A07622J2025m572O118J0041O842p436m690o13K5004n669j2996k045J0993
8631A40624J9773J1010r295J3075J5930j5412k2914m746j385q084m607N462L826
8618A43257K6578M234l69m837p530k797j2061K635n908K556O586M992J8081L2198
8604B07615K3938J5243L3741L7743K2710n970p881L7774L6741N699r3o914k7617
8591C72729J4203L6828L8314N9256K8658M0447N6211J8961J8283K7417Q329k6720
$$ plain form
8685 75749 67934 63313 61623 74154 75732 80074 71370 80053 59337 55463 51813 61667 83169 78009
8671 78009 63206 57194 67299 69483 49614 49187 71449 79496 70850 73885 79185 74649 74854 61329
8657 61329 62320 79622 96483 110529 118119 122542 128183 111246 101246 100235 88278 85700 107622
8644 107622 119647 115075 121193 131234 138076 130640 125950 125337 150341 144672 131676 129631 140624
8631 140624 160397 171407 162112 175187 191117 175705 152791 148045 146660 138576 133969 139431 143257
8618 143257 169835 174069 173700 168863 161333 158536 146475 149110 143202 145758 152344 157336 175417 207615
8604 207615 231553 246796 280537 318280 340990 335020 327139 364913 401654 407353 407260 400346 372729
8591 372729 386932 423760 462074 521330 549988 590435 646646 665607 683890 711307 719636 692916
8579F92916k0315K100k514J8669K3409O088k8007l1173k4466l5056m3214n1891
8567E06546m2534n2807m6715l0677P836J8036K4432K202M991n50p459k1921j2073
8554C49307k5067m3508l0197k3760k1463j2028m998q866o744J0085L6697R952
8542B29410l504P104J1014L122J2468K2450L1847K1177N097Q454J3147K620j1105
8529C53301k9573l4359k3268l4707n2791k3629J6609L531p610p940n202j904J548
8516A54006K311q359j9049J1999M167k4101o695J9188M518m953j3566l952k277
8503A13237K299J4700j2863N50j7189q715J0851M924J602k0376q560m81N062J1587
8489I6628M371K946k812r807q664N335j0684k0582O843J3030o493j8126j3193
$$ plain form
8579 692916 672601 674701 672187 690856 714265 720353 692346 661173 636707 601651 558437 506546
8567 506546 464012 411205 364490 333813 341649 359685 384117 386319 391310 390760 383301 361380 349307
8554 349307 324240 280732 250535 226775 205312 193284 188286 179420 172676 182761 219458 229410
8542 229410 225906 233010 244024 247146 259614 282064 313911 335088 340185 348639 361786 364406 353301
8529 353301 323728 289369 266101 231394 178603 154974 171583 175114 167504 159564 154362 152458 154006
8516 154006 156317 147958 128909 140908 145075 120974 114279 133467 137985 133032 119466 115514 113237
8503 113237 115536 130236 117373 117923 100734 92019 102870 107794 109396 89020 80460 79979 85041 96628
8489 96628 100999 103945 101133 91326 82662 87997 77313 56731 63574 76604 70111 51985 38792
8476C8792K4395J7012q991J177o182J0337R61k638Q255o054N714P202q842k7135
8462E4003r479K223q941N547J9981J0898k1526k941M059L146j3127l312O750J4797
8448F2078n402k262k20K860K257r587k3912j6589K595K0947j734k1321P752Q658
8434B6120K7203K4288j1109j1167m912l910r028j2143J9428J3262R990P09M9J1160
8420G9940j8645R00j690j1073o845O021J5689J1724J474j0453j0208k1460J3107
8407D8481J0506m687n94j0391j5642j1734o485L1511L824j9606q875p670O611
8394A5249K462O370J1045L854O830K3766M777r283k875r562m596j7146R679L301
8380D3871j3571o301K052Q921J0421m206j1306O405J7557k1891j4152j5032P570
$$ plain form
8476 38792 63187 80199 71208 72385 66203 76540 77501 74863 83118 77064 82778 89980 81138 54003
8462 54003 44524 46747 37806 43353 63334 74232 52706 49765 53824 56970 43843 40531 47281 62078
8448 62078 56676 54414 54194 57054 59311 49724 25812 9223 11818 32765 31031 9710 17462 26120
8434 26120 53323 77611 66502 55335 50423 46513 37485 25342 44770 58032 68022 68731 68780 79940
8420 79940 61295 62195 60505 49432 42587 48608 64297 76021 77495 67042 56834 35374 48481
8407 48481 58987 54300 53706 43315 27673 15939 9454 40965 44789 25183 16308 8638 15249
8394 15249 17711 24081 35126 38980 45810 69576 74353 65070 62195 52633 48037 30891 40570 43871
8380 43871 30300 23999 26051 34972 45393 41187 29881 36286 53843 31952 17800 2768 10338
8367A0338J4939J537J3692O340O781r0k0704j4567J3994N481k775J6452r239o848
8353C5331j293o323m931J5071J3042n352l3207k2090p307M273J3294j558n47J134
8339d63q767q129J6377J0706J0315l199p451k6624j3808R052L85K501l239M99
8325b1845J0359K6677L0493n338r581j5455q821L860J3642J814J684j281j383
8312B4825R04j2871j9408l270J39N472M542K514k207q046J0027o691R015M108
8298I053j7509o616j344l888N817j4031N195J0132K0045J4658R69J5481l509q385
8284B6068j8498j6907o995J9984J3238m693J074k062j0891P027r697n24k780j968
8270g624J4444J3957k2230k718J1363l861N171O346l127L710O401o875r610j3806
$$ plain form
8367 10338 25277 26814 40506 46846 53627 53537 32833 18266 32260 37741 34966 51418 42179 35331
8353 35331 34038 27715 22784 37855 50897 45545 12338 -9752 -17059 -12786 508 -1050 -1597 -463
8339 -463 -9230 -17359 -982 9724 20039 16840 9389 -17235 -31043 -21991 -21606 -19105 -22344 -21845
8325 -21845 -11486 15191 45684 40346 30765 15310 6489 10349 23991 25805 27489 26208 24825
8312 24825 25729 12858 -6550 -9820 -9681 -4209 333 2847 640 -7406 2621 -4070 4945 9053
8298 9053 -8456 -15072 -16416 -20304 -14487 -28518 -23323 -13191 6854 21512 22481 37962 34453 26068
8284 26068 7570 -9337 -16332 3652 16890 12197 13271 11209 318 7345 -2352 -2876 -5656 -7624
8270 -7624 6820 20777 -1453 -4171 7192 3331 8502 14848 11721 15431 21832 14957 5347 -8459
8256h459j2033m736J9729K1526J0024n701j136L576j42q95j5563j2815J30L777
8242b718L971P996Q314j3527K0870K3405q446K08n529j614j0158j7174j1927o705
8228a3034J3382K0363k07O953P289j5051j6581k36j7965J9261l513o145L899K55
8214a330m271J5787R906q187J408n41q892j215K3996J6735j1004k2470j5238m846
8200a0162j0154R60K31L210J5135j794o956J157O664K8230R749j1853j9846K304
8186F875J0413K190j4259k0775j6479j0121K3209L4068M557q400q579j0838J4114
8173E975J2505J2625o750N7m733j6674P736J5852k4474J5846J4204j328O687J2137
8159D9665K447m636j2466p317J3768N312j6966r979n258l060J77J8664J8346L750
$$ plain form
8256 -8459 -20492 -25228 -5499 16027 26051 20350 19214 22790 22648 21753 6190 -6625 -6495 -2718
8242 -2718 1253 9249 17563 4036 24906 48311 39865 40073 34544 32930 22772 5598 -6329 -13034
8228 -13034 348 20711 20504 27457 34746 19695 3114 2878 -15087 4174 661 -5484 -1585 -1330
8214 -1330 -5601 10186 20092 11905 13313 12772 3880 2665 26661 43396 32392 9922 -5316 -10162
8200 -10162 -20316 -19356 -19125 -15915 -780 -2574 -9530 -8373 -1709 26521 36270 24417 4571 6875
8186 6875 17288 19478 5219 -15556 -32035 -42156 -18947 15121 19678 11278 2699 -8139 5975
8173 5975 18480 31105 24355 24412 19679 3005 10741 26593 2119 17965 32169 30841 37528 49665
8159 49665 52112 47476 35010 27693 41461 46773 29807 19828 14570 11510 11687 30351 48697 52447
8145E2447j1242q694j0727j2845m594M209r013J972K4786J3351N890r80j6314
8132B8246J339j7484k293M098J5365J0161k980m981J3141j170m819N975j6490
8119B8108K811k1849P184N288p725J7704J0144R510J991m539j0431L284o190j1773
8105B3517Q410Q535K323J539k40j3198j2037n200J102J0656K0375L731N782j5589
8091C9706k988J1112r863J375K7814M971k2957j358j6706j1511P775J0253J7066
8078E4689l5056j2720J6008J8811m467j9884O14j305k034N479m764N659r849j3806
8064b625j0234m570l017J4793O432M430K651Q176K3025R348M987O541j0743q924
8050D0270O249J3161n054L233K297j1872j0625o527j1275R369L742P899L888M413
$$ plain form
8145 52447 41205 32511 21784 8939 4345 8554 -459 1513 26299 39650 45540 44560 28246
8132 28246 29585 12101 9808 13906 29271 39432 36452 31471 44612 43442 38623 44598 28108
8119 28108 30919 9070 16254 21542 13817 31521 41665 51175 53166 48627 38196 41480 35290 23517
8105 23517 31927 40462 42785 44324 44084 30886 18849 13649 14751 25407 45782 49513 55295 39706
8091 39706 36718 47830 37967 39342 67156 72127 49170 47812 31106 19595 27370 37623 54689
8078 54689 19633 6913 22921 41732 37265 17381 17995 16690 14656 20135 15371 21030 11181 -2625
8064 -2625 -12859 -17429 -20446 -5653 779 5209 7860 16036 39061 48409 53396 59937 49194 40270
8050 40270 46519 59680 54626 57859 60156 48284 37659 31132 19857 29226 32968 40867 44755 49168
8036D9168l10j2295J8885J2349Q880K16m458Q180l934K700J0506n864j6075n063
8022F2885M960K742r105j4051j4986N965J1427o989J2088K7959R437r521j6040
8009F6771J074J8038K4747R041j2150j5711J3379p792l165M685q604m820l195
7996H2298j2171k1579J706K0713K3495K5443J1028J084j0743n324J3939J4558
7984A44447J3047q44j4083J9246M48J441r091j9590k913j3901j83j946J4470Q680
7970A39228j4961l6967r763J1971J3833J046J223r803k2428J0021J1903p536k372
7957H5395q319N019K5742j589q938k670J7597J5523J078J1221K289M976J6782
7944A64106R70j1897K451l711m45j1111j2588L130j1999K314L001J7348k3579
$$ plain form
8036 49168 48858 36563 55448 67797 76677 76893 72435 80615 76681 79381 89887 84023 67948 62885
8022 62885 67845 70587 61482 47431 32445 38410 49837 42848 54936 82895 92332 82811 66771
8009 66771 67845 85883 110630 119671 107521 91810 105189 97397 94232 98917 90313 85493 82298
7996 82298 70127 48548 50254 70967 94462 119905 130933 132017 121274 115950 129889 144447
7984 144447 157494 156650 142567 161813 162261 163702 154611 135021 132108 118207 118024 116078 130548 139228
7970 139228 124267 87300 77537 89508 103341 104387 105610 95807 73379 83400 95303 87767 85395
7957 85395 77076 82095 107837 106248 97310 94640 112237 127760 128838 140059 142348 147324 164106
7944 164106 165076 153179 155630 151919 151474 140363 127775 130905 118906 121220 124221 141569 117990
7931A17990k6896Q083J052j4119j121N75K1065j2259l1359j1314l828j7691j282
7918B8896K4336L8767J4508J4293q758q250N275p007j5198K206K174j3869N483
7905H2856J322J2408j298j5702r002q345R41R835o214q34r077J3296J6940j4492
7891G2634j8256n449j3200q534J0795J1787K2228P210j257j4497j3222O69p862
7878D3046m477j3581J1380N505J0515M495j0436l2838j9916J2608J7970J4127
7866C8398M011j2746k1736P848K093j1422j1408J7972J9436j6929J0793J2151
7854C8461j7031L02Q692j1535K84n686o987R483O023r493j3251Q65J2771J3273
7840B6171o226J106r924O14L357J2841j1332L61J2375P978L378j9353j2001k516
$$ plain form
7931 117990 91094 99177 100229 86110 84989 85564 106629 94370 63011 51697 47869 30178 28896
7918 28896 53232 91999 106507 120800 112042 103792 109067 102060 86862 89068 91242 77373 82856
7905 82856 84178 96586 95288 79586 70584 62239 63180 73015 66801 65967 56890 70186 87126 72634
7891 72634 54378 48929 35729 27195 37990 49777 72005 79215 77958 63461 50239 50908 43046
7878 43046 38569 24988 36368 41873 52388 56883 46447 13609 -6307 6301 24271 38398
7866 38398 42409 29663 7927 15775 17868 6446 -4962 13010 32446 15517 26310 38461
7854 38461 21430 21732 30424 18889 19173 13487 6500 15983 22006 12513 -738 127 12898 26171
7840 26171 19945 21051 11127 11741 15098 27939 16607 16968 29343 37321 40699 21346 9345 6829
7826F829J1103n65l111j5238q768R905K1123p432o184J1941P502p289K0685J5023
7812E5524j8336l0345N569J818o394j4291L210J531l122k261O466J583k779l0734
7798c2561j1472J8152L115O777j2180k543K3926J337l599J6610J4898m051j5006
7785C403p457J3817m553n125l580j0758j2847j150L751J181O332J9345J1840j425
7771A2774k1934o335j4019n36l158o817l149K882K4713J5576J861j8520k3523
7758d0185o308J2705K4741Q858J5869Q353r802j8795k0785j4149J4693J8927j8683
7745b4561n836J2635m322J2414K0060n504k777J127p82l85P862k0049j0184J2755
7731g547j859k644J5O104q297q366L008p183K382P347J6162j3053j4540L675J5372
$$ plain form
7826 6829 17932 17367 14256 -982 -9750 155 21278 13846 7662 19603 27105 19816 40501 55524
7812 55524 37188 6843 12412 14230 7836 -6455 -3245 -1714 -4836 -7097 -631 952 -1827 -32561
7798 -32561 -44033 -25881 -22766 -15989 -28169 -30712 -6786 -5449 -9048 7562 22460 18409 3403
7785 3403 -4054 9763 5210 85 -3495 -14253 -27100 -28250 -24499 -23318 -16986 2359 14199 12774
7771 12774 -9160 -15495 -29514 -30050 -33208 -40025 -43174 -40292 -15579 -3 1858 -16662 -40185
7758 -40185 -46493 -33788 -9047 -189 15680 24033 14231 -4564 -25349 -39498 -24805 -5878 -24561
7745 -24561 -30397 -17762 -22084 -9670 10390 4886 2109 3236 2454 2069 9931 -10118 -20302 -7547
7731 -7547 -9406 -12050 -12035 -5931 -14228 -22594 -19586 -26769 -24387 -17040 -878 -13931 -28471 -24796 -9424
7716i424J5912J4033m123q571q407Q459p490r16L087L444n083K47r697n658M930
7701i257N025j2151j8310J282J3580J1925J4609n819K0910n611k2878k3951n60
7688c1206L680n982J5753J4640R92J0852k595n491N977j6096L31O669N28J550
7674c98l044k672j4819j9081q654J843l503j0145r436L767n062J6731K3153J1303
7660b0017l540J6921L36l547q339l363l899m239L358K347R76J7386R863k6296
7646b2053o950J920R630O122j254K903J587j3281Q746J0631M126j8257j845R194
7632h781M567j4843k3786j293J3258J1179R692j4066M226K6447J8624j7912j8767
7619a1455J8667J3210k520k5912o738O732J2667J8775K139j7370J0674k673q718
$$ plain form
7716 -9424 6488 20521 16398 7827 -580 7879 389 -527 2560 6004 921 1168 -8529 -14187 -9257
7701 -9257 -4232 -16383 -34693 -33411 -19831 -7906 6703 884 21794 16183 -6695 -30646 -31206
7688 -31206 -27526 -33508 -17755 -3115 -2123 8729 6134 643 6620 -9476 -9145 -2476 -1948 -398
7674 -398 -3442 -6114 -20933 -40014 -48668 -46825 -50328 -60473 -69909 -66142 -71204 -54473 -31320 -20017
7660 -20017 -23557 -6636 -6300 -9847 -18186 -21549 -25448 -29687 -26329 -23982 -23006 -5620 4243 -22053
7646 -22053 -29003 -27083 -17453 -11331 -12585 -9682 -8095 -21376 -12630 -1999 2127 -16130 -17975 -8781
7632 -8781 -4214 -19057 -42843 -44136 -30878 -19699 -10007 -24073 -19847 6600 25224 7312 -11455
7619 -11455 7212 20422 17902 -8010 -14748 -8016 4651 23426 25565 8195 18869 16196 7478
7606G478l871M089l673L75l646r573k878o345k395j361K772K3087P909j7197o414
7591a1643n05J453J1192N736j1552j186o146P300P066r481j6716j2492l0542j0958
7577g8474J0705K4945K3453L757k0893J6348K0888l9395K0J0727J9918J6753j1370
7564b618k168M158k1613j52P483M971j721r703o058J0092m454o054Q766R63J2980
7549e128J9180r923j2301k2179p342j5074j6701K2076l470j1616J5724J5245N00
7536c1009J1275J1729j428l716M516j1532J4435K604n486L0226j1004m1931M652
7523b6669J2858J1492L775m716q224j9336J0475P116L786l551Q18K854j0341j0817
7509c0480J7237K509p593p300j1348N684o33j883K2240K2504l369P386k268L581
$$ plain form
7606 7478 3607 7696 4023 4398 752 -8821 -11699 -18044 -20439 -21800 -19028 4059 11968 -5229 -11643
7591 -11643 -12148 -10695 497 6233 -5319 -6505 -12651 -5351 1715 -7766 -24482 -36974 -67516 -78474
7577 -78474 -67769 -42824 -19371 -15614 -36507 -20159 729 -38666 -38646 -27919 -8001 8752 -2618
7564 -2618 -4786 -628 -22241 -22393 -14910 -9939 -11660 -21363 -27421 -17329 -21783 -27837 -19071 -18108 -5128
7549 -5128 14052 4129 -8172 -30351 -37693 -52767 -69468 -47392 -50862 -62478 -46754 -31509 -31009
7536 -31009 -19734 -8005 -9433 -13149 -8633 -20165 -5730 -3126 -8612 21614 10610 -31321 -26669
7523 -26669 -13811 -2319 1456 -3260 -11484 -30820 -20345 -13229 -9443 -12994 -12176 -9322 -19663 -30480
7509 -30480 -13243 -10734 -18327 -25627 -36975 -31291 -31924 -33807 -11567 10937 7568 14954 12686 16267
7495A6267q610j6603N091n85k541J5608N071M25J732j0231j2921J2261J47k2472
7481a7361j4552J9381j0708J841M59m789p185J0710k734k8355p681J1014J3117
7468c6843J9011J0824p651k736J6597q710l145N931n808J015J6070O850M427j6571
7454g39j0628O859J115l525j8744O949L43Q188P78O690j9000r059J0688R937l632
7439a3780m050j8128M318R638L545K3182J7604J1447k1149l5559L716K2193J0629
7426A3606j7417m233j2837m791J4852J018j716K800Q432J224n694L455M932k799
7412H32J4778L464J0412j2964j1570N669q420k2879j5063J5222Q313N215o149
7399a3140j090N770Q953j3135L27L524Q266o625j9172N470K795o492j239j218
$$ plain form
7495 16267 7657 -8946 -3855 -4440 -6981 8627 13698 14123 15855 5624 -7297 4964 5111 -17361
7481 -17361 -31913 -12532 -23240 -21399 -20940 -25729 -32914 -22204 -24938 -53293 -60974 -49960 -36843
7468 -36843 -17832 -7008 -14659 -17395 -798 -9508 -12653 -6722 -12530 -11515 4555 11405 15832 -739
7454 -739 -11367 -4508 -3393 -6918 -25662 -18713 -18370 -10182 -9404 -2714 -21714 -30773 -20085 -10148 -13780
7439 -13780 -17830 -35958 -31640 -22002 -18457 4725 22329 33776 12627 -22932 -19216 2977 13606
7426 13606 -3811 -8044 -20881 -25672 -10820 -9802 -11518 -8718 -286 938 -4756 -1301 3631 832
7412 832 15610 19074 29486 16522 4952 10621 2201 -20678 -35741 -20519 -12206 -6991 -13140
7399 -13140 -14230 -8460 493 -12642 -12315 -8791 -525 -7150 -26322 -20852 -18057 -24549 -25788 -27006
7385b7006K0328K996j023j9645N865J0229o893q611N598J1819j0433k2137m257
7372d3170J1518O239K1239N357j6001J520N522j454L010L653n440j0194J028j0597
7358b7770j5540q488k537L555j653J5199J5280N589m76o124J4282j9275k3351
7345e1309Q262K4770J5638J4735l038j6394p154J6241j4561k1272j1320j247L520
7332d3129J2017J3498P250J634n085O759l976m510j2290J179M714k884Q794J4064
7318a965j2870l536n411p411M258k132P109l419r368O628n31J4459R662k729l657
7303a0913j885L967L039N573M783j3201o162J8642p947j4195m304L791K8937j0666
7289e41o122j2696o764m31L297M267J1987P059J1m007J0453j5855j7566N100J2119
$$ plain form
7385 -27006 -6678 -3682 -4705 -24350 -18485 -8256 -15149 -23760 -18162 -6343 -16776 -38913 -43170
7372 -43170 -31652 -25413 -4174 1183 -14818 -13298 -7776 -9230 -6220 -2567 -8007 -18201 -17173 -27770
7358 -27770 -43310 -51798 -54335 -50780 -52433 -37234 -21954 -16365 -16841 -22965 -8683 -27958 -51309
7345 -51309 -43047 -18277 -2639 12096 9058 -7336 -14490 1751 -12810 -34082 -45402 -46649 -43129
7332 -43129 -31112 -17614 -10364 -8730 -13815 -7056 -11032 -15542 -27832 -26653 -21939 -24823 -16029 -1965
7318 -1965 -14835 -18371 -23782 -31193 -26935 -29067 -21958 -25377 -34745 -28117 -28648 -14189 -4527 -7256 -10913
7303 -10913 -12798 -8831 -5792 -219 4564 -8637 -14799 3843 -4104 -18299 -22603 -18812 10125 -541
7289 -541 -6663 -19359 -26123 -26554 -23257 -18990 -7003 56 67 -3940 6513 -9342 -26908 -21808 -9689
7274i689Q975j3571J9690J9301j7601k1284j3143j0171J6791J1122q086l908L540
7261a8034J0608J4361Q459j3771J2353j9923l60P890M754J207o178k4088j2339
7248c5061l857n652K8939O637q191M592p81r6M226J1098R089j0783k8623k0302
7234d8765j0374J2161Q400J9474O979l924L765L389j0659j5135K839P785k766
7221b6831K169j0976K3898K5847L513o271r714m178j1096J130K9712R693q904
7208A7992K57M28j4076j5561q280K5081Q828j2453j3971j4680o728J0741P706
7195a4716J126j8945Q82P361J5706O321j9618j0941j337p226J0061J5396J2627
7182c303K0238N739j0026k3263O700J4674K350K928m38j2206q092K458J1688M727
$$ plain form
7274 -9689 -714 -14285 5405 24706 7105 -14179 -27322 -37493 -20702 -9580 -17666 -21574 -18034
7261 -18034 -7426 6935 15394 1623 13976 -5947 -6307 1583 6337 7544 1366 -22722 -35061
7248 -35061 -38918 -44570 -15631 -8994 -17185 -12593 -13374 -13470 -9244 1854 10943 160 -28463 -48765
7234 -48765 -59139 -46978 -38578 -19104 -12125 -16049 -12284 -8895 -19554 -34689 -31850 -24065 -26831
7221 -26831 -24662 -35638 -11740 14107 17620 11349 1635 -2543 -13639 -12509 17203 26896 17992
7208 17992 18249 18677 4601 -10960 -19240 5841 14669 2216 -11755 -26435 -33163 -22422 -14716
7195 -14716 -13590 -32535 -31653 -24292 -8586 -2265 -21883 -32824 -34161 -41387 -31326 -15930 -3303
7182 -3303 16935 22674 12648 -10615 -3915 10759 13109 16037 15599 3393 -4699 -2241 9447 14174
7168A4174j7665k799J2916p784j1501j0786j1587j3280N452J195J6390J5077J0581
7155C83O215j4156k4019P212M52O093J6705Q755R46j1999j6377K037R84q846q191
7140c3806q836r00K0213K1768n930m773q360N496n691q903O994J5059j2242j1021
7126c0932j5228R039Q94J6793L512J063N13K401R26O669O26j4312J0994R779j7729
7111a4992j7492K32m787n883J0712J1681p926O789J495J2656J3101J5748J8725
7098D0059o865j9741o495j2172j516k403j7721j002J1379l988j3975K055J0886
7085b1499q97k2823j2159K5716J6830J3685r044j9201p352R27J4886P156k299
7072a6074K667P923J4882K2694j9665l1964J3360n954P713N556k1546R260j474
$$ plain form
7168 14174 -3491 -6290 6626 -1158 -12659 -23445 -35032 -48312 -42860 -41665 -25275 -10198 383
7155 383 6598 -7558 -31577 -24365 -23913 -17820 -1115 7640 8586 -3413 -19790 -17753 -16769 -25615 -33806
7140 -33806 -42642 -43542 -23329 -1561 -7491 -12264 -20624 -15128 -20819 -29722 -22728 -7669 -19911 -30932
7126 -30932 -46160 -37121 -36227 -19434 -15922 -14859 -14346 -11945 -11019 -4350 -3724 -18036 -7042 2737 -14992
7111 -14992 -32484 -32252 -37039 -42922 -32210 -20529 -28455 -21666 -20171 -7515 5586 21334 40059
7098 40059 33194 13453 6958 -5214 -6730 -9133 -26854 -27856 -16477 -20465 -34440 -32385 -21499
7085 -21499 -22396 -45219 -57378 -31662 -14832 -1147 -10191 -29392 -36744 -35817 -20931 -13775 -16074
7072 -16074 -13407 -5484 9398 32092 12427 -19537 -6177 -12131 -4418 1138 -20408 -11148 -12622
7059a2622J5223K194r371k0009k320p912k641J2755J2484N754Q80j7900o085L734
7045b5836J383Q354K0544J7889r276j3606J902P049J3127O270p945j6450p828
7032d423p292j0971O175K1772M786j0218R784J3454R254j7515q851m305m77J917
7018C090P700o226k3412j4078n393K3167L809Q355j0691j4034j8407j0237J2891
7005d3466N727j4485Q241J3899K245o330n862L760l799R219l554J0563J6485M724
6991b633R178M098k5860j1952j5582j652K5142J4707j0173M97l807q331Q59R779
6977a5730J498j0467r645J0923P495l472N543n552l539l983J1263J5803J031j1348
6963a0180O851r804R925q211j4931j4073k285P427j2949l715K4537L542P531p655
$$ plain form
7059 -12622 2601 4795 -4576 -24585 -26905 -34817 -37458 -24703 -12219 -6465 -5585 -23485 -29570 -25836
7045 -25836 -24453 -16099 4445 22334 13058 -548 1354 8403 21530 27800 19855 3405 -4423
7032 -4423 -11715 -22686 -16511 5261 10047 -171 9613 23067 32321 14806 5955 1650 1173 3090
7018 3090 10790 4564 -18848 -32926 -38319 -15152 -11343 -2988 -13679 -27713 -46120 -56357 -43466
7005 -43466 -37739 -52224 -43983 -30084 -27839 -34169 -40031 -36271 -40070 -30851 -34405 -23842 -7357 -2633
6991 -2633 6545 10643 -15217 -27169 -42751 -44403 -19261 -4554 -14727 -14230 -18037 -26368 -25509 -15730
6977 -15730 -14232 -24699 -34344 -23421 -15926 -19398 -13855 -19407 -22946 -26929 -15666 137 1168 -10180
6963 -10180 -3329 -13133 -3208 -11419 -26350 -40423 -42708 -35281 -48230 -51945 -27408 -23866 -16335 -23990
6949b3990R473J2927r367j4703J9350K3790k987O252k568o437m626k0546j454
6936a4886q261R250o195L598n992j2993q530K3254r090r424J186K4611o85p814
6922b1971l719R848O845O44m48J092j947L196P313r39O022o76q600o609p464j184
6906a8597J0854p771j7095p640M137l125l619j0384j5298O204J7034Q743m592
6893d1149j0359J8341o524r93k054K5557J6845J2279j78K816K816o070j5812o907
6879a1392k52P810P485R62l253J3396J0543m243k4960j0862P867r596J626j949
6865a6818K176Q687n363N519J9816J614j7726k3235j5866O710l376j0557J1717
6852c6702Q886N667P824Q614j9392K08K5769J627j8811j3326p710J1659k108o289
$$ plain form
6949 -23990 -14517 -1590 -10957 -25660 -6310 17480 14493 20745 18177 11740 7114 -13432 -14886
6936 -14886 -23147 -13897 -20092 -16494 -22486 -35479 -44009 -20755 -29845 -39269 -38083 -13472 -14157 -21971
6922 -21971 -25690 -15842 -8997 -8353 -8801 -7709 -9656 -6460 853 -86 5936 5260 -3340 -9949 -17413 -18597
6906 -18597 -7743 -15514 -32609 -40249 -36112 -39237 -42856 -53240 -68538 -62334 -45300 -36557 -41149
6893 -41149 -51508 -33167 -39691 -40684 -42738 -17181 -336 11943 11765 14581 17397 11327 -4485 -11392
6879 -11392 -11644 -3834 3651 4613 1360 14756 25299 21056 -3904 -14766 -6899 -16495 -14869 -16818
6865 -16818 -14642 -5955 -11318 -5799 14017 15631 -2095 -25330 -41196 -34486 -37862 -48419 -36702
6852 -36702 -27816 -22149 -14325 -5711 -25103 -24895 874 2501 -16310 -29636 -37346 -25687 -27795 -34084
6838c4084O287P958m521J8597K3335r878r466P519N29L527m450j7602q985J948
6824a9286j5743N299K1772K2271J5449j1306k1323k2356O002J7222j4177k316
6812a8492j6297K175O824J8605J293j1364L326k4075j7787K3306K7468K7145O02
6799B2729r971k1966j9607l880Q095K0964j3011Q929J719j7792l865J670J38K2250
6785c598J9643o182R911j7999q557k378j0927J8504j654l091m348p433p022R557
6771a5574J3950n304j9373l187J6941J0650K503R999M654M715j2906N176N484
6758A7728j4776J04r845j1439K136N976j304J0069Q184l217J9044r16k3653m303
6744f212J0682j45k0169n251J1570q682R516O891J1282K045q851M19k9597j9014
$$ plain form
6838 -34084 -27797 -19839 -24360 -5763 17572 7694 -1772 5747 6276 9803 5353 -12249 -21234 -19286
6824 -19286 -35029 -29730 -7958 14313 29762 18456 -2867 -25223 -19221 -1999 -16176 -18492
6812 -18492 -34789 -32614 -25790 -7185 -5892 -17256 -13930 -38005 -55792 -32486 -5018 22127 22729
6799 22729 12758 -9208 -28815 -32695 -24600 -3636 -16647 -7718 -5999 -23791 -27656 -25986 -25848 -3598
6785 -3598 16045 9863 19774 1775 -6782 -9160 -20087 -1583 -3237 -6328 -10676 -18109 -25131 -15574
6771 -15574 -1624 -6928 -26301 -29488 -12547 -1897 606 10605 15259 19974 7068 12244 17728
6758 17728 2952 3056 -6789 -18228 -16092 -10116 -11420 -1351 6833 3616 22660 21744 -1909 -6212
6744 -6212 4470 4325 -15844 -21095 -9525 -18207 -8691 -1800 9482 11527 2676 3095 -26502 -45516
6730d5516N159K8002J3392j7833k9631o518J391P845K5424K1176L899k2675o735
6717b2620J5151K2611L36j0941L713j4193M682J3956j8127P506K1973j4009j4837
6704d799j3580j0540J2625J8439r490j1657J1738J4863m508j2689k1362j854J2554
6691b0260R845j485J0602L97o592m509k4870j4659L21J7503K1982R915j0962L389
6677i383j5628k729j4938L191L092j4448R887J3963p687q183J3719K0763j1061
6664a9442n843Q870J0468q254m795Q484L814L192K133j3224j5785R875o680j3479
6650d0666J7215q124j6107J7932N349J518R045p397L386L1k935j1062K3185j7338
6636b5968k806J6604J5008k414j4755j5264j216J0898J209q072P548R3k823n965
$$ plain form
6730 -45516 -40357 -12355 1037 -16796 -46427 -52945 -51554 -43709 -18285 2891 6790 -15885 -22620
6717 -22620 -7469 15142 15478 4537 8250 -5943 -1261 12695 -5432 2074 24047 10038 -4799
6704 -4799 -18379 -28919 -16294 2145 -7345 -19002 -7264 7599 3091 -9598 -30960 -32814 -20260
6691 -20260 -10415 -11900 -1298 -901 -7493 -12002 -36872 -51531 -51210 -33707 -11725 -1810 -12772 -9383
6677 -9383 -25011 -27740 -42678 -39487 -36395 -50843 -40956 -26993 -34680 -42863 -29144 -8381 -19442
6664 -19442 -25285 -16415 -5947 -14201 -18996 -10512 -6698 -3506 -1373 -14597 -30382 -20507 -27187 -40666
6650 -40666 -23451 -31575 -47682 -29750 -24401 -22883 -13838 -21235 -17849 -17818 -20753 -31815 -8630 -25968
6636 -25968 -28774 -12170 2838 424 -14331 -29595 -30811 -19913 -18704 -26776 -19228 -19135 -21958 -27923
6622b7923K0246K7569r326j3804k614m748R60k284L261m356m048j1400m981R539
6608b3909J1179j2394p0m417J1300J0346j791J1101K018j1311K6133N138m988
6595A8335j0936k309j3386r441K574J3877P524j5594p266j1922L834R065O633
6582i012o294k596J0821J3199n578o195R605p168r900P215P44Q128j5984j0867
6568b3882Q107K5615J3464k365k1908k3592k648J3597J4302j0368K829P314J2367
6555A2832p343J371r38j191n786k864j3255P697P068n707j1272q29m646J222J5099
6540h542P273J362M849J0224J1269k572o821j3104p614R373q452j8634j024J1870
6526a0543n544j2063N969L0481j252M495p729k0956r098J289k3981J1785K3091
$$ plain form
6622 -27923 -7677 19892 10566 -3238 -5852 -10600 -9640 -11924 -8663 -13019 -17067 -28467 -33448 -23909
6608 -23909 -12730 -25124 -25194 -29611 -18311 -7965 -9756 1345 3363 -7948 18185 23323 18335
6595 18335 7399 5090 -8296 -17737 -15163 -1286 6238 -9356 -16622 -28544 -24710 -15645 -9012
6582 -9012 -15306 -17902 -7081 6118 540 -5655 3950 -3218 -13118 -5903 -5159 2969 -13015 -23882
6568 -23882 -15775 9840 23304 20939 -969 -24561 -27209 -13612 690 -9678 -6849 465 12832
6555 12832 5489 6860 5922 4731 -1055 -3919 -17174 -9477 -2409 -8116 -19388 -20217 -24863 -23641 -8542
6540 -8542 -1269 93 4942 15166 26435 23863 17042 3938 -3676 5697 -2755 -21389 -22413 -10543
6526 -10543 -16087 -28150 -22181 8300 7048 11543 3814 -17142 -26240 -24951 -48932 -37147 -14056
6513a4056J4279j9125j3096j2255J0240J917J724Q67k540O3L065J2108J2346k0346
6499b4809n561J236K180M519o952k1375l760N905J161J2918J4735K1708J0677
6486A2582R929N419j8755r493L856k0622K380M665J1482M551j6538j1124l157
6473b4825J1288J1784K686k0022J3343l800k6194J1521J7995J4236l7391k3490
6461e2869k199J703K2148K5735l387p108k423P424P250j1516J868J2877P12j5364
6447a5149k131k0769J545K0272j2131J0572K621K968J9223N696r956p298R079
6434D542k547j983R763J6530j896o197k2212j8997J4117K401p771n618o333l10
6420b6511J7057j431M459r155J4237J6751o959P155L63n721j4036l660l349L378
$$ plain form
6513 -14056 223 -18902 -31998 -44253 -34013 -32096 -30372 -29505 -32045 -31982 -28917 -16809 -4463 -24809
6499 -24809 -30370 -29134 -26954 -22435 -29387 -50762 -54522 -48617 -47456 -34538 -19803 1905 12582
6486 12582 22511 27930 9175 -318 3538 -17084 -14704 -10039 1443 5994 -10544 -21668 -24825
6473 -24825 -13537 -1753 933 -19089 -5746 -9546 -35740 -24219 -6224 8012 -29379 -52869
6461 -52869 -55068 -53365 -31217 -5482 -8869 -15977 -18400 -10976 -3726 -15242 -13374 -497 215 -15149
6447 -15149 -17280 -38049 -36504 -16232 -28363 -17791 -15170 -12202 7021 12717 2761 -4537 4542
6434 4542 1995 12 9775 26305 24409 18212 -4000 -22997 -8880 -6479 -14250 -19868 -26201 -26511
6420 -26511 -9454 -10885 -6426 -15581 -1344 15407 8448 15603 15966 10245 -3791 -7451 -10800 -7422
6406g422J3757P495N224k1454o416j5950L812J4150K332J1613R689k566j1049
6393C215l302o392J2427N935p136j6202J0556q471q684o358j1600p826O327O898
6379c0613K181J676M429R960L304k304M412Q96M949j1958k678m279n310J0020
6365a5315J3271M877O999j8783j2551N785l4J5136N767R914r709n414J081k2997
6351b1973k2169L738P191J2283R700m581J0843N372n849L772j977J9686L0096
6338D6132j9586j4806j2131j2252r553k1625K1843K0441l859q72m036j4089O846
6325a7547Q450J4494k87k3941j8945R686K952J172J373K106N245R796j198j6104
6311b2748J6657R696N844J0577j0253r247K71k1905j8307M388K1654R01p062J0260
$$ plain form
6406 -7422 6335 13830 19054 -2400 -8816 -24766 -20954 -6804 -4472 7141 16830 14264 3215
6393 3215 -87 -6479 5948 11883 4747 -11455 -899 -9370 -18054 -24412 -36012 -43838 -37511 -30613
6379 -30613 -28432 -26756 -22327 -12367 -9063 -11367 -6955 -6059 -1110 -13068 -15746 -20025 -25335 -15315
6365 -15315 -2044 2833 9832 -8951 -21502 -15717 -15751 -615 5152 15066 5357 -57 1024 -21973
6351 -21973 -44142 -40404 -33213 -20930 -11230 -15811 -4968 404 -5445 -1673 -3650 16036 46132
6338 46132 26546 11740 -391 -12643 -22196 -43821 -21978 -1537 -5396 -6268 -10304 -24393 -17547
6325 -17547 -9097 5397 5110 -18831 -37776 -28090 -25138 -23966 -22593 -20487 -15242 -5446 -6644 -22748
6311 -22748 -6091 3605 9449 20026 9773 526 797 -21108 -39415 -35027 -13373 -12472 -19534 -9274
6297i274j1674m722j5452n192K609K8196K9182J704o65p924p233q678j6324J7454
6283g993J7397P482J747j5616J3264J767r390j755r074m197O765j4613N755K6215
6269A7754o124j8507r155R284J0696j9254j7938K5072J0931L444J348o356j6405
6256a5210m924p820J7280J7687p565k6347n050L809R767Q859J0533o912j0316
6243a6209j0438J7487K0161m893K883j0641P739j7916o881O417j2062j4294J8264
6230b0383J3248k461r633n862J2389J8195J3934k4317j9606m667L114K423J7749
6217e877r910m463K1648m729k692M320r432K456p611J6271J8140k1603m318J0790
6203B990L484P565j1325j4532j3022q331J529P068j516J367K756j3123J6478K2764
$$ plain form
6297 -9274 -20948 -25670 -41122 -46314 -43705 -15509 13673 15377 14712 6788 -445 -9123 -25447 -7993
6283 -7993 9404 16886 18633 3017 16281 18048 8658 6903 -2171 -6368 397 -14216 -8461 17754
6269 17754 11630 -6877 -16032 -6748 3948 -15306 -33244 -8172 2759 6203 7551 1195 -15210
6256 -15210 -20134 -27954 -10674 7013 -552 -26899 -31949 -28140 -18373 -9514 1019 -5893 -16209
6243 -16209 -26647 -9160 11001 6108 8991 -1650 6089 -11827 -18708 -12291 -24353 -38647 -20383
6230 -20383 -7135 -9596 -19229 -25091 -12702 5493 19427 -4890 -24496 -29163 -26049 -23626 -5877
6217 -5877 -15787 -20250 1398 -3331 -6023 -1703 -11135 -8679 -16290 -19 18121 -3482 -7800 2990
6203 2990 6474 14039 2714 -11818 -24840 -33171 -31642 -24574 -26090 -24723 -21967 -35090 -18612 4152
6189D152J5224L225l586q625k0922j1698m369P4j843J6651j503M911P806R517
6175I014L634P7j4202j9132N88N057P565R080j0661n098P371J2376J2709n843
6161A2535j4948R458J5968j8942j7794j1558m318K709J2495M849J585L164J2588
6148G791n607j4337K00n3j2675K933P344J378n338M652n957P996r905j8374K3280
6133a6672J098j2746m874Q52n214L114j050Q102J594n652M020R520r265J7649
6119i524J0675k252j3723j0590q958Q662O115m931N373j45R184j220N262L739
6105b333R930j0804n097K046j564j8399M071K2806k681n432k710q072J142J4852
6091b245l843k1924J2228m283j2006N442J5867J1005J8919P105L782j3476k6735
$$ plain form
6189 4152 19376 22601 19015 10390 -10532 -22230 -26599 -26525 -28368 -11717 -13220 -8309 -503 9014
6175 9014 12648 12725 -1477 -20609 -20021 -14964 -7399 1681 -8980 -14078 -6707 5669 18378 12535
6161 12535 -2413 7045 23013 4071 -13723 -25281 -29599 -26890 -14395 -9546 -7961 -4797 7791
6148 7791 2184 -12153 -11953 -12006 -24681 -21748 -14404 -13026 -18364 -13712 -19669 -11673 -21578 -39952 -16672
6133 -16672 -15574 -28320 -33194 -32342 -37556 -34442 -35492 -27390 -25796 -31448 -27428 -17908 -27173 -9524
6119 -9524 1151 -1101 -14824 -25414 -34372 -25710 -19595 -24526 -19153 -19298 -10114 -11334 -6072 -2333
6105 -2333 7597 -3207 -8304 -6258 -7822 -26221 -22150 656 -2025 -7457 -10167 -18239 -17097 -2245
6091 -2245 -6088 -28012 -15784 -20067 -32073 -26631 -10764 241 19160 26265 30047 16571 -10164
6078a0164j3832K544m399M568K6900L114o213K606r829j7022k975J0658R85R237
6064c822j0690j7004Q678P293N32O416J4678K0534q652l4531n390K4995L1745
6051C4782j6978o875k66j2202j4116j2925j3941J088r737M686K0754Q164Q54l003
6037a9715O803K80N872o644p536J948M697J2736j9m698N946p815P136J8759p515
6022A0235k1879k050J6605L315k9384j0876J1006J2828J2380J0003j5275k8125
6010c1217N863K0054J4481r400j8010n577n95j8690N205J7930L88K702L037j161
5996a4990J3647P690k373P270j8734o271r700Q699Q213l157q471R743J6787j0870
5982b517k856R820N14o762j2021K560J4515P946r599j6997J371L132J4210J3257
$$ plain form
6078 -10164 -23996 -21452 -25851 -21283 5617 8731 2518 5124 -4705 -21727 -24702 -14044 -13059 -3822
6064 -3822 -14512 -31516 -22838 -15545 -15013 -8597 6081 26615 17963 -16568 -21958 3037 34782
6051 34782 17804 10929 10663 -1539 -15655 -28580 -42521 -41433 -51170 -46484 -25730 -17566 -16712 -19715
6037 -19715 -12912 -12632 -6760 -13404 -20940 -18992 -14295 -1559 -1578 -6276 -330 -8145 -1009 17750 10235
6022 10235 -11644 -13694 2911 6226 -23158 -34034 -23028 -10200 2180 12183 -3092 -31217
6010 -31217 -25354 -5300 9181 -219 -18229 -23806 -24401 -43091 -37886 -19956 -19568 -16866 -13829 -14990
5996 -14990 -1343 6347 3974 11244 -7490 -13761 -23461 -14762 -6549 -9706 -18177 -8434 8353 -2517
5982 -2517 -5373 4447 4961 -1801 -13822 -11262 3253 11199 1600 -15397 -14026 -10894 3316 16573
5968A6573j3047j3825k2768j961J4863l269L698O287j3049k108O05o0j916L1251
5954A274J4798k4343O158J3233l215k315j1237p51J0581J1112j724k5995m847
5941a7271M179l61j002p718m351L443J6190n052J4537p358M711N356q572l059
5927f328j2474o145n857J4462m764j3011m947L402J2736j2642J64K6445J2386
5914C427o238O604L813M555R241j1190k1575q041j968J0344k649k643j3790k901
5900c3011o12n443n28j8663Q012J2712N119K6474P398k5380K134O145J234L58
5886a4051j3617j1210o14J747J0940R536J0819J5924n508j6952M376m24m826P990
5872e870n825M308J2726J6515N362m099n489k4706j1051j9902l06L0106K8794
$$ plain form
5968 16573 3526 -10299 -33067 -35028 -20165 -23434 -19736 -13449 -26498 -28606 -28001 -28061 -29977 1274
5954 1274 16072 -8271 -2113 11120 7905 5590 -5647 -6398 4183 15295 13571 -12424 -17271
5941 -17271 -13092 -13453 -14455 -22173 -26524 -23081 -6891 -11943 2594 -4764 -53 5303 -3269 -6328
5927 -6328 -18802 -24947 -30804 -16342 -21106 -34117 -39064 -35662 -22926 -35568 -35404 -8959 3427
5914 3427 -2811 3793 7606 12161 21402 10212 -11363 -19404 -21372 -11028 -13677 -16320 -30110 -33011
5900 -33011 -33623 -39066 -39594 -58257 -50245 -37533 -32414 -5940 1458 -23922 -21788 -15643 -14409 -14051
5886 -14051 -27668 -38878 -39492 -37745 -26805 -17269 -6450 9474 3966 -12986 -8610 -9034 -13860 -5870
5872 -5870 -11695 -7387 5339 21854 27216 23117 17628 -7078 -18129 -38031 -38337 -8231 20563
5859B0563j7303l995l040N483J066l385Q717J0922N735J3933p357r462j3795L085
5845A1167l707j9688n96M837m050p969K687O442O296p432p543J5683K7530L56
5831B4013m840j396q885J2706l344j1793j8236k235J930K716k440q617j4995K3990
5817a1426K3288j018k861k414j4438k387K0883j4941j570m66l774j8601j1121
5804d0846j1748L285O322J2497J3806L643K790p962M67P004j6111J341q252J973
5790c1791J3023O152l869p007K892J4587Q895k2037L281N486j3474O888j904j0801
5776b9679J051J2388L205O767O407K2975l917q310L996n133p124j2653n78J17
5762a0488p784J419K6100q426j3244n976J1984R144J4901K180p357M750j1599
$$ plain form
5859 20563 3260 -735 -3775 1708 2774 -611 8106 19028 24763 38696 31339 21877 8082 11167
5845 11167 7460 -12228 -12824 -7987 -12037 -20006 -17319 -10877 -4581 -12013 -19556 -3873 23657 24013
5831 24013 19173 17777 8892 21598 18254 6461 -11775 -14010 -12080 -9364 -11804 -20421 -35416 -11426
5817 -11426 11862 10844 7983 5569 -8869 -11256 9627 -5314 -6884 -7350 -11124 -29725 -40846
5804 -40846 -52594 -49309 -42987 -30490 -16684 -13041 -10251 -18213 -17746 -10742 -26853 -25512 -33764 -31791
5790 -31791 -18768 -12616 -16485 -23492 -20600 -6013 2882 -19155 -15874 -10388 -23862 -16974 -18878 -29679
5776 -29679 -28628 -16240 -13035 -6268 139 23114 19197 10887 14883 9750 2626 -10027 -10605 -10488
5762 -10488 -18272 -16853 9247 821 -12423 -18399 -6415 2729 17630 19810 12453 17203 5604
5749E604l404J0382L734j1852j4436j124K3788k2037j8761J419O171J1639l387
5736a2264O354n826M020M365J1103r474K187j1904m725k434o015o523J2392J9021
5722B77J4381j396J3121j5894J14j744m581k2355j6628l716J8333K6688J4269
5709B0869O912l019J550K615j8536j7235k6124p401J1050K4793K5362K487k9897
5696f574k2197j576J7420K7105n103k0495O310o60r506q149m731o775M780J8196
5682a1955K35O911M166K842J087j2960q503k919K621q513K74K286r103P009j0346
5667c6868j332N294J3548R603k864j0543k529o013J8745P752l197K117j2938P896
5653a1329p897l272J8417J1114q691q457P614m482O82q698j1982R539J2877K389
$$ plain form
5749 5604 2200 12582 16316 4464 -9972 -11096 12692 -9345 -28106 -26687 -20516 -8877 -12264
5736 -12264 -5910 -11736 -7716 -3351 7752 -1722 465 -11439 -16164 -18598 -24613 -31136 -18744 277
5722 277 14658 13262 26383 10489 10603 8859 4278 -18077 -34705 -38421 -20088 6600 20869
5709 20869 27781 24762 26312 28927 10391 -6844 -32968 -40369 -29319 -4526 20836 23323 -6574
5696 -6574 -28771 -30347 -12927 14178 9075 -11420 -5110 -5770 -15276 -23425 -28156 -34931 -30151 -11955
5682 -11955 -11720 -4809 -643 2199 3286 -9674 -18177 -21096 -18475 -26988 -26714 -24428 -33531 -26522 -36868
5667 -36868 -38200 -32906 -19358 -9755 -12619 -23162 -25691 -31704 -12959 -5207 -8404 -6287 -19225 -11329
5653 -11329 -19226 -22498 -4081 7033 -1658 -10115 -2501 -6983 -6301 -14999 -26981 -17442 -4565 -2176
5639b176Q946l149p817O827k614q418L922j6711K84J9471j7730l895o733R735
5625b0058K1968m528j326q509m52J2576K9988J2138K092j5962L726J1417n786
5612C7284R95J2620M243j4969p287j5496o784k2487k899J7807j414k4187k6147
5599d8721N079R536p584Q908L2030K6887O294p355l0389p876J1138J6522p349
5586G120k9152k427O522p018j965J3345R143J1984L583M557j0443j8129p444J5056
5572e268O694K51j0746j3943J2002R709j0670J059J1009k245j7422J7771k2436
5559b4235k353k390J1317K0186j4418k103J5852p5P735n95p844Q684n19j3595
5545d353M090l41n300n865m153j0286k646M568M731j16J1224O805Q226M361j2474
$$ plain form
5639 -2176 6770 3621 -4196 2631 17 -8401 -4479 -21190 -20906 -1435 -19165 -23060 -29793 -20058
5625 -20058 1910 -2618 -3944 -12453 -12905 -329 29659 41797 43889 27927 31653 43070 37284
5612 37284 38279 50899 55142 40173 32886 17390 10606 -11881 -14780 3027 1613 -22574 -48721
5599 -48721 -43642 -34106 -41690 -32782 -752 26135 32429 25074 -5315 -13191 -2053 14469 7120
5586 7120 -22032 -24459 -17937 -24955 -26920 -13575 -4432 7552 11135 15692 5249 -12880 -20324 -5268
5572 -5268 1426 1677 -9069 -23012 -11010 -1301 -11971 -10912 97 -2148 -19570 -1799 -24235
5559 -24235 -26588 -28978 -17661 2525 -11893 -13996 1856 1781 9516 8921 1077 9761 9242 -4353
5545 -4353 -263 -604 -5904 -11769 -15922 -26208 -28854 -24286 -19555 -19671 -8447 -1642 6584 10945 -1529
5530a529p533l2034k388K0414J7928P35k004k380p572r809p342J5021p884Q785
5516a7592n39J0671o064j2771q368J0265q549J1258K5621n15m519j3849k366J9271
5502A954p54Q493n073q923o237L683M722n300o011J2396j3726J006j0310m691
5488b8771J6308J2399r078o148K598J2988l137j5028J0233j15M520j942r25N435
5474f63J5968j0206j1847K598J4450k55j5161j503o965J4400J7929j981j7975
5461a211R954J0011j5571O804k693j3317N660m081k346P20R824J1575K860j0568
5447G621j0559L92m921r881m909J6206N974j0608m106r024r753l110J0019J0349
5433a6310J879j7453m037J0309P179M064r865J910N761p265K5475J4618j7781
$$ plain form
5530 -1529 -9062 -41096 -43484 -23070 -5142 -4407 -6411 -8791 -16363 -26172 -33514 -18493 -26377 -17592
5516 -17592 -18131 -7460 -13524 -26295 -34663 -24398 -32947 -21689 3932 3417 -1102 -14951 -17317 1954
5502 1954 1200 9693 4620 -4303 -10540 -6857 -2135 -7435 -13446 -1050 -14776 -13770 -24080 -28771
5488 -28771 -12463 -64 -9142 -15290 -12692 296 -2841 -17869 -7636 -7751 -3231 -5173 -6098 -663
5474 -663 15305 5099 -6748 -4150 10300 10045 -5116 -6619 -13584 816 18745 16764 -1211
5461 -1211 8743 18754 3183 9987 7294 -6023 -363 -4444 -6790 -6070 3754 15329 18189 7621
5447 7621 -2938 -2546 -7467 -17348 -22257 -6051 -77 -10685 -14791 -23815 -33568 -36678 -26659 -16310
5433 -16310 -14431 -31884 -35921 -25612 -18433 -14369 -24234 -22324 -16563 -23828 1647 16265 -1516
5420a516k3605j4080K3716J9482O90m510o715q64J2222j2550k668o099j2378r883
5406c8758m595J2490l611L3734Q429p805n100k4152O731J1735l402j014K07k8865
5392d3976J7277L257J7753P19N203k646p126K03J4896j5756M125k3546P917J3990
5378g710j142J0932m278k4178n8J4334k2963j0714m6J5249M381J13J1704j1396
5364b5772Q55O366P743J6586j335p560j2298k2327o218J5151k863k225J4713J0368
5350h816L2051q945j1586k6684P617J9641K613l032p812j235j0799o368r607j0839
5336d3801J2109K4559K097J235j0649l03q494l740P235J6547k906j2536r924Q189
5322b0382J0799l702q081J2571o670j6572p183l915O27j2604R673Q963q249j7345
$$ plain form
5420 -1516 -25121 -39201 -15485 3997 4687 177 -6538 -7402 4820 -7730 -10398 -16497 -28875 -38758
5406 -38758 -43353 -30863 -34474 -740 7689 -116 -5216 -29368 -22637 -10902 -14304 -15318 -15111 -43976
5392 -43976 -26699 -23442 -5689 -4970 233 -2413 -9539 -9336 5560 -10196 -6071 -29617 -21700 -7710
5378 -7710 -8852 2080 -2198 -26376 -26434 -12100 -35063 -45777 -45823 -30574 -26193 -26080 -14376 -25772
5364 -25772 -24917 -18551 -10808 5778 4443 -3117 -15415 -37742 -43960 -28809 -31672 -33897 -19184 -8816
5350 -8816 23235 14290 2704 -23980 -16363 3278 5891 2859 -4953 -6188 -16987 -23355 -32962 -43801
5336 -43801 -31692 -7133 -5036 -3801 -14450 -14753 -23247 -26987 -19752 -3205 -6111 -18647 -28571 -20382
5322 -20382 -9583 -13285 -21366 -8795 -15465 -32037 -39220 -43135 -42508 -55112 -45439 -36476 -44725 -62070
5308f2070R061K7231K1574K1854R56r562j6490K17J4502M111p644r034L510K5491
5294B3707j195K508n891m622k3610j7199R859P097p987R413Q003P501R671J2034
5280B9289j780j3959m419J113j5947j0440R189M965n331j4046P269J5749r676
5267h024N779K1566J0102l1992j8394K1042j509Q807K193j4097j2820j759j666
5254b0772J1163o087j8133Q987J0178q671p34K140Q780j0564l728j1649R103Q349
5240b1638L235O287K2580P7j0267m751k258J7948l291j27j4596J173n376J87R239
5225a578J333R058j928p975m442J2646R966n001J87R150J4217j067j1897r087
5211A3582k309J1351j4641k6424r865J7455J1580k2272L399K7382R55o197l597
$$ plain form
5308 -62070 -53009 -25778 -4204 17650 18606 9044 -7446 -7229 7273 11384 3740 -5294 -1784 23707
5294 23707 22512 25020 19129 14507 -9103 -26302 -16443 -9346 -17333 -7920 83 7584 17255 29289
5280 29289 27509 13550 9131 10244 -5703 -16143 -6954 -1989 -7320 -21366 -14097 1652 -8024
5267 -8024 -2245 19321 29423 -2569 -20963 79 -1430 7377 9570 -4527 -17347 -19106 -20772
5254 -20772 -9609 -15696 -33829 -24842 -14664 -23335 -24069 -21929 -13149 -23713 -27441 -39090 -29987 -21638
5240 -21638 -18403 -12116 10464 10541 274 -4477 -6735 11213 7922 7795 -6801 -5628 -11004 -10817 -1578
5225 -1578 -245 8813 6885 -1090 -5532 7114 17080 12079 12266 21416 35633 34566 22669 13582
5211 13582 11273 22624 7983 -18441 -28306 -10851 729 -21543 -18144 9238 10193 3996 399
5198C99r973j4539p050O421K814R380l757P718o1J1687O674o835j051K740o234
5183a667p964k0029J2561K0141J2690l089r587O90J9915j2046k1235r118K230
5170a6508J6086J5686n983K415q588r045j6118k156j938k352J0712L885J0240
5157c664j5321l49P65j3963l325K783R168J7023p719j9467Q834K8487q62r244
5143f854K216J578O609j6096k6498N796K6241L01j1645n417j5880K219J3662Q121
5129a5647K472N624K3856r02q690o080l147j3051m725L006K0926N071N89L140
5115A2442J882l105j0853j2523j1586o136M997J0967O887N134k2120j2335O389
5102b9960Q099Q566J3908n283K228J2038j9500o828J6271j3983q675J3347J1441
$$ plain form
5198 399 -9574 -24113 -31163 -24742 -21928 -12548 -16305 -8587 -8648 3039 9713 2878 1827 4567 -1667
5183 -1667 -9631 -29660 -17099 3042 15732 12643 3056 3746 23661 11615 -9620 -18738 -16508
5170 -16508 -422 15264 9281 11696 3108 -5937 -22055 -24211 -26149 -28501 -17789 -13904 -3664
5157 -3664 -18985 -19334 -18569 -32532 -35857 -33074 -23906 -6883 -14602 -34069 -25235 3252 2390 -6854
5143 -6854 -4638 -3060 3549 -12547 -39045 -33249 -7008 -6707 -18352 -23769 -39649 -37430 -23768 -15647
5129 -15647 -13175 -7551 16305 15403 6713 633 -2514 -15565 -20290 -17284 3642 8713 9302 12442
5115 12442 14324 11219 366 -12157 -23743 -29879 -24882 -13915 -7028 -1894 -24014 -36349 -29960
5102 -29960 -21861 -13295 613 -4670 -2442 9596 -9904 -16732 -461 -14444 -23119 -9772 1669
5089A669K1948N452L28k4637j5972K157R754p884q607J5408K9159J784j8350j2640
5075d31P33N956j689K084J7821o011Q737M281j0717R43p749q432L536Q18j7245
5060g365Q901M338q792o394l576r727P0J0849O612r544o283N800m221j2767N263
5045b6836J4607J9933K159J898m573J2963j2450m480j0901J64j4580R1Q760k520
5031a5765m397N73R174j0840j5353P842J5833L648j2344J1093J3348j60k1272
5018a8620O105J9170j162m168K201q867p908J8437J4810P269O350k0599j4175
5005a157j1065n942L46K1152K3943K516j2044J90n676q494j8281L49r69j754r457
4990b6343j3501J9380J5534j2871j2581m018k51r258N947N793P814K0307K778
$$ plain form
5089 1669 23617 29069 29397 4760 -11212 -9055 699 -7185 -15792 -384 28775 30559 12209 -431
5075 -431 302 6258 4569 6653 24474 18463 27200 31481 20764 21707 13958 5526 9062 9880 -7365
5060 -7365 1536 5874 -2918 -9312 -12888 -22615 -22545 -11696 -5084 -14628 -20911 -15111 -19332 -32099 -26836
5045 -26836 -12229 7704 9863 11761 7188 20151 7701 3221 -7680 -7516 -22096 -22005 -13245 -15765
5031 -15765 -20162 -19589 -10415 -21255 -36608 -28766 -12933 -9285 -21629 -10536 2812 2652 -18620
5018 -18620 -12515 6655 5493 1325 3526 -5341 -13249 5188 19998 27267 33617 13018 -1157
5005 -1157 -12222 -18164 -17818 3334 27277 29793 17749 17939 12263 3769 -14512 -14163 -15132 -16886 -26343
4990 -26343 -39844 -20464 -4930 -17801 -30382 -34400 -34651 -43909 -37962 -32169 -24355 -4048 -1270
4977a270O754R249l284j1150k849p763P496j598j0874r971K0396K5408r924q852
4963A768o895r189J9616J3355r930o209j6376J1195R620j884j2385q652J8073
4950B107J6929n232j2452N269P304K241j7694q599J1768K0160j4619o765J4076
4937A4493J6371o187j3843l6468j0463J6166N849R842L640N463j2719j5935r441
4924c3232M235q027k176Q81J2382L427N566J5224J5995J0273j3024k9588n602
4911b3666k651K1855K346j9657J308Q934j0832r58J4624j6828L656k377q86l241
4897b8373J52Q783l48r757J0053J1257l512k345M993k163J21l212k2194m738K766
4882c8517J0000J9894j145J314n518r155Q88r62R331m307R393j0222k921M533
$$ plain form
4977 -1270 5484 14733 11449 299 -2550 -10313 -2817 -4415 -15289 -25260 -4864 20544 10620 1768
4963 1768 -5127 -14316 5300 18655 8725 2516 -13860 -2665 6955 5071 -7314 -15966 2107
4950 2107 19036 13804 1352 6621 13925 16166 -1528 -10127 1641 21801 7182 417 14493
4937 14493 30864 24677 10834 -25634 -36097 -19931 -14082 -4240 -600 4863 -7856 -23791 -33232
4924 -33232 -28997 -37024 -39200 -38319 -25937 -22510 -16944 -1720 14275 24548 11524 -18064 -23666
4911 -23666 -26317 -4462 -2116 -21773 -20465 -11531 -22363 -23321 -8697 -25525 -21869 -24246 -25132 -28373
4897 -28373 -28221 -19438 -19786 -29543 -19490 -8233 -11745 -14090 -9097 -11260 -11139 -14351 -36545 -41283 -38517
4882 -38517 -28517 -8623 -9768 -8454 -13972 -23127 -22239 -23201 -13870 -18177 -8784 -19006 -21927 -17394
4868a7394J3306k34K1611J145R576j865j9410k4693N903P754J859j8506j210J3799
4854h359M34K3915k548j6305l364q603q590j0916J5832j0768n32p509P352J0209
4840a9752k247M227p508l864j502N952P615R161J1757J153m040J305J4207j0091
4826F373k918q691j2773m846J9498o824P478J4790r871j6363j4590P238P075M719
4812i705j189l494J5375p052r577J0238j0805j7982R960J1871k090K141J4920
4799B611K868L795R139j1280j3637K710J060q112Q197o268n022m558J0702k2515
4785c0310k0300M597N771R565r141j1162M789J0983J3178R187n468k121L137J3233
4771d062J9309o523p772J6520O863m979k1152k879q00j4353K3964K764q558P660
$$ plain form
4868 -17394 -4088 -4322 17289 18434 28010 26145 6735 -17958 -12055 -4301 -2442 -20948 -22158 -8359
4854 -8359 -7925 15990 13442 -2863 -6227 -14830 -23420 -34336 -18504 -29272 -29804 -37313 -29961 -19752
4840 -19752 -21999 -17772 -25280 -29144 -30646 -24694 -17079 -7918 3839 4992 952 2257 16464 6373
4826 6373 3455 -5236 -18009 -22855 -3357 -10181 -2703 12087 2216 -14147 -28737 -21499 -14424 -9705
4812 -9705 -10894 -14388 987 -6065 -15642 -5404 -16209 -34191 -24231 -12360 -14450 -12309 2611
4799 2611 5479 9274 18413 7133 -6504 -3794 -2734 -10846 -2649 -8917 -13939 -18497 -7795 -30310
4785 -30310 -50610 -46013 -40242 -30677 -39818 -50980 -46191 -35208 -22030 -12843 -18311 -20432 -17295 -4062
4771 -4062 15247 8724 952 17472 24335 19356 -1796 -4675 -5475 -19828 4136 6900 -1658 6002
4757F002q23j6015j0057K0851N556j1099m462J5617M351j3130o36J4307K1321
4744C1783M242l0344j8317J1084K7138j7605q308m958J7155J2639p982j5651J7883
4731A8759M904M148J74m430j0933j1346J521J1588Q987n911R726j90j1133M319
4717B0183l577k355p855j0307k5003m301K553J7035q770k555j965Q021R483J2286
4703B873M817o292l187J8013Q48q356J0059r615j3837J953O063l725j1343P357
4689d372q934m813L0123j2057j8728R465P519N584J4190k111j5784M10K3829O569
4675C0890Q714j6176j1214o358J4513O781j5615j8793j1177R19K921j1225l771
4662b9591M250O181O254J7237O874j6534N293O480r414j4600o374R54J0644J4781
$$ plain form
4757 6002 5179 -10836 -20893 -42 5514 -5585 -10047 5570 9921 -3209 -3845 10462 31783
4744 31783 36025 5681 -12636 -1552 25586 7981 -327 -5285 11870 24509 16527 876 18759
4731 18759 23663 27811 27985 23555 12622 1276 2797 14385 23372 17461 27187 26997 15864 20183
4717 20183 16606 14251 6396 -3911 -28914 -33215 -30662 -13627 -22397 -24952 -26917 -18896 -9413 2873
4703 2873 7690 1398 -1789 16224 17072 8716 18775 9160 -4677 -2724 3339 -386 -11729 -4372
4689 -4372 -13306 -18119 12004 -53 -18781 -9316 -1797 3787 17977 15866 82 492 24321 30890
4675 30890 39604 23428 12214 5856 20369 27150 11535 -7258 -18435 -17516 -14595 -25820 -29591
4662 -29591 -25341 -19160 -12906 4331 11205 -5329 -36 6444 -2970 -17570 -23944 -22990 -12346 2435
4648B435J8485J5799j6795l6516j3569J5852K0480L169j7390l353P324O106n322
4635c295J272n80m414j064K291J057J772j105j0448n38N050r576o976O01J0880
4620a5073K502J4789L426j6654J014Q523l641l586j0856j4883q078j1636o992
4607f1145J0633K5197L2141K475M052k186Q257j3967j9739j6409O794J1984K0220
4594H307p550N378o689k5094J7501J6056j9311k9540j0823J7027K4608j2322N26
$$ plain form
4648 2435 20920 36719 19924 -16592 -30161 -14309 6171 9340 -8050 -11403 -4079 2027 -3295
4635 -3295 -2023 -2603 -7017 -8081 -5790 -4733 -2961 -4066 -14514 -15052 -10002 -19578 -26554 -25953 -15073
4620 -15073 -12571 2218 5644 -11010 -9996 -1473 -5114 -8700 -19556 -34439 -42517 -54153 -61145
4607 -61145 -50512 -25315 6826 9301 13353 11167 19424 5457 -14282 -30691 -23897 -11913 8307
4594 8307 757 6135 -554 -25648 -8147 7909 -11402 -40942 -51765 -34738 -10130 -22452 -21926
$$ [...]
##END NTUPLES=NMR SPECTRUM
##END=
