##TITLE=Analysis number 322490
Compound Code cd 03352
Book Reference a
Project Code adrs
Chemist Name ians
##JCAMPDX= 6.0         $$ Bruker NMR JCAMP-DX V2.0
##DATA TYPE= NMR SPECTRUM
##DATA CLASS= NTUPLES
##ORIGIN= Bruker BioSpin GmbH
##OWNER= nmr
$$ XWIN-NMR		Version 3.5
$$ Thu Sep 28 09:26:59 2006 GMT Daylight Time (UT+1h)  MAYBRIDGE\nmr@NMR_250MHZ
##.OBSERVE FREQUENCY= 250.131544655141
##.OBSERVE NUCLEUS= ^1H
##.ACQUISITION MODE= SIMULTANEOUS (DQD)
##.ACQUISITION SCHEME= undefined
##.AVERAGES= 16
##.DIGITISER RES= 18
##SPECTROMETER/DATA SYSTEM= dpx250
##.PULSE SEQUENCE= zg30
##.SOLVENT NAME= DMSO
##.SHIFT REFERENCE= (INTERNAL, DMSO, 0, 16.522)
##AUDIT TRAIL= $$ (NUMBER, WHEN, WHO, WHERE, WHAT)
$$ ##TITLE= Audit trail, XWIN-NMR		Version 3.5
$$ ##JCAMPDX= 5.01
$$ ##ORIGIN= Bruker BioSpin GmbH
$$ ##OWNER= nmr
$$ C:\u/data/dgb/nmr/ADRS/1530/pdata/1/auditp.txt
$$ ##AUDIT TRAIL=  $$ (NUMBER, WHEN, WHO, WHERE, WHAT)
(   1,<2006-09-28 09:26:31.08 +100>,<MAYBRIDGE\nmr>,<NMR_250MHZ>,
      <created by zg, POWCHK disabled, PULCHK disabled
       configuration hash MD5:
       E2 DF 36 D8 04 B2 41 60 5A D7 A3 38 5A 4B D0 FE
       data hash MD5: 64K
       3A EC 10 41 C5 1B 4A 2E 01 6A 9C D7 9A 45 7F 8B>)
(   2,<2006-09-28 09:26:46.73 +100>,<MAYBRIDGE\nmr>,<NMR_250MHZ>,
      <Start of raw data processing
       ef LB = 0.3 FT_mod = 6 PKNL = 1 SI = 32K 
       data hash MD5: 32K
       B8 55 42 EC 14 24 69 ED 8F 17 A2 C5 C3 D7 A8 6B>)
(   3,<2006-09-28 09:26:48.52 +100>,<MAYBRIDGE\nmr>,<NMR_250MHZ>,
      <apk 
       data hash MD5: 32K
       78 AB 9D 9D EB D3 0C 6C ED F2 B2 20 54 86 24 DC>)
(   4,<2006-09-28 09:26:49.36 +100>,<MAYBRIDGE\nmr>,<NMR_250MHZ>,
      <abs ABSG = 5 
       data hash MD5: 32K
       C5 10 87 17 71 3A 76 20 8C 07 7C 53 A2 06 4D A3>)
$$ ##END=
$$ 
$$ hash MD5
$$ 9B 88 93 2D 9C 72 C1 FB 94 52 38 16 2B C8 4D 98
##$RELAX= 
##$RELAX= 
##$RELAX= 
##$RELAX= 
##$RELAX= 
##$RELAX= 
##$RELAX= 
$$ Bruker specific parameters
$$ --------------------------
##$DU= <C:\u>
##$EXPNO= 1530
##$NAME= <ADRS>
##$PROCNO= 1
##$TYPE= <nmr>
##$USER= <dgb>
##$AMP= (0..31)
100 100 100 100 100 100 100 100 100 100 100 100 100 100 100 100 100 100 
100 100 100 100 100 100 100 100 100 100 100 100 100 100 
##$AQSEQ= 0
##$AQ_mod= 3
##$AUNM= <au_zg>
##$AUTOPOS= <20 >
##$BF1= 250.13
##$BF2= 250.13
##$BF3= 250.13
##$BF4= 250.13
##$BF5= 500.13
##$BF6= 500.13
##$BF7= 500.13
##$BF8= 500.13
##$BYTORDA= 1
##$CFDGTYP= 0
##$CFRGTYP= 5
##$CHEMSTR= <none>
##$CNST= (0..31)
1 1 145 1 1 1 1 1 1 1 1 1 1 1 1 1 1 1 1 1 1 1 1 1 1 1 1 1 1 1 1 1 
##$CPDPRG= <>
##$CPDPRG1= <>
##$CPDPRG2= <>
##$CPDPRG3= <>
##$CPDPRG4= <mlev>
##$CPDPRG5= <mlev>
##$CPDPRG6= <mlev>
##$CPDPRG7= <mlev>
##$CPDPRG8= <mlev>
##$CPDPRGB= <>
##$CPDPRGT= <>
##$D= (0..31)
0 1 0 0 0 0 0 0 0 0.06 0 0 0 0 0 0 0.0002 0 0 0 0 0 0 0 0 0 0 0 0 0 0 
0 
##$DATE= 1159431989
##$DBL= (0..7)
120 120 120 120 120 120 120 120 
##$DBP= (0..7)
150 150 150 150 150 150 150 150 
##$DBP07= 0
##$DBPNAM0= <>
##$DBPNAM1= <>
##$DBPNAM2= <>
$$ [...]
##$SUBNAM7= <"">
##$SUBNAM8= <"">
##$SUBNAM9= <"">
##$SW= 20.6930455092707
##$SWIBOX= (0..15)
0 0 3 0 0 0 0 0 0 0 0 0 0 0 0 0 
##$SW_h= 5175.983436853
##$TD= 65536
##$TD0= 1
##$TE= 295.16
##$TE2= 300
##$TE3= 300
##$TEG= 300
##$TL= (0..7)
0 120 120 120 120 120 120 120 
##$TP= (0..7)
150 150 150 150 150 150 150 150 
##$TP07= 0
##$TPNAME0= <>
##$TPNAME1= <>
##$TPNAME2= <>
##$TPNAME3= <>
##$TPNAME4= <>
##$TPNAME5= <>
##$TPNAME6= <>
##$TPNAME7= <>
##$TPOAL= (0..7)
0.5 0.5 0.5 0.5 0.5 0.5 0.5 0.5 
##$TPOFFS= (0..7)
0 0 0 0 0 0 0 0 
##$TUNHIN= 0
##$TUNHOUT= 0
##$TUNXOUT= 0
##$USERA1= <user>
##$USERA2= <user>
##$USERA3= <user>
##$USERA4= <user>
##$USERA5= <user>
##$V9= 5
##$VALIST= <valist>
##$VCLIST= <CCCCCCCCCCCCCCC>
##$VD= 0
##$VDLIST= <DDDDDDDDDDDDDDD>
##$VPLIST= <PPPPPPPPPPPPPPP>
##$VTLIST= <TTTTTTTTTTTTTTT>
##$WBST= 1024
##$WBSW= 4
##$XGAIN= (0..3)
0 0 0 0 
##$XL= 0
##$YL= 0
##$YMAX_a= 266160
##$YMIN_a= -354595
##$ZGOPTNS= <>
##$ZL1= 120
##$ZL2= 120
##$ZL3= 120
##$ZL4= 120
##$ABSF1= 16.522
##$ABSF2= -4.171173
##$ABSG= 5
##$ABSL= 3
##$ALPHA= 0
##$AQORDER= 0
##$ASSFAC= 0
##$ASSFACI= 0
##$ASSFACX= 0
##$ASSWID= 0
##$AUNMP= <proc_1d>
##$AZFE= 0.1
##$AZFW= 0.1
##$BCFW= 0
##$BC_mod= 0
##$BYTORDP= 0
##$COROFFS= 0
##$CY= 12.5
##$DATMOD= 1
##$DC= 0
##$DFILT= <>
##$DTYPP= 0
##$F1P= 14.0000005364418
##$F2P= -0.99999901652339
##$FCOR= 0.5
##$FTSIZE= 32768
##$FT_mod= 6
##$GAMMA= 0
##$GB= 0
##$INTBC= 1
##$INTSCL= 1
##$ISEN= 128
##$LB= 0.3
##$LEV0= 0
##$LPBIN= 0
##$MAXI= 10000
##$MC2= 0
##$MEAN= 0
##$ME_mod= 0
##$MI= 0
##$NCOEF= 0
##$NC_proc= -5
##$NLEV= 6
##$NOISF1= 0
##$NOISF2= 0
##$NSP= 0
##$NTH_PI= 0
##$NZP= 0
##$OFFSET= 16.522
##$PC= 1
##$PHC0= 143.521
##$PHC1= 13.20633
##$PH_mod= 1
##$PKNL= yes
##$PPARMOD= 0
##$PSCAL= 4
##$PSIGN= 0
##$REVERSE= no
##$SF= 250.13
##$SI= 32768
##$SIGF1= 0
##$SIGF2= 0
##$SINO= 400
##$SIOLD= 32768
##$SREGLST= <1H.DMSO>
##$SSB= 0
##$STSI= 32768
##$STSR= 0
##$SW_p= 5175.98343685301
##$SYMM= 0
##$S_DEV= 0
##$TDeff= 65536
##$TDoff= 0
##$TI= <Analysis number 999999
Compound Code 99
Book Reference 9
Project Code 9>
##$TILT= no
##$TM1= 0
##$TM2= 0
##$TOPLEV= 0
##$USERP1= <user>
##$USERP2= <user>
##$USERP3= <user>
##$USERP4= <user>
##$USERP5= <user>
##$WDW= 1
##$XDIM= 32768
##$YMAX_p= 302868321
##$YMIN_p= -1145365
$$ End of Bruker specific parameters
$$ ---------------------------------
##NTUPLES= NMR SPECTRUM
##VAR_NAME=  FREQUENCY,     SPECTRUM/REAL,   SPECTRUM/IMAG
##SYMBOL=    X,             R,               I
##VAR_TYPE=  INDEPENDENT,   DEPENDENT,       DEPENDENT
##VAR_FORM=  AFFN,          ASDF,            ASDF
##VAR_DIM=   32768,         32768,           32768
##UNITS=     HZ,            ARBITRARY UNITS, ARBITRARY UNITS
##FACTOR=    0.157963299565203, 1,           1
##FIRST=     4132.6476996994, 0,             0
##LAST=      -1043.33573715361, 0,           0
##MIN=       -1043.33573715361, -1145365,    0
##MAX=       4132.6476996994, 302868321,     0
$$ Real data points
##PAGE= N=1
##DATA TABLE= (X++(R..R)), XYDATA
$$ [...]
15564b05564J59340Q0234K13015R2129j51200j05492n042o4125q479J32333P8776
15553B15925K46638j78636o5452K09496K57333k66858o08436k28548j55403K3252
15543e50689j11626P0387J44554O7441m8671M1545J31541K587j01352k7240K49034
15532a32489l7442m7742L5049j46426l5150K48808l621j10716m9479O9422M7234
15521a62552J57045J87756j1674J86931J81081J26187l10238k83870L23580Q365
15511D02611p7556N6722L2862j40705k31140j60156k29458P0825K03028K12262
15501A39295j13146J08191j40088J94866j27316j68699O2161M1392j19881j50584
15491b73809O1729J60242J54721l34290n12301J25172J97717p5924l42072K65284
$$ y = [-205564, -46224, 34010, 247025, 339154, 187954, 82462, 77420, 13295, 4816, 137149, 215925, 462563, 283927, 218475, 427971, 685304, 418446, -189990, -418538, -573941, -550689, -662315, -591928, -447374, -379933, -428604, -387059, -255518, -252931, -354283, -381523, -132489, -169931, -217673, -182624, -329050, -364200, -115392, -119013, -229729, -279208, -209786, -162552, -5507, 182249, 170575, 357506, 538587, 664774, 354536, 70666, 394246, 402611, 325055, 381777, 414639, 273934, 42794, -117362, -346820, -275995, -72967, 139295, 26149, 134340, -5748, 189118, 61802, -106897, -44736, -3344, -123225, -273809, -212080, -51838, 102883, -231407, -743708, -618536, -420819, -496743, -838815, -573531]
15481e73531L94691J38713j0796P5186q23k7497j73218J0959k6344N7916l5013
15470a69757R7516P6266q6871r2833k34533n0747K60736P8188j01473N6826p4583
15459b41265K87018Q1989o2550j44485k98768k4335J95805l1136l71044n4499
15449f63270O26978K75158l42594k0514k00943j51483o8933n2433J30338J46053
15439c21643L0807J82702j25922j98535K8919J63721M5911k85019M4344K93989
15429a40726Q0074k88385O9752J07075J24770J60420o7536O8319q5613j29712
15419a01562O3136J39307j5117j23926j35780L1022r2977Q7365q6003l13769j42253
15408f90557P7686N8994J70215K7249j06579k00387L3154K48500J4427J9079q1149
$$ y = [-573531, -178840, -40127, -50923, 24263, 23440, -4057, -177275, -166316, -192660, -134744, -169757, -72241, 4025, -82846, -175679, -410212, -460959, -200223, -122035, -223508, -166682, -241265, 45753, 127742, 65192, -79293, -378061, -402396, -206591, -237727, -608771, -663270, -36292, 238866, -103728, -124242, -325185, -476668, -545601, -598034, -467696, -321643, -290836, -108134, -234056, -432591, -403672, -239951, -194040, -479059, -434715, -140726, -60652, -349037, -279285, -172210, -47440, 112980, 45444, 113763, 28150, -101562, -38426, 100881, 85764, -38162, -173942, -142920, -235897, -148532, -234535, -548304, -690557, -612871, -553877, -383662, -356413, -462992, -663379, -630225, -381725, -367298, -348219, -429368]
15397d29368r5879j10599n8352M9971K72896K88667K85423j0512p4354n4353k22017
15386a58477k81730j71151Q9748M062N2553L2185L2644O520p1290j2246j18311
15375e95493K29214Q7458j45764j12971j2723j3377r2259J11124r564l48216Q0281
15364h22290L73480M22271J83440l18262j27901P8315R520J58166P9405j37616
15354a01472k19163J28556J26120n4031k14901Q9955o4359j98219l8966J45867
15344d00613k563j63534j79320L93429L72795R503j45359Q6974J85320L0510j09746
15333G7396r1451k65342j80538j30844K08973l2140N484k787l4770J51731J46292
15322a47996K3107M3917Q653J65264L2100q3270o5344k90141r6200j8941k50149
$$ y = [-429368, -525247, -635846, -694198, -644227, -371331, -82664, 202759, 192247, 117893, 63540, -158477, -440207, -611358, -521610, -517548, -464995, -432810, -400166, -393646, -464936, -477182, -595493, -366279, -278821, -424585, -537556, -550279, -563656, -655915, -544791, -554355, -902571, -822290, -448810, -26539, 156901, -161361, -289262, -210947, -201427, -43261, 36144, -101472, -320635, -192079, -65959, -119990, -334891, -244936, -309295, -507514, -546480, -400613, -403176, -566710, -746030, -352601, 20194, 29697, -115662, -28688, 156632, 187142, 77396, -14055, -279397, -459935, -590779, -381806, -413946, -408462, -411249, -446019, -294288, -147996, -124889, -80972, -72319, 92945, 125045, 41775, -23569, -313710, -409910, -428851, -679000]
15311f79000j61938J98038J56128q4801J75135M37182J23770l28866l90170j741
15301e56263L5124K27424P091j9631m6297j23314o8871L4232K87326j47719n7091
15290d27989Q5750L6716j07016N0713K71606O9176K56832R4309k40268j44888
15280e5059N6763n5008K33767K63643j12807j9340j90829m3479j41064j59095
15270b22508j27859K45743N06837K50741l2800q3593j05880K56045M12441L03479
15260A402646M12856L60533M89455L90679J0185L87697N39229M73877J14525o86468
15250C895214j024405p60203p18602l12592k3595k95687j91656m0398j65850k95427
15240F6799J27887K69039Q2400j19728j10358J8187k78894j66220J99402K47941
$$ y = [-679000, -840938, -642900, -486772, -571573, -396438, 40744, 164514, -164352, -554522, -556263, -521139, -293715, -286624, -306255, -352552, -475866, -544737, -510505, -223179, -370898, -427989, -342239, -305523, -412539, -361826, -90220, -21044, 235788, 330097, 89829, -55059, 1704, -53304, 180463, 444106, 331299, 311959, 121130, 77651, -63413, -222508, -350367, -104624, 402213, 652954, 620154, 536561, 430681, 686726, 1099167, 1402646, 1815502, 2176035, 2665490, 3056169, 3066354, 3454051, 3993280, 4467157, 4581682, 3895214, 2870809, 2110606, 1392004, 1079412, 1055817, 760130, 568474, 528076, 362226, 66799, 194686, 463725, 546125, 426397, 316039, 334226, 55332, -110888, 88514, 336455]
15230C36455J21837O0470k67250k98486K7061J84937K02498K12916j38228j64063
15220B78147L5601K65553n9287k96080q7367k1830N5512M7616J63912K71952k84635
15209C69094l81212k8772J15627o6247R4025r0516J24001K14004k0701r9729j25772
15198A03802r1136J2472R9453j97208J79161P5830j68654k94418j48348K8908
15188d00138K067k03632J43899K15456j45559J04522k399k27798J99220R3542
15178b20820j02977O1398K18411K70302o7188N8391j64119L6637j62110j51921
15168b23996l6987J37168K53918J95162j42743j26549j78385J90101K44071q6021
15158B25739j97369j28147p9926p5858J42662Q9928j79987P6515L85659Q8734
$$ y = [336455, 458292, 518762, 251512, -46974, -19913, 165024, 367522, 580438, 442210, 278147, 313748, 579301, 520014, 223934, 136567, 114737, 170249, 217865, 381777, 653729, 369094, -12118, -40890, 74737, 8490, 102515, 11999, 136000, 350004, 329303, 229574, 103802, 12666, 25138, 124591, -72617, 106544, 182374, 13720, -280698, -429046, -400138, -398071, -601703, -457804, -242348, -387907, -283385, -285784, -513582, -314362, -220820, -323797, -262399, -43988, 226314, 159126, 217517, 53398, 90035, -72075, -223996, -260983, -123815, 130103, 325265, 182522, 55973, -122412, 67689, 311760, 225739, 28370, -99777, -179703, -255561, -112899, -22971, -202958, -126443, 259216, 347950]
15148C47950J50654J2989j04347j07757j05082j45898j19486K14170K68138k49170
15138A62161j80941l2151M5790K7693o167P8603j04832j17562J8588j9828J77557
15127D8911j42933K05723J81217k28547k34003j49625Q7222J89182J3359J58343
15117A28849P9362J14876j41659k04723j93253J40245M61397j79173m42060l22223
15107e58362J11155L30187J47650Q5072M4601l6347K591r2797j22434L6846J79970
15096A28132j17174k83271J68957M8353P5025j63840L38242q1712l13150j25323
15086c25761j75875m0231L41958Q6077j99253l3148L85235K48611o1391k83849
15076e7627L7188R5178j60863j18212L7473J81335j28531j35462M853n2725p651
$$ y = [347950, 498604, 511593, 407246, 299489, 194407, 48509, -70977, 143193, 411331, 162161, -18780, -50931, -5141, 22552, 16385, 94988, -9844, -127406, -108818, -128646, 48911, -94022, 111701, 292918, 64371, -169632, -319257, -232035, -42853, -29494, 128849, 208211, 323087, 181428, -23295, -216548, -76303, 385094, 205921, -236139, -558362, -447207, -117020, 30630, 115702, 160303, 123956, 126547, 33750, -88684, -51838, 128132, 10958, -272313, -103356, -55003, 20022, -143818, 194424, 112712, -200438, -325761, -501636, -541867, -199909, -113832, -313085, -346233, 39002, 287613, 226222, -57627, -20439, 74739, -86124, -204336, -166863, 14472, -114059, -249521, -244668, -297393, -305044]
15065c05044n8803O2961J09977j25956n0311J75694K42175n5856j0752n1489k23042
15054b90446O8449J18128O8278J20534K04819Q1768o6851j35134j01295P5663
15044A43913O4936L1450k39963k67293m44251L2160L01595K15423K17888J73183
15034B29041k7456J9361l9435q1015l0795k49523N9343K67664J20211k10921j59463
15023a02988m4623p9230p4031L32086k91166j74918J47948N01647j86323j60593
15013a32191K50112J41052m8469j21608k28538M6347j50519k17470K09770L23486
15003G1972k097K0864j67395m434L12142J91875j09619m87015o3211n1111l7285
14992c25314N8876p6576R7166L38993L6895J9357J600j10217l6146k7758J12577
$$ y = [-305044, -363847, -300886, -190909, -316865, -367176, -191482, 50693, -5163, -15915, -67404, -290446, -221997, -103869, -35591, 84943, 289762, 371530, 304679, 169545, 68250, 143913, 208849, 240299, 336, -266957, -711208, -679048, -377453, -162030, 55858, 229041, 201585, 220946, 181511, 100496, 69701, -179822, -120479, 147185, 267396, 56475, -102988, -147611, -226841, -300872, 31214, -259952, -434870, -286922, 214725, 28402, -132191, 117921, 258973, 210504, 88896, -139642, -93295, -243814, -461284, -251514, 71972, 69875, 90739, -76656, -81090, 231052, 422927, 313308, -173707, -236918, -288029, -325314, -266438, -343014, -245848, 93145, 130040, 149397, 150997, 40780, 4634, -23124, 89453]
14981H9453P4396l15119m18465N4517M46314K58908N0298j28697k6302J5235k3629
14970G6909j73607j59716J2914K6681K00532k61136j63794L08892J92433k48754
14960a88646P1519K75826P1110k88588K3311K2908L0751K4641n1515j38816l7186
14949a84685l41133J20139J42436j41185o2837J21912M92056M4263k353j712J07184
14938B94085K32671J4791m24357l29897K847j62188o0305j4125J60945K686P8212
14927b04635O708j0927N4198m7396j33285k68975q205R8954J7953M39747K20085
14916A64222j17120j86475p8124j6783P8621J55768j84911J46322J83619o9625
14906G5514j57446l8608l8679J90721J85854k85254j71270O3088j06130j11123
$$ y = [89453, 163849, -151270, -569735, -515218, -68904, 190004, 240302, 111605, 85303, 100538, 76909, -96698, -256414, -243500, -216819, -16287, -277423, -441217, -132325, 60108, -188646, -117127, 158699, 229809, -58779, -35468, -12560, 18191, 42832, -8683, -147499, -184685, -525818, -405679, -263243, -404428, -467265, -345353, 146703, 190966, 188613, 186901, 294085, 526756, 541547, 117190, -212707, -209860, -372048, -432353, -446478, -285533, -282847, -204635, -197927, -208854, -154656, -202052, -335337, -604312, -612517, -513563, -495610, -55863, 164222, 47102, -139373, -217497, -234280, -155659, 109, -184802, -38480, 145139, 75514, -81932, -120540, -159219, 31502, 217356, -67898, -239168, -176080, -282210, -393333]
14896c93333L2988l21555j24395J48258J1568l4780L25769K66947J86677Q2020
14886A80164j06844l79431j81499P0278K8444J46747k99372o9771J44237N4788
14876d12259L0290J17686q5285l98342J00673K11802J64960K85151K93880J90198
14866D98754O6646j70328j07490N936j42659k91046k84990R4565K48438j00738
14856a82912k05930L83495O8685j38573j67443m3478j11123j5680K12412j12556
14846c13103K28983n9971J68894q3274j91405J14691O9908l9328J03021k00825
14836b02409j9567P1963k338j57178M4578J24886N3544o5129J90936J35586q4380
14825I0492l41663L32369j13682l0704m390j5726J37387n7334k01263j85845J84828
$$ y = [-393333, -360345, -681900, -806295, -658037, -646469, -681249, -355480, -88533, 98144, 180164, 73320, -306111, -487610, -417332, -388888, -242141, -541513, -611284, -467047, -412259, -381969, -264283, -349568, -747910, -647237, -435435, -270475, 14676, 308556, 498754, 565400, 395072, 287582, 293518, 150859, -140187, -425177, -330612, -82174, -182912, -388842, -5347, 63338, -75235, -242678, -286156, -397279, -412959, -200547, -313103, -84120, -144091, 24803, -58471, -249876, -135185, -65277, -104605, -1584, -202409, -221976, -150013, -152351, -309529, -264951, -140065, -86521, -151650, 39286, 174872, 90492, -251171, 81198, -32484, -63188, -67578, -83304, 54083, -3251, -204514, -390359, -205531]
14814b05531N3771k95993J55350K79725L0868k84803k13783K9252j57074j27458
14804g35676K3974K50251M33124K48908J31873J20537j3700j63331j75961j84082
14794f4083K31733L9232k76483P0592K59719j63559J48796K4740k52148k43551
14784b25012P7108R7980K2690Q8535n6074n247N2171j127j00481j47463J15666
14773h1254J31921R6113r4272p5145Q9278J94195k4773m6512k9615j50729j66376
14762a57169k11777M835P5533J3527N17J92146J01472j48353j66886j24338J53569
14751b66924K0199k29286j66382j706K58859N9238J39740k5553J80229j7691N5107
14740E830k01307j96132L09371l544j76461k15571q1865L10638j6149P2452J00453
$$ y = [-205531, -151760, -447753, -292403, -12678, 18190, -266613, -480396, -451144, -608218, -735676, -711702, -461451, -28327, 220581, 352454, 472991, 459291, 295960, 119999, -64083, 167650, 206882, -69601, 991, 260710, 97151, 245947, 270687, 18539, -225012, -147904, -49924, -27234, 61301, 5227, -20, 52151, 51024, -49457, -196920, -81254, 50667, 146780, 52508, -22637, 66641, 260836, 236063, 189551, 159936, 9207, -157169, -368946, -364111, -288578, -275051, -274534, -82388, 19084, -129269, -296155, -420493, -266924, -246725, -476011, -642393, -644099, -385240, -326002, -186262, -211815, -31586, -49277, 5830, -195477, -391609, -82238, -85782, -262243, -477814, -559679, -249041, -265190, -192738, -92285]
14729i2285q7521O8415L8195J14960J47392K8185L8252k27656n5125n0100k73475
14718c50763L1424J55954J32418q4625k11929q5751j00397J0539J15623J26381
14708b61126L0262J7441p3782j76528J6865L90240J82679q8078r6931j88178J03105
14697a44031j42351Q9025L25477J06592j87147k33539j5073o4015K458J64018
14687i8586K36242R5577K75362P3402j50263q4235j00798J44765K40381n515k54916
14676C71416j01555r0455k82742j32092K47191j32640j17128m1956o2954J42110
14666b00805O2067J3107j58421K06072K19789k3259j35145R7758J56041r8221
14656A38983k62671q0471L6828q4803j4609R5398J35271N9482L8959j40506O4548
$$ y = [-92285, -179806, -111391, -73196, 41764, 189156, 217341, 255593, 27937, -27188, -77288, -350763, -319339, -163385, -30967, -115592, -327521, -413272, -513669, -503130, -387507, -261126, -230864, -213423, -287205, -463733, -446868, -56628, 126051, 37973, -58958, -247136, -144031, -286382, -197357, 128120, 234712, 47565, -185974, -201047, -265062, -262604, -98586, 137656, 233233, 508595, 581997, 431734, 347499, 246701, 391466, 631847, 626332, 371416, 269861, 179406, -103336, -235428, 11763, -120877, -238005, -279961, -342915, -200805, -138738, -125631, -284052, -77980, 141809, 118550, -16595, 81163, 237204, 138983, -123688, -204159, -167331, -252134, -266743, -171345, -36074, 23408, 62367, -78139, -13591]
14645a3591o2362k74668J0345O4488R0843j8254K05608P9232o360q5387j14026
14634a24132k47558K180J65195J8075r2881L2068j81152M6988j3776P8804J45593
14623a70596J59401J287j8750J68242K7659k80552m4601L28134J3444j81041j07850
14612a05223O3201N33483k01390l46456R9754k0912j87072J9462L06401k58701
14602i7453j60212j3946L20821J69976j7146O9385l9845j58230l6126J53840q3244
14591A07820K38288j3714k03160j96521K4929q5000R1966L5741K4306P8323J0200
14580A13178l63412j80860n2655J03086O8713K2613J291p0381q5462j3235J17292
14569c39832J59114J91490j24597q3021J81732Q3837j45466q3867M2110K34657
$$ y = [-13591, -75953, -350621, -340276, -275788, -184945, -203199, 2409, 81641, 75281, -10106, -124132, -371690, -369510, -204315, -186240, -279121, -247053, -428205, -381217, -394993, -316189, -170596, -11195, -9908, -28658, 139584, 167243, -113309, -157910, 170224, 183668, 2627, -105223, -42022, 491461, 290071, -56385, 43369, 22457, -164615, -145153, 161248, -97453, -257665, -271611, 49210, 219186, 202040, 271425, 231580, 73350, 37224, 191064, 107820, 346108, 332394, 129234, -67287, -42358, -127358, -35392, 349, 24655, 102978, 113178, -250234, -431094, -483749, -380663, -311950, -289337, -288046, -358427, -443889, -457124, -339832, -180718, 10772, -113825, -196846, -15114, 68723, -76743, -160610, -118500, 116157]
14559A16157Q8908j65556l02757p4561N7410J55692k32655j03068L0050J72598
14549b57782J06462O9179j3084q9333k15920J63677q8522K63740J82444j96476
14539g5615L8393J23510p2648R846P6356Q5215j13045n9125o7476l8885j6324
14528a09798J75977N560j11336j5365K37588q671l68562m01692L14799J54566
14518a26934p0546l93554J42855J78654K34153P9350p0598L2911M7981l37178
14508b82906Q4147J79061j7485k2713k3343n4251j26970j16978L09488J77354
14498A05404l71197l48696J67277J78552M6295k49978J52568L28142J81747m6584
14488A43530K12231J15528k17519l06969j27416L58155j72501k14443J1197j2600
$$ y = [116157, 205065, 39509, -263248, -337809, -280399, -124707, -357362, -460430, -430380, -257782, -151320, -82141, -95225, -184558, -400478, -236801, -325323, -61583, 120861, -75615, -37222, 86288, 13640, 23486, 99842, 185057, 72012, 12887, -54589, -93474, -109798, 66179, 71739, -39597, -54962, 182626, 173955, -194607, -596299, -281500, -126934, -197480, -591034, -448179, -269525, -35372, 43978, -26620, 6291, 54272, -282906, -198759, -19698, -37183, -59896, -83239, -137490, -264460, -381438, -71950, 105404, -265793, -614489, -447212, -268660, -222365, -472343, -319775, 8367, 190114, 143530, 355761, 471289, 253770, -53199, -180615, 177540, 5039, -209404, -198207, -210807]
14478b10807J42708k05506J46111J27722j34558k3828P9848r7603o0971L4569
14468b02315K17806j2844j50187j48424p0178J66812Q4930j38365J52900K31441
14458A31576K06162k87861o0085Q5362q9214l6471r4439K33817J64939l36195
14448h2409k12285j6777J20096j96713k30774k36132K09969L29500M28084N4040
14438A66599l4140j86635m6790l8980j64431k2269k56691K24584L12340j77220
14428b23633k45524k3134N0805J59135j66984J31437M7718p9152K0343J5325J35323
14417a78341m004j90537p4516l8544L22515L94348J24773J7050j1864j23019j84109
14406E3752K51398O752m8235J04701l65302k97635k5957J5849J75197N9237M710
$$ y = [-210807, -68099, -273605, -127494, 228, -134330, -158158, -78310, -175913, -236884, -202315, 15491, 2647, -147540, -295964, -366142, -199330, -114400, -252765, -99865, 131576, 337738, 49877, -10208, 75154, -14060, -50531, -144970, 88847, 253786, -82409, -294694, -311471, -191375, -388088, -618862, -854994, -645025, -315525, 112559, 166599, 132459, -54176, -100966, -139946, -304377, -326646, -583337, -358753, -46413, -223633, -469157, -492291, -441486, -282351, -449335, -317898, -270180, -349332, -328989, -313664, -178341, -182345, -372882, -447398, -485942, -163427, 230921, 355694, 372744, 360880, 237861, 53752, 305150, 311902, 263667, 368368, 3066, -294569, -320526, -304677, -129480, -70243, -65533]
14395f5533L13833J63695j09221k8170n5061j39393k90564l5821O9908J35348
14385d0979j4783J91479m2021k41298j77028L59192L05260r6364j14792K3747
14375A52413N1222M1282j57074r5158j61278m2095R9152q1143n8064K80045Q5165
14364A14467O6252j0960J33757p6066k15482l0480J909k3780J38109J10981n0490
14353A58217k9047N9722m0332n6051j85870j15994J11487R8496M4584j80711j39028
14342b74527K09300M43414j63892k39940k4218j18425k88396J13356N403J17490
14332b20435J75155K78545o7266j21340o9787q7430k57852J73719J96444j69248
14322a69495Q3480K13231J49338J27861j98779J3531J20987j66988J59178j40315
$$ y = [-65533, 248300, 411995, 302774, 274604, 219543, 80150, -210414, -246235, -176327, -40979, -55762, 135717, 93696, -147602, -324630, 34562, 339822, 243458, 128666, 152413, 203635, 244917, 87843, -7315, -168593, -210688, -111536, -192679, -250743, 29302, 114467, 180719, 169759, 303516, 227450, 11968, -18512, -16603, -40383, 97726, 208707, 158217, 129170, 188892, 148560, 92509, -93361, -209355, -97868, 628, 45212, -135499, -274527, -65227, 378187, 214295, -25645, -49863, -168288, -456684, -343328, -337925, -220435, -45280, 233265, 165999, 44659, -25128, -112558, -370410, -196691, -247, -169495, -86015, 127216, 276554, 404415, 205636, 219167, 340154, 173166, 332344, 192029]
14312A92029j21554l30740m2032L945R5552J44133O0016q061J4770J05799K9999
14301A43856j24785k57519k19379J01735J72641K72547L99465j383j2472j26773
14291C47933k86565O145J54978q5659j84121n1085N7068J38196J34514J6611j53237
14280I4778n1687K27726J87224J65910j38243l20054j85946J39052j38488K4474
14270D746j6879J74483K33653n1215l9025N4290k14475J45217J89300o0456j85770
14259B33869j78649k62400l3310R0457J80299k25739k80296K32245o2155j4676
14249c20355J74025o3252j35444J61666L66044M3033j23710J74678j5030l38222
14239g6567l0502O7384N0500J62995J74005N9680k97325k51618J12924m488m8525
$$ y = [192029, 70475, -260265, -302297, -298352, -202800, -58667, 1349, -6712, 8058, 113857, 143856, 19071, -238448, -457827, -356092, -183451, 89096, 488561, 487178, 474706, 347933, 61368, 67513, 222491, 136832, -47289, -98374, -41306, 96890, 231404, 248015, 94778, 43091, 270817, 458041, 623951, 485708, 165654, -20292, 118760, -19728, 4746, -12133, 162350, 396003, 344788, 305763, 360053, 145578, 290795, 480095, 419639, 233869, 55220, -207180, -240490, -150033, 30266, -195473, -475769, -243524, -305679, -320355, -146330, -209582, -345026, -183360, 182684, 225717, 102007, 276685, 261655, -76567, -107069, -39685, 10815, 173810, 347815, 407495, 110170, -141448, -28524, -33012, -81537]
14228h1537L66384P4175j94672k52283j25655N5959N8228K22487M8092j01267
14218F9911j45849K4845p4046l3631o5192j00753L0595L142J52633J07369j0863
14207d1839J59133k28598j47825M3115K45181k20105j4415k4351o1297P2270O1027
14196a57704J30145K95500N408j09089k27038r5122J53328j39003p1107O6673
14186a48009L34199J97125j6107j25574m3171O2652K2589k41876M4779J94420
14176B81027p4821k01268k13993J73767K00058k16958J36616N6493k45129k15650
14166c19858l0448J77611l686p5972r6263j2810M3907K50101L2479O4756J91871
14155B21688k63514j9494K84936J48860o5638k98791j13936K37385o8443k34544
$$ y = [-81537, 284847, 359022, 164350, -87933, -213588, -157629, -99401, 123086, 171178, 69911, -75938, -51093, -125139, -158770, -223962, -324715, -294120, -290978, -138345, -30976, -41839, 117294, -111304, -259129, -216014, 29167, -190938, -205353, -229704, -291001, -218731, -157704, -27559, 267941, 273349, 164260, -62778, -157900, -4572, -143575, -214682, -148009, 186190, 383315, 367208, 241634, 198463, 261115, 283704, 41828, 86607, 281027, 206206, 4938, -209055, -35288, 164770, -52188, 84428, 140921, -104208, -319858, -350306, -172695, -176381, -252353, -348616, -361426, -317519, -67418, -34939, 29817, 221688, -41826, -61320, 223616, 372476, 306838, 8047, -105889, 131496, 63053, -171491]
14145a71491J85993m791k5719l3442O1931J43518m3866o1755R1398J09554N593
14134B56923j23758J47599N0688m5234N6602j53867o9313n329K2262O1783l32113
14123a33757p848M00100J12546q196j45072q6124R8122j72385K6086J19609K59763
14112D62844m9762j38552Q5260k4656j17086n6989K05087l112l65351p6739L51284
14101B72228J02189r0062j69135k51447l3714m5871j90751R0842M30674m3535
14091G1418j55163n9365j84396j14597J84209J51591K05092J62851M394J1917
14081B77951K21276N1578l2804j39323j77720l16954j48356N1633K35755Q3228
14071A06264j5919q9262l37157M7107J02485L6872k7138j89029K71632J16355
$$ y = [-171491, 14502, 9711, -16008, -49450, 12481, 155999, 112133, 50378, 141776, 251330, 256923, 133165, 280764, 331452, 286218, 342820, 188953, 119640, 114311, 136573, 198356, -133757, -141605, 258495, 371041, 362845, 217773, 131649, 229771, 57386, 83472, 203081, 462844, 413082, 274530, 359790, 335134, 218048, 161059, 366146, 363034, -2317, -79056, 272228, 374417, 284355, 115220, -136227, -169941, -215812, -406563, -315721, 114953, 71418, -83745, -143110, -327506, -442103, -257894, -106303, 98789, 261640, 266034, 277951, 499227, 550805, 518001, 378678, 200958, -115996, -264352, -212719, 23036, 106264, 90345, 1083, -336074, -288967, -186482, -149610, -176748, -365777, -94145, 22210]
14061B2210j74702N665J30665L74071M155j54947r4319j99803l90129J30257M20760
14050G3883J16500q2308j98526J47448J05572k59821j64398K26782J29770j26996
14040c2094K52352l2066k97692R4955p2644m69972M3136K05254M9108L1256K2905
14029b05502o5558j17868J73847J06593M8449L2200K01568p3384j04541j56621
14019a60817K42847J796Q4634J10748k40250k58707J29027k0372n5377k7397K8025
14008a65843J79243j3007k37739K08566L04005q4335j1493J14028J05511j81574
13998B17362p8517J12580J74749j51971j40998J51920Q8708K7741Q6393k40853
13988B47114k42353j46457J36981j64990k8203P5112O306J23357J676j78315j7999
$$ y = [22210, -152492, -146827, -16162, 357909, 362064, 207117, 112798, -87005, -477134, -346877, 73883, 190383, 108075, -90451, 56997, 162569, -97252, -261650, -34868, 94902, -32094, 220258, 188192, -109500, -14545, -87189, -557161, -514025, -308771, -259663, -228407, -205502, -271060, -388928, -215081, -108488, -60039, -27839, 173729, 100345, -4196, -160817, 82030, 83826, 168460, 279208, 38958, -219749, -90722, -111094, -166471, -193868, -165843, 13400, 393, -237346, -28780, 275225, 190890, 179397, 293425, 398936, 217362, 138845, 251425, 426174, 274203, 133205, 285125, 373833, 401574, 487967, 247114, 4761, -141696, -4715, -169705, -197908, -122796, -116490, 6867, 8543, -169772, -187771]
13977a87771Q2169K03159J51526K6019k38590n5225k20268L06756K67744j03489
13967B32030k17962k51510j3440J0833J29369L27385r9572j2952K58344p025k5869
13956C29631J45777k26174j54096m5865K57425j34158k64935J89945J43452m8774
13946A92228M4160M25764k1161l50644q0277q3935J18563j36119j99180n0322
13936a40923J01537J52315J75143j95147j7337k85345p0475r0575K78387p0369
13926a62789j20553K7303P0862Q3841j15328J093j28634j41490K78179Q3261j97732
13915c21987j06396J29553L57972Q9740j96829j61013j28340p074K02576K51084
13905A09286K0947p4646n6857P4689P3541j3388J8632l23372l2614J88720N2689
$$ y = [-187771, -105602, 97557, 249083, 275102, 36512, -18713, -238981, 67775, 335519, 232030, 14068, -237442, -250882, -240049, -110680, 216705, 117133, 104181, 362525, 355500, 329631, 475408, 249234, 95138, 49273, 306698, 172540, -92395, 97550, 241002, 192228, 236388, 662152, 640991, 290347, 210070, 126135, 244698, 108579, -90601, -140923, -39386, 112929, 288072, 92925, 75588, -209757, -280232, -370807, -92420, -162789, -283342, -256039, -185177, -101336, -216664, -215571, -344205, -485695, -207516, -124255, -321987, -428383, -298830, 59142, 148882, -47947, -208960, -337300, -344374, -141798, 109286, 130233, 55587, -1270, 73419, 146960, 133572, 152204, -171168, -203782, -15062, 37627]
13894C7627l302k37618j24146j04319n1875L47674L0947k24581o6612L0583q8068
13883d53690K06120L3257r9620L50957K55446P6471J6241J31806J63812q9456
13873E91344l0169k09874j90365o5650R0297J5617k21800j67753j37786p968L34516
13862D09O0540r0183O4162K25146j82752m09218J8929K83580j67031p6012L11507
13851C9077l8210J85640K42794k29808K6315k05110O8602J71963J19741k67735
13841A13269j36027k26103J71702J59972q7661j77835q0292l158N1786j9354J86746
13830d6955j7845K40072M57840o6733k41849l04769J85554K46487m10052J69856
13820B11606J76057Q7755k07938j52724J13911J24699k62684j89897m6714j0400
$$ y = [37627, 34325, -203293, -327439, -431758, -483633, -135959, -105012, -329593, -396205, -365622, -453690, -247570, -214313, -313933, 37024, 292470, 368941, 385182, 516988, 680800, 591344, 561175, 351301, 160936, 95286, 185583, 201200, -20600, -188353, -326139, -334107, 409, 60949, -29234, 34928, 260074, 77322, -331896, -312967, -29387, -196418, -272430, 39077, 867, 186507, 429301, 199493, 225808, 20698, 89300, 261263, 381004, 113269, -22758, -248861, -77159, 82813, -4848, -182683, -262975, -266133, -214347, -233701, -46955, -64800, 175272, 633112, 566379, 324530, 19761, 205315, 451802, 41750, 211606, 387663, 475418, 267480, 114756, 228667, 353366, 90682, -99215, -145929, -156329]
13810a56329Q8275M55422J4183n2554j47668n7314j459k30726j65561n5900L78881
13799F9250j56965K00313Q7483o7561k63837N1357q950R5972o7834O302m1746
13788i6216J40127j10639n2910L62989K38211M0263j40720k23459n9988J00565
13778A98223O2772Q649q0678K911P0501K49241l59151k22088N0160J9649K02885
13767B03074J31712j00486J35648M15109q4534k52685P6715J03570K9887j4485
13757F43525r4984q2187J50019o7409k44566j45790L5453R1197J7425j34498N210
13746A73395j9357K5452j65159l06271K76989K97797K66315j32283j32057k97182
13736a2361m05839L6909M46155j7424j65868J07586R8755R4401K15273J19229
$$ y = [-156329, -68054, 387368, 401551, 348997, 201329, 144015, 142556, -88170, -253731, -309631, 69250, -87715, 112598, 200081, 132520, -131317, -79960, -88910, 7062, -60772, -54470, -96216, 43911, -66728, -119638, 243351, 481562, 521825, 381105, 157646, 97658, 198223, 260995, 269644, 188966, 191877, 262378, 511619, 152468, -69620, -19460, 189, 203074, 334786, 234300, 369948, 785057, 700523, 447838, 524553, 628123, 658010, 643525, 548541, 466354, 616373, 548964, 304398, 158608, 194061, 285258, 302683, 168185, 173395, 154038, 179490, 14331, -291940, -14951, 282846, 549161, 416878, 284821, -12361, -418200, -381291, 64864, 47440, -118428, -10842, 87913, 182314, 397587, 516816]
13726E16816k00637j64396j28746j49338k82275K49996J10365l5701J65575L22656
13716D04315K29472j31432m27389k65698j65300l17126n6638N17927m8900k4634
13706b85403J65340J10584Q3322k95247k05412K48487P2027K9449j35160j18325
13696c30338n5145j70871K92469K09791j05706J28722K40282L85187k13071l20529
13686F0791k42410m1744l239j96608L24058M5759q0492o922J69810J19429m6430
13675A02002q7O1637q8451j56195J3286J65922j41564j3139Q2683j09664k48889
13664c32459o332K64623L0871r6490Q8049L98105J98958M7326l21386m878o1444
13653B04943J42693l19981J57928J98450j34106k55698O6482o8877Q8842K57111
$$ y = [516816, 316179, 151783, 23037, -126301, -408576, -158580, -48215, -83916, 81659, 404315, 633787, 502355, 74966, -190732, -356032, -673158, -729796, -211869, -260769, -285403, -120063, -9479, 73843, -221404, -426816, -178329, -106302, -76853, -212013, -330338, -385483, -556354, -263885, -54094, -159800, -31078, 209204, 594391, 381320, 60791, -181619, -223363, -226602, -423210, -99152, -53393, -133885, -140807, 29003, 148432, 102002, 101915, 163552, 75101, -81094, -67808, 98114, -43450, -56589, 26094, -83570, -332459, -338791, -74168, -43297, -139787, -51738, 346367, 545325, 592651, 271265, 266387, 204943, 347636, 27655, 185583, 384033, 249927, -5771, 60711, -8166, 80676, 337787]
13643C37787J65804J20782l70069k50959J89993L6277k66895j40683q6728p9814
13633c44505o0739L5562J06869M3039j26489p0439K79007K84654K1378k36205
13623f7868K7055N8489o7335J78356O9075n7472K04809K98824J66786m6483k47963
13612E16273k86936J24885J66235k54233l26350p3642Q2643J40233k62680J40758
13602c2814J98699n2735k96569p4754j54829L36062K17137Q4122q9211l9557k35861
13591a40310j03667L70139J6977K4558p5050k49129J74029J95035P673m9422J44118
13580C14951j17104j69597J16591P2916K78564p3445j38037j13365o1351k5031
13570H5092m1576J6827l2140o4822P4674J81198K85980j60848j55594p9686m3613
$$ y = [337787, 503591, 624373, 254304, 3345, 193338, 229615, -37280, -177963, -264691, -344505, -405244, -369682, -262813, -219774, -346263, -416702, -137695, 146959, 168337, -67868, -40813, 17676, -49659, 128697, 197772, 140300, 345109, 643933, 810719, 764236, 516273, 229337, 354222, 520457, 266224, -60126, -133768, -51125, 89108, -173572, -32814, 165885, 113150, -183419, -258173, -413002, -76940, 140197, 224319, 135108, 95551, -140310, -243977, 126162, 143139, 167697, 92647, -156482, 17547, 212582, 220255, 170833, 314951, 197847, 28250, 144841, 217757, 496321, 422876, 284839, 171474, 110123, 85092, 43516, 60343, 28203, -36619, 38055, 219253, 505233, 344385, 188791, 109105, 65492]
13559F5492L5322j38986p4546J33805P7849K20002J10223j14139p3368j24111
13549A17543N9885q7589r1780q4786N8234K26277j00074k0812J7704L08524j30320
13538B72806l70026J8277j13055J53697J75654L84836L50354k67317l68183j2939
13528B24104L18535L13997j73425l33354p5164P4971j2009o4029K93358k76227
13518B90757l57893j00919K54672L9042p1517J4244K32215J78802p743O0670J04739
13507F37069J02705k8416M6616M1654O6777p9611l44757j28437m4714N3066n2109
13496B69843l03m8101P410o9560L38538l3278k31027l836J59630n9736j71604
13485A57976k71978J94505K54611k5564j19178k1413q8041M3283N4431J91598
$$ y = [65492, 100814, -38172, -112718, 21087, 98936, 318938, 429161, 315022, 241654, 117543, 177428, 89839, -1941, -86727, -28493, 197784, 97710, 76898, 94602, 403126, 272806, -97220, -78943, -191998, -38301, 137353, 522189, 872543, 605226, 237043, 224104, 542639, 856636, 683211, 349857, 274693, 349664, 337655, 273626, 566984, 290757, -67136, -168055, 86617, 125659, 54142, 68386, 300601, 479403, 471660, 532330, 637069, 739774, 711358, 757974, 799628, 866405, 786794, 442037, 313600, 268886, 321952, 269843, 269540, 221439, 228849, 159289, 497827, 464549, 233522, 229686, 389316, 329580, 157976, -114002, 80503, 335114, 309550, 190372, 168959, 80918, 124201, 178632, 370230]
13475C70230j26352j33229J55156J4123M5700l1558m3263q3458r4882j7576O966
13464F1857N3913L02966j57472R5966O0389j10007l75131k4993J23930Q3242O8829
13453A83489r7985M8976K2149P1577k93697j38150j15350K55303K84427K82671
13443E03410M873k58319m69007o8072L83473k17575j64301J7704L91721J89584
13433C13491J81264k2512o4298K0568o672q2605k94712j41252J5398j71824K61828
13422H674l7443J58289K55664m690m9390o8312j46978q5756J31719k5775r9064
13411C6938L474J41190o4392J19146J23933J29336R5866K5982j39806j78882l87308
13400i4523Q4484L25797j14082p030J69583K23777n4776j48779n4117J25868L13005
$$ y = [370230, 243878, 110649, 265805, 279928, 325628, 294070, 250807, 167349, 72467, 54891, 61857, 115770, 418736, 261264, 357230, 417619, 307612, -67519, -92512, 31418, 114660, 183489, 85504, 134480, 156629, 228206, -65491, -203641, -318991, -63688, 220739, 503410, 508283, 249964, -219043, -287115, 96358, -121217, -285518, -267814, 123907, 313491, 494755, 472243, 407945, 428513, 421841, 339236, 44524, -96728, -81330, -253154, 8674, -28769, 129520, 385184, 380494, 331104, 262792, 115814, 30058, 161777, 136002, 36938, 40412, 181602, 117210, 236356, 360289, 489625, 585491, 611473, 471667, 292785, -94523, -10039, 315758, 201676, 194646, 364229, 588006, 533230, 384451, 330334, 456202, 769207]
13389G69207n2190n5641k03867k02555j94076l1209o486J19989L40016j11618
13379C71570j41331O4168o9355p8239k04687R5859n1961J21503L5931K9687L99110
13368E72255j56577k99536J31915L22827L0300K3964l30282m88484R8071M01895
13358C06348K99093L7656Q6573j2603l70799n6974L73652q1453l5983L1340o5554
13347E11296l7468k18646J79153N2151j50431o873J45351K09497j3101k69195
13337D01734k56375R8890R2178j22890j34202L42571N30492J28484j47391l36004
13327E97487n3704q6603j28608J24174N4867J59892J18071k61626j67955M5855
13317D01850m234M0998J977j37953r9187j64061k5892L46186L18857k4360j7743
$$ y = [769207, 717017, 661376, 457509, 254954, 60878, 29669, 23183, 143172, 483188, 371570, 230239, 294407, 225052, 146813, -57874, 37985, -13976, 107527, 143458, 173145, 572255, 415678, 116142, 248057, 570884, 601184, 625148, 294866, -193618, -95547, 306348, 605441, 643097, 729670, 717067, 346268, 289294, 662946, 581493, 545510, 576850, 511296, 473828, 255182, 434335, 486486, 336055, 329182, 474533, 684030, 670929, 401734, 145359, 244249, 336427, 213537, 79335, 421906, 952398, 1080882, 933491, 597487, 543783, 457180, 328572, 452746, 507613, 667505, 785576, 523950, 355995, 401850, 397616, 438614, 440591, 302638, 203451, 39390, 13498, 359684, 678541, 654181, 636438]
13306F36438l23643k72661N3561L29063M33128l5560O388J3j37350l03144j51709
13295B34524J44102j6706r9306M8241J52859k91173R6780J51148Q347p7075K04820
13284E56561Q0606J1069M8102j00439j43159j22817k7311m497P5518N8745L00343
13273G32721J32746j51807k18037j51807K00567J44160K61226k8779k19094L6147
13263G38043j00626j19315j28846N8689o2991p582j77043N0521k1964o2273j9174
13252A47439K35056O3743R6165q7580j09148J01658r6139R8658L23675j17554
13242F55973Q1641r9130q5147p6710j10838K0687k49996Q8447K78800K75746q3073
13231F96400m11423j53730K71792l7855J68896N0838J72420j07969l71788j70924
$$ y = [636438, 312795, 40134, 93695, 422758, 855886, 820326, 826714, 826727, 689377, 386233, 234524, 378626, 361920, 262614, 310855, 463714, 172541, 269321, 420469, 428816, 351741, 556561, 637167, 648236, 696338, 595899, 452740, 329923, 302612, 298115, 373633, 432378, 732721, 865467, 713660, 495623, 343816, 544383, 688543, 949769, 920990, 701896, 738043, 637417, 518102, 389256, 447945, 384954, 377372, 200329, 250850, 228886, 166613, 147439, 382495, 446238, 542403, 454823, 345675, 447333, 351194, 449852, 773527, 655973, 737614, 638484, 553337, 476627, 365789, 386476, 136480, 224927, 503727, 779473, 696400, 284977, 131247, 403039, 365184, 534080, 584918, 757338, 649369, 277581, 106657]
13221A06657P5528J4254j9108K73577o8204o6644K79797Q729p6015k2119j40112
13210C66340L6943k28523J87112J6987Q5876Q6281Q7020k4512j09033P0559K5702
13199F00752Q2734P9845J09990J04954K48847j18858l82200j32570J2638j45690
13189D60442l19924J5251L61120J29535J63489K3973j92960j91094k23365J76691
13179D03158J69949J05189M9544l56787j36827O4327k2059o1045J30991P437J27791
13168D81668L62764m4786O4M4872j64304j38251k6882J73350J86862l93438j52898
13157C29021p9029j68713Q5425M37903p0315k50646j27667J48740j5940k9434
13147B59345P1731j28654J71667K24208J15018J27159j66945k14880J08109J21194
$$ y = [106657, 182185, 196439, 177331, 450908, 382704, 316060, 595857, 604586, 528571, 506452, 366340, 403283, 174760, 361872, 378859, 464735, 551016, 638036, 613524, 504491, 575050, 600752, 683486, 763331, 873321, 978275, 1227122, 1108264, 726064, 593494, 606132, 460442, 140518, 155769, 516889, 646424, 809913, 833886, 640926, 449832, 226467, 403158, 573107, 678296, 727840, 371053, 234226, 298553, 276494, 215449, 346440, 353877, 481668, 844432, 799646, 799710, 844582, 680278, 542027, 515145, 688495, 875357, 481919, 329021, 249992, 81279, 166704, 604607, 534292, 283646, 155979, 304719, 288779, 259345, 331076, 202422, 374089, 598297, 713315, 840474, 673529, 458649, 566758, 687952]
13137F87952l7811J32465R8910n1658l67513K1562J6523q6392O224K27674K30513
13126H78449j14777r3993j11545N6519K429n4268q9800k51750m2705O1867k01953
13115C8473K4564L48306P2379J02111k2950P1479J84590k57305o1391o6755k38009
13104A95492m5234K34763L3436J28335p5374M1157k3317k44347R0382R055J7108
13093C61456r4692K1051l8649J47286N0535k83465l1262o9001l4732K30425K29882
13082D88834q6358J8341O7138O2418P3578M07050O4358J3860R270Q835M0055k61049
13070I06330l34145k14487j46371N7280J31055J50248J70478J47002J02810p1642
13060H98558j53894J38394j82847l38217n2918K62724r9966m3026J34174M8077
$$ y = [687952, 650141, 782606, 881516, 829858, 462345, 483907, 500430, 414038, 420262, 647936, 878449, 763672, 669679, 558134, 614653, 617082, 562814, 473014, 221264, 178559, 240426, 38473, 63037, 411343, 483722, 585833, 562883, 634362, 818952, 561647, 500256, 433501, 195492, 150258, 385021, 418457, 546792, 471418, 512575, 489258, 244911, 335293, 344348, 361456, 266764, 287815, 249166, 396452, 446987, 163522, 132260, 63259, 28527, 258952, 488834, 402476, 420817, 487955, 550373, 623951, 1031001, 1095359, 1109219, 1118489, 1127324, 1167379, 906330, 572185, 357698, 211327, 268607, 399662, 549910, 720388, 867390, 970200, 898558, 744664, 883058, 700211, 361994, 309076, 571800, 471834, 428808, 562982, 611059]
13050F11059N094k43671j51153M10615J65404k2375k30054K9109P2047O6917j13049
13039E99943l231n8149J5072K18037M7782j62732j64587k52364J148J89131J33929
13028E63979K16892M0467O8094j0970K46634k00049k68883o4810O4338O4692j33044
13017E87340k85611R0763K19973j74734m19874l0398M79513L984J04276J55779
13007G31011j67108J60643K1407M7546n0058k24744j67320Q698R8522K83807K12362
12996I54766L09784K88806l40172k12428J3026k67214j45161p1451L05567j617
12986H33906m9110k8317P5743l2730j29553K6527j672M0779P9988j67100n2366
12975E96095M99703K51864M795j59731J60112O9731k83917l98674k35648q1909
$$ y = [611059, 616153, 372482, 221329, 631944, 797348, 774973, 544919, 574028, 646075, 712992, 599943, 596712, 538563, 553635, 771672, 819454, 656722, 492135, 239771, 240919, 430050, 563979, 780871, 821338, 889432, 878462, 1125096, 925047, 656164, 591354, 655692, 720384, 587340, 301729, 392492, 612465, 437731, 17857, -12541, 466972, 470956, 575232, 731011, 563903, 724546, 745953, 793499, 743441, 518697, 351377, 360075, 458597, 742404, 954766, 1264550, 1553356, 1213184, 1000756, 1013782, 746568, 601407, 529956, 835523, 833906, 784796, 756479, 832222, 799492, 669939, 696466, 694794, 735573, 815561, 648461, 596095, 1095798, 1347662, 1352457, 1192726, 1352838, 1422569, 1138652, 739978, 504330, 422421]
12965D22421O1412N6102K3020K90445P040j15454j68637m0861j77302N583J01541
12954D65310K8999j27165J21576J05764k6779K16532k9563J53849N3162J19068
12944A080753j49289j88596l78114O9973K44557K50466o3248l24447L8907j10687
12934D70275L5615L03458K25324J17786l0485j21404r3634J89489p051j48933
12924I40440R6479J19947K58475P4273k56389j14725r3811j3041q6539l2864j58348
12913G33897m9899r402L0414L90222q9049l42757j91381L0925M6280N6431K563
12902F08244L79777J72816m7784k4128J02735K65930Q737l4337j28823q2338j72459
12891A048370j22763l4925J0564n0356J27427m398j42292K852O6799k20047j36592
$$ y = [422421, 483833, 539935, 562955, 853400, 860440, 744986, 576349, 535488, 358186, 363769, 465310, 494309, 367144, 488720, 594484, 567705, 784237, 754674, 908523, 961685, 1080753, 931464, 742868, 364754, 434727, 679284, 929750, 866502, 542055, 580962, 470275, 505890, 809348, 1034672, 1152458, 1121973, 1000569, 906935, 1096424, 1089373, 940440, 1036919, 1156866, 1415341, 1489614, 1233225, 1118500, 1024689, 1011648, 925109, 892245, 733897, 683998, 674596, 705010, 1095232, 1006183, 663426, 472045, 502970, 549250, 605681, 608244, 988021, 1160837, 1113053, 1088925, 1191660, 1457590, 1466327, 1431990, 1303167, 1220829, 1048370, 925607, 890682, 901246, 850890, 978317, 973919, 831627, 834479, 901278, 681231, 544639]
12880E44639k9785N5142K78355J4833k88293N426L00450J49074L29302Q7330k7902
12869A418571k98788l14597o3910N4191L3006o1514R8227K27293K97647P9919
12859A470045k44715o2805J61296r3352J04412J88201J23210n3394p3155j3529
12849A506214j78333L4213K43738L2718k05592P5874K6321j76472L03447k12542
12839A449586k21763j76102J30252J07782q843r126k12768J83672q0162N5473
12829A218001J00732O4031R4957j7663J38895o2404P2826j05212J00489j6429
12819A588223m11971k50613P6719L5409k92261J63354J69493J79385J28183q2961
12809A302960m0434R9052j9559M912j40971j02259N8131p4755o3301N7146J15091
$$ y = [544639, 514854, 569996, 848351, 863184, 574891, 580317, 880767, 1029841, 1359143, 1446473, 1418571, 1119783, 805186, 741276, 795467, 828473, 766959, 865186, 1092479, 1390126, 1470045, 1225330, 1162525, 1323821, 1230469, 1334881, 1523082, 1646292, 1592898, 1519743, 1506214, 1327881, 1362094, 1605832, 1638550, 1432958, 1508832, 1535153, 1358681, 1662128, 1449586, 1227823, 1051721, 1181973, 1289755, 1280912, 1271786, 1059018, 1242690, 1162528, 1218001, 1318733, 1382764, 1477721, 1460058, 1598953, 1536549, 1609375, 1504163, 1604652, 1588223, 1176252, 925639, 1002358, 1037767, 745506, 908860, 1078353, 1257738, 1385921, 1302960, 1262526, 1361578, 1342019, 1346931, 1205960, 1103701, 1161832, 1087077, 1023776, 1080922, 1196013]
12798A196013M4053k21035q1703K67489L96237J3903q1343n3914q1383l59263
12788A039054n0979Q5663J69597k05694j45555j38673O0175K48919J16135J29717
12778A308359m0184o9790p8540o7837Q0712J0290M79552P133n6278r0550l18035
12767A164832J61436J18086n0533L3199J97276j67042o267m5758o1859R1609k71954
12756A163025N2399K82309N7918j39772j27343n4917J00476P4173k35272p1976
12746A101020j3711J5859K97831J70125k01316k04783J37611L08554J92447o9172
12736A734465j03622J40481m1698m7449j96692K35118K3218J7132j43455J2820
12726A630318J69127O5963k24640J7595j23470n0279j01418J54224K40146p8499
$$ y = [1196013, 1240066, 1019031, 937328, 1204817, 1601054, 1614957, 1533614, 1479700, 1398317, 1039054, 988075, 1073738, 1243335, 1037641, 892086, 753413, 813588, 1062507, 1178642, 1308359, 1268175, 1198385, 1119845, 1052008, 1132720, 1143010, 1622562, 1629695, 1573417, 1482867, 1164832, 1326268, 1444354, 1393821, 1427020, 1624296, 1457254, 1450987, 1405229, 1343370, 1434979, 1163025, 1215424, 1497733, 1555651, 1415879, 1288536, 1233619, 1334095, 1408268, 1172996, 1101020, 1087309, 1103168, 1400999, 1571124, 1369808, 1165025, 1302636, 1611190, 1803637, 1734465, 1630843, 1771324, 1729626, 1682177, 1485485, 1720603, 1743821, 1760953, 1617498, 1630318, 1799445, 1865408, 1640768, 1658363, 1534893, 1484614, 1383196, 1537420, 1777566, 1699067]
12716A699067j96603j70035r9265J83319J63327K59896K31183J21614L5658l0859
12706B197302k13162k93158K5804j4143k44948q2722k88933j37243M06796J95751
12696A551344j46238N2581O2120j74123p2349K96345O8417q6998q2601J20159
12686A588657j92053O7293N68755J81164L8782m7658j86521n239K47819R5494
12676B356493j27529j92977r2183J18411n2515l29342l65134L21967J35223J8139
12666A790553L6321P4804j44253J07407j25475j22689K21633K35074J66728l75081
12656A865022l65337J76157P9982q8932O8544J98175q9338K30258L1537k06370
12646A899698k71756k406j25466J67034N4299j67589L10934L67526k8147l70947
$$ y = [1699067, 1502464, 1332429, 1233164, 1416483, 1579810, 1839706, 2070889, 2192503, 2228161, 2197302, 1984140, 1690982, 1716786, 1702643, 1457695, 1374973, 1086040, 948797, 1355593, 1551344, 1405106, 1457687, 1519807, 1345684, 1273335, 1569680, 1638097, 1551099, 1468498, 1588657, 1396604, 1463897, 2032652, 2213816, 2252598, 2204940, 2018419, 2013180, 2260999, 2356493, 2228964, 2035987, 1943804, 2062215, 2009700, 1680358, 1315224, 1637191, 1772414, 1790553, 1826874, 1901678, 1757425, 1864832, 1739357, 1616668, 1838301, 2073375, 2240103, 1865022, 1499685, 1675842, 1755824, 1666892, 1735436, 1933611, 1844273, 2074531, 2106068, 1899698, 1627942, 1625536, 1500070, 1667104, 1721403, 1553814, 1864748, 2232274, 2204127, 1833180]
12636A833180R9656P2946r1672k1379k0403j40381K30893J88773k56192j79792
12626A715629L4556J60912M00824m9283p1981j15494q7945j77746L37014L1029
12616B177515k89224k95369R7709R719O4401j17196J3233J25677J01389K37799
12606B125653M1372j64535m4778J73733K96833j43451j34637K6840j18161J86862
12596B245731J41390j50806j60201j67698k75941J45696K34622P5724O017K4892
12586B119426R6554R1044M517K6689O7806j59225n9652J49361m6259k51283K18566
12575B257544K07634j33083o6531j99080n7290j46648K57999J12710r2800j78380
12565A962075k37481Q948J96408J43081j4401J02962J01383M5765J246j5642j8858
$$ y = [1833180, 1932836, 2005782, 1914110, 1892731, 1872328, 1731947, 1962840, 2151613, 1895421, 1715629, 1750185, 1911097, 2311921, 2262638, 2190657, 2075163, 1987218, 1809472, 2146486, 2177515, 1888291, 1592922, 1690631, 1700350, 1764751, 1647555, 1660788, 1786465, 1887854, 2125653, 2167025, 2002490, 1957712, 2131445, 2428278, 2284827, 2150190, 2177030, 2058869, 2245731, 2387121, 2236315, 2076114, 1908416, 1632475, 1778171, 2012793, 2088517, 2094534, 2119426, 2215980, 2307024, 2311541, 2338230, 2406036, 2246811, 2187159, 2336520, 2290261, 2038978, 2257544, 2465178, 2332095, 2265564, 2066484, 2009194, 1862546, 2120545, 2233255, 2140455, 1962075, 1724594, 1733542, 1929950, 2073031, 2058630, 2161592, 2262975, 2308740, 2309986, 2294344, 2275486]
12554B275486J07111R7534K40615K59820r8652j25709j69788J11243p2448l50753
12544B274459J69215J98449J50011J30559l1764J07798j61694j792P7162p4055
12534B838348K407J01727J04292M239l89603j79179J83089l6471p4574N6682O2778
12523B673735O6333J09193J45068j69115P8606N6097j94628j37395r8334m5687
12513B483873R2019J89938m9544o6016R0397j4332L2128J61371K16220j32125
12503C003929k36238j67133P1026L51055K47268q5186l1357j12489Q3126J08778
12493C232779j94456k04682j62504J07534j19752K74365J59874N4085j0906N4801
12483C191138k23677o1811O7688J68918o0868n1253N3072L08414j48657j45863
$$ y = [2275486, 2382597, 2480131, 2720746, 2980566, 2881914, 2756205, 2586417, 2697660, 2625212, 2274459, 2443674, 2642123, 2792134, 2922693, 2890929, 2998727, 2837033, 2835241, 2912403, 2838348, 2840755, 2942482, 3046774, 3051013, 2661410, 2482231, 2665320, 2628849, 2554275, 2610957, 2673735, 2740068, 2849261, 2994329, 2825214, 2903820, 2959917, 2765289, 2627894, 2529560, 2483873, 2575892, 2765830, 2716286, 2650270, 2740667, 2726335, 2758463, 2919834, 3136054, 3003929, 2767691, 2600558, 2671584, 3022639, 3269907, 3184721, 3153364, 3040875, 3124001, 3232779, 3038323, 2833641, 2671137, 2778671, 2658919, 2933284, 3093158, 3147243, 3136337, 3191138, 2967461, 2905650, 2973338, 3142256, 3081388, 3030135, 3083207, 3391621, 3242964, 3097101]
12473C097101K95108K74743j20816j17862J50600K63992O979j81423k86601J08361
12463C490182J26617k30447J78144K67470k50403l38278k59770L7336J22812N08320
12453C651983L24955j72842l83847O7484J0449J33871K05649k93603J33486L4997
12443C712582J05481J05262K2506j62738L4764J46916l3993j65541k47933l8514
12433C478792J98464l3435J36944L3794K57621J44080q9664l26985J33182K99377
12423D232170J89163j01427j29642j41311j04861J24108K03650J21446Q2088P5377
12413D550761o3040P2220P2028j21709j96321k75381J88837L52252K48256p2404
12403D755499m36095l97047P5845M24886J94768P5924O2876o0579m8733K46513
$$ y = [3097101, 3392209, 3666952, 3546136, 3428274, 3578874, 3842866, 3849845, 3668422, 3381821, 3490182, 3616799, 3386352, 3564496, 3831966, 3581563, 3243285, 2983515, 3020851, 3143663, 3651983, 3976938, 3804096, 3420249, 3487733, 3498182, 3632053, 3837702, 3544099, 3677585, 3712582, 3818063, 3923325, 3945831, 3783093, 3817857, 3964773, 3930780, 3765239, 3517306, 3478792, 3677256, 3643821, 3780765, 3814559, 4072180, 4216260, 4126596, 3799611, 3932793, 4232170, 4421333, 4319906, 4190264, 4048953, 3944092, 4068200, 4271850, 4393296, 4475384, 4550761, 4487721, 4559941, 4631969, 4510260, 4313939, 4038558, 4227395, 4579647, 4827903, 4755499, 4319404, 3922357, 3998202, 4423088, 4617856, 4693780, 4756656, 4696077, 4647344, 4893857]
12393D893857R058j75972j4640O192J12308l3703k18315l09985r2147Q5256r3986
12382D167923L70981J87135O0262r7113k93844K5372K73129J90180n3698M46098
12372E276425R8620j18413j60959J45128L36789J35744j2244k16569j97623L8135
12362E325033j2363k09655k50206M0848L564M9729K74702N9566K50728J66264
12352E698210m605k36391O1543J59668M9416r6388J28140M3274O4183J41933O6639
12341F075622J49104K29822K02535L9565j14469J8005m32755k1325L30241J56778
12331F633123k87196k3685j24933J55733J37038j73016j85848K23399J63555j05894
12321F412276j120k81774o7284R5013K51118J14223N7246J09333j76000Q0555
$$ y = [4893857, 4902915, 4726943, 4712303, 4718495, 4830803, 4797100, 4578785, 4268800, 4176653, 4261909, 4167923, 4538904, 4726039, 4786301, 4689188, 4395344, 4420716, 4693845, 4884025, 4830327, 5276425, 5375045, 5256632, 5095673, 5240801, 5577590, 5713334, 5701090, 5484521, 5286898, 5325033, 5312670, 5103015, 4852809, 4893657, 4897221, 4946950, 5221652, 5281218, 5531946, 5698210, 5693605, 5457214, 5518757, 5678425, 5727841, 5631453, 5759593, 5802867, 5867050, 6008983, 6075622, 6224726, 6454548, 6657083, 6696648, 6582179, 6600184, 6167429, 6146104, 6476345, 6633123, 6345927, 6322242, 6197309, 6353042, 6490080, 6317064, 6131216, 6354615, 6518170, 6412276, 6411156, 6129382, 6062098, 6157111, 6408229, 6522452, 6579698, 6689031, 6513031, 6593586]
12311F593586j91674j02247J55362Q5489J17831j39566K30266P7627L96j6911
12301F810159J62862J34271m3795J08359q2583p6602J39610L98174J88230K3638
12291G762323j6533j48815p6361N510J92593J38457J01047q042j39810n2167J87499
12280G945701Q8352o8458k97163J8728J01585j19858l8362J52595J62865m6457
12270G899528j78656L44216M45262j97536k54063o5244J04475K1547J57770L27371
12260H604670j09633j72473K07483M8078K89115Q0619j35353j01517K21613R8428
12250I031030J86864j50509k4979K69074R4679j28167m9740R2650m4534K07765
12240I484133J03045J97775o2822j06059K6684j88905N4827K9317M9731K56082
$$ y = [6593586, 6401912, 6299665, 6455027, 6540516, 6658347, 6518781, 6749047, 6826674, 6827070, 6810159, 6973021, 7107292, 7063497, 7171856, 7089273, 7012671, 7152281, 7550455, 7738685, 7762323, 7745790, 7596975, 7520614, 7526124, 7718717, 7857174, 7958221, 7950179, 7810369, 7758202, 7945701, 8034053, 7965595, 7668432, 7687160, 7788745, 7668887, 7630525, 7783120, 7945985, 7899528, 7720872, 8065088, 8510350, 8312814, 8058751, 7993507, 8097982, 8119529, 8277299, 8604670, 8495037, 8322564, 8530047, 8578125, 8867240, 8947859, 8812506, 8710989, 8932602, 9031030, 9217894, 9067385, 9042406, 9311480, 9406159, 9277992, 9228252, 9320902, 9276368, 9484133, 9587178, 9784953, 9722131, 9616072, 9642756, 9453851, 9508678, 9537995, 9587726, 9843808]
12230I843808J68869j80657l60136q7242L17298M88803L55013R822l65733k07408
12220I982437P2274L06325K86378J00057l09293K31400J03530j12308J4583J16992
12210A0792375J90610K66984K21852J56757N7475j18550J4308j18251l4107L08606
12200A1738059j03649k37638L06166K75926r4000q2164L10327p021Q8667j64526
12190A2030147o4137P3128q3271j02188L47110M20936M12329J01537J5234j37521
12180A3013304L8689J30732j01068j03633K43257K72236R6855j30514p3540J15948
12170A3502266m0576Q2993O8204K1807r7793L32122K13254L4806J81134K83508
12160A4581725M22345j3385N5774N3793Q4072k017j33314j45697j80868J58229
$$ y = [9843808, 10012677, 9832020, 9471884, 9384642, 9701940, 10190743, 10545756, 10555578, 10189845, 9982437, 10054711, 10361036, 10647414, 10747471, 10438178, 10669578, 10773108, 10660800, 10675383, 10792375, 10982985, 11249969, 11471821, 11628578, 11686053, 11567503, 11581811, 11463560, 11429453, 11738059, 11634410, 11396772, 11702938, 11978864, 11884864, 11802700, 12113027, 12106006, 12194673, 12030147, 11966010, 12039138, 11955867, 11853679, 12200789, 12621725, 13034054, 13135591, 13150825, 13013304, 13051993, 13182725, 13081657, 12978024, 13221281, 13493517, 13590372, 13459858, 13386318, 13502266, 13461690, 13544683, 13612887, 13634694, 13536901, 13869023, 14082277, 14117083, 14298217, 14581725, 15004070, 14990685, 15046459, 15100252, 15184324, 15182307, 15048993, 14903296, 14722428, 14880657]
12150A4880657L94749K40686J53617O8336k58150N667K80610L58346J00347J91429
12140A6416294J04755J49311j2545J46573J30469j62305l1869J92273R5982L00283
12130A7329221o7278q7323l15893J58824M57781L12577m1650J18509P3054J70990
12120A8108812K56106J38537j74436J91665K06401L17874K85618k51721j36185
12111A8942671M30020K35178J0631O5793J72044J73638J28810N8578m3250J46046
12101B0320159L37519J1657j2743J4145Q6444r9318N6466N5568K27036M91545
12091B1488478K31630J90264p5638K12263K45117k44583k37932K85182L14106
12082B2408887P9578J12507K15245K93014J00419o5298K53334N7150L24266j37625
$$ y = [14880657, 15275406, 15516092, 15669709, 15738045, 15479895, 15485562, 15766172, 16124518, 16224865, 16416294, 16521049, 16670360, 16657815, 16804388, 16934857, 16772552, 16740683, 16932956, 17028938, 17329221, 17261943, 17174620, 16858727, 17017551, 17475332, 17787909, 17746259, 17864768, 17937822, 18108812, 18364918, 18503455, 18329019, 18520684, 18727085, 19044959, 19330577, 19078856, 18942671, 19372691, 19607869, 19618500, 19684293, 19856337, 20029975, 20158785, 20217363, 20174113, 20320159, 20657678, 20669335, 20656592, 20670737, 20757181, 20657863, 20714329, 20769897, 20996933, 21488478, 21720108, 21910372, 21834734, 22046997, 22292114, 22047531, 21809599, 22094781, 22408887, 22488465, 22600972, 22816217, 23109231, 23209650, 23144352, 23397686, 23454836, 23779102, 23641477]
12072B3641477K25048K19666j31481m9467J25900N5775J2436K89918L06357J67037
12062B4862666k6418J33273K24342L46518N5622L04267K06586N8922O6240q837
12052B6223181K90749L31061L33958R4971P6537m34750n47290q4720K82305M51392
12042B7017394J18019j71192r1060J16131J87629J14726J88384K9699r0500p0941
12032B7348289K20122K34465K32564J84467n8360J76558J49650J03446J95994
12023B8787195K33846r5521j23430o6383j9237M67305M37325L17324J55087K985
12013C0096496R52j86405l6233k6183J93599P6195k3939J07920L69137J89703
12003C0761242m3462M2527M4018o5328L35324J84194j48397j79831n5529J57014
$$ y = [23641477, 23866525, 24086191, 23954710, 23905243, 24031143, 24086918, 24099354, 24389272, 24695629, 24862666, 24836248, 24969521, 25193863, 25540381, 25596003, 25900270, 26106856, 26165778, 26232018, 26223181, 26513930, 26844991, 27178949, 27273920, 27350457, 26915707, 26368417, 26283697, 26566002, 27017394, 27135413, 26964221, 26873161, 26989292, 27176921, 27291647, 27480031, 27509730, 27419230, 27348289, 27568411, 27802876, 28035440, 28219907, 28161547, 28338105, 28487755, 28591201, 28787195, 29021041, 28925520, 28802090, 28735707, 28716470, 29183775, 29621100, 29938424, 30093511, 30096496, 30097448, 29911043, 29874810, 29848627, 30042226, 30118421, 30094482, 30202402, 30571539, 30761242, 30717780, 30760307, 30804325, 30738997, 31074321, 31258515, 31110118, 30930287, 30874758, 31031772]
11993C1031772n5189k3873K55593O4295L1850l3324j10477o5609k7758J88872
11983C1256152P4735k07653l0592K05815L85173j41138j69564K25297L04871j14245
11973C1788851k27387j93896J71786J9194J14522J03712j63763r0928J3967q0104
11963C1455954k9693l9648q7653J49363K82780P3251j99188k7738k25393j5503
11953C1336532l14524m10617j40941K33769p5466r6515j34917j18367o8708J22123
11943C0332369J76496Q060o0262j06525j37989p6256j67128j72199j59936q072
11933B9628558J32702q259J9447j49612k47552l01522P2228j7307n3221M9535
11923B9124997J9269j87641M576J44992j32205k05741j31257O0980L5158K511
$$ y = [31031772, 30976583, 30952710, 31208303, 31272598, 31304448, 31271124, 31160647, 31095038, 31067280, 31256152, 31330887, 31123234, 31092642, 31298457, 31683630, 31542492, 31372928, 31598225, 31903096, 31788851, 31561464, 31367568, 31539354, 31558548, 31673070, 31776782, 31613019, 31522091, 31536058, 31455954, 31426261, 31386613, 31298960, 31448323, 31731103, 31804354, 31605166, 31577428, 31352035, 31336532, 31022008, 30611391, 30470450, 30704219, 30628753, 30532238, 30397321, 30278954, 30210246, 30332369, 30508865, 30516925, 30456663, 30350138, 30212149, 30135893, 29968765, 29796566, 29636630, 29628558, 29761260, 29753001, 29772448, 29622836, 29375284, 29073762, 29145990, 29128683, 29075462, 29124997, 29144266, 28956625, 28961201, 29106193, 28973988, 28768247, 28636990, 28697970, 28733128, 28735639]
11913B8735639k31574k47956m06843j46451J86122p8930l54722j26384k55878
11904B7073023k08954j44562k18753J09958J15698k94399k94779N7460J93171
11895B6387863n3911q6244l89570j04961j1424q212j23896L2086k0267k05204
11885B5416260j86282k86115j74112j11331k90601k4064j5947j46234l46001k68543
11875B3567030l3328J11117o6172n7280J6826j35417J53171j48994l12661k87459
11865B2806833j04077j8884p2928k11997m2634k09757J44556k12726l50433P2749
11855B1800702J04456m3647k65318N1045m6545k5287p5790j99115k45880m9835
11845B1004786K06214j93368l45540m13294j95875j24081m42917j23200m0630
$$ y = [28735639, 28504065, 28256109, 27849266, 27702815, 27888937, 27810007, 27455285, 27328901, 27073023, 26864069, 26719507, 26500754, 26610712, 26726410, 26432011, 26137232, 26194692, 26387863, 26333952, 26247708, 25858138, 25753177, 25741753, 25733541, 25609645, 25641731, 25621464, 25416260, 25229978, 24943863, 24769751, 24658420, 24367819, 24343755, 24327808, 24181574, 23835573, 23567030, 23533702, 23644819, 23578647, 23521367, 23538193, 23402776, 23555947, 23406953, 23094292, 22806833, 22702756, 22683872, 22610944, 22398947, 22356313, 22146556, 22291112, 22078386, 21727953, 21800702, 21905158, 21861511, 21596193, 21647238, 21600693, 21575406, 21499616, 21300501, 21054621, 21004786, 21211000, 21017632, 20672092, 20258798, 20062923, 19938842, 19495925, 19372725, 19332095]
11836A9332095Q6738N9650Q8152q7293j53576k7580j53342k71816k83203P2771
11826A8662596j02170j56227J21727K0527l35152n41843n0440N9972j45947k24606
11816A7308437k40336R2018J89762j94285j31624N5441q7537l51878R8862k0599
11806A6718261j90830k02145k1493K17356j74778l19687o30415j25043K35543
11797A5506769j9642j96838m2823j56192k18381P7482l8295j32051j83839j76230
11787A4419960J5271n6535r9045j27870j03320k11788n3245o0320J97030J11691
11777A4031829k38784m4368n7649n373K72645O48j14098k38017j46046l30053
11767A3130734j2750Q7842L29567P486k23679j89128l11218k43224N7900m6204
$$ y = [19332095, 19418833, 19478483, 19566635, 19479342, 19325766, 19298186, 19144844, 18873028, 18589825, 18662596, 18560426, 18404199, 18525926, 18546453, 18211301, 17669458, 17619018, 17678990, 17533043, 17308437, 17068101, 17160119, 17349881, 17155596, 17023972, 17079413, 16991876, 16639998, 16738860, 16718261, 16527431, 16325286, 16303793, 16521149, 16346371, 16026684, 15396269, 15271226, 15506769, 15487127, 15290289, 15247466, 15091274, 14872893, 14950375, 14912080, 14780029, 14596190, 14419960, 14435231, 14378696, 14279651, 14151781, 14048461, 13836673, 13783428, 13723108, 13920138, 14031829, 13793045, 13748677, 13691028, 13685655, 13958300, 13958948, 13844850, 13606833, 13460787, 13130734, 13117984, 13205826, 13535393, 13542879, 13319200, 13130072, 12818854, 12575630, 12633530, 12587326]
11757A2587326o1510j08465j70907j78800n537m53506j85272k6469N7215J94515
11747A1648590k29440k70283L38077Q8976Q6790n2156j81971k22187k36426K6119
11737A0996089J50890o7947m4477M4039l13618k47669j36683l6154L8908M8389
11727A0431767l439j99915j49198K0472J10380j75042j42475j04731K3897N4549
11717I866265J47224R9909j04246k23182k21219K70041L11912o0161j18738k16319
11707I751486l03420j74306m4358j93761K9983J57637o4690k24171k26694j81116
11697H526590J21698j4500J01892J28361j73416l87564k38012K1335K62157j06332
11687H242209j54662O1489j9130J36831L75482N4932l52698l67061j21531j31324
$$ y = [12587326, 12525816, 12417351, 12246444, 12067644, 12062107, 11608601, 11423329, 11396860, 11454075, 11648590, 11419150, 11148867, 11486944, 11575920, 11662710, 11610554, 11428583, 11206396, 10969970, 10996089, 11146979, 11079032, 11034555, 11078594, 10764976, 10517307, 10380624, 10344470, 10383378, 10431767, 10428328, 10228413, 10079215, 10099687, 10210067, 10035025, 9892550, 9787819, 9811716, 9866265, 10013489, 10113398, 10009152, 9785970, 9564751, 9834792, 10146704, 10086543, 9967805, 9751486, 9448066, 9273760, 9229402, 9035641, 9065624, 9223261, 9158571, 8934400, 8707706, 8526590, 8648288, 8633788, 8735680, 8864041, 8690625, 8303061, 8065049, 8086384, 8348541, 8242209, 8087547, 8149036, 8129906, 8266737, 8642219, 8697151, 8344453, 7977392, 7855861, 7724537]
11677G724537K83314J86595J86327j94000m1389j26706k38849k79283k07389Q9545
11667G382702P7386m0055K5338j2307q5081j36604r1079L59778J71246k11491
11657G439833j03653l4261j40190k14307m5284j65427J03497n2447P5434J4087
11647F877282k62707M8648L3465J18130L6501Q9425J67155P899l66309k29740
11637F519749Q5949O6853j21389j02109L0664j8273j15183k24502m9219M9418
11627F121958J78644r3899k12341J11222R8158l13382p4425L5972P6638n0092
11617E878453k97880Q172P6393K65861J48764K48636J49120k88618Q2594j61957
11607F109538j21797l42884j80856j47178R5341L00643O5830o2530k22622Q4384
$$ y = [7724537, 8007851, 8194446, 8380773, 8186773, 8145384, 8018678, 7779829, 7500546, 7293157, 7382702, 7460088, 7420033, 7445371, 7433064, 7347983, 7211379, 7120300, 7480078, 7651324, 7439833, 7336180, 7301919, 7161729, 6947422, 6902138, 6736711, 6840208, 6787761, 6863195, 6877282, 6614575, 6663223, 6696688, 6814818, 6851319, 6940744, 7107899, 7115798, 6749489, 6519749, 6605698, 6672551, 6551162, 6449053, 6479717, 6461444, 6346261, 6121759, 6072540, 6121958, 6300602, 6206703, 5994362, 6105584, 6203742, 5890360, 5815935, 5851907, 5928545, 5878453, 5580573, 5588745, 5665138, 5930999, 6079763, 6328399, 6477519, 6188901, 6271495, 6109538, 5987741, 5644857, 5464001, 5316823, 5412164, 5712807, 5778637, 5716107, 5493485, 5577869]
11597E577869j53771k17282n4955J41224q0824j6850L79296l846q7266J95846
11587E679441j58438k09481o9139o2718p745l19026j10020K4J40468l1197J43751
11576D995920J39780m45714k61184R6645K09083p4873j68486N2563j48960K56172
11566D650946p5459O4483j72844k9877K34193L22444J90012Q7455j56096j94033
11556D921224k7217J832r363O7301L39303O8515l27786n36408k76602K89172J90065
11545D700036j28394j62068J28726J71665N3629J00454k43023l24074k41041N0234
11535D106144Q9174l5705J55414K85268r1075q7711K49238J96530j72097o8359
11525D626821j85774k27735j27972k11268m3990L47314j19620N7527r089k26819
$$ y = [5577869, 5424098, 5206816, 5151861, 5293085, 5212261, 5195411, 5574707, 5570861, 5483595, 5679441, 5521003, 5311522, 5242383, 5179665, 5171920, 4852894, 4742874, 4742898, 4883366, 4852169, 4995920, 5135700, 4689986, 4428802, 4525447, 4734530, 4659657, 4491171, 4543734, 4394774, 4650946, 4575487, 4639970, 4467126, 4437249, 4671442, 4993886, 5183898, 5271353, 5115257, 4921224, 4894007, 4895839, 4886476, 4953777, 5293080, 5361595, 5033809, 4497401, 4220799, 4509971, 4700036, 4571642, 4409574, 4538300, 4709965, 4763594, 4864048, 4621025, 4296951, 4055910, 4106144, 4195318, 4159613, 4315027, 4600295, 4509220, 4421509, 4670747, 4867277, 4695180, 4626821, 4441047, 4213312, 4085340, 3874072, 3830082, 4177396, 4057776, 4115303, 4106214, 3879395]
11515C879395k1873J15118K01485Q2584j40712p6270l4568R265J03943k04784
11505C913583P2736M503k99753j35072k2996m5064J68399j12051k07450K24242
11495C561077N13981r3228j20638j96077j02142J81903K10416j60504J29061J79523
11485D103372O5143m8488j51039l00898k50852l50880R1211J01590l5352j18284
11475C105523m2470J7310K92401M3459J8383k5419k35277j19962R3943J75588
11465C323479j99517k98414K14716J16134m2106o888J28970K6213j4523m6434
11455C201630J08958p5756j80000o4048K56844j24580j88421J56957l9484j50440
11445B901660k21515O5670j91327R214K26608j63801j39434r1934m6868J43339
$$ y = [3879395, 3857522, 3972640, 4174125, 4256709, 4115997, 4039727, 4005159, 4014424, 4118367, 3913583, 3986319, 3990822, 3691069, 3555997, 3533001, 3487937, 3656336, 3544285, 3336835, 3561077, 4075058, 3981830, 3861192, 3665115, 3562973, 3744876, 3955292, 3794788, 3923849, 4103372, 4168515, 4120027, 3968988, 3668090, 3417238, 3066358, 3157569, 3259159, 3223807, 3105523, 3063053, 3080363, 3372764, 3416223, 3434606, 3409187, 3173910, 3053948, 3147891, 3323479, 3123962, 2825548, 3040264, 3156398, 3114292, 3107404, 3236374, 3262587, 3248064, 3201630, 3310588, 3234832, 3054832, 2990784, 3247628, 3123048, 2934627, 3091584, 3052100, 2901660, 2680145, 2745815, 2554488, 2563702, 2790310, 2626509, 2487075, 2395141, 2348273, 2491612]
11435B491612L02234Q0832L12895j62173k71540j59292k1567L7010P3869R3703
11425B777583k14094k22451R1280J02706K684R2461N285N8574o420M243O0919
11414B752770M4616j09480n8348J78511j23791P1190p8293k26363l307J30943
11404B578448j86621j17212J76098Q4863m71114k29188J58023M34678Q1007k69210
11394B239772k70112l0746N4039J25550J41400j5595j10194J6176N4454N7647
11384B262391j4309k78627l0630J20953O6422K29918J32083m4891k63350l1487
11374B148473K61901j80587j51097l0963P0112N283k4842o5663K46277J66798
11364B445692k2742j84084j58106o479j10361l1975J21157Q6846j75014J5980
$$ y = [2491612, 2793846, 2874678, 3187573, 3025400, 2753860, 2594568, 2573001, 2610011, 2683880, 2777583, 2563489, 2341038, 2432318, 2535024, 2537708, 2630169, 2635454, 2694028, 2687608, 2691851, 2752770, 2797386, 2687906, 2629558, 2808069, 2684278, 2755468, 2677175, 2450812, 2447505, 2578448, 2391827, 2274615, 2450713, 2535576, 2064462, 1835274, 1993297, 2427975, 2508982, 2239772, 1969660, 1938914, 1992953, 2118503, 2259903, 2244308, 2134114, 2150290, 2204744, 2262391, 2248082, 1969455, 1938825, 2059778, 2126200, 2356118, 2488201, 2443310, 2179960, 2148473, 2410374, 2229787, 2078690, 2047727, 2117839, 2123122, 2098280, 2032617, 2278894, 2445692, 2422950, 2238866, 2080760, 2074281, 1963920, 1931945, 2053102, 2139948, 1964934, 1980914]
11354A980914N5527J37489K05380p9966j05532k80959K1577L38229j75457l18489
11344A778713j26725L67631J71348p5855m12664J18056K36153J60818N7387r6480
11334B178382k09906j24888J87679J71307n4943J41231j26153m34467k06349K09244
11324A731137j4357P5508p4100J27113r8359j94226K63694P2027j2758r9315j5462
11313A760902j6596J58486L48854O2996k05414k10072l13111j05006K04637P8484
11303A764160k93532m4004P0361k50650o1718J03775J57837J03985O5143P3246
11293A688603k14327j99570L45413j06807k06550q691j27174J76357L27534j15070
11283A559718J0544J37130p6311J0690J58310J9116p8944j30161l05806L72609
$$ y = [1980914, 2036441, 2173930, 2379310, 2299344, 2193812, 1912853, 1934430, 2272659, 2097202, 1778713, 1651988, 2019619, 2190967, 2115112, 1702448, 1820504, 2056657, 2217475, 2274862, 2178382, 1968476, 1843588, 2031267, 2202574, 2147631, 2288862, 2162709, 1728242, 1521893, 1731137, 1716780, 1792288, 1718188, 1845301, 1746942, 1552716, 1816410, 1888437, 1875679, 1776364, 1760902, 1744306, 1902792, 2251646, 2314642, 2109228, 1899156, 1586045, 1481039, 1685676, 1764160, 1470628, 1426624, 1496985, 1246335, 1184617, 1288392, 1446229, 1550214, 1615357, 1688603, 1474276, 1274706, 1620119, 1513312, 1306762, 1298071, 1170897, 1347254, 1674788, 1559718, 1570262, 1707392, 1631081, 1641771, 1800081, 1819197, 1740253, 1610092, 1304286, 1676895]
11273A676895k00946l28653J87375L4132J85390K01006R602J49588M0481M764
11263A959634j95518Q5017J00235J3455n3142k85512l06770k58031l6700J51810
11253A174478K29663J98103J54710j04108j39120j6147k2714n9152L61717k3326
11243A754104l90234m12495k44739K45419J76001J84701R4607K33335j02171k36898
11233A301630j61653q8763R3829j13103L255J41141J23185K91726j17538j64652
11223A309057J54208q6720j66795j18615j77408N5133L4999P8195R4988J14960
11213A292002O7192N9177N8742M3752j02812j06423l376J26590K68068L7932K54235
11202A995079k01580n32906k45634N4789K01074O9588J412j89459J79008n7478
$$ y = [1676895, 1475949, 1147296, 1334671, 1368803, 1554193, 1755199, 1764801, 1914389, 1954870, 1959634, 1764116, 1849133, 1949368, 1962823, 1909681, 1624169, 1317399, 1059368, 1022668, 1174478, 1404141, 1602244, 1756954, 1652846, 1513726, 1497579, 1474865, 1415713, 1777430, 1754104, 1363870, 951375, 706636, 952055, 1128056, 1312757, 1407364, 1640699, 1538528, 1301630, 1139977, 1051214, 1145043, 1031940, 1035195, 1176336, 1299521, 1591247, 1473709, 1309057, 1463265, 1376545, 1209750, 1091135, 913727, 968860, 1003859, 1082054, 1177042, 1292002, 1359194, 1418371, 1477113, 1520865, 1418053, 1311630, 1308254, 1434844, 1702912, 1740844, 1995079, 1793499, 1260593, 1014959, 1069748, 1270822, 1340410, 1341822, 1152363, 1331371, 1273893]
11192A273893r2125j82637j32219J01380J3147K23247J52865J04209m9469k77455
11182A134836O2035O4489J04791J83901q0963q4083K34682j4426k8028k34149
11172A343085l78248j77692p0333J1278K42309L53856L9409j42031J71770K76430
11162A669833j19526l49771k10915J41398L9594k02120K1122M655N434M3147j54041
11151H88810k17520R2369J80133n7607L3353J30j83157K44239K82350j55911M7365
11140A154554J96773j10648l51131l04207r5559L29834P7897R1379P3824J1891
11130A074607j46761J4922o3702j96610j30599Q4074J07442j44909J14114L4832
11120G47410r3317J17678K0600J23687o7822k81957l5860J79362L36249O8363
$$ y = [1273893, 1181768, 999131, 866912, 968292, 981439, 1204686, 1357551, 1461760, 1412291, 1134836, 1196871, 1261360, 1366151, 1550052, 1469089, 1385006, 1619688, 1605262, 1577234, 1343085, 964837, 787145, 716812, 728090, 970399, 1324255, 1363664, 1221633, 1393403, 1669833, 1550307, 1200536, 989621, 1131019, 1170613, 968493, 989615, 994270, 999704, 1042851, 888810, 671290, 763659, 943792, 886185, 919538, 919668, 736511, 980750, 1263100, 1107189, 1154554, 1351327, 1240679, 889548, 585341, 489782, 819616, 897513, 988892, 1062716, 1074607, 927846, 942768, 879066, 682456, 551857, 635931, 743373, 598464, 712578, 747410, 654093, 771771, 792371, 916058, 848236, 566279, 530419, 709781, 1046030, 1114393]
11110A114393L1700l1975l49307k8392R9525j08534J82592J84560j03063n4497
11100I37002K94499N8502l6928j56478m55077j66268J29326l18805J25074J2016
11090D22863J07665K59514l3289k20209j0834l1907M7623J01859L29139J4386
11080I86810l6233j73392J21867l84806m3187J67796J27883L05735j67447r4114
11070H10912q8191j72397J67797O0047P9773o9261J52444N8264k47439j78864
11060E73085L90584N2462n7976j32602J99679J11824K2232k16640r3764J60842
11050A009726J41069k47209J21320J82082r8645J33630J7766P4580K98050O819
11040A639188k05219L06785K71852J27334l8311j08588o4615J49694j46612q1378
$$ y = [1114393, 1146093, 1114118, 764811, 736419, 835944, 727410, 910002, 1094562, 991499, 937002, 1231501, 1290003, 1253075, 1096597, 641520, 475252, 604578, 285773, 410847, 422863, 530528, 790042, 756753, 536544, 525710, 493803, 541426, 643285, 972424, 986810, 950577, 777185, 899052, 514246, 471059, 638855, 766738, 1072473, 905026, 810912, 722721, 550324, 718121, 778168, 857941, 788680, 941124, 999388, 751949, 573085, 963669, 1016131, 958155, 825553, 1025232, 1137056, 1159288, 942648, 848884, 1009726, 1150795, 903586, 1024906, 1206988, 1108343, 1241973, 1259739, 1334319, 1632369, 1639188, 1433969, 1740754, 2012606, 2139940, 2101629, 1993041, 1928426, 2078120, 1931508, 1850130]
11030A850130k86684P1622L06845L66753L9715k1977j18689J32520J4609n23794
11020A831050k25449J61985J04854k10595P0799M3657j62960n168J68092k93767
11010A482498l95235J77468L3490j47969k8304K32009J83454J59743Q6340j77662
11000A605832n912m8851l97679l36J56209m95469l33204K5921J02069K58169k9745
10989H37004J258j05730l8649j38511j68970o706p4983r2425N7841J77653J64001
10978F11783M8995K74802l33370j48773j53543l2227q7290k57835P1662m0589
10968d6385l4702Q9687K68656L16401l1576p8803K8521j06630J8061J00153J29625
10957F53008j46428R2580O0058m1289O7450j01861J0400N4330k1590k16860Q5791
$$ y = [1850130, 1563446, 1635068, 1941913, 2308666, 2348381, 2326404, 2207715, 2340235, 2354844, 1831050, 1605601, 1767586, 1872440, 1661845, 1732644, 1776301, 1613341, 1608173, 1776265, 1482498, 1087263, 1264731, 1298221, 1150252, 1121948, 1353957, 1537411, 1697154, 1783494, 1605832, 1599920, 1551069, 1153390, 1153054, 1309263, 813794, 480590, 506511, 608580, 866749, 837004, 838262, 732532, 693883, 555372, 386402, 379696, 304713, 212288, 270129, 447782, 611783, 660778, 935580, 602210, 453437, 299894, 267667, 180377, -77458, -5796, -46385, -81087, 8600, 277256, 593657, 562081, 483278, 511799, 405169, 423230, 523383, 653008, 506580, 599160, 659218, 617929, 685379, 583518, 593918, 648248, 626658, 409798, 495589]
10946D95589J79648j69028q8743l8037k2500j6121J23490J61828m5429K12152
10936G92849j30970J2806j03347j09627J20709j09908j86385j20146J89469l6606
10926C18844o4732n74595j66345L32172L34818O0081j6999J42619J2649p5266
10916C03246R4785m1971j14462j00541N2578Q2472J15772n3267K09336q6899k64456
10905A96593p8111L7807J75843l999k29169J56329L41062k08331j36542J5878
10895B67360P5314m4050J35118J92133J98457k7842q1161j81426m9164J25321
10885F10060J55098r8693j41456M1508J92697q1032K3334j85456q0425o6652m6490
10874C22493j16857l4941J41702L42384Q8791O699N1896K73171J55283k87487
$$ y = [495589, 675237, 506209, 417466, 379429, 356929, 340808, 464298, 626126, 580697, 792849, 661879, 674685, 571338, 461711, 582420, 472512, 286127, 165981, 355450, 318844, 254112, -320483, -486828, -154656, 180162, 240243, 223244, 365863, 378512, 303246, 398031, 356060, 241598, 141057, 193635, 276107, 391879, 338612, 547948, 461049, 196593, 118482, 156289, 332132, 328133, 98964, 255293, 596355, 388024, 251482, 267360, 342674, 298624, 433742, 625875, 824332, 796490, 715329, 533903, 484739, 610060, 765158, 666465, 525009, 566517, 759214, 678182, 701516, 516060, 435635, 368983, 322493, 205636, 170695, 312397, 654781, 743572, 750271, 802167, 1075338, 1230621, 943134]
10864I43134m27042j87116k43293q6981J59754Q254o0728J38475N6200J73805
10854D74462J93366M3305k2622j40314l8516k35753Q9929k4583J61117j1667n1528
10843D37196j64903l8004K1568O9860o0609n0960J66095l8389J17735j36761k61984
10832F0844J09889n7342J47221n7246o4042J22292J90200L6142q6856j25119k26192
10821D9791M794o7005P1185K17173j41749J51389L18056r8328j30015J52128l17163
10810B10256j71649K30637j49384k66926o111k0120J60983J10656J35492K72321
10800E06155N9842q5824k43442n6177k44142o2704n5094j65735L67199M4616J37545
10789B02239j1350j67454O5459o0282j26494J55328R8532J72350K69547j45887
$$ y = [943134, 516092, 328976, 85683, -1298, 158456, 166710, 105982, 244457, 300657, 474462, 667828, 711133, 688511, 548197, 509681, 273928, 363857, 339274, 500391, 488724, 437196, 272293, 234289, 255857, 325717, 265108, 214148, 380243, 341854, 459589, 322828, 60844, 170733, 113391, 260612, 203366, 139324, 261616, 451816, 487958, 401102, 275983, 49791, 54585, -12420, 58765, 275938, 134189, 285578, 603634, 505306, 375291, 527419, 210256, 38607, 269244, 119860, -147066, -153177, -173297, -12314, 98342, 233834, 506155, 565997, 480173, 236731, 180554, -63588, -126292, -181386, -347121, 20078, 64694, 202239, 190889, 23435, 88894, 28612, -97882, 57446, 155978, 328328, 597875, 451988]
10779D51988m56637R765M17050J1979k07394j96686K07888J21844o0692q6043
10769B13062l8660p8285K46201J64125J61278l38238k64684p1590O4448J43049
10759B00706J05471k4728M1128J69914K34678N1394M2040n8795j25604j43385
10749D92819j02595R2919j15461J6105K33694j48367k20595j8615l7014k04651
10739a1761J7521J0115j01534k27989L78718L60389J91764j94380j39815M2039
10729C25067K179O4351l1277N8345J13905k1658j03912j46909r1100K0532j30116
10718E9407R4455K87186P0464J40889k5794J5958k27278o5197J18993j69433n4378
10707B45272k44119j10141J27012J51500L9762q4871O986K05539J23442j08344
$$ y = [451988, -4649, 5116, 422166, 434145, 226751, 30065, 237953, 359797, 299105, 213062, 174402, 96117, 342318, 506443, 667721, 329483, 64799, -6791, 57657, 200706, 306177, 281449, 322577, 492491, 727169, 778563, 820603, 761808, 636204, 492819, 390224, 483143, 367682, 383787, 617481, 469114, 248519, 229904, 192890, -11761, 5760, 15875, -85659, -313648, 65070, 425459, 617223, 422843, 283028, 325067, 327246, 391597, 360320, 418665, 532570, 510912, 407000, 260091, 168991, 189523, 59407, 153862, 441048, 511512, 652401, 626607, 642565, 415287, 350090, 469083, 299650, 245272, 1153, -108988, 18024, 169524, 209286, 124415, 131401, 336940, 460382, 352038]
10697C52038K28349K39748j25381l63254J08223Q0337l9973j74009J03134l17
10687D08895L4347J08932j53260n7220r5173O5078j2900J79477j43593k19636
10677A14947J95021j9562j48476M9936J38073j1852o1518J8347R5446Q3602k51090
10666B02874p338K13674O5580l53258p1874J83600L35117m9876J20015l6914r7629
10655E03971n0943Q3422O7531L24776L1545m688J79043J0954J68775K49431K05360
10644A769177K23224K29457M23906L82523K28447L99928K84983M48779Q28521
10635E218945J393550J498961J252152J880042K408669L538893M723077O124678
10627B8038967P377228P890361P332279O880803O700165P496346Q886850J0425881
$$ y = [352038, 580387, 820135, 694754, 331500, 439723, 520060, 480087, 306078, 409212, 408895, 443242, 552174, 398914, 341694, 246521, 311599, 298699, 478176, 334583, 114947, 309968, 290406, 141930, 191866, 329939, 318087, 256569, 274916, 370362, 453964, 202874, 195536, 409210, 474790, 121532, 49658, 233258, 568375, 518499, 638514, 601600, 503971, 453028, 536450, 603981, 928757, 960302, 955614, 1134657, 1145611, 1314386, 1563817, 1769177, 1992401, 2221858, 2645764, 3028287, 3256734, 3656662, 3941645, 4390424, 5218945, 6612495, 8111456, 9363608, 11243650, 13652319, 17191212, 21914289, 28038967, 35416195, 43306556, 50638835, 57519638, 64219803, 71716149, 80602999, 91028880]
10619I1028880J0186641Q361565O899588O770259P773741Q624994Q113941P498237
10611A55257846P759682J0481055J4690357J7279191J5816213R931433K824264
10604B34040041q99915Q73239L588085M105925L721648N488422R702763J4459429
10596B75079637J6233693J1554991r2911j2971174j9668023j7894903j2820929
10589B39420381r291606p062494l640723N56719M238363M781944P31029p657329
10581B22076284j6123710j9832701j7835332j3912236j0272509p426186n246901
10574A31426709l284450j790744k262052m404786p664007j1123234j2407458j1387058
10566G7102920r624329p165301n491829m308731l115103k535354k367253k296441
$$ y = [91028880, 101215521, 109577086, 116476674, 123246933, 131020674, 139645668, 147759609, 155257846, 163017528, 173498583, 188188940, 205468131, 221284344, 231215777, 234040041, 233140126, 234013365, 237601450, 241707375, 245429023, 250917445, 260620208, 275079637, 291313330, 302868321, 302775410, 289804236, 270136213, 252241310, 239420381, 230128775, 223066281, 219425558, 219982277, 224220640, 229002584, 229733613, 222076284, 205952574, 186119873, 168284541, 154372305, 144099796, 136673610, 131426709, 128142259, 126351515, 124089463, 119684677, 112020670, 100897436, 88489978, 77102920, 67478591, 60313290, 54821461, 50512730, 47397627, 44862273, 42495020, 40198579]
10558D0198579j971057j409825j303626j141124j227402j231753j364665r16323
10550B9632804r59333p09081o09009p59125p95824r97457j018873n52974l39241
10541B2891887m96169k50381n00978p56361p87439q80786o44925l39039m66868
10532A7768941j57100l43887j90287m53432o14618k69489j74913l40938l58701
10523A4865576m24367o50267l85502k31242k14611l54441m56045k15239m60599
10514A1473263k31852r8824J1533j41910k53845R4676l62918m57044k64338j99339
10504I569402k04830o6758k61562n7204q4737j68386k44930j40381k91320l28951
10494G720343J1554p6760j77250m64346n26067j79361Q2585j7309j64977m6835
$$ y = [40198579, 38227522, 36817697, 35514071, 34372947, 33145545, 31913792, 30549127, 29632804, 28673471, 27964390, 27355381, 26596256, 25800432, 24802975, 23784102, 23231128, 22891887, 22395718, 22145337, 21644359, 20887998, 20100559, 19219773, 18574848, 18235809, 17768941, 17611841, 17267954, 17077667, 16624235, 16009617, 15740128, 15565215, 15224277, 14865576, 14441209, 13790942, 13405440, 13174198, 12959587, 12605146, 12149101, 11933862, 11473263, 11241411, 11142587, 11154120, 11012210, 10758365, 10853041, 10490123, 10033079, 9768741, 9569402, 9364572, 9297814, 9036252, 8979048, 8894311, 8725925, 8480995, 8340614, 8049294, 7720343, 7731897, 7655137, 7477887, 7013541, 6487474, 6308113, 6390698, 6373389, 6208412, 6161577]
10484F161577r4960P397K11297J9405P3844k25232l12392k00430n31325m24381
10474D684800j91443K49250J39235j82730l3472p2836j95057k40958Q9941j32817
10464D113913j2196n6389J1871P4538J8910k29894k21091p5388r7980K06201j08173
10453C624322k05222j20971J90566J92383j89832j16514k30835j16857J95569
10444C222609K14581j23827l45321k92308k11819J14041k3438j94896J62464K64083
10434B786169K07481k3313k59355l38905k09584J71299K4341N9295l33346K4237
10424B108319j61478j14763k18639L75499M70437k22927m06490j68822K40620
10415A901756J15800j03267K320j15494k7747K1080P6229j91307K7699l7684j12955
$$ y = [6161577, 6066617, 6074014, 6285311, 6304716, 6378560, 6153328, 5840936, 5640506, 5109181, 4684800, 4493357, 4742607, 4881842, 4699112, 4665640, 4592804, 4397747, 4156789, 4246730, 4113913, 4101717, 4045328, 4057199, 4131737, 4150647, 3920753, 3699662, 3624274, 3526294, 3732495, 3624322, 3419100, 3298129, 3488695, 3681078, 3491246, 3374732, 3143897, 3027040, 3222609, 3437190, 3313363, 2968042, 2675734, 2463915, 2577956, 2554518, 2359622, 2522086, 2786169, 2993650, 2970337, 2710982, 2372077, 2162493, 2333792, 2358133, 2417428, 2084082, 2108319, 1946841, 1832078, 1613439, 1988938, 2459375, 2236448, 1829958, 1661136, 1901756, 2017556, 1914289, 1916609, 1801115, 1773368, 1794448, 1870677, 1679370, 1707069, 1669385, 1556430]
10404A556430p1802j73311j08918R4963n7248l57800P5427L9312J8214J77414
10394A192681K8650j64942L2175N3056q9088r412K68022O7504l89601J42605J85988
10383A317638j72608l75070l00706J66974L98011n1947l29456j21333M31484L36653
10373A299640p9468k98674K4569K41955J52465q3744m2691j6357j52824j78519
10363H66352j90428L1327Q1476m839J62017M5330j29215k4088j73150p7253K42394
10352H29923K57302J53478j6704l99444r7083l1519J79856M57024j46775J07005
10342A293063K29985m18308k94894J98046k19083k44526j213R2592O8693K33527
10332I37882J98566N4813j70273k78465j80248K11551K07633M1055l09647j33193
$$ y = [1556430, 1484628, 1311317, 1202399, 1297362, 1240114, 882314, 957741, 997053, 1015267, 1192681, 1221331, 1056389, 1088564, 1141620, 1052532, 1043120, 1311142, 1378646, 989045, 1131650, 1317638, 1145030, 769960, 469254, 636228, 1034239, 982292, 652836, 531503, 962987, 1299640, 1220172, 921498, 946067, 1188022, 1340487, 1256743, 1214052, 1197695, 1044871, 866352, 675924, 707251, 788727, 783888, 945905, 991235, 862020, 837932, 664782, 587529, 829923, 1087225, 1240703, 1223999, 824555, 727472, 695953, 875809, 1332833, 1186058, 1293063, 1523048, 1104740, 809846, 1007892, 788809, 544283, 543070, 635662, 704355, 937882, 1136448, 1191261, 1020988, 742523, 562275, 773826, 981459, 1022514, 712867, 579674]
10322E79674J84185k12499j44995O9816N4284K50870k29128j11700J29323J62702
10312G32532j86030r6124R2623j7022m8929k55838J50393K65570K7295J28101
10302G92571j20862k53651m2259r1248j71918J10252K12557Q0962O981L6088o1050
10291D98423R3266Q1254j42222Q580J21079O6024P779p7029J20375R873r0371
10280F97031l0973l2131M4748N0128J4028K9792J3987j62241K67860q5416j24023
10269F82790K50102M2506k02533n7446j40593K12900O6268j3922k33365q3822
10259E22885P603K07146j88197j89971J47538k25510O9842K73969L26610m9314
10249I02601k9747k54498r1370K01213k23599l31247k40569O3077J37835J87058
$$ y = [579674, 763859, 551360, 406365, 476181, 530465, 781335, 552207, 440507, 569830, 732532, 546502, 450378, 543001, 525979, 477050, 221212, 371605, 637175, 664470, 792571, 671709, 418058, 375799, 284551, 112633, 222885, 435442, 516404, 523385, 559473, 498423, 591689, 672943, 530721, 539301, 660380, 726404, 734183, 657154, 777529, 787402, 697031, 666058, 633927, 678675, 728803, 742831, 772623, 786610, 624369, 892229, 806813, 682790, 932892, 975398, 772865, 715419, 574826, 787726, 853994, 840072, 606707, 522885, 530488, 737634, 549437, 359466, 507004, 281494, 351336, 625305, 951915, 902601, 872854, 618356, 526986, 728199, 504600, 173353, -67216, -4139, 133696, 320754]
10239C20754J09585O8925M0828K21285q3136j31830p4420k31600J62982K05873
10229F09246J17593N843l3448j20943R3202k26598k6915L9131n1190p6208j82796
10218A46917K14621Q2944q0777k14604p92L02483K13588j4707l5606k32924M335
10207C85478j60033R7130J70262j9439O6697l0570j96312j85178J48744q499j3514
10196B54766r6748n9028M8180L96153L33528K6171l61579m23050M9872K60642
10186D28907K64422M06916K70649j9081J13045k29837j99566j219L9607O2519
10176A136362l7409j09460j8016j68214L61111M19086M7351j58017o9482j23394
10166A279918j60474Q3311J98427L20173j51521j18773r908K5530J67816M22536
$$ y = [320754, 430339, 499264, 540092, 761377, 678241, 546411, 471991, 240391, 403373, 609246, 726839, 732682, 699234, 578291, 671493, 444895, 417980, 457111, 405921, 329713, 146917, 361538, 444482, 363705, 149101, 148309, 450792, 664380, 649673, 614067, 381143, 385478, 225445, 322575, 492837, 473398, 540095, 509525, 313213, 128035, 276779, 268280, 254766, 158018, 98990, 147170, 543323, 876851, 903022, 541443, 118393, 168265, 428907, 693329, 1100245, 1370894, 1351813, 1464858, 1235021, 1035455, 1034236, 1073843, 1136362, 1098953, 989493, 971477, 803263, 1164374, 1583460, 1630811, 1472794, 1403312, 1279918, 1119444, 1202755, 1401182, 1721355, 1569834, 1451061, 1441153, 1466683, 1634499, 2057035]
10156B057035J62513j00860m00430q9592j15156P7785K22891J18374j04008l77321
10146A451231o6795J39962P1761l90502j17517j4748M7146j30304q4817M2148
10136I47565l8946J08995J34941k9880r4081l01792k8213R319J13242j48072m31203
10125B41875j84745J16884L38866l5876j81631J74903j15010j76814R151P4093
10115B61696j30341P8023K00649J64366N6188J08928m6815k23394r6176j06112
10105B67012L9468k2024J0601l3189O7609L61469J14165r2695r9623m29571k53073
10094f9851Q7405M3490j04633K76625J81289l8306j22983P887J2162o2161N9764
10083B70688K4406j60695L69653L35165k70619J3161j65053k20786m3453K81816
$$ y = [2057035, 2219548, 2118688, 1718258, 1628666, 1513510, 1591295, 1814186, 1932560, 1828552, 1451231, 1384436, 1524398, 1596159, 1205657, 1088140, 1073392, 1120538, 990234, 905417, 947565, 908619, 1017614, 1152555, 1122675, 1028594, 726802, 698589, 707908, 821150, 673078, 241875, 57130, 174014, 512880, 477004, 295373, 470276, 355266, 178452, 187603, 261696, 131355, 209378, 410027, 574393, 630581, 739509, 692694, 469300, 373124, 267012, 306480, 284456, 295057, 261868, 329477, 690946, 805111, 712416, 612793, 183222, -69851, 17554, 61044, -43589, 233036, 414325, 376019, 253036, 260923, 273085, 210924, 270688, 295094, 134399, 504052, 839217, 568598, 581759, 416706, 195920, 152467, 434283]
10073D34283k8888l42290l2197M4375M0649K84948r2769l62443L24880K41098
10063E11646p2648k84891m0577J06488J18281N6441L035l03238k52653J72422
10053A4306J20770O4817J87365J41980O6437R3969j05330o7221j34119l45039
10043C7935k41614k9590J58701L72683J36816O9117k61820N1272R9859l0642m2102
10032C20615k13493j05592j21924m4232J53196J26082J21206k4656N5187P1073
10022C37462m8893K75083p0614R2327J81933j75604K8740n3061R7019j08994j19590
10011D35808k74381j86618K30496L2214j70072o7961K7170O3694k28099J0649
10001a27100p4130J61136Q2638J12632q9637k25114J85486K67641K95231M9842
$$ y = [434283, 405395, 63105, 30908, 75283, 115932, 400880, 308111, -54332, 270548, 511646, 438998, 154107, 113530, 220018, 338299, 394740, 397775, 94537, -158116, 14306, 135076, 199893, 387258, 529238, 595675, 689644, 584314, 517093, 382974, 37935, -203679, -233269, -74568, 298115, 434931, 504048, 242228, 293500, 393359, 362717, 320615, 107122, 1530, -120394, -164626, -11430, 114652, 235858, 211202, 266389, 337462, 288569, 563652, 493038, 585365, 767298, 591694, 620434, 567373, 664392, 555398, 435808, 161427, -25191, 205305, 237519, 67447, -514, 26656, 90350, -137749, -127100, -201230, -40094, 42544, 155176, 65539, -159575, 25911, 293552, 588783, 638625]
9991F38625n7854J13918j41975k72814j97229L6759j18814j40522o2517K23578
9981B1155M4140l324J25367J49157m9793j87058k13614M1893o9336J97664J71737
9970B27988r3785J02322J96050j16352L05810K71924k53229m89487j82310O0551
9960B9482K33824K91980M8678l28228k95401K37813j2804J2121l089n3870N5680
9949B16186N6973J26130j27790K2825J50848j20854l7330p8343j06862j15175
9939a3392K39793M8774q5080J31191K60710L15432j47366j53536k48825k21215
9929A26486R4144M8518j46540Q0318l44844q84K28272j27240o8113Q0196J0130
9918a9557L16127M7337k09530j57946L48972j8849j52076n7456J21596M8608M539
$$ y = [638625, 580771, 694689, 552714, 279900, 82671, 119430, 616, -139906, -202423, 21155, 65295, 61971, 187338, 336495, 286702, 99644, -113970, -72077, -141413, 56251, 227988, 134203, 236525, 432575, 316223, 622033, 893957, 640728, 151241, -31069, 29482, 263306, 555286, 603964, 275736, -19665, 218148, 205344, 217465, 214376, 160506, 216186, 273159, 399289, 271499, 294324, 445172, 324318, 286988, 208645, 101783, -13392, 226401, 275175, 190095, 321286, 581996, 897428, 750062, 596526, 347701, 126486, 220630, 269148, 122608, 202926, -141918, -142802, 85470, -41770, -109883, -29687, -19557, 296570, 343907, 134377, -23569, 325403, 306554, 154478, 97022, 218618, 267226, 271765]
9907B71765j3364j35118j09107J84087L90772k17311k30772j3086J46600J4422
9897B88888k51048K27152J45146j28033j12599K3237j27662j36223L12372j03826
9887A37404J01042j69954l56273k35111J68222Q1236J42289p708j81611o3120
9877c83584K46947J49041J79184J62638P1076J480l91024j55391j66684J55569
9867a30748K30018J50842J08863L770k12665m3201N2701o7425r0951Q1922j60214
9856g7088j61291N0480R5348K46725K75591q2754j437O2896o1396N1641j89829
9845B08886j23056J00765k01481J01538L14086K67211k26963m8284j52430K43877
9835D84149M04259J69010l92702j57552r0195j43150l84749k55028M6856L46635
$$ y = [271765, 258401, 123283, 14176, 198263, 589035, 371724, 140952, 127866, 274466, 288888, 37840, 264992, 410138, 282105, 169506, 192743, 65081, -71142, 241230, 137404, 238446, 68492, -287781, -522892, -354670, -273434, -131145, -138853, -320464, -383584, -136637, 12404, 191588, 354226, 425302, 426782, 35758, -119633, -286317, -130748, 99270, 250112, 358975, 362745, 150080, 106879, 159580, 92155, 1204, 83126, -77088, -238379, -187899, -92551, 154174, 429765, 347011, 345574, 408470, 347074, 398715, 208886, 85830, 186595, -14886, 86652, 400738, 667949, 440986, 392702, 240272, 484149, 888408, 1057418, 664716, 507164, 416969, 273819, -110930, -365958, -319102, 27533]
9825B7533r9875k1588R8635K11777K093l2989J51519k079J14061j11845j19536
9814B17706Q6014J22809Q7412r5764J44124o6094k04706O6961K64472r5433l7511
9803D89990K19097k13061j72083l6704j17116J40251K21961k43088l3714m5978
9793B09555R1938N0623P6597Q2346P0584K15279j00148m64952k0073K83073L4816
9782E29638p5523K27908J35354N1589j74379j78000k7790O3592j09033m0487k82673
9771A20196j4926j03686j94790J68464L30705J83415l0977j59770J07289J1896
9761D17816m1552j60381J04069K51696J58374k46086J59128j62485j62834p0168
9751B47577J11803J11238k11149l82336p9156m6834o9653P7099J22190K2106m1187
$$ y = [27533, -72342, -93930, 4705, 216482, 218575, 185586, 337105, 335026, 449087, 337242, 217706, 303720, 426529, 513941, 418177, 562301, 496207, 291501, 358462, 622934, 527501, 489990, 709087, 496026, 323943, 287239, 170123, 310374, 532335, 289247, 255533, 209555, 301493, 352116, 428713, 511059, 581643, 796922, 696774, 231822, 211749, 494822, 529638, 454115, 682023, 817377, 868966, 694587, 516587, 488797, 552389, 443356, 402869, 120196, 105270, 1584, -193206, -24742, 305963, 489378, 458401, 298631, 405920, 417816, 376264, 215883, 319952, 571648, 730022, 483936, 643064, 480579, 317745, 247577, 359380, 470618, 259469, -122867, -202023, -248857, -318510, -241411, -119221, -97115, -138302]
9740a38302l1964j26831J83896L02573k2692J0819j9133l12000M9514J47932J67889
9729B11701K39798P2888j02021K08064p6650k92486j176J22952j78732j43254
9719F1084j02224l2811P4800o8765r7939n1537L60259K11918M7553j95385l16610
9708a09657m3198o7973K29288K0535P3059J20360j0813l0880l02059p1892J92887
9697c43J34778J17019M1023k18337o0994K38599J73924P9895k58276p7582R2371
9686B62077p339l23788j40762J66847l4864k17336L15057O7456J24644K24625
9676D36617J12999o2301l49014j34277j53348K0426K674p8194O6114M5298k49686
9665c42692K98706K94855J8503j33660M5469j34420J76835K15661K16902K42230
$$ y = [-138302, -170266, -297097, -113201, 189372, 166680, 177499, 158366, -153634, -104120, 43812, 211701, 451499, 524387, 422366, 630430, 553780, 261294, 260118, 383070, 204338, 61084, -41140, -73951, 849, -67916, -165855, -217392, 142867, 354785, 402338, 206953, -109657, -152855, -220828, 8460, 28995, 102054, 222414, 211601, 180721, -121338, -193230, -343, 134435, 251454, 292477, 74140, 13146, 251745, 425669, 505564, 247288, 169706, 262077, 254738, -69050, -209812, -42965, -77829, -295165, 19892, 87348, 211992, 436617, 549616, 487315, 138301, 4024, -149324, -128898, -126224, -204418, -138304, -93006, -342692, -43986, 250869, 269372, 135712, 181181, 46761, 223596, 439257, 656159, 898389]
9655H98389N9088l2943k62759l14394j05270J0960j01953n9044J15753j96964
9645A0863R4966J20405M3495j31630J46556Q5896j25648O5700J5885j55677j94883
9634b4072n4275L2288j69220O7659Q1754J88069J4244K16623O5606j95146m0182
9623A83348R5137L9856l24204k27518K515r1544q9054Q7892Q7180K75992K75420
9612C15020J00273R4846l07133M1548m3502l49498J16306L72455j8148j25089
9602A97078j96882m8078k45529K42954L89526J56694j46412o3672K61764K67253
9592H14696l10434k67175L7266k76183l28437N3780J06540J18190j59134j46291
9582c57182J64163J08621K24408J64708k90551j60889J51561o3344J38715K65825
$$ y = [898389, 957477, 924534, 661775, 347381, 242111, 253071, 151118, 92074, 207827, 10863, 105829, 226234, 269729, 138099, 284655, 370551, 244903, 310603, 326488, 170811, -24072, -78347, -46059, -215279, -147620, -65866, 122203, 136447, 353070, 418676, 223530, 183348, 278485, 318341, -5863, -233381, -230866, -322410, -411464, -323572, -236392, 39600, 315020, 415293, 510139, 203006, 244554, 201052, -148446, -32140, 340315, 322167, 197078, 196, -47882, -293411, -50457, 339069, 495763, 349351, 285679, 547443, 814696, 504262, 237087, 274353, -1830, -330267, -276487, -169947, -51757, -210891, -357182, -193019, -84398, 140010, 304718, 14167, -146722, 4839, -58505, 80210, 346035]
9572C46035j0050k9393j33134j04912j22130K4811N8981K05612N9035j66547j83159
9561e4851L01389R3731l2867L07908j03358k82076l0736J15432k86345j57807
9551a29580m2240k696J66927L1114j36905O4884Q9600J44935n085j89959K3909
9540A4904K04420M15844J99820M6178j51538l35148J85832q4180j41297k39002
9530A15833l32836J48853K9461O2179J75716J60407m9998R9404k4483j55454J09135
9519C38217R2194j83231j64811j17548m0723Q4587j25118j35584R2479Q8885K04114
9508A33461P0455J44639J25255n7653l06581K48159J83793k52108l1445j27221
9498A30754n34652Q4382J16458K43548o4066r1822L7811l06458J31235J86913
$$ y = [346035, 335985, 306592, 173458, 68546, -53584, -28773, 30208, 235820, 294855, 128308, -54851, 246538, 340269, 307402, 615310, 511952, 229876, 199140, 314572, 28227, -129580, -171820, -174516, -7589, 23525, -113380, -48496, 41104, 186039, 180954, -9005, 14904, 219324, 635168, 834988, 881166, 729628, 394480, 580312, 496132, 354835, 115833, -217003, -68150, -38689, 23490, 199206, 359613, 309615, 409019, 384536, 229082, 338217, 430411, 247180, 82369, -35179, -75902, 8685, -116433, -252017, -159538, -70653, 133461, 203916, 348555, 473810, 416157, 109576, 357735, 541528, 289420, 257975, 130754, -403898, -319516, -203058, 40490, -23576, -115398, -77587, -384045, -252810, -65897]
9488f5897l565K32801J92310m8316O7894M5046j06711j1975j23932p7625j00619
9477e89J00886J83928m1714k31195j08012J74406N2229l6639M0751j06158j75353
9466a47460K23073R7187k16528J57676J93545K22561k85495j40602L2772J23434
9456B60163q3838j59019j41587o1450L907j17167K24451L01520P2337O2511Q7769
9445D49597J30694m5709n9394n6408J61261J02768J19615k85039k58382R9891
9435C58894K1867k3842J04036O8526j98939r4699L77250N8947j48237M2815J29620
9424F96238j26858j56297P2074P8050M1559J52227R7097n6956K32588P1343J52610
9413A253675j28111k30660k30857o3640j72811j1818m5217l1252m2592j97412
$$ y = [-65897, -69462, 163339, 355649, 307333, 375227, 420273, 313562, 301587, 177655, 100030, -589, 100297, 284225, 242511, 11316, -96696, 77710, 129939, 93300, 134051, 27893, -147460, 75613, 172800, -43728, 113948, 307493, 530054, 244559, 103957, 136729, 260163, 176325, 17306, -124281, -185731, -181824, -298991, -74540, 226980, 299317, 361828, 449597, 580291, 534582, 475188, 418780, 580041, 682809, 802424, 517385, 259003, 358894, 380761, 356919, 460955, 529481, 330542, 235843, 613093, 672040, 523803, 566618, 696238, 569380, 413083, 485157, 563207, 604766, 756993, 854090, 797134, 1029722, 1101065, 1253675, 1125564, 894904, 664047, 600407, 427596, 415778, 370561, 339309, 296717, 99305]
9403I9305o0002J24223K30768K41183n6264j67062N3254j8331j5735o9404q8283
9392B73652J85282R4218j07802k40590J2188L1026N3479K48269j8719k14048j03975
9381B12980M3711k678R6858j11978n4075M59188K07779l21949J31075K67820J91730
9370A120461k21365j36696k3694M2481j72750l66870r8859P6015P4406R425Q2143
9359C84697k98197k39903M1914Q2366J73283M04350J44411m2396j06729l92095
9349A51701l72771p7391N612j8791J0796K70415l3663j33326J03409N52857L8920
9338D97768l49492k00889J94108J3565J22226P0148J10716j5630p5556K18371
9328E85335o3902j25497J55489k402L556j94742k90085l5676N3648k22364l7323
$$ y = [99305, 39303, 163526, 394294, 635477, 579213, 412151, 465405, 447074, 431339, 361935, 273652, 458934, 553152, 445350, 204760, 216948, 247974, 301453, 549722, 531003, 316955, 212980, 256691, 254013, 350871, 238893, 184818, 644006, 851785, 529836, 660911, 928731, 1120461, 899096, 762400, 738706, 781187, 608437, 241567, 142708, 218723, 293129, 302554, 384697, 86500, -153403, -111489, -29123, 144160, 548510, 692921, 650525, 543796, 151701, -221070, -298461, -292849, -311640, -300844, -30429, -64092, -197418, -94009, 458848, 497768, 148276, -52613, 141495, 155060, 277286, 347434, 458150, 442520, 366964, 585335, 521433, 395936, 551425, 549023, 552579, 357837, 67752, 32076, 85724, -136640, -173963]
9317a73963q0710P9224K1362Q1052J73300J19714J46204M2204l4623J11853j28421
9306C57196J99153P6982k47645j39497q7302L9753j49984J16982Q9650j4706M5835
9295B86417N2434M923k1060l3239N7402n6530K44353K6552j73802j14742J0025
9284B82733O3019L5324q3403q516K3347O7398k53393j74150Q4158K26289q885
9273B53921J91469r4569l0537L5668J3733j08934j55392J89634k23565k18027
9263a46599Q8426n7016R5180Q1053j02557L0693j73622K31544q0048N6323r64
9252B2413L36724q6576l13826K23225N8715J3873R6425J58324J4570k68014j78560
9241G7293j25460q6621J64958R0779N7834J82954O2715J42120l09991j89201M757
$$ y = [-173963, -254673, -175449, -154087, -73035, 100265, 219979, 366183, 408387, 373764, 485617, 357196, 556349, 633331, 385686, 246189, 158887, 198640, 48656, 165638, 255288, 240582, 286417, 338851, 343774, 322714, 289475, 346877, 290347, 534700, 561252, 387450, 272708, 282733, 345752, 381076, 297673, 289157, 312504, 379902, 126509, -47641, 36517, 262806, 253921, 445390, 350821, 320284, 355952, 369685, 260751, 105359, 294993, 71428, -146599, -58173, -115189, -20009, 61044, -41513, -10820, -184442, 47102, -32946, 23377, 22413, 359137, 272561, -41265, 181960, 240675, 254548, 350973, 509297, 523867, 255853, 77293, -48167, -134788, 30170, 120949, 178783, 361737, 424452, 566572, 256581, 67380, 72137]
9230G2137L29099K18408q4889k28797l83604k11663L0536L55139K21972j17790
9220B00548j28365N7245j99773j42572J01495q1789Q5052J32664j00509l37438
9210d13442o7493L58553R402N2376l8947J53864K24892j86161j46092j23186k26625
9199d02859r0111J99059L03284j32203K1223K3285r6074L23939J97752l6663K2603
9188C33235j7200j07124O8866l28126k91680M3399L692j10502K42797J57537R2039
9177H6933J56360m9167j98089L26756L8858k26362j26190M5077K08104K03087
9167D65367K71689o5449j84829n9817p7712j40986O7566P4843l38679j40358K56231
9156A27866O7249K70087n0999l6506j82202j72393M0078n5656K23676K97002p3162
$$ y = [72137, 401236, 619644, 534755, 305958, -77646, -289309, -258773, 96366, 318338, 200548, 72183, 129428, -70345, -212917, -111422, -193211, -108159, 24505, -76004, -413442, -480935, -122382, -112980, -60604, -99551, 54313, 279205, 93044, -53048, -176234, -402859, -492970, -293911, 9373, -122830, -101607, -78322, -174396, 149543, 347295, 310632, 333235, 316035, 208911, 277777, -50349, -342029, -298630, -294938, -405440, -162643, -5106, 86933, 243293, 194126, -3963, 322793, 361651, 135289, 9099, 54176, 262280, 465367, 737056, 671607, 486778, 426961, 349249, 208263, 275829, 350672, 11993, -128365, 127866, 195115, 465202, 414203, 377697, 195495, 23102, 63180, 7524, 231200, 528202, 455040]
9145D55040o9608j34127k43186L4685N6592r7954J80620r616j33907n8294J66260
9134A46505J04897q467q1710j40637j45119J90569J11764m1170N5912J09513l7584
9123B64473q1005r8067o1811j46700Q5520J61398k18571k03989k27650J63105
9113c63297L02848L8901J6398K33379q1668k22466j26906L73376K03011l23084
9103E0492j58404Q4481P3362O8322Q1199O3837j80909k06611J71654K49978Q965
9092C06366j75743J35261Q750k39294j3538k9J1706o1271K4404J76836K23259
9081C96707m3861j87347J13570J24504k11606j53746J46870k56901n18142L04373
9071b85579P5375j25107J70465J427k22035J72806L45553k30034n1186P3818M253
$$ y = [455040, 385432, 251305, 8119, 42804, 99396, 1442, 182062, 172446, 38539, -19755, 146505, 251402, 242935, 161225, 20588, -124531, 66038, 177802, 136632, 192544, 302057, 264473, 183468, 85401, 23590, -123110, -37590, 123808, -94763, -298752, -526402, -363297, -60449, -21548, -5150, 228229, 146561, -75905, -202811, 170565, 373576, 50492, -107912, -23431, 49931, 118253, 199452, 263289, 82380, -124231, 47423, 297401, 306366, 130623, 265884, 274634, 35340, 21802, 21773, 33479, -27792, -3388, 173448, 396707, 352846, 165499, 279069, 403573, 191967, 38221, 185091, -71810, -589952, -285579, -210204, -335311, -164846, -163419, -385454, -212648, 132905, -97129, -148315, -74497, -70244]
9060g0244n3046J48232O6390j80719l3894R0469l510m9833k43339J53680J34360
9049d1454J32073j10772j61579Q3350L00690R3941j04875l6314O9298j19962J2730
9038A17126j89140j43195K77191J86919j58104m0466k8886K81327K27513q1140
9028D49145k57356p5164j96392J76283L14942J3315k5101J3501j03103k89009
9018B1061J38247J87989j14112j51283k87476J98907l7050k06280Q2967M02717
9008B35687N8808n7465l0666j15637Q5316K02482M5239k33747r9874j02809J52317
8997A39651K80593J67080k01319r6227m205j92723N5441J97880q8871l61051L29138
8986B25387K26084j53547J20334k18188k62362k22047j10850J43340K64692L44211
$$ y = [-70244, -123290, 24942, 91332, -89387, -123281, -32812, -36322, -86155, -329494, -175814, -41454, 90619, -20153, -181732, -98382, 202308, 296249, 191374, 155060, 224358, 104396, 117126, -72014, -215209, 61982, 248901, 90797, 50331, 21445, 302772, 530285, 449145, 191789, 116625, -79767, 96516, 411458, 424773, 399672, 413173, 310070, 21061, 159308, 347297, 233185, 81902, -205574, -6667, -43717, -249997, -167030, 235687, 294495, 237030, 206364, 90727, 176043, 378525, 423764, 190017, 90143, -12666, 139651, 420244, 587324, 386005, 289778, 285573, 92850, 148291, 346171, 257300, -103751, 225387, 451471, 297924, 418258, 200070, -62292, -284339, -395189, -251849, 12843, 357054]
8976C57054L6869r0117j91834k66429j29321o4397J90898J33527M1944J23244
8966A41438j42603j35552N50l5856J37083J88869J29133N5891r0307r9387J6957
8955A66216j53035R5139N3413K42610J6725n0043j15683k84237J21867K02037
8945B95009r7291k73132Q208K73521K53968k6187j83141k50931P299Q1545J0871
8934I9739k00520r2106j6490O2626m4721J61219j10982J38257R8346K7259L4309
8923A56936p6322K4450j04065j00326n766J47050J25736M13618K00347o8574k07580
8912E05504r2163L23759j8741k52177j39580l95168j74382K11683K1123j60008
8902a70150k27507J87021K86579k76115m17871L73563L35765K27704Q1216j60024
$$ y = [357054, 393923, 303806, 111972, -154457, -283778, -348175, -157277, -23750, 18194, 141438, -1165, -136717, -136167, -172023, -34940, 153929, 283062, 338953, 248646, 149259, 166216, 13181, 108320, 161733, 404343, 421068, 371025, 255342, -28895, 92972, 295009, 197718, -75414, -67206, 206315, 460283, 434096, 250955, 24, 7323, 88868, 99739, -100781, -192887, -209377, -146751, -191472, -30253, -141235, -2978, 95368, 122627, 156936, 80614, 105064, 999, -99327, -105093, 41957, 167693, 581311, 781658, 713084, 505504, 413341, 737100, 718359, 466182, 326602, -68566, -242948, -31265, -10142, -170150, -397657, -210636, 75943, -200172, -618043, -244480, 91285, 318989, 400205, 240181]
8892B40181M4271j8044q4950J17950j1666O2844j37049j44585J35995N590R2145
8881C02682O7722j92614J79866J19528q1345j80204J03272k49375o2798L57672
8871C64406J96501q2485n9546j22934L6929J06278K5009l92060l64424l1846M37779
8860A13607J54575k28020j00314Q1997N6248L6832P6124l0082j69015M37536J10132
8849E39620n17129j70320K20874J86585M2186l8545j0783J48937j27355J64473
8839D38543L49370M31K14634J14371l6325l14482j33891j30609q921L3978L1390
8828E58489j72502J4243n3676k94502J13393L406K12027k09918J1805k12506q567
8817c8308o9464J67845K03356k58727l69858K67997K51714K08052J67423j72515
$$ y = [240181, 284452, 266408, 181458, 299408, 287742, 350586, 213537, 68952, 204947, 210537, 302682, 370404, 177790, 357656, 477184, 395839, 215635, 318907, 69532, 6734, 364406, 560907, 478422, 418876, 295942, 332871, 439149, 464158, 72098, -292326, -324172, 113607, 268182, 40162, -60152, 21845, 78093, 114925, 191049, 160967, -8048, 429488, 539620, 22491, -147829, 73045, 259630, 301816, 263271, 252488, 401425, 274070, 438543, 787913, 788344, 1002978, 1117349, 1081024, 766542, 632651, 502042, 493121, 527099, 558489, 385987, 400230, 346554, 52052, 165445, 168851, 380878, 170960, 182765, -29741, -38308, -107772, 60073, 263429, 4702, -365156, -97159, 154555, 362607, 530030, 357515]
8807C57515j25854r0289q454l4928M4941j55419Q2279J1657q1727j37394p1724
8796b09397J56213K41156k463Q351n1388q9598J49892j16630L6653M7658l37017
8785a66570m0143L81324J94521j6520R9167k46619k90907K16015L9428k22303
8775e2607J51105j1296l06109K33141L84845n3637k26884J6855m8219N196n8418
8764C3972j28171o0603M7431K54294J44342J68860k4920k4095m789O1875j10951
8753C57245K9185j60661j62190J66514j2354p607j08607K0171K60070j78018q7236
8742A16512J80950R6333j18653o7997n3438N4694J02121J68906q87k65071j7360
8731A96110J88649k07149N2905j79066j40643n5874n4548P6334P8094j89562j8579
$$ y = [357515, 231661, 141372, 132918, 97990, 142931, -12488, 69791, 81448, -279, -137673, -209397, -53184, 187972, 185509, 193860, 142472, 52874, 202766, 86136, 122789, 170447, -166570, -206713, 174611, 369132, 352612, 451779, 205160, -85747, 130268, 169696, -52607, 98498, 87202, -218907, 14234, 399079, 345442, 118558, 135413, 87194, 92390, 33972, -94199, -154802, -107371, 146923, 291265, 460125, 435205, 411110, 406321, 468196, 357245, 386430, 225769, 63579, 230093, 217739, 210132, 101525, 121696, 381766, 203748, 116512, 297462, 393795, 275142, 207145, 153707, 208401, 310522, 479428, 478541, 213470, 196110, 384759, 177610, 230515, 51449, -89194, -145068, -199616, -123282, -45188, -234750, -253329]
8720b53329K18963n5649j30949J63453J44231R8131P3130j8703k5752J27181M2903
8709C83610K3675j53310O4254k6983k52210k24512k26185L97997L02303J4467
8699C03106o1889j43808j14596J94715J95412j7947J32711j33965j21333Q1929
8689C14335k70916j00600J53361M6223k62j53858K59595J34477K0041P9837j1966
8678D70267q3283j47016m301J40045Q3102M2643k8661L6068j70013n1106l5345
8667B52400L5964K75007k56048j28787L70186K57380j21632k94250o7129J56461
8657D79552m1025J46971q495L0020J45236j96099r6025j100j66780O4105J59964
8646E16324J2063L3181q172j82298J62007n4346m7291J80309R4884K68145J24134
$$ y = [-253329, -34366, -90015, -220964, -57511, 86720, 184851, 257981, 239278, 213526, 340707, 383610, 407285, 253975, 318229, 291246, 39036, -185476, -411661, -13664, 288639, 303106, 241217, 97409, -17187, 177528, 372940, 354993, 487704, 353739, 232406, 314335, 43419, -57181, 96180, 142403, 142141, -11717, 247878, 382355, 402396, 482233, 470267, 386984, 239968, 235667, 375712, 458814, 501457, 472796, 508864, 338851, 287745, 252400, 288364, 563371, 307323, 178536, 548722, 806102, 684470, 390220, 323091, 479552, 438527, 585498, 577003, 607023, 752259, 556160, 460135, 459035, 292255, 356360, 516324, 528387, 561568, 553396, 371098, 533105, 478759, 431468, 611777, 706661, 974806, 1098940]
8635A098940k31601k61665m9100k32429J44387K21284K66769K83495j06378j11096
8625A022606k38872k15465J8807J5941j04766K05864K16667l8658j18196M965
8615G68893K11964K53196p7823k55601l6983M45221L32827L396k43509K8586m7887
8604A382280P2869K6898K81588L34990L08266L3917J3825J53876L1694N5823J37946
8593B833972N9176O7338K20088J54835J93720J30529P1685J33215M15186J95115
8583D474859l48401p65517o21379l59382j78372j82311j86282j73324J94506K9989
8573A884386k3095j58808K645n5885K40544k34514k2429j30217m0774L6238j44518
8562A353573k06504R8470P0234j34883r6675r2391M2955J24502J55441k5842k79634
$$ y = [1098940, 867339, 605674, 556574, 324145, 468532, 689816, 956585, 1240080, 1133702, 1022606, 783734, 568269, 587076, 603017, 498251, 704115, 920782, 882124, 763928, 768893, 980857, 1234053, 1156230, 900629, 863646, 1308867, 1641694, 1645090, 1401581, 1430167, 1382280, 1455149, 1482047, 1763635, 2098625, 2406891, 2440808, 2454633, 2608509, 2640203, 2696026, 2833972, 2893148, 2960486, 3180574, 3335409, 3529129, 3659658, 3731343, 3864558, 4279744, 4474859, 4126458, 3360941, 2739562, 2380180, 2201808, 2019497, 1833215, 1659891, 1854397, 1884386, 1861291, 1702483, 1705128, 1649243, 1889787, 1655273, 1632844, 1502627, 1461853, 1498091, 1353573, 1147069, 1245539, 1315773, 1180890, 1084215, 991824, 1034779, 1159281, 1314722, 1288880, 1009246]
8551A009246j16452j56004j3130m423K43113N0460k03863k3738J97086J18249
8541A100544K80992n9901R7376M8373J3357j58987j12538m03987r7901K02265
8531I09593R0403J976l09439m2649k9311k13051K3391K57664K44046L9284j31327
8520H40580k70940k198K26907J94968k30503k83169K35624J87063j6502o3206
8510H18624k0696m9403j93848N6419K87685M1431n606j04641N279J48614L86713
8499A370571J68987Q7610k68377m1073J33358J7975J66304j97065l6641m1465
8489A360184l6676o2233P5628j25568k20264O8140J42767k51661j12273J37198
8479I75242l17101K4917J62706j35404j87730j22759r3640L34549N2473k08939
$$ y = [1009246, 892794, 736790, 723660, 719237, 962350, 1012810, 808947, 785209, 982295, 1100544, 1381536, 1321635, 1419011, 1467384, 1480741, 1321754, 1209216, 805229, 707328, 909593, 999996, 1001972, 692533, 649884, 620573, 407522, 430913, 688577, 932623, 971907, 840580, 569640, 567442, 794349, 989317, 758814, 475645, 711269, 898332, 881830, 818624, 797928, 748525, 554677, 611096, 898781, 940212, 934606, 829965, 835244, 983858, 1370571, 1539558, 1627168, 1358791, 1317718, 1451076, 1469051, 1635355, 1438290, 1401649, 1360184, 1323508, 1261275, 1336903, 1211335, 991071, 1059211, 1201978, 950317, 838044, 975242, 658141, 683058, 845764, 710360, 522630, 399871, 306231, 640780, 693253, 484314]
8469D84314k47809m3728M734J06492J95757J69859K03663J29873j15238k26516
8459F61401P2252K36454r5700k3121r2162M3020J68603j7218J095J95661K42077
8448A392362N1053J32899k39075j05924J52143j96691k29343K13551K43362k130
8438A412207k92831m34031k42626j61582P3783K74970J61104j10258l55979J1663
8428C36420q5572M1642J04408Q8903J12190M7532j11497J47318l876j41939r712
8417E25817j54266L4355J65724j45807p2094P8417J84074j30314k48693L0746
8407B67959O1049l13813r2554K84551R4155j35333K5078l14992j31780J69919
8397h5761L60110J44999M7554n1025L8221K2808m3140p1761j81541O5585J05478
$$ y = [484314, 236505, 192777, 197511, 304003, 499760, 669619, 873282, 1003155, 887917, 661401, 733653, 970107, 874407, 851286, 759124, 802144, 970747, 953529, 954624, 1150285, 1392362, 1443415, 1576314, 1337239, 1231315, 1383458, 1186767, 957424, 1170975, 1414337, 1412207, 1119376, 685345, 442719, 281137, 354920, 629890, 790994, 680736, 324757, 336420, 250848, 292490, 396898, 485801, 597991, 645523, 534026, 681344, 677468, 535529, 525817, 371551, 405906, 571630, 425823, 353729, 432146, 616220, 485906, 237213, 267959, 329008, 15195, -77359, 207192, 301347, 166014, 191092, -123900, -255680, -85761, 274349, 419348, 466902, 415877, 454098, 476906, 433766, 362005, 180464, 246049, 351527]
8386C51527p5992j33143k9878J14053J41078k67856P7147J07747J70182j6853
8376D38012n5315j91926j49432j03399J31942J91331j26309k57219P3478L80114
8366C31277O5748N1346J25864M00334j10459m31413j25179J74682J45084o8103
8356E59181L09413J79515J820l16941p4236J30017j60641l39290J8901J03595
8346D11334J79707l5099l16997k7457L22725N6238p9458j80086m8302R1468l310
8335C70763L0372K14699K28561k31421q5681k78380j075J25156j82433j60509
8325C0052N1843J15265Q7857R2254k05409m2101M5174N9997j49944k27054J75226
8314C3160L31065o1565k07180q1491Q8559K69416j20324M0450J28157j0147Q3891
$$ y = [351527, 275535, 142392, 112514, 226567, 367645, 99789, 176936, 284683, 454865, 438012, 382697, 190771, 41339, -62060, 69882, 261213, 134904, -122315, -48837, 331277, 397025, 448371, 574235, 974569, 864110, 432697, 307518, 482200, 627284, 559181, 868594, 1048109, 1049929, 732988, 658752, 788769, 628128, 288838, 307739, 411334, 591041, 555942, 238945, 211488, 534213, 590451, 510993, 330907, 282605, 374073, 370763, 401135, 615834, 844395, 612974, 527293, 248913, 247838, 372994, 190561, 30052, 81895, 197160, 285017, 377271, 171862, 129761, 174935, 234932, 84988, -142066, 33160, 364225, 302660, 95480, 13989, 102548, 371964, 251640, 292090, 420247, 410100, 493991]
8303D93991L6782R6060j98308J04968j54761j02578j81257j55276N8453K8173
8293B6247j53290j52175O2115J31955k0653k2126L05985P430k7769N4733j36173
8282G6279l79611P3545J8710J00604j80409k12081M14316M22575R3907J0459L0903
8271D69197J5623j09016k16400l1221J64402j6853N226M2726j43225r5874j9960
8260F4625N30450J41102k12166k44829j07998j91820P4462J75237K27665j06356
8250C50372j80502Q2300J74860n821K0971j34976M0755n4834m5967J24129Q3707
8239D54994j72392l68366j11989K74533r8388L685k24818j22931J38656J31790
8229i5226J5337L9109M7707J23921l3721j56871Q315K83551j9796k03703j51832
$$ y = [493991, 530773, 626833, 428525, 533493, 378732, 276154, 94897, -60379, -1926, 26247, -127043, -279218, -217103, -85148, -105801, -127927, 178058, 185488, 157719, 212452, 76279, -303332, -229787, -211077, -110473, -290882, -502963, -88647, 333928, 427835, 438294, 469197, 484820, 375804, 159404, 128183, 292585, 275732, 280958, 323684, 180459, 84585, 64625, 595075, 736177, 524011, 279182, 171184, -20636, 53826, 229063, 456728, 350372, 169870, 252170, 427030, 421209, 442180, 307204, 347959, 293125, 247158, 371287, 454994, 282602, -85764, -197753, 76780, -21608, -17923, -242741, -365672, -227016, -95226, -79889, -40780, 6927, 130848, 97127, -59744, -51429, 232122, 212326, 8623, -143209]
8218a43209J44349K97591j96159l29144P2215K57219Q8836n1365j05125n480P4254
8207A03982k2985J63363K723P13j55437j94418k16087j0713O5873j21539J65502
8196b19023K17394K30832L2660K03070K2675k23563P7965j40407k97094K4918
8186g0573q4571j09209K4459J86809o5749j77151n6655K46609L45836n387l74401
8175a39983k28469q644K68499O7746o0545Q2815l732k12606j75795j61228j7728
8164e89670L75321L01294j73538M9975k551n6315J83112J24232l7702k28816j73176
8153b27834K39285J81619p5143p4101L99827J82776p5679j63377o3432J06304
8143D30245J51754R796J918J95130l24636l81302k54470R479K18016J80145L21076
$$ y = [-143209, 1140, 298731, 102572, -226572, -154357, 102862, 191698, 140333, 35208, 29728, 103982, 80997, 244360, 247083, 247796, 92359, -102059, -318146, -328859, -262986, -384525, -219023, -1629, 229203, 261863, 464933, 487608, 264045, 342010, 201603, -95491, -70573, -155144, -264353, -239894, -53085, -118834, -295985, -352640, -106031, 239805, 234418, -139983, -368452, -377096, -108597, -40851, -101396, -18581, -22313, -234919, -410714, -571942, -589670, -214349, 86945, -86593, -36618, -39169, -95484, 87628, 211860, 174158, -54658, -227834, 11451, 193070, 117927, 43826, 443653, 626429, 550750, 387373, 323941, 430245, 581999, 591795, 593713, 788843, 464207, 82905, -171565, -162086, 55930, 236075, 557151]
8132E57151K16052k93676j79872J27782k07322j82078K56735J71784j23129l15198
8122B8229l20381K54773J15839j76721k31480n0140K34570L6160J12229k10181
8112b07103k8659L33942L96029k3000j98124J68334k8361O6833j50p8659p7345
8101C23737j26324R2537j13932j48686j67955p686o5790j01435P0687O0451o8837
8090b53233N3014m1714J23584L13k7083Q8641q4497L0046R9202K0525m9150p1751
8078a12103q3092M7466J17310J50723Q9719K7952O5550j0457r8770j66798k07008
8067a79508j92761j30866J13017L66286J42858J88124q2092l68264q453J18155
8057c3504R6372k11144J47141K01825l5343k13994j01746k50772L18924K67371
$$ y = [557151, 773203, 479527, 299655, 427437, 220115, 38037, 294772, 466556, 343427, 28229, -292152, -37379, 78460, -98261, -329741, -379881, -145311, -109151, 3078, -207103, -235762, 98180, 494209, 471209, 273085, 441419, 413058, 479891, 479741, 401082, 323737, 197413, 289950, 176018, 27332, -140623, -148309, -214099, -315534, -244847, -184396, -253233, -200219, -241933, -118349, -118036, -145119, -56478, -140975, -110929, -11727, 8798, -40352, -112103, -195195, -147729, -30419, 120304, 210023, 237975, 303525, 293068, 194298, 27500, -179508, -372269, -503135, -390118, -23832, 119026, 307150, 225058, -143206, -151659, -33504, 62868, -148276, -1135, 200690, 165347, -48647, -150393, -401165, -82241, 185130]
8047A85130K59395j62842j68767j26462k00423O025R1211O7253K4267m1740Q8810
8036B1857K65786L16305L4083R0170J16801j7418q096j20175k77882p4088J93057
8025E40400N9805k58294M7916j5092J55738m3555j88134J60798j03776k12528
8015A43278J20405K60760J7273J2225k00033J02987n7580m11143j16767K08289
8005G9694q828o9597J80461l0188N0071j67332J66512J7090J16489j09112K64965
7994D90225L35270k7369p1864L52870L70477J87901M81381N6428J207K07664J88217
7983B572407p6437m3512J03454j56058l56645l56473p1026p6048R6342k85634
7973A350370j52990k70062K11278N0213k40345M0744j14134p5756j02049n7844
$$ y = [185130, 444525, 281683, 112916, -13546, -213969, -207944, -116733, -49480, -25213, -66953, 21857, 287643, 603948, 638031, 728201, 845002, 827584, 819488, 699313, 421431, 347343, 540400, 600205, 341911, 389827, 374735, 530473, 486918, 298784, 459582, 355806, 143278, 263683, 524443, 541716, 553941, 353908, 456895, 399315, -11828, -128595, 79694, 70866, 1269, 181730, 151542, 201613, 34281, 200793, 217883, 334372, 225260, 490225, 825495, 798126, 726262, 1079132, 1449609, 1637510, 2118891, 2175319, 2176526, 2384190, 2572407, 2495970, 2452458, 2555912, 2399854, 2043209, 1686736, 1615710, 1539662, 1636004, 1350370, 1197380, 927318, 1138596, 1188809, 948464, 989208, 875074, 799318, 697269, 639425]
7963F39425r8560o0104j84013k54580J64570K65394K68063j3611Q4693K11545
7953A022822p0871j79350J71148J70526K71137L76948K7868K6620K94110K3656
7943B134614j03092J78629L24067L3864J40098k21694n43143l73094M4304k27625
7933A386928j97277J67550o7633l29767j17665R4397l6582j40042j89931J5610
7923E85588r091r0023J97635j08525k10921j02063L86139J65166k27557k85464
7913C00884J85229J39990L18478J50720j41328Q4352J38953j43556j38136k19948
7903F75638k03914R7458M7185r840l8457k5163Q8198k46653j21003K54936R8518
7892F16903N01489o4256k34713l96335j95138J57682K28853j19805n27158k33184
$$ y = [639425, 540865, 480761, 296748, 42168, 206738, 472132, 740195, 726584, 811277, 1022822, 951951, 772601, 943749, 1114275, 1385412, 1762360, 1790228, 1816848, 2110958, 2134614, 2031522, 2210151, 2534218, 2568082, 2708180, 2486486, 1943343, 1570249, 1614553, 1386928, 1189651, 1357201, 1289568, 959801, 842136, 936533, 899951, 759909, 569978, 585588, 576497, 486474, 684109, 575584, 364663, 262600, 648739, 813905, 586348, 300884, 486113, 626103, 944581, 1095301, 953973, 1038325, 1177278, 1033722, 895586, 675638, 471724, 569182, 616367, 606527, 568070, 542907, 631105, 384452, 263449, 518385, 616903, 1118392, 1054136, 819423, 423088, 227950, 385632, 614485, 494680, -32478, -265662]
7882b65662J96320N7698M28295J08500l9923M9697k67320j5227M7922o2578k51167
7871a3445l74545K16717K67433J27340m8327j02660j03812l9104n766k0950M0848
7860e6271J33076J46581O5671M0719r8216J5418R1849j10731J14087J63116L2075
7849E37374j96601j07442q6636Q701N9211j75322k15904O4499J52001J3597K25767
7838B79245K00660J25674R9395k40333j31418j28465j7545j63239K779J01054
7828A27807n6924p4158J10233J10117j77864n2724J47493m6908j14514k09703
7818b37145j94061r7390M0490K89852K8219J0675m6035J06248j08160j6140q0707
7807c04154J70989k17371r8971k0911L37403K17558L02466k12626M5457J54250
$$ y = [-265662, -69342, -11644, 416651, 525151, 485228, 534925, 267605, 252378, 300300, 237722, -13445, -387990, -171273, 96160, 223500, 175173, 72513, -31299, -70403, -76169, -97119, -56271, 76805, 223386, 289057, 329776, 231560, 246978, 338827, 228096, 342183, 505299, 537374, 340773, 233331, 146695, 155396, 214607, 39285, -176619, -112120, 39881, 53478, 279245, 479905, 605579, 704974, 464641, 333223, 204758, 187213, 23974, 26753, 127807, 70883, -3275, 106958, 217075, 39211, -13513, 133980, 87072, -27442, -237145, -431206, -528596, -488106, -198254, -170035, -159360, -205395, -99147, -207307, -223447, -304154, -133165, -350536, -449507, -470418, -133015, 84543, 387009, 174383, 219840, 374090]
7797C74090m0483k92556P7590j56323L709j42046n601N9085J25666r3719J85901
7786I5313J98514P9029j27187L20538k45504l93379L8850m9521m27864N3704J20491
7775c37016J9323J61349J71481N6162l68237j43259l082J30907o4796j60838K18826
7764c19180J16866O1336m0126J06205R0425K16879K831l15082O3685K7923J44236
7753A55998K34880k911J1953k48674k61556M384J09920L6454K25993j64364l49315
7742b47238k61613J46422K58196K75308M7290j74856p0462p8814j84225K5712
7732b64280K00503Q1961p9576k15651r8425J16212P335K15548l7204j5677k7065
7721a16319P4495n5788K11145r984j60104Q7868J2911j09987j9122m8021J45157
$$ y = [374090, 333607, 41051, 118641, -37682, -33973, -176019, -181620, -122535, 3131, -90588, 95313, 293827, 372856, 245669, 566207, 320703, -72676, -33826, -83347, -511211, -457507, -337016, -317693, -156344, 15137, 71299, -296938, -440197, -443279, -312372, -377168, -538006, -319180, -202314, -140978, -181104, -74899, 15526, 232405, 235236, -79846, -16161, 11762, 155998, 390878, 387967, 399920, 151246, -110310, -105926, 3994, 40448, 266441, 102077, -247238, -508851, -362429, -104233, 171075, 218365, 43509, -26953, -105767, -289992, -264280, -63777, 18184, -61392, -277043, -375468, -259256, -251921, -36373, -73577, -89254, -116319, -41824, -97612, 113533, 103549, -56555, 31313, 44224, -65763, -84885, -132906, 12251]
7710A2251j39610K00284p9791L8311j8154K6441P0511r3903K14942J31757j81223
7699A81816J04782j3666j70061j99196j59858J48947O4825p7602o2685J27870
7689e4828r4530N1471M2061l14890Q2951L16627M7782q6438M9833k04458k56747
7678d21166k5145L6682J61646L4661K19787K3216j65447j02642r9701l16773o1349
7667g16231L7521P3223L46161J13095J36306L6097j47289l25484o8502J22938
7657c92165P0097J5795k24054O0675J7031L16657j44807r0480J63753K14060K78143
7646B84705J5715m3298j43638j21655k69581J08876n5164k95110J60249K08997
7636a49904J01566J17414J43169M566k10888j55711j29063q9411R6362J90134
$$ y = [12251, -127359, 72925, -6866, 31445, 13291, 39732, 110243, 16340, 231282, 363039, 181816, 286598, 272932, 102871, -96325, -256183, -107236, -42411, -120013, -182698, -54828, -149358, -97887, -55826, -370716, -287765, 28862, 76644, -9794, 40039, -164419, -421166, -446311, -409629, -247983, -213322, 6465, 29681, -135766, -238408, -338109, -654882, -716231, -678710, -605487, -259326, -146231, -9925, 26172, -121117, -446601, -515103, -392165, -322068, -306273, -530327, -469652, -452621, -135964, -280771, -371251, -207498, 6562, 284705, 300420, 257122, 113484, -8171, -277752, -168876, -224040, -519150, -358901, -149904, -48338, 69076, 212245, 216811, 5923, -149788, -278851, -368262, -271900, -81766]
7626h1766o1883R3058p2092j3186L6331j33945J00109K12739n0169j38690j70934
7615b80428l0704J08188K24169J71633q0999j8660r6656j26272r0561K3036p2767
7604b70021J80975j64654K2450L68398J42561j75849j04619l3085k20053J29898
7594a23999J25097k27164J5745k7231P5732L44331R2680n04086o2947J27982L59777
7583A95917N3418l59924m0555J13518P2380j43434l67577J31598L25065j7099
7573c6693k3944J44390k48091j19496K7604Q1560O0868j79123o7704n8515M20394
7562A250P5971M8301L1329J88710q3164k42142j29679j4040O7658m2143L0972
7551f6977J81703k29860j63152j58270J4764J28456R5987P3581L76792K09226
$$ y = [-81766, -143649, -50591, -122683, -135869, -99538, -233483, -133374, 79365, 29196, -109494, -280428, -311132, -202944, 21225, 192858, 111859, 93199, -3457, -129729, -220290, -197254, -270021, -89046, -253700, -231250, 137148, 279709, 103860, -759, -33844, -253897, -123999, 1098, -226066, -210321, -237552, -161820, 182511, 275191, -228895, -291842, -163860, 195917, 249335, -110589, -151144, -37626, 34754, -108680, -476257, -344659, -19594, -36693, -60637, 83753, -164338, -283834, -256230, -174670, -113802, -292925, -360629, -419144, 1250, 77221, 125522, 156851, 345561, 262397, 20255, -109424, -123464, -55806, -97949, -66977, 114726, -115134, -278286, -436556, -421792, -293336, -197349, -123768, 253024, 462250]
7541D62250J01449l48522j28908n0063O9743l37383j41594J87119J94166o5164
7531e6907N3120J8511l23638j12300K98157K01039J21595j91230l61248n5028
7521d07929K00724K07481R6981l3778j34423j4924p0408r682L5739p8907m1667
7510b50793L41166P7584m7995M7150Q4752j85636j92800J23322l0007p5970R0192
7499a9035j55l0238j17550p1842q0991L8302N5369J63650k93760k62403j73133
7488g91786q9391J49381k9790j19050K20000O91710J17900O8274l7097j05308
7478G4843j40763l0334O8235j35154Q9050l8455k08854j02396J09668l9456J37477
7467b16139k64862J77813M29860p0680j72995l0197m4304J3740K14972J09142
$$ y = [462250, 563699, 215177, 86269, 36206, 105949, -231434, -373028, -185909, 8257, -56907, -3787, 14724, -308914, -421214, -123057, 77982, 199577, 8347, -352901, -407929, -207205, 276, 97257, 63479, -70944, -85868, -156276, -165958, -130219, -209126, -250793, 90373, 167957, 119962, 167112, 251864, 66228, -126572, -3250, -33257, -109227, -19035, -19190, -49428, -166978, -238820, -319811, -281509, -226140, -62490, -356250, -618653, -791786, -881177, -731796, -761586, -880636, -660636, 31074, 148974, 217248, 180151, 74843, -65920, -96254, -28019, -163173, -74123, -112578, -321432, -423828, -314160, -353616, -216139, -481001, -303188, 126672, 55992, -117003, -147200, -191504, -177764, 37208, 146350]
7457A46350j16346j52705J98150K97511Q5308k28160n11102Q5720r0057p7676
7447c63007K42851l4882q0353J78254K34196L5441l08618J50698N03134j71752
7437C85962k18414J12113l26002j07885r0555k14324k98466M2654L53402L34574
7427b6941k5810J42011p1093J45440k75895l67178N3565R9387J42716K30442J7527
7416F4171j0857l59582L8379L46132M9020M5600j70027m7178j65911j17629J97810
7405a30072J85011Q1610J36788j99373r6709j10697j60603J28207k96652M5464
7395d17026J34555N8911l18398j54525j03062K08264M443J7646L5587L07465k9030
7384b55170k38415m0143L94099M04982q1879J2827O4242j17645P906j19569l3158
$$ y = [146350, 30004, -122701, 75449, 372960, 458268, 230108, -280994, -195274, -285331, -363007, -120156, -155038, -235391, -57137, 177059, 212500, -96118, 54580, 557714, 385962, 167548, 279661, -46341, -154226, -244781, -459105, -757571, -714917, -361515, -26941, -52751, 89260, 18167, 163607, -112288, -479466, -425901, -326514, -183798, 46644, 64171, 53314, -306268, -267889, 78243, 127263, 172863, 2836, -44342, -210253, -327882, -130072, 54939, 136549, 273337, 73964, -22745, -133442, -294045, -165838, -462490, -417026, -282471, -223560, -541958, -696483, -799545, -591281, -586838, -569192, -533605, -226140, -255170, -493585, -533728, -139629, 265353, 183474, 196301, 260543, 142898, 150804, 31235, -1923]
7373a923l96703m0818m2775J83416M467K79386J94603M6189M4282j74006j22722
7362b6604k90915J28250r2474j02954j05575k8673m3036J5004k22213R3343K30685
7351d45162J75323K93899q3254l37093J96782p2990M1555K04522J99253J02330
7341B75165l8227k18027j22638J06257m9775j88232M0556o5418k21768J63488
7331c18619N9783J0081J26356J10259j24739K7237L45199L49681l11785k94229
7321b0776j14391m3415J5595J71662n3488n609M6340p0040k66580j64870O5804
7310d39768l758J71389J65464J18733j6981j46442j09507J90593J5189l81305
7300d36393m3544J12105J03323Q159j4480L63645j5526j86571r9179J54887L9274
$$ y = [-1923, -398626, -439444, -482219, -298803, -294336, -14950, 179653, 225842, 270124, 96118, -26604, -317519, -189269, -281743, -384697, -490272, -518945, -561981, -546977, -769190, -675847, -445162, -269839, 24060, -59194, -396287, -199505, -272495, -230940, -26418, 172835, 275165, 236938, 18911, -103727, 2530, -47245, -235477, -194921, -260339, -482107, -318619, -258836, -248755, -122399, -12140, -136879, -109642, 235557, 585238, 273453, -20776, -135167, -178582, -162987, 8675, -44813, -50422, -4082, -74122, -340702, -505572, -439768, -443526, -272137, -106673, 12060, -4921, -151363, -260870, -70277, -55088, -436393, -479937, -367832, -264509, -256350, -270830, 92815, 77289, -109282, -208461, -53574, -14300]
7289a4300Q7483O5520o1960j51642j35153K40062p0223N9221J20761J21394l39029
7278g7866k96041p8439m903J30640j78316J82589L23204N2977j36402k35645L759
7267c14443n0878J26573k6712J94317K51605k17109j5644N6051q7596m8853J29118
7256c571L911J17381l2281j71766k04693K58744q0785k26077k65214j38706J56107
7245e86950J96591J82065O6277J87957N9019j66037m2253J37733P1450O8850k06369
7234c1667j32150k3354P967J16566K83481J76727k59479j82602Q0015K38185K1911
7223B95600l8643l37870l8427R5185J28052j30651m0303J44873J85644j95511
7213F7949o6483K25939j02049j71700j70449j92883O2483J51284K51013N6257
$$ y = [-14300, 73183, 138703, 76743, -74899, -210052, 30010, -40213, 19008, 139769, 261163, -77866, -373907, -452346, -457249, -326609, -504925, -322336, 868, 53845, -82557, -318202, -314443, -365321, -238748, -265460, -71143, 180462, -36647, -52291, 3760, -83836, -132689, -3571, 340, 117721, 85440, -86326, -291019, -32275, -113060, -339137, -604351, -743057, -586950, -390359, -208294, -142017, 45940, 104959, -61078, -103331, 34402, 105852, 174702, -31667, -163817, -187171, -179204, -62638, 220843, 397570, 138091, -44511, 35504, 273689, 295600, 256957, -80913, -119340, -24155, 103897, -26754, -67057, 77816, 263460, 67949, 1466, 227405, 125356, -46344, -216793, -409676, -347193, -195909, 55104, 111361]
7203A11361o5368J20306o0779r3023l4714k59874J03789j67013k48871j04718
7193f98904L12489r8446R8721L98993K82829q4997k28943j41915k96716O9754
7183c87135O956J24736K46899L10509n4071N6625J3879k24449j47694j13729j94143
7172c61617J27241P6790k45414j91576J38781N8600J70607J27906N529l69377
7162d62530J66006O0843j04918K67690K82646J62515k54369j97815J8073J53858
7152I1999n0024l6337j46139k67261k97577K88814J93154J58020k46700j36241
7142d48292J09955P8498K98891k9506j00450j02325O0062p8178j00921P2784m3000
7131b82482M0325R0690j8613m9095J3048r2985J87930L99389K1112M585m2075
$$ y = [111361, 45993, 166299, 105520, 12497, -22217, -282091, -178302, -345315, -594186, -698904, -386415, -484861, -386140, 12853, 295682, 210685, -18258, -160173, -456889, -387135, -380179, -255443, -8544, 301965, 247894, 304519, 318398, 93949, -53745, -167474, -361617, -234376, -157586, -403000, -594576, -455795, -397195, -226588, -98682, -93153, -462530, -296524, -235681, -340599, -72909, 209737, 372252, 117883, -79932, -61859, 91999, 41975, 5638, -140501, -407762, -705339, -416525, -223371, -65351, -312051, -448292, -338337, -259839, 39052, 9546, -90904, -193229, -133167, -211345, -312266, -239482, -282482, -242157, -151467, -170080, -219175, -206127, -299112, -111182, 288207, 309319, 313904, 271829]
7120B71829j21681k45054k18589J1679L30407j8327j04247K40513k41097j44389
7110b38956k74052p2688J93099k1311K56158R315k22931j26458J2732J75749m6886
7099c56229j29217o8182M3499J46558k2471j2020K37923j50679k14864J5985J8149
7088d91548L047J27130J47941J23195J70539m19931O0318K42713K55645k75429
7078e6380p5266R3546l152J46184k6327j4502j34748Q4613k74296k60531K06226
7067c14633J72265M9576J02713J37053k16413J94700p381j21055q2068j49267
7057b34510r3843P9478k65443q0423K43327K55467K04810M6613j77958M6700k18733
7046a94515K0308K57330l0122n5648o4376k09295l3238Q411j14319L15094L02040
$$ y = [271829, 150148, -94906, -313495, -301816, 28591, 10264, -93983, 146530, -94567, -238956, -513008, -585696, -392597, -413908, -157750, -148435, -371366, -497824, -485092, -309343, -356229, -485446, -553628, -510129, -363571, -386042, -398062, -160139, -310818, -525682, -509697, -491548, -488501, -361371, -213430, -90235, 80304, -339627, -279309, -36596, 219049, -56380, -131646, -38100, -41252, 104932, 78605, 64103, -70645, 13968, -260328, -520859, -314633, -142368, -92792, 9921, 146974, -69439, 125261, 117880, -3175, -85243, -234510, -328353, -248875, -514318, -594741, -351414, -95947, 108863, 155476, -22482, 24218, -194515, -174207, 83123, 53001, -2647, -67023, -276318, -309556, -301145, -415464, -100370, 201670]
7035B01670m83j37449k17990j28736q5450J09925p5036l96523m15293K65291K42540
7024f37534L33736P8063J1938M2524J16749q4401j38240m8226K36880J98112L9222
7013A48823k38053j13333K36829J00347j10865J55272L80291m2061m86643m04380
7003c73773J08907Q7540q4189Q8669J00414J00500L20051K39524k42197r0288
6993B55158m30034l40971L3219o3122r346J37846J83851l4975m9180j51922j68229
6982f37705L19604N6046M880Q7358P0431O2352o5908J70594K91341p436j92954
6971A58603l10948O3011P3557l7109n161k03732J86614O39j27202P2863K27038
6960I8173J46553p6828n5604j10080n215n6938M7744K59471L2041l01774o5722
$$ y = [201670, 201187, 63738, -154252, -282988, -368438, -258513, -333549, -730072, -1145365, -880074, -637534, -303798, -225735, -213797, -171273, -54524, -138925, -277165, -325391, -88511, 109601, 148823, -89230, -202563, 34266, 134613, 23748, 179020, 559311, 517250, 30607, -373773, -264866, -177326, -261515, -172846, -72432, 28068, 348119, 587643, 345446, 255158, -174876, -515847, -482628, -545750, -555096, -417250, -233399, -268374, -317554, -469476, -637705, -318101, -262055, -257175, -169817, -99386, -37034, -102942, 67652, 358993, 351557, 158603, -152345, -89334, -15777, -52886, -58047, -261779, -75165, -74526, -201728, -128865, 98173, 244726, 167898, 112294, 2214, -3001, -59939, -12195, 247276, 279317, -22457, -88179]
6949h8179p9341j74534n8048J34328M9337M93887J74705L6888p2279k05087q1360
6938A30317l97098N5014j8203J04132j27386Q3064k56154m5213M35200J70368
6928A34041j49218j49951k11710K76323j63227o2596J14289J51629o6562j77327
6918c04309j7798M12680Q8709o0246J96907l6585J41333q7656k78492k41303j885
6907a88645J52521J19296n340k92011j10453k97825J08119K47567L53906P1157
6897A58292M5647j5153l89993l02467J34061R5564O4671j0934J11777j80858k69957
6886e59350J31760L7259L1190K27908K58121M2348k93247l28543j2359K15485
6876b49428q0683K29954K80747j73954J9313K24370K9072k46000M1133q2180l6363
$$ y = [-88179, -167520, -342054, -400102, -265774, -216437, 277450, 452155, 489043, 416764, 211677, 130317, -266781, -211767, -229970, -125838, -253224, -170160, -426314, -471527, -36327, 134041, -15177, -165128, -376838, -100515, -263742, -326338, -212049, -60420, -126982, -304309, -322107, 90573, 179282, 119036, 315943, 279358, 420691, 333035, 54543, -186760, -188645, -36124, 83172, 77832, -214179, -324632, -622457, -514338, -266771, 87135, 158292, 203939, 188786, -201207, -503674, -369613, -274049, -209378, -220312, -108535, -289393, -559350, -427590, -390331, -359141, -131233, 126888, 169236, -124011, -452554, -464913, -249428, -330111, -100157, 180590, 6636, 25949, 250319, 279391, 33391, 74524, -7656, -44019]
6865d4019j95146j21563o6169j76852K5438J41023J99770L09746K13901k6933
6855B59196k14158l40845O973L42496J92797K15041k84411m36941k05334J92684
6845b72502J22832N1244j33013j20385j449J26366l4373O1761n727j14778K7309
6834b92715j32283J00940J22757L03408J08763j24734l91362j31654r4631K72832
6824b58679N30814J13730p0622J79344k51141o7442Q5741m7407k01236n4153o1194
6813a02245J66099N6203j10316K42636P7247l07824k02164L32022k43555p4617
6803a66514J06131J54950K8774j4915k44869j36225n2225J69025K42631J73705
6793B60468Q3893j86298l07885k74298N4930r5339J11165k47001Q61L37992L86540
$$ y = [-44019, -239165, -360728, -426897, -603749, -578311, -437288, -237518, 72228, 286129, 259196, 45038, -295807, -288834, 53662, 246459, 461500, 177089, -259852, -465186, -272502, -149670, -98426, -231439, -351824, -353273, -226907, -261280, -199519, -205246, -320024, -292715, -424998, -324058, -201301, 102107, 210870, 86136, -305226, -436880, -531511, -258679, 272135, 385865, 315243, 494587, 243446, 176004, 261745, 214338, 13102, -41051, -102245, 63854, 120057, 9741, 252377, 329624, 21800, -180364, 151658, -91897, -166514, -60383, 94567, 123341, 108426, -136443, -272668, -324893, -155868, 86763, 260468, 344361, 158063, -149822, -424120, -369190, -464529, -353364, -600365, -599504, -261512, 125028]
6782A25028q7200l32508j43344M8579J56160l31j34045J90242o4294m56140j35399
6771h33252j0568J46765M77194J07215J8642J30017j58518m5410K93035K18443
6761C43563J09730p8490k36714k37245m1106K69255J05283n947n4290k30508P6693
6750B0224K89345l4798q598j52902J22229K8107K4599k47752j45059K0459J3060
6739g1086p6973Q3632J2701L6570M19897Q5643j87071k12401J13578l43673q8769
6728b27952K13379M8977J53810K3092j07863j65883P189K14005j66667j98139
6718b06052j39666p7576N892J05592r8728k24648J19938J56212K05442J5024M656
6707a33914J44968L5423k59861q4604k00055n7154J45967J2555M0194L80910J03878
$$ y = [125028, 37828, -294680, -438024, -389445, -233285, -233616, -367661, -177419, -241713, -697853, -833252, -843820, -697055, -219861, -112646, -94004, 36013, -122505, -167915, 125120, 343563, 453293, 374803, 138089, -99156, -140262, 128993, 234276, 228329, 174039, -56469, 20224, 309569, 274771, 266173, 113271, 235500, 263607, 288206, 40454, -104605, -84146, -71086, -148059, -64427, -51726, -15156, 404741, 490384, 303313, 90912, 204490, -139183, -227952, -14573, 34404, 188214, 211306, 103443, -62440, -55251, 158754, -7913, -206052, -345718, -423294, -417402, -311810, -410538, -635186, -515248, -359036, -153594, -138570, -133914, 11054, 46477, -213384, -297988, -498043, -555197, -409230, -396675, -356481, 24429, 128307]
6696A28307j33503n5400J96524q1709l09942j19071J98617J33894q2457M5251
6686g9489O2899K27927P7200M2570j0938M588o527j39269J14103k72321J58567
6675A79310J17598k43657M0791J48214l8328k0000k99342R2091K98300o6321r9134
6664A09522q0292L1699j8420q1033o5174o7249M196R4357k0536k44498P1686o0587
6652c26329k1796J845L27684K50656L9971j54917o4374l1347l23637m6116J02437
6641b45923J75639J09480J22072n4888l6375K17795l6617j79649k45902J57027
6631a7341L3980q3671J48063P8031o2942n4363k68171j24465K31112L09047l5573
6620A53707l20434Q1097j11013J02544K09202R8176k11408j59341Q1214R9242
$$ y = [128307, -5196, -60596, 135928, 54219, -255723, -374794, -176177, -42283, -124740, -79489, -16590, 211337, 288537, 331107, 320169, 324757, 318230, 178961, 293064, 20743, 179310, 296908, 53251, 94042, 242256, 203928, 183928, -115414, -23323, 274977, 208656, 109522, 29230, 60929, 42509, -38524, -103698, -170947, -166751, -72394, -92930, -337428, -265742, -326329, -348125, -346280, -18596, 232060, 272031, 117114, 52740, 21393, -302244, -348360, -245923, -70284, 39196, 161268, 106380, 70005, 287800, 251183, 71534, -174368, -17341, 16639, -67032, 81031, 159062, 96120, 41757, -226414, -350879, -119767, 189280, 153707, -166727, -85630, -196643, -94099, 115103, 213279, 1871, -157470, -76256, 22986]
6610B2986k57920J61552K111j54843Q0865k0523P3751q5617j62498J39407L82512
6599A81783J46123j75361k60237J24026M05068j01465j37057M7060j49171k25202
6589a44433l0307o4171J33203P9845j05587k12296J64961L7675n7213n919j73203
6578c77445O0544j35393j26685j91413J39140J04421L07156k4529o0061j3256
6568c17521l5141j47490M5122Q877o9826L03689L4929l2765R7883K8420j3206
6557i7029r5884K98073R7285j09880j22282j61484N0246K59002L2282j20856l80382
6546c50909j22892j26200K09880K82467K73484J03406o0525l03591J14863m387
6536A5596k60183J63451k0757Q791m971J62333J57973k27417q7568p629j12677
$$ y = [22986, -234934, -73382, -71271, -226114, -145249, -165772, -92021, -177638, -340136, -200729, 181783, 327906, 152545, -107692, 16334, 421402, 319937, 182880, 229940, 80769, -144433, -174740, -238911, -105708, -25863, -131450, -343746, -178785, -141110, -198323, -204242, -377445, -316901, -452294, -578979, -770392, -631252, -526831, -219675, -244204, -304265, -317521, -352662, -500152, -455030, -446153, -515979, -212290, -177361, -210126, -112243, -83823, -97029, -192913, 105160, 202445, 92565, -29717, -191201, -140955, 118047, 150329, 29473, -350909, -473801, -600001, -390121, -107654, 165830, 269236, 208711, -94880, 19983, 15596, -244587, -81136, -101893, -93102, -98073, 64260, 222233, -5184, -92752, -100381, -213058]
6525b13058k4315J19355K6638k52637K26796L39999n0883k23892n8279k72713
6515c82989r658p469j94478j67392j66817L72536M916o8763L57485Q6806J3389
6504a62434L9046K35069k2077p3501j20335j87316k05046k18568o048n5197Q3828
6493f92579M53036R7064J16832J8699k77868j99898K54303L76779j61005l67397
6483c82034Q8707R8972J19488l7287M5227O2567r0945P4042L29192Q2298k53763
6472A36464Q123O0659j65594r3152J10926M8612k29105o1804m6750j45136Q8998
6461b87759J16271J50057N465J28055k21687k17045K12873m0220j02312k29454
6451d85756j45474J10186M364o7454K13032L50153p0126o7302j8801R9208K2734
$$ y = [-213058, -237373, -118018, -91380, -344017, -117221, 222778, 171895, -51997, -110276, -382989, -392647, -400116, -594594, -761986, -928803, -556267, -551351, -620114, -262629, -175823, -162434, -123388, 111681, 89604, 16103, -104232, -291548, -496594, -715162, -721210, -776407, -692579, -239543, -142479, -25647, -6948, -284816, -484714, -230411, 146368, -14637, -382034, -293327, -194355, -74867, -112154, -66927, -4360, -95305, -21263, 307929, 390227, 136464, 144587, 205246, 39652, -53500, 57426, 106038, -123067, -184871, -231621, -376757, -287759, -171488, -21431, -15966, 112089, -109598, -326643, -113770, -153990, -256302, -485756, -631230, -521044, -516680, -584134, -371102, -20949, -91075, -158377, -177178, -77970, -55236]
6440e5236k71244j39164J46921j7074K43690P7857P3999k44074o5440K76895K15098
6429B42228J4721j78432l54084J8133J11607J18200j27843r5046M2359j70439
6419c78596M0299K6120j53715J37936J95803K07701k48231l26211L4J68J01769
6408c96923R6466K36099K52730K2043K3873j71223m12373n0203K46310Q3023k21112
6397b91290M6927K67775p6354l3600P4829q4708l37822r9883k1988K8843N4317
6386d72954M38109n318N5280Q191k8179l75350k85245q5086M4790N69906K24989
6375H9133j60202j9566J23977m8794K2957J7332j53800j92219j13165K17751J61949
6364e4647n4625j8594n4042m6531l7493q5567k11803J03751J40773J97475J60898
$$ y = [-55236, -326480, -465644, -318723, -335797, -92107, -14250, 59749, -184325, -249765, 27130, 242228, 256949, 78517, -275567, -257434, -145827, -27627, -155470, -250516, -208157, -378596, -338297, -312177, -465892, -327956, -132153, 75548, -172683, -498894, -498860, -498692, -396923, -300457, -64358, 188372, 210415, 234288, 63065, -349308, -399511, -153201, -70178, -291290, -244363, 23412, -52942, -86542, -11713, -96421, -434243, -534126, -556114, -527271, -472954, -34845, -40163, 15117, 23308, -4871, -380221, -665466, -750552, -705762, -135856, 89133, -71069, -90635, 33342, -15452, 7505, 24837, -128963, -321182, -434347, -216596, -54647, -109272, -127866, -181908, -228439, -265932, -351499, -563302, -459551, -318778, -121303, 39595]
6353C9595j76184j3208O9928R9615J56177j03398k52054R202j69586M0566n1494
6342c50841j18353J23588J61829n039R5579m0616l85840J99394K20063R3583Q5352
6331G8699R1965k6715j8568J15589j8646j33716k93736j56284M54809M30000k167
6320E21230j19448k18423o836l3968l00646j64041M2327J97229J00125j5421p5258
6309g3130K43210J81706j93980m016K5000O0909k87926p1233P7205J06236M9675
6298A13656o0469K08967O0171q9350j61736l383m3375K37740J65935j29842j71281
6287A27033j32687j30729J80046n1817K7199k08564k68418O9720J27528k874J78955
6276h4608j30290k07850J91722R7220j20449m0818j24704K67495L45852m9855
$$ y = [39595, -136589, -149797, -79869, 19746, 175923, 72525, -179529, -170327, -339913, -299347, -350841, -469194, -345606, -183777, -188816, -93237, -133853, -519693, -320299, -100236, -6653, 78699, 170664, 143949, 125381, 240970, 222324, 88608, -205128, -361412, 93397, 523397, 521230, 401782, 183359, 176523, 142555, -158091, -322132, -279805, -82576, 17549, 2128, -73130, 170080, 351786, 157806, 153790, 178790, 239699, -48227, -119460, -42255, 63981, 113656, 53187, 262154, 322325, 232975, 71239, 67856, 24481, 262221, 428156, 298314, 127033, -5654, -136383, 43663, -8154, 19045, -189519, -457937, -388217, -260689, -263563, -84608, -214898, -422748, -231026, -133806, -254255, -295073, -419777, -152282, 193570, 143715]
6266A43715j00721L06154J08230o5662k24121p9142k91274j21593n7131J20347
6256b61198J79805J29868P4769m7366l88088J71110k36135q6005j85445J20500
6246e28185K95140K7706K87497J65164j84397k03297o5438j77675k82212r3444
6236g59141L49026M12331J91426j37295k04248n2295k08943Q6554L41874J7052
6226C6341j51715p8739m7326j05662j989K80809j34044k43136M2839M5268k75352
6215f32706k15009L01839J38170J5320j94399j7408J03684j3162J43198q3363
6205d53836K3233K78262J17899K65630K5815j91451q7550Q863J47310o1639l00188
6194b27652j5480J5685J444m6701J2438J40703J20183K05776j1301k86132Q0595
$$ y = [143715, 42994, 349148, 457378, 391716, 167595, 88453, -202821, -324414, -381545, -261198, -81393, 48475, 123244, 75878, -312210, -141100, -377235, -463240, -648685, -528185, -233045, -205339, 82158, 247322, 62925, -140372, -205810, -383485, -665697, -759141, -410115, 2216, 193642, 56347, -147901, -200196, -409139, -322585, 19289, 36341, -115374, -194113, -241439, -347101, -349090, -68281, -202325, -445461, -402622, -357354, -632706, -847715, -545876, -407706, -392386, -586785, -604193, -500509, -513671, -370473, -453836, -430603, -152341, -34442, 231188, 257003, 65552, -21998, -13135, 134175, 72536, -227652, -243132, -227447, -226003, -272704, -260266, -119563, 620, 206396, 195095, -91037, -10442]
6183a0442L3338K3596N9142j62359j16290R1646O9830J8092r4712J04857K65783
6172B82481J31123j48449j59916o9594j44512r1935K5185L9677m5454J17857p1322
6161a34859M3524J45666J7914J24611j66729j79910o4332k7016j46940p7705J89486
6150b76290k235m9732J31081P4372J17674j6363j58033k35966K58014J25514p9100
6139a11064M6607p1986j82812p7405j09697j2270K2978j01898J45163L52763J80421
6128H0800j88733k87008J84584j0820j33175N7159L69106J16758r683k17467J0910
6117b7569J57945J23974K75387J64259k80120j05902k08308n26387k4209J89391
6107b61539J79629n6808O8640P8236L0599n4965j33826J20399N656K01588j50115
$$ y = [-10442, 22896, 46492, 105634, -56725, -173015, -81369, -11539, 6553, -88159, 16698, 282481, 413604, 265155, 105239, 35645, -108867, -200802, -175617, -135940, -181394, -63537, -134859, -91335, 54331, 72245, 196856, 30127, -149783, -214115, -241131, -388071, -465776, -276290, -278525, -328257, -197176, -122804, -5130, -21493, -179526, -415492, -157478, -31964, -111064, -64457, -136443, -319255, -396660, -506357, -518627, -495649, -597547, -452384, -99621, 80800, -107933, -394941, -210357, -221177, -354352, -297193, 71913, 188671, 178988, -38479, -27569, 130376, 254350, 529737, 693996, 413876, 307974, 99666, -426721, -450930, -261539, -81910, -138718, -70078, 8158, 38757, -16208, -150034, -29635, -23979, 177609, 27494]
6096B7494j19346J5311j72637j43258p3697J08193Q0690L75052K31327k04525
6086A24604j21953j83411k30696K36927K86457r4737j18685J50596L49049K326
6076D00477l4053k41763l154k7572k05154j04992j29768j71212J59365L4126J3955
6065c09745K6075K47703j65903k34061J11491K64246J19296o3027P5934K71496
6055C43505p7113l84653n8294N5981K6069J69612p881J08609M8226j15138j53292
6044d4369k12651R8419L39231l8234k329O3365K34412J54173j90965k80012p8796
6033D2244l450l0180k18759N0763L33101q1183k68647l05045k2385K46660K71304
6022A4423p9628j14592J39836J87408J56567m8088m6238N4397k50607p5903J09208
$$ y = [27494, -91852, -76541, -249178, -392436, -466133, -357940, -277250, 97802, 329129, 124604, 2651, -180760, -411456, -174529, 111928, 17191, -101494, 49102, 398151, 400477, 366424, 124661, 121507, 93935, -111219, -216211, -345979, -517191, -357826, -323700, -309745, -283670, -35967, -201870, -435931, -324440, -60194, 59102, -3925, 72009, 343505, 266392, -118261, -176555, -120574, -94505, 75107, 67226, 175835, 224061, 108923, -44369, -257020, -158601, 180630, 142396, 140067, 203432, 437844, 592017, 401052, 121040, 42244, 38794, 8614, -210145, -159382, 173719, 92536, -176111, -481156, -503541, -256881, 14423, -65205, -179797, -39961, 147447, 304014, 255926, 209688, 264085, 13478, -62425, 46783]
6011D6783J02769j15681m9487l0033j14874N6048L8868k07420J8250p2018J74639
6000a52156K54192p3093r7619L34972J87123J5155r7217j52046m29661j64979
5990c75329J81995K45976K51761j99281k9940j44986K6660o5225n8245J43084
5980b3530L7597j8236K57911K16989J37664j40711K7688j03688l33799l30285
5970b72400j04318r5217J58576J33831L23251k9472j15242k4836j65906q1381
5960b73114K04100L09854m3224k45744p2776J80359j17400j51453q3882K45893
5950d7387K49383j16679k4796k1283J6129j09287J64794K31566K90118r9889J21941
5939F54610k65788p3411L4986k48332k99374j37237r5345n2887K62125M23501
$$ y = [46783, 149552, 33871, -15616, -45649, -160523, -104475, -65607, -273027, -254777, -326795, -152156, 102036, 28943, -68676, 266296, 453419, 468574, 371357, 219311, -210350, -375329, -193334, 52642, 304403, 105122, 75182, -69804, -43144, -108369, -166614, -23530, 14067, -4169, 253742, 470731, 608395, 467684, 495372, 391684, 57885, -272400, -376718, -471935, -313359, -179528, 143723, 114251, -991, -25827, -191733, -273114, -69014, 240840, 197616, -48128, -120904, 59455, -57945, -209398, -293280, -47387, 201996, 85317, 60521, 39238, 55367, -53920, 110874, 342440, 632558, 532669, 654610, 388822, 315411, 350397, 102065, -197309, -334546, -429891, -482778, -220653, 202848]
5929B02848j25642j78001J25659j08932j40843K10076K31215j06753r9983P1379
5919H1023j15887j84272K32190N2884j22431j11065o6806J31945R2970J20243
5909A10794k52137j59338Q3435j05548k71669r4592n8910J68842K00577J24665
5899b53881K0908J895r4052K43841K38886k167k20052m9931N4085M07102k12226
5888A34408k40595L50320k9956r0643K69605n6799J24445k7672j67382j99222
5878F6509k10787j54051K13917J7723l43508Q404J73363L5556n7369J02147M478
5867a43618l6491K4683K95797r1199K3394j682Q0850Q7374r2465J45509k03471
5856H8681o8615k5957p1700R0765M0281o202j04397K29539k29956l00126N2534
$$ y = [202848, 77206, -100795, 24864, -84068, -224911, -14835, 216380, 109627, 9644, 81023, -34864, -219136, 13054, 65938, -56493, -167558, -234364, -102419, -9449, 110794, -141343, -300681, -217246, -322794, -594463, -689055, -747965, -579123, -378546, -253881, -232973, -231078, -325130, -81289, 157597, 155430, -64622, -114553, -60468, 346634, 134408, -106187, 244133, 214177, 123534, 393139, 336340, 460785, 433113, 265731, 66509, -144278, -298329, -84412, -66689, -410197, -401793, -228430, -192874, -250243, -148096, -143618, -180109, -155426, 140371, 49172, 72566, 70884, 151734, 239108, 146643, 292152, 88681, 20066, -5891, -77591, 13174, 53455, 47253, -57144, 172395, -57561, -357687, -305153]
5845c05153J49828L21602Q1492J67462l34746j79637j63086p9972J7292L9024
5835b85894N0795K09852r0606j27425J65671j01970J33201P9690o4451k03312
5825b34449J97992J06972K82236k52567k73217M4360J91084k50395J89424K5010
5815B6450k66165J96462j5566L2048j67438k79753J76792J28188J10308J03547
5805D4873P6208k39432j36863K30685m1605j42823J43477J74084Q7159j60506
5795C5257k79595J45036J63687J4991j29904l8999l3501j46889O45K56134J60301
5784A47163n2033J1387j64024j84999Q4411p0464K1469J43523K07221J29360j47992
5773A25022j27546m3985j07315J29794m6943K60172R2616l31999l22111j5779
$$ y = [-305153, -155325, 166277, 247769, 415231, 80485, -99152, -262238, -342210, -324918, -285894, -235099, -25247, -115853, -243278, -77607, -179577, -46376, 33314, -31137, -234449, -36457, 70515, 352751, 100184, -173033, -128673, 62411, -187984, 1440, 26450, -239715, -43253, -58819, -26771, -194209, -473962, -297170, -168982, -58674, 44873, 121081, -118351, -255214, -24529, -66134, -208957, -65480, 108604, 195763, 35257, -244338, -99302, 64385, 79376, -50528, -89527, -123028, -269917, -269272, -13138, 147163, 95130, 106517, -57507, -242506, -158095, -228559, -207090, -63567, 143654, 273014, 125022, -2524, -46509, -153824, -24030, -70973, 189199, 281815, -50184, -372295, -388074]
5763c88074N8j44360J31093N7303M2331P336j0924K22121J49217J1489J17544
5752A95134l1461j33704l8269K02793J7376r3230n2184k88388l9732J23884n6785
5741a94566m1198j35127j79714n9611K52708K08169K50497j20901k45990k10983
5731d76716P9483o9848O8108L33586K8145n6878J54547J0718j18021q8618R7485
5720c8009j88379O9093K54408o619m15596k11483P1720J68182J0470o7194j10462
5709d63869N4842K28991K24404l0650j43411k45428K0807J52855K93908l4247
5699E8202q5937J81542o6669j84524l51830k8400j82697l8451J58920K24623J79516
5688a35705N86L9239J68556j16326P1049k5878k1482j01933R7271m5378n0785
$$ y = [-388074, -388016, -532376, -401283, -343980, -301649, -294313, -305237, -83116, 66101, 77590, 195134, 163673, 29969, -8300, 194493, 211869, 118639, 66455, -221933, -261665, -137781, -194566, -235764, -370891, -550605, -610216, -357508, -149339, 101158, -19743, -265733, -476716, -397233, -467081, -398973, -65387, -37242, -94120, 60427, 71145, -46876, -135494, -38009, -226388, -157295, 97113, 90494, -325102, -536585, -464865, -296683, -286213, -353407, -463869, -409027, -180036, 44368, 13718, -129693, -375121, -354314, -201459, 92449, 58202, -27735, 153807, 87138, -97386, -449216, -477616, -660313, -698764, -539844, -315221, -135705, -135119, -95880, 72676, -43650, 27399, 1521, -19961, -121894, -24623, -70001, -120786]
5677a20786N3465L3498J21084J02324R7549k54953k79654M6503O0036o8691o0137
5666b69762j25920n7250L1442O2727m9427q0227L57507J32763N9366J2597l1210
5655D2606j62822r1253K0869m3417K7486Q5663j37998j41793K35352K05810K6140
5644F6643J11223R8442K70264l0114N1639p6208k71048j61322l1913p8408j55803
5633b06605k18296J97871J55773J16451J78573j20608J11556p8637k76171P9982
5623f0111l6896r8034M2075n644j71886K72618J99607L0072m6900k31725J50796
5612D3972J4125j07019P672K5479l24305P7887M30462J47908k03157K13642o0328
5601B66338Q2248J5443k51910j03001l1835K11116m4879j22589r3370J08571P8335
$$ y = [-120786, -67321, -33823, 87261, 189585, 287134, 32181, -247473, -200970, -140934, -209625, -269762, -395682, -452932, -421490, -358763, -408190, -488417, -130910, 1853, 61219, 73816, 42606, -120216, -211469, -190600, -234017, -206531, -120868, -258866, -400659, -165307, 40503, 66643, 177866, 276308, 546572, 516458, 568097, 491889, 220841, 59519, 27606, -50802, -206605, -424901, -227030, -71257, 45194, 223767, 103159, 214715, 136078, -140093, -60111, -97007, -195041, -152966, -158610, -330496, -57878, 141729, 171801, 124901, -106824, 43972, 58097, -48922, -41250, -15771, -340076, -262189, 168273, 316181, 113024, 326666, 266338, 348586, 364029, 112119, 9118, -22717, 188399, 143520, 20931, -72439, 36132, 114467]
5590A14467K34203J79817o4493k99393o597j93670J88831k951O8469r0628m19916
5579b91861q7302J00307J23238K49519J0854o9053K65548o9531l66980m7380M88179
5568C05538p8212J1564l3211k84901J90556K52373k89874j87808j69924R7417
5558a86482J85009J36260K72613O2968o5182k0955j89010j91262k77890J03855
5548a70076J31292K29252j23574r0020J27980p1744j00663l38943j20865K99124
5538b28237J46823P2682J18587P526j30998L7785L6813L748j12848n4619k12212
5527c14950N394J75988J11107J55337j84904j64776k18108j76140K12440J87755
$$ y = [114467, 348670, 528487, 463994, 164601, 158004, -35666, 153165, 150214, 218683, 128055, -291861, -379163, -278856, -155618, 93901, 104755, 35702, 301250, 231719, -135261, -182641, 305538, 227326, 238890, 205679, -79222, 111334, 363707, 73833, -113975, -283899, -186482, -1473, 134787, 407400, 470368, 405186, 384231, 195221, 3959, -273931, -170076, -38784, 190468, 66894, -23126, 104854, 33110, -67553, -406496, -527361, -228237, -81414, -8732, 109855, 117381, -13617, 24168, 60981, 64729, -48119, -102738, -314950, -309556, -133568, -22461, 132876, -52028, -216804, -434912, -611052, -398612, -210857]
$$ [...]
##END NTUPLES=NMR SPECTRUM
##END=
