##TITLE=Analysis number 322115
Compound Code cd 09458
Project Code adrs
Chemist Name durham
##JCAMPDX= 6.0         $$ Bruker NMR JCAMP-DX V2.0
##DATA TYPE= NMR SPECTRUM
##DATA CLASS= NTUPLES
##ORIGIN= Bruker BioSpin GmbH
##OWNER= nmr
$$ XWIN-NMR		Version 3.5
$$ Wed Sep 13 10:51:16 2006 GMT Daylight Time (UT+1h)  MAYBRIDGE\nmr@NMR_250MHZ
##.OBSERVE FREQUENCY= 250.131544655141
##.OBSERVE NUCLEUS= ^1H
##.ACQUISITION MODE= SIMULTANEOUS (DQD)
##.ACQUISITION SCHEME= undefined
##.AVERAGES= 16
##.DIGITISER RES= 18
##SPECTROMETER/DATA SYSTEM= dpx250
##.PULSE SEQUENCE= zg30
##.SOLVENT NAME= CDCl3
##.SHIFT REFERENCE= (INTERNAL, CDCl3, 0, 16.4421)
##AUDIT TRAIL= $$ (NUMBER, WHEN, WHO, WHERE, WHAT)
$$ ##TITLE= Audit trail, XWIN-NMR		Version 3.5
$$ ##JCAMPDX= 5.01
$$ ##ORIGIN= Bruker BioSpin GmbH
$$ ##OWNER= nmr
$$ C:\u/data/dgb/nmr/ADRS/660/pdata/1/auditp.txt
$$ ##AUDIT TRAIL=  $$ (NUMBER, WHEN, WHO, WHERE, WHAT)
(   1,<2006-09-13 10:50:47.57 +100>,<MAYBRIDGE\nmr>,<NMR_250MHZ>,
      <created by zg, POWCHK disabled, PULCHK disabled
       configuration hash MD5:
       E2 DF 36 D8 04 B2 41 60 5A D7 A3 38 5A 4B D0 FE
       data hash MD5: 64K
       50 4B A3 2B 2C 63 79 87 F8 82 80 21 81 54 DA 17>)
(   2,<2006-09-13 10:51:06.25 +100>,<MAYBRIDGE\nmr>,<NMR_250MHZ>,
      <Start of raw data processing
       ef LB = 0.3 FT_mod = 6 PKNL = 1 SI = 32K 
       data hash MD5: 32K
       3E 17 E4 E7 DC C9 67 29 A2 08 87 4E 35 B2 81 2D>)
(   3,<2006-09-13 10:51:08.28 +100>,<MAYBRIDGE\nmr>,<NMR_250MHZ>,
      <apk 
       data hash MD5: 32K
       9D F5 2E 6D 56 75 36 70 02 D6 25 C9 4F 72 C9 26>)
(   4,<2006-09-13 10:51:09.01 +100>,<MAYBRIDGE\nmr>,<NMR_250MHZ>,
      <abs ABSG = 5 
       data hash MD5: 32K
       A7 D3 64 A0 8A 2E B6 53 C9 1B 8C 7A 7E 54 7A 78>)
$$ ##END=
$$ 
$$ hash MD5
$$ 06 61 9D 31 07 F5 55 39 86 B6 0C 40 56 52 00 3F
##$RELAX= 
##$RELAX= 
##$RELAX= 
##$RELAX= 
##$RELAX= 
##$RELAX= 
##$RELAX= 
$$ Bruker specific parameters
$$ --------------------------
##$DU= <C:\u>
##$EXPNO= 660
##$NAME= <ADRS>
##$PROCNO= 1
##$TYPE= <nmr>
##$USER= <dgb>
##$AMP= (0..31)
100 100 100 100 100 100 100 100 100 100 100 100 100 100 100 100 100 100 
100 100 100 100 100 100 100 100 100 100 100 100 100 100 
##$AQSEQ= 0
##$AQ_mod= 3
##$AUNM= <au_zg>
##$AUTOPOS= <16 >
##$BF1= 250.13
##$BF2= 250.13
##$BF3= 250.13
##$BF4= 250.13
##$BF5= 500.13
##$BF6= 500.13
##$BF7= 500.13
##$BF8= 500.13
##$BYTORDA= 1
##$CFDGTYP= 0
##$CFRGTYP= 5
##$CHEMSTR= <none>
##$CNST= (0..31)
1 1 145 1 1 1 1 1 1 1 1 1 1 1 1 1 1 1 1 1 1 1 1 1 1 1 1 1 1 1 1 1 
##$CPDPRG= <>
##$CPDPRG1= <>
##$CPDPRG2= <>
##$CPDPRG3= <>
##$CPDPRG4= <mlev>
##$CPDPRG5= <mlev>
##$CPDPRG6= <mlev>
##$CPDPRG7= <mlev>
##$CPDPRG8= <mlev>
##$CPDPRGB= <>
##$CPDPRGT= <>
##$D= (0..31)
0 1 0 0 0 0 0 0 0 0.06 0 0 0 0 0 0 0.0002 0 0 0 0 0 0 0 0 0 0 0 0 0 0 
0 
##$DATE= 1158141045
##$DBL= (0..7)
120 120 120 120 120 120 120 120 
##$DBP= (0..7)
150 150 150 150 150 150 150 150 
##$DBP07= 0
##$DBPNAM0= <>
##$DBPNAM1= <>
##$DBPNAM2= <>
$$ [...]
##$SUBNAM7= <"">
##$SUBNAM8= <"">
##$SUBNAM9= <"">
##$SW= 20.6930455092707
##$SWIBOX= (0..15)
0 0 3 0 0 0 0 0 0 0 0 0 0 0 0 0 
##$SW_h= 5175.983436853
##$TD= 65536
##$TD0= 1
##$TE= 296.16
##$TE2= 300
##$TE3= 300
##$TEG= 300
##$TL= (0..7)
0 120 120 120 120 120 120 120 
##$TP= (0..7)
150 150 150 150 150 150 150 150 
##$TP07= 0
##$TPNAME0= <>
##$TPNAME1= <>
##$TPNAME2= <>
##$TPNAME3= <>
##$TPNAME4= <>
##$TPNAME5= <>
##$TPNAME6= <>
##$TPNAME7= <>
##$TPOAL= (0..7)
0.5 0.5 0.5 0.5 0.5 0.5 0.5 0.5 
##$TPOFFS= (0..7)
0 0 0 0 0 0 0 0 
##$TUNHIN= 0
##$TUNHOUT= 0
##$TUNXOUT= 0
##$USERA1= <user>
##$USERA2= <user>
##$USERA3= <user>
##$USERA4= <user>
##$USERA5= <user>
##$V9= 5
##$VALIST= <valist>
##$VCLIST= <CCCCCCCCCCCCCCC>
##$VD= 0
##$VDLIST= <DDDDDDDDDDDDDDD>
##$VPLIST= <PPPPPPPPPPPPPPP>
##$VTLIST= <TTTTTTTTTTTTTTT>
##$WBST= 1024
##$WBSW= 4
##$XGAIN= (0..3)
0 0 0 0 
##$XL= 0
##$YL= 0
##$YMAX_a= 339602
##$YMIN_a= -414099
##$ZGOPTNS= <>
##$ZL1= 120
##$ZL2= 120
##$ZL3= 120
##$ZL4= 120
##$ABSF1= 16.44208
##$ABSF2= -4.251093
##$ABSG= 5
##$ABSL= 3
##$ALPHA= 0
##$AQORDER= 0
##$ASSFAC= 0
##$ASSFACI= 0
##$ASSFACX= 0
##$ASSWID= 0
##$AUNMP= <proc_1d>
##$AZFE= 0.1
##$AZFW= 0.1
##$BCFW= 0
##$BC_mod= 0
##$BYTORDP= 0
##$COROFFS= 0
##$CY= 12.5
##$DATMOD= 1
##$DC= 0
##$DFILT= <>
##$DTYPP= 0
##$F1P= 14.0000005364418
##$F2P= -0.99999901652339
##$FCOR= 0.5
##$FTSIZE= 32768
##$FT_mod= 6
##$GAMMA= 0
##$GB= 0
##$INTBC= 1
##$INTSCL= 1
##$ISEN= 128
##$LB= 0.3
##$LEV0= 0
##$LPBIN= 0
##$MAXI= 10000
##$MC2= 0
##$MEAN= 0
##$ME_mod= 0
##$MI= 0
##$NCOEF= 0
##$NC_proc= -2
##$NLEV= 6
##$NOISF1= 0
##$NOISF2= 0
##$NSP= 0
##$NTH_PI= 0
##$NZP= 0
##$OFFSET= 16.44208
##$PC= 1
##$PHC0= 147.9061
##$PHC1= 9.378675
##$PH_mod= 1
##$PKNL= yes
##$PPARMOD= 0
##$PSCAL= 4
##$PSIGN= 0
##$REVERSE= no
##$SF= 250.130019989501
##$SI= 32768
##$SIGF1= 0
##$SIGF2= 0
##$SINO= 400
##$SIOLD= 32768
##$SREGLST= <1H.CDCl3>
##$SSB= 0
##$STSI= 32768
##$STSR= 0
##$SW_p= 5175.98343685301
##$SYMM= 0
##$S_DEV= 0
##$TDeff= 65536
##$TDoff= 0
##$TI= <Analysis number 999999
Compound Code 99
Book Reference 9
Project Code 9>
##$TILT= no
##$TM1= 0
##$TM2= 0
##$TOPLEV= 0
##$USERP1= <user>
##$USERP2= <user>
##$USERP3= <user>
##$USERP4= <user>
##$USERP5= <user>
##$WDW= 1
##$XDIM= 32768
##$YMAX_p= 393923297
##$YMIN_p= -114690
$$ End of Bruker specific parameters
$$ ---------------------------------
##NTUPLES= NMR SPECTRUM
##VAR_NAME=  FREQUENCY,     SPECTRUM/REAL,   SPECTRUM/IMAG
##SYMBOL=    X,             R,               I
##VAR_TYPE=  INDEPENDENT,   DEPENDENT,       DEPENDENT
##VAR_FORM=  AFFN,          ASDF,            ASDF
##VAR_DIM=   32768,         32768,           32768
##UNITS=     HZ,            ARBITRARY UNITS, ARBITRARY UNITS
##FACTOR=    0.157963299565203, 1,           1
##FIRST=     4112.65768502654, 0,            0
##LAST=      -1063.32575182647, 0,           0
##MIN=       -1063.32575182647, -114690,     0
##MAX=       4112.65768502654, 393923297,    0
$$ Real data points
##PAGE= N=1
##DATA TABLE= (X++(R..R)), XYDATA
$$ [...]
$$ plain form
24341 54323 47495 25760 19015 14584 28067 22045 2956 -11448 -5368 -13615 -17176 -13792 -2133
24328 -2133 -26965 -31900 -2810 -17892 -5273 -1044 -13102 15507 34893 42222 42230 42898 22856 15891
24314 15891 -5840 -29874 -40643 -45401 -46282 -37586 -8744 1162 -6838 -1699 19471 51760 45353
24301 45353 34254 31912 23044 -9701 -22040 -37079 -37002 -22933 -32976 -4572 23299 8237 30017
24288 30017 33474 -5796 10541 5580 20742 9214 -894 26443 834 -13435 18760 28725
24276 28725 39625 19117 19840 14864 31828 60831 76339 76525 68844 58648 31737 4021 17096
24263 17096 22842 22151 11078 13983 38937 25151 -10219 -52195 -44489 -39934 -33302 -66840 -63949
24250 -63949 -66369 -60911 -22177 -10001 -14461 -13840 -15739 76 7031 2445 1860 -12863 1370 -7177
$$ packed form
24341E4323o828k1735o745m431J3483o022j9089j4404O080q247l561L384J1659
24328b133k4832m935K9090j5082J2619M229j2058K8609J9386P329QO68k0042o965
24314A5891k1731k4034j0769m758q81Q696K8842R906q000N139K1170L2289o407
24301D5353j1099k342q868l2745j2339j5039P7J4069j0043K8404K7871j5062K1780
24288C0017L457l9270J6337m961J5162j1528j0108K7337k5609j4269L2195R965
24276B8725J0900k0508P23m976J6964K9003J5508J86p681j0196k6911k7716J3075
24263A7096N746o91j1073K905K4954j3786l5370m1976P706M555O632l3538K891
24250f3949k420N458L8734J2176m460O21j899J5815O955m586n85j4723J4233q547
$$ plain form
24236 -7177 -9204 -27515 -22569 2362 17094 13433 20933 35650 42865 43957 49516 37845 1337
24223 1337 -16215 -10115 -7753 -1361 -3274 13751 24393 8950 -856 23063 25235 29166 28325 1015
24209 1015 7100 52586 78197 67925 49483 22464 -21231 -48300 -32073 -20616 -518 11850
24197 11850 -2848 -31780 -57161 -73029 -72451 -64390 -52430 -46479 -30197 -21432 -1223 -19922 -44229
24184 -44229 -32212 -14357 -30507 -34820 -7709 11656 -5350 -14435 -28637 -49881 -7425 34182
24172 34182 36160 10077 -10179 -18505 -14421 -1831 14703 -11577 -11688 785 16943 27300 26368
24159 26368 6515 2836 -12259 2028 26119 22960 36555 53064 25530 50032 31066 17812
24147 17812 30777 61414 83087 67882 54683 24991 3678 6657 -6144 -11083 -6625 5664
$$ packed form
24236g177k027j8311M946K4931J4732l661P500J4717P215J092N559j1671l6508
24223A337j7552O100K362O392j913J7025J0642j5443r806K3919K172L931q41k7310
24209A015O085M5486K5611j0272j8442k7019m3695k7069J6227J1457K0098J2368
24197A1850j4698k8932k5381j5868N78Q061J1960N951J6282Q765K0209j8699k4307
24184d4229J2017J7855j6150m313K7111J9365j7006r085j4202k1244M2456M1607
24172C4182J978k6083k0256q326M084J2590J6534k6280j11J2473J6158J0357r32
24159B6368j9853l679j5095J4287K4091l159J3595J6509k7534K4502j8966j3254
24147A7812J2965L0637K1673j5205j3199k9692k1313K979j2801m939M458J2289
$$ plain form
24135 5664 -10090 -26590 -21663 -34693 -6884 10931 20533 4990 -21601 -40466 -78607 -56619
24123 -56619 -43255 -34217 -23635 -21793 -8876 -26053 -20214 -12687 -2691 -7462 3309 24637 35974
24110 35974 39751 17844 29324 27049 38630 59554 41700 29511 42139 35606 19755 8606
24098 8606 33233 27733 33067 11737 -10980 -34831 -51506 -52848 -36242 -21698 -39359 -34457 -14819
24085 -14819 -3351 4477 -9681 -4542 20701 11287 6991 -5193 -25114 -15116 -509 -11562 -13862
24072 -13862 5602 15785 14114 10610 -4141 -53636 -54697 -54170 -34794 -14933 25038 33383 20532
24059 20532 39700 -8986 -29858 -9443 30236 31280 46346 13661 24724 3213 -26741 -26419
24047 -26419 -3083 12100 26769 6221 6479 8704 4028 -20030 -14814 4030 664 -8205 35119
$$ packed form
24135E664j5754j6500M927j3030K7809J7815R602j5543k6591j8865l8141K1988
24123e6619J3364R038J0582J842J2917j7177N839P527R996m771J0771K1328J1337
24110C5974L777k1907J1480k275J1581K0924j7854j2189J2628o533j5851j1149
24098H606K4627n500N334k1330k2717k3851j6675j342J6606J4544j7661M902J9638
24085a4819J1468P828j4158N139K5243r414m296j2184j9921R998J4607j1053k300
24072a3862J9464J0183j671l504j4751m9495j061N27J9376J9861L9971Q345j2851
24059B0532J9168m8686k0872K0415L9679J044J5066l2685J1063k1511k9954L22
24047b6419K3336J5183J4669k0548K58K225m676k4058N216J8844l366q869M3324
$$ plain form
24034 35119 31144 18766 26799 16524 18849 10697 -6064 10888 17299 4400 17082 20576 17852
24021 17852 42482 31745 -6171 -16183 1870 -6576 -36042 -25198 -12868 -13648 -19093 -38320
24009 -38320 -29039 1033 164 -16986 8002 34339 39254 36947 13207 4170 -23277 -30665 -62940
23996 -62940 -66740 -39159 -773 -26928 -40265 -40908 -20326 568 -9874 6651 -9931 -55059
23984 -55059 -64987 -48327 -23881 3437 2090 21145 17057 20732 36990 28430 4709 -10853 -44147
23971 -44147 -56172 -21627 -23 -14631 -36626 -32290 -28843 -2708 7839 29844 40851 1768
23959 1768 -17077 -33128 -23619 -1028 15694 39579 28302 39998 56886 21455 -6378 -18926
23947 -18926 32031 40634 6926 -23694 -22190 -28451 -39015 -17349 27804 20577 -18828 -18202 1091
$$ packed form
24034C5119l975j2378Q033j0275K325q152j6761J6952O411j2899J2682L494k724
24021A7852K4630j0737l7916j0012J8053q446k9466J0844J2330p80n445j9227
24009c8320R281L0072q69j7150K4988K6337M915k307k3740r037k7447p388l2275
23996f2940l800K7581L8386k6155j3337o43K0582K0894j0442J6525j6582m5128
23984e5059r928J6660K4446K7318j347J9055m088L675J6258q560k3721j5562l3294
23971d4147j2025L4545K1604j4608k1995M336L447K6135J0547K2005J1007l9083
23959A768j8845j6051R509K2591J6722K3885j1277J1696J6888l5431k7833j2548
23947a8926N0957Q603l3708l0620J504o261j0564K1666M5153p227l9405O26J9293
$$ plain form
23934 1091 10542 -28209 -44633 -73620 -60947 -37737 -37389 -46418 -36871 -27959 -36777 -64126 -52767
23921 -52767 -23675 -31816 -32442 -26375 -52300 -34750 8583 26191 2202 -15492 -30431 -26317 10519
23908 10519 8182 -20524 -19298 -20789 -1614 -9945 4987 26104 -5157 -33304 -45634 -23988
23896 -23988 -4032 3199 -12755 -44520 -50067 -33888 -8618 -15206 -24677 -4687 19270 14438 -5878
23883 -5878 -7519 25324 38532 19447 20300 37802 51462 42412 15930 12189 -8095 -21884 11426
23870 11426 32479 -1404 -21423 -13698 5054 4973 -32789 -34474 -39637 -309 15973 22130 -18103
23857 -18103 -29188 -46861 -44392 -19237 -7498 -6930 13065 26027 -12946 -44370 -35007 -23951
23845 -23951 -27674 135 19371 39912 32825 14660 -21875 -22881 -24810 -26501 -17723 -26203 -12090
$$ packed form
23934A091R451l8751j6424k8987J2673K3210L48r029R547Q912q818k7349J1359
23921e2767K9092q141o26O067k5925J7550M3333J7608k3989j7694j4939M114L6836
23908A0519k337k8706J226j491J9175q331J4932K1117l1261k8147j2330K1646
23896b3988J9956P231j5954l1765n547J6179K5270o588r471J9990K3957m832k0316
23883e878j641L2843J3208j9085Q53J7502J3660r050k6482l741k0284j3789L3310
23870A1426K1053l3883k0019P725J8752q1l7762j685n163L9328J6282O157m0233
23857a8103j1085j7673K469K5155J1739N68J9995J2962l8973l1424R363J1056
23845b3951l723K7809J9236K0541p087j8165l6535j006j929j691Q778q480J4113
$$ plain form
23832 -12090 -7357 -4020 6368 532 -12407 -10708 13827 -20758 7990 31748 18929 320
23820 320 -31359 -1009 32177 12675 -2100 3803 2176 8808 2112 -5229 -23504 -8079 7738
23807 7738 5479 2470 28863 35914 36179 14730 -8968 1102 1245 -25920 -38464 -46062 -49364 -50020
23793 -50020 -40289 -25866 -35194 -36155 -29128 -9785 4246 19531 30856 44737 47269 26120 -11514
23780 -11514 -19125 -8727 -8671 -15514 -20769 -34396 -48052 -6072 26275 33928 18764 4096 -6679
23767 -6679 -14581 -6773 -7232 -26427 3903 37006 18113 23961 18881 5200 3638 -2413 -10710 -6837
23753 -6837 2117 14700 18084 12469 2076 3905 -2004 -13206 8830 17207 2854 26095 76314
23740 76314 77538 57902 41642 19466 13224 6791 7813 12219 -15954 -37927 -15742 -22079 -724
$$ packed form
23832a2090M733L337J0388n836j2939J699K4535l4585K8748K3758j2819j8609
23820C20l1679L0350L3186j9502j4775N903j627O632o696p341j8275J5425J5817
23807G738k259l009K6393P051K65k1449k3698J0070J43k7165j2544p598l302o56
23793e0020R731J4423r328r61P027J9343J4031J5285J1325J3881K532k1149l7634
23780a1514p611J0398N6o843n255j3627j3656M1980L2347P653j5164j4668j0775
23767f679p902P808m59j9195L0330L3103j8893N848n080j3681j562o051q297L873
23753f837Q954J2583L384n615j0393J829n909j1202K2036Q377j4353K3241N0219
23740G6314J224j9636j6260k2176o242o433J022M406k8173k1973K2185o337K1355
$$ plain form
23727 -724 7820 -11616 -9080 7786 25552 9972 6404 15409 44965 49559 4760 -27104 -20861
23714 -20861 8899 25456 35417 43395 28440 49537 40325 30677 52402 42752 7179 3276 -46800
23701 -46800 -52664 -23392 -33363 -37614 -17856 -3563 -14922 -16147 -31723 -61504 -22465 12865
23689 12865 13591 12460 21658 13932 -21451 -11557 -8280 16278 17898 18243 25435 32598 30371 18570
23675 18570 24238 -184 -11904 -34126 -53219 -56838 -43061 -11395 -22106 -25384 -21468 -16803 -33677
23662 -33677 -31516 -632 14499 21213 4146 -24900 -20360 15280 32888 22657 9987 16071
23650 16071 22168 3859 -12441 -3365 -16625 -26456 -28528 -10554 -19745 -3459 36956 42424 -7685
23637 -7685 -26555 -20834 -10912 9397 29767 44540 55414 12987 -31410 -38162 -8617 20309
$$ packed form
23727g24Q544j9436K536J6866J7766j5580l568R005K9556M594m4799l1864O243
23714b0861K9760J6557R961P978j4955K1097r212r648K1725r650l5573l903n0076
23701d6800n864K9272r971m251J9758J4293j1359j225j5576k9781L9039L5330
23689A2865P26j131R198p726l5383R894L277K4558J620L45P192P163k227j1801
23675A8570N668k4422j1720k2222j9093l619J3777L1666j0711l278L916M665j6874
23662c3677K161L0884J5131O714j7067k9046M540L5640J7608j0231j2670O084
23650A6071O097j8309j6300R076j3260r831k072J7974r191J6286M0415N468n0109
23637g685j8870N721R922K0309K0370J4773J0874m2427m4397o752K9545K8926
$$ plain form
23625 20309 16505 -25884 -43612 -14864 4494 14197 11251 2288 26440 24459 15713 9846 12710
23612 12710 29675 25965 8485 28372 8685 11540 9284 8886 -10661 -7020 -16845 2437 -9220
23599 -9220 588 36294 55893 47403 28000 6456 3454 -8986 -11790 -19417 -7192 -20687 -10074
23586 -10074 -23047 -53474 -32495 -1938 35952 47632 26463 -4066 -13706 3670 2860 -1647
23574 -1647 5944 6689 16877 18826 -1496 20701 39577 35551 19282 -13413 -29018 -29495 -6993
23561 -6993 24983 5723 -27512 -15084 13429 932 -19412 -9842 -13551 -9333 -3548 -2240 30443
23548 30443 29694 -4339 -112 25219 16114 -14933 -23494 2507 14767 1802 -7386 5033 9789
23535 9789 5535 -826 1991 -32425 -29403 -22363 -36830 256 7299 -43261 -72437 -47987 -41515
$$ packed form
23625B0309l804m2389j7728K8748J9358R703k946q963K4152j981q746n867K864
23612A2710J6965l710j7480J9887j9687K855k256l98j9547L641r825J9282j1657
23599i220R808L5706J9599q490j9403k1544l002j2440k804p627J2225j3495J0613
23586a0074j2973l0427K0979L0557L7890J1680k1169l0529r640J7376q10m507
23574a647P591P45J0188J949k0322K2197J8876m026j6269l2695j5605m77K2502
23561f993L1976j9260l3235J2428K8513j2497k0344R570l709M218N785J308L2683
23548C0443p49l4033M227K5331r105l1047q561K6001J2260j2965r188J2419M756
23535I789m254o361K817l4416L022P040j4467L7086P043n0560k9176K4450O472
$$ plain form
23522 -41515 -59676 -31230 7046 -2095 -13374 -23721 -475 21428 29964 34824 44246 40350 24833
23509 24833 23622 16983 18727 12613 14641 -12675 -31250 -28096 -25334 -41281 -22673 -19419 -53465
23496 -53465 -52099 -24283 -13167 23922 29588 11079 -503 29257 45449 31520 -9049 -37901
23484 -37901 -40889 -40230 -24969 19401 3031 -19349 -41087 -38229 -2141 -22449 -30491 -5701 12586
23471 12586 -9710 -4955 -9799 -47305 -58689 -33641 -1540 11744 -18349 -14067 879 -38444
23459 -38444 -39570 -24738 -22462 -18298 7388 26143 5767 -11787 -10480 -36066 -27435 -16097 -13543
23446 -13543 14847 39019 18720 290 -649 8333 6522 10135 18456 27957 9211 3064 13998
23433 13998 2391 -10280 1430 8433 1748 25075 -2443 -24142 -16846 509 1758 -3140 -2131
$$ packed form
23522d1515j8161K8446L8276r141j1279j0347K3246K1903Q536M860R422l896j5517
23509B4833j211o639J744o114K028k7316j8575L154K762j5947J8608L254l4046
23496e3465J366K7816J1116L7089N666j8509j1582K9760J6192j3929m0569k8852
23484c7901k988O59J5261M4370j6370k2380k1738K858L6088k0308q042K4790J8287
23471A2586k2296M755m844l7506j1384K5048L2101J3284l0093M282J4946l9323
23459c8444j126J4832K276M164K5686J8755k0376j7554J307k5586Q631J1338K554
23446a3543K8390K4172k0299j8430r39Q982j811L613Q321R501j8746o147J0934
23433A3998j1607j2671J1710P003o685K3327k7518k1699P296J7355J249m898J009
$$ plain form
23420 -2131 -18539 -9100 -23411 -10157 8281 6092 -1377 -11600 -22071 -61503 -83731 -87504 -48522
23407 -48522 -17087 -10131 7457 17336 7263 -23508 -50528 -36635 -8788 1001 16726 -5939
23395 -5939 -14962 -11723 -29916 -47689 -15847 15818 23232 -521 -16956 -27317 -27714 -16766 8488
23382 8488 6606 24911 287 -42665 -50609 -69894 -60806 -65317 -46331 -16499 9467 6207 -1493
23369 -1493 -16874 -31766 -33648 -39170 -15723 17531 30323 18002 21621 23874 -5989 -16215 -3581
23356 -3581 12828 10194 -21507 -23779 -15440 -28555 -47594 -53364 -40849 -30746 -15370 -2036 -5411
23343 -5411 -28941 -20701 -8410 -13877 -15742 -34717 -62817 -90834 -82479 -52784 -34049 21595 50181
23330 50181 22650 23664 26824 -8450 -42524 -48009 -2966 24275 37686 39850 16871 12979 6138
$$ packed form
23420b131j6408R439j4311J3254J8438k189p469j0223j0471l9432k2228l773L8982
23407d8522L1435O956J7588R879j0073l0771k7020J3893K7847R789J5725k2665
23395e939r023L239j8193j7773L1842L1665P414k3753j6435j0361l97J0948K5254
23382H488j882J8305k4624m2952p944j9285R088m511J8986K9832K5966l260p700
23369a493j5381j4892j882n522K3447L3254J2792j2321L619K253k9863j0226J2634
23356c581J6409k634l1701k272Q339j3115j9039n770J2515J0103J5376J3334l375
23343e411k3530Q240J2291n467j865j8975k8100k8017Q355K9695J8735N5644K8586
23330E0181k7531J014L160l5274l4074n485M5043K7241J3411K164k2979l892o841
$$ plain form
23317 6138 -4671 -10359 -19624 -9821 13904 7736 -18817 -2202 5638 -6323 -7097 -24381 -17465
23304 -17465 -20688 -22644 -36291 -28352 -36926 -46846 -40249 -15175 -30421 -21580 -11351 -21938 -39467
23291 -39467 -39318 -23271 2257 19569 -10677 -31343 -24346 11467 20765 23707 23106 11849 23731
23278 23731 15658 -21623 -38681 -11277 21506 44240 23282 -30497 -39677 -15479 -9669 -173
23266 -173 20397 32222 27757 21394 19481 10215 27993 23558 9930 5585 -3087 22420 31085 40815
23252 40815 31507 30928 34158 32976 22528 4923 -10894 3291 1916 11911 13433 20677 40468
23239 40468 24517 14282 5725 -48471 -68448 -36394 -12960 30267 31550 41823 22171 5754
23227 5754 41484 26951 29496 25020 69062 71435 28502 4055 -1361 -25646 -4318 15930 17454
$$ packed form
23317F138j0809n688r265R803K3725o168k6553J6615P840j1961p74j7284O916
23304a7465l223j956j3647P939q574r920O597K5074j5246Q841J0229j0587j7529
23291c9467J49J6047K5528J7312l0246k0666O997L5813R298K942o01j1257J1882
23278B3731q073l7281j7058K7404L2783K2734k0958n3779r180K4198N810R496
23266a73K0570J1825m465o363j913r266J7778m435j3628m345q672K5507Q665R730
23252D0815r308n79L230j182j0448j7605j5817J4185j375R995J522P244J9791
23239D0468j5951j0235q557n4196j9977L2054K3434M3227J283J0273j9652j6417
23227E754L5730j4533K545m476M4042K373m2933k4447n416k4285K1328K0248J524
$$ plain form
23214 17454 -6678 -4991 -949 26415 28199 21205 25044 24736 5655 -14333 -1273 -5664 -22508
23201 -22508 -25157 -31671 -37759 -44780 -48323 -76433 -80133 -43928 -15505 4286 11364 17058 28760
23188 28760 7172 9168 26303 36924 32654 13117 -11615 -28416 -43314 -26511 -15608 -6139
23176 -6139 12797 26107 17995 15264 19043 13757 16646 3603 27125 30836 27455 27050 27505 27960
23162 27960 54480 70603 51171 28222 29447 23102 9261 8398 -6318 -6957 -4901 -14438 -17138
23149 -17138 -22896 -31843 -9500 28049 33859 11349 28768 20308 15197 -10544 -37333 -22644 -1170
23136 -1170 8531 25170 20599 3865 -6447 -11145 182 -8589 49 25507 15185 35331 27456
23123 27456 -6311 -30348 -37244 -33676 2412 1191 -27487 9992 39175 52314 54123 69238
$$ packed form
23214A7454k4132J687M042K7364J784o994L839l08j9081j9988J3060m391j6844
23201b2508k649o514o088p021l543k8110l700L6205K8423J9791P078N694J1702
23188B8760k1588J996J7135J0621m270j9537k4732j6801j4898J6803J0903R469
23176f139J8936J3310q112k731L779n286K889j3043K3522L711l381m05M55M55
23162B7960K6520J6123j9432k2949J225o345j3841q63j4716o39K056r537k700
23149a7138n758q947K2343L7549N810k2510J7419q460n111k5741k6789J4689K1474
23136a170R701J6639m571j6734j0312m698J1327q771Q638K5458j0322K0146p875
23123B7456l3767k4037o896L568L6088j221k8678L7479K9183J3139J809J5115
$$ plain form
23111 69238 56411 42495 53766 53739 15592 -23699 -26520 -15061 -27061 -29968 -13941 -629 -17596
23098 -17596 -14011 23552 39693 63316 63283 40244 26969 43921 55089 35223 18029 912
23086 912 -8737 -10914 988 12340 11051 49233 40346 13018 9467 -7361 -31298 -25794 -24907 -21857
23072 -21857 -17852 -13375 4883 -25867 -55087 -67928 -85933 -59602 -43449 -20515 -10935 -2798
23060 -2798 -7540 -19097 -24283 -23846 -35074 -53693 -31916 -19615 21471 7948 22754 29042 16237
23047 16237 3574 2907 2025 -20928 -41813 -44439 -8578 25795 20914 -1422 12451 11498 -20507
23034 -20507 -24503 -31517 -60432 -53008 -51866 -40859 -45487 -46254 -50900 -58873 -45329 -40540 5109 18470
23020 18470 8450 -26532 -46752 -29581 -7655 -1410 -12630 -18695 -14443 -21000 -18819 -3102 9470
$$ packed form
23111F9238j2827j3916J1271k7l8147l9291k821J1459j2000k907J6027J3312j6967
23098a7596L585L7563J6141K3623l3k3039j3275J6952J1168j9866j7194j7117
23086I12r649k177J1902J1352j289L8182q887k7328l551j6828k3937N504Q87L050
23072b1857M005M477J8258l0750k9220j2841j8005K6331J6153K2934R580Q137
23060b798m742j1557n186M37j1228j8619K1777J2301M1086j3523J4806O288j2805
23047A6237j2663o67q82k2953k0885k626L5861L4373m881k2336J3873r53l2005
23034b0507l996p014k8915P424J142J1007m628p67m646p973J3544M789M5649J3361
23020A8470j0020l4982k0220J7171K1926O245j1220o065M252o557K181J5717J2572
$$ plain form
23007 9470 27169 27035 38480 31983 28939 22841 -530 -37047 -28866 -20828 -25614 -22274 19184 581
22993 581 -2420 17388 771 5923 13240 -1607 10330 1918 -15274 -15608 -34578 -46595 -35157
22980 -35157 -19608 3087 5280 -13951 -14541 -14008 -4560 -8948 -30341 -51642 -30064 -15781 4829
22967 4829 14984 17814 11967 33707 10264 -3525 -4124 -43454 -44771 -55767 -29764 -19835 2932
22954 2932 7681 15593 2822 9477 16941 10886 15415 29274 34106 21846 6359 -11109 17384
22941 17384 53606 63450 58151 60875 59305 46325 9298 1044 10060 -14355 -37467 -39393 -31987
22928 -31987 -32898 -43826 -33573 -18118 -23459 -9017 2897 -20287 -28862 -28811 -17368 -12199 -11353 11529
22914 11529 20646 9736 34634 24475 1602 -12235 -8531 6569 24124 18722 -13103 -18170
$$ packed form
23007I470J7699j34J1445o497l044o098k3371l6517Q181Q038m786L340M1458j8603
22993E81l001J9808j6617N152P317j4847J1937q412j7192l34j8970j2017J1438
22980c5157J5549K2695K193j9231n90N33R448m388k1393k1301K1578J4283K0610
22967D829J0155K830n847K1740k3443j3789n99l9330j317j0996K6003R929K2767
22954B932M749P912j2771O655P464o055M529J3859M832j2260j5487j7468K8493
22941A7384L6222R844n299K724j570j2980l7027q254R016k4415k3112j926P406
22928c1987r11j0928J0253J5455n341J4442J1914k3184q575N1J1443N169Q46K2882
22914A1529R117j0910K4898j0159k2873j3837L704J5100J7555n402l1825n067
$$ plain form
22902 -18170 -12048 -3636 1637 6690 10095 -13372 1229 -8657 -56367 -69636 -34452 -28659 -14811
22889 -14811 12430 17764 7201 -1980 -880 -14590 6819 14800 33 8384 16741 26269 23936
22876 23936 14271 -24922 -28565 -27573 14157 44694 43893 20604 11056 27628 1621 -8669 -11169
22863 -11169 -5888 -59 21291 15154 20719 16479 -10786 -42266 -11562 7790 13809 18374 23624
22850 23624 19453 24177 12076 16567 7213 -27875 -40933 -40670 -43459 -37478 -38357 -14423 20588 33844
22836 33844 6521 14689 21123 17765 30877 49209 43233 22506 -9689 -7142 -32033 -63845 -33766
22823 -33766 -1477 -7815 -2372 -9130 -17995 10524 14006 876 -29447 -7145 -904 264 -24909
22810 -24909 -35092 -33852 -55735 -29408 -9290 -5734 -10726 -36805 -24835 -1955 -5830 -12750 9518
$$ packed form
22902a8170O122Q412N273N053L405k3467J4601r886m7710j3269L5184N793J3848
22889a4811K7241N334j0563r181J100j3710K1409P981j4767Q351Q357R528k333
22876B3936r665l9193l643R92M1730L0537q01k3289r548J6572k6007j0290k500
22863a1169N281N829K1350o137N565m240k7265l1480L0704J9352O019M565N250
22850B3624m171M724j2101M491r354l5088j3058K63k789N981q79K3934L5011J3256
22836C3844k7323Q168O434l358J3112J8332n976k0727l2195K547k4891l1812L0079
22823c3766L2289o338N443o758q865K8519L482j3130l0323K2302O241J168k5173
22810b4909j0183J240k1883K6327K0118L556m992k6079J1970K2880l875o920K2268
$$ plain form
22797 9518 31873 49075 55574 15680 -2562 -9172 8208 -4423 12541 9525 633 -2900 7001
22784 7001 15129 13748 30824 7954 7926 3082 14795 18214 -5055 -15371 -14657 14515 14952 -3877
22770 -3877 11977 -2356 -15627 -13949 -5458 5615 28193 11508 -19646 -20884 -16770 2869 10779
22757 10779 8469 -2129 22932 21935 7966 10527 19191 2648 -1426 -20349 -28134 11394 38415
22744 38415 27537 6139 -38341 -24525 -31708 -46803 -91658 -100651 -74110 -75683 -62459 -62918 -39554
22731 -39554 1595 11375 11874 -4344 5651 8950 5202 -917 14897 14004 -9202 -37209 -27361 -7646
22717 -7646 -20710 -58183 -66299 -53284 -66471 -60166 -28067 -1946 19081 20893 9741 16996 31070
22704 31070 28997 11118 21288 44042 28093 7331 -6971 -44834 -65229 -70829 -82806 -70184
$$ packed form
22797I518K2355J7202O499l9894j8242o610J7380j2631J6964l016q892l533R901
22784G001Q128j381J7076k2870k8m844J1713L419k3269j0316P14K9172M37j8829
22770c877J5854j4333j3271J678Q491J1073K2578j6685l1154j238M114J9639P910
22757A0779k310j0598K5061r97j3969K561Q664j6543m074j8923p785L9528K7021
22744C8415j0878k1398m4480J3816p183j5095m4855q993K6541j573J3224m59K3364
22731c9554M1149R780M99j6218R995L299l748o119J5814q93k3206k8007R848J9715
22717g646j3064l7473q116J3015j3187O305L2099K6121K1027J812j1152P255J4074
22704C1070k073j7879J0170K2754j5949k0762j4302l7863k0395n600j1977J2622
$$ plain form
22692 -70184 -42752 -25190 -16283 -32283 -45523 -51242 -39008 -26787 -2490 -4740 -3347 -9556 485
22679 485 2583 18269 34580 38658 29446 -8926 -18383 -3922 -7770 -14968 -16602 -19188 -12477 -14550
22665 -14550 -20179 -26064 -9205 -6883 -6985 -3673 -952 -28342 -54989 -51247 -44057 -74894 -61164
22652 -61164 -37709 -18604 -22581 -35367 -46133 -31992 -32543 -59328 -55917 -43513 -30801 -11209
22640 -11209 -2667 -3101 -23916 -25590 4774 27759 26183 -261 6170 -3188 6491 -5687 -10776
22627 -10776 2891 -9487 644 22136 30547 1708 31843 39512 17430 16821 33620 2646
22615 2646 -51892 -67444 -22144 14840 7259 -3850 -47308 -43683 -33518 -32222 -13630 -31466
22603 -31466 -27631 -13121 -13144 -15773 -1554 6634 4880 -10820 -32479 -44301 -6871 -17756 -21493
$$ packed form
22692g0184K7432J7562Q907j6000j3240n719J2234J2221K4297k250J393o209J0041
22679D85K098J5686J6311M078r212l8372r457J4461l848p198j634k586O711k073
22665a4550n629n885J6859K322j02L312K721k7390k6647L742P190l0837J3730
22652f1164K3455J9105l977j2786j0766J4141n51k6785L411J2404J2712J9592
22640a1209Q542m34k0815j674L0364K2985j576k6444O431r358R679j2178n089
22627a0776J3667j2378J0131K1492Q411k8839L0135P669k2082o09J6799l0974
22615B646n4538j5552M5300L6984p581j1109m3458L625J0165J296J8592j7836
22603c1466L835J4510k3k629J4219Q188j754j5700k1659j1822L7430j0885l737
$$ plain form
22590 -21493 -5382 7107 -2101 -9146 -55466 -49689 -35716 -19296 -8376 -21159 -2606 887
22578 887 -10355 -7209 705 -16510 -29941 -14431 9025 13464 14979 18356 11907 15902 14901 1751
22564 1751 26688 42071 362 -2911 7579 -9501 -47728 -26334 624 -20857 -26379 -5774
22552 -5774 -1814 32460 29839 24918 25056 31309 35383 13571 5277 -21490 -36016 -535 32993
22539 32993 27653 19724 14955 14599 -19270 -18369 -6798 -10708 -8919 718 6735 25579 39167 36206
22525 36206 21285 -8 17099 14406 -7918 -28218 -27241 -1265 11315 -9897 3714 4711 6608
22512 6608 -4460 -8201 -3706 732 -12119 -27329 -3452 -599 -38865 -33616 2786 18844 19759
22499 19759 38259 26159 -4347 -1647 10238 31411 46641 20455 -5274 -17573 -19455 10223
$$ packed form
22590b1493J6111J2489r208p045m6320N777J3973J6420J0920j2783J8553L493
22578H87j1242L146P914j7215j3431J5510K3456M439J515L377o449L995j001j3150
22564A751K4937J5383m1709l273J0490j7080l8227K1394K6958k1481n522K0605
22552e774L960L4274k621m921J38O253M074k1812q294k6767j4526L5481L3528
22539C2993n340p929m769l56l3869R01J1571l910J789R637O017J8844J3588k961
22525C6206j4921k1293J7107k693k2324k0300R77K5976J2580k1212J3611R97J897
22512F608j1068l741M495M438j2851j5210K3877K853l8266N249L6402J6058R15
22499A9759J8500j2100l0506K700J1885K1173J5230k6186k5729j2299j882K9678
$$ plain form
22487 10223 27388 36920 3760 -31687 -45837 -48447 -44469 -31078 -23307 -20314 -3981 30618 11453
22474 11453 -10327 -49853 -58885 -67409 -85713 -76677 -62398 -48860 -29855 -29876 1283 11003 32280
22461 32280 46703 33725 5209 17581 23398 36507 32185 57251 54354 39634 51117 64012
22449 64012 70261 49720 15770 1897 -1676 -22598 -41910 -16060 -4967 6754 287 -12117
22437 -12117 -30299 -14648 12929 22535 38372 14091 -1587 6382 4768 15422 35102 54046
22425 54046 18669 40198 41308 22081 -7450 -8878 12831 15561 7436 -12987 -23299 -13351 -26316
22412 -26316 18829 22929 15376 28376 34574 13832 -12141 -32028 -43395 -36143 -15931 84
22400 84 39299 69186 72661 33416 38065 43810 26180 13944 -4924 10263 26139 11394 -20474
$$ packed form
22487A0223J7165R532l3160l5447j4150k610L978J3391P771K993J6333L4599j9165
22474A1453k1780l9526r032q524j8304R036J4279J3538J9005k1L1159R720K1277
22461C2280J4423j2978k8516J2372N817J3109m322K5066k897j4720J1483J2895
22449F4012O249k0541l3950j3873l573k0922j9312K5850J1093J1721o467j2404
22437a2117j8182J5651K7577R606J5837k4281j5678P969j614J0654J9680J8944
22425E4046l5377K1529J110j9227k9531j428K1709K730q125k0423j0312R948j2965
22412b6316M5145M100p553J3000O198k0742k5973j9887j1367P252K0212J6015
22400H4L9215K9887L475l9245M649N745j7630j2236j8868J5187J5876j4745l1868
$$ plain form
22387 -20474 -6937 -4457 11831 6811 1366 -1125 16313 -3613 5272 -9498 -41829 -29239 5315
22374 5315 12356 -15432 -30616 -35779 -4689 -4237 -45201 -22829 -38439 -49768 -54291 -57103 -35711
22361 -35711 -13078 4184 29288 44855 19994 7840 6862 10893 21263 9904 -19099 -5982
22349 -5982 6042 674 -8099 -6341 -3665 -20799 -29798 -11654 816 26417 42262 23780 3739
22336 3739 -6833 8929 19097 2077 13864 6377 3309 16022 24638 -2042 -5534 -1060 12633
22323 12633 30873 31162 41807 42215 8313 28521 55101 49924 56931 45800 19319 5021 -1159
22310 -1159 8710 -6904 14662 23590 10315 -4748 -5855 13553 23227 25360 3617 -11558 15354
22297 15354 26990 25483 20679 9875 -16223 -10002 18920 25972 12517 19415 65830 80613 58841
$$ packed form
22387b0474J3537K480J6288n020n445k491J7438j9926Q885j4770l2331J2590L4554
22374E315P041k7788j5184n163L1090M52m0964K2372j5610j1329m523k812K1392
22361c5711K2633J7262K5104J5567k4861j2154r78M031J0370j1359k9003J3117
22349e982J2024n368q773J758K676j7134q999J8144J2470K5601J5845j8482k0041
22336C739j0572J5762J0168j7020J1787p487l068J2713Q616k6680l492M474J3693
22323A2633J8240K89J0645M08l3902K0208K6580n177P007j1131k6481j4298o180
22310a159R869j5614K1566Q928j3275j5063j107J9408R674K133k1743j5175K6912
22297A5354J1636j507m804j0804k6098O221K8922P052j3455O898M6415J4783k1772
$$ plain form
22284 58841 21466 -24747 -18747 -12168 -6433 -14155 -3299 1858 -5062 24805 39190 28577 1867
22271 1867 11958 23656 39154 24294 -9518 -24934 2281 53193 52720 39087 24217 10084
22259 10084 20785 22488 28387 47831 38497 11159 -11930 -26340 -34836 -39655 -2646 11785 30199
22246 30199 23375 3815 -10995 -5646 -12798 -28521 -47981 -32572 -14163 -19631 -23944 -20707 -32470
22233 -32470 -20865 -5115 27548 32005 16502 19167 29169 37825 58015 18723 -13859 -20604
22221 -20604 31698 61350 29909 -4548 9386 -2998 -21745 -51311 -66889 -30540 -13419 14466
22209 14466 23711 25215 50146 55468 57368 76574 88744 80403 51929 43267 16133 1659 -5672
22196 -5672 4185 -14102 -18142 -11400 -6239 -20825 -19614 -17438 18448 24946 21759 5837 15706 29192
$$ packed form
22284E8841l7375m6213O000O579N735p722J0856N157o920K9867J4385j0613k6710
22271A867J0091J1698J5498j4860l3812j5416K7215N0912m73j3633j4870j4133
22259A0084J0701J703N899J9444r334k7338k3089j4410q496m819L7009J4431J8414
22246C0199o824j9560j4810N349p152j5723j9460J5409J8409n468m313L237j1763
22233c2470J1605J5750L2663M457j5503K665J0002Q656K0190l9292l2582o745
22221b0604N2302K9652l1441l4457J3934j2384j8747k9566j5578L6349J7121K7885
22209A4466R245J504K4931N322J900J9206J2170q341k8474q662k7134j4474p331
22196e672R857j8287m040O742N161j4586J211K176L5886O498l187j5922R869J3486
$$ plain form
22182 29192 28757 25001 22212 26189 41769 16847 514 31467 39659 21295 2218 -27200 -42626
22169 -42626 -21069 13222 29207 6384 -7334 5493 13711 15098 18806 8210 13085 28255
22157 28255 10097 -10504 2196 -14478 -10834 11982 23663 -6686 -13922 585 42 -27830
22145 -27830 -908 11033 18829 -10506 -3812 25178 21901 19896 3950 -5000 22177 34359 22277
22132 22277 -4797 -25609 2579 -11494 -7218 31668 52579 41989 37294 37809 18377 56
22120 56 409 22075 49209 28109 4917 -4464 -12244 -8302 5946 -25133 14662 34011 67050
22107 67050 73638 49481 24149 24798 21774 18674 7531 20402 4140 -17020 -16264 -36687 -40448
22094 -40448 -28527 -13470 -1782 -33424 -11835 11744 28550 55857 27658 22009 9121 8279
$$ packed form
22182B9192m35l756k789L977J5580k4922j6333L0953Q192j8364j9077k9418j5426
22169d2626K1557L4291J5985k2823j3718J2827Q218J387L708j0596M875J5170
22157B8255j8158k0601J2700j6674L644K2816J1681l0349p236J4507n43k7872
22145b7830K6922J1941P796k9335O694K8990l277k005j5946q950K7177J2182j2082
22132B2277k7074k0812K8188j4073M276L8886K0911j0590m695N15j9432j8321
22120E6L53K1666K7134k1100k3192r381p780L942J4248l1079L9795J9349L3039
22107F7050O588k4157k5332O49l024l100j1143J2871j6262k1160P56k0423l761
22094d0448J1921J5057J1688l1642K1589K3579J6806K7307k8199n649j2888q42
$$ plain form
22082 8279 3344 -23302 -11469 18165 3744 -3187 -18957 -53016 -44724 -28586 -15385 -44354
22070 -44354 -56715 -57240 -60552 -49787 -34613 -27752 -25853 -29886 15984 40327 29097 5284 -15571
22057 -15571 -1145 33296 22010 23141 25954 4252 -22695 -30499 -39081 -31353 -51619 -48582 -17523
22044 -17523 -7793 -16353 -41381 -44140 -25046 7914 32241 42821 40405 20012 4774 -2695 1485
22031 1485 32623 21608 1169 29447 25875 -17970 -6944 9887 -5859 -2798 21671 13918
22019 13918 6487 835 -2682 -14773 -31195 -26189 -14852 -17134 -15474 -17651 -38423 -39217 -20590
22006 -20590 -16833 -14316 14830 38151 13035 -13278 -6109 -20792 -34829 -80 3814 1860 11481
21993 11481 1975 -16321 -28348 -254 23432 16745 11630 -10868 -9957 -9567 -35122 -10314 14119
$$ packed form
22082H279m935k6646J1833K9634j4421o931j5770l4059Q292J6138J3201k8969
22070d4354j2361n25l312J0765J5174O861J899m033M5870K4343j1230k3813k0855
22057a5571J4426L4441j1286J131K813k1702k6947p804q582P728k0266L037L1059
22044a7523R730q560k5028k759J9094L2960K4327J0580k416k0393j5238p469M180
22031A485L1138j1015k0439K8278l572m3845J1026J6831j5746L061K4469p753
22019A3918p431n652l517j2091j6422N006J1337k282J660k177k0772p94J8627
22006b0590L757K517K9146K3321k5116k6313P169j4683j4037L4749L894j954R621
21993A1481r506j8296j2027K8094K3686o687n115k2498R11L90k5555K4808K4433
$$ plain form
21980 14119 847 -9478 -39023 -50041 -27341 -20891 -25770 -22422 -26079 -39078 -40514 -40373 -28984
21967 -28984 -27850 -13968 -6353 -38704 -71312 -67476 -34334 -7869 10470 5751 5078 -9147 -3461
21954 -3461 -17154 -53475 -52391 -30023 -16640 -2717 20918 39719 33961 10179 302 -11508
21942 -11508 -779 35635 31005 13731 21228 16545 36122 46970 23266 -12085 -23243 18838
21930 18838 24818 -2305 -22442 -9633 9379 13474 10759 34867 34148 28715 33124 49581 58480
21917 58480 37304 11699 3422 -16084 -44961 -58960 -40095 2299 42625 60573 53546 21828
21905 21828 -11042 8251 43207 56286 52912 40631 14119 2678 -24654 -18651 -18248 -16793 -23119
21892 -23119 -19876 -2985 31204 33406 8964 7704 -15272 -51746 -27743 -15239 -48306 -46029
$$ packed form
21980A4119j3272j0325k9545j1018K2700O450m879L348l657j2999j436J41J1389
21967b8984J134J3882P615l2351l2608L836L3142K6465J8339m719o73j4225N686
21954c461j3693l6321J084K2368J3383J3923K3635J8801n758k3782r877j1810
21942a1508J0729L6414m630j7274P497m683J9577J0848k3704l5351j1158M2081
21930A8838N980k7123k0137J2809J9012M095k715K4108p19n433M409J6457Q899
21917E8480k1176k5605q277j9506k8877j3999J8865M2394M0326J7948p027l1718
21905B1828l2870J9293L4956J3079l374j2281k6512j1441k7332O003M03J455o326
21892b3119L243J6891L4189K202k4442j260k2976l6474K4003J2504l3067K277
$$ plain form
21880 -46029 -41608 -33110 -29649 -53028 -34268 -2386 -190 9594 20733 13665 -3600 -5482 -1030
21867 -1030 11130 9503 -5522 -8671 4783 -10652 -9286 7935 -3964 -30570 -57840 -68841
21855 -68841 -55351 -36147 -33955 -32810 -43230 -25567 -18991 -39249 -48415 -31839 -8333 -2776 9479
21842 9479 20032 16274 -7655 -32443 -28359 -30060 -28907 10281 28742 28234 23251 1739 -626
21829 -626 28948 21172 28673 46882 31894 22583 4467 -2204 -16479 -16811 -13644 -912 -24902
21816 -24902 -24580 -9119 17816 2808 -12123 -14854 -28144 -29218 -14762 -5095 -7746 -42332 -36636
21803 -36636 -10709 15968 30261 12130 -3395 20404 28791 29362 18957 5341 -7971 17357
21791 17357 14264 8682 566 -30440 -14492 16257 12546 -4221 -8316 -14652 -21245 -13609 -8280
$$ packed form
21880d6029M421Q498L461k3379J8760L1882K196R784J1139p068j7265j882M452
21867a030J2160j627j5025l149J3454j5435J366J7221j1899k6606k7270j1001
21855f8841J3490J9204K192J145j0420J7663O576k0258r166J6576K3506N557J2255
21842I479J0553l758k3929k4788M084j701J153L9188J8461n08m983k1512k365
21829f26K9574p776P501J8209j4988r311j8116o671j4275l32L167J2732k3990
21816b4902L22J5461K6935j5008j4931k731j3290j074J4456R667k651l4586N696
21803c6636K5927K6677J4293j8131j5525K3799Q387N71j0405j3616j3312K5328
21791A7357l093n582q116l1006J5948L0749l711j6767m095o336o593P636N329
$$ plain form
21778 -8280 -30739 -18216 -21451 -31217 709 -5603 -19301 -15305 -4280 334 156 16965 5448
21765 5448 24288 -4453 -6166 3302 20012 27784 21040 14435 -16590 -36743 -34948 -27219 -41130
21752 -41130 -90741 -95462 -46111 4546 14907 8112 -6466 12724 24758 20496 -3667 355
21740 355 -17993 -19012 1095 -14268 -21946 -19307 -7029 -6157 -11455 -18919 -12789 -33686 -35996 -10499
21726 -10499 -24848 -36876 -48015 -61516 -48958 -29336 -17685 -30996 -34495 -27054 -28356 -7333
21714 -7333 -3924 1187 6848 9001 2349 -21299 -43980 -46623 -35070 -15446 -7243 -6749 -7560 -4672
21700 -4672 15977 16969 -3770 -7985 -10612 8954 -10969 -23682 -44464 -47197 -23439 -7646 3745
21687 3745 -15553 -29633 -19772 4849 10734 21106 3478 7448 14324 -8623 -8970 -3143 -3011 17073
$$ packed form
21778h280k2459J2523l235r766L1926o312j3698L996J1025M614j78J6809j1517
21765E448J8840k8741j713R468J6710P772o744o605l1025k0153J795P729j3911
21752d1130m9611m721M9351N0657J0361o795j4578J9190J2034m262k4163M022
21740C55j8348j019K0107j5363p678K639J2278Q72n298p464O130k0897k310K5497
21726a0499j4349j2028j1139j3501J2558J9622J1651j3311l499P441j302K1023
21714g333L409N111N661K153o652k3648k2681k643J1553J9624Q203M94q11K888
21700d672K0649R92k0739m215k627J9566j9923j2713k0782k733K3758J5793J1391
21687C745j9298j4080R861K4621N885J0372j7628L970O876k2947l47N827J32K0084
$$ plain form
21673 17073 48591 25520 -234 -46037 -45486 -27685 4292 43454 46214 33575 25908 28550 44932
21660 44932 22523 594 1472 -12444 7249 -4979 -29803 -43610 -43829 -13292 -19466 -15910 -4450
21647 -4450 -10973 -15971 -16357 -10305 18165 46974 42849 31934 60437 59833 36116 12212 9489 19720
21633 19720 4777 3857 780 15694 13123 4417 1669 3833 -2162 -16236 -21630 -23416 -1865 1880
21619 1880 -12641 508 26061 6838 -10008 -12208 -12675 -7575 -5837 2564 29680 28370 15072
21606 15072 20674 41131 24662 -15314 -33816 -29988 -30244 -14328 -8298 -4783 5751 -6086 -21548
21593 -21548 -441 5118 1836 -12737 -20774 2104 14097 16935 21037 31947 27775 6566 5592
21580 5592 -4662 -31332 -58456 -70217 -24540 4824 -6747 -10766 598 -5270 -11356 -18695 -2991
$$ packed form
21673A7073L1518k3071k5754m5803N51J7801L1977L9162K760j2639p667K642J6382
21660D4932k2409k1929Q78j3916J9693j2228k4824j3807k19L0537o174L556J1460
21647d450o523m998l86O052K8470K8809m125j0915K8503o04k3717k3904k723J0231
21633A9720j4943r20l077J4914k571q706k748K164n995j4074n394j786K1551L745
21619A880j4521J3149K5553j9223j6846k200m67N100J738Q401K7116j310j3298
21606A5072N602K0457j6469l9976j8502L828k56J5916O030L515J0534j1837j5462
21593b1548K1107N559l282j4573q037K2878J1993K838M102J0910m172k1209r74
21580E592j0254k6670k7124j1761M5677K9364j1571m019J1364n868o086p339J5704
$$ plain form
21567 -2991 5340 -7445 -13151 -5658 8982 35861 -4717 -22941 -2597 4357 -7378 4438 3718
21554 3718 20886 27280 12878 2824 -4213 15069 -5949 -11574 -6141 -10639 20068 77189 60338
21541 60338 21755 5750 10944 15878 3446 4237 25550 2250 -29337 -32486 -8753 2088 -8508
21528 -8508 -7668 -12230 -26508 -31905 -28493 3098 -6147 -65736 -93635 -78291 -80963 -66369 -26114
21515 -26114 405 6615 44495 35247 18253 34855 12261 -36373 -22036 -21823 12339 15681 6151
21502 6151 15267 32113 -731 -34086 -24584 17898 20322 -19611 -10007 -11276 10964 40717 22670
21489 22670 33897 21197 17113 22600 2871 -16795 -22485 8315 42147 48949 -263 -6638 -11968
21476 -11968 -11434 -19347 -15485 -5917 15955 34367 55389 80584 70563 63650 37720 50944 45591
$$ packed form
21567b991Q331j2785n706P493J4640K6879m0578j8224K0344O954j1735J1816p20
21554C718J7168O394j4402j0054p037J9282k1018n625N433m498L0707N7121j6851
21541F0338l8583j6005N194M934j2432P91K1313k3300l1587l149K3733J0841j0596
21528h508Q40m562j4278n397L412L1591r245n9589k7899J5344k672J4594M0255
21515b6114K6519O210L7880r248j6994J6602k2594m8634J4337K13L4162L342r530
21502F151R116J6846l2844l3355R502M2482K424l9933R604j269K2240K9753j8047
21489B2670J1227j2700m084N487j9729j9666n690L0800L3832O802m9212o375n330
21476a1968N34p913L862R568K1872J8412K1022K5195j0021o913k5930J3224n353
$$ plain form
21463 45591 49861 40591 24813 10816 20853 38322 59695 61783 66097 69593 51247 19502 -22036
21450 -22036 -47819 -17375 -17374 -26703 -25057 -6665 -1052 9044 3218 -9984 -20789 -22997 -15232 -15634
21436 -15634 14961 -11553 -29368 -3112 -463 -29910 -33634 -611 -11998 -34213 -1444 -9602
21424 -9602 -7814 -9567 -7609 -21652 1176 8860 9809 -8513 -26426 -39333 -17018 -5952 9446
21411 9446 2031 8842 16244 27944 42829 64236 46371 33987 33451 8108 -13100 -6668 -885
21398 -885 -36676 -49792 -13606 22510 29426 10539 3556 -2464 -4129 -21934 -27184 -42439 -48046
21385 -48046 -72487 -66310 -19944 -22333 -44046 -44697 -23402 -18075 -32694 -29898 -26052 -17191 -13051
21372 -13051 -22788 -5474 3751 3660 23636 8224 -20874 -28472 -34274 -40880 -15899 -3571 5351
$$ packed form
21463D5591M270r270j5778j3997J0037J7469K1373K088M314L496j8346l1745m1538
21450b2036k5783L0444Jr329J646J8392N613J0096n826j3202j0805k208P765m02
21436a5634L0595k6514j7815K6256K649k9447l724L3023j1387k2215L2769q158
21424i602J788j753J958j4043K2828P684R49j8322j7913j2907K2315J1066J5398
21411I446p415O811P402J1700J4885K1407j7865j2384n36k5343k1208O432N783
21398h85l5791j3116L6186L6116O916j8887o983o020j665j7805n250j5255n607
21385d8046k4441O177M6366k389k1713o51K1295N327j4619K796L846Q861M140
21372a3051r737J7314R225r1J9976j5412k9098p598n802o606K4981J2328Q922
$$ plain form
21359 5351 10105 -1208 16648 24388 4216 -21715 -15012 -13618 -20310 -17347 -32417 -37017 -6167
21346 -6167 1471 -8479 -2432 -2711 -25834 -28007 -3743 -21542 13631 27585 37903 18208 24788
21333 24788 -9664 -10021 -25351 -38386 -18186 17227 20179 -4659 -23634 -6164 21178 37336
21321 37336 17380 -21323 -39785 14056 34646 22546 -9267 -13226 -18612 -22534 -32984 -13705
21309 -13705 11788 31030 -5125 -28379 -44189 -61219 -48083 -34907 -38059 -20518 8367 24741
21297 24741 37317 40587 15233 11387 3287 -3719 14019 28282 7289 -18744 -7370 34715
21285 34715 30275 -15227 -24146 -39641 -55262 -72684 -79128 -43585 -40438 -42597 -50091 -48612 -47551
21272 -47551 -30673 -46907 -50812 -31860 -4486 -34365 -40309 -41693 -53395 -38991 -10548 1140
$$ packed form
21359E351M754j1313J7856P740k0172k5931O703J394o692K963j5070m600L0850
21346f167P638r950O047k79k3123k173K4264j7799L5173J3954J0318j9695O580
21333B4788l4452l57j5330j3035K0200L5413K952k4838j8975J7470K7342J6158
21321C7336j9956l8703j8462N3841K0590j2100l1813l959n386l922j0450J9279
21309a3705K5493J9242l6155k3254j5810j7030J3136J3176l152J7541K8885J6374
21297B4741J2576L270k5354l846q100p006J7738J4263k0993k6033J1374M2085
21285C4715m440m5502q919j5495j5621j7422o444L5543L147k159p494J479J061
21272d7551J6878j6234l905J8952K7374k9879n944j384j1702J4404K8443J1688
$$ plain form
21260 1140 10505 2488 -26430 -540 391 -2823 -16494 -10993 1234 9675 -12487 -16470 10588
21247 10588 -785 -4593 32187 26554 832 -33474 -51374 -21401 6279 14155 47330 70243
21235 70243 53202 19181 -7130 -34096 -38619 -26170 -34658 -71306 -49404 2165 13461 6940
21223 6940 15535 29152 19376 24171 35441 27507 33483 57571 54632 55998 14575 12789 26094
21210 26094 17184 -10447 -52436 -61244 -41220 -31351 -4133 3262 -17204 -27206 -24358 -30569 -22437
21197 -22437 12250 21274 7093 -12576 -184 22310 24957 34331 23390 10980 8509 7633 11450
21184 11450 13079 37632 44364 46824 18500 -5262 -7664 -12066 15165 -28947 -40166 -31089 4685
21171 4685 10615 -11379 -46878 -50865 -62093 -63307 -36379 -14947 -16104 -34893 -22852 -23153 -22917
$$ packed form
21260A140R365q017k8918K5890R31l214j3671N501J2227Q441k2162l983K7058
21247A0588j1373l808L6780n633k5722l4306j7900K9973K7680P876L3175K2913
21235G0243j7041l4021k6311k6966m523J2449q488l6648K1902N1569J1296o521
21223F940Q595J3617r776M795J1270p934N976K4088k939J366m1423j786J3305
21210B6094q910k7631m1989q808K0024R869K7218P395k0466j0002K848o211Q132
21197b2437L4687R024j4181j9669J2392K2494K647R374j0941j2410k471q76L817
21184A1450J629K4553O732K460k8324k3762k402m402K7231m4112j1219R077L5774
21171D685N930k1994l5499l987j1228j214K6928K1432j157j8789J2041l01K36
$$ plain form
21158 -22917 -31092 -24183 18718 33035 3764 725 14170 22771 27369 30847 16175 25072 33930
21145 33930 35957 22144 31303 60023 80825 46415 1326 -12483 8599 9057 -15159 -32536
21133 -32536 -16411 -8412 -16459 -39781 -54477 -67761 -61538 -37457 -17167 -23437 -8085 790 7594
21120 7594 5487 7014 2100 -1645 18249 16993 -1371 -3862 -23232 -22789 -37129 -30957 -37251 -21804
21106 -21804 -6088 33610 45285 26014 16503 22869 1635 -9185 -3575 9362 5587 -16032
21094 -16032 -10864 1724 15763 12489 -5331 21436 34401 20910 -9909 -17211 -27812 -2608
21082 -2608 22520 5151 -29431 -26270 -54903 -27731 -7188 -13130 -1255 -10907 -16728 -16224 -851
21069 -851 -16960 -17295 -12493 -16045 -14990 2293 474 22559 24623 23844 9667 -9598 3586 31537
$$ packed form
21158b2917q175O909M2901J4317k9271l039J3445Q601M598L478j4672Q897Q858
21145C3930K027j3813R159K8720K0802l4410m5089j3809K1082M58k4216j7377
21133c2536J6125P999q047k3322j4696j3284O223K4081K0290o270J5352Q875O804
21120G594k107J527m914l745J9894j256j8364k491j9370M43j4340O172o294J5447
21106b1804J5716L9698J1675j9271r511O366k1234j0820N610J2937l775k1619
21094a6032N168J2588J4039l274j7820K6767J2965j3491l0819p302j0601K5204
21082b608K5128j7369l4582L161k8633K7172K0543n942J1875r652n821N04J5373
21069h51j6109l35M802l552J055J7283j819K2085K064p79j4177j9265J3184K7951
$$ plain form
21055 31537 33624 9041 4717 13854 18929 7661 -8496 -27503 7519 -2766 -26761 -5988
21043 -5988 16846 19979 17582 7629 -21124 766 25779 27111 -7177 -15472 7129 -10952 -19143
21030 -19143 110 -32 -34437 -51285 -40111 -16408 -717 -20340 5833 18480 9430 18038
21018 18038 3299 8787 13329 25922 32433 37623 18245 -10774 -34522 -48389 -5908 -6003 -24260
21005 -24260 -4806 -8808 -10863 36136 62559 66076 30748 -19554 -49395 -89700 -75518 -30578
20993 -30578 -22865 -8508 -1942 -16303 -44023 -36682 -29785 -22550 -15097 -23615 -17721 -1700 -5601
20980 -5601 -22607 453 11784 12205 18796 11192 -18551 -21751 -381 -23583 -38556 -24084 -31123
20967 -31123 -34352 -17786 -17560 -18298 -22632 -10279 -7884 -26435 -24778 13717 23277 -9524 3580
$$ packed form
21055C1537K087k4583m324R137N075j1268j6157j9007L5022j0285k3995K0773
21043e988K2834L133k397r953k8753K1890K5013J332l4288q295K2601j8081q191
21030a9143J9253j42l4405j6848J1174K3703J5691j9623K6173J2647r050Q608
21018A8038j4739N488M542J2593O511N190j9378k9019k3748j3867M2481r5j8257
21005b4260J9454m002k055M6999K6423L517l5328n0302k9841m0305J4182M4940
20993c0578P713J4357O566j4361k7720P341O897P235P453q518N894J6021l901
20980e601j7006K3060J1331M21O591p604k9743l200K1370k3202j4973J4472p039
20967c1123l229J6566K26p38m334J2353K395j8551J657L8495R560l2801J3104
$$ plain form
20954 3580 -513 -7388 -14404 -27965 -49515 -73518 -50232 -21422 -19885 -22991 -18202 2153 15829
20941 15829 -7486 -70633 -88927 -53714 -15597 -6468 -8741 12092 37510 49622 63640 47963
20929 47963 59138 68114 71565 87002 69964 34830 -8188 -49500 -35625 -12798 -17123 -30000
20917 -30000 -21627 4567 31232 2311 -17654 -15844 -1777 14780 32138 20940 -11580 -3970
20905 -3970 -11924 -25591 -12280 9119 -9930 -22970 -12038 -25843 -4446 12989 2373 6696
20893 6696 29593 46573 19525 -25068 -31604 -7546 10650 9741 22336 -7584 27333 52090
20881 52090 43887 39615 644 -19089 -45089 -61639 -34227 -17707 1177 5629 20802 26354
20869 26354 8379 9028 40967 23338 23070 32871 41314 36484 39327 -6 -44771 -63288 -54716
$$ packed form
20954C580m093o875p016j3561k1550k4003K3286K8810J537l106M789K0355J3676
20941A5829k3315o3147j8294L5213L8117R129k273K0833K5418J2112J4018j5677
20929D7963J1175Q976L451J5437j7038l5134m3018m1312J3875K2827m325j2877
20917c0000Q373K6194K6665k8921j9965J810J4067J6557J7358j1198l2520P610
20905c970p954j3667J3311K1399j9049j3040J0932j3805K1397J7435j0616M323
20893F696K2897J6980k7048m4593o536K4058J8196r09J2595k9920L4917K4757
20881E2090q203m272l8971j9733k6000j6550K7412J6520J8884M452J5173N552
20869B6354j7975O49L1939j7629k68R801Q443m830K843l9333m4765j8517Q572
$$ plain form
20856 -54716 -17327 -14973 -37054 -13447 2406 4035 -5845 2863 9955 29710 33161 19110 13926
20843 13926 14691 29146 61762 70930 20412 12453 36140 24269 -2667 1574 17429 29567 22104
20830 22104 24033 13667 -4335 -16522 -7216 -1069 -822 -19089 -10993 -5855 -3483 10666 11426 15355
20816 15355 30936 7395 -41962 -70318 -71182 -60585 -65357 -50261 -26870 -32700 -42521 -19038 -18922
20803 -18922 -24005 10150 26695 16941 -16849 -5069 3187 -8062 -1150 -12160 -13899 -13114 25386
20790 25386 36918 19864 23258 51534 36376 -4164 -9526 -24143 -24242 -17679 -12595 4226 31606
20777 31606 43558 24519 32289 38503 23888 -21047 -22941 9745 17702 -7826 -22265 9531
20765 9531 21640 9602 5097 25963 41362 19238 -12407 -34949 -47146 -64695 -50256 -31738
$$ packed form
20856e4716L7389K354k2081K3607J5853J629r880Q708P092J9755L451j4051n184
20843A3926P65J4455L2616R168n0518p959K3687j1871k6936M241J5855J2138p463
20830B2104J929j0366j8002j2187R306O147K47j8267Q096N138K372J4149P60L929
20816A5355J5581k3541m9357k8356q64J0597m772J5096K3391n830r821K3483J16
20803a8922n083L4155J6545r754l3790J1780Q256j1249O912j1010j739P85L8500
20790B5386J1532j7054L394K8276j5158m0540n362j4617r9O563N084J6821K7380
20777C1606J1952j9039P770O214j4615m4935j894L2686P957k5528j4439L1796
20765I531J2109j2038m505K0866J5399k2124l1645k2542j2197j7549J4439J8518
$$ plain form
20753 -31738 -700 -12097 -32180 -39246 -27769 -11424 -23948 -32110 -13979 8928 18062 15247
20741 15247 47125 46576 27450 25544 29213 35666 36285 39140 52480 53124 32964 804 372 4764
20727 4764 2711 -38966 -63539 -49380 -41656 -36765 -46348 -34388 -30414 -19955 -24787 -10715 -10487
20714 -10487 -28345 -50622 -55919 -6833 -5959 -46933 -39391 9950 29118 -762 -9963 -22665 -25414
20701 -25414 -6400 5593 14340 19780 -2966 -2721 -23925 -21148 -23816 -22161 1512 -2895 -31967
20688 -31967 -65958 -47561 -2903 2403 -31071 -42954 -6443 -26491 -41668 -20800 -4154 29475
20676 29475 47181 20301 -17591 -19325 -15866 18061 2549 25395 60143 100773 75833 26780
20664 26780 32593 23584 -1652 5466 -17408 2765 -5696 -44267 -50995 -49912 -68891 -51149 -42667
$$ packed form
20753c1738L1038j1397k0083p066J1477J6345j2524q162J8131K2907R134k815
20741A5247L1878n49j9126j906L669O453O19K855J3340O44k0160l2160m32M392
20727D764k053m1677k4573J4159P724M891r583J1960L974J0459m832J4072K28
20714a0487j7858k2277n297M9086Q74m0974P542M9341J9168k9880r201j2702k749
20701b5414J9014J1993Q747N440k2746K45k1204K777k668J655K3673m407k9072
20688c1967l3991J8397M4658N306l3474j1883L6511k0048j5177K0868J6646L3629
20676B9475J7706k6880l7892j734L459L3927j5512K2846L4748M0630k4940m9053
20664B6780N813r009k5236P118k2874K0173q461l8571o728J083j8979J7742Q482
$$ plain form
20651 -42667 -34284 -21960 -17552 -17230 -15599 -25957 -43690 -44862 -31297 -33508 -42281 -38207 -22689
20638 -22689 -25070 -11991 4453 -767 27400 60273 40213 -3801 -22173 -26233 -4827 -9899
20626 -9899 -17288 573 14779 9220 -6729 -15056 -38256 -59420 -58424 -37154 -24290 -37459 -43901
20613 -43901 -7242 -18690 -36389 -4088 -12053 -21846 3198 -140 -5640 -21946 -13945 -3306 -1929
20600 -1929 4065 -4249 -14234 21985 5516 17394 27629 39864 41134 48192 63617 55809 52645
20587 52645 59390 44059 38092 11995 -20582 -9688 6536 -3419 2376 -1692 1189 11134 -12780
20574 -12780 -5265 4633 225 -28967 -38920 -14231 18942 28396 13160 22590 22326 2620 -15390
20561 -15390 5484 15817 24826 13043 883 -1760 -11435 -33620 -24048 -11195 -27495 -26125 -15920
$$ packed form
20651d2667Q383J2324M408L22J631j0358j7733j172J3565k211q773M074J5518
20638b2689k381J3079J6444n220K8167L2873k0060m4014j8372m060K1406n072
20626i899p389J7861J4206n559j5949q327k3200k1164R96K1270J2864j3169o442
20613d3901L6659j1448j7699L2301p965r793K5044l338n500j6306Q001J0639J377
20600a929N994q314r985L6219j6469J1878J0235J2235J270P058J5425p808l164
20587E2645O745j5331n967k6097l2577J0894J6224r955N795m068K881R945k3914
20574a2780P515R898m408k9192r953K4689L3173R454j5236R430k64j9706j8010
20561a5390K0874J0333R009j1783j2160k643r675k2185R572J2853j6300J370J0205
$$ plain form
20548 -15920 -20050 -21722 -925 19569 -1088 -23213 -3407 1015 -8247 -2054 -7451 -25044 -31629
20535 -31629 -28605 -18370 -7256 439 5971 12008 -2981 -23898 -40246 -31309 -40487 -29647 -24487
20522 -24487 -32869 -42078 -35225 12048 30604 3191 -23941 -40022 -45755 -26079 -10555 -27569
20510 -27569 -36148 -21301 -26443 -23763 -24584 -11304 -13867 -45206 -50175 -39505 -54711 -23931 -2394
20497 -2394 -9429 -24053 -25038 -24829 10033 34725 61962 52685 13441 1492 7689 -20011 -54588
20484 -54588 -57982 -42262 -42441 -28376 1277 35418 30872 31550 30894 29186 24375 20888 10216 9113
20470 9113 5401 -5230 -1813 -9859 -33953 -24996 -17146 -16815 -15438 -13325 -30350 -35568 -41479 -61558
20456 -61558 -63600 -55662 -41474 -33036 -49421 -43857 -24222 -11190 -4487 15621 25622 18069 13435
$$ packed form
20548a5920m130j672K0797K0494k0657k2125J9806M422r262O193n397j7593o585
20535c1629L024J0235J1114P695N532O037j4989k0917j6348Q937r178J0840N160
20522b4487q382r209O853M7273J8556k7413k7132j6081n733J9676J5524j7014
20510b7569q579J4847n142K680q21J3280k563l1339m969J0670j5206L0780K1537
20497b394p035j4624r85K09L4862K4692K7237r277l9244j1949O197k7700l4577
20484e4588l394J5720j79J4065K9653L4141m546O78o56j708m811l487j0672j103
20470I113l712j0631L417q046k4094Q957P850L31J377K113j7025n218n911k0079
20456f1558k042P938J4188Q438j6385N564J9635J3032O703K0108J0001p553m634
$$ plain form
20443 13435 9367 305 28034 47253 72964 73356 27633 16793 43547 39383 40277 42492 17538
20430 17538 -5537 -9309 -2212 -41089 -74035 -78470 -56488 -27786 -39467 -25790 -34329 -15497
20418 -15497 10507 -109 28108 33228 27563 22044 12907 1511 -1271 7137 4491 6998 16492
20405 16492 21740 18243 -857 -15617 -18650 7604 -6994 -43947 -32674 8687 6472 22558
20393 22558 -11381 -23701 -15229 -12437 -15234 7303 -17175 -37713 -24352 -3126 12831 -14576
20381 -14576 -12303 5949 5690 -13880 -6669 -6484 -11895 -27320 -23123 -31301 -51225 -33349 -40973 -39066
20367 -39066 -2413 1255 -8518 -22421 -31465 -24580 583 -6021 4650 -13023 -30058 -50384 -22107
20354 -22107 11549 9490 10957 6133 -3253 -33355 -26047 -11228 10036 17589 -347 1646 -13618
$$ packed form
20443A3435m068r062K7729J9219K5711L92m5723j0840K6754m164Q94K215k4954
20430A7538k3075l772P097l8877l2946m435K1982K8702j1681J3677q539J8832
20418a5497K6004j0616K8217N120n665n519r137j1396k782Q408k646K507R494
20405A6492N248l497j9100j4760l033K6254j4598l6953J1273M1361k215J6086
20393B2558l3939j2320Q472K792k797K2537k4478k0538J3361K1226J5957k7407
20381a4576K273J8252k59j9570P211J85n411j5425M197q178j9924J7876p624J907
20367c9066L6653L668r773j3903r044O885K5163o604J0671j7673j7035k0326K8277
20354b2107L3656k059J467m824r386l0102P308J4819K1264P553j7936J993j5264
$$ plain form
20341 -13618 -13703 6834 27844 28441 5819 -3262 3801 -31831 -46579 -16503 14223 -6020 -27664
20328 -27664 5006 26472 19064 14000 -3060 17472 11734 5807 20782 48913 47876 28030 -5588
20315 -5588 -91 50359 43872 696 -4669 9389 15800 -9185 -32880 -19617 7675 36898 54965
20302 54965 28546 -1223 2846 12791 -4698 -21870 -34518 -24725 -34486 -26758 -21087 -8642 13975
20289 13975 42788 55670 44316 49969 79657 57957 18189 -25879 -32161 -30275 -9454 -3488
20277 -3488 14925 4096 13447 21464 3934 -15050 -3910 13636 -12008 -39707 -37613 -56045
20265 -56045 -62812 -39674 817 20036 22950 41662 47960 39152 33742 23806 12224 21818 14344
20252 14344 -3711 -192 21263 -2778 -28313 -28110 -13382 -29890 -41213 -8825 24077 22334
$$ packed form
20341a3618q5K0537K1010N97k2622r081P063l5632j4748L0076L0726k0243k1644
20328b7664L2670K1466p408n064j7060K0532n738n927J4975K8131j037j9846l3618
20315e588N497N0450o487m3176n365J4058O411k4985k3695J3263K7292K9223J8067
20302E4965k6419k9769M069R945j7489j7172j2648R793r761P728N671J2445K2617
20289A3975K8813J2882j1354N653K9688k1700l9768m4068o282J886K0821N966
20277c488J8413j0829R351Q017j7530j8984J1140J7546k5644k7699K094j8432
20265e6045o767K3138M0491J9219K914J8712O298q808n410r936j1582R594p474
20252A4344j8055L519K1455k4041k5535K03J4728j6508j1323L2388L2902j743
$$ plain form
20240 22334 24458 16070 8870 31498 42170 46051 23608 -11795 -7328 43318 45250 14398 -62687
20227 -62687 -58346 -44673 -20176 22827 43964 36315 17230 6334 25380 39397 623 -14501
20215 -14501 -26332 -38049 -24012 -5856 5116 -13475 -20071 -29483 -14847 -15412 -34518 -57567
20203 -57567 -60401 -56283 -45248 -29958 -15377 -11403 -2146 -30660 -46899 -15178 -18857 -48214 -26823
20190 -26823 -19084 -3696 -6861 -15979 -13247 -28175 -31249 -84632 -86569 -50121 -29277 -8718 -5737
20177 -5737 -14233 1207 18008 29667 21598 34566 52806 51577 53446 48328 47068 -6106 -30925
20164 -30925 -15452 -5498 -13739 -16518 -17498 -11203 7257 29118 37288 20104 15196 42425 29346
20151 29346 18340 -18122 -46928 -48193 -19244 -3439 -8662 -11937 -2649 9520 -7758 -26999
$$ packed form
20240B2334K124q388p200K2628J0672L881k2443l5403M467N0646J932l0852p7085
20227f2687M341J3673K4497M3003K1137p649j9085j0896J9046J4017l8774j5124
20215a4501j1831j1717J4037J8156J0972j8591o596r412J4636n65j9106k3049
20203e7567k834M118J1035J5290J4581L974R257k8514j6239L1721l679k9357K1391
20190b6823P739J5388l165r118K732j4928l074n3383j937L6448K0844K0559K981
20177e737q496J5440J6801J1659q069J2968J8240j229J869n118j260n3174k4819
20164c0925J5473R954q241k779r80O295J8460K1861Q170j7184m908K7229j3079
20151B9346j1006l6462k8806j265K8949J5805n223l275R288J2169j7278j9241
$$ plain form
20139 -26999 -24020 -11997 17425 24258 12081 -3611 2515 -6648 -28850 -40394 -24196 5534
20127 5534 24962 45114 46609 24951 27331 -9766 -35039 -38041 -4478 -319 10773 32074 49214
20114 49214 35363 -23388 -50695 -32283 -18018 8439 133 -7905 -32591 -40556 -46427 -41735 -25216
20101 -25216 -26664 -14252 -18135 -6180 -6611 -4987 -10539 7651 6280 -3356 -17660 -17864 -6538 -36474
20087 -36474 -37579 -36032 -39402 -44542 -23227 -23577 -18151 -13672 2218 -9488 -16497 -22627 -9884 -43091
20073 -43091 -53829 -52591 -41006 -29599 -24782 -14729 10984 -11038 -8279 23870 32928 27365 29633
20060 29633 41267 39277 43119 61752 45163 32901 20188 -4755 -40379 -33856 -74765 -54274
20048 -54274 -17935 -4124 -8303 6921 19356 -4248 -18419 -12249 3613 22477 7522 5849
$$ packed form
20139b6999K979J2023K9422O833j2177j5692O126r163k2202j1544J6198K9730
20127E534J9428K0152J495k1658K380l7097k5273l002L3563M159J1092K1301J7140
20114D9214j3851n8751k7307J8412J4265K6457q306q038k4686p965n871M692J6519
20101b5216j448J2412l883J1955m31J624n552J8190j371r636j4304k04J1326k9936
20087c6474j105J547l370n140K1315l50N426M479J5890j1706p009o130J2743l3207
20073d3091j0738J238J1585J1407M817J0053K5713k2022K759L2149R058n563K268
20060B9633J1634j990L842J8633j6589j2262j2713k4943l5624O523m0909K0491
20048e4274L6339J3811m179J5224J2435k3604j4171O170J5862J8864j4955j673
$$ plain form
20036 5849 10360 -21315 -10780 -11637 -3468 7460 -2739 -18256 -16203 327 -42130 -44257 -35410
20023 -35410 -62592 -65197 -38319 -13502 -8485 -1598 2205 222 -11576 -17413 -20687 -12275 -20752
20010 -20752 -18709 -9454 -17641 -30341 -51140 -56570 -60942 -64816 -68711 -61597 -42157 -29609 -17570
19997 -17570 -17473 -9079 -17682 -15479 -12389 -3235 -20683 -35638 -36373 -24331 4304 8912 6921 24970
19983 24970 26001 1982 -18225 -17411 -6908 1301 1966 -1295 -1034 11629 38921 56825 32101
19970 32101 2575 5610 13514 13785 9763 39102 51171 48565 38778 26246 14349 -18863 -39716
19957 -39716 7291 26881 31560 39400 5206 -13992 -14990 -32530 -27380 -30869 -20148 3611 10420
19944 10420 -16610 -24851 -26901 -32771 -28602 11051 16712 12922 34985 56046 10124 -12586 -39299
$$ packed form
20036E849M511l1675J0535q57Q169J0928j0199j5517K053J6530m2457k127Q847
20023c5410k7182k605K6878K4817N017O887L803j983j1798n837l274Q412q477
20010b0752K043R255q187j2700k0799n430m372l874l895P114J9440J2548J2039
19997a7570R7Q394q603K203L090R154j7448j4955p35J2042K8635M608j991J8049
19983B4970J031k4019k0207Q14J0503Q209O65l261K61J2663K7292J7904k4724
19970C2101k9526L035P904K71m022K9339J2069k606r787j2532j1897l3212k0853
19957c9716M7007J9590M679P840l4194j9198r98j7540N150l489J0721K3759O809
19944A0420k7030q241k050n870M169L9653N661l790K2063K1061m5922k2710k6713
$$ plain form
19931 -39299 -48859 -47513 -22911 19941 19259 21513 -13993 -16978 -16268 -35391 -30637 -26791 -36060 -22670
19917 -22670 6802 26957 8100 -9604 -3000 436 -8285 -11190 -4756 3675 -1137 -4571 1614
19904 1614 2926 2451 -2993 -9921 -11607 -4050 -21980 188 29221 17490 3997 -13540 7709
19891 7709 -6287 -17461 -31910 -29374 -29514 -42125 -39700 -17181 -23999 -13919 -10339 4557 5624
19878 5624 -3495 -8567 11579 -2863 12915 12454 -7494 -18531 -8710 4134 -6424 1170 -6298
19865 -6298 -31443 -43338 -42762 -42777 -36653 -42490 -43411 -1089 12180 3350 -21493 -30245 -12052 22229
19851 22229 38703 37346 24918 3941 -38083 -51614 -35618 -43184 -43310 -18631 -41292 -37866 -7245
19838 -7245 -6532 30564 62199 38742 2802 -31003 -53597 -45202 12970 18254 -13364 -30360 -19528
$$ packed form
19931c9299r560J346K4602M2852o82K254l5506k985P10j9123M754L846r269J3390
19917b2670K9472K0155j8857j7704O604L436q721k905O434Q431m812l434O185
19904A614J312m75n444o928j686P557j7930K2168K9033j1731j3493j7537K1249
19891G709j3996j1174j4449K536j40j2611K425K2519o818J0080L580J4896J067
19878E624r119n072K0146j4442J5778m61j9948j1037R821J2844j0558P594p468
19865f298k5145j1895N76j5O124n837r21M2322J3269q830k4843q752J8193L4281
19851B2229J6474j357j2428k0977m2024j3531J5996p566j26K4679k2661L426L0621
19838g245P13L7096L1635k3457l5940l3805k2594Q395N8172N284l1618j6996J0832
$$ plain form
19825 -19528 -6435 7981 21551 24845 136 240 -6448 13947 9363 -19288 -43486 -62454 -37987
19812 -37987 -20816 -7641 10378 -19766 -68275 -80579 -32999 -208 21266 20732 16361 -6215
19800 -6215 -22795 -53935 -64329 -43631 -38792 -14042 21029 27752 -4035 -29145 -17096 -13428
19788 -13428 -1716 16809 14825 3335 -28411 -24944 -40878 -41326 -33172 -2285 12972 -3546 -34854
19775 -34854 -47852 -31079 -26000 -3821 17326 31789 29720 32162 10869 14490 30295 45976
19763 45976 58621 55886 27270 9554 -5199 4040 18550 12908 -15847 -38801 -18742 -7020
19751 -7020 15739 37780 34536 26495 24055 22964 -9648 -12276 -14643 -14462 -20941 -29783 -19657 3717
19737 3717 10497 30872 12006 -3880 1136 -3406 -4581 16147 12598 24353 51076 51817 14168
$$ packed form
19825a9528J3093J4416J3570L294k4709J04o688K0395m584k8651k4198j8968K4467
19812c7987J7171J3175J8019l0144m8509j2304M7580L2791K1474n34m371k2576
19800f215j6580l1140j0394K0698M839K4750L5071O723l1787k5110J2049L668
19788a3428J1712J8525j984j1490l1746L467j5934m48Q154L0887J5257j6518l1308
19775c4854j2998J6773N079K2179K1147J4463k069K442k1293L621J5805J5681
19763D5976J2645k735k8616j7716j4753R239J4510n642k8755k2954K0059J1722
19751g020K2759K2041l244q041k440j091l2612k628k367J81o479q842J0126K3374
19737C717O780K0375j8866j5886N016m542j175K0728l549J1755K6723P41l7649
$$ plain form
19724 14168 -6178 -17361 7846 -1570 -25999 -6581 -5131 934 691 1912 -4839 -14287 3428
19711 3428 34109 51865 31433 38101 41003 20295 -1559 20419 17346 18194 -23497 -60011 -47783
19698 -47783 -37187 -39609 -17721 -25378 4828 31163 14534 26111 26350 27721 22575 1192 7901
19685 7901 23702 39234 48022 21577 -3500 -27611 -23916 -22175 -30808 -9374 -13208 -24760 -48730
19672 -48730 -48436 -33607 -16808 15186 27905 -4331 -20797 -647 4082 11282 -498 2084 -16617
19659 -16617 -40871 -19453 -3835 7296 2081 -27267 -24973 5084 7269 -339 -2355 -27587 -40598
19646 -40598 -64893 -50133 -47301 -61201 -42924 -31296 -8789 -13232 -11286 5544 -5489 5737
19634 5737 12358 849 -1350 10602 19242 15141 -30446 -40957 -10589 16795 39151 23851 14700
$$ packed form
19724A4168k0346j1183K5207r416k4429J9418J450O065k43J221o751r448J7715
19711C428L0681J7756k0432O668K902k0708k1854K1978l073Q48m1691l6514J2228
19698d7783J0596k422K1888p657L0206K6335j6629J1577K39J371n146k1383O709
19685G901J5801J5532Q788k6445k5077k4111L695J741q633K1434l834j1552k3970
19672d8730K94J4829J6799L1994J2719l2236j6466K0150M729P200j1780K582j8701
19659a6617k4254K1418J5618J1131n215k9348K294L0057K185p608k016k5232j3011
19646d0598k4295J4760K832j3900J8277J1628K2507m443J946J6830j1033J1226
19634E737O621j1509k199J1952Q640m101m5587j0511L0368K7384K2356j5300r151
$$ plain form
19621 14700 19725 -13225 -18936 -18871 -13626 5619 392 -4763 -16420 -9008 -3635 -3404 -13219 -27394
19607 -27394 -31964 -14921 7993 -13315 -7638 -3814 -5468 -15714 -1942 -3179 -20610 -35684 -33367
19594 -33367 -46524 -42942 -29101 -23214 -22059 -9611 80 18873 36372 32756 22941 3798 -27024
19581 -27024 -15490 -9656 -9452 -15321 -44317 -27701 5959 538 -2260 21112 7394 -13244 -35490
19568 -35490 -11618 38646 46329 6353 -20396 -31390 -29452 -6864 -692 -14883 -11180 -24121
19556 -24121 -16868 -9952 -10740 -29721 -38272 -42815 -18485 31102 55438 39967 -9589 -28482 1316
19543 1316 24569 42154 30688 33200 29289 16221 -20870 -27646 -23432 -43935 -15751 -5730 -4320
19530 -4320 13067 88 -13275 -22288 -14706 17962 30210 55303 49952 38240 28468 13481 -14200
$$ packed form
19621A4700N025l2950n711O5N245J9245n227n155j1657P412N373K31r815j4175
19607b7394m570J7043K2914k1308N677L824j654j0246J3772j237j7431j5074K317
19594c3367j3157L582J3841N887J155J2448R691J8793J7499l616r815j9143l0822
19581b7024J1534N834K04n869k8996J6616L3660n421k798K3372j3718k0638k2246
19568c5490K3872N0264P683l9976k6749j0994J938K2588O172j4191L703j2941
19556b4121P253O916p88j8981q551m543K4330M9587K4336j5471m9556j8893K9798
19543A316K3253J7585j1466K512l911j3068l7091o776M214k0503K8184J0021J410
19530d320J7387j2979j3363r013P582L2668J2248K5093n351j1712r772j4987k7681
$$ plain form
19517 -14200 -31447 -22913 -7935 3370 -2647 1248 27717 42663 53299 36147 4001 10209
19505 10209 13920 9576 9491 -12804 -13591 -14791 -9208 28972 26681 19640 9268 -18604 -25743 -5381
19491 -5381 8947 14401 1568 -12952 -21008 -54279 -28947 31081 8725 -29302 -36394 -7428
19479 -7428 9708 -12432 -19781 -7702 -4305 2645 1333 -20674 -444 17493 23364 18816 23479
19466 23479 16031 14712 2710 -7451 2215 -13991 -11078 -7594 -25224 -37911 -40718 -39857 -52871
19453 -52871 -47752 -30874 -42419 -31062 -7278 9614 -29907 -52309 -79388 -83642 -58462 -45099
19441 -45099 -37571 -11591 -22847 -32222 -2654 -19197 -27415 -13450 -4678 -16808 1794 -22208
19429 -22208 -46842 -47843 -17971 -6927 8354 46991 66213 65489 24696 -11950 -5205 17602
$$ packed form
19517a4200j7247Q534J4978J1305o017L895K6469J4946J0636j7152l2146O208
19505A0209L711m344q5k2295p87j200N583L8180k291p041j0372k7872p139K0362
19491e381J4328N454j2833j4520q056l3271K5332O0028k2356l8027p092K8966
19479g428J7136k2140p349J2079L397O950j312k2007K0230J7937N871m548M663
19466B3479p448j319j2002j0161R666j6206K913L484j7630j2687k807Q61j3014
19453e2871N119J6878j1545J1357K3784J6892l9521k2402k7079m254K5180J3363
19441d5099P528K5980j1256r375K9568j6543q218J3965Q772j2130J8602k4002
19429b2208k4634j001K9872J1044J5281L8637J9222p24m0793l6646O745K2807
$$ plain form
19417 17602 46608 73069 72772 34299 26706 10627 25075 18379 43477 15213 -5290 -23814
19405 -23814 -16612 -3237 21744 26454 -107 -2918 8524 46947 43937 26832 38915 43450 19986
19392 19986 972 -25972 8856 19237 15052 26357 10721 -11453 -2585 33786 68128 97372
19380 97372 77231 49799 37394 27624 15321 4127 12378 17851 31713 7215 -1600 9240
19368 9240 6197 -1090 14443 33046 18227 26737 42284 53590 43403 21763 19540 35394 10071
19355 10071 15170 60480 66978 55634 36053 8239 -12304 -9437 5523 -17851 -17145 5619 8542
19342 8542 36809 52354 63390 65887 26695 1475 941 12177 22944 46972 47995 6169 -15756
19329 -15756 -10386 -506 -26935 2926 15654 -1057 4863 15726 1589 -3362 9572 23040
$$ packed form
19417A7602K9006K6461k97l8473p593j6079J4448o696K5098k8264k0503j8524
19405b3814P202J3375K4981M710k6561k811J1442L8423l010j7105J2083M535k3464
19392A9986j9014k6944L4828J0381m185J1305j5636k2174Q868L6371L4342K9244
19380I7372k0141k7432j2405r770j2303j1194Q251N473J3862k4498q815J0840
19368I240l043p287J5533J8603j4819Q510J5547J1306j0187k1640k223J5854k5323
19355A0071N099M5310O498j1344j9581k7814k0543K867J4960k3374P06K2764K923
19342H542K8267J5545J1036K497l9192k5220n34J1236J0767K4028J023m1826k1925
19329a5756N370R880k6429K9861J2728j6711N920J0863j4137m951J2934J3468
$$ plain form
19317 23040 378 1350 8443 -27846 -33855 -24063 -17624 -23402 -22757 386 18302 16218 37206 63171
19303 63171 36273 3816 -19064 -24542 -29662 8375 27683 44816 40006 33471 23086 25564 33092
19290 33092 27951 41266 54920 32878 26186 18037 30868 46050 48115 51713 27492 30905 37815
19277 37815 58580 58874 35160 24554 16925 278 9194 -14917 -38976 -28105 -8781 -4850 -7979
19264 -7979 -874 17143 19974 8813 30872 32328 49141 37379 19169 8217 11186 15820 38696
19251 38696 64277 55568 21182 31810 26668 1345 17757 16382 18692 12731 22905 16195 34239
19238 34239 27678 40960 33360 -6958 -29764 -28740 -17082 -25764 -23550 -25631 -24137 -21258 36124
19225 36124 62247 77832 83888 69250 50073 66327 61821 40933 45106 27588 -12070 -31433
$$ packed form
19317B3040k2662R72P093l6289o009R792O439n778O45K3143J7916k084K0988K5965
19303F3171k6898l2457k2880n478n120L8037J9308J7133m810o535j0385K478P528
19290C3092n141J3315J3654k2042o692q149J2831J5182K065L598k4221L413O910
19277C7815K0765K94k3714j0606p629j6647Q916k4111k4059J0871J9324L931l129
19264g979P105J8017K831j1161K2059J456J6813j1762j8210j0952K969M634K2876
19251C8696K5581q709l4386J0628n142k5323J6412j375K310n961J0174o710J8044
19238C4239o561J3282p600m0318k2806J024J1658q682K214k081J494K879N7382
19225C6124K6123J5585O056j4638j9177J6254m506k0888M173j7518l9658j9363
$$ plain form
19213 -31433 -24001 11544 16170 3181 -14347 33504 44677 7737 11126 29907 31610 43778
19201 43778 51203 60532 20130 20726 20850 41240 68913 65484 30522 35866 21508 36850 44278
19188 44278 41514 42076 69689 115902 139638 133822 116921 102889 71800 56660 68422 71014 55433
19175 55433 90408 137149 145484 126473 106229 89698 100822 94121 65819 35747 49127 42215
19163 42215 37216 41141 41252 56032 52054 55283 31309 6626 -3821 -5295 13735 9740 929
19150 929 -21859 -7487 -2923 2877 30493 70224 90833 88390 86493 96945 76910 46757 80204
19137 80204 114240 123294 128751 166128 202118 201092 200974 167757 136579 139588 132299 120369 83056
19124 83056 44067 47193 59101 77620 62276 62652 51790 37879 56962 67578 74314 63079
$$ packed form
19213c1433P432L5545M626j2989j7528M7851J1173l6940L389J8781J703J2168
19201D3778P425R329m0402N96J24K0390K7673l429l4962N344j4358J5342P428
19188D4278k764N62K7613M6213K3736n816j6901j4032l1089j5140J1762K592j5581
19175E5433L4975M6741Q335j9011k0244j6531J1124o701k8302l0072J3380o912
19163D2215m999L925J11J4780l978L229k3974k4683j0447j474J9030l995q811
19150I29k2788J4372M564N800K7616L9731K0609k443j897J0452k0035l0153L3447
19137H0204L4036R054N457L7377L5990j026j18l3217l1178L009p289j1930l7313
19124H3056l8989L126J1908J8519j5344L76j0862j3911J9083J0616O736j1235
$$ plain form
19112 63079 65213 70529 64312 84607 65691 39765 11840 13153 22020 32880 18224 18113 24358
19099 24358 26572 3531 -13945 -8076 -6896 29205 45419 41093 46872 77675 77796 74754 47988
19086 47988 58138 91362 65392 28936 406 -33955 -7486 1800 44532 79694 91904 73394
19074 73394 41207 4358 -9974 17215 23673 28802 15690 -1594 20573 21552 20163 37101 39467
19061 39467 32102 27102 12323 558 19744 58603 47600 26722 31796 44335 8743 -23874
19049 -23874 -22576 -10435 4367 14923 8538 10476 -9588 11484 34907 49868 23221 -15845
19037 -15845 -8275 -1837 2606 10187 7775 4929 38913 54242 38588 45199 78895 73972 60234
19024 60234 44418 21848 16953 17586 13674 52530 53540 23309 8350 30765 58695 54217 51598
$$ packed form
19112F3079K134N316o217K0295j8916k5926k7925J313Q867J0860j4656j11O245
19099B4358K214k3041j7476N869J180L6101J6214m326N779L0803J21l042k6766
19086D7988J0150L3224k5970l6456k8530l4361K6469R286M2732L5162J2210j8510
19074G3394l2187l6849j4332K7189O458N129j3112j7284K2167R79j389J6938K366
19061C9467p365n000j4779j1765J9186L8859j1003k0878N074J2539l5592l2617
19049b3874J298J2141J4802J0556o385J938k0064K1072K3423J4961k6647l9066
19037a5845P570O438M443P581k412k846L3984J5329j5654O611L3696m923j3738
19024F0234j5816k2570m895O33l912L8856J010l0231j4959K2415K7930m478k619
$$ plain form
19011 51598 49557 44479 42618 37110 6586 5642 -5756 -21174 -1422 -22753 -23884 7872 7759
18998 7759 23679 7218 -437 3204 -5093 -10865 -5493 -34469 -24259 11625 20837 38997 45239
18985 45239 37800 15951 25599 30287 42950 61308 59671 39421 42201 52664 50201 40228 59390
18972 59390 81913 88221 112026 132928 134534 137103 131981 169977 185957 146854 109745 87857
18960 87857 74910 63550 78252 64559 54130 30462 34633 59220 55843 41120 23743 33994
18948 33994 51360 75734 85905 64141 78701 153147 177226 128121 114256 143506 174176 175119
18936 175119 159696 141384 118585 94535 63471 82992 108992 108139 138366 128420 116608 160717
18924 160717 199113 226815 240495 269064 292963 299170 303329 272611 199671 164621 145507 113198
$$ packed form
19011E1598k041n078j861n508l0524r44j1398j5418J9752k1331j131L1756j13
18998G759J5920j6461p655L641q297n772N372k8976J0210L5884R212J8160O242
18985D5239p439k1849R648M688J2663J8358j637k0250K780J0463k463r973J9162
18972E9390K2523O308K3805K0902J606K569n122L7996J5980l9103l7109k1888
18960H7857j2947j1360J4702j3693j0429k3668M171K4587l377j4723j7377J0251
18948C3994J7366K4374J0171k1764J4560P4446K4079m9105j3865K9250L0670R43
18936A75119j5423j8312k2799k4050l1064J9521K6000q53L0227r946j1812M4109
18924A60717L8396K7702J3680K8569K3899O207M159l0718p2940l5050j9114l2309
$$ plain form
18912 113198 95565 92950 56433 38178 29137 62611 76932 81813 79892 63230 42652 25995
18900 25995 48017 60764 49909 44114 38718 47006 40111 36916 50139 62844 57469 37474 22375
18887 22375 16838 -1825 10306 28236 40086 41907 44543 68672 96187 87989 76431 44239
18875 44239 51557 90247 107827 75043 78576 68043 47305 69664 91894 81830 67755 70044
18863 70044 104612 126111 103308 85093 73931 71963 81887 95584 121998 153741 160739 178945
18851 178945 206008 280590 334233 403437 599951 884543 1195579 1439431 1538119 1668826
18841 1668826 1873403 2067633 2210655 2002202 1455048 1025465 758923 599827 491829
18832 491829 438850 383155 343242 318493 295984 283667 259914 251023 256797 246356 217071 214359
$$ packed form
18912A13198j7633k615l6517j8255r041L3474J4321M881j921j6662k0578j6657
18900B5995K2022J2747j0855n795n396Q288o895l195J3223J2705n375j9995j5099
18887B2375n537j8663J2131J7930J1850J821K636K4129K7515q198j1558l2192
18875D4239P318L8690J7580l2784L533j0533k0738K2359K2230j0064j4075K289
18863G0044L4568K1499k2803j8215j1162j968R924J3697K6414L1743O998J8206
18851A78945K7063P4582N3643O9204J96514K84592L11036K43852R8688J30707
18841A668826K04577J94230J43022k08453n47154m29583k66542j59096j07998
18832D91829n2979n5695l9913k4749k2509j2317k3753q891N774j0441k9285k712
$$ plain form
18820 214359 216416 163053 143535 156666 160748 160164 168310 156808 150042 153678 134541 128433 141242
18807 141242 137704 108615 106658 74577 70792 84114 93599 90218 77683 59092 75634 70979 64214
18794 64214 39262 45688 69590 106269 126038 109608 102182 104396 105441 91242 98308 85925 56991
18781 56991 71548 98244 96134 61797 63961 65862 77635 107999 119946 155573 181958 188519
18769 188519 168211 138979 167643 202082 181515 160951 100407 96829 112880 109175 121056 123379
18757 123379 121009 115829 77353 65859 77626 94462 90076 110145 120736 121723 85989 69438
18745 69438 63753 80174 100217 76423 72834 70412 72338 51894 50883 43965 34678 1765 -6538
18732 -6538 26035 30494 18826 26204 23002 33583 55761 65311 25418 11541 38727 33809 19268
$$ packed form
18820B14359K057n3363j9518J3131M082n84Q146j1502o766L636j9137o108J2809
18807A41242l538k9089j957l2081l785J3322R485l381j2535j8591J6542m655o765
18794F4214k4952O426K3902L6679J9769j6430p426K214J045j4199P066j2383k8934
18781E6991J4557K6696k110l4337K164J901J1773L0364J1947L5627K6385O561
18769A88519k0308k9232K8664L4439k0567k0564o0544l578J6051l705J1881K323
18757A23379k370n180l8476j1494J1767J6836m386K0069J0591R87l5734j6551
18745F9438n685J6421K0043k3794l589k422J926k0444j011o918r287l2913q303
18732f538L2573M459j1668P378l202J0581K2178R550l9893j3877K7186m918j4541
$$ plain form
18719 19268 42798 74270 67719 51981 30341 27545 6439 38083 79584 80392 65958 64477 75257
18706 75257 62178 44794 35845 32708 35969 44960 64798 68548 74771 77686 49070 72375 103424
18693 103424 102362 66292 40988 64444 75118 81128 59943 64380 76963 52671 46480 14912
18681 14912 6741 45205 50641 46101 52867 59311 70655 62309 45057 47100 34545 18241 31831
18668 31831 21016 46218 66718 72390 62848 69068 57615 34518 23572 18841 17006 -3527 -10501
18655 -10501 -36868 4152 47084 78336 64046 57204 67296 74478 99561 108433 78779 62014
18643 62014 60169 31172 33059 47085 35212 32952 60301 55890 26518 40607 99573 127743
18631 127743 84875 69646 84857 78148 44986 47518 44275 74761 94619 98629 95640 120103
$$ packed form
18719A9268K3530L1472o551j5738k1640k796k1106L1644M1501Q08j4434j481J0780
18706G5257j3079j7384q949l137L261Q991J9838L750O223K915k8616K3305L1049
18693A03424j062l6070k5304K3456J0674O010k1185M437J2583k4292o191l1568
18681A4912q171L8464N436m540O766O444J1344q346j7252K043j2555j6304J3590
18668C1831j0815K5202K0500N672r542O220j1453k3097j0946m731j835k0533o974
18655a0501k6367M1020M2932L1252j4290o842J0092P182K5083Q872k9654j6765
18643F2014j845k8997J887J4026j1873k260K7349m411k9372J4089N8966K8170
18631A27743m2868j5229J5211o709l3162K532l243L0486J9858M010k989K4463
$$ plain form
18619 120103 156495 139573 112848 108326 67010 85805 92297 70857 55676 43767 34442 44051
18607 44051 60692 74096 83545 72659 107304 87865 62622 64384 82456 55114 45306 38138
18595 38138 32891 43014 65238 66496 66548 56334 58931 85579 111927 111360 97642 84558 31644
18582 31644 9222 -351 -18271 -12068 20541 10952 8437 32548 33290 33754 32825 39836 24787 24404
18568 24404 18118 42790 57021 69138 65633 44667 33147 45338 27845 19095 -2517 16460
18556 16460 52029 67782 69530 82663 51489 16535 25083 69422 65154 34910 27229 11933
18544 11933 39555 62546 43833 56425 92962 134200 146280 127019 150535 162490 177171 172559
18532 172559 218083 262921 253278 284351 233020 254450 276415 228820 182288 204378 204711 185659
$$ packed form
18619A20103L6392j6922k6725m522m1316J8795O492k1440j5181j1909r325R609
18607D4051J6641J3404R449j0886L4645j9439k5243J762J8072k7342r808p168
18595C8138n247J0123K2224J258N2j0214K597K6648K6348n67j3718j3084n2914
18582C1644k2422r573j7920O203L2609r589k515K4111P42M64r29P011j5049l83
18568B4404o286K4672J4231J2117l505k0966j1520J2191j7493q750k1612J8977
18556A6460L5569J5753J748J3133l1174l4954Q548M4339m268l0244p681j5296
18544A1933K7622K2991j8713J2592L6537M1238J2080j9261K3516J1955J4681m612
18532A72559M5524M4838r643L1073n1331K1430K1965m7595m6532K2090L33j9052
$$ plain form
18520 185659 176465 173239 186379 188495 144076 107321 117570 127467 131680 128811 120736 110751 94505
18507 94505 94500 105404 105548 82063 62971 34027 45509 26529 49741 59135 95266 95070 70402
18494 70402 67366 75655 77172 77627 45957 15702 43515 74088 70164 58361 51950 27392 -11563
18481 -11563 11011 35024 19616 9913 9414 9524 14882 7780 -32187 -26193 2350 -3893 52652
18468 52652 119946 131768 138614 155357 236382 387433 565742 694672 702708 654042 625156
18457 625156 595912 561392 507951 443341 407510 368653 349023 332765 305415 282911 292230 318188
18445 318188 293719 296035 344848 367082 400130 382969 382952 397144 401594 389491 382073 402365 402527
18432 402527 398054 421032 407635 401277 395532 424631 438476 411806 391824 381985 386621 381621 354468
$$ packed form
18520A85659r194l226J3140K116m4419l6755J0249R897M213k869q075r985j6246
18507I4505nJ0904J44k3485j9092k8944J1482j8980K3212R394L6131j96k4668
18494G0402l036Q289J517M55l1670l0255K7813L0573l924j1803o411k4558l8955
18481a1563K2574K4013j5408r703m99J10N358p102l9967N994K8543o243N6545
18468E2652O7294J1822O846J6743Q1025J51051J78309J28930Q036m8666k8886
18457F25156k9244l4520n3441o4610l5831l8857j9630j6258k7350k2504R319K5958
18445C18188k4469K316M8813K2234L3048j7161j7J4192M450j2103p418K0292J62
18432D02527m473K2978j3397o358n745K9099J3845k6670j9982r839M636n000k7153
$$ plain form
18419 354468 347112 357196 335325 324248 320849 324738 330284 370432 395385 448345 548158 663096
18407 663096 722013 774699 784204 801111 772487 890912 1002432 1219448 1392176 1377610 1244555
18396 1244555 975634 815437 777344 769609 784360 800812 786422 743618 713570 737275 771003
18385 771003 805457 815218 779154 752294 708201 699521 745968 794834 809159 834770 845868 831915
18373 831915 845196 905267 944331 959176 967941 998194 1033455 1048853 1092261 1098183 1080733 1078733
18361 1078733 1067867 1072949 1082931 1076409 1028043 1007468 962746 965235 944089 918162 926542 966231
18349 966231 1000801 1018104 1034694 1064131 1106535 1125170 1130169 1134594 1160289 1174183 1142353 1144098
18337 1144098 1176426 1179129 1164835 1169446 1185622 1229594 1289154 1390087 1427063 1445504 1500048
$$ packed form
18419C54468p356J0084k1871j1077l399L889N546M0148K4953N2960R9813J14938
18407F63096N8917N2686R505J6907k8624J18425J11520K17016J72728j4566j33055
18396A244555k68921j60197l8093p735J4751J6452j4390m2804l0048K3705L3728
18385G71003L4454R761l6064k6860m4093q680M6447M8866J4325K5611J1098j3953
18373H31915J3281O0071L9064J4845Q765L0253L5261J5398M3408N922j7450k000
18361A078733j0866N082R982o522m8366k0575m4722K489k1146k5927Q380L9689
18349I66231L4570J7303J6590K9437M2404J8635M999M425K5695J3894l1830J745
18337A144098L2328K703j4294M611J6176M3972N9560J00933L6976J8441N4544
$$ plain form
18326 1500048 1537105 1578096 1696907 1826359 2012867 2285308 2668409 3039946 3298281 3467715
18316 3467715 3720323 3995852 4222214 4302554 3917191 3462516 3241607 3166403 3167751 3230604
18306 3230604 3333906 3470167 3704248 3955813 4203757 4464216 4724131 5017612 5374496
18297 5374496 5733128 6155640 6651664 7270710 8026276 8946124 10193221 12078909 14630394
18288 14630394 17815529 21605500 26357963 33341890 44236890 61823568 91573417 138844171
18280 138844171 199347376 248073005 267915737 284454059 320473093 360097087 393923297
18273 393923297 376554311 275895872 188107081 133847698 101503488 82011721 69229767
18266 69229767 59954928 52978804 47499040 42808082 38942465 35822115 33194656 30853465
$$ packed form
18326A500048L7057M0991J18811J29452J86508K72441L83101L71537K58335J69434
18316C467715K52608K75529K26362Q0340l85363m54675k20909p5204J348O2853
18306C230604J03302J36261K34081K51565K47944K60459K59915K93481L56884
18297E374496L58632M22512M96024O19046P55566R19848J247097J885688K551485
18288A4630394L185135L789971M752463O983927J0895000J7586678K9749849M7270754
18280A38844171O0503205M8725629J9842732J6538322L6019034L9623994L3826210
18273C93923297j7368986j00658439q7788791n4259383l2344210j9491767j2781954
18266F9229767r274839o976124n479764m690958l865617l120350k627459k341191
$$ plain form
18258 30853465 28855507 27104016 25515623 24084793 22681714 21406973 20309742 19317518
18250 19317518 18424355 17590422 16776189 16060996 15425832 14884977 14437732 14059228 13788120
18241 13788120 13599301 13446467 13156085 12767541 12472986 12295498 12127557 11885651 11214232
18232 11214232 10357337 9685667 9209798 8769410 8412823 8146366 7839089 7578071 7362280
18223 7362280 7108849 6838581 6628106 6393325 6177550 5950140 5730944 5522569 5342593
18214 5342593 5164998 4984023 4848022 4731331 4570510 4419253 4290985 4192827 4065855 3949643
18204 3949643 3877260 3800459 3719828 3626473 3510884 3394982 3288422 3197586 3077653 2968336
18194 2968336 2882316 2828480 2724969 2633592 2543028 2464374 2409297 2354934 2295990 2250438 2208338
$$ packed form
18258C0853465j997958j751491j588393j430830j403079j274741j097231r92224
18250A9317518q93163q33933q14233p15193o35164n40855m47245l78504k71108
18241A3788120j88819j52834k90382l88544k94555j77488j67941k41906o71419
18232A1214232q56895o71670m75869m40388l56587k66457l07277k61018k15791
18223G362280k53431k70268k10475k34781k15775k27410k19196k08375j79976
18214E342593j77595j80975j36001j16691j60821j51257j28268r8158j26972j16212
18204C949643p2383p6801q0631r3355j15589j15902j06560r0836j19933j09317
18194B968336q6020n3836j03511r1377r0564p8654n5077n4363n8944m5552m2100
$$ plain form
18183 2208338 2173269 2145963 2103875 2064172 2061525 2054155 1992018 1904855 1802101 1713704 1638527
18172 1638527 1516568 1390073 1326844 1290916 1243039 1164368 1075474 987194 942123 883855 809968
18161 809968 726016 678200 610825 484832 332581 255220 266780 267258 193799 79556 43405
18150 43405 265202 470673 535937 568042 542409 468304 377859 340307 378828 386969 397338
18139 397338 432481 494769 520512 515315 491758 480752 482226 499763 533475 584502 614653 624989
18127 624989 644887 687345 744203 827473 986001 1139443 1270334 1502944 1886774 2432259
18117 2432259 3288325 4749812 7257037 10892392 14823506 17270443 18408551 20134527
18109 20134527 22792001 25269210 26588431 22565846 15727969 10819081 7829167 6062878
$$ packed form
18183B208338l5069k7306m2088l9703k647p370o2137q7163j02754q8397p5177
18172A638527j21959j26495o3229l5928m7877p8671q8894q8280m5071n8268p3887
18161H09968q3952m7816o7375j25993j52251p7361J1560M78p3459j14243l6151
18150D3405K21797K05471O5264L2105k5633p4105r0445l7552L8521Q141J0369
18139C97338L5143O2288K5743n197k3557j1006J474J7537L3712N1027L0151J0336
18127F24989J9898M2458N6858Q3270J58528J53442J30891K32610L83830N45485
18117B432259Q56066J461487K507225L635355L931114K446937J138108J725976
18109B0134527K657474K477209J319221m022585o837877m908888k989914j766289
$$ plain form
18101 6062878 4946490 4159301 3563696 3113637 2781513 2475990 2221845 2029322 1815321
18092 1815321 1657874 1564919 1498575 1442897 1375411 1305486 1285171 1417807 1581867 1579655 1525899
18081 1525899 1465187 1400265 1319155 1242709 1169516 1128247 1101580 1087821 1031320 992396 964804
18070 964804 914883 887975 862594 841484 827089 876591 878270 857036 813746 789351 756120 763389
18058 763389 751722 691237 676023 715117 730449 682452 645062 651322 668424 667798 670869 659543
18046 659543 604808 564256 547843 531207 517510 534924 556668 564564 548525 498066 440462 396783
18034 396783 385191 385457 359721 320118 299463 313169 302141 285112 286257 280478 267336 260586
18022 260586 255311 234726 215721 214296 221117 234765 262982 274511 249804 238210 241864 229081
$$ packed form
18101F062878j116388p87189n95605m50059l32124l05523k54145j92523k14001
18092A815321j57447r2955o6344n5678o7486o9925k0315J32636J64060k212n3756
18081A525899o0712o4922q1110p6446p3193m1269k6667j3759n6501l8924k7592
18070I64804m9921k6908k5381k1110j4395M9502J679k1234m3290k4395l3231P269
18058G63389j1667o0485j5214L9094J5332m7997l7390O260J7102o26L071j1326
18046F59543n4735m0552j6413j6636j3697J7414K1744P896j6039n0459n7604m3679
18034C96783j1592K66k5736l9603k0655J3706j1028j7029J145n779j3142o750
18022B60586n275k0585j9005j425O821J3648K8217J1529k4707j1594L654j2783
$$ plain form
18010 229081 206951 191809 165998 158694 130157 139847 154968 162003 141659 133321 121817 122335 120650
17997 120650 132894 146488 159337 159787 139177 95309 70460 78675 83700 59714 66683 45100
17985 45100 32655 32890 35853 83653 88724 85931 78907 65744 51049 50893 70653 69699 60790 68454
17971 68454 91771 78335 53031 38135 50839 42721 33124 36296 32014 41436 64244 59382 52780
17958 52780 89593 117612 94000 69545 38933 17905 28539 40581 39954 35523 41813 -9441
17946 -9441 -11981 21964 4304 2206 18092 38308 37520 61616 84189 103560 105203 66907 58648
17933 58648 56910 24478 47962 59985 45081 24712 38764 19168 4977 14083 19302 36484
17921 36484 38328 57290 57532 83870 78062 56554 43768 38971 59256 60615 50272 31274 24848
$$ packed form
18010B29081k2130j5142k5811p304k8537R690J5121P035k0344q338j1504N18j685
17997A20650J2244J3594J2849M50k0610m3868k4849Q215N025k3986O969k1583
17985D5100j2445K35K963M7800N071k793p024j3163j4695j56J9760r54q909P664
17971F8454K3317j3436k5304j4896J2704q118r597L172m282R422K2808m862o602
17958E2780L6813K8019k3612k4455l0612k1028J0634J2042o27m431O290n1254
17946i441k540L3945j7660k098J5886K0216p88K4096K2573J9371J643l8296q259
17933E8648j738l2432K3484J2023j4904k0369J4052j9596j4191R106N219J7182
17921C6484J844J8962K42K6338n808k1508j2786m797K0285J359j0343j8998o426
$$ plain form
17908 24848 25445 28985 34294 -9630 -42406 -44623 -20800 -9498 -28165 -7446 26926 79817 80801
17895 80801 97239 102903 93850 87938 62983 48298 29734 24088 57864 66359 56450 56960 22118
17882 22118 12098 15393 35797 25711 22862 48712 88580 85518 79074 80377 102612 95352 95181
17869 95181 74255 89857 84015 52007 43304 41241 62209 47638 37934 25909 43362 47053 24952
17856 24952 20050 28095 9323 20961 21325 35388 45449 28761 16010 3330 25604 41233
17844 41233 42632 13610 4682 10621 55257 68161 67699 64523 48038 40042 36902 28884 45969
17831 45969 57981 57019 63293 55340 35282 7660 19034 70755 80403 64487 60995 33623 9359
17818 9359 14205 -2392 27601 46005 58534 61215 46410 22646 15489 215 -20400 -14982 4159
$$ packed form
17908B4848N97L540N309m3924l2776k217K3823J1302j8667K0719L4372N2891R84
17895H0801J6438N664r053n912k4955j4685j8564n646L3776Q495r909N10l4842
17882B2118j0020L295K0404j0086k849K5850L9868l062o444J303K2235p260j71
17869I5181k0926J5602n842l2008q703k063K0968j4571r704j2025J7453L691k2101
17856B4952m902Q045j8772J1638L64J4063J0061j6688j2751j2680K2274J5629
17844D1233J399k9022q928N939M4636J2904m62l176j6485p996l140q018J7085
17831D5969J2012r62O274p953k0058k7622J1374N1721R648j5916l492k7372k4264
17818I359M846j6597K9993J8404J2529K681j4805k3764p157j5274k0615N418J9141
$$ plain form
17805 4159 2792 12403 46584 82632 67817 84763 134049 166201 165885 149931 130595 159270 202537
17792 202537 228993 187200 125166 104581 68878 71255 83245 75748 81640 103562 138116 164772
17780 164772 169317 153719 119868 114838 139532 159147 178200 174001 149227 141928 115365 101275
17768 101275 81382 73891 67258 63147 51876 41633 84180 115341 124234 115859 112430 119968 127498
17755 127498 137163 165334 203023 233466 222703 197538 211567 222975 224776 214282 248638 270898
17743 270898 263878 288420 309599 340180 349502 351727 373044 405977 434884 478461 457508 419032
17731 419032 418715 446321 461512 508210 570536 628279 731732 878116 1021684 1201879 1480285
17720 1480285 1936160 2596469 3670554 5465715 8370150 12238193 15541946 17042368
$$ packed form
17805D159j367R611L4181L6048j4815J6946M9286L2152l16j5954j9336K8675M3267
17792B02537K6456m1793o2034k0585l5703K377J1990p497N892K1922L4554K6656
17780A64772M545j5598l3851n030K4694J9615J9053m199k4774p299k6563j4090
17768A01275j9893p491o633m111j1271j0243M2547L1161Q893q375l429P538P530
17755A27498R665K8171L7689L0443j0763k5165J4029J1408J801j0494L4356K2260
17743B70898p020K4542K1179L0581R322K225K1317L2933K8907M3577k0953l8476
17731D19032l17K7606J5191M6698O2326N7743J03453J46384J43568J80195K78406
17720A480285M55875O60309J074085J795161K904435L868043L303753J500422
$$ plain form
17712 17042368 18176575 20580839 23404316 25906321 25501874 19392451 13733750 10350430
17704 10350430 8476176 7330071 6417439 5308801 4315996 3642366 3214161 2879589 2622909
17695 2622909 2404822 2227937 2060536 1960133 1849736 1734991 1639885 1545649 1475606 1424493
17685 1424493 1401488 1375271 1324089 1273248 1188268 1103386 1072476 1041191 998340 930823 880174
17674 880174 837108 788783 781621 750483 717117 693136 703073 676522 634049 620901 616948 604580
17662 604580 608799 627412 660256 726110 809802 871516 917137 982752 1053004 1146020 1187751 1209574
17650 1209574 1159306 1085420 1051189 1023459 1036420 1028102 957408 845180 726902 601197 521648
17639 521648 463467 434754 402883 364433 355570 392937 390865 374195 367262 348597 301499 280937
$$ packed form
17712A7042368J134207K404264K823477K502005m04447o109423n658701l383320
17704A0350430j874254j146105r12632j108638r92805o73630m28205l34572k56680
17695B622909k18087j76885j67401j00403j10397j14745r5106r4236p0043n1113
17685A424493k3005k6217n1182n0841q4980q4882l0910l1285m2851o7517n0649
17674H80174m3066m8325p162l1138l3366k3981R937k6551m2473j3148l953j2368
17662F04580M219J8613L2844O5854Q3692O1714M5621O5615P0252R3016M1731K1823
17650A209574n0268p3886l4231k7730J2961q318p0694j12228j18278j25705p9549
17639E21648n8181k8713l1871l8450q863L7367k072j6670o933j8665m7098k0562
$$ plain form
17627 280937 283055 285862 262841 213950 194086 170071 151365 157167 168981 190083 184021 158610
17615 158610 154946 141411 145429 151103 135574 137545 150027 136719 104041 120675 157302 179284
17603 179284 156435 164110 141800 144685 137075 147373 137544 115567 92910 72192 90911 87292
17591 87292 91542 123159 147864 183223 211613 239273 251273 284198 327059 336639 368202 360620
17579 360620 359515 361400 365673 376865 386390 379339 332437 306710 263660 245229 241867 227889 224907
17566 224907 186015 145101 105049 110348 126435 105553 99467 108067 117737 119317 105498 98204 82135
17553 82135 51734 49252 12347 2938 36128 32727 15976 67087 55383 14489 16343 32414
17541 32414 33725 55678 70809 79395 79405 71387 75715 72191 65335 68384 49705 47583 30452 20685
$$ packed form
17627B80937K118K807k3021m8891j9864k4015j8706N802J1814K1102o062k5411
17615A58610l664j3535M018N674j5529J971J2482j3308l2678J6634L6627K1982
17603A79284k2849P675k2310K885p610J0298r829k1977k2657k0718J8719l619
17591H7292M250L1617K4705L5359K8390K7660J2000L2925M2861R580L1563p582
17579C60620j105J885M273J1192R525p051m6902k5727m3050j8431l362j3978k982
17566B24907l8892m0914m0052N299J6087k0882o086Q600R670J580j3819p294j6069
17553H2135l0401k482l6905r409L3190l401j6751N1111j1704m0894J854J6071
17541C2414J311K1953J5131Q586J0q018M328l524o856L049j8679k122j7131r767
$$ plain form
17527 20685 11866 18755 27305 20099 17203 34109 49857 52740 63057 53382 47377 47317 30862 35379
17513 35379 69048 73876 39624 36315 39879 29239 39767 36527 44412 69299 90753 108641 115824
17500 115824 81190 41311 39264 -13003 -26526 8895 6409 -823 -397 -9453 -366 -5653 11379
17487 11379 33308 31564 22107 18480 12015 41126 49903 39042 36767 50340 32007 19205 4992
17474 4992 7929 18452 9242 -6319 3903 26581 42122 37633 9477 -3311 -2120 1287 17403
17461 17403 -14313 -50120 -32366 -1494 7402 15478 -723 3613 17449 29231 68111 65461
17449 65461 40125 73756 96959 86384 70925 74262 89555 155658 195085 194838 149787 115022
17437 115022 87948 80795 81989 60614 55780 47205 31548 16743 6661 21299 45505 63711
$$ packed form
17527B0685q819O889Q550p206k896J6906J5748K883J0317r675o005o0j6455M517
17513C5379L3669M828l4252l309L564j0640J0528l240P885K4887K1454J7888P183
17500A15824l4634l9879k047n2267j3523L5421k486p232M26r056R087n287J7032
17487A1379K1929j744r457l627o465K9111Q777j0861k275J3573j8333j2802j4213
17474D992K937J0523r210j5561J0222K2678J5541m489k8156j2788J191L407J6116
17461A7403l1716l5807J7754L0872Q896Q076j6201M336J3836J1782L8880k650
17449F5461k5336L3631K3203j0575j5459L337J5293O6103L9427k47m5051l4765
17437A15022k7074p153J194k1375m834q575j5657j4805j0082J4638K4206J8206
$$ plain form
17425 63711 73542 68925 28380 34192 37522 24101 9821 23813 49645 45554 32419 28704 10947
17412 10947 6592 28668 22701 21390 12909 -3784 2477 34706 5553 4445 54876 81088 64389
17399 64389 45638 38361 50266 54944 71634 72614 55380 46290 65019 64868 36840 -6025 -28784
17386 -28784 8301 36710 -6474 -10255 5182 4831 24667 7429 -15844 -3693 3843 8856 33721
17373 33721 34701 37511 2384 -737 -17162 -20640 -21781 -18182 -19211 250 1048 7098 -8513 -23755
17359 -23755 -247 17088 -5572 -30976 -40676 -13336 -25596 -27061 -29534 -28186 -15091 -6376 -5253
17346 -5253 -10556 -46108 -62269 -55854 -47691 -42580 -13661 19856 9176 -15679 -8443 13662 18639
17333 18639 18189 29495 55930 49762 25971 10968 27734 35940 19223 18110 12879 26498 33624
$$ packed form
17425F3711R831m617m0545N812L330j3421j4280J3992K5832m091j3135l715j7757
17412A0947m355K2076n967j311q481j6693O261L2229k9153j108N0431K6212j6699
17399F4389j8751p277J1905M678J6690R80j7234r090J8729j51k8028m2865k2759
17386b8784L7085K8409m3184l781J5437l51J9836j7238k3273J2151P536N013K4865
17373C3721R80K810l5127l121j6425l478j141L599j029J9461P98O050j5611j5242
17359b3755K3508J7335k2660k5404r700K7340j2260j465k473J348J3095Q715J123
17346e253n303l5552j6161O415Q163N111K8919L3517j0680k4855P236K2105M977
17333A8639m50J1306K6435o168k3791j5003J6766Q206j6717j113n231J3619P126
$$ plain form
17320 33624 3953 -4542 -7276 -2746 -2603 -52108 -30970 -4405 2074 14206 23984 20782 17946
17307 17946 -10835 -21467 -652 36621 19200 15075 43191 31560 -5473 -9105 38368 59706
17295 59706 29995 1249 -8605 -6360 -19984 -31657 -32111 -27314 -16479 -35771 -12058 8033 43326
17282 43326 61806 67332 54903 46872 43311 74995 99360 86612 79245 69538 67243 84293 91535
17269 91535 68654 73690 57491 58882 61011 51768 46657 54546 47603 26632 20465 14152 23528 19294
17255 19294 1304 -6865 -4703 -5821 3887 15983 1770 -7973 8167 912 -524 1292 -23605
17242 -23605 -66365 -43734 -8030 5114 -8027 -16679 4303 23145 18199 32868 8200 -19368
17230 -19368 -910 23114 39745 24383 20065 -5474 -13098 -6927 -11821 -30117 -40115 -62175 -39776
$$ packed form
17320C3624k9671q495k734M530J43m9505K1138K6565O479J2132R778l202k836
17307A7946k8781j0632K0815L7273j7421m125K8116j1631l7033l632M7473K1338
17295E9706k9711k8746r854K245j3624j1673m54M797J0835j9292K3713K0091L5293
17282D3326J8480N526j2429q031l561L1684K4365j2748p367r707k295J7050P242
17269I1535k2881N036j6199J391K129r243n111P889o943k0971o167o313R376m234
17255A9294j7990q169K162j118R708J2096j4213r743J6140p255j436J816k4897
17242b3605m2760K2631L5704J3144j3141q652K0982J8842m946J4669k4668k7568
17230a9368J8458K4024J6631j5362m318k5539p624O171m894j8296r998k2060K2399
$$ plain form
17217 -39776 -9086 -30810 -9016 -12180 -25740 -37786 -25018 -15895 24174 43769 52915 10551
17205 10551 5882 21681 35080 43363 41955 50033 56166 45389 55578 87933 69920 67352 43142
17192 43142 12657 16591 26437 31737 9105 14496 42448 39053 22292 41054 55353 34715 7767
17179 7767 4779 11135 28352 27728 17051 -11769 -27520 -37335 -53223 -33101 -21487 -37233 -53450
17166 -53450 -25808 2123 9412 -30879 -41023 -16190 9370 37273 30124 24576 20441 1052
17154 1052 -13169 -15391 -31778 -25905 -28789 -42155 -42649 -45269 -33806 -8657 30042 13877 14750
17141 14750 33784 23340 59319 67798 47317 54968 71280 91426 102060 108287 115640 87275
17129 87275 63795 31151 -1150 -10409 -2787 7880 4720 -13132 -15055 -11281 -17816 4145 29646
$$ packed form
17217c9776L0690k1724K1794l164j3560j2046J2768R123M0069J9595R146m2364
17205A0551m669J5799J3399Q283j408Q078O133j0777J0189L2355j8013k568k4210
17192D3142l0485L934R846N300k2632N391K7952l395j6761J8762J4299k0638k6948
17179G767k988O356J7217o24j0677k8820j5751r815j5888K0122J1614j5746j6217
17166e3450K7642K7931P289m0291j0144K4833K5560K7903p149n548m135j9389
17154A052j4221k222j6387N873k884j3366m94k620J1463K5149L8699j6165Q73
17141A4750J9034j0444L5979Q479k0481P651J6312K0146J0634O227P353k8365
17129H7275k3480l2644l2301r259P622J0667l160j7852j923L774o535K1961K5501
$$ plain form
17116 29646 24122 624 -9649 -11976 16749 27542 6771 -9279 -5777 -1330 11140 8372 2712
17103 2712 9630 50442 48733 14673 -4432 -43088 -41593 -36141 -15735 -1309 -22036 -15060 -7466
17090 -7466 12457 16366 -14087 -31701 -10824 -22654 -26328 -6817 -16918 -171 29846 37728
17078 37728 19433 18314 3219 27307 57642 48886 19334 6411 -9003 -17726 -29226 -15694
17066 -15694 990 21347 25837 13086 4607 1376 -8410 1881 38577 28755 2147 854 11358
17053 11358 17243 28980 22567 12191 15 3688 12714 -2535 -11626 -31310 -42092 -4325 -1969
17040 -1969 3480 9963 -3254 -5769 -5815 12201 23220 21989 3390 -25296 -54038 -64639 -65727
17027 -65727 -30132 -2168 28046 37941 54572 27990 24652 21439 33151 48448 33542 13719
$$ packed form
17116B9646n524k3498j0273k327K8725J0793k0771j6050L502M447J2470k768n660
17103B712O918M0812j709l4060j9105l8656J495N452K0406J4426k0727O976P594
17090g466J9923L909l0453j7614K0877j1830l674J9511j0101J6747L0017P882
17078C7728j8295j119j5095K4088L0335q756k9552j2923j5414q723j1500J3532
17066a5694J6684K0357M490j2751q479l231r786J0291L6696r822k6608j293J0504
17053A1358N885J1737o413j0376j2176L673R026j5249r091j9684j0782L7767K356
17040a969N449O483j3217k515m6J8016J1019j231j8599k8686k8742j0601j088
17027f5727L5595K7964L0214R895J6631k6582l338l213J1712J5297j4906j9823
$$ plain form
17015 13719 15157 -1993 -6481 16847 12406 19396 24630 41885 55304 32906 -11248 -24352 -29618
17002 -29618 -25810 -21034 -18807 -14475 -13042 -34950 -17453 -16935 -31738 -49060 -32202 -6227 3640
16989 3640 -15861 -28706 -25942 -43690 -26728 -45879 2327 43505 34875 -16596 -51548 -47530
16977 -47530 -40600 -31895 -8275 7346 5527 629 -5094 -30322 -41090 -58820 -54655 -42324 -46204
16964 -46204 -35373 -2182 -19440 -31936 -22128 -28888 -44683 -44579 -18726 9826 28180 28690 2372
16951 2372 7031 1867 -7311 -24906 -17624 -8366 -19185 -28079 -20055 -12689 3026 7924 -25893 -17088
16937 -17088 -4106 10466 626 -29976 -46457 -46979 -29853 -19745 -6904 993 -16893 -30621
16925 -30621 3326 11239 3956 -30716 -42491 -11195 -28378 -70042 -77098 -67969 -22739 6846
$$ packed form
17015A3719J438j7150m488K3328m441O990N234J7255J3419k2398m4154j3104n266
17002b9618L808M776K227M332J433k1908J7497N18j4803j7322J6858K5975R867
16989C640j9501j2845K764j7748J6962j9151M8206M1178q630n1471l4952M018
16977d7530O930Q705K3620J5621j819m898n723k5228j0768j7730M165J2331l880
16964d6204J0831L3191j7258j2496R808o760j5795J04K5853K8552J8354N10k6318
16951B372M659n164r178j7595P282R258j0819q894Q024P366J5715M898l3817Q805
16937a7088J2982J4572r840l0602j6481n22J7126J0108J2841P897j7886j3728
16925c0621L3947P913p283l4672j1775L1296j7183m1664p056R129M5230K9585
$$ plain form
16913 6846 10498 -38174 -56632 -34054 -18197 -42582 -36341 -26363 -17942 -11609 6156 7872 -25905
16900 -25905 -66785 -51016 -49968 -40718 -31067 -28897 -39606 -46306 -43373 -47903 -31758 -17464 -15079
16887 -15079 11705 12737 19857 13236 3576 14787 21212 8799 -10517 -23492 -10043 35793 46427
16874 46427 48526 48993 67539 33503 36884 64897 42680 -2721 -32310 -36892 -42158 -11245 599
16861 599 -33144 -38439 -35769 -22756 -20308 -7024 18352 -10165 -10160 2997 9461 21028 3477 17521
16847 17521 23805 21588 7875 -12207 -29138 -9759 -5135 -12811 -12349 4878 -34838 -32229 3461
16834 3461 18081 4234 6091 865 -18291 17624 16497 -6219 -11531 13020 8119 8225 -283
16821 -283 4269 -13786 7568 4752 -3721 -25229 -16378 8309 11212 13106 32316 28449 -2537
$$ packed form
16913F846L652m8672j8458K2578J5857k4385O241R978Q421O333J7765J716l3777
16900b5905m0880J5769J048R250R651K170j0709o700K933m530J6145J4294K385
16887a5079K6784J032P120o621r660J1211O425j2413j9316j2975J3449M5836J0634
16874D6427K099M67J8546l4036L381K8013k2217m5401k9589m582n266L0913J1844
16861E99l3743n295K670J3013K448J3284K5376k8517NJ3157O464J1567j7551J4044
16847A7521O284k217j3713k0082j6931J9379M624p676M62J7227l9716K609L5690
16834C461J4620j3847J857n226j9156L5915j127k2716n312K4551m901J06q508
16821b83M552j8055K1354k816q473k1508Q851K4687K903J894J9210l867l0986
$$ plain form
16808 -2537 -22616 -11337 -4001 -25333 -30457 -2010 24936 20105 -4918 -19916 -22433 -22719 -6024
16795 -6024 22150 22822 -13446 -55519 -64613 -49551 -48186 -41523 -30026 12853 15717 27555 33055
16782 33055 -26353 1740 3500 4504 10548 -3779 15284 27802 -15046 -38150 2384 14527
16770 14527 -36610 -61104 -49354 -11559 -690 -651 18182 38367 11647 -10985 -20646 -7188
16758 -7188 3345 15765 37315 16837 -6437 -19264 -28926 -29388 -13870 -14655 -7833 -6436 -9946
16745 -9946 5295 14627 -17928 -21045 -18936 -37116 -57050 -75110 -73495 -60207 -48203 -31016 -11305
16732 -11305 102 9992 -3124 6209 13626 12136 -9490 -24467 -4766 -14760 1933 33171 39810
16719 39810 16200 4256 935 -7926 -25477 -2234 19212 32018 31988 11785 17261 -3376 -18183
$$ packed form
16808b537k0079J1279P336k1332n124K8447K6946m831k5023j4998k517k86J6695
16795f024K8174O72l6268m2073r094J5062J365O663J1497M2879K864J1838N500
16782C3055n9408K8093J760J004O044j4327J9063J2518m2848k3104M0534J2143
16770A4527n1137k4494J1750L7795J0869L9J8833K0185k6720k2632r661J3458
16758g188J0533J2420K1550k0478k3274j2827r662m62J5518p85O822J397l510
16745i946J5241R332l2555l117K109j8180j9934j8060J615J3288J2004J7187J9711
16732a1305J1407R890j3116R333P417j490k1626j4977J9701r994J6693L1238O639
16719C9810k3610j1944l321q861j7551K3243K1446J2806l0k0203N476k0637j4807
$$ plain form
16706 -18183 -21779 -32297 -16609 -18174 -32301 -28254 -15102 -15157 -25504 -9363 18705 4663 15692
16693 15692 14467 3095 -24783 -22416 -9429 -26673 -54058 -57095 -44155 -51299 -40953 -28219
16681 -28219 -14441 -37902 -13428 -2933 -19693 -22234 -12396 10845 -1688 4081 7272 3454 1799
16668 1799 -26809 -46178 -20622 -6186 -7048 -1749 20219 36193 29791 27524 33048 35973 49432
16655 49432 52037 23909 6159 -4336 -22472 -3751 4118 -9297 11556 10356 5144 -6912
16643 -6912 -23403 12611 29421 17999 19537 22667 24104 35935 7364 3294 13446 7990 -27860
16630 -27860 -30221 -22802 -12535 35243 40393 32755 37443 38284 45740 84933 94915 60011 33989
16617 33989 13757 -2377 -30591 -39321 -19036 -6791 -13293 -19350 -15567 -9737 -492 2414 -5871
$$ packed form
16706a8183l596j0518J5688j565j4127M047J3152n5j0347J6141K8068j4042J1029
16693A5692j225j1372k7878K367J2987j7244k7385l037J2940p144J0346J2734
16681b8219J3778k3461K4474J0495j6760k541R838K3241j2533N769L191l818j655
16668A799k8608j9369K5556J4436q62N299K1968J5974o402k267N524K925J3459
16655D9432K605k8128j7750j0495j8136J8721P869j3415K0853j200n212j2056
16643f912j6491L6014J6810j1422J538L130J437J1831k8571m070J0152n456l5850
16630b7860k361P419J0267M7778N150p638M688Q41P456L9193R982l4904k6022
16617C3989k0232j6134k8214q730K0285J2245o502o057L783N830R245K906q285
$$ plain form
16604 -5871 -5369 3786 -6447 -16263 -22397 -7016 7875 3216 15999 1199 -19423 -42200 -52701
16591 -52701 -37686 -57406 -86616 -75123 -37899 -19737 -10758 -5594 -1969 23980 55107 43074
16579 43074 17942 2149 -5511 -20723 13134 12006 -13600 -35606 -23888 -22494 -31445 -13632
16567 -13632 -15060 -19697 -25443 6362 -3824 -20179 -325 22351 3125 -17320 -28045 -44902
16555 -44902 -60521 -48809 -15723 1362 19929 25257 30284 20121 2753 -10744 -14875 -1878
16543 -1878 -9637 -22229 -18308 -9569 403 18822 42734 34237 40255 39117 40631 55060 54662 19545
16529 19545 4030 17227 -19296 -33524 -40439 -48973 -45853 -47906 14151 22834 3950 -52266 -57395
16516 -57395 -41989 -34182 -36096 -32492 -41212 -54849 -42855 -4477 -8494 -9728 -31936 -33607 -64075
$$ packed form
16604e871N02R155j0233r816o134J5381J4891m659J2783j4800k0622k2777j0501
16591e2701J5015j9720k9210J1493L7224J8162Q979N164L625K5949L1127j2033
16579D3074k5132j5793p660j5212L3857j128k5606k2006J1718J394q951J7813
16567a3632j428m637n746L1805j0186j6355J9854K2676j9226k0445j0725j6857
16555d4902j5619J1712L3086J7085J8567N328N027j0163j7368j3497m131J2997
16543a878p759j2592L921Q739R972J8419K3912q497O018j138J514J4429l98l5117
16529A9545j5515J3197l6523j4228o915q534L120k053O2057Q683j8884n6216n129
16516e7395J5406P807j914L604q720j3637J1994L8378m017j234k2208j671l0468
$$ plain form
16503 -64075 -67612 -65853 -50077 -24546 -2624 -1279 13599 26856 -2836 -23255 685 -175 -12928
16490 -12928 -34535 -5476 22727 19392 13368 32061 11941 -12236 12151 18028 24588 10024
16478 10024 -13765 -6015 -17823 -21806 -39530 -9368 15918 7587 -6544 6462 -3415 -11714 -31184
16465 -31184 -21057 -19095 24773 36546 40998 50359 32333 -7189 -32312 -40253 -9009 11116
16453 11116 27858 13098 9158 4819 6466 20628 18521 33475 46127 31876 31145 -807 -2228
16440 -2228 -14153 -24215 -31752 -25362 -42820 -42390 17178 12930 5140 -36838 -36694 -17546 -20412 -37103
16426 -37103 -25186 -6726 -5484 16094 40825 47055 16332 -18388 -29633 -34112 -18355 -3348
16414 -3348 -7917 -13709 4294 31099 269 -25587 -44529 -63107 -42641 -3516 -10410 -5489 13761
$$ packed form
16503f4075l537J759J5776K5531K1922J345J4878J3257k9692k0419K3940q60j2753
16490a2928k1607K9059K8203l335o024J8693k0120k4177K4387N877O560j4564
16478A0024k3789P750j1808l983j7724L0162K5286q331j4131J3006r877q299j9470
16465c1184J0127J962M3868J1773M452R361j8026l9522k5123p941L1244K0125
16453A1116J6742j4760l940m339J647J4162k107J4954J2652j4251p31l1952j421
16440b228j1925j0062p537O390j7458M30N9568m248p790m1978J44J9148k866j6691
16426c7103J1917J8460J242K1578K4731O230l0723l4720j1245m479J5757J5007
16414c348m569n792J8003K6805l0830k5856j8942j8578K0466L9125o894M921J9250
$$ plain form
16401 13761 18829 16719 36176 3514 -8081 -11032 -13214 -26866 -23301 -6444 -17271 -13750 -510
16388 -510 -11132 255 -12372 -10344 -2770 -1568 36551 28568 9407 25943 47168 19062 7572
16375 7572 7799 -63 2639 -7936 -12548 2212 39175 -2368 -33235 -36782 -26165 -12558 -11778
16362 -11778 -38931 -64729 -57116 -73557 -65863 -10498 15445 160 -9933 20276 25894 9726
16350 9726 3709 13458 -6507 -28662 -16081 -15198 -37149 -12783 22653 28582 7693 -4510 -35806
16337 -35806 -28203 -29250 -21081 -12227 -19923 -32269 -46879 -36452 -15916 -27417 -22473 240 8150
16324 8150 23564 23897 24404 21901 -12285 -21798 -39459 -52206 -51322 -4995 1769 -4549 -19901 -24883
16310 -24883 -29250 -31071 -56035 -40002 -14943 5570 -843 11594 13299 -11288 -31094 -28977 -11494
$$ packed form
16401A3761N068k110J9457l2662j1595k951k182j3652L565J6857j0827L521J3240
16388e10j0622J1387j2627K028P574J202L8119p983j9161J6536K1225k8106j1490
16375G572K27p862K702j0575m612J4760L6963m1543l0867l547J0617J3607P80
16362a1778k7153k5798P613j6441P694N5365K5943j5285j0093L0209N618j6168
16350I726o017R749j9965k2155J2581Q83k1951K4366L5436N929k0889j2203l1296
16337c5806P603j047Q169Q854p696j2346j4610J0427K0536j1501M944K2713P910
16324H150J5414L33N07k503l4186r513j7661j2747Q84M6327O764o318j5352m982
16310b4883m367j821k4964J6033K5059K0513o413J2437J705k4587j9806K117J7483
$$ plain form
16297 -11494 -5953 -12321 -12031 12685 48565 52609 23422 12482 7954 -18221 -24799 -9838 -28143
16284 -28143 -10452 8738 20378 16141 4946 -40515 -73752 -52506 -10867 1456 17037 -658
16272 -658 -20443 -50280 -46110 -15391 -8803 -4501 -8836 -9973 -3216 5331 -1728 -16083 -25937 -36911
16258 -36911 -58648 -22216 -3195 -20581 -55662 -36414 -23102 -12866 -10168 -23600 -25956 -6412
16246 -6412 -21092 -20374 -10770 -9677 -20996 -53180 -33680 -28828 -10354 39391 56816 26686 -12924
16233 -12924 -39863 -44511 -25558 -37392 -38862 -39012 -48207 -15677 2511 -33013 -27327 -22963 -25950
16220 -25950 -29724 -18680 -7654 -3120 -1741 -1860 -1266 -1012 13971 29856 32318 21923 831 -1723
16206 -1723 -11278 3148 12693 15741 12731 2068 2728 1844 -4414 -14849 -9987 5447 17709 42203
$$ packed form
16297a1494N541o368K90K4716L5880M044k9187j0940m528k6175o578J4961j8305
16284b8143J7691J9190J1640m237j1195m5461l3237K1246M1639J2323J5581j7695
16272f58j9785k9837M170L0719O588M302m335j137O757Q547p059j4355r854j0974
16258c6911k1737L6432J9021j7386l5081J9248J3312J0236K698j3432k356J9544
16246f412j4680P18R604J093j1319l2184J9500M852J8474M9745J7425l0130l9610
16233a2924k6939m648J8953j1834j470j50r195L2530J8188l5524N686M364k987
16220b5950l774J1044J1026M534J379j19N94K54J4983J5885K462j0395k1092k554
16206a723r555J4426R545L048l010j0663O60q84o258j0435M862J5434J2262K4494
$$ plain form
16192 42203 48855 54687 27094 12126 -903 -6142 12728 19153 -2569 -29050 -16096 -7660 -14512
16179 -14512 3660 5274 6058 19170 34356 37841 13866 21069 37864 21520 16956 19202 16189
16166 16189 17283 6120 22337 23061 -2168 7296 9526 17654 31679 36347 44093 41862 18784
16153 18784 783 80 16066 -2934 -37477 -49959 -52550 -32000 -20033 -12693 6749 -11556
16141 -11556 -31867 -29306 -16990 -6398 -37964 -55356 -26031 -48930 -67819 -60087 -28811 -22798
16129 -22798 -34351 7241 3918 2601 -20902 -39199 -25457 -6156 -18926 -1665 -2231 -9835 4399
16116 4399 7392 26144 35024 26555 28262 41475 48819 -1404 -24075 695 -21449 -85545 -85831
16103 -85831 -54881 -33520 -31180 -28855 -42889 -28782 -30686 -29151 -24129 -7920 3222 19924 38846
$$ packed form
16192D2203O652N832k7593j4968j3029n239J8870O425k1722k6481J2954Q436o852
16179a4512J8172J614P84J3112J5186L485k3975P203J6795j6344m564K246l013
16166A6189J094j1163J6217P24k5229R464K230Q128J4025M668P746k231k3078
16153A8784j8001p03J5986j9000l4543j2482k591K0550J1967P340J9442j8305
16141a1556k0311K561J2316J0592l1566j7392K9325k2899j8889P732L1276O013
16129b2798j1553M1592l323j317k3503j8297J3742J9301j2770J7261n66p604J4234
16116D399K993J8752Q880q469J707J3213P344n0223k2671K4770k2144o4096k86
16103h5831L0950K1361K340K325j4034J4107j904J535N022J6209J1142J6702J8922
$$ plain form
16090 38846 33193 28579 29529 23556 -2202 7110 39596 24178 19622 -811 -27152 -28098 -34199 -37611
16076 -37611 877 14239 9423 29689 17866 10817 10262 -3427 22952 47277 36182 555
16064 555 -21688 21460 62108 42182 13777 7121 -1229 7757 14894 -10744 -30029 -34461 -28815
16051 -28815 -13681 -9881 -21360 -32216 -32059 -25700 2063 19667 5957 -470 9241 -6224 -15995
16038 -15995 -31757 -43349 -34722 -18294 3973 6931 -9196 9414 21064 4384 -26798 -49492
16026 -49492 -45353 -37795 -36355 -18484 -7600 -34089 -60386 -46082 -49242 -46292 -50490 -24423 -19398
16013 -19398 -5264 364 -18570 -17641 -16259 -363 -5957 -4483 18957 24534 1646 -2814 -17874
16000 -17874 -25692 -35471 -32453 -21985 -23552 -32097 -53931 -69593 -26738 14522 5812 9397 -10580
$$ packed form
16090C8846n653m614R50n973k5758R312L2486j5418m556k0433k6341r46o101l412
16076c7611L8488J3362m816K0266j1823p049n55j3689K6379K4325j1095l5627
16064E55k2243M3148M0648j9926k8405o656q350Q986P137k5638j9285m432N646
16051b8815J5134L800j1479j0856J57O359K7763J7604j3710o427R711j5465r771
16038a5995j5762j1592Q627J6428K2267K958j6127J8610J1650j6680l1182k2694
16026d9492M139P558J440J7871J0884k6489k6297J4304l160K950m198K6067N025
16013a9398J4134N628j8934R29J382J5896n594J474K3440N577k2888m460j5060
16000a7874p818r779L018J0468j567q545k1834j5662M2855M1260q710L585j9977
$$ plain form
15987 -10580 -15867 -14080 -24489 -6269 -14407 -22337 -34092 -49379 -19110 -10165 -49537 -66203 -38849
15974 -38849 -3806 20961 19731 16807 8527 4412 -7611 -24906 -8928 -22239 -13591 17103 13724
15961 13724 800 25421 24512 -619 -9094 -26967 -14112 -42581 -68815 -24463 18698 10722
15949 10722 -20860 -37464 -26918 664 9722 21270 21709 2764 10566 7901 9024 1278 2267
15936 2267 17593 30520 23175 39623 17183 11520 -1910 -16669 -42532 -14900 -8403 -12288 -10238
15923 -10238 -4949 -14788 -24084 -19038 -17232 -27631 -10197 -13138 -20394 -21178 -28040 -40344 -24669 -21943
15909 -21943 -26407 -14746 -14051 -41638 -41215 -5311 33189 43746 23744 23513 1659 -3305 9594
15896 9594 8781 -15303 -58654 -68343 -37769 -60419 -65672 -62496 -27278 -17825 28476 50673 59532
$$ packed form
15987a0580n287J787j0409J8220q138p930j1755j5287L0269Q945l9372j6666K7354
15974c8849L5043K4767j230k924q280m115j2023j7295J5978j3311Q648L0694l379
15961A3724j2924K4621r09k5131q475j7873J2855k8469k6234M4352M3161p976
15949A0722l1582j6604J0546K7582R058J1548M39j8945P802k665J123p746R89
15936B267J5326J2927p345J6448k2440n663j3430j4759k5863K7632O497l885K050
15923a0238N289r839r296N046J806j0399J7434k941p256p84o862j2304J5675K726
15909b1943m464J1661O95k7587M23L5904L8500J0557k0002k31k1854m964J2899
15896I594q13k4084m3351r689L0574k2650n253L176L5218R453M6301K2197Q859
$$ plain form
15883 59532 79541 56061 25663 23818 44287 29466 -7096 -13565 -33082 -35058 -32611 -23574 -23000
15870 -23000 -35410 -19581 -21655 -24509 -51406 -61342 -40184 -10019 -3755 -16379 -21906 -14563 -15541
15857 -15541 -3113 12672 -14057 -38007 -50030 -38836 -24288 -30707 -8021 17155 17966 18220 -7535
15844 -7535 -24005 -25 23345 23432 -502 -1302 15106 5236 2265 22696 15402 -573 10374
15831 10374 -8331 -13490 -29690 -26175 -25382 -14265 -15057 -16236 -23688 -24785 -25250 -57150 -72627 -40858
15817 -40858 -22438 -14168 -9704 -22014 -46828 -27943 -15436 -21377 -20106 -13296 7282 8131 2936
15804 2936 -3343 -1612 -22744 -52870 -42749 -43364 -37940 -16171 -14177 742 1987 -12875 -46987
15791 -46987 -28773 -18475 6933 18113 13532 -29571 -66851 -67456 -43381 -48088 -52222 -40822 -33678
$$ packed form
15883E9532K0009k3480l0398j845K0469j4821l6562o469j9517j976K447R037N74
15870b3000j2410J5829k074k854k6897r936K1158L0165O264j2624n527P343r78
15857a5541J2428J5785k6729k3950j2023J1194J4548o419K2686K5176Q11K54k5755
15844g535j6470K3980K3370Q7k3934q00J6408r870k971K0431p294j5975J0947
15831A0374j8705n159j6200L515P93J1117p92j179p452j097m65l1900j5477L1769
15817d0858J8420Q270M464j2310k4814J8885J2507n941J271O810K0578Q49n195
15804B936o279J731k1132l0126J0121o15N424K1769J994J4919J245j4862l4112
15791d6987J8214J0298K5408J1180m581m3103l7280o05K4075m707m134J1400P144
$$ plain form
15778 -33678 -4901 -189 24483 24336 -3903 1238 -1184 -13900 -40971 -47850 -43887 -47266 -44876
15765 -44876 -42431 -21083 -33385 -20659 1520 -26197 -67861 -75190 -67854 -30694 -29894 -58093 -67567
15752 -67567 -43290 -17162 -766 18393 -5438 -11921 -5450 -13830 -44934 -32026 -20077 -10804
15740 -10804 -7369 -2672 -38119 -45988 -33748 -35392 -29481 7428 9927 10077 14126 -9887 -37578
15727 -37578 -28492 -14767 863 -6157 -26365 -12688 13713 -9720 -24042 7459 26879 28112
15715 28112 17846 44917 51684 -3432 -10998 -13845 -17738 585 18310 437 -6958 15964 28518
15702 28518 -4787 -15462 -38103 -43299 -48706 -22245 -7425 -29485 -21213 -562 -6777 -19070
15690 -19070 -16078 16544 13725 -5275 -44030 -65329 -15987 -10002 -22667 -24959 -13204 17324
$$ packed form
15778c3678K8777M712K4672j47k8239N141k422j2716k7071o879L963l379K390
15765d4876K445K1348j2302J2726K2179k7717m1664p329P336L7160Q00k8199r474
15752f7567K4277K6128J6396J9159k3831o483O471q380l1104J2908J1949R273
15740a0804L435M697l5447p869J2240j644N911L6909K499J50M049k4013k7691
15727c7578R086J3725J5630p020k0208J3677K6401k3433j4322L1501J9420J233
15715B8112j0266K7071O767n5116p566k847l893J8323J7725j7873p395K2922J2554
15702B8518l3305j0675k2641n196n407K6461J4820k2060Q272K0651o215j2293
15690a9070K992L2622k819j9000l8755k1299M9342N985j2665k292J1755L0528
$$ plain form
15678 17324 182 -13034 -22983 -2353 13520 -33 8079 7381 -800 -4697 -10487 -12575 -38224
15665 -38224 -70715 -57967 -45739 -42634 -8576 12404 6024 9944 7563 -23585 -11886 -2787 6391
15652 6391 14659 10603 -24551 -41945 -14839 15763 -1329 -3726 -17786 -26645 -24152 -15161 -15142 -14587
15638 -14587 -9771 -11662 -19315 -548 22060 29796 -10851 -32415 -6887 2230 11517 1509 9082
15625 9082 35918 19284 -10186 -9497 7845 8766 -3781 -25 -1360 -20677 -20778 -27588 -11235 16632
15611 16632 11221 17605 43553 24099 -4761 16074 54429 33705 10602 7476 -746 10796
15599 10796 25812 15836 37152 76312 57785 40979 35845 25470 30541 2495 4037 27778
15587 27778 55735 21291 -15094 -21412 -21852 -32392 -31184 -604 -7775 -22098 10046 12555 5252
$$ packed form
15678A7324j7142j3216r949K0630J5873j3553Q112o98q181l897n790k088k5649
15665c8224l2491J2748J2228L105L4058K0980o380L920k381l1148J1699R099R178
15652F391Q268m056l5154j7394K7106L0602j7092k397j4060q859K493Q991J9N55
15638a4587M816j891p653J8767K2608P736m0647k1564K5528R117R287j0008P573
15625I082K6836j6634k9470O89J7342R21j2547L756j335j9317j01o810J6353K7867
15611A6632n411O384K5948j9454k8860K0835L8355k0724k3103l126q222J1542
15599A0796J5016r976K1316L9160j8527j6806n134j0375N071k8046J542K3741
15587B7778K7957l4444l6385o318m40j0540J208L0580p171j4323L2144K509p303
$$ plain form
15574 5252 6093 -30799 -39945 -8268 6225 10674 27717 10882 20035 60038 63285 25334 -2613
15561 -2613 11652 4158 2878 15322 22068 15997 1391 -13012 -34725 -40660 -17640 1638 14081
15548 14081 618 -12057 11478 14987 32642 16518 -2838 11421 3661 2074 15957 31235
15536 31235 51493 53690 29048 10468 18939 6162 -10308 -7222 -16533 -16097 -27126 -17837 -29454
15523 -29454 -43629 -12479 -14035 -36199 -17041 -18897 -21891 1693 5547 16796 34835 14098
15511 14098 -11184 -13197 15883 42151 56228 31794 26675 29899 21324 38176 37615 57199 53929
15498 53929 32809 19270 -20200 -29255 -26723 -34052 -9511 -7624 -25343 -14433 -26964 -9261
15486 -9261 -3052 -25788 2407 -11009 7363 29289 28300 2243 47814 57052 18705 -2840 -34861
$$ packed form
15574E252Q41l6892r146L1677J4493M449J7043j6835R153M0003L247l7951k7947
15561b613J4265p494j280J2444O746o071j4606j4403k1713n935K3020J9278J2443
15548A4081j3463j2675K3535L509J7655j6124j9356J4259p760j587J3883J5278
15536C1235K0258K197k4642j8580Q471j2777j6470L086r311M36j1029R289j1617
15523b9454j4175L1150j556k2164J9158j856k994K3584L854J1249J8039k0737
15511A4098k5282k013K9080K6268J4077k4434n119L224q575J6852n61J9584l270
15498E3929k1120j3539l9470r055K532p329K4541J887j7719J0910j2531J7703
15486i261O209k2736K8195j3416J8372K1926r89k6057M5571R238l8347k1545l2021
$$ plain form
15473 -34861 -26005 -12859 24986 53463 16929 -11831 -22375 -32731 -40268 -30529 -13836 -10266
15461 -10266 -38049 -45977 -3128 9070 35290 21599 -8485 17812 37156 50563 42892 19816
15449 19816 5009 -21733 -42334 -8756 -2659 7180 16761 -2010 -14988 -12684 -31437 -40188 -16998
15436 -16998 -17832 -3486 -15443 -17087 481 45109 66681 43930 35005 22392 37710 23872
15424 23872 29281 27433 21569 -3203 -21747 -50300 -47072 -31369 -37174 -27770 -5431 -35385 -53860
15411 -53860 -48458 -33130 -24033 -1169 20025 24202 18131 40408 32075 30250 40527 20271 -42125
15398 -42125 -71897 -42845 -27151 -24975 -5439 14976 29102 16998 4078 23902 29294 27718
15386 27718 31471 24199 22590 -391 -5154 6438 -6451 -22866 1615 10835 36511 65632 49941
$$ packed form
15473c4861Q856J3146L7845K8477l6534k8760j0544j0356p537R739J6693L570
15461a0266k7783p928M2849J2198K6220j3691l0084K6297J9344J3407p671k3076
15449A9816j4807k6742k0601L3578O097R839R581j8771j2978K304j8753q751K3190
15436a6998q34J4346j1957j644J7568M4628K1572k2751q925j2613J5318j3838
15424B3872N409j848n864k4772j8544k8553L228J5703n805R404K2339k9954j8475
15411e3860N402J5328R097K2864K1194M177o071K2277q333j825J0277k0256o2396
15398d2125k9772K9052J5694K176J9536K0415J4126j2104j2920J9824N392j576
15386B7718L753p272j609k2981m763J1592j2889j6415K4481R220K5676K9121j5691
$$ plain form
15373 49941 36764 31360 29345 6671 21220 44161 50615 60860 42843 38189 49831 15304
15361 15304 -17342 -30935 -30398 -18964 -2210 16741 7560 -22601 -17246 -14248 -1052 34481 49766
15348 49766 20349 41130 49062 25042 7967 2904 -23177 -14797 -20713 -11441 -1806 19965 23142
15335 23142 4244 -10092 -2613 -35717 -51299 -55409 -46040 -47461 -52400 -41365 -19090 -9275 11811
15322 11811 -5572 -22870 -28131 -54773 -67637 -61309 -60297 -62419 -38908 -8909 11266 -12670
15310 -12670 -42332 -49264 -62755 -47198 -27623 -1984 -2855 -13930 -10194 -4044 -7595 13020 18957
15297 18957 15096 5406 -7841 -32901 -38226 -26243 -47095 -46180 -35033 -28831 -6046 35239 43704
15284 43704 35699 3676 -30758 -38943 -25001 -20175 -3825 -27670 -27292 1074 21688 12756 16453
$$ packed form
15373D9941j3177n404k015k2674J4549K2941O454J0245j8017m654J1642l4527
15361A5304l2646j3593N37J1434J6754J8951r181l0161N355K998J3196L5533J5285
15348D9766k9417K0781P932k4020j7075n063k6081Q380n916R272R635K1771L177
15335B3142j8898j4336P479l3104j5582m110R369j421m939J1035K2275R815K1086
15322A1811j7383j7298n261k6642j2864O328J012k122K3511K9999K0175k3936
15310a2670k9662o932j3491J5557J9575K5639q71j1075L736O150l551K0615N937
15297A8957l861r690j3247k5060n325J1983k0852R15J1147O202K2785M1285Q465
15284D3704q005l2023l4434q185J3942M826J6350k3845L78K8366K0614q932L697
$$ plain form
15271 16453 21441 30058 21221 22127 27877 31526 34932 12624 3985 -10912 -27790 -13326 13762
15258 13762 37846 11339 9660 3238 -24982 -4474 32710 11350 11738 24367 19051 12571 3576
15245 3576 -9790 -8487 -5451 10132 36112 41807 29996 21320 29705 42491 45822 12700 17
15232 17 742 17750 27675 -2021 -43074 -31148 -13994 19300 1293 2812 14627 27099 19843
15219 19843 18035 19420 26403 29605 25639 33393 28791 9354 -3802 1451 359 -18089 20151
15206 20151 30252 26808 45433 28007 -19405 -3028 60683 70743 32706 -15534 -5217 11184
15194 11184 1418 8276 11566 29688 6042 -18758 -21406 -9755 -52 -16296 -12607 673 -5199
15181 -5199 11494 33986 45095 53796 55725 29727 28312 21960 31750 16005 4231 -444 3753
$$ packed form
15271A6453M988Q617q837R06N750L649L406k2308q639j4897j6878J4464K7088
15258A3762K4084k6507j679o422k8220K0508L7184k1360L88J2629n316o480q995
15245C576j3366J303L036J5583K5980N695j1811q676Q385J2786L331l3122j2683
15232A7P25J7008R925k9696m1053J1926J7154L3294j8007J519J1815J2472p256
15219A9843j808J385O983L202l966P754m602j9437j3156N253j092j8448L8240
15206B0151J0101l444J8625j7426m7412J6377O3711J0060l8037m8240J0317J6401
15194A1184r766O858L290J8122k3646k4800k648J1651R703j6244L689J3280n872
15181e199J6693K2492J1109Q701J929k5998j415o352R790j5745j1774m675M197
$$ plain form
15168 3753 7672 28027 10749 -14324 -38871 -18238 -11338 -21152 -10926 10413 13828 -15386 -50335
15155 -50335 -33120 -31189 -36457 -41905 -16204 -2653 8100 13509 6252 7174 -34868 -41037 -58399
15142 -58399 -34232 645 -5964 -23048 -12671 -12341 -13742 -40320 -66405 -84055 -74294 -68309 -43884
15129 -43884 -30352 1342 34864 7444 -31454 -17414 -754 29676 59105 32556 4193 -3245
15117 -3245 -6381 962 23223 33777 28989 14900 32250 50497 31944 17391 -5055 -4310 -9390
15104 -9390 -29870 -50576 -32054 -14964 7661 22940 21449 31299 28785 -2863 -1269 23931 -1684
15091 -1684 -28697 -33545 -24660 -14552 -8447 -24279 -45185 -20084 7582 29251 -7694 -13350 -5024
15078 -5024 10797 -8172 -14005 -4247 12321 7576 1894 -31406 -54582 -31535 -43152 -53961 -53819
$$ packed form
15168C753L919K0355j7278k5073k4547K0633O900r814J0226K1339L415k9214l4949
15155e0335J7215J931n268n448K5701J3551J0753N409p257R22m2042o169j7362
15142e8399K4167L4877o609j7084J0377L30j401k6578k6085j7650R761N985K4425
15129d3884J3532L1694L3522k7420l8898J4040J6660L0430K9429k6549k8363p438
15117c245l136P343K2261J0554m788j4089J7350J8247j8553j4553k2446P45n080
15104i390k0480k0706J8522J7090K2625J5279j491R850k514l1648J594K5200k5615
15091a684k7013m848Q885J0108O105j5832k0906K5101K7666K1669l6945n656Q326
15078e024J5821j8969n833R758J6568m745n682l3300k3176K3047j1617j0809J42
$$ plain form
15065 -53819 -52981 -75882 -64617 -52079 -56747 -44954 -56538 -50698 -61486 -63283 -27497 -1138 -37070
15052 -37070 -68432 -70546 -43241 -19949 6267 16879 17647 28777 30026 34599 5649 -9477 -10470
15039 -10470 -6428 12116 16739 5871 -8550 -7147 -27877 -14197 -14242 16929 27027 37235 15310
15026 15310 -30708 -61269 -62667 -36285 -44051 -35697 -37570 -47734 -27939 5898 -7995 -2479 25551
15013 25551 42601 28318 -11929 -24318 9688 13007 -25829 -19109 -21049 -216 21758 -5373
15001 -5373 -16747 4817 5400 -13338 -19975 27099 37904 -1208 -34894 -15171 -13509 -30746 -23375
14988 -23375 -24638 -28678 -43318 -41401 -66824 -42960 -2428 2340 15834 9605 25249 7396 -2421
14975 -2421 20596 51947 14378 -8554 8261 -2586 -26915 -25898 -8349 -5097 -7558 -6550 -8432
$$ packed form
15065e3819Q38k2901J1265J2538m668J1793j1584N840j0788j797L5786K6359l5932
15052c7070l1362k114K7305K3292K6216J0612P68J1130J249M573k8950j5126r93
15039a0470M042J8544M623j0868j4421J403k0730J3680m5L1171J0098J0208k1925
15026A5310m6018l0561j398K6382p766Q354j873j0164J9795L3837j3893N516K8030
15013B5551J7050j4283m0247j2389L4006L319l8836O720j940K0833K1974k7131
15001e373j1374K1564N83j8738o637M7074J0805l9112l3686J9723J662j7237P371
14988b3375j263m040j4640J917k5423K3864M0532M768J3494o229J5644j7853r817
14975b421K3017L1351l7569k2932J6815j0847k4329J017J7549L252k461J008j882
$$ plain form
14962 -8432 -26135 -12942 -6437 7793 21491 14902 19593 -24080 -25769 -31146 -10346 14985 5783
14949 5783 -5736 932 18138 55253 35577 2201 -6329 -8627 -7686 -15386 -22524 -29032 -28549 -24867
14935 -24867 -15565 12498 30134 23008 15091 -495 -13597 -31883 -21331 -13411 -14696 -15634 10903
14922 10903 -3312 -14626 -15011 1204 -6057 -24175 -30852 -10622 -18343 -14593 -10405 5975 -16399
14909 -16399 -27678 1798 -4713 -6326 -7875 -4435 -21477 -54470 -47954 -37303 -43527 -59141 -38865
14896 -38865 -22772 16203 29247 14440 1976 -9064 -3329 11373 -968 5017 24776 8096
14884 8096 -7349 -11788 -30001 -18063 -3192 12967 11754 -13411 -6528 -1045 22809 20484 27635
14871 27635 29577 13676 6059 -14093 -41860 -35694 -3487 2139 -1248 5413 8750 12396 -3767
$$ packed form
14962h432j7703J3193O505J4230J3698o589M691m3673j689n377K0800K5331r202
14949E783j1519O668J7206L7115j9676l3376q530k298R41p700p138o508M83L682
14935b4867R302K8063J7636p126p917j5586j3102j8286J0552P920j285r38K6537
14922A0903j4215j1314l85J6215p261j8118o677K0230p721L750M188J6380k2374
14909a6399j1279K9476o511j613j549L440j7042l2993O516J0651o224j5614K0276
14896c8865J6093L8975J3044j4807j2464j1040N735J4702j2341N985J9759j6680
14884H096j5445m439j8213J1938J4871J6159j213k5165O883N483K3854k325P151
14871B7635J942j5901p617k0152k7767O166L2207N626l387O661L337L646j6163
$$ plain form
14858 -3767 -2387 -4456 14973 36457 24109 2242 -8864 1700 -20664 -42656 -12960 -16710
14846 -16710 -10419 3465 12346 11589 17517 -4454 2490 16703 35922 43825 37444 29071 24429 10199
14832 10199 -10671 -17480 -10081 -313 -14341 5877 -4904 -13336 -16778 -13049 -27342 -9424 14262
14819 14262 39953 46012 28718 14344 42267 33908 19503 -21685 -57519 -24819 -17416 16006
14807 16006 36801 12236 5492 3220 1137 14801 1308 620 -19593 -22985 -4149 14145 13832
14794 13832 18504 33085 23442 2767 -19384 -72147 -60953 -42766 -21800 -18325 -31547 -26556
14782 -26556 -44879 -33660 -23684 -38880 -32034 -15537 -14748 -31865 -35361 -51809 -49525 -30853 -23798
14769 -23798 -21772 -967 28614 21901 17637 34841 25368 20092 -151 -11489 9358 22857 18215
$$ packed form
14858c767J380k069J9429K1484j2348k1867j1106J0564k2364k1992K9696l750
14846a6710O291J3884Q881p57N928k1971O944J4213J9219P903o381q373m642j4230
14832A0199k0870o809P399R768j4028K0218j0781q432l442L729j4293J7918K3686
14819A4262K5691O059j7294j4374K7923q359j4405m1188l5834L2700P403L3422
14807A6006K0795k4565o744k272k083J3664j3493o88k0213l392J8836J8294l13
14794A3832M672J4581r643k0675k2151n2763J1194J8187K0966L475j3222M991
14782b6556j8323J1219R976j5196O846J6497P89j7117l496j6448K284J8672P055
14769b3798K026K0805K9581o713m264J7204r473n276k0243j1338K0847J3499m642
$$ plain form
14756 18215 15669 4745 11437 23005 34976 49735 39795 25094 40699 41784 42210 13413 6641
14743 6641 16707 21091 23056 10471 7399 -7652 -10122 8972 6137 6339 8815 -380 2785 -16556
14729 -16556 -27062 -9250 466 -3507 5004 27238 10525 -5929 -19629 -2138 23234 -25919
14717 -25919 -33704 -6563 -18431 -27061 -28578 -12650 -35703 -59643 -51315 -23581 -34454 -57793
14705 -57793 -51301 -50776 -19359 10090 31683 -1683 -41259 -54572 -2934 12574 -27867 -15614
14693 -15614 -28801 -52846 -46860 -45741 -66784 -74596 -58346 -13918 14436 15721 24465 16501 11528
14680 11528 -248 -23297 -19283 -29705 -28821 -39284 -36858 -42439 -16239 -7168 1626 -4537 -19542
14667 -19542 98 -1179 -7932 -14496 -6523 10539 3574 -3191 -6506 8833 11404 -2981 -9285
$$ packed form
14756A8215k546j0924O692J1568J1971J4759r940j4701J5605J085M26k8797o772
14743F641J0066M384J965j2585l072j5051k470J9094k835K02K476r195L165j9341
14729a6556j0506J7812R716l973Q511K2234j6713j6454j3700J7491K5372m9153
14717b5919p785K7141j1868q630j517J5928k3053k3940Q328K7734j0873k3339
14705e7793O492N25L1417K9449K1593l3366l9576j3313N1638J5508m0441J2253
14693a5614j3187k4045N986J119k1043p812J6250M4428K8354J285Q744p964m973
14680A1528j1776k3049M014j0422Q84j0463K426n581K6200R071Q794o163j5005
14667a9542J9640j277o753o564P973J7062o965o765l315J5339K571j4385o304
$$ plain form
14654 -9285 -15753 -21841 -20711 3544 19319 21483 26723 6704 17289 16184 2013 309 -258 -32229
14640 -32229 -44719 -26190 6584 -12783 -36622 -39686 -21203 -16333 -41543 -57791 -50886 -29924
14628 -29924 -18328 -9159 -24078 -9054 -870 957 38371 19437 -16448 -51943 -30839 -13699
14616 -13699 -25461 -17440 -19766 -14303 -23464 -15151 -17151 1287 -19048 -32125 7567 23395 27249
14603 27249 673 10853 13987 -13242 -14060 3600 794 -17712 -42469 -21523 -29672 -38327 -13462
14590 -13462 -11031 -42554 -83113 -70156 -27139 18884 52345 31493 23876 13454 12065 -5367
14578 -5367 2702 20342 -5632 -18874 -30035 -20405 3119 -753 17013 33223 39754 29453 36400
14565 36400 54429 18695 -42942 -47263 -19496 -8349 -10212 -5564 -17578 -22526 -1299 27456
$$ packed form
14654i285o468o088J130K4255J5775K164N240k0019J0585j105j4171j704n67l1971
14640c2229j2490J8529L2774j9367k3839l064J8483M870k5210j6248O905K0962
14628b9924J1596R169j4919J5024Q184J827L7414j8934l5885l5495K1104J7140
14616a3699j1762Q021k326N463r161Q313k000J8438k0335j3077L9692J5828L854
14603B7249k6576J0180L134k7229q18J7660k806j8506k4757K0946q149q655K4865
14590a3462K431l1523m0559J2957M3017M6023L3461k0852p617j0422j389j7432
14578e367Q069J7640k5974j3242j1161R630K3524l872J7766J6210O531j0301O947
14565C6400J8029l5734o1637m321K7767J1147j863M648j2014m948K1227K8755
$$ plain form
14553 27456 12604 -23445 -30142 -36254 -41054 -42120 -35806 -34838 -17852 -7188 -17818 -36951 -2556
14540 -2556 27315 25989 810 -8621 1917 6457 -14260 -16228 -24432 -27579 -5964 32372 18145
14527 18145 19369 4725 -11850 -28379 -18246 -11379 -8633 -618 -22995 -36993 -38628 -53122 -44820
14514 -44820 -8774 30793 43286 40853 22892 29643 28677 14444 -2012 -13353 20296 44248
14502 44248 37936 27447 48048 49624 38292 25513 477 4609 -7792 -29553 4297 13561
14490 13561 -8250 -24950 -59908 -60495 -44431 -18151 -12765 -17738 13857 14713 -3455 -22111 8920
14477 8920 38087 40621 16568 -16002 -20387 -12287 17322 35051 15618 14291 31362 23839 13870
14464 13870 8166 40017 36570 30103 24907 920 27039 57418 27651 -35050 -66237 -84549
$$ packed form
14553B7456j4852l6049o697o112m800j066O314R68J6986J0664j0630j9133L4395
14540b556K9871j326k5179r431J0538M540k0717j968q204l147K1615L8336j4227
14527A8145J224j4644j6575j6529J0133O867K746Q015k2377j3998j635j4494Q302
14514d4820L6046L9567J2493k433j7961O751r66j4233j6456j1341L3649K3952
14502D4248o312j0489K0601J576j1332j2779k5036M132j2401k1761L3850R264
14490A3561k1811j6700l4958n87J6064K6280N386m973L1595Q56j8168j8656L1031
14477H920K9167K534k4053l2570m385Q100K9609J7729j9433j327J7071p523r969
14464A3870n704L1851l447o467n196k3987K6119L0379k9767o2701l1187j8312
$$ plain form
14452 -84549 -65352 -43082 -39012 -8071 44964 50530 14006 6025 17982 4671 12948 10497 19064
14439 19064 5852 22463 28703 33651 33440 23266 15095 23928 19338 -318 -10428 7108 7921
14426 7921 10138 10240 -5261 -10990 -805 27495 36838 26458 3765 -22593 -40236 -53450 -69828
14413 -69828 -41253 -9710 -2924 -19411 -27970 -41490 -40085 -34760 -15829 -27723 -22449 -16367 13683
14400 13683 46654 28700 22350 30064 55043 38080 24151 43023 12927 -21577 -26544 2112
14388 2112 34025 9870 2017 5134 35029 41076 31168 26130 41155 38765 493 -13635 11693
14375 11693 -15374 -41748 -29725 -29205 -16106 -19722 -32871 -33347 -32999 -7694 -9215 -7604 19730
14362 19730 61830 55181 46705 29823 6875 22285 32466 15000 3903 14927 30321 37467
$$ packed form
14452h4549J9197K2270M070L0941N3035N566l6524p981J1957j3311Q277k451Q567
14439A9064j3212J6611O240M948k11j0174q171Q833m590j9656j0110J7536Q13
14426G921K217J02j5501n729J0185K8300R343j0380k2693k6358j7643j3214j6378
14413f9828K8575L1543O786j6487q559j3520J405N325J8931j1894N274O082L0050
14400A3683L2971j7954o350P714K4979j6963j3929J8872l0096l4504m967K8656
14388B112L1913k4155p853L117K9895O047r908n038J5025k390l8272j4128K5328
14375A1693k7067k6374J2023N20J3099l616j3149m76L48K5305j521J611K7334
14362A9730M2100o649q476j6882k2948J5410J0181j7466j1097J1024J5394P146
$$ plain form
14350 37467 26068 31743 21127 11276 17289 7674 -1627 -25520 -43760 -40505 30447 49905 29676
14337 29676 18338 -1801 21216 42332 26905 19238 39399 9609 -2449 -11104 -31912 -28051
14325 -28051 2884 19365 21328 38846 42178 42875 2374 -9346 13279 9366 15038 36291 47597
14312 47597 58750 45433 -5157 -29682 -36468 -46629 -13329 -8959 -12715 -10810 -3879 11556 16874
14299 16874 8265 -13745 -21649 -35225 -6029 9718 2241 -8204 -28376 -36018 -6033 7131
14287 7131 12090 -896 8150 22235 14745 -2153 -380 -25657 -43811 -10373 56191 73503 54903
14274 54903 40368 23802 8142 -9575 -2783 7419 14172 17857 14191 6306 15564 5942 -45492
14261 -45492 -38044 -33850 -9178 19271 40761 39276 17386 4864 -12204 -37068 -64577 -59050
$$ packed form
14350C7467j1399N675j0616r851O013r615r301k3893j8240L255P0952J9458k0229
14337B9676j1338k0139K3017K1116j5427p667K0161k9790j2058q655k0808L861
14325b8051L0935J6481J963J7518L332O97m0501j1720K2625l913N672K1253J1306
14312D7597J1153j3317n0590k4525o786j0161L3300M370l756J905O931J5435N318
14299A6874q609k2010p904j3576K9196J5747p477j0445k0172p642K9985J3164
14287G131M959j2986R046J4085p490j6898J773k5277j8154L3438O6564J7312j8600
14274E4903j4535j6566j5660j7717O792J0202O753L685l666p885R258r622n1434
14261d5492P448M194K4672K8449K1490j485k1890j2522j7068k4864k7509N527
$$ plain form
14249 -59050 -33141 -24086 -10327 -760 -9268 -6783 -33668 -44121 -32945 -1079 -2445 -9912 -4642
14236 -4642 24442 23984 28830 11597 3941 4557 -24171 -20083 10211 33212 28904 33721 51475 54686
14222 54686 33203 20724 3655 -17888 -3833 -20324 1790 12194 -546 -3814 -9278 9796
14210 9796 -7037 -26249 -25323 -4713 25997 31701 23979 26160 36505 39098 51121 25895 14484
14197 14484 -17829 -19752 414 14048 12010 21993 16553 -5914 -8012 -6113 6088 29074 33082
14184 33082 10545 -15863 -13307 24621 44275 42535 19769 -5629 -34464 -37864 -37092 -5244 20851
14171 20851 30523 15389 16964 3577 -7508 -8964 1432 -3344 3569 1847 -16898 -23152 -15544
14158 -15544 -18150 -16650 -4999 7264 10903 -2629 -15992 5982 8705 -3772 10527 9322 14240
$$ packed form
14249e9050K5909R055J3759R567q508K485k6885j0453J1176L1866j366p467N270
14236d642K9084m58M846j7233p656O16k8728M088L0294K3001m308M817J7754L211
14222E4686k1483j2479j7069k1543J4055j6491K2114J0404j2740l268n464J9074
14210I796j6833j9212R26K0610L0710N704p722K181J0345K593J2023k5226j1411
14197A4484l2313j923K0166J3634k038R983n440k2467k098J899J2201K2986M008
14184C3082k2537k6408K556L7928J9654j740k2766k5398k8835l400P72L1848K6095
14171B0851R672j5134J575j3387j1085j456J0396m776O913j722j8745o254P608
14158a5544k606J500J1651J2263L639j3532j3363K1974K723j2477J4299j205M918
$$ plain form
14145 14240 15720 -20038 2572 17166 8563 -10066 -21608 -23045 -16103 -12843 -18950 -29488 -6427
14132 -6427 10305 -18736 -9275 11374 41971 58246 17295 -7505 -3699 8054 3688 -1008 -2387
14119 -2387 14162 37708 41418 39624 25453 1672 6514 -34265 -35367 -21083 883 -4822 -21119
14106 -21119 -3925 5235 7400 13210 7993 -1033 -6550 1116 -18216 -63266 -64806 -47193 -22813
14093 -22813 8459 3899 11789 9512 15729 12075 -25893 -30204 -60475 -41736 -34631 -28371 -3344
14080 -3344 13929 7526 5739 8338 -6096 6326 19605 50237 67682 70952 71794 31265 28165
14067 28165 33869 40049 16761 -3822 8009 14653 16135 8657 -2156 -13470 -27363 -23520 3791
14054 3791 21552 6305 -12503 291 -35 -860 -23632 -23355 -7822 -2052 4952 -10728 -29604
$$ packed form
14145A4240J480l5758K2610J4594q603j8629j1542j437O942L260o107j0538K3061
14132f427J6732k9041R461K0649L0597J6275m0951k4800L806J1753m366m696j379
14119b387J6549K3546L710j794j4171k3781M842m0779j102J4284K1966n705j6297
14106b1119J7194R160K165N810n217r026n517P666j9332m5050j540J7613K4380
14093b2813L1272m560P890k277O217l654l7968m311l0271J8739P105O260K5027
14080c344J7273o403j787K599j4434J2422J3279L0632J7445L270Q42m0529l100
14067B8165N704O180k3288k0583J1831O644J482p478j0813j1314j3893L843K7311
14054C791J7761j5247j8808J2794l26q25k2772K77J5533N770P004j5680j8876
$$ plain form
14041 -29604 -21294 16179 25197 11891 10716 11432 6154 14670 20831 17326 -13360 -40470 -49073 -50285
14027 -50285 -46240 -13324 5650 -7404 -37770 -43647 -19660 4851 -2467 -25602 -16112 10174
14015 10174 7603 -11783 -530 -378 14632 13626 -32334 -50188 -67608 -60206 -24038 -16766 -7765
14002 -7765 -1080 8321 12482 -5516 -30974 -10630 -12224 -23653 -25307 -38669 -15457 19593 16679
13989 16679 -18916 -9978 2032 15785 15730 -14036 -34690 -2256 -20328 -33618 -35244 -21430 -20257
13976 -20257 4654 -9039 8971 42418 52180 10202 23091 40379 50635 31896 25491 52123
13964 52123 46968 70721 77783 55639 32709 21111 54747 75071 78264 132163 195760 220471
13952 220471 258841 264793 274815 307206 315116 330886 327412 291787 251576 238974 267675 259660
$$ packed form
14041b9604Q310L7473R018j3306j175P16n278Q516O161l505l0686k7110q603j212
14027e0285M045L2916J8974j3054l0366n877K3987K4511p318k3135R490K6286
14015A0174k571j9386J1253J52J5010j006m5960j7854j7420P402L6168P272R001
14002g765O685R401M161j7998k5458K0344j594j1429j654j3362K3212L5050k914
13989A6679l5595Q938J2010J3753n5k9766k0654L2434j8072j3290j626J3814J173
13976b0257K4911j3693J8010L3447R762m1978J2889J7288J0256j8739o405K6632
13964E2123n155K3753P062k2144k2930j1598L3636K0324L193N3899O3597K4711
13952B20471L8370N952J0022L2391P910J5770l474l5625m0211j2602K8701q015
$$ plain form
13940 259660 251493 252876 208305 149918 117095 97438 86914 59653 53446 53057 49704 62660 62425
13927 62425 63363 57467 61360 60500 45171 44669 56268 66833 70684 46206 31119 22882 25323 22708
13913 22708 16577 1637 -331 7382 43981 54559 47029 29695 -1742 16278 22301 21516 10135
13900 10135 -15129 -45251 -30514 -1882 8043 24878 38712 27840 2888 29674 45492 24694
13888 24694 -6014 7603 7502 38058 36243 19843 -1385 14533 25961 -30243 -51146 -6828
13876 -6828 5817 -7286 -16376 8895 17626 32549 52410 36734 44166 36173 26102 16883 34310
13863 34310 24088 25544 24446 8418 11751 30495 39203 29925 -1921 16064 23870 2627 -3355
13850 -3355 -994 -891 3803 -3535 10960 -4539 -4182 -12314 -370 32230 24760 7025 -4594 -2822
$$ packed form
13940B59660q167J383m4571n8387l2823j9657j0524k7261o207l89l353J2956k35
13927F2425R38n896L893q60j5329n02J1599J0565L851k4478j5087q237K441k615
13913B2708o131j4940j968P713L6599J0578p530j7334l1437J8020O023p85j1381
13900A0135k5264l0122J4737K8632R925J6835J3834j0872k4952K6786J5818k0798
13888B4694l0708J3617j01L0556j815j6400k1228J5918J1428n6204k0903M4318
13876f828J2645j3103r090K5271Q731J4923J9861j5676P432p993j0071r219J7427
13863C4310j0222J456j098j6028L333J8744Q708r278l1846J7985P806k1243n982
13850c355K361J03M694p338J4495j5499L57q132J1944L2600p470j7735j1619J772
$$ plain form
13836 -2822 10582 59556 78465 34388 4785 -4729 25752 25084 18297 -5092 -28911 -19436 -39665
13823 -39665 -61744 -52582 -23189 -9604 20221 25366 4398 7365 10436 16806 18462 8076 16290
13810 16290 18185 -15039 -32774 -28562 -18092 -21123 -21963 -35744 -25588 12093 20811 20892 21521 29222
13796 29222 45279 15469 -16248 -18474 -1307 53659 33799 4025 -16105 -27394 -186 5187
13784 5187 -23057 -8691 3492 -12809 -5099 9138 20711 42865 39484 27724 14500 -13511
13772 -13511 -5917 30918 47849 31912 20576 14573 12636 -16362 -1570 -7841 -21164 -24867 -37682
13759 -37682 -51528 -53652 -27053 -31479 -16046 -14563 -12900 -4213 -3876 -17180 -37959 -9636 15058
13746 15058 27031 1282 8058 -237 18283 15371 26093 60235 64768 50292 32966 45263
$$ packed form
13836b822J3404M8974J8909m4077k9603r514L0481o68o787k3389k3819R475k0229
13823c9665k2079R162K9393J3585K9825N145k0968K967L071O370J656j0386Q214
13810A6290J895l3224j7735M212J0470l031q40j3781J0156L7681Q718Q1O29P701
13796B9222J6057k9810l1717k226J7167N4966j9860k9774k0130j1289K7208N373
13784E187k8244J4366J2183j6301P710J4237J1573K2154l381j1760j3224k8011
13772a3511P594L6835J6931j5937j1336o003j937k8998J4792o271j3323l703j2815
13759c7682j3846k124K6599m426J5433J483J663Q687L37j3304k0779K8323K4694
13746A5058J1973k5749O776q295J8520k912J0722L4142M533j4476j7326J2297
$$ plain form
13734 45263 46276 37148 33387 60887 25721 16406 12329 6257 1548 10846 28313 21041 -6466
13721 -6466 -21437 7547 13146 -452 -14213 -27759 -33872 -23817 -18983 8156 47557 32409
13709 32409 -5953 -29369 -13329 9078 12879 37938 54603 53235 46717 20212 30752 36310
13697 36310 41080 14257 4667 13926 11318 17932 26287 17782 2156 -17507 1056 12724 4380
13684 4380 -2218 -23039 -27672 -51798 -34196 9705 6296 21548 23168 -10364 -18090 -38717 -22806
13671 -22806 -37185 -82501 -74685 -48410 -33863 -28526 -12131 -5840 -10330 11527 52846 41655
13659 41655 24498 865 -21288 -20362 -8519 -4334 11319 24944 17072 19121 42287 58608 28487
13646 28487 -5083 -11210 4284 13146 6948 1497 -7494 4659 -26315 -41782 11787 28206 33034
$$ packed form
13734D5263J013r128l761K7500l5166r315m077o072m709R298J7467p272k7507
13721f466j4971K8984N599j3598j3761j3546o113J0055M834K7139L9401j5148
13709C2409l8362k3416J6040K2407L801K5059J6665j368o518k6505J0540N558
13697C6310M770k6823r590R259k608O614Q355q505j5626j9663J8563J1668q344
13684D380o598k0821m633k4126J7602M3901l409J5252J620l3532p726k0627J5911
13671b2806j4379m5316P816K6275J4547N337J6395O291m490K1857M1319j1191
13659D1655j7157k3633k2153R26J1843M185J5653J3625p872K049K3166J6321l0121
13646B8487l3570o127J5494Q862o198n451q991J2153l0974j5467N3569J6419M828
$$ plain form
13633 33034 39096 42841 45771 41172 35917 40959 28623 17347 5602 -8879 13659 19035 7836
13620 7836 14951 -8800 -24257 -41042 -45504 -30576 -16537 -12207 4462 5048 -10658 -20580 -15531
13607 -15531 -11075 -15587 1428 5422 -5912 -33520 -56192 -59124 -41828 -16908 -8929 -20060 -33503
13594 -33503 -31688 -14611 7799 -25742 -36355 -20651 -37162 -14293 7818 -11308 -199 21127
13582 21127 40839 1346 -4948 -1407 10164 1915 -12821 -8425 6044 -6255 -12984 -8299 -3098
13569 -3098 1310 -8299 -4312 -13275 -9171 21139 32378 23964 13264 -600 -6981 5026 -10126
13556 -10126 -20874 -22194 -46889 -47841 -34834 -29391 24864 47532 1894 -28522 -21575 -19678 -8963
13543 -8963 -6845 -26709 -40553 -10150 32730 43315 45799 64806 41821 8865 19280 24027
$$ packed form
13633C3034O062L745K930m599n255N042j2336j1276j1745j4481K2538N376j1199
13620G836P115k3751j5457j6785m462J4928J4039M330J6669N86j5706r922N049
13607a5531M456m512J7015L994j1334k7608k2672k932J7296K4920P979j1131j3443
13594c3503J815J7077K2410l3541j0613J5704j6511K2869K2111j9126J1109K1326
13582B1127J9712l9493o294L541J1571q249j4736M396J4469j2299o729M685N201
13569c098M408r609L987q963M104L0310J1239q414j0700j3864o381J2007j5152
13556a0126j0748j320k4695r52J3007N443N4255K2668m5638l0416O947J897J0715
13543h963K118j9864j3844L0403M2880J0585K484J9007k2985l2956J0415M747
$$ plain form
13531 24027 3538 12913 -3754 -20598 -23252 -33310 -42432 -53905 -49968 -41767 -28506 -20726 -8875
13518 -8875 -38813 -67020 -65571 -28361 20544 4188 -5402 29975 46588 25069 23064 -1189
13506 -1189 -7333 -7972 -14544 -12965 -25709 -31429 -50668 -51180 -32901 6241 20073 -2674 -9031 3242
13492 3242 11033 22152 37719 25133 3426 5073 17194 3009 -10700 -14290 6080 14232 29902
13479 29902 16574 26072 17111 -27369 -59113 -53354 -33099 -18861 -14400 -16627 32245 46811 70156
13466 70156 43774 17813 -5828 -5119 3082 7143 -16555 -31881 -49086 -53741 -38903 -40461 -19044
13453 -19044 -20553 -30548 4375 10373 -1668 1158 1528 9531 11846 -6287 8974 2752 -31636
13440 -31636 -53862 -43157 -39823 -51756 -46347 -30749 -26062 -14868 -43544 -35017 6148 4547 15491
$$ packed form
13531B4027k0489R375j6667j6844k654j0058r122j1473L937Q201J3261P780J1851
13518h875k9938k8207J449L7210M8905j6356r590L5377J6613k1519k005k4253
13506a189o144o39o572J579j2744n720j9239n12J8279L9142J3832k2747o357J2273
13492C242P791J1119J5567j2586k1707J647J2121j4185j3709l590K0370Q152J5670
13479B9902j3328R498q961m4480l1744N759K0255J4238M461k227M8872J4566K3345
13466G0156k6382k5961k3641P09Q201M061k3698j5326j7205m655J4838j558K1417
13453a9044j509r995L4923N998j2041K826L70Q003K315j8133J5261o222l4388
13440c1636k2226J0705L334j1933N409J5598M687J1194k8676Q527M1165j601J0944
$$ plain form
13427 15491 7019 -11240 -14602 -28965 -18242 9090 5283 16390 27635 41137 12151 11891 51735
13414 51735 56962 36432 10371 -2649 -38223 -37382 -21800 -3601 8332 3325 3172 9012 30203
13401 30203 28798 7139 -7269 16680 38209 22492 13533 5042 -5750 -24135 -15818 -9301 -4530
13388 -4530 15378 19339 2336 -28823 -11275 23258 28413 31312 2907 -17558 -7662 -12286 -26629
13375 -26629 -29507 -25985 -29242 -36337 -9786 29933 36869 39398 29724 -836 -25923 -9801 -15955
13362 -15955 -1024 -18951 -27618 -12692 -24126 -39851 -55931 -53963 -51568 -52855 -53690 -40155 -5925
13349 -5925 2943 -5706 494 1660 1768 6494 15590 8965 -24308 -29942 -17178 597 -2501 6194
13335 6194 6446 2741 19361 22567 29681 44038 48191 14642 -26585 -33416 -24278 -4561 2531 14268
$$ packed form
13427A5491q472j8259l362j4363J0723K7332l807J1107J1245J3502k8986k60L9844
13414E1735N227k0530k6061j3020l5574Q41J5582J8199J1933n007j53N840K1191
13401C0203j405k1659j4408K3949K1529j5717q959q491j0792j8385Q317O517M771
13388d530J9908L961j7003l1159J7548L4533N155K899k8405k0465R896m624j4343
13375b6629k878L522l257p095K6551L9719O936K529r674l0560k5087J6122o154
13362a5955J4931j7927q667J4926j1434j5725j6080J968K395j287q35J3535L4230
13349e925Q868q649O200J166J08M726R096o625l3273n634J2764J7775l098Q695
13335F194K52l705J6620L206P114J4357M153l3549m1227o831R138J9717P092J1737
$$ plain form
13321 14268 27526 27004 47377 66459 40536 30862 44313 20074 12322 11455 20457 13042 5726
13308 5726 3173 -18862 -30566 -34907 -61480 -60393 -25940 7729 26847 9053 2072 -15752 -23422
13295 -23422 -30859 -36532 -4192 24921 64781 50829 33663 38179 21609 147 -28837 -46680
13283 -46680 -44111 -44082 -24884 -8452 -27226 -34611 -5435 -17631 -6532 9686 4505 21255 21076
13270 21076 4722 -7328 -23126 -7379 -12535 -11039 -3760 -35606 -47832 -16929 -12171 -3781 -6611
13257 -6611 -13671 -20084 -25051 -11418 -7058 -19693 -19310 -60072 -67929 -46441 -43045 -44241 -43099 -7508
13243 -7508 4796 16834 15040 6773 15144 29543 46221 64848 48382 42919 3417 -13671 5597
13230 5597 28121 3351 -31657 -45254 -26421 -19919 -35200 -37830 -29725 -31548 -12077 9163 14376
$$ packed form
13321A4268J3258n22K0373J9082k5923r674J3451k4239p752q67R002p415p316
13308E726k553k2035j1704m341k6573J087L4453L3669J9118j7794o981j7824p670
13295b3422p437n673L2340K9113L9860j3952j7166M516j6570k1462k8984j7843
13283d6680K569K9J9198J6432j8774p385K9176j2196J1099J6218n181J6750j79
13270B1076j6354j2050j5798J5747n156J496P279l1846j2226L0903M758Q390k830
13257f611p060o413m967J3633M360j2635L83m0762p857K1488L396j196J142L5591
13243g508J2304J2038j794q267Q371J4399J6678J8627j6466n463l9502j7088J9268
13230E597K2524k4770l5008j3597J8833O502j5281k630Q105j823J9471K1240N213
$$ plain form
13217 14376 10352 -12642 -34491 -55097 -66604 -48948 -27870 -12243 -942 598 -4446 -26180
13205 -26180 -1640 9827 10818 25614 3025 -7357 3254 3483 -4448 -14629 1696 6457 -27983
13192 -27983 -30857 -6069 -9492 -27231 -55206 -51252 -47828 -70237 -72513 -35599 -21844 -5103 12710
13179 12710 2206 -3795 -9838 -14880 -8018 188 760 -8093 1086 3404 19489 32597 22799 12872
13165 12872 -10825 -41742 -43177 -14321 -12386 -36832 -49984 2476 29597 13907 -16854 -4530
13153 -4530 46409 69634 39992 48970 47936 28250 14184 18272 16564 -16903 -42171 -34260 -21692
13140 -21692 -36617 -57097 -40958 -5922 8558 -639 -11065 308 -12965 -69953 -66786 -35401
13128 -35401 -18343 7802 -12381 2937 17160 45115 53208 28159 2815 30625 52644 32075
$$ packed form
13217A4376m024k2994k1849k0606j1507J7656K1078J5627J1301J540n044k1734
13205b6180K4540J1467R91J4796k2589j0382J0611K29p931j0181J6325M761l4440
13192b7983k874K4788l423j7739k7975L954L424k2409k276L6914J3755J6741J7813
13179A2710j0504o001o043n042O862Q206N72q853R179K318J6085J3108r798r927
13165A2872k3697l0917j435K8856J935k4446j3152N2460K7121j5690l0761J2324
13153d530N0939K3225k9642Q978j034j9686j4066M088j708l3467k5268P911J2568
13140b1692j4925k0480J6139L5036J4480r197j0426J1373j3273n6988L167L1385
13128c5401J7058K6145k0183J5318J4223K7955Q093k5049k5344K7810K2019k0569
$$ plain form
13116 32075 12725 5533 -16868 -49414 -61367 -58224 -30836 10464 32827 25050 -26660 -49181
13104 -49181 -53888 -24299 -12684 -423 -11981 -2556 39114 37605 22791 16733 9676 -24250 -42678
13091 -42678 -25757 -58919 -48666 -22713 -48701 -51083 -36818 -8781 -15829 -37001 -39941 -42536
13079 -42536 -19730 38342 31782 7314 11116 10585 30929 16150 13429 18062 651 -13688 -6897
13066 -6897 -14544 -37884 -56010 -24505 -15015 12537 8249 -16125 6648 34586 34000 21842 10231
13053 10231 5616 2550 -1875 -29755 -19113 3614 27965 26205 16091 4813 -7414 14267
13041 14267 803 -4906 -18962 -27460 -15973 -20642 -15583 -13450 -6833 -13415 -14928 -15897 426 -12665
13027 -12665 -33424 -30654 -28562 -37882 7310 20529 27626 15511 -6280 1092 9907 -17210 -5123
$$ packed form
13116C2075j9350p192k2401l2546j1953L143K7388M1300K2363p777n1710k2521
13104d9181m707K9589J1615J2261j1558R425M1670j509j4814o058p057l3926j8428
13091d2678J6921l3162J0253K5953k5988k382J4265K8037p048k1172k940k595
13079d2536K2806N8072o560k4468L802n31K0344j4779k721M633j7411j4339O791
13066f897p647k3340j8126L1505R490K7552m288k4374K2773K7938n86j2158j1611
13053A0231m615l066m425k7880J0642K2727K4351j760j0114j1278j2227K1681
13041A4267j3464n709j4056q498J1487m669N059K133O617o582j513r69J6323j3091
13027a2665k0759K770K092r320M5192J3219P097j2115k1791P372Q815k7117J2087
$$ plain form
13014 -5123 -2896 -16522 -27335 -4721 20871 20422 25782 15452 -10663 -4435 -3872 -10552 -21200
13001 -21200 -10328 -20764 -32356 -21028 -20315 -4598 -28807 -33981 -39693 -264 50010 51805 25069
12988 25069 -9552 -10722 5450 14554 13891 12510 9114 13150 -18960 -33749 -37051 -2467 -2764 -11560
12974 -11560 -35528 -38880 -45104 -32675 378 26167 17276 25205 -3242 3382 2136 1990 9644
12961 9644 -13160 -21236 -26178 -9080 -20372 -21902 -25444 -42629 -26798 -8896 12954 -10626 5480
12948 5480 48513 38215 5171 -36393 -17992 23477 35410 25781 509 -9829 9552 -740
12936 -740 -23236 -29205 -6300 -13162 -11642 -9038 -48826 -77897 -67372 -96668 -86591 -58981 -50115
12923 -50115 -7985 -2271 1512 15964 10943 -10720 26982 51262 46644 35870 -1693 3087 14692
$$ packed form
13014e123K227j3626j0813K2614K5592m49N360j0330k6115O228N63o680j0648
13001b1200J0872j0436j1592J1328P13J5717k4209n174n712L9429N0274J795k6736
12988B5069l4621j170J6172R104o63j381l396M036l2110j4789l302L4584k97q796
12974a1560k3968l352o224J2429L3053K5789q891P929k8447O624j246j46P654
12961I644k2804q076m942J7098j1292j530l542j7185J5831J7902K1850k3580J6106
12948E480M3033j0298l3044m1564J8401M1469J1933r629k5272j0338J9381j0292
12936g40k2496n969K2905o862J520K604l9788k9071J0525k9296J0077K7610Q866
12923e0115M2130N714L783J4452n021k1663L7702K4280m618j0774l7563M780J1605
$$ plain form
12910 14692 7664 10181 24453 24368 -17306 -39923 -39574 -11898 16178 17462 35448 31655 32737 48473
12896 48473 22107 -4516 -528 -18883 -19237 -21524 -1887 -4452 3953 -4904 6396 50792 62445
12883 62445 53212 34967 -1120 -1725 -7978 6243 8408 18612 12724 6778 21496 -14677 -14823
12870 -14823 20814 34057 -3583 -35717 -37240 -34471 -11603 9610 -24547 -24894 -24513 -25638 -41803
12857 -41803 -49796 -30451 -16663 -24058 9437 -14525 -28209 -21077 460 8519 -13903 1226
12845 1226 -4201 -11415 -44880 -47625 -11063 -888 -15179 -23974 -16738 19499 35785 48355 44054
12832 44054 33547 -4463 -16825 -6455 672 4800 7577 33616 14068 5395 22513 18898 3215
12819 3215 6967 16116 22084 5858 155 -40886 -45844 -35861 -12893 -1053 -37531 -49185 -8007
$$ packed form
12910A4692p028K517J4272q5m1674k2617L49K7676K8076J284J7986l793J082J5736
12896D8473k6366k6623L988j8355l54k287J9637k565Q405q857J1300M4396J1653
12883F2445r233j8245l6087o05o253J4221K165J0204n888n946J4718l6173j46
12870a4823L5637J3243l7640l2134j523K769K2868K1213l4157l47L81j125j6165
12857d1803p993J9345J3788p395L3495k3962j3684P132K1537Q059k2422J5129
12845A226n427p214l3465k745L6562J0175j4291q795P236L6237J6286J2570m301
12832D4054j0507l8010j2362J0370P127M128K777K6039j9548q673J7118l615j5683
12819C215L752R149N968j6226n703m1041m958R983K2968J1840l6478j1654M1178
$$ plain form
12806 -8007 3205 -4897 -35041 -4351 50183 38135 29574 23323 -14807 -30129 -21764 -55005 -34017
12793 -34017 17817 50185 52258 47529 24116 -567 -5221 -2101 4101 -12966 -2320 7986 19233
12780 19233 -5501 -16044 4169 17456 32088 16537 -18296 -13187 17991 4395 -13526 -2653
12768 -2653 -6783 -16078 -11150 7465 5182 11387 -41620 -67604 -51638 -51531 -34549 -8029 21071
12755 21071 37222 11946 6487 20655 21171 10494 1064 -15676 -15822 -20677 -16777 23508 17296
12742 17296 11715 36958 25214 12806 -12615 -29983 -33504 -30249 -9278 23541 20432 8734
12730 8734 22486 22776 35712 47415 59652 61093 39967 10274 8355 18038 14369 7010 15312
12717 15312 34701 54111 62978 42137 25350 13802 30938 55551 64265 50544 35659 29149
$$ packed form
12806h007J1212q102l0144L0690N4534j2048q561o251l8130j5322Q365l3241K0988
12793c4017N1834L2368K073m729k3413k4683m654L120O202j7067J0646J0306J1247
12780A9233k4734j0543K0213J3287J4632j5551l4833N109L1178j3596j7921J0873
12768b653m130r295M928J8615k283O205n3007k5984J5966J07J6982K6520K9100
12755B1071J6151k5276n459J4168N16j0677r430j6740j46m855L900M0285o212
12742A7296n581K5243j1744j2408k5421j7368l521L255K0971L2819l109j1698
12730H734J3752K90J2936J1703J2237J441k1126k9693j919R683l669p359Q302
12717A5312J9389J9410Q867k0841j6787j1548J7136K4613Q714j3721j4885o510
$$ plain form
12705 29149 29107 19251 29872 44034 44752 21054 -2191 -15557 -23666 -33480 -22563 -18152 9318
12692 9318 23956 -5100 -30748 -33702 -15954 -10182 -35599 -43866 -10984 6667 12868 48 1616
12679 1616 10849 -1419 -23949 -17761 4381 3468 -20594 -1471 1626 23855 3729 -6334 4227
12666 4227 6126 9250 6679 3452 19298 55114 82008 125613 130693 155075 170229 175074 201517
12653 201517 281597 450233 667696 898169 1135469 1344225 1482563 1647902 1816188 1921878
12643 1921878 1833047 1572405 1227790 894839 671115 525091 412339 349710 314530 275806
12633 275806 247323 209321 182558 158605 145306 126783 105156 84927 65938 66102 75625 68320
12621 68320 77911 84555 88192 79191 70664 99048 101550 100499 92582 79985 76237 87029 74432
$$ packed form
12705B9149m2r856J0621J4162P18k3698k3245j3366q109r814J0917M411K7470
12692I318J4638k9056k5648k954J7748N772k5417q267L2882J7651O201j2820J568
12679A616R233j2268k2530O188K2142r13k4062J9123L097K2229k0126j0063J0561
12666D227J899L124k571l227J5846L5816K6894M3605N080K4382J5154M845K6443
12653B01517Q0080J68636K17463K30473K37300K08756J38338J65339J68286J05690
12643A921878q8831k60642l44615l32951k23724j46024j12752o2629l5180l8724
12633B75806k8483l8002k6763k3953j3299j8523k1627k0229j8989J64R523p305
12621F8320R591O644L637r001q527K8384K502j051p917j2597l748J0792j2597
$$ plain form
12608 74432 94714 93054 99299 108606 65540 65708 75025 71326 43574 14890 -1787 1595 12679
12595 12679 44540 56637 67722 98108 84966 54533 24693 -3828 -5495 24846 40337 51602
12583 51602 46479 32704 52124 65426 43872 9700 15354 20061 42549 44196 60503 77129
12571 77129 57279 2685 -4969 -12608 -21319 -27902 -32681 -23809 -6266 24326 39917 29354 2543
12558 2543 13262 17341 14749 -14233 -18941 14423 8113 -6891 -15961 -20722 -31198 2703 30458
12545 30458 31610 18392 5890 12185 4788 15706 32284 20459 11431 13311 32686 39451 -3830
12532 -3830 -21920 -23347 -6033 1685 12737 22186 10979 8245 8364 -2576 -16351 -7438 14331
12519 14331 -5559 -12020 -9004 -19510 -8453 -31804 -24554 -25651 -27964 -40245 -21869 -18436 8682
$$ packed form
12608G4432K0282j660O245R307m3066J68R317l699k7752k8684j6677L382J1084
12595A2679L1861J2097J1085L0386j3142l0433k9840k8521j667L0341J5491J1265
12583E1602n123j3775J9420J3302k1554l4172N654M707K2488J647J6307J6626
12571G7129j9850n4594p654p639q711o583m779Q872J7543L0592J5591j0563k6811
12558B543J0719M079k592k8982m708L3364o310j5004r070m761j0476L3901K7755
12545C0458J152j3218j2502O295p397J0918J6578j1825r028J880J9375O765m3281
12532c830j8090j427J7314P718J1052R449j1207k734J19j0940j3775Q913K1769
12519A4331j9890o461L016j0506J1057k3351P250j097k313j2281J8376L433K7118
$$ plain form
12506 8682 24995 11234 -7366 38 13780 15743 8257 -18401 -20997 -30015 -34893 -25457 5481
12493 5481 -6304 -8509 -7860 4920 19150 41092 57224 66032 43347 36244 29201 9201 -3432
12480 -3432 -20879 -22142 -6015 -1659 822 -4533 -30035 -54468 -26589 -23144 -17917 5506 10272
12467 10272 -9340 -19968 -27788 -28663 -19410 -14152 17890 44432 31651 28725 40356 42119 18943
12454 18943 38327 74326 61015 13998 8355 -6180 -13365 9522 18515 26323 -5480 -31765
12442 -31765 -49227 -36334 -8528 -2670 -10673 -15989 2119 2449 1169 33838 36193 3823 -20502
12429 -20502 -11220 -5076 -5754 12059 7134 27384 41363 24041 8486 37946 33692 20135 -4327
12416 -4327 -19562 -23695 -27723 -5224 14111 12585 -3364 -3059 -4895 4484 4198 4534 10475 19366
$$ packed form
12506H682J6313j3761j8600P404J3742J963p486k6658k596r018m878R436L0938
12493E481j1785k205O49J2780J4230K1942J6132Q808k2685p103p043k0000j2633
12480c432j7447j263J6127M356K481n355k5502k4433K7879L445N227K3423M766
12467A0272j9612j0628p820q75R253N258L2042K6542j2781k926J1631J763k3176
12454A8943J9384L5999j3311m7017n643j4535p185K2887Q993P808l1803k6285
12442c1765j7462J2893K7806N858q003n316J8108L30j280L2669K355l2370k4325
12429b0502R282O144o78J7813m925K0250J3979j7322j5555K9460m254j3557k4462
12416d327j5235m133m028K2499J9335j526j5949L05j836R379k86L36N941Q891
$$ plain form
12402 19366 -2920 -26299 -35388 -65874 -67315 -33389 -282 -23520 279 23101 3523 -30973
12390 -30973 -16611 22198 29744 19266 -17673 -52643 -68860 -47488 -31715 -29595 -34057 -16450
12378 -16450 3831 439 -26970 -60784 -39857 -30902 -52110 -49646 -55901 -56728 -49044 -63206 -60277
12365 -60277 -40846 -17886 -16977 -35360 -26171 -16394 17382 47458 11109 -29654 -48182 -56993 -27663
12352 -27663 373 5987 -7526 -47130 -58384 -30617 7517 9935 4959 13921 3719 -2973 -15994
12339 -15994 -20221 -20846 -12824 -8618 5638 2051 16484 12028 -15101 -28539 -43932 -32704 -31202
12326 -31202 -4655 8415 -14079 -22572 -17602 -40131 -47926 -43424 -32075 -22794 7780 17872 35500
12313 35500 28452 11489 -13879 -31037 -459 10795 -5103 1896 8447 23918 32324 42832
$$ packed form
12402A9366k2286k3379r089l0486j441L3926L3107k3238K3799K2822j9578l4496
12390c0973J4362L8809P546j0478l6939l4970j6217K1372J5773K120m462J7607
12378a6450K0281l392k7409l3814K0927Q955k1208K464o255q27P684j4162K929
12365f0277J9431K2960R09j8383R189R777L3776L0076l6349m0763j8528q811K9330
12352b7663K8036N614j3513l9604j1254K7767L8134K418m976Q962j0202o692j3021
12339a5994m227o25Q022M206J4256l587J4433m456k7129j3438j5393J1228J502
12326c1202K6547J3070k2494q493M970k2529p795M502J1349R281L0574J0092J7628
12313C5500p048j6963k5368j7158L0578J1254j5898O999O551J5471Q406J0508
$$ plain form
12301 42832 35118 2243 -17272 -12289 25776 32902 20864 -2315 -18299 -5545 18494 18093 12900
12288 12900 4124 2629 8795 -3286 -8760 -194 27816 38111 48378 38223 11193 -26449 -22712
12275 -22712 -9641 -17539 -11929 3384 -7774 13258 28599 49892 52196 27650 3137 -9021
12263 -9021 15916 37860 40918 -237 -4675 -14858 2294 31993 48593 45012 34385 21495
12251 21495 33441 27297 25873 31729 31043 -6614 -13832 228 -145 -36742 -35613 -27308 -22772 -16385
12237 -16385 1512 -5404 -13399 -28061 -30584 -11083 -143 4084 -26444 -41938 -24713 14233
$$ packed form
12301D2832p714l2875j9515M983L8065P126j2038k3179j5984J2754K4039m01n193
12288A2900q776j495O166j2081n474Q566K8010J0295J0267j0155k7030l7642L737
12275b2712J3071p898N610J5313j1158K1032J5341K1293K304k4546k4513j2158
12263i021K4937K1944L058m1155m438j0183J7152K9699J6600l581j0627j2890
12251B1495J1946o144j424N856o86l7657p218J4060l73l6597J129Q305M536O387
12237a6385J7897o916p995j4662k523J9501J0940M227l0528j5494J7225L8946
$$ [...]
##END NTUPLES=NMR SPECTRUM
##END=
