##TITLE=Analysis number 328018
Compound Code cc 50546
Book Reference 521/51
Project Code adrs
Chemist Name evam
##JCAMPDX= 6.0         $$ Bruker NMR JCAMP-DX V2.0
##DATA TYPE= NMR SPECTRUM
##DATA CLASS= NTUPLES
##ORIGIN= Bruker BioSpin GmbH
##OWNER= nmr
$$ XWIN-NMR		Version 3.5
$$ Wed Apr 25 13:08:28 2007 GMT Daylight Time (UT+1h)  MAYBRIDGE\nmr@NMR_250MHZ
##.OBSERVE FREQUENCY= 250.131544655141
##.OBSERVE NUCLEUS= ^1H
##.ACQUISITION MODE= SIMULTANEOUS (DQD)
##.ACQUISITION SCHEME= undefined
##.AVERAGES= 16
##.DIGITISER RES= 18
##SPECTROMETER/DATA SYSTEM= dpx250
##.PULSE SEQUENCE= zg30
##.SOLVENT NAME= CDCl3
##.SHIFT REFERENCE= (INTERNAL, CDCl3, 0, 16.522)
##AUDIT TRAIL= $$ (NUMBER, WHEN, WHO, WHERE, WHAT)
$$ ##TITLE= Audit trail, XWIN-NMR		Version 3.5
$$ ##JCAMPDX= 5.01
$$ ##ORIGIN= Bruker BioSpin GmbH
$$ ##OWNER= nmr
$$ C:\u/data/dgb/nmr/ADRS/3110/pdata/1/auditp.txt
$$ ##AUDIT TRAIL=  $$ (NUMBER, WHEN, WHO, WHERE, WHAT)
(   1,<2007-04-25 13:08:04.20 +100>,<MAYBRIDGE\nmr>,<NMR_250MHZ>,
      <created by zg, POWCHK disabled, PULCHK disabled
       configuration hash MD5:
       76 6E 9A 78 1E 09 19 81 EC 84 63 8F B0 6A 59 2D
       data hash MD5: 64K
       82 72 67 4B 48 E5 24 F5 CE 2C DD 2E 4E 5E 82 0D>)
(   2,<2007-04-25 13:08:18.31 +100>,<MAYBRIDGE\nmr>,<NMR_250MHZ>,
      <Start of raw data processing
       ef LB = 0.3 FT_mod = 6 PKNL = 1 SI = 32K 
       data hash MD5: 32K
       1F 4E 89 4F 1C 93 6C 3B 78 60 F1 AA 8B 0F 1B D2>)
(   3,<2007-04-25 13:08:19.89 +100>,<MAYBRIDGE\nmr>,<NMR_250MHZ>,
      <apk 
       data hash MD5: 32K
       79 9B 4B 81 61 C9 9D AC C9 32 54 17 6E AF 78 E9>)
(   4,<2007-04-25 13:08:20.57 +100>,<MAYBRIDGE\nmr>,<NMR_250MHZ>,
      <abs ABSG = 5 
       data hash MD5: 32K
       C2 A5 08 44 2B 59 A4 09 C5 B3 8B 1B B8 A8 7B 98>)
$$ ##END=
$$ 
$$ hash MD5
$$ 19 0C 72 59 85 71 25 1E 85 19 FA E9 70 B7 73 27
##$RELAX= 
##$RELAX= 
##$RELAX= 
##$RELAX= 
##$RELAX= 
##$RELAX= 
##$RELAX= 
$$ Bruker specific parameters
$$ --------------------------
##$DU= <C:\u>
##$EXPNO= 3110
##$NAME= <ADRS>
##$PROCNO= 1
##$TYPE= <nmr>
##$USER= <dgb>
##$AMP= (0..31)
100 100 100 100 100 100 100 100 100 100 100 100 100 100 100 100 100 100 
100 100 100 100 100 100 100 100 100 100 100 100 100 100 
##$AQSEQ= 0
##$AQ_mod= 3
##$AUNM= <au_zg>
##$AUTOPOS= <27 >
##$BF1= 250.13
##$BF2= 250.13
##$BF3= 250.13
##$BF4= 250.13
##$BF5= 500.13
##$BF6= 500.13
##$BF7= 500.13
##$BF8= 500.13
##$BYTORDA= 1
##$CFDGTYP= 0
##$CFRGTYP= 5
##$CHEMSTR= <none>
##$CNST= (0..31)
1 1 145 1 1 1 1 1 1 1 1 1 1 1 1 1 1 1 1 1 1 1 1 1 1 1 1 1 1 1 1 1 
##$CPDPRG= <>
##$CPDPRG1= <>
##$CPDPRG2= <>
##$CPDPRG3= <>
##$CPDPRG4= <mlev>
##$CPDPRG5= <mlev>
##$CPDPRG6= <mlev>
##$CPDPRG7= <mlev>
##$CPDPRG8= <mlev>
##$CPDPRGB= <>
##$CPDPRGT= <>
##$D= (0..31)
0 1 0 0 0 0 0 0 0 0.06 0 0 0 0 0 0 0.0002 0 0 0 0 0 0 0 0 0 0 0 0 0 0 
0 
##$DATE= 1177502883
##$DBL= (0..7)
120 120 120 120 120 120 120 120 
##$DBP= (0..7)
150 150 150 150 150 150 150 150 
##$DBP07= 0
##$DBPNAM0= <>
##$DBPNAM1= <>
$$ [...]
##$SUBNAM7= <"">
##$SUBNAM8= <"">
##$SUBNAM9= <"">
##$SW= 20.6930455092707
##$SWIBOX= (0..15)
0 0 3 0 0 0 0 0 0 0 0 0 0 0 0 0 
##$SW_h= 5175.983436853
##$TD= 65536
##$TD0= 1
##$TE= 683.16
##$TE2= 300
##$TE3= 300
##$TEG= 300
##$TL= (0..7)
0 120 120 120 120 120 120 120 
##$TP= (0..7)
150 150 150 150 150 150 150 150 
##$TP07= 0
##$TPNAME0= <>
##$TPNAME1= <>
##$TPNAME2= <>
##$TPNAME3= <>
##$TPNAME4= <>
##$TPNAME5= <>
##$TPNAME6= <>
##$TPNAME7= <>
##$TPOAL= (0..7)
0.5 0.5 0.5 0.5 0.5 0.5 0.5 0.5 
##$TPOFFS= (0..7)
0 0 0 0 0 0 0 0 
##$TUNHIN= 0
##$TUNHOUT= 0
##$TUNXOUT= 0
##$USERA1= <user>
##$USERA2= <user>
##$USERA3= <user>
##$USERA4= <user>
##$USERA5= <user>
##$V9= 5
##$VALIST= <valist>
##$VCLIST= <CCCCCCCCCCCCCCC>
##$VD= 0
##$VDLIST= <DDDDDDDDDDDDDDD>
##$VPLIST= <PPPPPPPPPPPPPPP>
##$VTLIST= <TTTTTTTTTTTTTTT>
##$WBST= 1024
##$WBSW= 4
##$XGAIN= (0..3)
0 0 0 0 
##$XL= 0
##$YL= 0
##$YMAX_a= 381428
##$YMIN_a= -394695
##$ZGOPTNS= <>
##$ZL1= 120
##$ZL2= 120
##$ZL3= 120
##$ZL4= 120
##$ABSF1= 16.522
##$ABSF2= -4.171173
##$ABSG= 5
##$ABSL= 3
##$ALPHA= 0
##$AQORDER= 0
##$ASSFAC= 0
##$ASSFACI= 0
##$ASSFACX= 0
##$ASSWID= 0
##$AUNMP= <proc_1d>
##$AZFE= 0.1
##$AZFW= 0.1
##$BCFW= 0
##$BC_mod= 0
##$BYTORDP= 0
##$COROFFS= 0
##$CY= 12.5
##$DATMOD= 1
##$DC= 0
##$DFILT= <>
##$DTYPP= 0
##$F1P= 14.0000005364418
##$F2P= -0.99999901652339
##$FCOR= 0.5
##$FTSIZE= 32768
##$FT_mod= 6
##$GAMMA= 0
##$GB= 0
##$INTBC= 1
##$INTSCL= 1
##$ISEN= 128
##$LB= 0.3
##$LEV0= 0
##$LPBIN= 0
##$MAXI= 10000
##$MC2= 0
##$MEAN= 0
##$ME_mod= 0
##$MI= 0
##$NCOEF= 0
##$NC_proc= -4
##$NLEV= 6
##$NOISF1= 0
##$NOISF2= 0
##$NSP= 0
##$NTH_PI= 0
##$NZP= 0
##$OFFSET= 16.522
##$PC= 1
##$PHC0= -52.12163
##$PHC1= 2.223756
##$PH_mod= 1
##$PKNL= yes
##$PPARMOD= 0
##$PSCAL= 4
##$PSIGN= 0
##$REVERSE= no
##$SF= 250.13
##$SI= 32768
##$SIGF1= 0
##$SIGF2= 0
##$SINO= 400
##$SIOLD= 32768
##$SREGLST= <1H.CDCl3>
##$SSB= 0
##$STSI= 32768
##$STSR= 0
##$SW_p= 5175.98343685301
##$SYMM= 0
##$S_DEV= 0
##$TDeff= 65536
##$TDoff= 0
##$TI= <Analysis number 999999
Compound Code 99
Book Reference 9
Project Code 9>
##$TILT= no
##$TM1= 0
##$TM2= 0
##$TOPLEV= 0
##$USERP1= <user>
##$USERP2= <user>
##$USERP3= <user>
##$USERP4= <user>
##$USERP5= <user>
##$WDW= 1
##$XDIM= 32768
##$YMAX_p= 485058783
##$YMIN_p= -139983
$$ End of Bruker specific parameters
$$ ---------------------------------
##NTUPLES= NMR SPECTRUM
##VAR_NAME=  FREQUENCY,     SPECTRUM/REAL,   SPECTRUM/IMAG
##SYMBOL=    X,             R,               I
##VAR_TYPE=  INDEPENDENT,   DEPENDENT,       DEPENDENT
##VAR_FORM=  AFFN,          ASDF,            ASDF
##VAR_DIM=   32768,         32768,           32768
##UNITS=     HZ,            ARBITRARY UNITS, ARBITRARY UNITS
##FACTOR=    0.157963299565203, 1,           1
##FIRST=     4132.6476996994, 0,             0
##LAST=      -1043.33573715361, 0,           0
##MIN=       -1043.33573715361, -139983,     0
##MAX=       4132.6476996994, 485058783,     0
$$ Real data points
##PAGE= N=1
##DATA TABLE= (X++(R..R)), XYDATA
$$ [...]
20581 -3795 11557 17419 9709 15105 28273 24349 10963 4480 -10328 -25840 -23003 -22249 -15176 12101
20567 12101 12954 -10060 -43300 -35491 -13886 -11473 -39409 -50688 -44199 -16902 2833 -11080 -38220
20554 -38220 -60653 -55547 -51304 -46542 -17260 -19144 -43952 -53055 -33042 -24724 -9183 -3230 -5634
20541 -5634 -1250 -1434 -6075 -10381 -25102 -25508 -24641 -16795 -8541 -32051 -33427 -19326 -4865 -10076
20527 -10076 2709 -412 -6498 -20993 -39654 -37781 -19259 4529 11031 -869 -26062 -12021
20515 -12021 -4395 -8939 -14261 -1586 35087 10140 -3497 -8611 -30193 -32602 -14485 12511 4180
20502 4180 -6621 -17544 -35984 -45326 -51324 -53855 -38244 -4129 -242 823 -8669 -10778 -2811
20489 -2811 -6581 -16685 -11983 -13081 -13291 -20514 -6763 -13641 -48362 -70354 -45646 -44503 -33638
20476 -33638 -24716 -30694 -41168 -55737 -44033 -27806 -32339 -43462 -58538 -62696 -36345 -33168 -25454
20463 -25454 -584 2074 5717 -4268 -26261 -20279 -7673 5497 5300 8849 1812 -12946 -15188
20450 -15188 7194 8940 -10329 -38332 -44939 -28600 -15678 -9744 -16827 -38622 -63553 -44331
20438 -44331 -35547 -30195 -39921 -26637 -11186 -43879 -27827 -15196 -27336 -11023 6351 30941
20426 30941 45722 46786 31985 -6445 -12425 -26198 -31972 -32115 -2843 -9877 -11607 -8053 6730
20413 6730 5243 -9365 -6169 1980 -11170 -3386 11406 17093 -7283 -15843 -3270 -15972 -10655
20400 -10655 2776 -9745 -17478 -32792 -20758 -11629 -20111 -38650 -54285 -48205 -60273 -60982 -71497
20387 -71497 -58669 -55720 -62289 -83133 -68993 -56848 -76265 -45381 -33472 -39597 -34832 -19199
20375 -19199 -13080 -11371 -5574 -26787 -36515 -59574 -53129 -30312 -20946 -25729 -22037 -26113 -23362 -37592
20361 -37592 -42876 -27894 -1759 5117 -5271 -24300 -37693 -31912 -49723 -54108 -35017 -28275 -28860
20348 -28860 -189 10661 20715 9397 80 -7817 -11097 -1601 8512 31665 33417 30342 11275
20335 11275 5404 -9441 -22712 -10511 4478 2746 -13452 -27584 -33600 -15999 -8665 697 10527
20322 10527 4787 -10384 -30240 -4419 -875 -59 -37685 -73183 -62004 -52264 -16742 10081 18715
20309 18715 27530 20142 4691 -8542 -16292 2620 45331 55682 25382 9431 10839 12626 25392
20296 25392 39777 44585 14748 -26377 -38592 -23377 -36471 -65257 -42836 -34003 -21344 -10271
20284 -10271 915 -25176 -15976 -6328 -15059 23627 46397 27921 21492 5831 -1756 -14438 -15072
20271 -15072 -25872 -26075 -27871 -47318 -30314 -11158 -19998 -59623 -42769 -10943 13440 19269 12081
20258 12081 -26407 -44043 -14908 -13198 -20520 -36292 -33554 -36533 -11336 3683 -12941 8381
20246 8381 28117 24838 21056 16133 35687 43357 23490 12863 17588 10467 8611 21819 25525
20233 25525 32487 23922 5686 11344 13179 -7141 -16586 9248 26787 6757 2461 2830 -12584
20220 -12584 -12657 -29626 -31169 -801 -13704 -38786 -24005 -15693 -22384 -34714 -25218 -8685 2927
20207 2927 -2207 942 26923 28434 -634 -17988 -28964 -19983 12315 -5903 -20102 -17003 -24051
20194 -24051 -43100 -43186 -41075 -42115 -38193 -26521 -14431 -6225 17256 22901 -2320 -10978 -14821 -43526
20180 -43526 -47271 -31660 -16714 -17750 3816 -13946 -50523 -54302 -43963 -21081 -12676 -9310 -8344
20167 -8344 -27836 -44344 -61130 -51264 -48394 -67005 -41164 -8700 -18054 -3427 10932 2386 6608
20154 6608 11557 -4574 -33503 -24315 -35560 -29065 -34187 -28335 -39917 -32768 -14202 -19223 -4845
20141 -4845 31512 13836 -4965 11104 -6450 -4472 -18491 -69480 -86760 -60968 -32252 -21064
20129 -21064 -5477 -10914 -15138 -14247 -47602 -82733 -68970 -68287 -48893 -40836 -53011 -59072 -40625
20116 -40625 -22900 969 17993 10268 -29443 -21085 20587 -16089 -52049 -68276 -51907 -23281
20104 -23281 10861 13714 -7293 -31171 -20773 6191 43393 21640 16692 7362 8235 10349 1282
20091 1282 -13230 -17948 5566 5200 -19185 -13741 -16291 -21388 260 -3218 -330 9636 -7387 -35793
20077 -35793 -32478 -13123 -8576 -13287 -9034 15193 9087 -7879 10772 20889 2187 -11100 -36496
20064 -36496 -23488 -19133 -33672 -40418 -29361 -53936 -66654 -57105 -33720 -6467 9676 -10702
20052 -10702 -4806 -17243 -19328 -25993 -20502 -20170 -24043 -21689 -7817 -6122 -18881 -21159 -44667 -44031
20038 -44031 -50303 -57385 -30313 -18087 -43847 -30064 12564 33941 22511 25686 -9123 -51535
20026 -51535 -57114 -43730 -15548 2667 -174 -21322 -11238 -31874 -36127 -31657 -15763 -18960 -19254
20013 -19254 -29917 -40511 -15984 7352 7950 8431 -5900 -11944 17964 47998 60895 42530 57994
20000 57994 108459 141513 186179 227685 259305 295933 318784 314940 314258 331472 314621 278500
19988 278500 251229 204715 152860 108350 74137 45505 -291 -865 31556 44588 55540 64836
19976 64836 68855 42968 16930 27973 38764 82627 100126 96075 116353 122882 158311 195172
19964 195172 210321 226164 249344 262424 272692 277406 287485 282689 245675 223876 179249 106158
19952 106158 70077 53668 15327 -21349 -25002 -23321 -16156 2122 -4720 9098 6591 -25714
19940 -25714 -34763 -18416 -8944 2994 22111 -4998 -25370 -25007 -23480 -27254 -32920 -47779 -75096
19927 -75096 -107894 -139983 -102564 -27356 -22659 -28227 -12216 -3715 5199 11216 6191 8759 460
19914 460 4128 -12983 -4232 1818 -12262 -40715 -47183 -44895 -36682 -23764 -19076 -33516 -22145
19901 -22145 -22418 -19141 -10864 -2589 -33757 -39407 -18587 -14962 -15379 -18426 -19050 802 370 -13974
19887 -13974 -20963 -25816 -55855 -67619 -50293 -25503 560 16546 5597 10349 7783 -12353
19875 -12353 2904 -1174 -24794 -37373 -15854 -1826 -19607 -45507 -6420 24713 9966 24779
19863 24779 30504 13561 24612 19289 -25798 -18443 -28074 -20460 8131 9704 -7991 -6622 -7370
19850 -7370 -27232 -74798 -72337 -70151 -58288 -26339 -40738 -58265 -40325 6278 49923 30775
19838 30775 475 -3668 -27709 -49053 -49131 -37726 -17917 34307 38709 24705 24857 28260 40271
19825 40271 41009 23010 5046 13217 22852 3925 -16809 -9109 20095 31255 3593 -16672 -16479
19812 -16479 -7089 -16321 -13011 -43388 -61596 -88281 -76370 -53809 -44082 -55969 -43792 -22582
19800 -22582 -8661 -44186 -61824 -26069 -3015 -6971 -5203 -665 -1673 -34139 -40663 -29546 -18550
19787 -18550 -19225 -17382 -7028 17596 -5777 -20867 -17697 12885 26158 -19807 -49752 -45997 -21061
19774 -21061 -10235 -1430 14920 17827 2335 -12069 -21074 -32700 -27675 -37773 -39098 -46943 -70711
19761 -70711 -47704 -42929 -51241 -53777 -54758 -29759 -20331 -23530 -37810 -71087 -89608 -69539 -35150
19748 -35150 18 -5040 -20624 -583 -8436 -17058 -21749 -7038 14959 36779 21125 18543 18839
19735 18839 3540 -1134 17280 14614 25888 37828 45340 43466 23758 21217 1468 -15261 -29506
19722 -29506 -11849 6550 9945 1943 -1394 1716 27926 39121 14116 3579 -16473 -14453 5529
19709 5529 -494 7659 44549 38409 35554 36328 38094 39448 46498 65695 92027 70181 45808 37893
19695 37893 23955 12628 36295 37404 23498 9510 12063 10193 -1871 759 -566 22464 37972
19682 37972 61082 81331 83528 58862 52437 30822 40069 33147 37610 24119 16363 26302 21515
19669 21515 30044 50904 39914 40816 44830 30363 37706 41258 47762 63635 48907 17714 12311
19656 12311 31217 42414 38369 40041 30780 27272 20601 3612 -7802 -35631 -42126 -41389 -27619
19643 -27619 -190 7116 25396 39464 38801 12163 -6975 -8768 -5799 12374 22797 24342 19801
19630 19801 16650 12487 12265 23612 33085 35161 30705 27629 8432 -8223 -4590 31548 36529 49234
19616 49234 46724 20813 6819 21781 12451 -4427 -21521 -19928 -16277 -14555 -13765 -20252 -22874
19603 -22874 8014 40178 53123 44172 41786 52613 69137 69595 68798 64025 68633 62143 41182
19590 41182 57314 84283 82147 92421 100942 91548 80159 78473 72315 55782 73524 84963 77823
19577 77823 76635 70060 69422 62733 51588 34167 35827 26682 30824 33861 36002 27824 11767 2557
19563 2557 879 22533 48963 75725 93629 100662 71162 23947 30673 43249 73435 102716
19551 102716 89614 80494 84136 102587 123226 117859 107219 88924 95366 125500 137264 123488
19539 123488 105360 103806 81358 66930 69829 54166 33107 22114 4816 -1280 326 28429
19527 28429 34507 63176 73543 72303 59136 39264 32214 40408 75968 90237 80151 42017
19515 42017 46255 38605 54272 93930 111504 130042 149985 144716 130545 122745 130070 131856 116999
19502 116999 156799 161922 181851 169117 157088 159566 187864 199091 180776 200592 217317 272671
19490 272671 308056 323324 348166 383222 400330 427124 473930 528073 592683 689770 774312
19479 774312 826554 867371 884143 895679 925107 943106 969676 1005399 1039973 1079949 1184463
19468 1184463 1296026 1420603 1555277 1712434 1923044 2146492 2431495 2781033 3208984
19459 3208984 3714390 4339855 5112477 6024583 7109492 8404907 10006644 12012009 14498550
19450 14498550 17513770 20950235 24695943 28980125 34264781 40923404 48567759 55496831
19442 55496831 59184057 58687909 56378785 54506369 52995332 49466705 42410898 33643696
19434 33643696 25522511 19218567 14761808 11728940 9732505 8516913 7833049 7529277
19426 7529277 7505915 7788480 8332397 9116809 10151241 11519108 13237795 15490547 18327002
19417 18327002 21587333 25169724 29204825 34109162 40359004 47879861 55397544 60342361
19409 60342361 60844905 58646207 56420111 54894988 52086827 45640909 36664468 27674125
19401 27674125 20374400 15024725 11253809 8630425 6801452 5468514 4494986 3820169
19393 3820169 3307256 2919218 2638238 2422586 2288606 2163047 2027261 1921488 1837687 1755277
19383 1755277 1688743 1594821 1447153 1346694 1290282 1260906 1229422 1199860 1158320 1138481 1140075
19372 1140075 1117656 1056524 1027563 966346 899575 855660 775941 717317 648245 553878 513664
19361 513664 481101 447402 422184 409483 383811 346235 339502 350469 308780 297934 282557 254927
19349 254927 248364 243977 240486 245834 218150 219673 231427 231071 212631 230826 247879 258381 287212
19336 287212 282219 275820 293291 288147 260273 248243 235408 232964 255684 268529 253819 243825
19324 243825 230301 227813 246434 269094 249165 215938 231740 246132 217506 224810 241814 229534
19312 229534 209515 200323 193117 203557 208400 203296 190470 170512 177111 128017 94971 108518
19300 108518 110453 105536 112017 110894 123179 111555 117394 107812 89395 107236 110795 80763 82618
19287 82618 84046 127150 134519 145735 143442 127335 117052 108890 105648 109843 87879 71914 73236
19274 73236 37771 9289 15623 19359 7473 -10877 -19838 -4546 18866 39726 56704 29471
19262 29471 34336 57032 42045 42553 36309 7172 20741 38562 66077 48120 37525 67912
19250 67912 83852 47196 8609 4101 9163 46164 50965 55147 58618 40180 40275 49184 34478
19237 34478 2926 -6558 12157 20624 30648 22527 4291 -4741 -21469 -19674 -7629 11514 19306
19224 19306 14952 -6786 -5529 -6753 -29654 -13805 4130 22360 43013 51292 19186 8183
19212 8183 16382 45988 29881 27032 18176 22640 13438 8529 28303 42153 28878 22666 26640
19199 26640 26587 7406 390 -8933 -12919 -9247 440 -9457 -18222 3592 611 -44 -15298 -27337
19185 -27337 -36290 -36871 -1621 2823 10364 20593 9429 31822 29604 7450 -40358 -43737 -25705
19172 -25705 -22273 -21091 -18865 1010 10520 26947 13676 6639 29054 30205 19519 -2850 -9696
19159 -9696 -3574 12795 10493 11488 2021 -25215 -18693 108 23660 16522 4921 16207 6000
19146 6000 4970 20541 20556 15655 23270 31932 41229 19785 29585 30562 20386 17849 413 9272
19132 9272 1882 4952 18772 16564 13574 -2507 -19085 -12181 -9575 -21585 -45135 -45899 -20906
19119 -20906 6405 4571 -9278 -3473 -5601 -27552 -38409 -32344 -8675 23404 28164 36539 43354
19106 43354 30898 20921 15182 6740 4974 -6481 -6852 -3703 -2165 3221 -6385 -19706 -14863 -12430
19092 -12430 -18298 -5100 8875 28908 26749 29755 33797 21427 24294 11182 3031 -7154 -7079
19079 -7079 9395 12862 -3472 -5443 -22655 -28872 -45854 -59057 -54543 -50606 -53528 -48009 -42864
19066 -42864 -29812 -15208 -14287 -9789 -26382 -24540 -7132 18485 20224 12546 21081 21206 5662
19053 5662 -5084 -7412 -3098 -1199 -8768 14140 46465 61025 28179 8471 10708 27168 48116
19040 48116 39227 14066 -1393 -20173 7090 31560 14682 5892 -17044 -13892 -11392 -9075 -1597
19027 -1597 789 -6430 1727 25993 19306 -22836 -46154 -37116 -53745 -20587 2498 17768 20685
19014 20685 4847 -25013 -40283 -39034 -48665 -56356 -29723 -10949 13921 -3390 -551 -3012 11071
19001 11071 4062 -1887 -5695 -33774 -30530 -10015 -5735 -1359 -8294 17450 17503 -20024 -22174 -28013
18987 -28013 -47655 -37824 -55380 -45662 -40136 -41308 -32503 7316 53382 53604 12144 -1818 -1471
18974 -1471 15865 15448 20261 9937 3505 343 -37592 -41200 -23720 -19013 8890 22257 5308
18961 5308 36329 38115 -5193 4936 23571 18917 28527 3045 -22426 -27016 -37155 -28546 -28415
18948 -28415 -27327 -15658 -6673 -15851 -17111 -366 19671 21668 -18120 -7502 13508 21587 -17355
18935 -17355 -32421 -14502 2822 8924 3619 13379 21850 16235 25855 6146 -835 47000 60295
18922 60295 52131 33865 -11147 -21122 -17602 -36429 -18141 15531 55114 56545 22005 3561
18910 3561 11555 7853 18167 11156 4619 24050 28513 25625 20219 -21662 -13882 23862 41629
18897 41629 40612 48458 97445 83403 62082 99840 122318 128053 167743 211784 200241 217981
18885 217981 243833 293461 316435 297913 280981 254051 249656 221385 188652 137684 112984 104595
18873 104595 70661 47165 9366 -17549 -7694 -8790 -2499 4282 37968 54336 51263 71444
18861 71444 54217 63302 71768 103226 127338 146289 174087 209869 249044 277147 302146 300721
18849 300721 286353 257928 244086 241749 236693 211274 161420 104437 63991 55842 44827 12572
18837 12572 29887 33532 11726 20198 12271 7765 -5393 -19849 -18063 741 3108 8041 21104
18824 21104 33839 34521 37159 -1048 -25794 -18005 -6160 -18285 -14121 -17327 2995 20308 10913
18811 10913 9096 9125 -15691 -19101 -32941 -61398 -53120 -25324 -28122 -31095 -53350 -47231 -15989
18798 -15989 -19846 -31063 -37741 -42923 -39762 -21250 -13794 -11126 -33294 -23507 6426 10636 5939
18785 5939 6612 -24437 -26608 -23794 -31237 -7834 9623 19225 -8758 -39158 -29280 29987 65116
18772 65116 78347 91365 85218 97297 103208 115569 163275 202776 163655 109267 50556 21875
18760 21875 21340 16193 11998 20086 26075 14840 2373 -1897 394 5045 -8507 -23385 -45589
18747 -45589 -28585 -29341 10713 16202 8710 35939 19536 3634 759 21341 35799 44870 27898
18734 27898 34274 34001 28341 -27114 -38207 -11454 8839 21593 19120 -4201 -9125 21469 56386
18721 56386 36425 -8454 -11416 -12329 -1033 -3690 -24341 -33720 -32913 -1313 13077 -25796 -24488
18708 -24488 2123 18090 3326 4551 -9844 -13487 -11184 -15619 -21414 -2990 24333 26465 2093
18695 2093 13923 34900 25656 -4483 13071 23224 33804 25949 10581 -7874 -31889 -43149
18683 -43149 -24546 -29858 -30515 -30083 -19505 -14329 -4429 9312 2249 19003 22006 14558 -29034 -28609
18669 -28609 2048 -5393 -16685 -50491 -45863 -35424 -866 -1718 -5581 32881 57879 29786 23141
18656 23141 10303 31866 26375 8664 9640 -36145 -48220 -44421 -27863 -36226 -29399 9150 39859
18643 39859 10801 1349 -29747 -20031 -20058 -36761 -30116 -28777 -29485 -19096 12109 32304 30908 15742
18629 15742 9801 18599 25494 22796 13252 10576 17403 1426 -10319 -3764 17022 20874 9595
18616 9595 -7193 -23925 -19987 -8033 16398 28527 -17006 -13043 5104 1348 -18865 -17141 -10441
18603 -10441 -5217 -62 -7820 -15479 -13012 12657 14193 5324 1559 -2694 -5583 -14920 -10890 -15168
18589 -15168 -10706 -775 -1060 17248 12245 22709 22691 26409 36762 18955 25698 10236 -12536 -34501
18575 -34501 -30820 -23857 -17149 -17964 -36852 -54524 -54243 -74715 -57933 -21473 -3141 -24196 -24464
18562 -24464 -17018 -25873 -12520 12882 -5944 -2167 4490 -1908 16961 9602 -1581 -9312 -28193
18549 -28193 9900 7775 -4141 -19192 -25363 -31945 -48429 -36303 -36018 -39110 -21308 7329 6385
18536 6385 6195 -1192 -9341 -6180 -13553 4280 -6403 -2908 -41257 -42908 -8259 18410 16287 5135
18522 5135 -16732 -31758 -51095 -33429 -18282 10516 -6956 -6419 -25606 -38868 -29153 -41024
18510 -41024 -28343 -21494 -516 -14681 -27430 -28587 -21805 -29264 -12022 -1578 24181 -14911
18498 -14911 -23661 -15262 -20493 -14830 -7561 -14238 -57195 -77247 -64288 -42988 -15662 6446 2158
18485 2158 -17609 -8405 16904 15321 11099 22693 36080 25628 -3026 -26984 -36124 -25223 -38649
18472 -38649 -15056 9383 8032 2898 -8995 -17542 -10099 1598 11867 729 -18062 19651
18460 19651 56244 37636 25972 36534 17448 -4693 -22419 -37300 -10543 2837 3005 -1151
18448 -1151 -9116 921 -1620 -12830 -49492 -53099 -30656 -32027 -16794 -1971 -3839 3963 -2005
18435 -2005 550 -2614 12226 5665 -21396 -12040 -17726 1719 27324 3310 -19421 -11933 1114
18422 1114 -9160 -10096 16585 56506 77618 83284 69701 59037 42974 287 -27644 -41629
18410 -41629 -48354 -28859 -12866 15310 -7662 -3157 8403 10951 -12919 -21556 -6794 25841
18398 25841 11346 -14938 -53432 -66881 -51283 -32864 -20240 -5779 -19561 -25150 -48538 -42530
18386 -42530 -44971 -39011 -26166 -11027 -43081 -62029 -42710 -5906 15116 47211 45149 55349
18374 55349 51753 71779 71209 51874 17671 14764 34541 47347 42003 53641 51214 28430 32474
18361 32474 29007 73380 61575 40840 38725 28696 32236 58175 63850 27192 22356 -9436 -24634
18348 -24634 -30093 -35466 -10846 7919 755 -291 -6500 550 -2159 -2642 -13951 -24736 -18165 -23778
18334 -23778 -9297 -24550 -33393 -34251 -29302 -3781 -10428 -1682 -6588 -18392 -12476 2263 -6279
18321 -6279 -9742 -12775 -25462 -3161 22811 22157 12673 10589 26683 56792 79021 69411 69767 79653
18307 79653 61037 34477 16407 20745 28635 18696 15651 3852 1371 6623 -12888 -31420 -25327
18294 -25327 -38994 -38536 -7963 -195 -24384 -25542 1062 10473 -20257 -26908 -28190 -26869 -20549
18281 -20549 -15690 -33066 -29833 -6787 -21667 -32750 -9810 5708 -13702 -3951 -8706 -11707 -26981
18268 -26981 -34903 -33296 -12824 5146 -5316 4139 -13287 -10390 -10993 -11876 1322 27589 31801
18255 31801 22022 32378 54700 85673 64583 26406 -3 26091 30024 -8364 -19090 -5663
18243 -5663 -5974 11040 21966 1217 -22654 -21592 21265 42152 28072 18227 -2706 -7391 -16619
18230 -16619 2639 20047 11298 -3061 26473 27716 2256 -13315 -8200 -21711 -23210 -5173
18218 -5173 -1007 -13080 -466 -26527 -31988 -22187 -17359 14692 41152 34901 9310 25931 49003
18205 49003 36142 18708 320 14620 8203 -3125 -19507 -40054 -28156 15850 31018 32009
18193 32009 2352 -8843 -28758 -34888 -25544 20170 61948 51511 20225 -3763 12655 27728
18181 27728 27830 31892 7762 -13445 -41865 -20644 8904 27540 39924 22506 10373 11346 10928
18168 10928 28472 27645 23868 21368 31117 27527 24338 15360 34517 39494 33467 33072 32314 62135
18154 62135 72807 48893 56313 58320 16267 8378 24980 59184 84519 88771 86746 99103 90829
18141 90829 102342 120860 122161 138384 164465 194524 211748 215005 244397 285123 324242 346114
18129 346114 397798 490925 626202 811252 1022582 1316300 1686874 2079210 2532699 3080000
18119 3080000 3632943 4242803 5032723 6135188 7735609 9973119 12463038 14288922 16075792
18110 16075792 18648030 22704629 29107899 38595139 40170765 29474681 19689542 12814551
18102 12814551 8394357 5634682 3967604 2876338 2146272 1642108 1290151 1058707 878206
18093 878206 741283 639582 574244 504204 459963 404088 343345 294833 281181 268564 267772
18082 267772 249043 231893 216581 220373 198802 180859 173814 198628 180636 146780 135079 122553
18070 122553 130781 128204 133541 127359 117160 94608 89988 59156 42324 35059 42158 49283 51888
18057 51888 51402 45270 30635 44537 54742 56431 55801 68222 91256 77961 67177 47988 56869
18044 56869 73207 94853 73702 34882 22208 23880 17318 -4272 -9208 1502 43843 46754
18032 46754 40548 34837 56719 73841 55268 33767 32471 31207 41218 64642 58627 44056 -3149
18019 -3149 2724 6679 -5837 -15106 15741 31803 44020 17772 -18386 -9379 10614 14569 15852
18006 15852 35051 48379 23248 3500 11337 3351 -23314 -10477 14663 10860 2372 4102 2970
17993 2970 7416 48242 55323 45626 28556 10212 26324 31729 14975 14344 25944 26367 40564
17980 40564 27264 32744 22894 -5340 -3421 9186 -2232 -1145 25070 39362 19111 21128 24440
17967 24440 14324 -3778 -6897 -680 10497 -5805 -13846 -28790 -27556 -10150 721 -9186 -169
17954 -169 7473 -18165 -14154 -11773 14921 36642 34172 3890 -22655 -35555 -4814 38526 53904
17941 53904 40770 17011 5616 -4599 8925 18536 11757 -8647 -17772 -24330 -23204 -29354 -28479
17928 -28479 -16530 -15930 -30450 -35654 -8605 -502 11599 22987 22037 -8324 -26891 -31195 -37660
17915 -37660 -21505 -6464 4904 -5529 3488 13973 30824 32276 4749 -26511 -19173 4389
17903 4389 -11713 -18719 -22095 -37412 -37636 -24145 8550 6410 2104 -2595 -30341 -16593 4082
17890 4082 -5621 293 43738 60520 54466 40082 2288 -33663 -8112 -17462 -45244 -54662 -52078
17877 -52078 -56062 -57955 -20166 10059 -1313 -3274 4788 -18119 -32079 -40531 -16805 8913 7264
17864 7264 20700 10839 9675 -1617 -9525 -1902 26290 45406 26153 26499 33132 27280 40322
17851 40322 8757 210 9866 24557 8858 16800 14382 705 -11917 -11019 15268 35848 51126
17838 51126 15697 -14383 -20959 -32325 -56863 -35637 -3017 26695 -3278 -12912 14616 31098
17826 31098 34276 13803 32193 60991 57110 16509 10232 10952 2279 6786 2786 -7389 -9508
17813 -9508 -5815 520 16563 36564 44909 26719 9779 -5570 -19478 -19581 -13135 -39823 -41218
17800 -41218 -36616 -39039 -11339 -4881 4889 11041 -68 7169 -1151 -15960 -15403 20542 31233
17787 31233 24362 13806 15351 10497 -17063 -15470 -27972 -31187 -11227 12070 22259 36369 38806
17774 38806 20965 -27207 -43204 -12310 -19498 -35450 -15790 18690 37167 4529 1138 26983
17762 26983 22911 8615 17413 21937 27392 2828 4290 33905 9984 8925 -5352 3084 3805
17749 3805 3660 2740 16366 8864 6135 23516 29963 25054 37714 64463 38905 27225 19507 4312
17735 4312 -14797 -22523 -18637 -4032 -27465 -25384 21114 3809 19505 43699 23438 6325
17723 6325 -12428 -6932 2628 10827 24584 19341 19917 21247 20235 13512 -1714 -11257 -37870 -38377
17709 -38377 -6578 18727 7540 -18528 -27780 -12367 -18320 -2629 29539 18605 14764 -32571
17697 -32571 -37435 -3678 12266 -34585 -57901 -53149 -9264 4990 -1283 -4663 -18861 1805
17685 1805 15798 12227 -9107 -15977 -19217 -21611 -36580 -34445 -30461 -24385 -3272 2063 11277 -17423
17671 -17423 -29306 -33470 -40385 -29264 -40720 -45158 -38162 -3638 41424 45163 5254 -24715 -53490
17658 -53490 -73821 -54474 -20353 7543 23392 38635 31540 22463 18199 -28132 -40632 -18737
17646 -18737 3295 5003 22660 26736 16048 11700 13621 -1260 23691 9123 -20275 -31237
17634 -31237 -21316 -8360 4856 28913 43321 50395 23233 15826 -22847 -32096 -18590 7814
17622 7814 28872 16023 -3257 -10406 10170 18865 44448 25484 -240 6332 8769 -14891 -7481
17609 -7481 -404 357 33148 48380 44377 46006 33561 31024 31746 49969 58638 44912 7394 -11828
17595 -11828 -53443 -65472 -27798 11055 23075 296 -382 16758 26166 7359 3667 5878 41409
17582 41409 72795 55695 30898 21928 53427 75228 104382 106814 130465 154941 168696 204814
17570 204814 248785 286334 324334 358572 382849 416609 427967 451263 483602 477028 471884 472328
17558 472328 444277 428755 426914 409506 385943 380325 362571 323021 265456 193962 134320 120265
17546 120265 115092 68077 53859 43239 42791 11909 10285 12064 14040 48270 72230 75256 68682
17533 68682 48218 27262 17862 -6613 -6536 -39268 -42377 -37254 -29299 2910 15491 16217 -13592
17520 -13592 -5109 23978 53828 66441 59358 70147 65130 62221 79978 88940 87012 63428 67683
17507 67683 62168 42066 72602 103355 118005 141257 158711 158107 177611 189800 230209 283068
17495 283068 275947 272972 269289 236639 229820 217500 212712 241468 274237 254375 226427 205664
17483 205664 176182 137438 117290 103230 99245 72957 52172 43678 56520 85059 87459 83120
17471 83120 86257 97123 121610 154351 187824 222933 234865 241294 229642 230052 261534 246205
17459 246205 216672 212997 201957 200353 208007 222962 230051 201270 154046 126516 118870 147848
17447 147848 149664 131774 131122 125781 158561 155579 191963 225776 205648 176776 137680 93033
17435 93033 68901 33077 738 28540 57197 37505 22133 16326 6418 -10942 -16008 -9496
17423 -9496 1726 7516 43183 32469 40062 24211 51941 65082 39988 16021 13212 21837 28006
17410 28006 25940 -204 -17840 -18667 4672 21449 25072 40132 22803 18658 26270 40118 85755
17397 85755 103473 60169 36016 25703 7568 15178 29409 13786 10675 9714 36193 28685 8924
17384 8924 1262 -11913 -20096 3491 18057 31506 26878 1517 -6049 -2685 754 18516 39538
17371 39538 40844 37640 45891 56443 74120 49779 25294 16080 10843 19341 41374 33450 29236
17358 29236 34174 26003 29822 21085 26886 51525 56473 24680 20844 36556 57391 42308 25435
17345 25435 -447 8484 21534 26282 54240 70075 76615 92261 82261 61665 52899 61196 75305
17332 75305 74844 73667 62186 65114 81573 93387 97225 111678 120918 141197 157282 135469 118820
17319 118820 111823 104872 118711 142378 161065 155879 153273 131987 99605 68089 63540 86170
17307 86170 59549 18592 10492 14461 40267 57679 55268 51100 42701 42026 49499 52740 66797
17294 66797 42669 37449 70996 74846 83606 88161 82122 76051 111233 109428 76698 47151 20848
17281 20848 16923 27999 22071 24609 11171 24535 41398 42057 28931 27131 43089 67119 70687
17268 70687 75865 75212 80771 91819 92250 79791 27226 11996 46340 54621 54256 76334 79446 68908
17254 68908 61403 68180 63540 69370 45864 48337 78034 106201 105461 111410 109091 112900 103113 106370
17240 106370 123743 99797 95509 102460 109037 111955 107752 125750 131869 117936 106203 99719 80999
17227 80999 97727 93408 87635 77838 86396 111609 142300 173095 178632 170475 161245 169737 178478
17214 178478 161590 166599 174820 179512 195795 203267 211048 220528 224588 205147 230702 228072 230690
17201 230690 222126 211053 208975 200462 206477 202059 209635 232018 229322 206659 152242 96819 66612
17188 66612 48200 57342 87048 95076 87501 105252 87047 37977 25207 14999 14858 22345 34440
17175 34440 51013 60290 44898 43478 64584 63706 46305 13214 16752 12593 47232 71836 84284
17162 84284 106437 125117 118660 105231 53511 34301 77603 112060 134229 129386 119020 129789
17150 129789 122133 93653 94542 131933 159080 131383 98899 104691 109807 139628 175787 160977
17138 160977 162119 201455 213990 233147 255164 232486 213024 222471 245183 258940 271563 280520
17126 280520 298917 314303 336667 330692 335772 376531 395123 391142 412147 434159 439940 429421
17114 429421 449490 498727 514922 517067 531071 537817 555894 585211 600360 591619 614275 643948
17102 643948 685168 698387 733183 802430 870370 977894 1083887 1187648 1309410 1473583
17092 1473583 1632136 1807705 2045220 2337743 2689726 3102223 3587587 4169225 4885476
17083 4885476 5746624 6756078 7986383 9456962 11205112 13232962 15647111 18565648
17075 18565648 22117365 26343149 31135275 36220076 41266049 46495265 52383096 59060178
17067 59060178 65617359 70700965 74284086 77457820 80710288 83409779 84625934 84499663
17059 84499663 83521333 81007850 76497104 71082199 66133522 61571050 55994868 48763850
17051 48763850 41076668 34377543 28907459 24134523 19666976 15595775 12228438 9640441
17043 9640441 7755713 6377910 5361934 4625985 4048056 3580515 3176641 2839327 2554305
17034 2554305 2317815 2109641 1956470 1787698 1642020 1526188 1430128 1351055 1270565 1237488
17024 1237488 1192697 1139993 1124629 1100823 1092912 1132924 1117486 1071584 1059561 1073527 1097208
17013 1097208 1118563 1129514 1171820 1239490 1324622 1411711 1525199 1695224 1908511 2137445
17003 2137445 2434528 2835118 3320789 3887475 4566752 5365898 6286367 7410132 8788684
16994 8788684 10445104 12384801 14629919 17322982 20555609 24357999 28801461 33718883
16986 33718883 38149542 41880959 45761546 49003738 49212531 47689874 46531850 45575026
16978 45575026 43744404 41356589 39618959 38446447 35701961 31238437 26997103 23241239
16970 23241239 19369031 15749861 13025630 11268952 10313833 10007123 10220164 10890120 11949680
16961 11949680 13360821 15132140 17314133 20068516 23373146 27232161 31691655 36018164
16953 36018164 39632447 43191878 46709590 47940760 46779707 45552214 44760954 43376319
16945 43376319 41096930 39063936 37888156 35834323 31526420 26865377 22732483 18529731
16937 18529731 14288698 10746272 8106486 6226264 4931801 4069258 3435521 2929958
16929 2929958 2549159 2255529 1983566 1766316 1583485 1421444 1264587 1125109 1007252
16920 1007252 910981 858765 790277 712085 672714 644012 612747 580093 540821 492487 460475
16909 460475 435774 408642 409218 391511 354371 319797 345361 382068 368598 332565 336404 350813
16897 350813 341224 324903 316289 301408 298441 268533 247683 237737 237975 228899 254629 256077 234375
16884 234375 225917 240372 255501 259303 217945 218785 257595 251013 239106 237333 251890 256568 242708
16871 242708 239248 254791 268823 261857 245429 236495 228995 227885 218426 226093 210503 195984 204755
16858 204755 214456 214267 216488 210425 190210 155337 152767 151309 160903 152744 164870 196907 193013
16845 193013 161131 154732 129627 102173 79191 73611 83869 92288 111212 93447 92964 77488
16833 77488 60809 68367 94102 102902 102184 108019 145124 178269 164705 177545 168441 184018 165318
16820 165318 153562 152515 122058 129778 140039 130120 128329 137092 112425 66012 49562 38560
16808 38560 9304 23552 28392 36150 73379 81937 58828 18416 8950 9296 -6 -7330 -17667
16795 -17667 2350 24645 34057 55827 66687 61321 43575 63142 67378 59547 41600 41765 74912
16782 74912 97572 106277 100975 113866 123380 119695 99305 115524 80862 82710 108521 108489 105015
16769 105015 76690 54860 60245 56616 43055 36385 36337 46071 54071 36218 47595 50602 25956
16756 25956 34082 53863 20855 17696 960 -20064 -4127 -14343 -2540 -14064 -20712 -25435
16744 -25435 -43803 -16424 16836 2839 -10237 -19310 -25720 -11026 6129 -4513 -27943 -23228
16732 -23228 -20127 -2245 19926 39127 33443 17772 4415 -2436 -19549 -19316 -24909 -24407 -7017
16719 -7017 26060 18263 -1806 -20431 -15690 -35664 -50507 -32897 -29860 -44727 -33291 -3900
16707 -3900 -3568 -20682 -303 117 -26799 -43205 -16895 13441 27406 29191 10969 39605 65584
16694 65584 55275 32832 27595 766 7500 9550 -346 -18284 -23765 -19863 -8315 5403 -13990
16681 -13990 -11335 -37829 -22594 -31132 -37636 -35697 -18158 -28025 -34760 -40886 -32042 -31759 -26054 -38955
16667 -38955 -60827 -59418 -54255 -34682 -25048 -33271 -31338 -31497 -29320 -26362 -8242 -8917 -23882 -30550
16653 -30550 -21852 -17832 -6335 -7526 -5083 -39353 -22560 17960 13477 -21339 -22628 -3676 -19515
16640 -19515 -28546 -22133 -19935 1929 48661 78543 93229 54623 47820 37794 33115 47826 29772
16627 29772 -9452 32530 67409 33026 3877 -31029 -26929 -6515 7125 3341 -12561 -37704
16615 -37704 -41237 -13966 -12159 -25772 -30169 -47802 -26406 -13095 -26475 -5862 4689 3522
16603 3522 -35328 -42430 -38286 -20450 16137 25358 1140 9017 5042 -5041 -11090 -245 5058
16590 5058 30141 28092 -3607 -12927 -7921 -471 23143 27233 -7426 -31359 -40026 -19945 15305
16577 15305 -10811 -7991 47233 78757 111337 127054 149411 138750 122428 153811 180331 209802
16565 209802 235602 286863 318638 347917 354044 360898 384614 379955 420174 463023 445081 425827
16553 425827 405621 375215 349159 325391 321184 255233 249850 235383 178514 126169 105030 93387
16541 93387 81011 40671 23378 10695 11072 1548 -10613 -22009 -26197 -12842 -6273 -18171 -18863
16528 -18863 -31215 -38079 -56732 -51768 -11920 -2687 -8579 -12304 3403 25284 36640 26057 24868
16515 24868 21440 -119 -26815 -29067 -15663 -23555 -27555 -2356 -14462 -7268 5555 24991 29024
16502 29024 8044 4138 28836 58678 43474 16006 -3957 -1069 21496 43462 30413 1169
16490 1169 -700 5636 10722 -4529 -11512 -11348 -1439 24918 19548 40315 35095 45186 34311 31691
16476 31691 1452 -2095 25601 47592 105651 118823 136374 159642 186770 200106 246771 262171
16464 262171 273600 267116 249797 255185 242446 236654 207803 193874 198405 213999 193614 162545
16452 162545 122515 102246 88746 72155 81418 70755 51604 20008 42772 64079 77805 79407
16440 79407 105763 125484 127570 164277 194651 191012 195725 207622 230651 217658 217517 218741 234026
16427 234026 247013 241560 254921 259974 211480 183409 152330 115134 75967 50141 39936 26192
16415 26192 27039 26617 -7154 -36398 -57769 -46413 -21347 11278 9812 -2569 8578 7267 -19630
16402 -19630 -48197 -47314 -54294 -28601 3149 20403 -1068 -2702 -14662 -5749 -8814 -12761 2769
16389 2769 26035 -3146 -24088 -23299 -432 -2807 -4515 6600 6191 -9213 -28280 -36928 -23611
16376 -23611 -23021 -17751 -28381 -12687 5398 -2833 -27959 -58883 -52974 -35575 3338 -2466 2390
16363 2390 -9862 -14659 -22293 -47296 -69008 -48388 -12883 -29769 -31826 -46047 -27119 -17603 -24771
16350 -24771 -47682 -53804 -43053 -27760 -13125 -27517 -15568 12490 -4023 -34146 -35125 -8117
16338 -8117 2774 -4093 -7129 9765 17753 -13187 -40646 -40113 -44420 -67317 -50958 -7658 2170
16325 2170 -9313 -10710 -11412 -14819 -27461 -62386 -66893 -59188 -35560 -30015 -45541 -70749 -53205
16312 -53205 -23548 18286 23136 18251 -5830 -8036 -9957 -35960 -18185 -11673 3779 -16077 -24443
16299 -24443 -18772 -4408 5270 -36478 -27778 -5541 15076 5397 25689 48845 28894 11127
16287 11127 -2869 -12430 -34916 -52894 -46520 -26833 -36028 -52413 -50391 -29363 -18473 -14231 -29319
16274 -29319 -23523 -3029 -33795 -23447 -20381 -5220 420 -14174 -17283 -17568 -22190 -8957 -21238
16261 -21238 3508 -11649 -21912 -8876 -7928 -4607 -12887 -17614 -7996 -868 -4875 -24960 -18436
16248 -18436 -19912 -48155 -30742 -16807 -13533 -5340 12883 37785 12017 -14779 -28058 -12571
16236 -12571 6102 6093 21741 26527 21832 5021 -14480 -29777 -37641 -15834 -19444 -19126 -9272 -26940
16222 -26940 -19069 -12615 -38662 -50441 -34340 -20959 -3400 5308 13959 17544 19220 23732 17870
16209 17870 6733 -5415 -567 12612 -19913 -32801 -30896 -1876 -26745 -25475 9610 49059
16197 49059 35113 -10132 -12135 20354 36418 1408 -3845 -27544 -53913 -60200 -54141 -38114
16185 -38114 -39269 -38751 -27469 -22349 -25187 -18311 5243 34634 55203 49922 36149 13333 19021
16172 19021 40605 36376 29616 56196 63735 27501 10206 -28199 -30310 -12441 -9449 -11367 1367
16159 1367 -9670 5172 -318 -10277 -15571 -16335 -32300 -27538 -3042 -26664 -43710 -20037 -20186
16146 -20186 -8875 -2879 17045 39173 25771 19733 -12224 -21269 -5282 9924 20807 9115
16134 9115 -20592 -27579 -27145 -10952 -9487 -21398 -35311 -6795 10730 -10652 -21659 -21639 -8961
16121 -8961 3943 14332 11536 -18787 -31519 -23638 9946 18729 7519 5577 14500 -4193 1542
16108 1542 -11125 -25911 -11162 -29604 -56034 -60786 -42295 -24580 -34360 -57869 -45703 -68445
16096 -68445 -50580 -22891 -22817 -5362 -24952 -38764 -54421 -24701 -6759 -23990 -30032 -27475 -28383
16083 -28383 -36244 -24589 -9522 -12933 -13239 -18990 -15682 -18570 -22089 -20693 -6087 -7173 -30097 -48185
16069 -48185 -43117 -34115 -55475 -60031 -42643 -34641 -35425 -5894 -19598 -27494 -3322 33206 25231
16056 25231 -25371 -23716 -7547 -17264 -40135 -32345 5767 12224 20966 38045 25087 -17263 -56071
16043 -56071 -57124 -56990 -55423 -42062 -27736 -25409 -23975 -22449 -28905 -40605 -27618 -13130 4255
16030 4255 -2859 -24574 -52322 -70368 -66640 -50971 -67586 -78184 -71767 -40519 -15767 -17252 -4846
16017 -4846 -9921 -24970 -38274 -40159 -20725 -23108 -17407 6218 20521 10063 -24550 -22468 -23755
16004 -23755 -17933 -29049 -42507 -24546 -3709 -3328 -24863 -41772 -16529 -22530 -21589 7918 -21472
15991 -21472 -37951 -23695 -35813 -42671 -35024 -8328 -20184 -43425 -29371 -15120 3061 -4532
15979 -4532 -21650 -34634 -17694 13013 12626 -11031 -29157 -48943 -45110 -44327 -11717 -11081 -32003
15966 -32003 -17667 -21450 -4738 -6728 -4263 -15802 -7433 640 -2911 -6176 -11053 3446 20890
15953 20890 25184 20609 10008 -7778 -23926 -44079 -37614 -33578 -29385 -16734 -13517 -9541 -18110
15940 -18110 -15232 9283 -13386 -44124 -26666 16044 28512 20604 5604 9998 7329 -14410
15928 -14410 -23541 -36311 -34131 -21487 6037 -19500 -40326 -26103 4880 8112 -23639 -41731
15916 -41731 -21342 -9659 -15584 500 46692 53048 22454 -25387 -22047 -3054 -21891 -15177
15904 -15177 -2714 26453 20330 20745 21643 -20870 -28904 5572 9458 -18469 -32737 -39658 -24338
15891 -24338 -2339 3375 -11296 980 -17908 -15081 5429 -990 2676 19462 44714 35037 -18537
15878 -18537 -14618 5357 -18121 4414 30641 5495 -9396 -16454 -42228 -65950 -50520 -14421
15866 -14421 2765 3465 -29909 -35378 -9982 -7017 1577 -5110 -14472 -15269 -30639 -17430 11786
15853 11786 20685 25934 6644 -17778 -35236 -18071 1334 24888 36516 17456 -7453 -17528
15841 -17528 -26376 -25722 -27162 -17867 -19211 -27208 -29853 -18113 -23352 -11417 -67 7099 17178 33472
15827 33472 -1276 -23670 -21419 -30471 -22363 -1328 25579 -35 -15564 8844 22299 26060
15815 26060 -12190 -30326 -33155 -19225 -16198 -10420 -475 -9946 -12807 -3715 -19404 -11079 -14369
15802 -14369 -34973 -14165 -38287 -25730 -29720 -27656 -24333 -31115 -10721 17820 -341 -21680
15790 -21680 -518 -6463 -23910 -20666 -3573 -22632 -9507 -24654 -68491 -64474 -34976 -26865
15778 -26865 -34088 -24320 -21568 -25787 -12651 -20320 -22171 4973 -7780 -1770 2468 -39155 -40741
15765 -40741 -11352 30886 23812 -12213 -32824 -47215 -50221 -39917 -41708 -41017 -32436 -22272 -39930
15752 -39930 -25340 -7352 3861 -2580 25655 41225 66797 58224 50004 33142 -850 -25353
15740 -25353 -353 19650 19698 30617 36269 22587 7318 -15460 -33355 -35612 -28187 -43491 -28400
15727 -28400 -23298 -13110 -33088 -31075 -40381 -44184 -32756 -18951 14016 7085 17046 19329 -2755
15714 -2755 -29740 -40473 -31991 -15421 -2674 2675 1446 4323 25802 18337 1001 -19463 -38924
15701 -38924 -46880 -41666 -37712 -25744 -21932 -11259 -26923 -28813 -7777 -9738 -33905 -41371 -24211
15688 -24211 -6862 -9760 163 12525 13844 32664 30098 36885 43942 19364 12413 -1409 -20726
15675 -20726 -15847 -16154 -41118 -37180 -24995 -36722 -35344 -55457 -56223 -29965 -16191 -24648 -32918
15662 -32918 -15763 -3906 -2706 -30460 -34319 -22219 -3780 -15314 -12847 -19647 -38003 -46694 -27595
15649 -27595 3184 -4089 -25520 -11184 -13438 -17776 2035 27316 17301 10805 16316 -8227 -3514
15636 -3514 -20701 -59899 -47918 -37810 -42378 -25338 4460 20447 24950 27270 -18329 -42637
15624 -42637 -36514 -19333 -22037 -33372 -26522 -8580 -23002 -42558 -59731 -45060 -48887 -29710
15612 -29710 -5715 4822 -2836 -9351 -7692 -1261 3888 -28482 -31883 -40876 -55472 -46121 -24747
15599 -24747 7190 24280 21050 44878 28532 -328 -8623 -33973 -38056 -9901 36067 43864
15587 43864 31031 13952 7222 -3103 8767 -9602 -7895 -5433 24647 28475 19637 4031 -15463
15574 -15463 2501 26190 10125 -3280 4656 9237 -13854 -8254 -13396 -16627 9664 -2105 -26813
15561 -26813 -42637 -27975 776 22797 22286 19883 -10254 -41334 -26129 6190 2707 -8086
15549 -8086 14587 36844 6344 -353 2602 13349 3061 -29818 -29737 -33152 -9249 -5013 -8648
15536 -8648 23550 47447 13587 25737 14891 5972 3061 15656 18215 -1022 -5537 -39144 -58201
15523 -58201 -40708 -47446 -40340 -13640 7631 -20651 -10563 2221 11125 15472 13533 15940 -2488
15510 -2488 1849 18867 25686 16944 30106 25541 10903 13314 26342 23154 28296 28960 17846 -17108
15496 -17108 8302 46108 32938 19261 39735 32118 19627 2456 6130 13634 21997 21884 18372
15483 18372 -15755 -32552 -8324 4582 20970 42566 54656 62347 31987 37016 26760 5567
15471 5567 3020 -24975 -32684 -20772 -17548 -3935 -17893 -10997 -9407 -2934 -153 -175 -13486 -9822
15457 -9822 -808 9478 -3667 -13934 3941 -18019 -14446 -4199 2027 21294 27510 18904 -2457
15444 -2457 1770 -13606 -38363 -34548 -503 13978 39244 51746 33825 26356 25331 45351 51516
15431 51516 28338 25460 24810 3204 5971 25490 46690 50630 26040 7351 4501 34097 41695
15418 41695 4031 4930 -3586 861 -18549 -33022 -45319 -42837 -39582 -25066 -14983 -1818 -2034
15405 -2034 -20149 -10529 -1785 -1815 -7736 4215 5520 16150 43006 29549 24527 10993 588
15392 588 -40422 -44652 -21879 -18525 -32574 -28560 -48262 -51633 -28092 -3271 6270 2135 11159
15379 11159 4046 159 9288 2376 -9636 -1767 7244 28470 14023 15299 22889 31209 24136 3118
15365 3118 -4852 -15899 -21127 -5501 11059 32531 64086 44403 31513 20702 15570 1592
15353 1592 -29738 -34301 -17620 -14511 -19754 -19654 -32123 -41821 -32383 -37532 -28622 -24628 -16273 7691
15339 7691 19431 2354 -31384 -30953 -33821 -10739 9651 13288 10949 5235 1366 -3025 -27678
15326 -27678 -39159 -28546 -42196 -29589 -12567 -24705 -34293 -62149 -62963 -37074 -35915 -35058 -28306
15313 -28306 -1314 -8432 36393 45258 38660 13956 -4167 2511 -9055 -17182 -869 2865 -1448
15300 -1448 3049 20869 25369 25108 41346 13027 -32838 -33046 -29932 -18637 -17007 -6020 4804
15287 4804 1540 -3591 9432 12898 20850 11687 4285 3343 31328 32750 -3133 -33377 -55702 -38414
15273 -38414 -19469 -8763 -8126 -14535 15373 22192 32247 43741 30643 24445 45820 37425 17969
15260 17969 12247 -16766 -18017 11978 3583 -10167 -9876 -25679 -12432 -5157 7984 7513 -34914
15247 -34914 -68528 -53796 -56958 -56877 -11216 -13956 -34410 -13300 28159 15566 -479 -5396 -2810
15234 -2810 -24607 -46758 -56282 -54002 -36454 -10277 -12120 5160 -17140 -29592 -19541 7750
15222 7750 31072 42833 31481 8717 -8370 -30822 -29407 -8764 18477 14169 -2874 -15214
15210 -15214 351 47428 65217 34523 35424 27954 -8579 -41812 -13743 24019 37005 27601
15198 27601 17438 21337 5136 16668 36098 105 6012 40385 60354 34716 4796 -11092
15186 -11092 -8238 -11053 -34981 -51122 -38691 -24599 -16549 -16779 -12913 -29454 -29671 -24282 7611
15173 7611 12542 3701 -2812 -15785 -31537 -29433 2641 20609 14315 -18636 -14963 -5572 -2580
15160 -2580 -16153 -22476 -22087 -18110 -38220 -65902 -37612 15891 54974 64204 15199 2500 640
15147 640 -12981 -18637 -29032 -21804 -2892 548 33554 81110 66066 56984 33098 34231 15668
15134 15668 17672 40269 27049 -2267 -1975 16064 20061 18547 30656 9310 -19773 -19641 -15924
15121 -15924 -19593 -18184 -3963 4377 4800 -17158 -22583 -9195 2497 -15739 -18674 -23379 17033
15108 17033 28383 -5369 -21401 -61440 -26049 6100 -30959 -54381 -59732 -40659 -10440 15694
15096 15694 23561 26213 30083 48032 34903 28242 -5150 -9501 -242 10249 9631 1432 -23276
15083 -23276 -35969 -37933 775 21678 23633 -3557 -7521 -1656 -1463 14032 22506 26420 29405
15070 29405 29691 11875 5392 25812 35593 34935 14079 9236 10953 10512 12804 19839 36649 46494
15056 46494 33483 24229 22983 21179 31125 5447 -47113 -61685 -21819 -2109 -5971 -8015 -7921
15043 -7921 7408 15919 25799 32935 37577 40355 49239 35173 24828 11121 4445 -1521 8765
15030 8765 29183 31507 57419 50927 3767 5060 38765 51699 37404 32477 25311 12122 14632
15017 14632 19115 -1661 -6811 4982 18957 24159 36722 38391 47096 34284 28918 21537 46003
15004 46003 35904 29788 7523 7122 7014 -15995 -18401 -23635 -14586 -18800 -31696 -46306 -21117
14991 -21117 -6520 23033 17096 3663 3218 -13548 -9174 6605 10218 -2796 -7431 -3317 11975
14978 11975 22620 -7721 -36117 -13364 -6305 -5874 21133 47703 15470 27500 21999 676
14966 676 -10894 -4231 21678 5274 -20232 -9357 -23928 -19530 11208 9444 -13272 -22007 -38736
14953 -38736 -42826 -39912 -38135 -42408 -29744 -20129 -8097 4820 20305 21268 -14906 -11462 -9371
14940 -9371 139 21656 27039 28926 2751 2206 20027 21579 47372 41554 15055 -16756 -19282
14927 -19282 11464 38805 35957 10644 17591 17605 -21611 -36466 -28795 -2882 31056 17560 10258
14914 10258 19769 7095 -13813 -51989 -38301 3807 476 -2912 -9035 -29976 -35690 -8697 10307
14901 10307 15288 20510 2216 -20057 -21163 -31390 -38736 -42474 -20162 -16706 2756 33286 24571
14888 24571 21105 29838 21628 25245 25142 31616 35727 37585 41593 40110 34855 31392 21351 27929
14874 27929 15326 7034 11100 22051 11756 4316 -4110 -4567 22877 44931 10781 -37306 -14147
14861 -14147 8032 20928 -19 -11953 -7597 1143 -620 -6109 -10166 -20368 5895 -2010 -2812
14848 -2812 4217 9459 18196 34478 26021 20279 -4592 -14358 -15324 -31372 -43263 -53115 -83674 -61926
14834 -61926 -4864 -3751 13322 3262 -22120 -2818 8146 41144 53507 48962 24573 -6822
14822 -6822 -6961 -22475 -18628 -15625 28493 50335 67422 79340 58690 57343 52523 70298 64618
14809 64618 39701 48457 39379 -4278 -30542 -33511 -11787 38271 58346 60007 66644 69671 89012
14796 89012 69587 40660 8263 -7437 -19640 -6625 17571 29095 32169 15484 -2620 -7545
14784 -7545 9710 49120 23497 4623 10607 -6106 8628 28564 33045 17041 7659 4015 18088
14771 18088 33934 38753 43964 31088 51287 57306 50709 19268 25531 42196 43326 40622 27746
14758 27746 7731 15684 62299 95163 71505 50768 34112 7582 2516 7551 743 11910
14746 11910 51235 73349 63613 59629 41753 9327 10760 9551 10298 10308 17469 50851 50445 42361
14732 42361 52042 31021 9310 375 -4383 7278 16678 13879 -15387 -5105 17217 19355 30398
14719 30398 20516 5922 23275 -14468 -38572 -47363 -2958 19241 40811 62532 51427 32696
14707 32696 14502 -5723 -16732 -21459 7015 39851 43763 40470 41412 14753 9046 -4257 -17206
14694 -17206 -11268 4770 7965 7774 30395 52534 51586 27631 -3434 21463 24413 -10112 -685
14681 -685 21105 15919 17421 -10322 -5296 -10034 -11555 16311 14105 -13310 -36431 -27480 -16904
14668 -16904 2225 -8417 -22587 -11127 8303 26560 29556 24146 11284 14519 5725 15143 -2059
14655 -2059 -18522 -7396 15334 47310 71607 60789 14861 -12474 -5397 11758 43958 47986
14643 47986 37239 46498 45274 46159 20433 -10114 -15746 -19855 -3970 33326 40418 39062 14338
14630 14338 -24751 -10051 -5149 -27214 -17862 32104 65170 49019 31849 32508 13091 8035 20521
14617 20521 18974 21171 32404 41129 25502 27793 13833 11146 -7548 -15709 -3466 -2231 5799
14604 5799 33742 31315 4835 24647 44895 46032 51026 43414 35392 20838 -20012 -46010 -43895
14591 -43895 -11328 -27447 -11082 119 -4720 3779 9448 13537 56844 65026 30235 -2745 -19243
14578 -19243 -18243 4714 33469 4274 12026 36573 30190 30229 39867 20201 -12680 8135 24479
14565 24479 13196 -3150 15199 13426 -937 21369 70114 62050 61586 41484 30825 -3322
14553 -3322 -12429 -3291 6903 18528 36995 41296 41849 57931 63817 42240 36953 28181 9762
14540 9762 -852 8286 31198 24645 -7327 9782 7281 11936 32987 36436 50072 56830 43000
14527 43000 10213 -2573 -2078 19703 26433 25053 37115 21104 1310 -6755 -4642 -14664 -19897
14514 -19897 11496 24969 30191 20613 20098 1462 -292 10415 20962 7341 12307 34979 31107
14501 31107 7935 9364 -571 26101 26146 32103 51098 33725 14992 31103 27937 23800 30666
14488 30666 25358 19452 23332 26937 32731 43813 54406 56970 66798 85631 63789 68743 91120
14475 91120 57696 8226 3726 8339 7803 49241 42278 34668 31282 41753 29521 27326 7548
14462 7548 2018 3250 11901 18470 -611 11716 35643 42805 49628 38947 19824 30594 23874
14449 23874 24292 23212 47920 55481 50435 63352 48824 34570 30663 31192 23398 44545 54338 36047
14435 36047 25293 22867 30343 34941 18537 5768 -2272 -6152 7479 31632 55954 62355 52696
14422 52696 67327 63324 70580 49577 35394 44852 31998 37637 33888 40770 36745 26240 9554
14409 9554 21008 43554 49974 25154 8771 -22052 -22903 -15447 -24472 -6933 7267 21200 29303
14396 29303 33403 50243 68488 49518 33219 28876 38039 23655 23417 30256 36742 14654 -25060
14383 -25060 -33165 -31720 -19311 2137 10623 26595 21810 7504 14725 14407 40970 38942 65587
14370 65587 72037 9592 -3252 28984 23206 -4092 17219 23890 -3320 6113 9412 -23062 -24774
14357 -24774 -17678 -25647 -6453 -8813 -6119 -3610 10656 13092 8826 14133 21528 19986 6372 -33076
14343 -33076 -27279 277 39473 43965 62605 75568 44432 61772 81461 73047 45209 42258
14331 42258 29349 20464 5051 28299 23384 22312 14919 -7144 13757 54376 61622 34351 10639
14318 10639 9206 32375 36217 31466 29059 35792 39911 52469 61580 45027 31593 37804 45299
14305 45299 45298 41218 46955 11502 2109 -7342 -8323 13301 16668 30230 20089 13976 17109 3759
14291 3759 4293 -5928 -11050 -21389 -32704 -22806 10805 8042 5891 9844 19677 13013 577 33732
14277 33732 21302 -19572 -29035 28753 79883 76887 44317 35454 21859 6652 11948 5497 5773
14264 5773 35762 46121 36987 34891 40809 43452 35757 12913 244 14444 28810 38249 42765
14251 42765 27471 34627 38789 54371 37860 36869 81246 92257 40914 -1753 3558 14603 24163
14238 24163 26214 39087 31000 27976 47955 53149 49387 72361 76445 61338 46975 33049 24704
14225 24704 46346 34751 42263 58330 88219 74422 31531 16215 25830 13251 1402 3261
14213 3261 1123 -6560 16454 12158 10125 8230 25452 39324 34663 12344 8845 23724 26825
14200 26825 35890 42068 51602 29348 10551 -11622 16724 45605 32311 34196 30819 -4082 -23366
14187 -23366 -18927 17044 30103 14675 32423 31053 27645 26607 27201 24403 11316 20384 29775
14174 29775 8768 -691 9725 1538 2365 2614 -7359 2374 1904 -1308 -13795 -25488 -33243 -22616
14160 -22616 25313 51465 11688 -17147 4081 38730 25018 7710 2089 28006 58629 59479
14148 59479 59704 60974 51468 9353 -5296 21690 65410 102894 79321 41707 37393 4458 66
14135 66 14631 6126 30226 74540 69279 80249 77878 63930 37799 29967 52283 67021 48765
14122 48765 49025 36739 26783 19520 29734 56710 51553 23598 17216 22722 14117 21385 26948 30167
14108 30167 19605 -14719 -8520 -293 -28359 -9127 7524 -12307 7313 54971 66864 66379
14096 66379 47978 28875 42205 52008 47146 66175 64771 73510 67632 34259 8995 -1300 9282
14083 9282 -10296 -3300 51208 72335 73342 67643 41660 47505 55484 68238 59582 48690 37076
14070 37076 37150 59126 42845 68180 72270 45070 29293 41112 42976 33097 22118 12200 24685
14057 24685 18543 -14577 740 30378 44668 32913 22499 30881 20976 12679 57229 76894
14045 76894 80751 51229 31905 22347 15747 -26440 -25642 -11203 -19966 -30828 -21460 3945 16120
14032 16120 19463 12695 10207 23963 39548 74787 58092 61084 60014 61774 41580 10097 -17335
14019 -17335 25196 46374 50459 47685 41785 43033 60043 67520 58879 77940 58575 36213 67527
14006 67527 53177 25316 58762 65153 77649 43296 25436 34603 42233 71923 62996 54146 34680
13993 34680 39590 54090 47041 58625 76020 50798 44047 49594 29145 31244 30577 22424 26289
13980 26289 76736 80107 71136 86154 101628 111834 64884 33033 59286 79911 77031 56763
13968 56763 38871 13190 43842 51304 18852 15234 61189 54283 43313 65109 104663 127234
13956 127234 110955 93124 83188 92340 93427 93490 70230 56133 47839 40230 61967 103437 99710
13943 99710 78431 84808 107079 94090 63037 27995 19506 42589 53998 94321 82162 64966
13931 64966 62313 33179 21892 14912 5900 12362 28352 57795 45501 53653 34470 18030 31396
13918 31396 41014 26120 27599 28077 33324 60365 51467 50577 58509 32988 22380 24702 3382 6027
13904 6027 20060 31531 61394 68332 55253 46890 38522 31838 36451 54684 73608 50918 24331
13891 24331 17200 29675 33994 21014 21214 53981 77622 90827 50477 32799 22166 32797
13879 32797 36329 39013 22029 17635 31119 69481 42591 46589 40218 30296 31571 70086 66673
13866 66673 68505 68303 34464 28180 43648 28979 14848 20488 38822 70789 63475 38345 49134
13853 49134 69419 56677 69062 44320 26269 30754 15568 33206 55118 61308 60503 46477
13841 46477 28396 38719 56161 72287 64695 29316 53716 48118 43662 37594 36906 55909 106388
13828 106388 91434 66438 36452 30055 29743 40723 38787 52797 56856 54392 49017 48068 56341
13815 56341 79571 85635 82405 81136 73722 55370 33170 42600 43600 76568 97209 82860 54707
13802 54707 25699 37977 50459 52457 58326 70007 44519 37697 51680 37989 35926 47667
13790 47667 38213 23209 37887 50302 36792 38296 53292 62004 59179 50726 60889 64129 69564
13777 69564 62895 21119 16799 47968 54204 38941 29305 -15800 -1441 14953 10336 10697 8370
13764 8370 10382 21820 40731 60427 58123 41372 38687 53209 56606 48152 44822 53065 62037
13751 62037 50768 49033 32517 37877 34199 30245 21691 7732 11025 6671 10348 50774 30745
13738 30745 41128 53707 47686 76642 76246 61283 59124 55212 46495 37503 62626 85767 77199
13725 77199 74189 73466 82798 83730 87036 48300 65579 87067 111025 116667 144258 126659 109029
13712 109029 62054 59972 69141 85615 70866 75165 75815 52462 38258 28140 21516 18262 7880
13699 7880 25677 25398 20344 30368 42713 64746 85742 64947 60973 63180 35361 29465 51220
13686 51220 57824 69781 71402 63124 39584 26961 25919 48957 75175 63906 92355 79038
13674 79038 64073 58923 47341 75894 88123 92160 107983 120693 106328 106340 121376 96222 93803
13661 93803 75329 64538 57376 63553 66250 55784 51092 37634 27253 43391 56636 68223
13649 68223 65625 58441 59432 73185 84133 75642 70153 83497 70537 73137 90472 110506 88722
13636 88722 67202 72589 67593 77478 84627 87990 88347 87610 94637 110347 106551 96208 80267 62543
13622 62543 54615 54232 62208 52233 48365 40971 41828 45887 63861 58376 106325 111985 107127 114578
13608 114578 104829 96523 100404 98727 83283 94773 104853 95728 98476 103548 104255 88026 90556
13595 90556 76278 39072 46540 62021 51250 52732 93499 88317 55401 51048 49225 37576 4191
13582 4191 34348 71082 79414 87629 77708 66390 62548 93131 109252 74271 58273 85717 78858
13569 78858 90700 73953 32365 52673 68809 56257 51324 50359 54946 68129 89644 71362
13557 71362 21925 29942 54252 50963 43377 62352 80265 85578 85753 68890 75350 59826 45272
13544 45272 45536 41678 41633 37223 30498 35143 58331 76469 59983 61328 49672 56476 97497 104752
13530 104752 71672 59719 93395 101407 70723 68524 77916 104537 116538 111851 102220 110311 135171
13517 135171 130846 123953 107461 101308 81272 84728 76324 85650 98686 112421 127132 126341 87939
13504 87939 77316 111688 124410 124697 96809 81363 78547 66806 63911 74200 86125 66645
13492 66645 56885 74190 73253 92913 107868 98708 92745 55693 51062 49010 63400 69654 75584
13479 75584 67757 64768 54259 54948 96082 116404 70550 86691 132796 124910 107634 98916 85270
13466 85270 108064 140821 113604 111562 113385 90982 95677 96933 86844 87897 106234 118788 104742
13453 104742 87948 112437 112291 96468 76473 71439 91527 88417 90139 89512 87356 85711 66614
13440 66614 51462 67319 76374 85139 87680 93272 92998 98694 91669 83920 86556 119129 103853 96295
13426 96295 93965 87628 100870 67492 55548 45459 31110 21693 31554 34338 33514 67876 93469
13413 93469 94720 89400 65987 86144 107733 91625 116787 101745 73561 72576 69129 60830 103263
13400 103263 115806 119654 99175 82119 88971 118316 106524 91797 91304 130959 135222 114122
13388 114122 122384 118281 94864 118305 154117 163906 160801 145077 124980 115717 119524 123566 110239
13375 110239 102170 83117 89593 115674 112808 104188 97053 82644 100011 133487 143827 144817 149737
13362 149737 146070 120456 110709 133893 162239 176430 159083 150074 129950 107299 105781 110796
13350 110796 133684 134389 105638 94114 110598 130813 147596 146236 157317 171758 217157 241935
13338 241935 228907 246378 265662 294699 347128 365067 389452 408530 414253 447304 507647 574434
13326 574434 629996 680437 721144 791356 791362 753397 662926 590708 550289 508989 487660 483841
13314 483841 452146 454266 487048 511367 529755 542322 533857 537656 570215 584258 573133 578372
13302 578372 577688 592691 607043 597499 605543 668068 709384 721094 702763 697084 727127 765571
13290 765571 758609 709570 675344 643864 616792 562648 537339 533882 516658 532018 572856 585783
13278 585783 581187 587795 596473 573952 549730 542426 536390 525746 506697 507683 504470 518775 554145
13265 554145 591311 616986 640883 676875 710044 754667 788213 772126 743910 704933 642464
13254 642464 549492 486498 422384 367230 324770 280855 281968 257497 227950 223008 239097 242504
13242 242504 246394 250026 241189 224485 206263 197898 210485 210718 215998 198132 186362 197058 201847
13229 201847 160055 136451 162754 186634 175130 178943 177976 169197 172654 160959 179308 200850
13217 200850 196291 196527 198971 206357 221136 226207 227999 228654 212341 215911 228201 215248 200186
13204 200186 223782 224886 195871 189998 215580 182613 191098 208789 215718 208762 208688 227481 222936
13191 222936 229412 222221 216877 217579 223633 244329 211880 207699 197370 225372 243533 251685 229731
13178 229731 228307 235489 232496 219434 210751 228357 235240 229527 224586 204919 212976 250194 261088
13165 261088 259631 263357 265567 255864 261706 265783 289895 283375 279140 291957 305137 282710 271161
13152 271161 308713 308524 330713 356347 324753 335186 311063 288667 280591 300337 306460 292273
13140 292273 292543 284870 271126 274102 248151 257531 275939 281338 298092 267038 283769 285301 314510
13127 314510 329345 322075 319867 333267 333732 341061 351710 374007 382421 401108 387359 370766 366283
13114 366283 370112 349769 324852 318770 308444 295156 295703 314254 314229 294118 288039 298850 317431
13101 317431 323322 331927 331543 313311 296587 314820 331515 335530 358703 371406 391809 418793
13089 418793 396634 359765 359242 372642 373059 345713 332033 321581 311379 305599 323847 335120
13077 335120 347033 369507 341087 299342 306930 317979 284497 272373 298847 314525 319151 330192
13065 330192 321088 344385 372681 387584 390976 377546 390660 360303 361771 380257 381229 403065
13053 403065 406653 395988 426122 440506 442534 437493 442117 452563 462189 472498 496197 507269
13041 507269 499650 485697 497155 536422 568649 613100 648240 709063 758421 786467 826647 878569
13029 878569 923171 941193 894311 873717 843115 765539 692180 655530 618677 597835 569771
13018 569771 553581 533320 536423 528254 534660 544865 548197 557263 552684 541315 530495 542255 520610
13005 520610 510140 510700 522490 516515 530760 553468 574845 563839 573637 605495 627856 616330
12993 616330 625915 639178 635331 588343 591900 596068 591937 598544 607367 597041 631792 668776 690530
12980 690530 676086 686063 690875 675316 684211 711437 711926 714067 683518 695535 721559 727255 722868
12967 722868 727477 752787 778699 786185 793338 810556 829355 834697 857204 887345 906314 900326
12955 900326 892428 903609 901115 885854 894709 928121 956258 958643 973574 1003122 1045102 1048190
12943 1048190 1036372 1077577 1133319 1194416 1251675 1282236 1322430 1384865 1420812 1461235 1494304
12932 1494304 1519491 1555369 1600465 1689539 1803517 1913388 2016280 2115081 2234232 2360857
12922 2360857 2469410 2622163 2802929 2995736 3193965 3423981 3668463 3985651 4355214
12913 4355214 4763827 5285706 5897029 6632396 7561204 8727664 10123008 11755991 13691684
12904 13691684 15966721 18563882 21554277 25024630 29097293 33895788 39602779 46320369
12896 46320369 53946578 62353202 71627056 82009913 93693899 106418142 118378852
12889 118378852 126076581 126586135 120038362 108920029 96024592 83658918 73445106
12882 73445106 65949384 61077365 58581058 58269635 59840346 62859486 66708513 70628538
12874 70628538 74107082 77029536 79336910 80672111 80735110 79813760 78652031 77884593 77994314
12865 77994314 79332680 82087582 86339009 92033312 98889533 106349813 113597190 119593710
12857 119593710 123151942 123196550 119332342 112150882 103049869 93531013 84764297 77582796
12849 77582796 72390583 69270065 68023054 68359954 69903430 72333509 75117443 77691393
12841 77691393 79481673 79873743 78853768 77096873 75133003 73162349 71378824 70361614
12833 70361614 70926340 73447765 77952946 84142501 91615559 100089792 109214409 118172200
12825 118172200 125368533 128760093 126007661 115696630 99486445 81338793 64623297
12818 64623297 50782107 40005321 31901162 25859398 21297992 17746524 14927661 12653371
12810 12653371 10819151 9318054 8116889 7121057 6321654 5656158 5104591 4645830 4234993
12801 4234993 3881030 3578900 3291736 3032879 2835081 2679774 2578936 2487503 2348047 2247510
12791 2247510 2136440 2016817 1936018 1859527 1781370 1670041 1578862 1549852 1501734 1405043 1333451
12780 1333451 1314588 1255109 1222805 1170080 1123933 1104470 1089999 1084755 1058059 1037996 1009957
12769 1009957 990161 979177 963186 941022 917708 867485 817436 781060 720441 688607 682379
12758 682379 679056 665389 650312 639965 628814 619225 638982 659980 640341 601281 567860 571808
12746 571808 544640 517666 526788 514336 510629 528793 548292 560957 539581 531435 505336 490038
12734 490038 473484 455130 460254 484097 490185 481069 456899 438810 412321 385921 351549 371757
12722 371757 378987 368875 368720 375633 344764 316622 300256 305043 318865 344194 369735 378348 385430
12709 385430 359882 365648 383132 391594 389303 370050 347560 375870 398158 395105 372524 395093
12697 395093 435694 423358 399466 423118 452186 462306 473836 554932 612842 637593 638812 669070
12685 669070 679985 700849 710872 704640 683456 630655 563036 492292 416429 389113 354280 317797
12673 317797 304094 304169 295782 265485 221629 229702 271326 265149 275429 286513 296129 297595 293495
12660 293495 261869 227386 206363 206716 208851 216639 232509 242081 234815 256005 251763 264611 247848
12647 247848 249560 243622 208508 192642 185188 193889 196801 175188 153055 185729 207913 205717 187592
12634 187592 193632 183174 185631 212265 218037 188649 163215 156705 171103 176653 151999 147806 133679
12621 133679 147576 138157 140922 156462 134755 120378 126902 154990 179481 182433 177494 142148
12609 142148 125953 123060 111257 128537 140621 129495 146104 164990 172361 150279 169519 183162
12597 183162 214813 226281 213205 194901 199887 194077 188565 172811 191491 183877 140765 135876
12585 135876 147181 140213 171702 201142 194642 192058 189854 205518 217536 218903 212066 251853 262757
12572 262757 257752 279910 309458 326844 323331 330084 347535 362634 364577 364827 344446 348790 373477
12559 373477 412459 412074 410607 401362 429188 450918 462689 456307 446923 461059 462196 466281 451006
12546 451006 454022 447871 439127 403085 363059 315151 289784 249947 225799 200933 173676 167039
12534 167039 184784 193482 187737 179159 182293 179626 150928 171414 181009 170716 180154 190978 174380
12521 174380 194166 207736 232104 239442 221148 231071 267191 302395 310831 323409 332232 327803
12509 327803 303682 308679 313946 309921 320697 344727 340284 356317 379861 393991 422970 417565
12497 417565 408565 368060 365490 403353 436804 430719 462406 488995 487147 468294 480899 507163
12485 507163 535937 566393 599192 650033 671444 691443 725218 742655 764251 787733 835117
12474 835117 874236 879301 877125 914568 971913 1006777 1019323 1038549 1083940 1136559 1161676 1205874
12462 1205874 1279820 1345964 1385117 1458030 1555995 1633248 1695543 1782134 1902275 2019845 2152979
12451 2152979 2331816 2515432 2673790 2837597 2968576 3136303 3293707 3473850 3733465
12442 3733465 4053056 4418513 4871489 5401707 6019687 6752573 7623997 8705593 10042717
12433 10042717 11736625 13812175 16312360 19245993 22619522 26500579 30954907 36154000
12425 36154000 42242345 49417425 57811718 67536280 78789621 91994941 107728560 126366601
12417 126366601 147446890 168835151 187442238 201863176 212539493 219404682 219673985
12410 219673985 210804780 194261346 174046357 152448018 129319767 104995921 81832855
12403 81832855 62463292 47803074 37302317 29895252 24640447 20808823 17904751 15621886
12395 15621886 13693910 12025237 10574514 9290895 8158921 7157320 6298997 5594582
12387 5594582 5062793 4659508 4323532 4024659 3780212 3577597 3338569 3101224 2880937
12378 2880937 2673729 2440474 2238330 2096422 1969874 1831972 1742289 1618035 1495861 1399120
12368 1399120 1313719 1262377 1192862 1114288 1045996 1001303 955496 898139 877615 874810 842207
12357 842207 799093 746442 702308 656107 623349 589915 564070 536389 505480 484913 465348
12346 465348 448375 473759 495698 484616 502459 523855 512115 511963 495676 471795 459149 455744
12334 455744 436374 426966 402613 405366 423574 444067 415154 385059 346433 325405 291356 260290
12322 260290 217771 211347 238002 231083 199009 199261 197349 242895 259627 235163 227655 235185 262408
12309 262408 268707 260620 275576 312833 318954 315490 312555 307222 328897 325835 336174 337750 311581
12296 311581 325756 345020 382950 400482 402771 369788 354656 340619 323962 315953 301527 265621
12284 265621 245544 203952 162578 133376 141250 122598 88976 90438 75318 75948 61760 28929
12272 28929 -10445 -21978 -31855 -50130 -28982 -32963 -49460 -37203 -33622 -34430 -20100 -39165 -38886
12259 -38886 -13674 -23841 13259 27921 30944 29837 24722 72200 71354 46368 30868 20848 27374
12246 27374 52670 62745 61388 55129 46017 47032 46036 18160 22457 17073 10980 28692 32548 26284
12232 26284 -749 7614 -9306 1759 28746 20176 10095 18361 4320 18513 24539 23868 8854
12219 8854 -6592 8450 49406 30173 17188 51027 43927 29100 26713 38509 46240 39097 47467
12206 47467 55825 48533 24344 22897 -2802 -32898 -37416 -57977 -43470 1048 13370 28874
12194 28874 -1596 -23241 -18838 -19356 -23505 -20397 -4964 -39210 -64474 -55696 -44853 -29215 -28214
12181 -28214 -33831 -13044 12143 -1902 -28965 -48914 -45204 -27304 -40250 -39462 -48578 -56253 -31407
12168 -31407 -6462 20602 17598 -7867 -6816 -14533 -18011 -10136 -15953 -10610 -5917 8670 13476
12155 13476 -2532 -5808 818 12526 9129 -16443 -16313 -27128 -39577 -39084 -25481 4883 10966
12142 10966 -9667 -14148 -22521 -27550 2053 -2615 -19663 -19586 -21045 -31186 -34817 -7516 37117
12129 37117 60113 44148 26443 25906 23061 2977 20371 57201 20005 -18452 -28280 -30012 -26263
12116 -26263 -20532 -51001 -52006 -34672 -39867 -20617 19207 16194 -12432 -25657 -19747 -36724 -22772
12103 -22772 -6266 14734 52376 45399 7753 31720 30712 15036 569 2732 -11097 -4131
12091 -4131 30031 70369 67811 64630 36547 15658 -7454 2529 22644 43618 48044 31751 32395
12078 32395 26924 56417 60223 38924 39384 43991 30595 43974 32369 24423 34748 40329 31730
12065 31730 14254 -24177 -20556 -28266 -24939 -34714 -35641 -6873 13863 -2176 2129 19931 55213
12052 55213 57995 42390 36337 36254 -7887 -32225 -46239 -57475 -41562 -5280 17795 6470 16746
12039 16746 -8378 2214 -732 5191 13536 13940 17358 10687 14359 9615 2274 21092 35445 18778
12025 18778 3702 -6875 -13838 12894 12682 22077 36113 40576 45008 31145 44003 86977 119835
12012 119835 117123 135114 161462 173791 154232 185116 230223 242579 238290 217903 229062 238777
12000 238777 257166 261835 295952 342931 372714 403922 461593 538717 642724 749457 855825
11989 855825 939699 1012634 1097218 1164528 1185068 1138910 1063573 961929 855069 759195 624524
11978 624524 495812 393259 294512 222637 156829 108404 79887 65648 67520 55720 84659
11967 84659 94879 78462 49687 51335 65997 101783 101475 61795 41200 52175 85414 97400
11955 97400 98041 111636 113604 110088 119842 113489 75151 66623 74539 83508 85135 68053 72969 69989
11941 69989 56678 49846 33374 56573 60270 40178 37997 29115 24433 44675 46355 37517 26942
11928 26942 19608 15635 -3861 -25310 -32946 -5613 1918 9945 19629 19680 13875 11925 21419 31560
11914 31560 37217 30187 24167 44902 32706 25480 15006 14910 24076 -7167 15957 28962 25170
11901 25170 28321 43162 35298 27587 34702 29072 9690 -11435 11249 47892 39508 39583 30914 55274
11887 55274 55702 53193 46760 30315 12917 24545 32168 59774 83849 77471 116168 147427 166670
11874 166670 230327 276279 323776 340269 393476 467613 520361 608264 710464 848664 994020
11863 994020 1119606 1226100 1305023 1331631 1340971 1300246 1206822 1087719 944764 822078 669879
11852 669879 532860 409463 312684 235439 165651 118718 96100 89857 81314 67878 76335 48113
11840 48113 39713 50544 67240 75825 66649 81397 70687 72602 71522 57806 60409 29763 43016
11827 43016 36877 8167 11577 63247 97913 68402 26889 24336 61346 78051 73021 43576
11815 43576 34709 29857 25941 11138 4347 32845 49487 58108 39185 14533 47551 39437 14110
11802 14110 39501 64934 54682 37892 28720 25886 21963 30306 47474 31092 14137 25690
11790 25690 21460 8022 -4005 24197 41528 52074 25126 7255 16322 -5086 -16680 -20384
11778 -20384 -10017 -722 6134 27081 30987 29363 19206 11003 25027 33247 38370 22247 -17754
11765 -17754 -17507 -8442 5912 8588 -4405 -9230 -29164 -24962 -17796 11309 19837 13339 16359 -24291
11751 -24291 5072 49297 57342 9304 3945 14333 20579 9725 25948 41839 17408 13901
11739 13901 31445 34804 33649 27825 24712 34744 66299 68040 66254 39097 64533 76519 71671
11726 71671 49850 17743 15324 36269 60977 48475 25582 44238 32258 25046 23976 24974 16171
11713 16171 2996 -5789 -7025 5610 10380 41122 66272 42266 9219 -3110 -16858 -26850
11701 -26850 -24677 22250 34102 38828 24118 48001 67322 90295 107968 73511 47497 42182
11689 42182 58989 47509 35295 26158 36382 45586 46389 41120 42102 56363 58984 63768 39366
11676 39366 17955 43011 58078 63675 65582 56706 38158 44115 39990 26691 40224 68020 65633
11663 65633 71774 72296 67500 63975 61381 65501 74311 74085 73055 69636 41483 2938 7353 28517
11649 28517 38796 24734 -1104 -1615 25722 40469 51326 45113 20745 27049 33716 46101 65578
11636 65578 80429 53585 56896 25805 41781 62516 77433 64577 58527 47401 45278 50551
11624 50551 56214 46944 33344 28892 39224 62634 72382 68898 65554 79092 70558 45004 14715
11611 14715 29728 50148 60393 50826 38772 33876 74402 53242 60279 46307 26295 5333
11599 5333 32033 20966 -3851 12289 16586 29796 39808 42095 43932 34751 51364 69997 105737
11586 105737 120153 113901 96720 94325 80382 59048 50837 40756 32216 29301 45870 65606
11574 65606 73766 69217 82616 76936 62187 73791 104987 87563 67227 35795 46746 44026
11562 44026 42931 71524 86187 85647 83670 76072 58077 48381 51403 69012 73292 61396 72901
11549 72901 60613 43961 65305 86805 78829 75625 73846 77156 65445 56534 59474 81100 97259
11536 97259 126160 105138 96748 90902 63830 61930 67003 77796 74006 62121 70162 88653 65435
11523 65435 40703 48387 45976 69173 78548 66158 71981 66898 77364 100898 73820 53767 40883
11510 40883 39825 42337 49109 52866 40044 33272 50106 57369 58215 43808 43414 29048 37921 52624
11496 52624 60356 63553 92824 87653 70266 63073 85925 98159 75841 60197 69874 80881 83327
11483 83327 54587 55162 71243 47903 41062 56468 55703 77576 84553 90627 97061 84346 87218
11470 87218 113555 108727 104625 117344 130675 125705 111198 91763 61698 69391 69669 81153 88838
11457 88838 109451 113859 111923 117601 119579 131141 146186 141509 132555 106726 122395 125214 102547
11444 102547 106006 123221 120219 105429 94110 87702 77917 80077 68119 60418 88665 108944 116484
11431 116484 103784 101237 94838 66406 68439 82118 81677 66576 76765 78594 67763 63220 59135
11418 59135 75928 115500 114317 85614 93416 79342 59051 31288 20123 44029 65601 72140
11406 72140 67343 47534 46311 53864 66303 74856 57541 46485 71441 75116 84572 94981 80430
11393 80430 83838 79587 56350 39432 63149 78965 71425 56133 92739 103017 73722 66600
11381 66600 41746 43776 68061 83951 87922 58494 54554 78661 67747 74365 98444 107450 123462
11368 123462 149405 146754 139014 95506 88986 127819 156547 179016 155212 152396 152936 161951 155965
11355 155965 151530 119615 98093 134551 151745 157372 176970 179245 158746 131466 107860 99660
11343 99660 92972 113055 131402 131871 139467 136921 130356 130716 132475 120891 140564 132559 145388 157946
11329 157946 150162 143925 153410 140063 97816 103721 119528 122944 141873 158277 143177 122030
11317 122030 113121 130948 163559 172015 166849 152872 172227 201126 215708 205286 187893 157728
11305 157728 137708 149012 137861 157884 173891 170931 181035 198193 209576 239182 264049 264975
11293 264975 274848 272536 310291 361082 400319 436244 457058 515137 567392 614189 673448 736288
11281 736288 781425 842335 851834 823116 755753 694837 627032 585701 535888 517220 501567 497538
11269 497538 499181 540101 561744 568797 587404 579988 604946 603826 604566 597426 588141 576755 554173
11256 554173 555239 575090 607444 635051 647544 683632 718794 770330 812890 826005 829575 788484
11244 788484 717202 639604 567218 523117 507069 508135 482038 496765 534179 564500 595500 601942
11232 601942 610693 579670 580825 578940 545604 533882 545417 533379 521225 521577 546109 596339
11220 596339 642494 681201 721715 758830 759611 742455 716299 702091 638631 573568 517553 427847
11208 427847 352053 326881 320528 294049 273556 250187 246616 242313 244190 277587 280215 256448
11196 256448 251265 242705 213098 212650 226469 221599 194737 170149 169044 186219 209388 201250 198603
11183 198603 186957 187270 201864 213105 215404 195333 171063 163775 163693 164086 178947 205980 215590
11170 215590 232879 225901 221517 231340 236552 239867 246369 236174 249037 240703 230482 243412 268391
11157 268391 284270 265701 267256 267835 268207 281435 272696 270531 256945 249487 245345 221249 213096
11144 213096 194441 212776 227611 208161 198181 219218 251766 264366 276715 250905 241947 272850
11132 272850 272037 266020 263204 263032 273234 265134 255248 277889 279686 271821 264495 248264 236843 233672
11118 233672 219450 216623 223759 242430 236346 240866 266259 312060 343521 321890 290973 281237
11106 281237 265744 266672 278669 320142 372493 379726 355994 365497 378808 372242 338995 327984
11094 327984 353907 357870 354456 380043 355678 312435 321824 339030 295252 299697 308984 303450 335891
11081 335891 359413 353217 355264 357351 340438 347736 376003 425821 418235 368205 357782 381061
11069 381061 370475 364825 384732 394278 397471 408628 395640 380254 367869 387566 394276 379993
11057 379993 400555 400139 377075 322287 312849 340001 372029 383101 370479 373167 386741 386163 392694
11044 392694 412490 427567 430541 419849 403921 371947 369630 354732 341180 352397 375661 368244
11032 368244 378220 392096 374762 355249 349165 345025 378196 396932 382385 387183 392748 367229
11020 367229 375473 399075 390591 381704 370820 385658 378720 377845 415726 434989 436659 434738 420007
11007 420007 405607 426970 420698 439017 469244 476063 505360 527311 542676 566482 601268 608348
10995 608348 621617 632744 675318 694561 721932 761776 839293 915654 963195 1013553 1070782
10984 1070782 1121657 1152821 1141964 1120113 1074163 1018598 967736 922047 854782 768004 733291
10973 733291 716138 680434 644504 622075 615854 610054 641375 627531 613138 595057 595619 590490
10961 590490 586622 578468 610839 638381 649534 642001 663193 700539 717358 689846 675779 686458
10949 686458 703973 721108 741716 751177 747404 740308 752678 784899 799307 796297 806716 793505
10937 793505 783903 811953 836190 835802 824974 805369 809224 857009 858413 854391 865605 866190 870244
10924 870244 861571 906020 941921 966621 1027394 1108868 1178762 1232009 1267113 1379782 1507155
10913 1507155 1660844 1822138 1994382 2164672 2372186 2603662 2882193 3241123 3580027
10904 3580027 3612365 3278341 2803803 2397931 2061081 1818140 1653118 1544110 1483342 1446412
10894 1446412 1447834 1488613 1503468 1513563 1573485 1607675 1670725 1729053 1774086 1831231 1883383
10883 1883383 1936587 1960180 2032974 2120755 2233934 2342993 2494553 2640699 2767081 2957377
10873 2957377 3156750 3383966 3632933 3910963 4216004 4592562 5014423 5540317 6202021
10864 6202021 7020296 8065022 9325455 10834169 12650864 14781426 17216817 20030536
10856 20030536 23284370 27034918 31455328 36767058 43144253 50698221 59390771 69022582
10848 69022582 79577100 91293649 104244102 117994962 130652748 138148653 136498875
10841 136498875 126637174 112785942 98359221 85333538 74783123 67055039 62170737
10834 62170737 59950455 60091936 62282015 66308759 71670985 77456099 82553119 85986680
10826 85986680 87262706 86437071 83690951 79624027 75359478 72109772 70667138 71487992
10818 71487992 74619491 79836685 86773113 94905222 103745170 112855862 121447698 127803334
10810 127803334 129993992 126877678 118731411 107416954 95482263 84932356 76636342
10803 76636342 70864269 67600328 66703061 67953782 70885897 74761197 78761981 81864476
10795 81864476 83191640 82520984 80016566 75800212 70568299 65471600 61771451 60284604
10787 60284604 61288655 64632826 70021860 76982152 84867088 93366705 102377539 111426690
10779 111426690 119168096 123363393 120843913 109772114 92816371 74713392 58447090
10772 58447090 45122088 34824170 27190078 21585421 17466612 14385296 12043696 10219151
10764 10219151 8760473 7599513 6641164 5853381 5213656 4686921 4208956 3809208 3521196
10755 3521196 3290998 3036008 2824482 2641640 2489999 2358665 2264692 2150745 2051174 1984098
10745 1984098 1903893 1787861 1709909 1634177 1572463 1515044 1516605 1487805 1427015 1389467 1317780
10734 1317780 1281275 1249108 1192305 1134407 1054799 1031447 1020810 992674 962104 973487 986502
10723 986502 988706 986865 992299 973445 960961 956233 929102 907698 880884 847045 836790 832069
10711 832069 823364 842956 829497 803964 734544 669448 662409 649093 624723 605182 581721 551912
10699 551912 548874 553658 528712 529139 513367 502725 482464 482245 489675 476222 476000 463243 481741
10686 481741 502483 527710 555095 561966 550423 537107 498723 446873 417965 399617 417897 438950
10674 438950 434937 450736 451825 465558 443062 415938 402225 383135 335770 317000 307395 311831
10662 311831 300305 321086 369955 404136 415981 417126 433602 443975 448360 442798 414933 448741
10650 448741 499046 496683 487542 493349 509412 585862 674095 725884 774540 816648 844161 873339
10638 873339 887672 911709 897371 859829 863342 845898 790341 798483 791857 799787 821660 831090
10626 831090 837929 814665 783453 749910 753523 755084 710808 649700 572352 518098 514347 502773
10614 502773 436807 369858 310573 264162 230746 201731 158700 144030 153776 184516 206856 224170
10602 224170 234162 250715 283685 298561 273335 256727 243772 262538 272059 294287 327846 321265
10590 321265 356261 417568 461247 494951 523425 535028 516031 477966 477992 506369 518220 532247
10578 532247 512863 502001 497842 528704 559605 552676 562705 538757 526570 545596 556179 574969
10566 574969 591801 620440 644520 653611 677607 688940 754259 827812 836279 880871 934864 981514
10554 981514 1026381 1075186 1140802 1176100 1193414 1222379 1268612 1292671 1314291 1328890 1357799
10543 1357799 1382278 1445636 1494571 1521250 1568786 1624976 1654930 1727783 1824112 1914280 2023034
10532 2023034 2125209 2205472 2259603 2337482 2409140 2513011 2649880 2792353 2937511 3124102
10522 3124102 3343858 3622854 3927388 4250735 4559534 4911629 5367410 5878404 6457169
10513 6457169 7155506 7931083 8786825 9753396 10895528 12339837 14229432 16806614 20167332
10504 20167332 24341148 29224805 34668081 40698339 47554881 55537068 64672936 75291325
10496 75291325 88409058 105449713 127888620 155912590 186832196 217324055 249150914
10489 249150914 288239644 340318240 406644007 470654053 485058783 423827372 327491504
10482 327491504 238018153 169548711 121183623 88144869 65712480 50226412 39352327
10475 39352327 31623069 26012990 21844574 18769422 16527798 14864057 13608109 12595558
10467 12595558 11528089 10323123 9126472 8094611 7158723 6306455 5558988 4947996 4508107
10458 4508107 4207662 3978478 3817874 3662331 3490335 3278322 3050980 2818836 2600649
10449 2600649 2437323 2296076 2170491 2047624 1941603 1816215 1690557 1582623 1494424 1413083
10439 1413083 1321590 1223816 1177482 1145556 1114285 1050199 962137 915117 883819 835672 790389
10428 790389 768824 740326 713629 658412 636145 622900 645842 677502 663359 641139 651513
10417 651513 648990 673346 677684 681658 713507 747595 735186 742807 785162 826951 873775 927090
10405 927090 958226 972465 997241 1025828 1030497 1020154 974606 904248 839187 753852 665868 612257
10393 612257 574215 565254 581163 613615 608899 627160 625746 650839 718948 762904 803412 796608
10381 796608 762900 737509 773261 817765 837929 846187 824598 827802 868596 904283 934124 992892
10369 992892 1067062 1123462 1148534 1124836 1054065 974529 927393 889512 840015 756335 657012
10358 657012 571624 534692 539615 537940 478847 446859 416641 404226 381384 343214 307962 256541
10346 256541 221110 224992 270250 288821 322442 384365 425203 489641 536192 516809 486574 468897
10334 468897 454264 410738 371745 298851 235667 195825 147840 99236 78223 63574 38280
10323 38280 38943 48133 54487 36457 36511 44765 22183 -360 6571 8737 27109 51486 39746 59047
10309 59047 77764 40605 -7713 -51638 -61514 -60767 -69355 -89029 -82371 -63689 -71125 -76839 -61603
10296 -61603 -39071 -12438 14023 -20532 -53119 -82390 -68249 -41833 -41847 -60338 -44629 -7614
10284 -7614 11790 -6954 -13158 -14284 -282 18605 22007 13041 7995 -4083 -36336 -40205 -33836
10271 -33836 -34378 -33718 -51596 -54566 -76335 -95793 -102951 -102447 -113981 -117748 -124026 -86841 -65474 -81192
10257 -81192 -90970 -97548 -93843 -100205 -118170 -132100 -131209 -133168 -138733 -137478 -128517 -116331 -110212 -70513
10243 -70513 -25696 -52997 -62459 -62252 -70432 -65872 -74182 -68658 -37054 -27427 -51940 -82172 -83945
10230 -83945 -53433 -35983 -41125 -56322 -48669 -43433 -31532 -24438 -50210 -74717 -73530 -84895 -67633
10217 -67633 -51176 -38867 -62633 -86812 -88878 -92924 -106165 -107354 -104971 -89640 -68172 -61343 -66189
10204 -66189 -80459 -103965 -92169 -67012 -36928 -40551 -56778 -50873 -37093 -29431 -10451 4219
10192 4219 -10285 -18524 -1487 -4720 -22241 -41032 -47239 -45103 -55089 -57593 -59313 -74752 -85687
10179 -85687 -38790 -11800 9558 15023 41669 92328 107579 124722 126337 147038 172327 185538
10167 185538 214968 229836 239819 236743 248730 276207 294954 329689 333379 368947 423183 505591
10155 505591 607512 690002 810835 935990 1080226 1323911 1649569 2037584 2421966 2798617
10145 2798617 3243822 3815696 4497081 5173367 5481282 5124622 4218868 3179941 2297972
10136 2297972 1598430 1126015 836848 631067 476881 365692 265425 237959 191246 162712
10126 162712 158833 125599 102057 97987 73757 39433 35110 22325 -736 -14605 -28123 -12170
10114 -12170 -39448 -64077 -51969 -19297 3196 -17997 -12655 -14217 -28193 -53495 -98081 -101073
10102 -101073 -81515 -55942 -37492 -51542 -72445 -93384 -94569 -60752 -19138 -2693 27022 18670
10090 18670 1943 -16419 -33145 -38927 -12942 1422 35212 45277 51767 94007 151652 197748
10078 197748 215481 275886 341749 399561 465368 510060 537387 561693 588859 640069 741981
10067 741981 875995 1058217 1228962 1406658 1626898 1950133 2303472 2480731 2305917 1879742
10057 1879742 1412193 993939 709920 531837 377458 304573 248515 204322 131238 94454
10047 94454 89769 113875 70689 60290 71464 74418 44316 36400 37493 30129 48469 106019 162628
10034 162628 233029 295586 330968 404848 521808 632679 831231 1146340 1344022 1022273
10024 1022273 683137 446378 289367 186536 121833 88522 70446 63534 75963 75080 77663
10013 77663 84236 72720 50314 57713 48327 46491 65448 73165 78080 64188 76047 106915 119812
10000 119812 152447 141976 127201 87348 56234 31970 4587 -25395 -25729 -22975 -10005 -566
9988 -566 -17784 -47952 -55102 -38789 -45548 -50439 -45067 -41080 -33730 -37671 -26291 -36474 -59873 -72713
9974 -72713 -56100 -57041 -75901 -80414 -57471 -59950 -44682 -28719 -37069 -63666 -71058 -81576 -56493
9961 -56493 -47081 -39769 -48104 -57551 -54684 -61371 -71600 -75436 -74293 -77577 -46350 -46344 -51511 -61595 -66128
9946 -66128 -57670 -30454 -29099 -31336 -28857 -18015 -32266 -46832 -49556 -38051 -31398 -34422 -21724
9933 -21724 -6071 23596 -1801 -19594 1688 18161 -967 -24935 -60743 -69505 -80178 -92395
9921 -92395 -73442 -67103 -69735 -67684 -61150 -71782 -84055 -73904 -79859 -101668 -65632 -40303 -34066
9908 -34066 -23127 -33648 -53643 -73740 -90447 -91574 -70013 -77938 -87264 -92620 -72276 -41365 -33263
9895 -33263 -25975 -36331 -52289 -32727 -23896 -17834 -13822 -14190 -47251 -72894 -87458 -76483 -43731
9882 -43731 -40977 -62018 -51039 -16441 -25683 -52187 -31786 -36090 -29205 -18063 -29988 -36208 -48522
9869 -48522 -65143 -81551 -64168 -63666 -61658 -15851 18691 8587 -18617 -30037 -27312 -52930 -56900
9856 -56900 -71582 -61952 -42717 -23644 -21390 -14275 -5457 -16158 -17062 -29494 -53617 -54872 -23972
9843 -23972 -13627 -29919 -41724 -32888 -27370 -24212 -38779 -79438 -30182 7057 -881 -20567 -19335
9830 -19335 -20468 -32299 -54192 -58118 -56458 -55390 -51009 -1098 19449 15161 -18661 -78554 -78218
9817 -78218 -63105 -56198 -72858 -66109 -73139 -55785 -46675 -59270 -40828 -38347 -43014 -69138 -75824
9804 -75824 -90473 -72923 -78652 -42222 -31193 -26298 -14010 -8513 -45582 -60222 -59818 -69155 -64538
9791 -64538 -37062 -22967 -13060 -29314 -33077 -33969 -55022 -59879 -49418 -64881 -57055 -40130 -35252
9778 -35252 -48684 -59558 -48136 -30244 -25222 -44266 -22211 -39089 -61379 -46586 -28861 -41606
9766 -41606 -40694 -34722 -25539 -6098 -8867 -30502 -30665 -40816 -38082 -15829 -2449 9168 -9060
9753 -9060 -22125 -39000 -25543 -18184 -46121 -52909 -46153 -45320 -39944 -5861 4810 -41523 -57910
9740 -57910 -52114 -28929 -21493 -55981 -43008 -8348 -30588 -51043 -57514 -78112 -79802 -44469 -21053
9727 -21053 -3446 -19395 -44341 -54077 -63053 -69791 -58579 -84469 -100029 -74770 -44225 -5741
9715 -5741 -8375 -28182 -48218 -64022 -51813 -40104 -31766 -36247 -63624 -59117 -42009 -42905 -51732
9702 -51732 -87252 -78385 -61768 -66808 -83648 -79227 -51077 -50412 -39408 -14629 -9317 -3256 20887
9689 20887 12271 -30758 -46345 -30035 -15206 -16473 -28681 -54210 -50175 -64587 -55874 -16097 -8355
9676 -8355 -13361 -2602 250 2226 9774 7691 -3829 -4949 -11322 -31456 -34324 -27217 -1281 -1644
9662 -1644 14402 -13439 -47387 -23238 -5396 8696 266 -26845 -39161 -69212 -81484 -57159
9650 -57159 -56030 -64760 -66029 -44541 -26336 -43434 -26379 404 10128 27320 30171 25009 19573
9637 19573 1371 -10487 -17179 -47246 -48070 -42751 -48796 -13469 -5378 -60063 -79845 -74205 -47536
9624 -47536 -15991 -11009 -15214 -25941 -36569 -16895 29201 -5468 -34584 -33832 -36343 -15519 -34331
9611 -34331 -62742 -65572 -63032 -49256 -39016 -24547 -23834 -16048 22911 30754 10447 -1742 7921
9598 7921 15252 39214 70639 54360 19143 -8331 -3665 15800 12760 -20507 3863 -2283 -2999
9585 -2999 1751 -3 -2412 -15111 -15295 -30621 -19823 7233 2112 -28770 -37713 -23415 -20218 1
9571 1 6501 -16781 -31751 -51665 -31696 -35659 -43108 -18339 20012 12768 -14080 -18052 -12040 -28427
9557 -28427 -36299 -19138 -7576 -9479 -27962 -29325 -25248 -7767 -10513 -10802 -21846 -10876 -7187
9544 -7187 -32692 -33270 -1553 -516 1101 -2836 -9381 -22532 -12654 -9007 1553 9273 18551 15726
9530 15726 11781 38058 25479 6701 -17628 -25663 -20247 -8200 -16506 -40727 -26131 -4566 3744
9517 3744 10725 42564 40532 31481 28347 23744 41373 37567 34666 31981 15311 9658 5130 19084
9503 19084 -550 -2262 19314 46302 51966 54179 43764 28635 38063 50098 33289 13381 -7291
9490 -7291 14064 7287 13470 25237 19474 -8911 -12952 -29364 -4927 33243 28258 9441 -20248
9477 -20248 -53523 -46256 -15719 23072 40123 49157 30623 28330 -1297 -9390 -27014 -25545 -1614
9464 -1614 17363 33067 45203 33657 14533 1117 1993 16707 19656 35348 68638 62890 78163
9451 78163 76095 52108 3191 -12149 15546 25359 13023 24828 36901 5888 11528 40996
9439 40996 35535 23886 53096 65163 57766 30002 9993 10809 20914 8743 25250 39951 30691
9426 30691 -49 -6550 1695 29974 45813 25065 -10306 -15168 -22820 -31113 -13682 -8947 3084
9413 3084 6263 35803 31942 12703 18125 15692 -23635 -13797 2656 -12776 -8636 6055 32473
9400 32473 36727 7139 1260 17764 21006 -1381 11813 11777 -5886 -11544 -7455 1116 -10632 -20789
9386 -20789 -9551 7974 41233 36745 28997 45916 64539 29760 7224 -3111 2428 3358 7819
9373 7819 41940 39685 6930 5122 35149 40607 43521 38485 32500 -9615 -15965 13181 23497
9360 23497 31741 26195 13870 6483 4272 2777 5934 4346 -16652 -16696 -17249 -4097 -13671 6004
9346 6004 9986 17431 614 31451 70721 79734 72403 23546 -11711 33933 66556 26520 11745
9333 11745 16808 27359 14367 21164 31994 43023 32410 20490 22606 19712 -4324 6246 11193
9320 11193 30077 24478 23121 47084 67450 67586 62935 41619 42283 43062 23308 22177 26879 33025
9306 33025 31858 39804 28532 39196 57954 62891 65371 55231 41423 45727 37605 71503 83177
9293 83177 61103 67127 65313 57728 40439 21819 -2762 -8908 -11150 16453 39114 54253 61712
9280 61712 49233 38169 43660 38473 26008 44967 62104 61032 65675 50002 67836 86731 104432
9267 104432 96598 93488 91579 76627 66230 63897 75027 68353 52200 49736 66138 84086 89073
9254 89073 94222 105213 105743 98238 110547 103019 101525 78764 42985 50945 69179 85841 79374
9241 79374 78676 70877 47030 40671 23084 11928 37017 52594 48883 57242 79545 62371 38393
9228 38393 28659 40581 42720 12647 8105 27197 55305 86738 104470 94552 91601 115905 109896
9215 109896 95810 93292 86637 71072 83699 93850 98515 81959 66257 59945 65210 81306 72275
9202 72275 45058 41372 51634 62177 75840 64388 53670 71578 66538 110193 125908 117429
9190 117429 93061 83419 120263 141977 128882 108205 110380 95881 111379 101412 65778 56593
9178 56593 84035 90830 83411 70309 77042 78880 87587 84879 86237 116836 131792 115172 82018
9165 82018 64949 82788 95187 90648 106067 116827 108747 92621 98688 93532 87363 82089 76404
9152 76404 96828 116918 95346 91943 83033 87871 101362 110241 109121 113595 114251 110371 117688 154331
9138 154331 145220 106514 97867 92585 84696 81329 89667 100216 113653 124070 134340 137825 156412
9125 156412 137849 114390 113534 115039 148659 172741 186299 172221 149665 134275 131409 121139
9113 121139 124020 115189 95248 72484 87858 78127 96266 131596 103306 84087 95710 91525
9101 91525 99349 109734 107408 101236 108185 105234 101626 95894 111433 150873 150205 134956 122371 114506
9087 114506 131413 136948 124284 122616 142395 176675 183720 161254 144662 126098 124761 122903 129227
9074 129227 128788 119895 122998 128905 131981 127905 142516 163682 175079 174894 166859 167994 146843 143189
9060 143189 129400 155146 188548 182317 188210 140867 129257 140228 168258 164010 150089 153605
9048 153605 177481 173904 159094 160777 163806 169933 161706 184950 237625 243484 245526 208683 202731
9035 202731 210302 220116 226699 204795 194850 228228 244235 269358 244183 206887 186648 187643 175281
9022 175281 169211 194038 220445 227829 224875 232563 220656 234477 245012 227582 203276 206143 203649
9009 203649 210641 237009 244220 234430 211688 192041 183217 213154 255218 238804 239011 244453 260480
8996 260480 268028 247688 241915 243629 247980 254057 251276 232890 236800 260410 253450 264752 266781
8983 266781 262909 254150 263538 280319 267503 265236 252665 240776 221271 226840 268514 298582 293784
8970 293784 275161 298053 303304 299400 282139 279800 294687 296189 302270 277057 275722 308353 317738
8957 317738 299582 314515 305415 302400 311366 326588 337334 336905 294360 268420 297585 316927 282908
8944 282908 280835 286369 309099 297118 302511 314938 292583 274513 291020 300333 286892 300378
8932 300378 314598 329593 357588 373380 353623 347072 336298 352892 381932 399845 392194 387480
8920 387480 367018 364769 365957 389116 408397 426316 423343 392295 344514 355195 412455 430587
8908 430587 411177 389159 368160 366957 392031 397908 427019 432273 429699 434348 450091 458677 458212
8895 458212 457076 434392 433312 442384 462296 456157 454261 452422 454297 481637 498162 502823 501999 488365
8881 488365 460624 457249 454842 448183 480205 516678 517985 508720 505207 495600 486752 490435 505244
8868 505244 520807 515454 507243 517751 537891 544895 547657 555699 568103 565733 585826 598868 587186
8855 587186 576295 584549 617542 625975 625624 642663 637104 624243 639608 663209 686838 668890 635612
8842 635612 630669 620193 620715 637812 666244 695303 730967 723114 724919 742216 729098 727038 747539
8829 747539 740195 721073 721329 719903 716896 731735 752823 778689 749933 741673 760906 763379 770869
8816 770869 779875 783773 787927 812528 819351 796705 799539 832607 844074 851274 860136 884812 898898
8803 898898 887263 892639 915289 930814 930363 935391 986743 991358 985711 1012026 1012534 1014238 1036728
8790 1036728 1049641 1047080 1066075 1071917 1059794 1058772 1066830 1084977 1082825 1092689 1119870 1109693 1145287
8777 1145287 1160689 1157347 1141352 1156669 1180732 1208418 1233785 1261525 1289754 1283042 1263305 1280301
8765 1280301 1298662 1304127 1335889 1350811 1367096 1401878 1413500 1422183 1464186 1502959 1506668 1503616
8753 1503616 1516575 1531323 1543858 1584155 1580492 1574440 1582833 1587843 1613870 1646517 1671577 1650031
8741 1650031 1695365 1730356 1756260 1762079 1782688 1810070 1836840 1868724 1896797 1927428 1956208 1943050
8729 1943050 1945896 1975369 2011385 2062522 2114179 2127120 2144903 2163330 2196655 2236186 2259813 2279924
8717 2279924 2329072 2363112 2406960 2441068 2467664 2521690 2568644 2610074 2603005 2630810 2698270 2752043
8705 2752043 2789311 2840677 2878932 2905383 2930413 2968432 3015832 3063544 3107820 3128729 3178133
8694 3178133 3209527 3236499 3309882 3376775 3433588 3482153 3542608 3621442 3666403 3704584 3768933
8683 3768933 3843260 3912619 4010628 4097106 4162779 4224707 4279265 4349110 4430230 4518460 4596095
8672 4596095 4693001 4782636 4824117 4899388 4999758 5092570 5200047 5315340 5411770 5501388 5576899
8661 5576899 5710901 5796312 5877231 5998739 6090267 6183782 6318722 6448107 6555721 6663769
8651 6663769 6764146 6884745 7033099 7167604 7274876 7390625 7544174 7696333 7839963 7962746
8641 7962746 8083095 8232594 8365403 8518710 8666575 8799631 8960481 9118111 9246388 9420148
8631 9420148 9555929 9682949 9794531 9903410 10065082 10243652 10367968 10474815 10602023 10744288
8621 10744288 10862576 10969483 11098667 11211289 11314288 11417722 11502797 11591850 11678999 11755646
8611 11755646 11822804 11865200 11913183 11973664 12044084 12096864 12114715 12132767 12167664 12151428 12133395
8600 12133395 12132291 12109580 12089903 12055645 12012873 12001678 11938381 11860583 11787470 11689114 11641269
8589 11641269 11586881 11514970 11400703 11288628 11173533 11047382 10955262 10834723 10686795 10543936
8579 10543936 10423792 10313531 10199271 10031113 9865560 9713566 9569680 9421591 9243718
8570 9243718 9077949 8931249 8818176 8698781 8547832 8411481 8287987 8155397 8016135 7864332
8560 7864332 7738177 7616969 7459373 7310451 7163470 6999745 6832739 6694659 6555033 6436044
8550 6436044 6310909 6235700 6165313 6063115 5936795 5827687 5700412 5570626 5456250 5358286
8540 5358286 5259303 5165066 5060362 4980812 4883339 4800040 4727278 4645291 4527482 4447758 4359498
8529 4359498 4265317 4198445 4134751 4091892 4041851 3974510 3868218 3799772 3760695 3696684 3629659
8518 3629659 3559839 3487295 3395432 3319543 3257872 3216917 3156600 3077171 3061549 3049079 3016779
8507 3016779 2978156 2916813 2880604 2840706 2769231 2722516 2691914 2652498 2612988 2544764 2492815
8496 2492815 2443283 2421082 2392890 2321471 2280587 2238560 2212493 2194686 2190425 2171970 2161226 2147255
8484 2147255 2108626 2044697 2007379 1980096 1952399 1932216 1922331 1855663 1792088 1785618 1793819 1777188
8472 1777188 1766565 1746457 1725424 1690899 1644554 1624393 1583853 1536487 1516758 1526612 1513138 1497311
8460 1497311 1471916 1431272 1410903 1403975 1403295 1396773 1368641 1363184 1340251 1288988 1279271 1271744 1256555
8447 1256555 1238346 1214500 1214964 1242528 1221138 1208387 1222635 1218495 1193557 1144919 1111159 1097006
8435 1097006 1085039 1052165 1036949 1032432 1021499 1012738 1003555 979627 960837 989200 966118 941482
8423 941482 928099 906883 889274 881613 869595 852943 854651 860169 848888 869691 878137 857021
8411 857021 837283 812604 798343 780688 771945 752179 761093 771080 781284 773124 750734 721400
8399 721400 695720 686287 680415 664359 645090 646071 653794 678503 665461 641030 628762 615044 602860
8386 602860 619662 620975 623504 628596 634800 616148 582612 551760 562563 603958 592515 577827
8374 577827 573946 575955 556197 535378 508626 520582 531989 533508 525029 539832 558699 538485
8362 538485 517240 508527 511995 520820 529054 540011 530186 543170 531572 498404 466159 480141 502702
8349 502702 491296 486831 492360 494025 474050 455769 443904 438246 422338 393268 412463 438594
8337 438594 426319 401807 383696 398929 422203 423777 423106 397130 354473 346684 337907 362813 373868
8324 373868 360087 371404 381579 375422 370718 370690 410864 432604 438014 432885 405787 383748 380707
8311 380707 377291 383866 397721 376109 360055 326534 282914 275264 269674 250175 265923 274468 255898
8298 255898 247633 280775 283995 260982 254143 257022 281178 286200 270370 267083 267286 254899 249752
8285 249752 271475 292967 303884 308511 299519 311028 310675 333968 327870 329517 352594 360465 377473
8272 377473 383929 377191 431195 495349 493276 426070 404325 370157 344921 304546 271201 246543
8260 246543 214146 192286 220440 266969 266548 271542 275475 250449 241979 239551 224002 185766 199783
8247 199783 200363 193686 193093 192924 192929 189030 197897 227884 244710 245940 245661 237027 258788 256761 264573
8232 264573 297211 314132 316946 323070 378231 358569 324809 280350 239757 230634 204126 186907
8220 186907 194736 182884 150674 132860 115670 108216 146690 136678 143701 125290 105770 93132
8208 93132 86418 99177 94642 99420 67648 50325 82050 125412 145289 142697 167557 158908 143641
8195 143641 160217 159116 140933 122581 124580 147926 141321 140535 135774 141349 115719 79209 76649
8182 76649 69757 104367 119616 123696 138869 144673 123325 120922 126216 123628 122199 135478 124415
8169 124415 108703 77916 90891 101177 123293 104057 99114 117896 129104 140028 145241 132195
8157 132195 122415 128998 100081 83290 102860 118561 126693 144074 158392 144683 113379 74332
8145 74332 71851 49360 28862 34556 43462 46184 73460 119834 130376 94165 72172 83953 91037
8132 91037 80081 64576 100753 104168 118604 127962 128410 116161 101034 68401 66524 54080 20000
8119 20000 42840 88739 86295 71313 67360 59945 43142 56840 83674 89803 117151 111740 83451
8106 83451 37259 42888 87841 100082 82491 46354 38853 93585 108496 86075 70406 60978
8094 60978 77942 81201 92008 77972 59331 58176 63710 74392 101986 102295 88046 97722 102774
8081 102774 103150 91812 68898 60486 63167 103691 115321 123696 107685 91990 81670 89931 67834
8068 67834 32946 17212 31203 56335 70191 49868 59373 69585 79039 79961 76388 87380 87445
8055 87445 69960 69806 67284 29440 41712 57635 49877 31010 28764 28077 34812 55463 66469
8042 66469 60650 45591 35735 28570 17070 37389 41661 42744 23091 25449 40032 36762 24879
8029 24879 36255 50355 48545 8471 -11107 4302 50068 54570 48324 54020 41048 25213 12439
8016 12439 27407 62381 73291 68533 71560 68892 62105 42270 40027 61877 62182 69373 58078
8003 58078 55277 54143 63172 55989 56128 49364 42566 50022 61553 74898 79109 76765 40634 38415
7989 38415 43339 40207 41562 65212 99141 86178 74153 71679 83224 99588 69900 29560 9467
7976 9467 -2696 20095 47062 60225 63981 60090 46062 58260 33045 30860 27927 29574 43848
7963 43848 43807 39745 43154 43940 26751 28412 29531 25206 38772 34693 46130 53710 40155 41101 29277
7948 29277 19815 12871 18642 22529 26149 32589 40452 50627 81791 99746 82370 81084 93895
7935 93895 81956 94066 90185 67762 63356 79305 86539 62934 50755 49138 38258 31728 43297
7922 43297 71770 72813 81603 86466 75254 48155 32440 29450 32152 30916 49703 64575 29101
7909 29101 13099 1518 14037 37141 59783 63311 46338 38320 42372 48279 26492 14988 5329
7896 5329 11676 24694 43972 59751 46936 29643 53346 69009 47184 24428 23477 12275 -3290
7883 -3290 11785 27427 37763 49522 50747 53454 32421 16132 16586 18845 12422 19709 41626
7870 41626 60247 48947 50032 42827 27899 24324 36975 43194 32232 -191 -9889 -14448 -18648
7857 -18648 -21057 -16930 -19123 -27627 -54982 -41478 -25087 -27946 -38412 -49848 -24156 -3155 9839
7844 9839 3745 -4461 4458 17802 44049 45856 37748 20277 11289 1867 -1685 26353 22124 -5881
7830 -5881 -37619 -44962 -37907 -6264 -3799 -28801 -25397 -15185 -19963 -3804 4801 20968 10608
7817 10608 -8006 2433 9911 8604 -2251 7947 6808 -1843 -4533 12752 25147 4857 40898
7804 40898 16154 2667 22583 45678 33645 54870 52846 58118 51958 21595 4432 12588 -3158
7791 -3158 -11086 -6538 1569 28555 42889 21384 6389 14888 18866 51173 39359 18780 -3441
7778 -3441 -4854 -4612 10292 14602 -167 -28127 -24174 -13638 -2944 -4819 14219 44181 40482
7765 40482 19082 -2410 2022 10663 -7639 -17326 -18813 -19190 -11812 3153 20845 -6122 -9391
7752 -9391 -6754 4038 30955 35823 40049 19780 13995 -16601 -28140 -13982 -1659 1428 27784
7739 27784 17064 15146 3103 3142 -10288 19825 35313 12914 3394 4203 9856 16548 -2265 -8715
7725 -8715 -2139 5740 20069 8617 -2412 21083 43291 45008 11027 -25911 -41222 -21009 -26753
7712 -26753 -36434 -64026 -52784 -33569 -23489 -12195 1864 24871 33128 22508 15978 6086 12746
7699 12746 17195 11332 3055 12474 13746 6758 3133 -17186 21986 43374 21807 19763 -19173
7686 -19173 -50250 -27083 -16186 5302 13239 1026 24394 22682 -4390 4565 -21201 -34036
7674 -34036 33 20933 24251 14407 23075 -3994 -9590 -6855 -33925 -41838 -30428 -6980 15946
7661 15946 -9975 -32543 -33287 -52233 -40748 -62043 -102168 -78849 -25222 -15802 -21045 -854 6808
7648 6808 -8064 -21254 -24637 -15270 -9520 -30731 -34940 -38932 -37226 -12049 7029 -591 1733 -12108
7634 -12108 -39262 -53375 -41009 -23705 -15851 8693 15301 17086 17904 25254 41421 43964 21927
7621 21927 8863 15273 19804 5119 -13572 -21521 -24196 -11847 -13556 -14102 -4558 -6337 38702 24618
7607 24618 1579 15042 1174 621 7388 10051 10696 15963 15618 9277 14380 11437 12902 -31060
7593 -31060 -24422 -2090 16662 9336 6562 20723 5263 -8887 -33084 -46853 -38906 -33706 -19111
7580 -19111 -23936 -37043 -43312 -58378 -34585 -962 -9527 -31278 -54615 -52534 -30631 6549 17990
7567 17990 10179 17895 19164 -6450 -32984 -26766 -39680 -47599 -40223 -50942 -75378 -85888 -77847
7554 -77847 -64738 -73145 -46169 -28594 -41558 -25236 -12663 -15694 -32604 -16109 -10968 -14753 -43063
7541 -43063 -45566 -54327 -24379 -10959 -32438 -39644 -30425 -26067 -11166 12955 -1410 -22623 -13028
7528 -13028 -1108 -11835 -23637 -26539 -38485 -33014 -28953 -25618 -17724 -14303 -16576 11723 33885
7515 33885 25833 -7512 -26499 -31830 -25332 20558 45627 58246 64589 58241 27135 -26157 -43055
7502 -43055 -50208 -30748 -1422 31799 39353 24661 24359 16417 -30291 -52590 -62716 -54030 -36579
7489 -36579 -33590 -31735 -8293 -708 21892 4830 -1460 -10449 -5517 -4905 -26597 179 26675
7476 26675 28763 10557 -4385 -5906 1561 17047 -6905 -17201 3647 8739 -3644 3622 10217
7463 10217 14196 27276 14570 -12154 -21488 -9801 -18405 -13922 -11592 -37278 -47801 -51121 -31513
7450 -31513 -22586 -23509 -25634 -39131 -44397 -33869 -3774 6466 6214 10880 6812 7307 -4952 -17941
7436 -17941 2765 -23251 -26621 7068 19979 5083 -24991 -40362 -27392 -46139 -47809 -796
7424 -796 14669 10387 17479 2760 13479 5394 10415 12659 10986 -28250 -58671 -39543 -30454 -28001
7410 -28001 -13715 9110 11644 12613 19955 18162 2560 -4532 -16532 -1336 34302 52391 21884
7397 21884 6242 2975 9033 4789 -6062 -15147 -17241 -2090 6305 4040 -7625 9883 6948
7384 6948 -12354 -7260 19408 22868 23368 17595 7000 -13978 -19993 -15718 -25821 -25064 -37662 -24306
7370 -24306 -16309 -11558 -5203 -28669 -6780 -8737 -15006 12114 18725 -3528 3972 -658 -2999 -3010
7356 -3010 -6035 -8499 -39097 -32530 -21960 -12919 -31207 -37545 -37829 -27865 -17123 -24915 -19689 -15083
7342 -15083 -33210 -42002 -29241 -26841 -18318 -6277 15621 11399 9030 132 8100 10496 14183 339
7328 339 -12046 -19428 -25874 -12504 -26764 -18178 -23702 -38411 -44844 -55552 -48454 -10395 10974
7315 10974 -15728 -51532 -52111 -36680 -32865 -14972 9483 23885 23886 16609 -18634 -8828 -3802 -8443
7301 -8443 -12756 -3963 12481 40436 34950 27070 7760 7140 8917 3684 -14500 -13227 -14965 -26396
7287 -26396 -20844 -20478 -29135 -8098 -15129 -13532 -20138 -41314 -46058 -26981 -6339 115 11593 17585
7273 17585 12479 -16399 3732 8797 -4869 -17592 -34603 -45099 -23923 -5291 -114 -7229 2170
7260 2170 19408 14008 8702 8782 14950 5728 -23353 -27926 -32233 -12735 18527 33087 28048 38236
7246 38236 33257 1713 -17078 -18174 -10531 5945 23335 12792 19591 23445 20617 9989 -15861
7233 -15861 981 11302 -3740 -12488 -34530 -37921 -24700 -2528 -16131 -22093 -20856 -23330 -11761
7220 -11761 -33887 -31725 -27556 -22001 -27040 -59011 -50714 -16006 15722 29494 -1683 -10371 -13716
7207 -13716 -12320 10148 4167 -17975 -23039 -49864 -38471 -11787 3201 7112 -4758 9580 54915
7194 54915 64905 65418 49168 22482 28087 -2857 -4669 -983 16961 701 -17197 -11036 -24803
7181 -24803 -19735 -12280 -7019 -12025 -14399 -41294 -26399 6046 24959 17051 5111 22775 6649
7168 6649 -26938 -36447 -23497 -8712 2483 9042 -7439 -1619 -17552 -33418 -42446 -50733 -59834
7155 -59834 -67380 -64710 -48066 -33504 -54714 -51012 -31419 -10911 573 4706 -1780 -18631 -9395
7142 -9395 -2441 -2652 -4900 -10135 -13223 -14636 12868 33102 45852 45678 29001 3814 -10332 -12641
7128 -12641 -26829 -5479 9718 7773 -5505 -7780 4502 2180 -19921 -25013 -37635 -31109 -46541
7115 -46541 -38509 -22993 24817 33395 8805 8595 6361 24784 30465 42142 7523 -7497 13435
7102 13435 50816 66799 35508 31044 27674 21841 -9156 -6379 -7516 -12001 15194 10451 5073
7089 5073 -22549 -31838 -32279 -32393 -12479 -1920 3204 -18723 -21051 -9716 -37068 -19365 -6487
7076 -6487 -16098 -8311 8491 -6576 -28663 -15109 -10166 1102 -2 19354 14196 16507 6825
7063 6825 -33961 -46955 -41431 1013 18082 15472 -11617 -27713 -46690 -51250 -40101 -34191 -9653
7050 -9653 -47649 -81304 -54760 -34512 -21135 -24492 -43384 -55302 -45650 -28111 -38846 -54230
7038 -54230 -66330 -65889 -43401 -13235 -6102 -27539 -26817 -16394 7215 5413 597 -13549 -14174 -16950
7024 -16950 -27004 -15417 -28867 -11866 -41453 -61053 -64528 -78354 -63882 -43857 -36917 -23670
7012 -23670 -9739 -789 2803 -7826 -14499 -24538 -28664 -32835 -17407 -20983 -45857 -41816 -12779
6999 -12779 -13134 -37565 -46363 -55556 -22245 -5804 -10344 -18619 -29508 -33535 -40362 -35060 -28667 -21635
6985 -21635 -30371 -30573 -460 34481 44946 38271 28308 29358 43753 46240 3925 -16962 -27778
6972 -27778 -29180 -33528 -42431 -36097 -5797 -2903 -24940 -33255 -5769 7651 -6371 -31869 -51680
6959 -51680 -51329 -40430 -42177 -12366 2724 8770 -2920 -22235 -35499 -14816 -8332 -17098 -23767
6946 -23767 -19109 -29020 -52489 -77669 -70294 -46512 -39996 -59166 -35423 -20757 5736 -18542 -23704
6933 -23704 -24463 -52112 -65275 -69522 -56316 -41143 -53848 -72301 -86632 -68044 -51574 -33842
6921 -33842 -41441 -45439 -62101 -56538 -45240 -47807 -45792 -28817 -14090 7250 6287 5966 19783 15914
6907 15914 2417 -32551 -50580 -45638 -41238 -23972 -19659 -1630 10156 -2304 949 13368 2220
6894 2220 -14054 -34918 -30142 -33644 -21504 -25274 -32385 -47606 -47340 -32647 -21108 10922 15338
6881 15338 -14741 -11982 -6762 -693 -1828 -3417 -4897 8843 13176 6831 -8499 -48668 -68255
6868 -68255 -63958 -28995 11427 60600 75663 43913 20708 20479 -14572 -3421 -1271 -21689 -26062
6855 -26062 1888 20493 2003 -6142 -10449 -31427 -26660 -15754 -48227 -29354 -8798 -21489
6843 -21489 -47235 -45916 -13922 -12146 -26732 -12430 -11066 -3284 -22036 -36268 -33430 -30278 -26953
6830 -26953 -32344 -27223 -12890 711 15552 -2088 3796 12354 7873 17226 -2040 -50400 -53168
6817 -53168 -40586 -26139 -37708 -70726 -57998 -36778 -26134 -10165 11935 -5834 -24580 -14584
6805 -14584 -12691 7836 3435 -23622 -9444 23639 88 3239 17133 19555 2877 -8773 -13560
6792 -13560 -29855 -51129 -59388 -54914 -29888 -21605 -34823 -22647 7060 18518 -23403 -33226 -13872
6779 -13872 -1401 -16156 -36886 -33197 -38396 -43844 -28527 -42409 -24408 -23286 -14481 9889 -9054
6766 -9054 -22755 2804 15652 1181 -6963 -8298 -802 -15460 -16684 -7141 17930 39137 32192
6753 32192 41446 22697 -1631 -31129 -21378 -4192 -24884 -38321 -41543 -28045 -16278 -10205 -8699
6740 -8699 12516 35435 23647 21747 -4150 -23817 11335 6985 -16274 -29820 -47144 -43469 -28106
6727 -28106 -7538 -14958 -16420 -24389 -63143 -57153 -31228 -13890 -6714 -21687 -28390 -39526 -22003
6714 -22003 10571 54572 72850 59618 58787 37132 29246 14671 12038 45975 48723 44428 28389
6701 28389 28869 24100 6857 -4734 480 21097 17701 34380 22086 28932 19270 10379 32237
6688 32237 18457 -17026 -17370 852 5784 -1872 -45734 -31509 -10075 -21315 -6697 -14126 -17271
6675 -17271 -6096 950 4611 -15981 -49697 -37241 13073 22091 15298 999 -1456 23903 22138
6662 22138 29714 -4613 -42903 -47833 -61109 -62262 -34214 -38152 -56237 -32695 2183 30159 17831
6649 17831 -2666 -18248 -597 16077 10186 5595 6025 -12867 -32230 -30658 -2135 17384 8467
6636 8467 -11053 -46082 -44265 -40994 -49017 -51146 -21783 10203 -11708 -30342 -46302 -58514 -70207
6623 -70207 -60729 -33722 9273 -21930 -43726 -31441 180 -500 15804 13353 8077 9137 24285
6610 24285 8249 11357 20717 10873 -3196 -26110 -4449 7067 26911 46329 25619 -23977
6598 -23977 -45281 -69055 -57920 -57280 -51019 -34076 -21872 16140 -25830 -76996 -94097 -79438
6586 -79438 -68784 -40098 -22643 -28916 -25077 -34774 -23990 -56571 -45877 -9955 -7259 1949 11629
6573 11629 6499 15857 6739 1673 11873 -5099 20727 34172 29660 13287 -14777 -12306 10846
6560 10846 14686 3474 20663 15757 17151 -29273 -17197 9565 20065 2545 -35662 -69578
6548 -69578 -52459 -23379 4208 11923 7602 -3092 -26196 -32312 -19295 -16176 -11842 -21195 2002
6535 2002 8469 -25306 -14921 -26184 -21233 -7373 -8821 -2503 -4219 11411 10996 -4728 -1016 12519
6521 12519 28304 -1049 -16205 -16272 726 461 9193 12683 19260 -9353 -7897 -14978 -16189 -1058
6507 -1058 11726 25467 7148 16577 16053 3762 -12601 -42428 -49226 -47465 -41389 -15024 -12695
6494 -12695 -41187 -62196 -69800 -58861 -42719 -41747 -25386 3790 26896 25683 18048 -8118 612
6481 612 4256 -10001 -13002 -18294 -4551 257 5035 25700 34708 51933 33533 -2966 1880 20653
6467 20653 26411 40071 41305 42802 31116 1093 12940 11279 24560 38724 24658 -5911 -8506
6454 -8506 30706 33087 16335 22781 22304 4432 5421 -10489 -8651 -5840 23036 34730 14580 2568
6440 2568 -9610 -14950 -17280 -22764 -39249 -34743 -16255 -4070 11209 350 10727 12342 16102
6427 16102 23817 16707 10060 4871 -5514 -1083 5288 -3057 -14796 17318 30746 23432 18957 51385
6413 51385 58992 35130 19525 9928 -13243 -18301 -7678 -4607 22312 20256 12223 22572 31320
6400 31320 28495 12554 10572 -27479 -34664 -22902 -28350 -54538 -74043 -62998 -14969 -7068 14725
6387 14725 38690 41646 29404 -5876 -13486 -6902 -24391 -32245 -37815 -51364 -48926 -48696 -31446
6374 -31446 13670 52551 57069 35137 10821 -795 12139 10867 7390 -7822 -35725 -60211
6362 -60211 -59117 -31241 -33586 -19590 -9218 -43346 -24187 -5100 5685 9047 37380 35891 63134
6349 63134 40862 16450 -8099 -10911 5620 20188 -4250 -12524 -16306 -26172 -64510 -48070 2924
6336 2924 13334 -9467 -11314 -24751 -63096 -59648 -36268 -9614 -13390 -29945 -40852 -43101 -41294
6323 -41294 -25386 -7491 -14267 -8986 -15052 -25428 -818 6642 18540 16947 -11495 -40868 -51482
6310 -51482 -60741 -37200 -40056 -30441 -20134 -22443 -23785 -22670 -13072 4344 -24342 -31236 -37408 -21140
6296 -21140 -8996 -16920 -28932 -31877 -33125 -50325 -51273 -19612 15990 5348 -17372 -28300 -29126
6283 -29126 -7634 17388 5281 -7162 -1994 -21496 -35041 -37447 -20941 7937 27938 22988
6271 22988 11704 -4557 -21085 -40265 -52808 -63752 -71220 -43056 -8633 -22563 -37088 -25983
6259 -25983 -6807 -1588 -12949 -36355 -50455 -31634 -5313 846 -10466 10657 37567 37521 32182
6246 32182 19678 861 -10299 -3523 -1317 13838 53068 39902 19767 -17840 -38602 -48154
6234 -48154 -40748 -16556 11072 22320 -15484 -35783 -37201 -20083 -21328 -35583 -31863 1082 -3311
6221 -3311 -17589 -21487 -43156 -52695 -50730 -33600 -16427 -39254 -28199 -16999 -14025 -1195 -2518
6208 -2518 -19256 3442 -3009 -25766 -4861 4572 28086 26930 20105 -10631 -43206 -23853 -3045
6195 -3045 6350 13035 21893 18526 37232 54955 45588 25684 29323 18730 -4807 18229 -7493
6182 -7493 -41720 -36589 -21665 -8987 -12535 9533 16511 -13375 -14717 -33038 -45681 -67588 -67457
6169 -67457 -48523 -48317 -32081 -14631 949 -3426 -22496 -21721 -44806 -63622 -104798 -82604 -48904
6156 -48904 -12784 6692 -21246 -20343 227 27499 35326 10081 -5281 -9437 -13488 -28686 -23206
6143 -23206 -25473 -9169 1515 19712 13113 -19730 -23520 -19523 -8577 24300 49230 20438 18974
6130 18974 49967 48566 38298 7183 -13772 -21214 -12864 19265 19066 7617 -11738 -29336 -24393
6117 -24393 -15719 5507 46116 52466 21104 -2367 -9919 -5048 -8425 -2000 -19547 -17890 -24082
6104 -24082 -62236 -49370 -28206 6777 11765 -13254 -30117 5861 24151 40561 67312 86371
6092 86371 67217 14044 -35992 -42412 -20697 -14317 28924 33298 4663 -26167 -31220 -17701 -18713
6079 -18713 12007 23778 26316 21992 16123 -5519 -7215 -7123 -33291 -66083 -45699 -16052 -41936
6066 -41936 -35584 297 2640 -6037 -11228 -25754 -46312 -47166 -19842 -1038 -9402 -13255 -37004
6053 -37004 -8521 12645 -5248 -4397 9507 4179 -171 19882 -2909 -32806 -38479 -4625 30377
6040 30377 32724 6511 -52883 -74299 -54750 -45591 -51018 -59959 -35448 2865 5901 25054 18203
6027 18203 -19386 -39683 -31869 -22004 7128 31905 23954 -4900 -22345 -10501 2748 13467
6015 13467 -1355 -15515 -2730 -2801 -25692 -31494 -52602 -89179 -87099 -68028 -48652 -719 2335
6002 2335 6961 -8505 -27292 -10307 95 14730 2839 11501 18442 15221 -11829 -10457 11094
5989 11094 17891 18026 18704 13344 1595 2780 -15507 3038 31744 7893 13933 36525 29758 2777
5975 2777 -13047 -31073 -46404 -50333 -7239 41716 29237 -21 -25011 -7900 12690 -6603
5963 -6603 -33444 -53159 -40925 -17451 1205 16383 22999 1364 -729 14242 19501 3780 -32959
5950 -32959 -33675 17946 20218 16020 2349 3795 20165 59227 49894 13041 443 14636 27559
5937 27559 22481 3947 -6775 -29190 -35528 -8236 -13088 -12177 29592 31001 935 -14747 -12154
5924 -12154 5411 9722 1325 19844 51135 40624 20181 25679 20234 -8964 -33985 -19079 -16412
5911 -16412 -15915 -44110 -28942 -28361 -23838 -23231 2441 -2952 -4703 3259 16426 -1913 -34053 -37624
5897 -37624 -6999 19615 47675 14194 -23426 -13809 -3382 -4970 -12427 2579 -23907 -25930 -1447
5884 -1447 -28653 -44074 -23653 -1815 -16714 -17479 -30012 -39763 -42385 -32493 -43590 -32174 -9935
5871 -9935 21321 44939 33350 21667 39655 44088 22426 19611 1071 -16416 -32504 -9089
5859 -9089 -7625 -28162 -41645 -21531 -12276 -38833 -56264 -45162 -13551 17611 19683 7808 24198
5846 24198 16242 18157 8470 9398 11175 31455 35766 17976 4904 6134 20043 -3176 -14125
5833 -14125 -16242 -26384 -15100 -6965 -9615 -6967 -13622 -20619 -18007 2315 -15 -20720 -32635
5820 -32635 -26067 -9273 -24261 -43342 -29075 -47619 -62806 -35497 -9025 -23504 -13603 -16244
5808 -16244 -14513 -5781 -19280 -38322 -43037 -38783 -61554 -72191 -36062 -8525 -16527 -101 5054
5795 5054 4902 5126 -5565 17070 47369 37254 17823 14753 2580 -15883 -34306 -42759 -61741
5782 -61741 -43923 -19579 -16789 -16502 -9321 -747 -15784 -30816 -22238 -11908 5237 2174 2098 863
5768 863 4984 4045 10415 7235 20442 21651 13998 17076 1156 -17548 -11532 14041 16496 -14848
5754 -14848 -35563 -9323 41183 23430 -31759 -44620 -21122 -13810 -16978 -29467 -25678 1495
5742 1495 30082 11044 103 -528 -21502 -17616 -1554 13147 6403 3517 14337 13088 -24375
5729 -24375 -15405 -18594 -19295 17785 28260 10471 -2458 -15804 -9252 -27188 -21590 -14662 -20237
5716 -20237 -42906 -20624 -13188 -9326 -885 -36078 -60496 -19687 2164 7537 18370 22336 9891
5703 9891 1665 -1277 -12703 -22127 -30421 -32317 -32702 -45552 -43099 -26703 -25181 -7265 -17444 3114
5689 3114 -12322 -2934 -19890 -38592 -49789 -10052 19693 51537 46638 18923 7141 3612 11996
5676 11996 6661 22645 15592 10119 -183 13779 5494 -17288 -17608 -27363 -35109 -67688 -56922
5663 -56922 -42895 -29788 -4464 -14569 -29932 -33334 -4906 23281 29629 5111 -2130 9935
5651 9935 -13074 -14272 -9277 -11041 -31515 -41100 -45701 -53339 -47472 -51609 -45799 -22469 4134 13477
5637 13477 12020 -306 21819 8959 -7151 7754 4962 20565 23092 23586 27614 29113 23853
5624 23853 16987 44804 29776 6927 -4806 -30388 -1733 27818 18604 10823 6401 1516 1828
5611 1828 12251 23155 22652 26019 29603 43197 36377 29469 9005 -5450 11673 -1443 10361
5598 10361 20498 14241 1378 5623 14790 7093 6803 6784 25872 44683 10804 -7535 -14179 404
5584 404 3684 -18037 -24626 -11616 -26644 -43243 -50411 -58161 -28923 -11003 3910 12569 2265
5571 2265 -1314 -8984 -45094 -50699 -22433 -6805 8781 2174 -14374 15585 -2414 -17597 -10487
5558 -10487 -20903 -44839 -32559 1971 1268 -34131 -18185 -27877 -25319 31477 32914 29627 2370
5545 2370 -37031 -7421 21132 24166 279 -25783 -63306 -55256 -41211 -28709 -36634 -52915 -28231
5532 -28231 -4512 6356 8 -10132 12705 14551 9402 40665 40369 30461 36759 19220 27054
5519 27054 29936 3643 -5506 16444 47058 23355 -18632 -45743 -45688 -37755 -4762 5457 -9499
5506 -9499 -11021 -15709 -23686 -27311 -11637 -5180 -23136 16779 33294 7413 7679 9453 -3116 -21722
5492 -21722 -44931 -67204 -67584 -53332 -28036 -37050 -49909 -40046 -23903 -42951 -35732 -34499 -47487
5479 -47487 -46007 -38203 -33935 -26830 -32507 -12052 -18578 -30659 -8117 24991 21360 7683 -13712
5466 -13712 -27399 3498 42312 29190 36261 49304 30371 11485 5450 19095 24913 1797
5454 1797 -10095 7511 -20397 -20611 350 17606 17219 5705 -19394 379 16889 -6123 -6868
5441 -6868 1196 2957 14687 10696 17646 1452 -13847 -11347 -14198 -23038 -38185 -43420 -35151 -31467
5427 -31467 -34672 -37312 -49384 -52404 -35241 -5237 -15221 -11446 16249 5538 -13128 2738 15878
5414 15878 11753 4995 -33369 -48677 -34081 -28810 -22731 -23280 402 -1798 -12816 -20873 -38675
5401 -38675 -46170 -38050 -31592 -20042 -37506 -39545 -24202 -19278 -26905 -43975 -55103 -65602 -61625
5388 -61625 -49945 -27365 -5030 12146 12495 -12085 -39007 -24123 9893 14119 14499 39216 42668
5375 42668 55488 73468 19368 -4226 -16233 -25338 -23370 -5398 8078 -1250 -4225 -16333 -15517
5362 -15517 -1576 -11938 -15850 -29719 -27514 -29087 -35152 6158 23682 40859 21803 -17918 -39598
5349 -39598 -2617 5250 -31804 -18504 -79 5520 -7690 -18023 -8506 -20224 9117 -12267
5337 -12267 -49738 -38420 -18816 -2950 19211 10435 -5094 -862 -15460 -25012 -1990 700 6755
5324 6755 12593 -6438 -10879 -22551 -9082 -404 -10920 -17160 -23207 -28914 -13757 -2217 -6341
5311 -6341 2222 -7755 -19629 -32304 -20144 -38319 -42188 -18117 -15112 -10375 -4143 823 11073
5298 11073 16727 8888 -19964 -38764 -36219 -45236 -37424 -35182 -16812 14939 9613 -15684 -19373
5285 -19373 -8889 657 17050 8200 6763 -2244 -1750 -6394 -14349 -12036 -4500 -2953 19009 -5951
5271 -5951 -43856 -42478 -28687 -3224 19067 13246 467 -6574 -14112 -30331 -27476 -21132 -19993
5258 -19993 -5545 -136 -4522 -22096 -34254 -23813 -30163 -24934 -18694 -11746 -21260 -10583 -4193
5245 -4193 -20868 -38722 -50467 -63415 -70101 -37452 -31042 -45233 -44495 -14928 -21328 -36594 -25131
5232 -25131 -5218 -10717 -25141 -16765 -10524 -335 -34539 -46649 -34301 -16524 -7975 19984 6357
5219 6357 -17097 -19404 8344 1441 -22565 16307 17944 43 -19811 -25476 -21764 -9128 5116
5206 5116 207 -2049 -18807 -26710 -6124 11214 8420 11909 7284 -10482 -23024 -16222 -13091 -31209
5192 -31209 -31914 -16490 -19201 -25620 -31721 -3643 -4348 -11299 -10741 6712 584 11333 26174 34287
5178 34287 9669 -9875 -41532 -21101 6089 11768 11804 -14803 -32516 -47715 -36373 -7910 525
5165 525 2380 15213 41136 67639 82167 59129 41854 24104 39847 33719 -1555 -7994 -9719
5152 -9719 -23344 4358 23351 11633 6545 20730 39019 24254 20384 -759 -3253 10059 7080
5139 7080 10505 -2906 -24701 -29877 -37564 -21252 -21751 -31914 -25651 -20139 -27915 -37631 -24181 -26718
5125 -26718 -46913 -51031 -35338 -25632 -9625 12107 7951 6875 -9455 -14553 -28288 5325 11773
5112 11773 -443 -11900 -11114 -8206 -19293 -19586 11591 24822 19194 8342 -6610 3937 11625
5099 11625 -7478 -35415 -33194 -48877 -48661 -33057 -21856 -17767 -7973 -10946 -3481 -9772 3474
5086 3474 25633 39022 35446 15771 -7236 -22428 -17405 1174 -8644 17682 32165 14367 15394
5073 15394 26120 36232 49500 37152 21579 25262 29912 21912 -7444 16378 49839 53129 30220
5060 30220 142 15444 32548 3030 -28182 -28619 -19107 -9500 4982 31625 28066 23141 35252
5047 35252 42412 27795 24770 51761 62009 32568 -1737 -9497 -19912 -21704 -7703 8987 9278
5034 9278 1120 25028 34161 5135 13019 20968 24943 40993 30892 15911 498 -21811 -37944
5021 -37944 -34049 -2835 9404 -3950 -4675 -19095 -27764 -23449 -15459 -5799 19534 14422 -18658
5008 -18658 -12720 4941 9597 13122 6727 -16558 -35002 -36679 -23597 -63475 -59397 -16534 -24012
4995 -24012 -27204 -38105 -51199 -32145 -32592 -27479 -22359 588 -120 12915 -238 3612 13290 -2107
4981 -2107 -46839 -73290 -61624 -51491 -41292 -39364 -9374 35 -16557 -17914 -24512 -4813 -44010
4968 -44010 -44299 -41245 -21568 -1252 17871 -1797 -2370 -15577 -26451 -22055 -35540 -35889 -40582 -40540
4954 -40540 -37737 -27966 -29302 -14436 -27994 -47818 -56969 -28202 -18653 -22791 -22583 -13268 23585 43782
4940 43782 20453 -2027 -8741 -17240 -43911 -63313 -78549 -91949 -70672 -78560 -57658 -65730 -68340
4927 -68340 -40381 -21097 7341 -1794 2024 26845 47004 18369 6784 2542 -12309 3153
4915 3153 -2895 -6644 20038 30262 44753 39207 -12594 -14303 -6930 -9138 9591 149 -20919
4902 -20919 594 9430 -10030 -24616 -46522 -35219 -22794 -21355 -13978 19053 28953 3860 231
4889 231 206 15979 16008 8333 13884 10472 2017 -19292 -20887 3529 14277 6008 -6911 -3810 2269
4874 2269 -7221 -7271 -10176 -9249 25589 -306 -16707 8634 31095 14586 -10613 -22722 -25225 -25541
4860 -25541 -13607 7758 3501 -6085 -4407 15379 14230 1634 -13185 -16961 -4318 -9065 -41776
4847 -41776 -44144 -39012 -27521 -40134 -44852 -19033 -7834 -29554 -55714 -43526 -25234 691
4835 691 19584 18219 11448 17092 16585 -193 13739 7840 4193 19350 32315 36998 29637 9975
4821 9975 -11175 -28737 -17199 -13577 -19320 -15064 9433 -510 -7304 -6467 -30027 -14832 14554
4808 14554 16891 22310 24937 1788 -27015 -29781 -29367 -12046 -849 -20980 -40324 -27165 -3843
4795 -3843 14070 28842 6920 -29720 -39183 -56879 -33623 -975 6945 -9534 -40400 -67632
4783 -67632 -77581 -70254 -32266 8568 43292 39915 15930 21738 -3775 394 25395 26062 8255
4770 8255 -5115 -6197 -14381 -23589 -16133 -1932 17406 42439 37133 8998 23111 40015 20253
4757 20253 -10177 -27438 -18270 -5739 -627 11603 -14529 -10869 2518 -1981 -13052 15261 30438
4744 30438 14922 -9453 -18771 -5180 15760 345 -15179 -31828 -25353 -23372 -655 -1687 -10502
4731 -10502 -37801 -41870 -5690 21300 27057 17674 21366 10148 10832 -11640 -48318 -48345 -27940 -1910
4717 -1910 -13134 -15068 -2758 -4644 770 -6975 -2875 988 -3615 -13597 -37357 -24122 -5789 36176
4703 36176 40413 26494 14905 4427 276 -6614 -16985 -31582 -25091 -26309 -20173 -5075 -7993
4690 -7993 -14573 -30021 -34588 -38348 -27787 -47648 -35160 -24202 -46603 -44087 -41695 -58394 -59090
4677 -59090 -32451 -14084 -1946 3839 -11630 -13818 -21957 -12351 6882 37558 45951 16179 -2576
4664 -2576 -1312 8523 7493 15606 1517 14215 -12285 -34737 -25243 -20828 2055 19558 50470
4651 50470 68625 54443 54413 38264 22507 20802 16888 5681 8952 -3446 -22408 -35473 8
4638 8 -684 -2090 22103 -3251 -2299 -6885 4704 37424 28411 -9591 -15333 8051 -13025 5807
4624 5807 -151 -20115 -7822 -564 834 -9121 4013 21263 15106 21841 15543 -988 5295 2651
4610 2651 8049 20191 3394 -22183 -1944 19553 14628 -8247 -33390 -43449 -43741 -33785 -22134
4597 -22134 -9034 21220 15921 -14870 -6237 -622 -11139 -20424 -12369 20401 25822 8906 12289
4584 12289 16588 17035 20231 -7989 -25772 -41644 -44873 14017 52453 59487 43144 35934 32025
4571 32025 386 -10213 13933 15017 11978 26125 24943 27535 18963 7760 3153 -9586 -33393
4558 -33393 -34952 -35673 -26564 -19420 -15429 -16749 1678 -10840 -12479 -4625 7934 24284 18270 -31167
4544 -31167 -67973 -47726 -18762 3667 5967 19425 7458 617 -3274 8443 17629 8322 2568
4531 2568 -10710 -15712 -3897 2576 -3103 7054 11773 -1998 -17541 -32296 -33365 -10350 -14349
4518 -14349 -28664 -20330 6308 -1215 -2894 10023 7131 -12055 -3458 21723 28748 39208 57070
4505 57070 61952 59172 38179 -2638 -37823 -23862 -11676 5267 15659 12682 -7658 1665 9395
4492 9395 -16437 13473 42932 37232 23751 9046 -3311 12643 14703 9520 10349 14658 -2177
4479 -2177 -16821 -11623 -37262 -51987 -40323 -39964 -59990 -59698 -30892 -9001 -27294 -27408 -32441 -5357
4465 -5357 30493 37313 26328 10777 -6312 -7365 29898 38516 46554 35422 29802 37759 26441
4452 26441 -1687 -5327 2785 -24989 -39066 -40466 -10336 34976 24671 208 -14675 -32223
4440 -32223 -24406 -43464 -44679 -41577 -24347 -70 1827 16099 40208 14511 32361 6794 11085
4427 11085 54728 61620 51253 13977 -17740 20546 52020 51306 24069 4631 11145 24268 18653
4414 18653 33078 48592 30832 25271 27738 28788 19252 4781 -10497 3587 -20728 -39783 -48412
4401 -48412 -41446 -25228 -26162 -38092 -62334 -66742 -77028 -64972 -12880 -6537 -20927 -5659 -38594
4388 -38594 -69570 -79063 -48378 -661 19837 134 10429 41188 44626 31268 30559 29375 6049
4375 6049 4172 2630 15232 4336 330 -20405 -41795 -28725 -14525 -2478 -17961 -5494 10942
4362 10942 21786 11615 17022 14162 -12144 -32445 3792 19186 7158 -14808 -29166 -12874
4350 -12874 38178 69609 46504 -1081 -21175 -15149 -13619 19074 18893 15614 -8609 -16152 -21438
4337 -21438 -29140 -26498 8612 31634 42875 24858 514 1393 -8601 -20585 -27296 -25038 -30171
4324 -30171 -21356 -16577 -17503 -18502 -19683 -27293 -15283 3179 -5164 -12554 18050 22627 30694 -6162
4310 -6162 -41221 -43605 -32831 -22488 -9318 6614 -1040 -11250 2009 7907 -3704 648 15639
4297 15639 16658 -9154 -7750 2204 -14717 -11317 22281 36596 22585 11067 13511 35429 23988
4284 23988 2132 7064 11930 18546 8328 -22513 -16432 13967 22450 27511 36791 36483 9365 -4183
4270 -4183 -37809 -48853 -15627 5909 763 1457 19347 27010 35871 36406 62787 38084 36955 17954
4256 17954 21666 19942 30091 6771 -12644 -2745 19623 27799 23289 31681 28324 11298 16206
4243 16206 3071 -19431 -34055 -36207 -35741 -36455 -21719 -9257 1716 -9092 -16692 -57016 -78429
4230 -78429 -44511 -30610 -33408 -6565 3909 32536 34624 -4539 -29301 -18993 16101 20548
4218 20548 -1592 -13453 -39354 -60822 -60173 -26139 -847 18608 29788 35335 27082 11864 35071
4205 35071 9455 -895 -2907 14564 12315 11594 7603 28660 20665 -6406 -5229 14872 -1240
4192 -1240 -40669 -29025 -25194 -29737 -23625 -41374 -57359 -59611 -52481 -38736 -16596 10681 12263
4179 12263 -1959 -29747 -23424 20170 47491 53590 28211 19495 24416 -341 367 55083 50298
4166 50298 28851 28092 18453 8522 -470 -17312 -13635 -23930 -9538 16892 34832 49476 36427
4153 36427 13332 40365 23813 6335 -12759 -21279 -3330 -987 11930 38016 54857 40131
4141 40131 21445 12161 13078 9634 -7569 -20809 -1592 22392 21541 21236 30559 22730 11874 2503
4127 2503 34077 44333 31653 36081 29836 -2972 -20229 8289 12906 -9002 -35207 -21207 6177
4114 6177 11100 586 -7548 4917 4013 7272 18944 33716 50894 60583 41029 39377 34473 24827
4100 24827 2352 -3318 -2884 8826 8191 23417 26980 15232 6948 16095 30673 36669 14002 13512
4086 13512 13830 13739 24760 11531 1265 -10428 -35535 -9458 11399 17654 41470 34287 3057
4073 3057 15885 19757 -12974 -33074 -23674 -10916 -29965 -26150 -10929 -4289 -4265 -14496 961
4060 961 15947 17676 13060 7983 4959 18101 10672 26820 57079 47331 42570 23201 19882 20157
4046 20157 20407 9905 25789 16361 17209 22121 17503 9716 -7034 -9963 -36318 -14197 2812 21971
4032 21971 27963 40465 27441 20113 28857 19108 25187 9581 -4702 2698 1623 -4960 -12000 -2589
4018 -2589 -14734 -11992 -43760 -42156 -42622 -18680 7153 8613 -2027 9642 -5424 -9606 -21770
4005 -21770 -28548 -57576 -52470 -33238 -22925 -20243 -14015 11166 16865 30263 18859 3224 17242
3992 17242 2176 -8535 4541 -3654 10236 -868 -17551 -6482 2641 -25677 -43717 -52964
3980 -52964 -49786 -44873 -57603 -32481 -2682 2150 -3982 -25896 1516 2983 23664 21249 -6822
3967 -6822 -31516 -20252 -1510 1404 -2256 -19161 -6319 -3485 5327 -22078 -49969 -28751 -14582
3954 -14582 -22614 -27232 -11678 20489 46446 26077 10189 7691 -10641 -6480 -1325 19768 12941
3941 12941 11857 -17636 -23956 3788 17942 15184 2369 6492 -1114 -14394 -20547 -38603 -62241
3928 -62241 -77024 -52445 -13182 -14228 -26490 -18334 7598 10665 31402 79578 94431 53028
3916 53028 12914 26843 29720 16236 14188 -6314 -16818 -13991 -6189 -9455 -16358 -1557 25095
3903 25095 15112 16502 20565 47789 54016 13035 -14387 10130 18881 18472 45685 32870 -2030
3890 -2030 7071 27129 44124 61370 44031 7496 -1934 -26781 -28143 -15551 -26315 -27423 -5109
3877 -5109 9543 -111 26866 43522 41728 62737 54084 32206 19654 -13341 -28555 -7285 -7349
3864 -7349 8389 -14570 -7506 22577 38074 15131 -9630 -6107 -7712 -5133 -8413 872 -18984
3851 -18984 -28233 9369 8486 -6727 -17487 -15506 -9985 -4095 -26310 3027 14334 155 -4000
3838 -4000 -22247 9474 20833 -3582 -13338 -24701 -2383 -11238 -10303 20679 33666 1185 10755
3825 10755 15782 -12469 -39616 -51346 -45103 -28337 -20810 -14288 9819 11433 -8595 -19841 -19668
3812 -19668 7960 13144 27671 26746 17576 13887 8154 -2 5895 28270 46949 27113 9543
3799 9543 1632 -13364 1085 -2692 -15457 -308 23997 8404 -691 17157 12829 -5373 17073
3786 17073 33730 45177 20377 3411 -16579 -21773 -7055 4464 42517 50271 37875 23725
3774 23725 42911 49335 43989 49101 15954 -22790 2618 -1342 10598 7276 2659 2464 20625
3761 20625 6886 -16561 -18432 -16728 2692 7736 36319 45864 35548 25183 15686 13017 17543
3748 17543 18201 36407 39462 28316 -1594 -12225 -31742 -29158 -24462 -13875 -17770 -2777 10225
3735 10225 4847 -494 14313 -3560 4055 26547 19595 22319 212 -17303 6759 28726 21978
3722 21978 23554 14615 12708 5399 -11540 -53165 -73814 -50363 -27872 -15528 -11967 -18310 -4004
3709 -4004 -18593 -28155 -17131 -26503 -12850 18551 7123 -6588 -13988 18475 27667 27075 18104
3696 18104 -28724 -47809 -42322 -11512 13233 -349 6173 7933 -4055 -8650 -12100 -20690 8706
3683 8706 14227 29046 19903 -3122 -12015 -13687 -21762 -30645 -14939 307 -685 -35108 -49576 -33562
3669 -33562 -13064 -18557 2450 5484 11563 -2242 -8423 -11514 -7316 7943 -6265 -14296 -27107
3656 -27107 -2397 1397 1339 1893 -18710 -31664 503 44318 43817 19250 11676 13253 10583 26279
3642 26279 26597 15192 15691 5926 13683 28497 3780 -9500 -33488 -31035 2864 -3171 -24347
3629 -24347 -20525 -28406 -21136 -3630 -33130 -40404 -12085 -2396 13456 30943 28544 30917 18649
3616 18649 14216 15797 23908 3687 -17749 -24352 -25993 -27117 -33781 -23959 -4500 23265 14790 -6234
3602 -6234 -1747 -8858 4743 23294 27276 25849 9918 2645 5753 -11701 -13885 18517 11757 -16990
3588 -16990 -20598 -27536 -24767 -7360 10805 12713 -9841 -2651 2241 11464 48095 41961 31995 30403
3574 30403 70634 59649 43795 21962 8579 -4532 4356 814 665 4401 -17946 -53232 -52345
3561 -52345 -51135 -47254 -60729 -52699 -21391 5096 12493 19247 36324 53259 47887 13350 -5914
3548 -5914 -5741 -18053 -5376 -1978 -7329 -15250 -19815 -5513 -7099 -20262 10252 30037 46412
3535 46412 35663 22683 36960 40251 4854 -15921 -27098 13560 51749 48938 48193 53167 54703
3522 54703 35367 18489 14007 34674 35074 50637 21930 -16749 -24734 -12451 -22809 -10663 -26195
3509 -26195 -36454 -19823 -32051 -19962 5936 5761 4001 25308 9115 20582 23545 21108 27149
3496 27149 9049 -9585 -3050 26318 13074 37112 66735 59214 23467 27116 15246 22397 18896
3483 18896 11884 -1711 6464 24888 18036 6949 18693 22875 2701 -15077 -24568 -29624 -17055
3470 -17055 -22095 -45797 -36969 -14564 32762 51933 32546 12996 16836 20056 26224 14674 15991
3457 15991 25476 30330 16594 27472 30311 32472 17284 3898 14812 256 -1262 -10691 -24565
3444 -24565 -16270 -34230 -33582 3206 33726 30823 4229 -3735 12542 -2003 -2184 7118 28301
3431 28301 33474 21756 21945 -242 13391 26580 9180 -12969 -21766 -15567 -5842 -8187 -20434
3418 -20434 -29525 -42020 -16044 9533 -3418 -1831 -17228 -15226 3388 -9211 -26603 -12443
3406 -12443 13808 31922 29510 3714 29409 9622 -13603 -27564 -50253 -39679 3925 21695
3394 21695 5106 4125 8260 14476 8575 3419 -1557 6265 8870 20261 25058 14987 10501 -5997
3380 -5997 -21638 -14999 -7037 -100 -3520 6133 10608 -12512 1499 8072 8352 513 30385 49857
3366 49857 27287 -2810 3705 7584 -27339 -42633 -36809 -12549 3631 -27677 -41633 -20922
3354 -20922 12499 26250 -5932 -20001 -27561 -46957 -10226 -7275 -22525 -27725 -17019 -8712 -3945
3341 -3945 -15567 -38191 -12800 -21936 -14159 -9722 -7289 -4772 23634 42867 21187 33333 38269
3328 38269 26355 13538 -14812 -12109 4158 -8858 1971 33344 25957 10205 18158 32311
3316 32311 18173 7297 -4350 4544 4292 9398 18083 -11183 -21849 -16604 -29686 -21353 -30517
3303 -30517 -47055 -17245 8456 8674 4913 8242 5070 -15207 15199 30776 10881 -13434 -3132
3290 -3132 -22542 -25562 -14090 -46764 -40203 -6961 -4791 15978 35995 25359 18100 24730 50868
3277 50868 52528 54168 62290 57715 64470 25708 25985 33136 36654 44300 64885 54260 41547 27167
3263 27167 10638 22805 9020 -15879 6988 17122 24607 37975 53223 29148 5631 9568
3251 9568 22288 25758 14563 16276 44619 36715 12062 -2382 10562 -1913 -12756 -22809 -52223
3238 -52223 -62496 -44608 -4605 25499 41476 30287 28658 21179 14778 -6817 -110 10924 -8659
3225 -8659 -4063 -15812 -35714 -14316 -834 -4151 -27435 -19542 142 -12869 -10977 6356 21280
3212 21280 3336 1799 28298 51483 41478 10825 3095 868 7394 8965 -11964 -11202 -16614
3199 -16614 -22312 -37352 -20698 -10384 -13986 -16563 5567 25136 27049 32980 18727 13146 2268
3186 2268 2635 16259 10300 6396 -14022 26556 51424 28208 28751 36244 18461 5973 -1129 16323
3172 16323 19075 7005 -369 3502 -159 1306 -22115 -33663 -24331 -16466 -417 8642 4938 -18418
3158 -18418 -24152 -5346 -17349 -31623 -34256 -51915 -42464 -28155 -5873 -4443 -10946 -6354 -10612
3145 -10612 -3779 16185 6155 8049 -2139 -4798 -15320 -14043 28127 34678 30696 20787 29568
3132 29568 16312 18798 -17881 -41833 -39978 -47180 -38364 -26448 2576 21030 -19259 -15893 -5605
3119 -5605 7594 2460 -8870 6214 20087 -1625 3495 15054 18097 42753 47863 41783 24280
3106 24280 31307 43711 22240 1481 -10819 -6566 4357 43416 62946 58544 43951 16754
3094 16754 -10117 5266 5061 -11918 -36215 -32969 -11315 17140 24005 17274 -3674 6048 18936
3081 18936 20580 19824 17940 -1634 -2521 1914 -20664 -40471 -13655 1852 11880 13803 4435 -5552
3067 -5552 -3765 -9524 -1553 9007 14200 18230 15615 -9697 -30721 -26006 -22343 -33202 -17391 -16603
3053 -16603 -13184 -27933 -40306 -10484 -7131 4522 4568 9289 5057 -1192 -7747 -19684 -20240 15648
3039 15648 32716 18194 29762 41529 38406 5287 -9023 15294 21887 9322 -9416 -727
3027 -727 25021 39403 49329 67009 53707 25128 15996 26380 21813 10777 28629 44817 54577
3014 54577 11330 -19352 -31242 -45831 -15441 -9387 -1917 -15205 -11590 14669 4295 -17721
3002 -17721 -12477 14232 34583 28883 23689 28918 4093 -9449 -2820 32064 25407 28117 31085
2989 31085 14320 -5130 -8126 6020 17205 8345 3234 7349 1752 13121 5559 -6947 -20055
2976 -20055 -34220 -25945 -46988 -56703 -34985 12513 37905 37704 44654 27831 18827 2147 -8968
2963 -8968 -368 3006 11494 12159 3968 15887 7694 -30406 -35638 -46109 -59677 -32719 -17427 8920
2949 8920 17227 27783 22426 21631 12491 -26070 -61111 -72658 -47915 -29250 -22220 -38260 -27716
2936 -27716 -18680 -22482 -29157 -32368 -3501 8447 -6013 -18003 -21439 -21855 -15329 14864 14297 5738
2922 5738 21306 31629 48958 39951 26075 12849 13568 12169 7207 -3720 2412 40881 34045
2909 34045 29338 -1479 -12636 -8523 23963 14096 33490 36118 598 -10967 7161 8906 10888
2896 10888 6777 294 -19364 -31351 -13815 -656 5171 22037 4201 -1293 21111 9869 -12443
2883 -12443 -22653 -37771 -24307 -24790 -13856 -2905 -19421 -22869 -6730 13854 27676 28629 34445
2870 34445 50182 45214 22901 15484 25869 1416 10727 6783 8 -23034 -10153 775 -13287
2857 -13287 -22437 -26024 13356 55668 47862 22456 5668 -10370 -16835 -4977 -18544 1977 30840
2844 30840 39721 29207 42871 58473 16518 3967 1177 5113 658 1929 2410 14596 2101
2831 2101 12741 5304 2468 -499 -4345 -10306 -3962 3069 22741 17800 -16904 -21589 1400 2027
2817 2027 -2030 -11748 -4910 39 -10457 -36462 -42570 -21799 -20199 -13257 -14753 -5623 -8426 11275
2803 11275 2560 -4196 20673 19146 143 -11497 -16445 -24278 -30391 -15089 14802 14891 -13379 -15669
2789 -15669 -5940 12079 4467 -7827 -22952 10763 55686 54333 29425 2759 -5961 -12787 -6125
2776 -6125 16719 24910 35890 31957 21070 12828 -2342 -29656 -4383 16180 19029 17379 2813
2763 2813 -17450 -12072 -8444 -29281 -43961 -30046 3453 -33240 -86312 -60740 -36384 -20921
2751 -20921 6516 -14295 -5888 14950 33717 8289 -16557 -7819 31065 36413 39555 38889 26762
2738 26762 2873 -14263 -7083 10020 -5517 -30728 -44159 -33667 -25781 -10953 -12159 -24160
2726 -24160 -30483 -23389 1225 7150 3992 8374 20911 17103 16754 -18915 -12562 -23179 -11943 -13214
2712 -13214 -8236 -11298 11620 297 -27349 -50627 -42899 -19649 3340 42106 44163 13008 -7134
2699 -7134 12391 30436 36292 32029 4625 -5814 40345 66119 64480 62310 59240 44221 31458
2686 31458 16952 34247 59205 77734 25687 6251 -11041 5035 33803 17945 4812 18785
2674 18785 12226 -6615 -18517 -18669 -45914 -65737 -52948 -18988 3920 -438 -27424 -52884 -41939
2661 -41939 -2752 15568 -2464 -4114 19791 29919 15817 17148 39197 22954 -9570 -8700 -3560
2648 -3560 -8715 12679 14309 16691 -21639 -6076 21665 2253 -30555 -14893 -12399 -32197 -40024
2635 -40024 -23314 -45196 -57856 -34552 -44239 -35854 -8571 19969 21732 7168 -25464 -38571
2623 -38571 -25199 -14421 2766 2123 -24219 -17217 14086 6295 -15495 -36261 -42040 -26436 -38621
2610 -38621 -48347 -56932 -33148 -40800 -42979 -25221 -17462 9184 9230 -15748 -12974 1651 7663 27091
2596 27091 25861 19446 22753 24790 24793 22987 16004 9883 15639 21132 33466 -4116 -22290 -14603 10986
2581 10986 39677 23520 16522 23645 10492 -6914 -18923 -22876 -15670 -23878 -13523 -6909 -16815
2568 -16815 -11145 4915 14349 29270 26739 9099 43604 33719 -2913 -3866 9565 22622 16800
2555 16800 -21052 -6697 25813 27470 19963 -9015 -7168 -3359 -40779 -42025 -9019 -12114 -3728
2542 -3728 2740 -18440 -23536 -4801 21126 14220 33464 35231 32224 23718 1461 7831 17541 26381
2528 26381 5301 -13265 14259 40631 34910 16148 15457 32747 53068 49721 32984 17205 26751
2515 26751 5875 -8069 -11846 -7142 9544 22359 19349 7599 10711 -7243 -17106 21223 -8826
2502 -8826 -37048 -27355 -21427 -590 31296 34467 31103 33849 34993 39408 34368 35400 27922 24760
2488 24760 16750 2663 6036 7531 -21270 -8018 11574 18894 27662 35587 9875 -11200 -38731
2475 -38731 -17277 -2068 -1704 2169 29541 30380 5809 -7438 -19674 -1730 12635 15802 20324
2462 20324 17098 15290 -3723 4313 23831 11324 -569 -20697 -26062 -33360 -29975 6191 24393
2449 24393 28337 35177 58856 50135 -5706 -35746 -31134 -8405 8105 7999 9637 12829 21679 52900
2435 52900 46096 23998 28453 34721 16795 12403 -6202 -15963 -22111 6309 8848 24832 4501
2422 4501 8936 -5894 -11184 -15257 1069 -5728 -5982 -7009 8915 22753 -3097 -9480 -28496 -37004
2408 -37004 -23293 1682 8872 -4593 -12618 -19498 -21508 -20506 -12763 -17597 -22107 -6596 -3596 3563
2394 3563 121 -10877 -6981 6391 4232 -7748 10145 5633 13996 37794 39993 50384 55603
2381 55603 42100 21292 5905 21515 46333 33458 10778 5784 -17670 8324 17436 5377
2369 5377 10377 11380 16320 4241 11294 7421 -14311 -7683 -7627 -23197 -9130 5926 3053 22665
2355 22665 35789 12365 31876 48810 32689 37085 46552 66307 74682 62697 46517 30661
2343 30661 48750 58879 65980 51363 46139 27472 -960 -4275 -5406 15746 38316 48566 46066
2330 46066 11990 -26021 -18210 7041 6368 -10767 -4236 -4795 -7361 5804 -1102 228 14983 32909
2316 32909 55082 48455 21710 27631 48993 49107 58330 34672 14301 -12493 -17582 -13425 8679
2303 8679 16258 12266 13643 12522 9005 -206 13851 7876 -14207 -13661 -5643 -5612 -19422 -19720 -94
2288 -94 12813 -1723 9271 6512 19389 13048 11529 13326 3232 -8218 -10563 -13994 -25373 -10547
2274 -10547 14395 17429 29892 50197 67028 48296 26556 25724 21238 27229 15867 -3690 -2770
2261 -2770 16103 44282 54401 64402 61945 48678 33759 7167 -23029 -29360 -3484 17828
2249 17828 9708 15219 31317 28133 12887 -39835 -57807 -31725 -12670 -10691 10164 10846 36028
2236 36028 22974 -13913 -16956 -16974 7267 19001 18378 40015 35250 34128 28842 33994 29680 29702 32677
2221 32677 26380 28774 36901 62229 83961 75909 79086 43951 13602 5957 9399 16177 18290 25159
2207 25159 13349 40841 45987 34459 43565 39851 43111 36203 16341 -8248 -31176 -43373 -22541
2194 -22541 2716 30766 47434 44725 26038 24097 29122 28582 20911 1273 -16458 -9589 -2253
2181 -2253 -15318 7492 7228 -26811 -24838 -29622 -34867 -14273 -12699 -8008 -145 32112 30019 13606
2167 13606 20261 22875 29859 30493 9113 24455 25064 29351 22461 8338 11817 13129 6986 9790
2153 9790 -7188 -1162 6418 21873 32128 40107 4570 -6082 14659 27011 50906 36856 14997
2140 14997 -17274 -16531 20348 41757 31578 39358 38486 23716 27284 27970 32690 21314 22247 23757
2126 23757 9218 15024 6076 4232 6960 -6294 -2052 2305 18442 16883 -8982 -33058 -33397 -21081
2112 -21081 -5816 -1437 22953 2576 -915 -15500 33570 40038 32867 44846 40463 25428 18919
2099 18919 -6269 3604 8570 -3198 -14458 -18938 -16560 3297 11336 17425 28440 11756 -13841
2086 -13841 -15665 4114 4000 29886 884 -45173 -58983 -43929 -50538 -29036 -18852 -16846 1796
2073 1796 20939 28835 19252 24977 14524 -18945 -18045 -14347 -1461 -1493 21277 36116 24387 -6298
2059 -6298 -19102 -36956 -25672 -13340 17351 5858 2775 17260 31247 52775 55744 54276 24700
2046 24700 14711 35485 25917 18824 -877 -46840 -47671 -51899 -41203 -20692 -122 6125 7853
2033 7853 -21551 -16758 6446 14767 5798 -612 -2137 -18129 -28222 -53730 -37258 -6611 6587
2020 6587 24401 36396 66736 72265 31176 -2195 14577 20517 14805 44683 41801 21113 22157
2007 22157 5602 -17312 -33839 -22364 -18676 -14596 -27523 -34508 -15292 10828 17003 18821 37963
1994 37963 41730 29461 28418 23632 9858 -12445 -22309 -31412 -890 10449 181 -5779 14678
1981 14678 11644 7079 -5100 17300 13759 -11722 -12666 -44009 -47543 -8753 20397 39794 51891
1968 51891 37978 24635 -5115 -1020 -5245 -20255 -23122 -7740 -28577 -16079 8447 38635
1956 38635 31394 15512 6222 -8634 4397 16842 29310 35932 34812 12612 -3664 10452 16594
1943 16594 17703 6201 3587 18058 18989 24411 12224 19646 21875 -1967 -19660 -32639 -13964
1930 -13964 -1149 5423 -8280 -29999 -8137 -23920 -4395 38060 66671 85602 50034 5066
1918 5066 -18180 -26846 -10641 -8216 -11667 -16726 -28922 -7335 -6622 -11269 -7365 -5489 1947 30507
1904 30507 29260 8027 2001 16355 -1086 -8848 3306 3931 -3675 17149 24290 23324 27169 17370
1890 17370 13270 17119 29005 40000 23087 12330 24421 6411 -15716 -10419 -18838 -16223 7475
1877 7475 23913 26708 20900 -1245 -19562 -7215 15103 30618 29646 -4368 -386 -5749 -9828
1864 -9828 3443 40351 27028 1449 14986 43845 32446 12333 -23550 -39774 -27697 -14119
1852 -14119 -22134 -5068 689 -378 -617 14395 7750 -2424 -29648 -47264 -37586 -19344 -15751
1839 -15751 -25672 -27003 -40586 -7604 -4798 9568 25832 32009 26562 10339 -1507 4106 -4459
1826 -4459 -10627 6305 21355 8013 -1199 -2880 -8662 -31820 -30611 3690 26098 32506 41415
1813 41415 30596 24223 13840 23113 9556 -1422 -14529 -26192 -25047 -19143 -14774 462 10350
1800 10350 18372 14719 5901 40232 44247 32510 9937 -12622 4785 29635 27162 3027 11188
1787 11188 20989 23105 25334 6802 -14174 -13185 2578 -1361 16556 13881 31522 18809 -5628
1774 -5628 -25390 -28295 -3009 1427 8352 2552 10019 9851 7427 15667 21735 -13988 -22966 -2532
1760 -2532 -29006 -10267 17405 9148 44 704 20523 14166 5719 50558 33532 11196 25937
1747 25937 7805 -8235 -12740 -21512 -5691 11513 1440 5859 11357 -9863 -24296 -35045 -35418
1734 -35418 -12920 -34679 -32515 -27098 -31962 -27131 -71942 -68814 -26571 -26889 -36201 -39528 -29959 -5138
1720 -5138 3481 15575 4917 -402 31836 73905 81448 54061 30744 19844 -11078 12112 27471
1707 27471 26754 5436 -10552 -18208 -8695 -8651 -16012 -12156 -29944 -16458 -24117 -56053 -57066 -34971
1693 -34971 955 -895 3392 3024 14063 10970 15862 32202 35312 1029 -2861 -3264 -124 16499
1679 16499 -5386 -30531 -29897 -10617 5138 10330 -13614 -6524 3036 -16619 -11500 6408 10072
1666 10072 -8023 -5243 9758 -22442 -39224 -24282 -35338 -42094 -7814 -16952 -42961 -26524
1654 -26524 -15247 -30292 -33896 -48566 -26654 3633 1605 -3152 3901 16441 14291 -10087 -27233
1641 -27233 -37169 -29102 -9212 994 -13834 11504 20394 -6280 -9476 17507 21482 40159 38018
1628 38018 29354 21189 28154 47677 30878 9221 4875 6743 -16292 -18496 6486 9809 -11955
1615 -11955 -25663 -18272 -33393 -30791 4420 27586 11348 16321 7353 -17897 -10301 4980 -11035
1602 -11035 -21549 -11996 -17419 -28190 -22517 -18549 -2204 11283 40418 69777 42420 43999 37616
1589 37616 10381 -10844 5532 -17917 -28337 -38755 -27713 -3391 -5041 -29873 -22133 -9196
1577 -9196 -7921 5028 7512 -22691 -44021 -47033 -15522 7272 17820 8842 11035 3399 -8156
1564 -8156 -29383 -29465 -1929 12887 -6533 -7328 -42467 -45632 -31100 -27412 -19592 -19539 -21915 -10590
1550 -10590 -6261 -15474 -4793 -12111 -6848 -27377 -28666 -10031 3214 17954 21193 14552 16385
1537 16385 3688 2678 42299 50161 23614 10398 49450 50141 40837 11381 -19820 -17686 -22496
1524 -22496 -29086 -2472 4088 2733 14270 23632 31356 26403 9091 5432 -1785 2007 12837 10911
1510 10911 16138 -2013 5371 12391 4619 -2031 -3162 11042 29880 10333 4617 7475 34694
1497 34694 57126 65739 26001 4398 19191 48067 49687 52122 49235 42100 23607 3058 19848
1484 19848 12908 9146 -9574 3933 -5219 -16506 -27927 -13384 19574 28029 -17251 -22277 -24598
1471 -24598 4059 6031 -906 1252 14990 35718 34610 6443 -38658 -44940 -40593 -41010 -14443
1458 -14443 8921 31207 36461 46388 30148 34379 35522 42637 12292 -16097 -7619 -10021 -22212
1445 -22212 5588 33974 36862 5893 12749 36612 24284 28294 35483 -19709 -34606 -21627 -23218
1432 -23218 -8468 -6631 9887 20465 23706 14904 24408 44522 53963 56079 35065 36998 27194
1419 27194 23754 14186 -8847 -9697 14840 28009 16983 23965 8677 1050 29062 28771 4510
1406 4510 -16676 4660 -16711 9381 5130 -7740 -17156 -5741 9354 22412 28391 7304 1885
1393 1885 24467 15629 5461 5340 23077 24809 23411 21077 24230 41355 42260 29803 3959 -27025
1379 -27025 -4871 29630 22663 -16458 -19867 -16366 -19412 -2000 23548 19348 -10068 -19435 -16105
1366 -16105 -4891 16950 11370 8305 22273 12641 -24038 -37620 -26270 -24386 -27358 -60962 -54959
1353 -54959 -3096 3340 -11018 -21089 -8887 -10686 -17252 -22570 -12734 -6357 -8209 -32165 -25332
1340 -25332 4568 8757 -19235 -22478 -29398 -29264 -4216 -12842 -9145 -15129 -2641 -8563 -15521 -16989
1326 -16989 -14881 -23281 -11769 -14707 -36674 -38955 -24412 -17850 -19759 -8795 6635 7013 -5917
1313 -5917 1714 3493 1576 -14179 6274 8386 11788 34842 43605 19461 1403 -23683 -33615
1300 -33615 -16509 1941 -8831 -5480 -154 -9456 -12802 -10027 -10969 -1080 606 3239 -11763 -31411
1286 -31411 -27492 -14126 -190 29931 14641 16253 -4230 -25203 -38574 -53171 -62214 -69283 -68408
1273 -68408 -64020 -57686 -33529 -17794 -24011 -23373 4194 20090 30676 -9620 -7360 -31317 -30716
1260 -30716 -20229 -742 -5102 -44348 -18321 -8104 -1879 17999 26797 15662 40565 33300 30083
1247 30083 30953 5253 -13828 -7658 -16266 -26187 -51244 -41446 -34905 -53946 -26692 25904 18758
1234 18758 1882 -893 1173 -5770 -14819 -35054 -49617 -14008 15670 15882 25243 7172 -20012
1221 -20012 -21897 -17372 -27898 -3476 16699 13121 34050 33531 -621 -6125 32529 37626 24055
1208 24055 4198 -18609 -16203 12436 1296 -4323 15920 8780 21593 23664 2799 5575 2878
1195 2878 -18114 -8569 -16159 -49193 -47086 -40308 -16638 -5850 -2412 -1679 -9865 -15088 2346 15451
1181 15451 -1635 -24781 -8995 9215 16162 32478 38758 27971 14964 17102 -2370 -317 7412
1168 7412 49 5971 17779 27315 53727 47997 46910 31263 3416 -8901 -15902 -20869 -39374
1155 -39374 -37437 -28253 -17442 -4752 -7310 -26404 -22864 -28654 -56768 -62235 -32851 -5184 23358
1142 23358 21002 84 -10948 5161 -23113 -32733 -24779 -20783 -15723 -13497 -5045 11226 14583
1129 14583 -29838 -32101 -15109 2986 4351 -312 -11537 -9831 -25156 -22250 -11497 -37631 -37883
1116 -37883 -18564 -6658 -14142 -2961 19654 22742 25704 5286 -13786 -13633 -20707 5298 16987
1103 16987 18353 27604 2818 -9766 -14665 -23474 -19582 -16416 1768 32862 33787 26099 -1565 44181
1089 44181 70835 54473 12856 -1721 8123 7117 4543 13136 -4619 -11064 -13917 -7217 -9573
1076 -9573 -27076 -4689 22554 21366 19310 20579 18039 11204 21807 11279 -605 -5226 -13648
1063 -13648 -6075 15175 20126 33345 26462 23495 15560 10180 31832 33820 -641 245 -20060 -24202
1049 -24202 -12342 15841 -1341 -23861 -41154 -69553 -60312 -53756 -39860 -11508 -2031 -2035 -4696
1036 -4696 -1669 -5600 1837 -10862 -18846 734 25793 13300 3450 11651 26179 31848 15627
1023 15627 10478 -9128 -27368 -23319 -20068 -33022 -41055 -33689 -8044 -11418 -16664 14381 -12193
1010 -12193 -46676 -34793 -13943 -5233 -11280 -1415 -1129 -13589 -31297 -41551 -5401 -3610 -26267
997 -26267 -28613 -11831 2 7824 13350 25935 3522 25876 41339 47023 8380 -19540 -29779
984 -29779 -9839 7240 15057 -15831 -42809 -20305 -4118 7642 -2638 11101 15851 153
972 153 2284 23408 9208 -8064 -8194 6870 10702 30236 38095 26257 -6134 -17301 -14410 -22460
958 -22460 -18031 708 27906 -1052 -16340 -38549 -28109 -27738 -46568 -52996 -46272 -44209 -56441
945 -56441 -49382 -40113 -36568 -6744 3585 1727 -579 -409 -31534 -47523 -2155 2677 -13017 -19365
931 -19365 -18601 -8035 -1687 11915 27752 12097 -37838 -33398 -26106 -7306 -11225 -25712 -28682
918 -28682 -5546 16726 -13429 -10309 7939 -325 -6995 15337 28525 36737 48402 48333 46466 6678
904 6678 -39626 -42468 -18448 -16320 5968 -17697 -37006 -21015 -20764 -29775 -17660 -11933 17811
891 17811 24884 17137 17349 -2940 -15523 -6411 27296 25122 -5937 -26792 -15062 -8823 -3219 -2594
877 -2594 -21360 -15321 2748 10479 -10377 -13951 -608 -14228 -36522 -49975 -28812 3504 34369
864 34369 50782 44620 27757 39050 41138 16674 -1063 12424 25052 7443 -6293 -27488
852 -27488 -8844 -19158 -12175 18720 40109 33212 13043 14496 15946 10072 2861 5735 15703 22195
838 22195 26806 18389 -1843 -6084 -26514 -39487 -31897 -24614 -12859 -8545 1758 25486 29198
825 29198 23906 17673 15230 44256 30860 8726 -5974 -11433 -30545 -786 4998 1234 6347
812 6347 558 23089 46453 32601 15809 -9270 -58063 -63128 -69953 -51559 -15441 1254 -5445
799 -5445 17450 13778 11456 24386 15375 2454 -754 -12267 -42734 -52314 -40794 -44484 -54023 -59534
785 -59534 -31180 -4975 21996 71008 57917 37712 10229 -4777 -1467 -7713 -6394 3882 31316
772 31316 23768 26061 9865 -13305 -19264 1658 31619 42483 16948 12309 -4723 -27557 -5970
759 -5970 -14428 -5279 21836 16676 15668 27344 10434 -24591 -35078 2070 6031 -42902 -25261
746 -25261 -6406 6740 8508 -2445 -22195 -51580 -22342 20710 52395 68000 61716 12112
734 12112 -32136 -46702 -22743 9278 9613 6161 -3380 4191 23192 24712 24246 14970 -6648 11437
720 11437 10712 -18257 -24521 -8784 5767 21430 23091 -3577 -7821 -22551 -1010 -1514 -18147
707 -18147 -28008 -41072 -21849 -10971 4656 21506 26938 15072 -9746 -30638 -35078 -41590 -23398
694 -23398 -23815 -61417 -58238 -17216 36868 55314 15642 5063 2554 -6943 4392 4578 -17299
681 -17299 -32982 -59304 -45860 -19979 -15361 -2754 26777 4821 -16319 -27219 -13224 -29200
669 -29200 -26561 -15881 -18281 -16543 -15538 1971 26610 22697 3955 4631 14299 13880 11321 -4477
655 -4477 -49937 -52275 -39470 -32942 -38381 -30699 -9699 20526 17917 10849 11270 26618 3809 -29846
641 -29846 -21489 -18036 -12469 -22222 -25364 -22409 -22037 -24967 -27504 -31952 -39801 -42828 -37733 -12402 8798
626 8798 -8376 -28550 -42198 -43126 -22666 -14367 3844 5880 11840 -13044 -34486 -6349 8256
613 8256 25687 24003 18182 11022 911 2689 33143 29156 -4870 -25730 -37164 -16820 -19903
600 -19903 -42922 -35003 11878 7727 -8575 4736 31535 43342 28487 15391 14436 10114 11379
587 11379 37383 50314 77737 52704 30628 38110 21667 16326 8065 2701 16352 23376 13894
574 13894 10190 38466 48102 47464 49097 44392 23109 14836 2418 5781 27448 51515 41188 6663
560 6663 -9926 -23143 -39775 -48809 -60494 -52903 -55230 -54049 -49619 -18663 -6906 -15937 -32361
547 -32361 -26514 -4580 -13117 -29290 -48293 -44256 -44855 -39479 -21467 916 18430 -961 -12232
534 -12232 -18363 -41741 -28696 361 18248 19642 -19441 -38684 -43805 -34777 -32937 -7252 382
521 382 -14155 -4649 -4055 -16211 -18617 -30964 -17120 6033 3160 -17153 -35262 -30031 -16201 -36356
507 -36356 -66052 -79744 -64722 -41834 -41875 -37436 -5885 2052 -7167 -16663 -13937 -7244 19156 15547
493 15547 -7994 -18569 -13122 -5075 3394 471 -2406 9729 26469 42403 32792 40982 43925 27809
479 27809 3319 -7828 14782 25255 8867 -23917 -1862 19355 3273 -16480 -17063 5259
467 5259 7492 2836 28522 20888 12082 16136 210 -63 -21794 -19476 -12125 -30262 -6705 12566
453 12566 12976 37017 28052 50739 33915 22868 16656 29504 23755 5393 -3819 28839 32077
440 32077 27937 25638 31907 7693 -18453 -15871 -1373 -5224 -37167 -18782 3613 -23319 -33838
427 -33838 -14234 -25043 -38824 -63815 -63445 -34736 -3952 18155 -884 -9380 232 18148 23557
414 23557 15464 3645 -3209 -27332 -27804 -22086 -34173 -50130 -26541 -16730 -12542 -4957 -4119 23386
400 23386 55547 48612 33232 12705 -3925 -18079 10997 13950 -2688 -5468 -39579 -49644 -27778
387 -27778 1431 19250 17639 22402 9604 -10070 -3908 12866 39797 17737 20863 -6464 -10336
374 -10336 3081 12947 17768 12818 11732 14259 -18114 -10404 -18788 -37423 -24806 -20723 -41685 -38252
360 -38252 -15284 -14022 -25173 -15133 -7922 -17462 -3037 -2555 -21625 -34426 -14926 -6097 -3285
347 -3285 14856 18868 13654 23871 17891 19797 17191 -10238 -8512 -10276 -9535 -5882 -34269 -52788
333 -52788 -28339 -32016 -51189 -27456 -6809 17167 32274 22983 14068 -10774 -28769 7886 6002
320 6002 -19154 -7119 376 13289 2086 -2109 -19076 -31597 -29123 -36109 -32147 -25093 -12505
307 -12505 6539 10002 -20352 -26748 -28594 -27339 -19774 -36940 -21036 -5297 -26757 -40573 -33103
294 -33103 -67281 -54123 -46866 -37377 -19294 -26863 -23852 -19313 -23808 -21551 -8085 -18954 -33217
281 -33217 -55194 -36379 1030 5171 -11852 -23931 -11673 -7284 9801 21208 13946 274 -19233
268 -19233 -10652 964 -7325 -281 2935 -12042 -23044 -17218 -18473 -18677 -27839 -54000 -40216 -30948
254 -30948 -27410 -20372 -14394 -17454 -26966 -19800 -15547 -44443 -75318 -67387 -21116 14780 -597 9425
240 9425 35896 46115 29713 7194 8682 6901 -14039 -11669 3972 4134 2855 -14957 -15833 -22653
226 -22653 -22568 -22185 -19562 -30429 -21969 258 35694 43948 36653 14114 2344 -2789 7809 4690
212 4690 9041 -2103 -9803 -9047 -1003 15294 16600 11327 12747 14914 7039 293 -10122 3268
198 3268 14824 1079 9706 9973 60 1374 10017 20527 -3383 -6087 -453 -1457 -14061 -22765
184 -22765 -12047 -16768 -24753 -14902 -13293 -28295 -1703 5711 -19672 -27255 -31926 -13264 126
171 126 13596 22413 19282 21210 21710 12153 -2901 2876 -4982 -11167 -18911 -38936 -25691 -15382
157 -15382 948 23164 39881 29165 13230 4791 -9082 2532 8333 10492 -14899 -26743 -31253
144 -31253 -27908 -17376 -12077 -13058 -26789 -27523 -15823 -3303 1761 23286 -1696 -19597 -3601
131 -3601 -1986 -20260 -16607 7258 7171 18255 18557 3002 4019 -5481 -31738 -46389 -26621 273
117 273 15826 27452 18842 -4926 -6939 -11242 -2605 23926 29341 15144 -6139 -23933 -31989 -34215
103 -34215 -14975 -8919 1648 12201 9792 -4639 1051 5194 -4022 -8811 -26845 -30613 -18345
90 -18345 -23510 -40711 -45710 -47349 -38515 -27066 -23795 -18831 -7884 -3794 -10403 -9676 -40574 -50152
76 -50152 -35858 -17344 -20810 -6930 -11156 -16849 -11366 -4743 -5924 -12333 -11048 -9473 -11723 -21117
62 -21117 -16288 17457 17985 27881 18182 5504 13604 23630 4488 10778 16124 425 -13796 -518
48 -518 -3622 8444 22011 9314 -17591 -41294 -55731 -39307 -22267 -26060 -27175 -35534 -36864 -26515
34 -26515 -26096 -20586 -21184 -7150 -3824 -4997 853 1033 8211 7824 -9549 -6023 -1693 -15373 -16976
19 -16976 12723 22260 17927 -6586 -20917 -18633 -29724 -27953 -15922 -2523 13776 -11716 -37413
6 -37413 -37450 -28415 -10067 11935 21227 15916
0 15916
$$ Imaginary data points
##PAGE= N=2
##DATA TABLE= (X++(I..I)), XYDATA
32767 78181 81526 97099 112892 108816 107170 115752 111948 101431 84244 66399 90807 117351 133287
32754 133287 130156 128577 116581 113601 119180 116510 117251 146751 152542 146568 136458 133134 120569
32741 120569 118979 132298 132387 148925 167476 157077 127957 139207 147787 151869 154699 160458 156157
32728 156157 144875 134314 138064 148620 153476 142692 161074 173325 165902 194735 202776 196045
32716 196045 181565 172098 173772 173981 184932 184007 194921 202969 204218 214877 224649 219401 199630
32703 199630 193916 202952 217037 208912 176406 183422 191691 195321 191053 224031 230847 234924 224213
32690 224213 206306 209361 206822 220216 221814 228629 225551 228829 236074 220663 238548 247626 240235
32677 240235 244129 239932 215076 202174 206390 211560 233130 256138 266391 251489 238699 249262
32665 249262 260529 260924 255568 248071 257528 274928 289951 281572 261302 244407 227565 220527 260721
32652 260721 279323 270360 255628 272113 282347 264524 254239 266012 266915 269489 259485 279837
32640 279837 278625 276961 285499 283980 269325 274683 275903 283320 279841 290253 296251 304387 316675
32627 316675 315691 294428 276517 292884 304077 297455 291614 307917 309360 302508 301921 310406 323074
32614 323074 319936 331561 352348 347660 346124 341024 339726 315199 324442 329857 334752 349953 355065
$$ [...]
##END NTUPLES=NMR SPECTRUM
##END=
