##TITLE=Analysis number 328308
Compound Code cc 50613
Book Reference 525/116/9
Project Code adrs
Chemist Name davec
##JCAMPDX= 6.0         $$ Bruker NMR JCAMP-DX V2.0
##DATA TYPE= NMR SPECTRUM
##DATA CLASS= NTUPLES
##ORIGIN= Bruker BioSpin GmbH
##OWNER= nmr
$$ XWIN-NMR		Version 3.5
$$ Wed May 23 12:12:46 2007 GMT Daylight Time (UT+1h)  MAYBRIDGE\nmr@NMR_250MHZ
##.OBSERVE FREQUENCY= 250.131544655141
##.OBSERVE NUCLEUS= ^1H
##.ACQUISITION MODE= SIMULTANEOUS (DQD)
##.ACQUISITION SCHEME= undefined
##.AVERAGES= 16
##.DIGITISER RES= 18
##SPECTROMETER/DATA SYSTEM= dpx250
##.PULSE SEQUENCE= zg30
##.SOLVENT NAME= CDCl3
##.SHIFT REFERENCE= (INTERNAL, CDCl3, 0, 16.4589)
##AUDIT TRAIL= $$ (NUMBER, WHEN, WHO, WHERE, WHAT)
$$ ##TITLE= Audit trail, XWIN-NMR		Version 3.5
$$ ##JCAMPDX= 5.01
$$ ##ORIGIN= Bruker BioSpin GmbH
$$ ##OWNER= nmr
$$ C:\u/data/dgb/nmr/ADRS/1390/pdata/1/auditp.txt
$$ ##AUDIT TRAIL=  $$ (NUMBER, WHEN, WHO, WHERE, WHAT)
(   1,<2007-05-23 12:12:25.31 +100>,<MAYBRIDGE\nmr>,<NMR_250MHZ>,
      <created by zg, POWCHK disabled, PULCHK disabled
       configuration hash MD5:
       76 6E 9A 78 1E 09 19 81 EC 84 63 8F B0 6A 59 2D
       data hash MD5: 64K
       8B 34 FD 56 AA D8 7A 1D 84 D7 D8 04 C3 A7 54 47>)
(   2,<2007-05-23 12:12:37.16 +100>,<MAYBRIDGE\nmr>,<NMR_250MHZ>,
      <Start of raw data processing
       ef LB = 0.3 FT_mod = 6 PKNL = 1 SI = 32K 
       data hash MD5: 32K
       26 21 4E B6 EA F6 A1 9B 0E 0C F8 4B FE 2F 61 7D>)
(   3,<2007-05-23 12:12:38.89 +100>,<MAYBRIDGE\nmr>,<NMR_250MHZ>,
      <apk 
       data hash MD5: 32K
       4F BC 22 EE 69 1D 66 C1 8C 6F 20 01 F9 8C A0 CD>)
(   4,<2007-05-23 12:12:39.67 +100>,<MAYBRIDGE\nmr>,<NMR_250MHZ>,
      <abs ABSG = 5 
       data hash MD5: 32K
       90 63 73 13 B1 00 ED 7E 57 8D 11 6E CA 97 46 28>)
$$ ##END=
$$ 
$$ hash MD5
$$ 54 12 37 8B E0 90 C7 31 23 08 A8 59 13 F4 F7 7A
##$RELAX= 
##$RELAX= 
##$RELAX= 
##$RELAX= 
##$RELAX= 
##$RELAX= 
##$RELAX= 
$$ Bruker specific parameters
$$ --------------------------
##$DU= <C:\u>
##$EXPNO= 1390
##$NAME= <ADRS>
##$PROCNO= 1
##$TYPE= <nmr>
##$USER= <dgb>
##$AMP= (0..31)
100 100 100 100 100 100 100 100 100 100 100 100 100 100 100 100 100 100 
100 100 100 100 100 100 100 100 100 100 100 100 100 100 
##$AQSEQ= 0
##$AQ_mod= 3
##$AUNM= <au_zg>
##$AUTOPOS= <18 >
##$BF1= 250.13
##$BF2= 250.13
##$BF3= 250.13
##$BF4= 250.13
##$BF5= 500.13
##$BF6= 500.13
##$BF7= 500.13
##$BF8= 500.13
##$BYTORDA= 1
##$CFDGTYP= 0
##$CFRGTYP= 5
##$CHEMSTR= <none>
##$CNST= (0..31)
1 1 145 1 1 1 1 1 1 1 1 1 1 1 1 1 1 1 1 1 1 1 1 1 1 1 1 1 1 1 1 1 
##$CPDPRG= <>
##$CPDPRG1= <>
##$CPDPRG2= <>
##$CPDPRG3= <>
##$CPDPRG4= <mlev>
##$CPDPRG5= <mlev>
##$CPDPRG6= <mlev>
##$CPDPRG7= <mlev>
##$CPDPRG8= <mlev>
##$CPDPRGB= <>
##$CPDPRGT= <>
##$D= (0..31)
0 1 0 0 0 0 0 0 0 0.06 0 0 0 0 0 0 0.0002 0 0 0 0 0 0 0 0 0 0 0 0 0 0 
0 
##$DATE= 1179918744
##$DBL= (0..7)
120 120 120 120 120 120 120 120 
##$DBP= (0..7)
150 150 150 150 150 150 150 150 
##$DBP07= 0
##$DBPNAM0= <>
##$DBPNAM1= <>
$$ [...]
##$SUBNAM7= <"">
##$SUBNAM8= <"">
##$SUBNAM9= <"">
##$SW= 20.6930455092707
##$SWIBOX= (0..15)
0 0 3 0 0 0 0 0 0 0 0 0 0 0 0 0 
##$SW_h= 5175.983436853
##$TD= 65536
##$TD0= 1
##$TE= 683.16
##$TE2= 300
##$TE3= 300
##$TEG= 300
##$TL= (0..7)
0 120 120 120 120 120 120 120 
##$TP= (0..7)
150 150 150 150 150 150 150 150 
##$TP07= 0
##$TPNAME0= <>
##$TPNAME1= <>
##$TPNAME2= <>
##$TPNAME3= <>
##$TPNAME4= <>
##$TPNAME5= <>
##$TPNAME6= <>
##$TPNAME7= <>
##$TPOAL= (0..7)
0.5 0.5 0.5 0.5 0.5 0.5 0.5 0.5 
##$TPOFFS= (0..7)
0 0 0 0 0 0 0 0 
##$TUNHIN= 0
##$TUNHOUT= 0
##$TUNXOUT= 0
##$USERA1= <user>
##$USERA2= <user>
##$USERA3= <user>
##$USERA4= <user>
##$USERA5= <user>
##$V9= 5
##$VALIST= <valist>
##$VCLIST= <CCCCCCCCCCCCCCC>
##$VD= 0
##$VDLIST= <DDDDDDDDDDDDDDD>
##$VPLIST= <PPPPPPPPPPPPPPP>
##$VTLIST= <TTTTTTTTTTTTTTT>
##$WBST= 1024
##$WBSW= 4
##$XGAIN= (0..3)
0 0 0 0 
##$XL= 0
##$YL= 0
##$YMAX_a= 322946
##$YMIN_a= -380189
##$ZGOPTNS= <>
##$ZL1= 120
##$ZL2= 120
##$ZL3= 120
##$ZL4= 120
##$ABSF1= 16.45891
##$ABSF2= -4.234262
##$ABSG= 5
##$ABSL= 3
##$ALPHA= 0
##$AQORDER= 0
##$ASSFAC= 0
##$ASSFACI= 0
##$ASSFACX= 0
##$ASSWID= 0
##$AUNMP= <proc_1d>
##$AZFE= 0.1
##$AZFW= 0.1
##$BCFW= 0
##$BC_mod= 0
##$BYTORDP= 0
##$COROFFS= 0
##$CY= 12.5
##$DATMOD= 1
##$DC= 0
##$DFILT= <>
##$DTYPP= 0
##$F1P= 14.0000005364418
##$F2P= -0.99999901652339
##$FCOR= 0.5
##$FTSIZE= 32768
##$FT_mod= 6
##$GAMMA= 0
##$GB= 0
##$INTBC= 1
##$INTSCL= 1
##$ISEN= 128
##$LB= 0.3
##$LEV0= 0
##$LPBIN= 0
##$MAXI= 10000
##$MC2= 0
##$MEAN= 0
##$ME_mod= 0
##$MI= 0
##$NCOEF= 0
##$NC_proc= -3
##$NLEV= 6
##$NOISF1= 0
##$NOISF2= 0
##$NSP= 0
##$NTH_PI= 0
##$NZP= 0
##$OFFSET= 16.45891
##$PC= 1
##$PHC0= -56.55083
##$PHC1= 8.405848
##$PH_mod= 1
##$PKNL= yes
##$PPARMOD= 0
##$PSCAL= 4
##$PSIGN= 0
##$REVERSE= no
##$SF= 250.130015779537
##$SI= 32768
##$SIGF1= 0
##$SIGF2= 0
##$SINO= 400
##$SIOLD= 32768
##$SREGLST= <1H.CDCl3>
##$SSB= 0
##$STSI= 32768
##$STSR= 0
##$SW_p= 5175.98343685301
##$SYMM= 0
##$S_DEV= 0
##$TDeff= 65536
##$TDoff= 0
##$TI= <Analysis number 999999
Compound Code 99
Book Reference 9
Project Code 9>
##$TILT= no
##$TM1= 0
##$TM2= 0
##$TOPLEV= 0
##$USERP1= <user>
##$USERP2= <user>
##$USERP3= <user>
##$USERP4= <user>
##$USERP5= <user>
##$WDW= 1
##$XDIM= 32768
##$YMAX_p= 554501355
##$YMIN_p= -121701
$$ End of Bruker specific parameters
$$ ---------------------------------
##NTUPLES= NMR SPECTRUM
##VAR_NAME=  FREQUENCY,     SPECTRUM/REAL,   SPECTRUM/IMAG
##SYMBOL=    X,             R,               I
##VAR_TYPE=  INDEPENDENT,   DEPENDENT,       DEPENDENT
##VAR_FORM=  AFFN,          ASDF,            ASDF
##VAR_DIM=   32768,         32768,           32768
##UNITS=     HZ,            ARBITRARY UNITS, ARBITRARY UNITS
##FACTOR=    0.157963299565203, 1,           1
##FIRST=     4116.8674151133, 0,             0
##LAST=      -1059.11602173971, 0,           0
##MIN=       -1059.11602173971, -121701,     0
##MAX=       4116.8674151133, 554501355,     0
$$ Real data points
##PAGE= N=1
##DATA TABLE= (X++(R..R)), XYDATA
$$ [...]
15190a1528J2055l360j7841m086J5858N56N392j0704o233q289N445K0602J5756
$$ -11528 527 -2833 -20674 -24760 -8902 -8346 -2954 -13658 -19891 -28180 -22735 -2133 13623
15177A3623m848j3040n541J2468k970N817k240p664p616p357J576M172q371p152
$$ 13623 8775 -4265 -9806 2662 -308 5509 3269 -4395 -12011 -19368 -17792 -13620 -21991 -29143
15163b9143J8405J6907P622q745o979J988O262j6734m181O478O986Q58J1334Q373
$$ -29143 -10738 6169 13791 5046 -1933 55 6317 -10417 -14598 -8120 -1134 -276 11058 19431
15149A9431j954q981M944L368n281j0371j218m75j1753O868j309j0684M870R368
$$ 19431 17477 8496 13440 16808 11527 1156 -62 -537 -12290 -5422 -6731 -17415 -12545 -3177
15135c177M81N40p32n227o811J2037j1495q354Q091R207l953k163j982K307J9935
$$ -3177 -2696 -2156 -2888 -8115 -14926 -2889 -14384 -22738 -14647 -5440 -9393 -11556 -13538 -11231 8704
15120H704L58m551j4657p375J5315R188m687q764n634M529o990o328k638o163
$$ 8704 9062 4511 -10146 -17521 -2206 6982 2295 -6469 -12103 -7574 -14564 -20892 -23530 -29693
15106b9693J3259J1376J001N029m370J951O077j3138m908N051N066J0284L456
$$ -29693 -16434 -5058 -4057 972 -3398 -1447 4630 -8508 -13416 -8365 -3299 6985 10441
15093A0441l142j1315q392J2161q901o033j190N444k70J1293P345q444p829n252
$$ 10441 7299 -4016 -12408 -247 -9148 -15181 -16371 -10927 -11197 96 7441 -1003 -8832 -14084
15079a4084j5030P68J1322Q758J8216J4030J1904M254j3868j0737j2177K654J2186
$$ -14084 -29114 -28346 -17024 -8266 9950 23980 35884 40138 26270 15533 3356 6010 18196
15066A8196J236j2310j1592N127j667l35j1222M531k142M878N593J2022O053k723
$$ 18196 19432 7122 -4470 657 -1010 -1345 -12567 -8036 -10178 -5300 293 12315 18368 15645
15052A5645j688q656j5235N265R603P301K932M919r095m665J1797N518p187l811
$$ 15645 13957 5301 -9934 -4669 4934 12235 15167 20086 10991 6326 18123 23641 16454 12643
15038A2643R0K094p931K780O916N173m148m095k326J0049O461j1036K982P396
$$ 12643 12733 14827 6896 9676 16592 21765 17617 13522 11196 21245 27706 16670 19652 27048
15024B7048M985J7217M456n338N614n738j2136p595j7496L448O225P084n247R544
$$ 27048 32033 49250 53706 48368 53982 48244 36108 28513 11017 14465 20690 27774 22527 32071
15010C2071P071j6060r5J9239O439J0028O237O095P861J0302J5344L0331K8236
$$ 32071 39142 23082 22987 42226 48665 58693 64930 71025 78886 89188 104532 134863 163099
14997A63099K5801M1094Q0706J42646K12205L09183M43637O78844R85820J470803
$$ 163099 188900 229994 310700 453346 665551 974734 1418371 2097215 3083035 4553838
14987D553838J765272O1174k044159k000667j043962m95710k58539j54045q3181
$$ 4553838 6319110 6380284 4336125 2335458 1291496 795786 537247 383202 300021
14978C00021n7902m2090m8551l6006j0264j8835j8384p952j2606j0907n682M018
$$ 300021 242119 200029 151478 115472 105208 86373 67989 60037 47431 36524 30842 34860
14966C4860J3261j948r762o167l399r662N875Q796n927j7608r733L685r969r28
$$ 34860 48121 46173 36411 30244 26845 17183 23058 31854 25927 8319 -1414 2271 -7698 -8626
14952h626j881J614N686R698M236N965L70m984K261k465p175o207j7191q189P824
$$ -8626 -10507 -8893 -3207 6491 10727 16692 17062 12078 14339 11874 4699 -1508 -18699 -26888 -19064
14937a9064j885o259J0761J5904m582r718J610J3640N266q649n478L858R900O778
$$ -19064 -20949 -27208 -16447 -543 -5125 -14843 -13233 407 5673 -2976 -8454 -4596 5304 12082
14923A2082L470l298j583p066m797j8496p719K2568J6832j1301m480l515N29L705
$$ 12082 15552 12254 10671 3605 -1192 -19688 -27407 -4839 11993 692 -3788 -7303 -6774 -3069
14909c069J1588q408j1508P056J142M339n108j1408k941l597j6124P995J4221
$$ -3069 8519 111 -11397 -4341 -3199 1140 -3968 -15376 -18317 -21914 -38038 -30043 -15822
14896a5822J2240L039r804K561N831p049o264J940J1463p829n013P075l820J0117
$$ -15822 -3582 -543 -10347 -7786 -1955 -9004 -15268 -13328 -1865 -9694 -14707 -7632 -11452 -1335
14882a335J214j146J639j288Q02k383K930j4308j4010P476J7756J2723P351k129
$$ -1335 -121 -1267 372 -916 -114 -2497 433 -13875 -27885 -20409 -2653 10070 17421 15292
14868A5292k890p928n571Q682j162n224R706m235r252n211L374P960m566K600
$$ 15292 12402 4474 -1097 7585 6423 1199 10905 6670 -2582 -7793 -4419 3541 -1025 1575
14854A575K4234K26j8626r124L946J0838k521m850r417m588j7189q524K510K3659
$$ 1575 25809 26035 7409 -1715 2231 13069 10548 5698 -3719 -8307 -25496 -34020 -31510 -7851
14840g851J1228j229k516n1J841K638l167q982P66K1039J62k1926p060M742J2731
$$ -7851 3377 2148 -368 -419 1422 4060 893 -8089 -7323 13716 13878 -8048 -15108 -10366 2365
14825B365k92p797q15L083P327J222n640J4251R725o326L08j3662j2390P441m738
$$ 2365 2073 -5724 -6539 -3456 3871 5093 -547 13704 23429 17103 17411 3749 -8641 -1200 -5938
14810e938r046j803O744P042J367J3260R126j7850o690n213J805J5991J183r187
$$ -5938 -14984 -16787 -10043 -3001 -1634 11626 20752 2902 -3788 -9001 -7196 8795 9978 791
14796G91j0095n243j262Q71m895l048L319J3186j3439n346l707K404M101P156
$$ 791 -9304 -14547 -15809 -14938 -19833 -22881 -19562 -6376 -19815 -25161 -28868 -26464 -22363 -15207
14782a5207K99J5915j844j0448k0166l876q039O641P064J0609Q972q665J139J147
$$ -15207 -14908 1007 -837 -11285 -31451 -35327 -43366 -36725 -29661 -19052 -10080 -18745 -17606 -16459
14768a6459K494P2j0318j6029j2086K256P254P364J3311J902k179K146N846k536
$$ -16459 -13965 -13893 -24211 -40240 -52326 -50070 -42816 -35452 -22141 -20239 -22418 -20272 -14426 -16962
14754a6962P819N754O619N637Q048n682l0163p197L873N252J0640J2512n8P615
$$ -16962 -9143 -3389 3230 8867 16915 11233 -18930 -26127 -22254 -17002 -6362 6150 6092 13707
14740A3707J38j4180j587n740k379J1369p163P200J2614k472o794j4196n793J3580
$$ 13707 13845 -335 -1922 -7662 -10041 1328 -5835 1365 13979 11507 4713 -9483 -15276 -1696
14726a696m211n706n97J1088m692J0451q384r041N578J6711J1580j0855l650l363
$$ -1696 -5907 -11613 -12210 -1122 -5814 4637 -3747 -12788 -7210 9501 21081 10226 6576 3213
14712C213J931M210j1511r741o581J1650J2105L622r387M404q650j1162j3571
$$ 3213 5144 9354 -2157 -11898 -18479 -6829 5276 8898 -489 3915 -4735 -15897 -29468
14699b9468N2p968J1547J1924N53k967k967Q673m788J582J8494P841m932p325
$$ -29468 -29416 -37384 -25837 -13913 -13360 -16327 -19294 -10621 -15409 -13827 4667 12508 7576 251
14685B51j5632n822j2605O518J1084M64N674j672N412R927K341m384Q386N906
$$ 251 -15381 -21203 -33808 -27290 -16206 -15742 -10068 -11740 -6328 3599 5940 1556 9942 15848
14671A5848j7779n456M351R981N913Q06n543m548l561o595L313o880p257q552
$$ 15848 -1931 -7387 -3036 6945 12858 13664 8121 3573 12 -6583 -3270 -10150 -17407 -25959
14657b5959J0894O827M589Q138J974L603J750j3121j1017q601j804O159J9313
$$ -25959 -15065 -8238 -3649 4489 6463 10066 11816 -1305 -12322 -20923 -22727 -16568 2745
14644B745P176m220l087N456m786j4545k690j52p915Q344l567M415J3683J336
$$ 2745 9921 5701 2614 8070 3284 -11261 -13951 -14103 -22018 -13674 -17241 -12826 857 2193
14630B193j5856r877J4072m640o526n48J1060p217M78R055P555k0840j0393Q601
$$ 2193 -13663 -23540 -9468 -14108 -20634 -21182 -10122 -17339 -16861 -7806 -251 -21091 -31484 -22883
14616b2883M824N715O301J2326k723j2718l660L311o290q58K62n52L872j2132
$$ -22883 -18059 -12344 -6043 6283 3560 -9158 -12818 -9507 -15797 -16655 -16393 -16945 -13073 -25205
14602b5205m946j361R153J7443o819j8532L639J1738J3072j783l193j3976l808
$$ -25205 -30151 -31512 -22359 -4916 -11735 -30267 -26628 -14890 -1818 -3601 -6794 -20770 -24578
14589b4578L088N048O192J2555J418o570p22Q859J8J1770J301o114j4957k1959
$$ -24578 -21490 -16442 -10250 2305 3723 -2847 -3569 5290 5308 17078 18379 12265 -2692 -24651
14575b4651q579J6952J4296N142q568p013k591k175R848M646N546l073J3004l325
$$ -24651 -33230 -16278 -1982 3160 -5408 -12421 -15012 -17187 -7339 -2693 2853 -220 12784 9459
14561I459j0909j1103l078N205K58J1107M213K10J1399n072j0843N192m200J170
$$ 9459 -1450 -12553 -15631 -10426 -10168 939 5152 5362 16761 11689 846 6038 1838 3008
14547C008k343j011L145l321k270o854r540J92M795k628j685p026m527L215K4411
$$ 3008 665 -346 2799 -522 -2792 -9646 -19186 -18994 -14199 -16827 -18512 -25538 -30065 -26850 -2439
14532b439K1937q455k1290Q132J4993Q185n051N304k167o527Q820j3819j5674
$$ -2439 19498 11043 -10247 -2115 12878 21063 16012 21316 19149 12622 21442 7623 -8051
14519h051o212J413p87j904K256L992O8q028L539J0651J7414o22n756q45k868
$$ -8051 -14263 -12850 -13637 -15541 -13285 -9293 -9225 -17253 -13714 -3063 14351 13729 7973 7128 4260
14504D260K250Q243k171k942q856P088J0210p283Q20j087l312j2418l265o037
$$ 4260 6510 14753 12582 9640 784 7872 18082 10799 11619 10532 7220 -5198 -8463 -14500
14490a4500M879J2857r822o103P01J399m038n209j589M701K500R212m297p041
$$ -14500 -9621 3236 -6586 -12689 -11988 -10589 -14627 -19836 -21425 -16724 -14224 -5012 -9309 -16350
14476a6350j331O690J313j1285m854Q617J9348J1537o499P622o258l1139R68Q449
$$ -16350 -17681 -10991 -9678 -20963 -25817 -17200 2148 13685 7186 14808 8550 -22589 -21621 -13172
14462a3172M858J1892M695P898j401m45j1142K886k948P995O819m399K598n756
$$ -13172 -8314 3578 8273 16171 14770 14325 3183 6069 3121 11116 17935 13536 16134 10378
14448A0378j0245k990N766K384k151o172J2630n16o12j2389m255o057j0073O830
$$ 10378 133 -2857 2909 5293 3142 -3030 9600 9084 8472 -3917 -8172 -14229 -24302 -17472
14434a7472L861j5207j5829K0047J6243J3917n603j0174o780K239L925J8664L5545
$$ -17472 -13611 -28818 -44647 -24600 -8357 5560 -43 -10217 -16997 -14758 -10833 7831 43376
14421D3376Q626q780r667j1930m675p608k830j06O088k109j7880j515M671N601
$$ 43376 52002 43222 33555 21625 16950 9342 6512 6406 12494 10385 -7495 -9010 -4339 1262
14407A262N348k138p747O904k542q958J996r88N212J998n406j3972r394K318P289
$$ 1262 6610 4472 -3275 3629 1087 -7871 -5875 -6863 -1651 347 -5059 -19031 -28425 -26107 -18818
14392a8818P552R336J0133o091j222J1052J0582j7364j1284K18M620k383P244
$$ -18818 -11266 -1930 8203 2112 890 11942 22524 5160 -6124 -5906 -1286 -3669 3575
14379C575R790j3638j4901n126K048O331J6425l317l609L854L922q802j576J5841
$$ 3575 13365 -273 -15174 -20300 -18252 -11921 4504 1187 -2422 1432 5354 -3448 -5024 10817
14365A0817J619k430j4974j5897r27L873j812J1881L2565J3518j5905j5809l939
$$ 10817 12436 10006 -4968 -20865 -21792 -17919 -19731 -7850 24715 38233 22328 6519 2580
14352B580L636j4491n247j4918r326j486Q898J1431j5954j72J4328N396k44j559
$$ 2580 6216 -8275 -13522 -28440 -37766 -39252 -30354 -18923 -34877 -35049 -20721 -15325 -15569 -17128
14338a7128P48K485j1395L547K2823K293k832j13J2868j577j3525J04J2602K478
$$ -17128 -16380 -13895 -25290 -21743 1080 3373 541 428 13296 11719 -1806 -1702 10900 13378
14324A3378l423k570k517r932l123m059J7998J2761p362q657o93j235N1k182M949
$$ 13378 9955 7385 4868 -5064 -8187 -12246 5752 18513 11151 2494 1801 566 617 -1565 3384
14309C384m523m3o2k513n233L334O119j0387o368J1626O761m645n336n718j756
$$ 3384 -1139 -1182 -1244 -3757 -8990 -5656 463 -9924 -16292 -4666 2095 -2550 -7886 -13604 -15360
14294a5360J2220J4055J0686M336Q86q275j4397K972J828o646N069K441M313K538
$$ -15360 -3140 10915 21601 25937 26823 18548 4151 7123 8951 2305 7374 9815 14128 16666
14280A6666j0856r432J224q889j115j383k678P219J3762K866M3J2391j1786l998
$$ 16666 5810 -3622 -2398 -11287 -12402 -13785 -16463 -9244 4518 7384 7427 19818 8032 4034
14266D034Q751j803m389N768l170q230q513j896K930M831m938m332N640N421J127
$$ 4034 12785 10982 6593 12361 9191 961 -7552 -9448 -6518 -1687 -6625 -10957 -5317 104 1231
14251A231o236O973n988n855p24m93m924K502J897K97J861L177K244j666L737
$$ 1231 -5005 1968 -4020 -9875 -10599 -11092 -16016 -13514 -11617 -11320 -9459 -6282 -4038 -5704 -1967
14236a967J7734M6j3537j0649q512O462O054K54J835q598n858J1463M372l72k453
$$ -1967 15767 15813 2276 -8373 -16885 -10423 -4369 -4115 -2280 -10878 -16736 -5273 -901 -1273 -3726
14221c726R284K242j809k766j2192n293J9791P452j0301j704N096k243J1844j1989
$$ -3726 5558 7800 5991 3225 -8967 -14260 5531 12983 2682 978 6074 3831 15675 3686
14207C686o521L215n541K499p357o285J8939J2239p158j1880m349p633k801j1274
$$ 3686 -2835 380 -5161 -2662 -10019 -16304 2635 14874 7716 -4164 -8513 -16146 -18947 -30221
14193c0221M87J0172M411J2370P951j287n788j116L472j97M779q547k949j944
$$ -30221 -29734 -19562 -15151 -2781 5170 3883 -1905 -3021 451 254 5033 -3514 -6463 -8407
14179h407j680N768J50P168J0623j897N792K797k4424j8117R384L913j960R319
$$ -8407 -10087 -4319 -4169 2999 13622 11725 17517 20314 -4110 -22227 -12843 -8930 -10890 -1571
14165a571l504l39K319j0818K209p167O666Q697J8281j7147q866O072K5176M80
$$ -1571 -5075 -5414 -3095 -13913 -11704 -18871 -12205 -3508 14773 -2374 -11240 -5168 20008 20488
14151B0488k0033n492R324j5900o189R513O156J8117j4674k4892r526J1223R851
$$ 20488 455 -5037 4287 -11613 -17802 -8289 -2133 15984 1310 -23582 -33108 -21885 -12034
14138a2034O744J780R417J591p507J649J0922O135j3413j5491M506J234J544j0935
$$ -12034 -5290 -3510 5907 7498 -9 1640 12562 18697 5284 -10207 -5701 -4467 -2923 -13858
14124a3858J247J368J7974j7891l378Q672M819j0170r269N520L989M207Q19P45
$$ -13858 -12611 -11243 6731 -11160 -14538 -5866 -1047 -11217 -20486 -14966 -10977 -6770 -5951 -5206
14110e206R912j1957J985R643J0657J1855J574j0437k6266j845O42Q623P091o161
$$ -5206 4706 -7251 -5266 4377 15034 26889 28463 18026 -8240 -10085 -9443 -820 6271 110
14096A10m291R527j87O160M533j0842J481J152r719Q892K832L607m229j3279J956
$$ 110 -4181 5346 5159 11319 15852 5010 6491 7643 -2076 6816 9648 13255 9026 -4253 -2297
14081b297N025J335R53K306K715p271m289j0338o878J2693J7980N385r69m344
$$ -2297 2728 4063 5016 7322 10037 2766 -1523 -11861 -18739 -6046 11934 17319 16350 12006
14067A2006j0725M29O371j2441n83p851L391Q529K642P260L135P107j083r577
$$ 12006 1281 1710 8081 -4360 -4943 -12794 -9403 -874 1768 9028 12163 19270 18187 8610
14053H610r208n918n547R472l184k3895J302N327O306J3460J3947n237q293r079
$$ 8610 -598 -6516 -12063 -2591 -5775 -29670 -28368 -23041 -16735 -3275 10672 5435 -2858 -11937
14039a1937j2086Q557J14L931m821N775J0012M557n150M785l452o980n39o796
$$ -11937 -24023 -15466 -15352 -11421 -16242 -10467 -455 4102 -1048 3737 285 -6695 -7234 -14030
14025a4030O580J6451J1887q5k459q774j915p194q623k079j8672j925K0247O100
$$ -14030 -7450 9001 20888 20803 18344 9570 7655 461 -8162 -10241 -28913 -30838 -10591 -4491
14011d491j852m912o627R671k388m320j0478J191O386Q544K495m725j191J5158
$$ -4491 -6343 -11255 -17882 -8211 -10599 -14919 -25397 -24206 -17820 -9276 -6781 -11506 -12697 2461
13997B461J086K273Q341N783j0160j7279K385J9209J1400k1632l325J7991R639
$$ 2461 3547 5820 14161 19944 9784 -7495 -5110 14099 25499 3867 542 18533 28172
13984B8172r099k1922l888J0556O175q715j156P36J2638O450j8709p324k1960
$$ 28172 19073 -2849 -6737 3819 9994 1279 123 859 13497 19947 1238 -6086 -28046
13971b8046m627J3744J4537K531o366P334K270O642K0558r895j7492j6210l31
$$ -28046 -32673 -18929 -4392 -1861 -8227 -893 1377 8019 28577 18682 1190 -15020 -15351
13958a5351O706R086L968L860m773o574J0587J0992R695p065n324J051j425j3199
$$ -15351 -8645 441 4409 8269 3496 -3078 7509 18501 28196 21131 15807 16858 15433 2234
13944B234p596P260m369j325J177n586P792J149J343j805k446j690k734q34K178
$$ 2234 -5362 1898 -2471 -3796 -2619 -8205 -413 736 2079 274 -2172 -3862 -6596 -7430 -5252
13929e252k820m312p400J6974J5843k868j1081R083L582j251K509K958m595Q043
$$ -5252 -8072 -12384 -19784 -2810 13033 10165 -916 8167 11749 10498 13007 15965 11370 19413
13915A9413m771j0961J253K708R247m662p638l625K27M803j1735j0404k725n087
$$ 19413 14642 3681 4934 7642 16889 12227 4589 964 1191 5994 -5741 -16145 -18870 -23957
13901b3957M483O310m448k930o05j09q717O278M779k675J554k184j933k395P706
$$ -23957 -19474 -13164 -17612 -20542 -21147 -21256 -29973 -23695 -18916 -21591 -20037 -22221 -24154 -26549 -18843
13886a8843J3722K153o108J0868M146j2851J534l652M551N967N696l062O287N107
$$ -18843 -5121 -2968 -9076 1792 5938 -6913 -5379 -9031 -4480 1487 7183 4121 10408 15515
13872A5515j3248j5354J723J346P629R740r89o361q760P505P728P428k920p236
$$ 15515 2267 -13087 -11364 -10018 -2389 7351 6362 1 -8759 -1254 6474 13902 10982 3746
13858C746l36L948k0992j4454P338J7803J0268j0301J541k470k85K400P574J92
$$ 3746 3410 7358 -13634 -28088 -20750 -2947 7321 -2980 -1439 -3909 -4194 -1794 5780 5972
13844E972p965J0237L890j1876k3450Q276O717K690n498K0766l165j1087L53K7521
$$ 5972 -1993 8244 12134 258 -23192 -14916 -8199 -5509 -11007 9759 6594 -4493 -4140 23381
13830B3381q719k0196j1192O054Q074R180P223M571N934k594o915o087J470k288
$$ 23381 14662 -5534 -16726 -10672 -2598 6582 13805 18376 24310 21716 14801 8714 10184 7896
13816G896R38K129J2434Q595q927j0113Q200L458j6193j9290j3273J058K1403
$$ 7896 8834 10963 23397 31992 23065 12952 21152 24610 8417 -10873 -24146 -23088 -1685
13803a685J4344j841L266n817j8117o736J788J1158J0769P546O571k792P862J111
$$ -1685 12659 10818 14084 8267 -9850 -16586 -14798 -3640 7129 14675 21246 18454 26316 27427
13789B7427k851N612j0866K044p015k3431J602J3777n568k1966K230N012J0433
$$ 27427 24576 30188 19322 21366 14351 -9080 -7478 6299 731 -21235 -19005 -13993 -3560
13776c560K599q740N431O571p089m530J4842m328K349L24q263p942Q667O467L681
$$ -3560 -961 -9701 -4270 2301 -4788 -9318 5524 1196 3545 3869 -4394 -12336 -3669 2798 6479
13761F479M819p897q58J3226j801K020p036m231m844J8256P715q624m695L564
$$ 6479 11298 3401 2543 15769 13968 15988 8952 4721 -123 18133 25848 17224 12529 16093
13747A6093o423j0195O713L090r303l84J1359L000J416l438j689k564j2207j0015
$$ 16093 9670 -525 6188 9278 -25 -409 10950 13950 15366 11928 10239 7675 -4532 -14547
13733a4547j569O304m479n943K0302J0714r313j4522Q201O628k36k745L408R47
$$ -14547 -16116 -9812 -14291 -20234 68 10782 1469 -13053 -4852 1776 1540 -1205 2203 3150
13719C150n709j2961L987K5064J2518j7353Q67J1516l194n060N883o385j3637
$$ 3150 -2559 -15520 -11533 13531 26049 8696 9563 21079 17885 12825 18708 12323 -1314
13706a314O571m532j7303j963R942J5439l79J7979M88n325m691N88j447l563n355
$$ -1314 5257 725 -16578 -18541 -8599 6840 6461 24440 24928 19603 14912 15500 14053 10490 5135
13691E135j7749L51k586R69K780K771P10q658o316K605L248J0645K1220n184p681
$$ 5135 -12614 -12263 -14849 -13880 -11100 -8329 -7619 -16277 -22593 -19988 -16740 -6095 15125 9941 2260
13676B260j2082J0818j7383P74J2693J140K1081O147j9287o655J5776P202j3586
$$ 2260 -9822 996 -16387 -15613 -2920 -1780 19301 25448 6161 -494 15282 22484 8898
13663H898J386p369K419r888K734R50m023n3p68J5013N738j673P187K995L08o684
$$ 8898 10284 2915 5334 -4554 -1820 -870 -4893 -4946 -5714 9299 15037 13364 20551 23546 23854 17170
13647A7170J905N398m912j768k205j2849L138q06j0219p329o16J9104K178L863
$$ 17170 19075 24473 19561 17793 15588 2739 5877 5071 -5148 -12477 -13093 6011 8189 12052
13633A2052m982n164M882k927p549j0201J364Q265k565J2763J0548K541R541j1672
$$ 12052 7070 1906 6788 3861 -3688 -13889 -12525 -4260 -6825 5938 16486 19027 28568 16896
13619A6896j7263m424k946j2800N586J6709J1292l363j495o186J0289N498j2666
$$ 16896 -367 -4791 -7737 -20537 -14951 1758 13050 9687 8192 2006 12295 17793 5127
13606E127m605N589M942j337l267J8077O798Q381m946j5913j4916j265O912n903
$$ 5127 522 6111 11053 9716 6449 24526 31324 39705 34759 18846 3930 2665 9577 3674
13592C674n338m629r306j496J0873K043K086r57o93O358P084p688r69L943J6307
$$ 3674 -1664 -6293 -15599 -17095 -6222 -4179 -2093 -3050 -3743 2615 9699 2011 1042 4985 21292
13577B1292o94j0116m731L549M168J089J463o987j1666K844P776n746M890R251
$$ 21292 20598 10482 5751 9300 13468 14557 16020 9033 -2633 211 7987 2241 7131 16382
13563A6382J3799l570j7031p333L905n342O945n558k16J2336J848o424n167K420
$$ 16382 30181 26611 9580 2247 6152 810 7755 2197 1981 14317 16165 9741 4574 6994
13549F994q696M376Q747L232L36J265r16k938P604o974n787k854o024r62L177
$$ 6994 -1702 2674 11421 14653 14989 16254 15338 12400 20004 13030 7243 4389 -1635 -2597 580
13534E80L986M433l996p022J1546N979p0K855n736N608J5114o053K14q889q053
$$ 580 4566 8999 5003 -2019 9527 15506 15436 18291 12555 18163 33277 27224 27438 18549 10496
13519A0496O131K305K462q346k175l916j1394J683K3002l703p691q581o170L585
$$ 10496 16627 18932 21394 13048 10873 6957 -4437 -2754 20248 16545 8854 273 -5897 -2312
13505b312m134K826J1062j3041q253K197R022J8175n947j4483l280K71k095l28
$$ -2312 -6446 -3620 7442 -5599 -13852 -11655 -2633 15542 9595 -4888 -8168 -7897 -9992 -10320
13491a0320o341J1253P783P631l788j9940r288O405J6289J2855K395j639P876
$$ -10320 -16661 -5408 2375 10006 6218 -13722 -23010 -16605 -316 12539 14934 13295 21171
13478B1171r61j2341l670l138n0j0765O338N672Q849j685L805K814l005K476Q799
$$ 21171 20210 7869 4199 1061 1011 -9754 -3416 2256 11105 9420 13225 16039 13034 15510 24309
13463B4309J2349j874L761J1856k3870k6592n153O816k717n011O4L746J3036k957
$$ 24309 36658 34784 38545 50401 26531 -61 -5214 1602 -1115 -6126 -6062 -2316 10720 7763
13449G763N9m213M027K121P725l223O37K742J3305Q05q474j1083j6107P678J6077
$$ 7763 7822 3609 7636 9757 17482 14259 14896 17638 30943 31748 23274 12191 -3916 3762 19839
13434A9839o009j5869p411J13L516R898J8778Q811j6595k5191Q272J0260q007
$$ 19839 13830 -2039 -9450 -9337 -5821 4077 22855 31666 15071 -10120 -1848 8412 405
13421D05J573N857J0699p094j721O920r676P537Q601R74K347p494k6657j7041
$$ 405 1978 7835 18534 11440 9719 16639 6963 14500 23101 24075 26422 18928 -7729 -24770
13407b4770J2859M736q685N403J6509J2970O111l066j1470j3297p528M832o313
$$ -24770 -11911 -7175 -15860 -10457 6052 19022 25133 22067 10597 -2700 -10228 -5396 -11709
13394a1709M775N384j2476L562J2873J1303J4859J290j7126k937J2096j666j1995
$$ -11709 -6934 -1550 -14026 -10464 2409 13712 28571 29861 12735 9798 21894 20228 8233
13381H233M612m941m923J3828N015N331j86r79l146k395j1864o398J118R859p18
$$ 8233 12845 7904 2981 16809 21824 27155 26969 25990 22844 20449 8585 2187 3305 13164 12446
13366A2446R63j0248M96O060l075p490j358L940O61j9272k015J0661R138K0763
$$ 12446 13409 3161 3657 9717 6642 -848 -2206 1734 2395 -16877 -18892 -8231 907 21670
13352B1670K0615j266k3076p046j171j0150m779J0206K2073J096j3082K714R814
$$ 21670 42285 41019 17943 10897 9726 -424 -5203 5003 27076 28172 15090 17804 27618
13339B7618m768J1611J2328K28k365l149j0414q194j6681M682J4385p35j8743
$$ 27618 22850 34461 46789 47017 44652 41503 31089 22895 6214 10896 25281 24546 5803
13326E803q560Q913o912P047J7442L528k919o281L028Q085J1927j0491q806q128
$$ 5803 -2757 6156 -756 6291 23733 27261 24342 18061 21089 29174 41101 30610 21804 13676
13312A3676M893p419n579lj1884o791J3743J8734J0731R456k585j7570K323L441
$$ 13676 18569 11150 5571 5568 -6316 -13107 636 19370 30101 39557 36972 19402 21725 25166
13298B5166m922P596K804j0286j2965o68j666l834N457J0580j644j1904r350n054
$$ 25166 20244 27840 30644 20358 7393 6725 5059 1225 6682 17262 15618 3714 -5636 -10690
13284a0690k664J0535k698j292J6096J6439M393K81j1020k789L37j268m426m780
$$ -10690 -13354 -2819 -5517 -6809 9287 25726 30119 30400 19380 16591 16928 15660 11234 6454
13270F454L564L008q004O421R609p877j0866Q353m68J0921J7386K101j2620k442
$$ 6454 10018 13026 5022 11443 21052 13175 2309 10662 10194 21115 38501 40602 27982 25540
13256B5540Q366L008o971j6415j3636J82P744j161J0505j3157L003O202J469j7600
$$ 25540 33906 36914 29943 13528 -108 74 7818 6657 17162 4005 7008 13210 14679 -2921
13242b921n535J4927j915n211O318q616J1301Q693r820J03l705l69m48N427L187
$$ -2921 -8456 6471 4556 -655 5663 -2953 8348 17041 7221 7324 3619 3250 2802 8229 11416
13227A1416j7013M741J8026L672M606j939p836j9350j2094M085J0321M23o789
$$ 11416 -5597 -856 17170 20842 25448 23509 15673 -3677 -15771 -11686 -1365 -942 -7731
13214g731M470Q562p72Q85p365J2361r38j173J2767k251K886O769q037L275N530
$$ -7731 -3261 5301 4529 5414 -1951 10410 9472 8299 21066 18815 21701 28470 20433 23708 29238
13199B9238j2247n622K36O291l37m075m375J461R41o5P944m544k1884k958K4000
$$ 29238 16991 11369 11605 17896 17559 13484 9109 10570 11511 11446 19390 14846 -7038 -9996 14004
13184A4004J756M172Q946R65o760o150P584Q994p246p153J922J224J6417n657
$$ 14004 15760 19932 28878 29843 23083 16933 24517 33511 26265 19112 21034 22258 38675 33018
13170C3018m732R559L708k411p785m639N960K32n162j773j2731l797O601M103
$$ 33018 28286 37845 41553 39142 31357 26718 32678 32910 27748 25975 13244 9447 16048 20151
13156B0151J3581p861J048k506j189n096l27K869o38m503J696J877j0461j2272
$$ 20151 33732 25871 26919 24413 23224 18128 17801 20670 20032 15529 17225 19102 8641 -3631
13142c631J735J5972O577o371Q614P172N476l48j0603m444N624k753J2230P495
$$ -3631 -1896 14076 20653 14282 22896 30068 35544 35196 24593 20149 25773 23020 35250 42745
13128D2745p303m353L324p158J555q87j116j3792o718j3540k86P323j1290m080
$$ 42745 35442 31089 34413 27255 28810 27923 26807 13015 6297 -7243 -7529 -206 -11496 -15576
13114a5576J0101Q240o789K339o825L415R226J0757J3791M266k557k859O7P190
$$ -15576 -5475 2765 -4024 -1685 -8510 -5095 4131 14888 28679 32945 30388 27529 27596 34786
13100C4786n961P832o201m585R424l524P485L013Q560k713R904n559L212J833
$$ 34786 28825 36657 30456 25871 35295 31771 39256 42269 50829 48116 58020 52461 55673 57506
13086E7506j065o204n275K905J9437o902J2377R854j1115l469K0701J1986K1414
$$ 57506 56441 50237 44962 47867 67304 60402 72779 82633 71518 68049 88750 100736 122150
13073A22150J4028K6473M2650L4343L7381N7009M7207L2876J4603n336l0882l7400
$$ 122150 136178 162651 205301 239644 277025 334034 381241 414117 428720 423384 392502 355102
13061C55102k5007l8398n1289l7658l3672k9900k1299j7186j7762n017o184j5269
$$ 355102 330095 291697 240408 202750 169078 139178 117879 100693 82931 77914 71730 56461
13049E6461j3666J270M082r383j0731J3303M454n82n787p586k694M474j7120r840
$$ 56461 42795 44065 48147 38764 28033 41336 45790 45208 39421 31835 29141 33615 16495 6655
13035F655J1733L618p127M81J3449N885l968o184L002L407j2828j7425K071J4045
$$ 6655 18388 22006 14879 15360 28809 34694 30726 24542 27544 30951 18123 698 2769 16814
13021A6814J0728P945m946n026P927j1939k705J412M00J0783M704M832J662j383
$$ 16814 27542 35487 30541 25515 33442 21503 18798 20210 20610 31393 36097 40929 42591 41208
13007D1208J194p354j2446j4735J8430J3785m99M804o908j0882p00O153m005n794
$$ 41208 42402 35048 22602 7867 26297 40082 39583 44387 37479 26597 25897 32050 28045 22251
12993B2251j0388M732J3091P137K857J75M634L990J8467M419j0702k554j1955
$$ 22251 11863 16595 29686 36823 39680 39855 44489 48479 66946 71365 60663 58109 46154
12980D6154j2173l149j9006m284J1757J3397J0916K88j2311o585J0229K74n190
$$ 46154 33981 30832 11826 7542 19299 32696 43612 43900 31589 25004 35233 35507 30317
12967C0317K901N688p859Q51J8492p811j1393k641n381j1545l438J5722K4973
$$ 30317 33218 38906 31047 31898 50390 42579 31186 28545 23164 11619 8181 23903 48876
12954D8876N212j1623K880j786m952q566L44J1195J0364J227p729l619J1426m22
$$ 48876 54088 42465 45345 43559 38607 30041 30385 41580 51944 53171 45442 41823 53249 52827
12940E2827j5305k0636O238R848m056j0857o620O284o87n194j0596J1778J4014
$$ 52827 37522 16886 23124 32972 28916 18059 11439 17723 17036 11842 1246 13024 27038
12927B7038L411q946O12J071O209o344J007J5664N48m887o317n98J6889J961J8104
$$ 27038 30449 21503 22115 23186 29395 23051 24058 39722 40270 35383 29066 28468 45357 47318 65422
12912F5422L265O302p149j2368jl928J1661J6413o576r112n230J1828K867R70
$$ 65422 68687 74989 67840 55472 55471 51543 63204 79617 73041 63929 58699 70527 73394 74364
12898G4364N396m601Q925J6463n729j4935n728j1269j7984j0681Q38K3923J5931
$$ 74364 79760 75159 84084 100547 94818 79883 74155 62886 44902 34221 35059 58982 74913
12885G4913l928j1516J5971r663j1054l347j1271j2872p494J0449J1338K45j1935
$$ 74913 70985 59469 75440 65777 54723 51376 40105 27233 19739 30188 41526 41771 29836
12872B9836p775J5304J0316J3707M749J244k099j0251j3964Q425O378M59K469
$$ 29836 22061 37365 47681 61388 66137 67381 65282 55031 41067 49492 55870 56329 58798
12859E8798l94j5120o118O684R735P69K763L199O819j0335M30L755L928q50l893
$$ 58798 58404 43284 37166 43850 53585 54354 57117 60316 67135 56800 57230 60985 64913 64063 60170
12844F0170n587Q648N919m118j7875P357q02j1773P406J3408Q839J0279j5999
$$ 60170 54583 63231 69150 65032 47157 54514 53712 41939 49345 62753 71592 81871 65872
12831F5872j0039o53O768J0179P958J4228J036q196P853M062P568r070N114K2304
$$ 65872 55833 55180 61948 72127 80085 94313 95349 87153 95006 99068 106636 97566 102680 124984
12817A24984L371j2261j3212m634k075Q807j102l172J092k188n339J2073J9976
$$ 124984 128355 116094 102882 98248 96173 104980 103878 100706 101798 99610 94271 106344 126320
12804A26320J6807q236J3303J1934J262R539k71p978j3963l067K989N31j1001
$$ 126320 143127 134891 148194 160128 161390 170929 170658 162680 148717 145650 148639 149170 138169
12791A38169j5819R316J1246P08q853j376J4077J4211K7738L100J091l613J6575
$$ 138169 122350 131666 142912 143620 134767 133391 147468 161679 189417 192517 193608 189995 206570
12778B06570Q805j2298J139O737P948M457N841Q956R420J481l83R286J2560K5569
$$ 206570 215375 203077 204216 210953 218901 223358 229199 238155 247575 249056 248673 257959 270519 296088
12764B96088K1905Q825Q820Q030k348J0879J8132R440m544j3516j3830J928M487
$$ 296088 317993 326818 335638 343668 341320 352199 370331 379771 375227 361711 347881 349809 354296
12751C54296k0037j4736M343R002j1477l609o307l434J103L038O083j73J5569
$$ 354296 334259 319523 323866 332868 321391 317782 311475 308041 309144 312182 318265 318092 333661
12738C33661N395m721j4620n402L436K795Q139n833m187J1398J8061p025m408
$$ 333661 339056 334335 319715 314313 317749 320544 328683 322850 318663 330061 348122 341097 336689
12725C36689J3248Q245Q52N156K192P020J4450J6118q563J787j1038l579M732
$$ 336689 349937 358182 359034 364190 366382 373402 387852 403970 395407 397194 386156 382577 387309
12712C87309P007N588M987j0177j517L227m834r538n672p84J4504J6872J057J8423
$$ 387309 394316 399904 404891 394714 393197 396424 391590 382052 376380 375596 390100 406972 408029 426452
12698D26452L1189J4433R36p88J4246K5140M5995L9246K5857K6033M0116L5786
$$ 426452 457641 472074 473010 472222 486468 511608 557603 596849 622706 648739 688855 724641
12686G24641M7564M8042P5865Q3384J13009J21203J27570J27756J13391J04120
$$ 724641 772205 820247 896112 979496 1092505 1213708 1341278 1469034 1582425 1686545
12676A686545R3383P9383M3644J191k961J0615k662N90P413K9286L4334P6984
$$ 1686545 1779928 1859311 1902955 1904146 1901185 1911800 1909138 1909728 1917141 1946427 1980761 2057745
12664B057745J05522J47096J91642K55709L06048L70911M55266N44390O32168
$$ 2057745 2163267 2310363 2502005 2757714 3063762 3434673 3889939 4434329 5066497
12655E066497P56471R18071J161090J482607J974579K695547L651024M949823
$$ 5066497 5822968 6741039 7902129 9384736 11359315 14054862 17705886 22655709
12647B2655709O505078Q029679Q780653Q220477O859184N717138M774357K790821
$$ 22655709 29160787 37190466 45971119 54191596 61050780 66767918 71542275 74333096
12639G4333096p57353m417510o436178o940673p345557q148328q461977p514463
$$ 74333096 73575743 69158233 62722055 55781382 48435825 40287497 31825520 24311057
12631B4311057n746626m023612k781739j953397j432191j104162q90250p36484
$$ 24311057 18564431 14540819 11759080 9805683 8373492 7269330 6379080 5642596
12623E642596o29371n69433m86135m20086l81214l44450k72375k25165j83240
$$ 5642596 5013225 4443792 3957657 3537571 3156357 2811907 2539532 2314367 2131127
12614B131127j70376j43737j08638r2969q3207n5134o6470m9644n2011m7093l7450
$$ 2131127 1960751 1817014 1708376 1615407 1532200 1477066 1410596 1360952 1308941 1261848 1224398
12603A224398m5784l8710l9024m0944n6138o8576o9566o2089m8059m0302m9180
$$ 1224398 1178614 1139904 1100880 1059936 1003798 935222 865656 803567 755508 715206 666026
12592F66026l9071j9962r213l739j0357j6981j2925p919k845q964k0990k6415
$$ 666026 626955 606993 597780 594041 583684 566703 553778 545859 543014 534050 513060 486645
12580D86645n313k509j6273j0679m021j9932j0289r682j4201j1619K766j310j226
$$ 486645 481332 478823 462550 451871 447850 427918 417629 407947 393746 382127 384893 383583 382357
12567C82357p242l792o658k648q949N246Q334j146O655q817j5737j803k5837j7896
$$ 382357 375115 371323 364665 362017 353068 358314 366648 365502 372157 363340 347603 345800 319963 302067
12553C02067J4607R602N156m584j1146r753j0427l28J2532K096N394L041n522
$$ 302067 316674 326276 331432 326848 315702 305949 295522 295194 307726 309822 315216 318257 312735
12540C12735p747p913q609j3082M120K819j3814j3195J864l327n02R861K3090
$$ 312735 304988 297075 288466 275384 279504 282323 268509 255314 257178 253851 253349 263210 286300
12527B86300m378j9272p971K615J8486K445K047R51O650k215J4509J3179Q574
$$ 286300 281922 262650 254679 257294 275780 278225 280272 281223 287873 285658 300167 313346 321920
12514C21920J9614O740Q406K2688K4092J6198J051J6878P566j814J0250K9474
$$ 321920 341534 348274 356680 379368 403460 419658 420709 437587 445153 443339 453589 483063
12502D83063L6014N3515O2780N3696N0800K2025k4140n0359o7798n5093n4951
$$ 483063 519077 572592 635372 689068 739868 761893 737753 687394 619596 564503 509552
12491E09552n5330o3341n7109m1071j8917k6783k9573j7830n550k756L719j1142
$$ 509552 454222 390881 333772 292701 273784 247001 217428 199598 194048 191292 195011 183869
12479A83869l932J462k23J0274k326j7613R876J3047J1747J2596j352J863M996
$$ 183869 179937 181399 181176 191450 189124 171511 181387 194434 206181 218777 217425 219288 224284
12466B24284J7456O655L874k5039j1347L628L741O597O65J9824L7206N5646L8208
$$ 224284 241740 248395 252269 227230 215883 219511 223252 229849 230514 250338 287544 343190 381398
12453C81398J6035k3731k9673l5865k6191K77K11j0305k3248j1015M718M751k2533
$$ 381398 397433 373702 344029 308164 281973 282250 282461 272156 248908 237893 242611 247362 224829
12440B24829l3154j4832k5357j7131n123J1999p934P14R419K1366J6727m835K766
$$ 224829 191675 176843 151486 134355 129232 141231 133297 134011 143430 164796 181523 176688 179454
12427A79454L608j1742j4097L164J1938L379N722O315n909j695j185k327Q824
$$ 179454 183062 171320 157223 160387 172325 175704 181426 187741 181832 180137 178952 176625 185449
12414A85449J3443J866q69j3121J4970K1664j9716j7287k365O732j1553M086j33
$$ 185449 198892 200758 199889 186768 201738 223402 203686 186399 184034 190766 179213 183299 183166
12401A83166o676l656L618M428m014j552j2417l569r088o306k135K6056J6543
$$ 183166 176490 172834 176452 180880 176866 175314 162897 159328 150240 143934 141799 167855 184398
12388A84398Q850J7195M308M658J6007k331R588J3026K2841K4319N778R460k036
$$ 184398 193248 210443 214751 219409 235416 233085 242673 255699 278540 302859 308637 318097 316061
12375C16061j1066M337j7306m228k9M112p97L294R934L793Q646L890L99j3406
$$ 316061 304995 309332 292026 287798 287769 291881 291084 294378 304312 308105 316751 320641 321040 307634
12361C07634M168J1899q708L004q439k1431j9876k4702k8833k8460j6268k2594
$$ 307634 311802 323701 314993 317997 309558 288127 268251 243549 214716 186256 169988 147394
12349A47394p205J1096J2559J1796J7517K7517L2244M1603L5582K9240J9042J7833
$$ 147394 140189 151285 163844 175640 193157 220674 252918 294521 330103 359343 378385 396218
12337C96218Q656R128K3988K1346K554j2008m682q609m953L108K2469K8738L9104
$$ 396218 404874 414002 437990 459336 461890 449882 445200 436591 431638 434746 457215 485953 525057
12324E25057O1473N4323K5505l20k3063l1677l7976j1227m403j4159J4064N216
$$ 525057 586530 640853 666358 666038 642975 611298 573322 562095 557692 543533 557597 562813
12312E62813r793k361n989N041J6599N424p474l230R346J4273R386K5583L763
$$ 562813 553020 550659 544670 549711 566310 571734 564260 561030 570376 584649 594035 619618 623381
12299F23381J3030J5748K2307J8525o074O304J2248L165J5734L0597K669j107
$$ 623381 636411 652159 674466 692991 686917 693221 705469 708634 724368 754965 757634 756527
12287G56527K4768L5891J5483J882R911K3739K6130J5617K0573J0750K9804L3849
$$ 756527 781295 817186 832669 834551 844462 868201 894331 909948 930521 941271 971075 1004924
12275A004924L9527N7177M5833L8857M7281N1971L6023L2333M6724M0550L5092
$$ 1004924 1044451 1101628 1147461 1186318 1233599 1285570 1321593 1353926 1400650 1441200 1476292
12264A476292N5338O6134Q2359Q1379O4025N1604M5899O1524O6011O6377P4335
$$ 1476292 1531630 1597764 1680123 1761502 1825527 1877131 1923030 1984554 2050565 2116942 2191277
12253B191277P8326J02113J12342J16424J37346J48596J65479J57572J39031J38456
$$ 2191277 2269603 2371716 2484058 2600482 2737828 2886424 3051903 3209475 3348506 3486962
12243C486962J08052Q6001Q7348J15852J33594J38766J80424J95136K17863K62743
$$ 3486962 3595014 3681015 3768363 3884215 4017809 4156575 4336999 4532135 4749998 5012741
12233E012741K83904L28327L67983L94619M39816M89932N50341O06136O79799
$$ 5012741 5296645 5624972 5992955 6387574 6827390 7317322 7867663 8473799 9153598
12224I153598P60654Q47991R60370J091528J232721J404076J646536J937413K304512
$$ 9153598 9914252 10762243 11722613 12814141 14046862 15450938 17097474 19034887 21339399
12215B1339399K740489L323371M092165N114343O463383Q244719J0662783J3902633
$$ 21339399 24079888 27403259 31495424 36609767 43073150 51317869 61980652 75883285
12207G5883285J8199842K3568494K9901804L6883061M3445947M7150709M3188176
$$ 75883285 94083127 117651621 147553425 184436486 227882433 275033142 318221318
12200C18221318K5376149n805166l6785020n2537408n1551275m2385814l2313709
$$ 318221318 343597467 337792301 301007281 248469873 196918598 154532784 122219075
12193A22219075k4111366j8061601j3769311j0715083q474979o794468n482110
$$ 122219075 98107709 80046108 66276797 55561714 47086735 40292267 34810157
12186C4810157m483446l711911l081291k546444k117710j797218j543414j315320
$$ 34810157 30326711 26614800 23533509 20987065 18869355 17072137 15528723 14213403
12178A4213403j147498j039425r28382q21857p62997o83451o15645n56670m98585
$$ 14213403 13065905 12026480 11098098 10276241 9513244 8829793 8214148 7657478 7158893
12169G158893m59749l97540l57318l50285l01102k77086k53174k32271k25674
$$ 7158893 6699144 6301604 5944286 5594001 5292899 5015813 4762639 4530368 4304694
12160D304694k10505j85230j72801j65149j59249j59027j56614j35609j29024
$$ 4304694 4094189 3908959 3736158 3571009 3411760 3252733 3096119 2960510 2831486
12151B831486j16621j22659j08249j04960r4471r2627p7873q0807p3646q4788
$$ 2831486 2714865 2592206 2483957 2378997 2284526 2191899 2114026 2033219 1959573 1874785
12141A874785p1699n9006m9077l3549l4303k6112l7217l6238l1212l7560l5033
$$ 1874785 1803086 1744080 1695003 1661454 1627151 1601039 1563822 1527584 1496372 1458812 1423779
12130A423779l7960k3087P475l0051k7974k0528l1781k9762j4055l0290k7748
$$ 1423779 1385819 1362732 1370207 1340156 1312182 1291654 1259873 1230111 1216056 1185766 1158018
12119A158018r262j4995l6673l6083l3204l9270k5276j2429k1521k5769j8448
$$ 1158018 1148756 1133761 1097088 1061005 1027801 988531 963255 950826 929305 903536 885088
12108H85088j5670k4602k8315k5451j9782j4528l1642p301o810j4558p764m681
$$ 885088 869418 844816 816501 791050 771268 756740 725098 717797 710987 696429 688665 683984
12096F83984j4100k3424j4676O870J631r958j6001k7659j7327o608p265M248Q97
$$ 683984 669884 646460 631784 638654 640285 630327 614326 586667 569340 562732 555467 559715 560612
12083E60612n30k0346k3965k1313q369m383J4067L1585M3123M2678K9421J0094
$$ 560612 560082 539736 515771 494458 486089 481706 495773 527358 570481 613159 642580 652674
12071F52674k1219l2836k4896j7940k4135l7904j5791n284j4770n311o462J616
$$ 652674 631455 598619 573723 555783 531648 493744 477953 472669 457899 452588 446126 447742
12059D47742K1676J1312N278Q979R044N232J2628L209j3198o285k3997m2335l6185
$$ 447742 469418 480730 486008 494987 504031 509263 521891 525100 511902 505617 481620 439285 403100
12046D03100l6392k3306k5820j3357l6328l2397j2355r593n87j290q938j883n836
$$ 403100 366708 343402 317582 304225 267897 235500 223145 213552 212965 211675 202737 200854 195018
12033A95018k892P321j23K127j439O312N195j0108j3875j1711j5840j4599j0367
$$ 195018 192126 199447 199324 201451 200012 206324 211519 201411 187536 175825 159985 145386 135019
12020A35019r63Q82J5920K0616K0518K352K781J8168L907M050K612Q300J0967
$$ 135019 134056 134938 150858 171474 191992 194344 197125 215293 219200 223250 225862 234162 245129
12007B45129m75r237q394r518j1179j381o468j4714N59Q646P31n838R148Q540
$$ 245129 244654 235417 227023 217505 206326 204945 198477 183763 184322 192968 193699 187861 197009 205549
11993B05549K591j589j490n163o875j934m967j0500k3665n284R682j0585l667
$$ 205549 208140 206551 205061 199898 193023 191089 186122 175622 151957 146673 156355 145770 142103
11980A42103R01o303l746J506l528J253R603P11J259J3649K1101o494j3744j0881
$$ 142103 143004 136701 132955 134461 130933 132186 141789 142500 143759 157408 178509 172015 158271 147390
11966A47390J0608K6263L517j0787j2675O109R416o458m647j339p623n61K964
$$ 147390 157998 184261 187778 176991 164316 170425 179841 173383 168736 167397 159774 159213 162177
11953A62177j6805j4844P833n081q104K132j587J0718R115P325J369J2214j584
$$ 162177 145372 130528 138361 133280 125176 127308 125721 136439 145554 152879 154248 166462 164878
11940A64878j2875j2584j5811j3719p524P497J1731R477m56Q422p507j6122L003
$$ 164878 152003 139419 123608 109889 102365 109862 121593 131070 130614 139036 131529 115407 118410
11927A18410J8980p222j0675N534R50J408O851j8561j5256M237J3976J0851j224
$$ 118410 137390 130168 119493 125027 125977 127385 134236 115675 100419 104656 118632 129483 128259
11914A28259R08j1249Q063J6302P971n10l432J188J4630m11j324O322J822j620
$$ 128259 129167 117918 125981 142283 150254 149744 146312 147500 162130 161719 160395 166717 168539 166919
11900A66919r319j7075j0324j6974j9363o046j2120j4705j5501j2267n582p466
$$ 166919 157600 140525 130201 113227 93864 87818 75698 60993 45492 33225 27643 20177
11888B0177n333J0147O355l261j1019J935J0899O155J6374R875j2557j8153K215
$$ 20177 14844 24991 31346 28085 17066 19001 29900 36055 52429 62304 49747 31594 33809
11875C3809J5161J4037O734m378j96M606q600J387l608j5065q141L340L259L366
$$ 33809 48970 63007 69741 65363 65167 69773 61173 62560 58952 43887 35746 39086 42345 45711
11861D5711m980j1017m061N424j055J950K867M458j1064j970K1400P159l376P374
$$ 45711 40731 29714 25653 31077 30022 31972 34839 39297 28233 26263 47663 54822 51446 58820
11847E8820M053k2567P157P346q338L465J4525N913o565m732n859j178J3467r90
$$ 58820 62873 40306 47463 54809 46471 49936 64461 70374 63809 59077 53218 52040 65507 64517
11833F4517j2869p547N23l761O363J130j0849j359J144J209O677j1691p508m343
$$ 64517 51648 44101 44624 40863 47226 48356 37507 36148 37292 38501 45178 33487 25979 21636
11819B1636J5230J1513p635l045j592N143J6849P521j1946O356O227j097k20l164
$$ 21636 36866 48379 40744 37699 36107 41250 58099 65620 53674 60030 66257 65160 64940 61776
11805F1776J0910O970N804K2352J4713J6886L5857L0641K3011L2810L7795K5696
$$ 61776 72686 79656 85460 107812 122525 139411 175268 205909 228920 261730 299525 325221
11793C25221K3561J9438O159Q956j4406k2132k4240l0488j7522j8278j1924o292
$$ 325221 348782 368220 374379 383335 368929 346797 322557 292069 274547 256269 244345 238053
11781B38053j2056j1576r505N075Q218Q93J3298R332Q143J4414J1567j703J2429
$$ 238053 225997 214421 204916 209991 218209 219102 232400 241732 249875 264289 275856 274153 286582
11768B86582R211j2841L932l624K132J726J4661K5044K7254K052L960M096J4914
$$ 286582 295793 282952 286884 283260 285392 287118 301779 326823 354077 356129 360089 364185 379099
11755C79099J733k665j0133j0775j0491l512p195o087j1809p172k4180o881k74
$$ 379099 380832 378167 368034 357259 346768 343256 336061 329974 318165 310993 286813 279932 279658
11742B79658j4964k2242j3728j1969j3005j5215j6643L306N973J3251J683J7590
$$ 279658 264694 242452 228724 216755 203750 188535 171892 175198 181171 194422 196105 213695
11730B13695K0506L41P402J8292K7160J7270J287q871n273j2986k2672k6577j7195
$$ 213695 234201 234542 241944 260236 287396 304666 305953 297082 291809 278823 256151 229574 212379
11717B12379p064l6245k7698j3364j6874j3476n343k029k2088o485L497M413j3100
$$ 212379 205315 169070 141372 128008 111134 97658 92315 90286 68198 61713 65210 69623 56523
11704E6523n012r075j9935j728J544M679K653l544n018k3569j4759j90J2772J5414
$$ 56523 51511 42436 22501 20773 22317 26996 29649 26105 21087 -2482 -17241 -17431 -4659 10755
11690A0755Q528q808J878R95j0216k122M233N864J0084Q43j4368j4669J8605N609
$$ 10755 19283 10475 12353 13348 3132 1010 5243 11107 21191 22034 7666 -7003 11602 17211
11676A7211L692m754p83P891L154L035j5089j1689k222K148M239K684k090N33
$$ 17211 20903 16149 15366 23257 26411 29446 14357 2668 446 2594 6833 9517 7427 7960
11662G960J020J253l768O53m806p159R595L27R145J3464R119n216r46j0679j7161
$$ 7960 8980 10233 6465 7118 2312 -4847 4748 5075 14220 27684 36803 31587 30641 19962 2801
11647B801n966O793j44J128N692K970k492J3946j056j1394q200m841k919j843
$$ 2801 -3165 3628 3484 4612 10304 13274 10782 24728 23672 12278 4078 -763 -3682 -5525
11633e525K279R021j525K602L965P485q059L488P568Q680l089k5612j306J864
$$ -5525 -3246 5775 4250 6852 10817 18302 10243 13731 21299 29979 26890 1278 -28 1836
11619A836l680r369J0145P744p023n66j702k058M695J3385n055M674j2118p248
$$ 1836 -1844 -11213 -1068 6676 -347 -913 -2615 -4673 22 13407 8352 13026 908 -6340
11605f340p747M106o31k509O656N489k924q746O401j012J1155N625q252k953j0165
$$ -6340 -14087 -9981 -10612 -13121 -6465 -976 -3900 -12646 -6245 -7257 3898 9523 1271 -1682 -11847
11590a1847k338N248Q20l238m176O453P271n031q125j14M551k45l457L421O632
$$ -11847 -14185 -8937 -8117 -11355 -15531 -9078 -1807 -6838 -14963 -15077 -10526 -10771 -14228 -10807 -4175
11575d175n836J18J0127K14P16j5248p290J6782K3346q738r87J768k5297q066
$$ -4175 -10011 -9893 234 448 1164 -14084 -21374 -4592 18754 10016 9029 10797 -14500 -22566
11561b2566J320N504J7261n347r530L051P910O464P951l118j6886Q433P867p461
$$ -22566 -21246 -15742 1519 -3828 -13358 -10307 -2397 4067 12018 8900 -7986 447 8314 853
11547H53J678q252M996j2012j2442k718R410k308l875M372J573O22Q73J3440K427
$$ 853 2531 -5721 -725 -12737 -25179 -27897 -18487 -20795 -24670 -20298 -18725 -18103 -17230 -3790 -1363
11532a363K138L466p675k320J7095Q210j4016O762J4298J540n197j95N910k337
$$ -1363 775 4241 -3434 -5754 11341 19551 5535 12297 26595 28135 22938 22743 28653 26316
11518B6316j824j0504j4178J4576O277N632L928k0546j3009J2024L116J212l44
$$ 26316 24492 13988 -190 14386 20663 26295 30223 9677 -3332 8692 11808 13020 12676
11505A2676J13K152j0391J1918R151j328o912r972k253M213p84R47k609j0756
$$ 12676 12789 14941 4550 16468 25619 24291 17379 7407 5154 9367 8583 9530 6921 -3835
11491c835N723N065p382m650j0457P154P930J0224M956n057k401K127M33m176
$$ -3835 1888 6953 -429 -5079 -15536 -8382 -452 9772 14728 9671 7270 9397 9830 5654
11477E654J306k127J426O948L337j1463J714K961R295J296L516o057j0800n681
$$ 5654 6960 4833 6259 13207 16544 5081 6795 9756 19051 20347 23863 17806 7006 1325
11463A325j2470R927J2499K513n819n425j986k477K522J4386K334k016j0782o9
$$ 1325 -11145 -1218 11281 13794 7975 2550 564 -1913 609 14995 17329 15313 4531 4462
11449D462Q758J1251J3796q126j1131n095j375p237L556m683l685J3998R488q376
$$ 4462 13220 24471 38267 30141 19010 13915 12540 5303 8859 4176 491 14489 23977 15601
11435A5601j989l133j0439N89K0118L503o077K096L809J946Q638J592o007K27
$$ 15601 13612 10479 40 629 20747 24250 18173 20269 24078 26024 34662 36254 30247 30474
11421C0474j4756M297l152l182n905O064J8627M460m021j1184N164O320J3231
$$ 30474 15718 20015 16863 13681 7776 13840 32467 36927 32906 21722 26886 33206 46437
11408D6437p210j4247j6153k120P021m588j2807J0514K667P571l129m781N078
$$ 46437 39227 24980 8827 6707 13728 9140 -3667 6847 9514 17085 13956 9175 14253
11395A4253K937j901l372O22n932r203J0759R701J1344J2176J422j7823o580n645
$$ 14253 17190 15289 11917 12539 6607 -2596 8163 17864 29208 41384 42806 24983 18403 12758
11381A2758j3302j5098L685P095O80p769l522J160O142R941J3101O791M31n781
$$ 12758 -544 -15642 -11957 -4862 -4182 -11951 -15473 -14313 -8171 1770 14871 21662 22093 16312
11367A6312n364N339l305j8231M00J3455R610p86j1516k5347P47J8916J7974N293
$$ 16312 10948 16287 12982 -5249 -4849 8606 18216 17430 5914 -19433 -18686 230 18204 23497
11353B3497j8753j0634N376j0757J2656J8363L682k0774p364Q394q764J4702N964
$$ 23497 4744 -5890 -514 -11271 1385 19748 23430 2656 -4708 3686 -5078 9624 15588
11340A5588j171o508j5972n927Q472K053n76P728P767J4147J814r947p29o222
$$ 15588 14417 7909 -8063 -13990 -5518 -3465 -4041 3687 11454 25601 27415 17468 16739 10517
11326A0517j345P840R092j386r376j8405j1859Q624O102K868L014J293J1733K402
$$ 10517 9172 17012 26104 24718 15342 -3063 -14922 -6298 -196 2672 5686 6979 18712 21114
11312B1114j0860n818M497M913j6986J578N028J2810j892j236J0604R878r288
$$ 21114 10254 4436 8933 13846 -3140 -1562 3466 16276 14384 13148 23752 33630 24342
11299B4342o879r660K218K893J983M496o911K922l159J1140L07j6845k372Q57
$$ 24342 17463 7803 10021 12914 14897 19393 12482 15404 12245 23385 23692 6847 4475 5332
11285E332j3283O263n398n497k447K077k395L435J2941Q308j5775r159J0015N742
$$ 5332 -7951 -1688 -7086 -12583 -15030 -12953 -15348 -11913 1028 9336 -6439 -15598 -5583 159
11271A59P748k301L380l397l062k987K623j502j0604n334L76J6517J9181R55j0123
$$ 159 7907 5606 8986 5589 2527 -460 2163 661 -9943 -15277 -14901 1616 20797 21752 11629
11256A1629j2081O520J1703p359j263K444n092j558J832n41j1820j2304J2355
$$ 11629 -452 6068 17771 10412 9149 11593 6501 4943 6775 6234 -5586 -17890 -5535
11243e535J0471K427M412j774o809k605l558J8033Q000L892j784l854K992j3760
$$ -5535 4936 7363 11775 10001 3192 587 -2971 15062 23062 26954 25170 21316 24308 10548
11229A0548k0873j04N100j0842k324n86J2558J638K217O918J0951M844P988k089
$$ 10548 -10325 -10429 -5329 -16171 -18495 -19081 -6523 -4885 -2668 4250 15201 20045 28033 25944
11215B5944k0994j775j5121j3470M726K990J3031Q926k466l514j658J5132J677
$$ 25944 4950 3175 -11946 -25416 -20690 -17700 -4669 4257 1791 -1723 -3381 11751 13428
11202A3428l143J8225k691m793k96k779p233o316k028N340R701p029m365l307
$$ 13428 10285 28510 25819 21026 20730 17951 10718 4402 2374 7714 17415 10386 6021 2714
11188B714K874j5140p218J3351P443J151J453P544l506j28m92J0480R222Q7o425
$$ 2714 5588 -9552 -16770 -3419 4024 5175 6628 14172 10666 10538 10046 20526 29748 29835 23410
11173B3410J515J4372p159j1436n713r927m645l339M364J568j2303p364R274N948
$$ 23410 24925 39297 32138 20702 14989 5062 417 -2922 1442 3010 -9293 -16657 -7383 -1435
11159a435N248J0779L508n793j4394j4761N284R520L99P425j857k304n092n491
$$ -1435 3813 14592 18100 12307 -2087 -16848 -11564 -2044 -1645 5780 3923 1619 -3473 -8964
11145h964Q957J0962J22m933J4415p864k0865O110J5777o299K893j4161j234J6489
$$ -8964 -7 10955 11077 6144 20559 12695 -8170 -2060 13717 7418 10311 -3850 -5084 11405
11131A1405M262J798n41k674m36Q979k15p524J0107m167M221r286n309J7708k678
$$ 11405 15667 17465 16924 14250 13814 22793 22578 15054 25161 20994 25215 15929 10620 28328 25650
11116B5650j6593p28K901j3127p73M418l296Q520M992j013j6086j2636j001J879
$$ 25650 9057 8329 11230 -1897 -2670 1748 -1548 6972 11964 10951 -5135 -17771 -18772 -16893
11102a6893J3703J8799P284m864J185j33j519K246l882j4201j0524J237R492R342
$$ -16893 -3190 15609 22893 18029 19214 19081 17562 19808 15926 1725 -8799 -7562 1930 11272
11088A1272K5474J860o848j252M969M93k851J0886M574L847j1216j2775p239k909
$$ 11272 36746 38606 31758 30506 35475 35968 33117 44003 48577 52424 41208 28433 21194 18285
11074A8285Q426J2228L568L95l380P983k020j2802k673O728J1973l596m594J1543
$$ 18285 26711 38939 42507 42902 39522 47505 45485 32683 30010 36738 48711 45115 40521 52064
11060E2064l64k626Q985O627k0003j1598J8067j013j8217M426j4045p349J8652
$$ 52064 51700 49074 58059 64686 44683 33085 51152 50139 31922 36348 22303 14954 33606
11047C3606J6181k412n033M052o456N220M245r430r311J6568j651n798l565k720
$$ 33606 49787 47375 42342 46394 39938 45158 49403 39973 30662 47230 45579 39781 36216 33496
11033C3496M143Q62J331R12N02l487j471L52m80l918n516l84j0054P962J1843
$$ 33496 37639 38501 39832 40744 41246 37759 36288 36640 36160 32242 26726 26342 16288 24250 36093
11018C6093N805j078J395N89n473M577J438K599j6362l898J5374L0616Q561j8129
$$ 36093 41898 40820 42215 42804 37331 41908 43346 45945 29583 25685 41059 71675 80236 62107
11004F2107j0418m457j6240o4L048p133p709L041K1917J547r393p334j2848q139
$$ 62107 51689 47232 30992 30928 33976 26843 19134 22175 44092 45639 36246 28912 16064 7925
10990G925n275O790R077J035M470q204R170K472M898J3764m786r836K562N827
$$ 7925 2650 9440 18517 19552 24022 15818 24988 27460 32358 46122 41336 31500 34062 39889
10976C9889J323j5076j0685L258J6887J1958o322j5553R937K0567R473m487R551
$$ 39889 41212 26136 15451 18709 35596 47554 41232 25679 35616 56183 65656 61169 70720
10963G0720J5751K429L846l790j1784p242q557j033j0147q431J3038K311o060
$$ 70720 86471 88900 92746 88956 77172 69930 61373 60340 50193 41762 54800 57111 51051
10950E1051j3922j7181j088m380Q078K397O288O259m264j1118J480K777p392R93
$$ 51051 37129 19948 18860 14480 22558 24955 31243 37502 33238 22120 23600 26377 18985 19978
10936A9978j4170j0429o163J0851R529K051q081K240N169J419O795r10j913L299
$$ 19978 5808 -4621 -10784 67 9596 11647 3566 5806 10975 12394 19189 18279 16366 19665
10922A9665N064m818K181l021q760l337J1626k097J4827j348p234M540q119j90
$$ 19665 24729 19911 22092 19071 10311 6974 18600 16503 31330 29982 22748 27288 19169 18979
10908A8979M959k518P483j7489j2500J6576n819j0148Q521P481K25m484n674J148
$$ 18979 23938 21420 28903 11414 -1086 15490 9671 -477 8044 15525 15750 11266 5592 6740
10894F740K574R585J2105j0834j2710j0103J5845J5229M933p090k2809m338r828
$$ 6740 9314 18899 31004 20170 7460 -2643 13202 28431 33364 26274 3465 -873 -10701
10881a0701Q409N740J0122l130N218L856J487p149q012k549k927m955J0229L840
$$ -10701 -2292 3448 13570 10440 15658 19514 21001 13852 5840 3291 364 -4591 5638 9478
10867I478J7505J2630K463j1954J806k575j5198o870J714J1837K951n71J1831
$$ 9478 26983 39613 42076 30122 31928 29353 14155 7285 8999 20836 23787 23216 35047
10854C5047J0087J611q53o708r834j0825p570l874P65j26J705K101p182J3087
$$ 35047 45134 46745 45892 39184 29350 18525 10955 7081 7846 7720 9425 11526 4344 17431
10840A7431n20k106K161K338l472j146L635K04n403J356J642K475k532P595M268
$$ 17431 16911 14805 16966 19304 15832 14686 18321 18525 13122 14478 16120 18595 16063 23658 27926
10825B7926j6887r211k507r99J0659O926R399m169m66j3960K012J7047Q296k803
$$ 27926 11039 1828 -679 -1678 8981 15907 25306 21137 20671 6711 8723 25770 34066 31263
10811C1263p258p006J687p701j0662O58J39L029J0911M447q900q079J4110P013
$$ 31263 24005 16999 18686 10985 323 981 1120 4149 15060 19507 10607 2528 16638 23651
10797B3651j279k0966q302Q576J2331J3225m462m388m968q818o265J0977L129
$$ 23651 22372 1406 -6896 1680 14011 27236 22774 18386 13418 4600 -1665 9312 12441
10784A2441m68M360p429r502n5M723M934j7884j0089M347K2078J0742P240J416
$$ 12441 11973 16333 8904 -598 -653 4070 9004 -8880 -18969 -14622 7456 18198 25438 26854
10770B6854j4583q34P274l332K226O021o470P344j140j0314o588j6412M893J4847
$$ 26854 12271 11437 18711 15379 17605 23626 17156 24500 23360 13046 6458 -9954 -5061 9786
10756I786j382L02L249q864K46n7Q369j0010m430R07j2189P492K0601M655k0325
$$ 9786 8404 8706 11955 3091 3337 3280 11649 1639 -2791 -1884 -14073 -6581 14020 18675 -1650
10741a650L634R376k175k883j1653j4895n350J5156L438Q59r42J0057L957j3799
$$ -1650 1984 11360 9185 6302 -5351 -20246 -25596 -10440 -7002 -6143 -7085 2972 6929 -6870
10727f870n781k376R030J7948Q151j899O212l70p776o907k3542L023J2139J3288
$$ -6870 -12651 -15027 -5997 11951 20102 18203 24415 24045 16269 9362 -14180 -11157 982 14270
10713A4270j0154m535J5854p136N192O032N508Q438L348q886j899Q12j4594j3173
$$ 14270 4116 -419 15435 8299 13491 19523 25031 33469 36817 27931 26032 26844 12250 -923
10699i23O098Q898r27j5727n70o006j0L483M461m46q206j0214K038J2604o600
$$ -923 5175 14073 13146 -2581 -3151 -9157 -9167 -5684 -1223 -1669 -9875 -20089 -18051 -5447 -12047
10684a2047J306J1357O123J953j0415n543O272J2206K156M241j5408k610M237
$$ -12047 -10741 616 6739 8692 -1723 -7266 -994 11212 13368 17609 2201 -409 3828
10671C828J5622J0149N68l222n129l4j5690K797J0495J2637K806m719j9241l275
$$ 3828 19450 29599 30167 26945 21816 21782 6092 8889 19384 32021 34827 30108 10867 7592
10657G592J7183J024j5338k5775l400l503J5657M251q067P583L718M802M411J054
$$ 7592 24775 25799 10461 -15314 -18714 -22217 -6560 -2309 -10376 -2793 925 5727 10138 11192
10643A1192j115k760l715J3052J783j5600k707L281L917k403j7018J0871J3903
$$ 11192 10077 7317 3602 16654 18437 2837 130 3411 7328 4925 -12093 -1222 12681
10630A2681m232j3141k212J1739R76L196K166n077j7343R89J8978L672P352N180
$$ 12681 8449 -4692 -6904 4835 5811 9007 11173 6096 -11247 -10258 8720 12392 19744 24924
10616B4924K02n902j3336J295O311j0383m679M684j846K561l477m318M843K503
$$ 24924 25126 19224 5888 7183 13494 3111 -1568 3116 1270 3831 354 -3964 879 3382
10602C382o513j280j912n695Q293K663m172M939j4548l256J2319O394j037L167
$$ 3382 -3131 -4411 -6323 -12018 -3725 -1062 -5234 -295 -14843 -18099 -5780 614 -423 2744
10588B744J610L0k601J8845P483k3692r010R393Q039L633l658P2O392o531N116
$$ 2744 4354 4384 1783 20628 28111 4419 -4591 4802 12841 16474 12816 12888 19280 12749 17865
10573A7865l193j4732p312n850J4111o98K125L037M391J1202l127k791N293J6498
$$ 17865 14672 -60 -7372 -13222 889 191 2316 5353 9744 20946 17819 15028 20321 36819
10559C6819r472o751j0070n82O429r771o500p631L020o617q231L48k513O111k789
$$ 36819 27347 20596 10526 9944 16373 6602 102 -7529 -4509 -11126 -19357 -19009 -21522 -15411 -18200
10544a8200K059Q658M071m842m761O093M303j9461N8L1p62L422P43L379j4023
$$ -18200 -16141 -7483 -3412 -8254 -13015 -6922 -2619 -22080 -22022 -21991 -22753 -19331 -18588 -15209 -29232
10529b9232L517J3481L660o743Q877J7943j4918j3338J0104J1263n149L765K534
$$ -29232 -25715 -12234 -8574 -15317 -6440 11503 -3415 -16753 -6649 4614 -535 3230 5764
10516E764R11k56m317k934L94J2847Q150j2137n376J1811q600K075R466J792n640
$$ 5764 6675 6419 2102 -832 -438 12409 20559 8422 3046 14857 6257 8332 17798 19590 13950
10501A3950m158o766j4250J1639O215N798k021m802r883K374J6412O659l945r063
$$ 13950 9792 3026 -11224 415 6630 12428 10407 5605 -4278 -1904 14508 21167 17222 8159
10487H159N197o459o903R119J6706o037j7773q354J4611J1956j4981j1078J3828
$$ 8159 13356 6897 -6 9113 25819 19782 2009 -6345 8266 20222 5241 -5837 7991
10474G991J048o269j2577q45M872J0933O87J5286q136r990J2338J3702j4865k1154
$$ 7991 9039 2770 -9807 -10652 -5780 5153 5840 21126 12990 3000 15338 29040 14175 -6979
10460f979k647J2918m916M323R907m554j3034r557p994J022J4041L847K756R520
$$ -6979 -9626 3292 -1624 2699 12606 8052 -4982 -14539 -22533 -21511 -7470 -3623 -867 8653
10446H653r264n739n787M416Q136m646J1632N36n063j4990q379L285R579J2535
$$ 8653 -611 -6350 -12137 -7721 415 -4231 7401 7937 2874 -12116 -20495 -17210 -7631 4904
10432D904J4371N283r040k192k186j4562n12J987L105M144m44J033L313l458L402
$$ 4904 19275 24558 15518 13326 11140 -3422 -3934 -1947 1158 5302 4858 5891 9204 5746 9148
10417I148J3473J1168M078k3173j2420r884R300R618J868j198r914j2444J231
$$ 9148 22621 33789 37867 14694 2274 -7610 1690 11308 13176 11978 2064 -10380 -9149
10404i149n941M247L56p638J4729J7256o193p866P618n60j3787K315k788r689
$$ -9149 -15090 -10843 -10487 -18125 -3396 13860 7667 -199 7419 6859 -6928 -4613 -7401 -17090
10390a7090O132K439L376k239m854p952J5760J8020k68L272n711k205L962o647
$$ -17090 -10958 -8519 -5143 -7382 -12236 -20188 -4428 13592 13324 16596 10885 8680 12642 5995
10376E995r146p573L045n213r006O230J9430m414n862j762r208P290O093K557
$$ 5995 -3151 -10724 -7679 -12892 -21898 -15668 3762 -652 -6514 -8276 -17484 -10194 -4101 -1544
10362a544j0860P206K060O256N376n029j461J816P949j3761o036j945L631j0660
$$ -1544 -12404 -5198 -3138 3118 8494 3465 2004 3820 11769 -1992 -8028 -9973 -6342 -17002
10348a7002N616J1741j2030q371L21J7107K3970O038j3756q410r58R748J624Q78
$$ -17002 -11386 355 -11675 -20046 -19725 -2618 21352 27390 13634 5224 4266 14014 15638 16516
10334A6516r01j9911j4282J2508l793r782J2012K0114Q554j2408j0611P376M036
$$ 16516 15615 -4296 -18578 -6070 -9863 -19645 -7633 12481 21035 8627 -1984 5392 9428
10321I428j0743j373L97L514Q907j295l417R85n911j1700N049P664q607j1750
$$ 9428 -1315 -2688 -2291 1223 10130 8835 5418 6403 492 -11208 -6159 1505 -7102 -18852
10307a8852J3660R146Q593P461Q856o595J054j162j5609o939N41o315J0146O764
$$ -18852 -5192 3954 12547 20008 28864 22269 23323 22161 6552 -387 154 -6161 3985 10749
10293A0749n95M747J2335k413P968j126j7116J0604j1956j726k430l128j966l720
$$ 10749 10154 14901 27236 24823 32791 31665 14549 25153 13197 11471 9041 5913 3947 227
10279B27O466k326P93k222M128n763j5665N805Q963J2071O524q045j4194m266
$$ 227 6693 4367 5160 2938 7066 1303 -14362 -8557 406 12477 19001 10956 -3238 -7504
10265g504J2684M91j0128j5174O491J7225j493R131n877n856n147j2708Q022M139
$$ -7504 5180 5671 -4457 -19631 -13140 4085 2592 11723 5846 -10 -5157 -17865 -9843 -5704
10251e704O656J5760k421j1316O1j4467j7167r435k1471J876K0927K6184J6545
$$ -5704 952 16712 14291 2975 3036 -11431 -28598 -38033 -59504 -57628 -36701 -10517 6028
10238F028p382r541n591O864J3250Q450O388j4652l731n068k550J7268J3616n90
$$ 6028 -1354 -10895 -16486 -9622 3628 12078 18466 3814 83 -4985 -7535 9733 23349 22759
10224B2759k817o39J1283o44j2872j2020R262L571J0350O336n087J2103P973n545
$$ 22759 19942 19303 30586 29942 17070 5050 14312 17883 28233 34569 29482 41585 49558 44013
10210D4013j2125r958p081j2633K838L264m668k471n082j2360M802K1811p77K107
$$ 44013 31888 21930 14849 2216 5054 8318 3650 1179 -3903 -16263 -11461 10350 9573 11680
10196A1680K679K964j1169j3556J1959J2239K990P962J9149n632j7640j1705p638
$$ 11680 14359 17323 6154 -7402 4557 16796 19786 27748 46897 41265 23625 11920 4282
10183D282N237J1693Q532k462j3831r755k2007o612J6331J5095N86p217Q400L399
$$ 4282 9519 21212 29744 27282 13451 3696 -18311 -24923 -8592 6503 7089 -128 8272 11671
10169A1671M542l713q460L286m54l834q39N009r323p375q340p690L837P212R263
$$ 11671 16213 12500 4040 7326 6872 3038 2199 7208 -2115 -9490 -17830 -25520 -21683 -14471 -5208
10154e208J2329Q401j3477l726J7173R715J553k957r237M791J6510K243K212k976
$$ -5208 7121 15522 2045 -1681 15492 25207 26760 23803 14566 19357 35867 38110 40322 37346
10140C7346n730J0522Q498j2096J432M434j775k0268n617N503l462k849O005J3371
$$ 37346 31616 42138 50636 38540 39972 44406 42631 22363 16746 22249 18787 15938 21943 35314
10126C5314J905m257p861p177P42q71p772j4540n823k610m800l748P248J75O679
$$ 35314 37219 32962 25101 17924 18666 17795 10023 -4517 -10340 -12950 -17750 -21498 -14250 -14075 -7396
10111g396N639J0854L265l875p263j369K967k690o372q403J8963J8118l470p113
$$ -7396 -1757 9097 12362 8487 1224 -145 2822 132 -6240 -14643 4320 22438 18968 11855
10097A1855M284O013o108j5931m004n537q934J007Q443K826l055K950N476R937
$$ 11855 16139 22152 16044 113 -3891 -9428 -18362 -17355 -8912 -6086 -9141 -6191 -715 9222
10083I222Q486j3658p305M896M743j0206j243j2247J3934J8638Q603Q859j0063
$$ 9222 17708 4050 -3255 1641 6384 -3822 -5065 -17312 -3378 15260 23863 32722 22659
10070B2659o475j1129l611j0938o874N460J1606J4635L802j1558P85J8506o164
$$ 22659 16184 5055 1444 -9494 -16368 -10908 698 15333 19135 7577 8362 26868 20704
10057B0704j5060J5220J1528j8497j348J4988j7485j4968L254J9963J22o257l594
$$ 20704 5644 20864 32392 13895 12547 27535 10050 -4918 -1664 18299 18421 12164 8570
10044H570k036L641J395k411M547O690R683Q085K868l696m213Q759n751N853R801
$$ 8570 6534 10175 11570 9159 13706 20396 30079 38164 41032 37336 33123 41882 36131 41984 51785
10029E1785m187j0919k2654j4448J0766R707k755m268o751N23J70p294l547p867
$$ 51785 47598 36679 14025 -423 10343 20050 17295 13027 6276 6799 6969 -325 -3872 -11739
10015a1739M843L841q276N193J0392K021J314K810J2388L685J2557m81m380K296
$$ -11739 -6896 -3055 -11331 -6138 4254 6275 7589 10399 22787 26472 39029 38548 34168 36464
10001C6464p16p603p322j5003l744k129m092M434J8737j8869l573p408j816N661
$$ 36464 35748 28145 20823 5820 2076 -53 -4145 289 19026 157 -3416 -10824 -12640 -6979
9987f979O982M40k461R274J86j310J1327O463L167k213k56M737P810M506j2244
$$ -6979 3 443 -2018 7256 7442 6132 17459 23922 27089 24876 24620 29357 37167 41673 29429
9972B9429j6308K335Q339j4872p391j9554L442K0569N990N085L855Q161m478p410
$$ 29429 13121 15456 23795 8923 1532 -18022 -14580 5989 11979 17064 20919 29080 24602 17192
9958A7192P132J0110P404o64l811r905J590P81o976j568M186l620O236k225M041
$$ 17192 24324 34434 41838 41174 37363 27458 29048 29829 22853 21285 25471 21851 28087 25862 29903
9943B9903J5371J691J579q837J1528O327o107O608J227p457j8958j9584k948J709
$$ 29903 45274 46965 48544 39707 51235 57562 51455 58063 59290 51833 32875 13291 10343 12052
9929A2052j393K014K781n894Q290O348o394j223N268k225N04Q25l306N336k956
$$ 12052 10659 12673 15454 9560 17850 24198 17804 16581 21849 19624 20128 20953 17647 22983 20027
9914B0027R197l334p719l591K0700k613j8196N10M832J673O19n195K6721J1575
$$ 20027 29224 25890 18171 14580 35280 32667 14471 14981 19813 21486 22105 16910 43631 55206
9900E5206j7096p038L563K135j1171j9655L160O334L425Q585Q922O510j243m112
$$ 55206 38110 31072 34635 36770 25599 5944 9104 15438 18863 27448 36370 42880 41637 37525
9886C7525m935k688r404K910q29l489Q376R045M759P996j0654j3746m767J0015
$$ 37525 32590 29902 20498 23408 22579 19090 27466 36511 41270 49266 38612 24866 20099 30114
9872C0114J663O073o077j0482k254K039k1545m621P014J0930J4104J2869O513
$$ 30114 31777 37850 31773 21291 19037 21076 -469 -5090 1924 12854 26958 39827 46340
9859D6340j351j6395M38L720o632k757J0841N637K598M316j1066j3836o112J740
$$ 46340 44989 28594 29032 32752 26120 23363 34204 39841 42439 46755 35689 21853 15741 17481
9845A7481N327K130J3497J1876J197R270o253N132Q69j6993m080J2366J706m758
$$ 17481 22808 24938 38435 50311 51508 60778 54525 59657 60526 43533 39453 51819 53525 48767
9831D8767j1514p551q694j0240K18O72R045L409M889P59k547p423O44j611K4o020
$$ 48767 37253 29702 21008 10768 10986 11658 20703 24112 29001 29760 27213 19790 20434 18823 18847 12827
9815A2827J1008j61P384m228p994m451J9807M511Q502M201l874J117r007n164
$$ 12827 23835 23674 31058 26830 18836 14385 34192 38703 47205 51406 47532 48649 39642 34478
9801C4478j8211K308J2995N24O960Q287m567m781r554j3123J0644K433K490j008
$$ 34478 16267 18575 31570 32094 39054 47341 42774 37993 28439 15316 25960 28393 30883 29875
9787B9875Q090O4o78J1727R945K621p518j4958j5358r909J5831L364r497N318
$$ 29875 37965 38029 37351 49078 59023 61644 54126 39168 23810 13901 29732 33096 23599 28917
9773B8917L168N641j688n419p537q174N462R768L618p940q89J0655L600l052J313
$$ 28917 32085 37726 36038 30619 23082 14908 20370 30138 33756 25816 24927 35582 39182 36130 37443
9758C7443o752J119P041M488j956k873q104K018O58j0759p757o173J4895J9521
$$ 37443 30691 31810 38851 43339 41383 38510 30406 32424 33082 22323 14566 8393 23288 42809
9744D2809m904P58M291j2482o409J0699O863m432P785j609j3223N70n116q390
$$ 42809 37905 38663 42954 30472 24063 34762 41625 37193 44978 43369 30146 30716 25600 17210
9730A7210L274J315O169L91M151N194j402L992K790j4938R009J596N761Q331Q272
$$ 17210 20484 21799 27968 28359 32510 37704 36302 40294 43084 28146 37155 38751 44512 52843 61115
9715F1115r705j0615j1427Q122P068j3958j4813j710N261n418P268R642l048k393
$$ 61115 51410 40795 29368 37490 44558 30600 15787 14077 19338 13920 21188 30830 27782 25389
9701B5389J0952O57j779N279k924k0864j0552J3190R521J7460J4512j872m381
$$ 25389 36341 36998 35219 40498 37574 16710 6158 19348 28869 46329 60841 58969 54588
9688E4588j6096o793M903o872J0301O354l671j0993n516M014J0033l581R005J779
$$ 54588 38492 31699 36602 29730 40031 46385 42714 31721 26205 30219 40252 36671 45676 47455
9674D7455k670J0242L112m721o222q688n148l025n202M727K486J2679K210O56
$$ 47455 44785 55027 58139 53418 47196 38508 33360 30335 25133 29860 32346 45025 47235 47891
9660D7891k463j1918O586O615K438n397r4J7632M263n450n950M97M264m721R597
$$ 47891 45428 33510 40096 46711 49149 43752 43658 61290 65553 60103 54153 54650 58914 54193 63790
9645F3790R506l450j0683q102n638r900R191K0446m494k601j2269r789J4081m517
$$ 63790 73296 69846 59163 51061 45423 35523 44714 65160 60666 58065 45796 36007 50088 45571
9631D5571q174N614K463K57k75J6446j941j2003j1978m450J4352Q901O820o760
$$ 45571 37397 43011 45474 45731 45456 61902 59961 47958 35980 31530 45882 54783 61603 54843
9617E4843j6521r18L636j461L208J5857O708n805J0338o797R367k724k0316J0771
$$ 54843 38322 37404 41040 39579 42787 58644 65352 59547 69885 63088 72455 69731 49415 60186
9603F0186J5039J0538p673r606r170n432K277P147J3877j0563j1367p272N116
$$ 60186 75225 85763 78090 68484 59314 53882 56159 63306 77183 66620 55253 47981 53097
9590E3097k5r953J1818J2951K317n518p229l147q379j730O699J2394R091M178
$$ 53097 53072 43119 54937 67888 70205 64687 57458 54311 45932 44202 50901 63295 72386 76564
9576G6564M490r437j0922k255R559m915j114m899p026J3539J1618q178p879N192
$$ 76564 81054 71617 60695 58440 67999 63084 61970 57071 50045 63584 75202 67024 59145 64337
9562F4337j111q70k200r369n379n335M832Q214J121q19M087o747o684Q735n202
$$ 64337 63226 62356 60156 50787 45408 40073 44905 53119 54240 53421 57508 50761 44077 52812 47610
9547D7610j4071M982P442N109O237R095P96N84j8015j405o695l598k207P816N468
$$ 47610 33539 38521 45963 51072 57309 66404 67200 67784 49769 48364 41669 38071 35864 43680 49148
9532D9148J4549Q468M042l827K712Q21m048K031n486j636J2439P348n945p566
$$ 49148 63697 72165 76207 72380 75092 75913 71865 73896 68410 66774 79213 86561 80616 73050
9518G3050m485O270L997p332J4618R510q022q427j7707n590Q654K0810k667L073
$$ 73050 68565 74835 78832 71500 86118 95628 87606 79179 61472 55882 64536 85346 82679 85752
9504H5752J2102r464R784j1091j1002K094m07l677N173k451K1859k641p701L57
$$ 85752 97854 88390 98174 87083 76081 78175 77768 74091 79264 76813 98672 96031 88330 88687
9490H8687l06r535k01P225l99j1799p958Q605J1867R642j0992m113M047n804N066
$$ 88687 88381 78846 78645 85870 85471 73672 65714 74319 86186 95828 84836 80723 84770 78966 84032
9475H4032p662k728P082J0775k542Q374J0400j6766q037o07K2M649k213j2730
$$ 84032 76370 73642 80724 91499 88957 97331 107731 90965 82928 82321 82343 86992 84779 72049
9461G2049o502K875O945M607j038k182J1422O821N209M652N88N432m977k332J810
$$ 72049 65547 68422 75367 79974 78936 76754 88176 94997 100206 104858 105446 110878 105901 103569 105379
9446A05379q476J183k014l940N948k85j713Q288J4515o091j1402L496j2534m109
$$ 105379 96903 98086 96072 92132 98080 97795 96082 104370 118885 112794 101392 104888 92354 88245
9432H8245j021j466J3845k728o697k190O282L200r84L415p180Q948L878N383J4982
$$ 88245 87224 85758 99603 96875 90178 87988 94270 97470 96486 99901 92721 101669 105547 110930 125912
9417A25912J0093q514j7788k463R825j0725j1123j558M596P35j0192j1050j931
$$ 125912 136005 127491 109703 107240 117065 106340 95217 93659 98255 98990 88798 77748 75817
9404G5817l144n937J2248L5109L1664J9704Q230j2230j2060J3372M502k039j3890
$$ 75817 72673 66736 78984 114093 145757 165461 173691 161461 149401 162773 167275 165236 151346
9391A51346r047O328r152M011J0137q19L635P79Q622q237j7510j0051R860O244
$$ 151346 142299 148627 139475 143486 153623 152804 156439 157218 165840 157603 140093 130042 139902 146146
9377A46146l93R136k8P383J1098R320n235q129p936J1190J5319J3432J6358J8958
$$ 146146 145753 154889 154861 162244 173342 182662 177427 169298 161362 172552 187871 201303 217661 236619
9363B36619J1894K1083K8159K8660M2689L3717K6856M0059N6592R8354J20792
$$ 236619 248513 269596 297755 326415 369104 402821 429677 469736 526328 624682 745474
9352G45474J47206J63576J81999J77215J68152J29771P9600L4323l8388r9217
$$ 745474 892680 1056256 1238255 1415470 1583622 1713393 1792993 1827316 1788928 1689711
9342A689711j28552j83648j91928j85062j65551j23737r9215q5378p2019m6528
$$ 1689711 1561159 1377511 1185583 1000521 834970 711233 612018 526640 454621 408093
9332D08093j9193l0846j7703l0718k7121j7322j6192p631j0811n289k0434j1914
$$ 408093 388900 358054 340351 309633 282512 265190 248998 241367 230556 225267 204833 192919
9320A92919k572O327o967j0235r095o542J0146J4717r465q237J426m328l478J209
$$ 192919 190347 196674 189707 179472 170377 163835 173981 188698 179233 170996 172422 168094 164616 165825
9306A65825J3886k050p124l403J7582p447p49M426J0848m535j3000m448M149m026
$$ 165825 179711 177661 170537 167134 184716 177269 176520 180946 191794 187259 174259 169811 173960 169934
9292A69934L711J691P287P166k0M538j823J1720P151j5666o123O798k881K599
$$ 169934 173645 175336 182623 189789 189769 194307 192484 204204 211355 195689 189566 196364 193483 196082
9278A96082M244q706j5157Q680J0340m350l175J1335J5463J0941Q008K594p768
$$ 196082 200326 191620 176463 185143 195483 191133 187958 199293 214756 225697 233705 236299 228531
9265B28531j010j068r484p759j241J6327J5136j822K949P1o584N822p736k5616
$$ 228531 227521 226453 216969 209210 207969 224296 239432 237610 240559 240630 234046 239868 232132 206516
9251B06516k9811m1223j6352J1691o264k200N610P095J523O897Q56O829l61M647
$$ 206516 176705 135482 119130 130821 124557 122357 127967 135062 136585 143482 144338 151167 150806 155453
9237A55453J6913m567J0710R674O809o307L794J2849N789L695J4474L628J0773
$$ 155453 172366 167799 178509 188183 194992 188685 192479 205328 211117 214812 229286 232914 243687
9224B43687n515J0252J8289L988M266N485J0925K0125K5648J3989M415p88o721
$$ 243687 238172 248424 266713 270701 274967 280452 291377 311502 337150 351139 355554 354766 348045
9211C48045k514l372o910j9180K466J2971K2568N248j8092P42l952J2791Q046
$$ 348045 345531 342159 335249 316069 318535 331506 354074 359322 341230 341972 338020 350811 358857
9198C58857r321J0043O758M83J1697r207r557j2245j425j2574j0940n603n789
$$ 358857 349536 359579 366337 366820 378517 369310 359753 347508 346083 333509 322569 316966 311177
9185C11177k8934q490Q257J0206O684R040n674j6200l97J4319j199P594J6384
$$ 311177 282243 273753 282010 292216 298900 307940 302266 286066 285669 299988 298789 306383 322767
9172C22767M714M24j920j1090p945Q08K838J372L709J0706K2017J3477L90N137
$$ 322767 327481 327905 325985 314895 306950 307758 310596 311968 315677 326383 348400 361877 362267 367404
9158C67404q519j1839k6803n206j7917j0817J8139R569n668J2040J1061J3570
$$ 367404 358885 347046 320243 315037 297120 286303 304442 314011 308343 320383 331444 345014
9146C45014j464l97r630m044q6o340k4414j1005J767J3457J5159K7472J0559K0926
$$ 345014 343550 343153 333523 329479 329393 323053 298639 287634 289401 302858 318017 345489 356048 376974
9132C76974L8888M9651K7990K0202N712J7813P437n315p311j6880j4063o623p179
$$ 376974 415862 465513 493503 513705 519417 537230 544667 539352 532041 515161 501098 494475 487296
9119D87296M353L829k307j255P177M405J3137J4988J6170J2508Q438j851j1409
$$ 487296 491649 495478 493171 491916 499093 503498 516635 531623 547793 560301 568739 566888 555479
9106E55479J559m67n604j6721j8068l9642n1471o9782p9271l7084k782J7465L4644
$$ 555479 557038 556571 550967 534246 516178 476536 425065 355283 276012 238928 236146 253611 288255
9093B88255L6087K9891L8554N8890N9404M1587M2881L1516L0415L2317K2373K2731
$$ 288255 324342 354233 392787 451677 511081 552668 595549 627065 657480 689797 712170 734901
9081G34901J4210k4508l0867r268J9495J7246j6026J0505L8223R0296J24041J00659
$$ 734901 749111 724603 693736 684468 703963 721209 705183 715688 753911 844207 968248 1068907
9069A068907L5201m6805p0311o1672l6030m0565k0147O446J7232J801j2955j2362
$$ 1068907 1104108 1057303 986992 925320 889290 848725 828578 835024 852256 854057 841102 828740
9057H28740N720J7330J2683M692N496l574R241K0454J9929K2510J8673M746J1654
$$ 828740 834460 851790 864473 869165 874661 871087 880328 900782 920711 943221 961894 966640 978294
9044I78294n467p425Q486K1705P747m326K4904L6602K0654K2270M549k359M309
$$ 978294 972827 965402 973888 995593 1003340 999014 1023918 1060520 1081174 1103444 1107993 1105634 1109943
9031A109943J1725L2038K1793K1658J3951L3103L6047L6745M0675N2454Q2059
$$ 1109943 1121668 1153706 1175499 1197157 1211108 1244211 1280258 1317003 1357678 1410132 1492191
9020A492191R2197P9469Q1615O9978Q1968Q0119P9441J01488J43133J84828K39031
$$ 1492191 1584388 1663857 1745472 1815450 1897418 1977537 2056978 2158466 2301599 2486427 2725458
9009B725458K84397L22151L75221M20394M61002M87969M60504L40925J66515j8856
$$ 2725458 3009855 3332006 3707227 4127621 4588623 5076592 5537096 5878021 6044536 6025680
8999F025680j70661k52658k93165k75785k33470j91574j49719j27840j16521j15994
$$ 6025680 5855019 5602361 5309196 5033411 4799941 4608367 4458648 4330808 4214287 4098293
8989D098293j09092n0561J3341N2529J06706J32584J24331J56695J96545K15062
$$ 4098293 3989201 3938640 3951981 4004510 4111216 4243800 4368131 4524826 4721371 4936433
8979D936433K41161K99577L36301L34866L49025M29281M93281N57068O70585P81115
$$ 4936433 5177594 5477171 5813472 6148338 6497363 6926644 7419925 7976993 8647578 9428693
8969I428693Q78498J026797J285289J624326J951656K291205K654931L087632
$$ 9428693 10307191 11333988 12619277 14243603 16195259 18486464 21141395 24229027
8961B4229027L592659M222859M912096N557047O761667R464224J4311351K1395260
$$ 24229027 27821686 32044545 36956641 42513688 49275355 58739579 73050930 94446190
8953I4446190L0542814M2521751N8244564P7070750R6027863J01432410N4215013
$$ 94446190 124989004 167510755 225755319 302826069 398853932 500286342 554501355
8946E54501355m6887123j19345325j18205797q3318355n2684657l3214567k1603076
$$ 554501355 507614232 388268907 270063110 186744755 134060098 100845531 79242455
8939G9242455j4715952j0478536p684132n641926m138432l268156l123710l384415
$$ 79242455 64526503 54047967 46363835 40721909 36583477 33315321 30191611 26807196
8931B6807196l401867k971851k396965j950621j598790j338391j132043r63260
$$ 26807196 23405329 20433478 18036513 16085892 14487102 13148711 12016668 11053408
8923A1053408q01783o68626n91808n20983m26820l80051l31640k42130j89369
$$ 11053408 10251625 9582999 8991191 8470208 8043388 7663337 7331697 7089567 6900198
8914F900198j55115j19685o3659j8990n1886j91645l06525l06174k70824k44383
$$ 6900198 6745083 6625398 6561739 6542749 6490863 6299218 5992693 5686519 5415695 5171312
8904E171312k15474j75408j34999r4734m6922k4102k0133o971m643q677J5875
$$ 5171312 4955838 4780430 4645431 4550697 4503775 4479673 4459540 4452569 4447926 4439249 4455124
8893D455124m803k2490j7283l615O175J3270K450L4184L4959L6839M1719M8241
$$ 4455124 4450321 4427831 4410548 4406933 4413108 4426378 4428828 4463012 4497971 4534810 4576529 4624770
8881D624770K7059K7626J4765J1901L4580O8221P7350P3142O9430P3042O5413
$$ 4624770 4651829 4679455 4694220 4706121 4740701 4808922 4886272 4959414 5028844 5101886 5167299
8870E167299P6138P4146N6432N4998N7836N6767P1754M9861M8672O5300Q0310
$$ 5167299 5243437 5317583 5374015 5429013 5486849 5543616 5615370 5665231 5713903 5779203 5859513
8859E859513P3896P5880P6872P7114Q4609O2588N4685O2099O2588O1358P5597
$$ 5859513 5933409 6009289 6086161 6163275 6247884 6310472 6365157 6427256 6489844 6551202 6626799
8848F626799O8246P5478Q5783Q4490N8626O5384P2222N8311P1306P1918P3897
$$ 6626799 6695045 6770523 6856306 6940796 6999422 7064806 7137028 7195339 7266645 7338563 7412460
8837G412460Q3398O7767N6665N0113M0576N1736M8221M4679K4616K4517R265P094
$$ 7412460 7495858 7563625 7620290 7670403 7710979 7762715 7810936 7855615 7880231 7904748 7914013 7921107
8825G921107J6104M3653Q0401J07239Q5425M9938j3313l8773m3775m7778o7582
$$ 7921107 7937211 7980864 8061265 8168504 8253929 8303867 8290554 8251781 8208006 8160228 8092646
8814H092646q2067p7208n6992m7677m4513n6050p4673m7009l4069m3091n1672
$$ 8092646 8010579 7933371 7876379 7828702 7784189 7728139 7653466 7606457 7572388 7529297 7477625
8803G477625m9632l3120n2374p3792r8022j04413q4965j12652j59694j84146j65357
$$ 7477625 7427993 7394873 7342499 7268707 7170685 7066272 6981307 6868655 6708961 6524815 6359458
8792F359458j40040j10476r4976j01215r5925q6855q7220r7952j08485j02874
$$ 6359458 6219418 6108942 6013966 5912751 5816826 5729971 5642751 5544799 5436314 5333440
8782E333440r8761q9114j00119p5193o4219q7807j04080p0170p3261r3993p6989
$$ 5333440 5234679 5145565 5045446 4970253 4906034 4818227 4714147 4643977 4570716 4476723 4399734
8771D399734q4408j07799r2314q9722q5135n5519m6254m2776m1162o3082n3010
$$ 4399734 4315326 4207527 4115213 4025491 3940356 3884837 3838583 3795807 3754645 3691563 3638553
8760C638553l6683k3621m0075o2919o9390o7672n5754n7348q2317q2938n7689
$$ 3638553 3601870 3578249 3538174 3475255 3405865 3338193 3282439 3225091 3142774 3059836 3002147
8749C002147n4901n9005n5823m3797n0343l4933l1720m6188m4255n2754o2636
$$ 3002147 2947246 2888241 2832418 2788621 2738278 2703345 2671625 2625437 2581182 2528428 2465792
8738B465792n7139m2289k9284m2235n0882m6688k5998l4858k3085k7372l2988
$$ 2465792 2408653 2366364 2337080 2294845 2243963 2197275 2171277 2136419 2113334 2085962 2052974
8727B052974l1513k3357l1393k9990j9133k6831m1341k2069r982k2736k4004q193
$$ 2052974 2021461 1998104 1966711 1936721 1917588 1890757 1849416 1827347 1817365 1794629 1770625 1762432
8715A762432j8881l1860k6492l0660k4498j9078k8186l6263j1633k1563j8151
$$ 1762432 1743551 1711691 1685199 1654539 1630041 1610963 1582777 1546514 1534881 1513318 1495167
8704A495167p324j0792k3745k6474k1587j8436k6598k5429k7280k1961j5668j9169
$$ 1495167 1487843 1477051 1453306 1426832 1405245 1386809 1360211 1334782 1307502 1285541 1269873 1250704
8692A250704j5649r481q925k7774j2807o156j4138j4944k0654j3003j3528k7053
$$ 1250704 1235055 1225574 1216649 1188875 1176068 1169912 1155774 1140830 1120176 1107173 1093645 1066592
8680A066592j7926j1079q927j3250o276j3991o613r358j4957k0608l09M073j538
$$ 1066592 1048666 1037587 1028660 1015410 1009134 995143 988530 979172 964215 943607 943298 947371 945833
8667I45833l726o529l205J236j6191k0430k0571q532n382j0902J0317q902o347
$$ 945833 942107 935578 932373 933609 917418 896988 876417 867885 862503 851601 861918 853016 846669
8654H46669n234o99p104J1288J0400k3266j6328j0609r368k018j7006n3746m3511
$$ 846669 841435 840736 833632 844920 855320 832054 815726 805117 795749 793731 776725 722979 679468
8641F79468k7419k3356j4324k1541j5879K441J0504J0568k236P86K698n734r353
$$ 679468 652049 628693 614369 592828 576949 579390 589894 600462 598226 599012 601710 595976 586623
8628E86623M541l802j7403j2995k532k494l024Q20l342L921j4201j4355k089k981
$$ 586623 591164 587362 569959 556964 554432 551938 548914 549734 546392 550313 536112 521757 519668 516687
8614E16687o685O193L984O536q932j6119L74Q525N25N341J9266L4876L0402J9930
$$ 516687 510002 516195 520179 526715 517783 501664 502038 510563 511088 516429 535695 570571 600973 620903
8600F20903K7868m167n3911m5445k5120k1003O83n866k3587q802M708J28j0609
$$ 620903 648771 644604 590693 545248 520128 499125 499808 493942 470355 461553 466261 466389 455780
8587D55780J126J9117R586r781P97j2057j6019M00K032m964o183j2998P60r787
$$ 455780 456906 476023 485609 475828 476625 464568 448549 448949 450981 446017 439834 426836 427596 417809
8573D17809q319l93J909j704q845m368l586K0155J5056J7605K0995J9904L4979
$$ 417809 409490 409097 411006 409302 400457 396089 392503 412658 427714 445319 466314 486218 521197
8560E21197J8470M3321O6106Q9207J12095P3991p198j5310L7829R1265J42105
$$ 521197 539667 582988 649094 738301 850396 924387 917189 901879 939708 1030973 1173078
8549A173078J60360J74533J80868J46723J13831Q2844J2673n4074j03666j58344
$$ 1173078 1333438 1507971 1688839 1835562 1949393 2032237 2044910 1990836 1887170 1728826
8539A728826j96828j99507k01651j67888j24948j10672r5424p0411m6727j7867
$$ 1728826 1531998 1332491 1130840 962952 838004 727332 631908 561497 514770 496903
8529D96903l0335l0789l4832k3383p268j3316j7707j9719o290j7819J7451R46
$$ 496903 466568 435779 400947 377564 370296 356980 339273 319554 313264 295445 312896 313842
8517C13842j406l8J5146L413J7915L1429L0752m527m5441k8997k1226j3864j3138
$$ 313842 312436 312398 327544 330957 348872 380301 411053 406526 361085 332088 310862 296998 283860
8504B83860j1655r467n296r179r842m558L841P630K254M310K972J1198N936P679
$$ 283860 272205 262738 257442 248263 238421 233863 237704 245334 247588 251898 254870 266068 272004 279683
8490B79683M41j840Q026J732j3873j5937k2514J078K049j0418l571K811q115j2239
$$ 279683 280124 278284 286310 288042 274169 258232 235718 236796 238845 228427 224856 227667 219552 207313
8476B07313k143k618J1410L519j5572r125K00K453j6852m774J79P256M876P437
$$ 207313 205170 202552 213962 217481 201909 192784 192984 195437 178585 173811 173990 181246 186122 193559
8462A93559r003j2004n607j986j1116M542M54M2O948O505K3290O18j9520q714
$$ 193559 184556 172552 166945 164959 153843 158385 158839 158881 165829 172334 195624 196242 176722 168008
8448A68008L438J613k800r490L748J7221j3191j5571j0428j7024J301J8253J6110
$$ 168008 171446 173059 170259 160769 164517 181738 168547 152976 142548 125524 126825 145078 161188
8435A61188p798k0176m020R586q28K782k49J391n103J1251Q020M602p977l790
$$ 161188 153390 133214 129194 138780 137952 140734 140485 141876 136773 148024 156044 160646 152669 148879
8421A48879L19j501K689K225L122j5009j7882J7N955J2128M388q94J068M541l062
$$ 148879 149198 147697 150386 152611 155733 140724 122842 122859 128814 140942 145330 144436 145504 150045 146983
8406A46983p592p526N729m40J4125P689M174J076j3063j2062k452J2195l326j1448
$$ 146983 139391 131865 137594 137154 151279 158968 163142 164218 151155 139093 136641 148836 145510 134062
8392A34062j2822m93J3787R35M290r420p757J0907N457M247j2187j1592m936J4590
$$ 134062 121240 120747 134534 135469 139759 130339 122582 133489 138946 143193 131006 119414 114478 129068
8378A29068J9810O770r132k1260o082m190mj452j990j0088p374k731Q44O980K429
$$ 129068 148878 155648 146516 125256 119174 114984 114980 113528 111538 101450 94076 91345 92189 99169 101598
8363A01598r24p393N449O753j247k200l715L909j758J816j830n677o270j031J0788
$$ 101598 100674 93281 98730 105483 104236 102036 98321 102230 100472 102288 100458 94781 88511 87480 98268
8348I8268J805L476j0066N538K2594K633j7781O52J1686R73m538P369j0086m032
$$ 98268 100073 103549 93483 99021 121615 124248 106467 107119 118805 119778 115240 122609 112523 108491
8334A08491P334q478n927n334j5390o48j824Q872J497n387L386m678P473J7930
$$ 108491 115825 107347 101420 96086 80696 80048 78224 87096 88593 83206 86592 81914 89387 107317
8320A07317J1302k0328q920M554L189P625Q741o421k2223n055N902n914Q847J0157
$$ 107317 118619 98291 89371 93925 97114 104739 113480 107059 84836 79781 85683 79769 88616 98773
8306I8773n585r969n865j355M384J1488R463j0247n982J1267p431k2691O438O462
$$ 98773 93188 83219 77354 75999 80383 91871 101334 91087 85105 96372 88941 66250 72688 79150
8292G9150n045L451N332j389p805j5985r67m750J0695L609P481q893j4125N993
$$ 79150 74105 77556 82888 81499 73694 57709 56742 51992 62687 66296 73777 64884 50759 56752
8278E6752q53O872p625J897M923M099l327J1939K534O01r216j4626J1378L402
$$ 56752 55899 62771 55146 57043 61966 66065 62738 74677 77211 77812 68596 53970 65348 68750
8264F8750K420j7269K668L077n07K406M768p646L189N648j0105Q516P374k299
$$ 68750 71170 53901 56569 59646 59139 61545 66313 58667 61856 67504 57399 65915 73289 70990
8250G0990j8908o052J4214K568J583n513O1M51q654m896j2087n606J9096J5886
$$ 70990 52082 46030 60244 62812 64395 58882 58943 59394 50740 45844 33757 28151 47247 63133
8236F3133m531n23n299l099j3370q641M551J3876J8735N138r074L713p009q415
$$ 63133 58602 58079 52780 49681 36311 27670 32221 46097 64832 69970 60896 64609 57600 49185
8222D9185M874m661r829n532P622J2563J0450K75j511n170N79L976K686L749j2598
$$ 49185 54059 49398 39569 34037 41659 54222 64672 64947 63436 58266 58845 62821 65507 69256 56658
8207E6658p964N116p987j265n197N533J279j543Q216J2097L636j4949n409N967
$$ 56658 48694 53810 45823 44558 39361 44894 46173 44630 52846 64943 68579 53630 48221 54188
8193E4188L980l986k797o174o783J381k560P846o587l568j377O248R318O658j8422
$$ 54188 58168 54182 51385 45211 38428 39809 37249 45095 38508 34940 33563 39811 49129 55787 37365
8178C7365N022J2969j976j5722o052J903j5647P594M100n407P654P692r961q345
$$ 37365 42387 55356 53380 37658 31606 33509 17862 25456 29556 24149 31803 39495 29534 21189
8164B1189J1496k86R179L941K736n42R218J4531R26q26M500j2225p881K494l872
$$ 21189 32685 32399 41578 45519 48255 47713 56931 71462 72388 71562 76062 63837 55956 58450 54578
8149E4578j2755P733J1204l808j2858q949N926J980J739j4570n776Q348J1716
$$ 54578 41823 49556 60760 56952 44094 35145 41071 43051 44790 30220 24444 32792 44508
8136D4508J3645j675j5413O030k834K246J966j7644p617K386K026N897j1698K167
$$ 44508 58153 56478 41065 47095 44261 46507 48473 30829 23212 25598 27624 33521 21823 23990
8122B3990M506l737J7967k729O19j018R740N207j484j5135J224K4672l665j5900
$$ 23990 28496 24759 42726 39997 40616 39598 49338 54545 53061 37926 39150 63822 60157 44257
8108D4257M077n393L758j08n852j2876J0548J3101k706J5340l666J309N544k3597
$$ 44257 48334 42941 46699 46591 40739 27863 38411 51512 48806 64146 60480 61789 67333 43736
8094D3736j3580J4058P736L204j450J20j4702q225j331p501o101l037J0712K940
$$ 43736 30156 44214 51950 55154 53704 53824 39122 30897 29566 22065 15964 12927 23639 26579
8080B6579j2583L642M344k47O642J3285Q032q916l306Q15o69l34Q953m210J019
$$ 26579 13996 17638 21982 21735 28377 41662 49694 40778 37472 38287 37618 37284 46237 42027 43046
8065D3046j6971j38J551m207r69l178N299J0835M566L776N529j724q618o394R380
$$ 43046 26075 25937 27488 23281 22312 19134 24433 35268 39834 43610 49139 47415 38797 32403 41783
8050D1783K66r751j1257M658q018p540N903M866J3403o439j5064P021N028R480
$$ 41783 42049 32298 21041 25699 17681 10141 16044 20910 34313 27874 12810 19831 24859 34339
8036C4339r273J1914N645j2862P318J316J097q994j751P228J4334r496o347j0895
$$ 34339 25066 36980 42625 29763 37081 38397 39494 30500 28749 35977 50311 40815 34468 23573
8022B3573J0339K3765K196j1140j2011K596m241J880p879q133J201n22M945L33
$$ 23573 33912 57677 59873 48733 36722 39318 35077 36957 29078 20945 22146 21624 26569 26902
8008B6902J2481m427n004N651j0348m509J0351J1829K515j6994l334L750R369
$$ 26902 39383 34956 29952 35603 25255 20746 31097 42926 45441 28447 25113 28863 38232
7995C8232o00r947o741J0478K256q05L718j9379j5268R38K0535J2323P01q540
$$ 38232 37632 27685 20944 31422 33678 32873 36591 17212 1944 2882 23417 35740 36441 27901
7981B7901o538n457q130j021J3782O378n642l438J215M889K935M736L08J406J1723
$$ 27901 21363 15906 7776 6755 20537 26915 21273 17835 19050 23939 26874 31610 31918 33324 45047
7966D5047R306j952k1085l224p450O305J933N749J968m087P34R256M228k599j0835
$$ 45047 54353 52401 31316 28092 20642 26947 28880 34629 36597 32510 33244 42500 46728 44129 33294
7951C3294J1628p20m986l373J0316j1429l938K40J005j1258m534L766O14M004
$$ 33294 44922 44202 39216 35843 46159 34730 30792 31032 32037 20779 16245 20011 20625 24629
7937B4629R018L806M377o845K375k348L956o189k949M890L245M236J5240r865
$$ 24629 33647 37453 41830 34985 37360 35012 38968 32779 29830 34720 37965 42201 57441 47576
7923D7576j2331o015J6594K842j3425m167k564K40O806o925p45J5154P939n454
$$ 47576 35245 29230 45824 48666 35241 31074 28510 28750 35556 28631 27886 43040 50979 45525
7909D5525j2003o717r415P835M945M020L048p436m715o416J417K0459k583j2086
$$ 45525 33522 26805 17390 25225 30170 34190 37238 29802 25087 18671 20088 40547 37964 25878
7895B5878J431n875M950J4891J1993K235p690o439j1863j5929Q24J3385k473r221
$$ 25878 27309 21434 26384 41275 53268 55503 47813 41374 29511 13582 14406 27791 25318 16097
7881A6097p79P756j522k449O857K408k03q116j008q43r875o245k488R136o382
$$ 16097 15318 23074 21552 19103 25960 28368 28165 20049 19041 18198 8323 2078 -410 8726 2344
7866B344P170K2143R62r004l600j0620K096j160j672q704m535N813N394j754l274
$$ 2344 9514 31657 32619 23615 20015 9395 11491 10331 8659 -45 -4580 1233 6627 4873 1599
7851A599J572P054Q420K275j2347l379m911r666R295N538j027K981Q191J3560
$$ 1599 3171 10225 18645 20920 8573 5194 283 -9383 -88 5450 4423 7404 15595 29155
7837B9155r578k0119j6618J1594J4035J2796k232j6399j785J0484L814Q180k24
$$ 29155 19577 -542 -17160 -5566 8469 21265 19033 2634 849 11333 15147 23327 23103
7824B3103j1661j2556j3633k662O011K0500J711J1520j531O072J5669p281j4306
$$ 23103 11442 -1114 -14747 -17409 -11398 9102 10813 22333 20802 26874 42543 35262 20956
7811B0956R788q937k787q381J4825J0516J2118j3453n402j1286n142L168M849
$$ 20956 30744 21807 19020 10639 25464 35980 48098 34645 29243 17957 12815 15983 20832
7798B0832J1313L803P728q11p904k6363j1926O30M200M088N939K583j841j658
$$ 20832 32145 35948 43676 42865 34961 8598 -3328 -2698 1502 5590 11529 14112 12271 10613
7784A0613J7984N195j2684j2897P13M446m755j8547n759J0395P345N125l822N731
$$ 10613 28597 33792 21108 8211 8924 13370 8615 -9932 -15691 -5296 2049 7174 3352 9083
7770I083j970j2053m265J2742K257J2834o219j9553K752J4024R060m056N081j2238
$$ 9083 7113 -4940 -9205 3537 5794 18628 12409 -7144 -4392 9632 18692 14636 19717 7479
7756G479q534J023J1744J0296m196m755n53o79J435p081q690l785N452J259J0168
$$ 7479 -1055 -32 11712 22008 17812 13057 12504 11825 13260 6179 -2511 -6296 -844 415 10583
7741A0583N669q324q989n261J5804l007p583j880J8319K554J323j0881m480o491
$$ 10583 16252 7928 -1061 -6322 9482 6475 -1108 -2988 15331 17885 19208 8327 3847 -2644
7727b644l975N856r495K069Q361O43Q29M397j1172j1133j58K339P928J5929k178
$$ -2644 -6619 -763 -10258 -8189 172 815 1644 6041 -5131 -16264 -16422 -14083 -6155 9774 7596
7712G596o660O459Q679K692o460j1063o930Q926Q940J0583j5032j4174J5569J1933
$$ 7596 936 7395 16074 18766 12306 1243 -5687 3239 12179 22762 7730 -6444 9125 21058
7698B1058M696L501J4098q643j7295j1866j2268J712R825O711m000m087l239m416
$$ 21058 25754 29255 43353 34710 17415 5549 -6719 -5007 4818 11529 7529 3442 203 -4213
7684d213M006P069j0248J1956K1225J0009j34k3057j2939j2953l300J3099M761
$$ -4213 -207 6862 -3386 8570 29795 39804 39670 16613 3674 -9279 -12579 520 5281
7671E281j6875q607J3067L849j940n339p553R931J0946O884p746J1267M063M397
$$ 5281 -11594 -20201 -7134 -3285 -5225 -10564 -18117 -8186 2760 9644 1898 13165 17228 21625
7657B1625p427j3156j900O623m001N156J422J5050o328q393p110p652L419L035
$$ 21625 14198 1042 -858 5765 1764 6920 8342 23392 17064 8671 1561 -6091 -2672 363
7643C63j2613M530O546j82Q228o454q988O505R118p511o50M271J867n698m586
$$ 363 -12250 -7720 -1174 -1356 6872 418 -8570 -2065 7053 -458 -1108 3163 5030 -668 -5254
7628e254J4610J4495r195k972J725j5924j5993R958M818M179J343R389j99j4815
$$ -5254 9356 23851 14656 11684 13409 -2515 -18508 -8550 -3732 447 1790 11179 10980 -3835
7614c835m691J3628J6711p793j1188q24J69o402J056l493M748R589n562r455j5275
$$ -3835 -8526 5102 21813 14020 2832 2008 2177 -4225 -3169 -6662 -1914 7675 2113 -7342 -22617
7599b2617k573Q590N587q307P780R950k249j1700j3259J7362K816l189P831N549
$$ -22617 -25190 -16600 -11013 -19320 -11540 -1590 -3839 -15539 -28798 -11436 -8620 -11809 -3978 1571
7585A571J7527j203j1092o51N813J369n572p089k3480j1446J6001J4213J4556
$$ 1571 19098 17895 6803 6152 11965 13334 7762 673 -22807 -34253 -18252 -4039 10517
7572A0517L366j5616j851J1456L207M459J653l652m455o497q887J5241N140L87
$$ 10517 13883 -1733 -3584 7872 11079 15538 17191 13539 9084 2587 -6300 8941 14081 14468
7558A4468J249J236j1612q830k585k04l82M074q93J0034N865j8293p226j498M728
$$ 14468 15717 16953 5341 -3489 -6074 -6278 -6660 -2586 -3479 6555 12420 -5873 -13099 -14597 -9869
7543i869K519J0170N551o975m504k14O983K324l705k045q507Q37n52j1225k43
$$ -9869 -7350 2820 8371 1396 -3108 -3322 3661 5985 2280 235 -8272 -7435 -7987 -19212 -19455
7528a9455P246M464n642l303J4031j589L495O176o238P727j34q073J238k573m235
$$ -19455 -12209 -7745 -13387 -16690 -2659 -4248 -753 5423 -815 6912 6778 -1295 -57 -2630 -6865
7513f865Q223q803P779P958M5j1549r017R770R539Q890L0j4713j1009o457k952
$$ -6865 1358 -7445 334 8292 8337 -3212 -12229 -2459 7080 15970 16000 1287 -9722 -16179 -19131
7498a9131J2541l00P064R341k024p271p380p804J2700j2041n988l01J845N883
$$ -19131 -6590 -6890 174 9515 7491 220 -7160 -14964 -2264 -14305 -20293 -20594 -18749 -12866
7484a2866Q755J7088K194K320j871n41N189L252N993J5634r427k0044k584j6882
$$ -12866 -4111 12977 15171 17491 15620 15079 20268 23520 29513 45147 35720 15676 13092 -3790
7470c790j2213L765N178P4q200k311K1644N541m665n673o059q461J3511J8703
$$ -3790 -16003 -12238 -7060 -6986 -15186 -17497 4147 9688 5023 -650 -6709 -15170 -1659 17044
7456A7044N329q060j2207m279K3262M576j0132m597Q750R213j110m288n658J056
$$ 17044 22373 14313 2106 -2173 21089 25665 15533 10936 19686 28899 27789 23501 17843 18899
7442A8899m737m923r518j5859M163J016K428P783M123l931N12o036q554M091J5251
$$ 18899 14162 9239 -279 -16138 -11975 -10959 -8531 -748 3375 -556 -44 -6080 -14634 -10543 4708
7427D708o292j388L757p729l524J8971L705r216J59O318m787j831N269J0563N915
$$ 4708 -1584 -2972 785 -6944 -10468 8503 12208 2992 3151 9469 4682 2851 8120 18683 24598
7412B4598J249m896K695J2646j0840j3087k45o903j3213j36O968O507j039j84
$$ 24598 25847 20951 23646 36292 25452 12365 12120 5217 -7996 -8132 -1164 5343 4304 4120
7398D120N630k22o350p51K191j3045N223R769L631j1293J906P198r456j7249N041
$$ 4120 9750 9528 3178 2427 4618 -8427 -3204 6565 10196 -1097 809 8007 -1449 -18698 -13657
7383a3657p841p89m268O983L998Q003j111k765k052k16J460J647R681J0408J2608
$$ -13657 -21498 -22287 -26555 -19572 -15574 -7571 -8682 -11447 -13499 -13715 -12255 -10608 -927 9481 22089
7368B2089m297j3439K068K008j0776j270m01r053k576K781p049J1946J0140l505
$$ 22089 17792 4353 6421 8429 -2347 -3617 -4018 -13071 -15647 -12866 -19915 -7969 2171 -1334
7354a334Q54J4026m634k546o686m363Q163n697j3078l174J2527O494M337q319
$$ -1334 -480 13546 8912 6366 -320 -4683 3480 -2217 -15295 -18469 -5942 552 4889 -3430
7340c430j1301N547J0229P537J0291j500j2289p173r318o106m567R040N077J0114
$$ -3430 -14731 -9184 1045 8582 18873 17373 5084 -2089 -11407 -17513 -22080 -13040 -7963 2151
7326B151J1530p956n319N202R48k930p051P407J715m253j0302K755J2387K5O761
$$ 2151 13681 5725 406 5608 6556 3626 -3425 3982 5697 1444 -8858 -6103 6284 6309 13070
7311A3070L877r676q424P739J164n739N53J391n232n529p1O36K416j245Q716K047
$$ 13070 16947 7271 -1153 6586 7750 2011 2564 3955 -1277 -6806 -6877 -6241 -3825 -5070 3646 5693
7295E693n818m654j701k8J813P071O39m756j2439j0434J5989M575j0980m067l878
$$ 5693 -125 -4779 -6480 -6508 -4695 2376 3015 -1741 -14180 -24614 -8625 -4050 -15030 -19097 -22975
7280b2975M364R859j603J2305k830j3365p633J5088P895q210L566N769J3454r606
$$ -22975 -18611 -8752 -10355 1950 -880 -14245 -21878 -6790 1105 -7105 -3539 2230 15684 6078
7266F078n408O420Q299k731O748j0626l468M364L440O200L07L239q465r501j1764
$$ 6078 670 7090 15389 12658 19406 8780 5312 9676 13116 19316 19623 22862 14397 4896 -6868
7251f868n633R604j883P84M27J710O82Q684R230l391j3132P351O67l979m878K035
$$ -6868 -12501 -2897 -4780 -3996 -3569 -1859 -1177 7507 16737 13346 214 7565 8232 4253 -625 1410
7235A410M513p288L459J6959j0343o64L30M748j339j1096j4563J3512J3728m224
$$ 1410 5923 -1365 2094 19053 8710 8046 8376 13124 11785 689 -13874 -362 13366 9142
7221I142J097J5213j0155p966j2247Q878Q289j620k31J390m744l788r625L531
$$ 9142 10239 25452 15297 7331 -4916 3962 12251 10631 10400 11790 7046 3258 -6367 -2836
7207b836l070l696J5060J1538J276j1447L08m381j1060O45J2515P177M284m797
$$ -2836 -5906 -9602 5458 16996 18272 6825 7133 2752 -8308 -7663 4852 12029 16313 11516
7193A1516r901P298N698m49J922j853l505m149o951J4960M468J24o972m904Q875
$$ 11516 1615 8913 14611 14162 16084 14231 10726 6577 -374 14586 19054 19178 12206 7302 16177
7178A6177j2324q883r164O54l527P385Q737k728N586M177l46j5067k975R459K539
$$ 16177 3853 -5030 -14194 -13540 -17067 -9682 -945 -3673 1913 6090 5744 -9323 -12298 -2839 -300
7163c00p388R8J847m48P296J235j512J1258j1176j2143n127J577J9555j360r38
$$ -300 -7688 -7590 -5743 -6191 1105 2340 828 12086 910 -11233 -16360 -14783 4772 3412 2474
7148B474j688Q430n326N952j1660j765J177L524J1240J588q791o138n678K925
$$ 2474 786 9216 3890 9842 -1818 -3583 -2406 1118 12358 13946 5155 -983 -6661 -3736
7134c736N934J0180O125j4158o748J475o543J9683J0855r999j1391O920Q121r48
$$ -3736 2198 12378 18503 4345 -2403 -928 -7471 12212 23067 13068 1677 8597 16718 15770
7120A5770n602J428k566j2824j2107k211J1209M249K158p582k0357n548J3282
$$ 15770 10168 11596 9030 -3794 -15901 -18112 -6903 -2654 -496 -8078 -28435 -33983 -20701
7107b0701J4575L004L246J2375J1188k170o323j7870q511O627J5669n122q735
$$ -20701 -6126 -3122 124 12499 23687 21517 15194 -2676 -11187 -4560 11109 5987 -2748
7094b748o580q785j11l131n58l393J7646J7999j3001j6940O705RN427J0846p245
$$ -2748 -9328 -18113 -18224 -21355 -21913 -25306 -7660 10339 -2662 -19602 -12897 -12888 -7461 3385 -3860
7079c860k633o723O198j893o275k302m145Q132P606n402r008N658J8165j963q805
$$ -3860 -6493 -13216 -7018 -8911 -15186 -17488 -21633 -13501 -5895 -11297 -20305 -14647 3518 1555 -7250
7064g250j1564N631N065m704j3290Q120o191m421J1673R937J1372N659N751k962
$$ -7250 -18814 -13183 -8118 -12822 -26112 -17992 -24183 -28604 -16931 -6994 4378 10037 15788 12826
7050A2826M882q867r774q901j1205M621ml107J2578l84o290J1663j045n643L266
$$ 12826 17708 8841 -933 -9834 -21039 -16418 -16422 -19529 -6951 -7335 -13625 -1962 -3007 -8650 -5384
7035e384Q886p546J66J0351R499q371j4769Q47O758P379M41m462l716J3024j0692
$$ -5384 3502 -4044 -3878 6473 15972 7601 -7168 -6321 437 7816 8257 3795 79 13103 2411
7020B411p239n482O349j96o67R472K965L982J414n210j0723j3643P835N361l980
$$ 2411 -4828 -10310 -3961 -4157 -4824 4648 7613 11595 13009 7799 -2924 -16567 -8732 -3371 -7351
7005g351l839J0963o770r520J1848k650P561O411k424O544J1111j0382o860q615
$$ -7351 -11190 -227 -6997 -16517 -4669 -7319 242 6653 4229 10773 21884 11502 4642 -3973
6991c973j147J224P200j77m301O013N714l052k181J55J4771j0200r80J350j0071
$$ -3973 -5120 -3896 3304 3127 -1174 4839 10553 7501 5320 5475 20246 10046 9066 10416 345
6976C45k451K704j0892p757J659K901M543O955J3999M314o649j5110j0495J8430
$$ 345 -2106 598 -10294 -18051 -16392 -13491 -8948 -1993 12006 16320 9671 -5439 -15934 2496
6962B496K348j4528r006R238J688j71j875p882M194N799K175J2137R658j7817
$$ 2496 4844 -9684 -18690 -9452 -7764 -7935 -9810 -17692 -13498 -7699 -5524 6613 16271 -1546
6948a546p626J2201J7013L413l570k719j0011l76J399n187q24n891N745Q004J2781
$$ -1546 -9172 3029 20042 23455 19885 17166 7155 6779 8178 2991 2167 -3724 2021 10025 22806
6933B2806o114r25J343p696o520m162L061K2230J5695o466m242k2654k263P281
$$ 22806 16692 15767 17110 9414 2894 -1268 1793 24023 39718 33252 29010 6356 4093 11374
6919A1374j0811p409k31J3203R98l867n397q989N309j0785K548J0084j1188j8740
$$ 11374 563 -6846 -7077 6126 7124 3257 -2140 -11129 -5820 -16605 -14057 -3973 -15161 -33901
6905c3901N77P640J1609L688P259j979l417j0868R47N213N197k532j862n574p353
$$ -33901 -33324 -25684 -14075 -10387 -3128 -5107 -8524 -19392 -18445 -13232 -8035 -10567 -12429 -18003 -25356
6890b5356K882J4523L579K843N755n204P122o166j61J16O68J1181J158q542l748
$$ -25356 -22474 -7951 -4372 -1529 4226 -978 6144 -22 -183 -67 601 11782 12940 4398 650
6875F50q980M706K2331J2372L889J2388j3049j1629j1324j1852J0497O936l362
$$ 650 -8330 -3624 18707 31079 34968 47356 34307 22678 11354 -498 9999 16935 13573
6862A3573j6542j2658q293K1596L0599P178k880n44k138q173j5377L6O019K485
$$ 13573 -2969 -15627 -23920 -2324 28275 35453 32573 32029 29891 21718 6341 6377 12396 14881
6848A4881J336J751k39j0139n790l720j103j276j6756l262q41Q891J2059o344
$$ 14881 16217 17968 17729 7590 1800 -1920 -3023 -4299 -21055 -24317 -25158 -16267 -4208 -10552
6834a0552J1703K353q146N453M930M596k404p105l640O44P3l916p828r998L154
$$ -10552 1151 3504 -4642 811 5741 10337 7933 828 -2812 -2168 -2095 -6011 -13839 -23837 -20683
6819b0683L130P758P048J3586Q680r183o376O297L512p619m806N474n399n460
$$ -20683 -17553 -9795 -2747 10839 19519 10336 3960 10257 13769 6150 1344 6818 1419 -4041
6805d041n917M726O646m731m985K843N06n148k896l355n656K1020J8763n039r642
$$ -4041 -9958 -5232 1414 -3317 -8302 -5459 -4953 -10101 -12997 -16352 -22008 -988 17775 12736 3094
6790C094M292R424k65j4230j9060m02N827j1556O649K3067Q346j1521J0809Q763
$$ 3094 7386 16810 16545 2315 -16745 -17147 -11320 -22876 -16227 6840 15186 3665 14474 23237
6776B3237k956k319o612K189r734k476O830j361J7897o2j7501j561o287J344l909
$$ 23237 20281 17962 11350 13539 3805 1329 8159 6798 24695 24633 7132 5571 -716 628 -3281
6761c281q250N70L050O58Q80J2590K426j70j1377m951J1321J8473N553j1736k7846
$$ -3281 -11531 -10961 -7911 -7253 -6373 6217 8643 8473 -2904 -7855 3466 21939 27492 15756 -12090
6746a2090k5065J3290L9235K8297r80j9507m323m081k5641j4196J3719J9469J6065
$$ -12090 -37155 -23865 15370 43667 42687 23180 18857 14776 -10865 -25061 -11342 8127 24192
6733B4192K4463K560l024L743k495j4649j8130J207n32R965N807Q548K610n057
$$ 24192 48655 51215 48191 51934 49439 34790 16660 17867 17335 27300 33107 41655 44265 39208
6719C9208m788l786J558l60J4582O857L6281M9165N1171Q6197J10179J44600J80125
$$ 39208 34420 30634 32192 31832 46414 53271 89552 138717 189888 276085 386264 530864 710989
6706G10989J97426J16466j30729k71483k29655j40311p6904m0741k3884k0967
$$ 710989 908415 1024881 894152 622669 393014 252703 175799 135058 111174 90207
6696I0207j9979j5900j7826L393p4r202j1029r486q814k407J0966o498M552M504
$$ 90207 70228 54328 36502 39895 39821 30619 19590 10104 1290 -1117 9849 3351 7903 12407
6682A2407l407K225K703p71n382M860L865M980p726k961m656j5951l646J418J3897
$$ 12407 9000 11225 13928 13157 7775 12635 16500 21480 13754 10793 6137 -9814 -13460 -12042 1855
6667A855K2507N285L128n317j6216j827l051L729L92m946J0829k955m5R544j966
$$ 1855 24362 29647 32775 27458 11242 9415 6364 10093 10485 5539 16368 13413 13368 22912 20946
6652B0946j2763k921O029J817M792O84j1558k720J932o966j3305j203J0318Q085
$$ 20946 8183 5262 11291 13108 17900 18584 7026 4306 6238 -728 -14033 -15236 -4918 3167
6638C167J158j3660O750J6093k350k79J007p104p174O978j505j5743j367J0746
$$ 3167 4325 -9335 -2585 13508 11158 10879 11886 4782 -2392 4586 3081 -12662 -14029 -3283
6624c283J5323J4761j539J095r871r098J1142k442j1076p819J711M325m29M848
$$ -3283 12040 26801 25262 26357 16486 7388 18530 16088 5012 -2807 -1096 3229 2800 7648
6610G648l535R74N312K003j2950j5773m551k622J0318N350j8375j873J7185J6032
$$ 7648 4113 5087 10399 12402 -548 -16321 -20872 -23494 -13176 -7826 -26201 -28074 -10889 5143
6596E143L558p918j1395m182P742J8133L666J2757K464o426l784o847l928L419
$$ 5143 8701 783 -10612 -14794 -7052 11081 14747 27504 29968 23542 19758 12911 8983 12402
6582A2402M038Q499J459q600o595q614q24j7088R90J5180K056m050J48j1572j974
$$ 12402 16440 24939 26398 17798 11203 2589 1765 -15323 -14333 847 2903 -1147 -999 -12571 -14545
6567a4545J3462p356j416J6459J7772L254p186j4872j3908J10J2975L910R010
$$ -14545 -1083 -8439 -9855 6604 24376 27630 20444 5572 -8336 -8226 4749 8659 17669
6554A7669p30j140l129j2892P475Q882l532o858p284n590q24O26O176P16j373
$$ 17669 16939 15799 12670 -222 7253 16135 12603 5745 -1539 -7129 -7953 -7327 -1151 -435 -1808
6539a808P010p107m105r28r35k269k469N006J5856P822k75K172p740j5070j0581
$$ -1808 5202 -1905 -6010 -6938 -7873 -10142 -12611 -7605 8251 16073 15798 17970 10230 -4840 -15421
6524a5421o093J3729Q057j0246J252J0848l789j4550O797l645K67m172M704P163
$$ -15421 -21514 -7785 272 -9974 -8722 2126 -1663 -16213 -9416 -13061 -12794 -16966 -12262 -5099
6510e099O293o180K647J405j0101r77J1214O83J1195R352j1451K078K525R82m71
$$ -5099 1194 -4986 -2339 -934 -11035 -12012 -798 -115 11080 20432 8981 11059 13584 14566 14095
6495A4095j4851j6536j0040N199Q84K945q76O705J2641j651J1757M866n342o701
$$ 14095 -756 -17292 -27332 -22133 -21249 -18304 -19180 -12475 166 -1485 10272 15138 9796 3095
6481C095q857M70J3105N56r964q998Q673o146J652n098K972Q057K746Q260O313
$$ 3095 -5762 -5292 7813 8369 -1595 -10593 -1920 -8066 -6414 -11512 -8540 -483 2263 10523 16836
6466A6836n434j1392k471K315R709j2063P57j8045l330J7577J0961J1791J942
$$ 16836 11402 10 -2461 -146 9563 -2500 -1743 -19788 -23118 -5541 5420 17211 19153
6453A9153L732n832L518r655r456M300N328p136m570J0444M757l575n852j2016
$$ 19153 22885 17053 20571 10916 1460 5760 11088 3952 -618 9826 14583 11008 5156 -6860
6439f860o44n533J857M727k628o445J3079J538j911j0006o919j281m23J0702J4929
$$ -6860 -7504 -13037 -11180 -6453 -9081 -15526 -2447 -909 -2820 -12826 -19745 -21026 -21449 -10747 4182
6424D182J7352r150j1761j0385P70l705r201m538M876O206J703j0545J901J2395
$$ 4182 21534 12384 623 -9762 -8992 -12697 -21898 -26436 -21560 -15354 -13651 -24196 -22295 -9900
6410i900J566j7535r983J6806K5012P540Q82l095k258k306J0103k482o481K067
$$ -9900 -8334 -25869 -35852 -19046 5966 13506 14388 11293 9035 6729 16832 14350 7869 9936
6396I936l897Q27L770p432L846q00m510l163Q242Q770Q061l746o979N508m742
$$ 9936 6039 6866 10636 3204 7050 6250 1740 -1423 6819 15589 23650 19904 12925 18433 13691
6381A3691R038J552m841o005p98m173o532n357K498R079M578N778l425k7869k250
$$ 13691 22729 24281 19440 13435 12637 8464 1932 -3425 -927 8152 12730 18508 15083 -12786 -15036
6366a5036J1790J900n226o739M111l912m339K505P607J1634P522l836N401o447
$$ -15036 -3246 -1346 -6572 -13311 -9200 -13112 -17451 -14946 -7339 4295 11817 7981 13382 6935
6352F935p550j1748L80N266m308M635p48p898J3402N611p99j499l641j930Q387
$$ 6935 -615 -12363 -11983 -6717 -11025 -6390 -7138 -15036 -1634 3977 3178 1679 -1962 -3892 4495
6337D495M442m065r241l774k382k2J807R541r913l378n88r080J4703N056o180
$$ 4495 8937 4872 -4369 -8143 -10525 -10547 -8740 801 -9112 -12490 -13078 -22158 -7455 -2399 -8579
6322h579K59P276N367Q744j3695l761l344l546P640J3183l322K157J9648p128
$$ -8579 -8320 -1044 4323 13067 -628 -4389 -7733 -11279 -3639 9544 6222 8379 28027 20899
6308B0899j5519j5511k96R428p05r711r038M358o902R74l459l818k105P961Q828
$$ 20899 5380 -10131 -10427 -999 -1704 -11415 -20453 -16095 -22997 -22023 -25482 -29300 -31405 -23444 -14616
6293a4616L421L296m22n737l19J1904k494jJ872L231o836P348l15q044j249Q829
$$ -14616 -11195 -7899 -8321 -14058 -14377 -2473 -4967 -4968 -3096 135 -6701 647 332 -7712 -8961 -132
6277a32Q071k448J637L604m12L644m03q414p407k923K359J059j6205M177J974
$$ -132 7939 5491 7128 10732 10320 13964 13561 5147 -2260 -5183 -2824 -1765 -17970 -13793 -11819
6262a1819l327O833J9994L612j3991j0161o087N331J0004N405Q044P609j0257
$$ -11819 -15146 -8313 11681 15293 1302 -8859 -14946 -9615 389 5794 13838 21447 11190
6249A1190j2149j1239j0358J5165J1347O282j8430j1907K965K678L455J5266P691
$$ 11190 -959 -12198 -22556 -7391 3956 10238 -8192 -20099 -17134 -14456 -11001 4265 11956
6236A1956j2276k0559k057K164P076J6127N815j890j5136j0975n949J2097R421
$$ 11956 -320 -20879 -22936 -20772 -13696 2431 8246 6356 -8780 -19755 -25704 -13607 -4186
6223d186L35k388m617m927j7452L559K8044R269j1226r68k655j739J793o837j73
$$ -4186 -3851 -6239 -10856 -15783 -33235 -29676 -1632 7637 -3589 -4557 -7212 -8951 -7158 -13995 -14168
6208a4168N127O70N085O157m25m04L676j6729N23M422Q040j0976K851q133J404
$$ -14168 -9041 -8371 -3286 2871 2446 2042 5718 -11011 -10488 -6066 1974 -9002 -6151 -14284 -12880
6193a2880O940q007J1647k41m566j443Q092k289l67J5804L984Q983L304j7279
$$ -12880 -5940 -13947 -2300 -2541 -7107 -8550 -458 -2747 -3114 12690 16674 25657 28961 11682
6179A1682m756Q501j9083k1504O305Q350J6376j657k347N621j2460o037J2661
$$ 11682 6926 15427 -3656 -25160 -18855 -10505 5871 4214 1867 7488 -4972 -11009 1652
6166A652j516R602J0285k219j7691j636M732m291l632J3063L977l671k064M781
$$ 1652 136 9738 20023 17804 113 -1523 3209 -1082 -4714 8349 12326 8655 6591 11372
6152A1372k302p290m574j3780k283M693m437l900p111o27J2994P588N063m924
$$ 11372 9070 1780 -2794 -16574 -18857 -14164 -18601 -22501 -29612 -30239 -17245 -9657 -4594 -9518
6138i518K634O509L345O075j7557j0162n5q974Q972J7705R227P75M601j1836K358
$$ -9518 -6884 -375 2970 9045 -8512 -18674 -18729 -27703 -18731 -1026 8201 8976 13577 1741 4099
6123D099J742N886J1533J9939M80k8385j7301p152l574k450N395L594q593q727
$$ 4099 5841 11727 23260 43199 43679 15294 -2007 -9159 -12733 -15183 -9788 -6194 -14787 -23514
6109b3514J1665J7947j1268r685N614P814j0891q346K893j21m246n32q88Q973
$$ -23514 -11849 6098 -5170 -14855 -9241 -1427 -12318 -20664 -17771 -17892 -22138 -22670 -23558 -14585
6095a4585R848R471J361o512L961J799M344n297j630O650J33j0100J541Q672J2290
$$ -14585 -4737 4734 6095 -417 3544 5343 9687 4390 2760 9410 9543 -557 984 9656 21946
6080B1946N944j2085r601n419M701j0524j5736J1279O510P95N288j3158M85O89
$$ 21946 27890 15805 6204 785 5486 -5038 -20774 -9495 -2985 -2190 3098 -10060 -9575 -8886
6066h886m677m919K177R729K662m01l421j1896J1202J2288n485j91q46O16K92
$$ -8886 -13563 -18482 -16305 -6576 -3914 -4315 -7736 -19632 -8430 3858 -1627 -1818 -2664 -2048 -1756
6051a756r022J028L230k976R770J0300P12P340k594j2281J0128j0200K56M72R26
$$ -1756 -10778 -9750 -6520 -9496 274 10574 11286 18626 16032 3751 13879 3679 3935 4407 5333
6036E333L354j1849n931N280P88p633l99M745j0814k627J204j4128L702P502O548
$$ 5333 8687 -3162 -9093 -3813 -3025 -10658 -11057 -6312 -17126 -19753 -18549 -32677 -28975 -21473 -14925
6021a4925J7826Q68m346j4727m045k868L759J7894r40j7208M428q280k0228Q591
$$ -14925 2901 3769 -577 -15304 -19349 -22217 -18458 -564 -1504 -18712 -14284 -22564 -42792 -34201
6007c4201J3744Q984N230L337N601p37j0003j278M033j3871j3992P919K183o661
$$ -34201 -20457 -11473 -6243 -2906 2695 1958 -8045 -9323 -5290 -19161 -33153 -25234 -23051 -29712
5993b9712L294j222p39R882o553O520r621K252J6977N919O089N67m461R95M117
$$ -29712 -26418 -27640 -28379 -18497 -25050 -18530 -28151 -25899 -8922 -3003 3086 3653 -808 187 4304
5978D304r470j0625n075J2783J9310K309j3139N07N625k71O030l44j1336j9799
$$ 4304 -5166 -15791 -20866 -8083 11227 13536 397 904 6529 6258 12288 11944 608 -19191
5964a9191m505j045o775p516J8286K2281k542o094j567J0839J0883m775K70j9813
$$ -19191 -23696 -24741 -31516 -39032 -20746 1535 -1007 -7101 -8668 2171 13054 8279 8549 -11264
5950a1264l03l73P590O382n423o796N783k943l982J481o38J3125J8621j082q216
$$ -11264 -11567 -11940 -4350 2032 -3391 -10187 -4404 -7347 -11329 -9848 -10486 2639 21260 20178 11962
5935A1962L69j0301k914m481M732m863O434J081j2279r905L250J7480N541j3817
$$ 11962 12331 2030 -884 -5365 -633 -5496 938 2019 -10260 -20165 -16915 565 6106 -7711
5921g711K756q600M9M591L706P391L593L615k729j3539l1n992r89R322L76m428
$$ -7711 -4955 -13555 -13506 -8915 -5209 2182 5775 9390 6661 -6878 -6909 -12901 -13890 -4568 -4192 -8620
5905h620R951o752m381J1451j3785l285m964l814K542M634N753J565L056N390
$$ -8620 1331 -5421 -9802 1649 -12136 -15421 -20385 -24199 -21657 -17023 -11270 -9705 -6649 -1259
5891a259q929o382J1357Q404P204p095l950P654rq915j4547l392J414q16p829
$$ -1259 -10188 -16570 -5213 3191 10395 3300 -650 7004 6995 -1920 -16467 -19859 -18445 -19261 -27090
5876b7090J992N640J8067N276O596m191M54J9875O219j6154j5351p449j5367l454
$$ -27090 -25098 -19458 -1391 3885 10481 6290 6744 26619 32838 16684 1333 -6116 -21483 -24937
5862b4937P353J979K048O480R025K340K430m586p047J1062m385j1879m53l056
$$ -24937 -17584 -15605 -13557 -7077 1948 4288 6718 2132 -4915 6147 1762 -10117 -10570 -13626
5848a3626l61k808L19J60o805N612J1283Q172k484j80k959M642O712j7648j6334
$$ -13626 -13987 -16795 -16476 -16316 -23121 -17509 -6226 1946 -538 -718 -3677 965 7677 -9971 -26305
5833b6305P138J3610k742j498P7K888K754J520j0634p142L00L459R479O394j7789
$$ -26305 -19167 -5557 -8299 -9797 -9720 -6832 -4078 -2558 -13192 -20334 -20034 -16575 -7096 -702 -18491
5818a8491p248L105R379L559J4077K290N144j3772j3625R025R682k482o454j5498
$$ -18491 -25739 -22634 -13255 -9696 4381 6671 11815 -1957 -15582 -6557 3125 643 -5811 -21309
5804b1309j849j929M547J0041q876N42J0294j062L72k541k732R383K610n647j6446
$$ -21309 -23158 -25087 -20540 -10499 -19375 -18833 -8539 -9601 -9229 -11770 -14502 -5119 -2509 -8156 -24602
5789b4602J5549J9509M325K415n738r220p250N328M351j8018o556R348J6234N749
$$ -24602 -9053 10456 14781 17196 11458 2238 -5012 316 4667 -13351 -19907 -10559 5675 11424
5775A1424K12r083r825Q96p918J894j3297M413J2429r70L362j780j0214j217l649
$$ 11424 11636 2553 -7272 -6376 -14294 -12400 -25697 -21284 -8855 -9825 -6463 -8243 -18457 -19674 -23323
5760b3323Q574N082q698K522O999J0194O832r931n379n71J262n976m577J1770
$$ -23323 -14749 -9667 -18365 -15843 -8844 1350 8182 -1749 -7128 -7699 -6437 -12413 -16990 -5220
5746e220q544N728O305o859M645j273j0158j0895r527J0088J7565l223J629P95
$$ -5220 -13764 -8036 -1731 -8590 -3945 -5218 -15376 -26271 -35798 -25710 -8145 -11368 -9739 -8944
5732h944L903p333r018n07R124J1780J947p593N557q114l947o316m503K430k773
$$ -8944 -5041 -12374 -21392 -21899 -12775 -995 952 -6641 -1084 -9198 -13145 -19461 -23964 -21534 -24307
5717b4307j0512J7341P356o189q160L484O616j2823l480N576J8213P994m345j0670
$$ -24307 -34819 -17478 -10122 -16311 -24471 -20987 -14371 -27194 -30674 -25098 -6885 1109 -3236 -13906
5703a3906o932J6517l031K538R311J9053K9737K1412K2374Q759k4320l1625l5529
$$ -13906 -20838 -4321 -7352 -4814 4497 23550 53287 74699 97073 105832 81512 49887 14358
5690A4358p942R712N842q954j3685k2239L736J1966J3541J0483j6918L508O465
$$ 14358 6416 16128 21970 13016 -669 -22908 -19172 -7206 6335 16818 -100 3408 9873
5677I873K794l912j2875k646n346j9896n680J8671J2302o923Q57R892k946N261
$$ 9873 12667 8755 -4120 -6766 -12112 -32008 -37688 -19017 -6715 -13638 -12781 -2889 -5835 -574
5663e74o149j220J900m182p750m384J435K848K704r38n957J9888J1478M219j344
$$ -574 -6723 -7943 -6043 -10225 -17975 -22359 -20924 -18076 -15372 -16310 -22267 -2379 9099 13318 11974
5648A1974j3039r169L110N688M146J0920j4155o035P690n623K583L485j8088k3660
$$ 11974 -1065 -10234 -7124 -1436 2710 13630 -525 -6560 1130 -4493 -1910 1575 -16513 -40173
5634d0173J6246J9319K970M963n290n006p507K247o03N577J7538Q51L848j101
$$ -40173 -23927 -4608 -1638 3325 -1965 -6971 -14478 -12231 -12834 -7257 10281 11132 14980 13879
5620A3879N519r042j4239p72n976J330L994P329R411j0698l485N37M993L759L609
$$ 13879 19398 10356 -3883 -4655 -10631 -9301 -5307 2022 11433 735 -2750 -2213 2780 6539 10148
5605A0148N482j2120j2863k553N211J0053K1970r379n967P428j2869q545k161
$$ 10148 15630 3510 -9353 -11906 -6695 3358 25328 15949 9982 17410 4541 -4004 -6165
5592f165J1007q906K11L063p664j5221R106J281o40K2860P41o667P432m729q537
$$ -6165 4842 -4064 -3853 -790 -8454 -23675 -14569 -13288 -13928 8932 9673 3006 10438 5709 -2828
5577b828l125J472m727j0962K678R146N956m12L214l820m285k814n817L331k33
$$ -2828 -5953 -4481 -9208 -20170 -17492 -8346 -2390 -2802 412 -3408 -7693 -10507 -16324 -12993 -13226
5562a3226P062R695p459j5161J6795R339Q615M216j4943o923N912P402l286k770
$$ -13226 -6164 3531 -3928 -19089 -2294 7045 15660 19876 4933 -1990 3922 11324 8038 5268
5548E268L397j4845r223J24n48N566L072N988J2172Q801j4832o528p060J1973
$$ 5268 8665 -6180 -15403 -15279 -15827 -10261 -7189 -1201 10971 19772 4940 -1588 -8648 3325
5534C325k814p479l790M636n483J199O428Q470l470j0045J957P374J15k521K982
$$ 3325 511 -6968 -10758 -6122 -11605 -10406 -3978 4492 1022 -9023 -7066 308 423 -2098 884
5519H84n13r242J691q737P245J2538n787n027j727L030M79J167j124K407O425
$$ 884 371 -8871 -7180 -15917 -8672 3866 -1921 -6948 -8675 -5645 -5166 -3999 -5123 -2716 3709
5504C709J1805r808j2642j535q397K76l749J0909J0896Q16j1858n230m770n19
$$ 3709 15514 5706 -6936 -8471 -16868 -16592 -20341 -9432 1464 2280 -9578 -14808 -19578 -20097
5490b0097L554J1465R669J0314R48j1464N880K718j2215l039n82p044j5356O669
$$ -20097 -16543 -5078 4591 14905 15853 4389 10269 12987 772 -2267 -2849 -9893 -25249 -18580
5476a8580K1873M356J418Q141j5083q459J4139M942j762j1442J0954r92r421p851
$$ -18580 3293 7649 9067 17208 2125 -6334 7805 12747 10985 -457 10497 9505 84 -7767
5462g767o250J1165K876j5988P761O789j0322J531p87J0436J5451J3931L13j4557
$$ -7767 -14017 -2852 24 -15964 -8203 -1414 -11736 -10205 -10992 -556 14895 28826 29139 14582
5448A4582j5767n688n289J856K753j101m93m812k315m154l755p732J7000J6121
$$ 14582 -1185 -6873 -12162 -10306 -7553 -8654 -9147 -13959 -16274 -20428 -24183 -31915 -14915 1206
5434A206R892J595m93o5J797k872j3575j0997o867k726J4006j0053o193K0451
$$ 1206 11098 12693 12200 12135 13932 11060 -2515 -13512 -20379 -23105 -9099 -19152 -25345 -4894
5420d894K3948l72j5050p203P372m70O814n930j5568R438O117m638L671M921l939
$$ -4894 19054 18682 3632 -3571 3801 3331 10145 4215 -11353 -1915 4202 -436 3235 8156 4217
5405D217j149q926l601J0596L134j0260K659N379p139O078N937N555j682J033
$$ 4217 3068 -5858 -9459 1137 4271 -5989 -3330 2049 -5090 988 6925 12480 10798 11831
5391A1831j794o829k573n293j37J4494p226j9972j986K876r224M015j200k416
$$ 11831 10037 3208 635 -4658 -4795 9699 2473 -17499 -19485 -16609 -25833 -21818 -23018 -25434
5377b5434Q205k094M927K0645J0265j9029q951j1449p49R162N970o245M230Q283
$$ -25434 -17229 -19323 -14396 6249 16514 -2515 -11466 -22915 -23664 -14502 -8532 -14777 -10547 -2264
5363b264J5836O555O92l46j1400j607N213j3891r351Q106o261k475j216j6973
$$ -2264 13572 20127 20819 20473 9073 7466 12679 -1212 -10563 -2457 -8718 -11193 -12409 -29382
5349b9382K456M565J2226J3234j4235k847J907j300m52N504K244o780O672N13
$$ -29382 -26926 -22361 -10135 3099 -11136 -13983 -12076 -13376 -13828 -8324 -6080 -12860 -6188 -5675
5335e675O026l571o111K1525K710r321l48K153o081P760n715j2026j165J5895
$$ -5675 351 -3220 -9331 12194 14904 5583 5235 7388 1307 9067 3352 -8674 -9839 6056
5321F056M159j651q745m621j3168k783J1423J3629Q556J0903L516O286j0195k0825
$$ 6056 10215 8564 -181 -4802 -17970 -20753 -9330 4299 12855 23758 27274 33560 23365 2540
5307B540k797p932j2008J8214K398J4478N967j0462j6659N784Q732P398j1432
$$ 2540 -257 -8189 -20197 -1983 415 14893 20860 10398 -6261 -477 8255 15653 4221
5294D221j90J410j9146l787J9155O737j0850J733O44o391j2875r409K286J1979
$$ 4221 4031 5441 -13705 -17492 1663 8400 -2450 -717 -73 -6464 -19339 -28748 -26462 -14483
5280a4483J1707l810N08K560j5330L856J5486M144m172J930K336j5330o610P119
$$ -14483 -2776 -6586 -6078 -3518 -18848 -14992 494 4638 466 2396 4732 -10598 -17208 -10089
5266a0089J4270j655j1849K242m687P840J940J0062J0727O966k051p088n383m491
$$ -10089 4181 2526 -9323 -7081 -11768 -3928 -1988 8074 18801 25767 23716 16628 11245 6754
5252F754l902J645L881j2338j0028M847L053L322j4690j2766l684J072J4058J0897
$$ 6754 2852 4497 8378 -3960 -13988 -9141 -6088 -2766 -17456 -30222 -33906 -32834 -18776 -7879
5238g879P527k556Q367J829o104Q60M0j6476l642Q107Q730q8J1621O89R068p856
$$ -7879 -352 -2908 5459 7288 1184 2044 2084 -14392 -18034 -9927 -1197 -1285 10336 11025 20093 12237
5222A2237p96j0814m435k268L654R147j1608p567L485n382Q34J1531O800j2903
$$ 12237 11441 627 -3808 -6076 -2422 6725 -4883 -12450 -8965 -14347 -13513 -1982 4818 -8085
5208h085p753P91J0233N203n914n941O664M347k614m051R762p827J1020L386j5021
$$ -8085 -15838 -15047 -4814 389 -5525 -11466 -4802 -455 -3069 -7120 2642 -5185 5835 9221 -5800
5193e800J25K389k666R933J3089o462j2831m904J5062L670N061R17p196r020R46
$$ -5800 -5675 -3286 -5952 3981 17070 10608 -2223 -7127 7935 11605 16666 17583 10387 1367 2313
5178B313p34p246j215l891P206j161P593l94r91j0457n685l539l32R482J863p349
$$ 2313 1579 -5667 -6882 -10773 -3567 -4728 2865 2471 1480 -8977 -14662 -18201 -18533 -9051 -7188 -14537
5162a4537n942M722o038r746j541J9771q11N363J4680m806j21N848J1073K693
$$ -14537 -20479 -15757 -21795 -31541 -33082 -13311 -14122 -8759 5921 1115 994 6842 17915 20608
5148B0608j3190j609j3189R4k830j2303N203K350Q856N173k547N845M841M995
$$ 20608 7418 5809 -7380 -7286 -10116 -22419 -17216 -14866 -6010 -837 -3384 2461 7302 12297
5134A2297l83j2074K16l487o216q145q767o061N029J6235k197N101K4303J5144
$$ 12297 11914 -160 56 -3431 -9647 -17792 -26559 -32620 -27591 -11356 -13553 -8452 15851 30995
5120C0995L358p932j8718K250r61j4418l947n904N321O992o324j664n635R665
$$ 30995 34353 26421 7703 9953 8992 -5426 -9373 -15277 -9956 -2964 -9288 -10952 -16587 -6922
5106f922J6688m093m117p586n579Q155N202p968j3425l435R532J5334Q910k279
$$ -6922 9766 5673 1556 -6030 -11609 -3454 1748 -6220 -19645 -23080 -13548 1786 10696 8417
5092H417p914o639k321K392M765m545m51j516R160O537k294j4506r491m484J0937
$$ 8417 503 -6136 -8457 -6065 -1300 -5845 -6296 -7812 1348 7885 5591 -8915 -18406 -22890 -11953
5077a1953J682k181O676L566q256M180J926j7274p544L688R540J1417N47n86K275
$$ -11953 -10271 -12452 -5776 -2210 -10466 -6286 -4360 -21634 -29178 -25490 -15950 -4533 -3986 -4572 -2297
5062b297m736M660Q600j537l062n352p8q230r52M218j5309O074K1048k197J47
$$ -2297 -7033 -2373 6227 4690 1628 -3724 -3802 -12032 -12984 -8766 -24075 -18001 3047 850 997
5047I97j176L168J882o083K417k478q384q427J051Q940K695M341O44j0899o942
$$ 997 -179 2989 4871 -1212 1205 -1273 -9657 -18084 -17033 -8093 -5398 -1057 -413 -11312 -18254
5032a8254N237K136j137j723j967p521j204J4183J2507R517p654J313P02p878
$$ -18254 -13017 -10881 -12018 -13741 -15708 -23229 -24433 -10250 2257 11774 4120 5433 6135 -1743
5018a743j3603j609k185L804p555j026N932J1325j622j372Q107k483l024J1600
$$ -1743 -15346 -16955 -19140 -15336 -22891 -23917 -17985 -6660 -8282 -9654 -1547 -4030 -7054 4546
5004D546N069k936k45p579k180m97j0716j0608J0090J0365q156r77q63k926P334
$$ 4546 9615 6679 6434 -1145 -3325 -3822 -14538 -25146 -15056 -4691 -12847 -13824 -14687 -17613 -10279
4989a0279M92M321j084j4229j6805N523L846Q182j318p9L535M582J4893J8946
$$ -10279 -9787 -5466 -6550 -20779 -37584 -32061 -28215 -20033 -21351 -21430 -17895 -13313 1580 20526
4975B0526J695j5304q13n510n838J866O623o951J50r342K100j049L571O225P67
$$ 20526 22221 6917 6104 594 -5244 -3378 3245 -3706 -3556 -12898 -10798 -11847 -8276 -2051 -1284
4960a284J040m612J182O630N134p00L3J3458M271q517j7961J956n2m687J3644
$$ -1284 -244 -4856 -3674 2956 8090 7390 7423 20881 25152 16635 -1326 630 578 -4109 9535
4945I535J9009r998o481L955p445j3395m177J127J532K446K754j74o254J0464
$$ 9535 28544 18546 12065 16020 8575 -4820 -8997 -7870 -6338 -3892 -1138 -1312 -7566 2898
4931B898J6267j0582j5967j0498L561J4976R323p759n369J037L361K72j99k511
$$ 2898 19165 8583 -7384 -17882 -14321 655 9978 2219 -3150 -2113 1248 1520 1321 -1190
4917a190K620j316j1336L113j891R933J2188j2545j1108M541Pm281j1527J0694
$$ -1190 1430 114 -11222 -8109 -10000 -67 12121 -424 -11532 -6991 -6984 -11265 -22792 -12098
4903a2098J7415J7815r064q083O82j599j4506l904L927m413O391O392n014j2508
$$ -12098 5317 23132 14068 5985 6667 5068 -9438 -13342 -9415 -13828 -7437 -1045 -6059 -18567
4889a8567L326K906J3380r371L377K178n132P056o495m888M122L641N724J3645
$$ -18567 -15241 -12335 1045 -8326 -4949 -2771 -7903 -847 -7342 -12230 -8108 -4467 1257 14902
4875A4902J2700j9445o358O488l373K719q122p263j5078N090R069m9Q079m306
$$ 14902 27602 8157 1799 8287 4914 7633 -489 -7752 -22830 -17740 -8671 -8720 -641 -4947
4861d947M945M329l972o221P16p98K05J0621R666J469j3636J509M49l330M589
$$ -4947 -2 4327 355 -5866 -5150 -5948 -5743 4878 14544 16013 2377 3886 4335 1005 5594
4846E594L059J592q290j0691p501M057J2441l12N34K5164o854j9090o813l472
$$ 5594 8653 10245 1955 -8736 -16237 -12180 261 -51 483 25647 18793 -297 -7110 -10582
4832a0582M971J675m91l59p992l314J575k208O891J4652Q817r112j4350l03J67
$$ -10582 -5611 -3936 -4427 -4786 -12778 -16092 -14517 -16725 -9834 4818 13635 4523 -9827 -10130 -9963
4817i963k403o312n787J4773L946j4558R869K7443o724j4172q602m600q5J1609
$$ -9963 -12366 -18678 -24465 -9692 -5746 -20304 -10435 17008 10284 -3888 -12490 -17090 -17175 -5566
4803e566J3342N756p028j6638j7741J1957M505P128R835R220l52L620J287q512
$$ -5566 7776 13532 6504 -10134 -27875 -15918 -11413 -4285 5550 14770 14418 18038 19325 10813
4789A0813n488j7038k003L899R641N271n221j649q187L844K366k865J5723q3m243
$$ 10813 5325 -11713 -13716 -9817 -176 5095 -126 -1775 -9962 -6118 -3752 -6617 9106 9023 4780
4774D780j147j1246j0258r60N865K498O10k607j498o328L39J742m868J30R73k544
$$ 4780 3633 -7613 -17871 -18831 -12966 -10468 -9858 -12465 -13963 -20291 -19952 -18210 -23078 -22948 -21975 -24519
4758b4519l294j188J0720O325j2758J3209J6262q804o489M439l073n356n848R243
$$ -24519 -27813 -29001 -18281 -11956 -24714 -11505 4757 -4047 -10536 -6097 -9170 -14526 -20374 -11131
4744a1131R38k592K291K202o305P903K388r562j614J3144J832K303o662j1051
$$ -11131 -10193 -12785 -10494 -8292 -14597 -6694 -4306 -13868 -15482 -2338 -506 1797 -4865 -15916
4730a5916R97j156O352n033j550q226Q251J5378m100k426l965R932O56l654l66
$$ -15916 -14919 -16075 -9723 -14756 -16306 -24532 -16281 -903 -5003 -7429 -11394 -1462 -806 -4460 -4826
4715d826n768J0956R013L458J0169j0465l475O794p981j0103l412q714j559n164
$$ -4826 -10594 362 9375 12833 23002 12537 9062 15856 7875 -2228 -5640 -14354 -15913 -21077
4701b1077K64J0962K087m257p693k549j168n80J1760M406r637j220k096q197L546
$$ -21077 -20813 -9851 -7764 -12021 -19714 -22263 -23431 -24011 -12251 -7845 -17482 -18702 -20798 -28995 -25449
4686b5449J2928J5744J3956n88l692r674l339K681M040R088q323O319J2295r590
$$ -25449 -12521 3223 17179 16591 12899 3225 -114 2567 6607 15695 7372 13691 25986 16396
4672A6396r765j7018o640J0955O862P404L452j0180L11j1039R50j0109l342Q926
$$ 16396 6631 -10387 -17027 -6072 790 8194 11646 1466 1777 -9262 -8312 -18421 -21763 -12837
4658a2837r46j5428o92J661K705N291P479j601q280N480O871L216j564j719M034
$$ -12837 -13783 -29211 -29903 -28242 -25537 -20246 -12767 -14368 -22648 -17168 -10297 -7081 -8645 -10364 -6330
4643f330m647n627j922P8r781K5748Q951o587J2417J567r763K984m277o175p86
$$ -6330 -10977 -16604 -18526 -18448 -28229 -2481 6470 -117 12300 13867 4104 7088 2811 -3364 -4150
4628d150J09Q61M602Q463m016l358L32R426j0954n654M359L821J565o33k203j206
$$ -4150 -4041 -3180 1422 9885 5869 2511 2843 12269 1315 -4339 20 3841 5406 4773 2570 1364
4612A364Q45j8768J504j356O465l81r679M166o77q070K721M424q23P261j7817
$$ 1364 2209 -16559 -15055 -16411 -9946 -10327 -20006 -15840 -16517 -24587 -21866 -17442 -18265 -11004 -28821
4597b8821J2351J8235J5034j0365k0780N818J5996R236j5913j4473n278j722R24
$$ -28821 -16470 1765 16799 6434 -14346 -8528 7468 16704 791 -13682 -18960 -20682 -19758
4584a9758J1943q797m78j069Q135J2477J1766m28K191j4913o58l172L745N651
$$ -19758 -7815 -16612 -17090 -18159 -10024 2453 14219 13791 15982 1069 411 -2761 984 6635
4570F635l916J0504k152j0590j1621N976r52p322P374O533N887r994J672K433
$$ 6635 2719 13223 11071 481 -11140 -5164 -6116 -13438 -6064 469 6356 -3638 -1966 467
4556D67p700J3902J0597K66j162k648r751j3220j1971L270O660L454m903N263
$$ 467 -7233 6669 17266 17532 16370 13722 3971 -9249 -21220 -17950 -11290 -7836 -12739 -7476
4542g476J2390k357M118j3286j0713L28l216m414O696J1501J2440J1198m953q642
$$ -7476 4914 2557 6675 -6611 -17324 -16996 -20212 -24626 -17930 -6429 6011 17209 12256 3614
4528C614n387p572P574N637m00q156r159Q828J0279N55q386m024l249M357J2240
$$ 3614 -1773 -9345 -1771 3866 3466 -4690 -13849 -5021 5258 5813 -2573 -6597 -9846 -5489 6751
4513F751K2419m116j6885n140J444q66o66j0608j033Q559p108p767J6896K200
$$ 6751 29170 25054 8169 3029 4473 3607 2941 -7667 -8700 -141 -7249 -15016 1880 4080
4499D080j6526q086P421M145l00N440K700j111k977J2305J6621o00p063K15J0008
$$ 4080 -12446 -20532 -13111 -8966 -9266 -3826 -1126 -2237 -5214 7091 23712 23112 16049 16264 26272
4484B6272m281j7799o608P365J666m867l942M828M386N736m851p15j0190j5955
$$ 26272 21991 4192 -2416 4949 6615 1748 -2194 2634 7020 12756 7905 7190 -3000 -18955
4470a8955j914J0139O310j175P779K472O765l238r62n197j1032R326R463K507
$$ -18955 -20869 -10730 -4420 -5595 2184 4656 11421 8183 7221 2024 -9008 318 9781 12288
4456A2288Q733o560O05o232N065n889j6294J878L190j0617n543N854O291n37o578
$$ 12288 21021 14461 15066 8834 13899 8010 -8284 -6406 -3216 -13833 -19376 -13522 -7231 -7768 -14346
4441a4346J737p51Q334m559j6196N112J7957J6844j3187o215J9125K185o425p50
$$ -14346 -12609 -13360 -5026 -9585 -25781 -20669 -2712 14132 945 -5270 13855 16040 9615 8865
4427H865k875r141j5228k663N695O804L203m406J2325L030j44p108j4626N170
$$ 8865 5990 -3151 -18379 -21042 -15347 -8543 -5340 -9746 2579 5609 5465 -1643 -16269 -11099
4413a1099J5344J039j584l824r872j861N701R420J9808p835j3060O426L779m953
$$ -11099 4245 5284 3700 -124 -9996 -11857 -6156 3264 23072 15237 2177 8603 12382 7429
4399G429q643j1309P78Q716R84p472m713k019J66J1004r638j95J5712l389n578
$$ 7429 -1214 -12523 -11745 -3029 -2045 -9517 -14230 -16249 -16083 -5079 -14717 -14912 800 -2589 -8167
4384h167K764J1604o42k289N612R017J544l602j4164o377K869P229O932p068m580
$$ -8167 -5403 6201 5559 3270 8882 17899 19443 15841 1677 -4700 -1831 5398 12330 5262 682
4369F82j2349j1684L071J0602P65N582K090J386K522p632j558M544P816j0337
$$ 682 -11667 -23351 -20280 -9678 -8913 -3331 -1241 145 2667 -4965 -6523 -1979 5837 -4500
4355d500j0176p566J0160P087p179P76n539j75j119Q082P217k605k042O748Q670
$$ -4500 -14676 -22242 -12082 -4995 -12174 -11398 -16937 -17112 -18231 -10149 -2932 -5537 -7579 -831 7839
4340G839n810j2328p575J3309Q691j572j1285J778j2035k591J500J3279J238o905
$$ 7839 2029 -10299 -17874 -4565 4126 2554 -8731 -6953 -18988 -21579 -20079 -6800 -5562 -12467
4326a2467N037R901O681j699q453N168j644J6457P509N144m630K41j7289r587
$$ -12467 -7430 2471 9152 7453 -1000 4168 2524 18981 26490 31634 27004 27245 9956 369
4312C69n819q631r797J7611L553n748J157l148N948J5233J894n003K44J30r355
$$ 369 -5450 -14081 -23878 -6267 -2714 -8462 -7305 -10453 -4505 10728 12622 7619 7863 7993 -1362
4297a362r351r172k206J1875O538J2259n200j244r253n018q822j187P972K507
$$ -1362 -10713 -19885 -22091 -10216 -3678 8581 3381 2137 -7116 -12134 -20956 -22143 -14171 -11664
4283a1664K347J0769l571j8414m59P142K929K305J0783O448p493O87L629M754
$$ -11664 -9317 1452 -2119 -20533 -20992 -13850 -10921 -8616 2167 8615 1122 1809 5438 10192
4269A0192j7308o597J6337O984N002P356O233M468j5780k0015J153p927j6480
$$ 10192 -7116 -13713 2624 9608 14610 21966 28199 32667 16887 -3128 -1975 -9902 -26382
4256b6382k686n248N383J448J1966J9678m435O213r027K52K114k3007O446J0731
$$ -26382 -29068 -34316 -28933 -27485 -15519 4159 -276 5937 -3090 -2838 -724 -23731 -17285 -6554
4242f554K875q062R13j3196m270O940L33L664J0423J6178K317l935j0329n347
$$ -6554 -3679 -11741 -10828 -24024 -28294 -21354 -21021 -17357 -6934 9244 11561 7626 -2703 -8050
4228h050K247P109L392j8124j485J2001J4096N686Q357l708q746j3489M615o53
$$ -8050 -5803 1306 4698 -13426 -14911 -2910 11186 16872 25229 21521 12775 -714 3901 3248
4214C248j4102P52J146j5829Q02R292Q370m815O226L864j134l149l19n11j1273
$$ 3248 -10854 -10102 -8956 -24785 -23983 -14691 -6321 -11136 -4910 -1046 -2180 -5329 -5648 -6159 -17432
4199a7432N073J1404o336j3582q405N438R879J0653p507N977O286r7O511L849
$$ -17432 -12359 -955 -7291 -20873 -29278 -23840 -13961 -3308 -10815 -4838 1448 1351 7862 11711
4185A1711j399O497O339K949o877j2899n956J085O1j0997O277j4256P850l083
$$ 11711 10312 16809 23148 26097 19220 6321 365 1450 1511 -9486 -3209 -17465 -9615 -12698
4171a2698k360K652J0035m539p017J1019P471K292l529j1674q096P135L569M918
$$ -12698 -15058 -12406 -2371 -6910 -13927 -2908 4563 6855 3326 -8348 -16444 -9309 -5740 -822
4157h22k268j2884K775J0121J3464l215k6725j1059R464J5967N324m556K917j3164
$$ -822 -3090 -15974 -13199 -3078 10386 7171 -19554 -30613 -21149 -5182 142 -4414 -1497 -14661
4143a4661j2337J0695K0758R16K72P99J2104Q465P005l155j3968j6651J2611m48
$$ -14661 -26998 -16303 4455 5371 5643 6442 18546 27011 34016 30861 16893 242 12853 12405
4129A2405M210p022j3865m856p75k824J3810J0694r664o492l8l2q699P536k08
$$ 12405 16615 9593 -4272 -9128 -9903 -12727 1083 11777 2113 -4379 -4417 -4449 -13148 -5612 -5820
4114e820o247J3336R180j2188M72r787n110L611P33N709N468N35q360n130J1295
$$ -5820 -12067 1269 10449 -1739 -1267 -11054 -16164 -12553 -11820 -6111 -643 -108 -8468 -13598 -2303
4099b303R526j738j6190N044j626j4108l205P015K998j526j5023L74K283J5360
$$ -2303 7223 5485 -10705 -5661 -7287 -21395 -24600 -17585 -14587 -16113 -31136 -30762 -28479 -13119
4085a3119P796L785l106j0053j3815j6169k75L479J7270J1288J2700m57P954J2775
$$ -13119 -5323 -1538 -4644 -14697 -28512 -44681 -44956 -41477 -24207 -12919 -219 -676 7278 20053
4071B0053K525l53k109j1039o032K122K827l479r862k479j950l883n311l368J2741
$$ 20053 22578 22225 20116 9077 3045 5167 7994 4515 -5347 -7826 -9776 -13659 -18970 -22338 -9597
4056i597J7025m57o156k1889J3024K0743l090J773O415p759j4968N63P080O028
$$ -9597 7428 6971 815 -21074 -8050 12693 9603 11376 17791 10032 -4936 -4373 2707 8735
4042H735R068l245p412j0815M137L228J557j522r581p242j0152M52N193L815n929
$$ 8735 17803 14558 7146 -3669 468 3696 5253 3731 -5850 -13092 -23244 -22792 -17599 -13784 -19713
4027a9713P420J0188L244M512N659j3860l568m402j1298P111J0694l088L222n613
$$ -19713 -12293 -2105 1139 5651 11310 -2550 -6118 -10520 -21818 -14707 -4013 -7101 -3879 -9492
4013i492r627Q76Q404J347Q205R743l275p107j0676Q616o239j0804Q537J543N892
$$ -9492 -19119 -18243 -9839 -8492 -287 9456 6181 -926 -11602 -2986 -9225 -20029 -11492 -9949 -4057
3998d057Q403j4309R765O83r281J604n916j0173M682J1554N987j060p176q83N891
$$ -4057 4346 -9963 -198 485 -8796 -7192 -13108 -23281 -18599 -7045 -1058 -2118 -9294 -10177 -4286
3983d286j036j3992j0725L802J5405L222J520m952n567J7370J6276j0381j2684
$$ -4286 -5322 -19314 -30039 -26237 -10832 -7610 -6090 -11042 -16609 761 17037 6656 -6028
3970f028L785J0387l419n395J0623J43R333M395r057p896j0734j2464m827j6930
$$ -6028 -2243 8144 4725 -670 9953 10096 19429 23824 14767 6871 -3863 -16327 -21154 -38084
3956c8084J1110K7772J4415m114j5840j599K058O009O829j4257q389j678L130
$$ -38084 -26974 798 15213 11099 -4741 -6340 -4282 1727 8556 -5701 -14090 -15768 -12638
3943a2638M216J1797N176o632K672J8989j3104k9691j869J0197q08K460J2459
$$ -12638 -8422 3375 8551 1919 4591 23580 10476 -19215 -21084 -10887 -11695 -9235 3224
3930C224J715n575l013O829J0230jj7192o925L962q110o346J895R673o430q113
$$ 3224 4939 -636 -3649 3180 13410 13409 -3783 -10708 -6746 -14856 -21202 -19307 -9634 -16064 -24177
3915b4177L288n776r07K297o59k52J1289N526p716o325R606M041R028p494O899
$$ -24177 -20889 -26665 -27572 -25275 -25934 -26186 -14897 -9371 -17087 -23412 -13806 -9765 -737 -8231 -1332
3900a332L896N818M154o422l20R151r530q580j625j7200J2787k642J747J4151
$$ -1332 2564 8382 12536 6114 5794 14945 5415 -3165 -4790 -21990 -9203 -11845 -10098 4053
3886D053N640j566q993m389J213j610q202p332p445J6253J3420o616q954j3148
$$ 4053 9693 8127 -866 -5255 -4042 -5652 -13854 -21186 -28631 -12378 1042 -5574 -14528 -27676
3872b7676o537P45N528Q585Q678J2712R374n509j112n512J61k633q451J676r516
$$ -27676 -34213 -33468 -27940 -19355 -10677 2035 11409 5900 4788 -724 -563 -3196 -11647 -9971 -19487
3857a9487o621M702j7807P694K2746Q951p982j3502K269J9700P3j5362q044K460
$$ -19487 -26108 -21406 -39213 -31519 -8773 178 -7804 -21306 -19037 663 736 -14626 -22670 -20210
3843b0210L993R07M57N874j6245m424O366J5779N091N03j0597j011R56J2069J4598
$$ -20210 -16217 -15310 -14853 -8979 -25224 -29648 -23282 -7503 -2412 -1909 -12506 -13517 -12561 -492 14106
3828A4106Q644o260j4040j1835J21K010O927L46k748P196J5908P608j2715o656
$$ 14106 22750 16490 2450 -9385 -9264 -7254 -327 19 -2729 4467 20375 27983 15268 8612
3814H612q550q844K554L321r808O617M395N891L675j4386o552Q685l689R923m076
$$ 8612 62 -8782 -6228 -2907 -12715 -6098 -1703 4188 7863 -6523 -13075 -4390 -8079 1844 -2232
3799b232q520R864k503l806M696J1621l37j061J0476j5019j1453P194k509k322
$$ -2232 -10752 -888 -3391 -7197 -2501 9120 8783 7722 18198 3179 -8274 -1080 -3589 -5911
3785e911J7644J3086K457p173j5469q629j3271K279Q987L543q226J0952l997n513
$$ -5911 11733 24819 27276 20103 4634 -3995 -17266 -14987 -6000 -2457 -10683 269 -3728 -9241
3771i241l481O47J520Q014P794K411p107J978j804L919L811k650l130j171R835
$$ -9241 -12722 -12075 -10555 -2541 5253 7664 557 2535 731 4650 8461 5811 2681 1510 11345
3756A1345q538K50K577R357J125j1953j0279M943k873r520L300R681J0189M581
$$ 11345 2807 3057 5634 14991 16116 4163 -6116 -1173 -4046 -13566 -10266 -585 9604 14185
3742A4185Q164N652n108n719j4471K591J409Q627l637q960p417m599O33j7132
$$ 14185 22349 28001 22893 17174 2703 5294 6703 15330 11693 2733 -4684 -9283 -8650 -25782
3728b5782m285J1900J1248q70k899j115K664K393N79K234P214M217j6445j0625
$$ -25782 -30067 -18167 -6919 -7789 -10688 -11803 -9139 -6746 -6167 -3933 3281 7498 -8947 -19572
3714a9572L12O064k553m057Q359l123J6357R841P48R32l903l338o427p189k776
$$ -19572 -19260 -13196 -15749 -19806 -11447 -14570 1787 11628 12376 13308 9405 6067 -360 -7549 -10325
3699a0325j116M865k254o450k10r22J225j742q612M072P249R274l237J555j0786
$$ -10325 -11441 -6576 -8830 -15280 -15490 -16412 -15187 -16929 -25541 -21469 -14220 -4946 -8183 -6628 -17414
3684a7414l832L321j629m60J5713J2312l470R357O22n081r497N179o01k99K013
$$ -17414 -21246 -17925 -19554 -20014 -4301 8011 4541 13898 14520 9439 -58 5121 4520 4221 6234
3669F234j1343m531l823n586J0449J8732N773r792K193N683N432k237K953l310
$$ 6234 -5109 -9640 -13463 -19049 -8600 10132 15905 6113 8306 13989 19421 17184 20137 16827
3655A6827j5201J9800J2595n079o263P254o26p090n395o439o493j1133m665j350
$$ 16827 1626 21426 34021 28942 22679 29933 29307 22217 16822 10383 3890 -7243 -11908 -13258
3641a3258j3370J345M722J1352R748r456M502Q582L848j1808o223j1403K464K181
$$ -13258 -26628 -25283 -20561 -9209 539 -8917 -4415 4167 8015 -3793 -10016 -21419 -18955 -16774
3627a6774K329J141k86Q287N928q232j7184Q188K6403K249p032k006L315P894
$$ -16774 -14445 -13304 -13590 -5303 625 -7607 -24791 -16603 9800 12049 5017 3011 6326 14220
3613A4220j0549l524O586m101j0376l161p96q63j1931m066O433N647K559Q775
$$ 14220 3671 147 6733 2632 -7744 -10905 -11701 -12564 -24495 -28561 -22128 -16481 -13922 -5147
3599e147J5822J1332j412k794o384l139q149K34M390l875Q715J0759J606r968
$$ -5147 10675 22007 20595 17801 11417 8278 129 363 4753 878 9593 20352 21958 11990
3585A1990k923J1513m903j2081k2789J718J1232j508l93P625R832P654l529o411
$$ 11990 9067 20580 15677 3596 -19193 -17475 -6243 -7751 -8144 -519 9313 16967 13438 7027
3571G027k787K429p65o300k197o570k767M342Q822N073J2101l294j0335p042R31
$$ 7027 4240 6669 5904 -396 -2593 -9163 -11930 -7588 1234 6307 18408 15114 4779 -2263 -1332
3556a332l304k882j0820K59O719J2318O484m448m843j265n99M26j1336P800J1193
$$ -1332 -4636 -7518 -18338 -18079 -11360 958 7442 2994 -1849 -3114 -3713 -3287 -14623 -6823 4370
3541D370Q530P845j7925j0074K672j124r090M625M578j3580m169o12j782J2386
$$ 4370 12900 20745 2820 -7254 -4582 -5706 -14796 -10171 -5593 -19173 -23342 -23954 -25736 -13350
3527a3350R944L890k124O015q95p578O291K710m384o708O310J0804n28j0655k190
$$ -13350 -3406 484 -1640 4375 3480 -4098 2193 4903 519 -6189 121 10925 10397 -258 -2448
3512b448K056L328m000k909n893L796L497L462Q067o531k163M302L042j7770j2673
$$ -2448 -392 2936 -1064 -3973 -9866 -6070 -2573 889 8956 2425 262 4564 7606 -10164 -22837
3497b2837O748P577N742j2681j3521P649K26l906m534J3702K6333J1603J237k0013
$$ -22837 -16089 -8512 -2770 -15451 -28972 -21323 -21097 -25003 -29537 -15835 10498 22101 23338 3325
3483C325l926J876l004k102l750Q81o63L1m347q546p596r787J1736K5501N912
$$ 3325 -601 1275 -1729 -3831 -7581 -6700 -7363 -7332 -11679 -20225 -27821 -37608 -25872 -371 5541
3468E541j7526n257P297n45L927R561j011j5825J7144J6786J309k873j1719j0483
$$ 5541 -11985 -17242 -9945 -10490 -6563 2998 1987 -13838 3306 20092 21401 18528 6809 -3674
3454c674o675j624m033K421J2619P51j838k347M460J9110o157J810q41j2208j6925
$$ -3674 -10349 -11973 -16006 -13585 -966 -215 -2053 -4400 60 19170 13013 14823 13982 1774 -15151
3439a5151o35R579l429L666J9502K198j5376l80o158j721j116J4016K795K467
$$ -15151 -15786 -6207 -9636 -5970 13532 15730 354 -26 -6184 -7905 -9021 4995 7790 10257
3425A0257R636n450k0650o650K956O000M909j0158L894P281q145L500J4253l432
$$ 10257 19893 14443 -6207 -12857 -9901 -3901 1008 -9150 -5256 2025 -6120 -2620 11633 8201
3411H201L062j2200j6389q19J6852P344K281j1994r345J3285l325J033n19N019
$$ 8201 11263 -937 -17326 -18145 -1293 6051 8332 -3662 -13007 278 -3047 -2014 -2533 2486
3397B486J4740k496l907Q895j1385m523j425m725l569J2584N199L832j810n73
$$ 2486 17226 14730 10823 19718 8333 3810 2385 -2340 -5909 6675 11874 15706 13896 13323
3383A3323Q283p017q435N640m622j9751J683L310J1707n430m395p300O87K1126
$$ 13323 21606 14589 6154 11794 7172 -12579 -10896 -7586 4121 -1309 -5704 -13004 -12317 8809
3369H809J026n973j430p433J862o973m336J182J828J2403L485J831K573Q065j7284
$$ 8809 9835 3862 2432 -5001 -3139 -10112 -14448 -13266 -11438 965 4450 6281 8854 16919 -365
3354c65n839J2081M899n440j1425o823Q293O356l52M461j0346P10J0335K271L356
$$ -365 -6204 5877 10776 5336 -6089 -12912 -4619 1737 1385 5846 -4500 -3790 6545 8816 12172
3339A2172j6416o846n93K741j686k423J7813l942N698Q268q429m309K901N912
$$ 12172 -4244 -11090 -11683 -8942 -10628 -13051 4762 820 6518 14786 6357 2048 4949 10861
3325A0861j2082k491m059r185K855J667M877o037k111Q799j090o811l078J845
$$ 10861 -1221 -3712 -7771 -16956 -14101 -12434 -7557 -13594 -15705 -6906 -7996 -14807 -17885 -16040
3311a6040L559O933O72p77P655q914j5782R820L472O169M238m805p712K961L015
$$ -16040 -12481 -5548 -4876 -5653 2002 -6912 -22694 -12874 -9402 -3233 1005 -3800 -11512 -8551 -5536
3296e536N25O909M483k308j5041m401K338M162P598J4437k743q821n641q551r754
$$ -5536 -5011 1898 6381 4073 -10968 -15369 -13031 -8869 -1271 13166 10423 1602 -4039 -12590 -22344
3281b2344O16J3139J0244J3469k10p583j1201J9340N792j3869p630J3561J0469
$$ -22344 -21728 -8589 1655 15124 14914 7331 -3870 15470 21262 7393 -237 13324 23793
3268B3793j6323l697j11j0679P58P771j187n764N76l256J6377N719Q162L18j9036
$$ 23793 7470 3773 3662 -7017 -6259 1512 325 -5439 -4863 -8119 8258 13977 22139 22457 3421
3253C421j2185J354L684j3992Q039J1033j167N831J350J0649K954O11l214j632
$$ 3421 -8764 -7410 -3726 -17718 -9679 1354 187 6018 7368 18017 20971 21582 18368 16736
3239A6736K463Q503m709j2109j011r715L471P32q052O298k843j1401r730M810
$$ 16736 19199 27702 22993 10884 9873 158 3629 4361 -3691 2607 -236 -11637 -21367 -16557
3225a6557J1029J4513n030p035J0766J931r162j0772J0923j1961k816M601N309
$$ -16557 -5528 8985 3955 -3080 7686 9617 455 -10317 606 -11355 -14171 -9570 -4261
3212d261J666O631N739j523J0845J3893j1522k0939K354n112j0426l85N850K865
$$ -4261 -2595 4036 9775 8252 19097 32990 21468 529 2883 -2229 -12655 -13040 -7190 -4325
3198d325J1171O160n188k709q044N189J161k0709N235M426j78P361R406j3355
$$ -4325 6846 13006 7818 5109 -2935 2254 3415 -17294 -12059 -7633 -7811 -450 8956 -4399
3184d399j3737R688o832o039R501L221P494K126M152j429K470j3585m875o194
$$ -4399 -18136 -8448 -15280 -21319 -11818 -8597 -1103 1023 5175 3746 6216 -7369 -12244 -18438
3170a8438m317K91M160r734P40J967R221Q271O953m762j3250Q908p014M325O105
$$ -18438 -22755 -22464 -18304 -28038 -27298 -25331 -16110 -7839 -886 -5648 -18898 -9990 -17004 -12679 -6574
3155f574K795k37q724K576K14j3233l94J1700J2813N581r310N945O616j3196j0209
$$ -6574 -3779 -4016 -12740 -10164 -9950 -23183 -23577 -11877 936 6517 -2793 3152 9768 -3428 -13637
3140a3637J1236R717L77j287J975j1456p589m882j608J0872N525J2702L904o233
$$ -13637 -2401 7316 7693 6406 8381 -3075 -10664 -15546 -17154 -6282 -757 11945 15849 9616
3126I616J2877l976j2260j147J3423N099p746j1206j026K17Q560O187j217k545
$$ 9616 22493 18517 6257 5110 18533 23632 15886 4680 3654 3871 12431 18618 17401 14856
3112A4856n170q907p630n419m363N475N337L414l632p6j3191R50J5843k333K58
$$ 14856 9686 779 -6851 -12270 -16633 -11158 -5821 -2407 -6039 -6115 -19306 -18356 -2513 -4846 -4588
3097d588Q510K955l888l865J0048M698j3036R39J3179n963r604j258J232k520
$$ -4588 3922 6877 2989 -876 9172 13870 834 1773 14952 8989 -615 -1873 -641 -3161
3083c161M733p905m689n338N366K456k116j4066O250R065J878n53r313K137J8327
$$ -3161 1572 -6333 -11022 -16360 -10994 -8538 -10654 -24720 -18470 -9405 -7527 -8080 -17393 -15256 3071
3068C071K895r896p151o828J803J021J3860r766q969J2661K7753J5061K73j1943
$$ 3071 5966 -3930 -11081 -17909 -16106 -15085 -1225 -10991 -19960 -7299 20454 35515 35788 23845
3054B3845j6097r678P360l322j7570n1j636q920L101L692k07M512O932N026K640
$$ 23845 7748 -1930 5430 2108 -15462 -15513 -17149 -26069 -22968 -19276 -19483 -14971 -8039 -3013 -373
3039c73L631L041m116j5859k241L764k552N255M49k0685J672K1883K664K72j8457
$$ -373 3258 6299 2183 -13676 -15917 -12153 -14705 -9450 -9001 -29686 -28014 -6131 -3467 -3195 -21652
3024b1652o576O171R044n912r152M231M656K555J6710J940L727J4110K683j6331
$$ -21652 -28228 -22057 -13013 -18925 -28077 -23846 -19190 -16635 75 2015 5742 19852 22535 6204
3010F204p335R201l695P169j0359j3996O086R351j0008J842O474n898Q348J0731
$$ 6204 -1131 8070 4375 11544 1185 -12811 -6725 2626 -7382 -5540 934 -4964 3384 14115
2996A4115j134q491n117l629l074O208J863m305J1867J4944Q6k3133j7071k536
$$ 14115 12981 4490 -627 -4256 -7330 -1122 741 -3564 8303 23247 23333 200 -16871 -19407
2982a9407K010O479q901l096J1513R284R16p07J8012l492q752n679m050l305O684
$$ -19407 -17397 -10918 -19819 -22915 -11402 -2118 -1202 -1909 16103 12611 3859 -1820 -5870 -9175 -2491
2967b491L9J0359m009p30M755j4100k944j297p936M234L92K453o4Q164L304K268
$$ -2491 -2452 7907 3898 3168 7923 -6177 -9121 -10418 -18354 -14120 -13728 -11275 -11339 -3175 129 2397
2951B397R451J0565j6076m344K319O310r564j942o086N041j042J72l13N763r339
$$ 2397 11848 22413 6337 1993 4312 10622 1058 -884 -6970 -1929 -2971 -2799 -3112 2651 -6688
2936f688j4830Q377R762K918n299M277L122j1197k518R753P722K148M5L171J533
$$ -6688 -21518 -13141 -3379 -461 -5760 -1483 1639 -9558 -12076 -2323 5399 7547 7592 10763 12296
2921A2296r901j3303O588Q265j3040N647R191M662j5430p12N496J691K612J4645
$$ 12296 2395 -10908 -4320 3945 -9095 -3448 5743 10405 -5025 -5737 -241 1450 4062 18707
2907A8707j3576k248L178n187K89O89l05k041q710O889L328o078j082p638l401
$$ 18707 5131 2883 6061 874 1163 1852 1547 -494 -9204 -2315 1013 -5065 -6147 -13785 -17186
2892a7186M236k988J569k55K570K837K430J2301r746J601O464m609O022j772M472
$$ -17186 -12950 -15938 -14369 -14624 -12054 -9217 -6787 5514 -4232 -2631 3833 -776 5246 3474 7946
2877G946L038O098p639j5290K056j041k664k236J5849k146m662L088o888P311
$$ 7946 10984 17082 9443 -5847 -3791 -4832 -7496 -9732 6117 3971 -691 2397 -4491 2820
2863B820P289M231J7338n17k3611k684R099j4087L069n650j6154J350J0543J6084
$$ 2820 10109 14340 31678 31161 7550 4866 13965 -122 2947 -2703 -18857 -17507 -6964 9120
2849I120M516o979k702L913l077J3L353p685j6009l186O650R520O02o632j813
$$ 9120 13636 6657 3955 7868 4791 4804 8157 472 -15537 -18723 -12073 -2553 -1951 -8583 -10396
2834a0396J4607J0895j0949J17m060o664p077N433L853N844M837q236n068j3231
$$ -10396 4211 15106 4157 4274 214 -6450 -13527 -8094 -4241 1603 6440 -1796 -6864 -20095
2820b0095m764M017k139J0738P524J6533l178j1187M328P511O736J0470o694q234
$$ -20095 -24859 -20842 -22981 -12243 -4719 11814 8636 -2551 1777 9288 16024 26494 19800 11566
2806A1566M36j831l074k1406j915K187q775O288K7833N141j1421r180m770P993
$$ 11566 12002 10171 7097 -14309 -16224 -14037 -22812 -16524 11309 16450 5029 -4151 -8921 -928
2792i28J4865o601j1542L911J3244L62p476N995Q423J2218o520j870p819j5880
$$ -928 13937 7336 -4206 -295 12949 13311 5835 11830 20253 32471 25951 24081 16262 382
2778C82m402j2130j5016m27J3919P938N504j173L238J2950O304K456P62j7155
$$ 382 -4020 -16150 -31166 -31593 -17674 -9736 -4232 -5405 -2167 10783 17087 19543 20305 3150
2764C150j3186O778J4220K603r437j3983O414J3905R59N13J004j93j0191l801
$$ 3150 -10036 -3258 10962 13565 4128 -9855 -3441 10464 11423 11936 12940 12747 2556 -1245
2750a245Q312k534j0811L066m810n314J9186L444k871o894N523M793j2j6302n851
$$ -1245 7067 4533 -6278 -3212 -8022 -13336 5850 9294 6423 -471 5052 9845 9833 -6469 -12320
2735a2320J4458J0617K961m796K081J972Q378J119l056o859P684L581j0423o166
$$ -12320 2138 12755 15716 10920 13001 14973 23351 24470 21414 14555 22239 25820 15397 9231
2721I231l02P873O995L120M624j184j8811j3539Q58j4342N509J5329P661k573
$$ 9231 8929 16802 23797 26917 31541 30357 11546 -1993 -1135 -15477 -9968 5361 13022 10449
2707A0449j651Q525k725m781r074n491J4250J166m75o299Q671J1659n532j4846
$$ 10449 8798 17323 14598 9817 743 -4748 9502 10668 10193 3894 12565 24224 18692 3846
2693C846j3498j423j2812O758J5756K191o089K31N953P070O939k814j2559j1111
$$ 3846 -9652 -11075 -23887 -17129 -1373 818 -5271 -5040 913 7983 14922 12108 -451 -11562
2679a1562J2138J7188m821pr64q876k7224l097O279O25P218O947n873J456q05
$$ -11562 576 17764 12943 12936 11972 3096 -24128 -27225 -20946 -20321 -13103 -6156 -12029 -10573 -11378
2664a1378J0576N305j0878J704N070p669j0073J1L027J2718P772j8045K492N803
$$ -11378 -802 4503 -6375 -4671 399 -7270 -17343 -17332 -14305 -1587 6185 -11860 -9368 -3565
2650c565k934N599P995j125O30J4162J5563m093j9392q558l906r395o069J7481
$$ -3565 -6499 -900 7095 5970 6600 20762 36325 32232 12840 4282 376 -9019 -15088 2393
2636B393K4172N706j5516j1032l189j5702l452J7068R817j8579j2148P179J6676
$$ 2393 26565 32271 16755 5723 2534 -13168 -16620 448 10265 -8314 -20462 -13283 3393
2623C393K096k810J502M28M559K702L739O981j4461j4331r071J8280j0183j4519
$$ 3393 5489 2679 4181 4609 9168 11870 15609 22590 8129 -6202 -15273 3007 -7176 -21695
2609b1695J4903p8J0315j28J962o589P54L431j1663o09R637N288l527k493J519
$$ -21695 -6792 -6870 3445 3317 5279 -1310 -556 2875 -8788 -9397 240 5528 2001 -492 1027
2594A027M060p90J1937P857k562p979M407N50L685k018r2j7035j3486j307O511
$$ 1027 5087 4297 16234 24091 21529 13550 17957 18507 22192 20174 20082 3047 -10439 -11746 -5235
2579e235m240K772P15j733k393K982j243N490J1621L565n960L853J1741J056l276
$$ -5235 -9475 -6703 -5988 -7721 -10114 -7132 -8375 -2885 8736 12301 6341 10194 21935 22991 19715
2564A9715N544Q46n333j32j6115j6358j645N771Q465p58J0320k924j0754M412
$$ 19715 25259 26105 20772 20640 4525 -11833 -13478 -7707 758 0 10320 7396 -3358 1054
2550A054M28L895P681K027q655p628l554J0223R650J346K164M799j083o033q126
$$ 1054 1482 5377 13058 15085 6430 -1198 -4752 5471 15121 16467 18631 23430 22347 16314 8188
2535H188l90n135J5812l406j818L418O15R75q755p945J1464J1802j867j8759J8619
$$ 8188 7798 2663 18475 15069 13251 16669 17284 18259 9504 1559 13023 24825 22958 4199 22818
2520B2818j1125p159l57L241M418P503J3723m491j2856j8925r278p316N779J0001
$$ 22818 11693 4534 4177 7418 11836 19339 33062 28571 15715 -3210 -12488 -19804 -14025 -4024
2506d024M696p40J914l307O168k985j933K733j173k844r534Q696k290k735Q253
$$ -4024 672 -68 1846 -1461 4707 1722 -211 2522 1349 -1495 -11029 -2333 -4623 -7358 895
2491H95J4070P274L455r077o993P774J1340k1932k1352Q652L279J492J4612J3140
$$ 895 14965 22239 25694 16617 9624 17398 28738 6806 -14546 -5894 -2615 -1123 13489 26629
2477B6629k790j2431j079j607K373J358o734j2573L349J2628n420n863O92p465
$$ 26629 23839 11408 10329 8722 11095 12453 5719 -6854 -3505 9123 3703 -2160 -1468 -8933
2463h933R089K124j0439J625P018k280j158J750m076p824R002J708j8694j3020
$$ -8933 156 2280 -8159 -6534 484 -1796 -2954 -1204 -5280 -13104 -4102 -2394 -21088 -34108
2449c4108Q315O043l225k092k965Q711J187k0562r5Q103K1444J7639J588p335
$$ -34108 -25793 -19750 -22975 -25067 -28032 -19321 -18134 -38696 -38791 -30688 -9244 8395 9983 2648
2435B648m862P30j8344k255J0170J2069j240m428l30Q839N021O983r489o298R435
$$ 2648 -2214 -1484 -19828 -22083 -11913 156 -1084 -5512 -5842 2997 8018 15001 5512 -786 8649
2420H649J4623j3631p155M405k26R51r403J908N269r446l365l00P796J3353l043
$$ 8649 23272 9641 2486 6891 6665 7616 -1787 121 5390 -4056 -7421 -7721 75 13428 10385
2405A0385m643N657p735p589P310J0137k684k357p143m737m052p466k853J2970
$$ 10385 5742 11399 3664 -3925 3385 13522 10838 8481 1338 -3399 -7451 -14917 -17770 -4800
2391d800K535q220J4585J3234j792r855j1083J0612L169p937J2615O113o205L910
$$ -4800 -2265 -10485 4100 17334 15542 5687 -5396 5216 8385 448 13063 19176 12971 16881
2377A6881m101j1973l12O307L39p748l540N382J4035q106L841M289R426j1356
$$ 16881 12780 807 495 6802 7141 -607 -4147 1235 15270 7164 11005 15294 24720 13364
$$ [...]
##END NTUPLES=NMR SPECTRUM
##END=
