##TITLE=Analysis number 327325
Compound Code cc 52406
Book Reference 464/116/1
Project Code adrs
Chemist Name chrisr
##JCAMPDX= 6.0         $$ Bruker NMR JCAMP-DX V2.0
##DATA TYPE= NMR SPECTRUM
##DATA CLASS= NTUPLES
##ORIGIN= Bruker BioSpin GmbH
##OWNER= nmr
$$ XWIN-NMR		Version 3.5
$$ Wed Mar 21 12:27:45 2007 GMT Standard Time (UT+0h)  MAYBRIDGE\nmr@NMR_250MHZ
##.OBSERVE FREQUENCY= 250.131544655141
##.OBSERVE NUCLEUS= ^1H
##.ACQUISITION MODE= SIMULTANEOUS (DQD)
##.ACQUISITION SCHEME= undefined
##.AVERAGES= 16
##.DIGITISER RES= 18
##SPECTROMETER/DATA SYSTEM= dpx250
##.PULSE SEQUENCE= zg30
##.SOLVENT NAME= CDCl3
##.SHIFT REFERENCE= (INTERNAL, CDCl3, 0, 16.522)
##AUDIT TRAIL= $$ (NUMBER, WHEN, WHO, WHERE, WHAT)
$$ ##TITLE= Audit trail, XWIN-NMR		Version 3.5
$$ ##JCAMPDX= 5.01
$$ ##ORIGIN= Bruker BioSpin GmbH
$$ ##OWNER= nmr
$$ C:\u/data/dgb/nmr/ADRS/1430/pdata/1/auditp.txt
$$ ##AUDIT TRAIL=  $$ (NUMBER, WHEN, WHO, WHERE, WHAT)
(   1,<2007-03-21 12:27:24.25 +000>,<MAYBRIDGE\nmr>,<NMR_250MHZ>,
      <created by zg, POWCHK disabled, PULCHK disabled
       configuration hash MD5:
       49 4B E0 1D 92 C2 6B 37 9F E6 65 BC 52 41 86 1D
       data hash MD5: 64K
       9F 55 D2 BC 4B E0 C3 11 51 BB 9F A4 34 91 86 83>)
(   2,<2007-03-21 12:27:37.21 +000>,<MAYBRIDGE\nmr>,<NMR_250MHZ>,
      <Start of raw data processing
       ef LB = 0.3 FT_mod = 6 PKNL = 1 SI = 32K 
       data hash MD5: 32K
       2E 19 6D E5 00 01 E6 C7 22 82 7A 69 05 3F A4 A3>)
(   3,<2007-03-21 12:27:38.89 +000>,<MAYBRIDGE\nmr>,<NMR_250MHZ>,
      <apk 
       data hash MD5: 32K
       52 49 FD 67 2F 66 BA 67 D2 21 C8 8E E8 49 83 6E>)
(   4,<2007-03-21 12:27:39.60 +000>,<MAYBRIDGE\nmr>,<NMR_250MHZ>,
      <abs ABSG = 5 
       data hash MD5: 32K
       53 5C DB 90 D2 65 3F 23 4C 46 80 10 24 8F 7B FD>)
$$ ##END=
$$ 
$$ hash MD5
$$ 48 FB C3 2E B7 95 A4 C1 B6 E2 8B 6E 4E 22 8A E5
##$RELAX= 
##$RELAX= 
##$RELAX= 
##$RELAX= 
##$RELAX= 
##$RELAX= 
##$RELAX= 
$$ Bruker specific parameters
$$ --------------------------
##$DU= <C:\u>
##$EXPNO= 1430
##$NAME= <ADRS>
##$PROCNO= 1
##$TYPE= <nmr>
##$USER= <dgb>
##$AMP= (0..31)
100 100 100 100 100 100 100 100 100 100 100 100 100 100 100 100 100 100 
100 100 100 100 100 100 100 100 100 100 100 100 100 100 
##$AQSEQ= 0
##$AQ_mod= 3
##$AUNM= <au_zg>
##$AUTOPOS= <18 >
##$BF1= 250.13
##$BF2= 250.13
##$BF3= 250.13
##$BF4= 250.13
##$BF5= 500.13
##$BF6= 500.13
##$BF7= 500.13
##$BF8= 500.13
##$BYTORDA= 1
##$CFDGTYP= 0
##$CFRGTYP= 5
##$CHEMSTR= <none>
##$CNST= (0..31)
1 1 145 1 1 1 1 1 1 1 1 1 1 1 1 1 1 1 1 1 1 1 1 1 1 1 1 1 1 1 1 1 
##$CPDPRG= <>
##$CPDPRG1= <>
##$CPDPRG2= <>
##$CPDPRG3= <>
##$CPDPRG4= <mlev>
##$CPDPRG5= <mlev>
##$CPDPRG6= <mlev>
##$CPDPRG7= <mlev>
##$CPDPRG8= <mlev>
##$CPDPRGB= <>
##$CPDPRGT= <>
##$D= (0..31)
0 1 0 0 0 0 0 0 0 0.06 0 0 0 0 0 0 0.0002 0 0 0 0 0 0 0 0 0 0 0 0 0 0 
0 
##$DATE= 1174480043
##$DBL= (0..7)
120 120 120 120 120 120 120 120 
##$DBP= (0..7)
150 150 150 150 150 150 150 150 
##$DBP07= 0
##$DBPNAM0= <>
##$DBPNAM1= <>
$$ [...]
##$SUBNAM7= <"">
##$SUBNAM8= <"">
##$SUBNAM9= <"">
##$SW= 20.6930455092707
##$SWIBOX= (0..15)
0 0 3 0 0 0 0 0 0 0 0 0 0 0 0 0 
##$SW_h= 5175.983436853
##$TD= 65536
##$TD0= 1
##$TE= 683.16
##$TE2= 300
##$TE3= 300
##$TEG= 300
##$TL= (0..7)
0 120 120 120 120 120 120 120 
##$TP= (0..7)
150 150 150 150 150 150 150 150 
##$TP07= 0
##$TPNAME0= <>
##$TPNAME1= <>
##$TPNAME2= <>
##$TPNAME3= <>
##$TPNAME4= <>
##$TPNAME5= <>
##$TPNAME6= <>
##$TPNAME7= <>
##$TPOAL= (0..7)
0.5 0.5 0.5 0.5 0.5 0.5 0.5 0.5 
##$TPOFFS= (0..7)
0 0 0 0 0 0 0 0 
##$TUNHIN= 0
##$TUNHOUT= 0
##$TUNXOUT= 0
##$USERA1= <user>
##$USERA2= <user>
##$USERA3= <user>
##$USERA4= <user>
##$USERA5= <user>
##$V9= 5
##$VALIST= <valist>
##$VCLIST= <CCCCCCCCCCCCCCC>
##$VD= 0
##$VDLIST= <DDDDDDDDDDDDDDD>
##$VPLIST= <PPPPPPPPPPPPPPP>
##$VTLIST= <TTTTTTTTTTTTTTT>
##$WBST= 1024
##$WBSW= 4
##$XGAIN= (0..3)
0 0 0 0 
##$XL= 0
##$YL= 0
##$YMAX_a= 434778
##$YMIN_a= -518184
##$ZGOPTNS= <>
##$ZL1= 120
##$ZL2= 120
##$ZL3= 120
##$ZL4= 120
##$ABSF1= 16.522
##$ABSF2= -4.171173
##$ABSG= 5
##$ABSL= 3
##$ALPHA= 0
##$AQORDER= 0
##$ASSFAC= 0
##$ASSFACI= 0
##$ASSFACX= 0
##$ASSWID= 0
##$AUNMP= <proc_1d>
##$AZFE= 0.1
##$AZFW= 0.1
##$BCFW= 0
##$BC_mod= 0
##$BYTORDP= 0
##$COROFFS= 0
##$CY= 12.5
##$DATMOD= 1
##$DC= 0
##$DFILT= <>
##$DTYPP= 0
##$F1P= 14.0000005364418
##$F2P= -0.99999901652339
##$FCOR= 0.5
##$FTSIZE= 32768
##$FT_mod= 6
##$GAMMA= 0
##$GB= 0
##$INTBC= 1
##$INTSCL= 1
##$ISEN= 128
##$LB= 0.3
##$LEV0= 0
##$LPBIN= 0
##$MAXI= 10000
##$MC2= 0
##$MEAN= 0
##$ME_mod= 0
##$MI= 0
##$NCOEF= 0
##$NC_proc= -5
##$NLEV= 6
##$NOISF1= 0
##$NOISF2= 0
##$NSP= 0
##$NTH_PI= 0
##$NZP= 0
##$OFFSET= 16.522
##$PC= 1
##$PHC0= 233.7894
##$PHC1= 7.582993
##$PH_mod= 1
##$PKNL= yes
##$PPARMOD= 0
##$PSCAL= 4
##$PSIGN= 0
##$REVERSE= no
##$SF= 250.13
##$SI= 32768
##$SIGF1= 0
##$SIGF2= 0
##$SINO= 400
##$SIOLD= 32768
##$SREGLST= <1H.CDCl3>
##$SSB= 0
##$STSI= 32768
##$STSR= 0
##$SW_p= 5175.98343685301
##$SYMM= 0
##$S_DEV= 0
##$TDeff= 65536
##$TDoff= 0
##$TI= <Analysis number 999999
Compound Code 99
Book Reference 9
Project Code 9>
##$TILT= no
##$TM1= 0
##$TM2= 0
##$TOPLEV= 0
##$USERP1= <user>
##$USERP2= <user>
##$USERP3= <user>
##$USERP4= <user>
##$USERP5= <user>
##$WDW= 1
##$XDIM= 32768
##$YMAX_p= 475852667
##$YMIN_p= -268020
$$ End of Bruker specific parameters
$$ ---------------------------------
##NTUPLES= NMR SPECTRUM
##VAR_NAME=  FREQUENCY,     SPECTRUM/REAL,   SPECTRUM/IMAG
##SYMBOL=    X,             R,               I
##VAR_TYPE=  INDEPENDENT,   DEPENDENT,       DEPENDENT
##VAR_FORM=  AFFN,          ASDF,            ASDF
##VAR_DIM=   32768,         32768,           32768
##UNITS=     HZ,            ARBITRARY UNITS, ARBITRARY UNITS
##FACTOR=    0.157963299565203, 1,           1
##FIRST=     4132.6476996994, 0,             0
##LAST=      -1043.33573715361, 0,           0
##MIN=       -1043.33573715361, -268020,     0
##MAX=       4132.6476996994, 475852667,     0
$$ Real data points
##PAGE= N=1
##DATA TABLE= (X++(R..R)), XYDATA
$$ [...]
27371 19985 -8287 65087 139883 185019 195142 135007 61735 58774 65891 99856 76424 -8383
27359 -8383 -17603 81471 71772 69522 39018 116375 133980 132500 143507 171843 140757 163358 152609
27346 152609 157183 72989 12302 -61538 -98248 -72881 -45632 -66068 -69993 -50045 -77519 -121716
27334 -121716 -75680 -22748 -36426 -51979 -51465 55739 66923 11107 24817 103957 43663 -60104
27322 -60104 -34485 4383 -3018 -19435 -25115 -43887 -77083 -66526 -28643 -6240 65125 33083
27310 33083 11535 -555 -54115 -134555 -51414 -46062 -23806 84947 90569 68590 61942 -17815
27298 -17815 -47446 -89287 -60175 32499 40484 81844 71253 71778 61899 19625 5034 -38925
27286 -38925 -55680 -58649 -97403 -164355 -112932 -50251 -2772 40054 35003 4670 64335 72004
27274 72004 69074 30914 2190 -28983 6128 35897 90203 34175 -39101 -43888 -82269 -71223
27262 -71223 -15755 44425 51295 88559 34266 -20542 12726 12097 7177 -21564 20184 -25269
27250 -25269 -13522 101320 101272 45963 39333 38370 29068 82421 103382 68622 35754 12188 -59544
27237 -59544 -82947 16128 81387 56088 -40251 -40611 330 -1129 -38648 3710 73129 86463
27225 86463 89474 20342 -31895 -31593 70721 153897 164508 177433 200079 137304 54268 -40155
27213 -40155 -82225 -47928 25940 6629 -29025 11005 61694 85198 27509 -16075 -49644 -10756
27201 -10756 37719 -39699 -183142 -190585 -91359 26369 -8487 -83541 -39028 -30963 -32744 -108841
27189 -108841 -176905 -93347 46027 44842 29100 -3592 -75673 -34924 27187 42424 86342
27178 86342 65698 41771 6746 -79670 -73347 -60266 -56593 -28907 11041 -37650 19996 61946
27166 61946 96305 62902 32258 77752 76508 83607 96557 108555 2815 -41036 -9625 63446
27154 63446 101240 -24990 -55873 12192 42968 53464 26842 -29885 -124755 -48429 -27483
27143 -27483 -8880 49599 67268 19389 42017 34885 11868 -3172 -18841 -19351 26893 52063
27131 52063 -50744 -75722 -81796 -136437 -159656 -45954 73872 176513 200514 80922 40045
27120 40045 22064 16059 56358 114026 120386 71048 -8596 100689 218215 140765 90122 -97
27108 -97 -12359 -51845 -75983 -65979 33075 87296 103087 102716 76419 100880 45002 -61989
27096 -61989 -39161 40850 74035 107669 92344 37746 -33860 -18041 -5876 -96797 -103383 -40713
27084 -40713 21605 25167 42336 51835 38672 7788 31440 48574 -16253 -51378 -105743 -103554
27072 -103554 -93216 -58818 -103680 -118296 -75517 -46956 219 38534 -1939 -45660 -346
27061 -346 20262 -38741 -69416 20010 94093 72963 76709 41257 18273 75909 87941 115281
27049 115281 152043 57365 -19892 -75396 -29127 -3504 -32111 -46469 -35394 11258 32050
27038 32050 43763 -26683 14132 35931 66903 39707 54382 87179 68555 61084 18146 -54267
27026 -54267 -103412 -4213 70004 43579 -14043 11759 -1667 18292 98439 77510 55123 -5719
27014 -5719 4162 42745 9940 -41477 -69839 -60487 -87692 -28173 33289 52326 48709 -3747
27002 -3747 -3366 -54643 6422 13889 41924 40577 -11402 -38757 56322 65030 46191 23848 -47178
26989 -47178 -187619 -268020 -222257 -115719 -107436 -78584 -75968 -16459 82128 28297 -4905 -78967
26977 -78967 -85094 -14986 -22771 65382 86886 9351 11856 67573 139747 128533 67859 -2715
26965 -2715 -47537 -83081 -30647 14801 7457 -30170 -148025 -128462 -95140 -100742 -13107 41039
26953 41039 22276 96590 117474 80001 -11928 8691 28150 57249 79055 -14346 -124218
26942 -124218 -103658 -23659 35144 14417 -46711 -87613 -16112 80534 41117 -6056 -360 61644
26930 61644 57746 -30599 -51970 -26731 -10148 -46733 -79529 6872 -38994 -36588 18954 35808
26918 35808 76561 148563 222819 208514 55196 -3359 5662 32853 7889 25093 33 -42360
26906 -42360 -34206 -13757 -6161 10447 6420 -58351 -38807 -6768 25699 65356 -42351 -99243
26894 -99243 -64960 -5393 -25899 -91577 -95956 -114362 -107905 -82217 3559 84189 149107 62860
26882 62860 -5327 -28814 79 30641 88210 107708 15987 -11458 -7453 31847 37738 25366
26870 25366 41749 30448 -5532 -619 33411 2931 5654 18703 78196 95542 128720 122526
26858 122526 72707 66922 70806 28850 -5391 22542 -21682 -44849 -3490 2486 -31246 -91001
26846 -91001 -54238 -75947 -101863 -31793 56685 74866 209 -17667 -78809 -120513 -101687 2699
26834 2699 64939 41123 -48371 -73422 19989 35228 35947 42388 8469 14677 47510 72287 1978
26821 1978 29443 32695 85455 73768 11699 46492 46338 -15159 12650 -76759 -169430 -112212
26809 -112212 -59942 -101473 -28367 -46447 -44761 9595 30383 43130 82670 101597 97414 72049
26797 72049 103178 157302 154282 93465 56301 38294 -20955 -28832 -49538 -15165 27183 67295
26785 67295 30603 -64797 -73187 1660 38254 127247 147002 107336 154938 157019 82633 33813
26773 33813 6799 139949 142154 40537 -19082 -5128 34065 15383 22501 33433 16639 75987
26761 75987 114911 25533 -39384 -67556 -136369 -201314 -169003 -138713 -129881 -100637 -31865 28092
26749 28092 61810 25895 37052 20171 -96062 -107423 -48486 68100 77671 63260 31947
26738 31947 14532 42042 33854 -28898 -57451 -33323 22198 20507 -25452 -38174 -38749 -50181
26726 -50181 3605 33558 90131 89637 92462 24494 31832 70190 -13784 -4897 4445 -21044 373
26713 373 -19047 -36576 -12087 60972 94297 54275 -15995 5976 -41886 -10207 14078 68677
26701 68677 93564 38157 29477 54823 154400 172652 202715 145966 129482 93082 90336 88008
26689 88008 114105 111154 112249 91412 50701 6035 -449 11805 9110 -20875 32232 49706
26677 49706 -12797 -33051 -40799 -14668 -77794 -32472 72856 44262 -58862 -29680 -1612
26666 -1612 22569 36900 40240 70665 58548 66215 80396 62710 93252 81615 31204 15678
26654 15678 -36187 -69292 -80954 -36936 24378 24696 32763 -31502 -125555 -117633 -80472 -90504
26642 -90504 -124080 -35448 56307 105563 123047 66542 -37169 2682 34254 92705 61920
26631 61920 15472 -59733 -111951 -57061 -59573 -14172 2973 -21768 -103040 -71012 -56366 -8764
26619 -8764 24830 -5916 46613 150235 205388 136518 127649 89100 30572 11060 122224 172792
26607 172792 169625 111849 133244 89774 17484 -34632 -34195 -29496 15612 186 -14787 20472
26595 20472 107588 92005 -29395 -17421 2961 -12848 15740 95925 96100 51847 67747 77843
26583 77843 -6458 -65661 20639 98738 -39846 -93798 -66334 -6396 -52897 -21096 -35318
26572 -35318 -506 99357 110003 44543 -8671 67787 77050 63937 68802 73510 35204 52508
26560 52508 65174 115262 111705 65888 43047 77617 60353 20711 -11855 40763 26991 -44904
26548 -44904 -82352 -46008 -2416 27523 -25046 -36928 -995 61053 77068 84903 144924 156165
26536 156165 144770 190222 190268 171255 29091 -42137 -9873 12446 51281 20957 -25332 -84639
26524 -84639 -47475 5025 -1610 -16911 -37916 11915 -5851 -67734 -133310 -124271 -80334 -79705
26512 -79705 -74247 -32566 9386 -35435 -81650 -138082 -57236 -9749 -14716 9895 5864 -51769
26500 -51769 -37516 -22234 -72266 -46460 56506 20090 -43647 -48497 828 40066 37021 21778
26488 21778 11474 -53921 -65112 -42746 -27356 22397 -28395 -64868 -41112 -117339 -119673 -118918
26476 -118918 -101415 28305 45952 -30768 -37251 70323 55990 -53120 -77325 -47318 -40831
26465 -40831 -50022 -29507 33469 46528 -4247 -80116 -110114 -47555 16552 5157 52606 -4359
26453 -4359 -17954 46164 86627 57063 3476 20959 -19746 15922 76379 45987 20292 -6214
26441 -6214 34232 96547 35421 2086 40452 13711 -27915 10919 1657 -8933 -13780 12617
26429 12617 -4050 4210 63310 77161 -16744 -84202 -43201 -25908 -5319 -43647 -1 38532
26417 38532 9917 13569 82266 4358 -73101 -70151 -38173 38776 102441 64090 128689 133591
26405 133591 128176 55717 9546 -32952 -23028 -21892 -15899 -18879 -24383 33549 106527 84448 102191
26392 102191 90232 75866 40784 23781 -14115 -30404 -45831 -63474 -130783 -177065 -163132
26381 -163132 -131421 -43150 -318 -28971 -14152 132511 180862 98597 49204 45242 60380
26370 60380 -5358 -13474 -23319 -116516 -77533 -92189 -157821 -80408 -51886 -30315 26226 16288
26358 16288 -7004 34993 93329 33235 -14342 -5625 44042 46806 -54569 -49854 -91248 -119822
26346 -119822 -49057 5226 -33543 -39295 -29415 -65995 -89040 -59509 -803 -78542 -186560 -152050
26334 -152050 -60957 -43901 -118552 -95944 -52396 -20508 55214 34243 -6042 -657 -9118 -43348
26322 -43348 19393 67800 32913 20261 -38979 -54552 -48754 -112067 -125295 -94272 -86193 -58070
26310 -58070 -6301 31635 8563 385 66896 36599 73208 17094 19397 31064 54604 23205
26298 23205 -43683 -56700 16644 78913 119860 132465 92753 30639 30671 38275 135053 98361
26286 98361 71143 128735 126379 122203 137550 45604 16291 -23680 -59917 -48773 -88137 -12928
26274 -12928 105416 144542 35485 67786 51471 -24133 -8644 -35041 -52618 -14137 -13331 13025
26262 13025 62138 66548 22989 -42920 -83409 -22650 -32369 -19285 42315 72034 71708 -59316
26250 -59316 -103731 -62296 -30476 -73570 -98073 -21203 95480 48595 18822 22614 -47172 25165
26238 25165 6294 -84585 -39737 1903 -34902 -103707 -160066 -94557 -13448 36692 44509 37943
26226 37943 22863 29422 -39375 -54041 -55159 -55696 -86223 -90778 -85585 -42372 -12328 -8565 -4597
26213 -4597 -84246 -154157 -5439 32296 -41803 -46895 -43522 13596 19421 -15050 -39037 -29621
26201 -29621 -90489 -41440 58386 107960 68159 46954 113722 89675 83147 47893 25863 37185
26189 37185 66297 75183 51644 -33729 -10364 3678 2894 -37875 -40331 -34461 -27361 -50005 -22946
26176 -22946 15225 -6933 -26137 -1452 92439 109805 120239 110506 83083 32297 72985 42730
26164 42730 -21111 -9724 -68218 -93653 -43810 36975 65069 -28953 -80509 -9641 72514 9760
26152 9760 -28874 -55221 26056 93542 12172 32227 63772 93024 84713 39599 -33327 -70412
26140 -70412 -92432 -7913 -4900 -78074 -80256 -54596 8075 13678 36482 95687 146983 140794
26128 140794 106509 84439 77541 73925 145367 201950 120624 12349 16111 -59085 -89104 -81861
26116 -81861 -148902 -79604 -61075 -32398 -25508 -43939 -135443 -182616 -131844 -124203 -69685 42471
26104 42471 145089 111734 52122 62588 7919 -90407 -98278 -147350 -113556 -105274 -98346 -59489
26092 -59489 -25611 -10528 -47675 -128051 -132207 -86557 -51893 -28108 23689 20224 4978 33812
26080 33812 31666 63469 86243 26914 -54026 -51615 26108 3015 57637 59681 -39482 -113485
26068 -113485 -104304 -75589 -119887 -99223 -74993 -29370 4033 -14291 -20678 2647 -23638 -54725
26056 -54725 -83053 -107897 -122493 -46061 -80398 -137013 -43856 24856 72455 131273 115709 89649
26044 89649 16150 -6149 2991 -13150 -73544 -193069 -251875 -205825 -118245 -22357 10324 -32114
26032 -32114 -18558 18200 -13498 31257 -38780 -65821 -16433 -45705 -25332 58152 11232 6087
26020 6087 -44547 -115735 -79108 -123604 -137320 -133519 -79870 -48959 -71703 -3802 -9014 -35572
26008 -35572 -42871 25665 -17656 -65457 -104166 -68805 -19781 -27374 15273 5222 -37179 -87453
25996 -87453 -47397 22237 79196 115563 85524 77151 96783 116981 33579 27532 57971 74696
25984 74696 91728 39371 7267 -23149 -40232 -71969 -11291 50494 164076 200150 161146
25973 161146 126676 112323 25587 -9562 -17078 -57380 -118301 -96243 61596 128408 58331
25962 58331 -46068 -61445 14757 106723 120280 117650 124710 -23067 -38900 72059 17088
25951 17088 -8613 18925 12038 38124 34794 6037 -26175 -70810 -26252 40398 67320 49523
25939 49523 53953 12642 55420 176929 150339 48097 5233 -89380 -78643 -18089 -42903
25928 -42903 -6819 10443 45190 44787 34807 111745 61824 75217 63804 8191 -49406 -94260
25916 -94260 -34038 5664 -12404 -77047 -116604 -142233 -98922 -136154 -70096 47393 63299
25905 63299 65550 55670 48389 10197 69322 57366 41503 -27226 -47523 -65229 -87864 -54696
25893 -54696 -29709 -48403 -114571 -142176 -110369 -41591 663 -2621 6474 67997 54349 -18152
25881 -18152 28238 1332 -47676 -70901 -4672 83651 102435 38066 20197 2948 23531 24066
25869 24066 -48005 17940 38368 42172 80610 105323 170284 120762 80107 58029 9754 57307
25857 57307 50728 34060 -1435 19625 71545 55642 -9062 -41163 -48058 -13022 32671 -23625
25845 -23625 -93940 -26664 25815 -36906 -55096 -30592 -67048 -61996 2008 11015 -25948 -45624
25833 -45624 -13703 3620 -5291 -15762 19833 27012 89310 149970 85610 -12372 -70976 -28427
25821 -28427 -20334 20371 13896 17124 -39196 -63404 -64933 -68271 -60620 -7585 65554 108397 84820
25808 84820 54057 105128 29319 -2428 -57262 4250 28778 25460 4130 -42213 -30872 -27931
25796 -27931 11467 74126 59029 29309 91616 131496 128752 65880 39896 -51243 -88055 -85890
25784 -85890 -84064 -64967 -43154 -38084 10381 94500 147996 123296 107682 98349 13503 -20487
25772 -20487 -44696 18776 19136 10093 29377 -12545 13620 110570 166482 167868 88311 51579
25760 51579 135071 115818 25266 -61214 -15923 -7926 28248 52180 88942 104996 67561 64620
25748 64620 78253 -11425 -106679 -79678 805 9474 -23955 -64088 -63221 -103944 -98521 -58618
25736 -58618 67670 100251 42514 43625 17716 7060 28653 15154 64362 72597 53854 83411
25724 83411 68748 -7227 -33473 -26317 -36422 756 -8831 -101631 -59163 -71685 -74404 -60366
25712 -60366 -26327 26001 67790 108200 149497 111364 50405 54242 54154 90061 49174 38435
25700 38435 80116 110799 85882 70820 44178 64497 129130 123565 51760 40728 56488 47329
25688 47329 66678 6573 4286 -12551 -17918 -8769 -440 -20569 22892 11760 -47310 -74360
25676 -74360 -41213 6068 23574 -16186 -48699 -36417 14768 -51269 -4167 45115 48188 5707
25664 5707 -50383 -37687 32127 18734 -25299 -105237 -71383 6137 12871 -3571 -43679 -15550
25652 -15550 -52396 -39158 -71375 -89704 43946 71123 48362 31536 -17949 -101006 -163315
25641 -163315 -127886 -75675 -46013 -47942 4378 -61603 -71776 -47864 -111731 -107198 -84143 -156886
25629 -156886 -108285 -76563 -68065 -9299 28261 -8713 38097 43551 75713 50123 -43107 6131
25617 6131 133062 167697 108123 70548 19477 57650 101537 -15781 -75542 42990 24358
25606 24358 -15683 -2437 28732 6099 -3097 67584 91610 20632 -85860 -88597 -111073 -172193
25594 -172193 -185214 -125885 -129266 -62737 81447 55065 -13652 25179 -39879 -57368 -2574
25583 -2574 38618 43635 46405 65389 82982 54801 50354 29170 56973 64431 98334 77563 56266
25570 56266 49645 40445 10657 -76993 -121030 -85141 -52916 -9928 22814 -2760 33143 79758
25558 79758 133989 120272 -10632 -82674 -82343 -45406 -59898 -106506 -53103 31627 43855 13877
25546 13877 -2475 39523 118377 151217 168123 90046 62785 27830 18261 54138 -7965 -58758
25534 -58758 -15074 18535 34199 -3877 -33528 -45079 15663 81467 46552 -17977 24334 32797
25522 32797 -34573 -11065 61986 76199 99718 109601 40772 90367 107435 24182 67871 48207
25510 48207 20441 -22964 -39637 -9931 42665 96547 50837 34320 1407 -8533 -7425 -6417
25498 -6417 34679 52368 58472 -22879 -90507 -83902 -33121 -61634 -75203 -7834 -102264 -143120
25486 -143120 -137647 -99162 -123635 -85494 -29436 -59678 -108203 -135807 -154335 -117163 -127536 -70122
25474 -70122 -10230 -16707 -45159 -86740 -133917 -153958 -115788 -82427 2816 51790 21568 46880
25462 46880 30894 -76534 -78913 35454 77925 50547 34742 -15425 -29994 -27057 -77793 -154547
25450 -154547 -98387 -64008 -37535 -7441 46142 81568 48472 -47848 -19233 2978 -11076
25439 -11076 -32452 -86328 -83431 -55345 -80136 -116610 -38607 -11277 -71034 -31012 -20961 -66029
25427 -66029 -57020 -55180 -21828 39131 61820 125025 158307 107573 19892 -17235 34332 4106
25415 4106 -72903 -16701 20342 13971 -70017 -106376 -86280 -39572 36354 15418 -89413 -112102
25403 -112102 -102693 -56791 -15197 1894 26324 7550 26022 13425 23521 116962 153101 180142
25391 180142 174097 95376 61247 34203 9108 -17198 -45530 -93043 -27598 -64506 -65664 -35855
25379 -35855 -7429 117779 133853 31054 -14351 -969 27038 41711 55841 79244 42934
25368 42934 22467 54049 68777 31479 19774 747 -21757 -54168 -62515 -988 28189 -28051
25356 -28051 12091 37204 15504 4461 12508 40142 -73000 -164923 -109230 -65768 -56985 -46285
25344 -46285 -30807 16574 80228 -1108 -77317 -52777 69702 56284 55193 22817 102785 224917
25332 224917 155730 120430 94397 88050 -1411 -20472 6996 -35127 -53203 -82291 2478 21656
25320 21656 -36716 -67451 -64370 -30036 -16543 -52958 14170 55949 85890 66878 3314 -12115
25308 -12115 -60948 -125872 -89135 -31385 -17649 13929 46677 -39557 -55150 15801 241 -37131
25296 -37131 -36532 -48620 -35026 -26361 22574 34939 41753 32828 7767 -3566 34252 20179 53809
25283 53809 2324 -71534 -64696 -87398 -84847 -10151 71820 30830 -71418 -173325 -207351 -205725
25271 -205725 -113920 -26262 15679 81516 197463 245046 190051 140852 102567 103769 107255 103872
25259 103872 56887 -8934 32830 88612 107943 57766 47736 63388 139994 188783 176782
25248 176782 58553 24001 -47901 -50483 49354 25287 1136 -10627 -63705 -108855 -106836 -35653
25236 -35653 -17804 -113086 -182903 -258468 -216190 -165714 -71908 -27417 -72412 -146731 -90326 -64196
25224 -64196 -72575 -119738 -83547 -17610 12615 -24112 -33109 25656 18929 9940 -24835 -41325
25212 -41325 -59549 8819 91943 87124 44081 27171 -29902 -103598 -107677 -18231 81347 131660
25200 131660 146882 91218 86517 34456 -7262 63122 114791 22846 35160 15998 -56712 -88239
25188 -88239 -121874 -44239 8208 7645 -28573 -59204 -19545 144 10933 -44949 -89472 -112667
25176 -112667 -14171 23124 86431 113547 103766 145934 187117 176659 47712 -45147 -94688
25165 -94688 -103956 -11888 8403 -48298 -2471 -23866 -7260 -34569 -80469 -43040 41328 51377
25153 51377 51391 25229 17104 74490 94428 54338 79006 144977 148122 62349 -8809 17227 -16669
25140 -16669 -7244 -11862 -6144 98855 117800 123083 135069 180525 202303 37496 -78973 -151116
25128 -151116 -163178 -69823 -58957 -34849 -120254 -109840 -34610 22454 38053 -4268 -15972
25117 -15972 3740 23829 45576 33296 3013 6834 5432 30072 6033 -10295 7713 -15637
25105 -15637 -33503 -2140 12560 -24258 -47624 -53005 -80307 -76610 -21838 26220 66408 67191
25093 67191 18151 63834 70275 11987 -69613 -90898 -141198 -143238 -83038 -11369 -24401 -68609
25081 -68609 -53878 -120225 -86333 -87917 -134935 -123848 -94915 -36903 11605 68081 40841 84851
25069 84851 127741 63856 16790 -10149 42252 -18724 46032 52492 85216 69187 63348 130982
25057 130982 111811 58434 -20177 -45292 -69668 -42756 2141 45874 49087 65089 121582 38283
25045 38283 -74728 -104094 -6651 52579 76883 65864 -72529 -158666 -105823 13217 43100
25034 43100 -42575 -131004 -125856 -126306 -29689 63241 60311 89200 121375 42483 6695 12131 56215
25021 56215 -42046 -7968 89959 104341 60771 -16127 73715 74794 85202 57018 17487 14505
25009 14505 64647 73824 77793 50496 35013 68320 37436 -47773 -101416 -41624 -60982 -50749
24997 -50749 29920 20422 -34275 -26938 8525 -37018 -104268 -58411 -85900 -107753 -96601 -73202
24985 -73202 -108333 -148055 -83777 -46169 -28280 -3271 39906 15573 26882 28858 34442 -17490
24973 -17490 -61178 -3374 63033 58138 55939 101053 152536 98317 -2436 7585 25873 -483
24961 -483 -60837 -144723 -104955 -82240 -3901 4855 -38248 -27337 50332 141977 192089 189543
24949 189543 89378 148324 86185 70155 40015 33078 6972 14117 17892 60360 31789 10181
24937 10181 56878 26581 4988 -43610 -91848 -41510 -22198 -2624 116546 151010 132205
24926 132205 42512 -81667 -141024 -139883 -80940 -95441 -162519 -176539 -157523 -102524 -60535
24915 -60535 -18366 -37085 -124027 -183307 -204075 -176563 -155338 -72362 -55135 -65538 -27142 -29800
24903 -29800 -103851 -108343 -87261 -54022 -39602 -1556 -34878 -83549 31859 121911 59413 -31516
24891 -31516 -60088 -67740 -43518 -41525 44113 50205 -69084 -71290 -10262 -3387 -36931 32803
24879 32803 26564 1078 -1204 -4913 1845 -5022 -61246 -91197 -85555 -32374 24141 18338 -31582
24866 -31582 -17729 6185 23785 -15829 6424 -49874 -61121 -36437 -13796 -36854 -41470 -80084
24854 -80084 -86589 -12932 -44707 -23641 43653 81816 -23083 -65661 -92283 -81106 -30364 -13461
24842 -13461 -40032 -52448 -102126 -71445 22085 124491 187687 201761 151315 161487 113958
24831 113958 94574 119916 142987 140257 101966 -6443 -42179 -17453 52302 25501 -43188
24820 -43188 -70003 -111442 -109407 -89613 -36130 -37152 49538 125401 29184 22519 56790 14037
24808 14037 -2154 -6861 22547 44891 90495 71618 36457 15189 3936 -12692 3320 -95185
24796 -95185 -123335 -79503 -85923 -75197 -66392 -82642 -69920 -70757 -43328 22365 49061 83589
24784 83589 102235 31060 8037 -17320 -28810 20181 40504 33703 36287 66068 53994 3310
24772 3310 -18781 -96041 -2071 -25395 -87312 -59019 -10441 -9258 -45861 -104567 -44435 -23137
24760 -23137 -26473 -77850 -104274 -108286 -59200 -24785 -9936 -19551 26823 86804 136982 195699
24748 195699 145226 100633 66163 57696 25057 -35589 -97940 -148385 -135798 -82517 -968 25912
24736 25912 28848 15249 93852 68178 39003 45649 4247 -8393 -48360 31709 58864 52967
24724 52967 25845 71112 102802 89608 124901 221989 203377 88005 -42658 -26572 -35470
24713 -35470 -72089 -27692 4766 -16751 -51753 -25536 -58474 -21490 -15901 -39296 -113 25299
24701 25299 -7128 -10787 36987 34552 35496 -16200 -38354 -9441 5557 -1239 -66834 -84319 -94775
24688 -94775 -80095 -91803 -114678 -62063 -1010 -45580 -100556 -105179 -139879 -169531 -58793 -52862
24676 -52862 -10553 24102 55787 78573 94997 35352 -16303 -3705 58862 93258 58758 47493
24664 47493 2046 28694 50620 -28265 -39471 -136573 -262883 -245163 -217888 -69547 -16706
24653 -16706 -28820 7942 -20217 -73325 -100255 -60855 -75950 -147230 -177569 -105379 -10550 8906
24641 8906 52320 48631 90388 129079 134185 94451 63647 45203 50591 71349 40591 -4445
24629 -4445 -21017 10726 61829 8179 -19367 -12302 50868 72762 106872 95653 101744 38270
24617 38270 64515 13844 -123736 -95462 -26977 -30717 -10616 1244 3550 -46332 -69789 -46025
24605 -46025 -38333 40861 90243 -15697 -90829 -64751 -33610 -33719 -41414 -19308 -16216 -21165 -89413
24592 -89413 -141984 -76894 -63937 -48450 -28284 -7819 4519 42605 36420 85241 127875 108252
24580 108252 73673 -29846 -4342 71208 77776 32414 4448 -40565 12512 -10070 -73674
24569 -73674 -54142 -71788 -148563 -168086 -164101 -216637 -189649 -117488 -113377 -77995 -35768 43613
24557 43613 -45277 -113703 -101665 -46939 57004 116911 57542 43981 78642 30489 -51488
24546 -51488 -10205 -36894 -51964 -114016 -172766 -169950 -175032 -105412 -73671 -119206 -95894 -53041
24534 -53041 -59426 -62074 -109857 -27571 28572 48944 58166 37844 -27618 -73713 -69668 -47160
24522 -47160 38857 118977 190904 201974 154108 67861 30715 -17006 -88467 -51785 -35297 26987
24510 26987 -13801 -9439 -14174 -48055 -51429 17788 41933 67321 96892 41715 34009 -34764
24498 -34764 -61630 -72657 -84343 -99635 -159898 -140418 -48241 25380 3432 861 -3286 -72253
24486 -72253 -82404 -63327 -43735 -22303 51528 90665 740 -32264 -96673 -50860 -39562 -72700
24474 -72700 -105529 -106681 -169328 -171295 -156364 -97539 33011 9224 11564 17097 37336 93948
24462 93948 -7916 -114482 -81270 -65992 -35342 -43061 12682 61218 -10507 -61685 -123346
24451 -123346 -131225 -100934 -31065 9363 64361 66701 22965 66330 86659 90809 92155 76184
24439 76184 40733 17720 -58501 -56283 -7514 3891 1055 -21671 -29598 -34236 -7837 59005
24427 59005 -30224 -116024 -100558 -22703 29556 61225 44507 67847 -44976 -98610 -14785
24416 -14785 -22031 -45333 -30170 -10824 -52473 -80321 -89554 -114491 -167619 -161239 -121560 -87552
24404 -87552 -57370 13551 31855 11662 20439 -53499 -166054 -123833 -43958 -23109 -13655 -36792
24392 -36792 -96083 -100555 -23485 12492 18489 65031 44742 19636 -25200 4855 9529 -42354
24380 -42354 -77306 19700 -15614 -91251 -26338 -54598 -16723 -25376 -35384 -69487 -133508 -88931
24368 -88931 37567 72914 11326 1498 13896 16257 48328 17460 -514 -36037 -48837 -28582
24356 -28582 27817 70485 61629 4623 6801 55413 73273 77618 48285 24673 45773 21856
24344 21856 21517 67296 78520 69145 27209 -16773 -20961 -23761 -60011 11358 -19887 -55464 -67358
24331 -67358 -102428 -130300 -29537 -25750 -12694 44477 119434 157258 80148 85927 109727 55947
24319 55947 56769 82077 34913 -22138 20353 53282 55632 91863 93644 92076 101148 51896 -13453
24306 -13453 -22195 -4098 48629 60255 -32032 -113326 -61837 -75895 -46938 22044 18450 24632
24294 24632 28006 79119 62087 8946 -7931 192 7937 30412 44762 89081 59286 -11034
24282 -11034 -39290 -26488 -62813 -80346 -143716 -118874 -96425 -72014 -34233 -119038 -165731 -130533
24270 -130533 -137057 -80831 -60444 -68183 -34087 -18685 -60229 -55757 -26113 99184 92535 110116
24258 110116 100188 41764 -10801 -27754 -22190 -46597 -57803 13751 8390 -10303 -28129 -50967
24246 -50967 -27702 39194 51948 84854 101431 133326 180836 131762 71242 68203 14571 -43392
24234 -43392 -122583 -110538 -65892 -50169 -36353 -45650 -44877 15746 16269 18869 55080 -3177 -5459
24221 -5459 79888 96396 63829 54250 43244 27321 7843 41337 105014 109218 32571 55382
24209 55382 33869 2387 -69701 -75758 -128574 -135487 -59646 -70152 -96467 -95818 -83354 -13025
24197 -13025 6459 17159 69353 73581 38262 46716 44766 -12209 -15870 -45073 -30984 -11473
24185 -11473 -4372 -28588 -50087 6171 58308 89379 140581 116850 146880 124196 93098 -43968
24173 -43968 -85591 -26566 -57871 -36584 27092 -45295 -73819 -846 55198 49542 43537 30476
24161 30476 -62330 -96276 -63773 -127107 -109848 -54911 12012 52999 13774 -52126 -48712 -61582
24149 -61582 -32771 19573 -21088 -73537 -102831 -180253 -91626 -22330 -69675 -59901 -84457 -101455
24137 -101455 -104326 -113771 -39430 -10352 -3101 9944 1501 -19716 39917 90706 110735 52089
24125 52089 9513 -48940 -61629 -110910 -38257 -24029 -92206 -50945 53514 34004 -53647
24114 -53647 -98856 -91671 -94532 -121074 -185414 -123635 -34905 74706 83566 106925 60369 79383
24102 79383 79776 40082 86790 96818 92196 4456 -78875 -41114 61824 81267 60383 -14925
24090 -14925 -52565 -9929 -22629 9251 21796 4914 -19818 -41954 -75533 -146774 -136276 -100167
24078 -100167 -21145 37586 31662 61176 -9121 -81747 -14658 -37535 -133740 -169509 -142266 -124617
24066 -124617 -76464 -68897 -75397 -41218 -6596 98926 190750 191819 74636 22880 50630 59880
24054 59880 24980 -20629 -4951 -61466 -63717 26884 92330 195365 138356 57294 13812 -58584
24042 -58584 -27400 43884 63700 49878 33652 14506 -17764 -100215 -98446 -86864 -134616 -97910
24030 -97910 22949 22237 11098 18115 16006 -69352 -65024 -38150 -644 24985 53143 95704
24018 95704 47098 12030 28143 -33053 -1597 65070 85373 76574 85790 20767 -32118 5153
24006 5153 40557 31461 10024 62970 83725 108627 15520 -19730 -19028 -4209 -8645 25025 24618
23993 24618 -3684 -59974 -69701 -68737 -81078 -140744 -155394 -128331 -30438 -13208 43931 65715
23981 65715 68050 31337 19772 11617 -14443 4936 20908 -13278 77298 147225 113628 86889
23969 86889 50538 29556 47627 44641 17693 65086 50483 22112 -76360 -87885 -101622 -73036
23957 -73036 -6607 -47557 -186405 -185470 -95788 -55391 -29200 -43564 -5695 64776 59652 -16336
23945 -16336 -8365 -54491 -129051 -135329 -67953 -85621 -112323 -91194 -16338 -18357 -90892 -123488
23933 -123488 -79738 -18544 8776 -2974 -53601 -89440 -56381 14657 15795 -18760 15720 9842
23921 9842 -46769 -8492 19356 5430 -65978 -149424 -197676 -174667 -91314 -44428 14712 -12794
23909 -12794 -20056 123988 112622 63001 82701 108041 79779 134414 129009 78654 51784 1497
23897 1497 -24558 28456 131057 64804 112 -38450 -43503 -29264 -37128 -35474 -2574 -20719
23885 -20719 -118 80 26421 -10114 -71162 -64367 -47978 -56443 -114126 -109101 -51727 17473 -45352
23872 -45352 -58407 -5493 51441 93026 83370 35053 46933 11705 -14957 -103392 -33443 -19902
23860 -19902 -7422 25186 10675 37983 40638 31051 -11590 -46069 -42918 33105 56168 44453
23848 44453 19900 -9113 -80602 -95129 -45583 -58286 -66134 -61210 -82768 -66161 -53538 -70263
23836 -70263 -80809 -33759 -31741 -6738 43245 45158 141107 82574 51150 32613 99835 168420
23824 168420 132592 116194 93837 33646 -12794 -105696 -162815 -133726 -56342 63021 62362 56301
23812 56301 67322 -27583 -43396 -41627 -50264 31664 72818 112175 70755 48993 107985 77561
23800 77561 26918 64601 117764 81230 40198 -2684 -62369 -52859 -26222 -50739 -108002 -63843
23788 -63843 2467 -50388 -110972 -67934 58111 143945 162212 127609 94276 91764 109741 85318
23776 85318 46016 64406 -17724 -63248 -11465 -28526 110544 67518 37147 24136 -33143
23765 -33143 -16879 66520 48204 68265 22857 -12522 -56646 -103757 -52299 -34725 35143 81696
23753 81696 99328 56080 102928 88589 -3022 -1890 -28287 -1022 -10569 1821 -23862 -46980
23741 -46980 -26592 30297 22625 -36825 -35739 6543 76032 77462 83056 109635 93546 25706
23729 25706 -27175 -84588 -113469 -110848 -97955 -22035 -18736 -20396 65284 84392 60209 1301
23717 1301 -55379 -80898 -12324 5673 -10285 54366 71513 168662 79771 15322 -8969 -79891
23705 -79891 -117283 -131599 -52481 -53180 -31898 84243 111304 81502 53211 44053 17475 8770
23693 8770 24084 -57928 -73174 -107780 -126315 -90807 -93107 -144410 -178571 -187648 -148044 -70050
23681 -70050 -19799 -39528 -35561 -99140 -117230 -115009 -129559 -179235 -123093 -101156 -58579 55089
23669 55089 66260 61626 -11218 -20322 2974 59606 -50978 -59591 -49418 -105834 -67138 26899
23657 26899 18750 63437 63701 58870 69825 -45971 -171355 -178348 -145184 -170270 -147099 -120878
23645 -120878 -54728 2541 1287 60773 78106 15238 -50942 -55853 -22652 105691 128590 32704
23633 32704 69715 87260 63058 40219 59480 17295 -51136 -7344 -45152 -55406 -18129 111371
23621 111371 124650 85720 -24581 -71970 -23732 7836 43703 114117 102701 50067 -29773
23610 -29773 -84159 -35988 10847 40853 -7263 -59920 -31567 19890 44539 93330 106499 55744
23598 55744 16140 58879 105446 24328 -43685 -80953 -96784 -84490 -93743 -54211 -37375 16553
23586 16553 35630 127920 2187 -52235 1908 -15834 -78960 -107167 -123600 -128243 -182808 -188810
23574 -188810 -164618 -110522 -29049 -10986 -24784 -2846 21719 68945 29599 25239 81940 18838
23562 18838 34704 53170 -12532 16338 29577 37420 61753 102309 57323 -14759 -24630 -81195
23550 -81195 -109696 -88765 -12024 7210 -44252 -112236 -91339 -104986 -96937 -86394 -155375 -135298
23538 -135298 -78479 -44686 -51127 -109092 -44832 -44287 -19357 132387 200689 145075 41078 27932
23526 27932 -85728 -149217 -128271 -118992 -71973 -75734 -71712 -85169 -101969 -59406 17505 26793
23514 26793 37730 -19331 -79188 -25950 47297 50192 3092 -20649 20013 19370 -54628 -118069
23502 -118069 -5195 13458 7788 -16702 4792 76207 92960 60103 30660 9250 -23252
23491 -23252 3837 9658 -46345 -105458 -144458 -155191 -173891 -166592 -134707 -77022 -67111 -9082
23479 -9082 8352 44280 -9584 -70377 -59359 -24225 -38849 -69821 -32245 -4846 -68289 -104348
23467 -104348 -60302 54480 67461 11897 23071 57253 81117 72554 15828 6158 41285 85246
23455 85246 71785 17767 -38515 -61103 -55187 -15700 -467 -15632 15675 12600 74888 114103
23443 114103 20540 41640 45336 43991 141264 210251 198463 128782 10709 -94672 -104317 -7639
23431 -7639 42254 -19964 -23696 37719 45595 43880 67705 121904 84781 10925 -11644 -45928
23419 -45928 17661 97760 113967 76745 43123 16543 -39561 -43505 -24452 22971 128692 131264
23407 131264 45201 -23734 -37861 -4464 1007 80627 87900 94637 78443 -57858 -107690 -19042
23395 -19042 -27184 6098 42709 -25905 -135167 -152842 -89752 -133062 -121083 -91260 -16997 77575
23383 77575 78906 23883 24213 23750 50500 76921 103905 45871 72420 73581 92246 89940 109274
23370 109274 72414 30383 -13330 -89473 -104735 -67593 -24795 -33134 -23723 55295 34099 27834
23358 27834 22151 -49068 20365 15061 -65183 -134022 -83544 -90779 -111193 -111157 -106691 -37880 15631
23345 15631 -44333 -52407 -61159 -65906 -37307 -17697 6774 82351 112872 84371 50170 24144
23333 24144 89971 184071 155930 115261 137067 -29208 -119850 -64634 -3942 -19439 -105887
23322 -105887 -80385 2760 -97124 -168501 -137285 -97522 -73024 -17546 38372 45674 15479 20431
23310 20431 61165 86126 33109 2476 -61224 -9671 -12022 -89897 -185568 -132418 -81516 -93947
23298 -93947 -90150 -92340 24610 130843 145473 115931 99263 105864 51731 -20882 -39747 -142576
23286 -142576 -114479 -12481 -24931 -54173 -16170 -25238 8428 37704 68441 74702 6144 -52037
23274 -52037 -76427 -136386 -195782 -121544 -115493 -141968 -151441 -125254 -56421 31230 102169 92335
23262 92335 19481 18042 -6086 -27067 -38418 -55712 -66054 -31167 16616 1960 -28615 -48751
23250 -48751 -70177 -50861 -17456 25146 46716 21546 14275 7602 41958 20497 -67579 -39755
23238 -39755 57696 37807 -14982 55915 1253 -48648 -40503 -28101 -50637 -81622 -120496 -64282
23226 -64282 -30760 51666 35117 -10247 -48890 -86679 -75462 -9452 41656 -487 -40639 -122437
23214 -122437 -169904 -89296 -6202 33203 52398 66179 112076 65831 59325 58707 29105 5889
23202 5889 -15808 -57471 23068 108194 151956 169402 101219 53527 -18402 -113277 -182426 -194289
23190 -194289 -75231 -92433 -116633 -27745 50809 106851 148056 120800 71273 125719 85144
23179 85144 63552 111188 100455 71300 93438 121716 140272 92767 106616 46752 65071 67612
23167 67612 121539 139489 68387 6666 -18324 -27352 -73029 -84553 -24069 -5386 19519 -8417
23155 -8417 23786 35115 100835 75389 75190 93946 28448 21977 88722 94648 88532 75853 19850
23142 19850 11834 12796 14013 22608 87326 153105 143047 53572 24372 15470 -26659 -30030 -27563
23129 -27563 -51709 -35640 -108176 -212859 -192217 -106117 -96092 -92717 13034 12295 -67879 -56200
23117 -56200 53444 111692 123472 141489 168373 241701 239198 151691 50310 -28124 -35611 -43907
23105 -43907 -33117 -103292 -134535 -136623 -43671 28555 61661 40998 17384 22706 9880 72564
23093 72564 110209 80328 17503 -29029 -91142 -70819 -61371 -47735 -34127 -104347 -73109 -98948
23081 -98948 -58101 -40306 -2942 47409 61061 -12302 -25240 -64421 9463 65422 103278 70236
23069 70236 83914 71620 37049 95457 72497 34572 80295 14942 -56823 -113494 -120896 -63012
23057 -63012 -33552 -34033 -47452 -47209 -30950 -68706 -48001 -34956 -39645 -64742 7226 12366 9297
23044 9297 29227 -25269 -46499 -55061 25535 79073 92365 112963 149953 115268 78674 -1704
23032 -1704 -45816 -9973 20753 -38144 -31218 -44041 -55727 -42298 -56577 -60307 -51079 -9539
23020 -9539 62013 54705 60891 143683 169014 73135 78148 116989 88275 6698 -66644 -69435 -25275
23007 -25275 32506 57497 -4209 30738 28207 -34445 -98973 -62665 -59769 12394 2059 -37530
22995 -37530 -34470 -46308 -97738 -100331 -108032 -57864 -15571 -67162 -47574 -68965 -106857 -97014
22983 -97014 -43864 -84628 -72297 -96705 -119555 -157685 -94077 -29219 -54580 -66257 -78326 -125935
22971 -125935 -156573 -110608 -72135 -120362 -135450 -51498 -45948 11027 72573 7685 -19033 44320
22959 44320 143108 85169 41433 17442 -63837 -67963 -121279 -101391 -48137 -8724 -59863 -87972
22947 -87972 -99704 -157898 -163673 -134033 -49132 95256 102504 45474 32571 -75754 -99286 -70934
22935 -70934 -19252 -869 -42926 -93503 -66557 -76743 -101088 -52079 -43494 -34793 -34457 -32577 -42181
22922 -42181 -14471 25115 -31794 -89300 -125459 -130308 -119851 -48575 -1011 80692 164791 118957
22910 118957 79156 113007 106702 36470 62825 111756 93469 13156 -32122 19209 90903 64197
22898 64197 109174 99367 66684 68321 50383 -12886 -73796 -122336 -104183 -85572 -26106 21514
22886 21514 -63 -60 -17627 -27783 2489 48743 66074 32148 -29651 830 70825 -18584
22874 -18584 -78422 -20928 -38120 -68460 -29278 -91147 -143750 -132968 -145351 -170926 -121517 -14913
22862 -14913 14504 -24163 -123805 -141891 -165073 -173157 -117201 -91598 -95290 -22999 -8649 28834
22850 28834 50881 54577 14926 42875 60703 -8119 -55888 -66996 -101082 -160101 -137278 -89436
22838 -89436 16916 -24086 -63020 -67423 7750 56472 35888 4912 -7204 69358 94003 112113
22826 112113 124878 97050 104305 107891 37718 -38001 -82214 -50841 -5696 -24873 -58798 -84003
22814 -84003 -102594 -124780 -161484 -71383 60339 100864 116226 75047 3623 -55814 -49998 -73402
22802 -73402 -118602 -80855 -32629 -44812 45554 117765 61979 32522 32508 30156 -2244 -47985
22790 -47985 -23747 -4155 18866 -55573 -36904 34263 39516 51054 122357 35278 -28373 -60892
22778 -60892 -99059 -116828 -120834 -51328 25627 27646 32700 -13089 -105346 -115245 -73024 -3202
22766 -3202 80849 -11315 -141917 -92494 -38445 -21174 22567 39806 -50025 -34983 1948 -31963
22754 -31963 -28749 -5592 46991 106189 74727 25927 6399 70872 81981 62575 13927 34657
22742 34657 27361 -84938 -106188 -83731 -58504 -15824 -73256 -73298 -28902 -62806 -90573 -30507
22730 -30507 24898 66665 14479 -87935 -116631 -106865 -30371 -24850 -40321 -328 -3006 -36444
22718 -36444 -47646 -10199 27181 -23641 -147338 -113276 -72265 -56814 -32624 11000 59082
22707 59082 77693 36567 -2326 -4908 6671 47370 92793 137822 65029 11842 -16233 -5149
22695 -5149 -13801 1799 -6091 -23291 -37489 -40863 -92108 -89089 -91938 -108621 -68425 31854 -13993
22682 -13993 -34331 -38535 7564 -38385 -99012 -90961 -44058 -7566 4288 33471 42643 2572
22670 2572 -52160 -73621 -136212 -107626 -49362 -6468 242 -70037 -93669 -159562 -181812 -167661
22658 -167661 -155254 -138035 -125041 -78629 -25845 18387 7176 -20137 -8667 -47477 649
22647 649 49556 104175 70628 12351 -70931 -98929 -65909 -42883 -64551 -27229 -10186 -62986
22635 -62986 -87649 -28219 -19917 -32441 -71535 -23380 -68597 -127580 -158719 -206938 -125975 -23276
22623 -23276 63610 83411 85133 154794 89948 97287 151546 67582 27141 -53412 -57973 38911
22611 38911 20233 48915 7997 -37944 -28726 -28534 -68646 -79568 -37096 -36383 -54590 -68907 -133671
22598 -133671 -132614 -89481 -69624 -66831 -90024 -131795 -144815 -103438 -12950 -49871 -60575 -45544
22586 -45544 -82235 -103438 -16089 37970 56433 93090 99237 3287 -55118 -18840 -17985 -46442
22574 -46442 4157 49092 15498 6584 -24748 18333 2537 28922 48750 65916 54907 30926
22562 30926 -73538 -75511 1116 60622 26045 17202 26816 20548 -58830 -70439 -21434 -48160
22550 -48160 -68747 -94377 -122790 -107464 -43400 -32440 -106158 -146401 -155034 -102217 -23039 -6534
22538 -6534 -70224 -99520 -155149 -152776 -117486 -35736 -62551 -152961 -169097 -74159 -39648 11646
22526 11646 44092 35676 -11006 -62424 -100166 -69823 -78532 -21235 -50214 -106570 -35993 68110
22514 68110 99701 78445 31459 13735 32195 63550 89167 135638 128146 27081 25935 33662
22502 33662 33976 46920 34697 -63946 -143246 -110706 -179298 -139233 -127879 -116410 -98794 -161021
22490 -161021 -200730 -112555 -97493 -22664 50407 68505 45410 4635 -30726 19553 47994
22479 47994 -24224 12136 -28604 -80134 -87206 -43981 -12257 -1916 -29343 -27262 33445 105513
22467 105513 56091 -24903 -44113 -101738 -117334 -101024 -32619 -1715 -46650 -80679 -51898
22456 -51898 -36475 -50896 -120395 -109332 -45774 -72202 -90056 -8458 61670 23273 -6906 28260
22444 28260 26485 -22086 -21904 -30546 -37106 -40390 -72367 17595 21454 24692 14162 19418 -28002
22431 -28002 -48010 -47107 -61894 -67391 -56437 1526 33521 83425 66554 45472 35984 60661
22419 60661 90101 85979 26401 -47839 -59825 -64169 23796 129862 123116 68584 18526 28926
22407 28926 -6662 -27281 -40050 -29617 -14708 -78313 -143795 -150918 -82065 -37559 -23877 63644
22395 63644 77153 43638 -17099 -44887 46045 64035 44341 62536 -16441 -24296 -35889 40063
22383 40063 73401 71438 15734 3134 39668 6589 -108152 -40141 55568 -826 12940 18062
22371 18062 21158 20930 17023 20426 -22189 39665 36167 1106 -12809 -25436 -45711 -35445 13955
22358 13955 19965 -68622 -58409 4674 -16321 -36774 -75870 -91381 -51877 -44875 -56678 -73657
22346 -73657 -46880 -33424 -53728 -35734 -50490 -60979 -18902 20276 14158 -79906 -122451 -124957
22334 -124957 -30202 -56713 -80507 -90914 17803 102546 125701 60000 -11311 8012 25903
22323 25903 23220 21608 49966 29226 40826 56586 50475 -3096 -88498 -133362 -148260 -76349
22311 -76349 -19468 -96325 -76083 -2412 22427 23584 19284 -2307 22038 22268 32081 40930 27045
22298 27045 -58328 -66364 -13903 -6787 5205 -4605 148 32974 66873 8053 -56057 -14807
22286 -14807 20626 73834 94243 92304 55462 18893 -27503 -85316 -66451 38705 41520 32697
22274 32697 16880 -19914 -38579 -68244 -73390 -106575 -70674 -30678 3749 56949 70168 18760
22262 18760 -20585 18195 108195 53708 10925 -5682 20048 -43138 -73835 -117294 -101995 -40220
22250 -40220 -43898 -20370 -39608 -79145 -22071 -14829 -26817 -14779 19026 17407 -122914 -221704
22238 -221704 -129991 -71480 -113952 -173964 -198363 -162609 -152393 -169349 -140744 -66865 -31123
22227 -31123 -29126 -97489 -84686 33586 69531 59633 104075 131410 38389 -86007 -105914 -45131
22215 -45131 -31981 -42161 -41515 -62494 -20547 -12692 -2575 -4157 16223 33352 15373 31952
22203 31952 -39647 -39687 -41849 -58429 -33246 22912 10895 2395 51627 8543 -45786 -26759 21074
22190 21074 -1301 -19533 10004 59688 96548 4794 -19177 44391 54145 3184 -30859 -65276
22178 -65276 -68236 7552 127497 123525 80402 27014 -54761 -153146 -132216 -99691 -96711 -155443
22166 -155443 -55474 -21898 22430 76244 -11789 1414 102327 119212 125789 61203 -39402
22155 -39402 -35331 -2939 27780 9580 36245 55335 6576 -90207 -77980 3733 -14290 5851
22143 5851 58740 80547 64603 67789 79911 49241 54113 49042 55803 54601 17914 9032 -26196
22130 -26196 -50649 -57579 -14689 40020 7905 24356 47186 9216 -14640 -51975 -71689 31687
22118 31687 100027 112542 69031 38591 49977 79675 58988 -22096 -6303 26716 -16284 -40725
22106 -40725 -69188 -93506 -63624 -6020 -32886 3389 -3275 28032 9731 25070 16620 8151
22094 8151 54307 108483 84364 59670 76848 81835 90731 85615 74810 14548 -19859 -57650
22082 -57650 -25064 -29128 43588 78311 89118 41341 -34133 -92811 -54819 23781 -37187 -125131
22070 -125131 -64061 -15891 62798 105198 133507 153547 146909 136096 71678 69052 82718 72799
22058 72799 32062 7683 16754 -9581 15010 101406 113925 136645 138804 65939 67790 138717
22046 138717 73568 -37707 -13766 -35967 42806 210917 319569 346843 232050 115988
22036 115988 29826 16511 33184 65997 98735 19478 3503 -19862 -21219 -43589 -84596 -138398
22024 -138398 -80064 -20480 40380 50135 59549 41825 48172 86180 76047 18462 -33544 -15023
22012 -15023 -32614 -55467 -65737 -14492 36064 -25915 -70573 -61134 6379 55222 33896 67001
22000 67001 120807 67096 73595 46763 -2000 -19625 -61704 -117466 -133615 -70944 -4090 5914
21988 5914 108549 137475 95849 68817 -21359 -50148 9765 -22665 -76899 -23780 20263 48739
21976 48739 -31435 -38680 -32023 -44692 -75048 -50677 20807 86374 47655 22106 2632 -289
21964 -289 67397 98481 63811 98287 15342 -77319 -48013 -8834 -9023 -20720 60587 35947
21952 35947 -594 3464 21051 51968 142410 211613 139958 100602 73480 22037 -37491 -36838
21940 -36838 -9316 -41501 -72917 -84714 -143702 -171454 -58682 58228 36431 -35117 -12703
21929 -12703 8846 -9625 -30308 -14754 33385 93075 153991 63358 -553 -112342 -262864
21918 -262864 -234858 -259647 -249936 -103801 -60041 -76823 -324 89110 31559 -24600 -53533
21907 -53533 -187407 -243114 -148163 -40916 -12301 4816 81680 1980 -35929 -17915 -22229
21896 -22229 -16172 11119 -48671 -83832 -21198 45082 121631 69129 33617 9289 -15653 39599
21884 39599 34026 -42714 -174437 -144279 -104496 -35290 -78536 -10774 16011 -2636 -57859 -57825
21872 -57825 -19127 72885 74940 34702 -12056 -32896 -68686 -136173 -146496 -147777 -77879 -58588
21860 -58588 -48020 -73810 -136779 -102287 35641 53846 60994 -43341 -48330 -27576 -25557 -26739
21848 -26739 -13221 -39635 -29966 42926 51374 34532 78217 138245 136629 -2556 -35293 -51478
21836 -51478 -21620 -63659 -148098 -197839 -132007 -118247 -154651 -102275 -114357 -181662 -128505 -112954
21824 -112954 -113205 1745 83714 120807 45686 -53963 -71192 -64328 -20851 -31190 82545 167376
21812 167376 114737 5865 -71059 -42269 -13954 -52694 -57873 -156834 -175084 -124535 -104364
21801 -104364 -109227 -75736 16447 17646 -1893 1385 29330 13796 -18155 -56666 -71722 -26470
21789 -26470 60989 91740 133111 105955 47501 47557 -4768 -40625 -35180 -16249 -85260 -52327
21777 -52327 7683 50452 52450 -295 12244 62569 71442 5159 -41066 -23055 -35212 -83763
21765 -83763 -59612 -99993 -152815 -61158 2778 -57694 -68002 -108320 -133784 -89063 -42134 68018
21753 68018 106044 28519 44664 101817 121426 119477 53411 16709 61525 40268 85170 85604
21741 85604 32971 55172 13519 6728 -7179 -31716 -110734 -137068 -118223 -63628 -24182 -52203
21729 -52203 -88134 -17731 -6418 15699 -31396 16521 53072 29705 2733 -52291 -151346 -162017
21717 -162017 -55483 53096 98956 115333 87295 32288 -38048 -84550 23738 65964 73125
21706 73125 92435 120310 56507 24106 64575 85973 81331 59158 34640 2708 -18284 20227
21694 20227 -8257 -9772 -49395 5493 93295 37211 -38846 -77158 -91758 -55297 -9519 53436
21682 53436 50258 36989 39979 6540 80922 139245 110999 107322 -7436 -56184 886 24819
21670 24819 -52829 -37237 42626 42775 21606 30584 -35575 -74642 -117375 -108094 -58853 -37266
21658 -37266 -70890 -25355 -27230 -56803 -68486 -26352 -33671 -44403 26087 82660 31988 -58475
21646 -58475 -5709 52806 -39430 -88950 -23754 -31629 -83389 -102951 -42798 -12757 -7417 43536
21634 43536 13955 -9700 -34326 -29575 -34710 -28358 -51573 2663 98097 137560 64925 58326
21622 58326 84768 100792 120739 83497 44504 34028 34914 81356 -62580 -148982 -157786 -120357
21610 -120357 -46270 -126240 -133504 -33426 -33344 -70356 -125587 -137855 -73925 -4617 27125 49794
21598 49794 11732 85525 98160 159783 92915 -12526 -101705 -53889 25683 51761 48995 103242
21586 103242 67264 39080 41113 44013 128313 126346 1555 -80856 -33136 23081 76230 89958
21574 89958 62307 69275 37830 40091 55782 38111 64494 15864 -15805 -6835 -10166 -8650 -75661
21561 -75661 -126288 -144330 -103908 -94564 -152382 -172145 -158447 -152745 -162085 -129271 -95167 -41348
21549 -41348 -68306 -39634 -87359 -113192 -67736 -106438 -76653 13848 69534 40676 -19769 -6358
21537 -6358 30065 73366 42796 5904 -39824 -61803 -25096 -31600 -4102 30169 -60116 -127538
21525 -127538 -142329 -126718 -64909 24088 83886 59360 102653 71396 10951 -3195 12165
21514 12165 -2318 -35957 -5178 4108 -22402 -14229 2976 31866 -3167 4689 1837 38921
21502 38921 54420 50553 37245 28749 42783 90471 77524 24000 -50001 -64265 -23073 -21211
21490 -21211 -37688 -59506 -17635 54210 56615 14661 -118284 -170065 -192229 -134026 -19411
21479 -19411 -22410 -86355 -48854 -19398 -118431 -153884 -202857 -228543 -151763 -163053 -160617 -57617
21467 -57617 -62101 -24174 33358 12107 12149 26224 43472 140800 59753 -32691 -21265 32032
21455 32032 24304 3175 29672 44307 8226 -50031 -17368 4622 64354 109986 92161 89873
21443 89873 75524 3485 -59474 -104311 -121893 -92042 -32497 -31566 -58027 -70896 -57067 -7686
21431 -7686 48851 72144 81470 21063 -6633 64539 42703 24557 -59008 -106606 -69209 -6662
21419 -6662 -22938 -34067 -36521 15170 79610 7473 -36671 -25682 38107 105656 118889 60266
21407 60266 -12655 -5374 -30763 -4898 1370 -41563 -22461 25721 18362 63138 92485 33217
21395 33217 -18438 -98705 -80217 -79097 12708 -15904 -83155 -67472 34269 111892 113662 31156
21383 31156 -45979 -10354 -27460 -36140 -16017 -47407 -57754 -32297 3864 -12937 30008 6468
21371 6468 -19498 -53160 -8106 24047 20724 -17023 -1335 50854 92220 104361 128357 111954
21359 111954 41361 -5449 -35910 -100341 -94078 -106348 -85684 5092 -17381 -38929 -88485 -45309
21347 -45309 15994 2216 53225 22446 246 -72943 -65267 -41867 -30301 -6174 -49032 -89615
21335 -89615 -55666 14653 93288 55259 -12260 -41165 -24297 15430 -17819 -37214 -30990 -81512
21323 -81512 -53234 11099 61983 71619 -24719 -53630 -93716 -170250 -188295 -116458 -55329 -3619
21311 -3619 28963 -8258 -42918 -63399 -92438 -67402 -99195 -52796 -32024 -14587 42356 38208
21299 38208 -7352 -46054 -64975 515 61571 30608 2972 58120 63867 -11705 -36055 -73171
21287 -73171 -40584 -673 78108 81120 -19683 -58201 51504 80113 95011 81579 56886
21276 56886 82291 93733 46512 37153 134177 152752 121176 65752 57854 38678 -41192 -14875
21264 -14875 14491 30684 3385 13311 42756 97475 140219 152816 147416 87070 70650 17577
21252 17577 25147 -27304 -48837 7766 74323 106301 83240 100374 77378 12746 32431 16638
21240 16638 -96169 -102682 -44567 -3376 28309 24683 66218 55353 -10472 -34255 -39645 5581
21228 5581 50583 53145 32220 -54442 -113131 -48620 56071 85164 40656 -30942 -42805 36032
21216 36032 18085 -3316 33366 -83342 -127781 -140253 -115086 -65392 52116 68719 -37142
21205 -37142 -65483 -62560 -68090 -91848 -5298 59453 43984 19049 63040 -16274 -17879 -24209
21193 -24209 -78392 1628 47300 7513 18314 23025 -4964 -69309 -92667 -16416 21947 -55594
21181 -55594 -62545 -3423 37785 10092 41855 -33 -45408 -30768 -35744 -84751 -68477 -1052
21169 -1052 14256 18556 -34525 -86485 -40969 -55983 -41765 6943 43863 31760 19059 -1345
21157 -1345 -26410 -118179 -158715 -138679 -154452 -125736 -144303 -79503 -81959 -20361 -48170 -54403
21145 -54403 -61741 -64108 -122872 -125284 -70982 -87958 -79744 -94480 -157509 -187005 -122866 -66594
21133 -66594 -24068 -112397 -188003 -169111 -36593 39444 32554 44824 112816 57926 36504 48911
21121 48911 14748 26672 -38110 -21170 -28814 -68392 -105497 -50453 28755 -8060 -30345 -13099
21109 -13099 19487 -45206 -111957 -91268 -50424 -29201 -27838 -43125 -8949 33800 37348 22041
21097 22041 -88105 -143818 -72857 18156 22264 52209 79747 32063 37434 83896 96637 41745
21085 41745 23458 1975 -104744 -190343 -126655 -142633 -128773 -131781 -104278 -66084 -79199 -38697
21073 -38697 -6392 7897 27290 48585 29181 67343 89539 28789 39777 50321 50680 4320
21061 4320 18718 44198 -4570 -31924 13046 49407 56450 38134 75168 115115 56411 31274
21049 31274 -3387 -62151 -79271 -26663 24967 41062 13728 -210 -58354 -1750 31854 13629
21037 13629 54495 -5252 -59080 -70980 -52763 -47705 -77777 -99199 -133241 -164822 -92419 22047
21025 22047 9883 -2796 -48404 48677 103507 25080 -36235 -20171 -12975 107222 180104 145586
21013 145586 117550 91915 72919 11721 7126 -7701 -28774 33240 107433 92317 94939 111202
21001 111202 152253 176226 191476 123667 80494 114076 176894 96846 72338 43418 -21343
20990 -21343 -40504 -47535 -86711 -120886 -57259 -30053 -29478 -74207 -110690 -63548 -54768 -95112
20978 -95112 -76554 -50791 -88242 -78345 -71920 -30688 -80513 -61419 -39235 -35795 -30259 50057
20966 50057 -13933 -8778 -43609 -33875 -104409 -110359 -51833 -125264 -97913 -55481 -85271 -109665
20954 -109665 -59140 53299 -44995 -56625 -16606 -68099 -85994 -38290 -90055 -45707 -95407
20943 -95407 -134401 -103384 -77951 -92869 -97476 -59759 33612 6520 -57702 -56926 -36345 -78273
20931 -78273 -175999 -116100 -89530 -8657 23184 80187 78874 51089 120807 183031 126366 10950
20919 10950 -13852 19260 -1171 -44723 -33123 6903 33122 -5805 47991 31374 52012 51749
20907 51749 24864 4692 -13162 -51399 -25769 4775 9500 35996 81639 68304 76843 60555
20895 60555 38597 35606 99392 97297 69940 -5732 -8247 -23460 -61421 -46002 7619 878
20883 878 -4813 22317 92063 77029 38557 43730 48735 103881 126700 87347 60914 109610 111134
20870 111134 23842 -56111 -40221 42090 27557 -52444 -4558 75370 117132 94398 89469 54297
20858 54297 61891 57174 28705 26461 -4039 1226 -27222 -111963 -165630 -103387 -48363 -37275
20846 -37275 -3413 52698 46413 73093 -2339 -104518 -61932 -108114 -97101 -72328 -4962 110419
20834 110419 122051 75926 62640 78864 78527 34517 27616 50939 151908 168823 101251 22887
20822 22887 26583 58823 93829 95184 83725 125439 152139 22371 -35741 -23060 -31529 -42144
20810 -42144 -81711 10083 77563 50490 47821 77074 92570 11713 -59854 51257 166260
20799 166260 122710 55797 50041 40597 19838 21020 10318 20916 -15140 15573 24133 -32613
20787 -32613 -41382 77816 126030 105276 102261 52934 15575 16258 -9066 7515 57521 66283
20775 66283 43909 -14623 -29537 16719 88373 86516 96297 113698 45306 79737 58360 -36061
20763 -36061 -20850 -3960 -87792 -130822 -115074 -24405 -50332 -124223 -144792 -38348 11869
20752 11869 61790 28974 35170 19905 12988 -60470 -67408 -45530 -109486 -129181 -121121 -114580 -46983
20739 -46983 -37708 -39730 28588 24098 -8502 681 -7411 -70979 -79317 -12061 20287 27653 -21158
20726 -21158 -84400 -63404 -69169 -126304 -151965 -99810 -45672 -10446 -53263 -78894 -136961 -142261
20714 -142261 -122091 -103202 -102791 -89653 -33303 -100 -6941 217 846 -1573 -54880 -136857 -150311
20701 -150311 -26952 -44155 -104108 -65905 -43378 -36590 -2323 17164 4117 44345 48648 42197
20689 42197 -5849 -7516 -6118 -36147 -49932 -40868 -70902 -129338 -51787 25016 36048 33539
20677 33539 -4085 26797 64669 93738 112417 103356 18289 6618 13774 58946 61873 -24048
20665 -24048 -8355 34622 31583 51266 91386 59730 -20670 -71832 -58643 8448 11980 -25822
20653 -25822 20652 35828 1041 23692 84739 -2855 -58250 -12794 37631 -37384 -99076 -46424
20641 -46424 -17292 22236 54495 60822 14618 -88101 -84734 -4525 89472 60869 69261 113592
20629 113592 59399 23040 32639 68793 59234 32970 -19829 10983 98277 9475 -30318 -66893
20617 -66893 -45675 92898 96689 107638 81229 23471 -1639 53365 9457 65544 74416 80341
20605 80341 45675 51385 8906 8098 40193 70848 26048 13761 32774 2073 -21210 28801
20593 28801 -7217 -12845 49753 -7494 -6105 -25980 7526 60889 100354 26443 -91818 -99193
20581 -99193 -24395 -8394 -60671 -78220 6997 -47270 -49933 -22738 -52379 -37018 3952 16629
20569 16629 -62895 -138456 -104663 -17134 31369 70634 110735 83638 51364 77821 92851 105504
20557 105504 70775 57 -1588 41505 39755 -40242 -93274 -89051 -43206 60778 59423 -20926
20545 -20926 -13941 -7321 8006 64890 65217 -4266 -675 11643 5697 -46925 -30754 23780 94743
20532 94743 36865 -1174 -40815 -30596 27527 26058 -62632 -98906 -108333 -53851 -22781 8312
20520 8312 -3623 11532 -27631 -71170 -8130 58919 34421 -19723 -6349 -18075 -90022 -48628
20508 -48628 377 -55221 -35066 24630 70222 23038 -251 -93091 -125536 -137706 -119262 -15320
20496 -15320 7799 105871 148294 164817 66087 -9815 -4465 75128 81632 43039 73555 95003
20484 95003 104341 112293 126782 127265 93164 113542 75275 4596 -11925 -10902 -25615 -78660 -40258
20471 -40258 -81326 -109791 -22595 96020 90863 -11292 -48694 -76058 -117875 -72507 27335
20460 27335 10906 5255 -109848 -177511 -132092 -137388 -83087 -25525 15400 -34608 -39235 -110671
20448 -110671 -139826 -96234 -67437 -110093 -108450 -126464 -91747 -50855 -60279 -46208 -37543 -29098
20436 -29098 9023 21021 -51406 -17545 53547 53680 67431 84635 121754 139929 144641 62966
20424 62966 44019 -26749 -12432 1405 16944 -29489 -18043 -72766 -28751 49776 88596 65435
20412 65435 -23504 -7048 -9834 -47584 -38820 -14176 24188 -41937 -67502 -32613 -35609 -77396
20400 -77396 -85691 -21447 84244 131446 67891 35896 -5168 4242 -19606 -52465 -98791 -60625
20388 -60625 5542 19919 7810 -8378 5887 21893 27762 83838 63770 -62959 -84455 -22739
20376 -22739 3383 53966 -7753 -103689 -69315 32139 82047 38436 -21978 53960 77026
20365 77026 75957 5528 14834 -3136 -45342 -26001 48566 53390 36107 2707 53432 49491
20353 49491 -29627 -123190 -188764 -181153 -58096 27296 82197 24457 -6173 3175 59299 91181
20341 91181 28481 -42945 -2876 -9891 -16131 -26661 -30052 -1372 12244 -9939 85385 102430
20329 102430 14071 -4751 -16970 -64774 16611 14212 46421 39232 68301 119869 99672 69882
20317 69882 33183 25989 5387 41326 -62209 -73775 -19527 -17037 -60462 -67117 -60923 -54691
20305 -54691 -44362 19799 32062 43037 5704 -50868 -58383 -16009 45649 87513 42704 26021
20293 26021 14440 -22535 -71086 -52646 -61758 2996 78732 69289 65418 31013 21825 125255
20281 125255 86160 40540 36419 61631 106858 94661 90725 129045 130976 112925 79536 25558
20269 25558 -32567 40508 138577 88531 76232 65313 93846 111937 81719 5091 -62700 -64743
20257 -64743 -50144 -55722 -83784 -9970 16979 10218 -69180 -125883 -100116 -139355 -144107 -101462
20245 -101462 -47759 -47154 -14171 32359 74349 75867 67579 81160 85240 105086 153185 49686
20233 49686 -59650 -44183 -28453 -111238 -112894 10191 44399 24855 7940 40066 127239
20222 127239 99198 110491 1454 -57252 -39627 -74106 -70732 10809 5409 -39338 -41314 -44141
20210 -44141 -27041 -18036 14410 40914 70101 65715 -1773 24922 -2422 -68527 -91217 -81560
20198 -81560 -21826 40328 15953 -31143 -81273 -20135 -63098 -10414 -28549 -68564 6150 87570
20186 87570 71657 27530 9425 21 23919 25265 7643 11525 63621 56753 98157 102538 99440
20173 99440 86717 36803 -1581 74089 46265 -3926 -35801 -64345 -19327 81494 141651
20162 141651 72004 109131 123557 62324 16711 -37665 -26060 -1759 5118 9586 13302 -10098
20150 -10098 -33786 24701 43999 53562 22803 93623 91786 55457 104214 107940 70468 -4328
20138 -4328 -37829 -60325 -98257 -77622 -31533 -98727 -119111 -59444 -31000 31443 -67756 -111956
20126 -111956 -86283 -53077 -41767 -12299 73182 86074 59244 19657 -3446 -33456 -52889
20115 -52889 -61129 20272 38868 87953 49400 -9213 -67639 -127253 -175038 -129172 3393 85396
20103 85396 41742 4995 29376 13642 -38106 -113837 -110262 10292 248 -76849 -122210 -112646
20091 -112646 -63997 2794 13712 47981 -7256 -106442 -68032 -20446 -66718 -204061 -242833
20080 -242833 -173824 -145382 -127722 -88810 -32451 67523 136214 142364 173946 118001 43256 -29779
20068 -29779 28344 122975 102069 48968 37720 29545 42221 85713 124202 32713 -1251 67610
20056 67610 59070 40533 37752 -45628 -58299 -28561 850 6749 8541 7499 20867 20390 -14826
20043 -14826 -20671 19458 6720 -64015 -63261 -26820 -17913 -44422 -30886 -32050 -35132 -38820 -50883
20030 -50883 -62417 -91742 -61370 -7516 -55330 -67384 -8835 -60486 -66173 -26959 8366 46410
20018 46410 30407 -29404 45976 61616 35051 15316 -8784 25844 23751 -8682 -42432 -52458
20006 -52458 -18470 84797 45743 -78242 9892 84086 46741 22313 -53170 -77990 -77563 -110147
19994 -110147 -76040 -44299 -61557 -33902 -18036 -30975 -4868 -43824 -56829 -14343 -61056
19983 -61056 -142236 -125524 -137904 -118083 -24612 13793 54774 -34288 -62368 -85990 -54493 -2340
19971 -2340 -690 -45310 -16149 14943 25642 81505 78446 88554 87807 48671 78720 85945 79666
19958 79666 55713 121411 152005 92616 -4319 -17013 -48496 -7303 -4705 59176 150294 103417
19946 103417 43360 -22383 -42452 -15885 -4901 -42162 -48457 28253 -11081 -37793 -69159 -75389
19934 -75389 22508 12507 14687 10580 -58148 -75272 -41603 -77164 -60861 -28122 -42058 -40291
19922 -40291 -15456 32675 129026 116485 98381 86103 12234 3771 45659 132320 186964 157564
19910 157564 16226 28763 83354 70480 81900 -4871 14481 7299 -3484 -21609 -64406
19899 -64406 -76353 -86190 -46942 -110879 -150906 -194982 -181119 -117743 -124687 -138166 -7939 29616
19887 29616 -20707 19719 36523 61519 60727 -9309 -42620 -44571 -21040 40244 137683 98904
19875 98904 108450 43981 -42430 -52973 -35788 -86590 -124581 -34307 34096 -50047 -52869 -10660
19863 -10660 7942 -9223 -62960 -50188 -72327 -31103 -55989 -73212 -32459 -3028 7813 -17202
19851 -17202 -27601 24974 -35652 -41003 -72190 -34466 -97449 -135840 -51636 -234 8247 24911
19839 24911 72135 31842 -16473 -71677 -108696 -53814 -57475 -133135 -138517 -83744 -77573 -3198
19827 -3198 -4488 32531 32998 -54377 -42523 13918 7984 39178 40844 68035 7831 -6899 39870
19814 39870 50135 74367 42262 2713 -46954 -94599 -103497 -106018 -59936 -18624 32051 40925
19802 40925 -40335 -59150 -14130 -56796 -20168 25154 19169 -27717 -8607 38101 21568 16361
19790 16361 -9539 -48861 -57083 -61736 -38901 -70919 -92804 -106389 -90671 -81547 -148088 -119818
19778 -119818 -118213 -127096 -103982 -127502 -109773 -40807 -5804 -15426 9135 34639 413 -5620
19766 -5620 -68341 -99125 -112878 -62384 -94299 -65331 -104948 -70831 -47100 -69153 -25695 49914
19754 49914 137955 127232 90711 56147 57179 31679 18042 -98612 -88668 -22263 -3669 -62683
19742 -62683 -142997 -180853 -94257 -70516 -79512 -11145 41643 53516 -39876 -34027 8523 29255
19730 29255 74224 68044 72131 58013 74924 133229 105645 24261 31695 76335 24448 -48219
19718 -48219 -95336 -90896 -45130 28591 -37000 25051 48887 19232 -32659 -68998 -81491 -114235
19706 -114235 -116740 -30250 -61694 -94133 2152 64633 100815 87089 90888 91384 12332 36080
19694 36080 64056 110895 96728 24278 -24121 -13122 23658 53658 41420 12220 -21196 48734
19682 48734 87034 44154 97834 114891 64994 -21346 -76356 -81478 -122472 -125332 -131959 -89638
19670 -89638 -4441 -15735 -43927 -115308 -160590 -87212 -48240 -6287 5563 -23646 -39412 6804
19658 6804 -6249 -37508 -6497 5521 -23843 -7243 -64472 -71108 -75062 -122433 -157327 -136154
19646 -136154 -47260 -38162 -56519 -15567 -34166 -33425 -37218 -12853 4515 -35740 22664 48217
19634 48217 844 -23052 -94013 -106707 -97600 -61801 -61597 109 -23037 -62290 11587 54864
19622 54864 29269 -13867 -22538 42163 55308 20495 96744 106008 68042 42240 7547 -38492
19610 -38492 -91847 -18890 18396 61923 20214 -19164 -23772 6430 29487 42157 54475 182007
19598 182007 205253 128280 59653 12841 -115543 -129281 -64329 -23500 -6333 60699 61361 -24994
19586 -24994 -4380 -20634 9443 22814 -30288 -86680 -9756 -49636 -50875 -37811 -28832 -71625
19574 -71625 -58560 -45716 -35331 -95179 -116180 -126801 -82672 -119385 -78250 -80777 -57697 26596
19562 26596 60134 14436 -50422 -83438 1278 13033 30733 9586 -13201 -19566 -42480 -48714
19550 -48714 -53454 -73453 -103960 -110948 -80595 -86385 -86174 -167845 -92223 -3806 8601 8068 69249
19537 69249 65716 81834 71816 67538 87365 83018 -76274 -79761 18780 18641 55357 114526 79459
19524 79459 -56950 -53302 -35062 -56375 -13004 -65884 -58122 -120992 -180775 -225508 -225265 -116071
19512 -116071 -27814 -54510 -116906 -167470 -125341 -55783 -8598 78341 98911 -48867 -145615
19501 -145615 -118395 -5741 86964 60050 31396 27837 51222 10057 17396 59141 117128 86300
19489 86300 24583 -78980 -110273 -87496 -124643 -115147 38540 145401 89149 -48361 -88030
19478 -88030 -71212 53740 145823 138633 70235 61044 96309 107545 40345 86199 195717 153072
19466 153072 93372 74885 49543 99917 105362 4078 -38006 -57427 -1739 22087 -5182
19455 -5182 18944 9972 10385 78382 108921 76408 43339 4159 7177 -30101 -3729 96839
19443 96839 118161 97852 40517 34306 39232 -11697 -125337 -90673 -13692 -47188 -35884 -3104
19431 -3104 -1088 -53489 -32264 19492 61247 56797 -16483 -8461 -22877 12256 40449 9743
19419 9743 4436 -6520 -6127 -28445 -36300 -30362 6471 26129 25834 79277 89921 54903 74248
19406 74248 92713 40221 -5530 -50412 -29490 -9719 26387 49372 59327 -30222 -23528 23408
19394 23408 11279 -5464 -85294 -88010 25797 84433 84209 23324 -92439 -76531 -116553 -159764
19382 -159764 -122790 -94109 -90494 -101110 -73654 -2894 93955 70163 100488 30231 21679 -18559
19370 -18559 -13000 38871 114457 104373 70663 69358 70678 42742 -64079 -83268 -15106 -49394
19358 -49394 -94549 -88957 -51716 -47913 -43470 -79456 -103109 -31847 5242 92085 46019 -4382
19346 -4382 -41045 34641 122353 53972 37237 32583 44165 62273 46811 105849 125355 120490
19334 120490 38343 28401 57991 93055 76915 57251 16006 53729 74524 67851 124718 183560
19322 183560 196781 255915 322466 331288 329799 260859 137543 162242 148761 127631 127397 105029
19310 105029 112877 93706 98792 108758 149743 134608 146159 96826 26410 12834 6338 67963
19298 67963 106675 33870 8090 42940 30677 109372 34005 3929 88143 175237 197076 156389
19286 156389 114391 42858 24555 6759 -8195 29288 50551 24764 95353 167036 184440
19275 184440 182356 167522 88311 58396 8613 64619 111229 160261 180064 221091 276340 291332
19263 291332 268572 279695 261937 271547 179735 75475 27857 10321 -14190 -17515 12371 21386
19251 21386 55823 97791 94224 21727 -19143 -52458 -73993 -25613 46053 56685 15615 -71558
19239 -71558 -12314 27876 82605 36313 71241 90961 -221 -11968 53182 52261 -25575 -81260
19227 -81260 -107347 -86576 -58468 -66653 6142 32616 -26878 -40911 41551 111149 128486 67501
19215 67501 60302 67523 34993 51342 117422 68717 31961 25267 4311 -8848 43220 6699
19203 6699 -69238 -98473 -122915 -40216 7845 45631 63198 74436 87949 105982 117056 75498
19191 75498 15809 -21841 41959 137135 125489 54624 -9176 -81454 -79482 -42539 -46526 -77106
19179 -77106 -55743 -32973 -69617 -84260 -82569 -73077 -18164 -9187 8610 1052 13191 33469
19167 33469 55812 95188 94245 98353 30702 -22634 -25176 26159 59004 76176 46814 -81439
19155 -81439 -153733 -114492 -87171 -100987 -68733 -46896 -13294 -44083 -35222 -18869 -41576 -71303
19143 -71303 -48863 -27022 -28735 -32388 54904 111803 73937 86718 39207 -19987 -34002 6468
19131 6468 49135 92766 99629 32165 -23891 -65076 -91822 -102247 -114458 -122293 -96707 8955
19119 8955 -13671 -24210 -22177 -15050 -24863 29423 49445 -37320 -100915 -66699 -64624 -9423 -24803
19106 -24803 -74836 -39478 -29637 -56136 -18299 -67573 -34280 -20716 -88368 -175430 -76503 -38938
19094 -38938 -56411 -18488 -8521 27668 68000 38905 -53692 -35975 -49157 -174335 -161475 -81207
19082 -81207 -72102 -27627 -22456 -14545 75331 76081 46467 -7001 -58880 -95245 -45624 -70258 -101250
19069 -101250 -108361 -25922 -75255 -109702 -59016 -28955 18921 89534 131016 -20364 10345
19058 10345 57036 17628 9586 32217 69323 20015 -6168 -21635 -70525 34777 59688 93118
19046 93118 125210 118669 63953 -23612 -12531 28663 -49392 -12108 90438 95400 32017 -3884
19034 -3884 -97056 -137433 -71035 -53810 18787 131270 203279 177163 155419 114457 40950 61473
19022 61473 23404 -65757 -55678 45489 63753 52206 50452 172537 130913 62742 31399
19011 31399 -69162 -143008 -123538 -86393 -122983 -76585 -33066 35252 53448 44944 -9752 -14305
18999 -14305 44076 63777 16558 -13660 -49986 -42562 -18387 -34500 -45124 -72830 -83804 -120779
18987 -120779 -153045 -166230 -86382 -8060 22446 -2832 -19840 -10057 -9430 21814 31864 -27026
18975 -27026 2295 -902 37136 -15444 -20612 -20704 -60030 7362 23493 35949 91802 102332 74068
18962 74068 112246 40487 -4191 -39089 -16808 19529 33203 49798 48021 -10920 -21815 -100854
18950 -100854 -73008 20290 58300 -23739 -70465 -2777 19828 51325 157958 105766 4696
18939 4696 -22849 8952 64486 61036 37618 80393 175445 197004 122556 54264 7880 25835
18927 25835 -45361 -50121 -63951 -97547 -95823 -14279 41317 65503 18626 -99521 -92218 -33444
18915 -33444 33293 69576 42930 55173 56952 28406 30326 35341 21823 18813 14281 33266 47057
18902 47057 95011 54930 47260 -18604 -27952 -58097 -51287 22045 137 -27356 -138532 -180164
18890 -180164 -157665 -133209 -83013 -21831 17857 14309 21878 21364 -29689 -41115 23013 -3358
18878 -3358 -33803 -40612 -93101 -28121 62520 51363 24605 -11130 -703 -12665 -105885 -148653
18866 -148653 -136340 -122006 -84839 -35545 -5497 -19295 -10655 7784 -29077 3001 34307 -11623
18854 -11623 4481 -6502 19852 38408 92239 122589 98556 54541 6838 -10008 43413 38963
18842 38963 42520 16425 1023 36147 6517 -25327 -7202 65304 -24773 -104915 -82051 -47958
18830 -47958 5110 -3315 17441 8708 -681 -45263 -57465 -100997 -103472 -25283 9473 4218 -1166
18817 -1166 -13025 -31093 -22974 28703 49386 -43840 -96590 -42126 -13435 -10797 -52835 -90788
18805 -90788 -20481 -6016 13276 53647 43655 39282 -9095 -16863 -60438 -87790 -50720 -66822
18793 -66822 -125850 -90228 -122390 -140124 -148372 -90438 -52901 40068 107266 167740 106236 -8042
18781 -8042 5251 55372 14522 85346 113711 60959 42367 44062 119767 119039 170354 219532
18769 219532 221624 259092 316362 428293 490650 528892 373488 156005 98313 44011 73644
18758 73644 82776 64573 96335 105323 81855 81866 93255 90386 57758 -33809 -86765 -23269 7427
18745 7427 17628 -16225 -30574 -36111 -1288 44970 11183 -44724 -48446 -96157 -54046 44271
18733 44271 54233 136069 188552 132890 141659 238566 158725 58276 -26218 -19841 -39516 39986
18721 39986 68569 61093 -69937 -104138 -8588 -8081 -27910 18456 10486 22556 -253 35908
18709 35908 65529 -4780 -23997 -57835 -113291 -113263 -50029 -24717 -10550 3494 -23962 -110846
18697 -110846 -106671 -23929 5504 -64954 13932 48405 -9352 23575 48687 63266 52979 100230
18685 100230 105439 54825 83495 75355 26833 11519 42477 121870 159923 133419 81142 124402
18673 124402 113534 158074 184935 233088 253754 309843 314540 330344 357389 359225 349195 336840
18661 336840 374893 419755 513847 614479 576389 496271 444280 460627 444229 500051 576274
18650 576274 674589 774498 954231 1212112 1506459 1839159 2176100 2624224 3169698 3738617
18640 3738617 3812939 3176914 2430316 1870779 1487521 1138998 909551 830820 858350 889551
18630 889551 968557 1104860 1107569 1015265 825764 741063 570318 409006 329535 301920 269567
18619 269567 340997 352019 392281 373482 302933 258190 242298 300500 418116 340021 305410
18608 305410 337993 348980 357568 441674 539124 723389 968867 1119802 1197430 1273351 1408275
18597 1408275 1531796 1430683 1248224 1254073 1286489 1472315 1730585 1986169 2352705 2765142
18587 2765142 3103165 3381026 3618251 3867391 3721334 2700540 1636356 1000266 680516
18578 680516 557787 509747 416966 310090 285315 267147 268852 267550 213177 271133 362178
18567 362178 438638 449406 391199 265574 136926 119787 154781 139394 64812 88869 108496
18556 108496 130726 70834 58019 46836 49282 6187 -4923 -49251 -2288 97728 87058
18545 87058 130468 220841 238868 194667 150740 50025 8660 -2409 47874 66274 65726 127729
18533 127729 136872 145116 122556 93464 -39836 -49294 -34007 -24178 -29062 -35993 -65018 -118165
18521 -118165 -77661 -30956 -44868 -13614 11201 27072 25568 -11343 45999 70274 -6221 -14613
18509 -14613 25855 -21289 -33212 -70595 830 44983 40499 -5188 11003 9070 -34000 -38288
18497 -38288 -60876 -70960 -48199 34604 17319 29113 64092 55524 36558 8422 -17507 -84103
18485 -84103 -33466 10472 44483 67130 34484 42179 91378 93548 67499 -19663 -47981 16451
18473 16451 75020 55221 46611 53345 120160 151749 164740 106093 64732 82524 108233 46073
18461 46073 -74210 -66424 -40318 27892 35154 -38159 -116173 -92057 -54902 -1229 42423 -25525
18449 -25525 -115329 -45256 611 15946 41987 -24468 -32565 86132 120869 146817 80933 -3902
18437 -3902 -5355 57307 98997 128479 99191 65916 71415 -4613 40280 70928 12053 6412
18425 6412 85775 84208 71090 65760 99098 127848 116353 137946 115968 41996 -33275 -78581
18413 -78581 -72633 -71552 -33646 10247 28081 108428 217904 207888 102119 72009 74053 114700
18401 114700 163595 218590 280637 234317 231865 249174 329676 326942 238240 185160 116796 84608
18389 84608 91349 87045 118544 135404 175269 210729 185372 132376 125181 82832 18889 -46095
18377 -46095 46912 121241 132755 139983 183525 120711 103327 49604 30666 59430 57289 59058
18365 59058 57488 22721 58823 87074 34891 52938 50443 86076 117557 55184 9734 33494
18353 33494 92213 43790 47100 71665 101835 112689 131832 117616 81493 19409 96373 194120
18341 194120 179219 125102 179705 180951 160963 151140 140101 137926 101705 127460 138050 34292
18329 34292 24543 42696 -29980 -115041 -65681 -818 54893 168786 169104 65203 -21734 11209
18317 11209 19952 37618 145091 137599 113233 158086 149325 62514 66158 51865 72660 81273
18305 81273 60010 36003 70675 40974 -23793 19104 71019 33922 -8633 13675 -29518 -58778
18293 -58778 1810 6375 -12199 -41259 -17168 43336 66698 12196 10899 17231 63889 102390
18281 102390 69323 95688 92099 57649 65487 131108 103617 139755 237176 236259 191438 129972
18269 129972 170399 244001 206654 183843 234123 373036 469807 510738 522066 512214 580869
18258 580869 684392 751865 783482 814121 808222 871859 888387 972678 1105625 1120080 1011856
18247 1011856 840560 781323 783660 847491 818117 805013 743924 728053 785595 886856 949803
18236 949803 973628 994165 1074061 1153228 1072074 826457 731404 651690 638379 648877 618721
18225 618721 654519 708512 664763 522316 448233 362981 301050 306646 371594 300798 225661
18214 225661 261916 294011 403522 489898 472244 495148 563629 581895 591137 701612 761238
18203 761238 786612 680855 628329 597875 529168 517402 558782 655435 838146 1055959 1189497
18192 1189497 1296746 1270835 1139630 995890 970417 1048439 1231128 1414820 1387499 1174482
18182 1174482 928611 838700 853900 892707 910536 978912 1072339 1152299 1063599 919936 764298
18171 764298 668253 618538 530276 467221 485938 506814 512709 419876 411412 463526 420147 363699
18159 363699 404014 458268 508567 430285 327674 383392 413182 433737 444999 439773 466610
18148 466610 456931 456134 421419 379620 453624 585544 751170 788747 915210 1094337 1275228
18137 1275228 1493415 1823114 2090822 2318115 2554114 2800300 3047193 3337886 3711053
18128 3711053 3977563 4227882 4611920 5093261 5652489 6319130 7075033 8093224 9230334
18119 9230334 10537180 11995765 13729934 15777497 18295528 21945012 27689934 35984986
18111 35984986 45775290 55101141 65062529 78651532 97224238 120001873 112131397 66056014
18103 66056014 34668557 20473523 13554336 9713007 7371417 5973760 4849499 3925824
18095 3925824 3311097 2927950 2547541 2158470 1895116 1727368 1594744 1445260 1303678
18086 1303678 1186778 1057800 915245 814543 809509 878116 847311 797969 781972 709555 649719
18075 649719 609120 526975 549531 587033 587794 596747 491424 418752 492720 511654 480211 437959
18063 437959 408878 448716 469540 446641 407276 436930 426851 336987 301348 313784 317510 378059
18051 378059 362944 290976 271082 214423 131547 83329 44061 59071 68439 119686 122142 140642
18039 140642 263194 416203 428563 324914 262947 274610 323118 352590 410092 344585 234310
18028 234310 206256 219163 141789 173817 288677 258655 218979 255739 291006 340992 390804
18017 390804 360820 350428 402805 509858 577625 510408 507850 572348 594470 615829 596421
18006 596421 604864 686226 764467 870409 907403 976038 943800 888262 934016 884510 834848
17995 834848 841571 860129 880720 906168 976417 899677 831802 789655 775606 795189 818014 863937
17983 863937 845079 918754 944475 872391 637404 466812 526505 605697 550274 443253 461226
17972 461226 523608 619384 607368 472669 334313 226241 195471 211518 167110 173509 327095
17961 327095 500546 664554 704737 632772 702483 742002 776100 842043 817544 875875 985880
17950 985880 1034512 1033566 1066678 1174178 1185949 1124199 1103255 1149222 1289184 1354026 1303413
17939 1303413 1233369 1153220 1128825 1174785 1296456 1376257 1289105 1102502 966619 871347 868941
17928 868941 904794 1000695 1026874 1093483 1198220 1273140 1253114 1069676 940503 824219 865185
17917 865185 781207 676957 600946 401826 262535 252016 235434 233759 199955 267303 268950
17906 268950 235506 272221 333542 301258 279260 297059 283624 319060 351639 293043 272342
17895 272342 223023 192920 139393 171714 170888 190563 214419 206826 230462 228023 239073 256428
17883 256428 160028 94239 136833 237862 302597 489214 749959 905839 877030 900280 892468
17872 892468 826009 765910 541514 398663 337629 354265 339214 269742 217112 279766 329871
17861 329871 337193 377891 428534 513180 550609 495733 527411 559869 562402 520915 482212 448164
17849 448164 416894 428661 373730 459261 523343 501979 468633 448350 491159 522350 607097
17838 607097 701544 690996 639901 672321 706990 684466 656117 669500 566721 536207 496581
17827 496581 562154 690821 771590 805522 896206 963011 1061517 1283119 1432741 1418587 1419604
17816 1419604 1458278 1482452 1432648 1202417 1158088 1104422 943925 888002 827184 744065 647806
17805 647806 680465 749943 817555 921987 1000536 1016051 1041117 1031671 1097897 1131316 1159383
17794 1159383 1195589 1151348 1227489 1343978 1374489 1366023 1428046 1588097 1680828 1756468 1790086
17783 1790086 1943769 2059876 2176351 2342865 2489661 2591527 2633140 2863755 3227604 3590058
17773 3590058 3882352 4214196 4592342 5033322 5704340 6453531 7268988 8319747 9547157
17764 9547157 10868038 12441675 14193627 16033274 18151354 20424730 22908440 25831723
17756 25831723 29373253 33474485 37118950 36737188 32980648 30534700 30209501 31517047
17748 31517047 33917039 37281000 41473971 46601586 52764946 60112045 69602093 83005837
17740 83005837 101453825 124373068 149832430 178461356 213582088 256551082 304804785
17733 304804785 320386091 273018473 220865659 179995506 138815939 102229973 80397303
17726 80397303 70761369 68375264 70129119 73925133 79390511 87168805 97084013 105951694
17718 105951694 102531252 80592837 57206566 42477874 34421520 29934362 27470733
17711 27470733 26418739 26253769 26915428 28096208 29711917 31595927 33811958 35932970
17703 35932970 37995846 40606819 43997900 48462093 54580363 62833290 72886966 84256892
17695 84256892 96629481 111104948 128575635 147927848 161247218 153758424 133703146
17688 133703146 120458142 117958296 124173666 137968216 159413225 188840291 226045117
17681 226045117 269990747 319034144 374050464 425342561 456703524 465485067 415980309
17674 415980309 295173439 184222053 120215681 86346798 66612620 54117315 46298371
17667 46298371 41090936 37442826 34818609 33091971 32693018 33560371 35304074 37502709
17659 37502709 40305024 44254081 49392904 54232029 51019957 37995634 26519086 20098311
17651 20098311 16863609 15265893 14462528 13848850 13150328 12460151 11704480 10820667 9836425
17642 9836425 8706576 7578514 6655537 5860266 5209761 4801071 4627823 4509532 4428346
17633 4428346 4286430 4226756 4163922 3960607 3566747 3296418 3160703 3067569 2937976 2951774
17623 2951774 3117741 3281253 3414352 3431842 3368482 3185868 2939911 2700139 2484183 2295236
17613 2295236 2172192 2113486 2054379 2060565 2073487 2112441 2217507 2348650 2487638 2547632 2677166
17602 2677166 2721948 2749960 2701504 2622375 2474275 2289042 2175013 2214469 2373220 2664302
17592 2664302 2961379 3230363 3646455 4029177 4360575 4409484 4085858 3436192 2803409 2258922
17582 2258922 1908474 1760631 1671875 1578068 1553424 1527413 1524306 1486979 1426151 1455897 1547667
17571 1547667 1671966 1793302 1881003 1847358 1805077 1858659 1914363 1978542 2015601 1959865 1993380
17560 1993380 1881032 1776620 1676153 1541317 1551300 1533685 1572454 1577844 1530933 1459851 1423563
17549 1423563 1443821 1537866 1631149 1650712 1615751 1593428 1592830 1583929 1541163 1615859 1713087 1680204
17537 1680204 1676578 1774627 1988699 2230929 2467271 2672074 3033543 3299461 3473429 3606139
17527 3606139 3766279 3879306 4043692 4266815 4570235 4939187 5357746 5783419 6364379
17518 6364379 6902181 7653464 8510811 9508293 10738992 12255489 14095991 16143544 18211253
17509 18211253 20295993 22396488 25004774 28541509 32939472 37903021 43345630 49520532
17501 49520532 56782315 64574059 69123009 67470962 61509006 55697892 53616704 55064214
17493 55064214 58846502 64366883 71551396 80439521 91454344 105715462 124852069 150628568
17485 150628568 183452836 222260698 266542957 317945368 378692945 441918779 475852667
17478 475852667 456047081 387246075 299649834 221015320 161268674 121657025 99745436
17471 99745436 89690402 86950522 88653590 93172465 99697368 108177442 117712052 122873771
17463 122873771 115636724 96297655 72024284 52703984 40868375 34147090 30296659
17456 30296659 28108869 27074194 26754509 26956255 27482144 28213795 29330308 30980496 32970622
17447 32970622 35260540 37889236 41188793 45650852 51703104 59473952 68694617 79252472
17439 79252472 91394571 105187569 118570006 124571315 119571244 107147163 95974862
17432 95974862 92614011 96643430 106740387 122476215 143734729 170276150 201372805
17425 201372805 232947426 259269122 276764178 283821279 267714124 223137923 158971257
17418 158971257 101090139 66441688 47811086 37196931 30698749 26474099 23520450
17411 23520450 21348478 19856588 18864895 18420958 18472291 19081732 19935073 21167951 22980464
17402 22980464 24911912 25717259 23858725 19596651 14650851 11088892 9031858 7914691
17394 7914691 7198094 6586109 6104733 5708419 5249143 4703565 4147440 3597104 3226509
17385 3226509 2994994 2826572 2684790 2610124 2434994 2361384 2268293 2083402 1918798 1883777
17375 1883777 1841421 1767327 1762879 1723302 1647791 1628023 1674344 1651685 1588006 1457137 1290714
17364 1290714 1186491 1124463 1057614 1050391 1030103 1057110 1073010 1027471 955432 956718 946059
17353 946059 908604 877885 877598 867217 731855 712165 697958 569644 517583 469592 338786
17342 338786 191875 90191 -85019 -162736 -181403 -132828 -8561 182158 277470 368620
17332 368620 458928 529560 530545 517173 446938 415075 511371 438068 438133 378345 304101 347443
17320 347443 332424 258665 308636 440581 461208 456411 454648 414174 378774 377020 360860 372532
17308 372532 374352 318708 337122 309883 340035 370406 415871 383909 301484 294952 276296 220467
17296 220467 228210 308254 348922 340391 410536 436365 314589 265947 158539 167210 221376 217694
17284 217694 164913 1283 -28415 26275 119392 142773 222935 354626 427396 452440 351738
17273 351738 405974 477760 431492 400617 386792 356345 368172 347132 275149 249315 223933
17262 223933 235057 280329 300974 273612 338845 366861 292043 230073 230035 253944 221213 167350
17250 167350 145564 229016 259901 222586 273451 353124 320027 300876 358351 346149 387658
17239 387658 560394 596353 517896 546943 605604 709979 695714 713754 743221 824517 911898
17228 911898 1055444 1157514 1251485 1305466 1259729 1253931 1279204 1386993 1407826 1265317 983220
17217 983220 882068 955401 988406 989924 1076455 1172352 1153753 1234006 1270871 1205198 1101625
17206 1101625 1130896 1151512 1206762 1291994 1190530 963544 763748 680786 665535 712394 750012
17195 750012 817622 840484 796361 619683 406672 350473 412285 440963 403593 308278 255888
17184 255888 327970 423130 393713 313706 277491 358314 497041 511196 458962 507571 631104
17173 631104 752732 646444 533681 538241 559232 626994 708748 744121 856125 930423 1042522
17162 1042522 1096979 1085101 956367 888475 946097 952958 992726 1024553 911026 695687 656389
17151 656389 590000 549811 551745 613375 694497 744256 722004 615425 433465 395866 418884
17140 418884 410572 351492 331707 265032 297659 347924 361948 337795 289902 215697 231820 169788
17128 169788 17507 8473 60955 19763 -12936 -16965 9592 56382 85998 90454 97226 61980
17116 61980 105247 96039 7684 35600 62438 58092 96997 106891 66088 38620 55628 9428
17104 9428 -9624 17499 47682 66402 124921 116978 56071 -38345 -61569 -77388 -5130 126731
17092 126731 248674 250101 208354 204748 231081 250190 212638 125352 71610 1425 13363 118173
17080 118173 137431 135431 142013 121661 39511 -16476 61927 125204 195120 158036 87691 134604
17068 134604 132532 55384 82623 55182 -15721 -77275 -17557 -21811 -16284 23363 75040 44168
17056 44168 45047 63962 85115 46254 13816 -8213 -26748 36258 103371 90798 88696 62240
17044 62240 -2387 6809 -35661 -14139 7969 91645 140332 194654 210431 179909 166315 190940
17032 190940 127021 107170 79381 70004 72276 77965 102707 49855 75759 83511 41802 24593
17020 24593 59029 23338 7667 144734 153918 45558 -14706 -55925 -28885 58323 129763
17009 129763 153522 175942 100427 97562 89809 61705 140974 145115 223707 200543 147401 184735
16997 184735 199293 259154 212422 244102 355737 379650 341687 325018 370901 387870 395603
16986 395603 496525 685912 824208 888150 896947 1086639 1196737 1158171 1035485 853982
16976 853982 766201 868591 986666 1011587 1061701 923635 690597 618799 716139 836111
16966 836111 828956 850590 954083 971576 996849 988460 871631 692022 495591 418397 358128
16955 358128 271382 231409 268615 284046 344522 447873 449672 402093 444095 426727 351281
16944 351281 311699 322420 311378 317536 282985 250915 309209 425437 531578 528032 590806
16933 590806 596761 584918 686101 736748 867333 961818 873161 905276 879424 896097 965132
16922 965132 974829 996770 977603 788385 620639 582695 537619 413687 385409 338117 346298
16911 346298 393018 473485 551621 589557 596344 666726 666537 727362 816950 783043 716739 618469
16899 618469 520234 433663 324072 263467 206954 188907 178126 131754 122624 31432 -47056
16888 -47056 3457 20670 93290 97815 61258 -36523 -57393 -57566 -67150 -22571 101955 130860
16876 130860 78720 93800 88456 9365 -29015 -52867 -95461 -8516 76644 136351 77190 51722
16864 51722 54769 82401 137611 186616 129545 90148 98720 113598 110370 75116 18322 37374
16852 37374 47413 -19703 2710 36238 8203 -25908 -21589 -16639 -9169 14739 -30473 -9056
16840 -9056 -21531 51376 78739 43772 622 -1222 19096 3300 -5192 23839 -36447 -39957
16828 -39957 -119737 -137325 -80944 -23464 -70778 -41194 46870 134359 97747 26291 -30151 -35206
16816 -35206 -93606 91427 121552 6324 -17919 48307 58265 101080 130561 105008 77139
16805 77139 -2513 -66259 -59063 71761 98760 17787 -70850 -78082 47658 95838 69488 -37339
16793 -37339 -21620 -56105 -54106 12424 38327 90481 30919 -72724 -92745 -47178 42030 23279
16781 23279 10064 -24120 -17436 -35357 -2723 -14660 -23954 26907 72354 65678 -8920 -53676
16769 -53676 -29615 -52273 -101368 -52196 -14300 -61489 -66112 -68540 -136850 -117756 -70217 -21814
16757 -21814 14101 32702 58732 98013 71435 45457 57681 10941 -82031 -61470 -79224 -105261
16745 -105261 -110845 -108494 -84316 -80834 -40661 -25554 43854 46327 6823 -32672 -50998 -19808
16733 -19808 -10253 27096 -4437 -27700 -15356 36747 94130 99524 78744 -1452 -39740 -60177
16721 -60177 -37132 -49692 -43310 -62511 -35641 32349 85089 118640 120516 179558 167804 103127
16709 103127 1569 -27423 -30245 -10267 46070 -21339 -84506 -116345 -114547 -60379 -17185 61200
16697 61200 27931 -4136 58814 64743 79878 70676 36853 -9972 -26333 -42015 -114323 -72662
16685 -72662 26265 42545 81896 66633 25452 -7058 11869 89087 45398 -5119 -37871 -34456
16673 -34456 -20632 33580 -3695 -19926 17671 86740 131451 104322 133924 224337 176553 48292
16661 48292 -33640 -28733 6791 -29530 -28900 -18617 -51522 -88723 -75772 -24277 -34045 -32894 -102279
16648 -102279 -125002 -118243 -76681 -20571 -81205 -87135 -58408 2128 1967 -64064 -98805 -71701
16636 -71701 -64049 25044 52204 5349 -38530 -138537 -140355 -118847 -53085 -53979 -85188 -58703
16624 -58703 29656 -34816 -22472 20207 45570 64298 29293 -64835 -126861 -84464 -54843 -49613
16612 -49613 -67878 -89053 -147861 -140444 -104370 -68371 -109066 -122853 -105907 657 44060 -33633
16600 -33633 -35768 62141 81041 122755 103342 102633 54662 69919 63460 73689 76249 -61720
16588 -61720 -5333 -9390 -54451 -71267 29121 36172 19109 -3071 -56954 -42533 -9129 -33719
16576 -33719 -69116 87 83496 108888 95146 115047 45115 6899 7755 45049 90500 11365
16564 11365 -11013 4764 -25345 -13781 -36360 3791 86576 89429 73949 50405 102250 160657
16552 160657 120105 194709 137735 19415 14225 -6719 -28434 -62192 -86398 9636 118319
16541 118319 122967 57357 50421 59639 -473 -4904 41161 -9656 -107041 -124594 -84715 -115050
16529 -115050 -101419 -37581 -5311 -99654 -132827 -78155 -40152 -47072 -39629 -25889 -49552 -31863
16517 -31863 -15192 52664 95010 84999 68581 149491 127776 -4691 -71590 -84003 -47005
16506 -47005 67528 41002 -84522 -117858 -18846 -31190 -45549 24632 63041 9953 21292
16495 21292 20482 10872 66970 -21858 -8549 -54029 -84982 -50465 15408 -12420 -7671 -15342 -80542
16482 -80542 -77645 -103266 -132902 -105121 -108143 -81855 -88882 -90901 -102143 -16602 56383 46244
16470 46244 23191 -10357 -25177 -40346 -62333 -35205 -3442 18065 3296 -14520 1314 -62817
16458 -62817 -65992 -6126 -17709 -95105 -32807 17321 21332 14459 47094 27454 -27940 -24016
16446 -24016 13917 49507 55697 95486 95213 -2682 -75546 -73888 -8745 33676 19827 -61836
16434 -61836 -93793 -28395 21621 134569 171196 129709 75768 25731 -1843 68829 147732
16423 147732 95648 51979 100220 132240 115397 92674 116096 118637 41552 -11828 -48990 20837
16411 20837 -55894 -126790 -160260 -43890 51823 94490 170151 186204 125266 121804 67350 36858
16399 36858 -13548 -49208 18254 102115 83156 31891 -8510 -13469 -42552 -75974 -115899 -140586
16387 -140586 -103262 -117257 -151469 -160394 -156106 -105352 -13926 2196 10716 -25926 -35525 -22114
16375 -22114 25237 52287 3486 -73313 -88277 -108957 -56368 -84459 -147481 -126281 -48449 27498
16363 27498 -41661 -72233 -80608 -42689 12945 38217 68395 22667 8993 -40222 -42027 -53024
16351 -53024 -55283 -71918 -49511 13295 78679 44922 30003 25931 48564 78670 73414 124108
16339 124108 122502 18971 45340 129278 163472 95708 39710 36352 116052 14007 -39779
16328 -39779 25570 100692 94159 27702 30490 57138 163104 135896 -6344 -68535 -43276 -81531
16316 -81531 -74286 18841 2230 -26097 -26462 -22600 -1527 32720 44629 46572 16817 -19775 -21777
16303 -21777 -30421 -24489 15348 41745 22922 -40163 -21074 51441 99456 80761 14120 -12492
16291 -12492 12256 -31948 8370 15576 4600 2370 7141 -12779 40696 32921 -740 7831 757
16278 757 69016 103328 66311 33013 3851 55173 100161 34634 -22981 31971 33206 10115
16266 10115 -28661 -97339 -104705 -127799 -138699 -163608 -136532 -132779 -121193 -80185 -35965 32910
16254 32910 122627 49112 5295 -35960 -27861 39146 736 -11091 -41206 -87290 -13364 3734
16242 3734 22457 70921 79401 30796 20623 11770 -43518 -21839 112930 104492 67441 67977 118960
16229 118960 61099 -6279 -14106 7779 -67 -31605 -148312 -213984 -259873 -182746 -85832 -22130
16217 -22130 52786 87405 133914 44221 -1836 -9653 -79032 -45172 -54836 -47259 -66224 -80307
16205 -80307 -72568 -22697 57804 44275 15260 -29140 -54056 -71637 -19744 -47918 -42460 17995
16193 17995 107423 138132 98059 71116 43205 -399 -58772 -84162 -77410 -114590 -131959 -176389
16181 -176389 -205119 -92948 22048 33220 -3609 -22720 27807 -10072 -65208 -50930 -15236
16170 -15236 13534 -73166 -61155 -49768 -84821 -71959 -75732 2041 33381 -22120 -79928 -52384
16158 -52384 -17364 -1651 4529 2430 -28143 -25160 -17314 -31964 -97715 -222339 -228260 -154727
16146 -154727 -45111 4615 -28902 -71310 -113429 -123931 -43690 26230 -2614 -45636 -136255
16135 -136255 -111988 -45784 -61169 32078 75694 80390 77010 26109 2069 25695 22756 -3167
16123 -3167 -72311 -107083 -48005 9539 1027 -29022 -80102 -94336 -119151 -40757 -54392 -64754
16111 -64754 -41388 -27789 -6491 55277 77996 26221 -14330 -3738 55504 72408 90103 70631
16099 70631 27295 26851 -15416 -5550 -16016 -39424 28203 30887 45838 32033 -1002 -18859
16087 -18859 10581 102741 147522 68370 -35023 -79279 11707 17854 14238 51425 31827 -45664
16075 -45664 -64847 -57377 -64867 -63891 -79510 -30894 -71693 -113214 -96385 -79877 -38520 -44137 -37120
16062 -37120 53208 104992 29529 35165 58993 17126 -22710 -51894 -58606 -76264 -133396 -10822
16050 -10822 113919 71610 51200 90688 109668 139231 159466 152631 165959 153909 41684
16039 41684 -32610 -53446 -47348 -87259 -36015 15578 40236 26992 90700 108648 126612 124358
16027 124358 76657 18807 -28059 -97525 -33756 26528 97975 74200 35024 7769 -35672
16016 -35672 -3573 3648 -27535 -78747 -86541 -51725 -50738 3400 33 -101140 -116162 -108163 -92232
16003 -92232 -53531 20402 -1525 -111369 -200840 -158327 -126582 -72150 -3038 -19409 -91682
15992 -91682 -73652 10918 41189 -24515 -40962 4908 46943 61783 32282 -51616 -49579 -2339
15980 -2339 -24651 -4300 919 19421 25641 7520 -5729 -20456 -83741 -103334 -3476 40294
15968 40294 21912 34052 64602 -23084 -31433 -2836 -50306 -77909 -3994 -2447 -73659 -56693
15956 -56693 -29209 72926 116250 81204 53174 82724 33633 -42658 -4166 -31514 -81384
15945 -81384 -105000 -100467 -79270 -1486 101838 110581 97389 79670 76356 33005 74806 40247
15933 40247 53269 132101 129722 120268 139578 185152 161532 117404 188623 144193 83623 81457
15921 81457 41499 1527 -107590 -185646 -186034 -170459 -147216 -25990 28889 30539 31668 97146
15909 97146 86054 -18404 -43303 57249 64568 -33340 -75741 -46334 27024 29742 41015 54327
15897 54327 42813 36262 95439 72407 137798 60254 20470 -69202 -32775 -39893 -47918 -26407
15885 -26407 -74443 -126682 -149445 -157447 -65901 64765 123291 65003 31051 48846 85797 108286
15873 108286 60122 26229 -34553 -44376 -80626 -57642 18659 54750 31875 -4732 56865 111650
15861 111650 134591 111746 171947 230535 152129 104598 80456 -26867 -43092 13325 22879
15850 22879 -11901 -31926 -55651 -106267 -100997 -76237 -47636 -53937 21510 59786 8320 -76432
15838 -76432 -75846 -24437 -4240 -31244 -14974 15066 40391 79407 80714 64022 70013 23884
15826 23884 -13890 -958 -26361 -74266 -101142 -26628 36658 59314 63215 54345 -37452 -98262
15814 -98262 -157675 -157893 -101323 -143750 -186999 -131158 -105404 -40886 62881 166735 116039 67935
15802 67935 26265 -23714 -35692 38797 89569 97493 -12815 -36166 22805 71962 46956 49596
15790 49596 93303 48088 75028 53204 11935 36933 -46663 -101825 -75020 -19361 -3748 -23468
15778 -23468 -37389 -54451 -33369 47772 89431 89377 65186 -42558 -67278 -53825 -64681 -57101
15766 -57101 -41292 -13540 -4927 23428 91103 65535 38026 63459 34932 -46415 -108188 -27148
15754 -27148 21854 12926 -79636 -112343 -100346 5159 56922 67011 93163 49679 -6381 -2564
15742 -2564 58819 79285 16181 14780 -7597 -76802 -56632 219 -10179 -22848 24422 -43651
15730 -43651 -60626 -21447 -63336 -145898 -143199 -97652 -70615 -43285 5550 -40334 -52910 -32119
15718 -32119 -7424 52338 106622 90128 83069 142722 98680 89213 111913 58643 56423 14041
15706 14041 -74632 -138662 -57244 -35683 -90162 -43125 -21968 -53224 12943 14378 -24778 -86519
15694 -86519 -57865 -31827 -61839 17991 33912 103977 146599 100909 7890 -41283 -69440 -50113
15682 -50113 -71482 -130232 -82634 -4010 -36760 -81727 -60590 -84042 -48745 79039 92256
15671 92256 24788 10918 52862 74157 16811 -27005 -60500 -30338 -58087 -99367 -108382 -82447
15659 -82447 -63143 -62248 -117423 -53296 -51164 -115747 -124717 -36820 -11641 -87567 -48770 22825
15647 22825 -9873 -75094 -34990 -62335 -10371 -4757 -76140 -123596 -24039 -17259 -17744 20416
15635 20416 106618 88533 38637 -46447 -113028 -109671 41421 79249 63811 43164 -37387 -9953
15623 -9953 35314 73911 82411 45541 13676 29114 8669 -31333 37085 62838 116780 151236
15611 151236 109442 31418 86550 97803 114687 142683 165616 143399 63701 31069 -25426
15600 -25426 -30991 -2835 41783 25268 62764 134492 89757 38148 7463 -25115 29650 16195
15588 16195 -18987 43703 38047 -10636 -3069 52988 108630 112012 65609 18230 18491 9882 50381
15575 50381 -10193 -56519 -28147 -64628 -160009 -213391 -112024 -54254 951 24507 65171
15564 65171 68547 41383 -73202 -74122 -3315 -16495 -84563 -55363 -5215 24624 -3587 6020
15552 6020 24803 25500 37810 38980 -14077 -17110 17735 73632 68681 77611 90885 71649 7522
15539 7522 -11836 27000 -60758 -82432 -137911 -150041 -66265 -109759 -120823 -106435 -72090 -43731
15527 -43731 -58500 -1629 60596 40754 -11398 -80645 -153557 -146605 -175967 -160627 -70624 -34058
15515 -34058 -58135 -115266 -75748 18048 24588 18252 -3147 -8420 -34124 -89823 -46008 23817
15503 23817 66049 62580 43665 21544 40690 -33356 -61382 -58706 -1644 21175 37522 84860
15491 84860 39315 12667 -5870 27288 86910 159018 62096 -36728 31764 54941 -63678
15480 -63678 -80300 -34865 -8389 2428 -633 16344 8525 -24764 -75439 -128326 -92966 -17540
15468 -17540 8726 -25002 -26286 31608 57359 11593 68615 59878 -5310 -108877 -31454 31109
15456 31109 8811 27945 52323 50900 21015 36343 32074 59755 69489 19572 -36114 17115
15444 17115 19290 -95335 -42257 -43009 -73320 -88996 -113543 -124114 -100213 -70075 -55266 44941
15432 44941 96048 113423 186621 67714 -101388 -27098 54507 101112 107864 121875 98521
15421 98521 84238 10919 48889 30710 13240 25576 99516 134010 162548 103108 5273 -16549
15409 -16549 7149 13116 -4883 -68309 -76040 -13985 5533 10082 15095 -35075 -37317 -50732 -22183
15396 -22183 27257 -22323 -17936 -17140 20339 63343 6482 -42103 -124685 -126712 -61349 -30045
15384 -30045 -31346 -24947 1416 54939 46297 35250 9951 -18159 58562 82453 84418 107424
15372 107424 -853 -139460 -160993 -151988 -64319 -20320 61620 109515 33180 2681 -75364
15361 -75364 -90787 -66360 -32067 908 29624 -45303 -118026 -80376 -43201 -42624 -14557 38749
15349 38749 59480 -29345 -106873 -161535 -150187 -62763 -60023 -114506 -88973 -42365 -2961 19032
15337 19032 -63091 -177573 -208834 -113272 -75745 -11938 19043 4032 19975 15183 -86699
15326 -86699 -71629 12886 26845 27422 -8128 -48342 -52939 -8993 35869 61729 51367 -6276
15314 -6276 -68707 -51659 -22644 17269 70863 130200 129803 79848 37021 76914 68016 75950 88141
15301 88141 105720 23730 25044 18879 -69441 -118976 -145016 -104779 -37315 -51501 -74770 -37211
15289 -37211 -1557 -49837 -35558 -19082 -67509 -107086 -63230 -85866 -97962 -38813 -45142 -5774
15277 -5774 71132 102610 20193 -6516 7653 2294 26924 27802 52620 55824 43318 -66411
15265 -66411 -49251 31990 -2710 11141 32632 69751 15280 -65411 -132037 -150210 -97839 -90054
15253 -90054 -131250 -126622 -57483 -23948 -23347 -2258 -10344 -59224 -72889 -34437 27432 47220
15241 47220 -3236 5122 1532 12460 27332 48182 44646 18178 24295 7647 31134 38192 -51884
15228 -51884 19653 61021 -13332 -25609 -3065 -874 -20235 -35025 -20254 32100 25320 -75501
15216 -75501 -131666 -109555 -69034 -94091 -188301 -126263 -41411 -56674 -91364 -75254 -113084 -111947
15204 -111947 -114149 -116147 -69457 -142473 -87924 50881 29082 -8713 10294 -49930 -18212 81776
15192 81776 128795 35994 -42034 -55257 -11159 3481 13376 36325 8728 -30117 -121702 -99938
15180 -99938 -57147 -36267 -12113 67052 91344 6367 -18048 85176 167548 61354 62875
15169 62875 61800 18699 68248 125526 174143 126941 152748 52773 27913 28294 14958 60217
15157 60217 59916 -44630 -73658 22066 57374 -58999 -83946 -14303 56468 93960 52075 53046
15145 53046 21521 -13338 -29164 -82847 -11278 57846 89346 147945 136334 138214 38982 9382
15133 9382 -22259 -100684 -61825 -1260 2200 38403 47870 32734 67765 80221 37291 -25283
15121 -25283 64560 63040 22310 46259 88860 69292 63485 29783 40044 -258 -72600 -103954
15109 -103954 -140240 -158090 -156830 -107776 7479 46792 -42012 -83428 -144659 -185656 -108120
15098 -108120 -21723 -46029 -27877 -41783 -7053 10315 8474 -28844 -51998 -8123 -25666 6865
15086 6865 7230 -29407 -16035 -25095 -36807 -15424 40760 16155 6595 12209 23926 71513 101888
15073 101888 71177 34273 54246 59177 22348 -41778 -97540 -127358 -139671 -100352 -22466 -30556
15061 -30556 -10423 28921 -113281 -159896 -46763 -36910 -29841 -7800 -12902 36371 34786 37684
15049 37684 -9981 -30682 -56122 -18510 33394 36505 -23304 -90909 -53812 12991 -83544 -17333
15037 -17333 -14496 -96064 -114355 -35680 66749 147025 143590 122009 45776 -48640 -33815 -74441
15025 -74441 -136892 -163148 -151699 -137563 -110378 -88538 -126917 -145910 -50241 -53760 -51363 -60263
15013 -60263 -89076 -36366 38506 30781 29063 -12009 -14326 18442 -8359 -21280 -12677 46572
15001 46572 102441 93748 61247 80593 65861 41747 -7858 -94559 -68146 -49806 -109099 -133019
14989 -133019 -48582 10032 10555 -41781 -62013 -47050 -55814 -53156 -72770 16445 42181 51598
14977 51598 -15279 -159650 -120606 -67613 -66682 -26789 11673 32663 10010 -13614 -18680 43124
14965 43124 74405 73756 31418 -3257 -8920 11723 -60587 -77977 -4770 5811 -62408 -28230
14953 -28230 3366 73798 137272 110062 75514 24090 43153 61407 20879 -34237 -52790 -33219
14941 -33219 -8581 16353 60727 84100 120781 78081 97940 76025 92140 -29642 -64702
14930 -64702 -27950 -41398 -31032 -46729 35917 86374 43361 39024 10210 -1795 -7325 -44942
14918 -44942 14708 40156 114898 149405 44581 -45946 3341 44415 15079 -26187 -35276 -9956
14906 -9956 -27218 -59742 -120947 -104499 -10817 109010 158570 187606 157584 106591 84530 132867
14894 132867 109892 97200 68870 51863 65756 134379 134759 54057 24360 12629 14623 -18002
14882 -18002 -53703 -58924 -26126 -18220 -38710 -41865 -11669 7001 -29497 -31685 -102162 -97773 -3763
14869 -3763 81185 85975 73294 50959 25225 -19190 -36016 -48653 20210 14501 22206 31366 22229
14856 22229 10507 95979 143890 140087 9384 -25716 -7057 -705 66681 59790 -41660 -89883
14844 -89883 -26445 -12445 -110816 -94658 -11686 24973 -17573 -2554 79276 142561 192489 112907
14832 112907 90861 90236 110998 71876 55074 33648 71181 52606 -1559 982 5676 10353
14820 10353 -27228 16996 85704 72782 22792 -38509 -38163 -75014 -102931 -95200 -66483 -20135
14808 -20135 27017 95187 141203 116403 105356 85197 97391 131734 106807 101252 60790 4428
14796 4428 -23890 3000 36353 14811 -9359 -39321 -26935 42429 94452 119511 117394 32154
14784 32154 -26177 -97340 -88265 34856 86245 141024 95920 50242 -39715 -65853 -83397 -70710
14772 -70710 -18717 -76888 -90944 -32188 4923 -51044 -75537 -67376 41393 85265 144231 115945
14760 115945 130767 137589 115775 76280 -25737 -59545 -49230 -673 73667 49767 -20022
14749 -20022 -57198 -97074 -27957 88971 120093 28137 13352 -10034 106604 143975 48946
14738 48946 25897 57809 23969 49297 11660 -14285 -76874 -68753 -81091 -58238 -75408 19093
14726 19093 16968 -6518 -16313 -29350 -39771 22030 55210 59489 100427 155376 159849 111469
14714 111469 63804 71913 69571 58269 42759 99861 82566 18795 -28353 48719 34425 17007
14702 17007 14662 37404 50367 44250 -21057 2286 -66762 -103555 -68404 -33339 5759 17241
14690 17241 33465 75088 142113 78923 -39536 -97915 -105614 -37186 11623 47692 83480 8181
14678 8181 10966 53936 65748 62720 84285 74046 41935 29409 26796 77306 139399 134573 106033
14665 106033 120786 75073 21222 3312 -9150 -13961 8420 -39656 20529 141834 111567
14654 111567 -518 -40470 -110757 -127245 -136356 -108348 -80476 -94003 -31909 -1870 -38124
14643 -38124 -49495 -9830 -29115 -23906 -2432 -67383 -112681 -62735 25964 18103 -27790 -52462
14631 -52462 -89281 -50814 -6118 15413 30575 22377 -3677 14539 24196 7945 20476 32178
14619 32178 -6725 -12514 596 -23492 -60225 -44680 25542 -14645 -66099 73064 115503 73135
14607 73135 54934 23542 -764 -25053 5682 364 -1701 45386 67459 41406 14125 38202
14595 38202 30434 -30325 23752 73113 57454 -5917 -15305 23025 988 5907 48570 57235
14583 57235 12158 38938 72415 67031 97356 106767 37119 -23137 -27420 13703 -15765 -9869
14571 -9869 30739 8181 -35681 -97942 -131611 -176720 -178853 -177997 -141750 -101063 -41396 -59345
14559 -59345 -106636 -91718 55154 66666 -1984 -16507 -78145 25487 19199 59860 27483
14548 27483 -46447 -106147 -88940 -85434 -106317 -120593 -131304 -26582 -76908 -117433 -105009 -134841
14536 -134841 -137305 -102123 -50877 -89120 -129440 -70537 -82028 -27792 -11497 31446 135598
14525 135598 167330 60654 -56607 -99 13679 -15394 14189 4913 -44616 -98177 -101110
14514 -101110 -96029 -66465 -3544 58195 -25567 -38726 -60928 -16523 -92275 -83825 -23677 -69570
14502 -69570 -44672 -37659 -29812 -3959 53466 36056 29169 62478 38629 60010 38497 48478
14490 48478 91763 48018 17211 48258 8195 -14640 -72159 -52894 -60637 -87059 -17646 90250
14478 90250 76263 22328 32457 28126 11917 -17428 -31229 20296 41384 -3998 -2018 41700
14466 41700 6236 54127 132009 51866 30702 65384 103755 141996 129353 67769 19478 45177
14454 45177 28027 28942 23811 13103 45848 -10234 14857 -36567 -60175 -103024 -68064 8848
14442 8848 31037 32787 20194 5397 21580 -21040 -38635 -5908 21191 18150 113622 116914
14430 116914 -12197 7479 17843 25842 -68064 -32007 -27425 56340 89627 64506 11031 -6937
14418 -6937 -33367 -35379 343 -38809 -14184 -110208 -132439 -122419 -121175 -70180 -2048 -65956
14406 -65956 -66827 -111643 -149320 -77529 -12015 -33335 -46159 -31529 -75962 -153859 -210445 -150639
14394 -150639 -82992 -81940 -45468 32164 59532 57783 83878 81456 65497 36573 -63064 -130379
14382 -130379 -174346 -223521 -99720 -54631 -143457 -112497 -97220 -19291 50912 13170 110896
14371 110896 158719 181634 111395 32691 -38778 -53891 -70058 -26283 35539 10784 -40105
14360 -40105 -32480 6163 28834 -6926 39838 59282 27783 -20666 -61785 -40198 14149 48215
14348 48215 10044 -22927 -4666 46432 42192 96316 78024 60776 9037 -27782 -18537 5798
14336 5798 55489 152074 133358 119296 96909 38829 46384 75723 27348 -8185 -54381 -57069
14324 -57069 -3138 116773 118709 31007 22689 53772 37769 127719 188797 93217 20822 1066
14312 1066 11869 -25543 -43549 -11823 31006 1779 19961 54254 108804 204777 297466 241106
14300 241106 106504 48561 23793 54797 148724 72855 -2463 20259 12903 -48499 -44196 -44052
14288 -44052 -53277 -67352 -60821 -2145 68451 145996 163495 172102 176068 80979 50024 -32857
14276 -32857 -143331 -69642 43270 74557 -10229 15476 59640 50686 4953 -29274 -88505
14265 -88505 -158832 -167491 -81457 -16437 24380 -488 15345 -3776 -16890 -31771 36027 -75647
14253 -75647 -146192 -140730 -128932 -138104 -98769 -11199 34319 -48138 -81339 -40451 -1391 -14693
14241 -14693 6992 19181 -77742 -89342 -140842 -150115 -129059 -95110 -20917 -2563 8085 -51976
14229 -51976 -154168 -195261 -162224 -128011 -86528 -24258 -21615 -82548 -66389 -42436 -45418 -39397
14217 -39397 -43499 -43794 13239 -35391 -108594 -191976 -229280 -131976 -88590 -169805 -178743 -122587
14205 -122587 -442 33035 -38871 -69785 -63771 -16667 44970 -15487 -73320 -31335 -38033 -58798
14193 -58798 -72713 -26760 -35165 -63819 -118029 -5661 22460 23149 -16630 -49757 -43809 7719
14181 7719 84943 84892 41597 39387 -3629 -15634 31768 -8603 -30336 -13693 65368 62521 69158
14168 69158 84146 32595 28320 80784 47094 -3707 -22544 -28439 -38489 14503 73252 95753
14156 95753 166736 188729 162913 120122 20892 34225 18068 6327 4669 83374 97249 21261
14144 21261 5798 -65347 -51497 51738 80671 21698 35282 98520 135693 111423 144912
14133 144912 223008 275602 166399 142195 116423 141676 170687 211939 241698 182145 167703
14122 167703 138486 127521 133075 123586 155569 95146 145122 192838 205649 202042 232503 190165
14110 190165 129083 223884 361655 373550 418675 395854 369923 376310 343566 300747 195528
14099 195528 200871 215280 203055 166048 41354 15280 -8508 9008 -27109 -34926 88105
14088 88105 99146 122307 243458 330924 385359 390312 473665 514685 614852 621936 514224
14077 514224 493234 460746 454848 326626 274633 218196 135194 118623 95610 156862 195813
14066 195813 184559 112757 132653 185438 274475 361829 388755 341890 306531 277641 259219
14055 259219 255787 231824 260021 195681 182382 253059 199755 145629 183159 249885 241979 179732
14043 179732 138704 82569 123560 114995 77958 118936 150522 154234 230341 210696 230539 254776
14031 254776 228073 230502 211670 216678 123254 148426 168156 175759 178654 179542 206632 188920 100167
14018 100167 53151 5649 -890 24161 77575 76617 144936 195992 183830 175244 191618 201246
14006 201246 200940 184938 140307 133252 145043 112183 121554 127733 101586 51057 81150 124602
13994 124602 100732 48116 -48923 -118951 -114238 -169884 -161039 -166669 -53117 -2022 -21119 -36688
13982 -36688 -62696 -89513 -65932 -29786 9972 50392 -17547 -70074 -111595 2772 60010
13971 60010 68428 124570 182548 145750 142868 135588 102135 54934 24406 46880 -13034 -53044
13959 -53044 2376 97783 126286 116380 52658 50122 44550 5071 -13176 13731 25566 18867
13947 18867 2729 -18153 23390 -18707 -5158 65949 111098 124658 119020 133317 141698 156397
13935 156397 138752 63094 70051 154373 177983 215698 283258 229028 193542 204928 223023 263510
13923 263510 232945 220443 245316 287823 266501 132303 78740 211713 244787 279000 281688
13912 281688 250970 234768 232213 221367 239519 220058 291170 399046 422065 358004 350009 411692
13900 411692 480349 518513 472619 417254 400071 365527 335780 332244 345398 301399 255235 350232
13888 350232 403165 345759 266117 211378 319894 344738 402912 444222 492382 587447 623567
13877 623567 711802 711961 747689 785807 777715 798723 842904 727654 560737 486653 465113 407922
13865 407922 385663 388980 382213 377483 348875 388625 438574 487572 531689 560697 560394 609356
13853 609356 707398 805888 920159 1028238 1027523 1010504 1028767 998909 854141 738926 647019
13842 647019 516337 467914 404158 349648 302021 300890 408526 465920 444198 466643 517806
13831 517806 586350 632156 624684 667605 726998 832064 910028 880997 797845 710030 542844
13820 542844 472837 459018 462873 439911 465199 439491 355550 348401 336591 355314 439861 432179
13808 432179 437702 431156 416561 389624 444906 547525 590212 605028 660579 669152 650573 667587
13796 667587 678716 603697 485957 441707 407045 356075 350737 328479 320561 303041 289365 238408
13784 238408 254626 313758 354944 448566 432907 434259 448058 442575 423764 433597 395883 471998
13772 471998 425387 403593 365387 446139 480398 429661 387489 364785 334169 264834 267826 294185
13760 294185 270766 281145 253315 223594 233181 276368 255837 258729 318797 334649 281744 196340
13748 196340 265031 409768 524672 524300 541526 647262 722545 676222 704332 683490 564625
13737 564625 602375 820604 923105 932061 981986 1051915 1053161 1112065 1250088 1360524 1479056
13726 1479056 1637461 1783383 2010911 2259674 2529774 2788700 3098781 3545862 3936001
13717 3936001 4419199 4990383 5659308 6486536 7447774 8619243 9982655 11668574 13750241
13708 13750241 15972208 18287865 20558177 22512548 23942225 24588272 24389802 23253480
13700 23253480 21485107 19310112 17033830 14955611 13385267 12452398 11951055 11830071
13692 11830071 12188222 12883424 13822840 15278583 17172014 19423793 22263270 25708071
13684 25708071 29662155 34042206 38665895 42938798 46474895 48599767 49037577 47529145
13676 47529145 44205927 39651973 34648955 29806896 25607691 22346008 20213234 19099800
13668 19099800 18748775 18993138 19834422 21201915 23184991 25889090 29311511 33560384
13660 33560384 38624370 44581871 51367768 58316006 64824587 70169077 73532975 74267904
13652 74267904 72009223 67039022 60232056 52577073 45037594 38326199 32997036 29381286
13644 29381286 27337410 26536230 26668770 27625731 29406156 32025367 35551392 40111153
13636 40111153 45814628 52719016 60822994 69738521 78764935 87022618 93417321 96957157
13628 96957157 96865180 92758440 85103185 75092702 64080039 53407770 44031780 36607414
13620 36607414 31476601 28134642 26213961 25402122 25461061 26370105 27936805 30241498 33458903
13611 33458903 37614478 42604576 48513064 55127299 61823801 67828148 72206685 74293440
13603 74293440 73557810 69995689 63791500 55911125 47515502 39516592 32489774 26939434
13595 26939434 23038439 20451502 18872430 18105053 17976254 18303100 19261430 20796662 22873354
13586 22873354 25608432 28960600 32916553 37318633 41821802 45870202 48861569 50363598
13578 50363598 49985706 47557715 43358531 37969566 32117656 26504127 21626915 17716177
13570 17716177 14886224 12964865 11748538 11064961 10869409 10935097 11362508 12016939 12981572
13561 12981572 14319861 15953098 17874389 19999291 22005097 23591371 24662855 24895018
13553 24895018 24130162 22493725 20002415 17154140 14197511 11436684 9023802 7090908
13545 7090908 5630392 4532729 3811608 3268328 2831203 2469692 2166897 1950473 1772237
13536 1772237 1682025 1628959 1524973 1376539 1245851 1188763 1224396 1160941 1081820 974391
13526 974391 903218 859990 814873 670982 631615 722094 722868 602908 546890 576465 570033 610568
13514 610568 538681 433275 376752 345420 373343 468178 530857 525167 542903 480231 441251
13503 441251 396515 324467 331297 359222 364376 386185 421012 386526 386710 400076 380927 303151
13491 303151 234772 158443 175532 238356 318080 338224 375801 342441 330380 297558 310007
13480 310007 377941 463729 372506 264186 269579 221479 263394 250559 189912 130470 151620
13469 151620 196429 240192 243153 260384 257154 285427 243659 245789 251702 256373 238193 240460 180755
13456 180755 134256 146269 173355 211955 173233 218144 307406 289046 306668 352105 308676
13445 308676 276174 276300 254591 243609 264513 290063 265222 242549 326946 288771 333276 382906
13433 382906 437563 411439 472138 545733 652760 657852 616771 592793 567241 539857 536016 584111
13421 584111 558135 502579 452198 399207 322696 314518 301417 275295 268308 277549 335104 360415
13409 360415 436321 460496 449492 505069 590414 639386 603971 664375 750726 745652 749511 655815
13397 655815 602410 518344 484235 471798 493881 522585 468873 388833 429743 558856 621987
13386 621987 594537 582142 525133 376736 380626 313794 357410 391199 289065 243059 307365
13375 307365 338538 424720 536202 528414 497651 530506 634611 692120 718020 680887 678073
13364 678073 631049 611229 595222 590765 675987 726639 777494 785765 736239 681425 685819 720680
13352 720680 684219 670818 679335 640188 588563 575522 518775 359022 311150 328035 364258
13341 364258 336942 288874 310529 355837 383598 492186 505485 520182 578881 560491 563208
13330 563208 577874 584688 576757 619777 646409 742235 762013 718253 737088 768797 727121 713084
13318 713084 660584 613750 606852 629364 576349 548055 556096 565685 536160 470898 347745 267900
13306 267900 204350 251932 302854 312862 378131 391930 385998 364030 348774 405585 466835 537528
13294 537528 631786 606136 559772 575715 587439 583290 538376 502608 482316 406213 309473 329014
13282 329014 274742 243641 234818 265805 212048 143979 187243 239791 236180 224208 135259 171029
13270 171029 214340 190064 159438 149410 238587 246080 222679 152856 117990 123559 81780 131263
13258 131263 128311 102330 71994 121183 133307 185875 211266 259329 263630 265233 312171 385475
13246 385475 429082 415648 422406 407484 387443 367562 348638 270427 241951 245700 298655 242757
13234 242757 184566 185024 181921 201870 194127 251938 298495 311712 270586 256915 221093 263910
13222 263910 324934 334727 291547 300146 284856 233254 194876 249850 232429 138610 105103 121227
13210 121227 148740 223526 273444 250848 241397 257415 310016 334823 420039 403161 381508 485548
13198 485548 552491 523327 418794 425851 461585 434211 395965 355221 380498 411207 336825
13187 336825 280911 279394 205117 252577 313787 361525 396052 403637 406620 385205 366349 404164
13175 404164 424770 506248 583996 505495 480653 476457 517929 488403 428472 329393 321658 374040
13163 374040 407727 309160 258052 308137 359197 316634 307325 339012 364369 339233 322098 308918
13151 308918 302059 379563 378720 428737 514921 546835 514078 511441 440520 416237 394234 373736
13139 373736 303566 214321 135858 58251 -346 -3311 109449 183771 198834 138463 215217
13128 215217 348495 316584 269730 324699 310426 364324 443148 484295 471325 517552 563698
13117 563698 581509 566502 521597 463439 438772 397259 330824 259706 256244 328778 393740 409680
13105 409680 398409 332602 345634 312740 361513 448491 486374 458353 441244 369207 393738
13094 393738 353224 325383 311578 339814 373441 397335 401167 412262 371271 319409 337590 305672
13082 305672 314798 312152 258267 285311 326616 359100 378936 443148 464109 486153 470715 358475
13070 358475 299156 277690 302491 370698 404386 344240 342398 349794 323665 295172 312963 319079
13058 319079 293496 224534 219732 305221 435956 474092 464368 384877 351134 372354 423694 379462
13046 379462 385762 490935 542717 506880 504588 518175 494753 486955 470128 531413 590213 660348
13034 660348 628841 683922 700585 680929 749822 761564 716590 709245 751453 820944 846148 807985
13022 807985 821001 859696 817678 810447 929426 963057 1090252 1251438 1291518 1332702 1428562
13011 1428562 1488228 1535537 1661112 1728183 1900701 2119680 2278974 2540027 2657907 2856176
13001 2856176 3154764 3508838 3951393 4389112 4858067 5247229 5668796 6150726 6671843
12992 6671843 7231372 7849668 8596329 9353756 10163704 11210797 12524507 14090977 15935434
12983 15935434 18104382 20691291 23738640 27421955 31656863 36550840 42206579 48691864
12975 48691864 55969429 63643412 70536300 75329302 77885774 78737400 77241036 72980107
12967 72980107 66968894 60444080 53960432 47645619 41742194 36987466 33880777 32315508
12959 32315508 32114450 33100832 35078298 37989391 41815578 46602654 52349357 58983872
12951 58983872 66379572 74470429 82418254 89238844 93922323 96601163 97757799 96868692
12943 96868692 93356617 88963608 84905314 81508130 79104707 78081387 78755013 80670348
12935 80670348 82870238 84819210 85713319 84721812 82540501 79656190 75506538 70139448
12927 70139448 64339033 58827666 53684141 48710844 44501609 41781941 40710736 40970513
12919 40970513 42427912 45091714 48927591 53565293 58998867 65217531 72071154 78835392
12911 78835392 85118000 90987436 96132522 100005052 102622767 104485149 105965857 106845474
12903 106845474 107248187 107545212 107899790 108289876 108624958 108656287 107747511 105246481 101405791
12894 101405791 96546616 90498241 83044475 74986219 67577518 61100593 55479598 50985433
12886 50985433 48280702 47307296 47834520 49802141 53111532 57754474 63540999 70360920
12878 70360920 78121063 86074338 93258155 99346914 104538588 108754967 111376748 112018755
12870 112018755 111351897 110239430 107913073 104486762 101709893 100756131 101605133 104295707
12862 104295707 108126994 111845934 114457693 115641574 114978198 111408164 104400493 95600056
12854 95600056 86173851 75849808 65340728 56085975 49094112 44216168 41064269 39431782
12846 39431782 39287071 40468538 42827859 46261041 51009885 56967039 63961767 71672237
12838 71672237 79569572 86562024 91925645 95618605 97343968 96398615 92039651 84573201
12830 84573201 75298362 65037180 53895083 42860778 33497900 26527223 21568313 18027177
12822 18027177 15310023 13049770 11226698 9701591 8569119 7669349 6997020 6429547
12814 6429547 5910433 5531210 5218256 4902843 4626413 4324558 4089112 3824154 3515057
12805 3515057 3192047 2936458 2687752 2509736 2360130 2219446 2100343 2087005 2006049 1875443
12795 1875443 1785242 1706030 1613201 1586688 1582822 1580061 1516151 1508061 1441780 1464690 1479559 1411359
12783 1411359 1325911 1355427 1422604 1526264 1603775 1653675 1639433 1631869 1689942 1690815 1647898 1566841
12771 1566841 1434080 1260454 1183287 1060685 918438 878295 973357 987283 878430 805514
12761 805514 845521 928086 1037460 1055464 1069826 1129430 1121347 1174733 1180496 1198298 1200698 1095148
12749 1095148 985607 913310 856257 824223 748294 676547 676327 711020 681280 724155 745963
12738 745963 735803 670551 605029 541657 475344 492837 584484 670639 625380 593845 595692 640494
12726 640494 675567 715931 772587 938160 998940 989196 926652 892947 822915 699639 608023
12715 608023 614230 632991 685605 737112 897446 977739 1018949 1033737 1027347 1047397 1115684 1209645
12703 1209645 1306129 1357643 1384795 1420342 1364380 1269478 1093765 911277 801351 679134
12693 679134 555575 544258 665196 682741 698943 677368 592869 630092 767179 731094 706116
12682 706116 755698 816607 781812 770014 823694 862436 809559 698766 611953 581852 606828
12671 606828 565294 500041 483409 493286 573425 559362 525561 432350 372162 353597 390857 393005
12659 393005 477782 502281 459877 514656 480930 486640 523588 598723 574381 600456 689971 756754
12647 756754 813001 850630 889708 861970 674141 524709 487063 490387 488541 424293 360839
12636 360839 397712 494573 566396 635534 692768 760948 785676 775280 745939 689993 676742
12625 676742 672081 545557 410505 385255 346711 362451 289943 274054 327059 345610 297741
12614 297741 348228 383607 387493 327164 330039 326222 272941 190476 192866 180084 259013 313102
12602 313102 316646 364584 301425 233061 225314 238733 252415 342089 330115 195244 201385 221243
12590 221243 307491 290460 230105 166729 233211 307239 355674 340656 342889 301601 257110 313278
12578 313278 270448 256701 289615 258269 221945 238553 212484 185111 236344 335882 382752
12567 382752 297420 156549 96186 121968 164886 169560 217489 230628 189803 175822 192372
12556 192372 212011 197775 207322 257253 279571 283471 329173 351084 351272 253445 187364 192948
12544 192948 287923 349834 339674 269053 323473 351325 389461 379545 382086 421555 363083 294814
12532 294814 284542 357319 393500 384375 321418 274217 265523 295011 331482 289452 271126 281065
12520 281065 296341 263424 283786 342252 441879 461134 408577 392940 436944 415888 447896
12509 447896 507507 530977 568364 495090 446908 446032 427890 437551 396899 372052 331059 318961
12497 318961 249767 248189 346230 329622 297111 291105 199353 294912 449294 496819 531582 515939
12485 515939 555620 545574 564802 570867 564927 540712 584785 535792 511450 523977 589523 870752
12473 870752 932579 972612 1037826 1080914 1017266 942971 859957 785893 749443 644943 546782
12462 546782 482015 465640 506053 502724 568805 556077 525759 493917 535172 665137 766732
12451 766732 766995 796987 810468 870321 911145 934210 920945 877920 806082 741984 788683 864467
12439 864467 941432 916176 879112 888766 921873 929386 898314 857114 814918 725391 710320 762739
12427 762739 783626 708056 567716 508009 570939 592434 627126 697989 776348 826015 969841
12416 969841 1095864 1159359 1208705 1212002 1164494 1139020 1173204 1086521 1107784 1156923 1125796
12405 1125796 1136275 1151796 1149582 1145940 1192678 1351607 1495069 1681254 1695950 1693912 1749480
12394 1749480 1766995 1754292 1747524 1773789 1752608 1760124 1800659 1843756 1873346 1865353 1910898 2079446
12382 2079446 2246331 2342804 2459363 2455771 2350888 2321495 2276851 2307288 2330790 2389137 2451586
12371 2451586 2549037 2643621 2772505 2853850 2948118 3166661 3460376 3711375 3965183 4269329
12361 4269329 4566945 4890852 5188842 5504680 5897796 6190405 6579620 7055626 7677184
12352 7677184 8325905 9032283 9863966 10867177 12084673 13510591 15076576 17043172 19347798
12343 19347798 21904001 24893424 28421356 32492655 37259815 43050727 50079987 58459841
12335 58459841 68189350 79129251 90639246 101823565 111346387 117088948 117269295 110462170
12327 110462170 96718221 80004157 65212133 54514889 47889743 44315866 43032450
12320 43032450 43630264 45786589 49337421 54523503 61370494 69729351 78984724 88662203
12312 88662203 98138020 106981488 113870932 116216248 112425948 102962243 89371788 74076443
12304 74076443 59379168 47151586 38164386 32080434 27995026 25431493 23963487 23257186
12296 23257186 23259094 23675104 24413594 25503909 27004295 28878952 31210554 33973983 37451843
12287 37451843 41898462 47466724 54286499 62487092 72004547 82680122 93902382 105124925
12279 105124925 115686327 123721079 126993446 123176661 113006838 100538026 88372359
12272 88372359 77764437 69475244 64168648 62069304 62679970 65798196 71302300 79237951
12264 79237951 89785926 103019329 118846144 136906318 155739969 173732959 189349565
12257 189349565 200364815 203445077 194654717 174069337 147968052 122503482 100499101
12250 100499101 82811725 69265537 59602248 53359868 49904898 48589049 49345569 51930623
12242 51930623 56086071 61714071 68715817 76498815 84015995 90227381 94235074 95133017
12234 95133017 91489766 82463691 70383811 58183564 47377630 38700972 32029668 27305398
12226 27305398 24101942 21897046 20400516 19596068 19308014 19377028 19686541 20261171 21090825
12217 21090825 22289451 23797282 25676901 28027696 31202039 35387376 40726121 47254696
12209 47254696 54976169 63804489 73489472 83214038 91434768 96440262 96889408 92682173
12201 92682173 84565598 73604837 62507325 53576893 46919244 41712278 38002798 35844910
12193 35844910 35368602 36489193 39094089 43238363 48929621 55968597 64170349 73319577
12185 73319577 82889656 91519816 96305321 94320903 85511714 72860887 59073956 46222483
12177 46222483 35875229 28164359 22583814 18570192 15521295 13195698 11369280 9787558
12169 9787558 8440670 7518407 6791071 6063517 5381483 4905189 4511896 4137877 3849053
12160 3849053 3601355 3279153 3055495 2890595 2729303 2605695 2489108 2378321 2229516
12151 2229516 2167326 2111552 2053511 1991057 1908521 1819387 1721836 1653169 1552866 1403556 1375353
12140 1375353 1287270 1158866 1092136 1047503 1067856 1107237 1168040 1184772 1192021 1223424 1150547
12129 1150547 1103179 1048601 994752 941492 897282 907284 826317 726356 667084 622927 571580
12118 571580 525828 446177 399966 455017 568460 668313 658868 716611 791292 742272 709385
12107 709385 669250 713803 684170 556044 499528 564899 606742 567478 588636 546055 426715
12096 426715 415175 470743 540019 488870 469166 567477 682282 718548 685105 659829 574564
12085 574564 504876 520826 535324 585111 643666 617549 595234 668487 648016 632290 576354
12074 576354 558900 584637 590535 590761 537955 466689 447317 411770 377351 365486 283334 275655
12062 275655 369149 461972 487119 450436 423753 464835 555679 578568 552260 467632 309788
12051 309788 281579 234202 243499 293294 290354 300433 166219 152163 226010 282767 262777 169560
12039 169560 160961 247385 309361 399299 342772 322412 404567 360462 313877 251484 235152 204429
12027 204429 216797 254784 282840 292434 397965 361177 351759 438002 468628 439067 345861 375549
12015 375549 378673 362278 317923 191666 119870 102257 136280 182322 238156 229343 253650 248722
12003 248722 259774 303591 294381 252588 278901 243463 274227 321266 337633 335184 350365 418430
11991 418430 425437 422889 438187 374917 336586 293414 306564 216032 191762 206274 204182 195688
11979 195688 159674 123012 142984 99235 120034 162454 158416 136782 164219 169390 243719 288525
11967 288525 252038 193626 163647 147620 175024 206068 183426 127057 104783 118450 42345
11956 42345 54228 185442 187181 204332 188858 150294 158518 231985 227240 160960 116450 165429
11944 165429 265700 260502 209351 180612 166561 163563 149834 149541 170321 233141 232026 120642
11932 120642 129365 170603 176139 148561 134468 114331 70900 40709 49646 98784 42986 9102
11920 9102 25714 147307 163699 156653 166681 138908 87491 54495 79492 92972 158728 127373
11908 127373 122117 190754 235792 301629 229195 243469 247489 228509 195101 181505 185209 198614
11896 198614 230159 218392 234165 258668 269111 334805 390977 414091 382811 391597 444062 453227
11884 453227 439809 443324 560115 630608 602882 587720 614765 655243 651283 645157 533735 490106
11872 490106 513631 526215 587963 543741 425957 361916 338691 392717 451823 479443 534095
11861 534095 571781 675035 788101 840320 809157 723129 624399 479646 402224 363759 303169
11850 303169 246492 301321 255520 335044 326857 339691 323538 292460 247175 122097 91487
11839 91487 188334 262955 298774 350023 430408 486152 495996 520924 563569 545951 584083 703151
11827 703151 778790 785266 760781 652834 603336 541724 502589 508337 513579 573451 558661 426601
11815 426601 422253 470917 540169 579581 655743 794247 860437 925139 1031594 1110050 1148687
11804 1148687 1098590 992857 851589 721037 601031 490894 404873 337747 351714 297995
11794 297995 293113 328720 365732 405594 426891 430471 472822 512668 630701 746282 719549
11783 719549 662422 603764 541942 452181 333137 336439 339772 325709 275598 226966 167727 263438
11771 263438 273486 217695 242809 305872 307665 314771 343014 324532 286173 266400 219116 219244
11759 219244 257393 298012 318234 445543 518167 539022 580699 748133 789203 701783 586880
11748 586880 434208 345708 347033 362020 283697 244791 178144 247576 338853 412635 418605 370240
11736 370240 388890 443913 460965 549145 606580 605910 660210 559998 489767 417404 360793 243761
11724 243761 151255 114823 150519 207298 146180 133351 175476 225066 176337 230771 211140
11713 211140 141023 129618 115895 85556 9403 -17559 12947 25697 -34357 21337 15771 -34043
11701 -34043 10544 143719 139726 89188 105624 191677 172099 140676 155463 133099 130704 141596
11689 141596 106721 90051 71453 86904 23391 -16120 -33649 -39719 -13100 98826 75406
11678 75406 64604 51793 19543 64140 50078 85118 114619 139056 73228 95992 109816 141160
11666 141160 170977 150192 162184 101599 63972 34781 6793 -4451 74368 62901 46830
11655 46830 57678 8297 35183 62733 121448 205097 196137 162965 145590 77165 88405 109627
11643 109627 87361 152441 124572 76789 50899 19159 -24246 135774 189032 126720 48066
11632 48066 58277 37476 -53160 -148603 -67238 48579 116123 101583 121609 84439 133958
11621 133958 210727 286616 310563 293352 268500 199991 135005 108252 120820 48438 76628
11610 76628 -16970 -3429 48603 73775 125754 137533 124654 78362 112455 102571 51084 40837
11598 40837 71865 101529 168153 175958 118181 117030 109345 78145 86960 132888 29384 35312
11586 35312 134216 90560 71854 -27969 -48793 45782 63248 68702 96446 94968 59775 12668
11574 12668 27730 27384 74224 70663 -48315 -39051 -10468 49785 74268 95884 156016 162737
11562 162737 202079 190933 198461 225039 171964 216584 166425 106039 44354 42338 81059 99165
11550 99165 80350 87600 73577 59162 37701 30137 4677 -80255 -43087 -37316 -39918 -10787
11538 -10787 -21173 -3786 8458 1788 27148 134261 242055 167645 84519 52216 31263
11527 31263 -40594 6597 41016 36919 27054 7799 -8200 13077 -35060 -112352 -106931 -44006
11515 -44006 29119 89712 91648 67877 19357 46778 52962 29800 -27162 -2048 36581 25809
11503 25809 50832 91268 22916 -8826 33354 -32490 -73004 -42702 -17265 40193 22453 -39654
11491 -39654 -9980 27511 66565 65787 57340 56864 24714 66656 124414 85055 22646 -16561 -5508
11478 -5508 17881 7942 -7329 -16160 6263 68057 16214 -722 -494 2213 -1180 -22482 -45771
11465 -45771 -2224 53781 20786 534 126622 146231 83529 93163 30198 -54496 -90091 8639
11453 8639 115126 173786 130311 41132 88636 167162 204357 159772 49116 -38372 -22788
11442 -22788 9287 -4103 17914 6135 92 -52000 -24840 34963 8858 -52784 -89442 -67137
11430 -67137 -66829 -78554 -70686 -7657 50048 935 -50030 -39290 -63599 -11692 -35019 -46946
11418 -46946 -55566 -100655 -74375 -73726 -34824 -56332 -69719 -103414 -76072 -34457 -65503 -41269
11406 -41269 -20174 -36096 48144 81127 70321 24486 11996 -34801 13331 118651 189329
11395 189329 289730 236080 49952 -59825 -61066 -9729 52543 29825 38376 -6696 -38061
11384 -38061 -63008 -74605 -80394 -45447 63479 75278 -19173 -88329 -133974 -84618 -65611 -120588
11372 -120588 -98704 -89073 -59264 47114 77020 120812 153153 107114 67757 72309 20292 3712
11360 3712 76107 6747 -99182 -37719 69985 66007 -61888 -110401 -111897 -105965 -140964 -150056
11348 -150056 -109119 -73801 -40030 -4934 50188 -10079 26405 37974 53527 77515 73069 19618
11336 19618 43394 99884 113991 102111 69694 -14961 -63319 -85892 -22562 39831 -13193 -87383
11324 -87383 -111526 -120863 -175697 -129441 5353 44167 10691 -2303 27749 46199 34500 41710
11312 41710 105815 187744 258403 114832 17949 37311 28756 -18340 -61137 -69293 -53943 -21854
11300 -21854 -30699 20189 37017 -72636 -115634 -71874 -48340 -23907 -41607 -27904 -6904 19375
11288 19375 33834 78684 67342 -1581 1666 37353 17630 -18507 -8221 -13386 -58336 39099
11276 39099 133688 121932 -13614 55584 108287 113219 44748 2478 14452 -32164 -12055 88278
11264 88278 94556 54847 -40601 -45725 -2631 28726 -29017 -87334 -99670 -54895 -57535 -66077
11252 -66077 -71025 -3451 12883 70024 92761 121545 35635 50043 113648 142773 93036 2074
11240 2074 -63262 -68070 -157805 -95143 -22321 -9735 -18883 -70201 -78708 -62829 -111320 -82961
11228 -82961 4168 27594 14061 36361 -17696 -47063 -111157 -122689 -62280 -99152 -92741 -131799
11216 -131799 -94289 -74099 -97043 -45092 -9019 -14181 2914 16486 5799 30280 85728 88353
11204 88353 72855 64107 34913 -37163 -9627 -11187 -54413 -50278 -69732 -36093 -2528 28375
11192 28375 -2507 -7022 7903 1106 42318 51149 8424 -42150 -21968 -26545 -41318 -61438
11180 -61438 -112988 -123354 -107757 -25300 47945 64415 34032 -14380 -65737 -52730 -5807 60226
11168 60226 62424 23106 -12291 -803 2440 -30799 -70008 -68669 -60227 -30808 -5294 1398 -5877
11155 -5877 14730 -35691 -73888 20761 80444 13799 -35890 -6863 26331 9569 -33512 -19251
11143 -19251 3558 -23910 -50796 -46510 -62001 -88863 -43156 4906 -6432 -35803 15583 23141
11131 23141 39169 -22893 -18750 -48915 -112116 -136661 -100381 -138582 -137318 -94161 -95756 -63209
11119 -63209 -77901 -37825 -50883 16179 37454 1275 -22523 -35154 -63407 -14302 38003 74554
11107 74554 62165 56347 37871 -45516 -41732 -56372 30956 78134 99760 118797 158386 165171
11095 165171 172101 95939 25279 49353 53030 2823 13665 -49022 -86808 -69574 -11504 21142
11083 21142 66337 56898 10862 30734 90440 94345 95884 127651 134662 80852 70331 81832
11071 81832 35547 27001 818 -29694 -44610 -2436 -89617 -119005 -101969 -109503 -111604 -66351
11059 -66351 -11179 -37257 -58614 4492 -5473 -29519 -22859 -21745 27238 38883 -1346 -282
11047 -282 11875 51482 13673 58626 80238 37751 3384 -32310 2219 9182 6935 73708
11035 73708 61966 12847 -35645 -130029 -127606 -113964 -120496 -32805 -5618 -2401 71544 59331
11023 59331 -60093 -45437 -4324 -28960 -59259 -108311 -41486 -12717 -35204 1383 -22188
11012 -22188 -21112 -40468 -34999 1765 -14874 -35581 -26941 27871 63607 110930 40795 119490
11000 119490 90942 109081 44412 -27866 46808 114356 169466 132258 75102 38549 -23444
10989 -23444 38454 96132 51103 10249 19829 71207 22889 -22750 -27368 41162 -9604 -3623
10977 -3623 -9288 59186 62372 11670 -36522 -93065 -186988 -199889 -181654 -87118 61966 48794
10965 48794 19221 46207 37994 27172 -38738 -49792 -40835 -62388 -114928 -176495 -156623 -141833
10953 -141833 -153434 -113331 -35768 -24298 15126 -24332 -42091 -41991 -61255 -51627 -11756 71891
10941 71891 52578 8832 -32543 11806 -53751 -117718 -103168 25570 -47641 5564 47415
10930 47415 490 -9960 6389 86130 41760 -65071 -84183 -99401 -99301 -94045 -47519 -44892
10918 -44892 -76377 -67296 -36458 -59771 -24007 1310 20816 3365 40232 29924 -9542 -49784
10906 -49784 -106255 -94349 -2819 18524 5989 16916 5129 -54458 -74864 -1020 16300 34669
10894 34669 -34498 -90787 -26439 -7616 -30744 67535 86596 -10150 -33856 13710 28513 5860
10882 5860 23029 13740 -15368 -18774 -28677 36821 27299 -307 8530 36054 21894 -39727 -82786
10869 -82786 -65447 -15454 87271 82337 -6709 -35559 55269 88068 155099 156149 146894 65984
10857 65984 31596 -12408 -120176 -95208 -46223 -12515 -60456 -101819 -70967 -32387 157
10846 157 24572 64197 2716 17113 104096 150845 220245 174340 154216 157389 132630 143088
10834 143088 148621 139413 89239 67185 88902 98189 58964 -12899 -1922 103287 112344 45813
10822 45813 -34314 -45498 -4011 -66946 -80864 -81170 -98322 -110273 -12127 90012 151841 127622
10810 127622 -5058 -49813 -46796 -9376 -53112 -20939 48348 24520 -71207 -89407 -44705
10799 -44705 -26941 -47464 -68399 -85873 -64078 -79733 -55721 -26679 21212 -23398 -35790 -33370
10787 -33370 60403 33730 -74307 -214553 -243273 -139578 -46111 -46286 14735 82530 32783
10776 32783 16658 -49074 -82755 -109480 -79387 -13865 -1455 36628 32390 3300 9163 82383
10764 82383 14685 -54407 -53511 -34706 -10143 -15248 11321 4280 -26242 16669 34123 32105 92393
10751 92393 81471 43710 67429 91225 79827 51537 19461 22712 94836 39845 -30147 -28978
10739 -28978 3346 78466 102750 16417 -46492 58653 86935 5096 -68660 -57548 -86763
10728 -86763 -68061 -98722 -129016 -107839 -89939 -91987 -68648 -90236 -92018 -105731 -186680 -186819
10716 -186819 -101470 -71563 -87785 -33969 -26597 21914 41312 66312 81075 100914 71269 12560
10704 12560 -34058 -73373 -51544 -10875 58878 42061 595 10880 -29473 -26036 30145 10669
10692 10669 55211 68326 88399 2742 -66357 -117482 -103753 -8623 -8905 -42927 -11446 28640
10680 28640 -78742 -115681 -60002 13041 62283 78525 39604 18574 -39688 -125378 -163181
10669 -163181 -115825 -95645 -111281 -77805 70383 82819 100935 89499 94902 108210 33861
10658 33861 -41443 -11598 -70641 -104608 -12414 81604 62683 -42682 -28971 -38537 -45979 -8724
10646 -8724 6463 -53138 -42907 -63384 -3947 71007 68571 31393 20952 66878 60112 8596
10634 8596 -63193 -102726 -147435 -222223 -167598 -131837 -154007 -157412 -160417 -116738 -118716 -111689 16328
10621 16328 31990 -31615 -55939 -105729 -63876 -46372 -73282 -49530 17378 14111 23174 14581
10609 14581 34871 -5588 -3281 86773 111082 48657 40310 -24414 -89452 -61239 -32491 -523
10597 -523 12894 -45983 -115395 -69738 -23217 29346 47382 81766 -3981 -34978 -88797 -115990
10585 -115990 -92099 -76414 -60924 16532 -13745 -90420 -145232 -181577 -242246 -250680 -215487 -199087
10573 -199087 -114466 -90017 -172416 -170280 -85075 5525 -73317 -41962 -52544 -96667 -63486 -65540
10561 -65540 -48631 -6519 -71881 -99165 -5258 -23493 -26894 -8370 -19347 10796 59550 18882
10549 18882 -41432 -122996 -79908 -8973 -27829 -39149 -54612 -23751 -9846 -57821 -84965 -44567
10537 -44567 48487 -1692 -60868 -67011 -89145 -172469 -153455 -82311 -105078 -135087 -135178 -51329
10525 -51329 37292 21592 -7873 -29623 -62526 -17213 -7526 13187 -1459 -61033 -30677 -22624
10513 -22624 41398 58445 65566 15566 -17913 -28777 -11723 8558 -9287 -54581 -95455 -129912
10501 -129912 -109580 -72883 -95732 -94610 -13632 106080 104575 -45572 -140694 -142980 -132718 -69555
10489 -69555 -50382 -138811 -149728 -144467 -174682 -139099 -122612 -157249 -154975 -149330 -71002 -33852
10477 -33852 35228 21570 451 26096 -25203 -94467 -43692 6683 42254 50575 12074 -7249
10465 -7249 3311 36328 -9471 -90433 -98045 -116912 -24927 -989 44921 -8631 -48840 -37283
10453 -37283 -41306 -595 73 45229 68117 15360 -100898 -90976 -66275 -79523 -89022 -80141 -24117
10440 -24117 -38709 -44864 -75327 -43666 -87481 -113923 -153655 -152538 -44457 -20247 -24170 -62973
10428 -62973 -97021 2979 20856 -66391 -142054 -148235 -157528 -123971 -126331 -137069 -83720 -20498
10416 -20498 68521 79288 3980 -9713 -77821 -62871 182 83556 45840 32353 -16167 -117232
10404 -117232 -153761 1780 31583 -9427 -40562 -11929 -46192 -7715 38791 25617 21960
10393 21960 -14178 52480 31604 -32007 -116262 -65618 26282 78264 -15266 -35965 39626 102735
10381 102735 58677 10498 -43929 -28378 7226 -16332 -42082 -33213 -1070 -3473 23468 21616
10369 21616 -43950 -62455 -81718 -98911 -116695 -157784 -137837 -59733 -18890 -26083 346 -36362
10357 -36362 -86241 -309 -12316 -99628 -106913 -105088 -142077 -156731 -56531 -66141 -32745 70661
10345 70661 37150 -54086 -106517 -65964 -30328 43826 16339 -52853 -31656 24252 108249 38498
10333 38498 -4357 -11561 44184 -415 -58338 -15598 42867 -29694 -99707 -84032 -90511 -99998
10321 -99998 -84304 -41556 5639 -21597 -27784 -10627 -33546 -14652 -40262 -76129 -127930 -135586
10309 -135586 -34715 58801 16970 -114686 -60017 -42773 -73044 -53073 -47728 -26881 59633
10298 59633 83054 46775 84791 105020 47942 44270 64236 25021 8863 46724 84110 54868
10286 54868 51925 40010 28975 31505 -10259 27223 22008 61903 136144 99937 55837 -10754
10274 -10754 85248 205277 216837 186940 172116 116015 70795 19443 14850 62626 64894 133752
10262 133752 123078 -12594 -11132 116543 107309 133692 203855 258195 359477 316651 310684
10251 310684 284806 304421 318075 374645 411777 418535 348302 300524 222472 243527 263593 299326
10239 299326 315172 341849 296545 174971 239901 257236 319639 276315 220061 205068 283873
10228 283873 332910 292466 298944 317754 325108 374514 383564 384925 346965 312047 239494 181810
10216 181810 233862 296982 330957 381300 456357 489121 488464 431623 386585 357421 342448 313944
10204 313944 272714 243707 256822 316865 416980 418028 315028 355045 332322 260665 248039
10193 248039 223814 226028 249871 407530 475432 479602 483072 403084 385589 339273 324439 341994
10181 341994 315871 356450 426505 397664 400178 446965 439120 401844 336598 329758 279471 191800
10169 191800 293119 318352 256071 296503 392641 445899 449791 387300 357161 426449 455571
10158 455571 416934 398125 452444 463107 528902 533412 519314 549173 562198 525574 497174 418066
10146 418066 434196 532401 546026 572274 570008 552811 521240 503469 432490 407607 381872 351693
10134 351693 332939 384434 504439 536272 506179 467778 494787 544400 518686 488039 452849
10123 452849 434952 437488 347063 419669 445705 412868 433152 512476 519457 464038 381534 360475
10111 360475 388053 297645 246400 285025 353133 397762 321835 247006 223194 243815 218559
10100 218559 228563 224070 207601 199426 183845 203136 178102 167257 177585 149507 146043 151574
10088 151574 144986 109838 129480 139919 64444 14972 40839 88625 70886 23046 -44151 -90924
10076 -90924 -56506 -112401 -51354 8366 19885 -42340 -66259 -77493 -121866 -125778 -108158 -30725
10064 -30725 -15168 3440 18922 59914 54031 24146 -13596 48044 76638 54435 80241 106189
10052 106189 126335 145044 154793 188896 283772 372596 393656 244826 214879 137152 18071
10041 18071 -34882 -39285 56071 84067 136668 157581 71656 1824 -5975 95365 214322 200358
10029 200358 104044 -1805 -101036 -98043 -1548 5266 -97950 -53505 13086 48329 92676
10018 92676 161165 184576 147710 92332 54685 29512 40205 -56834 -72009 -27276 126369
10007 126369 200657 181888 188583 221860 213116 176699 136420 131945 89396 110212 138954 215742
9995 215742 215227 138205 55755 43128 101428 166656 206855 293907 302761 250786 239277 235511
9983 235511 335179 342061 381434 269026 179343 143487 268896 324307 293432 260662 242406
9972 242406 265021 259336 254689 208352 142512 204515 260202 179066 129889 140808 126283 65991
9960 65991 103974 125175 160297 210255 332745 373980 302151 188734 140128 130213 165330 267776
9948 267776 330548 285699 259138 213273 159646 198034 207862 305404 355910 412579 440814 370347
9936 370347 322097 336269 351988 392427 457870 508627 506854 627226 741322 813000 862625
9925 862625 937274 1034353 1117613 1164246 1115310 1107740 1129686 1233495 1237594 1193755 1182447 1194325
9913 1194325 1042229 944540 968588 1048996 1116948 1150502 1246680 1304667 1320510 1394913 1536489
9902 1536489 1741807 1856642 2005427 2257219 2381540 2468210 2527765 2595613 2753873 2975036
9892 2975036 3171842 3296022 3352589 3476774 3673444 3949083 4201017 4533850 5008854 5549387
9882 5549387 6097235 6786410 7608086 8579257 9642254 10853798 12347363 14202498 16374492
9873 16374492 18657495 21018504 23396163 25826669 28022783 29546038 30303006 30853236
9865 30853236 31333810 31800062 32419374 33424779 34605348 35340552 35241381 34045134 31922219
9856 31922219 29960064 29057017 29446583 31038472 33632884 36975275 40796582 45084419
9848 45084419 49273321 52759880 55549375 57918919 59655870 60489183 60788280 61490615 63022865
9839 63022865 64805440 66104371 66674161 66270836 64804353 62684372 60215033 57677969
9831 57677969 55520054 53889016 52665955 52239709 53084572 55062608 57596685 60109450
9823 60109450 62120401 63418885 63661735 62332814 59850996 57309418 55714502 55759134 57391930
9814 57391930 59810062 61980974 63209126 63221368 62476899 61912030 61691015 61626598 61432621
9805 61432621 60692369 59441122 58413509 58281585 59016047 59761901 59361560 58053318 56365068
9796 56365068 54348784 51527719 48440789 46296882 45912079 47347748 50563507 55204180
9788 55204180 60720586 66489419 71627402 75321386 77105941 76652686 74795895 73285567
9780 73285567 73088367 73578298 74094847 74832457 76033632 76691706 75366633 71897407 67178850
9771 67178850 62501642 58979653 57735989 59021959 62566830 67757189 73921265 80584892
9763 80584892 86735701 90993547 93162291 94140585 94703161 94280860 93121364 92850959 94331232
9754 94331232 96822658 98880831 99608503 99377905 98761333 97883189 97006699 95683060 93338762
9745 93338762 90382485 87652120 86247723 86888255 89520433 93273581 96535703 97696050
9737 97696050 96101529 92510985 88522905 85083411 82444890 80933317 81276125 83536581
9729 83536581 87136987 90852369 93706432 95907082 97606687 98547091 98439856 97104239
9721 97104239 94293879 90439992 86360894 82752630 80218174 78692056 77101719 74177748
9713 74177748 69738817 64522828 58871127 52825819 46976463 42300089 39352154 38151970
9705 38151970 38408559 39883331 42338332 45239142 47843838 49119732 48336943 45961821
9697 45961821 42964756 40332304 38595895 37698955 36871861 35573839 33642036 30872486
9689 30872486 27062890 22746217 18758163 15414861 12674541 10469148 8567031 7309011
9681 7309011 6485390 5733658 5132597 4613884 4239276 3901664 3620286 3352970 3139255 2889881
9671 2889881 2696037 2539878 2395780 2350149 2277801 2164314 2009777 1957585 1840085 1805613
9661 1805613 1891688 1901914 1810115 1773699 1717611 1530189 1421233 1459592 1524580 1398923 1323951
9650 1323951 1239651 1235076 1210140 1217905 1224512 1191298 1101924 1084793 1070521 1027938 984689 987069
9638 987069 912621 829352 925617 1014351 1033711 1045035 1105946 1062252 1021466 969118 897237 833533
9626 833533 836929 807789 749186 749692 722845 752920 746030 774657 752006 704629 727841 700952
9614 700952 744614 763062 720057 715333 661110 651666 685134 729640 770354 809618 766831 847991
9602 847991 973060 984353 978925 995273 940527 872887 791431 732321 666292 676216 680916 675895
9590 675895 657801 616804 623592 662642 710630 749967 786644 784180 786906 802849 944527 1065856
9578 1065856 1147751 1229084 1221105 1259847 1323998 1391814 1405669 1512352 1572501 1584403 1512465
9567 1512465 1371171 1293652 1250039 1160178 1141932 1268880 1306664 1353448 1393473 1385508 1398056
9556 1398056 1459753 1496796 1588124 1762242 1890872 1981971 2128868 2251208 2374977 2547825
9546 2547825 2847818 3049809 3181431 3363014 3553498 3715887 3894294 4163973 4499419 4827333
9536 4827333 5262351 5685444 6084243 6611796 7276516 7945314 8853151 9914954 11131972
9527 11131972 12566852 14254403 16111282 18334199 20968062 24106691 27789070 31971149
9519 31971149 36696342 41979120 47947262 54289097 60312118 64269308 64520951 61225827
9511 61225827 55986630 49462999 42026847 34983823 29516443 25808449 23551917 22237634
9503 22237634 21748499 21902742 22659108 24030412 26119047 28725590 31999148 35893916 40262850
9494 40262850 45085707 50253716 55292554 59634869 62401622 63155116 61699205 58830314
9486 58830314 55275183 50646694 45052496 39546056 34855239 31387530 29162097 27882317
9478 27882317 27637579 28291188 29738287 31845294 34763949 38463358 42897023 48248981
9470 48248981 54760174 62344083 71174801 81171813 91981575 102508591 110786096 115070823
9462 115070823 115202375 112369544 106622503 97184762 85463521 74165335 64296150 56165374
9454 56165374 50298730 46773300 45080515 44661395 45388419 47446642 50881293 55655639
9446 55655639 61624814 68874167 77303476 86662930 96492750 106038856 113798853 118415448
9438 118415448 119609403 118738144 117150200 114174694 108979645 101916723 94321514 86944906
9430 86944906 79906999 73383681 67222187 61491245 56788175 53196919 50155027 47101308
9422 47101308 44396420 42981220 43020040 44381783 47087130 51005344 55808942 61270955
9414 61270955 66918832 72475005 77479340 81687760 84390516 84764137 83001331 80135501
9406 80135501 76572409 72511779 68104322 63214876 57839539 52800434 48578258 45303171
9398 45303171 42972979 41980466 42289246 43871608 46679737 50505635 55434754 61202163
9390 61202163 66956697 71949259 75733427 78860994 82363045 86051732 88857858 90279777
9382 90279777 90621767 90345156 89516678 88022431 85324118 81165395 76249252 71208922 65595774
9373 65595774 58734994 51291004 44388979 38702837 34533980 31877731 30272578 29556001
9365 29556001 29780088 30717741 32527788 35251247 38698315 42836103 47695094 53234441
9357 53234441 59048791 64650607 69268114 72206967 72293491 69134087 64113031 58244289
9349 58244289 51148967 43019220 35227378 28937667 24470513 21486605 19506718 18225058
9341 18225058 17376350 16821122 16598087 16778422 17379298 18341897 19809031 21796651 24194871
9332 24194871 26981852 29990977 33045078 35782007 37689134 38341903 37697816 36470818
9324 36470818 34647652 31820030 28188049 24423431 21009206 18191779 16047078 14702781
9316 14702781 13927021 13621047 13615672 13925773 14671249 15787815 17392679 19363359 21765889
9307 21765889 24525133 27589150 30963638 34236134 36481620 36950491 35852936 33640583
9299 33640583 29947887 24769990 19351713 14987693 11936551 9970259 8584091 7424462
9291 7424462 6340108 5421985 4783922 4322614 3929838 3624609 3291175 3035124 2803915
9282 2803915 2578139 2458666 2362968 2269839 2201144 2060818 1829375 1615894 1444439 1344214
9272 1344214 1283447 1176746 1153960 1172948 1085375 1065755 1138075 1148020 1136306 1197130 1190815 1153379
9260 1153379 1138628 1131067 1109679 1079802 1107308 1094518 1138098 1125654 1093848 1035978 1003115 1028077
9248 1028077 1016590 986486 979718 957879 996974 927479 867880 848382 880680 857178 884023 889572
9236 889572 914084 881041 887462 856093 710724 616811 641330 704328 810476 821342 776462
9225 776462 718866 792727 828106 847629 925926 886692 900502 943126 876932 790295 758456 792116
9213 792116 829180 877697 984420 1067166 1135677 1211717 1320694 1285917 1334259 1444651 1512485
9202 1512485 1591788 1714957 1772408 1832731 1996300 2117638 2231194 2401782 2577726 2756171
9192 2756171 2983821 3328611 3719208 4102911 4510997 5006405 5435686 5920839 6535902 7110673
9182 7110673 7537403 7784305 7816205 7566511 7116080 6526576 5876644 5220840 4551248 3939077
9172 3939077 3517282 3144033 2682115 2380025 2114289 1885250 1643350 1504609 1441964 1374159
9162 1374159 1222337 1131878 1060519 1002893 1035337 994827 947714 914317 814739 777071 754463
9151 754463 735525 726215 728059 734137 720039 752051 812448 736836 693910 695661 711774 695156
9139 695156 651878 598680 673062 751010 747120 655051 564397 565533 515667 491018 525208 488076
9127 488076 486212 520735 454878 355095 405490 417715 504424 510441 468013 454470 439266 435903
9115 435903 424810 381704 427506 411212 449263 651635 757634 760834 689237 641220 587761
9104 587761 605547 602648 658602 729055 680281 656709 709636 725697 644092 544258 477309 412987
9092 412987 402614 406836 378902 336878 333621 379962 462878 548106 557560 539971 451846 437339
9080 437339 460417 520620 632554 640879 645370 634616 631249 640893 646687 615366 585254 546592
9068 546592 474828 441425 502690 537860 482550 455882 426322 384273 407957 449554 527874 542798
9056 542798 579965 593173 676680 700326 665443 762272 851078 826704 849179 908989 817846 716779
9044 716779 577366 505844 482798 457927 458044 491843 505312 502059 469015 415990 497184 649129
9032 649129 723726 736087 732056 784148 743460 782831 883545 896168 870713 876795 864179 810940
9020 810940 795280 740771 729918 765809 711464 654654 655406 642549 590424 564159 526462 469330
9008 469330 441505 412810 404277 367829 382480 474499 515919 505677 526259 579449 624050 679726
8996 679726 657878 661663 597096 540799 495837 459339 424358 415476 410171 444880 461969 418434
8984 418434 400481 375932 374788 433553 464961 539512 600122 637116 659394 669324 715333 736274
8972 736274 700450 704348 707013 799565 818909 799159 683847 570076 551630 533531 434232 319301
8960 319301 346905 362870 344451 315213 276732 188764 209334 252638 270157 277986 252060 228934
8948 228934 254291 310390 481956 613254 625114 596771 614050 531518 486440 391611 361844
8937 361844 450180 411661 459667 469265 434762 431946 404476 293391 294884 303873 273737 273302 245605
8924 245605 234578 269681 272213 297159 310858 249081 265816 371103 429339 478369 435833 462633
8912 462633 517847 583637 521108 438476 375455 350795 347814 370151 351419 291752 223309 83232
8900 83232 103695 210895 213851 217613 258873 216707 239594 297433 349995 367925 377707 356415
8888 356415 319042 308225 333155 350934 275128 206587 178467 205104 198049 148804 188679 176749
8876 176749 118834 96556 104726 154282 166769 154091 134631 100562 119259 144149 218444 181617
8864 181617 159933 184202 215853 118240 123114 142356 146341 177501 213567 187061 128276 53310
8852 53310 70863 125401 120561 180263 152968 61579 1084 10374 -5730 -67000 -86967 -23092
8840 -23092 53275 -21232 2819 96086 163904 199247 178224 204238 200144 248351 256594 155820
8828 155820 111939 66601 88920 95845 112165 218953 242948 276925 219759 210508 234989 217559
8816 217559 117984 101610 17810 -57258 -81962 -40431 -17369 -10333 61327 173944 234268 251349
8804 251349 368951 380780 273817 221655 171287 93579 37734 67212 72973 127142 186420
8793 186420 185309 206838 252141 219783 190386 186136 151829 128634 144593 125670 99809 109688
8781 109688 132433 96733 66318 125887 139611 145361 172487 210096 198955 187236 300729 298865
8769 298865 304910 249180 120928 85941 63233 42537 21731 68903 113553 102220 107096 110658
8757 110658 63734 81613 150622 147866 142912 155671 142145 135424 171947 217681 212777 253260
8745 253260 311610 252220 223334 226129 221185 138519 76238 24192 103896 243947 260778 216390
8733 216390 161101 178432 229952 175785 9167 2832 35845 62548 130722 122889 47201 26540
8721 26540 101637 167134 197407 208680 183789 226772 242753 298519 314540 224690 152820 127123
8709 127123 88369 48705 68461 119949 69504 96370 100027 40993 42017 61743 1244 59934
8697 59934 91935 56153 81234 132393 109333 96089 58537 78758 74601 95216 42952 5845
8685 5845 15274 108461 138749 178405 229200 180974 169393 195957 124674 148672 142056 174040
8673 174040 157473 87144 116997 92014 60470 87424 83817 132493 142002 153653 214721 182068
8661 182068 125201 55413 -13661 73445 157967 265489 308752 197637 131413 101287 120076
8650 120076 146480 148167 187224 256440 250831 205297 177530 136541 188776 253652 253902 170776
8638 170776 44713 26820 50122 -11428 -37957 -5507 98814 199770 230352 249924 179182
8627 179182 117721 91761 124214 131652 141007 216027 332560 344894 344764 332713 255861 249111
8615 249111 181884 72142 67868 104451 181986 256122 228341 183618 222225 250889 253795 260559
8603 260559 310917 350208 282700 233255 264027 306773 360782 429693 429660 409297 368428 315027
8591 315027 275901 242406 233289 196794 164081 177516 171742 97222 50800 135805 198921 186633
8579 186633 212514 226878 176329 201501 227615 203831 177688 173366 176941 193414 149668 169509
8567 169509 186028 156968 113779 112487 222362 250704 236741 227912 196543 173581 141327 105545
8555 105545 69224 103311 117887 183330 186204 90360 66509 102912 106708 79804 69374 63292
8543 63292 115877 125844 73971 83960 66734 31501 42756 111490 77068 51362 25367 65640
8531 65640 32928 35886 56727 77330 109626 98304 88772 48426 10134 -39880 -40666 57974 91604
8518 91604 5973 10580 94535 119046 186493 164044 138264 158111 153265 119795 148440 148258 180465
8505 180465 176332 177989 191256 144424 111936 110107 93262 74806 81872 53287 56200 34966 31082
8492 31082 74583 89025 20804 27631 112234 131947 102641 47957 96440 86286 63134 22792
8480 22792 -59164 -43841 -21478 -4639 48449 78546 95768 102869 118633 155210 191666 139869
8468 139869 153070 181563 155424 129493 172589 103648 17712 22160 90853 129027 121907 156414
8456 156414 115587 73625 68002 89170 91099 48513 50706 126103 76011 -7189 -98285 -128024
8444 -128024 -118799 -33360 59546 124668 154471 160451 145194 83948 82482 123762 208949 167357
8432 167357 129420 182958 224105 217018 235939 157156 131456 32113 -17747 -6117 -47933 -30053
8420 -30053 1204 -49530 -11621 49906 102606 141651 174543 167050 189266 163594 148648 93542
8408 93542 55205 74881 37025 39348 858 -63226 -42717 15888 51571 69428 77562 91558
8396 91558 181660 203532 108642 47969 85050 130107 100957 7534 -42070 -18806 22465 84349
8384 84349 41387 48015 46097 80629 118514 135749 130718 147881 167458 110303 84159 52786
8372 52786 -12402 -40752 46033 88680 -15071 -37839 5480 74852 47765 52173 61815 56613
8360 56613 4515 57574 148809 129326 126543 156906 135917 92741 27467 -31772 -115133 -78139
8348 -78139 13529 44899 85441 50447 25999 48041 67154 44995 54114 63921 76155 141710
8336 141710 66750 70130 61028 17089 95566 78678 77848 107835 40460 -38153 6528 65895
8324 65895 52529 76731 5275 45680 112467 49931 9103 56736 72089 47412 20831 66327
8312 66327 87493 71337 92326 140898 134351 122144 136287 121445 37263 21956 51994 17902
8300 17902 23549 9213 -44280 -21574 66413 85852 63191 11476 56749 163616 189702 167443
8288 167443 171445 134480 90565 112902 141789 121921 86281 143551 132543 89741 86583 109838
8276 109838 79670 120122 145117 109580 107871 132591 151983 129163 25658 -9137 58309 122801
8264 122801 57700 50002 -3404 -33215 -132397 -75104 -70185 -61355 -14224 53278 72032 36786
8252 36786 74559 125624 118460 141684 178775 208226 169981 177732 155706 138348 89308 120577
8240 120577 27395 -21009 27796 27006 -34936 -4778 38384 112436 88016 12242 -62995 -71078
8228 -71078 -42672 52640 67790 72089 76333 99806 86988 56938 98823 115533 96085 173435
8216 173435 160496 117224 138894 140918 126171 55334 27332 72255 125580 99049 36654 28402
8204 28402 13921 10702 59214 109897 104079 -13769 -20527 71592 92894 96255 -1241 -7096 67732
8191 67732 99877 133697 41920 -31988 -34713 -21030 -6085 7855 11273 3872 -26667 28565
8179 28565 82512 61248 -4974 -30774 88339 191156 198016 146322 47620 48196 126377 150203
8167 150203 187001 183675 114588 60606 45629 19989 19718 80201 109028 161436 113999 112963
8155 112963 91232 112767 88452 123791 167377 133974 150895 151839 136527 238022 189510 183761
8143 183761 131679 136690 115363 17948 4571 -29713 -29097 -4437 45658 52514 53308 73817 203909
8130 203909 293627 189332 50703 6659 45434 82151 105045 118497 119932 139495 127419
8119 127419 92814 53585 34915 58357 90615 75085 -22597 9622 24849 20431 41158 79800
8107 79800 138396 133243 32085 62133 113916 93979 79333 59306 37829 -6260 -30740 -3833
8095 -3833 21282 25601 67840 -15116 -63047 -4240 3915 42002 96286 98410 49768 125089 194801
8082 194801 91359 87592 63055 142851 179964 31096 -81180 -75650 40782 96827 95555
8071 95555 60425 132945 125104 110644 39135 47659 61358 72169 88016 128207 163287 121697
$$ [...]
##END NTUPLES=NMR SPECTRUM
##END=
