##TITLE=Analysis number 327278
Compound Code cc 52426
Book Reference 464/112/2
Project Code adrs
Chemist Name chrisr
##JCAMPDX= 6.0         $$ Bruker NMR JCAMP-DX V2.0
##DATA TYPE= NMR SPECTRUM
##DATA CLASS= NTUPLES
##ORIGIN= Bruker BioSpin GmbH
##OWNER= nmr
$$ XWIN-NMR		Version 3.5
$$ Mon Mar 19 11:53:12 2007 GMT Standard Time (UT+0h)  MAYBRIDGE\nmr@NMR_250MHZ
##.OBSERVE FREQUENCY= 250.131544655141
##.OBSERVE NUCLEUS= ^1H
##.ACQUISITION MODE= SIMULTANEOUS (DQD)
##.ACQUISITION SCHEME= undefined
##.AVERAGES= 16
##.DIGITISER RES= 18
##SPECTROMETER/DATA SYSTEM= dpx250
##.PULSE SEQUENCE= zg30
##.SOLVENT NAME= CDCl3
##.SHIFT REFERENCE= (INTERNAL, CDCl3, 0, 16.522)
##AUDIT TRAIL= $$ (NUMBER, WHEN, WHO, WHERE, WHAT)
$$ ##TITLE= Audit trail, XWIN-NMR		Version 3.5
$$ ##JCAMPDX= 5.01
$$ ##ORIGIN= Bruker BioSpin GmbH
$$ ##OWNER= nmr
$$ C:\u/data/dgb/nmr/ADRS/1180/pdata/1/auditp.txt
$$ ##AUDIT TRAIL=  $$ (NUMBER, WHEN, WHO, WHERE, WHAT)
(   1,<2007-03-19 11:52:31.32 +000>,<MAYBRIDGE\nmr>,<NMR_250MHZ>,
      <created by zg, POWCHK disabled, PULCHK disabled
       configuration hash MD5:
       49 4B E0 1D 92 C2 6B 37 9F E6 65 BC 52 41 86 1D
       data hash MD5: 64K
       D4 1C BC CB B7 1B F3 27 5F CA 9E 12 2E 14 40 39>)
(   2,<2007-03-19 11:52:54.29 +000>,<MAYBRIDGE\nmr>,<NMR_250MHZ>,
      <Start of raw data processing
       ef LB = 0.3 FT_mod = 6 PKNL = 1 SI = 32K 
       data hash MD5: 32K
       59 C6 36 FF 7A 34 47 7F 29 A3 D7 9A 9A 35 7A 3B>)
(   3,<2007-03-19 11:52:56.29 +000>,<MAYBRIDGE\nmr>,<NMR_250MHZ>,
      <apk 
       data hash MD5: 32K
       77 26 37 39 0B AE 06 C4 40 B6 D2 2F 05 D6 A3 7D>)
(   4,<2007-03-19 11:52:57.09 +000>,<MAYBRIDGE\nmr>,<NMR_250MHZ>,
      <abs ABSG = 5 
       data hash MD5: 32K
       90 DB 1B F6 54 A6 72 5A BD 98 D3 41 47 B4 BA 78>)
$$ ##END=
$$ 
$$ hash MD5
$$ 84 5D 33 C2 E9 1C 8E 3D AF D8 76 2C 89 49 F0 F7
##$RELAX= 
##$RELAX= 
##$RELAX= 
##$RELAX= 
##$RELAX= 
##$RELAX= 
##$RELAX= 
$$ Bruker specific parameters
$$ --------------------------
##$DU= <C:\u>
##$EXPNO= 1180
##$NAME= <ADRS>
##$PROCNO= 1
##$TYPE= <nmr>
##$USER= <dgb>
##$AMP= (0..31)
100 100 100 100 100 100 100 100 100 100 100 100 100 100 100 100 100 100 
100 100 100 100 100 100 100 100 100 100 100 100 100 100 
##$AQSEQ= 0
##$AQ_mod= 3
##$AUNM= <au_zg>
##$AUTOPOS= <17 >
##$BF1= 250.13
##$BF2= 250.13
##$BF3= 250.13
##$BF4= 250.13
##$BF5= 500.13
##$BF6= 500.13
##$BF7= 500.13
##$BF8= 500.13
##$BYTORDA= 1
##$CFDGTYP= 0
##$CFRGTYP= 5
##$CHEMSTR= <none>
##$CNST= (0..31)
1 1 145 1 1 1 1 1 1 1 1 1 1 1 1 1 1 1 1 1 1 1 1 1 1 1 1 1 1 1 1 1 
##$CPDPRG= <>
##$CPDPRG1= <>
##$CPDPRG2= <>
##$CPDPRG3= <>
##$CPDPRG4= <mlev>
##$CPDPRG5= <mlev>
##$CPDPRG6= <mlev>
##$CPDPRG7= <mlev>
##$CPDPRG8= <mlev>
##$CPDPRGB= <>
##$CPDPRGT= <>
##$D= (0..31)
0 1 0 0 0 0 0 0 0 0.06 0 0 0 0 0 0 0.0002 0 0 0 0 0 0 0 0 0 0 0 0 0 0 
0 
##$DATE= 1174305150
##$DBL= (0..7)
120 120 120 120 120 120 120 120 
##$DBP= (0..7)
150 150 150 150 150 150 150 150 
##$DBP07= 0
##$DBPNAM0= <>
##$DBPNAM1= <>
$$ [...]
##$SUBNAM7= <"">
##$SUBNAM8= <"">
##$SUBNAM9= <"">
##$SW= 20.6930455092707
##$SWIBOX= (0..15)
0 0 3 0 0 0 0 0 0 0 0 0 0 0 0 0 
##$SW_h= 5175.983436853
##$TD= 65536
##$TD0= 1
##$TE= 683.16
##$TE2= 300
##$TE3= 300
##$TEG= 300
##$TL= (0..7)
0 120 120 120 120 120 120 120 
##$TP= (0..7)
150 150 150 150 150 150 150 150 
##$TP07= 0
##$TPNAME0= <>
##$TPNAME1= <>
##$TPNAME2= <>
##$TPNAME3= <>
##$TPNAME4= <>
##$TPNAME5= <>
##$TPNAME6= <>
##$TPNAME7= <>
##$TPOAL= (0..7)
0.5 0.5 0.5 0.5 0.5 0.5 0.5 0.5 
##$TPOFFS= (0..7)
0 0 0 0 0 0 0 0 
##$TUNHIN= 0
##$TUNHOUT= 0
##$TUNXOUT= 0
##$USERA1= <user>
##$USERA2= <user>
##$USERA3= <user>
##$USERA4= <user>
##$USERA5= <user>
##$V9= 5
##$VALIST= <valist>
##$VCLIST= <CCCCCCCCCCCCCCC>
##$VD= 0
##$VDLIST= <DDDDDDDDDDDDDDD>
##$VPLIST= <PPPPPPPPPPPPPPP>
##$VTLIST= <TTTTTTTTTTTTTTT>
##$WBST= 1024
##$WBSW= 4
##$XGAIN= (0..3)
0 0 0 0 
##$XL= 0
##$YL= 0
##$YMAX_a= 180167
##$YMIN_a= -331234
##$ZGOPTNS= <>
##$ZL1= 120
##$ZL2= 120
##$ZL3= 120
##$ZL4= 120
##$ABSF1= 16.522
##$ABSF2= -4.171173
##$ABSG= 5
##$ABSL= 3
##$ALPHA= 0
##$AQORDER= 0
##$ASSFAC= 0
##$ASSFACI= 0
##$ASSFACX= 0
##$ASSWID= 0
##$AUNMP= <proc_1d>
##$AZFE= 0.1
##$AZFW= 0.1
##$BCFW= 0
##$BC_mod= 0
##$BYTORDP= 0
##$COROFFS= 0
##$CY= 12.5
##$DATMOD= 1
##$DC= 0
##$DFILT= <>
##$DTYPP= 0
##$F1P= 14.0000005364418
##$F2P= -0.99999901652339
##$FCOR= 0.5
##$FTSIZE= 32768
##$FT_mod= 6
##$GAMMA= 0
##$GB= 0
##$INTBC= 1
##$INTSCL= 1
##$ISEN= 128
##$LB= 0.3
##$LEV0= 0
##$LPBIN= 0
##$MAXI= 10000
##$MC2= 0
##$MEAN= 0
##$ME_mod= 0
##$MI= 0
##$NCOEF= 0
##$NC_proc= -5
##$NLEV= 6
##$NOISF1= 0
##$NOISF2= 0
##$NSP= 0
##$NTH_PI= 0
##$NZP= 0
##$OFFSET= 16.522
##$PC= 1
##$PHC0= 237.6663
##$PHC1= 7.39677
##$PH_mod= 1
##$PKNL= yes
##$PPARMOD= 0
##$PSCAL= 4
##$PSIGN= 0
##$REVERSE= no
##$SF= 250.13
##$SI= 32768
##$SIGF1= 0
##$SIGF2= 0
##$SINO= 400
##$SIOLD= 32768
##$SREGLST= <1H.CDCl3>
##$SSB= 0
##$STSI= 32768
##$STSR= 0
##$SW_p= 5175.98343685301
##$SYMM= 0
##$S_DEV= 0
##$TDeff= 65536
##$TDoff= 0
##$TI= <Analysis number 999999
Compound Code 99
Book Reference 9
Project Code 9>
##$TILT= no
##$TM1= 0
##$TM2= 0
##$TOPLEV= 0
##$USERP1= <user>
##$USERP2= <user>
##$USERP3= <user>
##$USERP4= <user>
##$USERP5= <user>
##$WDW= 1
##$XDIM= 32768
##$YMAX_p= 385151962
##$YMIN_p= -650002
$$ End of Bruker specific parameters
$$ ---------------------------------
##NTUPLES= NMR SPECTRUM
##VAR_NAME=  FREQUENCY,     SPECTRUM/REAL,   SPECTRUM/IMAG
##SYMBOL=    X,             R,               I
##VAR_TYPE=  INDEPENDENT,   DEPENDENT,       DEPENDENT
##VAR_FORM=  AFFN,          ASDF,            ASDF
##VAR_DIM=   32768,         32768,           32768
##UNITS=     HZ,            ARBITRARY UNITS, ARBITRARY UNITS
##FACTOR=    0.157963299565203, 1,           1
##FIRST=     4132.6476996994, 0,             0
##LAST=      -1043.33573715361, 0,           0
##MIN=       -1043.33573715361, -650002,     0
##MAX=       4132.6476996994, 385151962,     0
$$ Real data points
##PAGE= N=1
##DATA TABLE= (X++(R..R)), XYDATA
$$ [...]
27434 313012 165782 164284 300795 148637 71425 18481 59362 13786 -192887 -39834 62083
27423 62083 192922 279766 369989 241687 101774 194150 94452 -26481 -199194 -128974 -104585
27412 -104585 -42472 -101620 -91613 -31329 -114207 -97554 -73894 -94528 -3426 148124 144488
27401 144488 190272 249461 280789 174167 183313 195887 127554 81735 177894 250784 269127
27390 269127 149815 190341 -88647 -245674 -164552 -156557 -231335 -310843 -185436 -16245 198540
27379 198540 261041 220397 135468 133275 71095 83215 200313 224664 168306 134999 55601
27368 55601 -34062 1499 -106712 -232088 -78778 -34347 -157575 -51728 22867 -58800 -57658
27357 -57658 95268 107906 -20501 48568 228212 303627 318693 169535 16285 153010
27347 153010 201408 55528 -115359 -185738 -123747 -106916 -74472 -115597 109718 155263 128083
27336 128083 157186 121560 8244 -18663 65580 157700 134044 40352 -32185 -191015 -323852
27325 -323852 -248001 -130205 -100713 -103930 38108 117475 206851 187842 9012 -93259 -59656
27314 -59656 7418 -15376 -80957 55164 31212 -34217 -30815 -48167 -95527 -96099 -19355 77407
27302 77407 35412 84824 66879 86273 20660 -59847 -301973 -310677 -111482 -192338 -154786
27291 -154786 -80571 -34711 -23720 78847 142739 78918 23102 -32471 92620 220820 147108
27280 147108 184964 219957 257049 296349 128036 3305 -90978 -97798 -7671 -12746 14331
27269 14331 109349 158025 186286 81286 111858 -15917 -115509 -124299 -123985 -88078 -55575 15249
27257 15249 91126 -35567 -129688 -102459 -104507 37534 10929 -13644 71211 150460 164662
27246 164662 11438 -41666 71668 63756 40162 -44775 -33138 13602 44178 38637 -165320
27235 -165320 75477 314134 296446 187432 125499 -19389 -80952 -27119 -47080 -127373 -259197
27224 -259197 -307986 -206418 -77430 -132764 -137092 -344967 -345404 -401214 -392236 -261223 -57423
27213 -57423 -97968 -192848 14367 -70524 -435327 -434934 -237851 14343 198529 258118 132140
27202 132140 30578 7301 110290 -57708 -37812 139742 127909 72138 99967 117064 218759
27191 218759 302107 84702 -94236 -275143 -285110 -279055 -96106 62563 162866 152623 251827
27180 251827 217442 211366 65539 -150316 -152532 -40138 -42437 151751 226525 208172 228506
27169 228506 211622 57235 120354 249557 96935 56548 125261 122366 81990 83529 -100438
27158 -100438 -80162 22557 13470 195177 339233 358288 389117 185242 47918 -5658 164005
27147 164005 272107 300857 227716 194000 321522 315023 207077 229577 174677 216238 187305
27136 187305 -19798 -176062 -234504 -208266 -131449 75246 149660 69881 16612 -182317 -257566
27125 -257566 -190355 -249556 -207485 -310681 -301884 -228909 -136162 -219214 -219410 -122478 -110849 12118
27113 12118 -31469 -103680 -144296 -181709 -130581 -191865 -28620 166441 84839 -31577 57965
27102 57965 57598 203048 335012 189959 -49144 -156158 -78584 118179 169037 68873 -65361
27091 -65361 25100 62283 15157 -498 126279 185872 269700 295543 96437 144435 125908
27080 125908 58711 -35520 -32775 -132726 -203966 -211175 -124563 -6784 -108438 -39671 100965
27069 100965 179802 146157 140091 263128 244867 314670 277975 239563 147509 -147216 -200990
27058 -200990 -81306 -141953 23145 97160 81904 82830 -55523 15992 151757 65329 -59527
27047 -59527 80452 328899 306841 103093 124986 178335 183982 -63803 -224728 -243674 -111579
27036 -111579 109188 87533 -50331 41243 287960 113739 -61157 -203790 -118332 -33041
27026 -33041 8894 -10430 35538 102233 63668 -98884 -13082 80979 -16571 19760 22001 121158
27014 121158 98540 -23954 174281 314975 359953 212537 65330 -30440 56642 175978
27004 175978 -15563 -129159 -112617 -113761 -79727 -209941 -301922 -50882 243770 264983 98453
26993 98453 -105200 -8299 112145 58370 10643 32907 172612 216483 66083 70029 22655
26982 22655 -95512 44820 39519 -150866 -132110 -115008 -66560 -63776 -160869 -221323 -236876
26971 -236876 -270357 -315432 -334417 -299396 -324301 -141233 -34509 -14168 14803 126567 40184
26960 40184 -84880 15600 12159 92689 115087 45982 -52409 79663 247359 258487 308441
26949 308441 312609 135260 84709 -40068 -30156 -4910 -5378 36839 -47853 33308 60142 10817
26937 10817 -36152 -137600 -204798 -38625 155741 -7169 -51718 67026 8883 -88397 -80966
26926 -80966 -90374 -68915 -143625 -180678 -214480 -221051 -170038 -196405 -53135 -76670 -39388 81592
26914 81592 -39394 -110472 -49428 46205 55695 -16920 -10994 -155871 -139570 -206246 -122314 -40039
26902 -40039 -118410 -145867 -27133 153924 222901 115995 28418 56927 17482 -48419 -62119
26891 -62119 -151409 -212038 -177023 3210 -1300 26337 -17120 26662 28163 -48799 -135978 -244797
26879 -244797 -227482 -113429 13658 -36673 -216316 -304920 -317387 -288887 -137437 27544
26869 27544 -17072 -220200 -317143 -332826 -234220 -112557 -113972 -78799 -107899 -69363 44967
26858 44967 39885 -71375 -64942 -12245 -125669 -180242 -133851 -14094 218854 134401 -6235
26847 -6235 -87588 -104182 -20829 -103676 -148155 -126359 -210750 -13989 -646 5431 72878 124460
26835 124460 103268 134659 83173 -16692 24528 82413 66682 1382 168543 189379 221729
26824 221729 337254 220447 99446 218444 151171 51737 85110 -48684 127485 126531 -138433
26813 -138433 -267644 -232800 -175573 -227442 -19706 133153 161378 92512 97098 197401 162302
26802 162302 -2867 25474 102789 188091 203151 276942 272057 125565 32045 102621 46307
26791 46307 24487 83173 248626 258145 189287 43380 98585 233694 275214 101222 60730
26780 60730 30309 3726 -61629 21340 -6444 9124 71370 -108751 -57328 -32963 53975
26769 53975 161344 80037 6094 69532 18503 -68525 -150476 -175831 25964 186709 298689
26758 298689 337020 167678 129429 78483 -12749 -20390 -144769 64645 247347 95250 104392
26747 104392 165304 42383 101342 84356 79435 268489 245137 -42013 -1607 6579 415
26736 415 47895 -44118 110861 91034 320342 197999 29288 42975 44359 160257 176169
26725 176169 39960 -32579 -10788 -4966 139696 63660 -117452 -172249 -126594 61564 330350
26714 330350 357295 326100 102335 145633 103409 16988 48867 76167 60106 98819 11876
26703 11876 -107843 -136510 -176434 -184997 98045 151799 209108 158615 181023 122960 -9266
26692 -9266 -124873 -262943 -103995 -29676 -23019 -31224 -69554 5971 -5716 -84787 -171310 -165557
26680 -165557 33257 -21441 21366 41356 9562 68100 46863 -21727 -63929 -127332 -159084
26669 -159084 51608 124859 112700 108329 168457 143793 138833 272552 503210 510559 303617
26658 303617 186820 97519 183984 247200 146135 77901 99159 10172 25146 154258 250368
26647 250368 267071 9623 -135609 -70357 -177404 -187371 -127949 -142277 -14466 6787 17055
26636 17055 -47328 -7659 -93998 -207234 -12502 -26357 -121986 -47060 78384 46083 -49102
26625 -49102 -168130 -161687 -184325 -235679 -207673 -52852 -33677 -187207 -137915 58 -39318
26614 -39318 -197817 -144950 3112 179864 261003 254705 160050 -13431 105913 236036 333717
26603 333717 130408 -56704 54435 -34648 13858 44192 79511 -72341 -88446 80314
26593 80314 95694 -6209 82062 126406 148111 148749 126452 154284 106851 93255 330019 297466
26581 297466 103246 53860 164890 121893 199116 159071 14807 -42042 -18101 -89553 -92668
26570 -92668 54678 190364 238302 353702 363538 177473 74168 34863 -109761 -252091
26560 -252091 -355928 -371038 -190669 206794 293034 169305 42399 866 -239528 -291775
26550 -291775 -139522 -101094 -131860 -181657 -166057 -398186 -500571 -475099 -350150 -247290
26540 -247290 -250747 -279361 -289445 -245253 -232359 -282984 -280074 -221779 -158639 -149094 -160989 -143499
26528 -143499 147186 139464 17639 -65731 -72032 -58109 72618 61037 72919 136684 137665 90937
26516 90937 -14859 -18753 44243 84609 16837 -4532 59730 182145 96388 15760 72070
26505 72070 104425 210680 185040 82100 -38716 -106258 -73259 -11611 -18796 -121052 -330543
26494 -330543 -135530 -9134 -108815 -41378 -150192 -62564 -147489 -59680 15502 128423 -37662
26483 -37662 -245375 -339853 -238236 -60731 60291 47094 -17341 37148 221048 312632 221407
26472 221407 127407 105072 -41880 9367 79351 182618 257591 471400 335907 242778 269766
26461 269766 231886 148973 52503 99384 75857 101449 261742 218603 157822 129752 -78379
26450 -78379 -211003 -207097 -215404 -327010 -272828 -196624 -11921 -111354 -278476 -192667 -154515
26439 -154515 91335 240418 173907 297665 369394 26988 -139689 99514 102221 25496
26429 25496 -7431 38255 -8039 189366 155174 70967 428 -24291 111556 162837 264434
26418 264434 181346 -5474 72147 4831 62735 134719 152528 134119 -136652 -265788 -167591
26407 -167591 -142166 -135652 -82515 -138367 88384 281636 262985 222837 40865 -35676 85775
26396 85775 21734 -167114 24184 206324 248222 129249 104808 -3033 -91594 -103848 -124987
26385 -124987 -75093 -146065 -49720 125056 19628 -71393 -30569 151450 232861 -6834 -230596
26374 -230596 -295022 -533776 -458491 -306022 -128056 -24081 6184 -70075 -182589 -177555 -227558
26363 -227558 -64555 148437 105392 129532 119168 -47386 -5202 39839 125820 167636 259323
26352 259323 188299 91504 -8469 -193005 -283829 -121082 123248 226893 245501 136703
26342 136703 -106646 -257584 -137420 -62132 -92227 -263115 -138569 22468 69482 50853
26332 50853 89781 345069 395516 186901 -23527 38884 74459 91906 207225 281853 343880
26321 343880 268612 227995 425527 293462 249226 16369 -111067 -44574 18316 149509
26311 149509 146341 32106 -79927 -849 -69576 -80237 -36415 -119920 -137245 -160391 -70603
26300 -70603 -232141 -160115 -87444 -62484 -71763 -44237 29020 111419 60277 102656 128355 225127
26288 225127 145516 -33870 74561 63390 -21591 -61421 -158466 -250702 -163916 -8175 47130
26277 47130 -104734 -95557 -55405 -146618 -165972 -124577 -53095 143759 166585 -61547 -256778
26266 -256778 -237532 -138781 -219810 -155776 -114730 -215164 -22176 -54143 -194238 -35925 116854
26255 116854 123719 132001 60501 80655 115183 32933 -81605 76019 33994 9866 43076
26244 43076 188579 164666 62632 6820 149258 313630 227621 16001 -14757 -259182
26234 -259182 -352047 -373311 -283768 -167309 -80914 -27382 55900 122538 153810 182991 10538
26223 10538 -128513 -171232 -87972 -87356 -122613 -94808 -179787 -294430 -227233 -117750 2320
26212 2320 184585 227098 160123 146548 37566 -77298 -17860 52115 97519 127736 177071
26201 177071 245190 115223 183295 125745 68172 262496 393677 360682 266339 94509 -8985
26190 -8985 -119634 -218465 -109928 8622 9161 124812 235428 83382 -39872 5156 69078
26179 69078 21893 -58691 -50182 -58284 -16994 85297 166965 130802 137667 25530 -40175 -76050
26167 -76050 -145091 -84958 -15389 128932 117085 66697 152799 361635 286378 141727 -20213
26156 -20213 -88330 30883 78893 119568 69578 53015 -82341 -62862 -40250 32674 82707
26145 82707 142185 154115 81025 -187233 -307845 -499110 -556846 -392484 -101472 -700
26135 -700 -112807 -96333 -29928 -104657 -155613 -104075 -170770 -66571 -277433 -266296 -286621
26124 -286621 -228840 -105070 -100873 -27903 -90988 -200465 -234706 -158397 -5031 74889 -50071
26113 -50071 -16782 72032 178145 79400 82133 -65378 -116028 -113890 -122458 -210738 -67198 -12363
26101 -12363 -26598 -25065 -119911 -79781 86715 114709 -69090 44809 46414 168116 316896
26090 316896 109891 -151450 -161206 -100395 -87114 -232483 -228684 -193836 -99270 31874 -28323
26079 -28323 -135911 -114739 -24959 146608 96167 63822 141257 272623 208062 134554 121069
26068 121069 110280 59010 92916 162555 103820 190512 198795 131717 139887 56646 -34724 -18550
26056 -18550 -24670 -16398 -45143 -55656 -38211 212559 196648 51469 -45350 -126450 -7343
26045 -7343 16716 -34163 81428 313443 252960 186726 32335 -166135 -176135 -118469 -11413
26034 -11413 51045 -71802 -299501 -348766 -209154 -120720 -121129 -33157 17246 23424 43532 69175
26022 69175 178697 446 -153483 3344 -2488 -1897 -28706 -108775 -150436 -71468 -23840
26011 -23840 -48397 -9369 73822 214567 198752 174418 125837 46896 -119132 -248318 -148396
26000 -148396 -46016 -25043 -105903 -165533 -220404 -271520 -358891 -349551 -295528 -274431 -17483
25989 -17483 -31123 4120 148131 207835 114814 231365 173065 -53310 56497 166224 240062
25978 240062 175434 109184 -1711 208043 265440 298672 356641 136834 -94687 -64239 37588
25967 37588 45016 -102292 -120082 -19392 104866 67318 33146 83115 253250 473275 305482
25956 305482 17222 -147528 -139489 -119326 29154 145037 31830 69186 186920 77129
25946 77129 18189 -22973 -137174 -334795 -179092 -50910 -50829 -21643 -91655 -110603 -171772
25935 -171772 -328082 -483583 -343455 -211607 -115427 -167495 -142627 -53734 54264 -42436
25925 -42436 -146334 -76699 83065 126450 91800 121342 47067 28816 -18767 -185290 -109432
25914 -109432 128180 43022 -88145 40099 80988 130902 75996 -117565 -211811 -359190
25904 -359190 -592874 -641363 -533689 -388561 -228873 -96624 -140117 53565 201278 54835
25894 54835 -14830 -118648 15833 203375 143127 224883 11877 -93066 -66266 -75009 -119182
25883 -119182 -112616 -157309 69012 55518 -81094 33274 97261 6606 -47618 -29785 2364
25872 2364 -13368 -132155 -179372 -166973 -116288 -97597 -135792 -210421 -222958 -136456 -145939 71157
25860 71157 36468 58089 58536 17508 99584 51356 145802 207805 93262 192742 211562 332428
25848 332428 162179 -36654 -116002 -147578 4604 120350 217021 237746 284452 134023
25838 134023 36784 23197 230639 123338 109811 128610 160246 104037 7561 -74496 -77181
25827 -77181 -94606 -103375 162226 206737 196957 134552 103625 168177 211784 88037 97832 120963
25815 120963 88308 112333 83289 -63813 -183639 -62316 39264 16530 13629 -27737 -48997
25804 -48997 59796 171073 249803 282463 225452 49346 -154261 -318201 -327409 -337466 -260645
25793 -260645 -79571 -143362 -72264 1415 -48841 86180 67539 -2308 27019 13253 -17138
25782 -17138 -201608 -274318 -155958 -58083 85051 40692 -34560 -12517 -22795 43390 100247
25771 100247 21660 -43063 -179537 -133864 46896 148406 172214 60232 11059 -213684
25761 -213684 -320274 -223374 -160247 -227797 -267686 -238118 9790 202855 11340 -117248
25751 -117248 -139173 -20225 68824 188202 171606 141603 139279 -34352 -157489 -229424 -184157
25740 -184157 -16465 -78740 -112137 -39533 99228 156541 50192 -159517 -57338 39210
25730 39210 57138 48511 -80659 -24421 -141293 -196717 -200509 -235308 -16268 -12055 -179582
25719 -179582 22648 -9067 -102893 -86911 -241744 -139450 -178054 -228263 -104901 -24937 -123249
25708 -123249 -303995 -357658 -322734 -288312 -243809 -116382 -65173 -106726 -18999 74723 119384
25697 119384 -155372 -239380 -225979 -168232 -342879 -327026 -141970 -71698 -81485 -81380 92236
25686 92236 8906 -154120 -243691 -267428 -179836 -171928 -234920 -78652 90107 14018 -12798
25675 -12798 -50877 23128 133191 245533 233099 172546 -40227 -143935 -90863 -59958 80596
25664 80596 215098 212697 221623 46375 14265 -15435 -97586 -34947 -110719 -172023 -115225 -202773
25652 -202773 -132659 -58376 86221 74111 146170 32111 -158264 -221749 -397784 -482195 -363634
25641 -363634 -156570 -40802 155567 168573 -35580 -200238 -195399 -292117 -347754 -351547 -205771
25630 -205771 -30635 112662 257093 242765 230333 206505 151466 217274 224308 135385 -176604
25619 -176604 -357307 -280270 -179521 -136303 -54314 13890 -18136 14749 231754 194749 236489
25608 236489 270772 34559 -67255 67322 203277 151812 136128 85390 101877 167800 156975
25597 156975 123338 241529 310007 269068 285492 159565 68772 184395 286514 316060 249591
25586 249591 192906 220680 341009 353718 279537 209824 162583 160123 121242 81772 24449
25575 24449 82587 123455 101223 120565 156690 59395 -55480 -86378 43157 128241 286729
25564 286729 465603 381760 218212 182124 284605 370520 276111 329301 334351 202794 186213
25553 186213 142395 120280 85605 -105135 -135696 -113776 -14855 155987 220829 252325 220102
25542 220102 134665 -47507 -103094 -131659 -97861 -141645 -237685 -345584 -303126 -49590 47166
25531 47166 -23149 -217380 -358096 -199764 -158423 -37817 -175606 -219840 -202291 -276426 -233062
25520 -233062 -152602 -192814 -175365 -296573 -191088 22098 103549 235197 70879 -146245
25510 -146245 -134400 -181506 -182564 25597 84978 29180 103361 142601 67024 36948 167151
25499 167151 150452 178982 83534 64707 258188 209006 141486 143287 60765 43516 48208 12773
25487 12773 53786 183085 38437 46940 32463 80336 183805 214836 83323 20268 84500
25476 84500 294372 173197 38981 -127164 -90154 47471 69732 88858 109070 55976 -63336
25465 -63336 31743 136014 -44556 -105388 -91662 -169079 -54430 8089 -50590 18621 82029
25454 82029 130431 90216 -120430 -113935 -120858 -184192 -107839 -16767 141408 123375 54205 -20365
25442 -20365 -55752 -62293 -100938 -222459 -258739 -177853 -4739 25808 10315 -50822 114899
25431 114899 -12792 -61741 67419 -10749 -132163 -265626 -332161 -449289 -301651 -209852
25421 -209852 -174222 -159680 -308351 -280033 -196958 -176568 -146718 -1342 63487 -158956 -143896
25410 -143896 -173304 -141892 13360 -15144 -101064 -69566 -65190 -180347 -296661 -329456 -313577
25399 -313577 -166310 47326 11551 -215933 -178204 -103340 89572 -3498 91398 -17922
25389 -17922 20127 83507 -119472 -225372 -138708 -47033 -113735 -121735 -121706 -183931 -239436 -220699
25377 -220699 -246916 -221188 -117709 8909 82763 87888 134189 -46061 -207589 -152843 -123643
25366 -123643 -22032 -52544 -103994 -63267 -136536 -106157 -210951 -314149 -267760 -185260 -117121
25355 -117121 38316 -36797 49645 81692 -21343 4706 -43176 -49744 -29710 26694 45874
25344 45874 66516 -9481 -137885 -134321 28890 21550 -64958 21908 66482 -16223 -61945 -199458
25332 -199458 -121246 -6042 19065 -106079 -128739 -140500 -200911 -257515 -290009 -181810 -48407
25321 -48407 157363 67236 -29912 -49683 -67198 -154510 -183944 -142587 -107360 66501 38861
25310 38861 161446 216953 246173 170186 70442 85553 179491 137940 194489 167970 95167
25299 95167 77906 134478 81827 -50909 21099 189201 215614 136804 119813 130575 50
25288 50 51406 120486 -140522 -75095 -88826 -219726 -220057 -181536 -160078 -137351 -131522 36791
25276 36791 258530 231491 190691 255379 150551 57090 71668 -64028 -210077 -249915 -249594
25265 -249594 -20043 10532 -161517 -264707 -43681 117330 -7213 -59578 56868 20026
25255 20026 -56556 115021 237886 249129 157617 83516 -14542 112516 146249 142802 260535
25244 260535 166667 142663 68889 110524 163048 61390 79598 7920 16934 -82050 -8142
25233 -8142 100756 108844 179421 239366 247198 287700 301753 309827 360208 291107 137861 138651
25221 138651 96133 195673 208186 66687 60746 118420 59211 -33232 -7066 -115342 -221315
25210 -221315 -102191 -142294 -129005 -52398 -110849 -109138 11296 -55585 -155166 -45800 -78752
25199 -78752 -42312 -56740 -22824 66028 -100694 -68213 192422 331295 138887 166653 327045
25188 327045 438417 390305 168702 145251 180369 197617 254127 316121 347943 255548 203329
25177 203329 359770 424047 439675 381617 243125 54612 -95043 -128264 -117608 -161498 -62941
25166 -62941 -9930 79894 90349 110156 7168 93867 177301 166865 216251 165795 72173
25155 72173 148196 78979 13595 72452 229188 267511 257149 190140 166103 130293 55081
25144 55081 -21537 -132341 -147216 -54320 26522 11512 -129242 -286608 -187988 49979 247322
25133 247322 153116 142945 344675 287443 247426 245513 188912 4073 89617 100212 131113
25122 131113 145634 22329 -52215 -154615 -60013 129834 124621 191940 268351 297277 272028
25111 272028 201337 232613 130163 147276 190268 73749 445 -63383 -11957 84847 -23206
25100 -23206 42957 44143 82955 124598 248900 172344 45084 23983 130364 307094 191980
25089 191980 89563 133910 -29092 -328181 -301963 -235259 -207535 -74920 -41185 67300
25079 67300 54407 31265 -86012 -52632 152347 171969 194594 229897 191157 252226 285517
25068 285517 217305 55738 26542 127566 138968 86500 230104 173149 40293 -50774 44231
25057 44231 238933 122216 -180518 -63327 61970 -33908 -6404 46865 122281 234839
25047 234839 185896 37512 -96214 -27809 131751 45943 -12932 67353 89838 76341 170291
25036 170291 115136 -66550 24214 -12755 -4844 42219 177509 119911 3949 65293 1197
25025 1197 146568 325499 258964 341324 355148 252939 382520 423390 196738 146253 66668
25014 66668 182303 292896 334224 198361 228111 260446 156283 144110 104326 106323 -71328
25003 -71328 -91462 -109123 -160231 -233425 -47911 36916 14225 -161154 -125689 14838 319674
24992 319674 298016 256247 152511 15443 -64186 59720 109011 90968 34207 -34409 84537
24981 84537 104393 -106483 -106249 -30373 13822 108697 96698 -24978 37927 84094 -103327
24970 -103327 -71649 -133690 -4996 13532 -92526 -47935 -94603 -217189 -97762 3792
24960 3792 -54397 -160466 -112028 101511 159391 210836 331468 406509 237050 154380 185210
24949 185210 197237 306329 138043 -275293 -134967 97072 262064 313950 130535 149614
24939 149614 372057 326226 189558 145654 126790 116379 72934 -27163 -28225 61113 123887
24928 123887 110113 22312 15522 97028 -29845 -140701 -10163 77427 68144 36090 54704
24917 54704 123850 -23403 77914 76825 36678 -38301 10462 32260 179015 268335 75813
24906 75813 -85176 3565 -74110 101981 101297 -3288 -13251 25556 55702 14620 -26227 53277
24894 53277 81849 152992 153770 188026 280654 164859 46448 207776 190688 130868 226477
24883 226477 331529 339287 264889 239934 396910 546886 590257 565901 602877 709036 515333
24872 515333 217529 45795 -50415 -48081 -16149 -9711 -152039 200 68617 4050 -111656
24861 -111656 -195714 -129008 -73016 -234466 -191353 35529 149708 189557 238630 241973 245280
24850 245280 143963 41961 150645 196759 230701 162263 163958 -7746 -9086 104349 38678
24839 38678 -199180 -283154 -71220 -49008 -19775 -16915 -159750 -262850 -433944 -405174 -273652
24828 -273652 -83243 71468 145807 6486 127168 168684 -118086 -219414 -136627 -20433
24818 -20433 32780 26059 -23706 -187331 -274606 -106175 21010 138584 210192 176146 129388
24807 129388 -29999 -1237 -5318 27879 -42933 -48295 -25945 106035 -92305 2122 87625
24796 87625 -69403 -225598 -147432 -13423 241770 347228 153265 35847 -75100 -151370
24786 -151370 17589 -79440 -305370 -429563 -550174 -372087 -180458 -140180 11776 85325
24776 85325 -21022 -109316 -143532 -139464 32148 185350 128637 25721 136459 118410 104607
24765 104607 60444 24582 -50347 12585 46422 9218 -10429 55620 35709 -51194 -64833
24754 -64833 91176 128397 225542 30800 -145166 -143994 23640 182974 230495 99907 50264
24743 50264 107562 238411 201195 61059 24865 1960 60839 65251 50243 -8548 -30925
24732 -30925 -75982 -146308 -150698 -91281 -20863 50298 103829 77403 34637 -74930 -218022
24721 -218022 -303422 -179257 -182049 111403 191303 42225 17043 -5039 -78766 -171235 -248596
24710 -248596 -281729 -159317 -75617 -40559 -28759 -41483 -59912 -111408 -97236 -23226 124521
24699 124521 90650 71401 138486 172497 138136 137126 233383 290223 253213 193794 137597 59358
24687 59358 13549 64020 112007 27220 -61925 -49048 -102336 -171124 -344404 -214159 -46012
24676 -46012 35077 -9334 -95960 -34762 10231 -104341 -331318 -305775 -493568 -431740 -141048
24665 -141048 199793 199257 304838 407481 404100 152786 35731 131343 -74545 -207698 27805
24654 27805 69754 -114057 -146229 -255053 -201133 -126405 -96206 -70680 -181224 -251197 -90239
24643 -90239 3739 150677 150885 -123597 -15154 100767 -391 -180887 -91812 106029 322291
24632 322291 316516 260148 177407 272870 153339 63302 108822 170053 142686 130059 -35943
24621 -35943 -93829 -228932 -282157 -176962 -30968 -37145 -11936 36896 37628 54146 88794 20264
24609 20264 -63942 -10732 -28007 -476 -49127 -54921 -58245 -39068 -59116 18306 83565 115420
24597 115420 93417 29007 106896 214243 199360 110033 15554 -155428 -289557 -202937 -66065
24586 -66065 6941 83274 38452 -90876 -6209 -55796 30485 199233 307873 255269 193507
24575 193507 101485 145755 104381 164447 125468 -17958 10982 -128172 -31417 -67994 -9108
24564 -9108 104682 94823 21940 164362 147015 -26205 -63378 -120469 -167416 -256572 -133543
24553 -133543 14538 -53724 13810 156035 12561 -141339 -157349 -24388 -207609 -153729
24543 -153729 67659 69042 89293 47088 108719 86645 -3427 -2665 -113518 -68609 137544
24532 137544 412157 186320 1327 91005 153780 94411 -94802 -71255 -131977 -161233 35544
24521 35544 81904 -115516 -160854 -38427 -59231 -257371 -119696 -145107 -177782 -171213 57691
24510 57691 107387 13575 -42241 -7105 89403 132446 -51837 -78678 106969 192314 142398
24499 142398 127566 -57508 -18783 122465 216124 181940 51727 -173061 -225294 8560
24489 8560 196731 389505 424933 350870 278904 272151 431107 448425 164290 -107301 -3057
24478 -3057 189692 228337 114169 -58370 -144346 53044 157838 -91651 -135479 -75034 156655
24467 156655 337836 108299 24233 43912 60554 228213 67328 -284663 -225777 -38361
24457 -38361 89066 183906 319732 268261 332866 247107 80714 -53169 -58055 99372 70049
24446 70049 102363 161076 165393 27448 -94403 -90378 -20665 -101630 -86408 -195355 -138657
24435 -138657 -79104 -99064 -70861 -39321 24527 128044 129264 65091 -134963 -69110 88040
24424 88040 349418 448235 328105 240151 138883 -9334 -166346 -24207 73326 9414
24414 9414 -104411 -58427 -122404 -86825 66807 245731 211439 251508 8887 -100883 -22614
24403 -22614 -73608 -135649 -82378 199743 248055 -2591 -107756 32627 119724 53935 -236110
24392 -236110 -316078 -91160 -191886 -323047 -257782 -96464 -35460 -93593 -118538 -60815 -17169
24381 -17169 -34382 -1812 -81000 -151016 -90550 104662 86540 27155 16873 121723 52412
24370 52412 -114379 -352922 -294965 -187976 -129475 -103926 -206140 -74820 121914 278434
24360 278434 225356 82096 40220 -76721 29701 147817 70280 18385 -98636 -212059
24350 -212059 50270 214399 20067 -151323 -177866 -104506 -155291 -308593 -231964 -212473
24340 -212473 -122375 -25003 -65997 -213549 -205066 -26892 -3598 -80568 -266338 -226366 -46910
24329 -46910 114 42 -6391 -177566 -134919 -45894 -33578 -14904 178252 257831 210945 276299
24317 276299 215906 18052 -121058 -326084 -384867 -355085 -354944 -285151 -59808 61207 2465
24306 2465 -80330 -263651 -108367 152827 253697 226755 120124 84245 166685 72471 -137889
24295 -137889 -176311 125307 262700 41748 -65325 -18765 -439 -121428 73653 100955
24285 100955 -85961 -102439 -38122 26279 67706 6703 -35414 -45739 -13493 -31528 -137954
24274 -137954 -211020 -209490 60655 279065 103845 -143980 -239150 -108092 -72904 79042
24264 79042 214464 144829 45878 -155174 -191903 -214935 -430458 -357310 -175119 -127050 -10836
24253 -10836 -24139 -26403 -30532 -91964 -79890 -141822 -156817 -62531 23570 -105134 -248411 -328218
24241 -328218 -443439 -489866 -350949 -184751 -109974 7618 -40119 10713 -22809 58585 192351
24230 192351 125501 -88315 -139192 -294956 -235168 -28608 -28843 -715 -116159 -382079 -329334
24219 -329334 -200186 -198359 -158695 -140913 80516 51426 29198 121142 -20194 -100467 46997
24208 46997 -67031 -258655 -292313 -164929 11488 39343 -69697 -102907 -176575 -257132 -237034
24197 -237034 -247780 -286499 -215220 -304817 -238818 48458 261261 307730 229585 202819 289613
24186 289613 81696 101701 117766 -57557 -266066 -344230 -279887 -73953 18448 38498 -83969
24175 -83969 -164884 -116780 -97663 -59241 -130197 -147725 43392 116736 18516 -48209 -103751
24164 -103751 -128977 2264 104222 55947 -37316 -28656 124404 222193 -8071 -104174 -83258
24153 -83258 -167299 -245586 -320755 -312842 -233016 -111283 -198394 -299881 -278365 -390359 -317509
24142 -317509 -157150 -224269 -127516 -64673 100717 114150 46566 55816 79470 -86560 -108132
24131 -108132 -193224 -141828 -73697 -235515 -269215 -189122 -183892 -36759 40859 26756 53951
24120 53951 97557 147515 190950 48927 -102131 96267 70517 -3024 93048 100031 2092
24109 2092 -142049 -232241 -162819 -115341 -223784 -297067 -293580 31350 119502 147067 23371
24098 23371 20035 -55362 -157950 -38718 -53090 -103236 13857 230444 377656 186238 77828
24087 77828 -3093 150913 64523 -82749 -123485 -173717 -231417 -307956 -189435 -49747 -69414
24076 -69414 -255990 -303655 -202029 -234504 -130544 82910 80614 74881 85595 -38860 -47364
24065 -47364 124255 200772 -14269 -216920 -284704 -437614 -339749 -128205 -112667 -313315
24055 -313315 -380259 -281215 -48617 159285 91916 6456 89060 117930 120648 28764 -104368
24044 -104368 10193 329945 271370 228332 305738 413639 126736 45355 12095 53856 72650
24033 72650 75771 -3636 -244222 -177985 55140 83871 -10205 12950 -36092 -107632 49079
24022 49079 18590 -53055 -119783 85272 -124303 -244363 -218213 -62312 -12441 -73354 -26406
24011 -26406 -96913 -219137 -211733 -188516 -103935 -83312 38593 125935 74280 24293 -12943
24000 -12943 -65575 87612 137212 23942 -43103 -47626 5634 -74261 -35216 9023 -71665
23989 -71665 25106 -19404 -132033 -147594 33998 133267 54978 -7540 55131 92358 30272
23978 30272 26620 -53417 -141887 -171395 -21062 31361 -111652 -138111 -155451 -20178 70541
23967 70541 10928 47735 54059 142697 139947 138771 200616 228821 23186 14040 50962 97967
23955 97967 64637 -47460 -157154 -210816 -97798 19272 85737 109297 115318 121238 79620
23944 79620 53948 110481 99735 159793 7520 -21783 222641 307727 314521 268645 236293
23933 236293 81934 -55390 -162786 -279022 -402537 -328430 -107540 -30181 -72800 10525
23923 10525 97726 50070 39678 -54378 -126269 -203892 -142302 -257806 -270132 -142337 1575
23912 1575 -32114 16475 79902 155961 59499 92228 148656 -21412 -58089 186333 122756
23901 122756 -79690 -128674 -111860 18644 -22653 -265364 -237095 -81445 -155852 -360876
23891 -360876 -363551 -278213 -223786 -104612 3973 -38085 -171197 -37531 -44881 8650 85108
23880 85108 -17264 18663 100059 55683 -81942 2486 23226 -107430 -108496 -100058 -117923
23869 -117923 -183395 -4630 104295 8356 -39781 -173589 -182678 18423 67053 10781 -53821
23858 -53821 -226327 -351861 -358798 -135881 40011 25078 78456 38941 102414 109261 99989
23847 99989 157733 53386 -59061 34997 210368 163164 157519 112670 32342 -301823 -440607
23836 -440607 -438081 -197415 94616 1574 -103647 -91109 6827 101986 91453 31075 34419
23825 34419 101299 247307 471318 280633 91734 36914 90687 99929 42788 -104769 -287414
23814 -287414 -18935 112710 -39401 -159752 -389369 -294139 52188 -23960 68093 93193
23804 93193 83989 14272 51248 -32347 -23253 -107115 -62066 -65000 -60916 -30471 -103984 -92576
23792 -92576 105974 1295 4480 -70325 -121258 -230009 -255274 -169306 3483 -148400 -329832
23781 -329832 -204851 -34376 5566 -74384 -136721 -151555 -98672 -91984 -116068 -20444 15706
23770 15706 168224 215492 -57722 -114966 -62647 133367 254600 179217 121722 88719 -153005
23759 -153005 -409937 -219507 -129932 -82410 4352 -106756 -170575 -214280 -188760 -32379 -45754
23748 -45754 -230588 -191809 -57961 12367 7531 13173 -28013 -27792 -75462 -202429 -293072 -124348
23736 -124348 1402 124840 49304 -13639 54 -91213 5916 -31363 -35998 113496 -17973
23725 -17973 -17854 112707 51302 43165 -17083 -78290 -19634 41183 79279 146952 220983 66111
23713 66111 -131593 -125877 -70704 14792 143429 64201 -48873 45028 27847 110679 260670
23702 260670 141114 90714 -14119 57098 113307 -35356 -257415 -289833 -86941 26430
23692 26430 101362 10586 17138 -4697 -56157 63406 198567 245466 88155 -39335 -108690
23681 -108690 -81146 -35291 55383 180810 -77315 -236371 -277453 -318054 -153648 66918
23671 66918 167638 121914 160270 104673 -67080 -36380 33860 137196 173822 -40718 -103913
23660 -103913 -159522 -108560 -80250 -55099 67940 230341 365151 191831 -4287 -95299
23650 -95299 -59641 30254 -32286 -37266 34094 -65067 -15722 -84465 -135863 23621 38334 -62328
23638 -62328 -90684 -137524 -168508 -47323 151062 299518 371224 257248 138236 172720 164187
23627 164187 168959 209851 264037 46618 -10593 68957 113696 13467 -41603 176653 193786
23616 193786 203503 216043 122552 -88722 -115439 -107248 -133999 -341264 -225584 -2123 72386
23605 72386 -57054 -167455 -271872 -189213 -119846 -40079 -159612 -106500 -47984 21878 -105808
23594 -105808 -193120 39584 -14596 -67877 -74844 -255486 -207872 -80766 -176116 -255045 -148737
23583 -148737 15075 21622 39860 9653 -55562 -151628 -161063 -95551 -158642 -116027 -55715 -72732
23571 -72732 -23653 205152 149655 97399 43035 25029 3845 -226390 -407185 -239888 -177310
23560 -177310 -255567 -196435 -221117 -334800 -373554 -140584 183506 288605 228373 130914 -31203
23549 -31203 -26967 -107482 -199710 -109081 19814 -79484 -68364 -18058 -23677 -86167 -80688 19201
23537 19201 28081 -131262 -100269 44559 85198 10902 -81620 -187380 -218795 -40267 -29037
23526 -29037 -106258 -65827 205145 279402 172916 86362 100862 136915 320009 145678 63977
23515 63977 64938 82977 181392 106094 112905 201743 113530 -14633 -101331 -215203 -158081 38689
23503 38689 52390 116612 57659 93240 7909 -76496 -108249 -123456 -76809 57445 58852 -50088
23491 -50088 -172444 -156374 42296 136382 56161 143349 -13123 26648 23846 97372 152112
23480 152112 314966 307362 156014 62009 -65743 -122011 -209880 -156364 -152165 -134296 -49913
23469 -49913 29392 5891 67669 128174 -51390 -130936 -110548 -60343 -63658 -72186 -29826 2192
23457 2192 -78571 -150625 -212457 -166687 41302 124351 -1168 -65596 -14266 75032 106647
23446 106647 39903 68913 67679 -51882 -62211 -248516 -102240 -11285 -54499 -11759 96273
23435 96273 94809 119248 103062 131913 98323 62760 12122 -7349 -39371 -169332 -225667 -131348
23423 -131348 -158417 -132656 -43643 -23451 159155 221434 184782 -73122 -121328 -78569 -197623
23412 -197623 -258577 -259963 -250158 -81290 115164 173135 184843 215700 110073 62774 152180
23401 152180 66314 -94198 -38176 38240 -17386 -6610 114215 128660 5793 30613 -59185
23390 -59185 -24854 -21850 -61455 -83615 -80077 -156918 -241529 -298442 -437513 -374815 -400138 -402570
23378 -402570 -168647 -324653 -154654 11900 -122477 -88538 -90126 -90093 -73649 -79598 -47555
23367 -47555 -185621 -151900 -118568 -89253 -27103 69551 41124 -100418 -192487 35343 187485
23356 187485 112822 26456 -74300 -58303 22795 -50237 -87016 -105585 -58068 -41814 -125553
23345 -125553 -125965 -168156 -60345 24003 -68003 3448 25930 -68430 -38499 169628 73097
23334 73097 -50509 -239625 -345184 -234016 -53015 195433 347116 288413 311080 258662
23324 258662 307893 232168 13666 108923 144355 24636 15711 31894 -71988 -194460 -74158
23313 -74158 36619 -37564 -88525 -11821 -16232 -5205 7397 161512 135643 89963 -46941
23302 -46941 -171572 -299732 -273674 -276948 -268777 -126480 -24610 103804 62514 -83303 -203547
23291 -203547 -209073 -256410 -405585 -524749 -508602 -376471 -209121 -235520 -251278 -226893 -155207
23280 -155207 -112021 -24602 18595 37013 64645 141213 14225 -74878 -113312 -87139 51858
23269 51858 22292 53497 39717 74293 -37467 58544 89061 -18492 77573 10004 -88868
23258 -88868 -206531 -72125 210385 240804 11010 61202 -58567 -78431 -141990 -143664 -111934
23247 -111934 -84013 -181381 -9539 -24252 34681 104942 49220 -50635 19141 30828 18369
23236 18369 -45535 61187 65059 43827 99521 97205 34227 47713 106191 72364 103634 279670
23224 279670 299752 230017 206688 120174 10785 -34196 -138791 -234469 -94610 91735 -61095
23213 -61095 -109304 120433 79975 5707 102542 190835 170833 309338 144735 7971 40677
23202 40677 -18505 -106344 -54845 87655 99533 -61533 86604 289627 281383 215400 281932
23191 281932 311699 297963 81173 -37951 -183666 -231057 -193137 -210324 -103015 -364
23181 -364 164856 207924 28963 -33722 -69507 -176100 -182683 2217 93554 131680 212179
23170 212179 63279 -18952 120054 242148 181197 112168 203586 201666 134583 141186 39629
23159 39629 -46377 12103 -67863 -187257 -98014 -85238 118661 368341 415352 333271 300212
23148 300212 404902 347950 234194 -4141 -104291 -27320 141929 213175 200030 159348
23138 159348 37499 -23511 80564 197240 16971 93713 54592 -55732 -114611 48557
23128 48557 -24589 -159130 -101406 -2441 -79508 -183323 -200046 -244263 -151463 -179910 -232880
23117 -232880 -178413 -28947 11364 55345 -80302 43857 -110062 -297377 -244789 -154246
23107 -154246 -111775 -338 -72857 13276 217675 104394 -164238 -222401 -167402 -60491
23097 -60491 33016 -118240 -165856 -42683 43298 155298 251342 306071 186974 21451 76390
23086 76390 240293 355321 113859 147984 280732 210717 121673 146599 16372 18340 165521
23075 165521 270121 185011 270042 181989 -39109 -59713 -28983 175573 124514 -37761 -29100
23064 -29100 -2100 74314 265917 230064 163650 253138 394466 370159 110746 96234 -17080
23053 -17080 68076 122654 159492 70996 52816 -117929 -65727 -52997 -130685 41153 78406
23042 78406 143801 147532 -29562 -260724 -228874 -107592 211464 142597 71622 192362 303299
23031 303299 108900 -25323 61266 35754 70318 51609 99819 31324 134699 35787 -84279
23020 -84279 -96043 -9539 121331 245997 284215 137686 112567 155399 246803 300934 267596
23009 267596 67509 -29767 -27516 -50421 -108240 -34176 -70640 -254276 -287312 -196599 52692
22998 52692 198521 200805 202393 297973 261870 140319 43318 99950 30253 -22029 58855 -118994
22986 -118994 -284444 -252414 -151990 -93617 -109447 -97789 -9072 13241 -99027 -205928 -354803
22975 -354803 -320764 -127279 23819 26322 -15829 85560 256060 216472 179335 107838 -3030
22964 -3030 -105197 -218417 -175899 -226119 -152302 -184998 -260079 -3152 116589 -120363 -149115
22953 -149115 -39787 30397 97442 78640 17607 -97714 -74126 -30907 -21977 -181852 -147752
22942 -147752 -53277 -71374 -154367 -49936 -21604 -74563 -224015 -181462 -152074 -357324 -390074
22931 -390074 -362322 -288245 -255475 -321623 -368219 -296688 -242926 -328198 -236552 -152618 -152805 -81752
22919 -81752 -44949 -149653 -166065 -206167 -361688 -388573 -286602 -222201 100889 113640 -157668
22908 -157668 -258745 -77590 7249 -32382 19379 249055 159249 -128521 -323485 -238354
22898 -238354 -306182 -68709 26236 27988 -198846 -145842 -103038 -46659 -87738 -27158 -34744
22887 -34744 -87204 8886 51073 140074 -46448 -63043 -34927 -137618 -215415 -258649 -247169
22876 -247169 -186029 -228326 -222619 -130124 1630 -96563 -143614 -113031 -159700 -65088 25364
22865 25364 83765 76371 -111068 -178210 84096 196028 64608 -37656 -135565 -251765 -235255
22854 -235255 509 143858 159971 57269 -115590 -10047 -165068 -180993 -262735 -258993
22844 -258993 -181778 -184667 -123830 -97319 -15609 44201 75010 -79220 -161484 -28054 -69183
22833 -69183 -41109 85516 134888 236534 222311 177274 13767 20504 51747 -211915 -218976
22822 -218976 -178773 -132818 66175 133992 101452 81377 -7649 -25501 108852 200279 198156
22811 198156 21728 -138039 -208892 -93374 -89233 26185 -85554 -106620 -24090 -121357 -95230
22800 -95230 -100165 -17404 -56908 -182783 -266656 -191613 -93812 29524 132070 83058 148471
22789 148471 299696 336420 168175 109881 110995 115181 128114 28710 122723 34814 -59526
22778 -59526 111928 140301 164968 76420 -159465 -161625 -225257 -37322 74133 54039 -141578
22767 -141578 -214844 -304881 -347834 -326424 -202328 -48278 23998 47294 46838 175275 97865
22756 97865 40660 245000 346558 299347 246556 120343 -67377 -165667 -114338 -96047 -108593
22745 -108593 -101228 96149 261485 347861 225133 194491 112699 128595 169981 143457 15977
22734 15977 75308 166191 96724 -32716 -132663 -129180 23191 59461 65073 86737 166956 262429
22722 262429 385496 89899 37565 39699 -117197 -33661 122317 176065 224121 160269 115482
22711 115482 -14574 -177740 -180282 -64917 66709 212629 294589 230729 13209 -159308
22701 -159308 -209260 -285441 -191227 -43642 -64387 -88896 -160560 -66694 -2237 97581 17363
22690 17363 82433 164540 136717 247612 211892 269759 164418 -79298 -80878 67182 258161
22679 258161 352007 109608 62306 51229 -15634 -83111 -158676 -19381 6268 4012 -183883
22668 -183883 -266335 -102341 -38336 -46911 -189293 -89000 -78656 -74264 132715 89382 37125
22657 37125 133704 215149 221614 74050 5300 71543 21676 -48843 -21504 -79871 -65721 -69418
22645 -69418 -11442 162413 76679 -172860 -190833 -81335 -116676 -74602 -62073 -50126 -77155
22634 -77155 -205602 -247926 -191610 -145465 -198962 -324150 -306906 -11629 105519 19578 -31326
22623 -31326 -235089 -328969 -294474 -194762 -23932 -69645 -183673 -160219 -282117 -275634 -155061
22612 -155061 -37318 -2014 -11234 10000 -100240 -190945 -102372 -78380 -37232 -40016 -201260
22601 -201260 -265382 -122091 -8381 -11815 -95917 -168845 -97427 12323 50012 38769 118718
22590 118718 117359 34169 289812 269480 165150 33397 -55261 -87517 8388 -39495 123347
22579 123347 346384 338421 272371 335004 328815 237016 65665 76920 48637 208176 28769
22568 28769 -111102 -167870 -266670 -217389 -80577 -74009 -94045 -103802 916 141964 262533
22557 262533 108427 26966 4908 16144 -88758 -34277 161153 117440 14364 -11368 -51653
22546 -51653 50747 2265 143600 60798 -208226 -74457 121619 70566 59475 -5170 -128435
22535 -128435 -219453 -158289 -11307 50358 86861 92706 25661 -156661 -158354 -39104 268291
22524 268291 361042 234820 143083 -47442 -123672 -156897 -161098 -208813 -39003 38116 -146979
22513 -146979 -341998 -529526 -601068 -614421 -529101 -357885 -256500 -89589 -135022 -154937
22503 -154937 -39001 20345 -34922 -62624 41343 233055 284416 138240 -49866 8167
22493 8167 60526 18395 22241 7952 4187 -78463 -115433 -49274 -69365 58468 156816 53821
22481 53821 -173889 -138117 -91997 23479 79174 -99431 -239836 -224702 -40114 4324 -84011
22470 -84011 59425 -85208 -63592 -51340 -207104 -187945 -173672 -176135 -210969 -291899 -121264
22459 -121264 -57299 18867 22958 -14765 -5363 -56358 37306 111507 208106 179592 373980 457098
22447 457098 425475 361543 311071 93559 59532 -65631 -100926 -20624 -21856 -72914 -151185
22436 -151185 -106999 -105503 -4957 16912 -75022 -65262 -189705 -348276 -244946 -167542 -177736
22425 -177736 -266003 -244525 -110561 -33484 56755 222156 167144 -12123 13806 87395 114959
22414 114959 187762 191825 160741 44552 98948 81087 -111243 -276475 -415224 -224612 -250082
22403 -250082 -147358 -102311 -34037 -127463 -297818 -305676 -216189 -202126 -76155 -83576 -12321
22392 -12321 190946 180192 -12141 -37037 -206993 -216207 -73490 113617 212821 270427 391673
22381 391673 245090 114642 3977 70933 116327 -10836 -85631 -65248 -80239 -59259 64621
22370 64621 48304 -59312 21127 -28402 38125 82740 -21004 -156827 -110196 -84093 62200
22359 62200 222951 133132 18847 -92822 -145212 -196830 -207762 -163894 -161222 -155137 -13699
22348 -13699 39994 -185009 -167878 -205792 -259739 -261653 -190487 -199418 -85380 -121717 -276333
22337 -276333 -301985 -139962 -42093 107290 114096 3156 -85856 -17844 83816 129009 126000
22326 126000 146149 127722 22373 -4996 107285 -112651 -83225 31389 167227 128144
22316 128144 9725 -72539 -193950 -364022 -432978 -184830 46326 73517 170735 173595 28324
22305 28324 -57192 -170376 -105557 -122093 -123951 -121398 -214183 -267289 -245642 -246131 -84851 18368
22293 18368 12824 105257 227989 69726 -36281 95366 13257 -382691 -570306 -302796
22283 -302796 -16878 73560 220325 121831 2453 -72572 -28045 -9825 -81317 -64090 -2695
22272 -2695 56688 -79184 -229880 -198566 -71783 -37593 -60930 68254 101238 23609 -145712
22261 -145712 -139486 -111381 -124265 65384 8344 -64176 24603 86223 204229 272367 205772
22250 205772 69701 104623 119418 -49873 -94337 22893 115442 91641 40128 -220262 -196431
22239 -196431 -43236 8797 104020 -2972 -103985 -44515 -38172 -110395 -126727 -73029 -171809
22228 -171809 -197926 -122266 -131765 -180196 -121855 -29081 30464 -14859 80437 117660 300
22217 300 -27501 -47390 54366 -8542 39941 145127 120143 111538 2339 -84120 1534 79867
22205 79867 88506 -44369 4646 14584 -116812 -108974 -6181 -78639 -155926 -66167 39978
22194 39978 32382 80125 -110244 -185500 -90007 -159464 -211496 -293982 -298389 -240943 -271636 -276757
22182 -276757 -363843 -375940 -177085 25019 63685 86874 74059 64637 67050 25910 14183
22171 14183 -59389 -2139 45486 140851 98496 -163545 -239336 -118727 191 105268 135979
22160 135979 86292 -39618 89335 109716 118032 92433 40392 159869 114650 -57182 3224
22149 3224 118140 150977 198873 156556 94853 36975 104457 118972 184366 212330 86203
22138 86203 -4449 49476 -52134 -38052 -6752 -184223 -265416 -228604 -204911 -195416 -286836
22127 -286836 -110342 -91389 32763 216776 155045 65076 -25093 -84287 50983 52976 163453
22116 163453 183802 174400 55123 -153401 -56177 4236 -40071 -112063 -46783 -25443 49849
22105 49849 311143 254489 147486 160818 131960 160795 127574 191373 73309 16864 106468
22094 106468 157053 191126 -96860 -110511 14383 91804 97396 139691 -37575 -163613 -304519
22083 -304519 -283333 -151993 42544 82314 127807 93856 -20408 62517 169384 239663 183776
22072 183776 -68711 -251062 -216870 -159602 -126343 -28159 75283 190883 153828 112037 31350
22061 31350 -173723 -187221 -148339 -135676 -177922 -233505 -198074 -174841 -104560 -90976 -199985
22050 -199985 -289490 -247002 -116704 -29212 56583 51519 -3002 5270 -94854 -201143 -259413
22039 -259413 -150655 72693 92463 79356 40684 112726 191472 208476 275091 296433 221292
22028 221292 -8527 -111059 -202652 -192258 -86999 -51678 -52552 -139577 -163326 -164556 -151042
22017 -151042 -213116 -251110 -71663 65058 55387 -13700 -98769 -67279 -171593 -337824 -341824
22006 -341824 -58540 47270 130621 237080 174720 -47853 -135511 -37696 -49024 13146 -84226
21995 -84226 -280006 -316113 -273880 -249425 -347846 -283176 -275340 -107049 -23512 -63690 -128078
21984 -128078 -194432 -8118 80813 114077 156995 152424 133082 114565 85565 -117713 -106188
21973 -106188 -221295 -318459 -247456 -71317 91438 9742 113988 329182 311418 225828
21963 225828 61279 -64015 -78570 38638 88215 26405 -80654 11562 116580 15722
21953 15722 -816 44216 42878 -104488 -223061 -332179 -81394 85620 129893 207208 223472
21942 223472 81126 61742 56474 -29375 -62432 -85925 -179739 -288701 -130765 94931 190227
21931 190227 160200 -79660 -216780 -58271 67912 262593 315902 217695 50669 -67574
21921 -67574 -239397 -242840 23685 194788 231105 66839 69216 -32344 -158805 -240400 -180135
21910 -180135 -33800 -45371 -182792 -73167 -65380 -184624 -214215 -243151 -206547 -229075 -226833
21899 -226833 -84649 11300 -125767 -226019 -222321 -194640 -57360 -34566 38969 -7767 -18721
21888 -18721 -41814 -37283 39037 100170 12904 155916 252735 116786 -107930 -49475 166113
21877 166113 251722 272349 112045 -4573 170549 295321 254779 134186 202051 273419
21867 273419 13627 -108983 -8300 15848 18696 39145 -11727 -69332 -114615 9016 136513
21856 136513 111436 -18230 -164279 -117399 -18080 39638 -22544 -29577 1169 -132582 -5013
21845 -5013 186392 46193 -96687 -241136 -235763 -293463 -375228 -355181 -487511 -312828 -198963
21834 -198963 -141635 -62739 27715 18548 107828 139148 104508 24420 84986 53073 95261 121734
21822 121734 123544 -70188 -97170 -22673 18303 -2511 -33276 -145620 -147077 30419 68822
21811 68822 227298 199073 195834 126291 46724 198129 54462 -163632 -239105 -285472 -336156
21800 -336156 -167140 -122383 -273504 -250961 -204942 -153898 -31563 125140 26354 -58329 -208735
21789 -208735 -323309 -294158 -255171 -237736 -130266 37096 -76854 -354559 -315122 -227631
21779 -227631 -159425 -262910 -210578 -159690 -80375 27437 18217 -26894 -68005 -31013 134603
21768 134603 144093 11165 -164436 -243397 -229157 -168442 -151091 -87518 -43725 -97854 -86224
21757 -86224 -101718 3023 -21748 -77701 -28338 -74507 -95222 111642 88787 -49648 -233928
21746 -233928 -222596 -127730 54710 156084 94154 75613 -14739 -65793 141196 213342 79572
21735 79572 87519 86801 -157783 -262841 -82625 79441 69637 -127472 -210795 1615 -77022
21724 -77022 -128061 -63946 -1441 81552 41788 -86196 -96676 7434 -21856 196862 186241
21713 186241 221722 247893 98893 33725 -39468 88589 84861 -1007 -86197 -46319 50043
21702 50043 41085 -31253 -4457 12312 -70264 -198634 -119414 -84547 -188230 -136366 -69667
21691 -69667 -110668 -197243 -279267 -464469 -603564 -532277 -445933 -279244 -113784 125275 179381
21680 179381 -5127 -100001 41613 16182 -99043 -215182 -160834 -376708 -442931 -345438
21670 -345438 -67804 -36912 -69820 -86382 -43614 172264 169698 127779 169598 58574 -50025
21659 -50025 -248174 -274354 -134114 -150886 -279219 -296468 -204219 -123420 -92684 -213671 -215934
21648 -215934 30318 63291 -72111 -238645 -172289 7746 76258 91653 192514 296471
21638 296471 274165 197311 199793 -5121 -188854 -7283 111732 126763 107708 155238 97014
21627 97014 31570 90134 3298 -100824 -155034 -13196 76809 102015 6463 48686 16659
21616 16659 58158 98986 233113 94171 -16019 -36457 7334 99164 179564 231481 315816
21605 315816 86878 -216094 -172236 62943 170687 155597 1701 12124 139253 108096
21595 108096 23031 18220 -139871 -105080 -58543 -137909 -290973 -289733 -162712 -148328 -186067
21584 -186067 -56161 7687 -148655 20944 231425 143219 87492 170223 291522 318619
21574 318619 232183 152441 53780 -37569 -67863 -27811 -26474 -216806 -206578 -78647 -54709
21563 -54709 -147225 88340 35564 -87848 36887 -52501 -272539 -307379 -124778 -18634
21553 -18634 118298 124083 -141607 -175722 -248246 -168144 -124423 -90891 55569 71821 52099
21542 52099 70 18873 50086 -25642 8760 -85217 -295663 -278843 899 39764 72006
21531 72006 14182 8812 -33742 -81062 -349856 -288380 -213133 -146572 -69499 -44232 -46725 53642
21519 53642 -118186 -224659 -120143 148765 152749 151758 130983 273685 201063 95294 -24579
21508 -24579 -107166 -164369 -229068 -125265 13237 44735 48305 -102188 -307791 -187384 -100131
21497 -100131 -196111 -300626 -175687 98895 115485 -110743 -72224 -83072 -121906 -125548 -147291
21486 -147291 -171239 -211177 -117868 9212 36709 -242091 -394719 -407494 -264650 -168484 -93541
21475 -93541 143714 115105 38431 -141648 -201558 -207465 -184823 -71427 60219 56260 91191
21464 91191 178506 232742 277658 126685 88134 -33288 -222416 -247892 -135767 -40721 -127497
21453 -127497 -172319 -17944 -13511 -118339 -102788 -47850 -129754 -103658 -151352 -39207 -43985
21442 -43985 -207976 -257637 -132611 -181450 -149434 -130590 -118897 -10936 41099 84954 126371
21431 126371 136551 210180 233875 -38763 -213935 -117154 -262328 -360415 -435244 -407670 -354532
21420 -354532 -129520 -16736 -167115 -276790 -170843 -140050 -289047 -416902 -318761 -223864
21410 -223864 -201218 -216067 -120740 -52894 -318679 -427722 -371469 -308592 -81386 83317 56521
21399 56521 15990 45227 -16008 12419 43550 249592 315113 158559 152511 -60163 -169236
21388 -169236 -35481 8493 -35836 -134648 -104398 -93458 -206066 -176304 -9957 132716 106845
21377 106845 31402 12130 23322 35055 -101437 -195833 -57421 48769 -9175 -41269 1728
21366 1728 -163907 -103375 253540 343605 161230 55452 114081 -10001 -125997 61693
21356 61693 184866 135425 35069 3577 -40064 -53602 -115252 -228716 -42098 -103653 -175079
21345 -175079 -15978 -11747 -5266 43236 -57077 -164860 -79058 216426 435132 433791 166177
21334 166177 77808 107881 52434 78044 -9710 -202280 -182042 -113794 64670 115089 159718
21323 159718 225130 147487 -31497 -53089 -68359 -112981 20487 89806 134371 135112 17340
21312 17340 -64706 12745 -132919 -127224 -143444 -290503 -510558 -413719 -224542 -270107 -302499
21301 -302499 -181971 -139823 -164928 -233653 -117655 -200593 -353465 -263698 -111017 -55687 29121
21290 29121 63429 112075 31737 31331 131156 139735 7328 155665 205301 170348 210215 232469
21278 232469 305713 210301 88812 -16049 48192 106835 49595 22672 -51728 183936 372907
21267 372907 300912 32932 -164758 -73494 -10350 42649 34082 -173838 -239232 -264812 -92728
21256 -92728 -239046 -396345 -370654 -263873 -91006 8683 -1254 156180 292661 254133 273502
21245 273502 175796 91971 146650 -97600 -131150 -50792 48918 89515 35032 62042 -33453
21234 -33453 -7932 -158646 -79873 89200 20286 -111296 -106881 -125445 -41113 -79279 -64458
21223 -64458 -36635 -163196 -293940 -287238 -315791 -325560 -233423 -171074 -182795 -299082 -181280
21212 -181280 -90822 -103631 -213306 -324302 -305893 -146417 -90150 -248087 -391102 -343252
21202 -343252 -167214 -52712 -117981 -179121 -204517 -129371 100610 108986 -130403 -403775 -435108
21191 -435108 -222020 -127563 -21179 191463 269194 260121 239925 489218 388484 273119
21181 273119 207984 171654 73376 -2590 3632 39371 -2760 -84455 -61297 -119757 -20037 158653
21169 158653 167153 16630 -20861 7295 -129854 -219953 -217152 -124487 -128678 -275982 -282837 -256326
21157 -256326 -324232 -309593 -112070 -53850 -68434 -20615 -120615 -96801 -110594 -167916 32171
21146 32171 183461 122479 92557 -119 -133834 -44560 9352 6534 90920 109001 -11108
21135 -11108 -20698 105613 230489 119916 -43565 -30413 106949 144155 80646 82805 -333
21124 -333 -45964 -80501 -143141 -50548 20301 -58088 -259261 -213057 -116878 -68092 -97738 -174089
21112 -174089 -10131 60712 167723 117964 49623 202 -39370 263886 457721 376730 366012
21101 366012 421925 182511 148938 320526 269355 46772 -212013 -382062 -305373 -93309
21091 -93309 66029 -62344 -54103 -78548 -43718 -7860 200992 265212 279477 123431 51173
21080 51173 117551 207277 185929 13621 -108937 -159708 -23457 -46623 -106206 -100078 12965
21069 12965 79156 -20224 -112310 -157466 -138587 -246214 -356915 -167594 -77935 -35209 1664
21058 1664 -115081 -127132 -273295 -264582 -65904 -58986 -98260 -37036 28853 87903 33887 -20623
21046 -20623 -3371 40850 -15518 -16054 25789 -25686 86064 220507 240050 99967 -126363
21035 -126363 -128480 -13219 26635 33264 7190 65043 180791 24318 155293 168055 63186
21024 63186 107064 27232 -36638 -80482 -145950 -167056 -152091 -124910 -210685 -212288 -37832 13620
21012 13620 -65203 -32746 -9607 -56058 -60219 -45461 130590 279716 190443 132046 -62429
21001 -62429 -56425 -51852 78349 122253 -144717 -271483 -327674 -326107 -249750 -287098 -318109 -335836
20989 -335836 -585261 -638514 -650002 -375088 -334929 -331402 -336952 -349471 -287121 -36224 47702
20978 47702 57887 88292 -29264 20477 156508 137044 176668 -16195 -187396 -144146 -115149
20967 -115149 22305 48445 29343 -30831 -101236 -38347 -121659 -221583 -166398 -89578 65479
20956 65479 71724 91982 170695 107964 3343 -209739 -151211 -898 -41524 -35464 -186631
20945 -186631 -274984 -312511 -353214 -330767 -150329 -147308 -203171 -225377 -242392 -232184 -174395
20934 -174395 -160623 -166449 -115308 -73644 -181147 -305615 -245103 -248171 -199991 -91866 48051
20923 48051 60009 -14551 -173740 -176401 -145682 -224052 -249734 -362132 -414769 -316037 -392597
20912 -392597 -314623 -353834 -311821 -170014 -33577 47421 81826 -99387 -90031 78983 134016
20901 134016 -63223 15446 203389 166190 -32870 -156428 -114257 -112635 -205436 -19575 197022
20890 197022 57328 16873 -52088 -152171 -145661 -176650 -267467 -190340 -33640 -40969 -194841
20879 -194841 -234322 -214118 -105053 -27792 65121 72194 -87683 -223225 -174701 -132539 -153704
20868 -153704 -220700 -234393 -266360 -161590 128914 298741 153326 -34454 45462 158356
20858 158356 7408 -120199 -145079 -39257 -88653 -94961 -41592 -20800 -66728 69249 270126
20847 270126 319043 177892 -21263 -168562 -121419 51997 245167 367009 282771 254836
20837 254836 73486 -91934 -44158 45811 90291 280097 187291 -102326 -146022 -173473 -79552
20826 -79552 -96978 -168064 -216149 -230001 -184765 -154587 -201842 -90216 -28663 -37594 128436
20815 128436 117315 74123 69370 96741 187323 77420 167380 157184 149704 63132 -7458 -56802
20803 -56802 -268266 -290028 -43178 120873 32631 47888 122145 -11906 18998 55349 126012
20792 126012 155228 30749 39240 82004 -31056 -232077 -283873 -355765 -303009 -184477 -130220
20781 -130220 -143616 -129797 22182 89312 37934 8652 85050 -18442 -141032 -129646 22117
20770 22117 176010 111112 25202 23514 44202 -84309 52121 217526 130950 -119896 -175466
20759 -175466 -51450 -7248 83802 139260 134611 213663 145552 -4824 147785 328143 326777
20748 326777 253079 146254 36677 -10304 179689 176413 -64511 -182725 -174499 -154128 -62536
20737 -62536 -36795 -2643 -29641 13818 62083 29597 -22931 30829 67150 103942 -115037
20726 -115037 -259423 -230710 -329315 -292174 -215936 4477 -62844 -161679 -245520 -368585 -341349
20715 -341349 -262980 -323291 -242804 -220103 -244271 -159587 -79109 66427 76148 28411 68514
20704 68514 -6707 14825 -250458 -291923 -190472 -172593 -186512 -232554 -81471 -76535 -150654
20693 -150654 -45143 -56445 -155562 -104369 175897 154407 23114 -12987 -59598 -134386 34952
20682 34952 58599 145987 197985 215396 147540 -54837 -176392 -90821 -7551 23521 -129469
20671 -129469 -257666 -165049 -20238 302690 364156 155855 73216 97591 80035 60599 141300
20660 141300 171095 180753 81028 -27145 -16926 -102700 -191838 -3223 50107 107749 69473
20649 69473 -37342 -152121 -108082 28250 -134891 -126512 -24751 -43229 -175395 -81560 47620
20638 47620 -71149 -223448 -323878 -126292 60328 31136 -26106 -115643 -159838 -139917 9155
20627 9155 160226 176774 82540 29241 -29966 -15003 242196 301676 -8153 -196963 -292256
20616 -292256 -411030 -379130 -248053 -242897 -222715 -242227 -246370 -179923 -162528 -126758 -215432
20605 -215432 -251349 -79520 62108 -61194 -144954 -49067 -23551 64871 156476 243023 217960
20594 217960 84951 106728 74065 -134170 -221777 -162139 -141972 -48940 192849 231668 147276
20583 147276 -148137 -346327 -397460 -367663 -109522 55598 132459 -147631 -199548 -255613
20573 -255613 -219191 -18807 -134572 -184006 -127734 -138710 98553 179993 -93934 -206651
20563 -206651 -260028 -163533 -27076 33213 -131773 -248257 -210752 -119211 -324610 -430495
20553 -430495 -343483 -210877 -130632 -18207 -22222 39334 -114667 -337733 -376433 -372211 -235434
20542 -235434 -59808 -130662 -126729 -116375 -134109 -308103 -275619 -191703 -218691 -270860 -351118
20531 -351118 -322456 -242740 -195583 -196169 -178568 -97544 -114240 -221502 -438385 -336879 -252474
20520 -252474 -240601 40742 33942 -148161 -160593 -194475 -149300 -129363 -70343 28843 118360
20509 118360 54868 -67290 -229589 -367310 -431473 -507865 -196041 -182325 -293428 -135281
20499 -135281 -72988 -140312 -101211 -78266 -131984 -97334 -109740 -157116 -73237 -136811 -419136
20488 -419136 -473011 -399388 -271471 -94825 -17066 -13136 98286 79255 -91156 -113265 129274
20477 129274 62737 -87805 -96823 -72987 29435 180726 244753 202708 135937 249745 91560
20466 91560 -44179 111075 221994 298712 372776 423805 245726 232563 302498 296094 352887
20455 352887 180421 150093 320782 357665 167954 80195 -164320 -267338 -228658 -100255
20445 -100255 -217473 -161224 -65258 -1596 64645 84584 -47950 -137777 -58902 -115620 -287824
20434 -287824 -264862 -138998 -47317 -45950 -41432 -91129 102056 140854 74665 -41624 -61658
20423 -61658 19445 -33637 31116 128620 153463 84438 -71573 -138170 -47549 -33913 -58376
20412 -58376 -55070 -209919 -167044 -49205 36664 28500 -89627 -284397 -160361 -43264 40787
20401 40787 24624 105535 283174 143062 -116570 -270387 -241268 -170814 -307163 -227842 -178395
20390 -178395 -97723 -156786 -108487 23292 -144683 -182077 -195185 -218425 -329840 -250588 -97096
20379 -97096 100675 28135 -122804 -232828 -183395 -138715 -245567 -116185 31275 49291
20369 49291 -48368 78708 218564 134944 188936 267139 137331 -48365 -236324 -412650
20359 -412650 -355956 -237699 -84077 -31454 -31526 -107931 -194673 -248263 -167725 -100586 -151969 -28797
20347 -28797 -57614 -110770 -208159 -267559 -285191 -235747 -109671 91191 118291 33972 15407
20336 15407 -47834 -80677 -81728 -33621 36437 40837 37904 -131164 -101547 -42805 -3843 36717
20324 36717 -13398 201703 310674 311852 35969 -81996 -162282 -171640 -100590 -82560 -66861
20313 -66861 -93068 -195610 -268305 -230784 -81696 -33550 72596 114322 51714 -93742 -59607
20302 -59607 1133 -104254 -98463 -132933 -143459 -71464 -78023 -97371 -49225 122850 9321
20291 9321 -59770 -167091 -190172 -26496 63108 -11056 -45243 -153152 -107453 17468 23412
20280 23412 204830 75870 69377 172601 175216 77608 51815 -137949 -78756 50062 -13317
20269 -13317 -138466 -157298 -133783 -92361 -150677 -117517 -204357 -79817 -71500 -221386 -329114
20258 -329114 -458368 -507219 -355794 -141308 -147672 -201074 -270761 -359233 -100192 243398 245605
20247 245605 199217 229834 279168 353389 183842 188819 194416 52186 31919 -40242 -217212
20236 -217212 -174330 5771 187517 33701 -60138 -209907 -202360 -157104 -351150 -266715 12220
20225 12220 135585 13264 -71606 17153 4288 -52451 -51361 -152488 -99312 -102353 -207389
20214 -207389 -219508 -161885 -152361 -204378 -73150 14729 50341 -199424 -223118 -130573 -75037
20203 -75037 -325230 -301018 -69180 165088 33990 -79577 -230299 -209615 65439 206045
20193 206045 174650 -123660 -338334 -476827 -515417 -299993 -119943 11163 166379 6650
20183 6650 -221575 -284522 -197848 -227043 -265996 -194280 -77476 -196699 -176188 -201997 -227935
20172 -227935 -162857 -69028 -115557 -85268 -20207 -18258 -97273 126480 266898 196519 66332
20161 66332 -60377 -24779 8549 34299 5507 -144637 -58058 -16943 51650 164528 209975
20150 209975 -101355 -117571 -182875 -268119 -405719 -372125 -120549 -95872 -121319 48322 38660
20139 38660 18707 74932 96882 64766 124282 221833 149005 218205 207295 59383 9191
20128 9191 86390 -38179 -196514 -163234 -260853 -282901 -153212 -97319 101467 36285 -161261
20117 -161261 -177091 -234284 -244833 -219849 -377537 -419735 -261109 -237111 -200982 -364680 -348398
20106 -348398 -316402 -156626 -95324 -160446 -83138 -14343 -10940 -161251 -224518 -163485 -32825
20095 -32825 51998 85436 64248 93258 181913 48043 -145421 -148475 -143291 14298 79345
20084 79345 86700 118148 159771 196553 179040 -11022 -92544 -229604 -337655 -411635 -266985
20073 -266985 -78370 -29522 84440 85741 92862 -89262 -139444 8702 149851 188498 242024
20062 242024 266446 450830 442715 321727 279705 178402 56585 40597 160335 307504
20052 307504 321724 381369 495082 454916 552834 479066 476785 490661 690618 591698 308771
20041 308771 199951 127699 246234 379768 444029 300373 84579 86760 111161 124838 88212
20030 88212 12444 -70157 -146225 -57959 -122042 -89997 60472 15777 -162877 -221067 -106995
20019 -106995 217971 214034 6982 125386 96197 148894 280980 398994 466052 426284 267348
20008 267348 221196 144903 122289 215750 270969 271650 402876 454667 645808 638104 647673 701785
19996 701785 789311 725810 575088 661843 811418 760689 711816 652919 606313 538963 533564
19985 533564 575942 591524 664291 535108 259363 80208 227266 285868 192358 100621 167312
19974 167312 70332 -27691 -151244 -106428 -24417 121234 73310 56520 62651 99627 117846
19963 117846 67855 157827 222891 144573 121388 147873 165023 201725 233591 55727 -105207
19952 -105207 -135491 -100999 -219673 -418796 -300469 -125543 -26462 7274 -26575 -78533 -38218
19941 -38218 102179 232578 216505 59206 2386 -924 -89574 -131931 -185542 -180754 -82483
19930 -82483 -71270 -122776 -168325 -237734 -218684 -186227 -201097 -73353 -18156 -159125 -269050
19919 -269050 -167871 -6174 -30439 -172987 -278775 -287416 -167417 -60818 5349 124308
19909 124308 376 -19147 -84878 -191014 -276418 -165878 -73774 86036 178659 171426 127822
19898 127822 42785 -2826 -42582 92006 289669 176841 75820 162494 154423 -58094 -119307
19887 -119307 -45676 40847 -7315 -95326 -182956 -158901 -100562 -127340 -176943 -109349 -181763
19876 -181763 -213300 -291863 -430656 -355113 -55168 -89134 -89440 -29048 -1431 -39545 -244687
19865 -244687 -359075 -90016 -92790 105922 127255 64187 65329 81911 -7836 15779 118291
19854 118291 175770 -40027 -25957 154316 141829 196348 270487 124966 204208 142325 153200
19843 153200 190075 102239 -33863 -133906 -99842 -37572 -73926 -157198 -163585 -131202 -19075
19832 -19075 -38167 27699 -94654 -52844 24805 -8348 -79477 -14568 80173 6078 -8331
19821 -8331 -117093 53802 6604 -62064 43451 49418 126631 -76206 74892 122705 -1824
19810 -1824 15088 261449 295852 178153 4973 13558 93049 224566 191913 -14624 -42374
19799 -42374 -57844 42510 93221 -60126 -87298 -82496 -156274 -167551 -111097 -29280 -27399 -108528
19787 -108528 33594 195452 270707 362756 454804 357996 177534 160624 8102 -83981 -27587
19776 -27587 -59142 -23932 -94749 89783 225782 210909 124308 145301 250022 240057 68367
19765 68367 654 81033 150472 174328 4396 -47368 -108720 -196163 -156970 -161741 -153283 147694
19753 147694 312834 254224 244599 183185 148995 97525 -7215 71582 156711 79627 -109895
19742 -109895 -138709 -44109 94975 214664 229305 -13511 -178553 -134163 59128 153010
19732 153010 328887 314500 208792 217093 125302 4129 16187 41374 188886 151787 150676
19721 150676 102398 170273 125793 234430 298618 146868 -47884 -76377 -7903 82360 172042
19710 172042 172349 148359 95153 113544 288875 281203 131839 55 226027 389926 381794
19699 381794 234601 112210 102784 40983 -19483 70359 249561 77123 -38593 -131865 -80655
19688 -80655 138154 75154 -8506 204832 181945 318528 276013 303909 309757 285516 320306
19677 320306 204974 181141 275472 297909 445953 379997 292313 306916 333793 97410 -46288
19666 -46288 -93935 -57205 105167 181943 247005 533970 507387 351409 237136 78354 -44800
19655 -44800 32212 97907 131468 171974 252790 206429 35626 -7374 129826 277497 203597
19644 203597 105724 128941 207989 374150 250732 154854 39248 30872 134284 321603 301662
19633 301662 62394 57979 188622 364809 396623 256999 22292 -114479 -112062 -101353 -57018
19622 -57018 -16436 -116576 55956 145481 171924 201708 211669 257694 382095 438427 619459
19611 619459 728365 542208 283929 215695 479782 574555 394176 430089 671594 554507
19601 554507 479000 477285 418439 346016 397519 427601 216481 315347 559144 658212 722351
19590 722351 936959 1078691 1029949 957756 946899 703406 718711 704364 729298 977522 1077809
19579 1077809 1103982 1180346 1174988 1208911 1500172 1479600 1573245 1761993 1873475 2153492 2541581
19568 2541581 2897012 3207907 3728473 4326835 4612148 4763154 4867384 5075465 5556778
19559 5556778 6450570 7913285 10268721 13500556 17995170 22949804 25919727 25234713
19551 25234713 22462098 19734629 18015861 17042077 16723785 17130385 18520289 20943508
19543 20943508 24502399 30063898 38771881 52153478 73461944 107797001 158898090
19536 158898090 215112952 242713192 232464450 202395707 165388468 128681359 98457996
19529 98457996 76788141 62911658 55507071 53154804 55220657 61522351 70016223 74911139
19521 74911139 70902527 60030817 47626452 37070644 28967665 23281124 19485799 16696926
19513 16696926 14839740 13812956 13097353 12750262 12735248 12611240 12542659 12160952 11817533
19504 11817533 11702731 11645120 11999725 12718675 13669879 15142737 17432887 20505477 24987039
19495 24987039 31653116 41568375 54880741 67818321 73544870 70274263 62496214 55363581
19487 55363581 51682117 51783357 56582461 67493927 86493926 115797127 153627702 195624593
19479 195624593 238890635 265780032 248141500 197791778 144457030 102317145 73755244
19472 73755244 55192895 43020848 34874266 29271919 25489863 22992135 21373695 20653408
19464 20653408 21087536 22742905 25484644 28786295 29920703 27135313 22415731 17619773
19456 17619773 13655690 10979169 9145945 7903985 6988939 6370960 6052432 5645200 5420652
19447 5420652 5183664 4595715 3909609 3243725 2835701 2596422 2352776 2082505 1939001
19438 1939001 2077286 2056529 1821282 1898769 1845279 1637143 1628379 1684905 1716601 1546282 1545421
19427 1545421 1444172 1311968 1047798 1001286 978544 960619 868431 909179 863128 792549 717262
19416 717262 550956 541541 580864 610986 656420 601102 406294 437151 588649 765795 777683
19405 777683 821628 764598 777876 792654 832470 892382 909183 892923 712734 560338 488752
19394 488752 382504 204714 215559 383810 403044 452414 421371 477955 583798 420158
19384 420158 368096 361372 445518 530267 494833 455203 449768 272710 472476 458645 356950
19373 356950 496081 496922 394152 345869 412220 405800 670538 776487 767444 694535 694329 647740
19361 647740 641636 593646 629209 634982 658802 765599 942865 1069410 1553254 2314794 3339327
19350 3339327 4610633 5437560 5545731 4947427 4111348 3448634 2876433 2381015 2177441
19341 2177441 1999744 1710530 1455390 1586608 1735833 1840951 1843364 1717569 1385114 1128805
19331 1128805 886696 669862 532076 507988 577944 547605 619971 702459 416849 224969
19321 224969 167449 282102 290231 205124 190490 225772 279467 236793 280202 449117 626517
19310 626517 737248 1002189 1416481 1674815 1832283 1812608 1626393 1602091 1345846 1120691
19300 1120691 1218649 1517669 1821562 2275710 2962361 3706774 4526649 5725752 6384828
19291 6384828 5897343 4772580 3519583 2466605 1831265 1442393 1118513 984254 867516
19282 867516 672160 434952 420527 409134 468282 564052 522124 632049 824965 699791
19272 699791 453142 172962 78778 62607 84180 164023 144694 309643 233760 77413 -74623
19261 -74623 -106266 225481 336913 347117 344910 230360 172890 90331 31259 -54806 81213
19250 81213 -25952 24795 142640 63048 -9 -24411 85478 57922 51598 73294 124005
19239 124005 325555 429423 344451 140075 34555 -18836 -94105 -39308 -32284 123643 201160
19228 201160 287934 251659 76062 37378 132143 244903 269502 96975 -62216 -17191 20847
19217 20847 97152 134153 159268 221191 191306 163516 168799 115939 115578 250807 408550 271275
19205 271275 185510 53705 10480 75142 178532 425683 396399 378998 410380 386502 238620
19194 238620 211887 142865 35665 -20707 -121693 -201343 -88255 -53195 -143355 -109493 -120270
19183 -120270 -127536 -145109 -225826 -259956 -255721 -176533 -32525 36474 -26119 -92029 -177959 -160269
19171 -160269 45620 187087 131341 40661 132434 322424 355094 286854 174234 35727
19161 35727 42465 4993 -86880 -130537 -36564 -69076 -165430 -229440 -229416 -87534 -109858 -110051 97338
19148 97338 131777 143494 80215 154223 198185 149681 -2851 -54005 95483 181863 201850
19137 201850 128771 59293 216429 233197 77838 55072 156859 83520 19041 21337 65768
19126 65768 -1510 -112085 -107647 -96414 -51399 -108890 -118730 -62655 47387 134170 248503
19115 248503 225873 168448 195087 211615 89760 -112714 -89972 99827 66073 -43640 45669
19104 45669 85936 66022 3611 38441 32201 -63370 -58299 -42630 46871 84482 20295 17799
19092 17799 55345 9431 -8114 -118507 -108970 -64054 68889 127419 78265 15141 -5230
19081 -5230 59175 60407 -55832 47855 166921 135522 285432 278051 196579 212491 15457
19070 15457 -38807 86935 -31170 -245389 -259428 110543 107391 27835 25852 39774 21108
19059 21108 -79140 -134491 -49306 14664 156515 90169 -36365 -23995 88643 119138 70698
19048 70698 -52316 -64998 -92034 -162060 -124089 59396 237836 294824 24864 -48375 168052
19037 168052 273913 223575 193980 253620 302841 326076 287934 239874 349535 393462 152849
19026 152849 122321 264861 368895 517026 500083 473685 463908 468213 331900 394704 346306
19015 346306 329183 259232 232597 373962 450207 297648 214750 310992 378521 397001 77536
19004 77536 -25111 58980 127943 -49143 -108161 123254 306692 308840 304035 447013 366199
18993 366199 234326 138097 -113120 -160090 -172436 -231342 54228 -53210 -178564 -179607 46901
18982 46901 6213 35319 -41150 -273216 -298956 -213265 -73922 -90095 -87530 259736 736655
18971 736655 768662 597274 508960 341300 466282 611400 569928 423288 450149 557087
18961 557087 580268 546241 530205 246331 237842 217741 180451 127505 136495 219258 262765 370686
18949 370686 581311 762974 723211 490965 469189 524941 551957 545159 368781 220039 192745
18938 192745 295985 402714 340031 258751 294117 295453 213503 250567 289576 300495 228380
18927 228380 274969 427660 407853 343372 350796 285662 276304 222963 67784 -109592 -4228
18916 -4228 -9247 -131960 51390 13444 -159567 -139136 -61598 75602 88840 24033 -200814
18905 -200814 -175556 -108549 -113417 82133 217305 39687 -14354 -13147 186563 193202 314770
18894 314770 196792 -55781 -233583 -109306 14027 31992 15529 -88133 -123476 -56316
18884 -56316 -107945 -119120 22445 -85572 -34238 38902 -5652 -184708 -10331 135389 168273
18873 168273 114960 98482 111153 129210 76180 344195 437708 310606 272606 97846 4482
18862 4482 -38877 -90522 -326786 -313899 -156615 -87245 -53597 -131715 -171232 -36824 -12450
18851 -12450 -90699 -16907 -137786 11626 -213300 -238643 -57164 -6939 109208 170306 13264
18840 13264 -108882 -96147 50351 107723 102569 13926 -179275 -328432 -375089 -306039 -212541
18829 -212541 -84184 -19914 53330 -52810 -112235 1445 43457 -91902 -55459 -64484 -106659
18818 -106659 72232 116921 -41797 44352 -7476 16621 13704 61977 86060 3201 9415
18807 9415 -52059 -55467 -158793 -217588 -104266 58752 71957 118395 126586 4416 -130908
18796 -130908 -43815 77518 -65881 -157622 -91056 -453 91057 69168 107655 37648 44024
18785 44024 219833 98875 159724 138871 32545 40290 19251 34257 -46806 -59102 -2624
18774 -2624 107644 122593 197044 465648 671806 780902 1075944 1793084 2249984 1862891
18764 1862891 1348144 983796 589751 521905 403211 197593 68470 -111732 -151184 79097
18754 79097 133163 44385 -62304 -72785 -80399 70641 22155 -5897 174869 145040 43709
18743 43709 34545 23675 93034 163000 124713 49187 116817 21745 -94896 -144376 -273615
18732 -273615 -257342 -230375 -247363 -207861 -172489 -90934 -24586 -54367 -8882 -126567 27199
18721 27199 271640 149197 -135294 -294507 -290432 -131490 15995 178639 130463 212035
18711 212035 225637 166601 200238 201499 141492 95223 118865 294289 299584 298479 220837 54735
18699 54735 -21606 374 -166153 -231877 -238473 -221187 -102409 -62345 66983 85602 -95567
18688 -95567 -275263 -286347 -325562 -307309 -302393 -341876 -402573 -384248 -245350 -277063 -110751
18677 -110751 -63606 -255713 -461955 -502762 -306582 -188845 -193324 -161883 -117460 -74184 17162
18666 17162 59070 85905 106334 159301 54868 -52804 -79455 -251526 -166503 -92642 15770
18655 15770 178009 244487 275028 326139 330515 427983 543564 662418 803622 790741 607972
18644 607972 652407 693387 466890 230747 146912 47983 -33156 -6524 -113505 14297 -19602
18633 -19602 125727 170384 130524 102644 143145 218064 179678 285232 132005 126365 326078
18622 326078 411616 440462 191038 -71016 -65226 -97604 -179273 -100366 -111782 88840 333132
18611 333132 294396 298326 272664 129367 166924 146669 78343 154943 254584 255357 125687 -16074
18599 -16074 3735 192820 278844 412694 510121 776854 980753 1209593 1429141 1321695
18589 1321695 986750 599109 346082 188027 15065 -101077 -10004 -62232 -121024 -108079
18579 -108079 -55246 -181835 -273276 -289959 -242635 -136163 -152556 -199548 -192151 -109832 -89517
18568 -89517 -80459 -116989 -161178 -239056 -216382 -111122 -175849 -115802 -112824 -173230 -160391 -75513
18556 -75513 -34352 58630 -95077 -232548 -104802 26295 13398 -28598 -24494 6927 137158
18545 137158 48945 30947 76193 -9997 60297 117365 201312 184303 184687 307182 355462 78438
18533 78438 77657 175836 213141 252832 240159 309533 171929 -97790 65168 246443 258235
18522 258235 146942 62585 192131 158638 96218 49535 -173883 -179249 -18971 85807 120521
18511 120521 235215 295089 272079 -5833 -32775 63521 139304 57482 159942 148165 84738
18500 84738 15099 120815 287229 313441 34532 -111590 -158993 -197629 -60100 -66548 -352
18489 -352 95271 91092 130463 78547 -60127 19815 43688 41875 -4244 -150160 -186965 25406
18477 25406 717 -60001 -115064 40467 -60024 -162091 -216025 -142182 -208017 -94673 -125267
18466 -125267 56253 91008 192332 208781 46320 15929 34893 151425 149885 18344 -47947
18455 -47947 -89653 -54324 -124423 -63218 40998 82952 164438 98119 120797 206618 347658
18444 347658 337075 368420 212597 339624 341014 202967 118943 127500 70367 -19558 -121545
18433 -121545 -4857 17614 -43876 -28713 39140 168615 142968 131853 261248 150165 94230
18422 94230 89667 72869 -42134 -85375 -161676 -183954 -194021 -114060 91002 166064 169064 89493
18410 89493 108212 26915 -124447 -103241 -151847 -88388 -49813 16398 106045 50556 -87515
18399 -87515 -139990 -29313 6976 150936 73160 212784 264986 -6262 -223863 -156527 -28747
18388 -28747 49877 239303 313926 83248 -160606 -168249 -41520 -79127 72201 -80217 -53415
18377 -53415 97192 157281 154827 220622 167200 -23212 88302 258059 324977 150012 -47347
18366 -47347 -104248 -293790 -265003 -100073 191873 537901 566440 398472 102040 10945
18356 10945 73499 196018 -19775 -90725 32910 353741 555425 537297 398253 378002
18346 378002 360596 377600 83269 -16373 23556 161534 337594 340200 287169 396403 271252
18335 271252 174737 143691 -18567 -93581 6223 73579 -66042 -74397 2993 45883 32338
18324 32338 -2845 -54627 -240512 -77898 136521 260151 295742 313195 202993 209391 367890
18313 367890 276134 164094 203785 84630 28470 -17387 -73142 -39781 -18173 -133836 5874
18302 5874 -11123 -118363 -183596 -77512 109285 102775 154589 139036 23485 50137 47360
18291 47360 98548 163341 108573 -16194 -67452 18339 173287 192430 59326 -128139 -349614
18280 -349614 -174761 93189 295234 214618 27131 75103 279526 294356 165131 238883
18270 238883 394667 591729 666928 539767 511934 458819 602056 463222 438726 425062
18260 425062 525427 539850 551712 531975 590797 576581 509830 427782 424552 527730 440225
18249 440225 390592 565859 700146 663934 547106 548482 593042 512464 567323 512730 313957
18238 313957 346945 584236 646341 649446 683655 546640 446851 387434 339234 289735 290634 227901
18226 227901 258495 274473 215175 15675 -81694 103793 152493 9043 116891 229918
18216 229918 289353 437536 488300 334337 359273 356011 459568 536309 651660 792860 1064155
18205 1064155 1172999 989702 942174 803397 727195 717401 889917 850217 774308 844335 1014940
18194 1014940 1077681 968179 826288 951153 850334 647426 509770 428717 504669 428371
18184 428371 433649 529339 779650 587627 315851 311884 528358 580139 603844 450024 344514
18173 344514 374848 260620 223571 215761 151619 226621 266756 436292 489782 438975 419383
18162 419383 304540 299702 312386 133153 216438 361330 370827 382362 537078 686187 645207
18151 645207 694860 628302 636395 575116 624723 524455 561871 666282 678208 741021 919136
18140 919136 1018021 1165698 1230829 1285069 1564010 1736670 1691880 1530864 1687440 1969734
18130 1969734 2345188 2599367 2727281 3008441 3229568 3533371 4120743 4998511 5847426
18121 5847426 7087071 8417671 9707925 11367131 14061711 18157820 24040166 32865529
18113 32865529 46716163 69664514 110580463 184928695 305513767 385151962 330628067
18106 330628067 233995063 150622871 96234030 65657863 47660111 36139493 28220729
18099 28220729 22528575 18433115 15307813 12801958 10823132 9309302 8003618 7137815
18091 7137815 6527703 5850542 5074949 4251658 3872130 3511362 3211659 2964138 2609904
18082 2609904 2290427 2153814 1939163 1737414 1664209 1668580 1669701 1416979 1311902 1239790
18072 1239790 1275808 1235356 1048568 961505 1092408 1031900 766919 753258 834513 862443 837441
18061 837441 903117 960697 875470 696759 610887 563346 645061 700522 631910 752988 698173
18050 698173 629242 583810 589712 562899 456223 296286 239233 155221 241372 448945 415647
18039 415647 328705 346188 239941 270349 309381 143129 201592 164600 201267 248920 296224
18028 296224 355795 317637 259867 85658 95150 68987 73800 101750 144033 183494 223463 398468
18016 398468 280371 341306 302005 184446 40397 -80130 -242523 -276031 -268977 -172640 -92091
18005 -92091 66175 112794 296597 367104 339995 207556 157786 251250 237974 159710 169269
17994 169269 298477 181312 20467 51037 150306 215905 170755 137965 290095 282363 268522
17983 268522 69771 -70443 -15675 8682 71691 386852 589008 520888 348184 167074
17973 167074 62169 65713 254611 268096 191632 108544 165254 210841 177393 205138 174496
17962 174496 305489 307036 92838 54662 208280 283542 291778 238547 341704 327010 271852
17951 271852 113003 2163 -49310 -177410 -77132 121820 153481 255908 185596 43132
17941 43132 25550 243332 203004 47211 -38068 172564 225691 224764 261237 283823 190544
17930 190544 81913 144121 116041 44467 25993 -33804 -130723 -28766 69248 149505 163979
17919 163979 120922 90533 154402 104029 -72630 -98449 168591 146990 185045 246725 200138
17908 200138 42802 -68845 -261124 -257729 -156257 -263877 -325372 -132136 77304 177329
17898 177329 33393 -97372 -73486 -190571 -173558 -111229 31300 88045 30136 64954 94576
17887 94576 80542 -11054 -58612 -86618 -91222 34926 14862 -122235 -58011 162975 434299
17876 434299 531305 467394 516902 575981 704069 435233 194991 238251 335629 365443 334146
17865 334146 341848 513962 479439 544367 660645 434399 213470 84275 65795 266612
17855 266612 417465 322455 184252 156799 372588 466050 388684 323862 468200 418174 401191
17844 401191 237646 127332 77572 52427 187618 288487 456540 492035 490829 561204 559514
17833 559514 497025 431995 259639 179933 233824 348603 260491 288924 250720 276168 340782
17822 340782 422344 368331 237168 313885 320352 255177 317564 490691 699632 736279 669481
17811 669481 514337 363995 493353 530622 554242 597843 534687 670011 760134 874775
17801 874775 797296 768211 753341 778559 901040 682686 535208 569344 683854 721462 730831
17790 730831 987800 1181479 1380176 1448910 1612424 1601431 1490105 1629689 1694022 1736178
17780 1736178 2014145 2229221 2418077 2714834 3016740 3348626 3729535 4185186 4974459
17771 4974459 5872140 6897342 7941126 9531319 11923890 14982984 19082257 23374761
17763 23374761 25723010 25619033 23494174 21012726 19128291 18215772 18372945 19257385 21193386
17754 21193386 24574658 29496700 36523973 46768548 62445994 87410537 125504766
17747 125504766 174791621 219341130 241972125 236695547 209766300 173740472 138294412
17740 138294412 108506737 86298686 71458132 62891106 59443520 60492312 65042953
17733 65042953 70534969 73210142 70410954 62002868 50856405 40382897 31890920 25809819
17725 25809819 21515093 18615983 16840117 15488014 14553050 13552915 12613119 11949071
17717 11949071 11495481 11139275 11059817 11265063 11721351 12039319 12577398 13445906 14945277
17708 14945277 17065687 20220508 24754604 31369879 40431110 51197457 60922179 66255120
17700 66255120 65907599 61388191 56326637 53388899 53972427 59126509 69976003 87559536
17692 87559536 112638105 144462422 180393756 213209216 230112006 221694384 188193662
17685 188193662 144169305 105423444 77019941 57675791 45191823 37134416 31381574
17678 31381574 27044779 23720964 21449385 20236545 19920105 20801686 22842320 25040512
17670 25040512 26124757 25186065 22055029 18066088 14520535 11913893 10278749 9093351
17662 9093351 8120530 7117025 6425645 5799565 5143701 4524116 4189118 3764007 3371895
17653 3371895 3086313 2832046 3017215 3201756 3448690 3577575 3611618 3452926 3377631 3662117
17643 3662117 3987372 4353983 4983557 5929275 6658177 6760655 6441805 5934030 5095357
17634 5095357 4343483 3727049 3103909 2625912 2317157 2158730 2187554 2394123 2418319 2385751
17624 2385751 2351784 2192860 2008297 1726334 1519256 1295475 1111161 1130747 1163516 1149043
17614 1149043 1097203 900428 1085969 1105791 1066786 1150078 1322689 1357903 1457335 1537546 1480823
17603 1480823 1370713 1354686 1345338 1318975 1381567 1512083 1742907 2074635 2331357 2556682
17593 2556682 2655612 2732542 2734418 2716012 2644997 2683612 2717050 3159828 3585223 4198975 5015358
17582 5015358 5334855 5415687 4947961 4128982 2992619 2090182 1575570 1208145 1250645 1232931
17572 1232931 1044301 837669 738938 733136 809395 707257 631135 645922 828921 803940 582683
17561 582683 463246 403722 415792 667025 777735 817514 784737 555572 503432 352636
17551 352636 334346 219726 92940 11635 -16214 104468 120716 80937 83346 -11338 1192
17540 1192 142735 84493 67322 61334 48496 176006 210385 150492 426473 350563 276312
17529 276312 476118 519232 319687 270992 425412 325884 169292 194820 349184 408980
17519 408980 356922 179165 73271 -49506 98383 178886 44817 41269 38209 -17227 64816
17508 64816 45717 120658 94835 155557 273123 211471 116685 238124 251255 241724 337551
17497 337551 244939 65927 74261 -35809 -17263 -9414 14183 123108 261826 197758 105318
17486 105318 257509 316194 102815 149624 346668 333474 372811 285625 156760 30569
17476 30569 -1165 103226 244872 236871 118554 257493 117112 53193 26264 -13314 135886
17465 135886 59892 152320 151457 32264 41386 63370 37540 -64653 -192374 -96027 29872
17454 29872 31809 -2926 -55603 29639 181344 311139 319043 331725 360617 376395 673317
17443 673317 1352115 1848044 1695999 1304399 942285 629201 515728 463656 301845 238146
17433 238146 286123 288599 175258 232937 140864 100062 39950 -17467 25528 74815 -60441
17422 -60441 -38511 -93557 -146069 -94752 -135036 -90232 -174864 -186752 -274617 -298903 -151424
17411 -151424 -107096 -178889 -55121 46096 93870 -9528 -17645 -87646 -245287 -158563 -2193
17400 -2193 -140294 -55783 50930 66950 40794 -145024 -289068 -205277 -152809 116806 278804
17389 278804 237109 163224 157591 -22758 -14866 192168 188319 57546 -29147 -113346 -242508
17378 -242508 -296766 -276178 -301650 -123703 -56334 44727 130052 147327 267565 191378 299101
17367 299101 197844 -12928 -129018 -18809 87627 57032 -79453 -108701 -84440 -497
17357 -497 179008 142738 -63634 -144320 -209056 -217522 -271148 -294204 -181703 -165813 -205727 -201474
17345 -201474 -316309 -319988 -241034 -206872 -207215 -127207 41697 82917 205301 -22434 -201507
17334 -201507 -168154 -158244 -192082 -170576 -222098 -103024 -24124 -105224 6265 102611 88872
17323 88872 160841 309151 174413 -30497 12557 100445 164522 178276 23995 16561 80114
17312 80114 80500 143675 114048 149177 206769 174876 286642 264512 328358 324305 398489 255241
17300 255241 124832 55168 -11660 50176 94286 59486 75736 94567 -46846 104345 168499
17289 168499 90105 186880 131635 84389 196855 147964 81861 73066 48785 -10992 -85896
17278 -85896 -29454 78045 96953 139324 57228 7483 -6555 -160352 -266866 -298544 -272267
17267 -272267 -113821 136233 -4013 -272270 -159495 -49563 -15981 98834 -100248 -116771
17257 -116771 -136894 -98784 137394 252665 345383 357824 172456 23946 -83592 -3989
17247 -3989 85659 295801 474382 675729 674096 528839 545216 643375 660069 653470 725670
17236 725670 763347 775404 686990 418871 326523 274794 270058 352700 306930 369265 454814
17225 454814 488859 419945 372677 301798 262177 394178 454384 485662 416718 117459 -110777
17214 -110777 -147428 -61552 56434 62573 11953 -13822 249393 416500 305482 362409 276593
17203 276593 92447 90434 75403 120783 66083 -45989 2105 111854 104209 -63880 25508
17192 25508 -69828 -90580 99407 143426 273122 417293 543125 549001 645918 592711 453177
17181 453177 537868 550293 750150 744414 412989 202061 121549 69890 102486 116597 243508
17170 243508 179831 208265 262603 223310 445738 451302 488638 562430 550986 477672 463746
17159 463746 323974 213708 159814 206190 171456 50683 -25587 -21879 70895 98703 144966
17148 144966 141148 180703 114517 53580 -56405 -54101 -2192 27638 -75132 -149499 -236783
17137 -236783 -100201 68949 203815 358474 340613 77565 -46858 -164657 -94364 49421
17127 49421 105355 87168 34691 50126 44409 -23971 -51935 -88230 -77851 -99923 -107488 -47421
17115 -47421 -6712 74817 111072 97741 60687 111088 151068 60503 97505 214382 104989
17104 104989 -40120 -79725 28835 45369 -57335 -117523 28756 185330 105063 -45007
17094 -45007 -288757 -351932 -127535 204416 316089 400687 288985 124025 71157 50846
17084 50846 108475 254956 208459 218491 252547 163557 68562 -76432 -82126 -36382 120741
17073 120741 187581 212323 190439 66968 -14371 109505 33840 8649 -2657 105116 126473
17062 126473 84752 100140 -54344 -151338 -95371 10899 -38113 -116384 -147600 -118430 -47078
17051 -47078 -66005 103292 87169 101279 240516 200803 121248 87461 -129392 -193307 -235328
17040 -235328 -281309 -192542 -177149 -236716 -241552 -151725 -68888 -31335 6337 -109633 -138545
17029 -138545 65872 219721 151606 141553 13605 42521 22777 69836 149795 95709 206461
17018 206461 208236 278882 271389 198841 -88118 -164409 -218084 -260776 -212273 -1619 167766
17007 167766 139773 61324 184111 136539 246847 287886 274699 147514 43729 -150686
16997 -150686 -13464 -26225 -60689 -60102 -1247 28684 79319 126284 28636 20156 -44141 -103483
16985 -103483 -122863 -213525 -98763 40719 102699 39010 6147 -91839 -62757 -132748 -315767
16974 -315767 -202857 57474 69355 -33592 -230369 -249826 -265231 -216218 -136315 -33260
16964 -33260 21333 197077 136983 90457 87549 90912 56899 53246 88145 -1626 39164 -90345
16952 -90345 -226125 -42872 47089 -141178 -319194 -215672 45338 113637 118305 102047 -40546
16941 -40546 -86555 -104494 10487 3785 -68189 -125155 -89952 31834 52080 -61660 -116636
16930 -116636 -97879 -36979 -53376 9432 38254 -66547 -194448 -167229 -123226 -181866 -103582
16919 -103582 -172267 -197478 -75452 -297242 -357268 -330380 -288921 -237362 -184926 -109893 -110881
16908 -110881 -257325 -286003 -291564 -276367 -16656 214111 178736 -22497 -30262 -119 26820
16897 26820 9368 182886 215667 61709 47393 16592 -124038 -123347 -107326 -99292 -51666 -62895
16885 -62895 117750 44620 -98897 -32300 -46344 -137188 -378381 -484725 -353438 -121017
16875 -121017 -87656 -146056 -102146 -188988 -190503 -251946 -103915 -118658 -300958 -350069 -310774
16864 -310774 -271547 -147347 -178508 -106141 517 -42634 -100213 -64288 3878 124155 -670
16853 -670 -138112 -164323 -153353 -216565 -52114 -186582 -205667 -194503 -135609 -137628 -60910 -158207
16841 -158207 -193912 -265093 -254666 -262224 -36475 -28873 -132861 -172212 -157286 -147121 -130374
16830 -130374 -133584 -205085 -199961 -175547 -42903 116106 -84483 -199504 -219933 -54868 -34032
16819 -34032 -17446 92948 188545 97136 -40774 -84841 -119312 -113136 -77257 -21909 -12326 -14358
16807 -14358 -20604 -147271 -92314 140528 72779 -31292 -23806 -4180 -75542 -150746 -41434
16796 -41434 28401 79359 84122 198993 135010 40832 31304 -45914 4738 -79341 -132301 -164567
16784 -164567 -219316 -137122 -181557 -211026 -97653 13044 9041 -7927 33297 194550 108250
16773 108250 -155228 -76425 60456 138984 49040 81968 -174721 -281562 -254255 -234237 -134427
16762 -134427 -181479 -288403 -230833 -84840 121399 250132 116774 -32206 -99243 -64967
16752 -64967 -97022 -47497 -114796 -198073 -102759 -139448 -173393 -137513 -22721 75227 -65159
16741 -65159 -93013 81357 76376 50686 74774 -88621 -232493 -112340 19578 -121598 -241865
16730 -241865 -194549 -55860 -202230 -356350 -309965 -120929 49186 219636 187183 31706
16720 31706 -66161 -125312 -26371 8292 -95868 -191818 -9364 269533 187308 6505 -75103
16709 -75103 20245 3439 84927 72407 -6902 -95544 -137571 -209798 -381600 -356191 -270856
16698 -270856 -313769 -287412 -359220 -197252 -134747 23348 89184 -57519 -61524 145174 161432
16687 161432 -65544 -113819 11963 367659 222941 -54204 -226142 -242717 -191212 -212698
16677 -212698 -244331 -366849 -282478 -131031 -45665 -69901 -43511 -31792 -38039 47729 6436
16666 6436 -123881 -186003 -265136 -282943 -232649 -319564 -233033 -138124 -139566 -143077 -55937 -100059
16654 -100059 -156141 -54347 111100 50355 -14925 16194 -6370 -5045 -50826 -106679 -41296
16643 -41296 63235 -30723 -17176 46593 -34020 41641 80329 79060 25370 31722 -216864 -245321
16631 -245321 -110295 -59506 28255 136300 139253 168846 33210 -143057 -331338 -385525 -268772
16620 -268772 -230773 -124686 -102520 -175997 -280326 -279231 -143249 3686 109473 99768 -35701
16609 -35701 -126715 -175522 -179186 -151316 -221460 -123344 -11796 -52038 -8852 22284 -20558 17671
16597 17671 64910 -85548 -39373 -81056 -40540 63683 -39270 33991 194419 121988 -68128
16586 -68128 -224904 -294404 -483403 -429671 -429633 -295836 -315931 -316788 -134862 -12992 -53614 -30910
16574 -30910 -29323 -50905 -118824 -251713 -255627 -146514 -112825 -306185 -340091 -216470 -218558
16563 -218558 -156906 -51852 -150164 -163435 -46673 -15747 -115892 8073 151690 175348
16553 175348 203210 -5182 -74130 -117408 -45799 -36106 32087 -7452 65148 195658 256274
16542 256274 129226 206533 109554 -226958 -181810 -21807 180656 168208 -69309 -230690
16532 -230690 -207826 -201895 -103480 -101972 -232476 -318473 -292314 -190218 -123134 -139508 -37115
16521 -37115 12658 -66628 -107711 -81547 -249630 -333244 -356689 -348852 -206977 -147921 -275281
16510 -275281 -427281 -361662 -173227 -154053 -86859 -78347 -6758 13765 -44818 -196080 -414969
16499 -414969 -365161 -241469 -132941 -7196 -55109 -53831 85869 68837 -112800 -156310 -21032
16488 -21032 19733 124749 142 -253331 -186358 31632 162 124322 54757 -101684
16478 -101684 -42088 -51773 5513 100760 111805 4635 -33092 -84338 -146253 -69674 -28339
16467 -28339 -223771 -337689 -157009 -180316 -77275 -25486 -142440 -299457 -223221 -29605
16457 -29605 -30175 17242 -98017 -54957 -36626 -24256 1294 -65588 -115203 8654 -124767
16446 -124767 -422138 -381325 -381922 -180819 -62190 4053 -103235 -132119 10460 3214 -85567
16435 -85567 31600 49482 20720 31100 62018 -25363 27537 12199 -133254 -313692 -237278
16424 -237278 -52132 -94554 25810 37495 -82606 -362649 -418641 -196177 16147 -23287
16414 -23287 -186005 -94881 57313 -85275 -130376 -184354 -107913 51908 38195 -86850 -35083
16403 -35083 83397 84926 209616 129631 60412 17189 -43540 65615 147391 22949 -91315
16392 -91315 -69257 31480 101480 123877 -79617 -84842 -118804 -27224 -129684 -257657 -115996
16381 -115996 -49898 -51490 -58918 -26973 -44196 -61558 -54394 -161378 -205505 -87332 35335
16370 35335 139829 227885 128458 -122209 -138696 -233786 -195932 33011 55005 21939 -12696
16359 -12696 13583 64264 -11704 58404 30142 -81167 -72207 28347 33535 -70298 -181760
16348 -181760 -218777 -227584 -204230 -59494 -167016 -279097 -64111 186319 131795 2576
16338 2576 -35320 -248618 -231050 -1920 -104122 -235873 -172896 -54162 -90525 -219509 -214231
16327 -214231 -4748 -124805 -201325 -211036 -57080 98837 16921 -44667 121885 82443 52208
16316 52208 73993 104519 207933 140120 154000 88714 -157623 -193867 -148340 -133681 -98441
16305 -98441 -104549 -132110 -42249 47803 -12315 -41548 -60107 8306 81861 210863 206034 27285
16293 27285 156944 246959 338809 117680 8961 78718 218945 205464 42888 72324 -29653
16282 -29653 -190765 -122345 -78257 56381 47594 186953 124991 -89540 -159679 -116042 13088
16271 13088 86189 48352 21393 -78665 -132547 24047 75689 -108813 -278837 -341886 -114987
16260 -114987 -111277 -36743 -6222 13127 16456 -4532 60485 82654 115847 76282 135246 -50186
16248 -50186 -64466 -86689 13673 -8065 -26086 -102371 -299512 -391789 -328008 -285396 -192766
16237 -192766 -265122 -139988 167706 209966 164555 61346 70808 69576 235954 181277 271967
16226 271967 177691 200803 266083 73862 -75232 -42369 -95812 -260087 -321072 -185494 -22754
16215 -22754 -180072 -414340 -338839 -168925 -53134 -84766 -209086 -327437 -205914 -36781
16205 -36781 184513 303183 353792 290109 229735 231496 299405 258966 180467 96553 24211
16194 24211 170965 143613 -24652 -108159 -5427 -63810 -33574 -71944 37620 129334 73453
16183 73453 -28574 -66057 23834 143376 -97007 -306171 -250481 -101347 -30975 -209370
16173 -209370 -444393 -328339 -182414 -58150 -41517 -118652 -83534 -73807 -153226 -124608 -83210
16162 -83210 -69706 -111508 -43246 -73226 -95343 -136467 -350445 -407199 -275310 -126150 -117927
16151 -117927 -197011 -106251 126436 184912 79085 12354 54992 72273 107606 44678 -77351
16140 -77351 -55171 -72686 -58438 -97036 -136871 -111474 -43871 -249174 -231218 -85132 -149760
16129 -149760 -175596 -139234 -247327 -157876 -154374 -161939 155472 237573 206961 201946 48504
16118 48504 73738 136433 117914 99697 11552 -47533 -137162 -156789 -228316 -132334 -247491
16107 -247491 -344347 -311102 -92478 97450 199658 94331 -20308 -13670 61538 -103229
16097 -103229 -97407 66841 15707 -123964 -310339 -356304 -288007 -56746 8755 5440 -50519
16086 -50519 -164912 -192575 -114101 -64581 -203417 -318516 -268794 -165624 -152034 -172038 -232682
16075 -232682 -195171 -86304 -114315 -222312 -91731 -12519 -5991 -109769 -126594 -262560 -208713
16064 -208713 -223248 -268118 -184008 -32107 -39697 -74988 -203941 -246123 -135408 -213271 -305621
16053 -305621 -53934 -96177 -287644 -211280 -215423 -194389 -18987 10596 176039 267028 180322
16042 180322 120429 93150 -69352 -161537 -160045 34781 102479 38961 25347 99925 161317
16031 161317 20687 -81391 -159522 -194752 -89408 -129089 -69986 -9452 87713 91737 79761
16020 79761 54931 16305 -101385 -1922 -5448 -52249 -105640 -19827 -25836 -55935 -158892 -279692
16008 -279692 -202411 -62206 46140 336837 358800 258979 283585 110115 -147111 -223545
15998 -223545 -222790 -130119 6842 14804 -51294 -97267 -121756 -269691 -198178 -151429 -43244
15987 -43244 -63310 -145424 -189596 -51213 -127954 -173376 -77191 -229240 -169412 -18989 -91140
15976 -91140 -142290 -63107 59773 20907 89291 97099 132596 39474 79452 89313 1685 -159059
15964 -159059 25090 46496 231431 94724 45952 49716 -143446 -236419 -118371 38970
15954 38970 -35500 -242890 -415897 -314710 -171217 -185496 -15861 78939 -101999 -149318
15944 -149318 -162762 -247126 -142903 -210036 -108076 1779 65196 18920 31176 10854 116112
15933 116112 246413 133041 -31698 -50953 -60156 -157668 -303152 -358648 -202258 -67854
15923 -67854 -13830 69450 29176 -17010 -36710 -16127 161769 164961 173483 157313 -74150 -310509
15911 -310509 -225086 -246610 -429730 -293757 -222506 -242699 -190820 -21089 -30254 -6993 -50756
15900 -50756 23182 30986 87009 -124085 -335947 -374049 -137809 -15678 1957 -97799 -281677
15889 -281677 -187663 -61390 -199452 -225809 -234090 -311452 -467895 -383153 -146658 -50836 -80542
15878 -80542 -13761 45139 49595 -36048 -33010 -78026 -86007 71168 116898 -44332 -206745 -346750
15866 -346750 -394169 -270369 -10566 207561 200561 -43025 -192760 -346171 -289616 -175904
15856 -175904 -67069 -22769 27307 53631 77356 62256 -46284 66089 252970 129924
15846 129924 -5964 -54519 -55483 7936 -97647 -63529 -42296 5093 8108 98545 155517 4300
15834 4300 -57016 161870 155039 143406 226134 201260 378109 390815 286847 196320 114212
15823 114212 -171498 -57086 21690 -32544 -74406 -31868 -171152 -172061 -210759 -260662 -270449
15812 -270449 -219606 -140773 -243625 -356377 -348780 -234302 -179620 -347950 -410700 -257880 -233873
15801 -233873 -282612 -229039 -34166 -52146 69959 128114 238814 259361 169958 68610 23764
15790 23764 -21844 16757 148767 12204 -24824 -67229 -208334 -292188 -218309 -125439 -13353
15779 -13353 -14505 10476 -86900 -124524 -308089 -214426 -119145 -53433 -26858 -81159 -265190
15768 -265190 -49089 183699 188798 213948 233023 163127 116232 200107 266491 113653 -55308
15757 -55308 -94368 -8787 -17738 38607 194040 137633 -24172 -117158 -14477 -23253 -112176
15746 -112176 -141092 -99073 112865 64414 -127102 -288255 -239598 -130771 -110756 -68970 20081
15735 20081 -178650 -302564 -237683 -139109 -57306 45144 64897 -245573 -249018 -177026 -122175
15724 -122175 -38815 -53105 -143406 -136987 20913 70558 3445 -138385 -121535 27444 1833
15713 1833 -52114 -269093 -133094 19739 -186767 -145953 91007 54149 -196717 -251675 -164310
15702 -164310 -128640 -130296 57117 64410 -8180 45570 119095 154908 202666 103541 50604 -41421
15690 -41421 -162396 -141249 -172974 -33926 80785 -15547 -92122 -132688 -181526 -74961 -130578
15679 -130578 -287705 -360539 -200598 43364 116398 63379 -151021 -163744 -83932 -122186 -130498
15668 -130498 -130073 -162316 -135919 -32560 -67668 -97505 -101854 -155186 -376411 -269533 -5802
15657 -5802 -180813 -364287 -182200 189546 272296 107192 -133696 -318399 -203389 -115006
15647 -115006 -21635 49092 -98061 -410268 -484216 -260951 -52772 75492 22787 -147746
15637 -147746 -254623 -94943 -20983 -132000 -169903 -156917 -102831 -50214 -33829 73614 68969
15626 68969 98646 146553 113596 71628 -43683 -101649 -76683 -74713 -190042 -145739 -251533
15615 -251533 -144465 22707 137735 219650 36186 -93473 -88011 62713 26095 -53542
15605 -53542 -212443 -367490 -231572 24102 124183 67216 49135 -47866 -46959 -130607 -291072
15594 -291072 -407218 -258821 -180953 -104762 -121942 -300466 -301057 -254975 -279876 -231698 -186756
15583 -186756 -28686 124352 95004 -86876 -165237 -164759 -89988 -179052 -165529 -42953 31010
15572 31010 70911 119133 -111 -247758 -103249 -19607 -105975 -98557 -80511 12225 108277
15561 108277 239902 141344 -6483 -22979 -46418 -61168 78650 116530 -34305 -165394
15551 -165394 -295847 -327920 -208282 -175220 -31034 119355 171189 112718 -22392 -261417
15541 -261417 -365843 -276511 -238666 -140588 -248669 -470262 -351908 -209787 -182023 -105625
15531 -105625 -37044 58604 53802 -137026 -111938 -63913 -222777 -237849 -47901 23564 97711
15520 97711 6020 -75519 -72927 -55422 61920 171491 239131 186780 28660 -4846 -33051
15509 -33051 65100 2074 -238658 -282795 -91741 45244 14501 4080 46478 1072 -75822
15498 -75822 73847 122033 -5871 -185439 -194621 -65140 -66648 -91417 -85282 -104415 -66730
15487 -66730 34483 -131556 -554446 -627030 -556414 -474005 -325173 -128106 68930 -93708
15477 -93708 -254617 -313007 -296077 -133124 -79920 -196449 -212395 -131080 -72006 -82716 -250947
15466 -250947 -301682 -160549 44544 171677 153194 202647 160165 69369 -78292 -125582 -42336
15455 -42336 -72850 -6358 -18380 -161265 -244592 -202490 -130299 -168672 -234526 -260223 -183406
15444 -183406 62381 75865 -23063 -124206 -82336 -67294 14070 -13022 -34880 28734 33195
15433 33195 -115954 -169248 -136111 -109337 -107045 -119597 -189684 -30664 -34026 -9118 13845 -62079
15421 -62079 -141060 -227165 69914 166144 86650 58473 -46982 -107341 -74120 -71398 -191241
15410 -191241 -97389 -32414 -86683 -204965 -226536 -237028 -169781 -248367 -122770 102302 154572
15399 154572 213063 85417 -179350 -193685 -157369 -141502 -196861 -226475 24486 165485 171777
15388 171777 84509 25547 104252 110082 10026 18867 -118436 -158396 -148951 44669 235932
15377 235932 250145 125356 -62225 -135039 -48361 -11753 12770 120340 250914 177794 34391
15366 34391 -119366 791 28776 -69128 -4371 47619 38517 4648 91450 225095 365646
15355 365646 332248 177677 41486 -106122 -67662 57251 61087 213386 141112 90470 71284
15344 71284 131319 214075 227088 114755 -4833 2760 29891 783 -73940 -76924 -94901 -73905
15332 -73905 -10246 -10155 -29672 60440 183669 153304 205259 223104 171026 111066 152666 169841
15320 169841 205778 248156 63126 199498 200568 -71539 -74665 -2910 -47853 -131630 -198091
15309 -198091 -449296 -340583 -315863 -331016 -127684 6292 230569 287751 157585 171179
15299 171179 278505 155259 -101526 -258149 -292555 -228882 -112467 -91879 -228548 -181199
15289 -181199 -100888 -184811 -129221 37730 32482 81247 -4778 -111673 -105697 -49066 -33716
15278 -33716 -105372 -34912 37138 148086 31135 -126793 -276511 -195489 -112168 -194149 -101511
15267 -101511 -98855 -165241 -267807 -288639 -226926 28928 81896 92781 8330 -59142 14677
15256 14677 29337 -50984 -171561 10147 162036 75573 40540 85606 45233 55958 123040
15245 123040 112095 226185 390919 339429 251862 222139 161701 273252 169290 -12628
15235 -12628 -150398 -189492 -28584 -100182 -162906 11016 134236 137536 211715 -16095 -248995
15224 -248995 -236214 -177607 -164773 -61995 -94576 -81044 -71004 51238 77859 22077 95967
15213 95967 -40199 108562 281468 194512 119337 -26434 7687 29312 -74498 47059
15203 47059 217412 262494 150077 45924 39721 -78643 -31485 -65326 -82212 -53421 -149770
15192 -149770 -299018 -418714 -272949 -147051 -10291 -9977 -10959 24608 -131868 -32817 30441
15181 30441 128255 162438 174750 -8843 -123372 -15179 100943 98146 68350 -57940 -183362
15170 -183362 -131157 -25498 -173615 -139246 53108 49011 1056 -43650 32222 87022 -50667
15159 -50667 -104446 -64547 -130666 -235515 -224289 -97860 -56888 -155625 -181965 -160554 -226504
15148 -226504 -119158 -81960 -102417 -174216 -283364 -250491 -133110 11487 -44850 -100908 -227086
15137 -227086 -259468 -186697 -151065 -74625 32960 -151854 -284876 -123747 130579 33017
15127 33017 -26743 60263 14930 64153 156671 68072 -2343 -131180 -98940 -27855 -22359 -137692
15115 -137692 31807 143649 52268 27549 15062 -157263 -130124 -235253 -318452 -255027 -46785
15104 -46785 53582 59137 113629 324985 296130 -48323 -226446 -137218 -55605 -124368 -226398
15093 -226398 -115214 -212947 -377151 -297812 -119937 7160 8486 162413 200363 -38654
15083 -38654 -228290 -263394 -182460 5538 70575 8938 50771 -16882 -169423 -142623 -100568
15072 -100568 -200917 -224484 -243485 -252158 -203952 -24157 -25250 -131747 -198314 -182568 -77122
15061 -77122 11512 -14946 16051 -135221 -367548 -375181 -232112 -65477 -118562 -57986 70014
15050 70014 -63329 -192195 -262798 -127351 -49129 -49577 51621 -45182 -220933 -371654 -375109
15039 -375109 -209618 -26423 134001 38799 -56214 -94085 -88781 21708 -46475 -115389 -168557
15028 -168557 2770 40647 -11165 -150142 -154085 -266213 -295835 3755 97253 59213 70030
15017 70030 33098 -62752 -153609 -201516 -222403 -280108 -216998 -289391 -200015 -255929 -303275 -170909
15005 -170909 -92195 -80762 -55324 -90589 19964 97170 92375 175094 169055 143667 182747 62524
14993 62524 34119 38577 -58640 -239724 -127736 33501 130676 70438 -29786 11176 5626
14982 5626 -43168 -68954 28999 -51281 -199853 6170 82439 48078 90469 -8199 -137049
14971 -137049 -27578 184276 204179 99191 69173 171396 310436 521486 360114 70916
14961 70916 -25858 -107968 -137191 -257931 -295946 -110545 34267 1699 29171 3693 -20556
14950 -20556 26830 107302 134459 10617 -31450 231093 313915 174604 139537 284536 214752
14939 214752 1990 54831 126974 121122 110885 54832 118428 295926 205718 109896 57070
14928 57070 -151257 -162217 -92865 22748 51162 -78568 -63497 108797 107122 199420 191298
14917 191298 -20560 -172511 -247882 -131610 -102806 -83484 -97577 -215077 -130073 -57210 -80648
14906 -80648 -76537 -103009 -303933 -355312 -318528 -212342 -73760 -115866 -241588 -287906 -174740
14895 -174740 -144823 -58841 -30787 -27340 -122509 -125615 -53317 -193679 -212502 -96228 -106771
14884 -106771 -195916 -209328 -145201 -190647 -174967 -178522 -254035 -291893 26428 125004 -26535
14873 -26535 -183991 -215304 -132775 162201 211326 165837 64311 -106412 2741 24251 15705
14862 15705 53599 -27658 47490 3304 -39408 27376 36636 87419 96982 33833 -59225 -42921
14850 -42921 19313 -45367 -201745 -101481 -17505 10344 -36346 -3350 2894 -69760 -90733
14839 -90733 -38893 64545 2703 -128349 -114837 9656 -11264 -167937 -239843 -320226 -291324
14828 -291324 -260920 -292432 -458667 -506414 -449178 -437664 -278549 -355158 -214227 -12294 -150365
14817 -150365 -176215 -168728 -112278 39150 2155 -128234 -107838 -261144 -217989 -256934 -168394
14806 -168394 -153520 48403 197160 221392 130632 -23216 52995 126415 175373 175462 90710
14795 90710 134073 135270 115526 98272 28450 90085 16371 -78865 -166175 -177080 50893 69407
14783 69407 75555 188773 216021 194062 84345 73316 72417 48919 -53431 -119281 -179214 -292202
14771 -292202 -262806 -8477 73701 -39774 74271 14395 -122970 -324769 -319973 -79890
14761 -79890 -30950 189241 275289 226308 69692 100152 275078 240132 200658 178487 -84302
14750 -84302 -62735 54417 -10362 -145183 -70311 49520 111479 95274 -58193 -62203 -12237
14739 -12237 14674 -193271 -328407 -379617 -334865 -143248 -30100 153185 161062 107233 -35
14728 -35 64238 4636 -202808 -147005 -129953 16924 5168 -41564 -4476 132967 206620 181254
14716 181254 291250 388391 335587 388297 338141 71285 -34041 -39760 -98818 -43244 12941
14705 12941 377188 345257 172794 -14106 75769 131315 198643 49955 200995 263156 73190
14694 73190 -36083 39838 19368 119235 128157 43692 -31645 -44989 37730 -54659 -121883 -260248
14682 -260248 -286747 -181316 -48434 53433 -22449 8108 67930 126725 27951 -3943 -17663
14671 -17663 -81087 5157 81233 142590 118289 122344 40594 49686 37677 93804 -10588 43778
14659 43778 -64696 145280 231552 312158 251151 126003 46938 -11817 -55673 42776 56047
14648 56047 90236 82797 146437 44710 -43850 -162476 -182065 -15971 11519 -206050 -150208
14637 -150208 -131102 -91914 -13008 14634 -111599 -210941 -142461 -69786 9654 -7077 -64927
14626 -64927 -226942 -227877 51721 272753 141985 15756 57129 -44970 57881 28983 -40577
14615 -40577 -82596 39443 -33953 -28562 149428 136629 82392 -61264 -76312 50321 195781
14604 195781 135907 128378 75906 11308 -52759 -101342 -56302 -212594 -9795 152567 114916
14593 114916 -9314 36072 -100929 -145209 -192719 -318475 -148256 -175336 -99197 -55132 -11511
14582 -11511 73624 65517 -40991 85651 222238 255603 34683 -138111 -102879 -149975 -241531
14571 -241531 -403651 -307194 -241191 -79107 -11227 21603 -24959 86562 4094 58181 76777
14560 76777 77127 218203 425755 425641 101140 -111419 -54110 33927 134319 236027 51010
14549 51010 141576 84344 60140 296866 288872 245877 87573 36548 166537 266890 -18374
14538 -18374 -228904 -60412 -36200 -51629 -210166 -131610 64550 -3631 -43309 -185366 -147413
14527 -147413 -31458 25698 -9782 -25702 -325251 -496737 -311341 -250100 -222919 -220295 -209600
14516 -209600 -142692 -41017 -57784 -51102 -17689 -46671 96944 194990 27857 -84193 -240468
14505 -240468 -323065 -235786 69763 264881 16990 -212716 -212072 -153477 -137014 831 104620
14494 104620 90448 173685 218187 164977 116908 335225 359846 162121 -34218 20348 174724
14483 174724 77580 149314 46747 14823 166707 224879 90661 -8632 -54284 591 110458
14472 110458 311583 211167 72804 -37016 -78207 -210065 -226099 -31103 168391 49945
14462 49945 -170285 -108064 -23114 57943 79823 153469 252240 237858 425956 407913 176898
14451 176898 275985 402721 481660 351939 424633 349587 85346 144200 167207 296653 327803
14440 327803 469732 428202 383793 173297 20733 22116 798 52914 209871 166285 -15427
14429 -15427 79994 166249 136463 -28809 4617 -2251 116688 35942 183046 311347 419076
14418 419076 298462 257440 396566 359264 59118 -141851 -110680 -43240 -80295 208261
14408 208261 394932 215148 150315 126804 302853 299043 277663 273363 295485 137104 84503
14397 84503 209931 138975 76408 26719 -35616 -63939 -46570 38031 302754 325880 239313
14386 239313 -19107 -12117 177432 53642 -55336 -48932 53193 248284 219358 237466 167274
14375 167274 152451 113480 175957 300263 210454 170304 176831 84473 18591 -88869 27154
14364 27154 156506 34106 -103895 -59356 -11926 -70813 -212424 -47100 181056 296052
14354 296052 291410 197294 218591 119814 52591 -588 66067 -99908 -307241 -229367 -158745
14343 -158745 -84887 -89634 -153397 -193213 -132727 63122 -43688 -218723 -80081 -106980 -66671
14332 -66671 -44723 -58741 -72549 -68094 -113722 -96702 -39426 -70236 120688 147153 94780 -3343
14320 -3343 37499 -112278 -283039 -185513 -281329 -314230 -449022 -414192 -294254 -138816 -92561
14309 -92561 74546 162086 110972 -62926 20885 129429 -2020 -82475 -203921 -219624 -116099
14298 -116099 -76152 66967 205275 193102 119185 72279 -91126 -368453 -285391 -57605
14288 -57605 162215 150402 70491 150265 109471 -16447 149023 368434 185922 69654
14278 69654 52735 113195 2523 -52168 42837 138384 189373 -9759 -232844 -340815 -316264
14267 -316264 -181475 -63985 37337 -62194 36797 103515 4937 -132974 -80320 -115787 -119310
14256 -119310 120302 16746 -121533 -48593 73996 117363 104594 6838 -15629 11865 -54625
14245 -54625 30193 89846 224966 170103 150035 95050 55982 -11963 -62726 -12734 -26771
14234 -26771 80555 51519 45013 146076 49906 32335 82216 -13545 -49078 -38024 10437
14223 10437 -58374 -111881 27050 84896 4398 -87042 13588 169966 70253 -10100 -49725
14212 -49725 -193459 -260310 -316762 -168549 -156907 -335580 -194796 -65884 30786 -25004 9386
14201 9386 146046 152007 143462 156517 116966 36627 184440 198149 181022 366538 303074 14686
14189 14686 -133501 -169696 -12524 165027 55000 -15534 -59234 -181291 -96846 -15327 69527
14178 69527 19473 -55022 -79533 63586 106860 133991 57952 86277 198279 201563 141554
14167 141554 88858 89556 122399 82264 111108 11098 -59356 3381 -57469 -111006 -135125 -101516
14155 -101516 -76273 -92474 78287 159640 62792 47859 236966 230376 152553 161957 81444
14144 81444 182409 248867 154483 71010 -18150 -30926 -75086 -125826 -114567 -106504 115809
14133 115809 146842 110595 243325 308054 122549 -33874 -60732 62976 164203 205523
14123 205523 109443 49186 58187 136405 234676 149028 -11288 -59906 -117709 -107752 -93786 -210017
14111 -210017 -395778 -310737 -120549 -58610 -164651 -331712 -435114 -210259 -85505 -168152
14101 -168152 -13693 58691 254742 370556 100347 56798 44065 -72479 -168069 -41825
14091 -41825 -20862 82560 245820 264903 188528 305326 503940 529723 450935 458486 423572
14080 423572 514537 606019 651623 387150 303360 333738 348359 490512 553682 443538 600676
14069 600676 789895 812556 684924 897059 1126964 1239496 1233890 1318721 1715618 2328256
14059 2328256 3019517 3638530 4558282 5436967 6644271 7816043 9074323 10463959 11630469
14050 11630469 12371570 12801976 12693009 12010637 10928514 9814866 8912136 7883689 7164434
14041 7164434 6530865 6073805 5850818 6043084 6187335 6267551 6644317 7537755 8859709
14032 8859709 10390188 12265386 14806148 17542813 20288928 22723226 24723772 25898291
14024 25898291 25882575 24806057 22830362 20541139 18292157 16065581 13963038 12267292
14016 12267292 11206488 10380455 9798474 9666571 9831606 10312022 11348428 12974528 15133361
14007 15133361 17884548 21284376 25143505 29333313 33506754 37092367 39459910 40275473
13999 40275473 39437217 37022149 33799312 29993167 25985977 22369908 19411295 17208987
13991 17208987 15671850 14591659 14085160 14076621 14433256 15275939 16863922 19218735 22537778
13982 22537778 26497082 31366001 37052248 42677720 47574787 51103753 53094662 52943586
13974 52943586 50504136 46605696 41847555 36386530 30998257 26356822 22621322 19682550
13966 19682550 17411482 15842123 14866543 14284082 14339458 15008786 16222171 17859974 20331326
13957 20331326 23665168 27509524 31811426 35839377 39161924 41255177 41795874 40692635
13949 40692635 38056606 34439340 30572549 26432825 22435589 18921591 15960048 13957763
13941 13957763 12494012 11565288 11131536 10807129 10722628 11182063 12292394 14006275 16118236
13932 16118236 18401384 21023403 23911439 26488153 28238205 28912930 28662460 27393198
13924 27393198 25214995 22401326 19424724 16651133 13959605 11747152 10079901 8716045
13916 8716045 7762721 7188403 6998292 7080825 7207586 7509704 7924063 8814553 9883786
13907 9883786 11086466 12481388 13809183 14796255 15338294 15195139 14428012 13466679 12149482
13898 12149482 10712721 9258463 7830425 6598241 5582978 4765150 3957813 3362727
13890 3362727 2952300 2790177 2527425 2232757 2057032 2063920 2142611 2136058 2205580 2171852 2001035
13879 2001035 2010352 1938120 1823375 1436481 1205721 1165039 1196854 1236947 1281898 1158987 1015942
13868 1015942 1012322 907769 865301 902475 899494 904011 970030 986267 937305 969687 1033079 1134982
13856 1134982 1282290 1316275 1114436 1194855 1182901 997359 967126 894321 634170 452940
13846 452940 463759 590470 625829 714664 669569 381331 317421 282740 322248 353245 445392
13835 445392 394390 406573 504346 575801 612161 404691 371707 297713 314206 300726 349019
13824 349019 420804 373535 214857 26326 12612 84394 193022 167595 90333 184379 255681
13813 255681 214275 142884 4195 -48313 -114093 -81371 -74702 -116002 18200 215988 265262
13802 265262 120845 131792 239567 370316 694662 707896 600056 494697 372931 265967
13792 265967 309599 284151 225183 127103 240880 422807 317933 104581 17893 172581
13782 172581 415738 413920 358856 443962 374707 324719 384406 266189 324158 288769 275090
13771 275090 551286 609348 511144 369653 12148 -202496 -19631 213588 482478 389177
13761 389177 183245 231494 279316 150027 182296 267013 126587 140646 59483 39971 19148
13750 19148 -60969 -148842 -123707 -141832 -18403 -55097 18494 96615 194086 119187 172172
13739 172172 147384 49888 71278 231 -41702 -29402 -37075 -140599 -150066 -194700 -17569
13728 -17569 79930 157120 124425 49906 24504 -88335 -85068 -48995 -102077 -162068 -117591 -135895
13716 -135895 -63939 -1361 -17897 -164679 -234484 -249180 -257166 -144583 -48702 104539 165337
13705 165337 79129 154180 270519 263142 380697 430408 238246 143146 59007 -35061 -200416
13694 -200416 -76884 -71005 -198808 -76898 122596 268620 230178 154000 11104 -20861
13684 -20861 -54253 18167 136994 11013 60575 52025 97877 39783 -174263 -217412 -254557
13673 -254557 -177952 -21981 96906 119105 67951 29354 16288 -60603 -78559 -2023 144434
13662 144434 277738 239472 135884 -10062 -17335 7356 67897 184033 66114 -27907 73710
13651 73710 51403 58011 139682 179986 82914 -140544 -101939 -63762 36427 72559 41035
13640 41035 104376 15071 -1483 -36912 66629 116409 104555 -98612 -240161 -152228 -165630
13629 -165630 -216394 -144834 -35183 -59403 21535 77313 266575 316410 308105 212937 98488
13618 98488 115162 214738 213895 199841 309112 214576 43540 54723 142847 135825 87014 151355
13606 151355 317556 320755 81344 -57294 -255358 -316232 -104807 158844 321689 263717
13596 263717 178083 152512 -1243 51743 174034 243958 355213 394329 181606 22263
13586 22263 21335 30769 176703 96085 3398 107432 169446 192583 198932 321548 279427 -67880
13574 -67880 -217186 -178616 60642 148273 72698 -17407 95979 390029 484769 592816 450488
13563 450488 211903 185161 71108 64612 144486 108788 196183 359217 480509 453945 174513
13552 174513 654 -149851 -20031 275169 384815 334529 166568 138023 175459 68994
13542 68994 138607 191686 241671 341973 458683 411500 180433 119678 144388 191149 387427
13531 387427 265959 182838 230713 278885 127951 83081 32574 -7142 -107573 9354 170777
13520 170777 225248 298297 314885 415377 304690 356989 333328 249444 93972 77883 125450
13509 125450 319688 364871 241617 430972 367679 224355 103520 93972 -16032 170576
13499 170576 407353 451905 346067 339742 287358 290188 210549 139621 359973 291958 271946
13488 271946 514114 523418 300306 154803 178944 150467 165816 147855 210607 301004 237753
13477 237753 181184 383404 416367 341206 196528 -32742 4441 239041 331507 357459 250974
13466 250974 85488 76525 184451 271381 374587 536364 541458 434126 360495 361627 192035
13455 192035 173190 139721 317727 279173 120412 111390 433881 507176 508213 545924 437222
13444 437222 283443 250578 273270 296558 318162 87078 75661 50652 -78431 40317 -521
13433 -521 142930 129927 28006 98824 234688 179069 71721 -118027 11391 149277 177956
13422 177956 202204 19712 201956 280498 381543 228247 188294 162772 213340 370789
13412 370789 416943 277382 334537 421658 389324 329842 312158 391760 481130 317542 235591
13401 235591 236932 257831 296393 247980 269148 367438 327118 371994 328654 398135 387854 174903
13389 174903 65549 28432 -169766 -201738 -25862 53272 -47598 -112233 -25878 168577
13379 168577 212225 278371 245286 174351 241493 219279 254563 321998 302974 128985 31839
13368 31839 -34114 -115211 -22911 332231 569425 528867 591349 463570 243346 159133 88070
13357 88070 82858 50236 121543 149657 170243 283489 288308 223821 218371 80338 -53440 -88562
13345 -88562 -8280 83146 334427 384091 196992 18747 124798 217788 256276 265656 158978
13334 158978 228886 189551 6995 -86555 147184 211663 259744 152115 28449 -53261 91728
13323 91728 237224 97867 -25416 -113449 34828 121282 37031 -16715 37888 142567 49643
13312 49643 24569 -20989 -46401 -141393 -138852 -98197 -180379 -369635 -309548 -329808 -304245 -258484
13300 -258484 -309047 -334167 -210242 55458 -10511 -128697 -42354 69511 113235 -12606
13290 -12606 -55831 -113976 36738 32706 -15778 -103820 -210736 -185931 -182215 -175426 -226947 -160695
13278 -160695 -53894 463 -8478 10258 129018 122132 -43621 -141831 -145516 -150664 -114161 45408
13266 45408 96339 60468 101893 85453 29554 68336 -5814 -120836 -98330 -15825 -84755
13255 -84755 -80217 48591 43241 206 14497 -51555 -128356 29109 105439 113168 -24455 29577
13243 29577 -109828 -347745 -420705 -284033 -150579 -86770 -350814 -413014 -269756 -280589
13233 -280589 -292367 -261105 -47761 112324 -143491 -208253 -121908 -64634 -35065 -26391 -6087
13222 -6087 142087 195360 107037 -36114 -162029 -168083 -198592 -227125 -186348 -103056 -178480
13211 -178480 -270336 -234431 -224933 -238216 -219270 -341788 -194330 -21378 -14827 79465 79914 244075
13199 244075 361039 458187 381267 289161 375171 350355 131467 -38463 -10488 289589 503067
13188 503067 424919 236882 283086 299287 91094 -35994 170236 101769 -31370 27934
13178 27934 238573 149813 32564 48472 10201 -177984 -177925 -136562 -175054 31123 195550
13167 195550 216788 25466 -27615 49996 83064 81168 -6120 -21208 -53907 57317 148526
13156 148526 204136 69619 167231 123547 156209 277979 266529 270372 169242 298425 331939
13145 331939 349801 428631 348882 155195 101676 105260 109953 27520 -56916 133827 288661
13134 288661 144014 67249 -76487 -100328 -43896 37984 -66446 99208 222723 159550
13124 159550 75294 91518 184469 81862 21317 126878 51087 5727 38218 33389 -133793
13113 -133793 -277547 -171706 -54583 94010 67745 36979 70248 1499 -121493 33167
13103 33167 -31663 -2267 150041 205206 219203 105268 -6125 -45900 33065 127112 199208
13092 199208 161220 144120 42910 117486 134218 113359 202218 190095 303174 340014 398194
13081 398194 465448 543107 466230 347040 382868 379522 168012 47445 -39629 -5934 146780
13070 146780 264878 338595 347744 285831 457373 375150 408038 654132 666464 453900 385988
13059 385988 440671 424569 417627 536919 535935 482483 597449 642656 717362 725214 601963 778080
13047 778080 1067390 1324425 1401823 1329628 1532473 1846873 2093562 2379577 2278524 2257698
13037 2257698 2513145 2990493 3442722 3922278 4489644 5172351 6088109 7195418 8493092
13028 8493092 10016961 12114215 15096822 18724404 23126908 27881964 32492011 36479715
13020 36479715 39654341 41512158 41984139 40914104 38531727 35418350 31784250 27963068
13012 27963068 24298794 21160492 18684810 16932680 16005236 15664182 15667081 16217297 17550829
13003 17550829 19538669 22156354 25481642 29593866 34503400 39622674 44485519 48317455
12995 48317455 51030990 52130737 51534655 49518782 46567340 43380916 40302896 37696092
12987 37696092 36171431 36051634 37508917 39884082 42654050 45178092 47253036 48349699
12979 48349699 48534835 47615815 45525715 42833894 39735608 36062237 32339925 28639703
12971 28639703 25608667 23208164 21520513 20551496 20279681 20525838 21568909 23348125
12963 23348125 25830241 28822231 32395076 36329391 40600914 44496287 47830496 50867583
12955 50867583 53266226 55105030 56449068 57464588 58452811 59490071 60690229 61653433
12947 61653433 62495421 63181977 63006800 62209990 60545684 57650264 53892893 49338007 44498502
12938 44498502 39700449 35365209 31573164 28372396 26036903 24747516 24298044 24578789
12930 24578789 25750484 27847723 31195650 35232799 39650381 44323274 48782514 52758342
12922 52758342 56075924 58432168 59841808 60291074 59439256 57256541 54144666 51137919
12914 51137919 48648260 47385129 47621136 49523081 52765219 56697967 60732020 64329630
12906 64329630 66856806 67532498 66176789 63094550 58428297 52573766 46057698 39823475
12898 39823475 34540257 30268462 27094765 24689753 22914466 21799315 21763409 22414634
12890 22414634 24002982 26441422 29585969 33480108 38217195 43177904 47822991 51914644
12882 51914644 55217317 57117122 56953913 54714994 51012664 45943818 39955649 33868144
12874 33868144 28385038 23948066 20495752 17611473 15223835 13396813 11908803 10609347
12866 10609347 9460103 8448955 7645267 6858176 6252203 5825498 5143894 4606817 4327933
12857 4327933 3873589 3655625 3504355 3352099 3152267 2946981 2633244 2363580 2219017
12848 2219017 2359366 2340306 2097623 1957689 1892688 1818565 1639128 1387373 1330158 1296099
12838 1296099 1267326 1296289 1295220 1186824 1055570 1063409 1131210 1082286 1066925 966390 1024668
12827 1024668 1144947 1196806 1101129 1144341 1228678 1126707 1156842 1231030 1176527 1134887 1046406
12816 1046406 854838 817122 877863 792021 616500 741470 817109 750156 656046 742585 886071
12805 886071 1138958 934791 864771 893144 1034346 924136 1088590 1109671 952763 821137
12795 821137 691915 636189 700164 760320 627083 405740 315273 92772 182994 464546
12785 464546 485487 403557 417733 374556 410798 449276 284696 240185 371072 520165 472121
12774 472121 452953 494221 521572 382312 194100 363579 525861 647277 766797 666671
12764 666671 363541 208044 309596 377239 401711 722320 734773 752641 729385 591750
12754 591750 424117 366353 384549 301509 262452 239350 420330 582343 564092 426636 350627
12743 350627 390641 511281 603920 732491 583264 441007 368603 400239 337600 256619 141444
12732 141444 387944 406969 423373 371106 235622 231820 321675 349658 275811 149818 144431
12721 144431 350431 281736 103876 30327 65126 198972 191514 -26467 52348 166136 133178
12710 133178 65113 153606 119389 166270 224436 355991 447176 394007 265893 317607 218260
12699 218260 103186 67893 65884 114531 175284 217739 321899 367569 368277 449923 414245 304563
12687 304563 218666 114586 210502 299481 357425 340524 280798 106318 33783 66462 5821
12676 5821 -68114 -21676 96558 250781 322055 190951 18948 30317 112037 180215 296542
12665 296542 194247 79306 -102397 -6652 150021 65536 -57978 -140048 45838 104168
12655 104168 214772 179747 221824 276791 213932 259484 333324 357277 216482 100426 315559
12644 315559 467580 288223 219846 11480 183995 269419 122969 -34398 -94305 -845
12634 -845 4314 -49993 102618 174624 175974 296979 410583 375593 264781 418093 352149
12623 352149 235701 34445 -54106 -49301 51200 147229 17055 37437 10654 30534 3253
12612 3253 59714 165012 99197 61952 179454 175131 46821 -158969 -41422 -73265 -238644
12601 -238644 -162385 -45272 -208449 -186257 -234530 -186105 56060 114829 194976 191185 150193
12590 150193 165451 129400 222849 207996 117721 219293 222476 197190 225843 126766 170410
12579 170410 135128 100515 42912 246490 241930 13919 -100320 -26477 -45473 -84165 -1773
12568 -1773 167144 162969 131861 50649 40416 1117 1088 -86846 -146556 -12114 178256 175365
12556 175365 187386 248493 274531 321162 340235 267345 46549 140751 359308 423122 267745
12545 267745 233551 308065 196890 358919 384801 385959 477539 467517 453164 474322 554585
12534 554585 503319 357339 315662 430885 454464 228056 151590 171527 250141 368514 582270
12523 582270 541778 413883 322714 351045 366793 279026 269863 171803 235579 445485 412155
12512 412155 339162 374910 328192 329972 181972 361881 574234 553082 563895 589695 406273
12501 406273 364318 388085 342445 313843 362788 295269 237636 148257 291327 368593 542686
12490 542686 724183 634479 660944 717359 623028 653614 815529 973583 939559 685047 576755
12479 576755 736849 890051 963653 975500 1020708 1083873 1035659 778477 742608 811927 731215
12468 731215 654250 651168 834609 994860 1027691 909057 940796 1122535 1225009 1367555
12458 1367555 1394208 1475687 1388482 1429087 1557892 1594976 1802770 1999406 2074554 2165041 2480779
12447 2480779 2751932 3088412 3602924 4069809 4569887 5203493 5864093 6884228 8151141
12438 8151141 9467439 10760771 12777430 15225012 18681150 23067543 28564081 35323022
12430 35323022 43042869 51332867 58728047 63377225 64055637 60348722 53663165 45897223
12422 45897223 38753949 32813074 28363441 25134106 23085247 21898241 21604540 22357299
12414 22357299 24053412 26756306 30607168 35723169 41988809 49428200 57157315 63766766
12406 63766766 67999316 68453768 65227192 59017919 50958949 42700108 35461100 29354064
12398 29354064 24336314 20547041 17856011 15963489 14517356 13707064 13315984 13084753
12390 13084753 13163247 13450528 14193458 15000681 16092151 17721897 20034297 23472604 27744552
12381 27744552 33154677 39846574 47784086 56400878 63997549 69003714 70053176 67288317
12373 67288317 61787487 54854803 47755050 41355658 35868376 31900487 29209157 27829589
12365 27829589 27657534 28505176 30892145 34683594 40143978 47667819 57355271 68863172
12357 68863172 81479768 94107752 105022364 111791106 112567218 107359459 97870133 86323450
12349 86323450 74268796 62824821 52759642 44539040 38037872 33087287 29371761 27017280
12341 27017280 25659863 25353172 26313541 28246838 31394675 35912324 41319257 47065606
12333 47065606 52387462 56080406 56764227 54520268 49963167 43997658 37805435 32017571
12325 32017571 26930707 22716251 19541186 17012987 14977296 13730018 12881349 12166886
12317 12166886 11536042 11123060 10984216 11220528 11648319 12214767 13169714 14764911 17013585
12308 17013585 20191252 24373866 29800550 36420934 43478244 50081701 54720096 56291309
12300 56291309 54586324 50233303 44510407 38672107 33270800 28554139 24732349 21701159
12292 21701159 19683377 18233210 17796628 18167164 19268856 21139902 24172509 28633863
12284 28633863 34587076 41602527 48470982 53577516 55177315 52943891 48039735 41690876
12276 41690876 35118081 29360305 24288006 20007944 16608320 13988556 12071388 10378119
12268 10378119 8824518 7567869 6738320 6202973 5516736 4938722 4604216 4347880 4124416
12259 4124416 3826622 3771864 3825894 3710133 3592427 3580676 3426841 3207613 2945836 2660892
12249 2660892 2435230 2073610 1909322 1811093 1725119 1630494 1487501 1554235 1556323 1345656
12239 1345656 1233378 1105072 963838 1070137 1096058 1103076 1002461 1048458 1249720 1305749
12229 1305749 1153658 1179819 1193124 1179859 1171921 978992 759236 729629 494862 441843 737367
12218 737367 830506 773485 704078 616226 492571 477926 531488 394680 438656 528772 484186
12207 484186 397166 470595 415136 480726 382255 434606 454627 469551 396339 289820 249291
12196 249291 247984 244255 232458 311261 308435 216526 166543 85128 170561 475373 641132 539510
12184 539510 367894 95231 187025 326089 446483 482970 336149 391960 405174 435266
12174 435266 408568 457869 543551 467189 551078 448276 437334 542308 522307 368038 381444
12163 381444 385110 189077 233062 338536 414009 344047 196850 144040 141035 122031 97682
12152 97682 93729 120646 117209 310786 320106 341551 300228 94332 186903 234241 221108 269149
12140 269149 195679 110604 99295 85346 227457 265669 31002 -223797 -201468 -100607 -31439
12129 -31439 579 113865 236316 214877 231396 314173 478567 375490 97955 17278 25797
12118 25797 114867 153512 261862 270171 269119 289819 233704 223589 269927 226195 145595 262333
12106 262333 195536 205047 374860 280339 32421 172654 261992 236739 236458 254243 191345
12095 191345 244134 303946 133348 214593 471700 555838 406390 399080 285122 304089 157988
12084 157988 130450 205940 167204 19974 219 125877 98419 45700 339807 417846 341235
12073 341235 504103 564858 429368 138162 146113 120659 -47990 -89714 88597 -12776
12063 -12776 142132 306144 417058 428590 195957 211045 189705 79569 -22133 -108974
12053 -108974 -135533 -75593 173080 234212 330830 183300 20926 -65481 -192605 -220817 5317
12042 5317 247341 267580 328513 107598 -20207 45917 28017 -28087 -102165 -129825 -123718
12031 -123718 16778 153807 247365 240804 215615 215028 269753 217872 196602 329598 554068
12020 554068 522543 256965 76792 77218 204122 180466 122773 130313 110280 195633 174971
12009 174971 144308 195247 358568 155208 1879 -12816 -36946 -33653 -29449 47090 140147
11998 140147 208237 116854 65332 133198 223651 261021 229468 215057 252210 334967 235966
11987 235966 270017 112798 149198 290847 322250 154057 125428 213386 113604 -8714 76839
11976 76839 160602 217236 45982 -31795 301641 575563 406507 222879 224002 239383 343821
11965 343821 363856 323522 224484 335558 352777 191152 204563 355058 596988 760968
11955 760968 723855 532256 498188 468454 363240 156123 5218 59779 122740 154436 238834
11944 238834 118056 209014 330714 92144 -42111 -53586 -41826 69159 59905 -200209
11934 -200209 -230912 -150016 12111 -1950 104985 287597 344696 207442 213463 276771 297217
11923 297217 372321 377443 355833 208762 113739 11973 94504 60194 87670 -12684 -43971
11912 -43971 -90182 -89240 -106197 56946 175994 214842 307357 588191 590835 473410 504278
11901 504278 598391 581531 427404 395846 373855 224194 307540 293173 374794 283875 70204
11890 70204 69303 77763 91034 178985 225152 101150 125131 128723 36321 97836 283286 265572
11878 265572 284401 259539 232895 234574 214789 95582 101429 197003 124552 82780 175315 81058
11866 81058 -95967 -156103 -101776 2173 -21467 38935 94907 -89010 -354883 -235778 -124984
11855 -124984 11824 167146 53688 17307 44538 87480 33654 -26643 42787 27773 -74271
11844 -74271 124682 153340 22699 65627 124990 8811 -19776 7905 182129 180167 105634
11833 105634 130291 176119 94849 49507 72565 153519 102348 119143 81015 99957 200784
11822 200784 130405 145472 91562 71018 -24493 -127731 -257565 -252427 -146459 13758 194610
11811 194610 97526 47941 218007 162746 98546 -55503 -93132 20856 95566 317765 310923
11800 310923 50798 -33296 4123 -633 4261 78716 -768 -54699 -100933 -174450 -171883 -166998
11788 -166998 -21112 183926 146946 -146578 -352672 -195755 78653 227976 200556 99519
11778 99519 83605 80605 -48956 -155896 -86576 -51144 -113370 -128195 23398 61500 135673
11767 135673 87763 35481 114234 163743 37071 -105167 -37167 68204 51680 -63589 -173652
11756 -173652 -193236 -90614 -1422 27415 65234 5033 77448 246483 223829 413623 444006
11745 444006 319573 118067 61253 316890 434977 335410 120121 -60729 -64436 -179409
11735 -179409 -184459 -82921 -106438 -1994 17044 -4444 -16645 -65350 -275425 -453716 -446548
11724 -446548 -368148 -219064 -198506 -208072 -118090 54110 340478 339420 332433 341124 326681 185986
11712 185986 -62380 44901 131272 -52026 -184738 -109276 230018 461965 407955 215832
11702 215832 98315 154199 19820 16458 56201 107947 -13587 -10442 168393 348996 167718
11691 167718 234226 187676 61073 146071 134706 66531 163160 11738 62258 132748 56688
11680 56688 -101055 5191 48938 -93230 -134763 -100258 -155395 -198294 -233812 -145237 -239507
11669 -239507 -278902 -298690 -377790 -296221 -152124 -52609 -135153 -41041 -94455 -284456 -239830
11658 -239830 -121516 -52177 45478 -36970 -148845 -222063 -162347 -24317 -8111 10490 -132808
11647 -132808 -138730 -104213 -19611 14496 87711 -53218 -163468 43911 154744 24859 -81635
11636 -81635 -91943 -121735 9178 36095 23248 -102190 -111455 1836 27961 -110844 -113598
11625 -113598 -178969 -226762 -12444 118571 8274 -16843 -62687 66570 235238 269154
11615 269154 149618 4513 124493 321010 307101 94218 169804 184186 201109 161008
11605 161008 81028 -21541 -112754 -262100 -323877 -132196 -58938 -100950 -150076 -3149 231883
11594 231883 156279 -12312 129135 506220 359088 -54362 11873 65739 15203 7430 85901
11583 85901 257166 192568 174000 -18708 -74695 -110623 14951 263377 267946 102428 167042
11572 167042 246864 147019 -31148 -115611 -91867 4623 -52049 -23020 101037 152008 257504
11561 257504 334116 223287 241289 81553 -17069 40359 -123115 -91846 -76559 -225350 -223396
11550 -223396 -78738 -102397 -4082 -36199 -3495 65357 107955 237488 309006 179347 91651
11539 91651 -180383 -260620 -241431 -137176 -58221 -20696 190589 170044 -34199 -171685 -212771
11528 -212771 -95664 23764 90271 221311 44835 -39770 -81352 -279306 -318512 -280493
11518 -280493 -193204 -8962 80294 143113 177262 126911 83510 -4581 -238187 -143632 -51380
11507 -51380 -111420 -21028 201604 215000 25986 -68591 -230234 -252372 -114515 -115195 52378
11496 52378 20315 -113267 -191902 -159372 -141787 -131937 -130846 -138266 -214459 -302354 -212802 -172422
11484 -172422 -69382 17834 72407 -38151 -39415 53584 -13441 -176154 -131244 -207045 -192920
11473 -192920 -139460 -20374 46309 160909 196891 180518 28251 -78646 -67492 -36565 -99523
11462 -99523 -76229 -19108 83762 -89756 -142026 -171158 23998 36603 -147286 -170223 -223123
11451 -223123 -401964 -429042 -265208 -102978 -23090 -15878 92748 160267 37980 6852 -390
11440 -390 2515 54464 101051 218414 127175 96185 123520 159803 268232 342146 176178 -90688
11428 -90688 -172590 -201094 -74448 27723 52896 -114869 -294804 -272159 -184304 -263588 -67049
11417 -67049 85867 76224 212777 65793 -54495 34502 51920 157179 69440 151554 353494
11406 353494 377160 212415 1785 22107 -10808 -53100 -91833 -57502 -31742 -255210 -286333
11395 -286333 -122986 -97594 -153849 -55800 56540 30432 -118132 -156369 -95492 89534 -49108
11384 -49108 -46346 -92833 -54034 -9024 -18969 116855 218217 137946 66574 70195 -82576 -11438
11372 -11438 87466 193047 57887 -121742 -149730 -131250 -123477 -44080 -137853 -238788 -73251
11361 -73251 -57490 -43079 31149 -109437 -225906 -152684 -106071 -196428 -192849 -240130 -205384
11350 -205384 -134461 -13613 -10638 71491 -73493 -94676 -88590 -43867 -144803 -239792 -235819
11339 -235819 -69108 168191 136223 194313 288419 194495 15928 -146983 2873 -28814
11329 -28814 -26808 -7848 99166 47198 -68011 -99677 -102582 -41411 -69128 34852 -82141
11318 -82141 -216609 -315912 -362273 -341430 -318926 -345581 -242225 16498 74144 -86037 -160367
11307 -160367 -216520 -48047 -49153 -90439 -179029 -179220 -93125 163791 55190 -14794 16188
11296 16188 22364 93569 92306 187166 209934 167168 48248 58433 -66507 -259410 -294626
11285 -294626 -370669 -255115 -142135 -73758 -74704 -121000 -272724 -72311 15681 126541 250358
11274 250358 200012 120316 11073 -95823 -76792 99152 64158 124405 258572 220696 15587
11263 15587 -99300 -20984 68537 107084 -17054 -231149 -252077 -192438 -72039 256725 172932
11252 172932 22763 47953 183924 10832 -166469 23316 68038 34642 -198121 -298892
11242 -298892 -239562 -123367 84575 71006 -89980 5534 -26443 30492 107249 141873 180736
11231 180736 184980 117305 1834 -101052 -201809 -124513 -95712 -96866 -55834 4407 2931
11220 2931 -101599 -377827 -489330 -450627 -206132 -60388 527 -108028 -201794 -280676 -416708
11209 -416708 -254077 -96144 -201432 -303784 -151054 -7649 103688 149761 218662 82804
11199 82804 -78554 -239674 -168935 -19434 -175922 -133477 -45321 -61447 -210079 -183622 -173453
11188 -173453 -103643 51022 186632 124873 162476 186037 172298 193437 242327 83690 163050
11177 163050 295368 167651 78595 -101568 -195206 56960 243934 57678 54835 112778
11167 112778 150867 207878 316985 349977 218107 -9779 -71773 -173526 -175829 -97632 131051
11156 131051 324218 382748 459817 433751 335252 268908 -11044 -183958 -66422 169575
11146 169575 260507 178041 182958 291619 274617 84156 -28779 31338 183676 39077 -173623
11135 -173623 -180250 -33943 13603 -37912 -38383 -63226 118805 202899 139513 17805 -30870
11124 -30870 -68850 -146413 -107684 -47378 3149 -87680 -94095 -16742 -49197 -217027 -378313
11113 -378313 -401612 -246318 -258262 -445162 -398976 -280758 -131588 -32656 146216 184704
11103 184704 271571 327208 358343 224951 199137 263704 166801 14430 49479 16990 -35799
11092 -35799 -107260 -109422 78103 21015 -17816 -5384 -43650 -148797 -285917 -152678 -35846
11081 -35846 31032 50876 59508 21790 104303 217271 236847 149764 189792 34394 -23974
11070 -23974 83398 92369 -51981 -92772 -51977 -137784 -157099 -185912 -109949 -97534 -153265
11059 -153265 -241425 -397201 -355288 -192190 -81222 -107727 -166084 -162450 -248457 -195335 -255776
11048 -255776 -207031 -242070 -331907 -84542 -107100 -76295 -213120 -414007 -322741 -237985 -117089
11037 -117089 -170636 -318129 -285127 -33093 115031 149619 -73482 -159628 -250586 -360292
11027 -360292 -348580 -205774 -22476 -171993 -190247 -268479 -299637 -178203 -199757 -7166
11017 -7166 -28474 -187392 -318831 -399132 -420400 -352885 -319620 -216825 -240399 -448006 -493047
11006 -493047 -510196 -439758 -280922 10430 175534 157213 -11336 10948 -95769 -329075
10996 -329075 -371806 -232968 -295589 -309277 -135319 -181878 -340462 -288533 -122805 -57796 -96770
10985 -96770 -160360 -14211 -26226 -151650 -170478 -146434 -41510 1157 -112511 -200090 -258211
10974 -258211 -288268 -300955 -289370 -307201 -289158 -58308 -168320 -174785 -78470 -82073 -111301
10963 -111301 -63030 -130980 -274091 -233020 -327610 -155500 657 -199145 -235122 -345827
10953 -345827 -414341 -172402 -111896 -111869 38548 -164299 -129634 -225775 -254516 -302501 -341458
10942 -341458 -240613 -136160 -188652 -238559 -352099 -377527 -279678 -444615 -478701 -423752 -423898
10931 -423898 -302557 -160957 27669 208938 173914 -22018 -11335 69782 -208332 -161547
10921 -161547 112419 69286 -8582 45686 51371 91540 238921 179042 -3425 27581 29569
10910 29569 -34363 -97227 58366 91665 -142585 -204878 129000 229091 168818 -93856 -139607
10899 -139607 -150457 -116355 -187101 -247499 -403531 -347454 -384409 -255955 -190301 -96657 -145569
10888 -145569 -58589 -68200 -222184 -113535 -88428 -86327 -60914 -5438 54681 54138 11004 127541
10876 127541 150732 262016 255668 271383 280842 246965 19606 -103707 -68655 4568 17434
10865 17434 -38072 83043 -87565 -224764 -194332 -48850 203488 377730 533954 395049
10855 395049 89291 130657 198622 171805 53848 4027 20590 162884 207063 79057 19191
10844 19191 21043 118096 122793 -42754 -231990 -167172 -187436 -201924 -198746 -121597 -155816 -381934
10832 -381934 -257023 -139959 -188368 -381036 -256184 -1383 56030 123187 43515 -162686
10822 -162686 -277737 45961 197510 194682 42319 -59096 -104642 -74403 -92868 -29734 -30
10811 -30 56282 70510 -19578 55032 78576 61010 14902 -32735 -42359 -117581 -69321 21741
10799 21741 -70236 -214934 -172599 -22861 125788 68433 -79524 -79121 -131899 -196527 -145939
10788 -145939 -112719 -92564 15826 78875 219800 252603 184540 128732 30383 -20248 31992
10777 31992 216571 323805 370353 343569 364628 270855 741500 1426727 1902062 1729283
10767 1729283 1150234 674747 300479 203037 314140 424989 344900 149825 35407 -5770
10757 -5770 -168314 -253352 -126653 -83230 -191014 -268933 -374542 -327786 -317426 -177992 -66294
10746 -66294 -18113 -68180 -259252 -262440 -210821 -290583 -274087 -222022 -214571 -153095 -52994 36720
10734 36720 58935 102043 56607 -27021 59701 65532 -1086 -83344 -141615 -335499 -275785 -189241
10722 -189241 22490 105322 -36270 -41130 4889 -139400 -93943 100096 166529 64554 -124020
10711 -124020 -69211 -36998 -27556 -22707 -70323 -62205 -92739 -201414 -339351 -408719 -232788
10700 -232788 107906 183389 41991 -63102 13581 54034 91891 -79892 -101028 0
10690 0 -23806 -21986 -76053 -36034 78254 94052 -65856 -206482 -118437 -126131 -131487 -25790
10678 -25790 41179 112147 97447 -53816 -114564 -212890 -328173 -254154 -238144 -203014 -180076
10667 -180076 -127757 -117067 -166947 20948 -8577 -31707 -197229 -169789 -9989 132135 117086
10656 117086 118676 182818 132581 40464 -80877 4282 -136974 -68984 96684 -21342 -121637
10645 -121637 -7325 -4110 -19360 -41948 -83635 -142807 -215122 24600 179758 169740 151913
10634 151913 129058 127127 65809 90200 47811 179246 94815 -52867 -39514 -14151 11473
10623 11473 -55133 11827 169910 202353 119486 3792 -187059 -162493 -92963 14281 -2943
10612 -2943 -69450 -168398 -112787 -107858 -200968 -113807 -166976 -281364 -361572 -120924 14422
10601 14422 -29572 -10001 -63746 -162819 -117383 -87205 -39954 -3841 53996 79299 15649 150330
10589 150330 124623 -42278 -89696 -156493 16129 -24155 -181011 -167664 -175009 -11805 31760
10578 31760 65497 90149 62782 -149792 -369678 -172917 77224 -68907 -98406 -81951 -84363
10567 -84363 75296 62341 -153196 -195925 -130506 -110502 -38313 90921 210871 -4396 -55776
10556 -55776 -259730 -304491 -215136 51771 221254 257502 64471 62210 22775 -145783 22676
10545 22676 -40168 -256708 -344358 -371653 -322589 -216625 -237001 -259151 -152498 -146348 -182883
10534 -182883 -206554 -129755 59361 32124 -6432 -57986 -76919 11895 32007 -54479 -210717
10523 -210717 -175402 58344 115067 -12281 -13741 -100802 -152756 24600 48543 -26298 -96865
10512 -96865 -193171 -161329 -157701 -163406 -133203 -169875 -103016 -102396 -352138 -413691 -310459 -205098
10500 -205098 -198824 -276857 -217393 -216282 -121535 -206230 -323733 -279414 -475078 -404316 -309353
10489 -309353 -268237 11315 36431 -1586 8271 7743 66285 31948 -919 106828 25889 -169058
10477 -169058 -153659 36087 -35706 46491 69472 -80340 15913 108743 122199 103035 -73710
10466 -73710 -338882 -404171 -343953 -289881 -45504 88695 72678 -85608 -296368 -288399 -108952
10455 -108952 48068 48446 70731 -88079 -89084 16010 -25276 -36019 -114289 -143959 -296672
10444 -296672 -258767 -1932 12335 -46375 -123698 -225095 -180597 -126787 -164386 -182635 -55501
10433 -55501 97714 90021 -69104 -12796 8992 95146 -41498 -102790 -202599 -14798 -60126
10422 -60126 -227018 -191209 -172882 -133839 -211017 -93077 -18649 -61846 -56303 -100319 46566
10411 46566 -65599 -146912 -22329 35704 133091 -94469 -110656 -195484 -311543 -125236 -24267
10400 -24267 -61727 -49372 -151484 -100557 40244 171892 170437 242907 167566 -56147 -111858
10389 -111858 -29482 154885 216925 224593 125153 -3587 26998 -59074 -66288 -27616 130105
10378 130105 339429 105857 -36639 3840 120643 220390 209201 53253 -7714 -28076
10368 -28076 -58074 -20772 108070 230379 177079 227767 126308 -80868 27991 166416
10358 166416 76525 8676 25334 -32367 -197364 -155970 9112 34734 -42633 -166448 -302505
10347 -302505 -265999 -230370 -144500 -32527 180858 389902 589862 458657 221635 102824
10337 102824 122836 189750 299962 237387 44023 -70313 68480 102625 54342 7974 10328
10326 10328 223997 330592 305562 336403 414505 340293 353652 162694 -22134 34102 4796
10315 4796 -102338 -31700 63001 96353 15786 -252 -22060 -70102 -116454 -263094 -278075
10304 -278075 -68694 45429 32667 -80414 5623 68787 -11943 40903 134195 145552 161266
10293 161266 197378 220667 252967 203174 56113 -50366 -25624 51690 56333 -39989 109690
10282 109690 244223 280020 295458 270173 153430 47552 111556 280358 248513 13602
10272 13602 -163398 -168997 3066 209436 90220 154050 270618 367028 385493 377107 348437
10261 348437 258866 238554 212414 194794 237498 312701 209516 140230 13806 45331 187132
10250 187132 328016 456651 406993 180812 214697 146527 192261 208517 163373 144687 30034
10239 30034 109100 216304 150059 133725 139370 110712 149546 89502 12428 47415 -108736
10228 -108736 -109755 55981 11887 -46749 -23712 101552 233003 120886 92015 184540 86145
10217 86145 112310 136961 305446 357098 235393 355947 415438 321659 286220 250474 195245
10206 195245 52321 68179 -36924 56502 212601 254476 270539 303864 200193 89234
10196 89234 156295 128017 -147215 -233586 -217333 -168111 -303871 -193930 7668 59683 99907
10185 99907 113583 72950 -101536 -103736 -73890 -95289 -140268 -62512 33705 70941 97 -70300
10173 -70300 -50488 41372 118522 120299 49452 200967 200275 -106318 -98941 28749 3817 -40955
10161 -40955 21807 67970 -111160 -137843 -13993 -51553 -58463 -187140 -275716 -312915 -300310
10150 -300310 -223889 -266179 -409586 -283493 -151946 -42445 -13056 68467 -57975 -168112
10140 -168112 -176644 -76394 -185099 -280793 -198246 -38085 86959 9016 -211835 -222964 -2164
10129 -2164 46261 -98692 -172059 -54089 -87526 -83805 17181 81998 156192 -9143 -184408
10118 -184408 -167953 34583 -105340 -142912 7120 87646 201937 168423 51163 -107336
10108 -107336 -42806 -70951 27038 20715 -41622 -65032 -59955 -118862 -201905 -7279 -96871 -219985
10096 -219985 -388936 -417438 -210389 3214 127547 115531 167926 292721 83627 19981
10086 19981 -44420 -75720 18636 10334 -47997 42196 121439 139444 67270 -40507 -23560 -66643
10074 -66643 5974 68970 78554 112698 185248 220227 96682 29353 13731 113406 231800
10063 231800 411647 290797 -11167 -35696 -6740 127020 105998 37610 235001 212702
10053 212702 235174 360613 278812 213534 12057 -77456 -129716 -66624 37687 40337 -32123
10042 -32123 -139393 -74174 -34631 20648 298438 466078 254559 316983 401599 412574 306547
10031 306547 274343 261932 267423 225568 227931 218687 179141 257682 297384 309131 277652 333965
10019 333965 546075 529343 515076 633159 561188 599170 827035 974242 816120 610494
10009 610494 697327 948882 937219 946064 923769 715572 844968 1147062 1254157 1465113
9999 1465113 1622837 1924928 2428280 2821351 3380577 4201848 5095445 6083445 7246020
9990 7246020 8588435 10000828 11411868 12547801 13323574 13900482 14469241 14929350 15414329
9981 15414329 16034660 16784636 17376944 17409177 16967804 15949984 14809298 13636815 13000965
9972 13000965 12931695 13478299 14447463 15973286 18042140 20401492 22701507 24847721 26800797
9963 26800797 28444997 29533340 30126065 30700656 31477457 32545155 33728854 34565901 34706379
9954 34706379 34254629 33010662 31345626 29817737 28787638 28127849 27704835 27378101 27030467
9945 27030467 27346795 28186313 29645004 31290370 32561989 33502166 33954388 33642461 32655590
9936 32655590 31590916 30660691 30161022 30231464 30422662 30579751 30620420 30739355 30854737 31203531
9926 31203531 31725412 32377860 32957215 33277127 33070699 32590763 32355679 32573963 32932862
9917 32932862 33206609 33029990 32408103 31544604 29995664 27914607 25875022 24337188 23499169
9908 23499169 23809179 25212187 27485927 30709077 34042368 37018819 39135058 40185671
9900 40185671 40283788 40009702 39812506 39802285 39978734 40543889 41446411 42173838 41797103 40340937
9890 40340937 38029625 34958834 32136492 30305867 29616758 30120785 31983340 34828645
9882 34828645 38515459 42317000 45568846 47873395 48958485 49579334 49668645 49350192 49458207
9873 49458207 50180465 51302664 52142350 52611708 52482195 51619676 50610831 49865869 49413822
9864 49413822 48959858 48558469 47972679 47538233 47760138 48641852 50201682 52126274 53477729
9855 53477729 53659082 53100940 51754789 49919474 47986930 46290183 45245564 44723462 44698332
9846 44698332 45042047 45548850 46283331 47562231 49502812 51635635 53561084 54548571 54490523
9837 54490523 53452945 52066085 50604322 49600494 48843173 48059668 46784004 44765437
9829 44765437 42065850 38892969 35183461 31437525 28056846 25434004 23707838 22785820
9821 22785820 22858055 23721041 25049967 26559348 27857216 28428155 28230105 27378281 26374799
9812 26374799 25712492 25271390 24749896 24271181 23529421 22144363 20193783 18110307 16040853
9803 16040853 13973848 12134087 10407671 9082288 8114108 7234077 6518810 5802337 5125667
9794 5125667 4721965 4407016 3985189 3593754 3246723 2873093 2711446 2764450 2813608 2691792
9784 2691792 2617843 2549177 2566613 2505264 2353250 2132832 1772386 1685206 1606445 1514688 1451781
9773 1451781 1523932 1715696 1693504 1494767 1324705 1316945 1286517 1229480 1060273 855881 957515
9762 957515 930234 968760 934688 910899 874082 662064 532239 510714 599754 590234 726530
9751 726530 757837 743435 652995 465320 563356 689420 788714 669861 403269 510718 663020
9740 663020 587969 469421 420669 345699 574339 628647 754057 645936 346297 360111 623528
9729 623528 638827 616406 537528 620093 467043 433797 440855 376423 419391 375287 466168 612008
9717 612008 571385 619113 749267 675607 695591 729399 612247 490672 476623 582237 570562
9706 570562 525542 524733 406419 435722 473804 465568 401158 391121 289155 160617 304344
9695 304344 449749 410771 391351 552629 517695 426502 458864 445300 323903 454652 644471
9684 644471 808612 838811 871713 822793 923225 898743 775296 624175 606587 662276 743849
9673 743849 742370 762761 1074214 1144146 1163098 1173236 1106639 790737 713464 835163 775842
9662 775842 722894 803205 910716 1054221 1286761 1391562 1574187 1684715 1595519 1699932
9652 1699932 1868322 2094734 2409771 2681026 2950828 3533621 4297849 4798309 5447639 6560712
9642 6560712 7855271 9370550 11131557 13490883 16578459 20362508 24584786 28529356
9634 28529356 31709019 33225638 33091675 31640036 28914699 25632998 22258688 19109596
9626 19109596 16532368 14521294 13141017 12228029 11603598 11328827 11317133 11851645 12661395
9617 12661395 13858951 15700581 17977667 20764988 23964073 27359004 30341207 32578590
9609 32578590 33716898 33636945 33024377 31720329 29640224 27100306 24228328 21361562 18978944
9600 18978944 17110055 15836797 14772451 14327250 14656360 15304037 16007699 17192990 19094280
9591 19094280 21764970 25409759 30198790 35979657 42662406 49213913 55187555 59698002
9583 59698002 62364665 62966449 61457005 57466810 52158079 46204442 40408028 35409792
9575 35409792 31381630 28244883 25865635 24177291 23208703 22927823 23685660 25208682 27615119
9566 27615119 31056011 35559443 40962489 47003580 52724185 57398348 60570678 62632074
9558 62632074 63871952 63992959 62752645 60226650 56846528 53164124 49756627 47030968
9550 47030968 44650812 42342278 40033147 37606767 35292457 33175460 31367617 29652786
9542 29652786 28275793 27431738 27151937 27546977 28835951 30905559 33382153 36124518 38874107
9533 38874107 41037788 42446306 42583550 41875118 40840023 39742292 39116083 38744563 38316017
9524 38316017 37330068 35563888 33618777 31539741 29612631 27937967 26656848 26029608
9516 26029608 26110798 27115104 28715437 30907052 33093423 34985584 36765267 38304970
9508 38304970 39914716 41209145 42096956 42805719 43293272 44170592 45236187 46643831 47735970
9499 47735970 47900702 47144737 45958445 44384858 42166408 38996571 35115109 31123285
9491 31123285 27235700 23889106 21299584 19194303 17778577 16973867 16496139 16465463 16901611
9482 16901611 17914642 19508109 21932310 25194787 28832289 32794292 36473234 39310171
9474 39310171 41073502 41264365 40088604 37761707 34278811 30274773 26270982 22702306
9466 22702306 19498510 17070113 15306778 13838081 12597470 11657615 10875907 10329534 10167079
9457 10167079 10460610 11074418 11892142 13216948 15052534 17040218 18700794 20194700 21312780
9448 21312780 21915143 22253012 21948898 21051794 19588229 17468299 15346662 13492314 12034176
9439 12034176 10623990 9479078 8689154 8164695 8060655 8056541 8072424 8334669 8965492 9955814
9429 9955814 11301676 13073902 15312469 17500706 19432437 20558406 20988250 20557203 19219779
9420 19219779 16963188 14639916 12536591 10657778 9175856 7856129 6838479 6061206
9412 6061206 5357552 4644603 4023834 3586275 3310092 3107915 2893182 2672635 2509335 2383317
9402 2383317 2135446 1978764 1892263 1682355 1462940 1374126 1531203 1628236 1590079 1665464
9392 1665464 1803457 1915305 2132026 2139866 1748884 1385768 1215803 1048951 925534 885394
9382 885394 1007074 1082699 1094225 1150315 1132052 1063991 825916 604685 641127 580727 512267
9371 512267 609682 557022 745993 926119 942507 960283 944831 876257 724598 674308 653355
9360 653355 574032 436429 290482 206867 90868 185736 639267 653575 584482 457096 492955
9349 492955 515973 497973 538285 561123 598877 482736 495618 714968 795119 657731 703128
9338 703128 772800 753348 685639 666399 571109 593862 544502 548902 367732 346200 468794
9327 468794 390385 330201 465298 496751 452305 479386 366772 302707 460351 581656 448146
9316 448146 390731 369818 426618 465128 604217 648449 543719 543457 692408 768392 827946
9305 827946 795209 786941 704499 634843 634020 615221 643871 654710 527098 368552 122770 -100611
9293 -100611 162297 393157 672949 713644 646226 681898 604774 534251 604972 652368 537123
9282 537123 385746 458020 570022 606418 540305 478255 629975 755029 705159 529164 435223
9271 435223 483241 604270 559367 488772 567880 654599 592945 784520 877110 942176 982106
9260 982106 825611 638694 562673 437152 267364 401315 515568 577475 601724 552766
9250 552766 719435 852575 769189 562607 472411 423290 508754 386806 435043 656603 694623
9239 694623 545949 416137 419919 405928 440424 398138 371478 554897 674821 623788 582018
9228 582018 435352 460726 484874 526279 733115 695450 677027 642523 747994 698170 738555
9217 738555 891347 918488 706120 819314 883929 757220 642712 594931 981761 944052
9207 944052 845549 911087 961561 893982 828430 867725 1042158 1084549 1114407 1154358 1212818
9196 1212818 1232662 1172463 1057393 895894 892351 828397 865369 969318 962162 843695 844802
9185 844802 1063433 1188644 1151186 1162677 1293348 1238402 1174776 1274703 1446380 1436342 1313722
9174 1313722 1352037 1501193 1445805 1520851 1696770 1754936 1762763 1898443 1789352 1642836 1624879
9163 1624879 1735341 1721082 1513393 1461568 1768789 1958584 1837965 1800733 1753656 1782873
9153 1782873 1908967 1945661 2032087 2246980 2391944 2506263 2731346 2645946 2450589 2424098
9143 2424098 2398340 2546527 2601985 2552809 2714300 2747873 2781723 2737783 2741032 2800917 2583609
9132 2583609 2546770 2815476 2913748 2844878 2867964 2953181 2959774 2947828 3121059 3378680 3514964
9121 3514964 3442522 3476511 3805693 3946009 3926335 3906292 3944443 3991200 3934356 3983882 4156130
9110 4156130 4070634 3922571 4114292 4403116 4357095 4445076 4700837 4787226 4637905 4619521
9100 4619521 4555585 4499158 4505969 4592812 4532246 4694603 4737509 4577594 4513676 4691330 4807065
$$ [...]
##END NTUPLES=NMR SPECTRUM
##END=
