##TITLE=Analysis number 327990
Compound Code cc 52904
Book Reference 423/140/6
Project Code adrs
Chemist Name bruced
##JCAMPDX= 6.0         $$ Bruker NMR JCAMP-DX V2.0
##DATA TYPE= NMR SPECTRUM
##DATA CLASS= NTUPLES
##ORIGIN= Bruker BioSpin GmbH
##OWNER= nmr
$$ XWIN-NMR		Version 3.5
$$ Tue Apr 24 11:41:56 2007 GMT Daylight Time (UT+1h)  MAYBRIDGE\nmr@NMR_250MHZ
##.OBSERVE FREQUENCY= 250.131544655141
##.OBSERVE NUCLEUS= ^1H
##.ACQUISITION MODE= SIMULTANEOUS (DQD)
##.ACQUISITION SCHEME= undefined
##.AVERAGES= 16
##.DIGITISER RES= 18
##SPECTROMETER/DATA SYSTEM= dpx250
##.PULSE SEQUENCE= zg30
##.SOLVENT NAME= CDCl3
##.SHIFT REFERENCE= (INTERNAL, CDCl3, 0, 16.4555)
##AUDIT TRAIL= $$ (NUMBER, WHEN, WHO, WHERE, WHAT)
$$ ##TITLE= Audit trail, XWIN-NMR		Version 3.5
$$ ##JCAMPDX= 5.01
$$ ##ORIGIN= Bruker BioSpin GmbH
$$ ##OWNER= nmr
$$ C:\u/data/dgb/nmr/ADRS/2950/pdata/1/auditp.txt
$$ ##AUDIT TRAIL=  $$ (NUMBER, WHEN, WHO, WHERE, WHAT)
(   1,<2007-04-24 11:41:19.10 +100>,<MAYBRIDGE\nmr>,<NMR_250MHZ>,
      <created by zg, POWCHK disabled, PULCHK disabled
       configuration hash MD5:
       76 6E 9A 78 1E 09 19 81 EC 84 63 8F B0 6A 59 2D
       data hash MD5: 64K
       42 96 ED 51 A1 70 63 D3 26 68 D8 C7 E1 AF 0D B0>)
(   2,<2007-04-24 11:41:36.47 +100>,<MAYBRIDGE\nmr>,<NMR_250MHZ>,
      <Start of raw data processing
       ef LB = 0.3 FT_mod = 6 PKNL = 1 SI = 32K 
       data hash MD5: 32K
       C7 63 07 87 3E 8D F0 06 75 E6 AB 6D E2 ED 3C B2>)
(   3,<2007-04-24 11:41:41.22 +100>,<MAYBRIDGE\nmr>,<NMR_250MHZ>,
      <apk 
       data hash MD5: 32K
       42 52 05 E1 7E 73 EB 95 40 BE F8 F4 E1 DC A2 D6>)
(   4,<2007-04-24 11:41:42.83 +100>,<MAYBRIDGE\nmr>,<NMR_250MHZ>,
      <abs ABSG = 5 
       data hash MD5: 32K
       03 05 9C 05 3E CB A6 C7 B8 DC 2A 00 83 21 0A 8D>)
$$ ##END=
$$ 
$$ hash MD5
$$ 9D 12 DF DA AD 2D 54 AD 81 08 84 87 24 6E 56 07
##$RELAX= 
##$RELAX= 
##$RELAX= 
##$RELAX= 
##$RELAX= 
##$RELAX= 
##$RELAX= 
$$ Bruker specific parameters
$$ --------------------------
##$DU= <C:\u>
##$EXPNO= 2950
##$NAME= <ADRS>
##$PROCNO= 1
##$TYPE= <nmr>
##$USER= <dgb>
##$AMP= (0..31)
100 100 100 100 100 100 100 100 100 100 100 100 100 100 100 100 100 100 
100 100 100 100 100 100 100 100 100 100 100 100 100 100 
##$AQSEQ= 0
##$AQ_mod= 3
##$AUNM= <au_zg>
##$AUTOPOS= <14 >
##$BF1= 250.13
##$BF2= 250.13
##$BF3= 250.13
##$BF4= 250.13
##$BF5= 500.13
##$BF6= 500.13
##$BF7= 500.13
##$BF8= 500.13
##$BYTORDA= 1
##$CFDGTYP= 0
##$CFRGTYP= 5
##$CHEMSTR= <none>
##$CNST= (0..31)
1 1 145 1 1 1 1 1 1 1 1 1 1 1 1 1 1 1 1 1 1 1 1 1 1 1 1 1 1 1 1 1 
##$CPDPRG= <>
##$CPDPRG1= <>
##$CPDPRG2= <>
##$CPDPRG3= <>
##$CPDPRG4= <mlev>
##$CPDPRG5= <mlev>
##$CPDPRG6= <mlev>
##$CPDPRG7= <mlev>
##$CPDPRG8= <mlev>
##$CPDPRGB= <>
##$CPDPRGT= <>
##$D= (0..31)
0 1 0 0 0 0 0 0 0 0.06 0 0 0 0 0 0 0.0002 0 0 0 0 0 0 0 0 0 0 0 0 0 0 
0 
##$DATE= 1177411277
##$DBL= (0..7)
120 120 120 120 120 120 120 120 
##$DBP= (0..7)
150 150 150 150 150 150 150 150 
##$DBP07= 0
##$DBPNAM0= <>
##$DBPNAM1= <>
$$ [...]
##$SUBNAM7= <"">
##$SUBNAM8= <"">
##$SUBNAM9= <"">
##$SW= 20.6930455092707
##$SWIBOX= (0..15)
0 0 3 0 0 0 0 0 0 0 0 0 0 0 0 0 
##$SW_h= 5175.983436853
##$TD= 65536
##$TD0= 1
##$TE= 683.16
##$TE2= 300
##$TE3= 300
##$TEG= 300
##$TL= (0..7)
0 120 120 120 120 120 120 120 
##$TP= (0..7)
150 150 150 150 150 150 150 150 
##$TP07= 0
##$TPNAME0= <>
##$TPNAME1= <>
##$TPNAME2= <>
##$TPNAME3= <>
##$TPNAME4= <>
##$TPNAME5= <>
##$TPNAME6= <>
##$TPNAME7= <>
##$TPOAL= (0..7)
0.5 0.5 0.5 0.5 0.5 0.5 0.5 0.5 
##$TPOFFS= (0..7)
0 0 0 0 0 0 0 0 
##$TUNHIN= 0
##$TUNHOUT= 0
##$TUNXOUT= 0
##$USERA1= <user>
##$USERA2= <user>
##$USERA3= <user>
##$USERA4= <user>
##$USERA5= <user>
##$V9= 5
##$VALIST= <valist>
##$VCLIST= <CCCCCCCCCCCCCCC>
##$VD= 0
##$VDLIST= <DDDDDDDDDDDDDDD>
##$VPLIST= <PPPPPPPPPPPPPPP>
##$VTLIST= <TTTTTTTTTTTTTTT>
##$WBST= 1024
##$WBSW= 4
##$XGAIN= (0..3)
0 0 0 0 
##$XL= 0
##$YL= 0
##$YMAX_a= 267422
##$YMIN_a= -275461
##$ZGOPTNS= <>
##$ZL1= 120
##$ZL2= 120
##$ZL3= 120
##$ZL4= 120
##$ABSF1= 16.4555
##$ABSF2= -4.237673
##$ABSG= 5
##$ABSL= 3
##$ALPHA= 0
##$AQORDER= 0
##$ASSFAC= 0
##$ASSFACI= 0
##$ASSFACX= 0
##$ASSWID= 0
##$AUNMP= <proc_1d>
##$AZFE= 0.1
##$AZFW= 0.1
##$BCFW= 0
##$BC_mod= 0
##$BYTORDP= 0
##$COROFFS= 0
##$CY= 12.5
##$DATMOD= 1
##$DC= 0
##$DFILT= <>
##$DTYPP= 0
##$F1P= 14.0000005364418
##$F2P= -0.99999901652339
##$FCOR= 0.5
##$FTSIZE= 32768
##$FT_mod= 6
##$GAMMA= 0
##$GB= 0
##$INTBC= 1
##$INTSCL= 1
##$ISEN= 128
##$LB= 0.3
##$LEV0= 0
##$LPBIN= 0
##$MAXI= 10000
##$MC2= 0
##$MEAN= 0
##$ME_mod= 0
##$MI= 0
##$NCOEF= 0
##$NC_proc= -5
##$NLEV= 6
##$NOISF1= 0
##$NOISF2= 0
##$NSP= 0
##$NTH_PI= 0
##$NZP= 0
##$OFFSET= 16.4555
##$PC= 1
##$PHC0= -56.34111
##$PHC1= 8.189406
##$PH_mod= 1
##$PKNL= yes
##$PPARMOD= 0
##$PSCAL= 4
##$PSIGN= 0
##$REVERSE= no
##$SF= 250.130016631341
##$SI= 32768
##$SIGF1= 0
##$SIGF2= 0
##$SINO= 400
##$SIOLD= 32768
##$SREGLST= <1H.CDCl3>
##$SSB= 0
##$STSI= 32768
##$STSR= 0
##$SW_p= 5175.98343685301
##$SYMM= 0
##$S_DEV= 0
##$TDeff= 65536
##$TDoff= 0
##$TI= <Analysis number 999999
Compound Code 99
Book Reference 9
Project Code 9>
##$TILT= no
##$TM1= 0
##$TM2= 0
##$TOPLEV= 0
##$USERP1= <user>
##$USERP2= <user>
##$USERP3= <user>
##$USERP4= <user>
##$USERP5= <user>
##$WDW= 1
##$XDIM= 32768
##$YMAX_p= 475900548
##$YMIN_p= -526621
$$ End of Bruker specific parameters
$$ ---------------------------------
##NTUPLES= NMR SPECTRUM
##VAR_NAME=  FREQUENCY,     SPECTRUM/REAL,   SPECTRUM/IMAG
##SYMBOL=    X,             R,               I
##VAR_TYPE=  INDEPENDENT,   DEPENDENT,       DEPENDENT
##VAR_FORM=  AFFN,          ASDF,            ASDF
##VAR_DIM=   32768,         32768,           32768
##UNITS=     HZ,            ARBITRARY UNITS, ARBITRARY UNITS
##FACTOR=    0.157963299565203, 1,           1
##FIRST=     4116.01440089336, 0,            0
##LAST=      -1059.96903595965, 0,           0
##MIN=       -1059.96903595965, -526621,     0
##MAX=       4116.01440089336, 475900548,    0
$$ Real data points
##PAGE= N=1
##DATA TABLE= (X++(R..R)), XYDATA
$$ [...]
15180a37477o2384M0756J34892K44613p4739j66431n6627n834M5431N3911J9496
15169C5607l5929J33562L3126q034m8062q0880J3643l1342O7054Q742n814R5982
15157A77655R5628m5671n6097p9402n155J2707N3465P8588p213q0695L9008L4555
15145B17373m0968o5128n4080k7128n251n9633R2443J20523j8151q6538j23561
15134e0099n2860J3295l370N526Q7760N5434K1818Q5503r8242l0371j14210j29190
15122b09006L6297J07095K1066j4991J0028q9660p1093J80367K16962j1302l7090
15111A38673Q6980L2844j20075k18077j55952p915J06988m931n1401J35178R7665
15100C9977j8098q693n2473r9039o7737J15521J94913P2035n1374m4395M8071
$$ plain form
15180 -137477 -199861 -159105 -24213 220400 145661 -20770 -77397 -83231 -37800 16111 35607
15169 35607 -322 133240 166366 158332 110270 29390 43033 11691 78745 87487 81673 177655
15157 177655 273283 227612 171515 92113 86958 99665 153130 231718 224505 143810 182818 217373
15145 217373 176405 111277 57197 30069 24818 -34815 57628 178151 160000 73462 -50099
15134 -50099 -102959 -89664 -93034 -87508 252 55686 77504 163007 64765 34394 -79816 -209006
15122 -209006 -172709 -65614 -44548 -59539 -49511 -139171 -210264 -29897 187065 175763 138673
15111 138673 225653 258497 138422 -79655 -235607 -243522 -136534 -141465 -192866 -57688 39977
15100 39977 21879 13186 -39287 -138326 -206063 -90542 104371 176406 125032 80637 128708
15089A28708K0187o6860q1063R6710L9064Q8995J07811K31359J79719J20092p5056
15078G89666m4111n3576j41730k15465k45938j05171K8226N1982Q731k1800j926
15067D8888K4766J9964K6219l8145l0057j16111q1193O3520k3482q8550M6086
15056a48095O3975J07032J5745m7143p2867o8239L2805J46653O3304r6718N6799
15045E3251K4105r9448m8685j9691j26885k1854K44929R3406k932j02476R5320
15034H9040L077o2531P5639p8967p8098N5369k0777P2255j3913o7553Q3339M5314
15022A02194j52685o2929K0216L6739J40539j09403J7366P0738o8392J2958n9606
15011e2265p7133J18495L8548o706L3574O6670q1320P1651m1736k19073q1508
$$ plain form
15089 128708 148895 82035 972 97682 136746 225741 333552 564911 744630 864722 789666
15078 789666 745555 691979 550249 334784 88846 -16325 11901 63883 72614 50814 48888
15067 48888 73654 93618 119837 81692 51635 -64476 -145669 -82149 -105631 -194181 -148095
15056 -148095 -84120 22912 38657 -8486 -81353 -149592 -116787 29866 93170 -3548 53251
15045 53251 77356 -22092 -70777 -90468 -217353 -239207 5722 99128 96196 -6280 89040
15034 89040 92117 29586 105225 26258 -51840 3529 -17248 55007 41094 -26459 56880 102194
15022 102194 -50491 -113420 -93204 -56465 84074 -25329 -7963 62775 -5617 7341 -52265
15011 -52265 -129398 -10903 27645 20939 54513 121183 39863 111514 69778 -149295 -230803
15000b30803J37059J24879J2975j12844l0606O2057l105j20337O9136J12114M3684
14989F4209j00556j24309J8347l692J06933n914J6207k5327p2638L6415J12497
14978B2172L4196N0338n3789m493O7641p7947M0558J47310J5987j14590j74887
14967d7504j39476j3798q239l1544j02635K1618J19414J11127J57889L0494j79280
14956h1934j49795K5884p0095m5627P4223J7319n999P4464J26116L5080q1730
14945h2094j4293K0720J1399J18225O8467J1724J0266j03196j10306K1678M0089
14934g321O0011q9638J7611J1191M3275l0367j72638N2903J21857o7935j8245
14923g9296M6863j8421m3803P1259n6203J2600K797P8993K5570j47338j52970
$$ plain form
15000 -230803 -93744 31135 44110 -68734 -99340 -37283 -40388 -160725 -91589 20525 64209
14989 64209 -36347 -160656 -142309 -146001 -39068 -44982 -28775 -54102 -126740 -90325 22172
14978 22172 56368 106706 52917 48424 116065 38118 78676 225986 241973 127383 -47504
14967 -47504 -186980 -200778 -209017 -240561 -343196 -321578 -202164 -91037 66852 97346 -81934
14956 -81934 -231729 -205845 -275940 -321567 -247344 -230025 -236024 -161560 -35444 -364 -82094
14945 -82094 -96387 -75667 -64268 53957 122424 134148 144414 41218 -69088 -47410 -7321
14934 -7321 52690 -36948 -19337 -8146 35129 4762 -167876 -114973 6884 -61051 -79296
14923 -79296 -32433 -50854 -94657 -23398 -79601 -67001 -64204 14789 40359 -106979 -259949
14912b59949N0670K7360J34947J74416j46802j6867J24428J2399j524p2161Q5608
14901A12525j22915j30885J5700K7665N8911R5065L4675j1832K8560J32313p9848
14890A59934j63567m1457M6082o3662k9149L190m0876N8858P5283M2429L9671
14879H6736m8527n0395K2386K7075r5073o1718l8997J29873J05012j461j60070
14868h5159r3302N3722n8449n6879P5449J76885o2946j283J13491R5832P3078
14857B30439P0506L161m6399n4328o7638n3557q3589q860J5073P3145K7802j00521
14845E234M1211j10280K0032J8445p7438J0080P8831R8970J7183j0963M039R8336
14833A93680L8516j6166n752J2515m3115n1506j03848j34583P6090O3099M417
$$ plain form
14912 -259949 -209279 -181919 -46972 127444 -19358 -36225 88203 100602 99078 26917 112525
14901 112525 -10390 -141275 -125575 -97910 -38999 56066 90741 78909 107469 239782 159934
14890 159934 -3633 -45090 992 -62670 -91819 -88629 -129505 -70647 4636 47065 86736
14879 86736 38209 -12186 10200 37275 -57798 -119516 -158513 -28640 76372 74911 -85159
14868 -85159 -178461 -124739 -183188 -240067 -164618 12267 -50679 -51962 61529 157361 230439
14857 230439 300945 304106 257707 203379 135741 82184 -1405 -10265 4808 77953 105755 5234
14845 5234 46445 -63835 -43803 -25358 -102796 -92716 -13885 85085 102268 91305 95344 193680
14833 193680 232196 216030 210278 222793 179678 128172 24324 -110259 -34169 28930 33347
14822C3347j52112r8736L9635K34067K06123J8202j67231j11829l8715L1175P0441
14811F4367o0350K039J29833J50075m8931j32006N3399j80428j88113l4252J33110
14800a11257K07460L1089J05387l7265j42306m3205j05298J2315J17358N2762
14790H7040p2648n3959n1898o6383n0280n5040K6197J53868n3185l1210j0133
14779a77631P6955J50116R5566j7758o1423P463m0375j14102Q8241q3833j27058
14768b03839p5919J05346K09641J19342o871j17664R8488L9185J0138j28527J2697
14757F2017r760n9214K8164j34564k5564j3352R1294L6027Q652M584J0135j9173
14745b0754M0220q6378j76178J0984N7704N9040J99900l5410j48297L6029R6431
$$ plain form
14822 33347 -118765 -217501 -177866 56201 262324 280526 113295 1466 -37249 -6074 64367
14811 64367 4017 6056 135889 285964 237033 105027 158426 -22002 -210115 -244367 -111257
14800 -111257 96203 127292 232679 195414 53108 9903 -95395 -83080 34278 87040
14790 87040 14392 -39567 -91465 -157848 -208128 -263168 -236971 -83103 -136288 -167498 -177631
14779 -177631 -100676 49440 145006 127248 65825 73288 32913 -81189 7052 -76781 -203839
14768 -203839 -279758 -174412 35229 154571 147700 30036 128524 167709 177847 49320 62017
14757 62017 52257 -6957 21207 -113357 -138921 -152273 -60979 -24952 -16300 -11716 -1581 -20754
14745 -20754 19466 -66912 -243090 -232106 -174402 -115362 84538 49128 -99169 -63140 33291
14734C3291k716j70436p5179K2754O2758R9867j0292q6780l3945k9093k1473n3199
14722b64443M0830P8107J05544n0332j507M504K4228l274N6548p8266j0698O4335
14710c4424M625L6805j9015K2845J367p1985k408j5617k6693Q852P3045P005j15306
14697a30904R8766J94878O2948j42406o0537o087Q7813J14883J2175q6048j04329
14686D1152m852k0958j41340j36993J11775P2089j7751O4926R5799r9326n6316
14675i1795R6664O8404J6463n8668J45334l9684j27657r8209m4572R4515O3719
14664B4514r0104N332M2130J7579l0424P254K2928K3317J9974L066j2598J8045
14652E1013o7496L6004m0041r1238L1090J57393Q1162j26180m2031K233o7486
$$ plain form
14734 33291 30575 -139861 -215040 -192286 -129528 -29661 -39953 -126733 -160678 -189771 -211244 -264443
14722 -264443 -223613 -145506 -39962 -90294 -91801 -87297 -63069 -66343 -9795 -88061 -98759 -34424
14710 -34424 -29799 7006 -12009 10836 12203 -59782 -62190 -77807 -104500 -95648 -22603 -15598 -130904
14697 -130904 -32138 162740 225688 83282 22745 16658 104471 219354 231529 145481 41152
14686 41152 36300 15342 -125998 -262991 -151216 -79127 -96878 -31952 63847 -35479 -91795
14675 -91795 4869 73273 89736 31068 176402 136718 9061 -89148 -133720 -39205 24514
14664 24514 -65590 -60258 -18128 -549 -30973 -23719 -791 22526 42500 45566 32968 51013
14652 51013 -16483 19521 -20520 -111758 -80668 76725 157887 31707 -10324 -8091 -75577
14641g5577p4679o3291k8885J12848J14272J23562j6264k9892j21340L7466K4027
14630B247R1224P8750q3929j41980r8145L1324J09074K0906P0465j7510p7945
14619a5519m0840K7735L5978m5286N8884J1550p5867k5022q3708j6705P6448Q2349
14607a0003j2078K9235N5749L365N5602k6949j16545r5066M3360l4595l8773l1887
14595a78585M2563Q8750L9122k3231n1732M554J09196N9526m7808j1437k4783
14584F135j92817q0664Q9777J42995J30338J08966r9025n3054J1382j18556o5557
14573a20080M6205O6333l6662o6605j03773o6076q6597M3020l3680P8794K08376
14562g0745J26505m8007j7675k9535K0171k2090K09054k2041k05529J5705j2479
$$ plain form
14641 -75577 -150256 -213547 -242432 -129584 -15312 108250 91986 62094 -59246 -21780 2247
14630 2247 93471 172221 88292 -53688 -151833 -120509 -11435 9471 79936 62426 -15519
14619 -15519 -56359 -28624 7354 -37932 20952 32502 -43365 -68387 -152095 -168800 -92352 -10003
14607 -10003 -22081 7154 62903 66268 121870 94921 -21624 -116690 -73330 -107925 -146698 -178585
14595 -178585 -136022 -47272 -8150 -31381 -83113 -78559 30637 90163 42355 30918 6135
14584 6135 -186682 -267346 -177569 -34574 95764 204730 105705 52651 64033 -54523 -120080
14573 -120080 -73875 -7542 -44204 -110809 -214582 -280658 -367255 -324235 -357915 -279121 -70745
14562 -70745 55760 7753 -9922 -39457 -19286 -41376 167678 145637 -59892 -44187 -56666
14551e6666l2931Q8221M4401N6255l2835k9266n8186K7743K7754q1654j443q206
14539e6813R6856p8019J5129L1751l0010r0793l5401n4665Q099j3041J56865J21440
14527G1398J12242k5709j12608j05124J45331K3295l8792M3360j96400p3885O9038
14516h7854o978M2770J94748J51663j1611j72630q2930J8422p875P0247l1350
14505G6622r9919p7583j24780K4836K06919Q3100N088O7763O6066O1184L576M4005
14493C36877p4333K9671m4568p8799Q2218K7623J5641j09549m4936J02631n3769
14482A88707p1697K1756o8700J3884p1407j7905n9197j9774Q338L0877N9351N1412
14470F5645K9702j55780M4123n0392M8289m986o4318j1772m6546M7392M7832J0215
$$ plain form
14551 -56666 -89597 -1376 43025 99280 66445 37179 -21007 6736 34490 -47164 -48607 -56813
14539 -56813 40043 -37976 -22847 8904 -21106 -111899 -147300 -201965 -193866 -206907 -50042 71398
14527 71398 183640 157931 45323 -59801 85530 108825 70033 113393 -83007 -156892 -87854
14516 -87854 -94832 -52062 142686 294349 282738 110108 27178 45600 37725 107972 76622
14505 76622 -23297 -100880 -225660 -200824 6095 89195 94283 162046 228112 289296 292872 336877
14493 336877 262544 292215 247647 168848 251066 278689 294330 184781 139845 242476 188707
14482 188707 117010 138766 70066 83950 12543 -5362 -64559 -84333 -75995 -45118 14233 65645
14470 65645 95347 -60433 -16310 -66702 -18413 -23399 -87717 -99489 -146035 -98643 -50811 -40596
14458d0596P9378k0811q1924l9163P7155K8633m3483N016K204O0261J00236r9147
14446B7759K3099J1772j02408M2888J5157p1730n0091J33733J34758P5841K909
14435B43687J6962j51921l2250j0035j05155o4522J43683J38062n9841j24160
14425e490m2821P4524J86702K8773q3172j9611P6993k2781O9411R09J0207K4771
14413B98415j31787n8487j0839J9954j69321r0998n5887J90339K7189P7748m8112
14402D8214j35588l2808R4565K02300P480j38073r316m0446L1336n5623n0062
14391g8021m8136L3689J81246Q5638p0082p9909j28545q3241K766K6448J99648
14380D1501J40442j10994q2771o3645O9755Q5110j5542K5789q2221o3810N8196
$$ plain form
14458 -40596 38782 17971 -63953 -103116 -25961 2672 -40811 -35795 -33591 26670 126906 27759
14446 27759 50858 62630 -39778 3110 18267 -53463 -103554 30179 164937 240778 243687
14435 243687 260649 108728 76478 66443 -38712 -103234 40449 178511 118670 -5490
14425 -5490 -48311 26213 212915 241688 158516 138905 215898 193117 262528 263437 273644 298415
14413 298415 166628 108141 97302 117256 -52065 -143063 -198950 -8611 18578 96326 48214
14402 48214 -87374 -120182 -25617 176683 184163 46090 36774 -3672 27664 -27959 -78021
14391 -78021 -126157 -92468 88778 174416 104334 24425 -104120 -187361 -184595 -158147 41501
14380 41501 181943 70949 -11822 -75467 -5712 79398 63856 89645 7424 -56386 1810
14369A810Q3059j81750J7252J91916M7558j45470j47217K1415k132K6671J17677
14358C0789l4272j29696K5112R7318P5964l2125o4283J17717M3380P3563k9738
14347A73729j15531n2288O9943J7743o7338j04279O324j8540O6708k4176M7519
14336a86j877J59781J3900o3815m0389j5400n1739j011q8533J6616q7628J65757
14324E476M5569l3396j0394N3401M5818j23235r6646R4843L3968J12412l0129
14313I7687l3190p1150k2695o2615m3675J9661m4280J38390J14469m2247n6912
14302f557m3911o2303p764R9083J13561o7738q4592j1553k3138K7548J0108M5722
14290a1534n3628l71J43897L2466r099N3989O5491p8748j49797j51505j8600m5566
$$ plain form
14369 1810 84869 -96881 -79629 112287 159845 14375 -132842 -111427 -113559 -86888 30789
14358 30789 -3483 -133179 -108067 -10749 65215 33090 -31193 86524 129904 203467 173729
14347 173729 58198 5910 75853 93596 26258 -78021 -71697 -90237 -23529 -47705 -186
14336 -186 -2063 157718 171618 107803 67414 52014 275 -736 -89269 -72653 -160281 5476
14324 5476 51045 17649 7255 60656 106474 -16761 -113407 -18564 15404 127816 97687
14313 97687 64497 -6653 -29348 -91963 -135638 -115977 -160257 -21867 92602 50355 -6557
14302 -6557 -50468 -112771 -120535 -21452 92109 24371 -60221 -71774 -94912 -67364 -57256 -11534
14290 -11534 -65162 -65533 78364 110830 101731 155720 221211 142463 -7334 -158839 -177439 -223005
14278b23005N807J33682N5165j05177o7557K0918n4373K4768N3952J37169J67243
14267A48592J35460j28605j52473k2474L4434N3977o6234m406L8229j29954L1098
14256f2356M2647p9404j30744m0319K7750N6810J53644O2028K778J3291K5369
14245G1494r7619j00194K2728J53830J47978K4891k1636j37062R9667k4845j43259
14234d027l037J0417J4658J45079K3167j08166j22940k1208P7842L1247O021j2535
14222C6518k2126J2943o6972N270o8062J16611R3138k1607M4548j54704J0767
14211a3676N6535j853k6202M4400l9148K2223J03938p6955r5392N1165K5288P6101
14199A26424j28269O3307n7869Q7287J61289K9239p793j57804m5312M7825m620
$$ plain form
14278 -223005 -217198 -83516 -28351 -133528 -201085 -180167 -234540 -209772 -155820 -18651 148592
14267 148592 284052 155447 2974 -19500 14934 68911 2677 -1729 36500 -93454 -62356
14256 -62356 -19709 -99113 -229857 -270176 -242426 -185616 -31972 30056 32834 46125 71494
14245 71494 -26125 -126319 -103591 50239 198217 223108 201472 64410 164077 139232 -4027
14234 -4027 -7064 3353 18011 163090 186257 78091 -44849 -66057 11785 43032 49053 36518
14222 36518 14392 27335 -39637 -34367 -102429 14182 107320 85713 130261 -24443 -13676
14211 -13676 42859 41006 14804 59204 20056 42279 146217 69262 -26130 25035 50323 126424
14199 126424 -1845 61462 3593 90880 252169 281408 273615 115811 70499 118324 113704
14188A13704j00070m5936o7956j12490Q4472K1555J07313P0672m0443j20582p5672
14177a65433k9974l7530J42947J20834j8692J6344j5059p6181r9207L9965K068
14166a19918J34768K3757K7514J7084J6765m7025j67025n7939m1559k0359J03349
14155a30588K40655N164j07248J1226L3534J08908J35985o9483q3057j21754j24222
14144a00880L9885J2128O6746M6498j18336j5352q2374J9951k1212m2225M759
14133a90412Q4053M6246O4170l9573l2629j6344O8676J72773J5631p5791J1329
14122A08129l4035o0261n8378p2515R9912k4888j02612j1051N5677K47669J2294
14111A59941L9772q5863l5460j73029q2275K3025k30K1360k5633r0167J19712
$$ plain form
14188 113704 13634 -32302 -100258 -212748 -128276 -106721 592 71264 30821 -89761 -165433
14177 -165433 -195407 -232937 -89990 30844 12152 28496 13437 -62744 -161951 -121986 -119918
14166 -119918 14850 38607 66121 83205 99970 52945 -114080 -172019 -213578 -233937 -130588
14155 -130588 110067 115231 7983 19209 52743 161651 297636 228153 145096 23342 -100880
14144 -100880 -60995 -48867 17879 64377 -53959 -69311 -151685 -131734 -152946 -195171 -190412
14133 -190412 -106359 -60113 4057 -35516 -68145 -84489 -15813 156960 172591 96800 108129
14122 108129 74094 13833 -44545 -117060 -17148 -42036 -144648 -155699 -100022 147647 159941
14111 159941 199713 113850 78390 -94639 -176914 -153889 -154119 -132759 -158392 -248559 -128847
14100a28847J2883m0697R8298O9925O8645j84760j56706P9292J51678q6251j44788
14089b61328J0380P9971J69675R6919K7098o9557p6721r9513k8037j02629l0052
14078b83794J25407J63461J30057m1183P5492M2834p7669o7400o31p1053q267
14067a2746j45907P7163J00003L9980j91727p6438L8975J98128P0818l4841p5595
14056a2187p7698M740K2284M7635l5034p5420J2835J0945O3411O3756J22673k1479
14044A26461p1827j851k2193m3113Q2083J31251j22588j51228M269J42960M7595
14033A21819J2532k6443J45577j03882m3414j52423n5920m1020P4222O2692O9223
14022F2963J1349k0617O350R3378m3362J6377n0365j85527m8046N0797J03k9212
$$ plain form
14100 -128847 -115964 -156661 -58363 11562 80207 -104553 -261259 -181967 -30289 -116540 -261328
14089 -261328 -250948 -170977 -1302 95617 122715 53158 -23563 -123076 -151113 -253742 -283794
14078 -283794 -158387 5074 135131 93948 169440 212274 134605 67205 66574 -4479 -12746
14067 -12746 -158653 -81490 18513 58493 -133234 -209672 -170697 27431 98249 63408 -12187
14056 -12187 -89885 -85145 -62861 -15226 -50260 -125680 -112845 -101900 -38489 25267 147940 126461
14044 126461 54634 52783 30590 -12523 69560 200811 78223 -73005 -68736 74224 121819
14033 121819 134351 107908 253485 149603 106189 -46234 -102154 -143174 -68952 -6260 62963
14022 62963 74312 53695 60045 153423 110061 126438 76073 -109454 -157500 -106703 -106600 -135812
14010a35812m2863L7893J4074R99Q8766K2458p3881m7302O73Q8172J3764R5095
13998F2036J0267K703L8421o5726p3221P305K8446l0797j25496j04691J02839
13987a47914J0064J00693R7975N5194L8052j46342k4631m9295q6848R2049K50704
13976A89701P1819m3199k20932o9308J57235m5342j71979J86266L4827r677R6146
13965A75557m3500j5649j65793j6832Q5031J35248N4383L0448j0798q7735m3994
13954I6366j3985r0364J6144P9063M856M252K16148j26104k43168j14007N7297
13943a13502J23945L8888J03461R5112j07576j91122M0841K5493k7256P361J3141
13932H786o3665r4616M8955o0997p9681p569P1034k5162O4771J50615J29927p3285
$$ plain form
14010 -135812 -178675 -140782 -126708 -125709 -36943 -14485 -88366 -135668 -134995 -46823 -33059 62036
13998 62036 72303 75006 113427 47701 -25520 -18215 10231 -20566 -146062 -250753 -147914
13987 -147914 -137850 -37157 60818 116012 154064 7722 -16909 -66204 -153052 -61003 189701
13976 189701 261520 218321 -2611 -71919 85316 39974 -132005 54261 89088 79411 175557
13965 175557 132057 116408 -49385 -66217 18814 154062 208445 238893 228095 140360 96366
13954 96366 82381 -7983 8161 87224 92080 96332 312480 186376 -56792 -170799 -113502
13943 -113502 10443 49331 152792 247904 140328 -50794 -9953 15540 -11716 -4355 8786
13932 8786 -54879 -149495 -100540 -161537 -241218 -248787 -177753 -202915 -138144 12471 142398 69113
13920F9113j50983p5721L3404N9397J2707n7653K9689N3125O560n762N4758m865
13908B3769r345k6889q7793K7300J00955l7471r9689J20604K5008L0579j3559
13897E3469O7086J30610K921j27717k1946j74643J1427L2341J5426R6634N6614
13886A42222p1090m8287m3341q9436K7783l2411j14321n883M5226m2684j0279
13875b42501J02999J06683J33857j367j54457p8181l0289J31948L6760j21840
13865a16388l4604n289N8334m8929Q0251R0829Q9702o7877L684n9117K8692K0915
13853D0203O8916p2483l3605p8571n9532L3341j1894l7741j3439L7201p7015l0919
13841b35538M0281J16388L6767j200k98O5716N336j34722p8171J8806J1745K6378
$$ plain form
13920 69113 -81870 -157591 -124187 -64790 -52083 -109736 -80047 -26922 -20362 -26124 28634 23769
13908 23769 14424 -12465 -100258 -72958 27997 -9474 -109163 11441 36449 67028 53469
13897 53469 120555 251165 254086 126369 104423 -70220 -58793 -26452 -11026 85608 142222
13886 142222 71132 22845 -20496 -109932 -82149 -114560 -228881 -234764 -189538 -232222 -242501
13875 -242501 -139502 -32819 101038 99671 -54786 -132967 -163256 -31308 5452 -116388
13865 -116388 -150992 -156281 -97947 -146876 -66625 24204 113906 46029 49713 -9404 19288 40203
13853 40203 109119 36636 3031 -75540 -135072 -101731 -113625 -151366 -164805 -127604 -204619 -235538
13841 -235538 -195257 -78869 -42102 -43302 -43600 22116 27452 -107270 -185441 -166635 -154890 -128512
13829a28512P2575L4409R7487m2619l9311j396O2071P5074n0962j7131m6348O9480
13817H4817j25107J07475J63329o7227j34583j31255j57644q0874l8748M9610
13807c30207R8575m4185M6994j1089Q0529Q9335k9478M1289M1680l6921J764R073
13795d2641K9873L4628J37334N4945K5201m4883k9180j03091o4018m934o067j22626
13783a35459o566J28464Q0369J1443o4492P545N6313m4691Q063M7437m500j6630
13771F7296l548j7183O1379n7384n9755p8299R2110L2228j93873j17667N099J36623
13759a32974J46282N7191n395j7778l5171j33008k932j9968k2137L5505J52027
13748B1642J9058j77843j34731J22231J40528O2212n7368r0709r244P2340J81819
$$ plain form
13829 -128512 -55937 -21528 75959 33340 -5971 -7367 54704 129778 78816 61685 15337 84817
13817 84817 -40290 67185 230514 163287 28704 -102551 -260195 -341069 -379817 -330207
13807 -330207 -231632 -275817 -228823 -239912 -159383 -70048 -99526 -58237 -16557 -53478 -51714 -42641
13795 -42641 -12768 21860 159194 214139 239340 194457 165277 62186 -1832 -6766 -12833 -135459
13783 -135459 -142025 -13561 66808 78251 13759 21304 77617 32926 40989 88426 83926 67296
13771 67296 63748 46565 107944 50560 -9195 -87494 4616 36844 -157029 -274696 -269597 -132974
13759 -132974 13308 70499 65104 47326 12155 -120853 -123785 -143753 -165890 -130385 21642
13748 21642 40700 -137143 -271874 -149643 -9115 53097 -4271 -94980 -104224 -31884 149935
13737A49935N7566r1606j35562J16518P1346p9774M540J17792P3632J8309m2483
13726B60213m4492j52961p5924J1279n7943R8027J29525j09945m8780J7332k5938
13715C93j52286k7091J02265K7100M4164K27702P8079j87324j18472K837M8422
13704D5789l0221l0872L4988J65137K327k89940n6388J51028R3887M1589K403
13693A29727k2920j15558K6413O195Q836Q6952J09233l6553l4361p6436j02800
13682b1272k37661m9599J9394J12500J42670M5638j7734M1382q6109M1764M7581
13671C8554l7776j21398j00846K9184O5569K9902J3020J01594l4012q442k5265
13660d9916P5497J7725M2992l9093j49880N0145J37160J9071j19393q7298p591
$$ plain form
13737 149935 207501 115895 -19667 96851 168197 88423 92963 210755 284387 302696 260213
13726 260213 215721 62760 -13164 -1885 -59828 38199 167724 57779 8999 26331 393
13715 393 -151893 -178984 -76719 -49619 -5455 222247 300326 113002 -5470 -2633 45789
13704 45789 15568 -15304 19684 184821 187148 -102792 -159180 -8152 85735 127324 129727
13693 129727 106807 -8751 17662 23857 32693 119645 228878 192325 157964 81528 -21272
13682 -21272 -258933 -308532 -289138 -176638 -33968 11670 -6064 35318 -50791 -9027 38554
13671 38554 778 -120620 -221466 -192282 -126713 -96811 -83791 17803 -16209 -24651 -49916
13660 -49916 25581 43306 86298 47205 -102675 -52530 84630 103701 -15692 -102990 -110581
13649a10581m9950J6043k5688L1062L870J1893J55357J03155j26072l4579O2200
13638C6710q9237Q37J30613P5737R3464k2066n7491J0185k6549j76633L2873J6576
13626B5019n3478p5850n884p9181L9466Q7130L6117Q239m3850L9227O4800n8042
13614a6287K8312q7100J85666Q213k5527j17580j28118P9098M1460o5384j0226
13603a07473J10862O2731O317m982j2476K2110r0816O3166R1241j70596m6143
13592g6059m926L3274J35659K4326l2142q5009p4531J15914j15232k960N1119
13581c0567J39542L0094r6389l1979o2545L2057N8269J26989P0370j19713q5639
13570C0489J3122P876n144R471k7162l2628Q498J749j5869n9372J20071J05948
$$ plain form
13649 -110581 -160531 -144488 -170176 -139114 -135244 -123351 32006 135161 9089 -25490 36710
13638 36710 -52527 -51690 78923 154660 248124 226058 168567 178752 152203 -24430 8443 25019
13626 25019 -28459 -104309 -110193 -189374 -149908 -62778 -26661 -18422 -62272 -23045 41755 -16287
13614 -16287 12025 -75075 110591 118804 93277 -24303 -152421 -73323 -31863 -97247 -107473
13603 -107473 3389 66120 72437 67455 54979 77089 -13727 49439 140680 -29916 -76059
13592 -76059 -80985 -47711 87948 112274 80132 -4877 -79408 36506 -78726 -81686 -30567
13581 -30567 108975 139069 42680 10701 -51844 -19787 38482 165471 235841 116128 30489
13570 30489 43611 51487 46343 55814 28652 -3976 4522 6271 -9598 -68970 51101 157049
13558A57049o7000p0540K9008n153L6917j29981n0893L7943n9306L7533l5314
13547a19737K5083K1480L2994j2582L0116k0208q0133l9787P281Q2761Q0853O917
13535A5038j23183j1127R6873J50395L5394k2577l1182q072j7362j09549k6839
13524e2191O5700p4211N0202J17r4867J07922L2761L5695n2427O9612L3817o7655
13512E4475k00268j06650j1495M4018J05357Q0794r560J0525j363N5623O1132
13501H2588O3897L3634j36884p7568M7585l5050P9467J0548n3882l0802O1343
13490D4876j04808j98351O5950J09321n1703Q2022M1489o3302j24676N1818J38928
13479h436m7788J5403n0017j712L3810O8304J50518L1717r219l2387j65217j66902
$$ plain form
13558 157049 90049 19509 48517 43364 80281 -49700 -100593 -62650 -121956 -84423 -119737
13547 -119737 -94654 -73174 -40180 -52762 -22646 -42854 -122987 -162774 -155493 -72732 8121 15038
13535 15038 -108145 -119272 -22399 127996 163390 140813 109631 101559 84197 -25352 -52191
13524 -52191 13509 -60702 -10500 -10383 -105250 2672 35433 71128 18701 88313 122130 54475
13512 54475 -145793 -252443 -263938 -219920 -114563 -33769 -43329 -32804 -34167 21456 82588
13501 82588 146485 180119 43235 -34333 13252 -21798 57669 68217 14335 -16467 44876
13490 44876 -59932 -258283 -192333 -83012 -134715 -52693 -11204 -74506 -199182 -147364 -8436
13479 -8436 -56224 -40821 -90838 -92550 -58740 9564 160082 191799 182580 150193 -15024 -181926
13467a81926m3818p149m1639L9509J0006J29380j8470q3424Q3350N6397p289n3834
13455a18907J0757J13015J88290J74506p7960r7373j2063k0168n3467N3792p3571
13444H6851J6592J23008j913j26616l6521o325J1874J28103l8106p0063p3908
13433A2976J1797m8678R358p3604j24579J42670R4833n3616q9118J0774R3824
13422a3363M4436N8481k3922p2810k3665j1020K8678q7389j3130L1903P8927R9425
13410I6551P6314R862r840o535l5402j50939q71L9085q2706q3029J5140P3230
13398e9140R0922j93j01087J46833m5379n7855q029N0059j97422M1899J16338
13387b3054K6600J31643O8912p677J4145j24540j08149O253k2316o1040j41689
$$ plain form
13467 -181926 -225744 -232893 -274532 -235023 -225017 -95637 -114107 -197531 -114181 -57784 -65073 -118907
13455 -118907 -108150 4865 193155 367661 289701 192328 180265 160097 106630 160422 86851
13444 86851 103443 226451 224538 97922 61401 55076 66950 195053 156947 86884 12976
13433 12976 24773 -23905 -14547 -88151 -212730 -70060 24773 -28843 -117961 -107187 -13363
13422 -13363 31073 89554 65632 -7178 -30843 -41863 -13185 -100574 -113704 -81801 -2874 96551
13410 96551 172865 182727 172887 166352 130950 -19989 -20860 18225 -64481 -147510 -132370 -59140
13398 -59140 31782 31589 -69498 77335 31956 -25899 -33928 16131 -181291 -139392 -23054
13387 -23054 3546 135189 204101 196424 210569 86029 -22120 -15867 -38183 -99223 -240912
13376b40912j9533J87633J8030J3069P6215Q4222j5255M1612r535r3036j05239
13365f2729j11306q4770j1439L5527R0898N9073J36770R7686K9254l7949r5507
13354D5508j27699k2096K4320R7731K7105O3596L9667o0630j06603r122r2435
13343a20658q0613L2763J10575J16888j6620j46773m2417N5998J78230J51538
13333B38911o9073j11958o310o8954J02819o9087L0460L9919k200K9897J31223
13322B45647Q694j5461k5340M8079j75032j80091N5P1717J98838M2526j20547
13311I9085k6914q82P2092n9560N1578N4911j4449O4915J3851j19420k08408N5075
13299a8126J14017l4666L2627L5228j56728n1515l8513J22215O0833o6841m2430
$$ plain form
13376 -240912 -260445 -72812 -54782 -41713 34502 118724 103469 145081 135546 42510 -62729
13365 -62729 -174035 -258805 -270244 -234717 -143819 -84746 52024 149710 178964 141015 45508
13354 45508 -82191 -104287 -79967 17764 44869 108465 148132 87502 -19101 -28223 -120658
13343 -120658 -201271 -168508 -57933 58955 42335 -104438 -146855 -90857 87373 238911
13333 238911 169838 57880 51570 -17384 85435 16348 46808 86727 84527 114424 245647
13322 245647 254341 238880 213540 261619 86587 -93504 -93449 -21732 177106 219632 99085
13311 99085 72171 71289 143381 83821 135399 190310 175861 240776 254627 135207 -73201 -18126
13299 -18126 95891 61225 93852 129080 -27648 -79163 -117676 4539 65372 -1469 -43899
13288d3899j33487r8005p952L8870Q6702J30114R5630r2799n4205N0974N2298
13277B4241L5375r2927n6752j7853P2448p8714N6195J11586l1453o2433P8613
13266C8326m8876n7234P9720M786Q8443m9316l6817j72776o1138J51905J74590
13255A11613J52767p6110j44260M4505J07606K9864q7151j62135p1441J50101
13245E5359J23113k07688k29467o0884M9690m9678J08515J6039K8515J08288J01492
13234D3294L3174M1698n0004m3406m6890o6421j6588j72421J40943J13059j00753
13223a24315p8480L6055J43724j36689p860J55584M2150K0556q9988j25481J2440
13212a52304J63447J25616J35729J004j03713r6797n6984m070K19235Q9182J027
$$ plain form
13288 -43899 -177386 -275391 -283343 -244473 -157771 -27657 67973 -24826 -79031 -28057 24241
13277 24241 59616 -33311 -90063 -107916 -35468 -114182 -57987 53599 22146 -40287 38326
13266 38326 -10550 -67784 11936 16722 105165 55849 19032 -153744 -214882 -62977 111613
13255 111613 264380 188270 44010 88515 196121 225985 138834 -23301 -94742 55359
13245 55359 178472 -29216 -258683 -319567 -269877 -319555 -211040 -195001 -166486 -58198 43294
13234 43294 76468 118166 68162 24756 -22134 -88555 -105143 -277564 -136621 -23562 -124315
13223 -124315 -202795 -166740 -23016 -159705 -167565 -11981 30169 50725 -39263 -164744 -152304
13212 -152304 11143 136759 272488 273492 169779 72982 15998 11928 231163 320345 321372
13201C21372p4274l0481J04628J53211J60661J77612J33472j34755L3295j64692
13191F80049k31406k7043k2256j6568J0570q193k6956j39218m9147n4155N2802
13180A68479p4862j4066q7499Q6992J35243K0248R8055j47946k13220M9680R6534
13169A17638l3459L0133K9185j20081o0525K0113J07478o4261R9395R196O7487
13158B02299J51428O6651k0364q1870J35205L52455O66900N56264M89379m9488
13148B468859m65538n10088m64530l69276j45877j70317k64243J9520J07168P0917
13138B76595j03179r3378J27560j39802j49309p4378p143K28250K37638m6697
13128B56157j37936j23806N0560L5950l1467q0638O6403Q3813K4550k017O7401
$$ plain form
13201 321372 247098 216617 321245 474456 635117 812729 946201 811446 844741 680049
13191 680049 448643 421600 399344 382776 393346 385153 358197 218979 169832 115677 168479
13180 168479 93617 79551 -7948 79044 214287 234535 332590 184644 -28576 21104 117638
13169 117638 84179 114312 143497 23416 -37109 -16996 90482 26221 125616 134812 202299
13158 202299 353727 420378 400014 318144 453349 805804 1472704 2028968 2518347 2468859
13148 2468859 2003321 1493233 1028703 659427 513550 343233 78990 98510 205678 276595
13138 276595 173416 80038 207598 67796 -81513 -155891 -163034 65216 302854 256157
13128 256157 118221 -5585 44975 80925 49458 -31180 35223 119036 143586 141569 208970
13117B08970j01291M7833K17081J41843j58194r7280j74858N3873K68525L98741
13107H05243L90605N98385N50170J92045k61942n71688o17993m09374k57165k37139
13097A81147q1024K0528R7732n225j20558m7761r3614n013O1082j5678j83774
13086a92158k4461J74685k2047k4194J01564R09l3986M9530J24753j0888l6687
13075A07020J2446N743q686N0317L3072J09059l2640K7198k3318n1038L9851p2624
13063A96400p3214R0302L38901K10148J24522J04110j48883l49066j78180K786
13053C17826n8042N2827J3264n2304J8521j10522j0137N4799M4138k30407o6788
13042b6825Q3141n21L1528P728P5109P8826j19561j37290j54459J16551K4979
$$ plain form
13117 208970 107679 155512 372593 514436 356242 258962 84104 137977 406502 805243
13107 805243 1195848 1794233 2344403 2536448 2274506 1702818 1084825 675451 418286 181147
13097 181147 100123 120651 218383 213158 92600 44839 -48775 -53788 7294 -8384 -192158
13086 -192158 -216619 -41934 -63981 -88175 13389 14298 -19688 29842 154595 143707 107020
13075 107020 119466 125209 116523 166840 199912 308971 276331 303529 280211 229173 269024 196400
13063 196400 123186 213488 552389 762537 887059 991169 842286 493220 315040 317826
13053 317826 259784 312611 325875 273571 292092 181570 171433 226232 270370 39963 -26825
13042 -26825 56316 55795 87323 95051 170160 248986 129425 -7865 -162324 -45773 -20794
13031b0794o0246j61459P2584J95965J200p3293O6212M861N4173J23669N6673
13020B59545l6086l9841k8333j19192j13077k034P6844J12105j0090r4318l4695
13009b9172L180N522J77517k5950j12519j00076p8309J7915o8921o9097N9310
12998b20600O0198P6939O7836N8700L0081o2440m4334l5117j26282M1337Q0136
12987g3546O8354J6210l5495j66926K124O8952q4525O288J19304L9427m1167J9567
12975f1433m2760K2852J79452L3400j9250N3890r5437j22341k9945j15781m4098
12964b41451J14282O3472L0742n977J6161P1372J8119l3482p0755J35656K5428
12953A23567J8999j1180j6723o0757n542n7888j10153J8225p6442L4952Q5815
$$ plain form
13031 -20794 -81040 -242499 -169915 26050 27250 -46043 20169 25030 79203 202872 259545
13020 259545 223459 183618 155285 36093 -76984 -79018 -2174 109931 99841 5523 -29172
13009 -29172 -25992 -20470 157047 131097 18578 -81498 -159807 -141892 -210813 -279910 -220600
12998 -220600 -160402 -83463 -15627 43073 73154 10714 -33620 -68737 -195019 -153682 -73546
12987 -73546 -5192 11018 -24477 -191403 -189279 -120327 -204852 -198564 -79260 -39833 -81000 -61433
12975 -61433 -104193 -81341 98111 131511 112261 166151 70714 -51627 -81572 -197353 -241451
12964 -241451 -127169 -63697 -32955 -38932 -22771 48601 66720 33238 -37517 98139 123567
12953 123567 142566 131386 114663 53906 48364 -9524 -119677 -101452 -177894 -142942 -57127
12942e7127J7498L9429p8057j02817K01033L0685L6494M9222N8036j6356j73883
12931D157l426Q6868k0889R974k738L7050L964p4692J04472p8099K1702O2938
12919A51281j7564m9242r9914n8794N2239j7468j1360p8443K075J19979p4760
12908h1971r1354P1467M8657r0677j26913Q524J30259P7862O6860P199J1362j14373
12896h3098j09608m6341O9306J6027L6391K3509J6831r860L1530K4442J22891
12885I2020P6942J4412o2414n6950j886n3863j18879n1602N6870L9313K291m5487
12873a09233O571J25492o822Q372J05587J1523j20983j40566j32162r127J01890
12862a59458J02578R0523n9766q6054L6660L7680P0412L5378M7161N9443o5542
$$ plain form
12942 -57127 -39629 -200 -78257 -181074 19959 50644 87138 136360 194396 178040 4157
12931 4157 731 87599 66710 76684 73946 110996 114960 40268 144740 66641 88343 151281
12919 151281 133717 84475 -15439 -74233 -21994 -39462 -50822 -129265 -127190 -7211 -81971
12908 -81971 -173325 -101858 -53201 -143878 -270791 -262267 -132008 -54146 12714 19913 31275 -83098
12896 -83098 -192706 -239047 -169741 -153714 -117323 -93814 -76983 -86843 -55313 -30871 92020
12885 92020 168962 183374 120960 64010 62124 8261 -110618 -162220 -105350 -66037 -63746 -109233
12873 -109233 -102662 22830 16008 24380 129967 141490 20507 -120059 -252221 -261348 -159458
12862 -159458 -56880 33643 -26123 -112177 -75517 -37837 32575 67953 115114 174557 109015
12851A09015K3585j3858M6703J0020P3383N8131j47937j40485o0566J33355J10971
12840B02317j47450j48717N7954M7664R0525l6005m8497M7273j05766n9590Q2759
12829a7533N3812j05285k20737J55997J48003k9204q6756q9219N5530m6822J0616
12818a71598L8752K09318P4154L0486q2780M840N580j00747j11714L6993R0879
12807B4163K1980k8118j09254N9002O2103J6361k1522j31835J36969N2281k2865
12796E9265O2384L1296j2664J7729j00586n9943J44053m4756o0788M8044j6483
12785F7551m6201j965J2973N258N445k0522L6580m2526L6863j15967L335k0230
12773g9406o0339N9416J7070O0348N1501J03284o366n2232n3306R7748Q0077j01336
$$ plain form
12851 109015 132600 118742 165445 175465 248848 306979 159042 18557 -42009 91346 202317
12840 202317 54867 -93850 -35896 11768 102293 66288 17791 65064 -40702 -100292 -17533
12829 -17533 36279 -69006 -289743 -133746 14257 -14947 -101703 -190922 -135392 -182214 -171598
12818 -171598 -132846 76472 150626 181112 98332 103172 108752 8005 -103709 -66716 24163
12807 24163 46143 18025 -91229 -32227 29876 46237 24715 -107120 29849 82130 59265
12796 59265 121649 152945 140281 158010 57424 -2519 141534 96778 35990 84034 67551
12785 67551 21350 19385 32358 37616 43061 22539 59119 16593 53456 -62511 -59176 -79406
12773 -79406 -139745 -80329 -63259 -2911 48590 151874 145508 93276 39970 137718 217795 116459
12761A16459j48433M8049m0744k3888j5713m1680m2700J0427j1706n2j98K0835
12749a29344p6399J51722j3974l6471q3705o8376J27006J64070R7327k0993j4919
12738I5944j3432j33954q1401J72303J21427O8926j26991j81141k9422r989J00002
12727a7728r345M8458K0092k7063J0029M3951K7188j57677P0487n7155j53559
12716b02322o4830p0475J24528q120L1558J538L3434K7217J31449Q8491O6638
12705A59106l6507L5607K2992j57231K083K21598O025k5098L8200n6299q4625
12694A25851K9583p8733l3258m564p4726Q5616K1470l8515j9033K8821L4070j00339
12682b3757j5566J05074L7589J2621N3622n8675O4944P078p4001j65720k0890
$$ plain form
12761 116459 -31974 16075 -24669 -48557 -64270 -105950 -148650 -138223 -149929 -149981 -150179 -129344
12749 -129344 -205743 -54021 -67995 -104466 -188171 -256547 -129541 34529 131856 110863 95944
12738 95944 82512 -51442 -132843 39460 160887 229813 102822 -78319 -107741 -117730 -17728
12727 -17728 -27073 21385 41477 14414 24443 68394 95582 -62095 8392 -48763 -202322
12716 -202322 -267152 -337627 -213099 -221219 -189661 -188123 -154689 -127472 3977 92468 159106
12705 159106 122599 158206 181198 23967 26050 247648 253673 228575 266775 210476 125851
12694 125851 155434 76701 43443 38879 -35847 49769 71239 32724 13691 42512 76582 -23757
12682 -23757 -39323 65751 103340 115961 169583 110908 175852 182930 108929 -56791 -77681
12671g7681K398j31r0858j25182k6003J60448J42460K7407K8132p1589r4861n2703
12659a78163Q7151J30353Q5269O6074q8482j07463q6134k2572N0911M8067j73643
12648a88632Q4247J49910J24638r3239L338J06639L7306k1966q1217Q567p5801
12637E3790j9984M4263J11224O1349m9271j71557r1185n8541J2660Q1126M0364
12626A4238J5476q3608P9537j17190j41268J82J32914R3305O0057n0477k2055
12615a8889j9353r8985l0747L6671J21904N2082K99o6579J2245Q2695p214J44754
12603B08883J10812p654m4642o5437j30402j00199k624R3196m7028L5743P9254
12592A29902J22516j05495m5288p0995j1827M0856R4736M2870m762r984o1948
$$ plain form
12671 -77681 -75283 -75414 -166272 -291454 -317457 -157009 -14549 12858 40990 -30599 -125460 -178163
12659 -178163 -91012 39341 124610 190684 102202 -5261 -91395 -113967 -63056 -14989 -188632
12648 -188632 -104385 45525 170163 76924 80262 186901 224207 202241 121024 129591 53790
12637 53790 33806 78069 189293 250642 201371 29814 -61371 -119912 -107252 -26126 14238
12626 14238 29714 -53894 25643 -91547 -232815 -232633 -99719 -6414 53643 3166 -18889
12615 -18889 -38242 -137227 -167974 -131303 -9399 42683 42982 -23597 -11352 71343 64129 208883
12603 208883 319695 312041 267399 201962 71560 -28639 -31263 61933 14905 50648 129902
12592 129902 252418 146923 101635 30640 18813 59669 154405 197275 192513 182529 120581
12581A20581q9543m7398J24397M3429j901l3364K3929m721J154J926l0356j08430
12569b97j03510j8132L9963P9129k211q7785m7501n8235L4920K6062J5397P5943
12557d6257N886J39025P2373j33312r1046K18315P3277J0270J13102k4014l13958
12546B3661n1682J79666Q3203k5459K4236j93146p3437Q6458K9278l2277L2330
12535H2831J7051m7903k0316j2273L0446R3390m4521m5015O8219R7883p0925q2823
12523F6044j20783J38665J67814J48108J77918q609k4633J95152O0523N1737O7124
12512I19060q8806k22315j10049P9875J05187l0899R388N3982J6265j27134Q6920
12501F91474M85j30940l2104N2965K2412j10185n7895q3999O9707O1109r1835
$$ plain form
12581 120581 31038 -16360 108037 151466 149565 116201 140130 135409 136563 138489 108133 -297
12569 -297 -103807 -121939 -81976 -2847 -5058 -92843 -140344 -198579 -163659 -137597 -122200 -46257
12557 -46257 -40371 98654 171027 37715 -53331 164984 238261 248531 361633 337619 23661
12546 23661 -28021 151645 234848 209389 233625 40479 -32958 53500 82778 50501 82831
12535 82831 99882 51979 31663 19390 49836 143226 98705 53690 121909 219792 148867 66044
12523 66044 -54739 83926 251740 399848 577766 569157 544524 739676 800199 851936 919060
12512 919060 830254 607939 497890 577765 682952 652053 661441 715423 731688 604554 691474
12501 691474 691959 561019 528915 581880 604292 494107 436212 352213 421920 483029 391194
12490C91194j40989o1374P5017J54361l8436n7605j36199K6636K09962K54208
12480F76775K86673J85134J20750K47883J89801J88053J34076j8162j09105k6452
12470A875426o2672k50930j84637j53953j87713j01978k6347n1030j4907K4579
12460H65838O8732j24613q3557Q3187O5820j17764j50883J06813K3710j3770j64242
12449E59271r3509m3837j94460L5962K3118o8084l440P9943N8251J70595Q3717
12438F07527J8176R9412j08041j01656J04980J36119N8494O8473n4771j16162
12428G12551j9285L5088r5578p7138o2210q0697k1978P0576j9452P7333n5903
12417D63307j44577m3383J1067J348k550r6564K4831P8647n4136j20583o4870
$$ plain form
12490 391194 250205 188831 263848 418209 379773 322168 185969 212605 422567 676775
12480 676775 963448 1148582 1269332 1517215 1707016 1895069 2029145 2010983 1901878 1875426
12470 1875426 1812754 1561824 1377187 1223234 1035521 933543 907196 856166 841259 865838
12460 865838 934570 809957 726400 809587 875407 757643 606760 713573 737283 723513 559271
12449 559271 465762 421925 227465 263427 286545 218461 215021 294964 353215 523810 607527
12438 607527 625703 725115 617074 515418 620398 756517 815011 883484 828713 712551
12428 712551 693266 728354 632776 555638 493428 412731 390753 461329 441877 519210 463307
12417 463307 318730 275347 286414 287762 285212 188648 213479 292126 237990 117407 52537
12406E2537P1185n2089J41009o0477o2125J2931j36133k5466o938K6647L0079
12395h840l4525l0766J77042J1509J491J52248m6164j15575R2405L7411l3706
12384B02530J11848j66384m5146L9083k3127N7381j22016p1429L3190l492J34147
12373A46585O2591o8317j4612l0402R9203Q3496Q525M069O2838r0965j0912P7572
12361C29671q3818k18759q6724L3891N9702K9857J41702m3733j63769O934L8850
12350D3804J9941j0702O2284J18300K0730q8048q380k8286j21763j21409K5218
12339h8311L3144P1662K8091o6604J9290J69856K27572l7912k16686j21274n3281
12328c4453J72676J81206R8303j15101Q1253o9467j34386j6738J3197o2784j64842
$$ plain form
12406 52537 123722 71633 212642 152165 90040 102971 -33162 -58628 -65566 -38919 -8840
12395 -8840 -43365 -74131 102911 114420 115911 268159 221995 106420 198825 236236 202530
12384 202530 314378 147994 102848 141931 118804 176185 54169 -17260 15930 12438 146585
12373 146585 209176 140859 126247 95845 195048 278544 287069 291138 353976 263011 252099 329671
12361 329671 245853 27094 -59630 -25739 33963 63820 205522 161789 -1980 4954 43804
12350 43804 63745 53043 115327 233627 254357 166309 157929 129643 7880 -113529 -88311
12339 -88311 -55167 16495 44586 -22018 -2728 167128 394700 356788 140102 18828 -34453
12328 -34453 138223 319429 417732 302631 383884 314417 180031 163293 176490 113706 -51136
12317e1136j90461N9361J25766o5487K9349O4117K4732k1113J11534P9509J75490
12306C41661R4512q5891j45336M8707O3810K515j4517O5490j7827j60457k03295
12295a0628j1922P1488M7084K5287j0468j6455O1368J02147p0101M6233J21752
12284C55785J6038l7774m7350J9765N0439o9298J292K0724j28688l6841j5527
12273A28565J9135J35891R6508N4805j40656j65365j8168J08210M4917j9827j5712
12262B28303J16189J6776R0274N1038q2906j28709J6519j86755r7858L0634K0042
12251G3547p5430M394L4084Q0295J28580N4738O2907R1242J9534l0334J0504k1955
12239D32106Q3793l2184o7074k4989j23552j17859l4515q4175m6807N7597J3660
$$ plain form
12317 -51136 -241597 -182236 -56470 -121957 -92608 -28491 -3759 -24872 86662 166171 341661
12306 341661 436173 350282 204946 253653 317463 319978 305461 370951 353124 192667 -10628
12295 -10628 -22550 48938 96022 121309 110841 94386 155754 257901 187800 234033 355785
12284 355785 371823 334049 286699 306464 356903 287605 288897 309621 180933 144092 128565
12273 128565 147700 283591 380099 434904 294248 128883 110715 218925 263842 244015 228303
12262 228303 344492 361268 451542 502580 419674 290965 307484 120729 22871 53505 73547
12251 73547 -1883 2511 36595 116890 245470 300208 363115 454357 473891 443557 454061 432106
12239 432106 515899 483715 416641 391652 268100 150241 115726 31551 -15256 42341 56001
12228E6001k7224K2693l640J4997k9714J71808K09286K4030r5925o9410L435K9111
12216C05448R3785n7550l8971j7186j12898j9179N0897J65617J85636k0868j24219
12205D10512J5618l2551m2505l2950l2523P6681P3988m309N6301N5222l1273q5443
12193D26768K4818R3643k947J5195K32047n3193l9157k0733K8539n3465R165P2484
12181G33164m7387K2204P5877n6392m834N2564Q4530K9024j4317l8165K8439J03177
12169I67884k3781J7155l2394P6757O9961j7459j37383J74388K16522j35465J4568
12158A190753J06307J57541O1402K5779K19997K07179K13336K02914J94785J40497
12148B720490K09853J45352L6805k5249r0380j02276N1180K26016K25811p3157
$$ plain form
12228 56001 28777 51470 47830 62827 33113 204921 414207 438237 342312 272902 276337 305448
12216 305448 399233 341683 302712 285526 172628 153449 204346 369963 555599 534731 410512
12205 410512 426130 393579 351074 318124 285601 362282 436270 431961 488262 543484 512211 426768
12193 426768 451586 545229 542282 557477 789524 736331 697174 676441 704980 651515 660680 733164
12181 733164 685777 707981 783858 727466 722632 775196 859726 888750 874433 836268 864707 967884
12169 967884 944103 961258 928864 1005621 1075582 1058123 920740 1095128 1311650 1176185 1190753
12158 1190753 1297060 1454601 1516003 1541782 1761779 1968958 2182294 2385208 2579993 2720490
12148 2720490 2930343 3075695 3112500 3087251 2996871 2894595 2945775 3171791 3397602 3324445
12138C324445k00638q8777j17899l0590K10272K19230k6418M0792J8351j9648
12128C329120J68698j05136j65826k38285n2208j42242k07763M9343Q5505n9078
12118B662128j1968Q1254J53389K08101M2021K23279K73134K55219L67120N43045
12108D796722N27187N86767N46891M14218N52088P32114O36009O73689P64155
12099A0229840R31945J126915J118341J328098J476812J486160J161930Q39301
12091A9699342N81282K13149Q917J8204K38567O21408J136309J798444K750814
12082B7066436M330212O259452Q847721J1973545J5439788J9406436K2837599
12075A16161189K3480782J8342126P210229o369130j6458979k0153824j8497768
$$ plain form
12138 3324445 3123807 3035030 2917131 2886541 3096813 3316043 3289625 3330417 3348768 3329120
12128 3329120 3497818 3392682 3226856 2988571 2936363 2794121 2586358 2635701 2721206 2662128
12118 2662128 2650160 2731414 2884803 3092904 3134925 3358204 3631338 3886557 4253677 4796722
12108 4796722 5323909 5910676 6457567 6871785 7423873 8155987 8791996 9465685 10229840
12099 10229840 11161785 12288700 13407041 14735139 16211951 17698111 18860041 19699342
12091 19699342 20280624 20493773 20502690 20520894 20759461 21380869 22517178 24315622 27066436
12082 27066436 31396648 37656100 46503821 58477366 73917154 93323590 116161189
12075 116161189 139641971 157984097 165194326 158825196 142366217 122212393 103714625
12068A03714625j4075419r041425m575178j578613O54814K344501L719792M688298
12060H5851395N124194M975560L658982J558315l05200q97720l36728Q90079K674856
12051A03193733M330590N553211O101061N315909K998993r4724k855701m117647
12043A20425425m013191k578563J2067L368102P025742J1441256J7666999K7307960
12035A80655797M0772653N6066858O7009603O3248629L8713811L0927l6373838
12028D10124440n7163996o0012013n1691719l9788924k8604670j9996302j3406978
12021A39459838p882859l316263J94932K608871L393425K509093J58144l131513
12013A33993668n700556p065620o754233n609984l862280j790774j04971O10802
$$ plain form
12068 103714625 89639206 80597781 76022603 74443990 75098804 77443305 81163097 85851395
12060 85851395 90975589 95951149 99610131 101168446 100863246 99965526 99628798 100518877 103193733
12051 103193733 107524323 113077534 119178595 124494504 127493497 127398773 124543072 120425425
12043 120425425 116412234 113833671 113845738 117213840 124239582 135680838 153347837 180655797
12035 180655797 221428450 277495308 344504911 407753540 446467351 446498278 410124440
12028 410124440 352960444 292948431 241256712 201467788 172863118 152866816 139459838
12021 139459838 131576979 128260716 128455648 131064519 134457944 136967037 137125181 133993668
12013 133993668 128293112 121227492 114473259 108863275 105000995 103210221 103105250 103716052
12005A03716052J88953j300634l169820m375413m523673m039836l278862k471145
11997H0745622j326367M41917K948850O931968J2537202J8296505K2529615K1974992
11989A65080304J3992040L98201j3515343k2190180k4198628k2080427j8876925
11982G8609042j5509958j2009752q811140o002805m002583k563699j567716r20066
11974B7221323n22381m44958m78196n02616o49119r69403j097706j386925j697159
11965A9472860j723877j622174j428898j196442r69908q63667p50598o34855o27983
11956I654458q22852p27628o86140p72748o82840l26229l16390m17799l63366
11947D538466j89659j61686j36773j29558l19747P4237N334n8698J48696J12088
$$ plain form
12005 103716052 103905005 102604371 99434551 95059138 90535465 86495629 83216767 80745622
11997 80745622 79419255 79861172 82810022 89741990 102279192 120575697 143105312 165080304
11989 165080304 179072344 179470545 165955202 143765022 119566394 97485967 78609042
11982 78609042 63099084 51089332 42278192 36275387 32272804 29709105 28141389 27221323
11974 27221323 26698942 26253984 25775788 25273172 24624053 23654650 22556944 21170019 19472860
11965 19472860 17748983 16126809 14697911 13501469 12531561 11667894 10917296 10282441 9654458
11956 9654458 8831606 8103978 7417838 6645090 5962250 5636021 5319631 4901832 4538466
11947 4538466 4348807 4187121 4050348 3920790 3601043 3675280 3680614 3621916 3770612 3882700
11937C882700J75552J58495K11840Q8890N2476o7389j4886N4750r9060j66238
11927D277130j27430N8910J97031Q7028n3630m1497J8952k6396r5438l7804J25483
11916D382339J330j96966k79484k66406j25531k54104k36569o7482j96358k62818
11906B497951k39705l31995j20406m4724K4445j55986q9400P8855J2901N9373
11896A691309L4844j95369j45980R5984p4453o9291m0546j25332R629L3844O0024
11885A274663N3754p9876j50213N574K4477M5226j9521k33251j20297M4581J09815
11874I54932R9383q095j13858j84748n4199K4404k2990R0355n5815M291J8814
11863G52474L679q6945l2012l1611M1971m8965N975l3205o0053J9721J8507j2736
$$ plain form
11937 3882700 4058252 4216747 4428587 4517477 4569953 4502564 4487678 4542428 4443368 4277130
11927 4277130 4149700 4208610 4405641 4492669 4439039 4397542 4416494 4390098 4294660 4256856 4382339
11916 4382339 4383669 4186703 3907219 3640813 3515282 3261178 3024609 2957127 2760769 2497951
11906 2497951 2258246 1926251 1805845 1761121 1785566 1629580 1540180 1619035 1631936 1691309
11896 1691309 1726153 1530784 1384804 1480788 1406335 1337044 1296498 1171166 1180795 1214639 1274663
11885 1274663 1328417 1248541 1098328 1103902 1128379 1173605 1154084 920833 800536 845117 954932
11874 954932 1054315 1046220 932362 747614 693415 717819 694829 785184 729369 733660 752474
11863 752474 756153 669208 637196 605585 647556 598591 604566 571361 511308 531029 549536 536800
11851E36800K1029L0938p1631n5682j59980j29435J19073J55685j2679O3595K9412
11840E27125N3907P8958M2207j4693O4744k4061j12699j41814O6238M4894j00562
11829D84244l1481p8204p6562K67K02336K4318q3110M7482q61r9770j5052p8059
11817B95548j15663J50183J88838n0070k1710j9050J669J28375n7369j09993p2032
11806C18726J04310n017k0609J1962P321n0151m6182l7827p5684m6463J40670
11795C01056J06298Q2452K1898j34987j05331O3321m0889O702p8829L0632M1759
11784B94082m8835k8400N3596j02449n6359Q7426O3769k7570k253K6341j8903
11773B40445Q9q9108N7204O9945m3653p8487l4048j44169K5931P2545J46705N3399
$$ plain form
11851 536800 557829 588767 517136 461454 301474 172039 291112 446797 434118 497713 527125
11840 527125 581032 659990 702197 687504 752248 728187 615488 473674 539912 584806 484244
11829 484244 452763 374559 297997 298264 500600 524918 441808 489290 488429 388659 373607 295548
11817 295548 179885 330068 518906 468836 447126 428076 429745 558120 500751 390758 318726
11806 318726 423036 418019 397410 409372 416693 366542 320360 282533 206849 160386 301056
11795 301056 407354 489806 511704 376717 271386 334707 293818 300520 221691 252323 294082
11784 294082 245247 216847 270443 167994 111635 199061 262830 235260 233007 259348 240445
11773 240445 240534 151426 208630 278575 234922 156435 122387 -21782 4149 76694 223399 276798
11761B76798L6925j01321k6587M341j28121o7188L1494J9799l7995J30529J14207
11750B52881p0784k3431j06831r1604J66187J89552N466q3408Q720k9257R9486
11739C16977J7250q4078j27045m9277R7067K8215p2435j256K4826k0591l0852
11728I8801N3628J23154m3628n8957m3087m2731J4675p8143m718J68185K35790
11717D22969o7716j49100K6667j52331k26915j20821O8996J37075Q0070j4115
11707D779J5321M2103p5556L2098O4746J63517P1779n4591K6356m2264j03986
11696A44302Q1895N1723J2181j02646q8500P4575J1963o4522q043q1421N0983
11685H2490Q5121j61371k8302J20025J91542l2821P0095l5755n8810o4756j71958
$$ plain form
11761 276798 313723 212402 185815 190156 62035 -5153 26341 46140 8145 138674 252881
11750 252881 182097 158666 51835 -39769 126418 315970 321436 238028 246748 217491 316977
11739 316977 334227 250149 123104 73827 170894 199109 126674 125418 150244 129653 98801
11728 98801 152429 275583 231955 172998 129911 87180 101855 23712 18994 187179 422969
11717 422969 355253 206153 232820 80489 -146426 -267247 -198251 -61176 18894 4779
11707 4779 20100 62203 -13353 18745 83491 247008 318787 264196 290552 248288 144302
11696 144302 226197 277920 290101 187455 98955 173530 185493 120971 112928 31507 82490
11685 82490 167611 6240 -22062 97963 289505 256684 326779 291024 232214 167458 -4500
11674d500m0514l4874j9087K7345M6706R0269P6603J9135j66935j28256m0128
11663a74236J07818P8350m6566K5124P9012l4095j2404L41J85335m2753J780J1483
11651A79189r4471r7501J09286O3185m3285r2776n2244n0207K5945J51113P4107
11640A72341l358l875R9637l6713j3813M0669R6601P0774q8378r0216J00015J38444
11628D82128K18297J5068J14675J05512K349J30689m7731o0169j01983m9727R3067
11617I02175j18143r8587j1774o4211m1053L4900m7203L369K0734R1838q4542
11606E87503m5654K3652p294k455o4662O8796J097L5371R0006R9823j42797K3141
11594F66527J08614k0135j45640j58327J01942Q9450r8071J04274M50314M22909
$$ plain form
11674 -4500 -45014 -79888 -98975 -71630 -24924 65345 141948 161083 -5852 -134108 -174236
11663 -174236 -66418 11932 -34634 -9510 69502 35407 23003 23344 208679 165926 167706 179189
11651 179189 84718 -12783 96503 159688 116403 23627 -28617 -78824 -52879 98234 172341
11640 172341 168983 165108 264745 228032 214219 254888 351489 422263 333885 243669 343684 482128
11628 482128 700425 715493 830168 935680 938029 1068718 1020987 960818 858835 809108 902175
11617 902175 784032 685445 673671 609460 568407 603307 556104 559473 580207 672045 587503
11606 587503 541849 565501 558207 555752 491090 559886 560983 596354 686360 786183 643386 666527
11594 666527 775141 755006 609366 451039 552981 642431 544360 648634 1098948 1521857
11584A521857K82025J42610J61725M0606q6694j92905j46942j38196l28428k70660
11574I84998j25688j65053n4945p302M371L2208j06400N6354J9996r8020J6045
11563E56564O5174j03081o1442Q2186R3886j4371K9651N9459j42197j53798J0914
11552D22945N5111J32812N2432j85401j32332R8213J70246J86084l9147j0486
11542G50477M653O1711J35651Q973j6914l6282j12529j33910k14918k1302o4444
11531C61166q3222l5404n1225n6768m8165O1320l3066J5486J3699j27646J06446
11520A22621P611K5068q086L039K961P6825J8598M7419p1209j16651j16715K5224
11508A6705j414M8138k11928j48545N9544Q6557j32011J44733J72689o3170j0370
$$ plain form
11584 1521857 1803882 1946492 2108217 2148823 2062129 1869224 1722282 1584086 1255658 984998
11574 984998 859310 694257 639312 632010 636381 668589 562189 618543 638539 540519 556564
11563 556564 621738 518657 457215 539401 633287 618916 648567 708026 565829 412031 422945
11552 422945 478056 610868 663300 477899 345567 443780 614026 800110 760963 750477
11542 750477 755130 816841 952492 961465 944551 908269 795740 661830 446912 425610 361166
11531 361166 277944 242540 191315 134547 86382 147702 114636 130122 143821 16175 122621
11520 122621 130232 155300 147214 150253 153214 230039 248637 296056 224847 108196 -8519 16705
11508 16705 15291 63429 -148499 -297044 -237500 -150943 -282954 -138221 34468 -28702 -39072
11497c9072P6919l0134J970K4245r0996Q2127J41776j7678k23152r8871m2982
11486b15848R4226J4747R9087N3643M3160l1358j71345J9818J81316J11749R775
11475B08970j70166j29737k0723J81158l243k5233Q1321j2578L735O7286L6139
11464B16929n4392j05539r9778j26411k8039Q8923P7608Q6613k4621l2829M5931
11453D4395N1717q2257r2406J561P7213Q0618Q5492j10730j05517M1893k0619
11442b8640j13581M3835J42103L9515K8098k20620n8020N2347k2486k8688K588
11431a63549P4491J05544R9291n9575P9583N400p6961l7441q9891l9952R6183
11420f877M0622r1159L1386r2183l4984p638r2548M5582J19735Q5791J28751J33157
$$ plain form
11497 -39072 37847 7713 9683 33928 -57068 25059 166835 149157 -73995 -172866 -215848
11486 -215848 -121622 -106875 -7788 45855 89015 57657 -113688 -93870 87446 199195 208970
11475 208970 38804 -90933 -111656 69502 66259 41026 122347 109769 113504 180790 216929
11464 216929 162537 56998 -42780 -169191 -197230 -108307 -30699 55914 31293 -1536 44395
11453 44395 96112 13855 -78551 -76990 223 80841 166333 55603 -49914 -8021 -28640
11442 -28640 -142221 -98386 43717 83232 111330 -109290 -167310 -114963 -137449 -166137 -163549
11431 -163549 -89058 16486 115777 56202 135785 141185 64224 26783 -63108 -103060 -6877
11420 -6877 33745 -57414 -26028 -118211 -153195 -160833 -253381 -207799 -88064 -2273 126478 259635
11408B59635o2031J29950L3295r1334j70786k4426J00153M374q1804o5514j5362
11397A6150R2894j15530J6839j6246k6085o2454k7248n2855k5948k3456R0426
11386a33513O8575Q5961L352M0383n2605j35943r38n76L6086N0468P3828M9030
11374H4108j36145q0646M4834J8174j21558N7398j11120L6766L0201J6729k4107
11363a85366K2294O7664j4374L1261N3672k1291R045q3069k6413J2539j6010k1039
11351a71087n8327R477Q2790K5439L4707J0421q0409Q2793L7803p2373O622m761
11339i6905m5397o6567R7525L8158k6770Q9792j04175j17368L3979J33910R0257
11328B6439k3855n7960j8185J5473J62764J72763p8493k02584j41777m0203Q9999
$$ plain form
11408 259635 197604 327554 360849 269515 98729 74303 174456 178830 97026 31512 16150
11397 16150 109044 -6486 10353 -5893 -31978 -94432 -121680 -174535 -200483 -223939 -133513
11386 -133513 -64938 21023 24375 64758 12153 -123790 -124728 -125304 -89218 -38750 35078 84108
11374 84108 -52037 -132683 -87849 -69675 -191233 -133835 -244955 -208189 -177988 -161259 -185366
11363 -185366 -163072 -95408 -109782 -78521 -24849 -46140 -37095 -120164 -146577 -134038 -150048 -171087
11351 -171087 -229414 -219937 -137147 -111708 -77001 -66580 -146989 -64196 -26393 -98766 -92144 -96905
11339 -96905 -142302 -208869 -111344 -73186 -99956 -10164 -114339 -231707 -197728 -63818 26439
11328 26439 2584 -55376 -73561 -58088 104676 277439 198946 -3638 -145415 -185618 -95619
11317i5619J5208M663k13100l9109J26762P5211j11077N5050M4442J51490l156
11306A0765n9506j26951J09358J50637O6669m9796K6698L3454p34p7168p5462
11295G964m9745m9627O048j683o9047P8402J09246J03763o857n6586j79948K9784
11283g8286O8291L433R842m1165M3022P5452q3024J1274j42041p6568J4620M3208
11271a51942m4114J3665J17087J39671N7239j5832o9021q4441L0282J25139J47909
11260B65642O135k41012j54685K4477N8740l3326n0741p145O4748J3192k441K8522
11248b7894j9247L0731R9079j01900j70430J06020j7320Q7205M5965j03410j71070
11237b42271n9612O2288J44106l7861J1839M6869O1040L339n5870l160J29278
$$ plain form
11317 -95619 -80411 -75748 -288848 -327957 -201195 -125984 -237061 -182011 -137569 13921 10765
11306 10765 -48741 -175692 -66334 84303 150972 101176 127874 161328 160594 83426 7964
11295 7964 -41781 -91408 -85360 -87043 -156090 -77688 31558 135321 128464 71878 -108070 -78286
11283 -78286 -9995 -6562 3280 -37885 5137 80589 -2435 8839 -133202 -209770 -195150 -151942
11271 -151942 -196056 -182391 -65304 74367 131606 115774 46753 -37688 -7406 117733 265642
11260 265642 271777 30765 -123920 -99443 -40703 -74029 -124770 -131915 -67167 -53975 -56416 -27894
11248 -27894 -47141 -16410 82669 -19231 -189661 -83641 -100961 -13756 32209 -71201 -242271
11237 -242271 -301883 -239595 -95489 -133350 -121511 -74642 -13602 -10263 -66133 -69293 59985
11226E9985K0637K9469j38722n6641J3283O6547n0576k58604j07643J2509J22099
11215b87657J76819J79844M1255p1938n9510j9144m2532q5740K6575N8940O2686
11204b0402N7611N5901j25172q2380Q3491O081J8186p2181N1301j5514j12220
11193a55298L3044Q999J3631J19596N8847J99593j40367j49086r381k1628P9934
11182C7884K1957q5408K3946O215k8048r5710l4681P4144l4178p7439L1126J24600
11170c5592L4325k3780j10589K7568O7832N6859K2470P7261Q163p7644j02727
11159e5854p4265j9697J00321R0170m8583q6346j40389M0593l2135Q3546J17524
11148b5115M3195K0161j33921l4720K1875M108l1993j0794J27727m1177L8340
$$ plain form
11226 59985 80622 110091 -28631 -85272 -71989 -5442 -56018 -314622 -422265 -409756 -287657
11215 -287657 -110838 69006 110261 38323 -21187 -40331 -82863 -168603 -142028 -83088 -20402
11204 -20402 37209 93110 -32062 -114442 -30951 -24870 -6684 -78865 -27564 -43078 -155298
11193 -155298 -122254 -113255 -99624 19972 78819 278412 138045 -11041 -20422 -42050 37884
11182 37884 59841 -25567 -1621 4594 -23454 -119164 -153845 -79701 -113879 -191318 -160192 -35592
11170 -35592 -1267 -25047 -135636 -108068 -40236 16623 39093 116354 124517 46873 -55854
11159 -55854 -130119 -149816 -49495 40675 -7908 -94254 -234643 -194050 -226185 -142639 -25115
11148 -25115 18080 38241 -95680 -130400 -108525 -104417 -136410 -147204 -19477 -60654 -22314
11137b2314R8603K7624L002K6091J07090N8492j00733p8013M4150L6854n9297
11126A41549q4626n8868p3164J9935K3202P442N0000K9584J6087j30001l9368
11115i8228J23283M3503m8913J1155P3843P8927r9488k6120k7207q5309j83507
11104b38061l476M0576J21982R536o9127K9900J56908J60320O0737K739M0121
11093C12155j05486j98711k16896l9157n4356l3782M7855P9572J13025R0814Q6770
11082H1803J28371l1993r9976j30322N7164O2970K0096q9904o8779o9903l1750
11071a72223K4627l3259K8057M3894N2334j8371r3439m1249q08K1658K54010J43174
11059B08405N476n5976m3275q7778J3146K6710k6553p5514m8792J09330k0300
$$ plain form
11137 -22314 76289 103913 106915 133006 240096 298588 197855 119842 163992 200846 141549
11126 141549 56923 -1945 -75109 -55174 -31972 -24530 25470 55054 71141 -58860 -98228
11115 -98228 25055 68558 19645 30800 104643 183570 84082 57962 30755 -54554 -238061
11104 -238061 -241537 -200961 -78979 -69443 -138570 -108670 48238 208558 269295 272034 312155
11093 312155 206669 7958 -208938 -248095 -302451 -336233 -288378 -208806 -95781 -4967 81803
11082 81803 210174 178181 78205 -52117 5047 68017 88113 -1791 -70570 -140473 -172223
11071 -172223 -147596 -180855 -152798 -108904 -56570 -74941 -168380 -209629 -210437 -188779 65231 208405
11059 208405 213881 157905 114630 26852 39998 66708 40155 -35359 -84151 25179 4879
11048D879J12549J78667K1698p1112k71821j21575L2474R73O501O1593j7872J07996
11036D4950M0282o0109j1836M3341m2725m6785o3374L720J69977J1139K5198j48284
11024c4506r8616N5663L820n8874n3666j06528J43383J77282l1003K2730O9180
11013H8865k8033n4695R3301M0691p9057l5749k5865k8680k8992l8065M678K4821
11001f6780q6279n2252r4512J17650P9199k01217p4660J50942O990J87776J65510
10990A32367p1141o425p407k774J08146j9253K5239k4794l0826p873K0139L2421
10978A47819p9110J05659K8231j20468j72532j82463k0921J97196J67815L3094
10968A04320m2638J2930J2096J4080p0144r371J0329j34851N628N8951l2227o7225
$$ plain form
11048 4879 117428 296095 317793 246681 -25140 -146715 -114241 -113268 -106767 -45174 -63046 44950
11036 44950 85232 25123 13287 56628 13903 -32882 -96256 -92536 77441 88580 113778 -34506
11024 -34506 -133122 -77459 -73639 -132513 -186179 -292707 -149324 27958 -3045 19685 88865
11013 88865 60832 6137 99438 140129 61072 25323 -542 -29222 -58214 -96279 -91601 -66780
11001 -66780 -153059 -205311 -299823 -182173 -102974 -304191 -378851 -227909 -220919 -33143 132367
10990 132367 61226 54801 47394 44620 152766 133513 158752 133958 103132 95259 115398 147819
10978 147819 68709 174368 202599 82131 -90401 -272864 -293785 -96589 71226 104320
10968 104320 61682 74612 86708 100788 30644 21273 31602 -103249 -97621 -38670 -70897 -138122
10956a38122J63539N8344J09232j2600k25481r7907m540j2142N5419J16683j7806
10945e381J994O092K4386m4738j1316J0605l007m6675j15163r42L7715R3793J31015
10932G8378p33p2051r9383P7579M994n1588k1420j00077R385P6189N5411j592
10920d4908Q6960J41454j0537n9859Q7427P2154j17828j16064n1974J20465Q6761
10909A94051J8192k01969k17145L2785O6952M5770P7516j22027k9569j6336n0317
10898b02097J040J02726J39648j2047j44926j24213o28O7614J56084J40801M361
10887A28363l6311j6064o0528l8883J7305J01360K07761K4813j12369j08592p7702
10876B9153o2913j81481k7119J38458Q8394k3862p7570j08256j2533P3819k1877
$$ plain form
10956 -138122 25417 83761 192993 180393 -45088 -142995 -147535 -159677 -104258 12425 -5381
10945 -5381 -3387 2705 27091 -17647 -28963 -18358 -21365 -68040 -183203 -184145 -146430 -52637 78378
10932 78378 77645 5594 -93789 -16210 -11216 -62804 -84224 -184301 -174916 -98727 -43316 -44908
10920 -44908 42052 183506 172969 113110 200537 272691 154863 38799 -13175 107290 194051
10909 194051 212243 10274 -206871 -174086 -107134 -61364 16152 -105875 -135444 -151780 -202097
10898 -202097 -201057 -98331 41317 29270 -115656 -239869 -240497 -172883 -16799 124002 128363
10887 128363 92052 75988 15460 -23423 -6118 95242 303003 327816 215447 106855 29153
10876 29153 -33760 -215241 -242360 -103902 -15508 -39370 -116940 -225196 -237729 -163910 -185787
10865a85787P954J46222R4669j280p9362j8210Q190m4313J08020j0609j13702
10854h8208O8945L5064j10485O0453m9710p9162j7760P8709j2647K6867o2777
10843a50711K3529J23476n3907M0159M1354L5404o1900j67569J32745J37816l2564
10832F7832Q6238p5059K3028J08255J27905m1440j02543r1581K3622k1399M5805
10821A50663p638m4355K7182j02665j7319j77170j40402O4290J51576n7771J690
10810a51919J06843Q761m685K071N8291J13969L6351j44105k2832n2123j03756
10799a53134R0757Q8055k8666L3294K1099J5808n4268o3639q8502j18532O2839
10788a94889Q2967R0077m9519j34672o3720m4920J10318K6422Q5656M9851N3547
$$ plain form
10865 -185787 -177833 -31611 63058 61778 -17584 -35794 -27604 -71917 36103 25494 -88208
10854 -88208 -19263 15801 -94684 -34231 -83941 -163103 -180863 -102154 -114801 -87934 -150711
10843 -150711 -127182 -3706 -57613 -17454 23900 59304 -2596 -170165 -37420 100396 67832
10832 67832 154070 79011 102039 210294 338199 296759 194216 102635 126257 104858 150663
10821 150663 143025 98670 125852 23187 5868 -171302 -311704 -247414 -95838 -153609 -151919
10810 -151919 -45076 -36315 -41000 -38929 19362 133331 169682 25577 2745 -49378 -153134
10799 -153134 -62377 25678 -2988 30306 51405 67213 12945 -50694 -139196 -257728 -194889
10788 -194889 -111922 -21845 -71364 -206036 -269756 -314676 -204358 -177936 -92280 -42429 11118
10777A1118j6053q2842l7388J45470m8942P218J37274k5831K9011l2024o45j2760
10765G3606j092r4233o0032O3151o1652J06959K6943p5132n8993K1074J04957
10754D5556m3856m4790j2110L8915N0739N6191j27360m9074P4902J20764J45935
10743B55812J48782j43179j04936p4372q0953q9832p0326K5638l248O2325L0852
10732d3437J61200J96189j06728q2646J7739M7175m0471r2568m1957p3976J1597
10721d7883L2513J70807o5725j57156Q4362j12773J07367l7300M648n192J10209
10710H3877O8264j3690k4575L5345Q4698r5617k9635o0347p4530L7609o0265q7
10698d8953K0663N9212n8700q2719K5475R3147j02991K2766P7286n5460J33194
$$ plain form
10777 11118 -4935 -87777 -125165 20305 -28637 -21419 115855 90024 119035 87011 86366 73606
10765 73606 72514 -21719 -81751 -18600 -80252 26707 53650 -21482 -80475 -59401 45556
10754 45556 1700 -43090 -55200 -16285 34454 90645 -36715 -85789 -10887 109877 255812
10743 255812 404594 261415 156479 82107 1154 -88678 -159004 -133366 -136614 -74289 -43437
10732 -43437 117763 313952 207224 124578 142317 189492 149021 56453 14496 -59480 -47883
10721 -47883 -15370 155437 89712 -67444 16918 -95855 11512 -25788 -21140 -26332 83877
10710 83877 152141 138451 113876 149221 233919 138302 108667 48320 -26210 11399 -48866 -48953
10698 -48953 -28290 30922 -27778 -110497 -85022 8125 -94866 -72100 5186 -50274 82920
10687H2920M3610K5181M6903j529o3301K9408j8824j27680j28529l1082N3179
10676h9744j08858l5031J26651O6589L5628L7457p9503q5009M7178j74357K0236
10665b38763J13169N6151J440m4972O3574R77P5184J8493j28654j844J06104j5116
10653E743l9980l3436m6029R3250J27669J14398n4759j57044k9551R5922k1072
10642E5111q2349j41228j1609J14106J7484J35675N1276K9901R1294K44360K8386
10631E32407o5665m3698L16n3467k07690n6862l9217M4064J39933k696j3392j2812
10619B21221J4J9769R1432O5045j67518k28363m0295J16660j5340l2340L684J0339
10607D4308P0404J6767n5013n1764n8645j84974n3329Q5768J31597J13107N1591
$$ plain form
10687 82920 126530 151711 198614 197085 133784 163192 144368 16688 -111841 -142923 -89744
10676 -89744 -198602 -233633 -106982 -40393 -4765 32692 -46811 -131820 -84642 -258999 -238763
10665 -238763 -125594 -69443 -68003 -112975 -49401 -48424 26760 45253 -83401 -85245 20859 5743
10653 5743 -34237 -67673 -113702 -20452 107217 221615 166856 9812 -19739 76183 55111
10642 55111 -27238 -168466 -180075 -65969 -48485 87190 138466 168367 259661 504021 532407
10631 532407 466742 423044 423360 369893 162203 105341 66124 110188 250121 247425 234033 221221
10619 221221 221235 241004 332436 397481 229963 1600 -38695 77965 62625 30285 33969 44308
10607 44308 114712 131479 76466 24702 -33943 -218917 -272246 -186478 -54881 58226 109817
10596A09817r9199o6967M709m4937J20297M1049J00507m6015k5390L9358j31783
10585A446m6799j0928p2817K5555K22933K9097l924l0758O666q267l0671M5752
10573A27285M0727j36810P1930N6718n9024J40531J4061N6441r3966N839L1338
10562B55070j0478j09473q5263J9453P5440j11694o3613r1321P9129K2710o7195
10551h7235J9664P1237J64540j9467K1274O4092n4317k16812m8935Q8460M2858
10540D5359j0139j05086O3049J20258q926j27640j12762P0871J10484j5374j76772
10529a46678J23095J78793J0516k4873M7738O6569l6181l3246j4906L2531j44351
10518E9007p7455L5310j37938m9200J3293J68217R3065o5856k005J8751J40357
$$ plain form
10596 109817 10618 -56349 -51640 -96577 23720 64769 165276 119261 93871 133229 1446
10585 1446 -45353 -56281 -129098 -103543 119390 148487 144563 113805 120471 112204 81533 127285
10573 127285 168012 31202 103132 159850 100826 241357 255418 311859 217893 223732 255070
10562 255070 244592 135119 49856 69309 144749 33055 -30558 -121879 -42750 -20040 -87235
10551 -87235 -67571 3666 168206 148739 170013 234105 179788 -37024 -85959 2501 45359
10540 45359 35220 -69866 -6817 113441 104515 -23125 -135887 -65016 45468 30094 -146678
10529 -146678 -23583 155210 165726 140853 188591 255160 218979 185733 170827 203358 59007
10518 59007 -18448 16862 -121076 -170276 -156983 11234 104299 38443 36438 55189 195546
10507A95546K7253j14561j72957K3205P7522j41098O3639K15384K546r5744j19704
10496c8969J42354J6420n5477j01880k6467r7489Q0446R4365j4050k5402p242
10485c3391l6218j07123J9828K6096J23539J76801n3128j65583n420P0070k7632
10474a2161l6326Q983j0451L1781R3823o7730R4313L4017J3207L806j59734P5387
10462F8915J44343j09126m7995J14808L436j59390M7872K498k0327L9770o689
10451G8115j60925n4134R2715r8077j6169J50416N3193P406m5005l6879q9481
10440a18825L5666J5288L6814m1616J2383J19233M6499l2132Q0903j2247n2509
10429H9457j65976j69085R1093J89228J25184j4246j06038n8664l6186O2865J30010
$$ plain form
10507 195546 222799 108238 -64719 -41514 36008 -105090 -41451 173933 176479 80735 -38969
10496 -38969 103385 119805 64328 -37552 -64019 -161508 -81062 13303 -747 -26149 -33391
10485 -33391 -69609 -176732 -156904 -130808 -7269 169532 116404 -49179 -54599 15471 -12161
10474 -12161 -48487 -39504 -49955 -18174 75649 7919 102232 136249 149456 153262 -6472 68915
10462 68915 213258 104132 56137 170945 174381 14991 62863 65361 45034 84804 78115
10451 78115 -82810 -136944 -44229 -142306 -158475 -8059 45134 52540 7535 -29344 -118825
10440 -118825 -83159 -67871 -31057 -72673 -60290 58943 105442 73310 154213 141966 89457
10429 89457 -76519 -245604 -154511 34717 159901 145655 39617 -19047 -55233 7632 137642
10418A37642R6005J69851k5524k830L7357P428k4442j71403j20044j00791O2245
10407F5494R7497j5886j24719J02961J07081p2864n6639l1396J8832R7291J70276
10396C57928j7073k11424m8442L1656M3297m0494P060j312L0487K5247J4403Q2417
10384B73750R9749j58667n4692j38479k1100L29823J40412K06585J83512Q3924
10374I44817K4737L2743N6050Q5012J31468m3310k56384k38698p6893n7106j97816
10363D04620n0585L7959k2587j48481j33617j12884k4245M6394J17179k564m0570
10352G0619K4408P6460p041j21518J00078K1357k2539n7021j95917N005J02848
10341c261K23990k5359m9085K2123P1726Q0060K87875K13471K17916K62374J61256
$$ plain form
10418 137642 233647 403498 377974 375144 412501 419929 395487 224084 104040 3249 65494
10407 65494 162991 147105 22386 125347 232428 159564 102925 71529 90361 187652 357928
10396 357928 340855 129431 80989 112645 155942 115448 122508 121196 151683 176930 191333 273750
10384 273750 373499 214832 160140 21661 561 330384 470796 677381 860893 944817
10374 944817 969554 1002297 1058347 1143359 1274827 1231517 975133 736435 659542 602436 404620
10363 404620 354035 391994 369407 220926 87309 -25575 -49820 -3426 113753 111189 70619
10352 70619 95027 171487 164446 42928 143006 164363 141824 84803 -111114 -106109 -3261
10341 -3261 220729 195370 146285 168408 240134 320194 608069 821540 1039456 1301830 1463086
10330A463086J38490J45683J05662n2288N6825k3885j28473k03649k47664k91212
10320I62575k26949j84363j9040j08388n4028q0215j14792J19477P7411j44260
10310B27428q5598j1440k8981P49Q0480p4162l9652M2332R6811J3931q1780j1783
10298A28335K0895j2112O446J33310K12644n388P2066J35256Q3838J32532K3891
10287I31713J68008K73179J29307J93984m3370j91870k00932k21438k47853k23932
10277E66796n7908p235j03092j72714p0124K9254J46153j7556l9483m6064J0208
10266B38235o8022k2933J02123Q6702r5579o4534K8304l6971P0018J04366q6089
10255B55620k9997j55372Q4783O3385K0834k9770O4189J04782m7726M9190k0836
$$ plain form
10330 1463086 1601576 1747259 1852921 1800633 1857458 1833573 1705100 1501451 1253787 962575
10320 962575 735626 551263 532223 423835 369807 289592 174800 294277 371688 227428
10310 227428 141830 130390 101409 102158 182638 108476 68824 111156 207967 221898 140118 128335
10298 128335 149230 137118 143564 276874 489518 484130 556196 691452 775290 907822 931713
10287 931713 1099721 1372900 1502207 1696191 1652821 1460951 1260019 1038581 790728 566796
10277 566796 508888 501653 398561 225847 155723 184977 331130 313574 274091 228027 238235
10266 238235 170213 147280 249403 336105 240526 175992 204296 167325 237343 341709 255620
10255 255620 225623 70251 155034 218419 239253 209483 273672 378454 330728 379918 359082
10244C59082k2324K32651N3868m9314n4109j26325l1854l2164j64658m0057K1115
10233A45911L5471j3523j33523j03147O3042J65355N1491o7214O212l3543j33458
10222a6926L4934O1953j27414J5812l153N8426K77537p3893j1644P3012L9988
10211C28632j1801n7992J1385k5214j12179M5969P3691Q3179m932L1841j21340
10200B41239j11506Q4715l4651J44022M5025n1536o3191j91434m3913R3639J01998
10189B14407N5309j19539P8191J15011k13426j72314J0923j36469o0219J30478
10179i7648Q9818J22979P1596k3106k2567J8937j44994L6861k6791o2135J4745
10168b2305l919P2865K01421J34579j6174l4263J7911J9334j8409K3096N5532
$$ plain form
10244 359082 336758 569409 623277 573963 519854 393529 361675 329511 164853 124796 145911
10233 145911 181382 167859 34336 -68811 -5769 159586 211077 143863 150075 116532 -16926
10222 -16926 18008 79961 -47453 -31641 -34794 23632 301169 227276 215632 288644 328632
10211 328632 316831 258839 270224 245010 132831 178800 252491 335670 330738 362579 241239
10200 241239 129733 214448 179797 323819 368844 317308 254117 62683 18770 112409 214407
10189 214407 269716 150177 228368 343379 129953 -42361 -31438 -167907 -228126 -97648
10179 -97648 -7830 115149 186745 163639 141072 160009 15015 51876 25085 -37050 -22305
10168 -22305 -26224 46641 248062 382641 366467 332204 350115 369449 351040 374136 429668
10157D29668j28068j21238K9118M6554l1643j60711k43495N4324J38378R0231
10147A03118Q6574n136N6920O0516O0605r4792n0590k946n1097o974J09468k0195
10135B45471N4271j3319j02423o3442J58011k0688q1531M1386J13565l2625L0990
10124C29666k9257L5984P2076r7078j05398j1843N0345O4453j84820R2525O0599
10113B77252k23260j01880Q2243P9773O121m5978L3158K8495Q6332J29241j74831
10102A76666j95904J20164J62129N5274l8951p2133M2227m5336J19616J03390
10092D27142M2451j07225o0302j5638O1302P5918j05587p9249R6692K1340r3475
10081B63369p9046L9634J31342J2285O081p3057o7426M7760J42333n8126o6247
$$ plain form
10157 429668 301600 180362 209480 256034 224391 63680 -179815 -125491 12887 103118
10147 103118 189692 184556 241476 301992 362597 267805 217215 214269 163172 156198 265666 245471
10135 245471 299742 286423 184000 120558 278569 257881 176350 217736 331301 298676 329666
10124 329666 300409 336393 408469 311391 205993 194150 244495 308948 124128 216653 277252
10113 277252 53992 -47888 34355 114128 120249 74271 107429 135924 222256 351497 176666
10102 176666 -19238 100926 263055 318329 279378 207245 249472 204136 323752 427142
10092 427142 469593 362368 302066 286428 347730 423648 318061 238812 335504 356844 263369
10081 263369 184323 223957 355299 367584 373665 300608 233182 280942 423275 365149 298902
10070B98902J44412N6477M6880L0463K01N8128o5054j21077j2524L3602P7484
10059E47894m3421m3307M5939K8496J07720M2176K173M4513n1538j12382L1556
10048E99819J51082N0018R5193k4863o9658J02621J23630p942M3237J00832L3323
10037A197292l2974J7921P5244R4821p7675R987K59084J95979K22614J02413K02858
10026B267564L27554J57725K23686L82412L01304J94326L30073M56700M57067
10017E098411K02500j37626k65057j95734j69783k1429k2324k18720k78554j79797
10007C811887k07254N3987J05230J45973m723N3459K11240M13101O36014Q56853
9997F075767J075716J464518J809739J443738R09130L37079q5309k55969j4041
$$ plain form
10070 298902 443314 499791 546671 577134 577335 635463 570409 449332 436808 470410 547894
10059 547894 504473 461166 507105 535601 643321 685497 687670 732183 680645 568263 599819
10048 599819 750901 800919 896112 871249 801591 904212 1027842 1019900 1063137 1163969 1197292
10037 1197292 1164318 1182239 1257483 1352304 1274629 1284616 1543700 1739679 1962293 2064706 2267564
10026 2267564 2595118 2752843 2976529 3358941 3660245 3854571 4184644 4641344 5098411
10017 5098411 5300911 5163285 4898228 4702494 4532711 4511282 4488958 4270238 3991684 3811887
10007 3811887 3604633 3658620 3763850 3909823 3905100 3958559 4169799 4582900 5218914 6075767
9997 6075767 7151483 8616001 10425740 11869478 12778608 13115687 13030378 12774409 12760368
9988A2760368q6819m74418o99403r43871r52668p67113m96647m49251n66426l43499
9978F980253r0054o8251J3527K85659L02317L44299N29529O79200R03283J024935
9968A0904697R26733J010946J119200J496937J921597K476077L081430M287601
9960B7225218N911885Q235472J1280438J4981733J8647892K2787490K7728740
9953A36798868K9853613J9328790l390722k0786359k5975861k4154038j9914810
9946I1759481j5149799j0658807o707093l406185n42173K327564N479458Q969086
9938G2071532J2296836J4272912J3811978J2432291J1112848Q629266M826305
9931A49453968K463365J869474M71485j540525k908271m077656n418500p465508
$$ plain form
9988 12760368 12673549 12199131 11499728 10555857 9603189 8836076 8339429 7890178 7323752 6980253
9978 6980253 6890199 6821948 6835475 7121134 7423451 7767750 8297279 8976479 9879762 10904697
9968 10904697 11831430 12842376 13961576 15458513 17380110 19856187 22937617 27225218
9960 27225218 33137103 41372575 52653013 67634746 86282638 109070128 136798868
9953 136798868 166652481 185981271 182590549 161804190 135828329 111674291 91759481
9946 91759481 76609682 65950875 59243782 55837597 55295424 57622988 63102446 72071532
9938 72071532 84368368 98641280 112453258 124885549 135998397 144627663 149453968
9931 149453968 151917333 153786807 154258292 152717767 149809496 145731840 140313340 132847832
9923A32847832q792403p765724n568296l980024j939112J960383P841498J6012181
9915A30616335K7067122M1294432N6857851P0580502P8744142O2313801Q426363
9908D75900548m7905386p0731781o8575712n7700602m4928840l3095461k2817743
9901A30145023j4364316p274582j241779L193796N549385O179961N847541N340539
9893A33375568N404687N740698N599720M085792J013270r22678n80335j308696
9885A52408026n249399r912909j4289572j7409273j6930274j3955471j0061330
9878F4599798o531558l678178j129608J247973L982283P163913J1141283J5841765
9870I2637671K0232577K3809856K3865493J3895006n155279k0630509k5773367
$$ plain form
9923 132847832 124055429 116289705 110721409 106741385 104802273 106762656 114604154 130616335
9915 130616335 157683457 198977889 255835740 326416242 405160384 467474185 475900548
9908 475900548 427995162 357263381 288687669 230987067 186058227 152962766 130145023
9901 130145023 115780707 108506125 107264346 110458142 116007527 122187488 128035029 133375568
9893 133375568 138780255 144520953 150120673 154206465 155219735 154297057 153716722 152408026
9885 152408026 147158627 137245718 122956146 105546873 88616599 74661128 64599798
9878 64599798 58068240 54390062 53260454 54508427 58490710 65654623 76795906 92637671
9870 92637671 112870248 136680104 160545597 174440603 169285324 148654815 122881448
9863A22881448k3954128k0280063j6508029j2597392r450339o916181m985452
9856B8189864l530389k626242k122360j804395j499305j294220j068890q64606
9848A3379457p69659p74088o16259K4888P80585J570894K646058L118872J223488
9839B0584236j742704l060058k488687j320520m52760J20321M75374N71234N98376
9830A3284812O10425R9626N6195q4575m87429j073337j520100j560204j421795
9821G903618j019201p19857n08322m09315k92892k47133j98315k39316N7452J53935
9811D480654J71689l4070j7271P6470J24499J20987K563J18094L8118N5851J83131
9800E320715j09271l45259k78349l05632k76244k58604j92623k84926k74018k49941
$$ plain form
9863 122881448 98927320 78647257 62139228 49541836 40091497 33175316 28189864
9856 28189864 24659475 22033233 19910873 18106478 16607173 15312953 14244063 13379457
9848 13379457 12609798 11835710 11219451 11244339 12024924 13595818 16241876 19360748 20584236
9839 20584236 18841532 15781474 13292787 11972267 11519507 11639828 12115202 12686436 13284812
9830 13284812 13895237 13994863 14051058 13966483 13479054 12405717 10885617 9325413 7903618
9821 7903618 6884417 6164560 5656238 5246923 4954031 4706898 4508583 4269267 4326719 4480654
9811 4480654 4652343 4618273 4601002 4677472 4801971 4922958 4925521 5043615 5081733 5137584 5320715
9800 5320715 5211444 4866185 4587836 4282204 4005960 3747356 3554733 3269807 2995789 2745848
9790B745848p2472p645N3329q5198k07370j46972j31527k04848k22793j04340
9780A616012p4445m1830n0138l2686k8893J6052n6513j00032M0756Q841k7479
9769A269645K4551j70413j21484R0714j43730q5259r3674n141J5063J1703O5229
9758H57204K2686r2325J02110O0393r0423l5408j13173k1816k1399k8927m7771
9747E91151M6292o0467l6287j78993N7776J33421J03492J70211n5800l2401j949
9736G36446J11302M8322j92672j11828J49715M9031q9653j57715j49285k1725
9726C71938P1553L4647M8784N4424Q2684p9054j33213j8345P6399J29979O1327
9715G01123J3135r2332j8269K4453M6429m9404j49022r3290R3574m8299l0233
$$ plain form
9790 2745848 2673376 2665731 2719060 2633862 2426492 2279520 2147993 1943145 1720352 1616012
9780 1616012 1541567 1499737 1449599 1416913 1388020 1404072 1347559 1247527 1288283 1297124 1269645
9769 1269645 1294196 1123783 1002299 1093013 949283 864024 770350 765209 780272 791975 857204
9758 857204 879890 787565 889675 950068 859645 824237 711064 689248 667849 638922 591151
9747 591151 637443 576976 540689 361696 419472 552893 656385 826596 770796 738395 736446
9736 736446 847748 896070 703398 591570 741285 790316 700663 542948 393663 371938
9726 371938 443491 478138 526922 581346 664030 584976 451763 433418 509817 639796 701123
9715 701123 714258 621926 603657 628110 674539 625135 476113 382823 476397 428098 397865
9704C97865n1564k3076m9754P9181M4571J2328m9573J11867J17639M6684j34237
9693E01931j41047j8104j2058J33323J46481O8484j32358M0075j8667m0291o9704
9682D58065j15992j10581j88021J42155J03924j01878k5063J19991N1093n7759
9672B75934O129M0440J09580O8785O9720q3431j25864q1035k0305J5639n6543
9661B19049m5073J80658L5015q9140r1288n9313N348R842P3243J53416J30844
9650E22601Q912M8994j24281k77363K1114k393O8114J16506k476j04898j4496
9639B60334j93065L4787Q3377N1913j9453j09957m7987p3876o9937O8853M8304
9628C3293m0219K6257N1831j1474Q7976Q0728l4653n859O0751J55682P5684l4492
$$ plain form
9704 397865 346301 323225 273471 352652 397223 409551 359978 471845 589484 636168 501931
9693 501931 360884 342780 330722 464045 610526 679010 546652 586727 568060 527769 458065
9682 458065 342073 231492 43471 185626 289550 187672 162609 282600 333693 275934
9672 275934 282063 322503 432083 500868 570588 487157 361293 280258 259953 275592 219049
9661 219049 173976 354634 389649 300509 209221 149908 155256 165098 238341 391757 522601
9650 522601 531513 580507 456226 178863 199977 197584 265698 382204 379728 274830 260334
9639 260334 67269 102056 185433 237346 217893 107936 59949 -13927 -83864 -15011 33293
9628 33293 -6926 19331 71162 59688 147664 228392 193739 187880 248631 404313 479997 445505
9616D45505q9891j14303J2797M7801K7380R4822j14157j14363K8262K5040n98
9605B48295j56918p4391L6692P534O9521J08777P0358p0253o0778q4707q86O1651
9593A54895K9882K6000k3050o937j12041j63331J18849J44140J33236K3527j01185
9582B23985M0544M2465N7659J4167J0143K6093J4215K9321J26514J28850l2430
9571F81526m330j76132j10104k7444M9231J053m3525J0132N4626J5698j0823M0170
9559D80078J4067J30569l305j06548k19122j06149o8173P2205L0491L0332L2470
9548B86915n3975m0027k6316J03088J8909o909J37275L9881j69438q7111P2975
9537B75267O5356J43245p275P2413J22644J15358L18158M45836K97886N4065M1941
$$ plain form
9616 445505 355614 241311 254108 301909 329289 424111 309954 195591 223853 248893 248295
9605 248295 91377 16986 53678 61212 130733 239510 309868 239615 178837 94130 93244 154895
9593 154895 184777 210777 187727 180790 68749 -94582 24267 168407 301643 325170 223985
9582 223985 264529 306994 364653 378820 388963 415056 429271 458592 585106 713956 681526
9571 681526 677196 501064 390960 363516 412747 413800 370275 380407 435033 450731 439908 480078
9559 480078 494145 624714 621409 514861 295739 189590 121417 193622 224113 254445 286915
9548 286915 232940 192913 166597 269685 288594 281685 418960 458841 289403 202292 275267
9537 275267 340623 483868 476593 549006 671650 787008 1105166 1551002 1848888 1902953 1944894
9526A944894k44708l68075l75377k91483M338n9409j93966j56956l7380J5569
9516B37447J33318k0734p206m1776p4548m0436q0720r2838M9081J00463J08414
9505B70465J36041P0533l4152j35536r7653K11092J35671j15033k8445J10594
9495E23577K3757N516J82997J17120M8051J26183K52618K43987R9708K27272J97546
9484B048332O3578j01432j53566j73292j70487j93896j83545k56697k53212j28149
9474D97634j3260k337j06711j20585r0963L5298P9146J1488L688J2133q2705l48
9462B22478N0929m5161k27645R372K12051n2341K0244m1904L93l5692J21454O0669
9450B94847n4913L5172J81355K87466J77309J20682J63010L9516l1071j21980
$$ plain form
9526 1944894 1700186 1332111 956734 665251 669589 610180 416214 259258 221878 237447
9516 237447 370765 350031 342825 301049 226501 186065 105345 12507 61588 162051 270465
9505 270465 406506 477039 442887 307351 209698 420790 556461 441428 412983 523577
9495 523577 547334 552850 735847 852967 901018 1027201 1279819 1523806 1623514 1850786 2048332
9484 2048332 2111910 2010478 1856912 1683620 1513133 1319237 1135692 878995 625783 497634
9474 497634 484374 482037 375326 254741 163778 199076 278222 289710 293398 305531 222826 222478
9462 222478 273407 228246 601 9973 222024 169683 189927 148023 148416 112724 234178 294847
9450 294847 239934 275106 456461 743927 921236 1041918 1204928 1244444 1213373 1091393
9440A091393kq0407p9509j5955j19789j48405k13625n7872K0459j72635m3675
9429A79978j9458j7882P3467J20825j02444o4765j57030o2283N8175J09825k1035
9418I7373q4532J3060O7152P3274Q1087M8946j7866j45254j02479J18719P5849
9407B25329N2785p7880k316J08980Q1024R4149k5884M4903j20173j37285L2369
9396B76001j1694M5429l5738j9974l4349j2053j08398j61032J22235J77135m405
9385B33157j3483k4263J7223J2939L2244n4663j46862p8070J4685J68332J81630
9374C42869j9053q1385m8156j6162k0383M360M7852K2028J956N156j1101j48074
9362G9907O8938J22848k446L5786n4175O6460R2336m8111j18234n4738j9413r4870
$$ plain form
9440 1091393 1091391 1010984 931475 915520 795731 647326 433701 375829 396288 223653 179978
9429 179978 160520 142638 216105 336930 234486 169721 12691 -49592 8583 118408 97373
9418 97373 12841 25901 93053 166327 247414 296360 278494 133240 30761 149480 225329
9407 225329 278114 200234 197918 306898 387922 482071 456187 501090 380917 243632 276001
9396 276001 264307 309736 273998 254024 219675 207622 99224 -61808 60427 237562 233157
9385 233157 219674 195411 212634 225573 257817 203154 56292 -21778 -7093 161239 342869
9374 342869 323816 242431 194275 178113 157730 162090 209942 231970 233926 239082 227981 79907
9362 79907 148845 271693 269247 305033 250858 317318 409654 361543 243309 188571 169158 74288
9350G4288q4189J05115N7884J0261j12829n2573J7160L570P0330J32357O1897
9339B83271j5397j07691j77102p3782N5269N0972Q4161M3149M1666o0193k4835
9328I9488n1144r1599j44746j18998K2917K03650O6769J25912o5659o9347O2417
9317C9660o5998n5281m6719P6124k2474K8980N0313J0240P5051J79383j3503j55814
9305I9962j47258j4530J61975P8667M5882r7901p8756M2289K30215j0330k1587
9294B88628K0684R9606n9765M3842Q6037l3818q7077q6760o7355J13818J54872
9283D72712L1743o3921p2880n0896K9632J55008R8523j16817J0419M9278Q1192
9272F23993l5053O6730P8585J06684J655n2606R9015J00799J43649k9778N5918
$$ plain form
9350 74288 -9901 95214 153098 163359 50530 -2043 15117 18687 89017 221374 283271
9339 283271 267874 160183 -16919 -90701 -35432 15540 99701 142850 184516 124323 99488
9328 99488 48344 -43255 -188001 -306999 -284082 -80432 -13663 112249 46590 -22757 39660
9317 39660 -26338 -81619 -128338 -52214 -74688 -45708 4605 14845 89896 269279 255776 99962
9305 99962 -47296 -61826 100149 178816 224698 126797 48041 90330 320545 310215 288628
9294 288628 309312 408918 349153 392995 479032 445214 358137 271377 204022 317840 472712
9283 472712 504455 440534 367654 316758 346390 501398 599921 483104 493523 542801 623993
9272 623993 588940 655670 734255 840939 842594 789988 889003 989802 1133451 1103673 1159591
9261A159591J47951J02494Q2391K35612L11353K07755L38340L90845O62391P63779
9251D402502R07801J251225J862172K985126M553176P520523J2031120J9148068
9243E4661713K6666328J8577565q802317k3263951k1034842j4441132r419104
9236B2944260o243701m290087k826731j829502j368583q89629o47140m92204n47212
9227C809471l28180n22349m65393k56729k99377k71537j62449j61736m5855p7149
9217A218717j43023m4028j60257n1846j42696k9635j18269p3800L4752J5005n332
9206D99588J3212j5531r0258j5533j8562J16831k4739j11990k0753Q9877L9498
9195D61640J6247p0083m0831N4804k307j16033K9634j0592J5635K4406j07133
$$ plain form
9261 1159591 1307542 1410036 1492427 1728039 2039392 2247147 2585487 2976332 3638723 4402502
9251 4402502 5310303 6561528 8423700 11408826 15962002 23482525 35513645 54661713
9243 54661713 81328041 99905606 91103289 67839338 46804496 32363364 22944260
9236 22944260 16700559 12410472 9583741 7754239 6385656 5496027 4848887 4356683 3809471
9227 3809471 3481291 2958942 2493549 2236820 1937443 1665906 1503457 1341721 1295866 1218717
9217 1218717 1075694 1031666 871409 819563 676867 647232 528963 455163 489915 504920 499588
9206 499588 512800 497269 407011 391478 372916 489747 465008 353018 332265 422142 461640
9195 461640 477887 407804 366973 421777 419470 303437 333071 322479 338114 362520 255387
9184B55387m3369o0655j16652m4171J05818M4188R610J33776L0179j9076J13934
9173D08969p7846r9377o0546m5597j26913n622J27176n311j4836m270n3996l1995
9161I836n854J74752J03724q8491Q127O2017Q5872O3535q0044j06150L160j11885
9149A18599m9299M2559p1199k704m38L8685J14000L3306q3465l3357O8598p6802
9137I8483j12512J07137J26447J1340M5918o8943j11177m4206J7284N0646J6034
9126A36451n6278m1270o6766n4217q2881O9955J63025P9856j3321J29635L0465
9115B94654k3263q539l1283L673j05892n2052n5947P2018J16786j1851K1391p8235
9103A41460q6452O6827J32040R993K9046n6858J884k150k18553o4223K4554n6667
$$ plain form
9184 255387 212018 151363 34711 -9460 96358 140546 150156 283932 314111 295035 408969
9173 408969 331123 231746 171200 125603 -1310 -6932 120244 114933 100097 95827 41831 9836
9161 9836 3982 178734 282458 193967 202094 264111 349983 413518 333474 227324 230484 118599
9149 118599 69300 111859 40660 37956 37518 76203 190203 223509 140044 106687 175285 98483
9137 98483 -14029 93108 219555 230895 276813 207870 96693 52487 69771 120417 136451
9126 136451 80173 38903 -27863 -82080 -164961 -95006 68019 147875 134554 264189 294654
9115 294654 271391 262852 231569 235242 129350 77298 21351 93369 210155 198304 219695 141460
9103 141460 55008 121835 253875 263868 292914 236056 237940 235790 17237 -46986 -22432 -79099
9091g9099N4845J04237j8045j7458o9491m106M5349K05483R1640n2774j62326
9080I8255O7650O8896r1433p6781J16607P9003j71133m1214L5960l3298J9026
9069G1538j02583J32061R1865r6922j51672Q3487K4665l1553J4821o6724L9901
9058H884n1409O5941L3292K4795J2357j24644o8867K4162L9719k5461q0684O56
9046a41259l0161p2854j4599N8259L1648P2978J72401J27030q8521m6071L8103
9035A06954O9656j3715n7475n6832m8524J5860R5316j3983r1234N6455P0301P0651
9023B03430J09368K2792j26133j21281J05792o2601k03086k6074j8374L5127J34200
9012E3160L4223k4091k33973j25856n9184L921O4507J89299J39126J05755o1109
$$ plain form
9091 -79099 -24254 79983 61938 44480 -25011 -29117 16232 221715 313355 260581 98255
9080 98255 165905 234801 143368 66587 183194 262197 91064 49850 85810 52512 71538
9069 71538 -31045 101016 192881 95959 -55713 27774 52439 20886 35707 -31017 8884
9058 8884 -42525 23416 56708 81503 93860 -30784 -99651 -75489 -35770 -61231 -141915 -141259
9046 -141259 -171420 -244274 -258873 -200614 -168966 -95988 76413 203443 114922 68851 106954
9035 106954 176610 162895 105420 48588 64 15924 111240 97257 6023 62478 132779 203430
9023 203430 312798 335590 209457 88176 193968 131367 -71719 -97793 -116167 -81040 53160
9012 53160 87383 63292 -170681 -296537 -355721 -351800 -287293 -97994 41132 146887 85778
9001H5778n2630k6655l0426l1990K2203J1526J51725P2746K0405j6333N0521j20253
8989A36617n7299L5950m6901o1730r6449Q2118L3319K8222J01166l3524j04667
8978A6822k9090j3097L2720N4399O7486J21377Q1761j63791r2056o1280j07219
8967i1968L936o856N9379N0020m4340n8845L8247J02595N2763p24J3281J8445
8955A35933P1012j04374j16865N1586P9840r4396j41241L893P0306m0959l5414
8944a20679N3719O7225J76810j05777j29494J1861M3607J1281R0683l5446j01656
8933c7866k5691R724L691r3009k8377m1677N2701P8793M4586M1273N1263r6982
8921d1571m1320O9906M6212o8658l5696N0678M3301l4156p5631j27130K0053K701
$$ plain form
9001 85778 33148 6493 -23933 -55923 -33720 -22194 129531 202277 222682 206349 256870 136617
8989 136617 79318 115268 68367 6637 -89812 -7694 25625 53847 155013 121489 16822
8978 16822 -12268 -25365 7355 61754 129240 250617 332378 168587 76531 15251 -91968
8967 -91968 -88032 -94888 -35509 14511 -29829 -88674 -50427 52168 104931 104207 117488 135933
8955 135933 206945 102571 -14294 37292 117132 22736 -118505 -114612 -44306 -85265 -120679
8944 -120679 -66960 265 177075 71298 -58196 -46335 -2728 8553 99236 63790 -37866
8933 -37866 -63557 -53833 -50142 -143151 -171528 -213205 -160504 -81711 -37125 4148 55411 -41571
8921 -41571 -82891 -12985 33227 -35431 -71127 -20449 22852 -11304 -86935 -214065 -194012 -191311
8909a91311j2873M9729J60505Q5109l6692p9165j29145p3138M783J51868M1033
8898b9297Q0442R9072p2302j22283j13228J1891N6694p679K8675J14274M9169
8887I5428o1068j01561j02385O912M6361k3880o1361N4261M5965N203L9855o8181
8875a24451k040J32801O9510N6868k2144j31592M995K00497K1573j73214q4351
8864e1548l1442J70737L5696O7860r3918N2501J73117r4627j15265J2649p1855
8853E3905r5087L6182Q9008Q5575j5692j94058j10859k6951K3569O9997K7440
8842e6971j7653K8938R6925P8647J9213j45118j7673r544l1341r1553l0799J10016
8830f6913L3624j13914q7441J69426J95711n2092j63392j6716J44361n16j63255
$$ plain form
8909 -191311 -204184 -154455 6050 91159 54467 -24698 -153843 -226981 -222198 -70330 -29297
8898 -29297 51145 150217 77915 -44368 -157596 -145705 -89011 -96690 -68015 46259 95428
8887 95428 34360 -67201 -169586 -162674 -116313 -140193 -201554 -147293 -101328 -96125 -56270 -124451
8875 -124451 -126491 6310 75820 132688 110544 -21048 -16053 184444 206017 32803 -51548
8864 -51548 -82990 87747 123443 191303 97385 149886 323003 228376 113111 125760 53905
8853 53905 -41182 -5000 84008 169583 153891 -40167 -151026 -177977 -154408 -84411 -56971
8842 -56971 -74624 -45686 51239 129886 149099 3981 -13692 -23236 -54577 -146130 -176929 -66913
8830 -66913 -33289 -147203 -234644 -65218 130493 78401 -84991 -101707 42654 42138 -121117
8819a21117M138J14677n9138l4651J35209K10932k5342r9142M3763j27603j33379
8808i1653l0310L9702j2110J60404m3810n3061M9013M3907K7792K1829m0796j03835
8796c2928r3180p036J91900O5192J0690r3767r0051j10782n1178j9502N9791R5399
8784g5452J65688K3099j33541R657N5445J85189M3737j23007m1453p4879k2159
8773A2324J04150J08417l2097J1421J8935l6601j05043O2185M4829m3028l3768
8762A11724j54692K0100K8170L3535j61866q5704Q9025L7331o6236J6399l725
8751a35939k0472J7317J9233P4232Q5430Q5853o5115Q0430j13000m7513Q1964
8740F2420m5779J0614M4988p2629P3767M2120p3699k5099P4909l7763r933l8765
$$ plain form
8819 -121117 -116979 -2302 -61440 -96091 39118 250050 224708 125566 169329 41726 -91653
8808 -91653 -121963 -82261 -94371 66033 22223 -30838 18175 62082 89874 111703 70907 -32928
8796 -32928 -126108 -133144 58756 123948 134638 40871 -49180 -159962 -211140 -230642 -170851 -75452
8784 -75452 90236 113335 -20206 -10549 44896 230085 273822 150815 109362 34483 12324
8773 12324 116474 224891 192794 204215 223150 186549 81506 143691 188520 145492 111724
8762 111724 -42968 -22868 5302 38837 -123029 -208733 -119708 -82377 -148613 -132214 -135939
8751 -135939 -156411 -139094 -119861 -45629 39801 125654 60539 140969 27969 -19544 62420
8740 62420 16641 27255 72243 -386 73381 115501 41802 16703 91612 53849 43916 5151
8728E151k5407P2047Q1494J14392m4131r7933j45730j5466J11447R308M1033p0875
8716C5330k15235J27886J50781m4298m280R2931p3373r0619q6606L4589J00621
8705B7727n152M199J3643q7549K129L2858l4678l2736j07174l4780J53144N2052
8693a6317O5033O0028J2691K7396O9231o3548j15296j13830P0849o209l3185J01533
8681E8376o0398L9252k1743j15240R8612J31178n087p9230K8042n2017l5672K3088
8669I161L2400M9700m213k17820r8189q6264M4332J64850j1892O28J42568j5979
8657I282O986J18717Q7845m8112k1945N4307n0474m000l1367L5216Q6359P6758
8645C19572K04516K83878N08329O91282J016042M88953o29822j023623q11576
$$ plain form
8728 5151 -20256 51791 133285 247677 203546 105613 -40117 -55583 55864 65172 106205 35330
8716 35330 -179905 -52019 98762 54464 50184 143115 69742 -20877 -107483 -72894 27727
8705 27727 22575 26774 40417 -47132 -45003 -12145 -46823 -79559 -186733 -221513 -68369 -16317
8693 -16317 48716 108744 121435 148831 218062 154514 39218 -74612 -3763 -9972 -43157 58376
8681 58376 -2022 37230 15487 -99753 -1141 130037 124950 45720 73762 21745 -13927 9161
8669 9161 41561 91261 87048 -130772 -228961 -315225 -270893 -106043 -117935 -117307 25261 9282
8657 9282 16268 134985 222830 174718 152773 207080 156606 152606 121239 156455 242814 319572
8645 319572 524088 807966 1316295 2007577 3023619 3512572 2882750 1859127 1047551
8636A047551j98056j09571k40527k08018m1390n7630R1179k5324k1187k6503O71
8625B11195K9711L0288q9594k9116O8066J1758P5033R850j08275N7769l1115J5256
8613B50826R5885O2707j00169n7819k4981o284r945j10064K52431K97905O5222
8602G15714j3864P5122K08157N01033P04626J346253K117344J289026r23940j731026
8592D288445j440202q21681m49012m41284k51850j11680m8216p4773q2508J193
8582E68432j80761k3199K9922l9990o7468j6546P913n7284l9823o6409O71P8209
8570A93667r928O6094j29313K3588p833O2538j27870o8160O2901K2282Q9854J60712
8558C38532J27311N3199Q1579J09336M1351J82710O07424Q79562P68379j44298
$$ plain form
8636 1047551 849495 739924 499397 291379 249989 192359 283538 258214 237027 210524 211195
8625 211195 240906 271194 181600 152484 220550 232308 307341 317191 208916 266685 235570 250826
8613 250826 346711 409418 309249 251430 226449 220165 210220 100156 352587 650492 715714
8602 715714 701850 776972 985129 1486162 2190788 3537041 5654385 6943411 6019471 4288445
8592 4288445 2848243 2026562 1577550 1136266 884416 772736 724520 649747 567239 568432
8582 568432 387671 364472 394394 354404 286936 270390 278303 221019 181196 114787 115458 193667
8570 193667 183739 249833 120520 144108 136275 198813 70943 2783 65684 87966 177820 338532
8558 338532 465843 519042 600621 709957 751308 934018 1541442 2421004 3189383 3045085
8548C045085p77049o79847m89632l58509j82782j04855k13049q6818r835o8843
8538G3866Q6678k1221J6134L6031J9902j39483j71778n7606J85886J70575j05226
8527I3758k25774J9137K11427r1405j6691O100J5624M750K2106K71066j9473k15660
8515G4965J6835J54387N4477j9932k9270j02575j19266p0189L7636J3843L5886
8504D6797p6772n4528j4285K2264N5022q4108n9633N9310l3414J29673L1193m0913
8492a9394P3267Q1354l9176j15619K7112j4474P0857n106j08124j6894M1904J2427
8480a1866J1169r0949L149M6181Q3025K9916q7121j57230J91932J87586P5021
8469B80813q5415l3375l465o364q9097p8558k8106P3554O9285l0523N1187m0045
$$ plain form
8548 3045085 2268036 1588189 1098557 740048 557266 452411 239362 152544 142709 73866
8538 73866 160544 139323 155457 191488 211390 71907 -99871 -157477 28409 198984 93758
8527 93758 -132016 -112879 98548 7143 -9548 -3448 12176 16926 39032 310098 290625 74965
8515 74965 91800 246187 300664 280732 251462 148887 29621 -40568 -2932 10911 46797
8504 46797 -29975 -84503 -98788 -76524 -21502 -105610 -165243 -105933 -139347 -9674 21519 -19394
8492 -19394 53873 135227 96051 -19568 7544 -6930 63927 58821 -49303 -66197 -24293 -11866
8480 -11866 -697 -91646 -88497 -42316 40709 70625 -16496 -173726 18206 205792 280813
8469 280813 195398 162023 158558 152194 63097 -15461 -43567 29987 99272 68749 119936 79891
8457G9891J9644r0051J7964N6023L1995m0513l2439M6594l4022l9554K7806J880
8445D5218K882j6819j4758j00008K8238L9518j3565m1517m0775J11676k8122l5207
8433f3239J10624P2766j3640o4992P2277L3547O142J5222l6720m5196n6540l4216
8421c965K2565n3589r8790r1745K01783J86982L5216K1254j981j62015j33292
8410g7577p4006n531n3030J17221K33172k0467M9843N1370j46169k55584p3262
8399b54020L3804J41311P3987j23187N6640J45515J11825N8278l5575r6554j6095
8388I5929p5457j8126J07572J1140O086r1376j25493r5958J75306J23563j27874
8377a4688M5404J17009N8928J7266o3261J0996k2797l8819p9729l8012q3930j5275
$$ plain form
8457 79891 99535 9484 27448 83471 115466 74953 42514 89108 55086 15532 43338 45218
8445 45218 48100 31281 16523 -83485 -55247 -15729 -29294 -70811 -111586 90 -28032 -63239
8433 -63239 47385 120151 106511 41519 113796 147343 153485 168707 131987 86791 30251 -3965
8421 -3965 18600 -34989 -133779 -225524 -23741 163241 198457 219711 217730 55715 -77577
8410 -77577 -151583 -157114 -210144 -92923 140249 119782 169625 220995 74826 -180758 -254020
8399 -254020 -220216 -78905 -4918 -128105 -71465 74050 185875 244153 208578 112024 95929
8388 95929 20472 2346 109918 121058 127144 35768 -89725 -185683 -10377 113186 -14688
8377 -14688 30716 147725 206653 223919 160658 171654 148857 110038 30309 -7703 -91633 -106908
8365a06908J26697j3705K9554j4758J1039N9295n8204m0418l4607L8372O5594
8354F1951K149n0O133M8728l4402j06841N4076m4968n8073Q2013n013k5129k1250
8341d0676j7569k4190O6412N5669N911O1768j9664p2246J1035n235J27481j54
8329A48542p1743m7940R7345J41081k2948k21182M3962j7375l8199j35181K1763
8318a01875M7151M5203n6236j09085R112k2989N9114J4107k2782L6444P2992M5446
8306A6602j20042p5692N48o042K2325k8531O6159Q0824J13254M7953j03685m0583
8294b6910J4782O6546j46164r5704J73281K0391n8184m4590O6819p2324j2923
8283a14980j10008l7543N9125J06523K4759r8581O5213P8741J1592o2049k1242
$$ plain form
8365 -106908 19789 6084 35638 20880 31919 91214 33010 -7408 -42015 -3643 61951
8354 61951 64100 64050 70183 118911 84509 -22332 31744 -13224 -71297 10716 5703 -19426 -40676
8341 -40676 -58245 -82435 -16023 39646 45557 107325 87661 15415 26450 21215 148696 148542
8329 148542 76799 28859 126204 267285 244337 23155 67117 49742 11543 -123638 -101875
8318 -101875 -54724 -9521 -65757 -174842 -165730 -188719 -129605 -115498 -138280 -101836 -28844 16602
8306 16602 -103440 -179132 -178584 -184626 -162301 -190832 -124673 -43849 69405 117358 13673 -26910
8294 -26910 -12128 54418 -91746 -187450 -14169 6222 -51962 -96552 -29733 -102057 -114980
8283 -114980 -224988 -262531 -203406 -96883 -72124 -170705 -105492 -26751 -15159 -77208 -98450
8272i8450M1065k2130K1774K14422K3798q2578k6200j03183k02117J9427O3273
8261a50899R699k012J11745N8516P0999l6616j08186M5071j1218n6419M1197o3429
8249i1552l3871K0106K0962L6276J3180J35377m0997p1478N5352J98340O271j76930
8237G1036l6602J14729J2763j08834j21460l4155J26237J8597j65768m9804q384
8226a81645M6410J41973P2048K0473k1463q3879q141j19416m5375J22979J5402
8215d0634L231O7119O4896j7451j32166J37854L9199M4757n6891m0313p3865j28707
8203a32971P0068J62986k0419k1674p1697m8624J6892m3600M2312N404p8338j1020
8191a30681M8069J5826q6113R5982N4940J5319M3265o470j25703j30178M081j400
$$ plain form
8272 -98450 -57385 -79515 -57741 156681 180479 97901 71701 -31482 -233599 -214172 -150899
8261 -150899 -141200 -143212 -31467 27049 98048 61432 -46754 -1683 -12901 -69320 -28123 -91552
8249 -91552 -125423 -105317 -84355 -48079 -34899 100478 59481 -11997 43355 241695 247966 71036
8237 71036 34434 149163 161926 53092 -68368 -102523 23714 42311 -123457 -173261 -181645
8226 -181645 -135235 6738 78786 99259 77796 -6083 -14224 -133640 -179015 -56036 -40634
8215 -40634 -37403 29716 94612 77161 -55005 82849 122048 166805 109914 69601 -4264 -132971
8203 -132971 -62903 100083 79664 57990 -13707 -62331 -45439 -89039 -46727 -41323 -119661 -130681
8191 -130681 -82612 -66786 -152899 -56917 -1977 13342 56607 50137 -75566 -205744 -201663 -203063
8179b03063Q3708l3390j1336Q8719m5981N8625N5862n6045j60396l0917O454M0845
8167b06915O5195N7469J11520J25736J6190j81997j28848J00798J15345L3527
8157A08020r7686r2658M6386K13641L8525j40675l4190m055j31648O6841R3987
8146F6488l8478m8396k0338k4287J00147J04306k2470n9077K5596N4789K3799
8135A62079l8764o6325q9826N183R2465j53915m9229J42916L6937j37943j89484
8124b85906L5763M8333J09936N5603K2729p3144j2078J07464R5312O5244M9101
8113B18357Q235q5065q1584n4080K0137J7679j2130J3699j49898k9464J09494
8102b4620J34376k4769j32863k9671m7676J55166M8026R043L6240N304k7066k4182
$$ plain form
8179 -203063 -119355 -152745 -164081 -75362 -121343 -62718 -6856 -62901 -223297 -254214 -247760 -206915
8167 -206915 -141720 -84251 27269 153005 169195 -12802 -141650 -40852 74493 108020
8157 108020 10334 -82324 -35938 177703 216228 75553 41363 37308 -94340 -27499 66488
8146 66488 28010 -20386 -40724 -65011 35136 139442 116972 57895 83491 138280 162079
8135 162079 123315 56990 -32836 -27653 64812 -89103 -138332 4584 41521 -96422 -285906
8124 -285906 -250143 -201810 -91874 -36271 -13542 -86686 -98764 8700 104012 169256 218357
8113 218357 226592 141527 59943 5863 26000 43679 31549 45248 -104650 -134114 -24620
8102 -24620 109756 84987 -47876 -77547 -125223 29943 77969 87012 123252 128556 101490 77308
8090G7308m9484m055J03199O2167o8320j88245m0979J22975J45303m157O3996
8079B19708k24398r3973J00754M1161m9621O2588L0520o6314q524j13266J61490
8068F0125O3790j47801N683j4285n2899o3600k6592J49481j0878l7607K0676J13370
8056E9463J42309j64763r2370M0970L3941N318O6629j03562R1323Q565j03020
8045a5197O1828q654J1442j9156j3714J3434J2980N7431M6257q4493j17589J2386
8033d3045O3603K1410R8J5762m8065j51878l0128L0473m4142O807l4483P2078
8021a41510M1197Q9604J46596j32909p6532J0670J03186j2640m6055M500J00502
8010H6609r7068l7202K5385q69J14002p0334o5141J07573Q7513j06591j0799l4114
$$ plain form
8090 77308 27824 23769 126968 189135 120815 -67430 -108409 14566 159869 155712 219708
8079 219708 -4690 -98663 2091 43252 -6369 56219 86739 20425 11901 -101365 60125
8068 60125 123915 -23886 -18203 -32488 -85387 -148987 -175579 -26098 -36976 -74583 -53907 59463
8056 59463 201772 37009 -55361 -14391 19550 24868 91497 -12065 79258 87823 -15197
8045 -15197 46631 37977 49419 30263 16549 29983 42963 100394 146651 62158 -55431 -43045
8033 -43045 20558 41968 42066 57828 9763 -142115 -172243 -141770 -185912 -179105 -213588 -141510
8021 -141510 -100313 -10709 135887 2978 -73554 -62884 40302 27662 -18393 -13893 86609
8010 86609 -10459 -47661 -22276 -23145 90857 20523 -44618 62955 150468 43877 33078 -1036
7998a036J9605M1146K7307p720p701Q050l822J24763N4950n3075n0413m1039R7263
7985B08278j06107l3404j0013K9679Q9851q4060j47970K7960J18348J6922m6544
7974F2940k1532K7377P4426P6522j6621l6449M9005l2578j29551O9615P7015j23780
7962G6389M6058O5526Q1609n4139j32585L6997N1899p1463P8069k4801l5585J71473
7950B89447r87P983J4142r715q0295j22659j01732p8356j2498k7237O2791O839
7938e2277o5035m4352o3829R6881R0660R9606n6423j05609N1212J17145J2743
7927H0722j01952l06j24215n5216J43054Q3277O4482K0342j38520o451K04952
7916A70169k6291r1144N7020J13870K7666k2487J2826l8680r5278j4781p9751
$$ plain form
7998 -1036 18569 59715 87022 79302 71601 79651 75829 200592 255542 202467 152054 111015 208278
7985 208278 102171 68767 58754 88433 178284 94224 -53746 -25786 92562 109484 62940
7974 62940 41408 68785 143211 219733 203112 166663 215668 183090 53539 123154 200169 76389
7962 76389 122447 187973 269582 215443 82858 119855 171754 100291 178360 153559 117974 289447
7950 289447 288460 296443 310585 300870 220575 97916 -3816 -82172 -94670 -121907 -59116 -52277
7938 -52277 -117312 -161664 -225493 -128612 -37952 61654 5231 -100378 -49166 67979 80722
7927 80722 -21230 -21536 -145751 -200967 -57913 25364 89846 110188 -28332 -34783 170169
7916 170169 143878 52734 109754 223624 251290 228803 241629 202949 107671 92890 13139
7905A3139n1457p3232R3994J67297m1539N4125k5828p8485J22502m8717Q934J24172
7893B64905K9421p5236j43972L1293o2450n0360q3437j30247j3413P9419M9962
7882a04115J65072Q5K1376O8236l5212r5462p3294q8401L3890R9587m446l4802
7870d7486M2743J08150R7719l8695j36206K6367M3765o6798M8303o9557L9048
7859D7353L3585J44112J3179j47299R8520R2427m1355n1103n1260N0480M098m8902
7847A43835J6709k0025j22619k40599M1221M4290P7525J04090J48450k9688k4701
7836A38488j32583o6773P1780L7497o008J05362k2906P0915K7303o8263j56506
7825a694j75332Q2124J14219M6207O1807k1910K7261k6487l6501K1714J0755l2825
$$ plain form
7905 13139 -38318 -111550 -17556 149741 108202 162327 136499 58014 180516 131799 140733 264905
7893 264905 294326 219090 75118 106411 43961 -6399 -89836 -220083 -233496 -154077 -104115
7882 -104115 60957 61042 82418 150654 115442 19980 -53314 -141715 -107825 -8238 -12684 -47486
7870 -47486 -4743 103407 201126 162431 26225 52592 96357 29559 77862 8305 47353
7859 47353 80938 225050 238229 90930 189450 281877 240522 189419 138159 188639 192737 143835
7847 143835 160544 140519 17900 -222699 -181478 -137188 -59663 44427 192877 163189 138488
7836 138488 5905 -60868 10912 48409 42401 147763 124857 195772 223075 154812 -1694
7825 -1694 -177026 -94902 19317 65524 127331 105421 132682 106195 69694 91408 102163 69338
7813F9338R4004q1696o0620k9123Q2816k8009M4164J88048L9173j62760o0005
7802I5330R947j22327n4417k8035o1971P0113N674M0403J31706J02445L9437j374
7790B26931q182m7432K0026M2424L1516J19850o8496j60681q730p1171k7924p5914
7778b7783L3558l3407m1493Q1742P5808o4438j44968o7313J27144N3652j01522
7767a09020o9588l0436l7360k8491R3699J35388P2077m5875K046o2432L4819K30111
7755A84938P3263n3208r2134O1097l4697o0008J00764m8669j78281j14603L1791
7744a29747P0339N7835n1760Q4735p0007l7928k4190n3154M0329p3388M2197O7684
7732g7055Q0330N8700L8837l8567K1598Q4006o9075J9742l9244Q192J8083n2175
$$ plain form
7813 69338 163342 81646 21026 -8097 74719 46710 90874 278922 318095 155335 95330
7802 95330 105277 -17050 -71467 -99502 -161473 -91360 -85686 -45283 86423 188868 228305 226931
7790 226931 218749 171317 191343 233767 265283 385133 316637 155956 147226 76055 48131 -27783
7778 -27783 5775 -27632 -69125 12617 88425 23987 -120981 -188294 -61150 -7498 -109020
7767 -109020 -178608 -209044 -246404 -274895 -181196 -45808 26269 -19606 -17560 -79992 -45173 184938
7755 184938 258201 204993 112859 173956 139259 79251 180015 131346 -46935 -161538 -129747
7744 -129747 -59408 -1573 -53333 31402 -38605 -76533 -100723 -153877 -113548 -186936 -144739 -77055
7732 -77055 3275 61975 100812 62245 83843 167849 98774 118516 79272 87464 105547 53372
7720E3372O4957N0727m6291j83607k4327o9751K9161J50405J46700j29796l2659
7709H891J84245p8551l04366q5766K12993J26898K5148M4661m0752q2702p537
7698C162q0734j3388m9288R4757O3505K0593k238J5659p4014K5903J2011o1843
7686d5915p6244J89847J79203K6559N1302l9312J2811q438j32464j64600k7760
7675c5011L4103r6388j6999r6457L7670M0080P5398m9342j0891O634j16329m137
7663b31669p081L4722M9240P6965Q0881O442m5419M2891J33382k0801p55Q21n9558
7650F0061p7091L2669j8951l523j6010k0517N837J07827J20497O9174l4569k19568
7638E836k2045m0013j29074J7169R8984r982J3558J24887P5974n0908n5222r0950
$$ plain form
7720 53372 118329 169056 122765 -60842 -85169 -154920 -125759 24646 171346 41550 8891
7709 8891 193136 114585 -189781 -275547 -62554 64344 89492 134153 93401 10699 3162
7698 3162 -77572 -90960 -140248 -45491 18014 38607 36369 52028 -21986 3917 15928 -45915
7686 -45915 -122159 67688 246891 273450 324752 285440 298251 289813 157349 -7251 -35011
7675 -35011 -908 -97296 -114295 -210752 -173082 -133002 -57604 -106946 -117837 -111203 -227532 -231669
7663 -231669 -238750 -204028 -154788 -77823 3058 9500 -35919 6972 140354 119553 118798 119619 60061
7650 60061 -17030 15639 -3312 -6835 -22845 -43362 -37525 70302 190799 259973 225404 5836
7638 5836 -16209 -56222 -185296 -168127 -69143 -79125 -65567 59320 135294 84386 29164 -61786
7626f1786o5508j14307N2148J41858J70020r7739q6880J3039M3962J6733J8566
7615C0106N9888q2833p2820o4460J2303J20232n9410K3579k1867m082Q3223L3780
7603E7639k4140j01536m9400J50153L2097l1999o6590N6267J51673k5534r608
7592A39022k4748o3707q9329N1627p1927M4948m2559p4369K9039N695k052J8879
7580g9481P884j09695P9723J42818O5670O9753m1307j24017l7711n832j5505K0974
7568b6726m1021l9591O2863k7960Q8287p075j0115M4074M9423J19822n3404q0455
7556G8122n5457p0560O8564o3072l5441p3877L4931P7311J1550j14452n0414l8649
7544b31444Q6812O47j0187k3688J59705p3195n3120J46587P6606o2393j29767
$$ plain form
7626 -61786 -127294 -241601 -189453 -47595 122425 24686 -62194 -49155 -5193 11540 30106
7615 30106 89994 7161 -65659 -130119 -117816 2416 -56994 -33415 -55282 -59364 23859 57639
7603 57639 33499 -68037 -117437 32716 64813 32814 -33776 22491 174164 148630 139022
7592 139022 114274 50567 -38762 12865 -59062 -14114 -56673 -131042 -102003 -96308 -98360 -79481
7580 -79481 -71597 -181292 -101569 41249 106919 176672 135365 11348 -26363 -32195 -47700 -26726
7568 -26726 -67747 -107338 -44475 -72435 15852 8777 -1338 42736 92159 211981 158577 78122
7556 78122 22665 -47895 20669 -42403 -77844 -151721 -116790 -39479 -27929 -142381 -192795 -231444
7544 -231444 -144632 -143985 -154172 -177860 -18155 -91350 -144470 2117 78723 16330 -113437
7533a13437q1061n6805K6181K26465J47743l4346N3437R8901r6568j84252q7073
7522a00815O320N0594o5577J21812j6082M3372j4457q7081K7272j6688n5782L4130
7510g2982j20962N9744K17442K885k0244j66572r3663l9394J12405J27093J38784
7499A44536O1270j16866p6844o6359Q0871O36p4108j44069l3040q980O722j08437
7487c34668q4068Q5176J18425n1691j60863r8932J05543K05154R5709l6261R2390
7476f4086k7285J736j012j50457n8099J01681J03938N9299n1371L4395k9077M658
7464g5680q6959J3564O4273P7442N4449K03761j9112r0481r5066n3365q1912j7654
7452a06740J51795K428p6666n3382M9635m5823m8253M2073m9789K1887O1189O1379
$$ plain form
7533 -113437 -194498 -251303 -225122 1343 149086 114740 168177 267078 170510 -13742 -100815
7522 -100815 -94495 -43901 -109478 12334 -3748 39624 25167 -61914 -34642 -51330 -107112 -72982
7510 -72982 -193944 -134200 83242 86127 65883 -100689 -194352 -233746 -121341 5752 144536
7499 144536 205806 88940 12096 -54263 26608 27244 -46864 -190933 -223973 -232953 -226231 -334668
7487 -334668 -418736 -333560 -215135 -266826 -427689 -526621 -421078 -215924 -120215 -156476 -64086
7476 -64086 -91371 -89635 -90647 -241104 -299203 -197522 -93584 -34285 -85656 -51261 -80338 -75680
7464 -75680 -162639 -149075 -84802 -7360 47089 250850 231738 141257 46191 -7174 -89086 -106740
7452 -106740 45055 47483 -29183 -82565 -32930 -78753 -127006 -84933 -134722 -112835 -51646 9733
7440I733n6289J14273O1074J4475n53k04236j06530M5971N7069J24110J03068
7429A62165J6930j9386l4094o7730p6466p1182O26k195j6399M4393k230M7021
7417a8547j35804n6180O6607O5584J05046J35418K4202j06626k28187l1J36597
7406a1921K4723Q9142J14482p5133o1069M0606m3342N217p6204m756k7110j6166
7394d1531L5504j207k9474j51448j16001L7543K2650R5885l3665P3618J61894
7383E3768J39315l2764m7358N3552p3315n2884O3564O8572j14170M5354P9600
7372A83234N9178k18j06365k4801P2132l9989j13681J10741n3021N4998N325j64184
7360a6651k142Q4047q8548k08905j21619Q7242R0308o0815l6831P4891K5112Q9167
$$ plain form
7440 9733 -46556 67717 128791 143266 142713 -61523 -168053 -122082 -65013 59097 162165
7429 162165 179095 159709 125615 57885 -18581 -89763 -89137 -91332 -107731 -63338 -65568 -18547
7417 -18547 -154351 -210531 -143924 -78340 26706 162124 186326 79700 -148487 -148518 -11921
7406 -11921 12802 101944 216426 141293 80224 120830 77488 82705 6501 1745 -25365 -41531
7394 -41531 -6027 -7234 -36708 -188156 -304157 -266614 -243964 -148079 -181744 -108126 53768
7383 53768 193083 160319 112961 166513 93198 40314 103878 172450 58280 103634 183234
7372 183234 242412 242194 135829 111028 183160 143171 29490 140231 87210 142208 147533 -16651
7360 -16651 -18793 65254 -23294 -232199 -353818 -266576 -176268 -237083 -273914 -199023 -173911 -84744
7348h4744O4141L0617o3893l3552l0139L1922K3822M1334n0090j74424p4606J14281
7336b05331K7205J0660K6558k8915o1582j1613N037K3759L5284M6671K3206o6449
7324a75510L5623L5758N755J4103O3670o5517Q6302P9007R5201j09645j43088
7313g8341J0733m5062O4891L6418J27561K3250j549l6575J06810P5562j38954
7302A44744j56226j00465J7811Q0839Q7678J92605P3905j23206j29872r8228N6370
7291D5955O6689j224J30353j21871m9124K4430l2660L2723L7198p2307K2189P0342
7279A52693O6908q5075p8148P4526q9002k6204J46767P1475j71877L2159K9809
7268A24031J38362Q1825j08125k1757r2870j20846R9645L7795o056R12j00218
$$ plain form
7348 -84744 -20603 10014 -53879 -87431 -117570 -85648 -61826 -20492 -70582 -245006 -319612 -205331
7336 -205331 -178126 -167466 -140908 -169823 -231405 -243018 -237981 -214222 -178938 -132267 -109061 -175510
7324 -175510 -139887 -104129 -98374 -84271 -20601 -86118 184 79191 174392 64747 -78341
7313 -78341 -67608 -112670 -47779 -11361 116200 139450 137901 101326 208136 283698 144744
7302 144744 -11482 -111947 -94136 -13297 74381 266986 340891 217685 87813 -10415 45955
7291 45955 112644 111420 241773 119902 70778 95208 62548 95271 132469 60162 82351 152693
7279 152693 219601 134526 56378 130904 41902 15698 162465 233940 62063 94222 124031
7268 124031 262393 344218 236093 214336 121466 620 100265 138060 132004 132916 32698
7257C2698j68868r6200n6418O1886N558N6937J51016J23474o5641M7225p253o4054
7245B0360o8551J7109N6092R0157K6578k09384j1161L9128M0265R2924q0633n2855
7233c9971P5094o6155j48816L4659J9842Q187J01879k3707o2043Q902R7630m1263
7221c5762m6062o303o4241m6524j6320L584M9021k7059j08018J98767K21047o655
7209A15475k92809o3867r482O9724P3037N7552R7785M6682l2339o0815m1310L2035
7197h332o9856p9941J00764P3681j2478J00805J5332N7857q7150j14149M0445
7186A6978l9570k1872N6866q0901O5542L2576j0028p5098m9974l3650r3846r3860
7174c26837J09365J58094P2207j44600j11498j0542J34056M5480O6794M8932j10778
$$ plain form
7257 32698 -136170 -232370 -288788 -226902 -221344 -164407 -13391 110083 44442 91667 84414 20360
7245 20360 -48191 -31082 25010 115167 141745 -67639 -78800 -39672 593 93517 12884 -39971
7233 -39971 35123 -31032 -179848 -145189 -125347 -117160 -15281 -38988 -101031 -92129 5501 -35762
7221 -35762 -81824 -88127 -152368 -198892 -215212 -211628 -162607 -189666 -297684 -98917 122130 115475
7209 115475 -177334 -241201 -250683 -180959 -107922 -50370 47415 94097 61758 943 -40367 -8332
7197 -8332 -78188 -158129 -57365 16316 3838 104643 119975 177832 90682 -23467 16978
7186 16978 -22592 -44464 12402 -68499 -2957 29619 19591 -55507 -105481 -139131 -232977 -326837
7174 -326837 -217472 -59378 12829 -131771 -243269 -253811 -119755 -74275 -7481 41451 -69327
7163f9327j12670j07456J4826J95456n325N4465J23813m2886j19214L4813j7514
7152e1019J2252q7743r7605j2284M8503j1004J07350M927R836o7591o9896J81933
7140c2341j6103m1266J9668K6617K8452l4039j31139R8817P2506J8171K7900P4618
7128A11861J3797j01734j03143J7362L2686M6655N6682p0954J57579P6939p9506
7117A58224l6952m5348n6241K943M3161o3922p9887N3226R9345r1906m2491k0844
7105h0692r0762j8325L1028O7802N3790l9126L5788P111p1229j62217N0252O2023
7093a54557L2518O146L7086M7646J14719j85732J9436J49162P7560r8465j88202
7082a42683k19149P7209J56017J49841Q852q4823j65607r2802J06466P5607J01558
$$ plain form
7163 -69327 -181997 -289453 -274627 -79171 -84496 -30031 93782 50896 -68318 -33505 -51019
7152 -51019 -38767 -126510 -224115 -236399 -187896 -198900 -91550 -86623 -76787 -144378 -214274 -32341
7140 -32341 -48444 -89710 -70042 -43425 -14973 -49012 -180151 -81334 -8828 9343 37243 111861
7128 111861 125658 23924 -79219 -61857 -29171 17484 74166 3212 160791 237730 158224
7117 158224 121272 75924 19683 22626 65787 1865 -78022 -24796 74549 -17357 -59848 -80692
7105 -80692 -171454 -189779 -158751 -90949 -37159 -76285 -40497 -33386 -104615 -266832 -216580 -154557
7093 -154557 -122039 -115893 -78807 -31161 83558 -102174 -82738 66424 143984 45519 -142683
7082 -142683 -361832 -284623 -128606 21235 30087 -54736 -220343 -313145 -206679 -131072 -29514
7071b9514M9608r3114o3105M3899J25587j7008o2379l1044m2196J1098K6685n3361
7059a34844P0309m1723P694l0304O1372J4312r7569q1289o5857Q3629k5100K3416
7047b15954J17675n4265l1573O2956J38922J25951r2266j18374J39472N1395j15549
7036H390l3555p2241J4650L0931l0373O9734l493N7267K0730q5575L2248l5951
7024b7238Q2170J14438q8322r7686q2850j03594p5232M5331R6041P9676M2703
7013a4563J39026L1471n6023j08070j13869L6840J36766l7028o6564K5722N6999
7002C0707l1811m392m6755M8660K0837J15317J14203R6120j28519m67k3689l5148
6990A55063q8966L0793o1086q5641O7603J22998L43j35698j19970J5399O065o1476
$$ plain form
7071 -29514 20094 -73020 -136125 -92226 33361 16353 -46026 -77070 -119266 -108168 -81483 -134844
7059 -134844 -64535 -106258 -98564 -128868 -67496 -53184 -150753 -232042 -297899 -214270 -239370 -215954
7047 -215954 -98279 -152544 -184117 -121161 17761 143712 51446 -66928 72544 123939 8390
7036 8390 -25165 -97406 -82756 -51825 -82198 -12464 -15957 41310 62040 -23535 8713 -27238
7024 -27238 54932 169370 81048 -16638 -99488 -203082 -278314 -232983 -136942 -57266 -14563
7013 -14563 124463 155934 99911 -8159 -122028 -85188 51578 14550 -52014 -26292 30707
7002 30707 -1104 -5496 -52251 -3591 17246 132563 246766 342886 214367 213900 190211 155063
6990 155063 66097 96890 35804 -49837 17766 140764 141107 5409 -114561 -99162 -93097 -154573
6978a54573M1381k1893O7717K7996Q0308q203j2930n0594n9808J04778O1164L9250
6966A14593n3223l4062p8910q258N369p4449j6521m1560O917M4101J13124J6416
6954f463K2200K6722L1315R4699j11361j42480r538J24079o624K1834j7846k2931
6942C606k4794K4817N9372N7252j08940j9920l8696J01891r6126p2744M9783Q0632
6930A6133m4389j12028R3076l843p9205k1982J43193P0373K3672j0423j07661
6919c3084j16273L5801k8025j1404J484J24662K4796J524n5039L2746p4004k1906
6907a18722K2331n7371K381L4544O2261M5815m874J776r8484k3813J16757K0751
6895C352k8640j9133k2305O5603J9792q0574L5091L5038L1082O7787K9331r0049
$$ plain form
6978 -154573 -113192 -135085 -67368 -39372 40936 32733 19803 -30791 -90599 14179 75343 114593
6966 114593 61370 27308 -51602 -59860 -54491 -128940 -145461 -187021 -180104 -136003 -22879 -6463
6954 -6463 15737 42459 73774 168473 57112 -85368 -94906 29173 22549 44383 26537 3606
6942 3606 -21188 3629 63001 120253 11313 -8607 -47303 54588 -41538 -114282 -64499 16133
6930 16133 -28256 -140284 -47208 -51051 -130256 -152238 -9045 61328 85000 74577 -33084
6919 -33084 -149357 -113556 -141581 -152985 -151501 -26839 -2043 -519 -55558 -22812 -96816 -118722
6907 -118722 -96391 -153762 -151381 -116837 -54576 -8761 -13635 -11859 -110343 -134156 -17399 3352
6895 3352 -25288 -44421 -66726 -1123 18669 -61905 -26814 8224 39306 107093 136424 46375
6883D6375J53742P186l1540P2005m4734J6102N4719o7070j08622j43470o7945
6872a13252R783k8556Q436J6947M4260K113N225Q1869J37279R99k8172m7307o8613
6859B1011L6963j9383p5846k5055L7795n0296k6633Q0488p1707J49587q350q9584
6847d1010m807k081l3238O9439j22128o3971J20682R1298k0516J43343M4874M4325
6835B26210l804j08483j15439l5604k7500L2117J00428j8226j42181k8662J28595
6824G451k3118P775P6288J26449r704K6898r157J1817R7165L8708R4067j22458
6812C22181k26638k87960N695k1172k1652m1659O4167J24559P9152J9069j21692
6801a05950o2232R0465j3066k7914J46380R1480N2845M7236n9298q1712j08306
$$ plain form
6883 46375 200117 207303 175763 247768 203034 219136 273855 206785 98163 -45307 -113252
6872 -113252 -103469 -132025 -123589 -106642 -62382 -60269 -55044 26825 164104 165103 136931 89624 21011
6859 21011 57974 38591 -37255 -62310 -24515 -74811 -101444 -20956 -92663 56924 48574 -41010
6847 -41010 -45817 -47898 -81136 -11697 -133825 -197796 -77114 14184 -6332 137011 181885 226210
6835 226210 222406 113923 -1516 -37120 -64620 -32503 67925 49699 -92482 -121144 7451
6824 7451 -15667 -7892 68396 194845 185141 212039 202882 214699 311864 350572 444639 322181
6812 322181 95543 -192417 -186722 -207894 -229546 -271205 -207038 -82479 -3327 15742 -105950
6801 -105950 -168182 -77717 -90783 -118697 27683 119163 172008 219244 159946 78234 -30072
6790c0072J5326M5324O5963j9880L0992q0135q2888l0345l467m1789N9657l2886
6778a04200n5913l6747q402J53454O2104K9023K8048o2329q3656k2089Q7621J1681
6766a405k1453K4272K3705j0703m2776j28961n2625N1315J00818m7538R8158R0546
6754H3353O1988j42992j4954m0067J131j19489K3361K8083R230j1260o754m103
6742a32473P1809J33070J1531p0498q7769n7780K1300R4556l091j24903N3467
6731i0781J417J17579P0852j03204m2827j07362Q1488L9602k7830O9741O5591
6720G4266j4176J5713k07765L0328O0390J64710K14757L55023J06622L5413J5283
6709H50564j82519k37017k25692n4235j52800N1834Q3395q1694l2153J38984j6915
$$ plain form
6790 -30072 -14746 30578 96541 76661 107653 27518 -55370 -85715 -89182 -130971 -71314 -104200
6778 -104200 -160113 -196860 -205262 -51808 10296 39319 67367 5038 -78618 -100707 -13086 -1405
6766 -1405 -22858 1414 25119 14416 -28360 -157321 -209946 -158631 -57813 -105351 -7193 83353
6754 83353 145341 2349 -12605 -52672 -51541 -171030 -147669 -119586 -110356 -121616 -128370 -132473
6742 -132473 -60664 72406 83937 13439 -74330 -132110 -110810 -16254 -19345 -144248 -90781
6731 -90781 -89364 28215 99067 -4137 -46964 -154326 -72838 -33236 -61066 8675 74266
6720 74266 60090 75803 -131962 -101634 -41244 123466 338223 693246 799868 835281 850564
6709 850564 668045 431028 205336 151101 -1699 50135 133530 51836 19683 158667 141752
6698A41752K2392O9512j3276j43673k1783j16263L9821J02041Q035j40345q7758
6687a39545J24713N3324q867M5933k3608m9321J54950M5372n6733j42060J1558
6676A5716l3551q2697O2507p8429j9987Q405M1645j5785j7908J78395J44469j37091
6664F5689j57842L3134J06047l0049L8230J93449m6339j73925q0085J19199j6249
6653E1259j07443O8995N875K6164m5050J02543J02107J9162p2711j94357j40482
6642a83938M2805N4544O7785P7277m5533j4874j27405n0068M0725J63128Q4329
6631A08775Q255K0015n0680n0709K4300L5929J09873p6159m5485m91o7312l681
6619A2630L1726J066q7687j21383j16538Q761J65953O6811P422L6992o8553m4132
$$ plain form
6698 141752 164144 233656 220380 76707 54924 -61339 -21518 80523 88558 -51787 -139545
6687 -139545 -14832 38492 29625 75558 51950 2629 157579 202951 146218 4158 15716
6676 15716 -17835 -100532 -38025 -116454 -136441 -128036 -86391 -102176 -120084 58311 202780 65689
6664 65689 -92153 -59019 47028 16979 55209 248658 202319 28394 -51691 67508 51259
6653 51259 -56184 12811 18686 44850 -200 102343 204450 223612 150901 -43456 -183938
6642 -183938 -141133 -86589 -18804 58473 12940 -1934 -129339 -179407 -138682 24446 108775
6631 108775 117030 137045 86365 35656 59956 95885 205758 129599 84114 83623 16311 12630
6619 12630 44356 45422 -42265 -163648 -280186 -271425 -105472 -38661 -31239 5753 -62800 -106932
6607a06932o0950J04267R889n4093q7977J07949J46415Q0485j25642j52644r7649
6596b36882Q8376Q2580O4335j55302j29336m6624p7927O9462J90594N3088N2859
6585d4777M3561j03541L0884n9843l8161l7217Q8231r1990N0721M099n7465r737
6573b25235L4050N543J88108q1206j15751N3073Q3634j1097o4866r5521K7131
6562b02137J4827j11973P3984R3153J7275N9164m9773k3203O976O2179J5018J03885
6550E9375k5181l1384J55487K2091m0494j28583J07340L4453p5420o8161j63323
6539a53800j01473J84562J60228r3466K762J17755J63j43738k5427M93j33663
6528a85604J69289J52941J16825P7041l4467j59709j30396n350q7592O6860j8090
$$ plain form
6607 -106932 -167882 -63615 -53726 -107819 -195796 -87847 58568 139053 13411 -139233 -236882
6596 -236882 -148506 -65926 -1591 -156893 -286229 -332853 -410780 -341318 -150724 -97636 -44777
6585 -44777 -1216 -104757 -73873 -133716 -171877 -209094 -120863 -212853 -162132 -158033 -215498 -225235
6573 -225235 -191185 -185642 2466 -78740 -194491 -141418 -57784 -68881 -133747 -229268 -202137
6562 -202137 -187310 -299283 -225299 -132146 -114871 -55707 -105480 -128683 -121707 -59528 -44510 59375
6550 59375 34194 2810 158297 180388 139894 11311 118651 153104 77684 9523 -153800
6539 -153800 -255273 -70711 89517 -3949 -1187 116568 116731 -27007 -52434 -51941 -185604
6528 -185604 -16315 136626 253451 330492 296025 136316 5920 570 -87022 -20162 -38252
6517c8252m8353J83171L2644o765P0227j2921n7745j14418m5609r071J41765L7183
6505A31856j52800m5907N3429k2448M6223J180l7189m5842L176l1957K724O0259
6493c7296p3826j70043J08068R9506K7160J19895J37791O9859P5801K8754k69515
6482A16154j38566J85607p1428j57953r4661n3819J081N7941O9355K4325J5036
6471d6928K1607R3646j7781j48981o6766K1482o1067J25823M5990J12377m5720
6460C3682p7014L0078N3247r9628p205m4191m373J0477Q5658P9751j20081l5969
6448i5568R3758J4425q6674O0081R8060O138o6404n4488K3156N1077j21894j06138
6436a84471j34254K1957P2989R0968J1376M2688K7964J1699R0581J1233P9119
$$ plain form
6517 -38252 -86605 96566 129210 122445 192672 179751 122006 7588 -38021 -47092 94673 131856
6505 131856 -20944 -66851 -13422 -35870 10353 11533 -25656 -71498 -68322 -100279 -97555 -37296
6493 -37296 -111122 -281165 -173097 -73591 -46431 73464 211255 281114 356915 385669 116154
6482 116154 -22412 163195 91767 -66186 -160847 -214666 -213585 -155644 -86289 -61964 -46928
6471 -46928 -25321 68325 50544 -98437 -165203 -143721 -204788 -78965 -32975 79402 33682
6460 33682 -43332 -13254 39993 -59635 -66840 -111031 -115404 -104927 -19269 60482 -59599 -95568
6448 -95568 -1810 12615 -74059 -13978 84082 90220 23816 -30672 -7516 43561 -78333 -184471
6436 -184471 -318725 -296768 -223779 -132811 -121435 -78747 -50783 -39084 51497 62730 141849
6425A41849K3302J5220m5012j3105j51070o3955J71404J12590q1743j67561n5172
6414a13253N3236j45415N8248P6727N3342N7752n0351n5376o2904m4715J97638
6403B4929Q3651J18619j40101j71889o205j17152P8078P0263R809j09084Q4438
6392g4644Q5088j0901j19088m3397J04854p692O3698k2475r5900p2705k5117J64688
6380e3591o5921L8592k2655N5223N5098R1148m9981j06999N1382r1147O6092Q3531
6368E0772L3579m5790o3531J05769Q799j08812l6487j08106L7690L3714r038J3722
6356h7719N0162o3360j34607R2253L5395j11936M3023k2875J46571J78485j05572
6345A9820k620Q8475q3353k5291N5390n4196m4855l6927L2386L9492J9556r095
$$ plain form
6425 141849 165151 180371 135359 122254 -28816 -92771 78633 191223 109480 -58081 -113253
6414 -113253 -60017 -205432 -147184 -70457 -17115 40637 -9714 -65090 -127994 -172709 24929
6403 24929 108580 227199 87098 -84791 -90996 -208148 -130070 -59807 -49998 -159082 -74644
6392 -74644 10444 -457 -119545 -162942 -58088 -65780 -2082 -24557 -120457 -193162 -218279 -53591
6380 -53591 -119512 -80920 -103575 -48352 6746 97894 47913 -59086 -7704 -98851 -32759 50772
6368 50772 84351 38561 -24970 80799 89598 -19214 -55701 -163807 -126117 -92403 -101441 -87719
6356 -87719 -37557 -100917 -235524 -143271 -107876 -219812 -176789 -199664 -53093 125392 19820
6345 19820 17200 105675 22322 -2969 52421 -1775 -46630 -83557 -51171 -11679 7877 -1218
6333a218n7531J4103N1671J9516J2846N6534o4198O967O2954O5608Q7659j46879
6321A08032j54955P9074J15781l6163m0278J32551P7546k5924m9026k7801j40984
6310C7853j44569J55813L8044J57355q9298K4389K8671j13793n3345J9372l6905
6299B3587R5182k4249l370m8096k9043P4916O8329j18758o5233n3979l6879J33627
6287A6034k5252m9825R9373P3048j11530j32548K661M459K3130J1934q2194N587
6275a65123J60381J3257M3001q9072q2891M0547P9767j77998j7747P6857J2751
6264a06270M1576j466J1137K1100J6989q8128J982N2562p4514K9036j3170q287
6252a17453k9690K2520J55949O0241j1428r9878j58836L3803M1923p3741j58152
$$ plain form
6333 -1218 -58749 -44646 7025 26541 39387 95921 31723 38690 101644 167252 254911 108032
6321 108032 -46923 32151 147932 111769 71491 204042 281588 255664 206638 178837 37853
6310 37853 -106716 49097 87141 244496 155198 179587 208258 94465 41120 60492 23587
6299 23587 118769 94520 91150 43054 14011 88927 157256 38498 -26735 -80714 -117593 16034
6287 16034 -9218 -59043 40330 113378 1848 -130700 -128039 -123580 -100450 -88516 -170710 -165123
6275 -165123 -4742 8515 51516 -37556 -120447 -79900 -133 -178131 -195878 -119021 -106270
6264 -106270 -64694 -66160 -55023 -33923 -16934 -105062 -103080 -50518 -125032 -95996 -109166 -117453
6252 -117453 -147143 -124623 31326 91567 80139 -19739 -178575 -144772 -102849 -176590 -334742
6241c34742L9440q629J20968J14017M1742k083l2869J9771J4394M7774M5360m2864
6229B2279J26864n1215j0193j429j94512j03610J10826M7667L0646J19261R413
6218A05997o7706q1696R3708R1786k4817r2674r6456q5391n1715M367Q4679J82395
6206F2477N1692q1623p8348J23057K5593n0295p1240j02717Q9105R4338k2607
6195C9432q2722j54282Q207K07854k7907O5692k0073r4309Q3346j7752q5079q5267
6183a62860N2413J0426k2299o4233N3549m8868K0603J28504K8877n4628l0359
6172h8875j3932L1553J64487J34929l7111j76j13281m5699R208M0779Q7854K9740
6160A99476q5965P3775k6538p6398K1662O603L0830l522p084j26018M9555O5350
$$ plain form
6241 -334742 -295302 -303931 -182963 -68946 -27204 -29287 -62156 -42385 -27991 19783 65143 22279
6229 22279 149143 97928 87735 86306 -108206 -211816 -100990 -53323 -22677 96584 105997
6218 105997 38291 -43405 50303 142089 117272 24598 -71858 -157249 -208964 -204597 -119918 62477
6206 62477 114169 32546 -45802 77255 102848 52553 -18687 -121404 -32299 62039 39432
6195 39432 -43290 -197572 -189365 18489 -9418 56274 36201 -58108 25238 7486 -77593 -162860
6183 -162860 -110447 -100021 -122320 -186553 -133004 -181872 -161269 -32765 -3888 -58516 -88875
6172 -88875 -102807 -71254 93233 228162 191051 190875 77594 31895 41103 81882 169736 199476
6160 199476 113511 187286 160748 84350 106012 112615 143445 139923 132839 6821 56376 121726
6148A21726j30024j31739j4944J42213P246n0381k6632P0015k9321p8159M824
6137a15176j2428K37791R525K2441L5188p6848j13194L1391J11280j7485L3802
6126A46287l7994k9433k9674M4453L1110o5162o1272j47339j58894O307P2469
6115b29142n9892J13112j4121J00171K36016n1703j17258O255N1308J65468K18
6104B00432k46823q0131J3779J07226J18613J0016o5274q4373j48305p0950j0194
6093b55984L9812M7809K9591J22117J9161j33658k9573Q600J10737R2353R6341
6082A47306k4685P5635n5343j31850L4355Q655j52980o5759J8243K53l2813O7822
6070a11161Q5603L7201l8970j14405o7131m9022R5388J33410J8712M0404P4276
$$ plain form
6148 121726 -8298 -140037 -154981 -12768 -5522 -55903 -82535 -12520 -41841 -120000 -115176
6137 -115176 -127604 110187 119712 142153 177341 100493 -12701 18690 129970 112485 146287
6126 146287 108293 78860 49186 93639 124749 59587 -1685 -149024 -307918 -301611 -229142
6115 -229142 -289034 -175922 -190043 -89872 146144 94441 -22817 -16562 34746 200214 200432
6104 200432 -46391 -126522 -112743 -5517 113096 123112 57838 -26535 -174840 -245790 -255984
6093 -255984 -216172 -168363 -138772 -16655 2506 -131152 -160725 -152125 -41388 50965 147306
6082 147306 122621 198256 142913 11063 45418 54073 -98907 -164666 -146423 -146170 -178983 -111161
6070 -111161 -25558 11643 -27327 -141732 -208863 -257885 -162497 -29087 -10375 30029 104305
6059A04305m8902j31240P14M5711l9208K345Q9477r3859n9717J66467M8692k5264
6047E9521L96l4777m2143j08865q7836o1179n6741j0869J65625J73631j67751
6036a70988r8756J36355J0074M0781Q1344P9961J56290r2273p7533r8533L0399
6025b879j5868R089R0054p6571l6904K8536j02914p8492P1386J54850J24710j0440
6013A54557j69161j03317P514J20134O8614L0699j4961K679l9839k36276k55413
6002d34770r498J25979J95641J3706o0382R3364J2281n5100L627l2127J21584
5991b5695L0513k9784J6349R4840Q4701k10457o3774L3893j26141l5348J35324
5980i5579J27070m3067l0965M8599j9774n4430J8190O3554k6310n4912o4225r6791
$$ plain form
6059 104305 55403 -75837 -75123 -29412 -68620 -66275 23202 -70657 -130374 36093 84785 59521
6047 59521 59917 25140 -17003 -125868 -213704 -274883 -331624 -342493 -176868 -3237 -170988
6036 -170988 -269744 -133389 -123315 -82534 -1190 78771 235061 142788 65255 -33278 -2879
6025 -2879 -18747 -9658 80396 3825 -33079 -4543 -107457 -185949 -114563 40287 164997 154557
6013 154557 -14604 -117921 -110407 9727 78341 109040 94079 96758 56919 -179357 -434770
6002 -434770 -444268 -318289 -122648 -108942 -169324 -75960 -63679 -118779 -115152 -147279 -25695
5991 -25695 4818 -24966 -8617 86223 170924 -39533 -103307 -69414 -195555 -230903 -95579
5980 -95579 31491 -11576 -42541 6058 -13716 -68146 -49956 13598 -12712 -67624 -131849 -228640
5968b28640N1788N0879m3645j8222P077K0930n4800o3096L9209P0434l5404p8404
5956b81894l6406O5743O2522J8487N1127L4746L8976M7226o5323J67828Q5167
5945A88199j08350o1548k4539n9047m2256J10443P9754j0620j20799r9824R4257
5934e4330N8335J1394O9279m3730M6725k9670p1711m8593j4404M5482R145l0893
5922e2971r4536n3416Q0622J55805R7220L863M5698j05719j26081n7512n4810
5911a61837o0895J2366n1942o7171J2778J63316N5589p0173j11295J14576M8682
5900a16006M5615K4285L1566Q1193K7879j30332K8011q5196O52K8195p0321N4221
5888h0238J31871l4326m8480j25445k21994J09490J05298J65833L3658n0491K7886
$$ plain form
5968 -228640 -176852 -125973 -169618 -187840 -180763 -159833 -214633 -277729 -238520 -168086 -203490 -281894
5956 -281894 -318300 -252557 -190035 -171548 -120421 -85675 -46699 527 -64796 103032 188199
5945 188199 79849 18301 -6238 -65285 -107541 2902 82656 72036 -48763 -148587 -54330
5934 -54330 4005 15399 84678 40948 87673 58003 -13708 -62301 -76705 -31223 -22078 -52971
5922 -52971 -147507 -200923 -120301 35504 132724 136587 182285 76566 -49515 -107027 -161837
5911 -161837 -222732 -210366 -262308 -329479 -316701 -153385 -97796 -167969 -279264 -164688 -116006
5900 -116006 -70391 -46106 -14540 66653 94532 -35800 -7789 -92985 -92333 -64138 -134459 -80238
5888 -80238 51633 17307 -31173 -156618 -378612 -269122 -163824 2009 35667 -14824 13062
5877A3062J03641L4041k7310p3011j38790j4916N5802Q972j26898J159O1411j4531
5865a17368N0293Q2184L0172j8523l7882p0310j16971J4140O5762J64339R0781
5854A36617o0748p9172n0581p4037q3182J06597N3670R6129R5913j12121J2026
5843D1111p8145j05714Q6324k8837M6380R9146J8301M3100q8960p4409J3384J745
5831b6574K2519P7701k9574J11219P6742q5721J9069M7129q1583r2944p80l5639
5819A564M177M0559Q0858Q117O48k6559m848j5429l3380K829l0444m9324J29700
5806A08468K6752p3398q7583m3806J5028q8817l4174p0229L4269R5937N2418J01391
5794C6256m1683m3361j15204p1641R2227J0607n3046M0521q4654p5910K7273N0327
$$ plain form
5877 13062 116703 150744 123434 50423 -88367 -103283 -47481 -38509 -165407 -164248 -102837 -117368
5865 -117368 -67075 15109 45281 26758 -11124 -81434 -198405 -184265 -118503 45836 136617
5854 136617 75869 -3303 -53884 -127921 -211103 -104506 -50836 45293 141206 29085 41111
5843 41111 -37034 -142748 -56424 -85261 -38881 60265 78566 121666 32706 -41703 -28319 -26574
5831 -26574 -4055 73646 44072 155291 232033 146312 165381 212510 130927 37983 37203 1564
5819 1564 5741 46300 127158 135275 135923 109364 104516 89087 55707 58536 28092 -21232 108468
5806 108468 135220 61822 -25761 -69567 -54539 -143356 -177530 -247759 -213490 -117553 -65135 36256
5794 36256 -5427 -48788 -163992 -235633 -143406 -132799 -185845 -145324 -229978 -305888 -278615 -228288
5782b28288P9383M5801L8508J26715L3166p4915k15723k101J45406K23P2517m281
5770A6411N4430K3805j8563L9880n330j79364r9180J12110l589R4426p3521N47
5758c7938n1902o506q875j0349n1792Q5759K4217r0374l8905m3188L2712J66653
5746c0488J85961K8563o7748o6606o0453Q0094R635M5028K9940J08397L6654M0901
5734C39878r5412j48810R449O8253r0085k4216j0644j0739M0953J94731o3826
5723B09532p7507p7359p7944L2490n5640j5059J48111K7191q8578l7700n0494
5712f2957q6135K5028m2947o7041J08399N1282j3609l1746m716Q8423l5928M5482
5700b6465P7181j7023l0416K6099N0520R874J8963N4761n2747M2187m2385j57601
$$ plain form
5782 -228288 -148905 -103104 -64596 62119 95285 20370 -195353 -197454 -52048 -51825 20692 16411
5770 16411 70841 94646 76083 115963 110633 -68731 -167911 -55801 -59390 35036 -38485 -37938
5758 -37938 -89840 -96346 -105221 -115570 -167362 -81603 -57386 -147760 -186665 -229853 -197141 -30488
5746 -30488 155473 184036 116288 49682 -10771 69323 78958 123986 153926 262323 298977 339878
5734 339878 244466 95656 105105 173358 83273 59057 48413 37674 78627 273358 209532
5723 209532 132025 54666 -23278 9212 -46428 -61487 86624 113815 25237 -12463 -62957
5712 -62957 -149092 -124064 -167011 -234052 -125653 -74371 -87980 -119726 -124442 -36019 -71947 -26465
5700 -26465 50716 33693 3277 29376 79896 89770 108733 163494 110747 152934 110549 -47052
5688d7052j71603j31747L8262J81630O7806j3426K5247k0448J26840k7410r4260
5677f6161k9962M9679J42050Q8948K5181O1818p5183m8774r0575l2370M201M7494
5665G6346q4469m7240K0641j1985N6581P0903P2916o2876m2622R3586j0216r2379
5653C9186J1714j15044O6662J01552q9500L0508J03710M5753r5056k44833j08271
5642b53619O0113O7667m2028j9271j71644m3257J10972J48310M4873J61297O2284
5631A25697L2780M5N7942q588q8014j10120j1248m8783j98k9994l597k7528j25606
5618b37212m9801Q4194J13004o4422M4727K9752J8739J24526Q337q7232o46n2942
5606f8976r2858n7318P1233N0309j3940m0993J10380O9136j48m9511o8036l6106
$$ plain form
5688 -47052 -218655 -350402 -312140 -130510 -62704 -76130 -50883 -71331 55509 28099 -66161
5677 -66161 -96123 -46444 95606 184554 209735 271553 196370 147596 57021 24651 28852 76346
5665 76346 -8123 -55363 -34722 -46707 9874 80777 153693 90817 48195 141781 131565 39186
5653 39186 50900 -64144 2518 104070 14570 45078 148788 194541 99485 -145348 -253619
5642 -253619 -193506 -125839 -167867 -187138 -358782 -402039 -291067 -142757 -97884 63413 125697
5631 125697 158477 158522 216464 207876 119862 9742 -1506 -50289 -50487 -80481 -84078 -111606 -237212
5618 -237212 -287013 -202819 -89815 -154237 -109510 -79758 -61019 63507 71844 -15388 -16034 -68976
5606 -68976 -161834 -219152 -147919 -97610 -111550 -152543 -42163 26973 26825 -22686 -90722 -126828
5594a26828j3053J96815N9889p2598m6184j8843J0732J25509Q1969j51791j51334
5583a05717M9661n992M5106n1144O6407k9948k2397O5181n8440R9835L2309n8667
5571B6194o6888K8547L3358p4592j0501O5615m7998p4475J3507J27220J77867
5560A97854Q0123j73719n0544J3374n3951j82607J9706O4162j7607P0461O1526
5549B8778o0640l0848M3495l0923J34013J11110j40443q3691j9496N0719k389
5538c15o1116o4553j32435r777J60887m505P8753Q8854l0207p588P5566M2697
5526A36261r8800j09170l2822L0381R0237r100r3528j32499q863n7816K9402o507
5514b62824p3278J6591J07094N1718R9483L1108K8234N3885j8090N1697O519r8352
$$ plain form
5594 -126828 -139881 56934 116823 44225 -1959 -20802 -10070 115439 197408 45617 -105717
5583 -105717 -56056 -62048 -16942 -68086 -1679 -31627 -54024 11157 -47283 52552 84861 26194
5571 26194 -40694 -12147 21211 -53381 -63882 1733 -46265 -120740 -107233 19987 197854
5560 197854 277977 104258 53714 67088 13137 -169470 -149764 -85602 -103209 -32748 28778
5549 28778 -31862 -62710 -19215 -50138 83875 194985 54542 -29149 -48645 2074 -315
5538 -315 -61431 -125984 -258419 -268196 -107309 -111814 -33061 55793 25586 17998 93564 136261
5526 136261 37461 -71709 -104531 -74150 16087 6987 -86541 -219040 -227903 -285719 -256317 -262824
5514 -262824 -336102 -319511 -212417 -160699 -61216 -30108 -1874 52011 33921 85618 92137 -6215
5502f215j09070J7811P0016M7342J58078K2095j98008j42438J7736M7892K36686
5491A61925K2245j68962n1939m2199m1957m0009L5108J0076q322j3725J92318
5480E4559k5067o411j0684k7252N2137p6715j95028r5316J2208J53808J50609
5469a3152N5991r795q466J209p6457J12205Q8724J03549n0061o72L2260q8341
5457A46994j8917k4280j91507j6620K10381O1302J294q4370J13140K1030j28267
5446I0180j33363M705J00373k2902j37849n9596L0161J90570J64908L9655k30231
5435C6611K5609j3468j36359J8024J11539L9475j20250q721L3661j1350m1217
5424f6446l0971l890m6385R7734J8644j05373j0569j7443l9621r347m3459L9556
$$ plain form
5502 -6215 -115285 -97474 -27458 19884 177962 200057 2049 -140389 -122653 -74761 161925
5491 161925 184170 15208 -36731 -78930 -120887 -160896 -125788 -115712 -124034 -137759 54559
5480 54559 29492 23081 12397 -14855 37282 -39433 -234461 -329777 -317569 -163761 -13152
5469 -13152 42839 33044 24578 25787 -50670 61535 150259 253808 203747 203075 235335 146994
5457 146994 128077 103797 -87710 -104330 106051 167353 168647 84277 197417 218447 90180
5446 90180 -43183 -38478 61895 38993 -98856 -158452 -128291 62279 227187 266842 36611
5435 36611 62220 48752 -87607 -69583 41956 81431 -38819 -47540 -13879 -25229 -66446
5424 -66446 -97417 -101307 -147692 -49958 -31314 -136687 -147256 -164699 -204320 -213667 -257126 -217570
5412b17570j5115n46j8797K7567R6567O6720l7863J63661M8794o6078k7061l7673
5400a7394Q534P1264l0565n6019P7135Q2292k2379J1061m8936n6044k0373m1246
5388d2670j70624l9206q1092R4209R8447j5197O6303j8521K9473O070K9102P3659
5376B9953J57659N6110n7916k04536j21250j92474j14109J81081J19970J2038
5366a33474R4033N2094O2116K2079j37058K1057R9332L0816j25123j42061j74809
5355c30998K5749J18530j021J7829R3136j49722k6243L2469K2355O4206m1962
5344a75672r5481N6753K29022Q0495m1236j02321J0813j11822N044J15579N0960
5333B2134n3901k9256J6384j4665o1357l4231j498l2941J9795Q1086J1873j08591
$$ plain form
5412 -217570 -232685 -233231 -252028 -224461 -127894 -61174 -99037 64624 113418 47340 20279 -17394
5400 -17394 -8860 62404 31839 -24180 52955 135247 112868 123929 74993 18949 -1424 -42670
5388 -42670 -213294 -252500 -333592 -239383 -140936 -156133 -89830 -108351 -78878 -72808 -43706 29953
5376 29953 187612 243722 185806 -18730 -139980 -332454 -446563 -265482 -145512 -133474
5366 -133474 -39441 12653 74769 96848 -40210 -19153 80179 110995 -14128 -156189 -330998
5355 -330998 -305249 -186719 -187740 -169911 -76775 -226497 -252740 -220271 -197916 -133710 -175672
5344 -175672 -271153 -214400 14622 95117 53881 -48440 -37627 -149449 -144405 -28826 22134
5333 22134 -31767 -61023 -44639 -59304 -120661 -154892 -156390 -189331 -169536 -88450 -76577 -185168
5321a85168J35140J11155j76319k5179J18794q6185M9901J31375l123j00805q1889
5310a12303r4107O4884o1317q5121J37986J93551J22668P2580R4103j44032j54864
5299C4028j24005L7881m6332k1455P663J71821j8798k3107l8574K1053n218r5229
5287a00272P8364Q4703j9724j21548p2427n06P1142N4159j5125P203M3099p408
5275A660k0151o7078r8730m6496J6789M8105R7419J60681J33125k4969j71251
5264B9104l4744L2444k4896n6879k7621j8195k0841N5496K62606N4861j58083
5253I3252l2818P3102J58179r2189j98964j4203J22919Q1760O5081P3769j64079
5242A65809J0824R8114m5828j24990j38200p8558j29286m1643J12264J22660J11032
$$ plain form
5321 -185168 -50028 61127 -115192 -140371 -21577 -107762 -57861 73514 70391 -30414 -112303
5310 -112303 -206410 -141526 -202843 -287964 -149978 43573 166241 238821 332924 188892 34028
5299 34028 -89977 -52096 -98428 -119883 -112220 59601 40803 17696 -20878 175 -5043 -100272
5287 -100272 -21908 62795 43071 -78477 -150904 -151410 -80268 -26109 -41234 -34031 9068 1660
5275 1660 -18491 -85569 -184299 -230795 -214006 -165901 -68482 92199 225324 200355 29104
5264 29104 -5640 26804 1908 -54971 -82592 -100787 -121628 -66132 196474 251335 93252
5253 93252 60434 133536 291715 199526 562 -13641 109278 191038 256119 329888 165809
5242 165809 176633 274747 228919 103929 -34271 -112829 -242115 -283758 -171494 -48834 62198
5231F2198N6485N2055p1380j3981n8900r1887j28113J05292Q9934l1536J8760
5220a1073l0336n9277J07311j08507M407L7994l8212k7200P4058R7385k1762j07540
5208h2752N5591k1386j38714L9933q863r2312l3986J10202P2592r5305J53144
5197d1856J08856L1219m0195l2122J6060M8572K1267K9272r5251k9554P6488n9545
5185C3211r0641l6703K4571m4619N4567n4557j26841p4887J02891n2294N659L06665
5173D7022J0078j63535m9113l6714l5756J45429M4767J8767j02397j0476O7010
5162f4918R3993r6026j01868O7294M0098m8647N6901o6807k3457J2693J03447
5151b7297n4202J1993M1151P4234j03459k9569n5259j14366p6220K78750J97407
$$ plain form
5231 62198 118683 170738 99358 85377 26477 -65410 -193523 -88231 1703 -29833 -11073
5220 -11073 -41409 -100686 6625 -101882 -97475 -59481 -97693 -124893 -50835 46550 24788 -82752
5208 -82752 -27161 -48547 -187261 -147328 -156191 -248503 -282489 -172287 -99695 -195000 -41856
5197 -41856 67000 98219 58024 25902 41962 90534 111801 141073 45822 16268 92756 33211
5185 33211 -57430 -94133 -69562 -114181 -59614 -114171 -241012 -315899 -213008 -265302 -259643 47022
5173 47022 57100 -106435 -155548 -192262 -228018 -82589 -37822 -19055 -121452 -131928 -64918
5162 -64918 29075 -66951 -168819 -101525 -61427 -110074 -53173 -119980 -143437 -130744 -27297
5151 -27297 -81499 -69506 -28355 45879 -57580 -87149 -142408 -256774 -332994 -54244 143163
5140A43163N2726l5367l0291J1859q0500L2197p5569J7146m2192J9579n8945p7595
5128a23789l3756j0420P7141J49207P8208r0551j14286o091M7809N9183j4089
5117A8566R0553N0797j0196p1423N4527k4625p6672j55290o2912J73784Q7348
5106G4457P3168K9133r4352k9539o429n489j14943j3684O2348N2150m7350k2868
5094d3398K5209l9612q0164K872L6679J7728R0665Q6855P2399l7358j64301j29797
5082a62223Q7485O0852J909K0371J43995q0574j09877n7831Q8290J12632j11849
5071f820K2064L2807Q5106N6344l4339j34675p8219Q4094j8620p9598m0759L5204
5059g7411P8241n4781k8504J6328j04158j51725J45660k2648n1319K8981O3472
$$ plain form
5140 143163 195889 160522 130231 142090 61590 93787 18218 35364 -6828 12751 -46194 -123789
5128 -123789 -157545 -167965 -90824 58383 136591 46040 -68246 -74337 -26528 32655 18566
5117 18566 109119 159916 149720 78297 132824 108199 31527 -123763 -186675 -12891 74457
5106 74457 147625 176758 82406 52867 46438 40949 -73994 -87678 -25330 26820 -20530 -43398
5094 -43398 -18189 -57801 -137965 -135093 -98414 -80686 9979 96834 169233 131875 -32426 -162223
5082 -162223 -74738 -13886 -11977 8394 152389 71815 -38062 -95893 -7603 105029 -6820
5071 -6820 15244 48051 133157 189501 155162 20487 -57732 26362 7742 -71856 -112615 -77411
5059 -77411 830 -53951 -82455 -66127 -170285 -322010 -176350 -198998 -250317 -221336 -157864
5048a57864M5579J21784J1939l1483K2344r5390m5467N2647P2897J32060k8185
5037A00861l6382p8928o0633j21808m1551O9170q7901p461Q1701O1875J12091
5026h966K4810p0698k2079m3004m0785M1387K9149R2730L7388J8408J4533M3016
5014A15889N8457K4568J5887r0851j01180p4109l8059o2619M5511k37j11371r9360
5002c17474M3170O910R4863L9120M4024j89066m4181R3761j5905l8996q750O6851
4990b25673J2074L2362j6080R7342N0485R806j26577m8263R9396J52279J1852
4979D9003j33094K3361M1031p8948K0069O7798p549J03013M9007k07179l8067
4968a11555R9220R4025m0249K8418j818n725O5528p6629K7097j48696k49888j255
$$ plain form
5048 -157864 -112285 9499 21438 -10045 12299 -83091 -128558 -75911 -3014 129046 100861
5037 100861 64479 -14449 -75082 -196890 -238441 -169271 -257172 -264633 -182932 -121057 -8966
5026 -8966 15844 -54854 -76933 -119937 -160722 -119335 -90186 2544 39932 58340 72873 115889
5014 115889 174346 198914 214801 123950 22770 -51339 -89398 -152017 -106506 -106743 -218114 -317474
5002 -317474 -274304 -267394 -172531 -133411 -89387 -278453 -322634 -228873 -244778 -283774 -292524 -225673
4990 -225673 -213599 -181237 -197317 -99975 -49490 -39684 -166261 -214524 -115128 37151 49003
4979 49003 -84091 -60730 -19699 -98647 -78578 -10780 -18329 84684 133691 -73488 -111555
4968 -111555 -12335 81690 41441 69859 68041 62316 127844 51215 78312 -70384 -320272 -321527
4956c21527Q4374R1397N4043J03120J42742n5823p9610P748J1280m7665j01747
4945a11668k3767M4644J5694n6941O2644n919P511L7269l88p2828o075J46773
4933C6949J26587N8697q9560j11543q0809J02409j47543r3444M2423M9209L2888
4922g3737J00637J38197k4373j35561N2069J2734j14385m2611P3236N7962Q5643
4911A29811P9054M3262k14950q7189O4743M7976k834J6738K3357l0240m3284L2456
4899E8900J36472L3440k01817j56816J35867K9489p5929J6455N7518j00797k5014
4888i2232J60000J05092j20848l6112j3568m0270L4560m5925l9777R9035k5559
4877a5604j75070m0911p3987J00021P9860r2298M3795J69021R1493p2529M001
$$ plain form
4956 -321527 -237153 -145756 -91713 11407 154149 98326 18716 26464 37744 -9921 -111668
4945 -111668 -135435 -90791 -75097 -132038 -69394 -75313 -67802 -30533 -30921 -103749 -109824 36949
4933 36949 163536 222233 132673 21130 -59679 42730 -104813 -198257 -155834 -106625 -73737
4922 -73737 26900 165097 140724 5163 57232 69966 -44419 -87030 -13794 44168 129811
4911 129811 208865 252127 37177 -50012 14731 62707 59873 76611 99968 69728 26444 58900
4899 58900 195372 228812 26995 -129821 6046 35535 -40394 -23939 33579 -67218 -92232
4888 -92232 67768 172860 52012 15900 2332 -37938 -3378 -49303 -89080 9955 -15604
4877 -15604 -190674 -231585 -305572 -205551 -125691 -217989 -174194 -5173 86320 13791 17792
4866A7792J4463p660J0445J2661N3115k657o6219r9827J3869J17884K3205R6485
4854A83556r5310j40469J13157j0929r7191j53845J509J22005M7426q9476l5479
4843a55046R2529N9223K6728k7206R2463Q8334r191l4106j74896j147R6317Q7162
4831A41164n3863n7948r9041m4219R9327P3111j7942r340K3897J8406M1950j12230
4819C272j14366J16691J74832k9842j18949o4135o4641j25934J1295R1958o5814
4808a85633j9985P1177J56651j8399J1768P2116j325o6727j90915L4527P4101
4797f2644Q1310P1120m2176n0508k8827M594J31730l3906J17462M3554l2635m0072
4785A59002p6365j05230q9995L2135n8177O97k7257P6262L3744m0106r9501K6614
$$ plain form
4866 17792 32255 24595 35040 47701 100816 98159 31940 -67887 -54018 63866 87071 183556
4854 183556 88246 -52223 60934 50005 -47186 -201031 -199522 -77517 -30091 -119567 -155046
4843 -155046 -62517 -3294 23434 -3772 88691 177025 167834 133728 -41168 -42315 54002 141164
4831 141164 87301 29353 -69688 -113907 -14580 58531 40589 31249 55146 73552 115502 3272
4819 3272 -111094 5597 180429 150587 31638 -32497 -97138 -223072 -211777 -119819 -185633
4808 -185633 -205618 -134441 22210 3811 15579 87695 86370 19643 -171272 -136745 -62644
4797 -62644 18666 89786 47610 -2898 -31725 -27131 104599 70693 188155 231709 199074 159002
4785 159002 82637 -22593 -112588 -80453 -138630 -137933 -165190 -88928 -55184 -95290 -194791 -168177
4773a68177j2343J9945o1727p926N8011N3308m3856R0404J20103J508m7925q562
4761g237O683J9577R5750n4650o2952j1770k3758K3113M1855J5179p406k7395
4749F989j0138l0885M7560l3955j7107j5016q6344p8740M5864J8825N7384J13472
4737A7909O9912j1407o40O0772j7248l8273q1380N5665j7401j59920o3025j12211
4725b97247N4749O8471Q8973J01987L87j51745k2373J35241O5266n1653k8879
4714c6823N7076q572M0341q384j82231o767J43051J43675J56246k5599j11693
4703A60320j22388p3788j5517L1007l6638l9648q5023J00118M4331j46778Q8386
4692i5618K8546Q9529p6184m4820J2599P5398k4713N8272K9272K7440m5109J19938
$$ plain form
4773 -168177 -180520 -160575 -222302 -230228 -172217 -118909 -162765 -72361 47742 49250 1325 -7237
4761 -7237 -554 19023 114773 60123 -2829 -14599 -38357 -15244 26611 41790 34384 6989
4749 6989 -3149 -34034 13526 -20429 -37536 -52552 -138896 -217636 -171772 -152947 -95563 17909
4737 17909 87821 76414 75774 136546 119298 81025 -355 55310 37909 -122011 -185036 -297247
4725 -297247 -242498 -174027 -85054 16933 17320 -134425 -156798 -21557 43709 -7944 -36823
4714 -36823 20253 11681 52022 43638 -138593 -145360 -2309 141366 297612 272013 160320
4703 160320 37932 -35856 -51373 -20366 -57004 -96652 -181675 -81557 -37226 -184004 -95618
4692 -95618 -67072 22457 -53727 -98547 -85948 -10550 -35263 23009 52281 79721 34612 154550
4680A54550L5501o8293n9221j11474o9926L5371J16564J66781p7378j24556M5235
4669D3154l5160l9825r8607p091J57496N2934Q8062P0235J0140K4387m5219j34504
4657H6002q3606J05056L3231n3958j20148L390P5479m0985J7814k9133j7740p6428
4645a01026L1549n0062j382R4101n155l3956r7287J25924L7056j11027n1284J970
4633a60579j27379k6162J6864M1078J11701L2629L7300o6980l3680J35204L665
4622c6339l8627k4571r9239o965O7538L9862N6432L732M5892N5924L4228r0702
4610G165j08587k1021N74J12047Q1658n9115j25248l7481l9198m5923m8250N9097
4598b24282L4078P5905R8229O9264R1198J03187P1802k2771m9141j58084l362
$$ plain form
4680 154550 190051 121758 62537 -48937 -118863 -83492 33072 199853 122475 -2081 43154
4669 43154 7994 -31831 -130438 -137529 19967 72901 160963 231198 241338 265725 220506 86002
4657 86002 2396 107452 140683 86725 -33423 -30033 45446 4461 22275 -6858 -24598 -101026
4645 -101026 -69477 -119539 -120921 -26820 -31975 -65931 -163218 -37294 -238 -111265 -162549 -160579
4633 -160579 -287958 -314120 -297256 -256178 -144477 -111848 -74548 -141528 -175208 -40004 -36339
4622 -36339 -74966 -99537 -198776 -205741 -138203 -98341 -41909 -38177 7715 63639 97867 7165
4610 7165 -101422 -122443 -121869 -9822 71836 12721 -112527 -150008 -189206 -235129 -283379 -224282
4598 -224282 -190204 -114299 -16070 53194 144392 247579 319381 296610 247469 89385 86023
4587H6023N183m9524j44136J60701n1040J1155K05794J3078n6561m6612J5277
4576A49338l7900k11051j64363L0472J05587J32118N1076O714p1023M4602K2239
4565E7809j02592j0969N0156j81889l129n7233J7261J68345J23631K7693N6932
4554A46015J8429J3067J19114q7190p9387R757O7187p1829q0332j0107M4220P7092
4542A66036j03467k43059o1617J20512O5013P6590m3590o7896j38454l5269J98379
4531f6822J44483n283J2834p5316j32152o1610j8131J01560J71690k8436q6808
4520d3991j35460Q7461R8749m3353R1514L253l2518j99867K3861L979k8287k2760
4508a97419j5369l0612J7085R9440J31580l2670l754n2878r8031l417m79N0021
$$ plain form
4587 86023 91206 41682 -102454 58247 7207 18362 224156 237234 180673 134061 149338
4576 149338 111438 -99613 -263976 -233504 -127917 4201 55277 61991 -9032 35570 57809
4565 57809 -44783 -55752 -5596 -187485 -190614 -247847 -230586 -62241 61390 89083 146015
4554 146015 164444 177511 296625 209435 130048 139805 206992 135163 54831 44724 88944 166036
4542 166036 62569 -180490 -242107 -121595 -56582 20008 -23582 -91478 -229932 -265201 -66822
4531 -66822 77661 72378 85212 9896 -122256 -183866 -201997 -100437 71253 42817 -43991
4520 -43991 -179451 -91990 6759 -36594 54920 58173 25655 -174212 -150351 -146372 -174659 -197419
4508 -197419 -212788 -243400 -226315 -126875 4705 -27965 -31719 -84597 -182628 -186045 -186524 -136503
4496a36503j4873q685J31617J31706M4395j3550J8428q1079L939O9621l7299p3104
4484C4613j62409p0643K4113J44514n2185m6044N3266K7145j26778P4238R2539
4473g631q7384N5287k2464k2751n7734Q6050l9474o8452P4208O1025k997L5007
4461B690o1083o089N6426p5233L1568j1877j04809j40248J4556J09830n3687O3743
4449a74213J58987n4174J336J58310J3822o2766r2989L7740J50004l1102j25578
$$ plain form
4496 -136503 -151376 -160061 -28444 103262 147657 134107 152535 71456 75395 145016 107717 34613
4484 34613 -127796 -198439 -174326 -29812 -81997 -128041 -74775 -47630 -174408 -100170 -7631
4473 -7631 -95015 -39728 -62192 -84943 -142677 -56627 -96101 -164553 -90345 -29320 -32317 2690
4461 2690 -58393 -64482 -8056 -83289 -51721 -63598 -168407 -308655 -294099 -184269 -237956 -174213
4449 -174213 -15226 -69400 -68064 90246 104068 41302 -51687 -13947 136057 104955 -20623
$$ [...]
##END NTUPLES=NMR SPECTRUM
##END=
