##TITLE=Analysis number 327227
Compound Code cc 52909
Book Reference 423/132/7
Project Code adrs
Chemist Name bruced
##JCAMPDX= 6.0         $$ Bruker NMR JCAMP-DX V2.0
##DATA TYPE= NMR SPECTRUM
##DATA CLASS= NTUPLES
##ORIGIN= Bruker BioSpin GmbH
##OWNER= nmr
$$ XWIN-NMR		Version 3.5
$$ Thu Mar 15 14:12:47 2007 GMT Standard Time (UT+0h)  MAYBRIDGE\nmr@NMR_250MHZ
##.OBSERVE FREQUENCY= 250.131544655141
##.OBSERVE NUCLEUS= ^1H
##.ACQUISITION MODE= SIMULTANEOUS (DQD)
##.ACQUISITION SCHEME= undefined
##.AVERAGES= 16
##.DIGITISER RES= 18
##SPECTROMETER/DATA SYSTEM= dpx250
##.PULSE SEQUENCE= zg30
##.SOLVENT NAME= CDCl3
##.SHIFT REFERENCE= (INTERNAL, CDCl3, 0, 16.4538)
##AUDIT TRAIL= $$ (NUMBER, WHEN, WHO, WHERE, WHAT)
$$ ##TITLE= Audit trail, XWIN-NMR		Version 3.5
$$ ##JCAMPDX= 5.01
$$ ##ORIGIN= Bruker BioSpin GmbH
$$ ##OWNER= nmr
$$ C:\u/data/dgb/nmr/ADRS/1010/pdata/1/auditp.txt
$$ ##AUDIT TRAIL=  $$ (NUMBER, WHEN, WHO, WHERE, WHAT)
(   1,<2007-03-15 14:12:28.59 +000>,<MAYBRIDGE\nmr>,<NMR_250MHZ>,
      <created by zg, POWCHK disabled, PULCHK disabled
       configuration hash MD5:
       49 4B E0 1D 92 C2 6B 37 9F E6 65 BC 52 41 86 1D
       data hash MD5: 64K
       CA 9F DE D3 94 E1 F7 B5 10 26 08 4C 11 36 D6 92>)
(   2,<2007-03-15 14:12:39.64 +000>,<MAYBRIDGE\nmr>,<NMR_250MHZ>,
      <Start of raw data processing
       ef LB = 0.3 FT_mod = 6 PKNL = 1 SI = 32K 
       data hash MD5: 32K
       83 C1 7B 2D 82 E6 A2 BB CA D4 52 90 B2 68 78 5B>)
(   3,<2007-03-15 14:12:41.30 +000>,<MAYBRIDGE\nmr>,<NMR_250MHZ>,
      <apk 
       data hash MD5: 32K
       E0 D0 AC CB 90 3D 16 C0 36 36 2A 88 C1 9F 4C 0D>)
(   4,<2007-03-15 14:12:42.00 +000>,<MAYBRIDGE\nmr>,<NMR_250MHZ>,
      <abs ABSG = 5 
       data hash MD5: 32K
       8F 13 C0 07 86 AF 08 EE 6E 2E 67 51 35 80 26 02>)
$$ ##END=
$$ 
$$ hash MD5
$$ D4 A3 DA 97 B7 3E 26 DF 48 CB CD 14 25 F2 68 2E
##$RELAX= 
##$RELAX= 
##$RELAX= 
##$RELAX= 
##$RELAX= 
##$RELAX= 
##$RELAX= 
$$ Bruker specific parameters
$$ --------------------------
##$DU= <C:\u>
##$EXPNO= 1010
##$NAME= <ADRS>
##$PROCNO= 1
##$TYPE= <nmr>
##$USER= <dgb>
##$AMP= (0..31)
100 100 100 100 100 100 100 100 100 100 100 100 100 100 100 100 100 100 
100 100 100 100 100 100 100 100 100 100 100 100 100 100 
##$AQSEQ= 0
##$AQ_mod= 3
##$AUNM= <au_zg>
##$AUTOPOS= <40 >
##$BF1= 250.13
##$BF2= 250.13
##$BF3= 250.13
##$BF4= 250.13
##$BF5= 500.13
##$BF6= 500.13
##$BF7= 500.13
##$BF8= 500.13
##$BYTORDA= 1
##$CFDGTYP= 0
##$CFRGTYP= 5
##$CHEMSTR= <none>
##$CNST= (0..31)
1 1 145 1 1 1 1 1 1 1 1 1 1 1 1 1 1 1 1 1 1 1 1 1 1 1 1 1 1 1 1 1 
##$CPDPRG= <>
##$CPDPRG1= <>
##$CPDPRG2= <>
##$CPDPRG3= <>
##$CPDPRG4= <mlev>
##$CPDPRG5= <mlev>
##$CPDPRG6= <mlev>
##$CPDPRG7= <mlev>
##$CPDPRG8= <mlev>
##$CPDPRGB= <>
##$CPDPRGT= <>
##$D= (0..31)
0 1 0 0 0 0 0 0 0 0.06 0 0 0 0 0 0 0.0002 0 0 0 0 0 0 0 0 0 0 0 0 0 0 
0 
##$DATE= 1173967947
##$DBL= (0..7)
120 120 120 120 120 120 120 120 
##$DBP= (0..7)
150 150 150 150 150 150 150 150 
##$DBP07= 0
##$DBPNAM0= <>
##$DBPNAM1= <>
$$ [...]
##$SUBNAM7= <"">
##$SUBNAM8= <"">
##$SUBNAM9= <"">
##$SW= 20.6930455092707
##$SWIBOX= (0..15)
0 0 3 0 0 0 0 0 0 0 0 0 0 0 0 0 
##$SW_h= 5175.983436853
##$TD= 65536
##$TD0= 1
##$TE= 683.16
##$TE2= 300
##$TE3= 300
##$TEG= 300
##$TL= (0..7)
0 120 120 120 120 120 120 120 
##$TP= (0..7)
150 150 150 150 150 150 150 150 
##$TP07= 0
##$TPNAME0= <>
##$TPNAME1= <>
##$TPNAME2= <>
##$TPNAME3= <>
##$TPNAME4= <>
##$TPNAME5= <>
##$TPNAME6= <>
##$TPNAME7= <>
##$TPOAL= (0..7)
0.5 0.5 0.5 0.5 0.5 0.5 0.5 0.5 
##$TPOFFS= (0..7)
0 0 0 0 0 0 0 0 
##$TUNHIN= 0
##$TUNHOUT= 0
##$TUNXOUT= 0
##$USERA1= <user>
##$USERA2= <user>
##$USERA3= <user>
##$USERA4= <user>
##$USERA5= <user>
##$V9= 5
##$VALIST= <valist>
##$VCLIST= <CCCCCCCCCCCCCCC>
##$VD= 0
##$VDLIST= <DDDDDDDDDDDDDDD>
##$VPLIST= <PPPPPPPPPPPPPPP>
##$VTLIST= <TTTTTTTTTTTTTTT>
##$WBST= 1024
##$WBSW= 4
##$XGAIN= (0..3)
0 0 0 0 
##$XL= 0
##$YL= 0
##$YMAX_a= 255707
##$YMIN_a= -319127
##$ZGOPTNS= <>
##$ZL1= 120
##$ZL2= 120
##$ZL3= 120
##$ZL4= 120
##$ABSF1= 16.45375
##$ABSF2= -4.239422
##$ABSG= 5
##$ABSL= 3
##$ALPHA= 0
##$AQORDER= 0
##$ASSFAC= 0
##$ASSFACI= 0
##$ASSFACX= 0
##$ASSWID= 0
##$AUNMP= <proc_1d>
##$AZFE= 0.1
##$AZFW= 0.1
##$BCFW= 0
##$BC_mod= 0
##$BYTORDP= 0
##$COROFFS= 0
##$CY= 12.5
##$DATMOD= 1
##$DC= 0
##$DFILT= <>
##$DTYPP= 0
##$F1P= 14.0000005364418
##$F2P= -0.99999901652339
##$FCOR= 0.5
##$FTSIZE= 32768
##$FT_mod= 6
##$GAMMA= 0
##$GB= 0
##$INTBC= 1
##$INTSCL= 1
##$ISEN= 128
##$LB= 0.3
##$LEV0= 0
##$LPBIN= 0
##$MAXI= 10000
##$MC2= 0
##$MEAN= 0
##$ME_mod= 0
##$MI= 0
##$NCOEF= 0
##$NC_proc= -5
##$NLEV= 6
##$NOISF1= 0
##$NOISF2= 0
##$NSP= 0
##$NTH_PI= 0
##$NZP= 0
##$OFFSET= 16.45375
##$PC= 1
##$PHC0= 227.8639
##$PHC1= 11.83698
##$PH_mod= 1
##$PKNL= yes
##$PPARMOD= 0
##$PSCAL= 4
##$PSIGN= 0
##$REVERSE= no
##$SF= 250.130017070354
##$SI= 32768
##$SIGF1= 0
##$SIGF2= 0
##$SINO= 400
##$SIOLD= 32768
##$SREGLST= <1H.CDCl3>
##$SSB= 0
##$STSI= 32768
##$STSR= 0
##$SW_p= 5175.98343685301
##$SYMM= 0
##$S_DEV= 0
##$TDeff= 65536
##$TDoff= 0
##$TI= <Analysis number 999999
Compound Code 99
Book Reference 9
Project Code 9>
##$TILT= no
##$TM1= 0
##$TM2= 0
##$TOPLEV= 0
##$USERP1= <user>
##$USERP2= <user>
##$USERP3= <user>
##$USERP4= <user>
##$USERP5= <user>
##$WDW= 1
##$XDIM= 32768
##$YMAX_p= 359337146
##$YMIN_p= -567633
$$ End of Bruker specific parameters
$$ ---------------------------------
##NTUPLES= NMR SPECTRUM
##VAR_NAME=  FREQUENCY,     SPECTRUM/REAL,   SPECTRUM/IMAG
##SYMBOL=    X,             R,               I
##VAR_TYPE=  INDEPENDENT,   DEPENDENT,       DEPENDENT
##VAR_FORM=  AFFN,          ASDF,            ASDF
##VAR_DIM=   32768,         32768,           32768
##UNITS=     HZ,            ARBITRARY UNITS, ARBITRARY UNITS
##FACTOR=    0.157963299565203, 1,           1
##FIRST=     4115.57692103858, 0,            0
##LAST=      -1060.40651581443, 0,           0
##MIN=       -1060.40651581443, -567633,     0
##MAX=       4115.57692103858, 359337146,    0
$$ Real data points
##PAGE= N=1
##DATA TABLE= (X++(R..R)), XYDATA
$$ [...]
19128E9670098n887916o310535o260802n934692n498032m614324l844147k943010
$$ 59670098 53782182 47471647 41210845 35276153 29778121 25163797 21319650 18376640
19120A8376640k346787j967979j448946j313975r99855r23014q81092n80510n37361
$$ 18376640 16029853 14061874 12612928 11298953 10299098 9376084 8494992 7914482 7377121
19111G377121o01246o26762l73835l99489m03697l45483l20370j42289j57099
$$ 7377121 6775875 6149113 5775278 5375789 4972092 4626609 4306239 4163950 4006851
19102D006851k99829j27637K731q1066k17428j97210j79659l15769l38777j38655
$$ 4006851 3707022 3579385 3582116 3501050 3283622 3086412 2906753 2590984 2252207 2113552
19092B113552J10642j8235j39697r6925J50654n3061k77300j17862k57825l11047
$$ 2113552 2224194 2205959 2066262 1969337 2119991 2066930 1789630 1671768 1413943 1102896
19082A102896k831J79210o0858m0723p6358j45873o3099r1081j14910J28560K03544
$$ 1102896 1100065 1279275 1218417 1177694 1101336 955463 892364 801283 686373 814933 1018477
19071A018477M6249m3060K5596m3625r3803R632J9301j17962j59744J01092p7118
$$ 1018477 1064726 1021666 1047262 1003637 909834 919466 938767 820805 661061 762153 685035
19060F85035q2520J5744n2725R722n2753j8975K0602P1077n1924r70j0814n465
$$ 685035 602515 618259 565534 575256 522503 503528 524130 595207 543283 542313 531499 526034
19048E26034K1773J19802k7430j39289l6299n9766p879P933l8752n883O3556N3322
$$ 526034 547807 667609 640179 500890 464591 404825 396946 404879 366127 360244 423800 477122
19036D77122J089O0125N3949Q3788p0454m7139j32977p0189J5457R8233q7643
$$ 477122 478211 538336 592285 676073 605619 558480 425503 355314 370771 469004 381361
19025C81361m6522M463L6150M1574l1792k9414o8171K4075J0043j94162m2002
$$ 381361 334839 339302 375452 417026 385234 355820 287649 311724 321767 127605 85603
19014H5603J18168J46552N3901r0744J5826j48439J0553J41951j2522j18552n619
$$ 85603 203771 350323 404224 313480 329306 180867 191420 333371 320849 202297 196678
19003A96678R8429j0976j04616m6273R659J37877R6321k1459j09113n0914J4847
$$ 196678 295107 284131 179515 133242 142901 280778 377099 355640 246527 195613 210460
18992B10460J32599j0444p3924L9078Q5311M0809j38016l3969l1557O6055K5308
$$ 210460 343059 332615 258691 297769 383080 423889 285873 251904 220347 286402 311710
18981C11710o5795j41838r4510J648j2930J16985K05076J7886L9719J4490q6721
$$ 311710 245915 104077 9567 11215 -1715 115270 320346 338232 377951 392441 305720
18970C05720l5385P4090M8728j91459j46726j5016J41028O7698o7245n3634J4461
$$ 305720 270335 344425 393153 201694 54968 39952 180980 248678 181433 127799 142260
18959A42260N0020K8938j05781j28294J1456p6028K6236N4864n8887J44651R176
$$ 142260 192280 221218 115437 -12857 -1401 -77429 -51193 3671 -55216 89435 98611
18948I8611n9308p7910M8093J17115P3008q9080j48160n5741n73j4043M2298J30113
$$ 98611 39303 -38607 9486 126601 199609 110529 -37631 -93372 -93945 -107988 -65690 64423
18936F4423J66651p706j01294m4872O9779L6907j44486j25435q8568K290J52042
$$ 64423 231074 223368 122074 77202 146981 183888 39402 -86033 -174601 -172311 -20269
18925b0269R8296r403L801L7008r6841J3591J74278J3448j91134J22700J32297
$$ -20269 78027 68624 72425 109433 12592 26183 200461 213909 22775 145475 277772
18914B77772J36481O302K9828K5323J5800j15335N552P7742m6997j24431L0727
$$ 277772 414253 420555 450383 475706 491506 376171 381723 459465 412468 288037 318764
18903C18764M7082q9242n1640j34219j26432p2418O0688P6712K08753N3424o3727
$$ 318764 365846 276604 224964 90745 -35687 -108105 -47417 29295 238048 291472 227745
18892B27745j28597L6617P2735O883K246j9286k771p3513p1656L1212k8292Q828
$$ 227745 99148 135765 208500 215383 217629 198343 195572 122059 50403 81615 53323 62151
18880F2151J6868k8450J4686M5009j72648l9249J45036P7454n4262j42676k1232
$$ 62151 79019 50569 65255 110264 -62384 -101633 43403 120857 66595 -76081 -97313
18869i7313Q8417O5446L0812O8009m688k2736M6951M2115o8190Q8075M0282j55398
$$ -97313 -8896 56550 87362 155371 150683 127947 174898 217013 148823 236898 277180 121782
18857A21782o0430J43983J36195j17449o9200j18835J05298J83101m9280p4728
$$ 121782 61352 205335 341530 224081 154881 36046 141344 324445 275165 200437
18847B00437j97452j73274m5823L2386R9815P9016Q1434O4861p1336o7745P7706
$$ 200437 2985 -170289 -216112 -183726 -83911 -4895 76539 141400 70064 2319 80025
18836H0025M3909m5809L4266L029j8150N1215j7267J41528J8544q3846j55337
$$ 80025 123934 78125 112391 115420 97270 148485 131218 272746 291290 207444 52107
18825E2107q9876l0544J1073k2389K0418l226m3305o339R7252J19118R0433n2748
$$ 52107 -37769 -68313 -57240 -79629 -59211 -62437 -105742 -112081 -14829 104289 194722 141974
18813A41974j47975r2726n0579N5499J465P8176O6894j75319J2346q0966J1249
$$ 141974 -6001 -98727 -149306 -93807 -92342 -14166 52728 -122591 -110245 -191211 -179962
18802a79962M6001j6778J51653P8424q966j016n7874K408J3316q5742n0859R7646
$$ -179962 -133961 -150739 914 79338 70372 69356 11482 13890 27206 -58536 -109395 -11749
18790a1749l9914N7229J29429L6152j03369m0707K08010O3969r1487J9221L9468
$$ -11749 -51663 5566 134995 171147 67778 27071 235081 299050 207563 226784 266252
18779B66252m3761r7809M1583K2625n663J7520R4880M6737O9551R733p284k5891
$$ 266252 222491 124682 166265 188890 183227 200747 295627 342364 411915 421648 414364 388473
18767C88473P6587J16234L895J42676J33244j77018l82133p2446k3346k8053L4629
$$ 388473 465060 581294 585189 727865 861109 684091 301958 229512 206166 178113 212742
18756B12742n8326q3807j3738L8133k4048o988j00118q9210Q4588l7163n656J1420
$$ 212742 154416 70609 56871 95004 70956 63968 -36150 -125360 -40772 -77935 -83591 -72171
18744g2171J20209M1455K984N6984Q6411k3464o3911n5103N9905J9730m4674j6528
$$ -72171 48038 89493 92477 149461 235872 212408 148497 93394 153299 173029 128355 111827
18732A11827O6206Q5120J51972K8529j19609K5057J3324M0574p0645J9188n5801
$$ 111827 178033 263153 415125 443654 324045 349102 362426 403000 332355 351543 295742
18721B95742P851K9112J3596R9077p2193j43902k14496j74624J66012N9484j01029
$$ 295742 303593 332705 346301 445378 373185 229283 14787 -159837 6175 65659 -35370
18710c5370p505Q886J88638J8074r2375L0819M3376o5874l4816p3630j53301m4212
$$ -35370 -42875 -33989 154649 172723 80348 111167 154543 88669 53853 -19777 -173078 -217290
18698b17290O9375O8711k8943R3040K87612j6935j20315L5514N3693l51m6230
$$ -217290 -147915 -79204 -108147 -15107 272505 255570 135255 170769 224462 224111 177881
18687A77881j56405j977n0357l8739J15957m2948m3452q8221J1721P8979M0553
$$ 177881 21476 19499 -30858 -69597 46360 3412 -40040 -128261 -116540 -37561 2992
18676B992J29723R6712j1685K2371j0600L8618O019o2749j7333p1089m7181l9654
$$ 2992 132715 229427 217742 240113 229513 268131 274150 211401 194068 122979 75798 36144
18664C6144L1957k9027l0958J1295M1131m5954l9629q8288J2894P4479J45137
$$ 36144 68101 39074 8116 19411 60542 14588 -25041 -113329 -100435 -25956 119181
18653A19181m6486Q511n4073j6946l0338k058q848k7711j67382J9264R6414O8215
$$ 119181 72695 81206 27133 10187 -20151 -22209 -31057 -58768 -226150 -206886 -110472 -42257
18641d2257N379J3238R9664o4147J2041m677K1084n3328n9566k41J23541j04228
$$ -42257 -36878 -23640 76024 11877 23918 19241 40325 -13003 -72569 -72810 50731 -53497
18629e3497O2795J50176j29035j68106l3226J05849n2013K3023R5207J56904j61590
$$ -53497 9298 159474 30439 -137667 -170893 -65044 -117057 -94034 1173 158077 -3513
18618c513j73419k1295R7554j9224p9510P7250J01489J9344o687J49286L4920
$$ -3513 -176932 -198227 -100673 -119897 -199407 -122157 -20668 -1324 -8011 141275 176195
18607A76195q6941q6794j6709P096Q605O7465L4069K1480N9940Q5413n3056K3503
$$ 176195 89254 2460 -14249 -7153 1452 68917 102986 124466 184406 269819 216763 240266
18595B40266n4173m7643J12313P8444Q7645l3087j6170K9921J51243L2459Q285
$$ 240266 186093 138450 250763 329207 416852 383765 367595 397516 548759 581218 589503
18584E89503j34703q1828k0154J55439K5192p8206J8607N4570M942j73474p4733
$$ 589503 454800 372972 352818 508257 533449 455243 473850 528420 533362 359888 285155
18573B85155P2699o8018o8335J57711N4651o167j50139m200K0692q4412k6270
$$ 285155 357854 289836 221501 379212 433863 427696 277557 273357 294049 209637 183367
18562A83367q5468n4275J10719O7536q5542P6657j1042j16873n5536n4504j36647
$$ 183367 97899 43624 154343 221879 136337 212994 201952 85079 29543 -24961 -161608
18551a61608L1723J39584M6293Q4032l8369J60361M4963o7344j00357l8684j9862
$$ -161608 -129885 9699 55992 140024 101655 262016 306979 239635 139278 100594 80732
18540H0732N1382J03013N1186l3175j02673j19604o1315k4849J9845k9454l9664
$$ 80732 132114 235127 286313 253138 150465 30861 -30454 -55303 -35458 -64912 -104576
18529a04576R2226L6886p8662p9412l5183R9195Q9129j07366J15741K29275J19431
$$ -104576 -12350 24536 -54126 -133538 -168721 -69526 19603 -87763 27978 257253 376684
18518C76684K3237r3813k42982n3393J60310J0740p1998l1915k1562j7830j71435
$$ 376684 399921 306108 63126 9733 170043 180783 108785 76870 55308 37478 -133957
18507a33957m7754o4537R0320k3583o1546l9708R0905Q3728m9335M9012J24355
$$ -133957 -181711 -246248 -155928 -179511 -241057 -280765 -189860 -106132 -155467 -106455 17900
18496A7900M3938K3884N4921l8239m2501p9202k5329P3172J83270p6283j59022
$$ 17900 61838 85722 140643 102404 59903 -19299 -44628 28544 211814 135531 -23491
18485b3491j00921j30832P9685Q8369l9179q338J3720m6307J9773Q9841P9166
$$ -23491 -124412 -255244 -175559 -87190 -126369 -134707 -120987 -167294 -147521 -57680 21486
18474B1486K2078m377j0409o242M514R854K21999O5852j64493J5088K4715n9647
$$ 21486 43564 39187 28778 22536 27050 36904 258903 324755 160262 175350 200065 140418
18462A40418k9033l9194j4353j51408l9658J4410O1619q1494k5319n823J45022
$$ 140418 111385 72191 57838 -93570 -133228 -118818 -57199 -138693 -164012 -169835 -24813
18451b4813p067o5368j5690J6443L0606J5164r0032K3673P5436P2765L8300k13819
$$ -24813 -31880 -97248 -112938 -96495 -65889 -50725 -140757 -117084 -41648 31117 69417 -144402
18439a44402K2964K9125N5827l9812j54764P7333K5452J9648M5212j06978P507
$$ -144402 -121438 -92313 -36486 -76298 -231062 -153729 -128277 -108629 -63417 -170395 -162888
18428a62888J27283N2521l8530q6042K6610N4666n31k5531L8831k3707j37737
$$ -162888 -35605 16916 -21614 -107656 -81046 -26380 -26911 -52442 -13611 -37318 -175055
18417a75055l3556Q4225L747J8923N1435j1464P6987K35256r619j41059j40477
$$ -175055 -208611 -124386 -120639 -101716 -50281 -61745 15242 250498 240879 99820 -40657
18406d0657j6219J65252j29872r9702q4084J39218M0170J18641O0979m8823j27695
$$ -40657 -56876 108376 -21496 -121198 -205282 -66064 -25894 92747 153726 104903 -22792
18395b2792l0628o9601l972K51580Q2386k2790J1120p124j22756p7245M7149p9559
$$ -22792 -53420 -123021 -126993 124587 206973 184183 195303 188179 65423 -11822 35327 -44232
18383d4232k592L8900N6901L094p9269j40206k6835J08643J20817J9948j32266
$$ -44232 -46824 -7924 48977 52071 -27198 -167404 -194239 -85596 35221 55169 -77097
18372g7097m069J3819R2564n5020K765J16180O7452J02907n8626j15864J3560
$$ -77097 -81166 -67347 25217 -29803 -27038 89142 156594 259501 200875 85011 98571
18361I8571n1682o9296k9986P8477R7046N4956N7721l5502L2990J77617O8113
$$ 98571 46889 -22407 -52393 26084 123130 178086 235807 200305 233295 410912 479025
18350D79025l2475L0895r9858j28022q255N9712Q1256L9166O6172K5101n9114
$$ 479025 446550 477445 377587 249565 241310 301022 382278 421444 487616 512717 453603
18339D53603k28545K5489L4148p8118p2699o4572K9732P6530k8199m4574j09538
$$ 453603 225058 250547 284695 206577 133878 69306 99038 175568 147369 102795 -6743
18328f743N7780P390o95J0079l640O5414p1817n6437m0782j63749n6471L0569
$$ -6743 51037 58427 57732 67811 64171 129585 57768 1331 -39451 -203200 -259671 -229102
18316b29102O1668M6109M2445P6822m9022J0914l7689l3113O0150j0972o4041
$$ -229102 -167434 -121325 -78880 -2058 -51080 -40166 -77855 -110968 -50818 -61790 -125831
18305a25831J47070R3562N4597l3135J583j22234J04885J08118N9677J58997M4934
$$ -125831 21239 114801 169398 136263 137846 15612 120497 228615 288292 447289 492223
18294D92223n0769n4504J10926J24314p502o0683j33226n1723o0347l9205j03918
$$ 492223 441454 386950 497876 622190 614688 554005 420779 369056 308709 269504 165586
18283A65586j01726n2837n892L3847N5042j10286L2694j31073L1657J53170K5740
$$ 165586 63860 11023 5131 38978 94020 -16266 16428 -114645 -82988 70182 95922
18272I5922Q7467l523q4946O8050K5607M0897j5766K7056J07160m1288j46299
$$ 95922 183389 179866 94920 162970 188577 229474 213708 240764 347924 306636 160337
18261A60337P0561Q3728k8789K2288L9695r4110j12905J23813n9683r2835p2017
$$ 160337 230898 314626 285837 308125 347820 253710 140805 264618 204935 112100 40083
18250D0083N8522O4919J08046j42525j13523j18328R244R741j418J08473J38153
$$ 40083 98605 163524 271570 129045 15522 -102806 -93562 -83821 -85239 23234 161387
18239A61387J9855k0978n9844N661J27954J08682J33087K7787r7648k3529O4667
$$ 161387 181242 160264 100420 106081 234035 342717 475804 503591 405943 382414 447081
18228D47081P8305P607q062r3246J2770K26153N4456o3326K5798q3436j52858
$$ 447081 525386 532993 524931 431685 444455 670608 725064 661738 687536 604100 451242
18217D51242n2075m3927M5776P5544j00172q2281n8711J54730J35163J96216N2132
$$ 451242 399167 355240 401016 476560 376388 294107 235396 390126 525289 721505 773637
18206G73637j0484j09402l1273m2338j01558r3524o8054p6364j04070R0208J4253
$$ 773637 763153 653751 622478 580140 478582 385058 317004 240640 136570 226778 241031
18195B41031M0476J32165p986q5661l7702P627q8442k6995R1359P7453n3536P8809
$$ 241031 281507 413672 405686 320025 282323 289950 201508 174513 265872 343325 289789 368598
18183C68598O0268j5629N9639K1484J37952J6343k0476K6476k5070L1320J46281
$$ 368598 428866 413237 472876 494360 632312 648655 628179 654655 629585 660905 807186
18172H07186M326N662j754M2496J71345K07409m5836o6221r511J29972J3458l0954
$$ 807186 811512 817174 815420 857916 1029261 1236670 1190834 1124613 1115102 1245074 1258532 1227578
18160A227578q1248p0259P9264K76313K27035R5280N2814J35232K43621J77961
$$ 1227578 1146330 1076071 1155335 1431648 1658683 1753963 1806777 1942009 2185630 2363591
18150B363591J86344M6095n1870J58573n528k5275L90884M90274L84859L85386
$$ 2363591 2549935 2596030 2544160 2702733 2697205 2671930 3062814 3553088 3937947 4323333
18140D323333K27254K92109O25439P22600R46283J091880J200851J534952J514188
$$ 4323333 4550587 4842696 5468135 6190735 7137018 8228898 9429749 10964701 12478889
18131A2478889J210907L14140P2928J25241K30345L59758M45716O53245P35658
$$ 12478889 13689796 14003936 14076864 14202105 14432450 14792208 15237924 15891169 16626827
18122A6626827Q36949Q82206J042565J321803J831669K498579L402754M647058
$$ 16626827 17463776 18345982 19388547 20710350 22542019 25040598 28443352 33090410
18114C3090410O850846J0496843J3967229J4556952J3170783J2319244J2655579
$$ 33090410 39941256 50438099 64405328 78962280 92133063 104452307 117107886
18107A17107886J5658755K1570961K0180767l0668132o1331496l5333040j7003993
$$ 117107886 132766641 154337602 174518369 143850237 82518741 47185701 30181708
18100C0181708r133394n290617l294860k326606j866876j245420r56027p48060
$$ 30181708 21048314 15757697 12462837 10136231 8269355 7023935 6067908 5319848
18092E319848p33176p43380n05104k47625j57319j58919j60367m13316k04308
$$ 5319848 4586672 3843292 3338188 3090563 2933244 2774325 2613958 2200642 1996334
18083A996334q9962o8038o1597j64266l48467j67470Q208P10Q0843M0538j8758
$$ 1996334 1906372 1838334 1776737 1612471 1264004 1096534 1104742 1105452 1186295 1226833 1208075
18072A208075P1892R4939q6311j64230j33097l3730J12838k5898o8809J26627
$$ 1208075 1279967 1374906 1288595 1124365 991268 957538 1070376 1044478 975669 1102296
18062A102296j3390k10756j38166J2551L7504n0730l2565l4535R1858R581k22069
$$ 1102296 1088906 878150 739984 752535 790039 739309 706744 672209 764067 773648 551579
18051E51579j04734M0893O0855L2548l9592k31j69668p7392L7690k0783J75029
$$ 551579 446845 487738 548593 581141 541549 541318 371650 294258 331948 311165 486194
18040D86194n630o2138m6668j24174J5364J12063R4611L2136k7285j66574K617
$$ 486194 480564 418426 371758 247584 262948 375011 469622 501758 474473 307899 310516
18029C10516P9166O41q400L0825n8737m8051m2179k2623M4865Q1713R7743L5691
$$ 310516 389682 390323 381923 412748 354011 305960 263781 241158 286023 367736 465479 501170
18017E01170L7581k1785n7273l7028P4028K2534m0397l358O1709k260O818n5685
$$ 501170 538751 516966 459693 422665 496693 519227 478830 475472 537181 534921 541739 486054
18005D86054N6861m0392j58167k4735P1697j55173P886K8418M456O6632K7828
$$ 486054 542915 502523 344356 319621 391318 236145 244031 272449 276905 343537 371365
17994C71365K9657j8172L3442j395Q411P2328J22342M3229p1641m2342k8677o7249
$$ 371365 401022 382850 416292 414897 423308 495636 617978 661207 589566 547224 518547 451298
17982D51298k9187J25662J06341j44j23213O2194J46338J06943l6200j29581P6912
$$ 451298 422111 547773 654114 653970 530757 592951 739289 846232 810032 680451 757363
17971G57363l1868j53132O9203L2311L4324N5709l8538l4688N0868P6140K5307
$$ 757363 725495 572363 641566 673877 708201 763910 725372 690684 741552 817692 842999
17960H42999o7932J27948M0407R9690J39742J04786L4440m7127j00296M2205n1411
$$ 842999 775067 903015 943422 1043112 1182854 1287640 1322080 1274953 1174657 1216862 1165451
17949A165451j46563j51461j18390n5521n9611j27000P4964J01972L3762l3016
$$ 1165451 1018888 867427 749037 693516 633905 506905 581869 683841 717603 684587
17939F84587m7754M2227L8864j26048p6527J08424P5476L3764k1076J04052j7977
$$ 684587 636833 679060 717924 591876 515349 623773 699249 733013 711937 815989 798012
17928G98012m8034l8766r3750k2007J15622M5148Q2764R7121J47544K05733o7097
$$ 798012 749978 711212 617462 595455 711077 756225 838989 936110 1083654 1289387 1222290
17917A222290n3279q578j38678k66551K12117J82554k470j0970j5852K5948O9281
$$ 1222290 1169011 1160433 1021755 755204 967321 1149875 1147405 1136435 1120583 1146531 1215812
17906A215812K01270j6523l3905K9386J14297J00647J1726N1521m4478q9299m4954
$$ 1215812 1417082 1400559 1366654 1396040 1510337 1610984 1622710 1674231 1629753 1540454 1495500
17895A495500r636r5959J6955r6179q9026k7767j12569J5080J89147N7511M5226
$$ 1495500 1485864 1389905 1406860 1310681 1221655 1193888 1081319 1096399 1285546 1343057 1388283
17884A388283J46987J11485K23413J97218L80101M30299L11639L04617M32551
$$ 1388283 1535270 1646755 1870168 2067386 2447487 2877786 3189425 3494042 3926593
17875C926593M09121M77654O69041N21861N84096N78056N68781N74326M94122
$$ 3926593 4335714 4813368 5482409 6004270 6588366 7166422 7735203 8309529 8803651
17866H803651M69596N99772N30535N48152O87851P42502N29708P90149Q22406
$$ 8803651 9273247 9873019 10403554 10951706 11639557 12382059 12911767 13701916 14524322
17857A4524322J111992J351112J774658K334753K798739L293174L870799M567467
$$ 14524322 15636314 16987426 18762084 21096837 23895576 27188750 31059549 35627016
17849C5627016N060291N699402N917241N386325M630527L693010K190159l6904
$$ 35627016 40687307 46386709 52303950 57690275 62320802 66013812 68203971 68167067
17841F8167067k253411l778036m799023o020455p189508p279876o407179n521454
$$ 68167067 65913656 62135620 57336597 51316142 44126634 36846758 30439579 24918125
17833B4918125m855107l877254k818490j859562j322319r69587n89201l01436
$$ 24918125 20063018 16185764 13367274 11507712 10185393 9215806 8626605 8325169
17825H325169k21861l0136J35604J27621L18256M68848O46260N82213N79703O76547
$$ 8325169 8103308 8073172 8208776 8336397 8654653 9123501 9769761 10351974 10931677 11608224
17815A1608224O35355N72682N12983N77503N77901N34530P25900O72010O85402
$$ 11608224 12243579 12816261 13329244 13906747 14484648 15019178 15745078 16417088 17102490
17806A7102490Q63382J029641J184992J510585J779180K313285L083579L713155
$$ 17102490 17965872 18995513 20180505 21691090 23470270 25783555 28867134 32580289
17798C2580289M441725N393595O167262O864307P441735P568877O840785N570917
$$ 32580289 37022014 42415609 48582871 55447178 62888913 70457790 77298575 82869492
17790H2869492M302353K308121q95712l637024n367549o782656q586419r805525
$$ 82869492 87171845 89479966 88584254 84947230 79579681 72797025 64210606 54405081
17782E4405081r546612q389561p320987o123608m929922l626145k636034k067651
$$ 54405081 44858469 36468908 29147921 23024313 18094391 14468246 11832212 9764561
17774I764561j427385j110871q80693p40431n41618k92806l37990l83171l11681
$$ 9764561 8337176 7226305 6345612 5605181 5063563 4770757 4432767 4049596 3737915
17765C737915j93714k01972k58017k36246j81046j99212j75218j77200j22646
$$ 3737915 3544201 3342229 3084212 2847966 2666920 2467708 2292490 2115290 1992644
17756A992644j71096q3910j17017j54120k00232N9692n0394o7632J3127p4780
$$ 1992644 1821548 1737638 1620621 1466501 1266269 1325961 1275567 1207935 1221062 1146282
17746A146282r0026O6613o8274k1382M343J00374p5695j24095K4002R9248J63286
$$ 1146282 1056256 1122869 1054595 1033213 1037556 1137930 1062235 938140 962142 1061390 1224676
17735A224676K0086O3681j92745j69667J8245j3905j55915m2680O1769j16557
$$ 1224676 1244762 1308443 1115698 946031 964276 950371 794456 751776 813545 696988
17725F96988j67429R8119J22819O5552L4237j23003k2466J18589j79094k8946
$$ 696988 529559 627678 750497 816049 850286 727283 704817 823406 644312 615366
17715F15366k12974k02225O1881L6085M581K34490l9322m186p2698J2174J688
$$ 615366 402392 200167 262048 298133 302714 537204 497882 493696 420998 433172 434860
17704D34860O88j25683j51790L2980J25434m9664L5260M7887J03915P6391k6230
$$ 434860 435548 309865 158075 191055 316489 266825 302085 349972 453887 530278 504048
17693E04048k40177o8548P4709j4016l3367m1444p1232k3270K0392R0060J52382
$$ 504048 263871 195323 270032 256016 222649 181205 109973 86703 107095 197155 349537
17682C49537j0134J4259L6j1290j31172o71O3351k2122O0995j1130J19296j4647
$$ 349537 339403 353662 353698 342408 211236 210565 273916 251794 312789 301659 420955 406308
17670D06308l3522j16107l9104J15023J9760O3055r3301r7595N9899K9963j0449
$$ 406308 372786 256679 217575 332598 352358 415413 322112 224517 284416 314379 303930
17659C03930q144q1732J0755R6620q3736m4195K04607M86k1129r5912j3788j7968
$$ 303930 295786 214054 224809 321429 237693 193498 398105 398591 377462 281550 267762 249794
17647B49794j62244j32697n3477j00442L1974J59644Q6184j2322n696J33087O5714
$$ 249794 87550 -45147 -98624 -199066 -167092 -7448 78736 66414 60718 193805 259519
17636B59519M4189j00566q2094l8779J6311r5016j1279J75763L2938l6160j9714
$$ 259519 303708 203142 121048 82269 98580 3564 -7715 168048 200986 164826 145112
17625A45112q0094l819r9714q5038K1236J77644K15747n6037K3852J67941N7230
$$ 145112 65018 61199 -38515 -123553 -102317 75327 291074 235037 258889 426830 484060
17614D84060p2396j87377k5151M2196j5092k2198n988P2506J36883j50134j77406
$$ 484060 411664 224287 199136 241332 226240 204042 198054 270560 407443 257309 79903
17603G9903q2022q2202J46728J15519j9318j5032r9410K3704N1340j0376J02366
$$ 79903 -2119 -84321 62407 177926 158608 143576 44166 67870 119210 108834 211200
17592B11200j9037p4854m980J19595k3134q5752p6754J9945R477J3667J1880R5642
$$ 211200 192163 117309 112329 231924 208790 123038 46284 66229 75706 89373 101253 196895
17580A96895Q7559j9545j03031j1268q827j3764J6144R6636J31735k1658L07j37687
$$ 196895 284454 264909 161878 150610 141783 128019 144163 240799 372534 350876 351183 213496
17568B13496j4379M9666l5996l2532j07234q3015L8987m0755N6162J47966O5298
$$ 213496 199117 248783 212787 180255 73021 -9994 28993 -11762 44400 192366 257664
17557B57664M4451K5002j14919Q75P2204J37510k3910p1520k2038m5504N8065
$$ 257664 302115 327117 212198 213073 285277 422787 398877 327357 305319 259815 317880
17546C17880O1466m1820j03385N8990J27795P5263j50066l9054j8531m3601L8490
$$ 317880 379346 337526 234141 293131 420926 496189 346123 307069 288538 244937 283427
17535B83427M4619J390m4339j0679N669M816J22481k18441k6410O0232O0058J30841
$$ 283427 328046 329436 285097 274418 280087 284903 407384 188943 162533 222765 282823 413664
17523D13664M5501L1217N2551j17499K2429r6270O1878p5722j6108J37310K60888
$$ 413664 459165 490382 542933 425434 447863 351593 413471 337749 321641 458951 719839
17512G19839R9725l2523n6029J37194K1467j8792p4694K14298R9520L3721P2485
$$ 719839 819564 787041 731012 868206 889673 870881 796187 1010485 1110005 1143726 1216211
17501A216211J18508J73391L60522K71346L61300L11575L41421L04706L45433
$$ 1216211 1334719 1508110 1868632 2139978 2501278 2812853 3154274 3458980 3804413
17492C804413M92846N20464N36583P43114M60400K81395L57796M03667L94519
$$ 3804413 4297259 4817723 5354306 6097420 6557820 6839215 7197011 7600678 7995197
17483G995197M86854O14364O91327N64648O54692O34925P16966J115048J300506
$$ 7995197 8482051 9096415 9787742 10352390 11007082 11642007 12358973 13474021 14774527
17474A4774527J592701K075770K676062L271979M111610M874447N187629N502024
$$ 14774527 16367228 18442998 21119060 24391039 28502649 33377096 38564725 44066749
17466D4066749N802324N850710N211364L749964J422068k027048n371637p506043
$$ 44066749 49869073 55719783 60931147 64681111 66103179 64076131 58704494 51198451
17458E1198451p980349p060092n144817k860026j060700N44267J901536L105596
$$ 51198451 43218102 36158010 31013193 28153167 27092467 27636734 29538270 32643866
17450C2643866L925663M607440M861009M922136M525756L599670J469862j663077
$$ 32643866 36569529 41176969 46037978 50960114 55485870 59085540 60555402 58892325
17442E8892325n014245p554163q501241p936426o384785m797622l249246j927762
$$ 58892325 53878080 46323917 37822676 29886250 23501465 18703843 15454597 13526835
17434A3526835j238924q10966n30274l47679j5639J49196K32309J57186M6750
$$ 13526835 12287911 11476945 10946671 10598992 10583353 10732549 10964858 11122044 11168794
17425A1168794J68864L74356M77858N57990Q58088R05890J556647K000595K432413
$$ 11168794 11337658 11712014 12189872 12747862 13605950 14511840 16068487 18069082 20501495
17416B0501495L116081L511983L894626M048779M275327M246860L854660K529408
$$ 20501495 23617576 27129559 31024185 35072964 39348291 43595151 47449811 49979219
17408D9979219M26041j813413m238353o068492o226372n197352l629631j987535
$$ 49979219 50405260 48591847 44353494 38285002 32058630 26861278 23231647 21244112
17400B1244112o15751N16445J623921K434950L093083L357805L528018L732801
$$ 21244112 20628361 21144806 22768727 25203677 28296760 31654565 35182583 38915384
17392C8915384L321523K369010N33561j887247m453894o274781o962811o404887
$$ 38915384 42236907 44605917 45139478 43252231 38798337 32523556 25560745 19155858
17384A9155858n053100l495888k494203j620617j109389o70786o51274m06453
$$ 19155858 14102758 10606870 8112667 6492050 5382661 4711875 4060601 3654148
17376C654148j53212k26525k42815k11230j56054j63231k08083k05261j36897
$$ 3654148 3500936 3274411 3031596 2820366 2664312 2501081 2292998 2087737 1950840
17367A950840n6284j51038j40393j60931j33549j47511L748k7266j47493k7154
$$ 1950840 1894556 1743518 1603125 1442194 1308645 1161134 1164882 1137616 990123 962969
17357I62969q6662k04365l6445P5626J846J11108m7869p3948O3882P8352N7757
$$ 962969 876307 671942 635497 711123 712969 824077 776208 702260 766142 844494 902251
17346I02251N3030n7219p0519m7186r7167o4977N0637k4885Q3345K1476l6195
$$ 902251 955281 898062 827543 780357 683190 618213 668850 643965 727310 748786 712591
17335G12591j60376n936K5561Q7885P4775J07377J11517K4093m1346j62894J3712
$$ 712591 552215 546279 571840 659725 734500 841877 953394 977487 936141 773247 786959
17324G86959J1738R1882J16965j00002L0540R427j38340r8198j92254j60753r5387
$$ 786959 798697 890579 1007544 907542 938082 947509 809169 710971 518717 357964 262577
17313B62577J47648j9928j33542l8875M2595Q3280p6618m8520J13106M5933P914
$$ 262577 410225 390297 256755 217880 260475 343755 267137 218617 331723 377656 385570
17302C85570m8668M3727N9604M467o0894K8733M4735m5647n7550K829M6784m0763
$$ 385570 336902 380629 440233 444700 383806 412539 457274 411627 354077 356906 403690 362927
17290C62927j57949J750J3160K6383K08543O8484j30564j36947o9571M0599J21855
$$ 362927 204978 206728 219888 246271 454814 523298 392734 255787 186216 226815 348670
17279C48670J53563O2218k5774J0041J40136Q0896j12959r140K7991l5663K6492
$$ 348670 502233 564451 538677 548718 688854 769750 656791 647651 675642 639979 666471
17268F66471j85042q8666o6483P9629m5389p0874k6771K7540j7405L0477M9594
$$ 666471 481429 392763 326280 405909 360520 289646 262875 290415 273010 303487 353081
17257C53081q9811R584Q742j68192o0660J8023j1803M7811J59438J9648p9422
$$ 353081 263270 272854 281596 113404 52744 70767 58964 106775 266213 285861 206439
17246B06439j73983O851M6965R0523N2366O8041o5329j11146p510n8891n1095
$$ 206439 32456 39307 86272 176795 229161 297202 231873 120727 113217 54326 3231
17235C231R2484J00902j8843k2986m3484J0555P631q5912k9818l2106Q1098R3618
$$ 3231 95715 196617 177774 154788 111304 121859 129490 43578 13760 -18346 62752 156370
17223A56370N108j49264P854P2561L6733P9863R9628J1694N254j03366k47078
$$ 156370 161478 12214 20068 92629 129362 209225 308853 320547 325801 222435 -24643
17212b4643k1808J49761R3176L5871j36848o7728J0093j0465m1902j6705l5549
$$ -24643 -46451 103310 196486 232357 95509 27781 37874 27409 -14493 -31198 -66747
17201f6747J5389L5897J57657L4946K4131K4196j51906p3797J06996j35477n5438
$$ -66747 -51358 -15461 142196 177142 201273 225469 73563 -234 106762 -28715 -84153
17190h4153J87317J42258j65696o3985J1508R6401n7181l0947Q9870l279n176
$$ -84153 103164 245422 79726 15741 27249 123650 66469 35522 125392 122113 116937
17179A16937Q1689K9905j9116q3281j15428K5330L8248j6154k2809q2596j7021
$$ 116937 198626 228531 209415 126134 10706 36036 74284 58130 35321 -47275 -64296
17168f4296J13450J0228n8182r892M2259l1380k520p2218N5427L6133J31920q0412
$$ -64296 49154 59382 1200 -8692 33567 2187 -333 -72551 -17124 19009 150929 70517
17156G0517j25001J32404j9706j10177P851O1357o2561l4399J8509M5479l9292
$$ 70517 -54484 77920 58214 -51963 -44112 17245 -45316 -79715 -61206 -15727 -55019
17145e5019P8080L3516k2081q4755m4860M4549K9144j0367L400l6687j0766O9902
$$ -55019 23061 56577 34496 -50259 -95119 -50570 -21426 -31793 -28393 -65080 -75846 -5944
17133e944P8343J22044J11144j69713j78013m3871L9950L0846N3832k2424j67537
$$ -5944 72399 194443 305587 135874 -42139 -86010 -46060 -15214 38618 16194 -151343
17122a51343l7084J5884N8222K1257J48219K9299l0724k0114j00103K9490p7103
$$ -151343 -188427 -172543 -114321 -93064 55155 84454 53730 33616 -66487 -36997 -114100
17111a14100L5032J82204q84j3389J24618J9998L4859O5825j45994j77760j26509
$$ -114100 -79068 103136 102252 88863 213481 233479 268338 334163 188169 10409 -116100
17100a16100Q3744m854J31048R8400J4269k3047j40234j16422Q0354j20212r5359
$$ -116100 -32356 -37210 93838 192238 206507 183460 43226 -73196 7158 -113054 -208413
17089b08413r217m5663m7155N4021P0265J84255P4944M3615m2645j70351j37424
$$ -208413 -217630 -263293 -310448 -256427 -186162 -1907 73037 116652 74007 -96344 -233768
17078b33768k00J28553L0911l5790o5889o0119q7030n6748J15168k4557J49480
$$ -233768 -233968 -105415 -74504 -110294 -176183 -236302 -323332 -380080 -264912 -289469 -139989
17067a39989p252p1675O5076r9464O9500P4141J21604M6736l4692j43200j28645
$$ -139989 -147241 -218916 -153840 -253304 -183804 -109663 11941 58677 23985 -119215 -247860
17056b47860N9932J56516k7973j69410N4610J06142J06525J02115O093k9712K1535
$$ -247860 -187928 -31412 -59385 -228795 -174185 -68043 38482 140597 146690 116978 138513
17045A38513l8116k026j81857q5398L3708n17J12579p2527m3609k3023R6652o9541
$$ 138513 100397 98371 -83486 -168884 -135176 -135693 -23114 -95641 -139250 -162273 -65621 -135162
17033a35162L7067O7466P4655L5672m9579j67258P3071o9368R11O6616K3379m5049
$$ -135162 -98095 -30629 44026 79698 30119 -137139 -64068 -133436 -132525 -65909 -42530 -87579
17021h7579j14696N4434k5207N3444R9423l3258j45254n3914J07430N202q8670
$$ -87579 -202275 -147841 -173048 -119604 -20181 -53439 -198693 -252607 -145177 -139975 -228645
17010b28645R4172P8921P6449j75368q9549J30699K13041Q354j26121O652L8756
$$ -228645 -134473 -55552 20897 -154471 -244020 -113321 99720 108074 -18047 -11395 27361
16999B7361j8361O8154j3947M577J01679m8256j12273M5251Q4791N7736M1647
$$ 27361 9000 77154 63207 67784 169463 121207 8934 54185 138976 196712 238359
16988B38359N2693k6864k04613n592k3696n6773j1042J36413p2910n6000j21797
$$ 238359 291052 264188 59575 53983 30287 -26486 -37528 98885 25975 -30025 -151822
16977a51822l8794M5316l8270J69927L8352k6889m6101L8957J63025J27726N6494
$$ -151822 -190616 -145300 -183570 -13643 24709 -2180 -48281 -9324 153701 281427 337921
16966C37921O6121j06849j7247q5977l4574j08473P2704O7704J39761p4926q1163
$$ 337921 404042 297193 279946 193969 159395 50922 123626 191330 331091 256165 175002
16955A75002n8367J01637q9397p6466j11425o5288L8722P176L0375m690J52439
$$ 175002 116635 218272 128875 52409 -59016 -124304 -85582 -78406 -48031 -52721 99718
16944I9718J04801J09598k1233p3067L1447J19353Q4357p3709k2569j4911Q9824
$$ 99718 204519 314117 292884 219817 251264 370617 454974 381265 358696 343785 433609
16933D33609M9731j18722p4462J10129m8040K434j16588r6376k2349l5823m885
$$ 433609 483340 364618 290156 400285 352245 354679 238091 141715 119366 83543 78658
16922G8658l8064j58247j25835K20802O6563J0601K7137j77545j3042J31645J44140
$$ 78658 40594 -117653 -243488 -22686 43877 54478 81615 -95930 -108972 22673 166813
16911A66813N5605N7015N4412j85026k28400K1614M768J5793Q524J5693K30196
$$ 166813 222418 279433 333845 148819 -79581 -57967 -53199 -37406 -28882 -13189 217007
16900B17007q7848k50705R5168p064P3403L0759r9828J2991J16002Q0969o5907
$$ 217007 129159 -121546 -26378 -33442 39961 70720 -29108 -16117 99885 180854 114947
16889A14947r0276N9617J70005J0004n4759k04578o1350Q5396P092l9422j09006
$$ 114947 24671 84288 254293 264297 209538 4960 -56390 29006 36098 -3324 -112330
16878a12330j78552P8313J44292J60624k914j00842r3324J48772R378j33093R3099
$$ -112330 -290882 -212569 -68277 92347 89433 -11409 -104733 44039 53417 -79676 13423
16867A3423J14506J8276j74648n8020j5700n585J08787Q3045M6323J805j40911
$$ 13423 127929 146205 -28443 -86463 -102163 -107748 1039 84084 130407 132212 -8699
16856h699k1549m4262k6795J09788L7304q5769q8134O2521R4291j6937N1539J56129
$$ -8699 -30248 -74510 -101305 8483 45787 -39982 -128116 -65595 28696 11759 63298 219427
16844B19427j23645j98571M2434R7496N0038N3785q4268r5641j03688j25198P1307
$$ 219427 95782 -102789 -60355 37141 87179 140964 56696 -38945 -142633 -267831 -196524
16833a96524M9280Q7707O4807j22886N7374l1113R1815r0022L8548k5249o3169
$$ -196524 -147244 -59537 5270 -117616 -60242 -91355 460 -89562 -51014 -76263 -139432
16822a39432j26860q5687J33114K21880R9471j9050j5770J03164j72267j02445
$$ -139432 -266292 -351979 -218865 3015 102486 83436 67666 170830 -1437 -103882
16812a03882j07116o3195N29O2709J27741J21801M8979R1022p93m3176k7592q6317
$$ -103882 -210998 -274193 -273664 -210955 -83214 38587 87566 178588 177795 134619 107027 20710
16800B0710k6602k5081o743K8149L6666N2810J6540q9046p6847k085l752m8981
$$ 20710 -5892 -30973 -37716 -9567 27099 79909 96449 7403 -69444 -71529 -75281 -124262
16788a24262l015Q2373q0449n0396Q8244K12423k6264j63791O7565J17339m7190
$$ -124262 -127277 -44904 -125353 -175749 -87505 124918 98654 -65137 2428 119767 72577
16777G2577j66850l0872j87675j36541r33K3360J57886J10154O5372m6382K2570
$$ 72577 -94273 -125145 -312820 -449361 -450294 -426934 -269048 -158894 -93522 -139904 -117334
16766a17334Q171k4877L1169K9360k7425o2326Q8134j18544m1648R2414Q2959
$$ -117334 -109163 -134040 -102871 -73511 -100936 -163262 -75128 -193672 -235320 -142906 -59947
16755e9947L3878M4049j67440j51272J00608R6009J92688K2133j71655o9969j43185
$$ -59947 -26069 17980 -149460 -300732 -200124 -104115 88573 110706 -60949 -130918 -274103
16744b74103q592M4286J30410J37177J9804q2362q0124j15095R5535O0993q0543
$$ -274103 -282695 -238409 -107999 29178 48982 -33380 -113504 -228599 -133064 -72071 -152614
16733a52614j6916q7951j0483l5936J37030J11530K5556k6612K12064L5016j40144
$$ -152614 -169530 -257481 -267964 -303900 -166870 -55340 -29784 -56396 155668 190684 50540
16722E0540k0746j48909m1740j4682J05026Q566j6306J7121o8920j40266R5445
$$ 50540 29794 -119115 -160855 -175537 -70511 -61945 -78251 -61130 -130050 -270316 -174871
16711a74871L4655Q5758Q3831q9559M871P4517L4139k2261r3867o6359q5360r376
$$ -174871 -140216 -54458 29373 -60186 -55315 19202 53341 31080 -62787 -129146 -214506 -223882
16699b23882O2677j7021l4528Q9090J15033m7223q5374k6722J18278K7688N0081
$$ -223882 -161205 -178226 -212754 -123664 -8631 -55854 -141228 -167950 -49672 -21984 28097
16688B8097j4728n240O4000k7569j04372J1068J06584L5014q930J20117K2319
$$ 28097 13369 8129 72129 44560 -59812 -48744 57840 92854 83924 204041 226360
16677B26360M7757r2146M6560q8939k07660j20373J01870J33935k4693j01875
$$ 226360 274117 181971 228531 139592 -68068 -188441 -86571 47364 22671 -79204
16667g9204l6387j4816o3870K8635O7460n8387n5690L6350L6528O4077n5301j33422
$$ -79204 -115591 -130407 -194277 -165642 -98182 -156569 -212259 -175909 -139381 -75304 -130605 -264027
16655b64027J01097J3369n2426J040n3066j4159M0671P0712M3942j17889l0860
$$ -264027 -162930 -149561 -201987 -200947 -254013 -268172 -227501 -156789 -112847 -230736 -261596
16644b61596O2417L9875N2393K2938J03107j03572q0110o9938N0460N2013m4671
$$ -261596 -199179 -159304 -106911 -83973 19134 -84438 -164548 -234486 -184026 -132013 -176684
16633a76684L1492J36719m6524j56103l466r7969l5170K4381Q9181J19653R738
$$ -176684 -145192 -8473 -54997 -211100 -214566 -312535 -347705 -323324 -234143 -114490 -104752
16622a04752p8789J8986O8133k2045J72636k8678k18699k08754m4673P6973N8619
$$ -104752 -183541 -164555 -96422 -118467 54169 25491 -193208 -401962 -446635 -369662 -311043
16611c11043R3417M8782Q8695m7077n0355k9541j2272R3725Q3196j1477J18861
$$ -311043 -217626 -168844 -80149 -127226 -177581 -207122 -219394 -125669 -42473 -53950 64911
16600F4911R5775p890j29515m6980q1028p4050N7390j0165L2188j42945j27881
$$ 64911 160686 152796 23281 -23699 -104727 -178777 -121387 -131552 -99364 -242309 -370190
16589c70190Q994o4864J64639K41047N861R65n2707N078M7289N4559k5113P1590
$$ -370190 -361196 -426060 -261421 -20374 -14513 -13548 -66255 -61177 -13888 40671 15558 87148
16577H7148p1055m3804k6344P7290O7453J16208k2622q5696q3586J3523M0789
$$ 87148 16093 -27711 -54055 23235 90688 206896 184274 98578 14992 28515 69304
16566F9304j2567O9625j7680j04887j04877Q3238j00981j00567j6847n1209l1725
$$ 69304 56737 126362 108682 3795 -101082 -17844 -118825 -219392 -236239 -287448 -319173
16555c19173O4853J83456K5723R3652j04563j06890J482M0002J39585Q3242m4087
$$ -319173 -254320 -70864 -45141 48511 -56052 -162942 -161460 -121458 18127 101369 57282
16544E7282j84071j04560J18735m8351l7458L0791j13184N4910m8670O5836J52602
$$ 57282 -126789 -231349 -112614 -160965 -198423 -167632 -280816 -225906 -274576 -208740 -56138
16533e6138R0373o7898J15376N7858r4603R8393M7918J6531M5j65315k07276k9306
$$ -56138 34235 -33663 81713 139571 44968 143361 191279 207810 207855 42540 -164736 -194042
16521a94042J04804k8908l0096o7668j885L1522Q8951L8294j05634K0174J26979
$$ -194042 -89238 -118146 -148242 -215910 -217795 -186273 -97322 -59028 -164662 -144488 -17509
16510a7509L1310m7703j71175o0047K16747K8010k135K3160M6310q1517o8534
$$ -17509 13801 -33902 -205077 -265124 -48377 -20367 -22502 658 46968 -34549 -103083
16499a03083p6473k1560N3994q0992M5893K19090j7836k34725R495j8720J43737
$$ -103083 -179556 -201116 -147122 -228114 -182221 36869 19033 -215692 -206197 -224917 -81180
16488h1180N1663j6340j9301J8969L6843K8962m3748M665m1245j16422J45424
$$ -81180 -29517 -45857 -65158 -46189 -9346 19616 -24132 -19467 -60712 -177134 -31710
16477c1710q7482j1065R4492J30351q0461j40068j17177Q098R036P5720J9260
$$ -31710 -119192 -130257 -35765 94586 14125 -125943 -243120 -235022 -225986 -150266 -131006
16466a31006m2939j0020j19075k18707k2956k2930M2377J95843J15951K5776J53624
$$ -131006 -173945 -183965 -303040 -521747 -544703 -567633 -525256 -329413 -213462 -187686 -34062
16455c4062Q6430j37994r1831p6051L9803L1476K7429l6403n1268J74636J36380
$$ -34062 52368 -85626 -177457 -253508 -213705 -182229 -154800 -191203 -242471 -67835 68545
16444F8545M0512j98968o9491J25937J15557l2635m4139q6230K8388o7024j09127
$$ 68545 109057 -89911 -159402 -33465 82092 49457 5318 -80912 -52524 -119548 -228675
16433b28675L8655J19915O0668r8146j01612j1447J75690J00500q2853m5937j7233
$$ -228675 -190020 -70105 -9437 -107583 -209195 -220642 -44952 55548 -27305 -73242 -90475
16422i0475o3592j25194M6106n1929l7842J00847J37242J81337Q0056j45470p600
$$ -90475 -154067 -279261 -233155 -285084 -322926 -222079 -84837 96500 176556 31086 23486
16411B3486o1137L7039J7100l0935o5553L8244K2530p785n3637M8416j0649l9121
$$ 23486 -37651 -612 16488 -14447 -80000 -41756 -19226 -27011 -80648 -32232 -42881 -82002
16399h2002j11630K5706n6935J5478M2631R4686o327l6058J3217l348Q2429P7691
$$ -82002 -193632 -167926 -224861 -209383 -166752 -72066 -78393 -114451 -101234 -104582 -22153 55538
16387E5538O2832n810p1372j0004L6838k1709j8989O8375j3973m287o4203m002
$$ 55538 118370 112560 41188 31184 68022 46313 27324 95699 81726 77439 13236 9234
16375I234J1475K7526L4892Q8762O1858m5542j0041k8707j70084k8190o859j9511
$$ 9234 20709 48235 83127 171889 233747 188205 178164 149457 -20627 -48817 -55676 -75187
16363g5187Q3393J06895J16133n8945l5729N945q639J27036o7481m4827N0675
$$ -75187 8206 115101 231234 172289 136560 142505 133866 260902 193421 148594 199269
16352A99269j66360Q7630M0153J24026L5221J7361J36975Q9900R8947N5428J1600
$$ 199269 32909 120539 160692 284718 319939 337300 474275 564175 663122 718550 730150
16341G30150K0940J49354Q0401q0103j18105j12294l3766j42888j31478k1092
$$ 730150 751090 900444 980845 900742 782637 670343 636577 493689 362211 341119
16331C41119j83869j17841j29726K4076Q8267R8112L3371j51438q693p4248k7412
$$ 341119 157250 39409 -90317 -66241 22026 120138 153509 2071 -6622 -80870 -108282
16320a08282Q2101r6641L7168K7249K3675Q7067Q5605m777q0727l0876M4904j10167
$$ -108282 -26181 -122822 -85654 -58405 -34730 52337 137942 133165 52438 21562 66466 -43701
16308d3701K3846O8460l6329l4307J6465p0568j07796p502P2910J4334K3114J6029
$$ -43701 -19855 48605 12276 -22031 -5566 -76134 -183930 -191432 -118522 -104188 -81074 -65045
16296f5045L1563M6547N1321J2713k0507p4163j2460J03871r2712k02868M9991
$$ -65045 -33482 13065 64386 77099 56592 -17571 -30031 73840 -18872 -221740 -171749
16285a71749J22550O8036o6962L2015J3800p894o7550J51565Q2603l8845L4163
$$ -171749 -49199 18837 -48125 -16110 -2310 -10204 -77754 73811 156414 117569 151732
16274A51732O2749o7534R527o9482r3595m6381J49233K4095j70056O8366P8286
$$ 151732 214481 146947 156474 86992 -6603 -52984 96249 120344 -49712 18654 96940
16263I6940j42670j9692L8213l3609r3714j2452P7795M7267j21101q423M3872
$$ 96940 -45730 -65422 -27209 -60818 -154532 -166984 -89189 -41922 -163023 -171446 -127574
16252a27574L6098L1301L407M7553P6219p439o5728n87r6362q8415l9347j3741
$$ -127574 -91476 -60175 -56768 -9215 67004 59565 -6163 -6750 -103112 -191527 -230874 -244615
16240b44615J8404l4239q298L0503J28203O9247o0883J9275j01616o8716q5576
$$ -244615 -226211 -260450 -268748 -238245 -110042 -40795 -101678 -82403 -184019 -252735 -338311
16229c38311J30234J48995m2667N8859J72730l6194l0250j40632o5923O2300J01836
$$ -338311 -208077 -59082 -101749 -42890 129840 93646 63396 -77236 -143159 -80859 20977
16218B0977p4218l0819p4942j17547J08665J6162O2002O6598j4385p9657p2008
$$ 20977 -53241 -84060 -159002 -276549 -167884 -151722 -89720 -23122 -37507 -117164 -189172
16207a89172R4031K86J7545p2100J6571P6697Q2286L5942n4575J6394n7227L8155
$$ -189172 -95141 -94855 -77310 -149410 -132839 -56142 26144 62086 7511 23905 -33322 4833
16195D833k7149Q78M8633K9604N1605j56464j24929K7380M4427M6729M862l5983
$$ 4833 -22316 -21438 27195 56799 108404 -48060 -172989 -145609 -101182 -54453 -49591 -85574
16183h5574j4535M6394Q890J16334M481k34365L1896J81544j6661o4970P9240
$$ -85574 -100109 -53715 -44825 71509 75990 -158375 -126479 55065 38404 -26566 52674
16172E2674N2069J00173n5147K9238q2352j06651n1576j4833l9911o5833n2599
$$ 52674 104743 204916 149769 179007 96655 -9996 -61572 -76405 -116316 -182149 -234748
16161b34748L7612R5829O310J4041o918j36027j59225N6309N4867j36198J01141
$$ -234748 -197136 -101307 -94997 -80956 -87874 -223901 -383126 -326817 -271950 -408148 -307007
16150c07007J81698n1251M9683Q7700J2697m6266Q2758k4925l324p8916J21795
$$ -307007 -125309 -176560 -126877 -39177 -26480 -72746 10012 -14913 -18237 -97153 24642
16139B4642J16966l7069k43003j03646J93949J8249n5993K2424M2543p2766j02915
$$ 24642 141608 104539 -138464 -242110 -48161 -29912 -85905 -63481 -20938 -93704 -196619
16128a96619j00954q170J84960J05892l7990n8074J37865J12350m2242m1074M5987
$$ -196619 -297573 -305743 -120783 -14891 -52881 -110955 26910 139260 97018 55944 101931
16117A01931m7995r8387j27768O9635J24060O1130m5818m5448N956p6659q1122
$$ 101931 53936 -44451 -172219 -102584 21476 82606 36788 -8660 -2704 -79363 -160485
16106a60485J6778O8373K5667O117J29868k5150p0761j05962O5945K21435l3854
$$ -160485 -143707 -75334 -49667 -43550 86318 61168 -9593 -115555 -49610 171825 137971
16095A37971O00L7888m7573p1394J6222M7591j62236p5191j01989P0752l5150
$$ 137971 138571 176459 128886 57492 73714 121305 -40931 -116122 -218111 -147359 -182509
16084a82509n5570J3498J7293k9769J53372P1829r913r0104q2233P5128m596L1017
$$ -182509 -238079 -224581 -207288 -237057 -83685 -11856 -21769 -111873 -194106 -118978 -123574 -92557
16072i2557o8495j26886L7443O5756L3736M532J07255N312m8320j59484j8825
$$ -92557 -161052 -287938 -250495 -184739 -151003 -146471 -39216 -33904 -82224 -241708 -260533
16061b60533J20174K35093M9563k143p1885p8979J6946m5745n6668O5551m0114
$$ -260533 -140359 94734 144297 142154 70269 -8710 8236 -37509 -94177 -28626 -68740
16050f8740P6906J6274K8778Q4098q5895j64831n6334j34619K6360J76862r6582
$$ -68740 8166 24440 53218 137316 51421 -113410 -169744 -304363 -278003 -101141 -197723
16039a97723k1865J6789m3540m6301m3955M8806k411J26466K7806o0593R3673
$$ -197723 -219588 -202799 -246339 -292640 -336595 -287789 -290200 -163734 -135928 -196521 -102848
16028a02848J17897n1250N7763L449j46853j31898P6045P8875p198N3474J30404
$$ -102848 15049 -36201 21562 25011 -121842 -253740 -177695 -98820 -106018 -52544 77860
16017G7860m3757o4292n7672o3776M2187l1732q9374P981J50040J78741K6774
$$ 77860 34103 -30189 -87861 -151637 -109450 -141182 -230556 -222575 -72535 106206 132980
16006A32980k1121j8605M5715J09973R334j20854j34689q3761m065l0971k8540
$$ 132980 111859 93254 138969 248942 258276 137422 2733 -81028 -85093 -116064 -144604
15995a44604j7962q9882m6749N4777M1630j8559k9652k8957M0303R1771J12214
$$ -144604 -162566 -252448 -299197 -244420 -202790 -221349 -251001 -279958 -239655 -147884 -35670
15984c5670J7472M8831j44273n8235L7644p9343j42391N3372M0839J79824Q9118
$$ -35670 -18198 30633 -113640 -171875 -134231 -213574 -355965 -302593 -261754 -81930 7188
15973G188o5838l1110l067J25990m8073q7904J27225o5107p2605p8567l9657m4138
$$ 7188 -58650 -89760 -92827 33163 -14910 -102814 24411 -40696 -113301 -191868 -231525 -275663
15961b75663J11055K4263o7363j5315j7613j8059J8601L9607n4725m8551J03428
$$ -275663 -164608 -140345 -207708 -223023 -240636 -258695 -240094 -200487 -255212 -303763 -200335
15950b00335R1998J38713j5089j91050j51602J9187R8882N7334J0940n6191r1060
$$ -200335 -108337 30376 15287 -175763 -327365 -308178 -209296 -151962 -141022 -197213 -288273
15939b88273N6396j0004M7686J17356l8339m9628j9401j28088J5832p4179N2533
$$ -288273 -231877 -241881 -194195 -76839 -115178 -164806 -184207 -312295 -296463 -370642 -318109
15928c18109J26491L0958r061N890m0828K616K3680J9008K8082q9519n9881L6562
$$ -318109 -191618 -160660 -169721 -163831 -204659 -202043 -178363 -159355 -131273 -220792 -280673 -244111
15916b44111J20295Q4223L4398q864P827j3609M0306n5384r7908L3269O6711O4602
$$ -244111 -123816 -39593 -5195 -14059 -6232 -19841 20465 -34919 -132827 -99558 -32847 31755
15904C1755j12037j47082P5151k6291J0719M4293J5192Q8276m12M2874M4583p9168
$$ 31755 -80282 -227364 -152213 -178504 -167785 -123492 -108300 -20024 -20436 22438 67021 -12147
15892a2147R5765L7841r3290n1789L7198p9984j93330l6057J28513R0741L4752
$$ -12147 83618 121459 28169 -23620 13578 -66406 -259736 -295793 -167280 -76539 -41787
15881d1787Q266j35843J3261K3994Q0924r0518q2077Q5152J3032q838J15483n6879
$$ -41787 -33521 -169364 -156103 -132109 -51185 -141703 -223780 -138628 -125596 -134434 -18951 -75830
15869g5830J6241r0777o5671J41652J21271Q023j65896j32827P3224N0468l3726
$$ -75830 -59589 -150366 -216037 -74385 46886 54909 -110987 -243814 -170590 -120122 -153848
15858a53848k4669q2637M6529J22040k2825j8453k7012K2355L8717l117N6853
$$ -153848 -178517 -261154 -214625 -92585 -115410 -133863 -160875 -138520 -99803 -102920 -46067
15847d6067J9177o8453k90n5835j32747J25476J42308p1096j1316M8230j64263
$$ -46067 -26890 -95343 -95633 -151468 -284215 -158739 -16431 -87527 -98843 -50613 -214876
15836b14876n6951n2411q2943M5113O0510K7575L55k375J72024P0909J8217m5919
$$ -214876 -271827 -324238 -407181 -362068 -301558 -273983 -273628 -276003 -103979 -33070 -14853 -60772
15824f0772n139q206p0541N4853K5447M9828n8335k57836j99622m197R0523J41377
$$ -60772 -65911 -74117 -144658 -89805 -64358 -14530 -72865 -330701 -530323 -534520 -443997 -302620
15812c02620J35646J6098p8667K7540Q6440Q4569M6716q2914M3619P6867N6258
$$ -302620 -166974 -150876 -229543 -202003 -115563 -30994 15722 -67192 -23573 53294 109552
15801A09552R8515R8538m6092j73649r3554j3250L4029N0461P700L8550Q8258
$$ 109552 208067 306605 260513 86864 -6690 -19940 14089 64550 72250 110800 199058
15790A99058q796p3448n9569n5892N1210L7941j3953n8202k09464j46612J68979
$$ 199058 190262 116814 57245 1353 52563 90504 76551 18349 -191115 -337727 -168748
15779a68748O0102l8999l8314N110q0231r744m8676J08244O1113L6025M9471l2661
$$ -168748 -108646 -147645 -185959 -180849 -261080 -270824 -319500 -211256 -150143 -114118 -64647 -97308
15767i7308r5620j03413R5593L5229j00964p867K15569J53690O189l4005P9618
$$ -97308 -192928 -296341 -200748 -165519 -266483 -274350 -58781 94909 101098 67093 146711
15756A46711l9837l6734j34731k05254O33M2173J5972P1437J18716J09374j08854
$$ 146711 106874 70140 -64591 -269845 -269212 -227039 -211067 -139630 -20914 88460 -20394
15745b0394k2981N6149L4900q8539l150o5387o1221N6455P721J32415L938l6366
$$ -20394 -43375 12774 47674 -40865 -44015 -109402 -170623 -114168 -106447 25968 29906 -6460
15733f460l7911J15159O8830r1488J1980j03865k14412P1228P8799J3002j1423
$$ -6460 -44371 70788 139618 48130 60110 -43755 -258167 -186939 -108140 -95138 -106561
15722a06561O1607J1170q7587p4211j24740L8464o695j5775q7794k7191J34147
$$ -106561 -44954 -33784 -121371 -195582 -320322 -281858 -288553 -304328 -392122 -419313 -285166
15711b85166J40772p0279l9538L4718K4989J20848N1743n2493j28241J3413M7148
$$ -285166 -144394 -214673 -254211 -219493 -194504 -73656 -21913 -74406 -202647 -189234 -142086
15700a42086M2974j35963p6723j70502M8032Q2606R8475M0626k2374P2916K20984
$$ -142086 -99112 -235075 -311798 -482300 -434268 -351662 -253187 -212561 -234935 -162019 58965
15689E8965m1765p0510l1195K6736L4742O4810J637o0630j0966N907J45885k8778
$$ 58965 17200 -53310 -84505 -57769 -23027 41783 43420 -17210 -28176 -22269 123616 94838
15677I4838P2381k8188p0946O5886L4287K8411Q5775J1111q4760m1033j27427
$$ 94838 167219 139031 68085 133971 168258 196669 282444 293555 208795 167762 40335
15666D0335j03493k20897l3381J31431J26015j6398J59876r471j80216m1993N998
$$ 40335 -63158 -284055 -317436 -186005 -59990 -76388 83488 74017 -106199 -148192 -142194
15655a42194l9689O6141k4504M8413O8848k4440n547o2168m4772j9990j8755J26895
$$ -142194 -181883 -115742 -140246 -91833 -22985 -47425 -52972 -115140 -159912 -179902 -198657 -71762
15643g1762N5899J5718k5032j54566P6124Q0980J8821J8923J2809l6460k8317
$$ -71762 -15863 -145 -25177 -179743 -103619 -22639 -3818 15105 27914 -8546 -36863
15632c6863p9784r4185J85033O0678j23681J24507K8159n9073j36144l8041L4602
$$ -36863 -116647 -210832 -25799 34879 -88802 35705 63864 4791 -131353 -169394 -134792
15621a34792J08125J75189n2909j94964J7870Q7342k7341n5335J12421m0974N6909
$$ -134792 -26667 148522 95613 -99351 -81481 5861 -21480 -76815 35606 -5368 51541
15610E1541L5005k357r8731k9033o7391J5257q4315L4063j59615J7918P6859p3327
$$ 51541 86546 84189 -14542 -43575 -110966 -95709 -180024 -145961 -305576 -287658 -210799 -284126
15598b84126J10128j8729p7453J7673J66023l3330k5171M0427Q6880o364p9249
$$ -284126 -173998 -192727 -270180 -252507 -86484 -119814 -144985 -104558 -17678 -24042 -103291
15587a03291k9153M8501j44269j04785M4077N2841N4667J41273n6144q8943l1825
$$ -103291 -132444 -83943 -228212 -332997 -288920 -236079 -181412 -40139 -96283 -185226 -217051
15576b17051p8646R0452p0161O365J33157k352R6239j16621p7651J29713O6948
$$ -217051 -295697 -205245 -275406 -269041 -135884 -138236 -41997 -158618 -236269 -106556 -39608
15565c9608j49948q8058Q496Q8207K9859P1929J20196l7403l1596j04117l1321
$$ -39608 -189556 -277614 -269118 -180911 -151052 -79123 41073 3670 -27926 -132043 -163364
15554a63364q4924J1161N9442q6546N459J17450k8413q2592K2157k0289J62471
$$ -163364 -248288 -237127 -177685 -264231 -258772 -141322 -169735 -252327 -230170 -250459 -87988
15543h7988K8541q1994R4683n660q5035N0479P9306r6290j33632K8870R7410j25646
$$ -87988 -59447 -141441 -46758 -52418 -137453 -86974 -7668 -103958 -237590 -208720 -111310 -236956
15531b36956j14446K08279J64815N4707R695q2075o3578k5530Q5829P6776l043
$$ -236956 -351402 -143123 21692 76399 86094 4019 -59559 -85089 740 77516 74473
15520G4473J4254o0440n1097O5407N4037l5614q6878k8938O4321o369j0591k7248
$$ 74473 88727 28287 -22810 42597 96634 61020 -25858 -54796 9525 3156 -7435 -34683
15508c4683j15258q5195j28929j42451L9367J42361P886J33395J85716j5464l0625
$$ -34683 -149941 -235136 -364065 -506516 -467149 -324788 -316902 -183507 2209 -13255 -43880
15497d3880M5854m3994l5885K6269N877o6291r3550p988R656M0376m097j05506
$$ -43880 1974 -42020 -77905 -51636 -45759 -112050 -205600 -213588 -203932 -163556 -167653 -273159
15485b73159k1069p6243N8975J57109J91687l8943L3038K6100J5458j23031j28311
$$ -273159 -294228 -370471 -311496 -154387 37300 -1643 31395 57495 72953 -50078 -178389
15474a78389J14775J71376m3894m0468L502J42884K9683j31945K4022j8634j52971
$$ -178389 -63614 107762 63868 23400 26902 169786 199469 67524 91546 72912 -80059
15463h0059p9247P0269j0219P0863P7502j5551p7054m6070p3541p7847q004l0914
$$ -80059 -159306 -89037 -99256 -28393 49109 33558 -43496 -89566 -163107 -240954 -248958 -279872
15451b79872J54275M5007l2068O0114L5788o5345o2375o3188K231J12093j08964
$$ -279872 -125597 -80590 -112658 -52544 -16756 -82101 -144476 -207664 -205433 -93340 -202304
15440b02304o1799P6065Q0630R2322N6691L3365m3059K2033p3197r5565N2336
$$ -202304 -264103 -188038 -107408 -15086 41605 74970 31911 53944 -19253 -114818 -62482
15429f2482J7798r525j05264N2985O5070m6017N8914P5904J2029r1293K9738m0450
$$ -62482 -44684 -54209 -159473 -106488 -41418 -87435 -28521 47383 59412 -31881 -2143 -42593
15417d2593p2208M6162M6347l9517j0840n0769p992L4955m5809n6202j882K8375
$$ -42593 -114801 -68639 -22292 -61809 -72649 -123418 -131410 -96455 -142264 -198466 -200348 -171973
15405a71973J54630j2501n1783n8574m3395O0142K5115n0711r0573l2618q7287
$$ -171973 -17343 -29844 -81627 -140201 -183596 -123454 -98339 -149050 -239623 -272241 -359528
15394c59528J07132J67989n0794k3104P5607K6355j89206j7164J30879Q8024j16027
$$ -359528 -252396 -84407 -135201 -158305 -82698 -56343 -245549 -262713 -131834 -43810 -159837
15383a59837o5041J74742J21801n5955j58094J8745M0127P4664n4204j1428k0153
$$ -159837 -224878 -50136 71665 15710 -142384 -123639 -83512 -8848 -63052 -74480 -94633
15372i4633N941q5004k6987J3997O7774P4505j0725l582N653K2519l3321k42418
$$ -94633 -88692 -173696 -200683 -186686 -118912 -44407 -55132 -58714 -53061 -30542 -63863 -306281
15360c06281m2586J90171L2843J09405Q315K0521Q9051J1210j09392J8018j8213
$$ -306281 -348867 -158696 -125853 -16448 -8133 12388 101439 112649 3257 21275 3062
15349C062O6661m1284m5474o1850K421l1446r4710J40686J28339j02524r4995
$$ 3062 69723 28439 -17035 -78885 -76464 -107910 -202620 -61934 66405 -36119 -131114
15338a31114K08212K5228p6870O5641Q5711j45004j95507p3430M185J57693p529
$$ -131114 77098 102326 25456 91097 176808 31804 -163703 -237133 -232948 -75255 -82784
15327h2784k5811M0494J8633K6890Q0651J0967j21771r473l6945N6902J09093
$$ -82784 -108595 -68101 -49468 -22578 58073 69040 -52731 -62204 -99149 -42247 66846
15316F6846o8786j69752O4521M9361p0280j48625P2886j1725n3952J28057K58896
$$ 66846 -1940 -171692 -107171 -57810 -128090 -276715 -203829 -215554 -269506 -141449 117447
15305A17447R3716k8041J7864l4499r2858k7847m111j48913q1464L7528Q0403
$$ 117447 211163 183122 200986 166487 73629 45782 41671 -107242 -188706 -151178 -70775
15294g0775k594m8085k9349J7389o8158j0370K021P8096K5157j36723m0937L1153
$$ -70775 -73369 -121454 -150803 -133414 -201572 -211942 -209921 -131825 -106668 -243391 -284328 -253175
15282b53175r4253O5660j2048J50621J06928j04999L4768N9258j63678j17335
$$ -253175 -347428 -281768 -293816 -143195 -36267 -141266 -106498 -47240 -210918 -328253
15272c28253l2625L1422P5003M4072L4968K53885P5402j54882L546P0789q8130
$$ -328253 -360878 -329456 -254453 -210381 -175413 78472 153874 -1008 2538 73327 -14803
15261a4803j08961M4013J1639j44857K5668P6419k0906j00100k457q1865J22236
$$ -14803 -123764 -79751 -68112 -212969 -187301 -110882 -131788 -231888 -234345 -316210 -193974
15250a93974J45648p7600Q10P8903p9566o4628p6790J0665l0562n3111R266J63155
$$ -193974 -48326 -125926 -125116 -46213 -125779 -190407 -267197 -256532 -287094 -340205 -330939 -167784
15238a67784K34365K721j8741k0038j43500j40143J1871K4539J32905j2838k2531
$$ -167784 66581 69302 50561 30523 -112977 -253120 -241249 -216710 -83805 -96643 -119174
15227a19174L8230J34029n9636n4014n7206O7811R552o8023o9616r332J29691
$$ -119174 -80944 53085 -6551 -60565 -117771 -49960 -40408 -108431 -178047 -187379 -57688
15216e7688O6799q1237J52146o6345o7042J21654o0613k08706j84137J56716J33630
$$ -57688 9111 -72126 80020 13675 -53367 68287 7674 -201032 -385169 -228453 -94823
15205i4823K25649M1703j8793m6722o0848K3098O1593o883j42718j11791k1965
$$ -94823 130826 172529 153736 107014 46166 69264 130857 123974 -18744 -130535 -152500
15194a52500O768M4538j9491m0475J04912l006j65173m4150O5403Q5160p0145
$$ -152500 -145732 -101194 -120685 -161160 -56248 -59254 -224427 -268577 -203174 -118014 -188159
15183a88159m7688J55525J12974Q8144j37646j26900q4600m242J39456J80034
$$ -188159 -235847 -80322 32652 120796 -16850 -143750 -228350 -232592 -93136 86898
15173H6898J68745J4676k31055j83584M200J0514K2023n044J0143k5209j35576
$$ 86898 255643 270319 39264 -144320 -140120 -129606 -107583 -112627 -102484 -127693 -263269
15162b63269L4249j078m3709P9786l5818k7986J6181L4234J92007J8346k17951
$$ -263269 -229020 -230098 -273807 -194021 -229839 -257825 -241644 -207410 -15403 2943 -215008
15151b15008j13604K20528K299k9544j8104N9699J21222M7898j43408n9049R364
$$ -215008 -328612 -108084 -105785 -135329 -153433 -93734 27488 75386 -68022 -127071 -117707
15140a17707p653k6095R834R6715l2466k4632p3047j96552j69391K19439K4776
$$ -117707 -125360 -151455 -141621 -44906 -77372 -102004 -175051 -371603 -540994 -321555 -296779
15129b96779p5429L8037l834P6751j122J97150P3542m7166k37587r831q141M3413
$$ -296779 -372208 -334171 -338005 -261254 -262376 -65226 8316 -38850 -276437 -286268 -294409 -250996
15117b50996J23683N9002M3805j482k0060q8798K0239L4703k1847q038o665M0090
$$ -250996 -127313 -68311 -24506 -25988 -46048 -134846 -114607 -79904 -101751 -109789 -116454 -76364
15105g6364m0610L9318m4097o5869L635o6145o1878N8130J21241L8416l7527k5308
$$ -76364 -116974 -77656 -121753 -187622 -183987 -250132 -312010 -253880 -132639 -94223 -131750 -157058
15093a57058O887J3925l181K8618j4324p9929k7529o4991k2594J17497M5700M0840
$$ -157058 -150171 -136246 -139427 -110809 -125133 -205062 -232591 -297582 -320176 -202679 -156979 -116139
15081a16139J50282O3566l6576r6647j22252j05452k1920L4121K59089J33187
$$ -116139 34143 97709 61133 -35514 -157766 -263218 -285138 -251017 8072 141259
15071A41259o4386r5793j06737p8976J51203m5774o6233m7827N0550R8735l7616
$$ 141259 76873 -18920 -125657 -204633 -53430 -99204 -165437 -213264 -162714 -63979 -101595
15060a01595Q2736n822r1227J1055m3546K1138O4756k2712n4534R3315m4867p1198
$$ -101595 -18859 -24681 -115908 -104853 -148399 -127261 -62505 -85217 -139751 -46436 -91303 -162501
15048a62501J4692J10344M5297m2301j68765R236L6432J4857m8442m5995J05263
$$ -162501 -147809 -37465 7832 -34469 -203234 -193998 -157566 -142709 -191151 -237146 -131883
15037a31883P8094J2790J23671j43662m2487R0467R5111K7453R4385M2585N4732
$$ -131883 -53789 -40999 82672 -60990 -103477 -13010 82101 109554 203939 246524 301256
15026C01256p6116Q939p3908L461o296j5046r1467j38322P8218P5430L6149j61055
$$ 301256 225140 234079 160171 163632 157336 142290 50823 -87499 -9281 66149 102298 -58757
15014e8757O8881P2143K729j0159k6442k3920J60310K58830J42844J59760J45521
$$ -58757 10124 82267 84996 74837 48395 24475 184785 443615 586459 746219 891740
15003H91740K27599J98733J65191K13557J91978K64143L74852K62232p76564r44758
$$ 891740 1119339 1318072 1483263 1696820 1888798 2152941 2527793 2790025 2013461 1068703
14993A068703o14915l01621m3386l9295J0568o9409j26378R7104M3382j24245
$$ 1068703 453788 152167 108781 69486 80054 10645 -115733 -18629 24753 -99492
14983i9492l4336n4242r9114Q5330J12884m8978j06345K7721n1450q026j2028
$$ -99492 -133828 -188070 -287184 -201854 -88970 -137948 -244293 -216572 -268022 -276048 -288076
14972b88076q166N4756N9131M2399l537J74034N1231j22121r2557K4950o7355
$$ -288076 -296242 -241486 -182355 -139956 -143493 30541 81772 -40349 -132906 -107956 -175311
14961a75311j54486n236n8034J03062J44646r6076q726L572J20155P8975K5970
$$ -175311 -329797 -335033 -393067 -290005 -145359 -241435 -250161 -246589 -126434 -47459 -21489
14950b1489j36732j22720j10082R6107J94797J16368J23199k8416j86700p5682
$$ -21489 -158221 -280941 -391023 -294916 -100119 16249 139448 111032 -75668 -151350
14940a51350J8173m2249L0307K1313r2271Q6470L8195o6735J9318M4535N2048
$$ -151350 -133177 -175426 -145119 -123806 -216077 -129607 -91412 -158147 -138829 -94294 -42246
14929d2246n6297p4315J9158O661N9514R2586p500J09320p3348o749J39936P3788
$$ -42246 -98543 -172858 -153700 -147039 -87525 5061 -2439 106881 33533 26784 166720 240508
14917B40508J59404l8626j32607j27560j28613j5631K983j85444r0996j7520Q1563
$$ 240508 399912 361286 228679 101119 -27494 -43125 -40142 -225586 -316582 -334102 -252539
14906b52539R289r3584L7344J38444P8004K8396Q2509O6502K4493k29122j54355
$$ -252539 -243250 -336834 -299490 -161046 -83042 -54646 27863 94365 118858 -110264 -264619
14895b64619l5842K4040L6170J61605M201j32696k8390O8295J1037p5906j8361
$$ -264619 -300461 -276421 -240251 -78646 -74445 -207141 -235531 -167236 -156199 -232105 -250466
14884b50466L5290n5966j0295M4612M1598N958K9046p4561J31827l1680O7311
$$ -250466 -215176 -271142 -281437 -236825 -195227 -189269 -160223 -234784 -102957 -134637 -67326
14873f7326m6658j34972j12002O567J14453J29560o0330j65790J33545K17888
$$ -67326 -113984 -248956 -360958 -354391 -239938 -110378 -170708 -336498 -202953 14935
14863A4935P9026k7767n2902n0849j00519J12015K4662O426p4299q9008M5755
$$ 14935 93961 66194 13292 -37557 -138076 -26061 -1399 5027 -69272 -158280 -112525
14852a12525J7405m0480J93571j4898k2018j16905j33683P871J15609Q8355R5706
$$ -112525 -95120 -135600 57971 43073 21055 -95850 -229533 -221662 -106053 -17698 78008
14841G8008r2310o9971k5528O0694k7212J0104R2272Q4808l664r6906p6572Q9658
$$ 78008 -14302 -84273 -109801 -49107 -76319 -66215 26057 110865 107201 10295 -66277 23381
14829B3381P4502r2462q613J26423m1582j00646q2309j30656q3545K66606J19356
$$ 23381 97883 5421 -3192 123231 81649 -18997 -101306 -231962 -315507 -48901 70455
14818G0455o335P4921N8655j08988j32485p9771R2179K3442j05337n9287J37649
$$ 70455 64120 139041 197696 88708 -43777 -123548 -31369 -7927 -113264 -172551 -34902
14807c4902r8946o0312R2596J12583O1993j1198j09574j61845Q399J19414K3161
$$ -34902 -133848 -194160 -101564 11019 73012 61814 -47760 -209605 -201206 -81792 -58631
14796e8631k5163m3800J39342j5125r1569j8562Q0149J83010J07471K85k8333
$$ -58631 -83794 -127594 11748 -3377 -94946 -113508 -33359 149651 257122 257407 229074
14785B29074k8356j23457j93519J04489P5639j64564j66460L5281K06838O8837
$$ 229074 200718 77261 -116258 -11769 63870 -100694 -267154 -231873 -25035 43802
14775D3802o729m540n1821j1275K5445K9147K8005p7421j11056M6649l337N0896
$$ 43802 37073 32533 -19288 -30563 -5118 24029 52034 -25387 -136443 -89794 -93131 -42235
14763d2235O2124K4038K8542j6776j2574K4321L0292q9505n2558P3191n6374J40380
$$ -42235 19889 43927 72469 55693 43119 67440 97732 8227 -44331 28860 -27514 112866
14751A12866M8519n8901j9787N2363R4014k096J4364J16397J30698Q3526J03348
$$ 112866 161385 102484 82697 135060 229074 226978 241342 357739 488437 571963 675311
14740F75311j530q2055j62676n2522m4283J07717J85466O9323j9368J41389J10163
$$ 675311 673781 591726 429050 376528 332245 439962 625428 694751 675383 816772 926935
14729I26935K4997J07586K16939J85541J95318K29577K52348L03890L45324J73896
$$ 926935 951932 1059518 1276457 1461998 1657316 1886893 2139241 2443131 2788455 2962351
14719B962351J45430J33808R0661n8094m00231l45010n45785n37922m98398k11878
$$ 2962351 3107781 3241589 3332250 3274156 2873925 2528915 1983130 1445208 946810 734932
14709G34932q4211j36440n1839J10194o401p1659k76157k11790O6608J3751p4308
$$ 734932 650721 514281 462442 572636 566235 494576 218419 6629 73237 86988 12680
14698A2680r1293k4132M2230N7236J7029m3618M622J4777o3730K2673J10778j3089
$$ 12680 -78613 -102745 -60515 -3279 13750 -29868 -25246 -10469 -74199 -51526 59252 46163
14686D6163q6754M0331J26020n8934p708K6014K3848j61983M412K18736J0820
$$ 46163 -40591 -260 125760 66826 59118 85132 108980 -53003 -48591 170145 180965
14675A80965j77312j94623P714N5114J7188K7920k920J33928R7300n4462J5656
$$ 180965 3653 -190970 -183256 -128142 -110954 -83034 -85954 47974 145274 90812 106468
14664A06468k7585r272M9787j00311j24334j7652L9076J971J3275K6161l9185
$$ 106468 78883 69611 119398 19087 -105247 -122899 -83823 -81852 -68577 -42416 -81601
14653h1601r9181r553J03420K1069R299J06908r012Q6935l6840k00138r7915J00202
$$ -81601 -180782 -190335 -86915 -65846 -56547 50361 41349 128284 91444 -108694 -206609 -106407
14641a06407K39212Q4723k26995k06911p6550J8338J239j1662l5893n1748K03190
$$ -106407 132805 217528 -9467 -216378 -292928 -274590 -273351 -285013 -320906 -372654 -169464
14630a69464O9020N4869j00577l5033q627O7907O5187P172m3939j19162l9949
$$ -169464 -100444 -45575 -146152 -181185 -189812 -121905 -56718 -49546 -93485 -212647 -252596
14619b52596N5150Q9429q270J5498P5813k7541o2719j9688M8969N1764o4784j088
$$ -252596 -197446 -108017 -116287 -100789 -24976 -52517 -115236 -134924 -85955 -34191 -98975 -100063
14607a00063J44642M7215n6677l7720k67770j23817J83727J38583l4508J89988
$$ -100063 44579 91794 35117 -2603 -270373 -394190 -210463 -71880 -106388 83600
14597H3600K5251p3671J3009n2369k17054j2326N7455N8729J47756j9756m0065
$$ 83600 108851 35180 48189 -4180 -221234 -233560 -176105 -117376 30380 10624 -29441
14586b9441N1950j32207j11710P3212O1522J99358l9813r2734M4119L445j16744
$$ -29441 22509 -109698 -221408 -148196 -86674 112684 72871 -19863 24256 27701 -89043
14575h9043l008P8533o7100J5603j8100j936Q7885l1366N169L502j31624J05682
$$ -89043 -92051 -13518 -80618 -65015 -83115 -85051 2834 -28532 -23363 -19861 -151485 -45803
14563d5803Q327l4918Q6000P5487K0039k46206l02199O4278J77357N8772m6514
$$ -45803 -37476 -72394 13606 89093 109132 -137074 -439273 -374995 -197638 -138866 -185380
14552a85380j30714l6990J35106L4109P546j50464k8541R3981J75918N6851R4731
$$ -185380 -316094 -353084 -217978 -183869 -176323 -326787 -355328 -261347 -85429 -28578 66153
14541F6153k2789q7989J172l6607J4633m0040j16843l0898m0379M8924M7662K6704
$$ 66153 43364 -44625 -43453 -80060 -65427 -105467 -222310 -253208 -293587 -244663 -197001 -170297
14529a70297j56314L3084J15048Q6596M8674n3876o6443M7940k646o5872j64523
$$ -170297 -326611 -293527 -178479 -91883 -43209 -97085 -163528 -115588 -118234 -184106 -348629
14518c48629j8991L7717N959J5678J37205L4111p5024o764K8893J43040Q6771
$$ -348629 -367620 -329903 -323944 -308266 -171061 -136950 -211974 -218738 -189845 -46805 39966
14507C9966N143o7736o5873n269J3831o2491K2833j1707J1764j10776q2623Q0433
$$ 39966 45109 -22627 -88500 -93769 -79938 -142429 -119596 -131303 -119539 -230315 -312938 -232505
14495b32505k5852j626J66021m6371l8074j003L0830n6312j37511N5588J00920
$$ -232505 -258357 -259983 -93962 -140333 -178407 -179410 -148580 -204892 -342403 -286815 -185895
14484a85895J9893N9353N9193J1717J0103K3039J9595q9608q3103j12951J8038
$$ -185895 -166002 -106649 -47456 -35739 -25636 -2597 16998 -72610 -155713 -268664 -250626
14473b50626R4301O1582M548N066L8956o8344j24745l1792M3761M0001r8015m6267
$$ -250626 -156325 -94743 -90195 -85129 -46173 -114517 -239262 -271054 -227293 -187292 -285307 -331574
14461c31574k5520P9688N7733r2806o5232N7421K56244K9206J9378j76928q2920
$$ -331574 -357094 -277406 -219673 -312479 -377711 -320290 -64046 -34840 -15462 -192390 -275310
14450b75310J37775P9632P4811N6588p9219J36494K365j17202n5791K0161P9732
$$ -275310 -137535 -57903 16908 73496 -5723 130771 133136 15934 -39857 -19696 60036
14439F0036L1584l381n9302p0073Q5484P2521N0450N0919L3189M2856R6229Q7266
$$ 60036 91620 88239 28937 -41136 44348 116869 167319 218238 251427 294283 390512 477778
14427D77778n0640j25433p9759r0393l969J27351J74065J44677R5418K95648K46325
$$ 477778 427138 301705 221946 131553 127584 254935 429000 573677 669095 964743 1211068
14416A211068K55294P6920L5712J59574R5546n6486j22751k08096k09922k35082
$$ 1211068 1466362 1543282 1578994 1738568 1834114 1777628 1654877 1446781 1236859 1001777
14406A001777j99897k66435k25575J4407j15566J00913O4230k11655r8491R4535
$$ 1001777 801880 535445 309870 324277 208711 309624 373854 162199 63708 158243
14396A58243J1169J60076j46795p4891k3492J3541j25047q179L9408Q5920q2775
$$ 158243 169412 329488 182693 107802 84310 97851 -27196 -35375 4033 89953 7178
14385G178o3437l1912O6634M0546L2047n5894j29866J39718J00457o6559R561
$$ 7178 -56259 -88171 -21537 19009 51056 -4838 -134704 5014 105471 38912 48473
14374D8473n7167J86K56925N3917J2403K082j5334J6144j32510o8496J4403O8663
$$ 48473 -8694 -8508 248417 302334 314737 316819 301485 317629 185119 116623 131026 199689
14362A99689J45827j26708n8020M7776L9715J72550M930j65229R5839L52924Q3006
$$ 199689 345516 218808 160788 208564 248279 420829 425759 260530 356369 709293 792299
14351G92299j31455n9887R4732j6088m121n8182n288K0192n658j48449q8698r4074
$$ 792299 660844 600957 695689 679601 675480 617298 612010 632202 626544 478095 389397 295323
14339B95323j24707p2771n4971o4749k5200L734J2221j8261n4954O3494j2191
$$ 295323 170616 97845 42874 -21875 -47075 -43341 -31120 -49381 -104335 -40841 -53032
14328e3032l974J1115Q2733l1717j20880J6992J3840L0138L9356q4090j39165
$$ -53032 -57006 -45891 36842 5125 -115755 -98763 -84923 -54785 -15429 -99519 -238684
14317b38684M961J50000N7048J2702k5730Q9816R5151M2988l3704n7113j54157
$$ -238684 -233723 -83723 -26675 -13973 -39703 50113 145264 188252 154548 97435 -56722
14306e6722J04419k9418j35128Q7739j2885j06903j54645Q613Q6850L5596Q6937
$$ -56722 47697 18279 -116849 -29110 -41995 -148898 -303543 -294930 -208080 -172484 -85547
14295h5547J01507R9714J6949j07945N1281m5885l0235P762K490J6053n4512m3564
$$ -85547 15960 115674 132623 24678 75959 30074 -161 7601 10091 26144 -28368 -71932
14283g1932Q0071m3446M1924j2118J5366L2803n029M6653P332Q4418K7359j38937
$$ -71932 8139 -35307 6617 -5501 9865 42668 37639 84292 91624 176042 203401 64464
14271F4464k90810P164P539j48310N7043J38177p3950K6007l2981K7618J52377
$$ 64464 -226346 -219182 -211643 -359953 -302910 -164733 -238683 -212676 -245657 -218039 -65662
14260f5662N6005m1578k209k1284J10877J72164J0817r0479j61783j31430L2061
$$ -65662 -9657 -51235 -53444 -74728 36149 208313 219130 128651 -33132 -164562 -132501
14249a32501J85261K2319j5995m5542K2016j00783l4951o1346k9544M2360l3744
$$ -132501 52760 75079 59084 13542 35558 -65225 -100176 -161522 -191066 -148706 -182450
14238a82450M5197K7580m7104L0393J23659J02444j81374j10557j3200J02447
$$ -182450 -137253 -109673 -156777 -126384 -2725 99719 -81655 -192212 -205412 -102965
14228a02965J61481J63417j5647p1012m8250K6083J06707q0560j01058J48975
$$ -102965 58516 221933 206286 135274 87024 113107 219814 139254 38196 187171
14218A87171N9807r5154K6887k9025p2199j33891J71179M0517j81952k00223r543
$$ 187171 246978 151824 178711 149686 77487 -56404 114775 155292 -26660 -226883 -236426
14207b36426k0875M5938p100R0249K0413J7955l5902m8452o3664j7129J3747P7436
$$ -236426 -257301 -211363 -218463 -128214 -107801 -89846 -125748 -174200 -237864 -254993 -241246 -163810
14195a63810Q9027L8713j28760R486L761o1714j8893J32210R1498L9984j52188
$$ -163810 -74783 -36070 -164830 -155344 -151583 -213297 -232190 -99980 -8482 31502 -120686
14184a20686q6048o7200J43321R6719J37394j34444p3220j4404K5996J44446k3578
$$ -120686 -206734 -273934 -130613 -33894 103500 -30944 -104164 -118568 -92572 51874 28296
14173B8296P0892L7264k7497l2930j1880r106p8655J13400P5424q3795O7522J01900
$$ 28296 99188 136452 108955 76025 64145 55039 -23616 89784 165208 81413 148935 250835
14161B50835P3370n4567O5135n636N2411M2081o2983r0069k452k0016m6885l2204
$$ 250835 324205 269638 334773 329137 381548 423629 360646 270577 268125 248109 201224 169020
14149A69020o4594j77713l7176J32199j22135n4794J10413K8220L771M3372O8589
$$ 169020 104426 -73287 -110463 21736 -100399 -155193 -44780 -16560 -12789 30583 99172
14138I9172o2531j45085j75806P305J35377N5578J2576j3494J35636N4657l4290
$$ 99172 36641 -108444 -284250 -276945 -141568 -85990 -73414 -86908 48728 103385 69095
14127F9095j17524n4735R8631l1313n7912J2079N3952Q471J52295J12189L299
$$ 69095 -48429 -103164 -4533 -35846 -93758 -81679 -27727 -19256 133039 245228 248527
14116B48527r2187J21019P1376J385j38441n7314P5502O8870o5749n873p4938
$$ 248527 156340 277359 348735 350120 211679 154365 229867 298737 232988 227115 152177
14105A52177l5063J87906J12604r7402q4275m0975m9479K7462L415j0573m0119
$$ 152177 117114 305020 417624 320222 235947 194972 145493 172955 176370 165797 125678
14094A25678K0716K1491j2940n8459K3500J01264j14358m6699J45325j00885r7108
$$ 125678 146394 167885 154945 96486 119986 221250 106892 60193 205518 104633 7525
14083G525k5476p0363N9262J5093K5067J03642l2170N2443k8552j14478n5701
$$ 7525 -17951 -88314 -29052 -13959 11108 114750 82580 135023 106471 -8007 -63708
14072f3708l2981J8750Q955l1020O3868L2715P7979J75572J56453P0713j82283
$$ -63708 -96689 -77939 -68984 -100004 -36136 -3421 74558 250130 406583 477296 295013
14061B95013n8703m1369M5454L36633J42779p7818r7913Q1987Q4367M1640n3000
$$ 295013 236310 194941 240395 577028 719807 641989 544076 626063 710430 752070 699070
14050F99070m1145j22206R3702J28952K01348J28908P8693J52725N7089p3546
$$ 699070 657925 535719 629421 758373 959721 1088629 1167322 1320047 1377136 1303590
14040A303590n1435P5229M6101K3892L8062j31301k5402J91725M03831L11805
$$ 1303590 1252155 1327384 1373485 1397377 1435439 1304138 1278736 1470461 1874292 2186097
14030B186097K05496L09708K62290K80876K54472K71904M75531L59685O9556j88075
$$ 2186097 2391593 2701301 2963591 3244467 3498939 3770843 4246374 4606059 4675615 4487540
14020D487540j95977j71094k15343l62951l57116j82943m2216J1940O7973K18743
$$ 4487540 4291563 4120469 3905126 3542175 3185059 3002116 2959900 2971840 3039813 3258556
14010C258556J62011K78815M47489L05950K67636M57355O58326O59705P75552
$$ 3258556 3420567 3699382 4146871 4452821 4720457 5177812 5836138 6495843 7271395
14001G271395J129231J304953J415467J595974J697260J793177J974822K222005
$$ 7271395 8400626 9705579 11121046 12717020 14414280 16207457 18182279 20404284
13993B0404284K338472K747393K920659L097524L123044K866881K630050K564983
$$ 20404284 22742756 25490149 28410808 31508332 34631376 37498257 40128307 42693290
13985D2693290K407779K141643K040671K384238K561689K942027L541741M292119
$$ 42693290 45101069 47242712 49283383 51667621 54229310 57171337 60713078 65005197
13977F5005197N059276O017105P602260R623402J2312989J5649373J9327171K3193022
$$ 65005197 70064473 76081578 83683838 93307240 105620229 121269602 140596773 163789795
13969A63789795K7212241L0416187L2800863L3520148L1547298K5477171J4573443
$$ 163789795 191002036 221418223 254219086 287739234 319286532 344763703 359337146
13962C59337146q615j5633044k9822874m0732666m6862952m6874382m1603483
$$ 359337146 359328531 343695487 313872613 273139947 226276995 179402613 137799130
13955A37799130l3168660k4588132j7295196j2271460q729218o409289m867281
$$ 137799130 104630470 80042338 62747142 50475682 41746464 35337175 30469894
13948C0469894l870503l122904k675409k300094j923191j686822j463863j221066
$$ 30469894 26599391 23476487 20801078 18500984 16577793 14890971 13427108 12206042
13940A2206042j083973r36589p43448o46477m91989m54694n05146l77399l29433
$$ 12206042 11122069 10185480 9442032 8795555 8303566 7848872 7343726 6966327 6636894
13931F636894m44447n08682l71022q6770q0202p4641k70926l19527j72947q6505
$$ 6636894 6192447 5683765 5312743 5225973 5145771 5071130 4800204 4480677 4307730 4221225
13921D221225j05703k06298k87114k90497j00998n3426k25646k06713j38278j30312
$$ 4221225 4115522 3909224 3622110 3331613 3230615 3177189 2951543 2744830 2606552 2476240
13911B476240R7833N4085J85n968l9450q3544n4497j25671j44194q2165L259Q9600
$$ 2476240 2574073 2628158 2628343 2622375 2582925 2499381 2444884 2319213 2175019 2092854 2096113 2185713
13899B185713K7224j97034j11463j45689j81270J43542K3226l9637j81114j3405
$$ 2185713 2212937 2015903 1904440 1758751 1577481 1721023 1744249 1704612 1523498 1510093
13889A510093n2375j25223J9981J0571o4129q0473J5268j9809L3982j9171j45958
$$ 1510093 1457718 1332495 1352476 1363047 1298918 1218445 1233713 1213904 1247886 1228715 1082757
13878A082757r7417j1024R7010J2850J2782j04147k7345N0444q8836J05432Q9186
$$ 1082757 985340 974316 1071326 1084176 1096958 992811 965466 1015910 927074 1032506 1121692
13867A121692J61681J46645o8359l12774m9907o3627Q0335k2582q2369o672r7440
$$ 1121692 1283373 1430018 1361659 1048885 998978 935351 1015686 993104 910735 904063 806623
13856H06623j7759L2123n7755j32812O7057K61446j0682m3204p7570r8093n7104
$$ 806623 788864 820987 763232 630420 697477 958923 948241 905037 827467 729374 672270
13845F72270R2836n344m6591M329M2603r4769R2522J36966q4762j34982k04008
$$ 672270 765106 759762 713171 717500 760103 665334 757856 894822 810060 675078 471070
13834D71070L0598J24594j44800m6190j7488K6279Q1513P8534J16361J83969p1382
$$ 471070 501668 626262 481462 435272 417784 444063 525576 604110 720471 904440 833058
13823H33058n1114j7727r8867P161M2530j62578j15203M5693J4970j14983j56857
$$ 833058 781944 764217 665350 672511 715041 552463 437260 482953 497923 382940 226083
13812B26083J0026O0820J3906j23393n4633Q9773J21232K3910q5950q587r378
$$ 226083 236109 296929 310835 187442 132809 222582 343814 367724 281774 273187 263809
13801B63809J60289j2399n2162n5118J61375P3771m2823k7201r8331O115P4412
$$ 263809 424098 411699 359537 304419 465794 539565 496742 469541 371210 377325 451737
13790D51737K6088p9695j15636J15333J52213K680j00515P9185q4422o1276n1568
$$ 451737 477825 398130 282494 397827 550040 552720 452205 531390 446968 385692 334124
13779C34124J9833l4721N6941n8107L3892k6328L6585j16490j16178O0821J04663
$$ 334124 353957 319236 376177 318070 351962 325634 362219 245729 129551 190372 295035
13768B95035n3665M5711M8039j308l2486j57150K1537Q7931n1827k1403J33495
$$ 295035 241370 287081 335120 333812 301326 144176 165713 253644 201817 180414 313909
13757C13909R6959R0118n4253p1500j0515k7569p541k02827J2788J71085O8037
$$ 313909 410868 500986 446733 375233 364718 337149 329608 126781 139569 310654 378691
13746C78691o8216o8254n6705n2809j11063Q9587K1277m5974O0694J28522J2279
$$ 378691 310475 242221 185516 132707 21644 111231 132508 86534 147228 275750 288029
13735B88029k5245n1583o386J02543N4456m0855l5800k6753j8615J00049J09356
$$ 288029 262784 211201 204815 307358 361814 320959 285159 258406 239791 339840 449196
13724D49196o7854l0215L5751j89316j61352J18731P0641j4611q3348J26546J12488
$$ 449196 381342 351127 386878 197562 36210 154941 225582 210971 127623 254169 366657
13713C66657m9973j43453n6253N7119O3180j13191q0809J66699J36222m7693o4254
$$ 366657 316684 173231 116978 174097 237277 124086 43277 209976 346198 298505 234251
13702B34251J7177M5490O4763p6598r8913Q8244n3678j37626J7971N0880l846
$$ 234251 251428 296918 361681 285083 186170 274414 220736 83110 101081 151961 148115
13691A48115l719O8379L226l6250N4465Q3820J492j15925j51223m9229O93j36729
$$ 148115 144396 212775 216001 179751 234216 318036 319528 203603 52380 3151 3844 -132885
13679a32885j7792J59126L6362J11700J66523l9242n9678K0210j14161K9198J20154
$$ -132885 -150677 8449 44811 156511 323034 283792 224114 244324 130163 159361 279515
13668B79515J9291j06658L4867J1249k8686O7657j36749p4867P3550Q7018R246
$$ 279515 298806 192148 227015 238264 209578 277235 140486 65619 139169 226187 235433
13657B35433M885N1962k37790m6062Q6464Q0080J3970j69055l9990P2377R6560
$$ 235433 240318 292280 54490 8428 94892 174972 188942 19887 -20103 52274 148834
13646A48834K2893l8353j330R1570J17464L0062j48618l19538j72217M1131J75224
$$ 148834 171727 133374 132044 223614 341078 371140 222522 -97016 -269233 -228102 -52878
13635e2878N3919l2267J29964J85174J3117j11021q6214j9385o4740p7825P3311
$$ -52878 1041 -31226 98738 283912 297029 186008 99794 80409 15669 -62156 11155
13624A1155L7843N6322k9759N0328k9359j72861m3803M6259Q8484k5228p5929
$$ 11155 48998 105320 75561 125889 96530 -76331 -120134 -73875 14609 -10619 -86548
13613h6548j9538K642Q6890J27419P2212J8611k7419n0362r9540N239N0651P7528
$$ -86548 -106086 -103444 -16554 110865 183077 201688 174269 123907 24367 29606 80257 157785
13601A57785o0404r0826k4178K03524M5428K4353R384r731o025K1266P5708o4346
$$ 157785 97381 6555 -17623 185901 231329 255682 265066 255335 249310 270576 346284 281938
13589B81938j7723j90036j24341P7223j7706J8044n5678j25836M1738P574J3146
$$ 281938 264215 74179 -50162 27061 9355 27399 -28279 -154115 -112377 -104803 -91657
13578i1657J21514M2384p7970q5021O5794J19232N7308k8419j6657P0957q8866
$$ -91657 29857 72241 -5729 -90750 -24956 94276 151584 123165 106508 177465 88599
13567H8599Q779Q5745j57632N8778N0699o3931K0039K0548j79525L3018O6528
$$ 88599 97378 183123 25491 84269 134968 71037 91076 111624 -67901 -34883 31645
13556C1645j76499J11832O1879k6280Q0851J06885o3992j6558J39130J19087l976
$$ 31645 -144854 -33022 28857 2577 83428 190313 126321 109763 248893 367980 364004
13545C64004m9288k6658n7502K213j1308o8236k2178K7024P4372m1143l629n6122
$$ 364004 314716 288058 230556 232769 221461 153225 131047 158071 232443 191300 187671 131549
13533A31549n5867L9593J18543J27436J08392j884m3225k2101J10243j75127j1823
$$ 131549 75682 115275 233818 361254 469646 467762 424537 402436 512679 337552 325729
13522C25729N4438J07763k3326L8176J24265j5984J2528J40710J51600J49035
$$ 325729 380167 487930 464604 502780 627045 611061 623589 764299 915899 1064934
13512A064934J47191P9793J89563R5173K20189K20128J45238J18648j18904k96835
$$ 1064934 1212125 1291918 1481481 1576654 1796843 2016971 2162209 2280857 2161953 1865118
13502A865118l25939l03177k63277l55168j40724J31185L2692j55658j19511k24118
$$ 1865118 1539179 1236002 972725 617557 476833 608018 640710 485052 365541 141423
13492A41423j8777L7769k3098p329L9319j4459l1139l7926K5493m7328O13K6941
$$ 141423 122646 160415 137317 129988 169307 154848 123709 85783 111276 63948 64561 91502
13480I1502r2834N1578R2528J17694p000p6193n7074k815R0730n0056j17022j63214
$$ 91502 -1332 50246 142774 260468 253468 177275 120201 117386 208116 158060 41038 -122176
13468a22176N0081J59776N7416n6451K2774j13495J2458J43109N7965K9288q5783
$$ -122176 -72095 87681 145097 88646 111420 -2075 10383 153492 211457 240745 154962
13457A54962q2064K7414J6407q810p1764M0538L0016J37903q1209k31710N5019
$$ 154962 72898 100312 116719 107909 36145 76683 106699 244602 163393 -68317 -13298
13446a3298O3563j64715j70601P7111J59083O9250L590J26466j27409J02094k8561
$$ -13298 50265 -114450 -285051 -207940 -48857 20393 23983 150449 23040 125134 96573
13435I6573o422R8181J34042J9779j0635j50606m0794J34742k0291l9170q8996
$$ 96573 90151 188332 322374 342153 331518 180912 140118 274860 254569 215399 126403
13424A26403j9573j2864Q3715K0878Q261K6078J24891l3931j21410j7999m5360
$$ 126403 106830 93966 177681 198559 206820 232898 357789 323858 202448 184449 139089
13413A39089O9667N4964J15964l4898j16058k0826j05666j45933j6097P6838j9047
$$ 139089 208756 263720 379684 344786 228728 207902 102236 -43697 -59794 17044 -2003
13402b003N6778J15704j5585j49278p9010Q4853N4681N6809k36936M4405K16645
$$ -2003 54775 170479 154894 5616 -73394 11459 66140 122949 -113987 -69582 147063
13391A47063l3002j28204K9197L9176k1761L83r148K8436R2914R2743j09677n7611
$$ 147063 114061 -14143 15054 54230 32469 32852 23704 52140 145054 237797 128120 70509
13379G0509k6755O4776N8355K0217l2625r9149n4867O310Q0763R6377p1051j04032
$$ 70509 43754 108530 166885 187102 154477 55328 461 6771 87534 183911 112860 8828
13367H828r5489m4144M978N983n3368L3864N753r7775n2648J83332J50616O1015
$$ 8828 -86661 -130805 -125827 -119844 -173212 -139348 -133595 -231370 -284018 -100686 49930 110945
13355A10945k6184p321L6939r7808R212K7398L1210p7066O9917n3655m870k1286
$$ 110945 84761 77440 114379 16571 25783 53181 84391 7325 77242 23587 18717 -2569
13343b569j0928K2785O4863q3803O8383J01777M3571O237j65831q7989J1116M274
$$ -2569 -13497 9288 74151 -9652 58731 160508 204079 210316 44485 -43504 -32388 -28114
13331b8114k2369L8213R402o9834j4358N9778j3392q7501m6896q081K0316Q7203
$$ -28114 -50483 -12270 -2868 -72702 -87060 -27282 -40674 -128175 -175071 -183152 -162836 -75633
13319g5633n445k8135K2837j2198j15315O8855J36362n9832k0213Q5476R3771
$$ -75633 -81078 -109213 -86376 -98574 -213889 -145034 -8672 -68504 -88717 -3241 90530
13308I0530J28306m7853j48175O38r9377L2307Q7725K0895j30037k8846o2699
$$ 90530 218836 170983 22808 23446 -75931 -43624 44101 64996 -65041 -93887 -156586
13297a56586R5408K6790l7187N6333k7192J2158l9354L1639M5732J43039K06o5319
$$ -156586 -61178 -34388 -71575 -15242 -42434 -30276 -69630 -37991 7741 150780 150986 85667
13285H5667r3055j02868n5991J84394O4309J33170j20489j15468J845j21743j9008
$$ 85667 -7388 -110256 -166247 18147 82456 215626 95137 -20331 -18486 -140229 -159237
13274a59237Q1955R8704J71544J5084L8698N6534j55436j20014q7761j3979O1095
$$ -159237 -77282 21422 192966 208050 246748 303282 147846 27832 -59929 -73908 -12813
13263a2813j2453j35686p8973O2703R0562J02648k3690P967K0192J5994m6769
$$ -12813 -25266 -160952 -239925 -177222 -86660 15988 -7702 265 20457 36451 -10318
13252a0318K2606j9980p8427L2843p161R9276j0256M6716R3924r8795j12776m224
$$ -10318 12288 -7692 -86119 -53276 -60437 38839 28583 75299 169223 70428 -42348 -46572
13240d6572j4269L2890o5114J8562N6358l293Q8332O3480p6797q5370J17233R0830
$$ -46572 -60841 -27951 -93065 -74503 -18145 -21438 66894 130374 53577 -31793 85440 176270
13228A76270o9797j9072o5734n023O2796j35852K7080J89116L0012M6426j47443
$$ 176270 106473 87401 21667 16644 79440 -56412 -29332 159784 189796 236222 88779
13217H8779l4696M1131r938k9351n1880J00597J9237n6828m5977Q9362M3101o9277
$$ 88779 54083 95214 85276 55925 4045 104642 123879 67051 21074 110436 153537 84260
13205H4260j52265j520Q2424O1929n0832M9777J45748Q4735k8611j12287j38396
$$ 84260 -68005 -69525 12899 74828 23996 73773 219521 304256 275645 163358 24962
13194B4962o7952J0764Q2823R0797M3946m1735J0843j00894L6690j9427L4578
$$ 24962 -42990 -32226 50597 141394 185340 143605 154448 53554 90244 70817 105395
13183A05395J6873R0331L4695l8857j57492j36369N9403j1152L3892R8590P6254
$$ 105395 122268 212599 247294 208437 50945 -85424 -26021 -37173 -3281 95309 171563
13172A71563J8001N0604K498r5639L9098j02073q0073R9254l0444m1474Q2473
$$ 171563 189564 240168 242666 147027 186125 84052 3979 103233 72789 31315 113788
13161A13788O271K9055o1142k461J3652M9220K8862j66466J3184J30904j41005
$$ 113788 120059 149114 87972 85511 99163 148383 177245 10779 23963 154867 13862
13150A3862M5590J53923M7267m6764r969P4693O8398O9265o9267n0528J78544
$$ 13862 59452 213375 260642 213878 203909 278602 347000 416265 346998 296470 475014
13139D75014J90789O0235J125p2311k8788N7192j75878j07832o6407p8725K0031
$$ 475014 665803 726038 727163 654852 626064 683256 507378 399546 333139 254414 274445
13128B74445j7309n4799j19870j9877L1834P291m7047r2246J05180R7725P1517
$$ 274445 257136 202337 82467 62590 94424 101715 54668 -37578 67602 165327 236844
13117B36844r5141j8245q733O3309J5389r940j09476J1275k978p0075P5672J00631
$$ 236844 141703 123458 114725 178034 193423 183483 74007 85282 82304 12229 87901 188532
13105A88532J38898L9689r3105N7848Q3270m9500j36701Q2941j29505m2177P1514
$$ 188532 327430 367119 274014 331862 415132 365632 228931 311872 182367 140190 211704
13094B11704p2389K7444R1276M9440j0901J6553j42181J31265K08030n4973j33807
$$ 211704 139315 166759 258035 307475 296574 313127 170946 302211 510241 455268 321461
13083C21461j21187p7958N5990O0154J15096p1884j04048q8505k2980n2649J4795
$$ 321461 200274 122316 178306 238460 353556 281672 177624 89119 66139 13490 28285
13072B8285R1989m9732m4486J4566R4070L7342j1473r150n9804l663M2704j52344
$$ 28285 120274 70542 26056 40622 134692 172034 160561 151411 91607 87944 130648 -21696
13060b1696J36386R2820Q9841Q599j17892j94346j38668L9506j9309n34M7389
$$ -21696 114690 207510 297351 305950 188058 -6288 -144956 -105450 -124759 -125293 -77904
13049g7904p898K2552k6678j0791p4006j02341K5324K1426R1103J13317O2956
$$ -77904 -85802 -63250 -89928 -100719 -174725 -277066 -251742 -230316 -139213 -25896 37060
13038C7060J6656j06608j03014J04278K909J16336Q5833n8788j0558Q406j0478
$$ 37060 53716 -52892 -155906 -51628 -48719 67617 153450 94662 84104 92510 82032
13027H2032r0711J4843l293J23427n8568m1040R748P4319Q5932N242r4067O3751
$$ 82032 -8679 6164 2871 126298 67730 26690 36438 110757 196689 201931 107864 171615
13015A71615m6563j28360n3834O8302R6786J39308j7672j9330m6878m8831K18559
$$ 171615 125052 -3308 -57142 11160 107946 247254 229582 210252 163374 114543 333102
13004C33102L6832q6280q9121j1033k72251J8661O9363j8251j9557o4764J18347
$$ 333102 369934 283654 194533 183500 -88751 -70090 -727 -18978 -38535 -103299 15048
12993A5048J70161n9321q3228j86123Q2247Q9422l8627J20355P6499O9775R1571
$$ 15048 185209 125888 42660 -143463 -61216 28206 -10421 109934 186433 256208 347779
12982C47779o2952O343P2235o8563j62821j26900M3507J06627J2949l2050j29777
$$ 347779 284827 291170 363405 294842 132021 5121 48628 155255 168204 136154 6377
12971F377N8359J03811P9772m6190j95524j44376j4844Q6737Q7559P4494j0958
$$ 6377 64736 168547 248319 202129 6605 -137771 -152615 -65878 21681 96175 85217
12960H5217J76103R3294Q8058j7727j66727p6807q6509M1662O8469j706j8002
$$ 85217 261320 354614 442672 424945 258218 181411 94902 136564 205033 203327 185325
12949A85325J8065r221R1395Q3391q2071M2210K1385L4972j13754m7944N2591
$$ 185325 203390 194169 285564 368955 286884 329094 350479 385451 271697 223753 276344
12938B76344O8982Q8796l1659j40941n0821J2805K02523m1493n9672n569L2675
$$ 276344 345326 434122 402463 261522 210701 223506 426029 384536 324864 319295 351970
12927C51970J20640M604j87517j21979j49874p509J07711M4306N568j11848J23342
$$ 351970 472610 477214 289697 167718 17844 10335 118046 162352 167920 56072 179414
12916A79414J39222p2968m0577J02277Q5815k3048o4309j34257q924Q8452k7940
$$ 179414 318636 245668 205091 307368 393183 370135 305826 171569 162645 251097 223157
12905B23157q4931J87235q9031q0588o3451P8289M4363o8894j6249K8109m4639
$$ 223157 138226 325461 236430 155842 92391 170680 215043 146149 129900 158009 113370
12894A13370j1741Q422L7846q9687l4130N5960l1214K7539m8256p4352J53295
$$ 113370 101629 110051 147897 58210 24080 80040 48826 76365 28109 -46243 107052
12883A07052P4895J45002P7960n2692j27553O5953J52320M6105j34135j46706
$$ 107052 181947 326949 404909 352217 224664 290617 442937 489042 354907 208201
12873B08201N2077p227j4151J4566j27841r102N8172R527l6937k4632L6926J2280
$$ 208201 260278 253051 238900 253466 125625 116523 174695 184222 147285 122653 159579 171859
12861A71859O2609L8972J2012p7869j84719j03121J31450O7545R965Q6284J66878
$$ 171859 234468 273440 285452 207583 22864 -80257 51193 118738 128703 214987 381865
12850C81865L003l3064p2170L5006m6197j24775Q6094J00015k5425m4672N1736
$$ 381865 384868 351804 279634 314640 268443 143668 229762 329777 304352 259680 311416
12839C11416j54136j05362j58697N164O0722j9914N3295J44607L6959J37869K2472
$$ 311416 157280 51918 -106779 -101615 -40893 -60807 -7512 137095 174054 311923 334395
12828C34395n0284M6151j17684j6501O877m9973j3753J45619J3020p258j3173
$$ 334395 284111 330262 212578 196077 202954 152981 139228 284847 297867 290609 277436
12817B77436m144n7719q5355q2889Q4627J83457J13411l6946j78349j68081J22219
$$ 277436 273292 215573 130218 47329 131956 315413 428824 391878 213529 45448 167667
12806A67667J69650K3922l7059q8305n9891l6907p6191K6891J14349J02882l5686
$$ 167667 337317 361239 324180 235875 175984 139077 62886 89777 204126 307008 271322
12795B71322j83891n8648J39525J06161q126o4678J38155J78656m1233n933O894
$$ 271322 87431 28783 168308 274469 266343 201665 339820 518476 477243 471310 478204
12784D78204K7992N5117q7373n4508N8645j9055j47115j15893J10961J34289J37914
$$ 478204 506196 561313 473940 419432 478077 459022 311907 196014 306975 441264 579178
12773E79178l666k5511q7712q5036k1951j00237m8895k328J34038J28822m1347
$$ 579178 575512 550001 462289 377253 355302 255065 206170 203842 337880 466702 425355
12762D25355j78581j21520O0258K3922O9814l2050o2524J61590R7021L596n7616
$$ 425355 246774 125254 185512 209434 279248 247198 184674 346264 443285 446881 389265
12751C89265j14575j617J27814O6798M5414J34335j08718j80185j17211n7877
$$ 389265 274690 273073 400887 467685 513099 647434 538716 358531 241320 183443
12741A83443P2073J34391J6794n5609j4643P749r7311K0386j32891J31134K26573
$$ 183443 255516 389907 406701 351092 336449 344198 246887 267273 134382 265516 492089
12730D92089L5401j04293k9228l7597M5721K5802j337l4497m2987o2459o3070
$$ 492089 527490 423197 393969 356372 402093 427895 426558 392061 349074 286615 223545
12719B23545Q9377n3464J99421K9629J70709O614k7599P002o8685n319n9974l45
$$ 223545 312922 259458 458879 488508 659217 665831 638232 645234 576549 571230 511256 510911
12707E10911j31504j04203K910p9292p877J92869L8884j8922o4087J21776j47815
$$ 510911 379407 275204 278114 198822 190945 383814 422698 403776 339689 461465 313650
12696C13650q8457j39822p2454R9806Q7705P2098j506J21186J22704j24048m9447
$$ 313650 225193 85371 12917 112723 200428 272526 271020 392206 514910 390862 341415
12685C41415J518Q6425r2827J00234Q6875n4896j7146n708j35249j27191P2283
$$ 341415 342933 429358 336531 436765 523640 468744 451598 445890 310641 183450 255733
12674B55733O1115M4907R9655P3953q8329O265M6662R3359N9410Q0354p6080k8593
$$ 255733 316848 361755 461410 535363 447034 453299 499961 593320 652730 733084 657004 628411
12662F28411j33486K4424O129Q6975Q4819r6291n4338p7726q5913q7116m7656
$$ 628411 494925 519349 525478 612453 697272 600981 546643 468917 383004 295888 248232
12651B48232O8235J82138L3474k8608r6806q6410Q5825m4363j6563K05524M7317
$$ 248232 316467 498605 532079 503471 406665 320255 406080 361717 345154 550678 597995
12640E97995o7621j51812j40280n2849J66900J11811M1355k0452m9595N236M2796
$$ 597995 530374 378562 238282 185433 352333 464144 505499 485047 435452 440688 483484
12629D83484q0375j24635o3220N4840J31902K3939p714R3611m028J64650Q698
$$ 483484 403109 278474 215254 270094 401996 425935 418221 511832 507804 672454 681152
12618F81152j24084J070j1977P3520K5575j42682p3304n263Q7111L7039R485K7865
$$ 681152 557068 558138 546161 619681 645256 502574 429270 424007 511118 548157 557642 585507
12606E85507j41733j13174N9000J4746M8164m6928M2477Q4048N9054q0349j48496
$$ 585507 443774 330600 389600 404346 452510 405582 448059 532107 591161 510812 362316
12595C62316O5990o4090j3069O7672J47660L1877Q6880N8146m8025r7253o4200
$$ 362316 428306 364216 351147 418819 566479 598356 685236 743382 695357 598104 533904
12584E33904r4688r4670P0047M0519k3468R7864Q0373o740q7485P0204J1793L2199
$$ 533904 439216 344546 414593 455112 431644 529508 609881 603141 515656 585860 597653 629852
12572F29852l75Q481J52717J78571j41066j37272N1460o7268j44006M8673J46879
$$ 629852 629477 637958 790675 969246 828180 690908 742368 675100 531094 579767 726646
12561G26646Q5056j1765k0394J3209o1577o081P5170n4202j16675p959J05046
$$ 726646 811702 799937 779543 792752 731175 725094 800264 746062 629387 621428 726474
12550G26474k640j41804n0327l0736m2525J29995K4990r746l1739J21060N6089
$$ 726474 723834 582030 531703 500967 458442 588437 613427 603681 571942 693002 749091
12539G49091K4883r1248p9224J36647N2767K7383l7209J3029m3548L6574J29642
$$ 749091 773974 682726 603502 740149 792916 820299 783090 796119 752571 789145 918787
12528I18787j849j06519j8185K308j29451K2815J18863r4507l1561L5540N9658
$$ 918787 916938 810419 792234 794542 665091 687906 806769 712262 680701 716241 775899
12517G75899N3160J21011J65884o1816k10184j03004R7483P0429r1264m6859M3788
$$ 775899 829059 950070 1115954 1054138 843954 740950 838433 908862 817598 770739 814527
12506H14527P7476L7184n586o9758o2243q5281J44337J13685L5517j43288l3590
$$ 814527 892003 929187 923601 853843 791600 706319 850656 964341 999858 856570 822980
12495H22980n867J08165J42840l698k0130O2973M847j22764j05318j3914p1416
$$ 822980 817113 925278 1068118 1064420 1044290 1107263 1112110 989346 884028 870114 798698
12484G98698j34498J20125J77971k7122l2477K148m7090j7839p4053N7870P0958
$$ 798698 664200 784325 962296 935174 902697 904845 857755 839916 765863 823733 894691
12473H94691P8575R9317J20212N451J2017n1745j32124j62548N3627J12393J30226
$$ 894691 973266 1072583 1192795 1198246 1210263 1158518 1026394 863846 917473 1029866 1160092
12462A160092O8425n7081j68809l5939J46842r8285q9323l1544o5813J26008K7331
$$ 1160092 1228517 1171436 1002627 966688 1113530 1015245 925922 894378 828565 954573 981904
12451I81904k9375r4366n7182J25544J23857J20520l6749O2143J4735m7654j83101
$$ 981904 952529 858163 800981 926525 1050382 1170902 1134153 1196296 1211031 1163377 980276
12440I80276j49759O5719k8449J02168P256R4942J58395m3107j17110Q3632R2259
$$ 980276 830517 896236 867787 969955 977211 1072153 1230548 1187441 1070331 1153963 1246222
12429A246222J9791J14675l4188j16601p4277j10113o0307Q5219Q4817J38106
$$ 1246222 1266013 1380688 1346500 1229899 1155622 1045509 985202 1070421 1155238 1293344
12419A293344k528m4655O5973O7807m9063O0074O4561J0000m7040o0374L8953
$$ 1293344 1290816 1246161 1312134 1379941 1330878 1390952 1455513 1465513 1418473 1358099 1397052
12408A397052R0709o4919j04990j3876n1332M5876K2693l1666J65265O3713k8695
$$ 1397052 1487761 1422842 1317852 1303976 1252644 1298520 1321213 1289547 1454812 1518525 1489830
12397A489830n9589q1949j30691J20499R2817j4275q735l7771O3319k44J8277
$$ 1489830 1430241 1348292 1217601 1338100 1430917 1416642 1407907 1370136 1433455 1433211 1451488
12386A451488n7336O0896P3156r1550j07568L7315L2689J28767N4436L5412R2219
$$ 1451488 1394152 1455048 1528204 1436654 1329086 1366401 1399090 1527857 1582293 1617705 1709924
12375A709924r2253q9163J6950M0734J43087J288o9419p36o5771m4124Q5404L1999
$$ 1709924 1617671 1528508 1545458 1586192 1729279 1730567 1661148 1660412 1594641 1550517 1635921 1667920
12363A667920L1529L4126J40120o0940j7902p8141j35741k5414J03053O7001J31534
$$ 1667920 1699449 1733575 1873695 1812755 1794853 1716712 1580971 1555557 1658610 1725611 1857145
12352A857145k0117j2128j35821r263P4177M9200p5901P4283j1395r4773L4308
$$ 1857145 1837028 1824900 1689079 1679816 1753993 1803193 1727292 1801575 1790180 1695407 1729715
12341A729715K2855M0505M915O0348j7017j7717R5544R1955m0785r397L6715J83354
$$ 1729715 1752570 1793075 1797990 1858338 1841321 1823604 1919148 2011103 1970318 1960921 1997636 2180990
12329B180990Q2135j7326j27288j32229j60011o8813J40723N9582J27196j04895
$$ 2180990 2263125 2245799 2118511 1986282 1826271 1757458 1898181 1957763 2084959 1980064
12319A980064n3034P7875P3823O076o0931J96684P6392J43504R0474o4461j1536
$$ 1980064 1927030 2004905 2078728 2084804 2023873 2220557 2296949 2440453 2530927 2466466 2454930
12308B454930J59114R7259J3744Q7982J94998L0462j25448o7539L0816m5528K3222
$$ 2454930 2614044 2711303 2725047 2813029 3008027 3038489 2913041 2845502 2876318 2830790 2854012
12297B854012j26823J4403N323M293J28822r79j09337j5472M3559J9261L507J9307
$$ 2854012 2727189 2741592 2746915 2751208 2880030 2879051 2769714 2754242 2797801 2817062 2820569 2839876
12285B839876l8675k9558P9303J70249Q6412q5178j8032m2473K1466l1075M3494
$$ 2839876 2801201 2771643 2850946 3021195 3107607 3022429 3004397 2961924 2983390 2952315 2995809
12274B995809M1952L7999J16455N3308J6929O5847J38575L5041J08341J68957
$$ 2995809 3037761 3075760 3192215 3245523 3262452 3328299 3466874 3501915 3610256 3779213
12264C779213K85592J68259J21099l7698q7320j06963j38212r8278q9283m3423
$$ 3779213 4064805 4233064 4354163 4316465 4229145 4122182 3983970 3885692 3796409 3752986
12254C752986n2876K2131q0115o1940Q6807l0696j41080J8265P1101k894j19911
$$ 3752986 3700110 3722241 3642126 3580186 3666993 3636297 3495217 3513482 3584583 3581689 3461778
12243C461778m4509P1932L2947m4984J5324P3185r6368L2464P7684M8974r006
$$ 3461778 3417269 3489201 3522148 3477164 3492488 3565673 3469305 3501769 3579453 3628427 3619421
12232C619421K8965m0784m13q263J36385J68564j76954q5442M3310L2275J31692
$$ 3619421 3648386 3607602 3607189 3598926 3735311 3903875 3726921 3641479 3684789 3717064 3848756
12221C848756j6177j5138p5626L5276J0091R228K4500q001j1541n1159k218m0780
$$ 3848756 3832579 3817441 3741815 3777091 3787182 3796410 3820910 3812909 3801368 3750209 3747991 3707211
12209C707211j18708J3977P69k1245O6904j9723p5626q0273l5758J83459J69537
$$ 3707211 3588503 3602480 3603249 3582004 3648908 3629185 3553559 3473286 3437528 3620987 3790524
12198C790524Q6480j19990j03711J18058M4322L986P5631r6293O8490J70791l4336
$$ 3790524 3877004 3757014 3653303 3771361 3815683 3819669 3895300 3799007 3867497 4038288 4003952
12187D003952L0316j754M599k9716k4599L9511K4646J19839l5304J8654q5435
$$ 4003952 4034268 4032514 4037113 4007397 3982798 4022309 4046955 4166794 4131490 4150144 4064709
12176D064709k5086P0489l1038j37759k41181N340J51740Q3211q5946Q9015K59256
$$ 4064709 4039623 4110112 4079074 3941315 3700134 3705474 3857214 3940425 3854479 3943494 4202750
12165D202750j8406N954K1281Q7466M1332l5097o9463K5705O8111N8542J56745
$$ 4202750 4184344 4190298 4211579 4299045 4340377 4305280 4235817 4261522 4329633 4388175 4544920
12154D544920J78477P918p9371o1227l1628O1196J16971n738m9197r0970M457
$$ 4544920 4723397 4731315 4651944 4590717 4559089 4620285 4737256 4731518 4682321 4591351 4595808
12143D595808q5993l0406J42048M4169N7251R9262N9362j70290j10278k5335k5937
$$ 4595808 4509815 4479409 4621457 4665626 4722877 4822139 4881501 4711211 4600933 4575598 4549661
12132D549661O0627J09993J03634N7517m3269j02016m6026O9769J14033L2218
$$ 4549661 4610288 4720281 4823915 4881432 4838163 4736147 4690121 4759890 4873923 4906141
12122D906141L4837O5602J06119j9411J10455N5892J28104l6704n6219M5969j10687
$$ 4906141 4940978 5006580 5112699 5093288 5203743 5259635 5387739 5351035 5294816 5340785 5230098
12111E230098j8323j4089l9200O6756l7639J02105J72032N764K9813j03511m4745
$$ 5230098 5211775 5197686 5158486 5225242 5187603 5289708 5461740 5467504 5497317 5393806 5349061
12100E349061O5498J5089m599O3793O9244j7757L0438J56311m0546j86291Q676
$$ 5349061 5414559 5429648 5425049 5488842 5558086 5540329 5570767 5727078 5686532 5500241 5508917
12089E508917Q8451O3142k9523m7625J42432P3860L276K3259l9904N4347L9663
$$ 5508917 5597368 5660510 5630987 5583362 5725794 5799654 5802930 5826189 5786285 5840632 5880295
12078E880295P9496P4726L8144o1172K2820L6687l0606M5834K2758j8939M4325
$$ 5880295 5959791 6034517 6072661 6011489 6034309 6070996 6040390 6086224 6108982 6090043 6134368
12067F134368k50175k11069l9423m3569n5303m3528O3499N6471P861N3818N0208
$$ 6134368 5884193 5673124 5633701 5590132 5534829 5491301 5554800 5611271 5619132 5672950 5723158
12056E723158l4198q4349o2173m0257j40322p0925j885M280p5720P148j3233K2970
$$ 5723158 5688960 5604611 5542438 5502181 5361859 5290934 5289049 5293329 5217609 5224757 5211524 5234494
12044E234494k6762j32158p2599J94081J96718J94857n0679o5126J61753L2778
$$ 5234494 5207732 5075574 5002975 5197056 5393774 5588631 5537952 5472826 5634579 5667357
12034E667357j23039k53807n0014m6017k5430l119j05911o2821k1532Q6268j5063
$$ 5667357 5544318 5290511 5240497 5194480 5169050 5165931 5060020 4997199 4975667 5061935 5046872
12023E046872j1360N5621j3581m9427j56184K0418J18968J9326p2890K7357m6991
$$ 5046872 5035512 5091133 5077552 5028125 4871941 4892359 5011327 5030653 4957763 4985120 4938129
12012D938129k107j3878n3947j65838Q4586J14350j22494j99405r695O4688l3595
$$ 4938129 4936022 4922144 4868197 4702359 4786945 4901295 4778801 4579396 4569701 4634389 4600794
12001D600794J01119N0073n156q83R7646L8072M7567l0215O0891m1204K7356K4603
$$ 4600794 4701913 4751986 4746830 4745947 4843593 4881665 4929232 4899017 4959908 4918704 4946060 4970663
11989D970663m9474n1769l1618m591J7779K2888l1794j13045j0925j1411K5985
$$ 4970663 4921189 4869420 4837802 4833211 4850990 4873878 4842084 4729039 4718114 4706703 4732688
11978D732688l8222q6843J54990J03986L3912J83332N7991j91919p4751n3456
$$ 4732688 4694466 4607623 4762613 4866599 4900511 5083843 5141834 4949915 4875164 4821708
11968D821708N5119J3178j6807K0756o0071O3599j14852N4663K33446J09220J42459
$$ 4821708 4876827 4890005 4873198 4893954 4833883 4897482 4782630 4837293 5070739 5179959 5322418
11957E322418Q9346q1256k03738j43752j10552r3026Q1020J48732J60700Q347
$$ 5322418 5411764 5330508 5126770 4983018 4872466 4779440 4860460 5009192 5169892 5178239
11947E178239j4837K57766L06287J44713J39221R1471J36494L2220k3323q4394
$$ 5178239 5163402 5421168 5727455 5872168 6011389 6102860 6239354 6271574 6248251 6163857
11937F163857l0372o9231P9394j21200r4064p1103r0J12187J51702J5228m4848
$$ 6163857 6133485 6064254 6143648 6022448 5928384 5857281 5857191 5969378 6121080 6136308 6091460
11926F091460J2495M3362J15505J98152J84816O9025o2718J3615L1455m411n2092
$$ 6091460 6103955 6147317 6262822 6460974 6645790 6714815 6652097 6665712 6697167 6692756 6640664
11915F640664j3432J45295N5608J02395K42633K21877K36228L00582L03799K36592
$$ 6640664 6627232 6772527 6828135 6930530 7173163 7395040 7631268 7931850 8235649 8472241
11905H472241N14221N47844P42272P28780O74731P93002Q30996Q10471R72871
$$ 8472241 8986462 9534306 10276578 11005358 11680089 12473091 13304087 14114558 15087429
11896A5087429J194624J163993J092856J212339J314580J443140J459734J163439
$$ 15087429 16282053 17446046 18538902 19751241 21065821 22508961 23968695 25132134
11888B5132134J052442J029374Q43218O97588O86738P58297R28538J085037J220574
$$ 25132134 26184576 27213950 28057168 28754756 29441494 30199791 31128329 32213366 33433940
11879C3433940J701797K040814K699465L467675M417311N390942O639290P674813
$$ 33433940 35135737 37176551 39876016 43343691 47761002 53151944 59791234 67466047
11871F7466047Q679174R175620R546623R228904Q207704O202642K415477k619045
$$ 67466047 76145221 85320841 94867464 104096368 112304072 118506714 120922191 118303146
11863A18303146p126387r819124r601278p166933m039539j447499K42626J467990
$$ 118303146 111176759 101357635 91756357 84589424 80549885 79102386 79345012 80813002
11855H0813002K309028K954557L604022M208990M263602M066107L390281K548295
$$ 80813002 83122030 86076587 89680609 93889599 98153201 102219308 105609589 108157884
11847A08157884J948614J572047J630579J872907J928496K205382K495747K373900
$$ 108157884 110106498 111678545 113309124 115182031 117110527 119315909 121811656 124185556
11839A24185556K183639J418079Q02288N86025J254298K985856N463976Q529219
$$ 124185556 126369195 127787274 128589562 129175587 130429885 133415741 138879717 147408936
11831A47408936J1719983J4605249J6912178J8342565J9423445J9579065J8470125
$$ 147408936 159128919 173734168 190646346 208988911 228412356 247991421 266461546
11824B66461546J4541962N991794p551234k1976209l1173969l2767040k7824558
$$ 266461546 281003508 286995302 279444068 257467859 226293890 193526850 165702292
11817A65702292k0535687j4039549q826701n447062l255142j624444m96394K47524
$$ 165702292 145166605 131127056 122300355 116853293 113598151 111973707 111477313 111724837
11809A11724837K44344l58171j698440l045276l770339l688721l297794k533001
$$ 111724837 111969181 111611010 109912570 106867294 103096955 99408234 96110440 93577439
11801I3577439j819498j281366j071786j302129j590162k072738k451934k561275
$$ 93577439 91757941 90476575 89404789 88102660 86512498 84439760 81987826 79426551
11793G9426551k136392r59436N01213J780934L221086M446309N105767N428443
$$ 79426551 77290159 76330723 76831936 78612870 81833956 86280265 91386032 96814475
11785I6814475N690378O061951N429685L265759p70804o309117j1796686j4754696
$$ 96814475 102504853 108566804 113996489 117262248 116491444 110182327 98385641 83630945
11777H3630945j4878124j2851922j0143307p311687n229143l596074k385603j650394
$$ 83630945 68752821 55900899 45757592 38445905 33216762 29620688 27235085 25584691
11769B5584691j193232p80555p21233o51494n81798n77009l75777l96392m48961
$$ 25584691 24391459 23610904 22889671 22238177 21656379 21079370 20703593 20307201 19858240
11760A9858240o46469p28327p36193p31977r92361j026678p16114p23419o23485
$$ 19858240 19211771 18483444 17747251 17015274 16022913 14996235 14280121 13556702 12933217
11751A2933217n65614m60295n98227n72117n06713n85868m28211k67883k99327
$$ 12933217 12367603 11907308 11309081 10736964 10230251 9644383 9216172 8948289 8648962
11742H648962l31019l48134k02696k53684j70310j2911M6715R635j79016j5238
$$ 8648962 8317943 7969809 7767113 7513429 7343119 7330208 7376923 7386558 7207542 7192304
11732G192304O3314J17410P3545m408K0185j44885r3999J8506k18167j30864q5893
$$ 7192304 7255618 7373028 7446573 7442165 7462350 7317465 7223466 7241972 7023805 6892941 6807048
11721F807048j52919j62612j75927P0168J38204J11965l8288p1422j24000P6676
$$ 6807048 6654129 6491517 6315590 6385758 6523962 6635927 6597639 6526217 6402217 6478893
11711F478893M6588j6643k33170j75269k11722j23126R416k48699m33524k58102
$$ 6478893 6525481 6508838 6275668 6100399 5888677 5765551 5774967 5526268 5092744 4834642
11701D834642k41966k91283m0500m7160r3373l0595M0597l1513j07434q908n3967
$$ 4834642 4592676 4301393 4260893 4213733 4120360 4089765 4130362 4098849 3991415 3982507 3928540
11690C928540j13929n2275k1069o7924m2286o4412N3283J49645n1618K3278p4932
$$ 3928540 3814611 3762336 3741267 3673343 3631057 3566645 3619928 3769573 3717955 3741233 3666301
11679C666301m0289o5753k9483j34188j54130J4202O7563j0867n3254q8969j86837
$$ 3666301 3626012 3560259 3530776 3396588 3242458 3256660 3324223 3313356 3260102 3171133 2984296
11668B984296j33192O5618L2270O5454J29834k0365j60754M6644Q2208j49009
$$ 2984296 2851104 2916722 2948992 3014446 3144280 3123915 2963161 3009805 3092013 2943004
11658B943004J2353o7635k43169l0885J5363L6021M6578k1330K6183j4005j88105
$$ 2943004 2955357 2887722 2644553 2613668 2629031 2665052 2711630 2690300 2716483 2702478 2514373
11647B514373j83843l5492J83311Q3425P7029M2766k0970l1817n0391j1290n3044
$$ 2514373 2330530 2295038 2478349 2561774 2638803 2681569 2660599 2628782 2578391 2567101 2514057
11636B514057K3572q7674n9292o3844q2798n9716r6698n8596J18850J33984j43495
$$ 2514057 2537629 2449955 2390663 2326819 2244021 2184305 2087607 2029011 2147861 2281845 2138350
11625B138350p092Q6129P3679q9706K8838R4263j656o1653n2579N7901J1696m6363
$$ 2138350 2131258 2217387 2291066 2201360 2230198 2324461 2322805 2261152 2208573 2266474 2278170 2231807
11613B231807K4937P6607p3916j8049o3217J7557J11806P7268j25828O9327P8529
$$ 2231807 2256744 2333351 2259435 2241386 2178169 2195726 2307532 2384800 2258972 2328299 2406828
11602B406828k6131k28828j10999j26548j49878M0220J21452P2920J51379L8704
$$ 2406828 2380697 2151869 2040870 1914322 1764444 1804664 1926116 1999036 2150415 2189119
11592B189119j04622l1225j18881k0884J57082K3662J2319l4587l2006o239K7739
$$ 2189119 2084497 2053272 1934391 1913507 2070589 2094251 2106570 2071983 2039977 2033738 2061477
11581B061477n0754J6086j15j34382q8415Q8867J31019q8668J7133J7403J5164
$$ 2061477 2010723 2026809 2026694 1892312 1803897 1892764 2023783 1935115 1952248 1969651 1984815
11570A984815l8102K481n7813l9751m2642J9600J16703J01685j25030k41827P4378
$$ 1984815 1946713 1949194 1891381 1851630 1808988 1828588 1945291 2046976 1921946 1680119 1754497
11559A754497O7798l871J8012p8905r2744p9690q8655J41471p4347p0548J10464
$$ 1754497 1822295 1818424 1836436 1757531 1664787 1585097 1496442 1637913 1563566 1493018 1603482
11548A603482j6536p2327r4672l0814L5520J03980l6784q3694N3222J48730N74
$$ 1603482 1586946 1514619 1419947 1389133 1424653 1528633 1491849 1408155 1461377 1610107 1610681
11537A610681j07485N6306p5678N5789n3201n017K13590M4008n2337l7720J28824
$$ 1610681 1503196 1559502 1483824 1539613 1486412 1481395 1694985 1738993 1686656 1648936 1777760
11526A777760j8177k05964j61178K0694M6773Q1258l4914j09201J15562m1586
$$ 1777760 1759583 1553619 1392441 1413135 1459908 1541166 1506252 1397051 1512613 1471027
11516A471027n0599J24225J56527m5076r1533j98439q369J54934Q4950j42740
$$ 1471027 1420428 1544653 1701180 1656104 1564571 1366132 1357763 1512697 1597647 1454907
11506A454907m2799o6772o2619K9786J6558P8931J41733L0014J16048j1615j25350
$$ 1454907 1412108 1345336 1282717 1312503 1329061 1407992 1549725 1579739 1695787 1684172 1558822
11495A558822q0361o9403k8217M4924j55529o6605K3214Q0308R6180r702J3225
$$ 1558822 1478461 1409058 1380841 1425765 1270236 1203631 1226845 1307153 1403333 1393631 1406856
11484A406856l3769q2650J32351R4905n397o1525o461J3563J04479j11783N6080
$$ 1406856 1373087 1290437 1422788 1517693 1512296 1450771 1444310 1457873 1562352 1450569 1506649
11473A506649L1992l3384L4882k4122p181J06082k4054r4645j00327J822M7035
$$ 1506649 1538641 1505257 1540139 1516017 1508836 1614918 1590864 1496219 1395892 1397714 1444749
11462A444749m350k09242r5594K09666r14j48750N1492j8081Q2818N8409r8422
$$ 1444749 1440399 1231157 1135563 1345229 1344315 1195565 1247057 1228976 1311794 1370203 1271781
11451A271781L2456J31029P7504J6376k6609j48180j24719j7159K1486j47065
$$ 1271781 1304237 1435266 1512770 1529146 1502537 1354357 1229638 1212479 1233965 1086900
11441A086900l9536P0564P3499J51645O4656q723j39987P5019J04087o5289P229
$$ 1086900 1047364 1117928 1191427 1343072 1407728 1399005 1259018 1334037 1438124 1372835 1380064
11430A380064K37350L481j19118o5007J06731J86243Q2418P9017q218N3160N964
$$ 1380064 1617414 1620895 1501777 1436770 1543501 1729744 1812162 1891179 1882961 1936121 1942085
11419A942085K5947j07477k24401m9488k4365J16230N9462j05557q4853R0751
$$ 1942085 1968032 1860555 1636154 1586666 1562301 1678531 1737993 1632436 1547583 1638334
11409A638334J07333q8320j19526k3546n1454q761J05769J9796j22465L7984J48699
$$ 1638334 1745667 1657347 1537821 1514275 1462821 1454060 1559829 1579625 1457160 1495144 1643843
11398A643843L3074k7221L1742R0382L271j10643P0071M6715q1396r8572l1762
$$ 1643843 1676917 1649696 1681438 1771820 1775091 1664448 1734519 1781234 1699838 1601266 1569504
11387A569504J83393R6711O4921Q924O9953K32452O6259J34643J18692N0948m118
$$ 1569504 1752897 1849608 1914529 1923453 1993406 2225858 2292117 2426760 2545452 2596400 2592282
11376B592282k70577j3002n8992q2955k25868j79533j51695q2445j32393q5497
$$ 2592282 2321705 2308703 2249711 2166756 1940888 1761355 1609660 1527215 1394822 1309325
11366A309325O4179J37690l846k7696r7591M4303J45990J45209o8787j53113j23276
$$ 1309325 1373504 1511194 1507348 1479652 1382061 1426364 1572354 1717563 1648776 1495663 1372387
11355A372387O5976O697l603N8327j9275j7889l8451P375m2813K4339J10877o4107
$$ 1372387 1438363 1445060 1441457 1499784 1480509 1462620 1424169 1431544 1388731 1413070 1523947 1459840
11343A459840M1888K03393Q3069Q265M8187J1099q2201j30830l9032l3083l7677
$$ 1459840 1501728 1705121 1788190 1796455 1844642 1855741 1773540 1642710 1603678 1570595 1532918
11332A532918r8673j09586p3381r6215m5665P8988J6415k17759p818P3042K1161
$$ 1532918 1434245 1324659 1251278 1155063 1109398 1188386 1204801 987042 979224 1052266 1073427
11321A073427R2008l9320n7959n0645q7381L9449J20857K5373K5525l8344j07149
$$ 1073427 1165435 1126115 1068156 1017511 930130 969579 1090436 1115809 1141334 1102990 995841
11310I95841J02104J556K5681n1675m9566k4888m883J29391J8080J1355j46o3803
$$ 995841 1097945 1099501 1125182 1073507 1023941 999053 994170 1123561 1141641 1152996 1152850 1089047
11298A089047n4736j26025m0737m703K773O1962P504n8044l6182j8628Q788N4362
$$ 1089047 1034311 908286 867549 862846 865619 927581 935085 877041 840859 822231 831019 885381
11286H85381n8597J7839R1224j7329j27929R7987J52100P872k24866j39210K12452
$$ 885381 826784 844623 935847 918518 790589 888576 1040676 1048548 823682 684472 896924
11275H96924J94891P6624j12512l4304j61144j29810P141J29140o810k4959o7679
$$ 896924 1091815 1168439 1055927 1021623 860479 730669 737810 866950 860140 835181 767502
11264G67502J08856O9082Q5279o298j68495j0315Q0129j07726K3793J76745L3827
$$ 767502 876358 945440 1030719 1024421 855926 845611 925740 818014 841807 1018552 1052379
11253A052379j31594M4067J09630O1926p2812j80064j1844K19378l9141k27971
$$ 1052379 920785 964852 1074482 1136408 1063596 883532 871688 1091066 1051925 823954
11243H23954p3264J15087l8952k1178L8541J2474J1327n7604L7055J34452J56059
$$ 823954 750690 865777 826825 805647 844188 856662 867989 810385 847440 981892 1137951
11232A137951j47167k07651j2515k1551Q3214L6309j6297j5182o9031o1625Q4273
$$ 1137951 990784 783133 770618 749067 832281 868590 852293 837111 768080 706455 790728
11221G90728L8371k5750o5480Q7930Q7683K5363j33972n3086L4353L1875l1643
$$ 790728 829099 803349 737869 825799 913482 938845 804873 751787 786140 818015 786372
11210G86372J52196r135j27820k04892n2741O7147p987Q0003N4492p4991r967
$$ 786372 938568 929433 801613 596721 543980 611127 603140 683143 737635 662644 652677
11199F52677J85937l5699j12486r2841p2673J23153p741J10479N0927m7142j5971
$$ 652677 838614 802915 690429 597588 524915 648068 640327 750806 801733 754591 738620
11188G38620J8728n5861j31334j07868o2946K17016K26960R2939o596p3868o5756
$$ 738620 757348 701487 570153 462285 399339 616355 843315 936254 929658 855790 790034
11177G90034l8904O9637q6197q3135j6069Q1573p8691n5972k763q3827M8012K4380
$$ 790034 751130 820767 734570 651435 635366 716939 638248 582276 579513 495686 543698 568078
11165E68078R4902M5886j0766Q0739K9000k11970J722J01618L3605n4625k6976
$$ 568078 662980 708866 698100 778839 807839 595869 597591 699209 732814 678189 651213
11154F51213N726j16344n7467P127J60251P0636r5861j6895l0893j08819j41264
$$ 651213 656939 540595 483128 490255 650506 721142 625281 608386 577493 468674 327410
11143C27410Q5465Q1812M854M5394O7808K8651j4951J01j42240K4982J5829M8232
$$ 327410 412875 494687 499541 544935 612743 641394 626443 626544 484304 509286 525115 573347
11131E73347J44212O7386j04423P5537l6121o4831o8590J7031K3786o5551l2605
$$ 573347 717559 784945 680522 756059 719938 655107 586517 603548 627334 561783 529178
11120E29178o4850M1651P1621J18874j66708P2462L2637J29247N7773L6161j0912
$$ 529178 464328 505979 577600 696474 529766 602228 634865 764112 821885 858046 847134
11109H47134Q0862L0277k8450j10083q7905r8247l2740j7066Q6824J845j08792
$$ 847134 927996 958273 929823 819740 731835 633588 600848 583782 670606 672451 563659
11098E63659J15214n9696J0452k4583m1244K2807O8303Q9721J22250j22978j95449
$$ 563659 678873 619177 629629 605046 563802 586609 654912 744633 866883 743905 548456
11087E48456p1089R2511J30271n8596L1420K377l507Q0235R8534j28241j50573
$$ 548456 477367 569878 700149 641553 672973 675350 671843 752078 850612 722371 571798
11076E71798Q63j4658r939Q827J16588P9395R745j10279l2603m0627r5757j65641
$$ 571798 572661 558003 548064 556891 673479 752874 762619 652340 619737 579110 483353 317712
11064C17712J68088J55609m2224r1038n6896P6030K0387l2891K6145J02494j01911
$$ 317712 485800 641409 599185 508147 451251 527281 547668 514777 540922 643416 541505
11053E41505p9287k2670P1783K07586P940r7949J708n8462Q3963j20856j93580
$$ 541505 462218 439548 511331 718917 726857 628908 630616 572154 656117 535261 341681
11042C41681m504J29670K5532O3128J3729q2636J11821Q4929K2158p4398r6310
$$ 341681 337177 466847 492379 555507 569236 486600 598421 683350 705508 631110 534800
11031E34800j9385N2363Q0329m3609o4836l5607l990q6949O4500J21180J54260
$$ 534800 515415 567778 648107 604498 539662 504055 500065 413116 477616 598796 753056
11020G53056k0652j17651l9036k0839Q0292M3134J740n4193J0226n2184j20631
$$ 753056 732404 614753 575717 554878 635170 678304 680044 625851 636077 583893 463262
11009D63262m6311O7318k4627J18196P1631N7036l9535j73323r4466N5740k5868
$$ 463262 416951 484269 459642 577838 649469 706505 666970 493647 399181 454921 429053
10998D29053k4386O9061P4388J9486j32170m7125R4172O726P273K3359k8604N7031
$$ 429053 404667 473728 548116 567602 435432 388307 482479 489205 496478 519837 491233 548264
10986E48264j3245r266n6665j20320q841J08966J64237M9013N7906j14768j55112
$$ 548264 535019 525753 469088 348768 339927 448893 613130 662143 720049 605281 450169
10975D50169j6705q1348O2405J47354J16871r9184n6438K3901m3750l2234r3030
$$ 450169 433464 352116 414521 561875 678746 579562 523124 547025 503275 471041 378011
10964C78011j841O1188j3328K0650K5967L2888J22275l2879j43678n3704k868
$$ 378011 376170 437358 424030 444680 470647 503535 625810 592931 449253 395549 392681
10953C92681O3787J8650o28P4965j1736p7373r6338L1988J07788O606M6685O7267
$$ 392681 456468 475118 474490 549455 537719 460346 364008 395996 503784 510390 557075 624342
10941F24342l1408j90302K7340J01727M3561L3563R941j927j44479R653J14374
$$ 624342 592934 402632 429972 531699 575260 608823 618764 616837 472358 482011 596385
10930E96385J27659J7479O6318m0997k37877r0692J68954O6373J7962l3673r5118
$$ 596385 724044 741523 807841 766844 528967 438275 607229 673602 691564 657891 562773
10919E62773J1085n6762K5053o043J01005q5955l2154K1931J9043j5810q3213
$$ 562773 573858 517096 542149 536106 637111 551156 519002 540933 559976 544166 460953
10908D60953J991J44227O3479j27089j71587J1932m7473l0046Q610J15579J03549
$$ 460953 462944 607171 670650 543561 371974 383906 336433 306387 314997 430576 534125
10897E34125J5208o1243m089J07802K4647l0951l5078l8931o3423m0364j35879
$$ 534125 549333 488090 484001 591803 616450 585499 550421 511490 448067 407703 271824
10886B71824j9905J48195N4979l2251J9164J62144P2387J36778q8817k81258j22014
$$ 271824 251919 400114 455093 422842 442006 604150 676537 813315 724498 443240 321226
10875C21226m8142J70886N4329j9130k6402j16000m0161P9716J22386j6830L72
$$ 321226 273084 443970 498299 479169 452767 336767 296606 376322 498708 481878 482250
10864D82250N137K1425m7333k8979P2687J0654P1877q5978L629l2151k4250J3567
$$ 482250 487387 508812 461479 432500 505187 515841 587718 501740 505369 473218 448968 462535
10852D62535L2209j0279l2097L3009m2002L6090k5597o2579J43425P2479j24169
$$ 462535 494744 484465 452368 485377 443375 479465 453868 391289 534714 607193 483024
10841D83024k7837J6889J85615n0145j24547L6118j30049l1677K10978L5743q9797
$$ 483024 455187 472076 657691 607546 482999 519117 389068 357391 568369 604112 514315
10830E14315J4684p7827m3120k7869j3579j4980o100J05148L990R4041K7007Q4482
$$ 514315 528999 451172 408052 380183 366604 351624 345524 450672 454662 548703 575710 660192
10818F60192R0264j13238r4768m1560j70578M6396j6897M3624r7129J5183M2825
$$ 660192 750456 637218 542450 500890 330312 376708 359811 403435 306306 321489 364314
10807C64314j4410J64228J33719J5079j67536j41393J53065Q8535j18197L7596
$$ 364314 349904 514132 647851 662930 495394 354001 507066 595601 477404 515000
10797E15000J3102R197L1183p109j11345N4773n6243l9287J16078m0546N298o7033
$$ 515000 528102 537299 568482 561373 450028 504801 448558 409271 525349 484803 490101 423068
10785D23068O9437j0728m3840p5570K9574R8127L3432J28904J18611R1842Q8774
$$ 423068 492505 481777 437937 362367 391941 490068 523500 652404 771015 862857 951631
10774I51631J53090J57820o9700o659R8048k373j24184j11614j13813j02770j59303
$$ 951631 1104721 1262541 1192841 1186182 1284230 1281857 1157673 1046059 932246 829476 670173
10763F70173j39466r1702o0334J44813K6571J16505M2745P0468J06231J46407
$$ 670173 530707 439005 378671 523484 550055 666560 709305 779773 886004 1032411
10753A032411n1929n856L8671J18045Q9814J15371J68579K8602K31610Q6773l70511
$$ 1032411 980482 974626 1013297 1131342 1221156 1336527 1505106 1533708 1765318 1852091 1481580
10742A481580l31013l78961k74075n963R5144n6880l8948J7578j01635n8017j04055
$$ 1481580 1150567 771606 497531 491568 586712 529832 490884 508462 406827 348810 244755
10731B44755Q8270J00905Q7270q551q5988M2030O7944p2384J8010k8852J1522
$$ 244755 333025 433930 521200 512649 426661 468691 536635 464251 482261 453409 464931
10720D64931q4680n9381m963n2372p8559j9055l2430M3336J91738J43751J10888
$$ 464931 380251 320870 315907 263535 184976 165921 133491 176827 368565 512316 623204
10709F23204l4743k91050m1772J39895K03679J75441j12416o5853n4725j32133
$$ 623204 588461 297411 255639 395534 599213 774654 662238 596385 541660 409527
10699D09527K8461k3685r3489l870L0173N0664m0997N2690l8420P202J5288p6032
$$ 409527 437988 414303 320814 316944 347117 397781 356784 409474 371054 378256 393544 317512
10687C17512R9751j7396L754k3184M1625j7122r7918M4551K8682j8160J42643
$$ 317512 417263 399867 403621 380437 422062 404940 307022 351573 380255 362095 504738
10676E04738p5233r8228N329N175M6465L1076m8165j1101o9935K1875M0145J8373
$$ 504738 429505 331277 336606 341781 388246 419322 371157 360056 290121 311996 352141 370514
10664C70514m1846M880J68704R0445j01000k118j17260j02730l2920R0410M9986
$$ 370514 328668 333548 502252 592697 491697 489579 372319 269589 236669 327079 377065
10653C77065j05985k4345R6142j445k0298M348M5506O8015J04799J8318k2056
$$ 377065 271080 246735 342877 341432 321134 325482 370988 439003 543802 562120 540064
10642E40064k1405m3837K0254j29090j69667J35121J22759r946Q8231o0777m7567
$$ 540064 518659 474822 495076 365986 196319 331440 454199 444253 532484 471707 424140
10631D24140q2472k9320R237J21215P8752j41537J6433o4403k9364n4710l048
$$ 424140 341668 312348 321585 442800 521552 380015 396448 332045 302681 247971 244923
10620B44923J73792J18001j42412r879N1055j17771j641m1953R2411R3954M9384
$$ 244923 418715 536716 394304 384425 435480 317709 316068 274115 366526 460480 509864
10609E09864P824k45254l3267R1099P3621j9128j38792j43735K6896o047J66962
$$ 509864 517688 272434 239167 330266 403887 384759 245967 102232 129128 123081 290043
10598B90043Q556L4665J03981J76487M1803j71555P8760J07669q5948j14865j9335
$$ 290043 298599 333264 437245 613732 655535 483980 562740 670409 584461 469596 450261
10587D50261M723n5430M2452O1415R263M327q2538m8130P2073j24898l5794n6924
$$ 450261 454984 399554 442006 503421 512684 517011 434473 386343 458416 333518 297724 240800
10575B40800m7528N1950J03584j8734k5830r555J07185j07903j36152o0707O9119
$$ 240800 193272 245222 348806 330072 304242 294687 401872 293969 157817 97110 166229
10564A66229L0754j65835K6960J95938q4875m7265L2141J12225O680k9657m4021
$$ 166229 196983 31148 58108 254046 169171 121906 154047 266272 272952 243295 199274
10553A99274K5250p1719N5835L5651J18367O2394l5027r1216l1688M3714Q3467
$$ 199274 224524 152805 208640 244291 362658 425052 390025 298809 267121 310835 394302
10542C94302l414m8538k618j23542p3664l0861P7657J27527l5791j31190r2982
$$ 394302 390888 342350 339732 216190 142526 111665 189322 316849 281058 149868 56886
10531E6886j01257L9979J53994Q0627m4196q2869Q2769Q5072J33004O7867j00163
$$ 56886 -44371 -4392 149602 230229 186033 103164 185933 271005 404009 471876 371713
10520C71713n6716n3R4100j8387n2053r3793j4260j5192k5457K1416j10796n3777
$$ 371713 314997 314944 409044 390657 338604 244811 230551 215359 189902 211318 100522 46745
10508D6745P2654M2803j9882j14736m2467P2711K06270M0482k7289j10697K4016
$$ 46745 119399 162202 142320 27584 -14883 57828 264098 304580 277291 166594 190610
10497A90610M2878J09628J25791P0326j05230j96681J527K83989M7683j04209
$$ 190610 233488 343116 468907 539233 434003 237322 238849 522838 570521 466312
10487D66312l6765m5174j03649O3103K259n8556p4499N3404Q2985Q5310k0559
$$ 466312 429547 384373 280724 343827 346086 287530 213031 266435 349420 434730 414171
10476D14171j35067k23712k1368q334J14454P0333q6998j3879k0915m0770K1445
$$ 414171 279104 55392 34024 25690 140144 210477 123479 109600 88685 47915 69360
10465F9360M6185q5079k4946k8549n8587P6804J48581J06051Q444l0345j80805
$$ 69360 115545 30466 5520 -23029 -81616 -4812 143769 249820 258264 227919 47114
10454D7114K7117L1983r6422n9401M3814J05580P6108O8034p407L3746N7986Q0112
$$ 47114 74231 106214 9792 -49609 -5795 99785 175893 243927 236520 270266 328252 408364
10442D08364k5071j66234r5881L220K4631K7194j1818L5343o9473N5699M9895
$$ 408364 383293 217059 121178 124398 149029 176223 164405 199748 130275 185974 235869
10431B35869J7508r6027P7576n1450j26564O5396M5748J19690N1150j6527k16796
$$ 235869 253377 157350 234926 183476 56912 122308 168056 287746 338896 322369 105573
10420A05573o0654R4497J2937r6591O8414k9591Q9097Q0937l7078O9663Q0334
$$ 105573 44919 139416 152353 55762 124176 94585 183682 264619 227541 297204 377538
10409C77538j5959n2155j8383k2293k2150r132o2800J27090J28155L7157O8493
$$ 377538 361579 309424 291041 268748 246598 237466 174666 301756 429911 467068 535561
10398E35561j39582o5957p7134j0840j6826m0482O7800L6642L6469l2225j55073
$$ 535561 395979 330022 252888 242048 225222 184740 252540 289182 325651 293426 138353
10387A38353p0033J02317J06552N8532N844N7424m2093j37061n1846L7890K0455
$$ 138353 68320 170637 277189 335721 341565 398989 356896 219835 167989 205879 226334
10376B26334P9241p2042m3402N6154R6059O6623R8228N1937j03256j90858q3996
$$ 226334 305575 233533 190131 246285 342344 408967 507195 559132 455876 265018 181022
10365A81022J9563P8356O8995k3047N798J04841N978j75373j53631J25577K5533
$$ 181022 200585 278941 347936 324889 330687 435528 441506 266133 112502 238079 263612
10354B63612R4800Q2627R4789k3647j13996j55837j80782q083l189l7849p0135
$$ 263612 358412 441039 535828 512181 398185 242348 61566 53483 50294 12445 -57690
10343e7690j2547J33667k7806j24329J50397J24373n2229K9388j1053J8076J86254
$$ -57690 -70237 63430 35624 -88705 61692 186065 133836 163224 152171 170247 356501
10332C56501k15657o7640l2439K7232N0864K5140Q714M3869P8366J62076l2185
$$ 356501 140844 73204 40765 67997 118861 144001 152715 196584 274950 437026 404841
10321D04841K0511l0971p732j43853j21657P260J19127K4594M8039k367k3769
$$ 404841 425352 394381 386649 242796 121139 128399 247526 272120 320159 317792 294023
10310B94023l977l881m5986l730j3811L8175q8507L5912J72540l6574J5476L6855
$$ 294023 290046 286165 240179 236449 222638 260813 172306 208218 380758 344184 359660 396515
10298C96515j06776l5152j54775N4073R2558J16653J13477J5405L316p800O8327
$$ 396515 289739 254587 99812 153885 246443 363096 476573 491978 495294 487494 555821
10287E55821K2558O9646N2119P5181J90091J0701M1495L9121p8274o8849M467
$$ 555821 578379 648025 700144 775325 965416 976117 1017612 1056733 978459 909610 914077
10276I14077k3231n1729j66363j09530o7406P452l7457M0180l0820o4974m0483
$$ 914077 890846 839117 672754 563224 495818 503270 465813 505993 475173 410199 369716
10265C69716l0997l6881L2501k5167J01081J03556R077L8753n39p5450J06903
$$ 369716 338719 301838 334339 309172 410253 513809 522886 561639 561100 485650 592553
10254E92553J81092m6483q2054k3487m4200M8738L1180P9500N8708O6022j4535
$$ 592553 773645 727162 645108 621621 577421 626159 657339 736839 795547 861569 847034
10243H47034N6115R9920J03350P3959j0891J00276Q9684n5721p1936o9877n3507
$$ 847034 903149 1003069 1106419 1180378 1169487 1269763 1359447 1303726 1231790 1161913 1108406
10232A108406k35434j95166k56220K819q0308L5987k8374n1719N9047J52496Q6256
$$ 1108406 872972 677806 421586 424405 344097 380084 351710 299991 359038 511534 597790
10221E97790p8909j31138K44L3624L4880n7124j0578n4443o808O0194J27897L6197
$$ 597790 518881 387743 387987 421611 456491 399367 388789 334346 327538 387732 515629 551826
10209E51826R5922K1161k01950j75544N2953J87076O3158M8195M8714J29452P4077
$$ 551826 647748 668909 466959 291415 344368 531444 594602 642797 691511 820963 895040
10198H95040R372N1680L6354J55995P1800J15866j12767k32177k24072n3398k03537
$$ 895040 904412 956092 992446 1148441 1220241 1336107 1223340 991163 767091 713693 510156
10187E10156j51364k6953n4126J154o6902J08265l0477k2514j26450j01508N5808
$$ 510156 358792 331839 277713 278867 211965 320230 289753 267239 140789 39281 95089
10176I5089j0024P4698K06411j26308J2591J08344m1411j70257q5763M5571m3733
$$ 95089 85065 159763 366174 239866 252457 360801 319390 149133 63370 108941 65208
10165F5208n0006J08584J03294J2404r966N78Q3775L1327K2890J8877j8412P7647
$$ 65208 15202 123786 227080 239484 229518 230096 313871 345198 368088 386965 368553 446200
10153D46200J6975J795N7114m3790p9695Q7013p1166n1489l7757j64981k4135
$$ 446200 463175 464970 522084 478294 398599 485612 414446 362957 325200 160219 136084
10142A36084r906J5118K7248o7132P8800O9262p4098l2415O6710K1075k1983m3108
$$ 136084 126178 141296 168544 101412 180212 249474 175376 142961 209671 230746 208763 165655
10130A65655K6643M7938n9699l2647N002n8807L9103N4877l05Q4657L9484p4804
$$ 165655 192298 240236 180537 147890 152892 94085 133188 188065 187760 272417 311901 237097
10118B37097q5370J9933q8223q3830K4721K3022R0389O8635o9907j49120q3144
$$ 237097 151727 171660 83437 -393 24328 47350 137739 206374 136467 -12653 -95797
10107i5797J19935Q7313Q1738o6263J3090J46479l8843j01898j29106J17141J82637
$$ -95797 24138 111451 193189 126926 140016 286495 247652 145754 16648 133789 316426
10096C16426o8972m7847m0527J12447n5046k9165o3232L3378J10600K411N8447
$$ 316426 247454 199607 159080 271527 216481 187316 124084 157462 268062 270473 328920
10085C28920K1349M2851l9433q8772n868R9704J62741o7989o7791j94473K719
$$ 328920 350269 393120 353687 264915 259047 358751 521492 453503 385712 191239 193958
10074A93958J13519j27512j52148O081N6213J40860l5325q6451j07585j27769
$$ 193958 307477 179965 27817 33898 90111 230971 195646 109195 1610 -126159
10064a26159J2610R6849K16785K59486n6454j88932j42593R1636m498K3631N3088
$$ -126159 -113549 -16700 200085 459571 403117 214185 71592 163228 158730 182361 235449
10053B35449j65153j10685J25438P5446J849J50694M5531L674j7258j37687j06728
$$ 235449 70296 -40389 85049 160495 162344 313038 358569 362243 344985 207298 100570
10042A00570N6908J28050J18584k22995m8567L5437r029O9192M998O3244o1240
$$ 100570 157478 285528 404112 181117 132550 167987 158958 228150 233148 296392 235152
10031B35152r1762j55622L914j17526j9960K4685j4835l5403R8816k9627q7214
$$ 235152 143390 -12232 -8318 -125844 -145804 -121119 -135954 -171357 -72541 -102168 -189382
10020a89382k3817O558J43970P9874l8193O5464p0202m9012p8091l6742k971j82612
$$ -189382 -213199 -206641 -62671 17203 -20990 44474 -25728 -74740 -152831 -189573 -192544 -375156
10008c75156N839K65157J83211N207N9304l737j8159l3783L056l2628j49708j36631
$$ -375156 -369317 -104160 79051 84258 143562 139825 121666 87883 90939 58311 -91397 -228028
9996b28028j02370J45427J30810O0998P5044K32685m5168j16397J9804l1534j9355
$$ -228028 -330398 -184971 -54161 6837 81881 314566 269398 153001 172805 141271 121916
9985A21916n7583j18807O7959J39143r2944Q042Q0646m9747Q4467J49029L4433
$$ 121916 64333 -54474 13485 152628 59684 67726 148372 98625 183092 332121 366554
9974C66554K0375p5428j9906J26436n4753m9463j51195P3594N6098j2318r2592
$$ 366554 386929 311501 291595 418031 363278 313815 162620 236214 292312 279994 187402
9963A87402J42526J08053K7804J38707J52774Q6833k07201j74821J55254K66360
$$ 187402 329928 437981 465785 604492 757266 844099 636898 462077 617331 883691
9953H83691P898p068m3752J00146J83369J61962M483M950R9077J84825J52716
$$ 883691 891589 884521 840769 940915 1124284 1286246 1290729 1295679 1394756 1579581 1732297
9942A732297K23358J70885J82843L19946L33047k0968l188J84828L43777L25862
$$ 1732297 1955655 2126540 2309383 2629329 2962376 2941408 2938220 3123048 3466825 3792687
9932C792687K82285M6004J05376J40665n7242r8932q4040j01421j09342l6306
$$ 3792687 4074972 4120976 4226352 4367017 4309775 4210843 4126803 4025382 3916040 3879734
9922C879734l3314j9772P38K54913K89132J54999N6436J65317L96867M68194N72409
$$ 3879734 3846420 3826648 3827386 4082299 4371431 4526430 4582866 4748183 5145050 5613244 6185653
9911F185653N30009N60477O39451O29936Q03471R48006P55605L43854o6977j87604
$$ 6185653 6715662 7276139 7915590 8545526 9348997 10297003 11052608 11396462 11329485 11141881
9901A1141881P1311J24158P6935k46742l82906j01910J91664K61865N69805O21723
$$ 11141881 11213192 11337350 11414285 11167543 10784637 10682727 10874391 11136256 11706061 12327784
9891A2327784Q23095P53807Q00907P01615O66587O64376Q93262R96680J091199
$$ 12327784 13150879 13904686 14705593 15407208 16073795 16738171 17631433 18628113 19719312
9882A9719312J090186J192395J379141J730047K078184K307790K625564L282096
$$ 19719312 20809498 22001893 23381034 25111081 27189265 29497055 32122619 35404715
9874C5404715M361795N360226O227988P497693R003569J0145062J0603246J0434629
$$ 35404715 39766510 45126736 51354724 58852417 67855986 78001048 88604294 99038923
9866I9038923R637672Q892848P449609M730056k079304j1579660j5959285j4092320
$$ 99038923 108676595 117569443 125019052 129749108 127669804 116090144 100130859 86038539
9858H6038539j0128290o204827k872086j02271K219966M293421N957500P387133
$$ 86038539 75910249 69705422 66833336 66731065 68951031 73244452 79201952 86589085
9850H6589085Q587177R458596R762319R339899P575638N359524L451116J453763
$$ 86589085 95176262 104634858 114397177 123737076 131312714 136672238 140123354 141577117
9842A41577117r80501k872428l507434l493559l027509k737636k613061j874021
$$ 141577117 140596616 137724188 134216754 130723195 127695686 124958050 122344989 120470968
9834A20470968p45051Q03828K759915N128025Q312710J2433021J6805119K0501388
$$ 120470968 119725917 120529745 123289660 128417685 136730395 149163416 165968535 186469923
9826A86469923K2628709K3245641K3273712K1701354J7153867P469856j1076183
$$ 186469923 209098632 232344273 255617985 277319339 294473206 301943062 290866879
9819B90866879l3247393m4450627m1229320l1533817k0933694j2592959o808610
$$ 290866879 257619486 213168859 171939539 140405722 119472028 106879069 100070459
9812A00070459k692175j68029J816879L233481L685215L247181K607852K806969
$$ 100070459 97378284 97210255 99027134 102260615 105945830 109193011 111800863 114607832
9804A14607832L284061K910750J682033M22884j170829k854745m668528o297854
$$ 114607832 117891893 120802643 122484676 122907560 121736731 118881986 114213458 107915604
9796A07915604q335513r621193j0089859r321132p500734m808803k323268p4319
$$ 107915604 99580091 89958898 79869039 70547907 63047173 58238370 55915102 55840783
9788E5840783J935320L752956N271722O617910P353778P530814P345156P026184
$$ 55840783 57776103 61529059 66800781 73418691 80772469 88303283 95648439 102674623
9780A02674623N698242K289926m888663j3312815j7017735j5450598j2238993
$$ 102674623 108372865 110662791 105774128 92461313 75443578 59992980 47753987
9773D7753987r340685p084042n041351l664483k601216j928106j430108j165671
$$ 47753987 38413302 31329260 26287909 22623426 20022210 18094104 16663996 15498325
9765A5498325q78514o50190m64842m05285m28461l44661l25940l58550m32849
$$ 15498325 14619811 13969621 13504779 13099494 12671033 12326372 12000432 11641882 11209033
9756A1209033m24079m71721m16015k18108m5716L4239K27198K38440Q5341K12269
$$ 11209033 10784954 10313233 9897218 9679110 9633394 9667633 9894831 10133271 10218612 10430881
9746A0430881L00966L29442M48373N04221L82669P9039k93625m02001l93060n40268
$$ 10430881 10731847 11061289 11509662 12013883 12396552 12475591 12181966 11779965 11386905 10846637
9736A0846637p14607j016139r88605p15818n50617k90790l16833k64636m0715
$$ 10846637 10132030 9115891 8127286 7411468 6860851 6570061 6253228 5988592 5947877
9727E947877k22766j24562j59583o5737L799M8310K42913K09452Q6512l4099k9569
$$ 5947877 5725111 5600549 5440966 5375229 5379028 5427338 5670251 5879703 5966215 5932116 5902547
9716E902547l5970J18049o5056k32456j92207j53087j55366j98848k48746j62625
$$ 5902547 5866577 5984626 5919570 5687114 5494907 5341820 5186454 4987606 4738860 4576235
9706D576235k95097j74424k45991L309k9103p2895j92399k25597j19713n8781
$$ 4576235 4281138 4106714 3860723 3864032 3834929 3762034 3569635 3344038 3224325 3165544
9696C165544q4135q5550j37034j42041n5483k9010j34133r274M7229K4113P0006
$$ 3165544 3081409 2995859 2858825 2716784 2661301 2632291 2498158 2488884 2536113 2560226 2630232
9685B630232n3892k5074M2393j00502l3600r2000j6105j13401Q308J8412O687
$$ 2630232 2576340 2551266 2593659 2493157 2459557 2367557 2351452 2238051 2246359 2264771 2271458
9674B271458o9197j98968n8982K3216n0616q7775R0203O2812p8176j5108m9821
$$ 2271458 2202261 2003293 1944311 1967527 1916911 1829136 1919339 1982151 1903975 1888867 1839046
9663A839046Q1028J25496M9003K9717m2778j2925Q3063J7001k4627j21174M0057
$$ 1839046 1920074 2045570 2094573 2124290 2081512 2068587 2151650 2168651 2144024 2022850 2062907
9652B062907P4760k7791j31676o9762j42955q9946K8722J6730K1536n2826j4849
$$ 2062907 2137667 2109876 1978200 1908438 1765483 1675537 1704259 1720989 1742525 1689699 1674850
9641A674850P5220J1482m7874q4261n8451Q6558L7088o414j41318M584r6308j3208
$$ 1674850 1750070 1761552 1713678 1629417 1570966 1657524 1694612 1688198 1546880 1551464 1455156 1441948
9629A441948J42417Q9586J428j52353r59J71620l0471j01856M1188R3483P8223
$$ 1441948 1584365 1673951 1675379 1523026 1522067 1693687 1663216 1561360 1602548 1696031 1774254
9618A774254k7882j37071j47186L4067Q9956P4534J9838Q7098o4734j39597r2895
$$ 1774254 1746372 1609301 1462115 1496182 1586138 1660672 1680510 1767608 1702874 1563277 1470382
9607A470382m5225j75441j29984O4611N0309L9236R674j3571O2373J6357j3649
$$ 1470382 1425157 1249716 1119732 1184343 1234652 1273888 1283562 1269991 1332364 1348721 1335072
9596A335072L8624J76207j3691j01397K5911m9483n9012J8158K9696n8058j71772
$$ 1335072 1373696 1549903 1536212 1434815 1460726 1411243 1352231 1370389 1400085 1342027 1170255
9585A170255p0626r895R7819n1408n0897K413J08851J07308J04690L3880q5953
$$ 1170255 1099629 1089734 1187553 1136145 1085248 1087661 1196512 1303820 1408510 1442390 1356437
9574A356437j29600J5904J34331K4538m7570m2880J0024J7955q852J2335j10405
$$ 1356437 1226837 1242741 1377072 1401610 1354040 1311160 1321184 1339139 1330287 1342622 1232217
9563A232217j01311Q8480K1167j6093j69893r7535l9919L7460K30833R6845k7376
$$ 1232217 1130906 1219386 1240553 1224460 1054567 957032 917113 954573 1185406 1282251 1254875
9552A254875j75119n7825q703M612J38283N9126r054L2584j41113L4707p4878
$$ 1254875 1079756 1021931 1013228 1017840 1156123 1215249 1206195 1238779 1097666 1132373 1057495
9541A057495K8373L6113L6196J0433L1997j5734N4672J62283J27098j25064j70337
$$ 1057495 1085868 1121981 1158177 1168610 1200607 1184873 1239545 1401828 1528926 1403862 1233525
9530A233525p9861P5741L7995j8924o4174k8497N9978l485J04894J05721o1335
$$ 1233525 1153664 1229405 1267400 1248476 1184302 1155805 1215783 1212298 1317192 1422913 1361578
9519A361578j56443q3664n8497k7791L8253k4510p6636J5534J04964q954Q2403
$$ 1361578 1205135 1121471 1062974 1035183 1073436 1048926 972290 987824 1092788 1083834 1166237
9508A166237l4924j9731j0067o3084p7210M3072P5642O8540O8388r6966M656L556
$$ 1166237 1131313 1111582 1101515 1038431 961221 1004293 1079935 1148475 1216863 1119897 1124553 1128109
9496A128109k6559p230j13181n81J43607Q730k2840k109p9430L1059J18668J19564
$$ 1128109 1101550 1094320 981139 980558 1124165 1132895 1110055 1107946 1028516 1059575 1178243 1297807
9484A297807l5499J7953L2946j76211q5286J3911M526O0357k5966K1302K3084
$$ 1297807 1262308 1280261 1313207 1136996 1051710 1065621 1070147 1130504 1104538 1125840 1148924
9473A148924K8594n5189n8163J4847P8864P0221J1669n4606O8972j7071P0838
$$ 1148924 1177518 1122329 1064166 1079013 1157877 1228098 1239767 1185161 1254133 1237062 1307900
9462A307900j11956j25796K8378l4080N9313N7445R7918j1056R4300L391p429
$$ 1307900 1195944 1070148 1098526 1064446 1123759 1181204 1279122 1268066 1362366 1365757 1358328
9451A358328J50397o3879j78374O4869K29301J40676R7867j17882O1992P3928
$$ 1358328 1508725 1444846 1266472 1331341 1560642 1701318 1799185 1681303 1743295 1817223
9441A817223j4331p6751j74781j27123j50903m9870l1728p8790o934N077k2989
$$ 1817223 1802892 1726141 1551360 1424237 1273334 1223464 1191736 1112946 1106012 1111089 1088100
9430A088100j47295n4968N9827k4026K3017j03925J01077O4107J89090J38422
$$ 1088100 940805 885837 945664 921638 944655 840730 941807 1005914 1195004 1333426
9420A333426j59518k11460q0867j25876J12153J53371K9374k8239O2487J9060
$$ 1333426 1173908 962448 881581 755705 867858 1021229 1050603 1022364 1084851 1103911
9410A103911K5174M2643J29992J01420O2219R5505J8231K82059K58067P0301j18881
$$ 1103911 1129085 1171728 1301720 1403140 1465359 1560864 1579095 1861154 2119221 2189522 2070641
9399B070641m2634o9159l4458q2912n1691j32914j97217j68566j53336j09596
$$ 2070641 2028007 1958848 1924390 1841478 1789787 1656873 1459656 1291090 1137754 1028158
9389A028158n7125j07919j904N4899j43164l9570l9217K0985L2434J30671P2422
$$ 1028158 971033 863114 861210 916109 772945 733375 694158 715143 747577 878248 950670
9378I50670J0260l182r1338r1521N0246P3196k983k4270P5298J00116o7576j69853
$$ 950670 960930 957748 866410 774889 825135 898331 895348 871078 946376 1046492 978916 809063
9366H09063J8920J45309J73628O9079K12229K2842l141M1634Q0198Q9391o3637
$$ 809063 827983 973292 1146920 1215999 1428228 1451070 1447929 1489563 1569761 1659152 1595515
9355A595515l092K1763j23467k25880j91461K2681j90559p5781o1180J34570P220
$$ 1595515 1592423 1614186 1490719 1264839 1073378 1096059 905500 829719 768539 903109 910329
9344I10329q0614p1683j23921k2510O2675n6991n997k6522O501j32022O0847P7384
$$ 910329 829715 758032 634111 611601 674276 617285 611288 584766 591267 459245 520092 597476
9332E97476K3991j4416J59009j1828k1545l5398N5032Q2760N8417q6344o7303
$$ 597476 621467 607051 766060 754232 732687 697289 752321 835081 893498 807154 739851
9321G39851o9111R6883J57603k05171k6873n418L9078J11059m848O5506k5589
$$ 739851 670740 767623 925226 720055 693182 687764 726842 837901 833053 898559 872970
9310H72970j01819j2256Q6004p1793j90809j34936r8347L1801l0180L9572L7132
$$ 872970 771151 758895 844899 773106 582297 447361 349014 380815 350635 390207 427339
9299D27339M0061O3768l2206J11234J7858P427J2236o2720l5151n7628l9022j36245
$$ 427339 467400 531168 498962 610196 628054 635481 647717 584997 549846 492218 453196 316951
9287C16951j80596n4897O7442K33186O2194J7056O0782J64457p0156Q903l9471
$$ 316951 136355 81458 148900 382086 444280 461336 522118 686575 616419 625322 585851
9276E85851j03256P5330R6536M7269j11949k26061j1200N5443Q5148m247n5061
$$ 585851 482595 557925 654461 701730 589781 363720 352520 407963 493111 488864 433803
9265D33803R386K5644n7674M8888J3843q3904J4022L6840K7613k4861M5968K7699
$$ 433803 443189 468833 411159 460047 473890 389986 404008 440848 468461 443600 489568 517267
9253E17267L0132N6164K4438p6209p0689l5383J4027l055N7053m7726p0665j83
$$ 517267 547399 603563 628001 551792 481103 445720 459747 456692 513745 466019 395354 395171
9241C95171O1844L6536K8382o0537K3671M6027P8206l5048j08007J36300O8936
$$ 395171 457015 493551 521933 461396 485067 531094 609300 574252 466245 602545 671481
9230F71481r2379n597o2813j13078m0505k4700K6521J01027Q3832P1474j1513
$$ 671481 579102 573505 510692 397614 357109 332409 358930 459957 543789 615263 603750
9219F03750p8846m5833l2527j9225J79173J32554n4242k11835m5129n7556n2710
$$ 603750 524904 479071 446544 427319 606492 739046 684804 472969 427840 370284 317574
9208C17574L8053M110P5184k7975m5803J17905J09824J38857l7927l6323o852
$$ 317574 355627 359737 434921 406946 361143 479048 588872 727729 689802 653479 646627
9197F46627M703j1990l9075P204l4590j00206j11507l1242r1095J17924J57765
$$ 646627 651330 639340 600265 607469 572879 472673 361166 329924 238829 356753 514518
9186E14518K1340q7807j35719L071n3095J13861J15761q6328j45433o0539N6366
$$ 514518 535858 448051 312332 315403 262308 376169 491930 405602 260169 199630 255996
9175B55996N0661O0973P1627M5273m0359l8450j30176J71918O4275o3702L3260
$$ 255996 306657 367630 439257 484530 444171 405721 275545 447463 511738 448036 481296
9164D81296r6694j7086j00973o8279J2622J10890J92276j6564r2422p8731l816
$$ 481296 384602 367516 266543 198264 210886 321776 514052 497488 405066 326335 322519
9153C22519R3509L7589Q59L9449k3461l9005L9164j713L808k3279o658Q1266j0816
$$ 322519 416028 453617 454476 493925 470464 431459 470623 468910 472718 449439 442781 524047 513231
9140E13231K9907J26908p5950p1611j62073m6464r664k0733n4939R668k2317J0342
$$ 513231 543138 670046 594096 522485 360412 313948 304284 283551 228612 238280 215963 226305
9128B26305N5952P4771m9613j60909J20172O8143r2022R1863k0565n0976q6427
$$ 226305 282257 357028 307415 146506 266678 334821 242799 334662 314097 263121 176694
9117A76694p4698J84921J91202P70r4595m9764l8435P9522K5130N7547n4421j19184
$$ 176694 101996 286917 478119 478889 384294 334530 296095 375617 400747 458294 403873 284689
9105B84689o0254m286Q0621J03749l1556l2202n2948p817j34390J0521J28366
$$ 284689 224435 220149 300770 404519 372963 340761 287813 279996 145606 156127 284493
9094B84493l1506j00418j7724J3801K6286q8971R2619J86084Q9768o9359Q2497
$$ 284493 252987 152569 134845 148646 174932 85961 178580 364664 454432 385073 467570
9083D67570J3749j89675j47998J3972J23210K5850O5631j0925j31731j6099q0879
$$ 467570 481319 291644 143646 157618 280828 306678 372309 361384 229653 213554 132675
9072A32675p8033o975r5438P8720m280J28523R7247k8941R305o1460n2273M6168
$$ 132675 54642 47667 -47771 30949 26669 155192 252439 223498 232803 171343 119070 165238
9060A65238k9286L6898K8303N0149J7196n2461O005K8454R4772J49277o7707j03049
$$ 165238 135952 172850 201153 251302 268498 216037 222042 250496 345268 494545 426838 323789
9048C23789M9412p9416r3002P5918J0937n6719N2378J3369j4237J15837r3845
$$ 323789 373201 293785 200783 276701 287638 230919 283297 296666 282429 398266 304421
9037C04421j27222J13135O9757p420j0541N2214J04870J4794J6002J05347j54911
$$ 304421 177199 290334 360091 352671 342130 394344 499214 514008 530010 635357 480446
9026D80446j31948P6993l6009j61915k1200J8981o958k7643m1907J04847O5620
$$ 480446 348498 425491 389482 227567 206367 225348 218390 190747 148840 253687 319307
9015C19307j4077n914J10058L9549j40368n7872k3123N8316j4350j660N8955j6861
$$ 319307 305230 299316 409374 448923 308555 250683 227560 285876 271526 269866 328821 311960
9003C11960J8479k1215P9147j52001j67138n885O5171l2458L6773k733l8219K7879
$$ 311960 330439 309224 388371 236370 69232 63347 128518 96060 132833 130100 91881 119760
8991A19760O7105M5262J60825J7363j5864R9361N3079j1387p6625o9143o3035
$$ 119760 186865 232127 392952 410315 394451 493812 546891 535504 458879 389736 326701
8980C26701q0165J22679J69091j37307j17776r0990k1932j82344m8000K6790K23541
$$ 326701 246536 369215 538306 400999 283223 192233 170301 -12043 -60043 -33253 190288
8969A90288O7590J37743J85917o5436m510J1675j41318O4873Q0181o8603k5662
$$ 190288 257878 395621 581538 516102 511592 523267 381949 446822 527003 458400 432738
8958D32738p4284j59599o4725Q3507K4192k858q105k9659p5754J8111P2853K32
$$ 432738 358454 198855 134130 217637 241829 238971 230866 201207 125453 143564 216417 216649
8946B16649r9731O4501p5939l4810R7886N2002M9619j02500m9003j11808o2771
$$ 216649 116918 181419 105480 70670 168556 220558 270177 167677 118674 6866 -55905
8935e5905J88390M7341l0656O4669M0909o370n79L1120L2428L375j14722J0715
$$ -55905 132485 179826 149170 213839 254748 248378 247799 278919 311347 314722 200000 210715
8923B10715q9124K3432L9469N8673o0677p4029J8419J35735M2719r4811J1553
$$ 210715 121591 145023 184492 243165 182488 108459 126878 262613 305332 210521 222074
8912B22074N7680K9731O1538r4325r6105L3563M8348l5767J1460q9679M2710M4707
$$ 222074 279754 309485 371023 276698 180593 214156 262504 226737 238197 148518 191228 235935
8900B35935k6278O8742q877j71213N9941L9113j22138l6781l4222K5777M7981
$$ 235935 209657 278399 269522 98309 158250 197363 75225 38444 4222 29999 77980
8889G7980O4440M3224j3878J15512O9582J22434j0624j08126j56519m1602J18368
$$ 77980 142420 185644 171766 287278 356860 479294 468670 360544 204025 162423 280791
8878B80791J28998n9613j37404o0261k0296n1306n9385K0996Q2139L9071o0537
$$ 280791 409789 350176 212772 152511 132215 80909 21524 42520 124659 163730 103193
8867A03193k5249O2336Q5341l8706k779N0962J8747Q3097O3104l7836j86934k0166
$$ 103193 77944 140280 225621 186915 184136 235098 253845 336942 400046 362210 175276 155110
8855A55110J50424q8728K1651L354j08823J6031l4046J4090q0445J0926p0736
$$ 155110 305534 216806 238457 241811 132988 149019 114973 129063 48618 59544 -11192
8844a1192m3226J8669J27772j65168P4623O2562J49793Q8149K9110j07990j11886
$$ -11192 -54418 -35749 92023 -73145 1478 64040 213833 301982 331092 223102 111216
8833A11216r6892K43629K1442j21246r6246L4848P9585o972j02070l5514N0708
$$ 111216 14324 257953 279395 158149 61903 96751 176336 169364 67294 31780 82488
8822H2488J00290K4362o4825m7071K0702L5703M4713l4427J32507N2282n4207
$$ 82488 182778 207140 142315 95244 115946 151649 196362 161935 294442 346724 292517
$$ [...]
##END NTUPLES=NMR SPECTRUM
##END=
