##TITLE=Analysis number 328137
Compound Code cc 54826
Book Reference 511/120
Project Code adrs
Chemist Name stevem
##JCAMPDX= 6.0         $$ Bruker NMR JCAMP-DX V2.0
##DATA TYPE= NMR SPECTRUM
##DATA CLASS= NTUPLES
##ORIGIN= Bruker BioSpin GmbH
##OWNER= nmr
$$ XWIN-NMR		Version 3.5
$$ Tue May  8 11:56:10 2007 GMT Daylight Time (UT+1h)  MAYBRIDGE\nmr@NMR_250MHZ
##.OBSERVE FREQUENCY= 250.131544655141
##.OBSERVE NUCLEUS= ^1H
##.ACQUISITION MODE= SIMULTANEOUS (DQD)
##.ACQUISITION SCHEME= undefined
##.AVERAGES= 16
##.DIGITISER RES= 18
##SPECTROMETER/DATA SYSTEM= dpx250
##.PULSE SEQUENCE= zg30
##.SOLVENT NAME= CDCl3
##.SHIFT REFERENCE= (INTERNAL, CDCl3, 0, 16.4488)
##AUDIT TRAIL= $$ (NUMBER, WHEN, WHO, WHERE, WHAT)
$$ ##TITLE= Audit trail, XWIN-NMR		Version 3.5
$$ ##JCAMPDX= 5.01
$$ ##ORIGIN= Bruker BioSpin GmbH
$$ ##OWNER= nmr
$$ C:\u/data/dgb/nmr/ADRS/480/pdata/1/auditp.txt
$$ ##AUDIT TRAIL=  $$ (NUMBER, WHEN, WHO, WHERE, WHAT)
(   1,<2007-05-08 11:55:41.50 +100>,<MAYBRIDGE\nmr>,<NMR_250MHZ>,
      <created by zg, POWCHK disabled, PULCHK disabled
       configuration hash MD5:
       76 6E 9A 78 1E 09 19 81 EC 84 63 8F B0 6A 59 2D
       data hash MD5: 64K
       BF C0 5B 95 28 E5 F5 04 B5 82 2D 49 51 D1 B9 81>)
(   2,<2007-05-08 11:55:57.85 +100>,<MAYBRIDGE\nmr>,<NMR_250MHZ>,
      <Start of raw data processing
       ef LB = 0.3 FT_mod = 6 PKNL = 1 SI = 32K 
       data hash MD5: 32K
       66 62 A0 15 68 5C B4 7D 2C 49 73 A9 0F C2 5D 38>)
(   3,<2007-05-08 11:55:59.48 +100>,<MAYBRIDGE\nmr>,<NMR_250MHZ>,
      <apk 
       data hash MD5: 32K
       CC 13 42 0F C7 B0 F7 16 5C F5 E7 44 EE 51 B1 DA>)
(   4,<2007-05-08 11:56:00.46 +100>,<MAYBRIDGE\nmr>,<NMR_250MHZ>,
      <abs ABSG = 5 
       data hash MD5: 32K
       53 FC 42 48 B5 0E 86 7C 60 EB 66 6A 96 D5 1E DD>)
$$ ##END=
$$ 
$$ hash MD5
$$ AB 8C 67 D1 3B 26 54 D3 8B A3 96 F3 2A EF F7 BA
##$RELAX= 
##$RELAX= 
##$RELAX= 
##$RELAX= 
##$RELAX= 
##$RELAX= 
##$RELAX= 
$$ Bruker specific parameters
$$ --------------------------
##$DU= <C:\u>
##$EXPNO= 480
##$NAME= <ADRS>
##$PROCNO= 1
##$TYPE= <nmr>
##$USER= <dgb>
##$AMP= (0..31)
100 100 100 100 100 100 100 100 100 100 100 100 100 100 100 100 100 100 
100 100 100 100 100 100 100 100 100 100 100 100 100 100 
##$AQSEQ= 0
##$AQ_mod= 3
##$AUNM= <au_zg>
##$AUTOPOS= <7 >
##$BF1= 250.13
##$BF2= 250.13
##$BF3= 250.13
##$BF4= 250.13
##$BF5= 500.13
##$BF6= 500.13
##$BF7= 500.13
##$BF8= 500.13
##$BYTORDA= 1
##$CFDGTYP= 0
##$CFRGTYP= 5
##$CHEMSTR= <none>
##$CNST= (0..31)
1 1 145 1 1 1 1 1 1 1 1 1 1 1 1 1 1 1 1 1 1 1 1 1 1 1 1 1 1 1 1 1 
##$CPDPRG= <>
##$CPDPRG1= <>
##$CPDPRG2= <>
##$CPDPRG3= <>
##$CPDPRG4= <mlev>
##$CPDPRG5= <mlev>
##$CPDPRG6= <mlev>
##$CPDPRG7= <mlev>
##$CPDPRG8= <mlev>
##$CPDPRGB= <>
##$CPDPRGT= <>
##$D= (0..31)
0 1 0 0 0 0 0 0 0 0.06 0 0 0 0 0 0 0.0002 0 0 0 0 0 0 0 0 0 0 0 0 0 0 
0 
##$DATE= 1178621737
##$DBL= (0..7)
120 120 120 120 120 120 120 120 
##$DBP= (0..7)
150 150 150 150 150 150 150 150 
##$DBP07= 0
##$DBPNAM0= <>
##$DBPNAM1= <>
$$ [...]
##$SUBNAM7= <"">
##$SUBNAM8= <"">
##$SUBNAM9= <"">
##$SW= 20.6930455092707
##$SWIBOX= (0..15)
0 0 3 0 0 0 0 0 0 0 0 0 0 0 0 0 
##$SW_h= 5175.983436853
##$TD= 65536
##$TD0= 1
##$TE= 683.16
##$TE2= 300
##$TE3= 300
##$TEG= 300
##$TL= (0..7)
0 120 120 120 120 120 120 120 
##$TP= (0..7)
150 150 150 150 150 150 150 150 
##$TP07= 0
##$TPNAME0= <>
##$TPNAME1= <>
##$TPNAME2= <>
##$TPNAME3= <>
##$TPNAME4= <>
##$TPNAME5= <>
##$TPNAME6= <>
##$TPNAME7= <>
##$TPOAL= (0..7)
0.5 0.5 0.5 0.5 0.5 0.5 0.5 0.5 
##$TPOFFS= (0..7)
0 0 0 0 0 0 0 0 
##$TUNHIN= 0
##$TUNHOUT= 0
##$TUNXOUT= 0
##$USERA1= <user>
##$USERA2= <user>
##$USERA3= <user>
##$USERA4= <user>
##$USERA5= <user>
##$V9= 5
##$VALIST= <valist>
##$VCLIST= <CCCCCCCCCCCCCCC>
##$VD= 0
##$VDLIST= <DDDDDDDDDDDDDDD>
##$VPLIST= <PPPPPPPPPPPPPPP>
##$VTLIST= <TTTTTTTTTTTTTTT>
##$WBST= 1024
##$WBSW= 4
##$XGAIN= (0..3)
0 0 0 0 
##$XL= 0
##$YL= 0
##$YMAX_a= 228053
##$YMIN_a= -150461
##$ZGOPTNS= <>
##$ZL1= 120
##$ZL2= 120
##$ZL3= 120
##$ZL4= 120
##$ABSF1= 16.44882
##$ABSF2= -4.244352
##$ABSG= 5
##$ABSL= 3
##$ALPHA= 0
##$AQORDER= 0
##$ASSFAC= 0
##$ASSFACI= 0
##$ASSFACX= 0
##$ASSWID= 0
##$AUNMP= <proc_1d>
##$AZFE= 0.1
##$AZFW= 0.1
##$BCFW= 0
##$BC_mod= 0
##$BYTORDP= 0
##$COROFFS= 0
##$CY= 12.5
##$DATMOD= 1
##$DC= 0
##$DFILT= <>
##$DTYPP= 0
##$F1P= 14.0000005364418
##$F2P= -0.99999901652339
##$FCOR= 0.5
##$FTSIZE= 32768
##$FT_mod= 6
##$GAMMA= 0
##$GB= 0
##$INTBC= 1
##$INTSCL= 1
##$ISEN= 128
##$LB= 0.3
##$LEV0= 0
##$LPBIN= 0
##$MAXI= 10000
##$MC2= 0
##$MEAN= 0
##$ME_mod= 0
##$MI= 0
##$NCOEF= 0
##$NC_proc= -5
##$NLEV= 6
##$NOISF1= 0
##$NOISF2= 0
##$NSP= 0
##$NTH_PI= 0
##$NZP= 0
##$OFFSET= 16.44882
##$PC= 1
##$PHC0= -48.49974
##$PHC1= 5.295158
##$PH_mod= 1
##$PKNL= yes
##$PPARMOD= 0
##$PSCAL= 4
##$PSIGN= 0
##$REVERSE= no
##$SF= 250.130018302862
##$SI= 32768
##$SIGF1= 0
##$SIGF2= 0
##$SINO= 400
##$SIOLD= 32768
##$SREGLST= <1H.CDCl3>
##$SSB= 0
##$STSI= 32768
##$STSR= 0
##$SW_p= 5175.98343685301
##$SYMM= 0
##$S_DEV= 0
##$TDeff= 65536
##$TDoff= 0
##$TI= <Analysis number 999999
Compound Code 99
Book Reference 9
Project Code 9>
##$TILT= no
##$TM1= 0
##$TM2= 0
##$TOPLEV= 0
##$USERP1= <user>
##$USERP2= <user>
##$USERP3= <user>
##$USERP4= <user>
##$USERP5= <user>
##$WDW= 1
##$XDIM= 32768
##$YMAX_p= 566890654
##$YMIN_p= -861743
$$ End of Bruker specific parameters
$$ ---------------------------------
##NTUPLES= NMR SPECTRUM
##VAR_NAME=  FREQUENCY,     SPECTRUM/REAL,   SPECTRUM/IMAG
##SYMBOL=    X,             R,               I
##VAR_TYPE=  INDEPENDENT,   DEPENDENT,       DEPENDENT
##VAR_FORM=  AFFN,          ASDF,            ASDF
##VAR_DIM=   32768,         32768,           32768
##UNITS=     HZ,            ARBITRARY UNITS, ARBITRARY UNITS
##FACTOR=    0.157963299565203, 1,           1
##FIRST=     4114.34367620926, 0,            0
##LAST=      -1061.63976064375, 0,           0
##MIN=       -1061.63976064375, -861743,     0
##MAX=       4114.34367620926, 566890654,    0
$$ Real data points
##PAGE= N=1
##DATA TABLE= (X++(R..R)), XYDATA
$$ [...]
27140 175783 119005 193989 160330 94932 -100364 -171150 -162736 59639 341780 359215 424094
27129 424094 265308 80009 151709 176783 107914 -39971 11031 -127406 -365792 -406086
27119 -406086 -404954 -481839 -442150 -425822 -253436 -138724 -231362 -205110 6175 248769 186441
27108 186441 118661 419654 523642 667353 546696 288115 96097 280147 398939 438775
27098 438775 332849 178268 25410 229767 287224 122624 11500 -38312 -121351 -110676
27088 -110676 155410 60534 28167 125989 16609 -32570 12365 235742 340888 197929
27078 197929 -16328 -147998 -110144 -16855 -38094 -119725 -43558 66884 48505 149642 434449
27067 434449 298908 -61842 -297132 -193261 77860 28383 -199086 -212055 -340762 -202555
27057 -202555 -255050 -131018 52658 235908 83265 95345 261317 -98143 -247127 133469
27047 133469 326448 362020 292586 150196 -51852 -154265 198597 457655 230887 58634
27037 58634 67703 -43672 58004 166121 151801 332696 226492 212911 222282 132257 129999
27026 129999 208493 -96398 -100568 -73480 -5621 135284 -89940 -264830 -305193 -391190 -184120
27015 -184120 296408 272590 155439 234351 245082 100089 95254 -9939 -118774 -29955 158947
27004 158947 222391 195048 8994 -149777 -46674 -46388 -50050 -129853 -152105 -105998 -77555
26993 -77555 -42846 111557 -58011 -294967 -100712 32217 91971 57610 -192053 -305433
26983 -305433 -101238 92597 78343 101642 117877 -14416 -158604 -37169 44841 116077
26973 116077 320161 50267 -103319 -165019 -188943 -11994 -70206 -90546 -92715 26354 21207
26962 21207 -66451 -52741 52549 -149865 -340180 -75869 188209 226357 196805 14485
26952 14485 35203 150608 54913 209811 242086 127495 67224 -4931 11612 112484 245554
26941 245554 143633 108206 8578 -233569 600 134353 230901 477300 316008 312635
26931 312635 222684 176451 513208 571565 516046 306857 174338 218700 341276 154805
26921 154805 240599 384869 523582 546723 465469 243254 106468 104768 310103 331092 121356
26910 121356 -132753 78068 206093 209140 -66607 -111365 269626 219124 25394 -31578
26900 -31578 138278 301240 340346 135933 -28538 24416 47176 89090 -26750 -21797 210803
26889 210803 268672 119967 -76066 -147898 85985 189510 164576 264875 267375 223330 180970
26878 180970 252354 129278 90503 112550 65117 -32467 193763 290923 195057 48671 -45665
26867 -45665 -181453 -190623 121800 124871 122755 217928 20450 -327523 -572165 -499035 -133547
26856 -133547 320094 174324 -39028 -22952 96961 34650 -25780 176299 198543 88308
26846 88308 -29186 -113373 -128917 156231 516316 187756 -67459 -50081 -52691 16510 -16128
26835 -16128 -219514 -618750 -498830 -542729 -550351 -215035 99682 296161 263400 -7850
26825 -7850 -7922 -278563 -203091 66386 208108 256567 54810 45325 101302 -21990 -162918
26814 -162918 -214722 -195685 -120073 -60126 -126281 36407 -100170 -145938 46034 394220 446656
26803 446656 97025 73980 405149 335334 175871 88535 -40215 -75792 -232839 -254967
26793 -254967 -217081 -97018 -177523 -314882 -240386 -348383 -436004 -292773 -371027 -404380 -339372
26782 -339372 -140533 84248 -6954 86163 1804 -153509 -284017 -299655 -342146 -318002 -563271
26771 -563271 -324654 -105039 81939 72541 -35526 -218611 -287361 -253978 -415078 -545687
26761 -545687 -261592 -140410 -52033 -144757 -203082 -78137 -92636 26760 196420 162143
26751 162143 136123 15161 21769 182802 130349 162854 68349 -28844 -131839 115511 218127
26740 218127 23403 32948 107178 -112603 -8996 -106530 -295729 -155790 -154218 -352792 -370380
26729 -370380 -145724 -233559 -280456 -110956 184823 45857 -85269 87791 350106 259733
26719 259733 -92855 -228750 -116115 206563 386863 120300 -98384 -38429 101210 143489
26709 143489 251235 216225 -65668 -229923 -176082 -10790 287863 183289 -73616 66733
26699 66733 89508 105023 157720 154667 231633 319516 288530 -26824 -80384 15729 -32195 147948
26687 147948 103141 95607 37028 233054 18212 -53424 -80723 30303 189804 65151 -17809
26676 -17809 -111457 132504 223012 -60999 -304917 -170824 -123127 -221216 -290503 -334402 -423531
26665 -423531 -639341 -581030 -252983 42567 103282 -285677 -421367 -429233 -104407 168118
26655 168118 257469 339486 383928 162060 -104127 -96746 83595 187599 205598 262845 178816
26644 178816 57115 46381 -31983 -208129 -117601 -96691 -68766 -6747 -220383 -516491 -472790
26633 -472790 -13593 280419 374502 321640 86074 -81395 140641 88575 -77568 -82275
26623 -82275 72832 37002 23698 -215911 -157055 -76854 73566 -26333 -117040 -41322 -250084
26612 -250084 -232240 -88687 -45970 225197 362100 466707 103175 -40716 45031 55346
26602 55346 -26934 129697 143278 153835 121688 92073 415767 368816 178853 147215 235435
26591 235435 337750 439272 340432 186157 250509 -30766 16247 116519 165919 320008
26581 320008 321385 84511 -191074 -527708 -652151 -498167 -411560 -145413 126380 193177
26571 193177 85785 87739 211894 364942 453373 212984 264882 150335 175864 100471 301454
26560 301454 281583 254873 312088 371823 336634 212873 97258 -134657 -138774 -81196 105003
26549 105003 232297 322364 452316 509176 446833 215680 -37366 -37533 62864 -12408 44167
26538 44167 33306 29225 21207 -10976 95325 276167 549790 587280 430882 -40899 -110093
26527 -110093 -89407 -156066 -414349 -324374 -250981 -476409 -521363 -627166 -217025 40555
26517 40555 155370 391841 254851 -2138 28815 -36627 -79627 111517 -42465 -114014
26507 -114014 105076 226805 105131 206681 248996 5582 31945 228850 413869 462983
26497 462983 369821 221867 -14200 -168187 67703 210969 269133 184517 83933 -54099
26487 -54099 -39412 15229 -1673 162539 263043 202616 359308 309265 134253 269366 290438
26476 290438 95332 154711 165036 -7039 -117706 -141107 -265898 10639 29940 -191471
26466 -191471 -81393 -22215 82647 144272 131931 -10966 -202402 -148058 -146142 -71003 -116827
26455 -116827 -120661 -171707 -464246 -477410 -334258 -234988 -296999 -436006 -379095 -201285 11330
26444 11330 32990 -165225 -312958 -244463 -143526 -22741 -24660 179007 369904 143245
26434 143245 -80393 -331083 -264541 -125508 -251094 -177945 -55494 -126808 -46252 -106520
26424 -106520 18457 -46020 -168057 -230097 -222375 -505958 -351673 -311163 26777 -47982 149425
26413 149425 310467 268710 181021 89822 -94991 -181976 -92663 59923 200187 74769
26403 74769 -120392 -167427 -13246 74498 -25816 -196603 -115053 -96 -62373 -120699 109577
26392 109577 495213 289176 276218 307188 125273 105131 116447 103130 63238 62911 -154188
26381 -154188 -124177 -37484 -162572 -63432 50394 -60728 -193186 -280027 -170805 -38757
26371 -38757 -5522 12252 -65127 -87287 115836 8357 8684 59788 -107832 -197832 102802
26360 102802 165697 -94396 -114483 -65448 244842 240275 318080 301284 367134 414395 47636
26349 47636 -219505 -295888 -287529 -429018 -173081 107111 25085 -135152 105177 526542
26339 526542 224509 -131458 3868 52507 -223239 -337245 -78328 109583 -3226 -26973
26329 -26973 -144968 -219913 -112457 -17116 258400 608129 573908 365855 382467 505057
26319 505057 415272 313542 256003 304224 236230 271127 134837 272518 257675 289490 331775
26308 331775 146385 155446 104972 -98811 -486641 -472324 -489241 -218217 -102845 -130465 -90925
26297 -90925 70159 -147764 -172041 14391 34116 -41994 307296 432421 288912 -49598
26287 -49598 -226245 -266536 -259113 -373665 -255016 -183316 -187348 -207171 -55950 161943 97118
26276 97118 15902 212554 389858 358905 290965 219554 130641 -63249 -51677 169218 213969
26265 213969 307682 339609 470774 559904 536792 414631 217297 36518 35850 -97501 10277
26254 10277 -116544 -99029 -27752 136786 168624 31982 -44337 -46803 -66738 53525 173668
26243 173668 269304 272414 377182 272694 25563 6830 58481 133871 -49197 -61786 150820
26232 150820 159541 113346 122373 -36745 -83316 28427 78238 235774 357039 464732 224407
26221 224407 -40726 -157935 -306413 -457095 -209746 -11000 -156914 -463824 -403476 -222704
26211 -222704 -113797 26143 64576 52813 -19163 45123 106777 258427 211063 -20549 90531
26200 90531 244579 222686 78166 266867 361268 348004 155337 18180 218282 370720
26190 370720 311853 93187 144124 -54222 -199024 -154453 -201959 -159179 -88497 -103027 -375287
26179 -375287 -271809 -196090 148700 298181 186160 113677 68082 322792 183493 26099
26169 26099 43881 -19696 -136516 -94871 -48915 72329 -160709 -275237 -111292 -143166 -166720
26158 -166720 -29282 69666 -1141 -177454 -197654 -143944 -90993 -14358 281867 254800 168611
26147 168611 -1624 -109430 -28998 -309579 -224016 17209 -8837 2641 -73751 -123842 -15954
26136 -15954 104523 -53007 -260482 -193219 -36473 98861 300945 163826 76657 -11492
26126 -11492 148459 79276 -66516 -87711 -61042 -85618 -261761 -122420 -51154 73780 135147
26115 135147 224950 333154 243588 131672 199478 145 -67944 46692 -96921 -157928
26105 -157928 -40447 -97328 -133415 -111232 -39217 49574 38234 -79758 -90571 -145716 -154629
26094 -154629 -391945 -432264 -246304 -120878 -157154 -164777 37919 -5566 -223959 -220661 -204659
26083 -204659 -129443 -66825 222384 188019 -135796 92294 131763 53834 -37286 -103130 -32156
26072 -32156 213913 298755 -69801 -163727 203836 341427 171020 -99621 74630 31153
26062 31153 -146701 -334861 -203870 141666 79567 182871 151038 365496 403485 362181
26052 362181 156025 34707 -50624 -102824 61300 96301 -16021 -79148 65893 4726
26042 4726 -38040 -145430 -201545 -426839 -320012 -123670 113347 65910 -36022 211195
26032 211195 244156 -1429 -170718 5765 158322 21449 20988 -107205 -88166 -174093 -271943
26021 -271943 -196706 -203583 -99396 152239 -160394 -242791 -173347 -45932 225597 -41439
26011 -41439 -340282 -122918 112762 161419 96727 -125590 -329906 -231659 -187806 -297671
26001 -297671 -422694 -212504 -13245 24545 -215631 -90916 -196028 -282639 -265335 -289043
25991 -289043 -282187 -19311 193211 457762 287613 69108 -34224 -147592 -289561 25579
25981 25579 213286 128684 69889 -186243 -428739 -357022 -266148 -188767 -280219 -434500 -180320
25970 -180320 -100233 -213891 -433664 -212137 -7652 49309 148265 41469 77198 173368
25960 173368 13548 27313 -84534 -201641 -453727 -238307 -81407 -71807 123397 519172
25950 519172 313084 251292 434763 323565 -64124 -23744 -9553 -102011 -179703 -307409
25940 -307409 -229128 -184096 -94454 -268350 -259699 -169322 -10620 -134988 -494111 -744491 -552602
25929 -552602 -280503 3753 -11350 -30334 -59784 -102831 13498 204104 334322 181435
25919 181435 -86870 -285670 -25454 -32221 -171065 -144801 99697 53548 -55106 -64249 92496
25908 92496 119081 70240 -217901 -426569 -243334 -73806 -58417 38270 204096 -126785
25898 -126785 -269855 -370823 -198697 -46478 -119777 -118423 -33769 -233841 -214219 69135
25888 69135 26738 -51139 -181425 -50199 180762 179394 168534 300084 363637 488870 429538
25877 429538 267015 246825 348297 328411 156928 181389 180486 117533 413797 424309 225012
25866 225012 118089 -74901 -34325 185439 129593 51299 129343 357797 246962 156769
25856 156769 149858 126479 74376 -153937 -179756 -190029 -188578 -99771 13400 -60895 10146
25845 10146 255921 189206 13149 -87912 -231628 -380719 -335011 -174773 -218386 -376476
25835 -376476 -340544 -111812 -162305 -423588 -387992 -122240 -270204 -295018 -228647 -308621 -382594
25824 -382594 -346866 -433528 -346555 -339057 -74052 -37504 131856 68568 -473 77045 155809
25813 155809 -30954 -19681 -41658 137068 215016 30708 -92966 -67925 -231583 -213401
25803 -213401 -135854 -94739 -277585 -411798 -347581 -139458 97278 -80404 -209613 -300228
25793 -300228 -182896 -148965 -112286 -42217 9403 185000 217940 267487 172019 227434 117551
25782 117551 55646 -73876 -106950 -139599 53999 162717 238589 251689 153650 67333 148762
25771 148762 189363 -3343 -45140 126098 -12514 -268928 -175898 4203 125617 294046
25761 294046 453470 192818 -52800 -233619 -120165 157497 138973 -133203 32204 88918
25751 88918 -183856 -272075 -144242 -189058 -152305 -136723 178584 448189 480379 300123 31929
25740 31929 151649 253306 163098 294091 233809 191849 4479 -201982 -113692 139900
25730 139900 -18429 59552 149196 202991 55333 79233 -60786 -90716 7386 210287 225861
25719 225861 136659 257051 271931 241300 226285 -145677 -440666 -434068 -27079 -116357 -200652
25708 -200652 -249316 -388418 -214456 769 -63791 -53808 50583 -87019 -51510 -138942 -329540
25697 -329540 -350009 -426241 -402120 -17552 427887 810030 602157 390881 286477 83288
25687 83288 184 -43567 -250418 -140735 -126429 -224904 -341744 -236936 -86748 22340
25677 22340 77935 -62278 -61465 -57105 -13569 -116127 -278503 -296092 -33712 -42921 -70652 11412
25665 11412 74494 167742 122174 13977 134806 -124829 -134545 -188543 -174573 -114251 -202184
25654 -202184 -198551 -103017 111573 122859 -118973 -275530 -358243 -341664 -167253 195412 373392
25643 373392 310194 210393 360043 356067 396167 543099 391634 -22910 -135394 76017
25633 76017 170322 23877 32447 70728 84950 -285869 -408533 -263176 -350509 -405741 -197385
25622 -197385 -27806 -200551 -373081 -353002 -284912 -181445 -40220 -156691 -314224 -344016
25612 -344016 -217044 -162897 -289730 -385928 -154762 -200973 -422641 -194551 11630 197315
25602 197315 189665 240570 55671 -114202 -164408 -166868 -130285 -165867 51904 473815 284224
25591 284224 170943 426049 356222 111674 22422 82571 43663 -27603 -15855 38058 216710
25580 216710 359031 326258 163218 52581 -176326 -126855 -97473 -209072 -130826 -229532
25570 -229532 -245783 -144038 213729 405581 361758 194496 230369 357418 391295 21681
25560 21681 -247144 -198369 -139650 -277036 -391204 -258122 695 -1174 -24222 116857 19962
25549 19962 211805 467842 424998 28763 -301259 -365529 -155738 190662 97042 -94751
25539 -94751 -244217 651 235261 349536 275126 141402 60860 14984 55234 -109495
25529 -109495 -128363 -271101 -260976 -62070 -34264 -98211 176013 337992 294600 43486
25519 43486 31199 140348 122311 285650 256919 114785 363837 326863 127300 107676 48018
25508 48018 62928 149270 272514 242661 218634 303964 340256 277834 101026 -127077 -255031
25497 -255031 -117909 50698 -166014 -226028 -272982 -267600 -35874 -243831 -281663 -59980
25487 -59980 -19894 -128996 -232734 -67617 -29216 -58731 77857 16804 -59934 -210191 -87764
25476 -87764 173200 112801 7205 223766 173300 -56614 123905 164993 -37392 -320071
25466 -320071 -253426 -266274 -153454 -25622 -27752 56021 406561 376673 484232 563845 358360
25455 358360 201444 222854 58820 -118974 147160 81190 142648 -30742 -66797 311121
25445 311121 257382 219974 303777 477438 200193 -194571 31385 172513 124501 220015
25435 220015 166820 60949 -188446 -167794 -143237 -144771 -50323 -140071 100747 199492 111128
25424 111128 58651 -43023 -239277 -273681 -48835 131453 284202 304709 96565 -406062
25414 -406062 -370135 -133136 134473 285350 -22869 -116641 42300 186522 177636 339280
25404 339280 320668 161894 -197977 -126362 310517 626172 657996 543354 206576 -104771
25394 -104771 -184010 -52400 138887 349372 136217 14617 -260642 -416697 -332909 -294144
25384 -294144 -426206 -379952 -409533 -298899 -32506 -200487 74126 104380 139817 99424
25374 99424 -32429 -45682 21395 -12327 -22942 83939 256175 116491 -11518 -32049 146545
25363 146545 103829 -84942 -140065 -219173 -267679 -120659 146583 188124 181302 68915 -149589
25352 -149589 -73933 -65891 -229129 -242556 -206772 -301539 -136432 -36909 28375 14290 -9468
25341 -9468 -89759 -258417 -278013 6394 106048 74381 188511 304870 318640 60701 -162428
25330 -162428 -271189 -131832 83006 215016 9444 -215912 -252098 -330866 -432799 -562775
25320 -562775 -584188 -359175 -471922 -475382 -442827 -277126 -51186 -58347 -53822 -12418 104475
25309 104475 239457 134868 -2743 -94397 -41810 -186009 -473446 -466786 -140212 83357
25299 83357 92049 -14994 -140114 45959 357770 247790 -11176 -177394 132268 121587
25289 121587 65506 -219121 -297039 -390343 -226145 49234 267317 108373 170999 280235
25279 280235 299996 427995 340732 337289 46557 -153408 -256469 -238291 -163504 -41014 -109373
25268 -109373 -180392 -288782 -291839 -393772 -405520 -273446 -124861 -100603 -101110 172492 224744
25257 224744 92153 40288 135915 229816 354126 348073 127270 269300 361149 363170 224716
25246 224716 79490 86359 6345 -246954 -170377 -133156 88207 435913 268080 55637
25236 55637 -208203 -387436 -350286 -376556 -267749 -76370 -99364 -17401 -2759 -275918 -327101
25225 -327101 -160421 -51283 -15007 359589 489728 474847 318835 81472 -282833 -379132
25215 -379132 -393586 -343490 -219314 -99856 -270454 -184072 -205860 -141309 -62159 -166809 -146176
25204 -146176 -19964 -32960 125830 340100 357749 299518 77972 77500 172155 228406 129846
25193 129846 -115728 -165486 -1486 108336 123867 -105145 -306326 -437404 -326939 -234040
25183 -234040 39642 230049 -10856 -37703 97035 168842 159262 165519 -7341 -38059 167122
25172 167122 143857 -205491 -347568 -102164 -35655 -130447 -282980 -285708 -125412 128504
25162 128504 37502 -84429 -192199 -235176 -59125 124321 70817 16778 -69350 180842
25152 180842 224987 137926 138145 214979 56694 -12175 -64837 -379934 -118439 -28989 -248151
25141 -248151 -266099 2336 86857 170394 75531 -48322 4470 116044 60586 32703 -24794
25130 -24794 185512 277394 143490 52300 127687 80478 -45946 40883 333684 346185 130726
25119 130726 -37752 14339 -119796 -208581 -263123 -259192 -247627 -401963 -368201 -246579 -228382
25108 -228382 -319093 -465367 -444459 -220616 -71996 99732 209011 336940 250197 248432
25098 248432 -113439 -228146 42536 59866 225097 226354 -86410 -113812 -98941 -189264 -92786
25087 -92786 24400 110557 117395 78962 79545 -128469 -471503 -325054 -276905 -95253 54142
25076 54142 182873 322392 292602 107376 191415 -9023 -143438 46249 399650 485789
25066 485789 228761 289650 228803 13326 16128 130451 92086 -89059 -27751 131459 -10626
25055 -10626 99244 336961 206753 152272 408582 507142 261650 -97367 -184579 -75926
25045 -75926 163138 202876 57655 44632 -10003 -1831 -34204 58920 13194 -76211 84278
25034 84278 279427 332709 459541 223849 -30498 659 137465 -15086 2281 -163802
25024 -163802 -213967 -800 186140 238665 140301 -126095 -139666 -198287 -245052 -151353 -193327
25013 -193327 -261116 -90767 -185533 -19801 -42938 -311806 -338418 -11083 107727 202320
25003 202320 165783 93315 -139568 16545 37394 -182156 -203517 -131214 -227035 -274431 -137311
24992 -137311 -155630 -203275 -132423 -51498 -61922 -113740 -12959 -141845 -280055 -139998 9687
24981 9687 -142157 -56772 -23727 139513 406032 543246 506501 280905 -94603 -66408 -139145
24970 -139145 -252365 -125002 -157740 -331335 -339750 -290198 -180107 -125208 -360205 -355734 -40944
24959 -40944 235649 380345 419018 351534 -4856 -18534 -145213 -243697 -57493 48228
24949 48228 14150 -102961 -141557 -28746 -12362 111289 285560 257409 18930 -119430
24939 -119430 -19994 -27273 -170811 -350923 -247508 100708 163978 -73085 -430280 -281973
24929 -281973 -31429 103958 -26543 -247293 -310500 -212305 -131392 -9453 -125053 -141141
24919 -141141 -40868 86725 240588 270264 250974 352734 395091 349060 415698 501925 545923
24908 545923 566779 437023 66404 -213346 -268661 -148733 -48888 28989 130446 214492
24898 214492 -192274 -290884 -45241 52271 -73322 -24392 137898 124674 -11130 -259046
24888 -259046 -10572 56963 -137438 -117697 22061 152837 147085 -186509 -38826 -76476
24878 -76476 -19871 401735 173285 -335372 -156844 143519 154854 153417 81177 156009 59499
24867 59499 -69427 -97336 -134419 -138966 -17877 158853 25772 -351121 -260056 -150976 -48065
24856 -48065 -76166 -208163 -185061 -122487 98853 233842 391274 262353 -83673 -297846
24846 -297846 -151366 141356 92395 14216 -12489 -42331 66864 27306 -266405 -183250 -15343
24835 -15343 -99652 88819 264072 205548 146751 50272 110313 -101206 -299463 -235292 102261
24824 102261 124787 -87894 -48014 -32551 189215 108002 1370 17296 216048 284389 154562
24813 154562 59676 63085 115138 88857 -56879 -127538 -251159 -241422 227736 506078 455892
24802 455892 421900 423982 368064 403640 511241 481480 438956 225699 160343 145518 125139
24791 125139 94129 59983 -139805 -412784 -315052 -129002 -86695 -246901 -296389 -269739 -381207
24780 -381207 -375332 -227960 -227546 -228729 -207640 -257981 -218184 -41227 -15324 -33742 -105374 -120004
24768 -120004 -98856 66385 116822 317451 177178 85387 136692 110099 -63727 -198644
24758 -198644 -209668 2189 77800 -19237 114040 272958 233006 -105621 -117564 209154
24748 209154 240932 -23407 -234122 -160455 3330 220959 9458 -312052 -353062 -447890
24738 -447890 -334128 -64066 2838 -15702 -100088 -140651 -205605 -258678 -130487 98331 38409
24727 38409 -98931 -155236 27077 124808 -124565 -92299 -49487 -92787 -126403 -219885 -445313
24716 -445313 -422164 -374940 -256903 72172 71878 -198025 -337213 -236045 -117940 -15823
24706 -15823 -101301 -97792 -290380 -256698 -209687 -153289 -68977 -40612 -84057 104221 224731
24695 224731 194218 187875 111269 61921 290627 259803 269119 -60104 -432562 -465865 -267099
24684 -267099 24749 85614 -16262 -205979 -194195 240784 349823 145351 -166393 -23844
24674 -23844 127936 120859 28663 292131 258482 32029 -11286 -142268 -85721 -146388 -88263
24663 -88263 227848 282243 68838 -75433 -39266 -124457 21513 211065 187216 -191393
24653 -191393 -196593 -188669 -182042 -182287 -189374 -239971 -141301 -17989 -155715 -301513 -376450 -407593
24641 -407593 -498438 -381112 -219307 -156410 -310727 -417834 -209318 -145937 -174957 40322
24631 40322 221348 165208 -5430 -206106 -444136 -361496 -235539 124833 141461 -161765
24621 -161765 -316987 -281001 -409347 -443248 -207404 -143811 -147474 36082 401679 608741
24611 608741 288481 -107473 -150731 91158 175165 9324 -101016 -277961 -379768 -221632
24601 -221632 -10947 -20807 -116420 -144675 -85975 -210683 -394918 -396008 65439 125408 -34106
24590 -34106 -48753 -548 76503 124563 64259 -73751 -204621 -364591 -244722 -125645 -41589
24579 -41589 -162165 -332827 -113766 35058 -110545 -181563 -204073 -5414 255379 462450
24569 462450 636607 362505 164428 32735 44371 -3329 48721 -34586 120270 146909
24559 146909 145505 100686 -98334 -378035 -381156 -238274 -63010 19618 -97856 -231919 -286016
24548 -286016 -144548 -307828 -400840 -370791 -337183 -326885 -310653 -463360 -389530 -253700 -324700
24537 -324700 -93553 9808 -13711 -42968 -35142 138075 71456 -18480 156033 320839 250995
24526 250995 296987 221314 159916 217021 90953 153788 339401 294063 103876 80183 128034
24515 128034 43159 -107135 -12857 159302 -10350 -103970 -216852 -265393 -317341 -121047
24505 -121047 -14347 -31377 51412 82262 -110502 -139753 -77744 -47435 30918 -43462 -84411
24494 -84411 -415081 -418963 -183929 -54153 -2453 -6966 -132023 -274569 -110605 -115197 -297342
24483 -297342 -394084 -299231 8510 -119214 -56077 82292 121082 23958 -154959 -343340
24473 -343340 -316056 -430632 -316031 -183510 -259892 -242458 -11391 39649 150413 105877
24463 105877 124627 79726 330855 322597 -74335 -201601 -77684 375336 463924 355343
24453 355343 145789 123744 145970 32690 112358 250369 337597 30216 -105006 -213873
24443 -213873 -354506 -307278 -204911 -221495 -431638 -248272 -291786 -249054 -264662 64359
24433 64359 283410 98434 -59435 57518 -114059 -245196 -446803 -425555 -602624 -497807
24423 -497807 -383497 -204312 -63720 -192877 -277773 -354911 -222454 -187162 -70971 145536
24413 145536 343470 184089 92387 -241396 -376724 -504627 -605415 -503464 -323204 34845
24403 34845 127225 -169282 -47771 19260 -93801 -86390 114285 120269 75776 -84313 -145231
24392 -145231 28978 66105 -31070 -252379 -163279 112783 187803 -15110 85272 88471 36392
24381 36392 -12561 83274 22406 -18451 58745 -134651 119496 122960 159300 281328 326647
24370 326647 325429 145666 125329 127618 197795 497722 633285 467539 214465 27569 -94268
24359 -94268 -117205 -32015 -86903 81607 49118 112143 156770 -54588 -139507 -135777 -110200
24348 -110200 -136863 -161967 78533 132203 36553 -238814 -528688 -177992 -102384 -373561
24338 -373561 -575469 -552177 -445239 -355722 -345584 -216143 24274 139199 -123720 -501470
24328 -501470 -249826 -48886 -15457 -20402 -119853 -227645 -146915 -44733 93055 -41514
24318 -41514 29984 -57323 -179275 -297679 -336717 -167041 -126852 -178042 -283691 -415667 -75258
24307 -75258 203491 -83025 -88529 -15584 224713 93542 -4694 -117845 -89823 126059 218107
24296 218107 100859 14213 -200164 12962 65445 292395 47710 -279089 -381986 -210312
24286 -210312 86488 116509 225260 311152 254398 189731 122994 -24018 53454 191424 234649
24275 234649 150266 315501 273944 37348 -158733 -175178 -130558 -109876 102459 260001
24265 260001 347406 531332 565114 340622 20380 -125551 -103970 -183783 -144264 64636
24255 64636 119471 71076 -133459 -288358 -312822 -115291 -35355 59650 37407 307631 293643
24244 293643 205632 246193 46237 19885 56543 -23804 59020 -143511 -194803 -232211 -306368
24233 -306368 -273870 -247217 -149754 60759 151068 25931 -151724 -148549 -234392 -284390 -135611
24222 -135611 -67775 98595 233243 77908 34325 167080 -112458 -280393 -58372 74478
24212 74478 90272 115563 44959 -70534 -158812 -197533 -197674 -10839 344709 573535 458098
24201 458098 62838 -141333 -71316 228417 325985 348482 237759 238760 294243 245713 200293
24190 200293 182828 203236 -42263 -189872 -96528 55978 230475 80601 -295309 -375120
24180 -375120 -334440 -196293 -68004 10448 -205231 -235860 -274520 -192419 -198592 -222008 -360791
24169 -360791 -545871 -330671 -291223 -327083 -409668 -489338 -420838 -326567 -328664 -112222 -149318
24158 -149318 -18959 -32617 -8961 84394 33788 -83673 59789 121000 -262557 -244800 -129831
24147 -129831 -95691 -159699 -155864 58610 122091 184553 289282 367279 180093 -112938 -399126
24136 -399126 -252997 66822 22939 -128084 -175521 -276060 -400447 -476199 -319812 -272260
24126 -272260 -303289 -126517 84906 160336 -283413 -435330 -319838 -112070 -68939 37514
24116 37514 -168189 -212753 -252201 -106946 -10728 -1063 -2131 199644 166552 195751 391053
24105 391053 389987 329236 205128 171591 82245 -190185 -396564 -329736 -195034 118529 -54405
24094 -54405 -202215 -211530 -395077 -366124 -186935 -279071 -308269 -284098 -429353 -329176 -156593
24083 -156593 107719 -67190 -266222 -263975 -235944 -220461 59695 323144 250911 170525 90714
24072 90714 -26227 14720 -42427 -19769 -164851 -16480 105536 -42983 -113780 -369481
24062 -369481 -510721 -548162 -642233 -554233 -550439 -654695 -686490 -423523 -203567 -37567 -97772
24051 -97772 -186353 -115808 91121 112932 90470 335206 442614 457266 272641 180401 -37729
24040 -37729 -254205 -252391 -119176 -62029 -211423 -137420 -138122 -139622 -30028 47303 252771
24029 252771 135924 -264586 -273969 -110440 -12137 68212 155415 256204 201482 163870 87203
24018 87203 -108891 -32467 81755 -78918 51630 217086 436423 409021 135485 -132697
24008 -132697 -131282 6367 -53793 -298172 -274397 -21087 -97006 -217036 -177398 63792 251994
23997 251994 85046 -96375 -202276 -118218 45384 87069 -95975 9351 -200229 -244682
23987 -244682 -96491 -90919 79270 132888 211826 160231 357665 236800 -73576 -121629 -87651
23976 -87651 -23575 -194919 -508349 -438979 -103264 7518 -89443 -66461 72538 94631 337537
23965 337537 316454 148195 8294 171830 43758 -59698 -38062 -6927 -95168 -110803
23955 -110803 58006 143968 -40448 -310831 -63026 -122009 -293299 -87634 57244 19915
23945 19915 -369854 -652535 -584135 -261927 13083 -150799 -242835 6654 239994 218831
23935 218831 -108205 -7714 106860 -55638 -14446 -18285 -84301 -261083 -300966 -271853 -360559
23924 -360559 -179396 71372 263886 328619 264719 82773 -133909 -240011 -191626 32127
23914 32127 -44777 -142885 -179667 -44834 -62798 -145171 -169119 -58720 -143252 -336097 -104165
23903 -104165 -32296 -233291 -122063 -106446 -104761 85967 51204 -28620 90558 99277 -76163
23892 -76163 17575 36291 -121313 20959 -70974 -194704 -178418 -232595 -134214 74954 5127
23881 5127 59195 166082 347125 287233 8586 -113763 41007 34552 -133311 94372 84595
23870 84595 -118036 -305791 -276214 -138267 -286903 -310965 -238323 -8294 185510 33419
23860 33419 -209106 -335896 -290915 -343200 -307665 -84076 -189590 -128228 192962 239100 223208
23849 223208 211365 260449 41330 -60285 45773 -227573 -358926 -354177 -336018 -118000
23839 -118000 -188193 -208188 3448 79325 68833 326271 324132 293582 400228 335756 89455
23828 89455 -298497 -200597 -267762 -405552 -406229 -167294 192092 138379 -112900 -76066 102781
23817 102781 301426 111869 170192 286206 214372 143266 23555 -8530 65155 351530
23807 351530 402554 310198 186217 -68918 -38863 104827 57533 -83219 252155 319272
23797 319272 50991 116817 -31472 -273821 -186739 26622 18815 235212 425861 412562
23787 412562 315576 360791 412050 303148 159525 193133 197053 62100 4395 27796 187984
23776 187984 420887 475399 307208 209241 119047 217923 397439 389485 157197 49361 112022
23765 112022 302076 467767 451027 435807 289603 233412 181127 17591 -21621 12875 7935
23754 7935 -137977 64741 146966 51070 -147329 -172212 -117255 -110481 45997 118300 -154282
23743 -154282 -230013 22370 -89448 -330519 -183221 28686 -117760 5673 73335 12706
23733 12706 -141446 29783 360693 483518 378352 499084 256591 -149236 -68632 107056
23723 107056 -86261 -119732 -73964 -31535 -139032 -242266 -268515 -479229 -614953 -452798
23713 -452798 -376367 -430729 -128832 107052 69242 212271 250557 146619 49701 -100992
23703 -100992 -139499 -151970 113147 192130 50539 -158449 -96761 -93294 -221280 -252893 -229364
23692 -229364 -176131 93625 112349 -43870 -101822 -101299 -142233 -147120 -205523 -214901 -200370 -255145
23680 -255145 -327149 -160915 110816 126871 -5235 -17676 87030 98078 -17175 78764
23670 78764 115702 -95650 -136467 -144254 -175240 -77341 -146699 -195192 -245689 -291293 -376277 -227636
23658 -227636 14214 317299 513740 410008 185319 171851 -7580 -31437 80421 -152280
23648 -152280 182775 548367 487986 329283 119494 23889 136381 137941 44449 139935 -18709
23637 -18709 -47396 58584 54616 53380 255119 185793 119180 121745 -94178 -259920 -341335
23626 -341335 -171867 80152 210576 164228 196849 163659 94363 181475 113267 -60076 -212398
23615 -212398 -190434 -119361 70051 123806 -25875 -280944 -293385 -181424 18041 263944
23605 263944 345974 235368 85292 -5094 -127773 -278280 -103471 22419 99172 -144874
23595 -144874 -259635 -250179 -155384 -50221 -206206 -60735 -276034 -381037 -230393 93082
23585 93082 175354 89274 -242569 -192063 -41131 -333083 -408172 -420432 -403533 -330727 -196310
23574 -196310 -128473 -241027 -384187 -286966 50559 -50911 -23905 -62980 -120032 -361637
23564 -361637 -463072 -210291 -114110 -246484 -107527 -117209 -203820 -112120 -142171 -329231 -183261
23553 -183261 187220 322491 -51738 -112426 -196743 -233972 -113969 -114724 -286012 -181933 -271
23542 -271 95186 2803 -253417 -81843 -211366 61782 147788 -77282 -169840 -223461 -381047
23531 -381047 -457541 -269409 57447 133549 135782 36393 -86968 -145524 -97275 -185916 -459688
23520 -459688 -271654 -103903 -145216 -76844 35082 -183715 -457653 -607823 -675834 -356630
23510 -356630 -70718 -82533 -200555 -286693 -351679 -77657 72113 -146693 -228882 -185319
23500 -185319 -94132 -108304 -63838 -107993 -75311 -72089 146919 123583 -34928 -125415 29625
23489 29625 -758 58931 133346 136486 58431 -237957 -123610 80225 -74134 -368332 -641542
23478 -641542 -521676 -422637 -335798 -180812 -135777 -36500 62761 -106849 -317111 -339847 -523764
23467 -523764 -502914 -233278 -24456 -43018 57545 147672 -30829 -130026 -112456 -45772 77709
23456 77709 243853 -2091 -221766 -27040 73400 -215828 -270958 -241708 -369241 -187020
23446 -187020 35042 -60187 -63379 3997 -7879 192541 290761 166766 18248 -58257 -207565
23435 -207565 -52798 212328 66035 41800 116689 90369 167534 38797 -313522 -274471
23425 -274471 -457483 -478451 -375433 -87697 82506 45025 -39969 -107419 -63435 2765 94639
23414 94639 362939 321467 472803 372669 197000 -216279 -521978 -682778 -273590 -231717
23404 -231717 -402667 -307644 -148248 36503 124257 328893 295086 50853 -8194 -195437
23394 -195437 -164533 -17862 126283 27726 -60276 -135943 -129700 -136823 -79352 -90502 -217009
23383 -217009 -140535 28822 -155351 -71565 9921 -34466 -149684 -45117 -44854 -216959 -93538
23372 -93538 39630 63254 55260 48309 -193145 -491002 -521866 -336908 -199053 -199634 -480406
23361 -480406 -444132 -299397 -262759 -114604 -145498 -357240 -406255 -358897 13970 369205
23351 369205 449599 547374 522776 215532 91320 -15526 -116265 -145852 -51011 -167013
23341 -167013 -201894 -285034 -187840 -202663 24727 160640 52042 89687 -11453 -51815 -55143
23330 -55143 -197519 -112055 124881 91194 6809 169515 127085 230647 128375 18797
23320 18797 -250190 -315630 -296885 -221985 196690 367344 530637 507304 168622 108778 -72629
23309 -72629 1822 112385 -167966 -101938 -54353 -229931 -90191 72425 45034 -69717
23299 -69717 -76787 30260 -261027 -107860 78016 95425 47748 -60309 -82405 -225525 -420383
23288 -420383 -240256 -17617 65775 33908 159839 161425 155393 129876 157614 163275 -60326
23277 -60326 52385 160616 112881 165904 165382 2647 -49529 74409 62827 108890 -121092
23266 -121092 -118296 -52756 112560 60424 -54677 -180973 -254205 -258925 -211285 -327343 -352996
23255 -352996 -326920 -258486 -190611 107666 390881 370756 176093 -56350 -21683 17096 62796
23244 62796 201117 131403 33914 143920 296439 129950 -15737 -123113 -161685 -160596 -271056
23233 -271056 -178008 -332450 -433792 -387586 -393957 -317274 -225330 -212150 -323621 -383154 -391124
23222 -391124 -278895 -306694 -517158 -314935 -124537 -174849 -255291 -262880 -5706 188003
23212 188003 68953 94443 40919 111773 283698 164987 -150112 -279973 -228846 -308167
23202 -308167 -279052 -138175 -103564 -26960 -166227 -137061 -84015 11574 86140 257735 236135
23191 236135 53201 -180598 -32210 224860 438097 322599 104756 7115 -137134 -145989
23181 -145989 -144687 -226573 -148261 -101848 -26423 102214 176039 71935 14349 1439 -189495
23170 -189495 -238214 -145250 -261003 -84766 22273 -190425 -172837 -60374 -118888 67381
23160 67381 -68427 -176116 -48255 171685 200832 132330 -23109 -255698 -449416 -363701
23150 -363701 -165706 -118632 37374 285614 232545 81339 104235 37800 -197607 -273756
23140 -273756 -300297 -485541 -229864 -190308 -16444 465109 416920 320563 6925 -65360
23130 -65360 -53565 9716 -24322 -191960 -245036 -327316 -505104 -563958 -228396 -82356 -145156
23119 -145156 -170882 -339676 -182146 -259844 -270592 -118807 -177668 -133790 -69190 -152975 -229875
23108 -229875 -101707 49547 35153 146651 122350 120289 -83575 -268536 -365153 -310294 -130330
23097 -130330 -297085 -257984 -46015 122283 251650 250308 -36332 94355 140025 71058
23087 71058 28606 74925 215610 231167 100065 -14071 -158493 -305166 -431915 -288123
23077 -288123 18397 -98270 -241074 -239938 -267744 -131142 -143832 21118 191907 127004
23067 127004 162465 82740 143696 325696 506858 327232 68847 -12798 -217329 -231688
23057 -231688 8245 68485 205769 206098 54417 52779 164661 93229 -3525 -396085 -671737
23046 -671737 -509700 -54998 -66687 -263683 -277777 -298153 -316667 -94997 224046 -38882
23036 -38882 -298050 -286308 -131504 47160 275459 517099 349265 1782 77402 62482
23026 62482 54174 64461 -188590 -290469 -111753 -59759 -96200 -26350 -248311 -102920 32907
23015 32907 169214 -98946 -195466 -52757 -98143 -197390 -110975 -10818 -221138 -382033
23005 -382033 -403812 -551734 -443539 -369909 -329127 -126958 19261 -46833 -10078 116939
22995 116939 118865 29077 27367 42056 44399 77277 -84621 -41499 219237 186224 -15496
22984 -15496 -72370 -55603 -61468 15272 35979 -51945 14045 18830 -201447 -407115 -228967
22973 -228967 3529 54460 34974 229694 102540 -117544 -255337 -78667 360590 109625
22963 109625 -245460 -472505 -383413 -159288 18038 38498 -166272 -206361 -186919 -131823
22953 -131823 -11143 57805 189351 387052 378210 288583 288051 50977 -294703 -196374 71263
22942 71263 -33257 -41481 -16889 -208637 -295041 -181848 -225241 -220723 -250947 -200980 -109094
22931 -109094 -173777 -371515 -402614 -361478 -236057 -226674 -191072 -202805 -167408 -12241 -44457
22920 -44457 -37189 -54351 -153013 -44888 294167 394321 503704 293952 -79265 -102516 -53499
22909 -53499 -149626 -166543 -120946 -116205 -101872 -108259 -14879 42920 154317 311828 315940 267412
22897 267412 -139409 -314721 -248292 -130494 -79710 -222691 -382433 -376615 -298609 -218190 -267226
22886 -267226 -324001 -283425 -139330 -43666 85342 109368 140869 -173922 -110666 -58698 -82302
22875 -82302 86546 112690 -44450 -164070 -175726 -332931 -430769 -182436 -32881 77217
22865 77217 126966 -230 186748 65526 -157354 -46161 155585 205458 177816 90554
22855 90554 -74202 -21117 258605 304492 -9999 307201 532623 658771 435779 275774
22845 275774 174377 17893 -270004 10725 444248 552926 374720 359941 -3764 -134133
22835 -134133 62073 135238 77480 90128 77742 -5920 -53508 -84374 -120148 -260103 -578610
22824 -578610 -579880 -569408 -291613 -199425 -59548 -7719 -118779 -49510 -40147 -132684 -228386
22813 -228386 -438830 -416410 -265060 -167816 -9509 53063 260724 289937 172297 136449
22803 136449 343055 382166 438814 289016 15934 19980 -254480 -441459 -339694 -292468
22793 -292468 -335855 -235547 -206449 -290517 -226057 5818 315084 552289 479631 453614 399447
22782 399447 34972 -18042 31042 -7790 -33262 45731 -62921 -287083 -356682 -426363 -155106
22771 -155106 149798 261027 225169 -2721 -82535 -30034 44194 -127724 -219880 16938
22761 16938 25987 37132 225243 495359 340446 -1333 -11793 147157 260836 339530 417862
22750 417862 497818 355908 212983 106340 84115 -97050 -145356 48833 303333 340985
22740 340985 18956 4034 -46688 17653 -27775 -132363 -247799 -379142 -168823 8338
22730 8338 -62009 -319021 -343057 -70277 277013 317952 35626 -190390 -283825 -158144 96241
22719 96241 163476 178135 44853 -5249 200220 244714 132319 -106489 -135560 -58220 -168284
22708 -168284 -362067 -159999 38665 200828 -62048 -178673 -110559 -48833 -155363 -331022
22698 -331022 -284583 -81691 85618 -11697 -277096 -303471 45936 83026 -7472 53469 -49283
22687 -49283 -247032 -296732 -292547 -297251 -347311 -478695 -293367 -16631 56486 -33614 -237914
22676 -237914 -191158 85913 132887 70459 38585 -45121 -92446 -34487 -297160 -444089 -421846
22665 -421846 -170215 42601 200540 141150 -97811 -302423 -232679 -199437 -185391 54874
22655 54874 -46793 -25340 23575 16188 62475 -271714 -341516 126639 135475 -51979 -71381
22644 -71381 91329 -50733 153114 -1245 -344107 -170367 63160 6004 -60144 -91740
22634 -91740 -5106 178991 81615 10199 276446 446949 496144 364801 30918 -160761
22624 -160761 -183284 -385792 -260712 292111 396702 228874 74937 199679 37515 20472
22614 20472 -44245 -134268 50385 177636 305099 395205 383256 410430 121170 -116474 -160501
22603 -160501 -374495 -249900 -117938 4266 257017 109978 166365 122772 -58372 -23453
22593 -23453 22677 5894 160074 -32718 -203124 6464 33921 -87539 11397 -24783 112149
22582 112149 370362 359550 233261 175578 161132 109812 -120015 -114803 32026 108138 -116582
22571 -116582 -48968 -49397 -95766 -106489 3283 69610 -63638 36662 -49726 -98342 -173872
22560 -173872 -100141 -32480 -211788 -503691 -498252 -339473 -452568 -423667 -348477 -210144 -21186
22549 -21186 -4457 -155538 -273279 -122864 -242453 -263356 -62782 10294 45237 91922 43278
22538 43278 2538 29599 85119 154019 -97917 -152652 -110047 -232608 -472239 -521117 -268318
22527 -268318 -122142 164248 121390 -57381 -142630 -146414 -154135 -295322 -264332 -211044 -77561
22516 -77561 -115330 -123409 -39881 -156889 -208368 -45213 36609 180058 243453 236650 -36723
22505 -36723 -125331 17746 295705 440962 219537 166922 190801 11485 -40416 141455
22495 141455 42924 -101006 -103779 -75852 -188273 -132477 -115280 20189 202256 257566 239368
22484 239368 24551 -209884 -113178 50275 209707 450013 43129 -374706 -190140 6353
22474 6353 -174316 -74601 -155889 -88805 -213377 -331849 -34519 196701 245270 311194 72582
22463 72582 10970 40793 80151 31357 -36248 33498 75935 67202 194732 220450 79744
22452 79744 -111942 60812 28232 -62259 121258 -60771 -397244 -336171 -181080 -12049
22442 -12049 201563 175273 134618 174818 367714 205428 -168984 -239864 -210474 -80775 141343
22431 141343 337260 20779 -45717 -14278 -45452 -39913 -7916 -22930 -70323 -149536 82701
22420 82701 406 -183014 -399924 -476527 -251330 -80104 -12399 -35960 -106908 -213425 -80782
22409 -80782 -39775 -68738 -139152 19079 167801 -7812 -281486 -352955 -301565 -368334 -420855
22398 -420855 -216576 76666 154852 80721 99777 128825 115088 185893 374906 465442 280950
22387 280950 350625 132648 21941 -17044 104626 15566 -51304 -98269 -69 15894 10576
22376 10576 115584 374808 498911 356103 88828 -86498 -6735 -24192 -51613 -60627 -206763
22365 -206763 -381481 -287959 -215013 -23932 182385 173487 154071 182623 39144 -117649 -186256
22354 -186256 -160765 87696 -24072 -117062 -40860 -134970 -119462 -281276 -386763 -462612 -372733
22343 -372733 -251362 -165945 -26475 41813 -70151 70693 166828 -49283 -134489 3438
22333 3438 61944 68769 -101589 124334 296444 172902 -32888 -18879 -50136 56667 55836
22322 55836 -147385 -109839 2879 158271 -167286 4499 93470 -32225 46729 -99138
22312 -99138 -98401 -231856 -392398 -430507 -281439 -148857 -122552 120642 191001 -33871 -41163
22301 -41163 -3072 -79558 -35152 -119899 -285385 -367572 -507330 -715421 -669551 -477246 -350397
22290 -350397 -246115 -261389 -165733 31172 37445 -167729 -196372 -274848 -229300 -95923 -104032
22279 -104032 -74579 190729 172655 196552 389673 342464 14361 -238543 -328531 -176478
22269 -176478 163216 156336 146012 233120 182986 11414 -19026 -65230 -195232 -162974 -31191
22258 -31191 11402 -34815 -58340 66879 85740 44044 -76923 -211497 -422865 -21811 356638
22247 356638 287233 -75397 -313243 -397364 -474886 -557220 -460053 -395022 -380523 -104983 -86008
22236 -86008 -167149 -369782 -343855 -350014 -281318 -81172 -169534 -205462 -378478 -563930 -314896
22225 -314896 -165787 -288392 -445463 -413295 -156230 -177293 -379612 -346217 -301465 -565229
22215 -565229 -727387 -600612 -459146 -86767 -49286 -52795 -197661 -273666 -74124 181445
22205 181445 149579 -63127 -19042 33034 55282 318596 193843 54726 -103487 -84541
22195 -84541 -338197 -17737 330234 166594 -111436 -242754 -270250 43605 183769 35443
22185 35443 -20423 -178319 -180913 60675 190549 311995 290510 252290 76288 172288 31056
22174 31056 -120906 -141609 29987 -33217 -181000 -192025 -253402 -174558 34352 60541 51620
22163 51620 -77287 83022 194707 241020 295861 431591 467880 187209 -10056 12002
22153 12002 76127 -183569 -293184 -173713 -20909 -45225 -165051 -269133 -372834 -203142
22143 -203142 -211351 -438173 -341985 84571 154775 18598 -192548 -60639 -208825 -230132
22133 -230132 -237733 -345389 -341904 -125750 136980 283304 252388 -43947 -315365 -560351
22123 -560351 -411620 -314707 -174889 63316 -94253 -44496 119143 372068 202994 83497
22113 83497 -28435 60903 199219 75932 -107743 -228582 -142939 -174334 -173313 -43046 -136280
22102 -136280 -69517 15021 35218 68512 156050 87018 145357 -96725 -267250 8261 159704
22091 159704 90165 -41200 -128199 -248781 -184377 -129196 -115889 -32663 -59141 351131 301787
22080 301787 -52101 -269699 -130572 -37425 -321346 -184578 -37503 -168030 -383898 -300664
22070 -300664 -32237 88517 64942 -142205 -43320 -33607 -106527 117205 94844 -98682 6274
22059 6274 191944 249095 186641 189912 89253 -46711 -195450 -166268 -233120 -132592 -138844
22048 -138844 -448024 -649657 -571818 -52844 -103269 -355560 -310008 -232624 -185128 -42835
22038 -42835 -6131 -30456 101661 175534 241802 195508 100238 76910 1979 -66589 192843
22027 192843 186258 55170 17433 92360 88724 159523 -4155 -124886 -240838 -151820 -160856
22016 -160856 22204 14637 -203680 -178919 -144027 -142628 -58873 -156679 -65214 -135214 66979
22005 66979 147677 -83543 53712 42416 -166305 -182083 -144407 -57217 983 -79885 -213730
21994 -213730 -80909 175674 340953 299625 348407 444585 583268 583930 405435 -78038 -89911
21983 -89911 10336 23076 41048 69086 295285 578100 428504 264043 235845 42168
21973 42168 -125263 -109664 -126774 82914 145005 -33245 -277602 -114714 152858 36984
21963 36984 39542 253645 163907 246071 312110 412247 334419 269838 256212 242851 436796
21952 436796 250585 -22017 -186009 -66946 159023 420938 478370 502432 585958 715783
21942 715783 849101 792513 844665 690584 484888 483056 457908 351591 313695 362130 499979
21931 499979 714409 798754 576219 536838 850526 930559 747291 705998 598879 592644 478207
21920 478207 355087 225897 36173 72959 23064 -134448 -226126 -192310 -219772 -176122 -37624
21909 -37624 162712 291207 170977 10141 37195 108771 286206 206683 162311 -13704
21899 -13704 -110816 -37753 -141285 -320692 -176234 174970 62362 -99507 -355261 -297792
21889 -297792 -17853 134417 -64736 -27973 101031 58779 29467 27333 -47992 -24490 -52092
21878 -52092 69039 -53715 -235093 -358296 -387221 -208760 -113399 -117124 70765 249338
21868 249338 162808 10235 255664 155743 113176 55649 -14498 56588 376609 298923 -215538
21857 -215538 -398491 -157076 -136047 -161699 -124953 -79259 -64664 -33106 -11908 -182284 -334131
21846 -334131 -205477 130500 78848 -67980 53864 106185 -115989 -218479 -383443 -210686
21836 -210686 79130 138098 123402 -91478 -76938 69237 183679 266620 294657 180443
21826 180443 -73478 -13163 -59363 -192554 -292062 21965 59015 -39961 86847 147687 120162
21815 120162 37494 -120559 -307761 -238561 -183553 -91582 42200 -130017 -139382 10244 136477
21804 136477 116654 201699 50750 -2383 -68786 50899 17135 42967 182298 113370 -19675
21793 -19675 -321012 -337134 -125570 357953 400585 -89515 -500516 -515336 -491592 -482171 -430100
21782 -430100 -395030 -396582 -19573 2201 -67447 4790 -93900 -223911 -220015 -63828 -50058
21771 -50058 -91438 84713 132608 32072 -175571 -169757 -230649 17685 395030 282280 59591
21760 59591 -82664 -41947 -128421 -224739 -313815 -59954 -69342 -125810 -35335 42672 64139
21749 64139 12261 3324 -194125 -235957 -223341 -159135 23238 -175727 -83378 120128 340312
21738 340312 391494 95899 19775 -35651 18564 -119276 -189595 -55252 251170 25478
21728 25478 -121090 19268 -105323 1011 91666 262420 141978 -123595 -239808 -327383
21718 -327383 -99330 -8155 -119353 -204690 -68693 42138 -85397 -294203 -376407 -319668
21708 -319668 -298562 -163647 45498 172716 201420 -47093 109942 260808 172081 167627
21698 167627 124298 115442 -152136 -407956 -251163 -420380 -434580 -452502 -349358 -84705
21688 -84705 -78327 8752 -39015 -262678 -432582 -293792 -9159 97863 98665 169589 424790
21677 424790 515563 450042 172917 -94876 -176243 74650 57068 -160304 -89371 -19973 98670
21666 98670 18874 93054 193435 119676 49994 -260666 -207978 -180347 -86113 -24741 -207010
21655 -207010 -408399 -507264 -575294 -573199 -247646 59616 86616 87454 206159 228670 -48970
21644 -48970 148324 185754 141519 159105 35013 89997 337154 212803 77900 160392 429141
21633 429141 450441 361336 207204 211944 147654 188420 206549 261743 277818 94367 -39091
21622 -39091 -33885 -76479 -186879 -68622 194825 236982 228458 112127 270220 649640 606141
21611 606141 560385 613396 501728 157185 -138216 -149611 -201977 6587 213309 89859
21601 89859 -247968 -237959 -145534 -328637 -130797 62084 59265 123474 185551 85031 -31656
21590 -31656 -92619 -80169 -264123 -386288 -306435 -167154 -52798 158597 286711 153817
21580 153817 -44118 -95468 -268137 -385651 -436889 -420352 -418634 -189141 -39024 -121638 -35230
21569 -35230 -74395 -190219 -279417 -256647 -272942 -24682 297869 113855 -254068 -164332 -33417
21558 -33417 75236 84900 53021 11639 189600 153332 190964 360931 259042 140334 -7777
21547 -7777 -99525 -189343 -159747 70699 123616 140061 277338 245841 162778 152063 -3117
21536 -3117 -139213 -70849 -158766 -102624 -216743 -288332 -216387 -249325 -217759 -139846 -194366
21525 -194366 -208681 -236191 -249393 -415826 -400457 -336780 -145162 -126951 -189619 -351702 -262630
21514 -262630 193973 304567 111069 143123 208907 213996 166530 76114 196567 91913 -29248
21503 -29248 134624 305014 39690 -220967 -299620 -59605 73294 -136804 -181983 -164594
21493 -164594 -463849 -537754 -206840 -109168 -259491 -120006 -205939 -238522 -149530 -125834 -307176
21482 -307176 -372902 -374750 -193943 166746 353660 578304 353266 -25370 -228161 -218992
21472 -218992 -134130 50057 224181 219776 -12206 -47636 48894 49917 -78821 -62486 -148844
21461 -148844 -265220 -204245 -272414 -25205 67114 130455 99034 14780 158668 344368 200888
21450 200888 281344 425340 335287 347327 422407 306205 227973 322720 224260 88363 -80889
21439 -80889 17385 -22241 355869 360455 280419 184276 185167 129823 435637 513078 538642 485179
21427 485179 608421 548639 383225 301692 504788 528069 82888 95472 393242 595936
21417 595936 762214 774228 501674 447430 328060 225483 550299 969971 860342 828025
21407 828025 727000 657789 960663 1119755 1375508 1677033 1877365 1789563 1804334 2081112
21397 2081112 2051645 2095819 2383107 2522440 2510256 2511809 2559069 2604116 2717226 3045306 3361196
21386 3361196 3880141 4367790 4891885 5381590 5362732 5547132 5809866 6057754 6410959 6912380
21376 6912380 7303057 8074117 9304413 10838899 13011163 15652060 19534264 25461722
21368 25461722 34716359 50425750 74674307 102938509 118747460 113008129 100520253
21361 100520253 99337637 112827806 127642407 123401964 99268083 75083088 62290660
21354 62290660 60245833 68472689 87653121 114383346 131020347 123829432 106394565
21347 106394565 99755164 108432945 120846073 117332682 92285332 63457247 43409638
21340 43409638 31514018 23999814 19092156 15781856 13410617 11266611 9734704 8367068
21332 8367068 7668958 7163183 6781267 6672287 6631570 6329505 5853007 5213150 4870354 4682972
21322 4682972 4321514 3675997 3034503 2678006 2375729 2375948 2546381 2522237 2546206 2488666
21312 2488666 2330881 2112067 2178495 2231182 2231669 1900098 1381651 943955 716477 859796
21302 859796 935356 853346 835052 781048 466366 629765 996137 958034 667229 733678 846241
21291 846241 824070 525980 363418 301484 419963 506704 761885 575534 225221 271425
21281 271425 518535 475770 457811 370425 510855 367388 212125 289111 140177 61953
21271 61953 240789 373336 212615 -34857 -124852 -24278 135839 285519 433024 326133
21261 326133 349455 270334 107156 102921 22092 73891 -40800 -175026 -50567 -37026 -50678
21250 -50678 -80802 178374 233122 249295 287574 277837 352798 261980 30084 93017 -28947
21239 -28947 -178742 -196239 -245839 -160844 -136216 12737 315756 280475 106738 166321 267903
21228 267903 82252 -51215 -11318 200191 129153 160964 288345 276688 54024 -54913
21218 -54913 2724 -36297 28306 -4019 121279 287751 295330 -91988 -242434 -70779 -69021
21207 -69021 6390 180947 270552 267606 153967 -101186 15296 200609 303006 326112 248554
21196 248554 420017 599167 332636 153358 122970 85802 -20464 -44829 33970 -17315
21186 -17315 -87920 30293 2645 100406 -71612 -265650 -113846 31430 19530 -44677 -70054
21175 -70054 -13744 270842 202757 -31934 -232746 -171867 -146102 -122392 123784 153072 -91680
21164 -91680 -80171 111872 33280 -258523 -179915 -67742 49029 160614 57951 -139051
21154 -139051 -362507 -373419 -130204 329664 553538 443573 383681 388718 233191 434104
21144 434104 436199 303024 138050 116280 99675 156104 222801 449485 658559 531782 392168
21133 392168 163263 80179 72220 48370 -33090 85747 464144 483494 212248 135166 -131817
21122 -131817 -215122 -1204 156575 245465 245235 276057 65971 -144480 -99376 250727 254496
21111 254496 240252 504579 358952 72257 -175697 -150300 135503 191967 357732 287675
21101 287675 157993 -37634 -126913 -136005 45528 141680 51221 26027 -135537 -270236 -25131
21090 -25131 -169866 -266964 -201194 -382433 -301937 -116223 -79098 -41276 -105233 -329844 -273903
21079 -273903 -131780 -205278 -446062 -455687 -469004 -582212 -825698 -774790 -532614 -332776
21069 -332776 21038 186595 -12799 37704 -92625 -213135 -300500 -317772 -271857 -343120
21059 -343120 -406457 -378935 -350178 -151134 111916 315169 -29428 -109110 9751 -132007
21049 -132007 -44133 -143137 -125218 -56990 -14102 -53998 -24934 -94327 -154440 -279468 -357880
21038 -357880 -192026 -182268 -147222 9885 70776 80197 364 55647 76517 212411 156927
21027 156927 93593 -1835 -84763 -205147 -66516 15419 -133335 -79024 162985 240721 200510
21016 200510 254317 438206 495061 114155 -92158 -123404 -240343 -398203 -258970 -91985
21006 -91985 39023 52187 201630 146676 73166 27580 137865 222301 128247 121897 160558
20995 160558 167637 37334 -185420 -358536 -263992 -87271 70736 117605 130141 60955 164289
20984 164289 -18620 -133906 -226966 -186859 -123090 -237592 -160989 -24232 128903 -68545
20974 -68545 -104938 -39420 8617 -56829 24209 70830 -12219 -142345 -132790 -103351 -21626 -59101
20962 -59101 -63729 160276 212814 -4210 -7943 215402 35674 -49684 -77218 -45219 5886
20951 5886 -75782 18861 314520 154949 39870 -5456 -54255 -73311 -188263 -140136 -141889
20940 -141889 -11355 113217 132220 381663 377521 336785 204451 -9731 61197 182213
20930 182213 125035 13019 -247052 -509407 -93562 177681 360833 398526 493574 352142
20920 352142 203363 152472 -1618 -140770 -131426 3727 3569 -107796 -145504 75671 43457
20909 43457 39334 154909 202785 58201 -270253 -643570 -516184 -147780 -126795 -1078
20899 -1078 152778 186541 -113042 -267651 -431465 -395544 -482964 -226151 4022 -28904 -174194
20888 -174194 -132915 -188074 -274056 -92412 46656 231546 153691 31690 34246 -16228 117854
20877 117854 232312 326824 462037 491142 165192 122596 124652 72526 78897 60833 308070
20866 308070 300637 171123 262831 183337 50421 48688 90999 -186575 -293535 -368313 -293789
20855 -293789 41830 97329 23552 61343 252519 74904 144048 253253 131192 18071
20845 18071 -111076 -158745 -218766 -305810 -310197 -281100 106064 132173 36023 100344 155941
20834 155941 194936 204285 149237 173881 -20290 45914 -12959 -150746 -252742 -95097 -109243
20823 -109243 -310489 -182713 -200970 -416126 -456923 -374975 -286520 -348765 -331755 -440166 -517314
20812 -517314 -327601 -261116 -290489 -131632 -128051 -223678 3332 26198 -230168 -34997 150982
20801 150982 55820 -6107 -192510 -124403 -56743 14263 -76915 -208308 -163040 -39799 -7561
20790 -7561 4037 17809 212657 291808 206781 254616 135180 -120464 -91790 15405 207
20779 207 -9081 331523 477151 460655 322152 176968 335605 531761 521233 346864 159852
20768 159852 174142 28672 -49393 -49834 167641 320278 593754 576659 519307 586632 589981
20757 589981 563375 428966 495484 452483 530420 365177 150363 -85097 -151199 -171122 -42031
20746 -42031 -84663 -253093 -318782 -43126 334143 181077 127966 157058 29483 35034 -145607
20735 -145607 -226542 -155800 -249926 -224020 8362 -130494 -45845 176048 393668 315212 218282
20724 218282 108739 361170 465487 409057 471114 380920 285565 119664 265759 244663
20714 244663 -14557 3726 -43336 -287432 -208126 97554 208212 38190 -91115 57700
20704 57700 171295 86618 -79690 90089 305761 563140 414343 17882 2510 49311
20694 49311 102948 5899 -407786 -525848 -246424 -236124 -300325 -266697 -65252 -172832 -446873
20683 -446873 -392508 -109851 -54109 -23254 -128098 -184513 -101487 -271118 -281487 -175714 -215865
20672 -215865 -319738 -60411 76353 -39588 57580 -93399 -254729 -31986 77264 -70309
20662 -70309 -213711 127018 375572 446032 451161 306667 295857 244257 226058 162963 -24574
20651 -24574 -32839 19938 -21536 104515 196398 285607 347650 428182 247958 285718 279943 213705
20639 213705 122307 64255 -10632 -199773 -201402 -167327 -178470 -270419 -104162 141500 275009
20628 275009 -124784 -218122 -154943 2799 11231 -61623 91269 211565 140190 122214 215164
20617 215164 88930 -39116 -78845 -120772 -50389 54681 32148 137604 216112 191095 153686
20606 153686 103487 30768 -153889 79134 20544 21480 -11609 -162908 -130270 116122 171330
20595 171330 155145 114993 154532 183277 80153 -6615 -37083 8838 -54879 -99249 -5568
20584 -5568 -156938 -52464 -175928 23266 144237 62767 -170114 -41613 -36093 -100598 -38820
20573 -38820 28470 84464 -54992 35994 -83053 -278272 -144900 -36163 -81112 38381
20563 38381 223565 293043 58482 -22217 -168855 -522963 -602654 -294195 -13652 79958
20553 79958 224258 232037 90806 325691 419636 526043 274810 -16936 -765 -117 150492
20542 150492 239178 200287 14149 -149593 -160802 -172831 -122075 87101 179117 156110 -102193
20531 -102193 -67522 76615 109202 31621 -40078 -200376 -163399 -153424 -103615 -160146 -156012
20520 -156012 -54305 -110282 125227 159834 108835 24500 67895 19643 -109261 -61925 -50664
20509 -50664 32976 -84997 -261035 -451172 -431667 -453416 -557615 -421777 -223085 -193850
20499 -193850 -93794 110692 232204 87014 -294922 -232066 -265761 -101779 -188723 108649
20489 108649 331106 404737 514317 567643 412198 240367 250755 168083 -62716 -191987
20479 -191987 -216514 -180387 -246989 -8390 196457 136001 288177 359355 234404 312040 427001
20468 427001 439057 223580 132323 250347 335374 153193 40610 29663 10245 -10083 76129
20457 76129 -210240 -351601 -225636 -271882 -93454 261702 240910 291340 550842 569528
20447 569528 190160 113185 41797 -174165 -90694 111693 -19850 -233440 -183649 -296050
20437 -296050 -88707 59870 -170609 36466 281383 311895 225727 33632 99746 297280
20427 297280 265981 -60406 -118472 45216 123664 241624 415785 619978 653457 630119
20417 630119 370633 222885 279834 212050 27685 -95917 -71123 262452 402890 267799
20407 267799 -126607 -208206 -12067 218710 -88339 -354834 -360514 -213064 -159065 -233046
20397 -233046 -354882 -327272 -160587 -20161 162486 350457 371793 403329 281491 212024
20387 212024 215083 267692 296161 300020 386680 328689 251497 224237 249748 72274 -195049
20376 -195049 -269433 34992 204214 -6630 -24069 136192 202352 152573 -31482 -117147
20366 -117147 -196072 -203341 -233917 -98665 39343 38122 110091 302773 170197 50075 21884
20355 21884 74203 310355 401436 414518 258548 189609 196561 113632 108771 3137 -223387
20344 -223387 18027 153276 377472 483069 320501 298603 263722 206055 271320 114733
20334 114733 -51094 -185216 -125239 -126139 134467 300044 353263 144160 91521 1474 63260
20323 63260 151415 -6682 -26743 -221348 -241959 -172955 -189546 -19445 278271 174796 8396
20312 8396 144324 304798 457062 360337 93245 84205 289404 303515 324669 377082 113179
20301 113179 134436 162870 19557 -108238 -99013 231222 310080 316744 377353 195614 73314
20290 73314 -97191 130609 283509 149058 -43743 -249932 -328055 -308237 -226659 -277912
20280 -277912 -383986 -185421 -93283 110542 122477 52257 253739 317573 388773 461221 512142
20269 512142 263543 64062 120416 248327 -50671 -204930 -188647 -179588 130984 220243
20259 220243 -51876 -251573 -248357 -202349 -254495 -157693 -101935 -45176 -44558 -15004 -75734 -113691
20247 -113691 18581 122037 22252 96455 190788 -27388 -170098 -132227 -23929 -170602
20237 -170602 -267984 -79208 41311 317293 371999 401244 182161 -92227 -73286 111356
20227 111356 188286 93546 77287 -100776 -267317 -269491 -88353 -168098 -123135 114753 367188
20216 367188 328155 244229 264831 342558 397613 428124 372684 288742 11042 -301752 -283750
20205 -283750 -193031 -196051 -124987 -17826 63138 -65392 -123017 -117832 133013 334984 325836
20194 325836 176769 96260 -1878 91492 167645 84571 172316 4509 -24210 95169 36695
20183 36695 -103101 -24466 64515 -13769 8239 224252 166238 24253 -49558 -52270 -97854
20172 -97854 -118782 -47738 15383 -197588 -376299 -382639 -305916 -301733 -368166 -394054 -132528
20161 -132528 127110 212718 173331 17776 84969 258527 114618 -105674 -206723 -367228
20151 -367228 -324440 -323983 -412737 -382181 -212869 -46238 -153329 -180871 11091 240819 369949
20140 369949 319084 417985 398830 265529 332001 202735 67458 -128180 -117627 -28026 208774
20129 208774 132546 -235723 -334447 -283009 -94296 30509 -99041 11756 391000 523178
20119 523178 627898 671678 443115 525972 370021 167659 72725 186496 109355 -137894
20109 -137894 -108679 204792 185774 77189 169018 253752 140668 149139 306598 153703 -69721
20098 -69721 -70012 253966 270224 244169 329426 359916 388420 340646 347091 209202 142360 -64253
20086 -64253 119235 154727 159831 78673 -23104 -254473 -183850 -286982 -43232 179277 287500
20075 287500 277949 154331 139235 274987 198170 91898 61904 105659 160813 70367 101256
20064 101256 191647 141937 25918 267818 206832 -29494 -84276 24785 207703 347387
20054 347387 383374 89443 -118560 -55123 -106871 -179259 -162772 -55078 48989 254454
20044 254454 391513 522755 736568 803069 544731 350389 125935 87280 270344 416356
20034 416356 759904 680149 285866 126066 217032 398369 394546 273946 60451 129614
20024 129614 69837 472900 764975 751911 466992 379403 454406 476359 431762 324087 145531
20013 145531 18795 99564 311008 236796 264310 287298 273800 208984 225054 272553 401237
20002 401237 629725 712336 826355 742027 979375 1062217 783519 559735 446631 475690
19992 475690 651244 851510 977936 1325469 1676114 1732284 1929499 2140505 2290597 2548575
19982 2548575 2528980 2437593 2634931 2838920 2996628 3169911 3448280 3631325 4030627 4754664
19972 4754664 5180825 6053509 7338516 8524692 10262004 12830608 17097767 24033465
19964 24033465 35803688 55771301 84607817 107469416 102141735 73881247 48952556
19957 48952556 34579577 26514153 22056099 19945268 19950586 22270999 27566575 37304633
19949 37304633 54685358 80922724 104103558 101867773 75356448 49435464 33679589
19942 33679589 23997253 17581928 13645751 11394245 9954191 8814249 7951693 7187912
19934 7187912 6609846 6444951 6384051 6425309 6087445 5909080 5872021 5899102 5667096 5770251
19924 5770251 5884739 5818236 5893418 6107513 6379299 6629794 7454543 8639447 10275327
19915 10275327 12388239 15063544 18755909 24904321 35883138 54300259 82867886 113292199
19907 113292199 120101541 95012442 63523477 43420390 32181724 25913235 22720666
19900 22720666 22086455 23917647 28707963 37453052 53185043 79143921 109843437 120080119
19892 120080119 97326387 64368037 42171020 29068596 20966958 16045569 12800159
19885 12800159 10653530 8894005 7265023 6294143 5972491 5866853 5620241 5059023 4564701
19876 4564701 4268762 3959591 3298304 3004973 2896985 2833749 2795588 2652801 2228513 1765211
19866 1765211 1507315 1463073 1425681 1245152 965465 755903 724745 773446 636757 607812
19856 607812 675069 794515 998325 1055499 952227 632681 653980 752712 796853 676346
19846 676346 674491 500688 629184 727673 630686 553967 383029 443057 583228 539114 569460
19835 569460 423559 444422 659442 392757 90854 -22662 173433 351818 50648 2621
19825 2621 14157 126659 121457 304731 344886 122001 88308 117077 164086 342778 293259
19814 293259 156729 45371 397482 427928 273223 298516 289182 235263 316023 163958 28460
19803 28460 -159242 -267337 -164684 84137 316838 369952 419894 321714 227556 393511
19793 393511 263737 370123 260098 16363 -45155 110212 328873 385606 284992 268544
19783 268544 280838 115572 197341 406519 195295 150144 243021 9475 -92399 -91266 12133
19772 12133 152619 309195 276381 298134 324559 392053 341683 195969 177174 128828 87490
19761 87490 122049 377664 567796 478500 347197 328452 380915 340336 11190 -140097 -243925
19750 -243925 -97664 126781 -44718 -228305 -14929 245079 98328 -63235 -339289 -476775
19740 -476775 -101742 189471 -95122 -372418 -453640 -305009 -110694 -8658 -27962 -80891
19730 -80891 -322813 -190596 -52852 152235 190692 -273428 -359515 51219 358579 431218
19720 431218 497575 405203 263582 377703 391485 -3809 119113 232331 109903 53335
19710 53335 182854 25425 93787 -114907 -42461 -190512 -378996 -349589 -304734 -235556 -131265
19699 -131265 -33311 -171595 -364562 -216219 27959 -15380 -51254 12856 -264599 -283028
19689 -283028 -123666 -22749 -289329 -314572 41542 32130 31905 87983 -16114 -130471 -192455
19678 -192455 -233305 -185696 -421785 -325127 -320948 -274688 -204626 -157159 -308982 -462646 -275694
19667 -275694 -18693 89904 243048 308566 138352 299927 275362 49251 -142449 127003
19657 127003 100577 215067 225213 73906 254731 238687 -60396 -50268 42508 75444 324703
19646 324703 498091 311446 14922 -327470 -210174 -201453 -316579 -157841 -84836 -91665
19636 -91665 -76473 123797 446885 500991 436064 150427 57711 -101407 -89191 -262392 -162759
19625 -162759 175090 400175 331462 318770 422633 333367 273483 309877 215632 85844 -64627
19614 -64627 67138 398655 186755 158934 346849 280610 174665 228492 146980 6338
19604 6338 -15958 10601 254035 362901 508486 461946 341227 304329 22462 -109542 16183
19593 16183 -46529 -73098 -152165 -212862 -187966 -270217 -290681 -351936 -345615 -314413 -352093 -300430
19581 -300430 -148325 31826 63084 217153 287367 155235 250430 313757 251252 187809 147003
19570 147003 275211 221543 224564 415717 540422 258403 161646 209309 342444 259579 31869
19559 31869 215489 359948 431572 250747 62249 -82806 -112993 -101552 219503 125822
19549 125822 131159 -8617 27392 3351 177528 361652 -2823 -327717 -107493 9106
19539 9106 -91115 107673 165215 76220 213177 314765 197524 88331 295703 418304
19529 418304 301347 305125 205166 151968 342854 626649 801265 711397 396982 185041
19519 185041 403241 503324 577296 632304 706123 523292 552209 379043 367994 376097 447712
19508 447712 400920 514185 548133 454916 282141 458623 506502 264479 -22241 -159908
19498 -159908 114086 167279 472977 517179 256546 -62274 -196947 -241909 -156451 -178645
19488 -178645 -119162 -193829 -138840 -93709 -144894 38124 246520 67279 -15111 -169306 -96885
19477 -96885 -97353 -167030 -46268 -147235 -17795 41980 222909 252860 220848 301497 506900
19466 506900 479758 482436 610361 515259 473760 549987 807525 1184299 1174388 1085727 897747
19455 897747 719299 728831 969990 1097363 1038479 747531 792798 707144 428621 342744 298404
19444 298404 334615 546638 742795 679249 484520 236155 154318 53596 -149227 78167
19434 78167 306175 257577 274617 388096 718567 994598 931304 855591 698120 429120
19424 429120 160350 106356 337963 513529 630375 730129 667076 655685 830126 748579
19414 748579 665208 713678 642258 776560 682391 375257 408076 274197 150293 218346 320718
19403 320718 256521 331221 147210 118680 126578 185765 171307 73682 81629 242670 567530
19392 567530 420365 244672 213525 54694 -106991 -177582 -306912 -166432 -146354 -51804
19382 -51804 -43954 82029 185872 182511 294323 445997 379375 245314 197087 176285 218
19371 218 -48553 13077 57631 45859 3089 -16490 39697 110270 410752 467532 339790 305834
19359 305834 227265 64196 205630 124497 175149 283279 220982 130008 -187399 -276199 21589
19348 21589 200458 169586 63457 104006 -53185 -79998 27233 160664 243563 174750 202557
19337 202557 363055 111525 92810 75359 -64381 -99057 -145970 -100355 -246631 -262532 -93339
19326 -93339 -110262 -304780 -300810 -175189 -395025 -330495 -271997 -424951 -274869 -31907 113859
19315 113859 149553 -101760 -132330 183717 330753 152008 34609 100878 293971 547156
19305 547156 874561 709558 336435 277668 334550 227335 84030 7428 155895 -50408
19295 -50408 -174751 -120908 10352 22790 -263434 -388240 -263388 -182243 126114 123036 17231
19284 17231 -248517 -248961 -167708 -301640 -177297 229137 216121 51430 -41479 6618 36416
19273 36416 132124 47466 -90243 17160 23818 -63571 -265302 -284774 -102840 -196523 -259736
19262 -259736 -468711 -342149 -120620 -136605 -73972 -71216 -93589 -91263 -15038 -62347 -28968
19251 -28968 37718 -2859 -23308 163830 288709 318090 282149 115075 -1836 -31445 22925
19240 22925 -156260 -135235 -80472 -68683 -182936 -264485 -103915 -29548 113330 -20541 -109052
19229 -109052 35081 121702 172631 77931 287732 309229 108734 -73575 -348701 -115936
19219 -115936 -27331 76646 17316 -178536 -146011 -182077 -222241 -393775 -203369 24158
19209 24158 -18599 -57199 -9994 59503 -7479 -37498 186928 325802 332494 198138 156884
19198 156884 -89585 -41326 125111 199816 302966 359314 509714 587499 626017 698516 848989
19187 848989 912430 913653 764428 603537 519906 523814 695995 729400 845687 858673 783718
19176 783718 623730 587041 779107 776988 646330 315337 181682 170696 78114 137716 296464
19165 296464 265862 66924 329755 530843 547814 359503 363950 529139 722621 963929
19155 963929 985016 941903 781167 621609 602859 834068 749385 610587 614145 824398 878254
19144 878254 511074 295192 241176 159259 305311 279540 293891 170278 246075 172644 136793
19133 136793 168955 -44294 -84697 35014 -177624 -84453 124874 509763 522324 267877
19123 267877 315777 269289 212282 250843 473018 484413 885772 586834 368763 499536
19113 499536 512206 346244 160622 56898 50606 41659 145213 120039 -18843 -195966 -80102
19102 -80102 232955 374519 433396 476659 438860 359448 354553 515689 367604 202756 89745
19091 89745 112379 210018 41193 56663 298292 512354 334891 354649 521222 459962 507917
19080 507917 719357 878471 601563 469390 615013 631210 473990 600437 772724 945269
19070 945269 951456 989700 1107767 760939 608138 593052 760973 899098 1009148 950691
19060 950691 1028615 1098631 978541 861845 844709 736081 584641 700257 868519 965454
19050 965454 795586 828581 892930 653332 728379 796306 704238 566865 584002 751012 936978
19039 936978 942403 997114 1158510 1364046 1309906 1159788 1159466 1321827 1332424 1625822 1743205
19028 1743205 1623015 1566825 1658238 1732211 1650465 1792728 2023262 2556185 3080279 3358008
19018 3358008 3457035 3522077 3959645 4181978 4396970 4820911 5160656 5708170 6360546 7245145
19008 7245145 8568515 10572335 13126681 16433254 21062244 28133800 39522572 58319214
19000 58319214 86674437 117319698 131183282 120947818 104919265 103132393 116861685
18993 116861685 130698432 123232661 94465035 64726049 44447984 31786570 24049943
18986 24049943 19539302 16217620 13324358 11184919 9669584 8646522 7630823 7003071
18978 7003071 6456283 5949994 5735476 5588919 5104079 4876824 5019312 5163183 5137985 5199317
18968 5199317 5445949 5291571 5233288 5251189 5527526 5989097 6308979 6565473 6620770 6769239
18958 6769239 7255087 7925192 8823944 10354535 12339045 14458256 16917608 20135652 25321450
18949 25321450 33814385 48066760 70597272 99055788 119767671 118368178 102964882
18942 102964882 95293527 103731138 119649277 122852131 103068902 74994467 54497322
18935 54497322 43041422 37515963 36498603 39058602 47245504 63891962 90664476 116653484
18927 116653484 120149275 99154872 77953335 70391241 77166249 97409372 121774403
18920 121774403 126110928 101146604 69710077 48478605 36350461 29631665 25893848
18913 25893848 23889894 23342944 23766763 25180017 28220438 34469631 45938065 66144740
18905 66144740 96309755 122767593 122771471 99044517 77636012 71126786 79670433 101168102
18897 101168102 124158551 124365474 96242208 64264388 43038214 30624045 23058681
18890 23058681 18532896 15222370 12605482 10762790 9348616 8405263 7743150 7281486
18882 7281486 6594776 5882696 5324170 4932003 4695685 4633304 4576951 4210399 3621407 3164363
18872 3164363 2821593 2433705 2460466 2338574 2053311 2134331 2283320 2342136 2180654 2132001
18862 2132001 1959148 1754455 1534594 1404874 1049060 799258 623916 717147 790617 706419
18852 706419 610297 537424 626516 616590 574108 333871 287724 511322 584104 644479 870607
18841 870607 1016420 1067577 1117594 901622 749297 625287 392488 469636 421163 379990
18831 379990 370370 614728 751787 409440 307963 503334 503386 758806 939472 884502 867891
18820 867891 978754 922064 835728 1112351 1044115 873807 915277 749300 470599 602942
18810 602942 720783 661113 601313 680288 654071 492232 277741 269097 408398 494313 526645
18799 526645 617758 571652 672535 1055931 1000431 801572 655022 547167 524153 433151
18789 433151 487037 399402 517351 485446 328437 423755 427928 332179 397633 258329 76991
18778 76991 264079 449782 479536 420645 364015 360994 387326 458249 695480 1431811 2331656
18767 2331656 3304138 3878897 3483737 2386275 1823478 1391627 1346271 1504051 1614563
18758 1614563 1570427 1190300 799083 525583 199009 254847 252377 179891 90034 80230 347907
18747 347907 186200 -45927 30346 150411 403331 670333 715625 776244 825388 688408
18737 688408 598845 911798 1173088 1079930 761685 683178 621484 457032 348986 132369
18727 132369 90321 -68953 -29008 -29819 26839 -78902 -11046 -145318 -129021 90207 243367
18716 243367 195266 259177 341554 214663 159416 429509 352804 214598 92371 -139521
18706 -139521 -12512 171297 142876 282647 223411 325791 624937 686736 299549 122561
18696 122561 149291 391608 383530 277437 480267 605739 433289 162513 132608 -97086
18686 -97086 -92735 -47470 23147 97998 -97780 234066 672281 619140 453041 266787 197367
18675 197367 221870 389265 478348 326244 153518 116008 318363 477606 359425 375625
18665 375625 486576 514853 618935 712061 772640 569678 515871 390867 128989 216257
18655 216257 438392 717043 820621 760185 924141 999799 814565 824269 595674 575949
18645 575949 888202 996757 856927 988321 1258910 1455115 1531371 1283762 1251603 1213653
18635 1213653 1256930 1608761 1851397 2135072 2279544 2300159 2170174 2301713 2457741 2561381
18625 2561381 2560426 2672320 2769532 2944459 3306734 3623206 3615591 3572636 3659228 4111028 4770849
18614 4770849 5850691 6872299 7948039 9665314 12151878 16032633 22183889 32311569
18606 32311569 49897613 76771781 104677425 113802794 97609368 75527104 65339098
18599 65339098 69536904 86866607 108407160 113104620 91655894 61932518 40760274
18592 40760274 29017803 22670877 18630874 16057417 14248720 13025825 12450606 12053400
18584 12053400 11737869 11673667 11778251 12549999 13478219 15153250 17890275 22034305 28369784
18575 28369784 39596132 59217381 89485207 120428453 128658696 108724343 83639014
18568 83639014 72680570 77411768 95922712 118170742 120951019 96952063 65477629
18561 65477629 42811425 29725110 22057432 17046545 13974726 11933345 10500243 9416038
18553 9416038 8403899 7409738 6541611 5589026 4991345 4329865 3654454 3401372 3447193
18544 3447193 3090256 2779807 2798532 2527088 2353603 2243320 2482351 2583238 2468675 2252149
18534 2252149 2279624 2120295 1630118 1428925 1619578 1611266 1417151 1432808 1283653 1089553
18524 1089553 1102116 1193190 1330560 1161305 1002203 919024 825784 799110 420243 635336
18514 635336 746755 639343 655618 561880 295713 50944 171533 205842 135296 156452
18504 156452 519832 585440 636002 617364 739476 863595 828930 789103 444644 395432 414970
18493 414970 330382 351750 324759 424808 334836 415904 298030 -21545 244975 349050
18483 349050 170636 178884 383592 216790 106800 264733 371506 386093 656032 808666
18473 808666 791851 705666 885962 1057733 981210 931266 1072414 1125574 1081146 741598 542540
18462 542540 431997 501271 708228 836443 685702 270224 -25296 116927 454474 706442
18452 706442 414064 214556 513900 758455 655051 380569 283886 214926 62712 23995
18442 23995 102706 -16869 67051 211656 270285 233617 17727 181357 313290 149979
18432 149979 190831 240924 293306 344439 375082 667764 834563 903895 917908 903421 893978
18421 893978 831728 872388 977903 965587 742993 739054 659932 493700 557711 725718 789960
18410 789960 831309 632005 588141 608826 594943 860932 1046769 830467 544308 299036
18400 299036 184940 207969 392836 721719 905722 869875 797332 921124 852300 810030
18390 810030 963585 925855 705572 740574 647510 657239 844016 563059 467896 492551 557938
18379 557938 690896 885553 925322 1099772 1335454 1202205 944785 951446 1051285 1050092 787749
18368 787749 599173 616865 835442 530864 358720 316060 419321 325832 567371 696216
18358 696216 762930 714367 514708 473986 364069 485827 523654 282690 526668 413736
18348 413736 375792 328405 133248 35416 59830 187181 305048 371251 422515 574374 530436
18337 530436 348119 167742 -138452 -347579 -322154 -234795 118453 328480 305482 437527
18327 437527 580077 529384 396114 178132 288539 47845 -277736 -463141 -449095 -289747
18317 -289747 -213763 -293302 -84611 38364 24198 95281 376767 126890 -10674 -129327
18307 -129327 -107793 82921 245005 78236 -26066 -86824 71431 237774 142043 93597
18297 93597 277946 376435 308082 284432 418718 280395 254832 199033 189395 422644 425816
18286 425816 303807 256065 130043 83529 335654 531433 432771 556795 546963 501876 320364
18275 320364 199926 60029 301753 197629 15460 15828 115841 3625 149846 291324
18265 291324 420708 367948 -16945 -480963 -341400 285253 291723 211567 577850 757059
18255 757059 597579 643392 634791 654887 418983 329870 462499 408914 497945 346606 128507
18244 128507 91362 203848 252536 412263 585638 590073 497639 662471 725933 825917 780056
18233 780056 643569 460670 383722 544272 407952 386754 653661 677034 859557 848906
18223 848906 618974 404527 470593 654412 786436 808392 906891 1065084 1023056 897852
18213 897852 504252 459376 289851 240612 271788 582628 731961 842147 838770 940435
18203 940435 938517 1286588 1151434 927584 812424 1009265 1217386 1639683 1563505 1425733
18193 1425733 1198123 1093157 1258582 1164321 864635 681682 761247 872995 695732 359162
18183 359162 197574 256058 326013 318238 418943 855032 883806 463695 239799 356630
18173 356630 670329 839821 844642 870609 979162 900913 1096214 1530062 1935913 2042476
18163 2042476 1866892 1497309 1555458 1574512 1535781 1595769 1896472 1979603 2006871 1975045 1716899
18152 1716899 1343125 1314687 1417401 1545023 1608897 1594520 1682708 1784236 1725420 1917211
18142 1917211 1989156 1956992 1916299 1941291 1958674 2084239 2428212 2672451 2985075 3404990
18132 3404990 3728942 4050903 4406919 4636961 5049753 5509514 6104281 6602282 7168604
18123 7168604 7877554 8994523 10999508 13220590 15499379 18412472 22074692 27142638
18115 27142638 34426098 44828871 61505817 90259611 143888637 245770681 417719137
18108 417719137 566890654 528462717 338251115 192887756 118853116 80072755 57483173
18101 57483173 43458128 34067914 27600876 22648738 18941244 16149060 13917047 12477218
18093 12477218 11035851 9696980 8538167 7687059 6888542 6244504 5879618 5589856 5422249
18084 5422249 5195648 4834267 4863554 5013750 4898777 4591807 4777197 5131706 5217006 4797135
18074 4797135 4518514 4496358 4387132 4425386 4275402 3843472 3620578 3529418 3634697 3563104
18064 3563104 3435320 3144170 3108615 3194958 3230759 3266969 3201499 3141130 3386394 3735102
18054 3735102 3721998 3633636 3496281 3432182 3575194 3586188 3795967 4157910 4374081 4590575
18044 4590575 4728176 4903715 5189838 5234394 4953383 5033214 5209647 5585897 5997814 6743903
18034 6743903 7937704 9452138 11778911 15482673 20879597 29809118 45649166 72129089
18026 72129089 107522826 126824054 109242884 73869569 47969150 33239427 24955558
18019 24955558 19950604 16585038 14304933 12863136 12210656 12049345 12195342 12676083 13453891
18010 13453891 14235304 15210163 17206533 20828142 26266395 35492881 51705941 78488394
18002 78488394 110963079 124660696 105823241 76592125 58944896 54176757 60707677
17995 60707677 79380421 106840901 121102596 104228028 72886162 49529575 35068815
17988 35068815 26269230 20692617 17222284 15136094 13949967 12969278 12251891 11645458
17980 11645458 11398251 11262023 11374601 12444287 14137435 17297609 22249894 30533769
17972 30533769 45124815 69308742 98421704 109344345 88563366 57461427 36645780
17965 36645780 24724138 17789898 13363666 10534789 8663371 7555503 6453401 5571751
17957 5571751 4848383 4215243 3482532 3041927 3020746 3021977 3011035 2899255 2478699 2083035
17947 2083035 2045048 1871128 1711397 1553503 1652740 1725893 2035784 2007947 1728196 1408135
17937 1408135 1055882 871650 778605 920789 1017814 1112803 1188261 1095050 1072771 1078906 967274
17926 967274 1045716 1191824 1221704 1082158 1050127 919291 622728 507587 617535 822598
17916 822598 542601 447537 739342 778654 629864 457466 461307 603964 859905 620475
17906 620475 560709 511194 749432 590608 506041 488116 367880 334592 218477 41388
17896 41388 -110763 -130087 -192929 18723 235508 347287 233344 -35916 -112711 75259
17886 75259 235129 -28605 -185726 -186841 38220 101826 83865 241167 22849 -141730
17876 -141730 74261 307176 550325 689660 510555 327196 240738 213010 143102 387246
17866 387246 564773 816044 866732 800967 431834 221992 521112 715469 706289 719449
17856 719449 886741 659530 333551 -27040 192036 385154 581320 517111 509112 626585
17846 626585 530763 599056 563545 343489 214957 290065 434541 503075 516126 788857 699291
17835 699291 700070 539031 275454 294111 21144 -17614 62564 20633 -47362 207924 288980
17824 288980 87275 94320 392722 469832 620685 790999 777626 954880 1421623 1785624
17814 1785624 2091144 2217505 1824957 1520278 1180407 1109053 1058910 1029758 1023981 1072864
17804 1072864 1115924 996423 596566 655358 1053518 1197466 1190554 1184847 1138530 981734 1059619
17793 1059619 807940 392783 225632 309122 156378 -50107 271254 700779 649678 285828
17783 285828 386505 479500 587796 627736 669284 261987 212802 438084 366981 113008
17773 113008 218784 361365 177352 226840 443479 477785 606722 526396 573238 393519
17763 393519 229472 163628 414321 426851 364519 379923 265857 183583 397484 701860
17753 701860 683585 693592 767030 870243 918254 1095343 1229884 865314 278691 29552
17743 29552 381062 511365 503363 230288 97759 -48482 51505 158077 231373 237193 231255
17732 231255 154644 70994 43410 -33673 -56275 227291 264271 507174 697512 504918 271231
17721 271231 86087 197854 544961 756560 772301 744828 769066 574681 399683 413384
17711 413384 207581 243596 297895 393992 498798 367333 194450 -117034 -115344 -28791 -130745
17700 -130745 -83854 -122732 -154024 -159813 -117646 126715 467965 664571 664375 591364 332723
17689 332723 -148360 -278221 -133955 101554 182229 -13862 -279536 -104444 78008 22052
17679 22052 31003 -32530 -269144 -266687 -289492 -336194 -215698 -5901 126192 144350 -34436
17668 -34436 -350134 -572470 -626856 -552643 -492701 -536401 -254385 -484266 -505554 -360940 -255078
17657 -255078 -141206 -235155 -232049 -500297 -335819 8381 -122802 -242410 -475302 -602615
17647 -602615 -525703 -362520 -410548 -387199 -159566 -52528 314068 406039 428911 144235
17637 144235 146446 262411 138849 286837 52265 -108407 -260517 -385702 -370627 -458443
17627 -458443 -401196 -410173 -481231 -516420 -302641 -186868 -196482 -199055 -193683 -1979 4869 91873
17615 91873 45219 -14563 -69403 -159191 -193549 -31732 35939 -17861 -141356 -156862 -35798
17604 -35798 167913 172124 3953 -133956 -101297 -35112 -115043 117933 282056 188658 -223950
17593 -223950 -429843 -383009 -255392 -225898 -293555 -92508 19517 -55350 -197551 -78300
17583 -78300 -23832 115285 82396 -36190 -49890 -89317 -41076 -111093 100602 -5987 -203163
17572 -203163 -190051 -93640 -169896 13204 89188 30855 -178242 -183760 271076 398376 353212
17561 353212 141764 -109241 49082 44858 -54998 -127778 -53627 -74123 -152224 -149370 -20299
17550 -20299 132840 100385 -85353 -106608 -120412 110270 367609 283660 199178 -43784 -234766
17539 -234766 -286283 -389039 -69453 114729 226372 76230 115364 34409 -97720 -385137
17529 -385137 -379923 -285094 -304366 -57780 28449 122715 252636 110053 -8274 -8891 -71573
17518 -71573 -123446 -122317 104588 392368 426255 67134 -81564 -77189 210206 226907 262526
17507 262526 166364 -58240 -207300 -77968 -192149 -227899 -98513 21196 -82209 -237158
17497 -237158 -94881 166354 209377 2288 -125694 120388 454296 309707 232356 162097
17487 162097 113261 167367 215533 240133 182958 175683 377342 488412 183701 -83876 -163711
17476 -163711 22079 201638 379767 142610 38301 92810 105564 108569 271653 556432
17466 556432 329407 216219 19605 -87969 1646 137985 179252 129934 -152434 8372
17456 8372 153872 225541 547404 582088 355748 156176 130494 163260 -825 21885 382810
17445 382810 568137 999631 1956891 2757938 2783302 1948527 1136166 774022 629483 210690
17435 210690 -217314 -5339 297981 446543 266721 176265 186800 158076 -72491 -32070
17425 -32070 147671 267978 347548 206983 117657 168869 -1488 78427 47891 142396 148250
17414 148250 98108 -17341 -227643 -251375 -155203 53664 -22983 -181723 -327824 -327196 -116035
17403 -116035 -145355 -255406 -285599 -78756 -115264 -161068 -90391 -336850 -347102 -344111 -418709
17392 -418709 -522764 -448838 -74715 -168300 -173559 2853 -77561 30451 79401 -5123 -66799
17381 -66799 -20259 11962 128948 -27860 69575 -156882 -473568 -440401 -210250 -150111 -521429
17370 -521429 -598547 -509142 -379861 -336023 -93489 173505 -39701 -313195 -115724 -33958
17360 -33958 -131177 -144325 44698 145944 45572 -267563 -351359 -267552 -216380 -233669 -298449
17349 -298449 -253654 1079 -130225 -207636 -330551 -194689 -14507 -161894 -298242 -288750
17339 -288750 -237506 -137777 67627 68441 -173911 -245186 -70171 -52404 -164705 -135145 -46129
17328 -46129 -129749 -150657 -248311 -278023 -163870 -169911 -121955 -216691 -55867 114960 197150
17317 197150 160455 91043 -102603 33108 134889 158308 101725 -130527 -212443 16513
17307 16513 114514 -64217 -469816 -456261 -212119 55101 259171 213932 -73978 -199289
17297 -199289 -386694 -480213 -234052 -138673 -162180 -16992 150293 388095 700243 689256
17287 689256 654195 673113 654119 688590 928129 910055 866666 810753 736914 713512 457206
17276 457206 402804 637422 584924 599390 349025 372080 551435 648835 698070 528748 564515
17265 564515 619363 536255 497735 503957 546701 488322 487050 703685 955416 859030 845792
17254 845792 720464 840805 846343 770932 581041 266002 186329 425286 285570 159867
17244 159867 152660 215419 106704 51550 98252 352870 353417 449342 824558 1074398 1045613
17233 1045613 797567 779191 714179 485768 489159 463125 372812 212955 55364 -126603
17223 -126603 -183060 -149509 -165366 -199227 68092 291867 385356 340085 272731 380149 575986
17212 575986 575010 421105 271600 321133 440073 578051 444071 259890 321957 362688 239603
17201 239603 -4654 -82870 -178766 -69467 128144 81082 -20877 -47996 -216746 -307999
17191 -307999 -119334 40447 64351 218567 284093 534651 718216 574642 330453 278720
17181 278720 186547 84814 30766 -194783 -331469 -403792 -239978 -136562 22923 -180676
17171 -180676 -380600 -621765 -631812 -316390 2550 110635 56251 30727 222664 197699
17161 197699 195391 327066 364783 19605 -11199 110913 179320 351760 404882 450351 624368
17150 624368 249469 -168277 -549574 -610542 -479325 -587489 -499951 -193223 -273457 -435783
17140 -435783 -387151 -110453 49988 158812 180017 -19278 -53669 -14397 -81813 -60468 17320
17129 17320 -46262 -148554 -370472 -169450 17825 64995 403503 441213 108242 -130294
17119 -130294 -210945 -137212 -30310 -192589 -222762 -182343 -326411 -297875 -387358 -116853 104752
17108 104752 52098 -102565 -4500 -124754 -79406 150165 117620 -109065 -151005 -7324
17098 -7324 -172819 -426096 -546220 -520354 -608477 -627406 -511810 -481873 -126896 217888 371175
17087 371175 378985 104336 -151585 87508 171094 -69847 -3839 188456 313501 67765
17077 67765 -47169 181908 43854 -206978 -282894 -565403 -694549 -507483 -143062 -18205
17067 -18205 213461 240933 102036 18221 26259 -8731 -180436 -104180 -317902 -161403 -373795
17056 -373795 -556494 -584381 -575843 -361599 -127763 70678 388965 359455 84011 214892
17046 214892 46469 -129272 -105706 -153465 -225389 -315053 -499425 -525736 -543239 -344321 -111504
17035 -111504 -192780 -346591 -283726 -399774 -512286 -310048 -82517 -6555 217440 334190
17025 334190 325844 189960 189872 124542 238460 333673 143944 117132 57698 205855 -46597
17014 -46597 -234130 -195029 -136702 90816 217247 303967 117809 -133668 -544697 -503501
17004 -503501 -140477 29767 -295048 -257580 -441178 -268834 -270499 -126755 -66018 -94621
16994 -94621 -63073 -45804 129943 231421 243968 -47664 -249120 -248375 -314724 -148288 88928
16983 88928 205192 179151 175390 225934 15524 -125744 -144613 -82153 113551 261066 118396
16972 118396 -68094 -54807 -94246 -311681 -299912 -191689 -112387 -139479 -157081 -82372 -17723
16961 -17723 -70059 -147858 -177068 -70856 -165781 -241293 -342571 -260286 96512 345394 103243
16950 103243 -113184 -160163 -108336 3009 299668 203370 91297 -89639 -158707 -49233
16940 -49233 30422 -42259 -267832 -401478 -301506 -291809 -289903 -67168 141349 291699 414118
16929 414118 567420 349314 217380 191432 -76342 -169333 -205278 -163369 -58800 145744
16919 145744 -168412 -192896 84379 264720 254509 276908 303863 180477 111395 -61761
16909 -61761 -213625 -130223 -182768 -320230 -315421 -211723 -395832 -252034 -99736 -82854 -29621
16898 -29621 -238982 -303371 -300953 -289716 -247059 -349359 -383574 -125963 -91087 7181 133957
16887 133957 45254 -35591 -38313 -148877 10974 146440 92140 -291464 -451643 -313438
16877 -313438 -206434 -172379 -179816 -203257 -129919 -47741 -77789 -88160 -293653 -359438 -110612
16866 -110612 -152177 -337701 -338565 -62270 -65269 -287979 -391889 -327772 -249566 -226513 -208808
16855 -208808 -389204 -370812 -370922 -388634 -282317 3866 46257 139401 107707 121615 202671
16844 202671 254241 245890 358787 222518 21837 80887 -89672 -348193 -282835 -172503
16834 -172503 97606 7297 -128927 -110075 87574 116899 -112706 -7044 339847 348968
16824 348968 290541 -109422 -316331 -223559 -230367 -143288 -41183 106250 136310 173505 53826
16813 53826 -309370 -106875 -8994 89285 277355 164103 -172287 -182818 54242 161822
16803 161822 157857 154862 -27135 -115631 -55771 -75319 -110996 -46658 -65440 -43576 280231
16792 280231 254182 -77092 -18732 -47151 -211441 -239428 30841 84636 202286 97066
16782 97066 -104601 6165 106541 173736 195057 -129627 -409686 -422461 -19910 130220
16772 130220 204744 294948 132936 -30740 -22757 -37607 -260976 -231796 -305140 -299227 11686
16761 11686 302262 317053 324318 398244 232185 -5757 -112141 -27166 70054 204854 22674
16750 22674 137894 57318 -152182 -308262 -120070 50715 111025 167834 127125 -331632
16740 -331632 -336184 26779 167384 147162 142811 36887 -36437 30194 -148997 -301798 -123988
16729 -123988 27848 47323 -120620 -242286 -89171 -184707 -462104 -288188 -227838 -44616
16719 -44616 107545 -128502 -5377 160261 56344 -26753 -14298 -26093 -3954 17438 81986
16708 81986 111965 201457 80445 38269 -87761 -91180 -87557 -121638 -140501 -119278 -81273 152975
16696 152975 89425 7519 -15307 -230673 -211189 48358 64550 -43195 -80668 -98908 -200040
16685 -200040 -122495 47552 153998 -301518 -453016 -276946 115741 -40381 -126771 -27464
16675 -27464 105908 110785 81451 -142112 -150462 -3571 -127067 -182659 -3559 175970 250143
16664 250143 386087 410129 4254 -223349 -115662 -14578 99774 223643 176940 211404
16654 211404 288733 256395 148851 97860 -109321 -478828 -618466 -494118 -81441 -55391
16644 -55391 -10016 224895 366417 298695 276284 265716 217059 -84635 -206602 -81704 -41489
16633 -41489 -125591 -227366 147586 239374 210741 -9873 24798 74909 10323 -144738 -181341
16622 -181341 -188501 161939 220550 -15100 -351186 -370460 -97419 -85659 -291117 -189999
16612 -189999 74754 70372 -191628 -342845 -287569 -344878 -296288 -321820 -420189 -347917 -293631
16601 -293631 -218243 -91064 30220 45971 -67661 -160386 3154 136807 82889 182521
16591 182521 122430 87103 169551 447048 400091 79277 200006 201725 70647 10889 -25428
16580 -25428 -147455 -438820 -543443 -633587 -556080 -233688 -1164 -26799 115030 -153815
16570 -153815 -246323 -93648 -243907 -211325 -150146 -90673 83317 -101485 -401304 -423639
16560 -423639 -414599 -356526 -323532 -84180 84182 52995 -49912 -177509 -289149 -48647
16550 -48647 141098 295363 148320 88643 81382 122791 20618 -16840 -146557 -39831 293847
16539 293847 388813 213125 332586 537199 627609 336720 -33170 -228231 -217139 -346471
16529 -346471 -412442 -216425 -35952 -251283 -427443 -378866 19692 47674 -82488 -42827
16519 -42827 -91489 -70180 25241 -71740 -179109 -221200 -173840 -63101 -36311 146582 244383
16508 244383 -7102 112320 334376 669805 820566 514801 264535 -126784 -179476 -193205
16498 -193205 -120230 616 105947 217421 210851 149821 -7940 -6356 17562 -154291 -134789
16487 -134789 20362 303620 307143 31394 -59678 -93468 -301580 -361890 -122724 11413
16477 11413 -129811 -287751 -280360 -17595 172001 -5907 6093 39457 26360 18434 197565
16466 197565 213533 208079 98158 -82785 -129289 -29653 15719 -122454 -253675 -436509 -494805
16455 -494805 -433082 -283011 -379969 -248838 -184877 -204644 -150598 11699 -204482 -380971
16445 -380971 -332824 -176434 -270836 -265144 -234635 -148702 -223213 -239372 236023 210906 143079
16434 143079 54425 84562 150588 213742 62701 -106046 -386245 -383783 -109511 -126437 -246895
16423 -246895 -403164 -478921 -290924 -12047 130546 54156 -87885 -182217 -335901 -341704
16413 -341704 -230791 -154727 -195163 -89175 21317 -89400 -135416 -143663 138888 95156 42902
16402 42902 19838 462 -168252 -284203 -136486 -204255 -195477 -189025 -132562 -310295 -312952
16391 -312952 -88971 -61369 -93026 -144514 -211545 -217408 -260488 -304359 -180125 9064 15485
16380 15485 -39333 155756 200875 238452 226996 91522 -306792 -301894 -326594 -234612 -123760
16369 -123760 -71635 76402 17742 99424 -26782 -126826 -21302 21181 27088 46730 191907
16358 191907 55333 105056 90801 25547 98998 359752 396556 -146076 -461884 -598973
16348 -598973 -541104 -506172 -426211 -313728 -47818 37371 243722 144402 94119 130988 45079
16337 45079 -48561 -16092 -22097 40668 -156366 -137856 -129557 -219846 -399353 -497129 -510436 -531971
16325 -531971 -320677 -178623 -117478 -161544 -151337 -90910 -241126 -400861 -172139 66720
16315 66720 219055 -58179 -141205 -87349 -122960 -79036 -63802 -74735 -133456 -203367 -277633
16304 -277633 -261247 -119005 44332 41067 -34881 -96950 -24963 77678 -149845 -431976 -554576
16293 -554576 -686985 -531622 -235550 -338720 -684199 -632763 -408340 -566272 -727942 -664844
16283 -664844 -465756 -57777 26427 59656 -117218 -57059 -233178 -456849 -120123 160504
16273 160504 135494 -134378 -17467 -122179 -248996 -126981 -66862 -39753 4028 -88358
16263 -88358 -410938 -361974 -283031 -381978 -259725 -159012 -208949 -235062 -286916 -321598 -260015
16252 -260015 -370808 -292664 -274127 -380405 -357822 -251623 -196339 -216927 -200012 -144036 -143444
16241 -143444 -262520 -244261 -327792 -121810 66999 178144 83590 -127197 -211934 -530998
16231 -530998 -636217 -501998 -351568 -180310 -319625 -231984 -116546 63744 45589 -186370
16221 -186370 -392948 -640157 -257937 -35431 7317 217647 1906 -221230 -274409 -315938
16211 -315938 -192479 -243417 -242476 -125960 -8534 -61681 -150407 -431404 -568456 -554317 -318867
16200 -318867 -52017 -98590 64471 132834 -29156 -17199 -33635 103774 -18290 -62054
16190 -62054 -319289 -345038 -301854 -332663 -409023 -443476 -302598 -288784 -155087 -70930 -52671
16179 -52671 21258 290412 251033 -67393 -175162 -201445 -269903 -493862 -405724 -163303 -75620
16168 -75620 -210972 -341923 -412256 -260635 -175457 -256115 -286199 -74291 -176065 -415221
16158 -415221 -282656 -283656 -89659 26631 -142726 -73121 21797 35719 -16544 -52856 -94625
16147 -94625 -179653 -243275 -386101 -500071 -179680 -88305 -247047 -236881 -332226 -339754 -164880
16136 -164880 -254708 -238514 -76172 -1856 -123872 -113569 -126550 -169148 -157403 -108223 -186737
16125 -186737 -452944 -449971 -199315 -564 132418 43585 -42633 -30004 -49683 -62926 -231392
16114 -231392 -202697 -160526 -361235 -352790 77453 157080 163928 129968 289912 434442 206885
16103 206885 26632 -271367 -514129 -443983 -533027 -415829 -186331 -40904 -113048 -77232
16093 -77232 -210640 -228947 -116151 -279399 -363481 -257069 -272766 -243240 -115224 -280025
16083 -280025 -465211 -487320 -257831 -122208 -114178 -119627 -4316 269127 286166 -137775 -166449
16072 -166449 -250879 -106283 -147959 -122709 -96334 180140 203937 326095 594423 306911
16062 306911 334327 334157 282412 426532 396602 132252 -119979 -127796 131595 319674 276255
16051 276255 141574 190342 168176 188551 174693 197600 87803 26458 -122259 -217541 -303258
16040 -303258 -245529 -104366 43407 -85158 -124325 91021 226298 137804 90630 15770
16030 15770 -58648 48311 -93257 -3819 114210 83197 98562 -28692 -10065 116097 53065
16019 53065 176430 1420 -283247 -138365 116940 191007 159026 -4899 -19756 -33469
16009 -33469 -85737 -6446 127587 -10683 -81188 -53735 -20127 -126007 -85006 196829 572342
15998 572342 487250 322155 107064 97461 73574 -29810 -278287 -386056 -204923 -21316
15988 -21316 106058 28187 -194529 -262908 -365554 -284105 -390463 -488546 -441605 -357159 -217779
15977 -217779 -107936 -200458 -196623 115504 334388 317809 456730 554971 376743 10192
15967 10192 -196198 122752 306953 328070 440117 316163 211505 46443 75525 71247
15957 71247 17242 71662 183051 277881 104608 -17500 92341 63986 -184142 -220277 -202862
15946 -202862 -150868 -141138 -132583 -94448 91892 312569 125192 32237 21602 42962 109077
15935 109077 -154948 -141640 124833 407917 500929 365550 213621 -9745 114771 179896
15925 179896 227887 350603 113769 150676 43906 -42193 -63005 -121667 -75569 -95222 -187330
15914 -187330 -158241 -83135 -98521 -164470 -38920 -146302 -98939 46712 -190276 -510792
15904 -510792 -665091 -436276 -306286 -294849 -214381 -78138 14783 266284 184726 -20216
15894 -20216 -14039 -30770 -16715 -107252 -207802 -124363 91659 287060 119570 -204926 -292885
15883 -292885 -208865 -78390 138028 95042 126564 369666 219290 142254 66354 -147192
15873 -147192 -75759 -237197 -103627 168204 78152 198490 146741 -184405 -193511 34507
15863 34507 231212 327241 319116 203388 -51792 -79222 -101183 -154393 -173425 -285346 -351309
15852 -351309 -332619 -386396 -56171 314350 183749 89134 44610 107468 -78004 -146957 -281006
15841 -281006 -158353 79020 -25869 -172803 -159570 -99351 -130096 -278295 -33836 179434
15831 179434 145439 272953 258640 116244 -32324 -143400 -257545 -36504 -190754 -333865
15821 -333865 -381759 -414142 -283367 -306935 -355868 -437828 -347586 -253357 12569 -207922 -166151
15810 -166151 -19280 176271 711 -309218 -365424 -251401 -280243 -47043 -18822 -108961
15800 -108961 10845 279876 406820 178232 158770 175134 260210 274858 158521 49752
15790 49752 31224 -56620 -45949 12605 21244 -874 -103921 -59297 -16815 79848 -96539
15779 -96539 1718 163388 299919 199826 142062 71782 198505 370028 375096 259921 276864
15768 276864 282136 339555 277637 -168239 -287825 -167013 -205954 -218022 -333298 -294316 -120970
15757 -120970 -138366 -116644 23199 -147849 -117231 -110574 -292978 -534472 -370139 -128547
15747 -128547 -66030 -23045 258040 381357 492623 160346 8095 9598 -104762 -278033
15737 -278033 -373740 -400124 -245246 -153248 -94845 -109768 130796 309433 251670 309310 228252
15726 228252 140935 -113465 -305015 -398950 -232429 134981 209569 148935 104716 10397 -62910
15715 -62910 -119216 24390 117913 30071 -122791 -124854 -166444 -159268 -487583 -502117 -338720
15704 -338720 -259387 -328415 -320819 -114316 -136653 -99736 -222116 -344211 35734 124281 -195852
15693 -195852 -555369 -559165 -274924 -99769 -41042 119688 -74680 -310386 -260548 -174835
15683 -174835 -377765 -347064 -183294 -243775 -319886 -82805 -116903 -112380 -269451 -225984 -20251
15672 -20251 93484 391136 352023 107478 106766 67377 -96790 -234983 -375890 -295735 -198616
15661 -198616 63581 97065 7961 -259940 -296703 -335036 -250332 -291241 -89548 423822 489928
15650 489928 276538 123884 165596 204604 157217 -5251 -63262 -254167 -233991 -105856
15640 -105856 -104186 -194290 -197506 -322707 -278023 -75311 -259009 -191031 -79977 -156821 -202939
15629 -202939 -89952 -8474 -188216 -449796 -299062 -16124 58842 148485 323009 323372 159784
15618 159784 249854 597198 411609 -26094 -38476 -199683 -236274 -100027 181564 347658
15608 347658 65598 53054 208553 113216 106962 18425 -291793 -394535 -298273 -301951 -249996
15597 -249996 -236935 -206692 -163434 -7640 -20317 163437 201935 -16731 -5841 52237 11299
15586 11299 -32777 -196397 -156366 82177 274299 144030 -97665 82404 146099 -198710
15576 -198710 -74820 -208535 -515569 -408701 -177738 -71262 -27509 33437 267876 116258
15566 116258 -32334 24579 -34019 -50363 -115768 -322438 -74191 126806 124218 136720 81675
15555 81675 122373 9268 -20233 -107670 -6261 -2952 71561 67919 -94031 -77047 161360
15544 161360 123487 19013 123038 116241 157790 171015 167335 -75834 -64763 -149823 -247694
15533 -247694 50610 199450 286307 136005 102631 77144 132514 139018 177162 185643 88181
15522 88181 49962 30943 -10597 102922 -2072 -97625 78303 -12253 -21253 -10041 -149357
15511 -149357 -410863 -252296 -251792 -342362 -233340 -397810 -660038 -520720 -205656 -113726
15501 -113726 -131734 -271615 -218411 35224 4968 80437 234928 275081 152752 230479 163369
15490 163369 272651 239676 137843 207682 292330 295632 101448 -248494 -100630 96930
15480 96930 117324 50386 2759 -133446 -247469 -266688 -24243 117373 -5913 -52192 -146871
15469 -146871 -117666 -72117 82264 79995 -48832 -187594 128067 74207 -29171 93505
15459 93505 8696 -145928 37814 95983 -273498 -309461 -67766 -46150 -118805 -67529 18820
15448 18820 31714 -110413 120820 109262 -33246 -123549 -74552 50878 193043 198902 36905
15437 36905 122308 46049 -33881 -19833 61110 61309 254507 286142 202063 58302 -78609
15426 -78609 -23712 70468 230656 236844 172936 110046 119778 -145447 47203 169529 233654
15415 233654 221490 13058 -47619 52014 74122 74598 282327 430981 445309 363421 209718
15404 209718 132999 122855 268576 214450 53929 49491 203027 307705 240722 133997 -9304
15393 -9304 -88843 -102494 -58772 115068 2797 19369 81263 49896 38338 144886 94389
15382 94389 -38357 -5068 132237 127353 -29471 -138528 -91244 -194580 -496829 -731457
15372 -731457 -685346 -455387 -298920 -58922 39765 -134097 -44800 -55704 -123186 -279332
15362 -279332 -221804 -218035 9918 249516 223706 136422 -3658 8107 69890 66162 66166 -270266
15350 -270266 -122587 -13925 35024 21833 -143765 -127318 -111638 -260187 -208000 -441955
15340 -441955 -304221 -162616 -189151 -282961 -401309 -461718 -258305 -95235 -65271 -161859
15330 -161859 -23315 63291 170754 161571 303490 332913 13968 -190712 -159226 -175432 52820
15319 52820 295959 316523 306781 573100 351687 -52113 -60501 5473 -64167 51151 10239
15308 10239 -100079 -92866 24615 128719 -4412 -267472 -419639 -270223 -71109 103012
15298 103012 -50505 -114999 -338238 -367908 -437383 -359020 -409663 -375012 -657652 -632883 -470506
15287 -470506 -446364 -155933 63997 -48610 -302753 -289314 -250223 -196851 -121839 12252
15277 12252 168321 237480 218801 282668 358085 192677 160024 251520 190329 96559 -21083
15266 -21083 74613 31496 -197673 -22394 212943 298907 191635 9943 4562 -171995 -106710
15255 -106710 -195104 -82813 -50656 74381 129191 44216 -139708 -297110 -198400 -274331 -259687
15244 -259687 -386429 -408732 -286334 -123024 -24641 -94306 -98500 23546 139036 -20423
15234 -20423 -219430 -290777 -197895 48135 154334 189964 278603 189776 150228 102135 211758
15223 211758 -86081 -199096 -108390 -149773 -131586 53253 -1740 -107232 -80348 -12264 -115313
15212 -115313 -205717 -259365 -112819 6244 -19881 -229090 -284718 -188375 -101204 -172980 -67910
15201 -67910 53389 -178795 -387528 -382820 -261494 -217941 -245149 -120496 142677 217923 238190
15190 238190 135135 -720 -65894 -169858 -167731 -163290 -101164 115213 284387 202358 96600
15179 96600 144806 -74500 -162269 -101441 -17663 -56163 -67392 157153 186287 195639 140028
15168 140028 97109 -11571 -20709 40978 55943 -65153 214525 385725 394321 721054 735492
15157 735492 579011 330956 428029 353609 -57472 -130401 -34534 -26334 -100479 -14003 -206
15146 -206 195905 173900 7576 -112086 174401 225085 53389 -192563 -246602 -99962 11939
15135 11939 245340 252163 50197 -42004 -116644 -8828 -120442 -140576 -23627 39807 -40921
15124 -40921 185806 258811 181027 262078 462765 324214 181797 -12115 -254054 -598532
15114 -598532 -701806 -687485 -625445 -261981 -94925 -14014 149946 -51539 -170067 -288406
15104 -288406 -54163 -153585 149621 401743 453662 304729 342055 445880 -41921 -119222
15094 -119222 46457 38561 -174243 -86859 22191 -84076 -173767 27779 117613 -44572
15084 -44572 101568 291688 214319 -16403 -122687 7451 83564 66510 79082 325825
15074 325825 355560 306796 279118 53916 119021 393390 270148 129982 138359 148946 136819
15063 136819 230542 67867 -9628 181550 168526 -603 -99623 26885 103012 424551
15053 424551 640665 608400 287378 -21338 -125517 -140096 -124489 44080 5376 16183
15043 16183 74786 75384 132201 110141 126381 101036 130433 166045 17400 -8135 -13529 12005
15031 12005 22954 42714 -2554 -49396 -120256 -109469 -50120 13011 -162926 -128045 182567
15020 182567 367794 108042 -65763 -134106 -123378 -75869 -61364 67630 123528 324383
15010 324383 474479 643012 1040895 1876500 3589474 6469338 8294940 7330000 4549917
15001 4549917 2580267 1643370 1077708 622629 579720 350260 212777 236145 35039 -129293
14991 -129293 -362996 -240115 -14234 30808 109253 365071 508455 423092 100137 43891
14981 43891 31156 89426 108086 70888 138116 275278 281941 123081 157612 310945 178649
14970 178649 45087 95576 62718 54227 122039 -4077 -87218 -126350 -47774 94904 93772
14959 93772 -146385 -277360 -228793 -292891 -135541 -278011 -193286 -88047 -38181 221665
14949 221665 -5847 -85620 -48525 -53076 -165671 146058 139223 -30498 104412 201061 30196
14938 30196 -48316 -101465 -234822 -223531 -101958 -225868 -229886 -212634 -161773 -84309 85600
14927 85600 85056 -125805 -343082 -481596 -453975 -187543 -15226 118126 396820 397885 231608
14916 231608 79859 184540 304877 245170 433584 493229 431047 442373 282265 176242
14906 176242 101861 79788 276320 114862 -53691 -23634 -63404 -366977 -417875 -226924
14896 -226924 -248598 -314145 -208588 -84773 -172752 -181738 105696 242552 191720 -12715 -100901
14885 -100901 -84229 -87229 -70131 35401 -42620 -189748 -338352 -293453 -289739 -39923 -74797
14874 -74797 -61152 -82828 -121489 -221737 -261378 -198967 18897 103203 137685 166942 402565
14863 402565 479916 323860 138999 133263 273901 407742 243033 276948 246943 36486
14853 36486 -28110 94698 169328 20979 46899 47938 70948 -308565 -389395 -189198 -106484
14842 -106484 -154655 27194 130561 151436 73585 -215310 -117949 83942 277798 489571
14832 489571 591493 202662 -71435 24753 47952 191559 188114 153830 154099 29125 82479
14821 82479 36814 120722 72118 -27887 -129792 -12431 118020 -270944 -311685 -141891
14811 -141891 -217090 -74836 39264 11978 45918 -89573 38015 120765 88736 142683 77503
14800 77503 165341 306273 275549 381068 196417 -23557 -193206 -224853 -207313 -145192 40456
14789 40456 58653 46790 -104315 -189146 -143812 -85725 10287 31286 -76125 111133 159745
14778 159745 66949 2658 30023 16311 171364 178349 127053 176848 35058 -271449 -211261
14767 -211261 -316117 -362601 -161945 -94584 -210092 -79336 81962 382767 472744 405408
14757 405408 261883 1564 -54810 -12747 117439 78288 -96234 21602 109814 63549
14747 63549 50481 33337 -6776 43922 180424 175820 120827 85052 -61155 146812 160503
14736 160503 66906 -166613 -103907 -155139 -208183 62406 263648 372084 266272 155919
14726 155919 130308 -42215 -100786 -67921 46610 198308 118383 185094 442346 534335 308183
14715 308183 192890 177319 163714 31511 -29762 162795 311511 432443 152469 734
14705 734 68190 -292363 -356922 -195769 -145072 -116730 -222965 -351519 -285719 -205560 -100986
14694 -100986 189310 63001 -46046 -211455 112265 -85504 -29637 149340 256074 187029
14684 187029 97326 92448 126253 -15660 3646 142486 359935 229811 -214770 -123604 48024
14673 48024 -294852 -437660 -199615 37992 -73867 45374 212329 52703 -215085 -148751
14663 -148751 2688 41102 -100492 -143643 -67598 69465 214643 243410 57184 -103595
14653 -103595 -177569 -146829 174434 178228 270075 54539 -317703 -484632 -280747 -169745
14643 -169745 -48059 -56825 -131426 -37344 -45034 77512 44153 -22973 -21498 -65380 16174 139510
14631 139510 410146 459117 301531 303973 110627 12167 -39132 -182638 -199089 -189209 28489
14620 28489 142411 -157739 -310361 -75632 -196082 -176177 -225315 -226051 -142748 81590 277428
14609 277428 192147 76398 -47895 -264451 -111549 85730 328292 287904 -56580 -354752
14599 -354752 -459908 -412655 -158040 116435 44642 -134700 -207589 -261262 -343694 -536517
14589 -536517 -318324 146023 307080 260761 77320 83380 32638 38717 129593 70622 217306
14578 217306 62527 102033 213686 379886 324951 151528 -128371 -137146 -4200 242645
14568 242645 183747 -26726 -19671 32261 42801 -58045 -220046 -450051 -452835 -310478 -172260
14557 -172260 110596 152386 39533 -100012 -130861 79096 -122225 -324672 -469267 -555063
14547 -555063 -724168 -575879 -400695 -103264 33633 -30133 -20417 -131838 -206532 131818
14537 131818 324327 440939 323143 172940 106180 307644 344563 549416 321378 236732
14527 236732 51471 85917 222581 293843 127815 253291 278050 366681 372157 230486 161464
14516 161464 68925 -84110 -107325 -89837 55451 103182 343621 322867 99369 23154 97720
14505 97720 120256 104204 -241 -189169 -254649 -155383 -102083 -181969 -283640 -11935 -76876
14494 -76876 -102959 -302659 -260706 -252607 -11187 144480 -36176 -36901 -139816 88551 232694
14483 232694 260409 345720 119516 2192 87998 193094 206163 186496 -185189 -161846 -184552
14472 -184552 -169478 -106083 -81246 -89582 -207310 -239399 -140288 77351 34088 -75523 -90731
14461 -90731 -193391 -122823 -83534 14946 -461595 -617949 -443310 -112628 103495 15717
14451 15717 -333812 -521515 -442517 -93204 63151 248976 241335 116337 4741 194962
14441 194962 372958 232911 298710 297991 161712 225185 391064 386185 398488 200780 78669
14430 78669 49410 -21746 -9315 -262669 -460997 -502230 -408804 -46392 191138 313425 267056
14419 267056 298905 461788 424294 321846 106630 -14460 -104082 -328798 -327234 -352953 -230359
14408 -230359 35304 -52930 -186373 -221441 -299046 -241962 -159053 -125838 -85694 -127954 -343506
14397 -343506 -406202 -124440 180855 88330 85296 230745 297320 279056 309339 183790 280537
14386 280537 247723 141127 -2911 -222011 -148392 9678 47055 96892 -280642 -530991
14376 -530991 -317235 166881 289975 147923 87141 83993 139201 31406 94746 354706
14366 354706 239541 273025 165010 -170973 -236570 -342578 -261778 -268862 -34937 -47617 -173156
14355 -173156 -94845 61173 351674 353168 74127 -174571 -210306 -118718 32632 76832 -107487
14344 -107487 -105020 -279970 -241013 -355298 -400051 -353005 -383004 -473128 -356929 -370196 -420561
14333 -420561 -299062 -15878 115784 -47592 -76516 15124 -11117 11839 -57976 -60857 51283
14322 51283 211667 456488 367006 70996 7095 6701 -115622 -13053 -102548 175899 205057
14311 205057 82321 49902 110924 224939 161599 150796 101076 45246 -42447 -261954 -309992
14300 -309992 -337668 -32055 15805 -55961 188701 181470 217497 256844 78315 -42145 411756
14289 411756 448237 229314 294328 293912 186263 -92837 -107562 -186853 -246648 -146947 -115662
14278 -115662 28892 43499 -62633 -139867 -41368 67253 62689 -88401 -99938 9001 109329
14267 109329 295801 -74260 -230425 -331597 -405529 -353364 -267631 -257272 -93805 114601
14257 114601 415660 437969 118937 115613 333416 171971 -130941 -291256 -139759 -89536
14247 -89536 -313490 -459588 -435798 -253421 -238020 -306263 -48631 313221 -17899 -107679
14237 -107679 -150567 -151536 -116390 -156684 -251279 -144421 -58204 45701 -46380 -154488 -172955
14226 -172955 -174724 -190448 -176780 -176423 -226492 -98983 -87475 18502 196086 125591 -238392
14215 -238392 -147227 115493 192603 133672 365218 339883 384642 312215 338180 301292 309623
14204 309623 291039 448569 545810 376176 164392 102068 -32277 -40194 45083 -69908 -92982
14193 -92982 -163719 -141439 -185777 -232310 62430 477614 496147 335387 210491 121962 57779
14182 57779 262975 361531 -25938 -178894 -163811 -279948 -17242 154341 226828 292268
14172 292268 200174 150469 209138 44971 -24571 39951 221704 123507 -13499 -95359 -301162
14161 -301162 -494249 -278899 147569 127130 459711 490638 283580 7861 -106324 -109681
14151 -109681 5037 84478 37947 40263 2661 68414 -12474 -143804 -224849 -248310 -265248
14140 -265248 -149963 -106904 -56622 -55987 170827 411927 374202 315762 265245 151641 216337
14129 216337 439602 211232 -155546 -187067 -70624 92863 -232489 -303537 -250744 -49699
14119 -49699 197588 157105 66806 53663 165513 302659 119768 -117229 -158943 215951
14109 215951 214771 70050 2013 -107887 39301 24915 -190047 -315163 -457152 -529087
14099 -529087 -313846 -264138 -321236 -177320 -161798 -321967 -186287 -57388 147317 286247
14089 286247 310021 131210 199054 294800 124066 -4307 -133523 -69612 40816 130725
14079 130725 230746 246285 6439 -147868 -298595 -165332 13227 -64450 -203092 -147173
14069 -147173 57704 136300 291754 301962 228912 325328 185948 126548 230916 46680
14059 46680 -240412 -304496 -227783 -260515 -116853 5965 -173107 -247484 -182901 -147438 2692
14048 2692 81537 -35933 24484 5765 -103712 -238787 -256157 -172320 83436 292897 262846
14037 262846 342774 298528 52600 76973 171432 -13861 -100272 -292167 -117814 -222934
14027 -222934 -395405 -421056 -360569 -419667 -455713 -482731 -417807 -241265 -252989 -471172 -187334
14016 -187334 7202 -119805 -245122 -76908 336845 706366 845441 811370 836398 504440
14006 504440 163412 -4462 -129921 -261971 -220920 -197914 -164355 -230401 -311188 -224201 -176050
13995 -176050 -173221 -189794 -293177 -52504 -265281 -467975 -323735 -187607 69163 325244
13985 325244 421280 539434 444531 227062 105070 -98713 -76456 3760 238571 158401
13975 158401 124760 -74839 -60866 -44755 -229618 -348225 -248147 -177473 -6602 852 -38452
13964 -38452 -81123 89621 271353 156338 58622 -128957 -190236 -103169 -45122 73149 -96415
13953 -96415 65474 181790 220467 88571 75207 67628 -14145 41053 -99871 -300971 -303945
13942 -303945 -165178 -343583 -357097 -138590 -19884 45817 -216582 -205323 98669 203732
13932 203732 92879 -11680 25497 2694 62534 223780 146613 65657 -5806 -68516 93983
13921 93983 217127 285210 361983 239594 43348 -187852 -242160 -17204 107853 -121773
13911 -121773 -277258 29108 101614 2218 -54424 -1758 135504 163295 120501 -15628 110816
13900 110816 227981 264269 219419 295864 381279 431629 607576 701446 466581 301914 248171
13889 248171 103906 -4912 116339 -146735 -354007 -339005 -417518 -344188 -162934 246423
13879 246423 345109 342599 79187 -170222 -184120 -192240 -253116 -177922 -19012 -39255 -64238
13868 -64238 -113089 -185139 -180201 34695 209414 178797 91082 -321859 -204814 122313 17825
13857 17825 72674 -44573 -259087 -232962 17206 144963 393080 377327 564467 587340
13847 587340 452679 260963 79926 185823 161626 -151073 -449296 -500233 -128572 102734
13837 102734 149193 75268 -55375 -134868 -63831 -137781 -31975 3337 106860 158382 -272903
13826 -272903 -270975 -444753 -611144 -323308 -269754 -115791 -25651 -74697 -11936 33866 78496
13815 78496 22549 -94762 -83866 -236074 -636478 -610173 -346832 -274407 -403776 -310208 -119892
13804 -119892 120868 453507 486967 382120 289277 177177 130441 169742 114970 513
13794 513 -172816 -157900 49630 73143 55226 120733 37293 -101047 -90949 33204 -193121
13783 -193121 -28764 -15688 -202072 -565248 -423180 -78039 -69596 -176115 -212117 -327669
13773 -327669 -314970 -354857 -291437 -211133 -6082 -115682 -268746 -101624 170383 155830
13763 155830 -36500 -291573 -286190 -220535 62936 415515 124715 210774 378815 251712
13753 251712 358204 422063 193644 107630 193072 313707 205489 201845 316088 111842
13743 111842 -38003 -114246 -77054 -127028 -159442 -62762 -43905 -242869 -285355 -226805 -239886
13732 -239886 -194571 -36829 -95885 -113780 -140589 -216352 -9643 -37197 -17064 62030 192360
13721 192360 378084 302199 223836 379752 521322 278757 107749 63093 -73031 -14145
13711 -14145 -38761 70640 433632 506532 21262 -23000 -37340 39797 208558 193636 304999
13700 304999 259948 262347 324349 98439 83030 323294 573691 552995 247550 180894 189318
13689 189318 230786 232485 35905 -193691 -81994 11845 52894 -181845 -269348 -340142 -476669
13678 -476669 -234154 -135121 -8751 -81350 -14361 121364 219088 180669 134346 15272 8015
13667 8015 249013 232344 130429 148595 302848 283265 221644 93035 -208697 -481826 -474255
13656 -474255 -306189 76227 270100 205979 13491 15146 49777 -125650 -228409 8262
13646 8262 187866 7559 -122008 -153183 -72882 -80560 -155644 -307445 -247230 -58132 -2606
13635 -2606 -212652 -91769 -111338 -285261 -309837 -268714 -354819 -285294 -170784 -290607 -324715
13624 -324715 -398611 -420752 -145532 39540 202987 211072 106392 -126385 40563 248543
13614 248543 187273 -7046 -80825 -58719 94730 -642 -97147 -106617 33393 -85900 -158498
13603 -158498 -70534 54473 43740 148131 153690 15163 83203 289194 322398 530280 562051
13592 562051 374483 114612 233645 169671 93702 48362 -32896 86559 257351 57593
13582 57593 -944 54507 138691 -62130 -89835 -269724 -513639 -424987 -338808 -228579 -171983
13571 -171983 -184203 -183809 -321205 8002 37965 -19486 -140147 -282339 -441200 -343711 -295438
13560 -295438 -268327 -429863 -261079 -135290 -333602 -323246 -274173 -319460 -470378 -238882
13550 -238882 167095 298982 219808 -78953 -3496 201415 204707 108476 59785 -120569 -116646
13539 -116646 -172466 -263128 -227411 -140579 -139497 -194131 -266263 -469978 -424740 -472834 -247555
13528 -247555 -179602 -67541 -79760 -176267 117717 198881 -6661 -170383 -453437 -295268
13518 -295268 -281142 -232803 -279160 -115673 122423 141172 109375 150586 45087 112213 283646
13507 283646 456910 356055 380917 245637 309728 274115 228099 259326 265325 310454 -35915
13496 -35915 -99634 -20606 121521 9490 -114051 -163391 -236625 -348067 -306510 -202479 136695
13485 136695 116091 70833 -12561 -236437 -180001 -68302 -215960 -46249 -71156 -143432 -179056
13474 -179056 39076 213796 300956 297443 123865 383649 282718 66715 256500 246989
13464 246989 378633 288836 56452 -49001 -209141 -75687 51088 343245 236222 -27561
13454 -27561 -25165 164948 86213 48297 195372 137742 -188839 -339121 -594760 -450100 -288828
13443 -288828 -167651 -99079 47183 -73801 -340271 -370796 -165794 139234 210674 106000
13433 106000 -136285 -211736 -83330 -69155 -39780 -116666 -87133 191710 285372 24072 227359
13422 227359 208486 -88734 -213865 -189550 -208116 -23655 -49312 -124934 49089 -242732
13412 -242732 -444311 -344413 -303490 -97352 -87224 77711 99094 119021 -13817 41059 22700
13401 22700 42455 1558 -195978 -180002 -76519 110186 53712 11350 78157 -368 -35622
13390 -35622 127168 218244 88284 149289 130156 142186 327556 339979 270116 79606 122157
13379 122157 237187 356733 326676 138135 -38924 -203843 -283923 -247714 -99348 -40328
13369 -40328 699 -190458 -92064 -5214 -358073 -200108 75660 132759 -125268 -259896
13359 -259896 -47307 151438 88570 162008 347700 363215 123665 55612 39842 38194 88493
13348 88493 63066 -8441 -193099 -268057 -425645 -270844 -35662 194024 283646 52711
13338 52711 -122302 -136302 -4304 -178249 -82296 -11018 -183360 -4379 62758 -39306
13328 -39306 -49066 -74257 -238125 -215274 -19360 -16819 201749 168838 64264 247805 69101
13317 69101 30214 96685 105729 144303 -107025 -221923 -205755 -393330 -437717 -454432 -282012
13306 -282012 -262148 -175670 -24982 -35076 55387 227070 4968 132433 316425 434027
13296 434027 510567 539346 609603 454848 326356 302320 52725 -32299 -155026 -172785 -77955
13285 -77955 265157 144455 -42349 294 195005 192377 142628 46810 -119880 -126667 17857
13274 17857 28035 8620 274016 284127 278701 138128 90890 -163820 -285795 -303576 -98986
13263 -98986 -93504 -120674 -88380 -98496 -55721 31265 -143436 -411177 -440652 -110620 61835
13252 61835 5327 -227217 -278776 91923 539253 479984 305604 -44829 -289438 -512426
13242 -512426 -703449 -762803 -471720 -439358 -239692 -86 44666 163593 226447 -31703
13232 -31703 -31703 127056 63765 -1399 -360980 -311246 142822 243307 222584 -22199 -288467
13221 -288467 -337196 -138566 -60352 -106221 -217274 -218949 -218696 -198954 -169240 -286849 -268987
13210 -268987 -63722 -13945 -184137 -103225 -214034 -203421 -237268 -428116 -274756 -213167
13200 -213167 -62842 108206 93635 169912 -62255 -196101 -50689 97787 59730 23051
13190 23051 86149 300537 508031 358483 272572 333826 356432 204849 250022 254443 210702
13179 210702 203410 60562 -120533 -163428 -187537 75497 217570 316367 368326 343422 -26240
13168 -26240 -175294 53204 325949 386256 129018 40580 60985 38863 199645 64596
13158 64596 45397 242969 225278 315535 364334 339577 104415 -264586 -94844 60954 -128406
13147 -128406 -108790 -210716 -315928 -223330 -176437 -46698 -70505 -138389 -258176 -408845
13137 -408845 -267864 -204699 -74599 126261 73358 113094 115510 27458 241876 254031 368076
13126 368076 162005 -311007 -489293 -284763 137879 414344 530844 578178 331464 172371
13116 172371 216384 155195 -35140 76789 54418 53611 -25509 -132643 -143219 33120 -28509
13105 -28509 102883 171935 255239 316584 275919 131960 174701 38810 146336 235436 288043
13094 288043 191863 -42773 -12979 320827 389135 311293 359415 230911 13782 219351
13084 219351 310341 32035 -56650 138918 277446 359534 340767 159283 112206 162021 278738
13073 278738 135353 -50748 -186727 75831 309840 511179 385481 163929 205066 213343
13063 213343 12317 12727 38100 -237659 -304443 -83543 130011 7930 122004 328182
13053 328182 136018 84449 128294 377164 497297 379527 457368 479567 559968 262367
13043 262367 7477 -102891 -26577 28102 119500 53687 -201658 -195523 -83200 -235728 -294977
13032 -294977 -240877 -452845 -307458 87388 -7494 180892 130004 50788 -32957 130304
13022 130304 280404 167527 187266 131260 151209 66503 87212 54924 214661 344605 408332
13011 408332 434146 605666 637126 549325 512528 462388 455677 442185 327960 105287 -100376
13000 -100376 -56131 -245589 -241994 -210030 19225 283958 251398 55437 -31347 119473 138993
12989 138993 54957 -183350 -484676 -525412 -322670 46516 51661 -140304 -248149 -280737
12979 -280737 -330934 -270951 -482675 -303523 -11795 542 49943 -138753 27067 161021
12969 161021 95215 367205 336020 179451 279660 29220 -12602 -238881 -241349 35203
12959 35203 151109 -92599 -74761 166952 160086 45221 248700 64330 -40162 -201193
12949 -201193 -353028 -315951 -256672 -91439 85940 104580 -24740 -128020 -118145 -315787
12939 -315787 -239273 -119358 -14152 -23294 -18003 -87540 -81857 84257 271193 421211 475474
12928 475474 494400 490554 532455 795897 997732 1411168 2250635 2625257 2004863 1048716
12918 1048716 615503 343764 391479 614795 470317 167051 277812 436078 337290 351985
12908 351985 390135 440696 117832 63781 122466 104554 79232 49960 -13263 -45369 93354
12897 93354 70626 91689 83119 39205 9148 38050 46659 -52285 52921 163384 169760 -11494
12885 -11494 120613 376245 490715 238254 24880 -30560 12572 160259 275848 352038
12875 352038 282295 64652 78578 3845 45862 127253 162557 62508 -164421 -157526 -136915
12864 -136915 -138292 -202940 -201731 -65425 -49315 53356 346796 590300 666327 410121 282266
12853 282266 140361 140767 435624 99552 112605 147747 -45015 -123468 -134925 172004 367819
12842 367819 399591 418148 439225 354859 329679 170578 214874 373967 -82742 -531608 -557672
12831 -557672 -413214 -407917 -414536 -588547 -391881 -139381 -17506 14574 33822 -227084 -172298
12820 -172298 166594 82339 56086 -306891 -124217 -11955 208712 400093 353239 139064
12810 139064 -32687 53192 -45989 -122096 -196409 -93943 -60648 -151583 -250553 -407589 -117747
12799 -117747 71902 -37493 -76335 -1510 -47970 60966 145801 184960 276753 428607 815866
12788 815866 852935 1101770 1127053 1147628 1301537 1235327 1227280 920776 618981 357205 357252
12777 357252 382819 282035 67380 -162655 -2025 -48561 -201174 -97352 58019 53400
12767 53400 181686 135219 151588 127741 14850 -44567 -90832 -388895 -363027 -172935 -25481
12756 -25481 -99954 -100043 22351 -105533 -7237 -122261 -29369 -250774 -323664 -293964 -121474
12745 -121474 -178742 -538920 -686221 -587870 -477189 -332937 -260881 -211880 -31501 81706
12735 81706 105893 148052 166377 43900 12253 202189 31264 -104026 -124375 -79050 37358
12724 37358 -54671 -221482 -201411 -162981 -117271 -67654 -13219 -270656 -346709 130900 58022
12713 58022 -87625 -116113 17862 48539 42010 217396 182276 311477 231947 -40937 -398569
12702 -398569 -419526 -340900 -510698 -394437 -375160 -443372 -300835 -270583 -175934 -181347 -311453
12691 -311453 -563335 -435969 -254432 -193518 -137438 -110254 -128570 62740 116070 62
12681 62 -11031 174658 70027 -15425 211423 414259 576165 417707 458226 566898 402188
12670 402188 -104231 -427900 -277922 -200450 -117417 -54014 91765 44004 -77986 77761
12660 77761 35396 72498 -9673 21365 126450 304317 271331 208722 242979 38114 -299745
12649 -299745 -523223 -373370 -64342 -80067 -173305 -99189 -190224 -315629 -631499 -599558
12639 -599558 -244212 153649 76430 -340429 -290067 -351096 -339790 -34800 141739 -53270
12629 -53270 -5456 -93077 -68189 279232 290640 249744 129168 66671 52198 -105164 -168645
12618 -168645 -12157 89478 180204 89663 13985 -337387 -419228 -225191 60139 26805
12608 26805 157912 307555 282912 123324 -244349 -332170 -357505 -271734 -36589 -13218 184983
12597 184983 329221 254231 286265 147671 -93654 -107140 688 37301 129409 -16002
12587 -16002 -139397 -104549 -174626 -341307 -121048 -46910 -67349 -115775 -176779 -286661 -93698
12576 -93698 66427 28631 -202771 -243553 -314159 -145807 193323 332956 325326 69069 -26806
12565 -26806 -121883 -234911 -189979 -82373 -162473 -432718 -404747 -433332 -349802 -308218 -273480
12554 -273480 -298079 -142141 109118 225735 171775 178339 149305 -59805 -146070 -50540 53396
12543 53396 85442 182298 159219 187499 118357 -210288 -478691 -214926 55286 -20793 56937
12532 56937 147196 -2990 -195339 -449259 -530576 -343994 -220900 -295802 -352305 -335688 -184420
12521 -184420 -169574 -83607 71256 252342 513883 501185 328100 247448 92148 -109377
12511 -109377 -88181 215002 -17607 -85905 -117609 -239671 -242120 -147485 -94577 -99045 38503
12500 38503 6016 -112141 51957 128461 218166 128671 162224 103890 158918 243771 194321
12489 194321 274633 137282 45024 88403 176502 325979 660429 494936 465620 418455 347630
12478 347630 203388 -87067 -338744 -15230 257596 188850 183365 189608 -122408 -90437 -30548
12467 -30548 126164 147891 -50807 -300413 -272533 -222753 -367585 -309734 -258589 -278842 -520928
12456 -520928 -502584 -364632 -406685 -327200 -335316 -302462 -168210 -94815 39281 166415 27516
12445 27516 -48087 315018 562400 384943 218258 126224 93750 -23447 -194648 -251058
12435 -251058 -91817 -182593 -49955 49140 -57272 -164349 -370071 -237235 -209422 -311076
12425 -311076 -374256 -171131 -108610 149194 91832 61730 -129900 -105493 -22675 128262 244064
12414 244064 -45137 -228657 -23681 152742 2826 -151637 -281445 -277138 -45002 22808
12404 22808 -207910 -327808 -423329 -382274 -309960 -131110 92297 274205 149255 161239
12394 161239 295833 310091 203624 -33804 -26214 8232 38985 2911 14388 38414 21608
12383 21608 -79870 -380257 -431285 -357054 -206675 1653 308791 157134 112482 142906
12373 142906 27599 132591 282000 134728 32050 -68198 -134803 -66446 -7409 16803
12363 16803 155680 108839 116774 202026 342277 437468 396761 290813 337787 432000 385195
12352 385195 42938 -130994 -244463 -181279 25535 124075 7887 -32054 -21024 -66445
12342 -66445 -194942 185675 382037 -99098 -50959 200944 205890 204859 -13799 -445089 -565576
12331 -565576 -526045 -402063 -324795 -354743 -259582 -88037 -56802 20370 -16750 -229202 -127898
12320 -127898 -25543 -266099 -338699 -375608 -535627 -205493 64910 37776 25779 -144802
12310 -144802 -263009 -125494 86972 211561 280622 101670 330617 502962 453220 427591
12300 427591 449599 353420 209586 55878 65056 18091 157223 403322 389251 53784 -194622
12289 -194622 -307820 -413256 -224040 -160116 -176716 -32901 51152 44121 119629 57919 -162772
12278 -162772 -128286 119652 174363 464356 754289 474269 411227 425285 427619 360734 146911
12267 146911 5327 -67288 177309 305811 221126 164620 47505 33560 158912 211722
12257 211722 225895 149020 59290 -196428 -215163 -170047 46947 -130970 -258506 -138549
12247 -138549 23795 -136274 -139534 -8491 98977 183906 149854 -53410 -1094 12175 -15884
12236 -15884 -99410 -39838 76293 38587 19600 56031 198279 130198 -103970 -167945 -254786
12225 -254786 -107934 -212079 -98660 -171716 -214996 166513 108191 182474 263986 457211
12215 457211 454000 435640 205207 161129 223552 317742 390561 283426 278662 341042 90161
12204 90161 -166811 -71070 41139 102803 162651 253691 90996 -32158 44263 170364 179532
12193 179532 -5566 -75176 -208165 -64472 -226537 -395360 -225550 -45314 109673 218474
12183 218474 169502 20238 -131047 -100035 -61499 -4356 156661 30275 -274610 -419968
12173 -419968 -350716 -94761 160541 165307 141319 132020 -131742 -307507 -253133 6279 42507
12162 42507 -27618 79205 181034 -81709 -279088 -341734 -233227 -87421 -64459 -146196
12152 -146196 -321164 -266313 -324457 -130679 -24073 47017 309104 189751 -87888 -315990
12142 -315990 -197989 -68008 65211 3993 -124352 -221677 -486308 -535486 -420047 -250662
12132 -250662 -245550 15814 239373 137663 280576 306438 282557 210897 240323 339096 54402
12121 54402 119555 271359 147873 81362 8513 49440 174917 322356 327517 330296 357943
12110 357943 361927 81768 112984 205273 412742 157131 -200473 -369865 -202662 -122203
12100 -122203 -169842 -179981 -176882 -134149 -95221 -255995 -313438 -287602 -37216 -64572 -76297
12089 -76297 -77872 30884 -202233 -124596 -46053 -134648 -100838 78797 135078 -12871 74603
12078 74603 17909 -44666 142680 298051 431942 327558 57192 7861 202605 273895
12068 273895 321704 443843 461792 231767 161314 225352 194676 -53585 32556 179234 102051
12057 102051 -105942 -91682 -34138 -181637 -233429 -114209 -172130 -235728 -238813 -84692 322851
12046 322851 304532 245273 34998 111802 46004 -122952 -299265 -43071 -107498 -183468 -33393
12035 -33393 -29192 -145529 -217411 -21036 120517 56718 -18904 -136505 -242084 -311904 -255457
12024 -255457 -244958 -122909 116053 17930 -252347 -279523 -359132 -357716 -144463 -60491 -248396
12013 -248396 -329782 -358394 -395925 -232252 -189374 -141744 -42690 -192165 -252848 -62522 -20969
12002 -20969 -40623 -279777 -290303 -407704 -326814 -140248 4431 20780 -66799 -265702 -439747
11991 -439747 -251133 6407 -150190 -261410 -33612 128319 106203 95961 197192 130599
11981 130599 17014 -72875 -216676 -224182 -45844 -73161 -35830 46035 176971 89726 43180
11970 43180 -51698 160848 133092 -2056 93982 124703 -83837 -416421 -372471 -160277 -166882
11959 -166882 -175240 -230417 -38006 51834 -44706 58511 81794 214859 58574 -188646 -289897
11948 -289897 -142806 255232 315489 93986 14962 237816 392619 203200 66824 -43070
11938 -43070 -100481 -170482 -144591 -170370 -317023 -80266 45238 367702 352352 152654 -53318
11927 -53318 -212587 -260085 -101740 35631 110566 44419 -29565 -173237 -182596 10104 -2612
11916 -2612 71246 -182719 -239970 -118027 -50525 -163683 -157893 -86710 154606 185976 173243
11905 173243 96126 24423 46873 -56188 -304517 -323895 117396 242679 95299 -164213
11895 -164213 -123155 -81104 -39490 8893 166935 -100852 -318101 -424072 -374176 -354546 -125457
11884 -125457 -115285 -162801 26091 238802 425469 461307 336102 56618 -31746 200618
11874 200618 305983 316392 225838 -85443 -165356 -144572 -43857 -5450 78563 -91853 -467122
11863 -467122 -432276 -160363 142560 448979 280280 127155 -54943 -73522 9070 -222630
11853 -222630 -324128 -215847 -212478 83826 206764 -6709 -277295 -465652 -393395 -254585
11843 -254585 1988 250933 362996 153702 76189 166548 115128 208859 -160929 -148659
11833 -148659 87629 162187 -11720 73169 199076 192409 137304 165184 -34786 -201057 -273047
11822 -273047 -453967 -367180 -373474 -430147 -405024 -421335 -360636 -308859 -262284 -201283 -83446
11811 -83446 -341756 -332510 -219266 -407738 -386045 -486197 -356067 -59099 60496 -167856
11801 -167856 -196730 96946 236498 100957 66868 -43038 56085 151556 161842 -58259
11791 -58259 -129556 -44328 -105530 -248673 -191350 -203355 -262649 -450362 -538887 -567511 -379874
11780 -379874 -345828 -309743 -266834 -313597 -133564 1800 249635 161386 -27789 -124754 -367996
11769 -367996 -354127 -280699 -326223 -159215 -220180 21014 100245 57001 148791 122726 15937
11758 15937 -160302 -428702 -362357 -160461 -137627 -249023 -102118 80411 115792 306247
11748 306247 305950 133313 38316 -17538 5112 63313 -76495 -51214 -141227 -214697 78114
11737 78114 137857 -163903 -89960 -64112 -243199 -220740 -136534 -41129 -41455 -256605 -173108
11726 -173108 259802 331536 279562 15649 -49722 -233590 -112544 -58286 -113744 -211704 -1255
11715 -1255 -12916 -307234 -517771 -119948 180540 383850 292592 -30803 -4451 33659 -59653
11704 -59653 -80907 19418 137199 209021 246302 231239 105203 -49480 -167564 -319085
11694 -319085 -106701 155223 154056 -9536 -212621 -269196 -42531 96847 470597 417519
11684 417519 75519 44839 200970 192903 61938 235883 12315 -200747 -114884 -11437
11674 -11437 184302 31632 -106808 -103766 -204362 -60590 291256 238592 275324 182989 327485
11663 327485 377614 157892 29667 -5198 -137764 -279260 -260802 66209 152335 -132243
11653 -132243 -104387 -82930 -148212 -205286 -306615 -404877 -294827 -187200 -196480 -143534 12098
11642 12098 44076 57263 93865 128904 117416 103287 209449 109468 -258653 -319637 -259712
11631 -259712 -309769 -256508 -192506 -262461 -46272 -61091 -132231 -197159 -187222 -66286 -62519
11620 -62519 -222020 -73610 -73201 -165397 -431830 -413626 -382520 -321217 -139374 -91921 -111152
11609 -111152 -172767 -175768 324 -64536 -79716 40882 16326 127036 222163 -97738 -8912
11598 -8912 349531 313785 430776 388175 190599 -52327 -152602 -257979 -337370 -167043
11588 -167043 181135 116837 -37577 57956 -86462 -250855 -355699 -423015 -240937 -42609
11578 -42609 -94033 -199851 64539 330310 193153 -108371 -205849 6879 264575 312004
11568 312004 256235 -162299 -275144 -71408 -67862 -109947 234740 209810 -54721 -17658 86468
11557 86468 -133260 54140 325754 312262 108606 -136007 -123703 -39181 -290144 -384309
11547 -384309 -204195 -241122 -294118 -306549 -424754 -395437 -321550 89090 330454 265962 115708
11536 115708 89436 89446 12230 -114029 -76573 16886 -14422 -151927 -322935 -57391 6562
11525 6562 -72081 -76393 -107784 -113018 -36326 202475 421206 391383 510600 484260 415476 285095
11513 285095 298976 1930 -12498 117433 8669 -134916 -201664 -78697 114051 212399
11503 212399 237704 151374 -7749 63473 309546 356012 277927 194990 42661 -42115 -54784
11492 -54784 -77788 -67380 -74633 73572 -108658 -267919 -303909 -216400 -190540 -317703 -283426
11481 -283426 -214960 -225972 -44325 -271486 -284370 -425473 -328448 -291920 -234263 -282517 -207120
11470 -207120 -345072 -275870 -10766 -116204 86645 223563 274958 -4035 -177725 176846
11460 176846 342775 90355 -125673 -114352 -18750 -96265 -61009 -134667 -222339 -132879 -9958
11449 -9958 214952 248827 273761 305116 299654 337650 503933 384284 394716 258674 131019
11438 131019 138539 184840 191724 372626 363613 254782 172056 46087 2256 -102396 -37461
11427 -37461 -106721 -193806 -361597 -206062 -161378 -17987 -10610 81106 195779 377734 510264
11416 510264 95693 -183837 -245224 -294337 -352239 -390748 -195985 68140 219108 306987
11406 306987 169948 13295 16284 110778 63800 73906 93566 155939 90091 -84819 -283489
11395 -283489 -433141 -420033 -263728 62810 -96384 -93573 -57555 76375 4409 97050 163192
11384 163192 150875 -56479 -369350 -409084 -143594 -54298 -84629 -87746 -338016 -323454 -80092
11373 -80092 -129409 -96238 -201804 -265534 -322523 -123706 -31379 91594 -22694 -44946 213382
11362 213382 492462 512404 459663 413472 104399 20608 139137 60104 208426 314590
11352 314590 191050 158680 59640 -40909 -115126 -371120 -328341 -266178 -116965 -112822 -39441
11341 -39441 194395 20931 62531 265307 399881 403043 359284 279825 206892 194306 240628
11330 240628 68039 66900 109029 193553 145618 167479 317354 475886 475652 422877 238647
11319 238647 31694 144936 183888 -6514 -106823 -210126 -323050 -144935 37209 124776
11309 124776 143346 143535 172966 -41788 -207129 -168167 -248151 -142995 137940 181651 288382
11298 288382 227348 -120579 -55019 67849 193937 34522 15084 -33238 80176 -58963
11288 -58963 -228007 -353228 33651 433250 213852 58264 -31083 -41691 -128699 -177354
11278 -177354 -65920 71947 109439 -51187 -57734 -156394 -82021 -167073 -341831 -167386 88352
11267 88352 -63344 -79926 -157876 -176817 -3985 3902 -249535 -294431 185711 405579 293235
11256 293235 109325 -124067 -213571 -26090 107436 12695 257791 271372 269937 141633
11246 141633 101061 117473 88554 277532 205204 108028 125167 -16611 -190360 -194836 -210916
11235 -210916 -116139 -162787 -185259 -145580 -43853 -85108 -94838 -177184 -34668 44680 85268
11224 85268 57259 -167696 -214466 20661 138939 5271 213656 241522 237796 57942 -214072
11213 -214072 -372014 -422180 -224854 -238471 -253481 -262215 -210763 -90054 70920 -57157 -424770
11202 -424770 -581073 -325414 -257057 -290327 -185033 -185002 -349421 -286695 -492447 -275199 -167011
11191 -167011 110326 178319 175070 59209 -98503 -199402 -168765 -106293 -189100 -470332 -588076
11180 -588076 -414548 -135327 136644 26220 -21752 -122907 8398 -127913 -118611 41633
11170 41633 131980 112637 -215065 -469949 -476029 -612615 -702432 -543145 -299540 -218428 -236051
11159 -236051 -231092 -241680 58082 64823 -84129 -71369 123971 146529 15530 308249 599410
11148 599410 495819 308662 62568 -24671 -142639 -72395 -56531 -20888 -37268 160958
11138 160958 46476 -129921 -79058 36600 195617 40604 -124981 -221274 -184355 -89650
11128 -89650 3589 23593 -133341 -306942 -170119 -30502 -142980 -201297 12 -4384 36175
11117 36175 44582 -42051 -168142 -69147 -103278 88628 110403 -15676 -270 -69854 -133458
11106 -133458 -342466 -351589 -211060 -65296 -162264 -147039 -31836 -38026 -200185 -324342 -321272
11095 -321272 -359517 -207661 -82493 -26231 -230420 -230336 -191902 -87924 173630 355156 153927
11084 153927 -109296 -133323 -119281 -6817 288778 406605 397889 425464 359679 389735 152190
11073 152190 -21617 181302 120741 302853 488741 332472 268621 230401 146352 1581
11063 1581 207433 212415 -68690 53965 297335 377631 271801 -133043 -255215 -177010 -162522
11052 -162522 115592 387321 304780 31511 157053 210236 96656 103801 158513 53397
11042 53397 54157 116075 213798 250730 -86734 -79060 5650 78736 -128014 -190690 -76841 -32110
11030 -32110 21523 -44976 -281134 -307554 -357004 -376845 -283980 -34117 -14941 96551 170029
11019 170029 234068 191953 171989 103027 152560 284637 284944 52275 -51648 -173847 -226083
11008 -226083 -108213 -75097 242667 327801 165124 -57667 -171908 -135949 -256297 -384574
10998 -384574 -309530 -181458 -103767 -43147 -200154 -206723 -120476 9567 44608 78610 154250
10987 154250 181657 122084 168843 333715 306122 159857 -72168 -164650 -167421 -68257 -49294
10976 -49294 -99360 5592 59830 -94460 -190368 -104048 -133705 -8843 55456 -107845 -95375
10965 -95375 -21142 214453 462553 344150 140973 78972 68751 40414 -31108 -154257 -127491
10954 -127491 32817 328422 384961 765412 1110070 999369 663119 848421 1026400 927498
10944 927498 736821 657758 595325 424506 217644 -162622 -5361 -31786 165548 109217
10934 109217 87223 113405 19219 75695 313590 427648 420802 167611 64979 -239320 -332436
10923 -332436 -243143 -140026 137420 193463 198614 171035 -81715 -155438 24683 116987 190106
10912 190106 96007 88815 300271 368793 7314 -52212 123796 67579 172553 226725 66436
10901 66436 -16424 71512 74674 309598 366619 63739 68134 59807 -3350 68724 -107489 163806
10889 163806 210629 323384 335573 372438 121024 -178901 -308613 -320576 -265127 -149424
10879 -149424 25897 358583 264112 -38289 81500 61944 -3770 -16057 -58249 -6770 198365
10868 198365 425761 319978 234729 242815 95874 213463 195119 59656 -147711 -331827
10858 -331827 105161 98584 -214077 -44838 193745 313149 74598 -77291 -71448 -84160
10848 -84160 115449 215599 12216 -256148 -217485 -350526 -577859 -608973 -229061 124949
10838 124949 350589 113182 -322449 -362187 -281388 -23255 54121 22361 -90081 -97660 -178288
10827 -178288 -391355 -408866 -241593 -278575 -227456 -7155 -47287 -359658 -232719 -110891
10817 -110891 -82291 19890 181998 110084 -67007 -2086 81284 74522 196589 16534 -106985
10806 -106985 -180912 -250916 -109757 23804 129884 183254 304358 234265 228249 269599 -60888
10795 -60888 544 -10566 -135079 -239379 -262319 -406863 -518962 -513831 -327398 -181886 -153650
10784 -153650 -114224 -172562 -265351 -449787 -290910 -216988 -427278 -307431 -261489 46663
10774 46663 171219 151323 165703 76149 -63751 -120416 -151522 -343101 -237210 -291853 -369122
10763 -369122 -213120 85585 309453 230047 240253 114561 -7192 34735 -77783 -14143
10753 -14143 299618 384074 280162 186265 131177 43027 -70846 174095 336449 300265 192614
10742 192614 17603 -130914 -294757 -257241 -288766 -132399 -67170 -86461 62053 142313
10732 142313 -9789 -101160 -144166 -91605 99684 69570 178073 58562 13123 29424 100060
10721 100060 47645 65075 -81161 -104791 -251864 -213714 -199040 -117634 -143434 -178523 156539
10710 156539 120929 40079 170585 52770 72790 214752 98453 -6042 -358526 -498680
10700 -498680 -384408 -316952 -350975 -140324 123976 151251 -35749 -419161 -530202 -310664
10690 -310664 -194099 -133991 153586 245902 -4788 64409 17732 -203095 -81963 66009
10680 66009 131316 -159557 -271032 -201862 -197758 -293871 -154995 -52145 -218798 -169553 -81844
10669 -81844 -271755 -174331 123224 330063 364514 379243 146830 248133 309899 103935
10659 103935 -131451 -223830 -144870 53142 -19671 218110 421725 201543 119244 -29081
10649 -29081 -38190 91004 184415 -90756 -28843 89751 51562 -112073 124570 213015 189228
10638 189228 249379 180265 132361 226982 37482 -176751 -175098 -66068 -12073 -62613 -77206
10627 -77206 -229251 -309560 -138126 -61623 -181588 -176231 -293277 -248536 -134582 -157664 -50657
10616 -50657 42752 124296 68949 102727 232773 107766 -100817 -56305 -117035 -313311 -188480
10605 -188480 -216434 -142981 -57062 -128924 -124012 -171520 -15440 -7618 -110476 -76443 -223971
10594 -223971 -185768 -183888 -249516 -177029 34075 120207 -55102 -45794 15068 136390 277577
10583 277577 131939 -41387 -41297 -58344 66858 177294 233139 426379 507886 363459 373924
10572 373924 376241 390377 396550 205711 54037 165395 529981 725683 819334 665264 669317
10561 669317 791506 958397 818450 735524 758987 613780 416386 433811 398435 303289
10551 303289 144172 19131 39361 -105596 -353895 -174125 37430 125156 -74647 -349452
10541 -349452 -390094 -481562 -260892 1128 -33734 198483 120969 25662 -211495 -268414 -103654
10530 -103654 -186342 -191574 -215522 -196889 27188 15591 5643 -150061 -298467 14569 14705
10519 14705 99176 39099 -129927 -230476 -41187 -151268 -205618 -325041 -107180 45958
10509 45958 75150 -55834 -263255 -279993 -222558 -170877 60483 199214 161480 142954 303658
10498 303658 54296 5915 -93096 -37935 297501 392570 344085 139451 -47960 41972 277325
10487 277325 178183 85359 387099 361273 562543 620893 377084 288677 272275 342317 268415
10476 268415 247297 215255 4510 42851 -30017 -171257 -296317 -126883 142537 182271
10466 182271 50807 54280 194097 82385 151885 302698 150143 -73169 -241014 -306873
10456 -306873 -148262 81347 -54199 -213247 -119069 -24856 156032 95453 133556 -11665
10446 -11665 -51130 8127 382253 674675 553904 198445 -48692 -368238 -272499 -103904
10436 -103904 32164 -83593 -98586 -202626 -210856 -64107 47433 159686 291895 352214
10426 352214 341849 339383 593230 437526 228008 142720 18713 173607 492596 590875
10416 590875 640987 806720 883745 731387 554093 618328 923381 1237170 1389870 1399132
10406 1399132 1734160 2414500 3441993 4609419 5826525 6726361 7393308 7632091 7267070
10397 7267070 6857310 7037049 7386845 7409357 7321721 7399358 7261697 6886870 6105698 5234815
10387 5234815 4683991 4292832 3593724 2987494 2315920 1584194 1144460 862365 681721
10378 681721 820680 823724 882819 726658 715390 921088 890608 629948 477465 453964 391789
10367 391789 634445 485195 327421 179238 578631 651040 614772 560899 578003 554786
10357 554786 319168 402237 281578 91284 -151842 -33157 -56944 132014 270205 178459
10347 178459 -13569 -129458 -66968 -92859 -180648 -180235 -251325 29285 187606 28525 -40102
10336 -40102 8425 -248278 -122600 33035 -48816 -223743 -254674 -146937 -60904 -84945 93552
10325 93552 -64157 -184485 -172107 -232395 -261592 -29243 4524 67285 19410 -58904 32458
10314 32458 -121215 -248301 -305380 -104439 149952 -1147 -29322 40375 -111635 -106699 75425
10303 75425 56689 -138328 -181099 27391 -12646 148135 238276 134374 -175964 -242499 22976
10292 22976 239081 141765 245226 210020 181115 155098 8110 -29718 -194781 -277798 -114754
10281 -114754 152418 61880 -78692 -119018 -34765 -171826 -193682 26010 289324 310266
10271 310266 87883 103614 188426 330842 320044 -120196 -359456 -440908 -240380 -123017
10261 -123017 55196 249747 360637 655008 597707 323355 367711 21551 -86082 72762
10251 72762 385550 486857 447730 337237 554966 525437 122393 59960 86607 15684 -39058
10240 -39058 -47010 -45203 -101955 -214074 -291265 -385765 -427460 -431961 -477386 -335783 -378696 -412520
10228 -412520 -184605 184765 33788 -157184 -47108 -47499 35744 53630 125643 166383 194250
10217 194250 64344 26813 -7477 -17095 -19722 119466 329064 356095 354879 108867 -65201
10206 -65201 79326 57926 -66674 -119801 52263 37657 -110004 62632 16289 62916 137459
10195 137459 182840 14640 -289769 -432764 -374626 -88224 -70921 -341474 -302963 -164504
10185 -164504 -148565 -17926 50114 15606 72889 233357 433086 438730 238913 -64786 -201311
10174 -201311 -176267 -200013 -243017 94626 317314 234848 71436 -349056 -561727 -511169
10164 -511169 -480064 -363647 -126047 -132756 41347 126635 129374 218023 356169 389880 463871
10153 463871 267284 142961 -11881 -79126 -143890 -211685 -269320 -327200 -483502 -430521 -143128
10142 -143128 24661 -198585 -196784 -379329 -427579 -149242 28200 -98599 -167226 -120829
10132 -120829 -129735 -303561 -202235 108244 140746 153551 84616 156751 35035 -299049 -511070
10121 -511070 -440273 -388269 -237206 -367195 -565782 -579445 -475964 -477766 -206191 72179
10111 72179 170340 190386 239430 343113 511387 381505 258968 236837 231052 306063 390640
10100 390640 334330 149163 135478 -41563 -361729 -339568 -261781 -281905 -153978 -30600
10090 -30600 -175418 -174903 -65738 -53436 -223853 -161939 -200654 -102536 27418 80375 -94769
10079 -94769 -70816 -97785 -76449 -32713 105121 1409 -303174 -207983 -98753 -183326 -67550
10068 -67550 -132763 -238756 -226795 -255684 -245150 -57028 11540 -127885 -297724 -195969 -139885
10057 -139885 93023 177349 54989 152687 151214 356885 248394 408127 497256 367585
10047 367585 180624 184843 95983 109734 118766 269797 -22797 -78864 309783 563530 504293
10036 504293 333231 151644 -93968 -279239 -254811 -108610 34386 99547 99145 27194 117031
10025 117031 339515 215786 235159 161682 -134668 -385994 -535903 -296310 -395836 -330863
10015 -330863 -51985 95374 201272 277237 370497 292879 171882 27882 -11368 48262
10005 48262 -93657 46427 11171 87792 182205 143111 116376 313794 350817 190002 141104
9994 141104 176253 176285 61511 -365905 -619870 -519285 -163167 -286176 -186386 43618 -199918
9983 -199918 -341613 -337193 -273047 -24184 -215655 -283349 -490454 -528427 -302657 -115167 -183552
9972 -183552 -285266 -253298 -194324 -208104 -30582 -126292 -263956 -336913 -259937 -347203 -191899
9961 -191899 43311 -66291 -318667 -57823 -110168 -110201 9482 154275 174638 158111 36631
9950 36631 103144 126188 -185406 26526 290710 548965 624454 565901 378800 349239 356960
9939 356960 393610 301540 161080 205063 148542 131693 129319 117536 89717 -148392 -338519
9928 -338519 -333883 -247277 -357453 -41767 348803 199726 21508 114046 -17001 -109360 -17411
9917 -17411 -151499 70668 358860 322236 258849 303529 229124 259274 215580 101296 100349
9906 100349 824 -166008 -34159 141433 307826 215600 166966 228896 530884 618090 431859
9895 431859 268199 101995 103328 42427 31809 -48785 -68651 -109575 -214099 -351717 -347191
9884 -347191 -400367 -470302 -350890 -342530 -390952 -681393 -475854 -242836 -45945 251171 429303
9873 429303 583504 520152 339844 264021 233716 382644 278141 31806 84521 -48294
9863 -48294 230224 417419 466773 759649 615962 94037 -85500 -77246 34227 254359
9853 254359 94088 6818 -126920 -190192 -436019 -271054 -174377 -184504 -248820 -71791 250797
9842 250797 214499 291966 373426 329422 150598 43949 87932 111410 173432 93361 37216
9831 37216 318887 462481 188066 17458 131158 201040 135602 168174 207255 -364 52807
9820 52807 256052 300177 169491 184271 354207 36653 -205940 -158285 -120964 -144618 -193700
9809 -193700 -189252 -410414 -297955 -166741 -218140 -475457 -345214 37002 152363 97713
9799 97713 -273622 -671272 -553403 -522459 -457776 -355677 -300582 -124611 -43950 -119805 -50421
9788 -50421 -124979 -100970 120994 398717 410872 237379 -131275 -385071 -370228 -110595 15924
9777 15924 48306 -131435 -221033 -183930 -5275 77893 396832 422105 303278 174608 194536
9766 194536 -68006 -290415 -299068 167776 230294 169062 1152 -233484 -95617 -7830 -255477
9755 -255477 -345738 -292060 -117461 106155 212932 28796 -433013 -307086 -347125 -299110
9745 -299110 -321075 -230684 155699 302970 181677 228589 147266 -47842 36354 125115 -54942
9734 -54942 -528367 -573693 -348570 -385563 -326541 -311141 -277185 -241717 -99315 -118275 -77714
9723 -77714 -87170 -141273 -269538 -423970 -331679 -322729 -370433 -135392 -32677 -164308 -355720
9712 -355720 -295568 -295458 -151904 27914 109809 132230 149139 337556 287940 326504 113660
9701 113660 99618 303891 477861 517514 483516 263634 194486 37307 -18191 111650 311469
9690 311469 282813 129253 -172766 -437715 -114305 48268 1995 83906 132036 -1625
9680 -1625 -93744 -18426 131267 120560 -103478 -99170 70263 108521 122615 98281 81710 115925
9668 115925 127603 -27087 78052 44271 34570 165654 136367 -14588 -220779 -184501 -209622
9657 -209622 -128026 51697 136228 52926 54599 37067 107901 4944 -94817 -87389 -53218 6981
9645 6981 -53975 -230874 -330231 -260921 -170406 84021 84341 67924 63481 -199454 -83886 63793
9633 63793 -135295 -72292 2998 93038 122918 -50832 -174855 -108201 -11293 207513 234892
9622 234892 186087 -115080 -92287 -269778 -342656 -433929 -446880 -254371 -47678 -12847 -17596
9611 -17596 128380 102696 -79174 -98990 76165 157239 88990 -35876 -98396 -28605 -74335
9600 -74335 -199995 -79840 -62961 -134455 -37922 162545 -35517 -98831 -232554 -342504 -42552
9589 -42552 22522 84211 234944 134663 -32215 68160 212106 187347 267156 292535 163911
9578 163911 152958 220989 101693 103160 316386 291824 227920 233937 161137 14692 -22478
9567 -22478 89975 157937 125306 91686 49986 217044 282498 138249 34690 -69596 -34706
9556 -34706 -81428 -186524 -92626 -151056 -220303 -235876 -59813 -23200 -63597 -115536 -255727
9545 -255727 -313538 -489107 -340900 -416003 -468284 -112894 -3597 -109425 -63772 105452
9535 105452 260193 326969 487795 257132 94934 53310 -88746 -254525 -363200 -303638
9525 -303638 51110 251874 187517 8946 -104625 -6639 43055 -15922 -33023 -9612 -100196
9514 -100196 73323 -8822 29860 306644 321175 81600 -237969 -307971 -230217 -28186 373714
9503 373714 388625 453119 476768 76412 -173309 -38288 -16480 72424 311352 339568 230116
9492 230116 -149516 -15897 186519 277957 200890 399903 367755 169013 38666 -125491
9482 -125491 85007 309938 144966 38814 -282802 -91391 -14292 60336 61695 294269
9472 294269 -11154 -144913 -99320 -390994 -291523 -30334 289305 568078 452014 267737
9462 267737 199151 -4733 -139099 -29592 -82195 -95519 -5735 122311 -86793 -297068
9452 -297068 -374916 -187268 -11727 -16907 -74759 -149152 174745 353201 313150 79477 134945
9441 134945 189502 217691 243442 21333 43580 138532 47410 -73925 -305865 -80332 46077
9430 46077 -75781 13322 123784 254455 409592 464627 316074 220042 275365 229522 26802
9419 26802 86618 449506 611157 567571 477776 410521 331987 321759 308546 269431 132742
9408 132742 295125 248880 57886 -94064 -154395 -32699 -63204 -22382 -111850 44633 177247
9397 177247 212902 142596 321784 443878 391538 327380 298009 424760 543428 240516 -31651
9386 -31651 -28284 36458 -118720 -305193 -287054 -125750 31398 -5679 165430 214409 211035
9375 211035 354713 375551 40487 -102260 -70309 -208529 -289191 -143730 -15527 -207848
9365 -207848 -353204 -415443 -17107 233936 243606 173237 395122 539959 350688 74586
9355 74586 -86948 221937 527572 301830 200698 92590 154254 257004 102595 30724
9345 30724 97475 344362 589983 539809 393181 228369 226474 336436 231266 -445 -38036
9334 -38036 133881 343630 301640 386035 481130 570169 275858 366637 338147 212679 121414
9323 121414 -103682 -17610 32807 126373 180236 77193 -53838 -72837 6311 168485 305396
9312 305396 340840 342787 161338 426 -253166 -106086 14365 -8449 166234 212194 208347
9301 208347 320812 292053 220275 61919 119317 405021 290779 58583 17176 -52107 90243
9290 90243 205691 60530 305271 517894 339282 108977 -73505 202789 397402 350619
9280 350619 -45015 -204985 79832 -5233 -224861 133098 196440 161331 91638 55403 -31548
9269 -31548 -223746 -299041 -216234 -231005 -285552 -249199 -138410 -167843 -311028 -250522 -37578
9258 -37578 250551 252063 282017 307565 38888 -95748 -95815 42295 138943 145130 254985 421326
9246 421326 157492 -52584 7875 106596 160548 233431 375516 496619 360415 364886 188525
9235 188525 13749 -54253 -96435 132413 296771 332533 308931 489004 684913 777113 733248
9224 733248 564805 208671 3706 -52483 -123661 -90610 -278834 -190449 -140787 -160007 -51747
9213 -51747 -164663 -125211 91280 277469 326141 307149 122964 30664 8111 132526 177037
9202 177037 171694 281568 354743 402799 291218 373583 487936 355253 354006 200941 -106625
9191 -106625 -29351 -54747 -88349 -66273 -7639 113413 239764 245357 240745 387781 352385
9180 352385 232132 116168 234430 225460 3865 -121078 -228458 -221668 162920 270815
9170 270815 -177978 -228460 -8039 103342 242445 368035 718448 829929 693186 627580
9160 627580 644843 843005 605244 605911 509982 337091 238081 394801 406595 403633 338240
9149 338240 322229 366259 520739 673320 718109 730187 821361 694790 600386 651090 929519
9138 929519 892040 778932 913809 997191 1038875 961971 1034772 1100042 1024614 850165 868382
9127 868382 867539 751884 950985 1210779 1453090 1902728 2027654 2043670 1933641 1968072 1966575
9116 1966575 1806827 1919257 1856625 1887308 2161504 2269664 2201545 2313545 2433892 2687224
9106 2687224 2969217 3130440 3519560 4027471 4050251 4185579 4567334 5030952 5466958 6082703
9096 6082703 6798911 7647936 8644240 9396368 10513626 11872186 13796952 16439545 19853590
9087 19853590 23844069 28993265 36500519 46868345 61601359 83371856 115533504 159355998
9079 159355998 207540578 238151998 229600789 187595722 139229636 101166708 74405135
9072 74405135 56078515 43581467 34895975 28371426 23575210 19906066 16649373 14244501
9064 14244501 12342112 10925756 9885208 8735952 7467928 6803972 6203120 5776605 5286782
9055 5286782 4856527 4174181 3801233 3618400 3506203 3257700 3069330 2947725 2691818 2193498
9045 2193498 2027054 1847576 1856526 1991477 1839932 1896228 2019093 1863368 1714307 1644484
9035 1644484 1808791 1705955 1500515 1253246 1121672 1110273 907273 668949 679347 725494
9025 725494 664502 866957 672474 668146 639970 581187 570472 454702 362000 323510 106560
9014 106560 134333 348540 365121 344609 148986 1548 -1863 72631 234032 202686 255884
9003 255884 401371 416341 262283 105661 149773 164029 -12068 -85143 60551 296859
8993 296859 430535 196974 56086 35796 177068 111262 -58790 120956 304987 324251
8983 324251 -57310 -124453 128881 2779 154461 273556 280197 307164 263440 273674 208200
8972 208200 279531 289400 176874 -127909 -224601 117047 378352 464965 426830 356687 188033
8961 188033 48904 -171482 -141707 145630 166927 168204 294739 195561 217023 773431 731935
8950 731935 543374 682888 722164 325779 158246 -178813 -166184 -138709 -292836 -347288
$$ [...]
##END NTUPLES=NMR SPECTRUM
##END=
