##TITLE=Analysis number 327870
Compound Code cc 55404
Book Reference 470/180
Project Code adrs 
Chemist Name mikem
##JCAMPDX= 6.0         $$ Bruker NMR JCAMP-DX V2.0
##DATA TYPE= NMR SPECTRUM
##DATA CLASS= NTUPLES
##ORIGIN= Bruker BioSpin GmbH
##OWNER= nmr
$$ XWIN-NMR		Version 3.5
$$ Fri Apr 13 10:18:48 2007 GMT Daylight Time (UT+1h)  MAYBRIDGE\nmr@NMR_250MHZ
##.OBSERVE FREQUENCY= 250.131544655141
##.OBSERVE NUCLEUS= ^1H
##.ACQUISITION MODE= SIMULTANEOUS (DQD)
##.ACQUISITION SCHEME= undefined
##.AVERAGES= 16
##.DIGITISER RES= 18
##SPECTROMETER/DATA SYSTEM= dpx250
##.PULSE SEQUENCE= zg30
##.SOLVENT NAME= CDCl3
##.SHIFT REFERENCE= (INTERNAL, CDCl3, 0, 16.522)
##AUDIT TRAIL= $$ (NUMBER, WHEN, WHO, WHERE, WHAT)
$$ ##TITLE= Audit trail, XWIN-NMR		Version 3.5
$$ ##JCAMPDX= 5.01
$$ ##ORIGIN= Bruker BioSpin GmbH
$$ ##OWNER= nmr
$$ C:\u/data/dgb/nmr/ADRS/1430/pdata/1/auditp.txt
$$ ##AUDIT TRAIL=  $$ (NUMBER, WHEN, WHO, WHERE, WHAT)
(   1,<2007-04-13 10:18:26.15 +100>,<MAYBRIDGE\nmr>,<NMR_250MHZ>,
      <created by zg, POWCHK disabled, PULCHK disabled
       configuration hash MD5:
       49 4B E0 1D 92 C2 6B 37 9F E6 65 BC 52 41 86 1D
       data hash MD5: 64K
       B4 8E E6 35 F8 1E 93 1A DA 7C 83 9F E5 6E 80 A3>)
(   2,<2007-04-13 10:18:39.42 +100>,<MAYBRIDGE\nmr>,<NMR_250MHZ>,
      <Start of raw data processing
       ef LB = 0.3 FT_mod = 6 PKNL = 1 SI = 32K 
       data hash MD5: 32K
       4B 84 DB 40 55 46 75 05 EA E4 64 EB 7F AB 7D 66>)
(   3,<2007-04-13 10:18:41.49 +100>,<MAYBRIDGE\nmr>,<NMR_250MHZ>,
      <apk 
       data hash MD5: 32K
       26 49 DB 63 4F 19 69 9F 1F BF FB 68 51 60 6B A2>)
(   4,<2007-04-13 10:18:42.26 +100>,<MAYBRIDGE\nmr>,<NMR_250MHZ>,
      <abs ABSG = 5 
       data hash MD5: 32K
       A9 94 E9 54 2A E3 F4 EB 66 BE 82 94 69 BB 4B 5D>)
$$ ##END=
$$ 
$$ hash MD5
$$ 20 85 34 74 07 C5 AD DA 4F 83 49 E7 65 96 CD E8
##$RELAX= 
##$RELAX= 
##$RELAX= 
##$RELAX= 
##$RELAX= 
##$RELAX= 
##$RELAX= 
$$ Bruker specific parameters
$$ --------------------------
##$DU= <C:\u>
##$EXPNO= 1430
##$NAME= <ADRS>
##$PROCNO= 1
##$TYPE= <nmr>
##$USER= <dgb>
##$AMP= (0..31)
100 100 100 100 100 100 100 100 100 100 100 100 100 100 100 100 100 100 
100 100 100 100 100 100 100 100 100 100 100 100 100 100 
##$AQSEQ= 0
##$AQ_mod= 3
##$AUNM= <au_zg>
##$AUTOPOS= <4 >
##$BF1= 250.13
##$BF2= 250.13
##$BF3= 250.13
##$BF4= 250.13
##$BF5= 500.13
##$BF6= 500.13
##$BF7= 500.13
##$BF8= 500.13
##$BYTORDA= 1
##$CFDGTYP= 0
##$CFRGTYP= 5
##$CHEMSTR= <none>
##$CNST= (0..31)
1 1 145 1 1 1 1 1 1 1 1 1 1 1 1 1 1 1 1 1 1 1 1 1 1 1 1 1 1 1 1 1 
##$CPDPRG= <>
##$CPDPRG1= <>
##$CPDPRG2= <>
##$CPDPRG3= <>
##$CPDPRG4= <mlev>
##$CPDPRG5= <mlev>
##$CPDPRG6= <mlev>
##$CPDPRG7= <mlev>
##$CPDPRG8= <mlev>
##$CPDPRGB= <>
##$CPDPRGT= <>
##$D= (0..31)
0 1 0 0 0 0 0 0 0 0.06 0 0 0 0 0 0 0.0002 0 0 0 0 0 0 0 0 0 0 0 0 0 0 
0 
##$DATE= 1176455904
##$DBL= (0..7)
120 120 120 120 120 120 120 120 
##$DBP= (0..7)
150 150 150 150 150 150 150 150 
##$DBP07= 0
##$DBPNAM0= <>
##$DBPNAM1= <>
$$ [...]
##$SUBNAM7= <"">
##$SUBNAM8= <"">
##$SUBNAM9= <"">
##$SW= 20.6930455092707
##$SWIBOX= (0..15)
0 0 3 0 0 0 0 0 0 0 0 0 0 0 0 0 
##$SW_h= 5175.983436853
##$TD= 65536
##$TD0= 1
##$TE= 683.16
##$TE2= 300
##$TE3= 300
##$TEG= 300
##$TL= (0..7)
0 120 120 120 120 120 120 120 
##$TP= (0..7)
150 150 150 150 150 150 150 150 
##$TP07= 0
##$TPNAME0= <>
##$TPNAME1= <>
##$TPNAME2= <>
##$TPNAME3= <>
##$TPNAME4= <>
##$TPNAME5= <>
##$TPNAME6= <>
##$TPNAME7= <>
##$TPOAL= (0..7)
0.5 0.5 0.5 0.5 0.5 0.5 0.5 0.5 
##$TPOFFS= (0..7)
0 0 0 0 0 0 0 0 
##$TUNHIN= 0
##$TUNHOUT= 0
##$TUNXOUT= 0
##$USERA1= <user>
##$USERA2= <user>
##$USERA3= <user>
##$USERA4= <user>
##$USERA5= <user>
##$V9= 5
##$VALIST= <valist>
##$VCLIST= <CCCCCCCCCCCCCCC>
##$VD= 0
##$VDLIST= <DDDDDDDDDDDDDDD>
##$VPLIST= <PPPPPPPPPPPPPPP>
##$VTLIST= <TTTTTTTTTTTTTTT>
##$WBST= 1024
##$WBSW= 4
##$XGAIN= (0..3)
0 0 0 0 
##$XL= 0
##$YL= 0
##$YMAX_a= 566902
##$YMIN_a= -545669
##$ZGOPTNS= <>
##$ZL1= 120
##$ZL2= 120
##$ZL3= 120
##$ZL4= 120
##$ABSF1= 16.522
##$ABSF2= -4.171173
##$ABSG= 5
##$ABSL= 3
##$ALPHA= 0
##$AQORDER= 0
##$ASSFAC= 0
##$ASSFACI= 0
##$ASSFACX= 0
##$ASSWID= 0
##$AUNMP= <proc_1d>
##$AZFE= 0.1
##$AZFW= 0.1
##$BCFW= 0
##$BC_mod= 0
##$BYTORDP= 0
##$COROFFS= 0
##$CY= 12.5
##$DATMOD= 1
##$DC= 0
##$DFILT= <>
##$DTYPP= 0
##$F1P= 14.0000005364418
##$F2P= -0.99999901652339
##$FCOR= 0.5
##$FTSIZE= 32768
##$FT_mod= 6
##$GAMMA= 0
##$GB= 0
##$INTBC= 1
##$INTSCL= 1
##$ISEN= 128
##$LB= 0.3
##$LEV0= 0
##$LPBIN= 0
##$MAXI= 10000
##$MC2= 0
##$MEAN= 0
##$ME_mod= 0
##$MI= 0
##$NCOEF= 0
##$NC_proc= -2
##$NLEV= 6
##$NOISF1= 0
##$NOISF2= 0
##$NSP= 0
##$NTH_PI= 0
##$NZP= 0
##$OFFSET= 16.522
##$PC= 1
##$PHC0= 78.29753
##$PHC1= 5.099372
##$PH_mod= 1
##$PKNL= yes
##$PPARMOD= 0
##$PSCAL= 4
##$PSIGN= 0
##$REVERSE= no
##$SF= 250.13
##$SI= 32768
##$SIGF1= 0
##$SIGF2= 0
##$SINO= 400
##$SIOLD= 32768
##$SREGLST= <1H.CDCl3>
##$SSB= 0
##$STSI= 32768
##$STSR= 0
##$SW_p= 5175.98343685301
##$SYMM= 0
##$S_DEV= 0
##$TDeff= 65536
##$TDoff= 0
##$TI= <Analysis number 999999
Compound Code 99
Book Reference 9
Project Code 9>
##$TILT= no
##$TM1= 0
##$TM2= 0
##$TOPLEV= 0
##$USERP1= <user>
##$USERP2= <user>
##$USERP3= <user>
##$USERP4= <user>
##$USERP5= <user>
##$WDW= 1
##$XDIM= 32768
##$YMAX_p= 510140485
##$YMIN_p= -35406
$$ End of Bruker specific parameters
$$ ---------------------------------
##NTUPLES= NMR SPECTRUM
##VAR_NAME=  FREQUENCY,     SPECTRUM/REAL,   SPECTRUM/IMAG
##SYMBOL=    X,             R,               I
##VAR_TYPE=  INDEPENDENT,   DEPENDENT,       DEPENDENT
##VAR_FORM=  AFFN,          ASDF,            ASDF
##VAR_DIM=   32768,         32768,           32768
##UNITS=     HZ,            ARBITRARY UNITS, ARBITRARY UNITS
##FACTOR=    0.157963299565203, 1,           1
##FIRST=     4132.6476996994, 0,             0
##LAST=      -1043.33573715361, 0,           0
##MIN=       -1043.33573715361, -35406,      0
##MAX=       4132.6476996994, 510140485,     0
$$ Real data points
##PAGE= N=1
##DATA TABLE= (X++(R..R)), XYDATA
$$ [...]
$$ plain form
17658 398541 343431 270068 201146 148785 107486 76810 58291 47709 38123 30564 25131 18103
17646 18103 12826 8984 6879 5288 4067 4368 4107 4355 4324 1658 2680 2163 473 -2394 -6325 -8252
17630 -8252 -8321 -6594 -8736 -4821 3737 7821 11851 11279 7094 7954 10143 12486 14196 12765 10082 10793
17614 10793 12025 15038 18340 22072 26952 27271 27427 31117 30765 27893 25218 24847 21164 19054 22407
17599 22407 25188 27171 27129 28339 29073 26411 24926 22414 20763 16701 13131 11686 12140 11624 11446 11992
17583 11992 10242 9337 10659 9945 10215 15440 20599 23210 24490 27498 30347 31303 30496 31470 29455 25686
17567 25686 24933 24864 25160 26574 28898 33421 37430 39376 40034 37313 36021 31262 27381 21303 16053 14840
17551 14840 15282 16829 15159 13253 9689 10019 12322 12805 11916 11155 7952 6327 5694 3246 4061 7381
$$ packed form
17658C98541n5110p3363o8922n2361m1299l0676j8519j0582r586p559n433p028
17646A8103n277l842k105j591j221L01k61K48l1k666J022n17j690k867l931j927
17630h252o9J727k142L915Q558M084M030n72m185Q60K189K343J710j431k683P11
17614A0793J232L013L302L732M880L19J56L690l52k872k675l71l683k110L353
17599B2407K781J983m2J210P34k662j485k512j651m062l570j445M54n16j78N46
17583A1992j750r05J322p14K70N225N159K611J280L008K849R56q07R74k015l769
17567B5686p53o9K96J414K324M523M009J946O58k721j292m759l881o078n250j213
17551A4840M42J547j670j906l564L30K303M83q89p61l203j625o33k448Q15L320
$$ plain form
17535 7381 5891 2950 857 4545 10158 10794 10748 10876 11239 10916 9510 4128 3201 2722 431 612 3446
17518 3446 6253 5207 6289 5429 6756 3927 3475 1414 1592 239 554 1257 1733 3402 3149 4453
17502 4453 5347 5768 5938 4104 5539 6401 4434 4888 9676 12351 13380 14094 13726 13263 12173 13694 12630
17485 12630 11106 10658 10943 13496 11163 8379 8650 9174 15453 20204 20540 18635 18900 19401 17598 14425
17469 14425 12126 13560 14247 18730 18950 16118 16253 22536 26772 30002 31613 36969 45102 55320 70991
17454 70991 99418 145760 210915 286464 356826 405870 430829 437277 424637 393004 340944 279241
17442 279241 227167 208757 233198 293961 374448 438316 468465 477720 470350 452867 410305 342427
17430 342427 258367 186238 131354 94781 71999 55952 44729 36756 32352 29757 29848 31678 31961
$$ packed form
17535G381j490k941k093L688N613O36m6J28L63l23j406n382r27m79k291J81K834
17518C446K807j046J082q60J327k829m52k061J78j353L15P03M76J669k53J304
17502D453Q94M21J70j834J435Q62j967M54M788K675J029P14l68m63j090J521j064
17485A2630j524m48K85K553k333k784K71N24O279M751L36j905K65N01j803l173
17469A4425k299J434O87M483K20k832J35O283M236L230J611N356Q133J0218J5671
17454G0991K8427M6342O5155P5549P0362M9044K4959O448j2640l1633n2060o1703
17442B79241n2074j8410K4441O0763Q0487O3868L0149R255p370j7483m2562o7878
17430C42427q4060p2129n4884l6573k2782j6047j1223p973m404k595R1J830K83
$$ plain form
17417 31961 32259 34035 35383 30565 26296 23384 21960 21510 20502 20637 20621 21636 22054 22820 22838 22730 21571
17400 21571 21282 20502 20168 22920 24679 23825 20103 20325 21505 20720 20814 20355 23256 24222 25568 27968 29848
17383 29848 31966 34787 35990 34445 37508 39400 42447 43563 43617 43098 42936 51058 58961 62049 65734
17368 65734 67665 66558 66181 63057 60515 60210 62128 66442 67640 69712 72255 69805 66589 61577 57913
17353 57913 53774 48657 46229 45968 40899 35278 34867 34958 31899 30038 27009 24792 20648 18334 16950
17338 16950 14178 13872 16065 16141 12566 11466 13667 16890 17616 13862 10908 10765 14399 16597 17291 19670
17322 19670 16713 17283 18684 19407 18457 17946 18292 17252 21248 24901 22435 23194 26578 28119 28694 26753
17306 26753 25789 26176 24116 20713 17608 18038 12501 7704 6926 9581 11849 17496 22805 25078 25420 28838
$$ packed form
17417C1961K98J776J348m818m269k912j424m50j008J35j6J015M18P66J8j08j159
17400B1571k89p80l34K752J759q54l722K22J180p85R4m59K901R66J346K400J880
17383B9848K118K821J203j545L063J892L047J116N4n19j62Q122P903L088L685
17368F5734J931j107l77l124k542l05J918M314J198K072K543k450l216n012l664
17353E7913m139n117k428k61n069n621m11R1l059j861l029k217m144k314j384
17338A6950k772l06K193P6l575j100K201L223P26l754k954j43L634K198O94K379
17322A9670k957N70J401P23r50n11L46j040L996L653k466P59L384J541N75j941
17306B6753r64L87k060l403l105M30n537m797p78K655K268N647N309K273L42L418
$$ plain form
17290 28838 28005 27352 27928 26320 22764 20970 24991 27477 30525 30254 31906 34268 35704 35870 37804 40101
17274 40101 42213 43511 46428 47829 46761 45073 42782 35815 30635 28230 26699 25577 29233 31585
17260 31585 31987 33030 33412 32710 30498 27494 30925 33080 32547 34350 37102 44007 50871 59519 66473
17245 66473 70628 79444 85989 92190 96475 104275 103643 105792 111461 107922 109802 112587 108828 108627 111252
17230 111252 110366 110631 111958 112846 105797 97442 93839 91098 89542 85256 83492 82324 79036 73178 70536
17215 70536 68894 67372 66714 66936 66134 65976 63241 64771 68981 74219 75705 80263 85056 88016 91463
17200 91463 93218 92354 89383 87417 85281 83170 83928 82172 81838 84771 87052 88632 93829 100460 105540
17185 105540 108323 112153 117109 121835 126074 129101 134754 142555 144257 148752 154334 157983 163363 169479
$$ packed form
17290B8838q33o53N76j608l556j794M021K486L048k71J652K362J436J66J934K297
17274D0101K112J298K917J401j068j688k291o967n180k405j531j122L656K352
17260C1585M02J043L82p02k212l004L431K155n33J803K752O905O864Q648O954
17245F6473M155Q816O545O201M285P800o32K149N669l539J880K785l759k01K625
17230A11252q86K65J327Q88p049q355l603k741j556m286j764j168l288n858k642
17215G0536j642j522o58K22q02j58k735J530M210N238J486M558M793K960L447
17200I1463J755q64k971j966k136k111P58j756l34K933K281J580N197O631N080
17185A05540K783L830M956M726M239L027N653P801J702M495N582L649N380O116
$$ plain form
17171 169479 179737 192466 204796 216534 228938 238874 251065 264947 278183 291740 304799 318532
17159 318532 327344 334877 339987 350983 366649 386186 411468 440830 474179 519603 579343 652090
17147 652090 740936 843289 946009 1031893 1110136 1158701 1178640 1195987 1204732 1228851 1291495
17136 1291495 1396912 1547578 1743462 1964012 2197472 2429221 2640673 2848588 3061786
17127 3061786 3320231 3656728 4109975 4723297 5563009 6757477 8514280 11296238 15837174
17118 15837174 22822196 32323928 44126095 57565198 68789830 76555121 81079627 77699596
17110 77699596 69938942 60723637 49005135 39866326 35023673 34688032 39277792 47816593
17102 47816593 59035192 68961647 75675649 79597116 76088244 67686895 57787500 44869254
$$ packed form
17171A69479J0258J2729J2330J1738J2404R936J2191J3882J3236J3557J3059J3733
17159C18532Q812P533N110J0996J5666J9537K5282K9362L3349M5424N9740P2747
17147F52090Q8846J02353J02720Q5884P8243M8565J9939J7347Q745K4119O2644
17136A291495J05417J50666J95884K20550K33460K31749K11452K07915K13198
17127C061786K58445L36497M53247O13322Q39712J194468J756803K781958M540936
17118A5837174O985022R501732J1802167J3439103J1224632P765291M524506l380031
17110G7699596p760654r215305j1718502r138809m842653l35641M589760Q538801
17102D7816593J1218599R926455O714002L921467l508872q401349r899395j2918246
$$ plain form
17094 44869254 33212092 24224042 17272984 12668961 9772898 7836637 6468713 5457693
17086 5457693 4687833 4113916 3677513 3358855 3134410 2957086 2820421 2675710 2508359
17077 2508359 2341704 2139255 1916376 1712182 1519488 1357874 1235221 1148339 1094812 1069011
17067 1069011 1070912 1079349 1081248 1077121 1046428 982703 910053 821423 732530 662728 602294 551370
17055 551370 511425 477939 449564 424183 403719 382407 364447 348216 336320 327118 322816 317339
17043 317339 310687 310488 306018 298808 292934 284158 272692 261440 251559 247455 239424 233993 228404 223783
17029 223783 219206 217314 210916 209987 207303 198245 195197 194789 193716 190355 186072 178651 172256 166413 164304
17014 164304 157561 151995 143895 141223 140255 140323 141570 143724 145580 142927 140786 139823 137449 135139 132070
$$ packed form
17094D4869254j1657162q988050o951058m604023k896063j936261j367924j011020
17086E457693p69860n73917m36403l18658k24445j77324j36665j44711j67351
17077B508359j66655k02449k22879k04194j92694j61614j22653q6882n3527k5801
17067A069011J901Q437J899m127l0693o3725p2650q8630q8893o9802o0434n0924
17055E51370l9945l3486k8375k5381k0464k1312j7960j6231j1896r202m302n477
17043C17339o652j99m470p210n874q776j1466j1252r881m104q031n431n589m621
17029B23783m577j892o398r29k684r058l048m08j073l361m283p421o395n843k109
17014A64304o743n566q100k672r68O8J247K154J856k653k141r63k374k310l069
$$ plain form
16999 132070 126243 122496 121842 119039 115974 112005 106478 102752 100661 103123 105373 107036 113305 114379
16985 114379 112873 114271 113474 113116 113874 111758 111215 108262 106072 104605 101357 100110 103157 102884 103952
16970 103952 100711 99407 102527 101031 99073 97025 93863 92639 93402 96280 94676 89796 83726 78578
16956 78578 74402 70731 68145 66919 67466 64747 62146 59295 59568 60142 59398 56422 52773 49163 47253
16941 47253 44505 44460 42220 42380 41095 39398 37518 38285 43112 44945 48088 49765 52610 52435 52864 50830
16925 50830 51451 52466 47520 38667 34944 35776 40429 41850 42400 43952 47256 50707 50975 52825 50297
16910 50297 46642 41180 34203 28195 26031 26070 23120 19732 22532 29222 33352 34162 36642 37183 36717 35961
16894 35961 33398 32040 30789 32016 32115 32398 29137 26516 27325 29534 31744 30570 29080 32586 35046
$$ packed form
16999A32070n827l747o54k803l065l969n527l726k091K462K250J663O269J074
16985A14379j506J398p97l58P58k116n43k953k190j467l248j247L047k73J068
16970A03952l241j304L120j496j958k048l162j224P63K878j604m880o070n148
16956G8578m176l671k586j226N47k719k601k851K73N74p44k976l649l610j910
16941D7253k748m5k240J60j285j697j880P67M827J833L143J677K845j75M29k034
16925E0830O21J015m946q853l723Q32M653J421N50J552L304L451K68J850k528
16910E0297l655n462o977o008k164L9k950l388K800O690M130Q10K480N41m66p56
16894C5961k563j358j251J227R9K83l261k621Q09K209K210j174j490L506K460
$$ plain form
16879 35046 36546 37983 38767 35474 32093 27890 28462 29478 26394 28504 29639 30127 33226 31844 29387
16864 29387 28987 31013 32052 29049 25373 22147 21378 21216 22559 20532 20156 19368 21634 23118 27186 28244
16848 28244 26007 23859 21652 21622 22965 26497 26467 28549 28653 27658 26399 25593 25212 26516 26307 25741 30679
16831 30679 32734 34491 37417 40930 44434 59525 82145 112372 143609 153343 123542 84493 59105
16818 59105 47604 41414 34046 28390 25008 23143 23959 23596 24799 25059 25528 25406 25152 25325 24611 21328
16802 21328 19074 16405 12588 13823 16977 16330 16485 16351 16352 18864 20470 24283 26752 25732 22140 19148
16786 19148 15715 15275 13621 12943 14153 11253 8686 7514 10461 11161 14609 15502 14370 11973 12059 7663
16770 7663 6224 7063 6402 6877 8492 9354 7851 7111 9200 11171 8163 8207 10954 11212 9917 10411 11446
$$ packed form
16879C5046J500J437P84l293l381m203N72J016l084K110J135M88L099j382k457
16864B9387m00K026J039l003l676l226p69j62J343k027l76p88K266J484M068J058
16848B8244k237k148k207l0J343L532l0K082J04r95j259q06l81J304k09n66M938
16831C0679K055J757K926L513L504J5091K2620L0227L1237R734k9801l9049k5388
16818E9105j1501o190p368n656l382j865Q16l63J203K60M69j22k54J73p14l283
16802B1328k254k669l817J235L154o47J55j34JK512J606L813K469j020l592k992
16786A9148l433m40j654o78J210k900k567j172K947P00L448Q93j132k397Q6m396
16770G663j439Q39o61M75J615Q62j503p40K089J971l008M4K747K58j295M94J035
$$ plain form
16753 11446 11486 9847 12266 11379 11363 11301 10859 11530 9862 8643 8258 8203 11177 9585 4784 4134 7450 8823
16735 8823 9791 11526 14205 13423 10819 13615 13800 10837 10957 11096 11268 9592 9840 11350 10655 11825 12163
16718 12163 12493 10067 8356 9450 8238 7429 12231 12457 14039 13668 13375 14766 17509 20315 18829 15651
16702 15651 14752 13808 12450 14328 16297 15686 15618 16315 15527 14510 18294 18343 19521 17449 15386 13642 16483
16685 16483 18156 15138 12876 12997 15585 16831 16323 16222 15824 14861 17087 17104 14230 13779 12970 14260 16289
16668 16289 19482 19022 15844 12364 9529 9523 12916 16541 16938 16472 14317 13845 14314 12579 6916 2306
16652 2306 3401 3911 8036 12988 18510 21652 28615 37246 42279 40843 42167 42338 43515 50234 61627
16637 61627 78101 103068 141471 195123 274342 387015 536744 726685 926650 1117155 1290434
$$ packed form
16753A1446M0j639K419q87j6o2m42O71j668j219l85n5K974j592m801o50L316J373
16735H823R68J735K679p82k604K796J85k963J20J39J72j676K48J510o95J170L38
16718A2163L30k426j711J094j212q09M802K26J582l71k93J391K743K806j486l178
16702A5651q99r44j358J878J969o11o8O97p88j017L784M9J178k072k063j744K841
16685A6483J673l018k262J21K588J246n08j01l98r63K226J7k874m51q09J290K029
16668A6289L193m60l178l480k835oL393L625L97m66k155m72M69j735n663m610
16652B306J095N10M125M952N522L142O963Q631N033j436J324J71J177O719J1393
16637F1627J6474K4967L8403N3652P9219J12673J49729J89941J99965J90505J73279
$$ plain form
16626 1290434 1380753 1391964 1355794 1234870 1090608 980213 899771 886074 951698 1059958
16616 1059958 1188092 1320811 1392426 1382050 1327699 1185398 991021 805995 618079 458622
16606 458622 342429 257707 198751 159255 134905 118431 102365 89506 79852 73691 73900 78136
16594 78136 83122 95519 111165 121475 126758 131966 133115 129679 120196 108366 99413 93260 87353
16581 87353 90463 97262 109859 119972 124704 123000 119494 113841 102889 87361 71836 57091 45989
16568 45989 39429 37077 35224 36167 37477 36035 36080 40471 41623 41570 41541 45213 51372 54174 59064 67412
16552 67412 75794 91241 120400 164245 220649 288847 362755 420025 459447 468517 438143 390956
16540 390956 332274 267680 226203 210518 218421 255196 311716 373845 419700 452680 458969 420666
$$ packed form
16626A290434R0319J1211l6170j20924j44262j10395q0442j3697O5624J08260
16616A059958J28134J32719P1615j0376n4351j42301j94377j85026j87916j59457
16606D58622j16193q4722n8956l9496k4350j6474j6066j2859r654o161K09M236
16594G8136M986J2397J5646J0310N283N208J149l436r483j1830q953o153n907
16581H7353L110O799J2597J0113M732j704l506n653j0952j5528j5525j4745j1102
16568D5989o560k352j853R43J310j442M5M391J152n3k9L672O159K802M890Q348
16552F7412Q382J5447K9159M3845N6404O8198P3908N7270L9422R070l0374m7187
16540C90956n8682o4594m1477j5685P903L6775N6520O2129M5855L2980O289l8303
$$ plain form
16528 420666 366472 298825 225631 167730 121142 87464 66475 53445 44594 39001 34492 32610
16516 32610 31206 29023 25945 18172 14968 16064 18247 18717 17474 16989 17208 17900 13475 11072 9251
16501 9251 6701 7393 5259 4463 6650 10949 13112 15066 14784 14601 10643 9476 12382 14750 9904 4895
16485 4895 4391 4227 2948 2066 -294 2909 4232 4412 1075 -766 -577 3926 2013 275 3282 3462
16469 3462 3476 1917 -1193 -2578 252 2281 6735 7412 4160 1416 -160 3773 5551 6680 6343 7375
16453 7375 7034 5505 3783 5928 4330 2367 4423 4094 2073 1039 3444 6588 9559 12808 8763
16438 8763 4000 3494 3559 5329 5145 1598 -1237 -2294 836 1561 370 2992 3613 1821 4645 5798
16422 5798 5027 5698 2030 632 47 195 3544 5246 4857 3636 7578 7285 7829 10527 8939 5126
$$ packed form
16528D20666n4194o7647p3194n7901m6588l3678k0989j3030q851n593m509j882
16516C2610j404k183l078p773l204J096K183M70j243m85K19O92m425k403j821
16501I251k550O92k134p96K187M299K163J954k82j83l958j167K906K368m846n009
16485D895n04j64j279q82k360L203J323J80l337j841J89M503j913j738L007J80
16469C462J4j559l110j385K830K029M454O77l252k744j576L933J778J129l37J032
16453G375l41j529j722K145j598j963K056l29k021j034K405L144K971L249m045
16438H763m763n06O5J770j84l547k835j057L130P25j191K622O21j792K824J153
16422E798p71O71l668j398n85J48L349J702l89j221L942k93N44K698j588l813
$$ plain form
16406 5126 3040 2930 3026 3983 5907 9637 18907 20745 17047 11388 6174 541 2126 4229 8078 8468
16390 8468 9012 7663 10278 10734 8269 7625 5411 6725 6041 4912 6358 7185 4313 2660 2062 3767
16374 3767 6390 9331 8883 12258 12859 12526 13312 13232 10992 8343 5784 5651 5633 6871 7495 8845 10800
16357 10800 14203 18798 15187 9382 4805 5087 3129 3054 917 -1824 293 6733 10260 9469 7833
16342 7833 4476 5071 7279 7402 5189 1337 238 1046 1341 -1435 -158 673 -604 1044 4281 3311
16326 3311 2049 1323 -1062 -1965 -843 3055 3904 643 -1846 -2570 -4303 -1742 1644 2571 3762 1654
16310 1654 -1489 -613 2613 1742 -87 -1352 -3884 -4006 -5242 -2729 -2541 -3912 -3141 -1142 2586 4455
16294 4455 509 -829 -659 -2309 -2947 -2307 -858 -1502 -1791 -3113 -2249 -206 1360 -259 -1791 -1455
$$ packed form
16406E126k086j10R6R57J924L730R270J838l698n659n214n633J585K103L849L90
16390H468N44j349K615M56k465o44k214J314o84j129J446Q27k872j653n98J705
16374C767K623K941m48L375O01l33P86q0k240k649k559j33j8J238O24J350J955
16357A0800L403M595l611n805m577K82j958p5k137k741K117O440L527p91j636
16342G833l357N95K208J23k213l852j099Q08K95k776J277Q31j277J648L237r70
16326C311j262p26k385r03J122L898Q49l261k489p24j733K561L386R27J191k108
16310A654l143Q76L226q71j829j265k532j22j236K513J88j371P71J999L728J869
16294D455l946j338J70j650o38O40J449o44k89j322Q64K043J566j619j532L36
$$ plain form
16278 -1455 1969 4297 4640 1212 1509 865 -543 -112 1140 2709 1964 -516 -1847 -2249 -2751 -3660 -3152
16261 -3152 2207 7108 3949 -1505 -4663 -7690 -7695 -5511 -3840 -2945 -1669 -283 663 1313 3009 2612
16245 2612 3504 3807 5583 5745 5925 3703 1766 596 -1162 -1513 -21 3106 494 219 -1383 -1514
16229 -1514 -512 -136 -355 1583 4098 4337 3420 2923 2372 2554 859 1536 1454 3150 2558 771 1968
16212 1968 2398 -36 -2363 -4723 -3220 2832 4419 2990 3081 5168 7951 2775 2964 3722 165 120
16196 120 1870 5299 6082 3592 4422 1210 -885 -2038 -951 -936 -1823 -2840 1013 540 -2272 -2156 -530
16179 -530 1020 1384 3348 3286 3965 4205 3878 2380 2174 2106 711 1202 883 -1015 -2900 -4537 -266 3065
16161 3065 4177 2047 -207 1143 -1503 4 3517 2525 80 -1572 -589 -1526 -501 2067 3674
$$ packed form
16278a455L424K328L43l428K97o44j408M31J252J569p45k480j331m02n02r09N08
16261c152N359M901l159n454l158l027nK184J671Q95J276J386R46O50J696l97
16245B612Q92L03J776J62J80k222j937j170j758l51J492L127k612k75j602j31
16229a514J002L76k19J938K515K39r17m97n51J82j695O77q2J696n92j787J197
16212A968M30k434k327k360J503O052J587j429R1K087K783n176J89P58l557m5
16196A20J750L429P83k490Q30l212k095j153J087J5q87j017L853m73k812J16J626
16179e30J550L64J964o2O79K40l27j498k06o8j395M91l19j898j885j637M271L331
16161C065J112k130k254J350k646J507L513r92k445j652R83r37J025K568J607
$$ plain form
16146 3674 3488 2722 2533 6399 8046 6261 5098 516 -1719 -3897 -4420 -2917 -2603 -2532 -1271 520
16130 520 3068 181 -917 90 2366 4435 4511 4937 5386 5264 5423 1746 1000 1554 82 892 1485
16113 1485 -122 -1185 -3044 -5264 -6767 -2070 993 625 -813 -498 -2414 -2644 -322 1272 -2321
16098 -2321 -3009 -2346 -3794 -2798 -3317 -3619 -5229 -5328 -2597 -2972 -4133 -2932 -298 1983 456 3108 3424
16081 3424 7491 9171 8277 7457 3993 5814 7845 7366 7634 8287 8078 7040 4869 6001 8260 11699
16065 11699 12370 14057 13050 9702 10172 9836 7460 5279 3535 1695 1725 118 -1850 521 520 1020 -1439
16048 -1439 -3979 -4749 -5491 -1288 2200 4051 5434 1466 891 5146 6780 5954 4482 3380 3448 2715
16032 2715 6408 5904 5073 2901 512 -2147 -930 1377 1427 -1389 -226 1881 4148 2257 3130 1517
$$ packed form
16146C674j86p66j89L866J647j785j163m582k235k178n23J503L14P1J261J791
16130E20K548k887j098J007K276K069P6M26M49j22J59l677p46N54j472Q10N93
16113A485j607j063j859k220j503M697L063l68j438L15j916k30K322J594l593
16098b321o88O63j448R96n19l02j610r9K731l75j161J201K634K281j527K652L16
16081C424M067J680q94q20l464J821K031m79K68O53k09j038k171J132K259L439
16065A1699O71J687j007l348M70l36k376k181j744j840L0j607j968K371jN00k459
16048a439k540p70p42M203L488J851J383l968n75M255J634q26j472j102O8p33
16032B715L693n04q31k172k389k659J217K307N0k816J163K107K267j891Q73j613
$$ plain form
16016 1517 87 -1671 -3318 -2938 -1426 -1227 -613 -832 -2311 -2027 -2195 -3320 -2403 211 -312 -1228 -4428
15999 -4428 -4205 141 812 -3372 -6313 -3198 -3125 -6954 -5741 -3118 -4184 -3450 -21 -997 -3253 -4313
15983 -4313 -4637 -3164 -1144 -919 253 1959 1222 77 -774 233 505 -33 -455 -257 1203 -4069 -4335
15966 -4335 -5690 -3609 457 1686 4432 3241 -446 -2517 -3139 -1102 -1080 -2078 -515 -1958 -2703 -1927
15950 -1927 -1334 -1408 -659 302 -2033 -6818 -7767 -10728 -9977 -4781 -1723 -405 -1231 -5438 -8981 -8004 -6505
15933 -6505 -6755 -4705 -3145 -2431 -201 -585 -4975 -2818 2223 1427 -1927 -488 314 -813 -501 -2528
15917 -2528 -2146 -2281 -5386 -3791 26 511 885 2045 1929 1937 2225 2457 3020 1806 1968 627 -1341 -1222
15899 -1222 -2824 -4299 -3615 -4324 -2666 841 3734 5300 6465 7115 5292 1924 -2163 -3247 -510
$$ packed form
16016A517j430j758j647L80J512J99O14k19j479K84j68j125R17K614n23r16l200
15999d428K23M346O71m184k941L115P3l829J213K623j066P34L429r76k256j060
15983d313l24J473K020K25J172J706p37j145q51J007K72n38m22J98J460n272k66
15966d335j355K081M066J229K746j191l687k071o22K037K2r98J563j443p45P76
15950a927N93p4P49R61k335m785r49k961P51N196L058J318q26m207l543R77J499
15933f505k50K050J560P14K230l84m390K157N041p96l354J439Q02j127L12k027
15917b528L82j35l105J595L817M85L74J160j16QK88K32N63j214J62j341j968J19
15899a222j602j475O84p09J658L507K893J566J165O50j823l368m087j084K737
$$ plain form
15884 -510 2058 498 -1434 -4263 -5813 -5620 -3779 -3571 -6744 -8692 -5858 -4779 -6043 -3134 1846
15869 1846 3716 1532 -513 -1949 -362 2499 1627 2381 930 689 1622 2576 3049 244 553 -337 1670
15852 1670 4261 6321 5675 -439 -4323 -3964 -4615 -3118 -3600 -1777 -4620 -5025 -3128 1473 -1270 -5647
15836 -5647 -8711 -6801 -3695 -2868 -3117 -896 738 -2937 -4560 -5641 -5034 -4003 -7444 -6705 -4891 -841
15820 -841 -268 -1971 1316 1309 -638 -1835 -2873 -5263 -6034 -4435 -2775 -977 1335 -1693 -3823 -669
15804 -669 1367 580 3288 4121 -112 -2451 -2529 -1090 -2759 -4274 -1698 1354 666 -266 -1112 945 -785
15787 -785 -1080 -1616 -2199 705 700 -3002 -3940 -2458 -4542 -6714 -7212 -6947 -6546 -6463 -8568 -6318 -3318 -3666
15769 -3666 -5568 -4621 -3264 -3679 -4612 -3435 -1603 -403 -904 -3656 -5859 -7812 -7954 -5800 -5442 -5972
$$ packed form
15884e10K568j560j932k829j550J93J841K08l173j948K834J079j264K909M980
15869A846J870k184k045j436J587K861q72P54j451k41R33R54M73k805L09q90K007
15852A670K591K060o46o114l884L59o51J497m82J823k843m05J897M601k743m377
15836e647l064J910L106Q27k49K221J634l675j623j081O07J031l441P39J814M050
15820h41N73j703L287pj947j197j038k390p71J599J660J798K312l028k130L154
15804f69K036p87K708Q33m233k339p8J439j669j515K576L052o88r32q46K057j730
15787g85k95n36n83K904nl702r38J482k084k172m98K65M01Q3k105K250L000l48
15769c666j902R47J357m15r33J177J832J200n01k752k203j953j42K154L58n30
$$ plain form
15753 -5972 -5120 -1191 177 2768 69 -4685 -6467 -6599 -7132 -4904 -5328 -3141 -2700 -3466 -2761 -1410
15737 -1410 -5112 -6245 -3439 -3260 -1275 -263 810 66 788 -622 -2195 -1411 -1838 -2565 -2542 -1750 -2886
15720 -2886 -3436 -780 -1209 -4820 -5513 -3664 -2666 -645 -682 399 2700 4008 5114 4296 1050 -2429
15704 -2429 -3669 -3725 -3428 -2360 -718 -1591 1675 4334 2605 3064 8280 8661 3256 -254 375 1032 -385
15687 -385 -2809 -1973 -351 128 926 2626 3507 2432 983 -1450 -5344 -2070 395 -155 -1364 -1186
15671 -1186 -2617 -3447 -4393 -4662 -4200 -5591 -5631 -2843 243 -81 -518 -770 -186 -296 -944 -361 -517 2513
15653 2513 5971 973 -1947 -4177 -3647 -3485 -4284 -4597 -5782 -5021 -1970 -3678 -2672 -2036 -2002 -4029 -4905
15636 -4905 -5051 -2998 -2864 -1616 -1524 -3363 -2884 -2152 -182 4228 4605 1660 796 -2773 -7795 -6302 -3874
$$ packed form
15753e972Q52L929J368K591k699m754j782j32n33K228m24K187M41p66P05J351
15737a410l702j133K806J79J985J012J073p44P22j410j573P84m27p27K3P92j136
15720b886n50K656m29l611o93J849R98K021l7J081K301J308J106q18l246l479
15704b429j240n6K97J068J642q73L266K659j729M59N216L81n405l510O29O57j417
15687c85k424Q36J622M79P98J700Q81j075j449k433l894L274K465n50j209J78
15671a186j431q30r46k69M62j391m0K788L086l24m37k52N84j10o48N83j56L030
15653B513L458m998k920k230N30J62p99l13j185P61L051j708J006O36L4k027q76
15636d905j46K053J34J248R2j839M79P32J970M410L77k945q64l569n022J493K428
$$ plain form
15619 -3874 -3780 -281 1555 -203 323 -759 -59 1953 -357 -470 2405 3422 2540 2224 1051 -228
15603 -228 -3560 -3126 -669 1961 3004 1992 1593 1688 -158 1389 240 1230 4166 4628 2915 419
15587 419 262 -1562 -3431 -2948 -2566 -4989 -5708 -5052 -5804 -2986 -1553 -338 -1149 -3088 -1322 -524 2086
15570 2086 2533 362 -1558 516 -101 -320 -2651 -3480 -5416 -5877 -6541 -4471 637 3964 2824 1490
15554 1490 2665 493 -511 -4977 -5195 -2782 -4674 -4297 1875 4407 1265 -2166 -4160 -2867 -1420
15539 -1420 872 3646 1273 -254 -3273 -5397 -4156 -6636 -7767 -7415 -5238 -2845 -1988 -2770 -2053 -1985
15523 -1985 -3650 -4127 -4196 -8146 -8412 -8815 -9783 -9322 -5578 -4058 -4376 -5822 -6697 -4942 -5895 -7740 -5400
15506 -5400 -2813 -4009 -6961 -6738 -6792 -3538 -3043 -4492 -3827 -2180 -3850 -2721 -4350 -5106 -4131 501
$$ packed form
15619c874R4L499J836j758N26j082P00K012k310j13K875J017q82l16j173j279
15603b28l332M34K457K630J043j012l99R5j846J547j149R90K936M62j713k496
15587D19j57j824j869M83L82k423p19O56p52K818J433J215q11j939J766P98K610
15570B086M47k171j920K074o17k19k331q29j936m61o64K070N108L327j140j334
15554A490J175k172j004m466k18K413j892L77O172K532l142l431j994J293J447
15539a420K292K774k373j527l019k124J241k480j131L52K177K393Q57p82P17O8
15523a985j665m77o9l950k66m03r68M61L744J520l18j446q75J755r53j845K340
15506e400K587j196k952K23n4L254M95j449O65J647j670J129j629p56R75M632
$$ plain form
15490 501 2066 4001 1553 -1005 -1925 -1812 -4406 -2755 -384 1495 -1674 -3606 -4714 -6612 -4105
15475 -4105 -3038 -5272 -4470 -2789 -1347 550 400 -1770 -4453 -4113 -2602 -2823 -4834 -1824 -1310 -2319
15459 -2319 -4655 -6025 -10777 -10211 -9281 -7217 -6321 -7764 -10524 -11082 -6825 -4355 -1525 -2506 -4721 -3602
15443 -3602 -2794 -5560 -7751 -8319 -7908 -8558 -7957 -7213 -4823 -5118 -4501 -3985 -3437 -2650 -4979 -9088 -9422 -7883
15425 -7883 -5620 -5429 -9747 -7485 -404 2621 1553 1291 -1112 -3994 -5923 -2102 -1813 -2158 -971 -2211
15409 -2211 -4663 -6470 -4584 -1559 1513 60 -1693 -1369 -1084 800 2506 5023 1588 -2169 -4776
15394 -4776 -6491 -4746 -2780 -1220 574 2159 3103 295 -2127 -1026 -801 -55 -2426 -4424 -7247
15379 -7247 -11361 -9048 -4949 -5709 -6835 -6176 -3627 -454 393 -870 -2920 -2769 -3858 -455 -1997 -3020
$$ packed form
15490E01J565J935k448k558r20J13k594J651K371J879l169j932j108j898K507
15475d105J067k234Q02J681J442J897j50k170k683L40J511k21k011L010N14j009
15459b319k336j370m752N66R30K064Q96j443k760n58M257K470K830r81k215J119
15443c602Q08k766k191n68M11o50O01P44K390k95O17N16N48P87k329m109l34J539
15425g883K263J91m318K262P081L025j068k62k403k882j929L821K89l45J187j240
15409b211k452j807J886L025L072j453j753L24K85J884J706K517l435l757k607
15394d776j715J745J966J560J794J585R44k808k422J101K25P46k371j998k823
15379g247m114K313M099p60j126O59K549L173Q47j263k050J51j089L403j542j023
$$ plain form
15363 -3020 -2094 -3108 -3865 -3524 -3207 -5323 -6630 -6972 -4692 -5584 -5286 -3627 -318 610 -1009 -2769 -5790
15346 -5790 -5745 -7571 -6740 -1107 2067 2157 202 1071 284 505 2329 -340 -2185 242 2477 1222 5316
15329 5316 3597 -2337 -6932 -5528 -3711 -3162 -2485 -356 2017 1215 2374 3138 -1352 -4529 -4348 -2631
15313 -2631 -5367 -5655 -3822 -2982 394 -1310 -962 587 1362 504 -4655 -5982 -4287 -2315 -2619 -2191
15297 -2191 -1455 -1132 -2050 -1668 -1333 -55 1717 4823 3593 550 -1891 -2034 -2730 -5020 -4349 -546 4345
15280 4345 3798 4006 4690 726 -2644 -2355 -2378 -2576 -4325 -6339 -4895 -2004 446 1143 262 -728 -2018
15263 -2018 -3161 -864 -1666 -2584 -1443 -73 -2016 -2417 -3773 -2445 -2914 -4690 -5757 -6164 -2419 23
15247 23 941 483 2272 2047 -1617 -2206 -201 -940 -1290 -790 187 -168 -704 -3569 -2933 -203 -930 -3157
$$ packed form
15363c020R26j014p57L41L17k116j307l42K280q92K98J659L309R28j619j760l021
15346e790M5j826Q31N633L174R0j955Q69p87K21J824k669j845K427K235j255M094
15329E316j719n934m595J404J817N49O77K129K373q02J159P64m490l177J81J717
15313b631k736k88J833Q40L376j704L48J549P75q58n159j327J695J972l04M28
15297b191P36L23r18L82L35J278J772L106j230l043k441j43o96k290O71L803M891
15280D345n47K08O84l964l370K89k3j98j749k014J444K891K450O97q81r90j290
15263b018j143K297q02r18J141J370j943m01j356J328m69j776j067m07L745K442
15247B3R18m58J789k25l664n89K005p39l50N00R77l55n36k865O36K730p27k227
$$ plain form
15229 -3157 -3845 -3066 -2353 -5588 -6085 -4036 -3843 -1208 -806 -4397 -6618 -6634 -3685 -3221 -3076 -478 260
15212 260 -2922 -8001 -8227 -7372 -4575 -5366 -5419 -7574 -6701 -5814 -9167 -9771 -8343 -8692 -10454 -8246 -6795
15195 -6795 -5761 -5427 -5064 -2893 -235 1147 835 30 -2370 -1887 -3115 -4341 -4268 -4694 -2781 -2088 -2140
15178 -2140 -2957 -4999 -6152 -1938 -2749 -2468 -1948 -5669 -5617 -2638 -2345 192 -66 -1500 498 1756 -211
15161 -211 -3162 -4950 -7111 -8742 -7851 -6350 -5433 -6793 -5021 -5103 -5934 -4073 -2681 -1498 -4729 -8220
15145 -8220 -8750 -5215 -4196 -5577 -6988 -7972 -11404 -11218 -7569 -5093 -2419 -4147 -4432 -5400 -6432 -9219
15129 -9219 -8091 -4545 -4041 -6820 -5032 -6612 -9891 -5677 -4928 -6702 -4224 -3418 -780 -787 -6 -4158
15113 -4158 -7201 -8742 -8088 -3321 364 -1252 -606 -1082 -3710 -4221 -2996 -2717 -4025 -1029 81 -1496
$$ packed form
15229c157o88P79P13l235m97K049J93K635M02l591k221j6K949M64J45K598P38
15212B60l182n079k26Q55K797p91n3k155Q73Q87l353o04J428l49j762K208J451
15195f795J034L34L63K171K658J382l12q05k400M83j228j226P3m26J913O93n2
15178b140q17k042j153M214q11K81N20l721N2K979K93K537k58j434J998J258j967
15161b11k951j788k161j631Q91J501R17j360J772q2q31J861J392J183l231l491
15145h220n30L535J019j381j411r84l432J86L649K476K674j728k85r68j032k787
15129i219J128L546N04k779J788j580l279M214P49j774K478Q06K638pP81m152
15113d158l043j541O54M767L685j616O46m76k628n11J225K79j308K996J110j577
$$ plain form
15097 -1496 -1308 -2521 -6622 -8101 -7351 -8825 -10322 -8438 -6082 -5558 -5112 -7131 -8251 -6323 -3951 -4699
15081 -4699 -7631 -8406 -5641 -3149 -713 -1882 -790 -2340 -4066 -5701 -5570 -6141 -6916 -7055 -5700 -5148
15065 -5148 -2933 -3034 -4746 -4317 -4641 -5163 -4275 -4326 -3164 -305 2106 -1111 -4251 -9100 -9189 -7272 -8800
15048 -8800 -6644 -2626 -1000 -3869 -5963 -6958 -6025 -4471 89 -1584 -5227 -5152 -4304 -5576 -7141 -6671
15032 -6671 -4732 -6764 -6461 -5469 -235 4530 4403 1904 320 -3712 -5146 -2124 -1549 -6062 -8652 -8735
15016 -8735 -5921 -3386 -1845 -3023 -7605 -10258 -8232 -5060 -2377 -512 1115 1225 -3447 -3277 -1251
15001 -1251 -2889 -2918 -1489 -2016 -799 -1969 -2196 -2923 -8046 -5883 -4870 -5215 -4718 -3743 -3936 -2983 -1307
14984 -1307 -1734 -2055 -3339 -6294 -7146 -7559 -7867 -6407 -5045 -3105 -2705 -4009 -4415 -3929 -486 761 -2427
$$ packed form
15097a496J88j213m101j479P50j474j497J884K356N24M46k019j120J928K372p48
15081d699k932p75K765K492K436j169J092j550j726j635J31n71p75j39J355N52
15065e148K215j01j712M29l24n22Q88n1J162K859K411l217l140m849q9J917j528
15048h800K156M018J626k869k094r95R33J554M560j673l643P5Q48j272j565M70
15032f671J939k032L03R92N234M765j27k499j584m032j434L022N75m513k590q3
15016h735K814K535J541j178m582k653K026L172K683J865J627J10m672J70K026
15001a251j638k9J429n27J217j170k27p27n123K163J013l45M97R75j93R53J676
14984a307m27l21j284k955q52m13l08J460J362J940M00j304m06M86L443J247l188
$$ plain form
14967 -2427 -3774 -3134 -3497 -4603 -8035 -5603 -2733 -1744 -2713 -4614 -4038 -3538 -2215 -998 -1702 1124
14951 1124 -848 -3644 -3297 -3929 -6755 -5465 -5896 -6601 -7648 -8220 -7948 -4216 -329 -2264 -3904 -4922
14935 -4922 -3392 -5260 -6475 -4477 -6775 -8051 -10023 -9602 -7674 -5055 -1836 -161 -3411 -3388 -1732
14920 -1732 -312 561 -558 264 -73 -433 -445 186 -1909 -881 -94 1017 -2467 -6661 -6365 -5356 -5259
14903 -5259 -2897 -1849 -2332 -2593 -1507 1400 1495 1106 -176 -3917 -3482 -1892 -3778 -5548 -2024 2441
14887 2441 3056 1709 -343 -2713 -875 -1429 -3082 -2638 -2759 -2750 -3289 -1 -1149 -1555 -4732 -9003 -11198
14870 -11198 -8593 -5980 -3539 -410 -1234 -431 -861 -786 -3673 -3308 -1925 -151 4219 4886 3843 2892
14854 2892 2138 -732 -1617 -3335 -1758 -637 -3257 -2888 -3329 -4922 -4498 -2862 -2977 -1227 -1841 -3366
$$ packed form
14967b427j347O40l63j106l432K432K870R89r69j901N76N00J323J217p04K826
14951A124j972k796L47o32k826J290m31p05j047n72K72L732L887j935j640j018
14935d922J530j868j215J998k298j276j972M21J928K619L219J675l250K3J656
14920a732J420Q73j119Q22l37l60j2O31k095J028P87J111l484m194K96J009R7
14903e259K362J048m83k61J086K907R5l89j282l741M35J590j886j770L524M465
14887B441O15j347k052k370J838n54j653M44j21Rn39L288j148m06l177m271k195
14870a1198K605K613K441L129q24Q03m30P5k887L65J383J774M370O67j043r51
14854B892p54k870q85j718J577J121k620L69m41j593M24J636j15J750o14j525
$$ plain form
14838 -3366 -4715 -2530 237 -1430 1250 1988 2541 1700 -1084 -3672 -6685 -4275 -2039 -5077 -7690
14823 -7690 -4254 -2568 -1546 -4131 -4723 -5854 -3743 -3014 -3465 -2759 -2561 -4809 -8070 -5107 -1324 -1783
14807 -1783 -2802 -4777 -4619 -3464 -3182 -4476 -7427 -8407 -3586 -953 -3208 -4922 -2612 1163 831 -741
14791 -741 -4246 -3734 -3098 -3142 -1247 366 937 745 -2069 -1987 -1832 -4920 -5040 -1181 -2942 -8010 -5371
14774 -5371 -3107 -6017 -4787 -2959 -2351 -2303 -3825 -5896 -5141 -5941 -4677 -4284 -4039 -3651 -2092 -3351 -948
14757 -948 -1413 -3248 -1360 3025 4115 1726 1423 51 2430 197 -2553 -3500 964 1618 -375 -1250
14741 -1250 -3532 -6284 -4767 -4231 -6668 -3019 -2199 -1449 -3339 -4930 -6475 -2646 -1993 -3585 -5009 -4607
14725 -4607 -3730 -4571 -2944 -2075 -3300 31 2372 2085 1323 1039 -69 -8 -2429 -4319 -3489 -2144 1358
$$ packed form
14838c366j349K185K767j667K680P38N53q41k784k588l013K410K236l038k613
14823g690L436J686J022k585n92j131K111P29m51P06J98k248l261K963L783m59
14807a783j019j975J58J155K82j294k951r80M821K633k255j714K310L775l32j572
14791g41l505N12O36m4J895J613N71j92k814Q2J55l088j20L859j761n068K639
14774e371K264k910J230J828O08M8j522k071P55q00J264L93K45L88J559j259K403
14757i48m65j835J888M385J090k389l03j372K379k233k750r47M464O54j993q75
14741a250k282k752J517N36k437L649Q20P50j890j591j545L829O53j592j424M02
14725d607Q77q41J627Q69j225L331K341k87p62k84j108O1k421j890Q30J345L502
$$ plain form
14708 1358 -46 -4973 -8143 -6086 -5628 -5410 -7119 -7614 -6910 -5471 -2477 -2398 -4423 -13 1026 -2343
14692 -2343 -5334 -2288 -722 -96 -3829 -4711 -3656 -5272 -4419 -2144 -4730 -7258 -6001 -3411 -6
14677 -6 -246 -448 -1305 -4548 -5820 -2438 606 -1899 -4005 -4126 -2511 -3724 -4662 -4500 -2295 -653 843
14660 843 129 -1725 -1164 -477 771 -654 -2048 -3628 -1472 -2128 -3287 -4790 -5060 -5447 -5454 -6638 -5545
14643 -5545 -3840 -3474 -2247 -2094 -3940 -4675 -4233 -2627 -3015 -2711 -1489 -3678 -3036 -3001 -1325 -1856 -2595
14626 -2595 -1857 -2213 -2064 -1577 -974 -1706 763 117 -3067 -413 2706 3790 -674 -3588 -3921 -5134 -5940
14609 -5940 -5127 -3655 -4097 -8053 -7013 -4061 -2453 -3345 -3786 -2804 -1412 -1580 -2038 -1006 -3157 -2847 -2136
14592 -2136 -379 270 -1363 -6698 -5445 -3337 -3459 -4164 -2801 -487 1886 -1003 -5397 -6702 -8659
$$ packed form
14708A358j404m927l170K057M58K18j709m95P04J439K994P9k025M410J039l369
14692b343k991L046J566O26l733q82J055j616Q53K275k586k528J257K590L405
14677fk40k02q57l243j272L382L044k505k106j21J615j213r38J62K205J642J496
14660H43p14j854N61O87J248j425j394j580K156o56j159j503k70l87pj184J093
14643e545J705L66J227J53j846p35M42J606l88L04J222k189O42L5J676n31p39
14626b595P38l56J49M87O03p32K469o46l184K654L119J084m464k914l33j213q06
14609e940Q13J472m42l956J040K952J608q92m41R82J392j68m58J032k151L10P11
14592b136J757O49j633n335J253K108j22p05J363K314K373k889m394j305j957
$$ plain form
14577 -8659 -8117 -8402 -11700 -10672 -9667 -9563 -7641 -3074 -2829 -829 -3203 -9405 -7798 -5436 -3236 -768
14561 -768 -1451 -2721 -1009 -1324 -6004 -6462 -6811 -6168 -5279 -7253 -6868 -2305 -4386 -7572 -9081 -6023 -4653
14544 -4653 -5585 -4397 -1665 -2913 -6368 -6525 -8741 -7009 -4820 -2226 -3536 -5031 -3051 -3095 -4638 -4341
14528 -4341 -5285 -3181 -4592 -5310 -5951 -3966 -813 -2989 -2447 -2611 -1436 -282 -2203 -4717 -4986 -8427
14512 -8427 -9221 -8354 -10665 -8567 -3260 -410 -58 1558 2749 -162 -2255 -3827 -2406 -2445 -1658 -2378
14496 -2378 -2714 -2435 -2943 -3737 -3296 -3461 -949 250 1976 1175 1616 254 -1159 -866 -4433 -6253 -5639
14479 -5639 -6629 -5195 -1010 2799 6684 9280 11566 12019 12619 13950 16563 26314 36587 45137 62079
14464 62079 86511 122667 158897 194481 228749 257098 278038 290832 295192 294394 280979 259851
$$ packed form
14577h659N42k85l298J028J005J04J922M567K45K000k374o202J607K362K200K468
14561g68o83j270J712l15m680m58l49O43Q89j974L85M563k081l186j509L058J370
14544d653r32J188K732j248l455j57k216J732K189K594j310j495J980m4j543K97
14528d341r44K104j411p18o41J985L153k176N42j64J175J154j921k514k69l441
14512h427p94Q67k311K098N307K850L52J616J191k911k093j572J421l9P87p20
14496b378l36K79n08p94M41j65K512J199J726q01M41j362j413K93l567j820O14
14479e639r90J434M185L809L885K596K286M53O00J331K613R751J0273Q550J6942
14464F2079K4432L6156L6230L5584L4268K8349K0940J2794M360p98j3415k1128
$$ plain form
14452 259851 231724 199201 161788 127061 98569 74168 54728 38050 28258 18647 11363 9847
14440 9847 9267 11393 13498 9982 5865 5194 5629 5341 3171 -280 -1575 -1150 -1916 -4678 -5287 -5305 -5887
14423 -5887 -7248 -8835 -9415 -4730 -3041 -779 -155 -3138 -2335 269 1838 3139 872 84 -1033 1523
14407 1523 6543 10168 9297 10083 8657 7081 8956 9193 7735 3345 3091 3492 992 -583 1596 -548
14391 -548 6 -1550 -4376 -4608 -5476 -5084 -1274 -2095 -5781 -3611 -1245 -324 -4136 -6448 -2974 66
14375 66 168 125 -311 -2086 -4479 -3545 -621 -1550 -5457 -7387 -6329 -5761 -5737 -6929 -4465 -4626 -4993 -6614
14357 -6614 -6717 -5251 -3972 -2546 -2279 -4301 -6331 -7561 -9846 -10185 -8677 -7738 -5043 -2060 -1113 -2549
14341 -2549 -4002 -5373 -2046 -2620 -5782 -6680 -5490 -5556 -3945 -1837 -1765 -8133 -10290 -10338 -8740 -7685 -8820
$$ packed form
14452B59851k8127l2523l7413l4727k8492k4401j9440j6678r792r611p284j516
14440I847n80K126K105l516m117o71M35k88k170l451j295M25p66k762o09j8n82
14423e887j361j587n80M685J689K262O24k983Q03K604J569J301k267p88j117K556
14407A523N020L625q71P86j426j576J875K37j458m390k54M01k500j575K179k144
14391e48N54j556k826k32q68L92L810q21l686K170K366R21l812k312L474L040
14375F6J02m3m36j775k393R34K924r29l907j930J058N68K4j192K464j61l67j621
14357f614j03J466J279J426K67k022k030j230k285l39J508R39K695K983R47j436
14341b549j453j371L327n74l162q98J190o6J611K108P2o368k157m8J598J055j135
$$ plain form
14324 -8820 -6693 -4404 -4546 -5041 -7048 -5699 -3413 -3712 -3533 -229 -12 -2180 101 -1166 -2064 -3608
14308 -3608 -5361 -2778 -769 586 -1011 -3021 1511 2198 910 3113 6396 9457 12752 12098 12404
14293 12404 13889 15024 13487 9567 5775 -367 -5129 -3340 -1474 -2391 -1401 -1233 -2658 -1291 -1296 -1430
14277 -1430 -1726 382 -1804 -4801 -3265 -2957 -827 -1236 -3206 -7655 -10599 -8834 -7011 -5953 -7197
14262 -7197 -6460 -5285 -5210 -2397 -1058 -3915 -8539 -10760 -12459 -7921 -7758 -8349 -7165 -6929 -7849 -7128 -7781
14245 -7781 -7573 -6211 -6813 -3249 -1967 -3011 -4156 -3253 -6221 -5835 -6538 -7801 -6404 -6984 -6504 -6467 -4074
14228 -4074 -1143 -4220 -6162 -4678 -3054 -2587 -3671 -8253 -8541 -4869 -1389 653 -2125 -3041 -3830 -4459
14212 -4459 -3741 -3004 -2750 -3018 214 -1966 -2710 -2106 -1968 -1499 -1185 -1803 -1616 1524 -818 -3893 -2463
$$ packed form
14324h820K127K289j42m95k007J349K286k99J79L304K17k168K281j267q98j544
14308c608j753K583K009J355j597k010M532O87j288K203L283L061L295o54L06
14293A2404J485J135j537l920l792o142m762J789J866r17R90J68j425J367nj34
14277a430k96K108k186k997J536L08K130m09j970m449k944J765J823J058j244
14262g197P37J175P5K813J339k857m624k221j699M538J63n91J184K36r20P21o53
14245g781K08J362o02L564J282j044j145R03k968L86p03j263J397n80M80L7K393
14228d074K931l077j942J484J624M67j084m582k88L672L480K042k778r16p89o29
14212d459P18P37K54k68L232k180p44O04J38M69L14o18J87L140k342l075J430
$$ plain form
14195 -2463 -3795 -4355 -5364 -4938 -2494 -3508 -1895 -498 572 294 -424 -3334 -1229 1118 754 -621
14179 -621 -2079 -2898 1035 758 287 2053 1059 -937 -1627 935 -608 -2743 -2694 -1562 236 2530 277
14162 277 -1958 -1419 -3321 -8334 -7019 -5278 -6085 -5569 -7164 -7585 -9151 -8405 -6005 -6313 -7801 -6884 -3436
14145 -3436 -2008 -2712 -3045 -2121 -1134 -2330 -6105 -5792 -5432 -5229 -5587 -5276 -3962 -4166 -5112 -5501 -5124 -3329
14127 -3329 -3764 -3196 -3596 -3001 -7015 -5943 -4864 -2456 1241 2258 -759 -203 -390 -1577 -5507 -7295
14111 -7295 -4599 -4161 -1691 587 -1478 -1602 -3612 -6177 -7969 -2950 -2121 -4944 -8108 -7166 -5396 -3190
14095 -3190 -2804 -638 -1149 -1222 -842 255 -248 589 179 -653 -1939 -135 751 914 1833 3460 8000 11727
14077 11727 9077 5259 6151 7558 5711 7511 7832 6727 7984 8495 5348 2198 1682 2235 5721 2966
$$ packed form
14195b463j332n60j009M26K444j014J613J397J070k78p18k910K105K347l64j375
14179f21j458q19L933k77m71J766r94j996o90K562j543k135M9J132J798K294k253
14162B77k235N39j902n013J315J741q07N16j595m21j566P46K400l08j488R17L448
14145c436J428p04l33R24R87j196l775L13L60K03l58L11J314k04r46l89L77J795
14127c329m35N68m00N95m014J072J079K408L697J017l017N56j87j187l930j788
14111g295K696M38K470K278k065j24k010k565j792N019Q29k823l164R42J770K206
14095c190L86K166n11p3L80J097n03Q37m10q32j286J804Q86J63R19J627M540L727
14077A1727k650l818Q92J407j847J800L21j105J257N11l147l150n16N53L486k755
$$ plain form
14061 2966 2191 2075 3022 1646 558 5147 15374 23783 25567 20699 16911 11859 8269 5343 2519
14046 2519 -600 -57 -615 -416 -188 -1504 -1327 -2774 -5073 -6771 -5621 -6107 -4176 179 -3509 -4485
14030 -4485 -2372 -6329 -8068 -5703 -4845 -8544 -7117 -2392 -1324 -1974 -4205 -6631 -6977 -8269 -7800 -7857
14014 -7857 -6967 -4417 -5124 -5187 -3201 -4710 -6418 -6152 -4910 -3830 -3622 -4464 -6163 -3886 771 2630
13998 2630 835 -1910 317 -1088 -2882 -5529 -7318 -5018 -2863 -2662 -3533 -3238 -517 309 -2875 -5591
13982 -5591 -3405 -3737 -2961 -2096 319 1034 -491 -523 -3049 -1750 -2209 -4007 -7110 -7174 -6511 -3886 -2158
13965 -2158 -4977 -8784 -12122 -8899 -4968 -1026 -1058 -5253 -6471 -5871 -4889 -2914 -5978 -7747 -6445 -3821
13949 -3821 -1336 -197 -2748 -3083 -1846 451 1256 1207 -661 -4104 -6816 -9801 -8448 -1515 -1432 -6551
$$ packed form
14061B966p75j16R47j376j088M589J0227Q409J784m868l788n052l590k926k824
14046B519l119N43n58J99K28j316J77j447k299j698J150m86J931M355l688r76
14030d485K113l957j739K365Q58l699J427M725J068o50k231k426l46j292M69n7
14014g857Q90K550p07o3J986j509j708K66J242J080K08q42j699K277M657J859
13998B630j795k745K227j405j794k647j789K300K155K01q71K95K721Q26l184k716
13982e591K186l32P76Q65K415P15j525l2k526J299m59j798l103o4O63K625J728
13965b158k819l807l338L223L931L942l2m195j218O00R82J975l064j769J302K624
13949c821K485J139k551l35J237K297Q05m9j868l443k712k985J353O933Q3n119
$$ plain form
13933 -6551 -8223 -4722 -1793 -1460 -3913 -5170 -5975 -4413 -2656 -2356 -1722 -4876 -5743 -3479 -2417 773
13917 773 236 -261 -547 -2203 -1992 -627 -1327 -2941 -4324 -5223 -4053 -1937 -3054 -5561 -4709 -4513 -2128
13900 -2128 -1268 3072 2562 -2491 -4723 -2797 109 1168 47 -1588 -2675 -286 1404 -264 -1979
13885 -1979 -5567 -5269 -5144 -4292 -4818 -2663 -4252 -2946 337 -741 1911 2350 -2068 -5902 -5160 -2862
13869 -2862 -1738 -1432 1866 -596 -3527 -9007 -11586 -7569 -7007 -6757 -5472 -4968 -4195 -4096 -6672 -9020
13853 -9020 -7502 -3557 -2080 -3082 -4021 -2921 -1324 -1871 -2505 -1256 -512 -187 -2324 1214 3411 1142
13837 1142 -3242 -7003 -7416 -3476 -3432 -5693 -5903 -2984 947 -169 -283 -1340 -2594 -3383 -1930 -2326
13821 -2326 -2902 -1190 -1706 -5036 -7631 -8016 -8052 -5637 -2545 -1785 -81 -2098 -4195 -2118 708 458
$$ packed form
13933f551j672L501K929L33k453j257q05J562J757L00O34l154q67K264J062L190
13917G73n37m97k86j656K11J365p00j614j383q99J170K116j117k507Q52J96K385
13900b128Q60M340n10n053k232J926K906J059j121j635j087K389J690j668j715
13885a979l588K98J25Q52n26K155j589J306L283j078K652M39m418l834P42K298
13869b862J124L06L298k462k931n480k579M017N62K50J285N04P73R9k576k348
13853i020J518L945J477j002r39J100J597n47o34J249P44L25k137L538K197k269
13837A142m384l761m13L940M4k261k10K919L931j116j14j057j254p89J453l96
13821b326n76J712n16l330k595l85l6K415L092P60J704k017k097K077K826k50
$$ plain form
13805 458 -442 -2662 -2990 -3815 -2957 -148 -309 -2821 -5497 -696 -619 -275 39 -3791 -5835 -3902 -3367
13788 -3367 -6275 -6045 -2359 -6108 -7293 -3738 -1562 -3883 -6164 -4614 -4789 -5173 -1709 3471 5656
13773 5656 6023 3525 204 -2363 -3398 -3100 -2583 -2719 -2843 -2207 -747 1900 3032 4355 4461 1869
13757 1869 1509 5047 3198 2404 1233 2412 643 1217 5507 5209 925 -172 -2416 -2334 -24 1038
13741 1038 1499 1112 2105 5921 8537 9352 10036 11385 12611 14192 13086 17733 24376 31125 36652 38960
13725 38960 38861 36418 35746 35189 33369 34891 38144 41377 43967 45200 44310 43721 39656 32871 28037 23293
13709 23293 20118 22118 22550 19527 13425 12135 11097 9488 16428 21115 18894 16159 16106 17144 14742
13694 14742 14919 18566 19436 19854 19459 19352 21640 25743 30147 31488 28073 31817 32661 27608 25403 28460
$$ packed form
13805D58r00k220l28q25Q58K809j61k512k676M801P7L44L14l830k044J933N35
13788c367k908K30L686l749j185L555K176k321k281J550j75l84L464N180K185
13773E656L67k498l321k567j035K98N17j36j24O36J460K647J132J323J06k592
13757A869l60L538j849p94j171J179j769N74M290k98m284j097k244Q2K310J062
13741A038M61l87R93L816K616Q15O84J349J226J581j106M647O643O749N527K308
13725C8960r9k443o72n57j820J522L253L233K590J233q90n89m065o785m834m744
13709B3293l175K000M32l023o102j290j038j609O940M687k221k735n3J038k402
13694A4742J77L647Q70M18l95j07K288M103M404J341l415L744Q44n053k205L057
$$ plain form
13678 28460 37138 39129 42910 43615 44686 42327 44479 48900 54607 58764 62656 67227 68483 73399 79076
13663 79076 88186 96520 99923 104886 110772 116877 124818 135794 148776 162601 176814 192293 208422
13650 208422 227616 254642 280586 310062 339245 371575 411289 453492 505563 567178 629062
13639 629062 704833 795268 895713 1008849 1143287 1296984 1464448 1644797 1836359 2026572
13629 2026572 2212515 2373823 2502341 2585588 2616345 2594089 2517642 2396978 2241204 2062770
13619 2062770 1876601 1687335 1504180 1336488 1188129 1056171 940396 837821 748604 668387
13609 668387 597568 538094 489547 445223 398722 359765 327470 297362 272030 251051 230863
13598 230863 209988 193550 181573 164931 150053 138016 127353 118272 107787 97536 91132 87803
$$ packed form
13678B8460Q678J991L781P05J071k359K152M421N707M157L892M571J256M916N677
13663G9076R110Q334L403M963N886O105P941J0976J2982J3825J4213J5479J6129
13650B08422J9194K7026K5944K9476K9183L2330L9714M2203N2071O1615O1884
13639F29062P5771R0435J00445J13136J34438J53697J67464J80349J91562J90213
13629B026572J85943J61308J28518Q3247L0757k2256p6447j20664j55774j78434
13619B062770j86169j89266j83155j67692j48359j31958j15775j02575q9217q0217
13609F68387p0819n9474m8547m4324m6501l8957l2295l0108k5332k0979k0188
13598B30863k0875j6438j1977j6642j4878j2037j0663r081j0485j0251o404l329
$$ plain form
13586 87803 81568 75658 75587 70646 64008 59671 57701 56148 54722 50844 46974 44851 42938 40793 38130
13571 38130 35430 35254 33013 30183 29956 30301 27071 24087 25726 21914 19082 18267 20393 19982 17033 15781
13555 15781 16417 16440 17677 16195 14208 12810 12071 12657 13968 11378 9006 8187 5750 4523 8851 15130
13539 15130 17386 14496 11767 9169 9037 8713 4991 4707 4058 4862 5703 4933 7000 6427 5217 3427
13523 3427 2235 4905 5919 6333 5031 8463 6574 3078 1420 5680 9281 8695 11008 13306 9315
13508 9315 6827 6983 9815 10550 11272 10962 9830 10586 11219 10605 11896 13526 13736 16015 17388 12938 10276
13491 10276 10035 9912 10497 12547 13384 14073 12043 9924 12601 10786 5879 3526 632 -73 450 -186
13475 -186 406 81 -1947 1721 5191 5710 4754 4758 6805 4270 3418 4512 4235 -60 -3382 -2440 -557
$$ packed form
13586H7803o235n910p1m941o638m337j970j553j426l878l870k123j913k145k663
13571C8130k700j76k241k830k27L45l230k984J639l812k832q15K126m11k949j252
13555A5781O36K3J237j482j987j398p39N86J311k590k372q19k437j227M328O279
13539A5130K256k890k729k598j32l24l722k84o49Q04Q41p70K067n73j210j790
13523C427j192K670J014M14j302L432j889l496j658M260L601n86K313K298l991
13508I315k488J56K832P35P22l10j132P56O33o14J291J630K10K279J373m450k662
13491A0276k41j23N85K050Q37O89k030k119K677j815m907k353k894p05N23o36
13475a86N92l25k028L668L470N19r56MK047k535q52J094k77m295l322R42J883
$$ plain form
13458 -557 477 3072 8033 9408 6153 5672 5287 3702 3546 1247 -581 2314 1245 886 3251 7208
13442 7208 7470 6993 4554 6538 5438 1128 1748 3472 5856 8034 6345 4190 3160 718 -510
13427 -510 -1026 2727 6126 2274 1486 2014 -54 -1041 -3733 -2792 -3253 -1658 -548 157 5329 12209 18444
13410 18444 21044 19361 12841 4407 324 723 2572 2945 1723 568 2242 6340 7671 5722 4180
13395 4180 2006 603 -1659 -1485 -474 149 576 5303 6675 7455 8258 8959 7818 3294 -570 -2238
13379 -2238 -25 992 -2001 -2768 442 3783 892 -2139 241 2341 5555 8967 11301 10699 8206
13364 8206 1988 -401 952 2221 -506 -315 1201 1302 -2029 -4385 -2394 -2973 -1024 1932 1988 -128
13348 -128 -473 853 -316 -3937 -2324 -58 2282 4257 6358 9375 10328 8224 7938 10613 9741 9920
$$ packed form
13458e57J034K595M961J375l255m81l85j585j56k299j828K895j069l59K365L957
13442G208K62m77k439J984j100m310O20J724K384K178j689k155j030k442j228
13427e10n16L753L399l852p88N28k068r87k692R41m61J595J110P05N172O880O235
13410A8444K600j683o520q434m083L99J849L73j222j155J674M098J331j949j542
13395D180k174j403k262J74J011O23M27M727J372P80Q03P01j141m524l864j668
13379b238K213J017k993p67L210L341k891l031K380K100L214L412K334o02k493
13364H206o218k389J353J269k727J91J516J01l331k356J991n79J949K956N6k116
13348a28l45J326j169l621J613K266K340J975K101L017R53k104k86K675q72J79
$$ plain form
13332 9920 10533 11835 8567 3921 4960 7266 8843 6865 4206 7660 10909 15353 19432 22820 26629
13317 26629 30741 31478 30859 29086 22555 18176 14775 9990 4028 1341 5260 3936 1497 1891 2382
13302 2382 3573 3803 3466 4463 7229 7593 7595 8003 5476 4937 -323 -655 2313 3196 3241 6767 8620 11821
13284 11821 10450 7717 8086 10004 8535 6601 5753 7795 5435 7037 9892 9865 10538 6510 3674 2403
13268 2403 1684 2180 1930 2883 2362 2386 1728 2758 8315 8760 10255 11132 11915 12112 11754 10989 10734 8489
13250 8489 7260 7742 8751 9943 12884 19589 29560 39442 43712 38344 28893 24222 20662 17196 15311
13235 15311 12720 12932 15111 15678 13249 14192 14894 11567 8565 6478 6412 5739 3522 3532 5112 3274 1161
13218 1161 3978 3345 3407 4788 5590 4623 3572 6295 10753 15460 16895 18206 20457 20216 23386 28097
$$ packed form
13332I920O13J302l268m646J039K306J577j978k659L454L249M444M079L388L809
13317B6629M112P37o19j773o531m379l401m785n962k687L919j324k439L94M91
13302B382J191K30l37R97K766L64KM08k527n39n260l32K968Q83M5L526J853L201
13284A1821j371k733L69J918j469j934q48K042k360J602K855k7O73m028k836j271
13268B403p19M96k50R53n21K4o58J030N557M45J495Q77P83J97l58p65k55k245
13250H489j229M82J009J192K941O705R971R882M270n368r451m671l560l466j885
13235A5311k591K12K179N67k429R43P02l327l002k087o6o73k217J0J580j838k113
13218A161K817o33O2J381Q02r67j051K723M458M707J435J311K251k41L170M711
$$ plain form
13202 28097 33820 47136 73226 110103 145991 158122 133698 90407 56936 41072 30733 23541
13190 23541 19204 18422 14745 11875 10143 9930 9062 8857 9654 10437 8416 9714 12397 13652 14415 12155
13174 12155 10097 14117 17604 21323 22933 18657 17892 21591 26640 31684 31806 27297 29844 30719 29866
13159 29866 30747 34175 37083 46475 64857 98630 139371 163567 150138 107684 67617 40011 25712
13146 25712 20878 15826 13236 12570 11439 9861 7916 5580 5820 4471 3385 2345 6817 6440 4860
13131 4860 2176 -1448 -2485 867 1402 -639 1324 279 3926 8166 13999 20740 19022 11794 10034
13116 10034 10573 12942 13757 11258 10034 16349 24198 36392 51346 59466 56067 42937 28469 16813
13102 16813 10275 5548 4488 3459 197 -2575 -2164 732 3564 -501 -2313 -519 446 2589 3459
$$ packed form
13202B8097N723J3316K6090L6877L5888J2131k4424m3291l3471j5864j0339p192
13190B3541m337p82l677k870j732k13q68k05P97P83k021J298K683J255P63k260
13174A2155k058M020L487L719J610m276p65L699N049N044J22m509K547Q75q53
13159B9866Q81L428K908R392J8382L3773M0741K4196j3429m2454m0067k7606j4299
13146B5712m834n052k590o66j131j578j945k336K40j349j086j040M472l77j580
13131D860k684l624j037L352N35k041J963j045L647M240N833O741j718p228j760
13116A0034N39K369Q15k499j224O315P849J2194J4954Q120l399j3130j4468j1656
13102A6813o538m727j060j029l262k772M11K896K832m065j812J794R65K143Q70
$$ plain form
13087 3459 2328 -561 -355 -1031 -430 -89 -2402 -2769 -3911 -6844 -6549 -7093 -4733 -456 1279 2219 586
13070 586 -183 2208 4447 6752 9528 14843 18245 22585 25217 22398 17164 12183 3018 -1474 -1587
13055 -1587 -857 519 -268 2498 1210 343 1062 2256 96 -2427 536 3538 -1632 -2107 473 1718
13039 1718 3035 2029 3256 2520 1509 1006 -684 -240 1703 2448 3399 4932 2257 452 -271 -238 3454
13022 3454 5564 4025 10138 17091 22137 24900 21733 16109 8891 2366 -1804 -1983 -2271 -3253 -3611 -1137
13006 -1137 -892 -1164 -3703 -4181 -4112 -3555 150 -1305 -1388 -1557 -246 -714 -2154 -1858 -2493 -2126 -4131 -2919
12988 -2919 -3863 -5498 -6830 -6485 -5719 -3910 -3362 -2552 -2001 -3816 -3533 -388 3029 4489 4579 6261 10709
12971 10709 12667 10535 8364 4320 5456 4155 2367 1993 154 1573 1739 1349 2717 2984 1927
$$ packed form
13087C459j131k889K06o76O01L41k313l67j142k933K95n44K360M277J735R40j633
13070E86p69K391K239K305K776N315L402M340K632k819n234m981r165m492j13
13055a587P30J376p87K766j288q67P19J194k160k523K963L002n170m75K580J245
13039A718J317j006J227p36j011n03j690M44J943P45R51J533k675j805p23L3L692
13022C454K110j539O113O953N046K763l167n624p218o525m170j79k88r82l58K474
13006a137K45k72k539m78O9N57L705j455q3j69J311m68j440K96o35L67k005J212
12988b919r44j635j332L45P66J809N48Q10N51j815K83L145L417J460R0J682M448
12971A0709J958k132k171m044J136j301j788l74j839J419J66l90J368K67j057
$$ plain form
12956 1927 2939 3992 3251 3063 4862 6903 4901 486 1760 3003 45 -1044 -420 809 -1454
12941 -1454 678 2273 357 2528 2588 -1052 -2533 -2362 -1653 -1397 1617 668 3479 4130 3169 2037 2904
12924 2904 4756 4355 1142 -653 -2013 -1062 -2213 -1190 -1060 1273 1096 356 2 1092 4374 4186
12908 4186 681 3024 4531 2379 1643 2012 777 -2692 -1103 1089 650 2085 1857 -3628 -7132 -6203
12892 -6203 -5570 -4789 -4174 -2751 -3209 -184 840 -1739 -2642 -847 602 2316 2355 2147 1730 645 952
12875 952 -2079 -4140 -3706 -3912 -3670 -1177 -495 -1374 1453 1256 -314 -64 958 1277 -1917 -2271 2588
12858 2588 3908 1176 862 3476 7065 4069 1901 2012 1943 1923 3802 7000 9546 7260 1550 -2714
12842 -2714 -2030 -2970 -4594 -3775 -3781 -3738 -4293 -4312 -7003 -6932 -1492 -4057 -6824 -8471 -7905 -7213 -2061 1023
$$ packed form
12956A927J012J053p41j88J799K041k002m415J274J243k958j089O24J229k263
12941a454K132J595j916K171O0l640j481J71P09K56L014r49K811O51r61j132Q67
12924B904J852m01l213j795j360R51j151J023J30K333j77p40l54J090L282j88
12908D186l505K343J507k152p36L69j235l469J589K192m39J435k28n485l504R29
12892f203O33P81O15J423m58L025J024k579r03J795J449J714L9k08m17j085L07
12875I52l031k061M34k06K42K493O82q79K827j97j570K50J022L19l194l54M859
12858B588J320k732l14K614L589k996k168J11o9k0J879L198K546k286n710m264
12842b714O84r40j624Q19oM3n55j9k691P1N440k565k767j647N66O92N152L084
$$ plain form
12824 1023 246 -671 -190 2368 4428 2221 1354 -1563 -2393 66 2362 2595 1825 76 952 1103 3048
12807 3048 6571 10551 10659 10922 9385 4318 6748 8426 8597 6591 4218 5006 4691 3146 4516 7458
12791 7458 8844 6155 2321 -652 -2429 2972 6218 6601 6334 5960 4461 1682 -670 1964 3395
12776 3395 2835 2069 1618 1314 1792 940 1033 3104 2404 -348 -2002 -6036 -7826 -4231 1896 4126 5368
12759 5368 4343 2693 2910 3843 4153 1628 -1385 -718 -552 -191 -1901 -2561 -5781 -1076 723 -735
12743 -735 1130 420 -2902 -2731 -3088 -4289 -2577 -1278 -3883 -4252 -4195 -3635 -4320 -4903 -2124 3267 4561
12726 4561 3852 1746 -2845 -4595 -4191 -3522 -2332 -3253 -4123 -2665 -1215 -9 -1075 2771 3499 3259
12710 3259 3431 -1775 -1525 -632 -2460 -5754 -3708 -1824 -1849 -1821 -2997 -4308 -3082 -2632 -468 735 -395
$$ packed form
12824A023p77r17M81K558K060k207q67k917q30K459K296K33p70j749Q76J51J945
12807C048L523L980J08K63j537n067K430J678J71k006k373P88l15j545J370K942
12791G458J386k689l834k973j777N401L246L83k67l74j499k779k352K634J431
12776C395n60p66m51l04M78q52R3K071p00k752j654m034j790L595O127K230J242
12759E368j025j650K17R33L10k525l013O67J66L61j710o60l220M705J799j458
12743g35J865p10l322J71l57j201J712J299k605l69N7N60o85n83K779N391J294
12726D561p09k106m591j750M04O69J190r21q70J458J450J206j066L846P28k40
12710C259J72n206K50Q93j828l294K046J884k5K8j176j311J226M50K164J203j130
$$ plain form
12693 -395 -6774 -9463 -5668 -4158 -3264 -2574 -31 -381 187 -1408 -529 699 113 -624 2081 3935 1611
12676 1611 -731 2474 7958 8026 8150 6564 6229 3941 4396 4201 1385 207 3195 5372 2618 -1800
12660 -1800 -63 2099 3044 2747 4016 3186 4320 6386 7142 4675 3335 5678 4627 3490 4828 4854
12644 4854 5504 9498 13155 13340 8147 5885 4936 2960 230 896 1335 1336 1480 2165 3709 2034 2185
12627 2185 2315 2127 2925 2499 2276 979 221 1495 2982 5859 3605 3986 5541 7494 9664 7007
12611 7007 167 -3597 -1813 -826 -1839 -1360 3653 9735 11077 9464 7285 5800 6804 7071 6846 9415
12595 9415 9941 6144 7666 8039 1258 -2580 1815 2953 -2457 -4345 -957 66 -798 -631 -1352 230
12579 230 -484 4282 6521 5730 6267 5257 2651 -75 447 1640 4696 4245 2540 77 -5282 -2986
$$ packed form
12693c95o379k689L795J510Q94O90K543l50N68j595Q79J228n86p37K705J854k324
12676A611k342L205N484O8J24j586l35k288M55j95k816j178K988K177k754m418
12660a800J737K162R45k97J269q30J134K066P56k467j340K343j051j137J338K6
12644D854O50L994L657J85n193k262r49j976k730O66M39JJ44O85J544j675J51
12627B185J30j88P98m26k23j297p58J274J487K877k254L81J555J953K170k657
12611G007o840l764J784R87j013M79N013O082J342j613k179j485J004K67k25K569
12595I415N26l797J522L73o781l838M395J138n410j888L388J023q64J67p21J582
12579B30p14M766K239p91N37j010k606k726N22J193L056m51j705k463n359K296
$$ plain form
12563 -2986 -2082 -3925 -5147 -6604 -4012 -3769 -2423 -3173 -2871 -1951 -3230 -5315 -6017 -852 284 20
12547 20 315 -1521 1429 5334 2509 -824 2044 3603 3968 11705 12823 10703 8414 1140 -3579 -2774
12531 -2774 -2876 -5085 -4810 -4554 -6168 -4278 -1430 1338 4129 7026 4474 -598 -2216 -1515 454 4487
12515 4487 6131 9253 11379 12933 9357 7613 8254 8739 10728 8277 8574 8279 4389 5027 8843 10632
12499 10632 6664 3366 6141 6801 8784 11758 11490 11211 12181 12233 14250 12395 9308 8883 10653 12951
12483 12951 14673 15014 18148 22860 25070 29702 32611 31843 32551 34543 32370 28490 22996 17127 17025
12468 17025 16675 14509 12920 15052 15705 14621 13613 11283 10924 14487 16514 16151 12734 8620 7846 7339
12452 7339 12002 17083 18338 18256 19320 19620 19563 20388 22913 23929 28534 33240 36414 39153 45682 49671
$$ packed form
12563b986R04j843j222j457K592K43J346p50L02R20j279k085p02N165J136k64
12547B0K95j836K950L905k825l333K868J559L65P737J118k120k289p274m719Q05
12531b774j02k209K75K56j614J890K848K768K791K897k552n072j618P01J969M033
12515D487J644L122K126J554l576j744O41M85J989k451K97k95l890O38L816J789
12499A0632l968l298K775O60J983K974k68k79R70N2K017j855l087m25J770K298
12483A2951J722L41L134M712K210M632K909p68P08J992k173l880n494n869j02
12468A7025l50k166j589K132O53j084j008k330l59L563K027l63l417m114p74n07
12452G339M663N081J255q2J064L00n7Q25K525J016M605M706L174K739O529L989
$$ plain form
12436 49671 57119 65102 78575 95980 107347 112113 108430 103075 92037 80232 65918 57193 51294
12423 51294 43246 32451 27684 23166 18456 18677 19164 18958 21511 21463 19555 15824 13546 12649 11058 12412
12407 12412 17328 16948 18388 21702 23051 20478 16352 20908 23030 21922 26448 29660 34432 39960 45693
12392 45693 52669 67377 85052 105840 124996 134069 133847 123868 108475 91362 72672 60556 52860
12379 52860 47080 41690 33854 27144 24206 22844 21951 21110 18030 14283 10818 9249 7189 5964 7034
12364 7034 5949 2580 -1575 194 2730 7224 9595 8806 9540 10583 13820 18392 24123 25798 31310
12349 31310 42536 54239 68605 69488 63585 56878 52434 50505 46708 43295 37790 32713 24746 20885
12335 20885 21898 21157 19598 18158 12793 8236 9979 9193 8057 5294 3409 3671 3235 1873 707
$$ packed form
12436D9671P448P983J3473J7405J1367M766l683n355j1038j1805j4314q725n899
12423E1294q048j0795m767m518m710K21M87k06K553m8j908l731k278q97j591J354
12407A2412M916l80J440L314J349k573m126M556K122j108M526L212M772N528N733
12392D5693O976J4708J7675K0788J9156R073k22r979j5393j7113j8690j2116p696
12379E2860n780n390p836o710k938j362q93q41l080l747l465j569k060j225J070
12364G034j085l369m155J769K536M494K371p89P34J043L237M572N731J675N512
12349C1310J1226J1703J4366Q83n903o707m444j929l797l413n505n077p967l861
12335B0885J013p41j559j440n365m557J743p86j136k763j885K62m36j362j166
$$ plain form
12320 707 375 488 83 4472 10171 10747 9878 14163 15253 17133 21853 25273 30548 33320 29203 24212
12304 24212 17291 9956 5254 3948 2116 -1036 -746 -360 2576 4922 5472 3828 3300 1860 5832
12289 5832 7667 5002 2521 -1598 -2616 -4132 -2872 -1669 -1054 854 310 1913 1596 174 -2055
12274 -2055 -1087 3032 3582 4399 4176 2376 2988 2994 4129 7970 9069 8609 8380 8489 5974 3850 5383
12257 5383 5438 3553 3045 2409 1018 3596 3363 304 4191 5378 4899 3287 4078 3509 1455 423 -1084
12240 -1084 -1427 1412 595 298 1304 2838 3469 3641 5012 5162 4598 1448 -3272 -3389 -1549 1174 5338
12223 5338 7990 7388 11240 16371 17274 14100 7550 9285 12133 11184 10756 8009 6756 5374 4415 2401
12207 2401 3579 4770 6562 6087 3876 3846 5958 4636 -110 -1314 -2043 -1480 811 1520 -1575 -3383
$$ packed form
12320G07l32J13m05M389N699N76q69M285J090J880M720L420N275K772m117m991
12304B4212o921p335m702j306j832l152K90L86K936K346N50j644n28j440L972
12289E832J835k665k481m119j018j516J260J203O15J908n44J603l17j422k229
12274b055R68M119N50Q17k23j800O12OJ135L841J099m60k29J09k515k124J533
12257E383N5j885n08o36j391K578k33l059L887J187m79j612P91n69k054j032j507
12240a084l43K839q17k97J006J534O31J72J371J50n64l150m720j17J840K723M164
12223E338K652o02L852N131R03l174o550J735K848r49m28k747j253j382r59k014
12207B401J178J191J792m75k211l0K112j322m746j204p29N63K291P09l095j808
$$ plain form
12191 -3383 -887 304 -786 -2453 -2032 -1094 1316 3798 2330 2398 3508 5351 7514 6870 4445 4924
12175 4924 1260 -1232 -4996 -6682 -3907 -881 -568 -994 1974 2041 2099 1122 1583 717 1453 3494 3345
12158 3345 864 2355 5246 6035 3721 3555 4888 5543 1856 -525 -908 2144 844 -621 495 -991
12142 -991 -2008 2046 1473 -3413 -2078 -922 113 3376 6409 5292 2636 3194 2561 4537 3777 -695
12126 -695 -7621 -6713 -1891 167 2767 4420 5494 5532 3869 2436 4185 6369 7074 9047 11075 9730
12110 9730 6550 5603 4919 3481 4869 9682 13707 9937 4248 3637 6769 6916 4375 4577 5216 6594
12094 6594 6711 6070 5554 5202 5497 3388 3996 4826 2857 666 2723 2650 1590 -1125 2071 5284 5630
12077 5630 7117 7972 6245 6029 9493 15007 19304 20433 21339 17893 15738 14071 9975 11722 15091
$$ packed form
12191c383K496J191j090j667M21R38K410K482j468O8J110J843K163o44k425M79
12175D924l664k492l764j686K775L026L13m26K968O7N8r77M61q66P36K041j49
12158C345k481J491K891P89k314j66J333O55l687k381l83L052j300j465J116j486
12142i91j017M054n73m886J335J156J035L263L033j117k656N58o33J976p60m472
12126f95o926R08M822K058K600J653J074L8j663j433J749K184P05J973K028j345
12110I730l180r47o84j438J388M813M025l770n689o11L132J47k541K02O39J378
12094F594J17o41n16l52K95k109O08Q30j969k191K057p3j060k715L196L213L46
12077E630J487Q55j727k16L464N514M297J129R06l446k155j667m096J747L369
$$ plain form
12062 15091 17540 22339 30290 37280 31753 19802 15476 8152 5027 5065 5203 4878 7633 8748 8268
12047 8268 6653 6285 3767 821 2388 3513 43 -1391 1794 3942 5308 8453 11306 10514 8237
12032 8237 10669 14401 15552 16703 16681 21077 27636 29667 25164 18429 17688 17371 19218 18692 22098 29478
12016 29478 36019 42795 43135 37240 30703 25300 27648 29692 31941 40682 65172 96956 132540 175179
12002 175179 223405 264473 282361 284102 272198 238729 186472 139505 104852 76751 55569 40117
11990 40117 30215 21320 16252 12156 9460 9282 10926 13264 14668 14046 16571 14836 14104 9850 8129
11975 8129 11066 9800 9702 11357 13517 14694 10124 4929 5504 6011 6920 2838 872 2729 711 -1447
11959 -1447 -2788 -4582 -3759 -519 -744 1126 4662 5041 4601 4158 4239 5351 7050 2691 158 -699 120
$$ packed form
12062A5091K449M799P951O990n527j1951m326p324l125L8J38l25K755J115m80
12047H268j615l68k518k946J567J125l470j434L185K148J366L145K853p92k277
12032H237K432L732J151J151k2M396O559K031m503o735p41l17J847n26L406P380
12016B9478O541O776L40n895o537n403K348K044K249Q741K4490L1784L5584M2639
12002A75179M8226M1068J7888J741j1904l3469n2257m6967l4653k8101k1182j5452
11990D0117r902q895n068m096k696j78J644K338J404o22K525j735p32m254j721
11975H129K937j266r8J655K160J177m570n195N75N07R09m082j966J857k018k158
11959a447j341j794Q23L240k25J870L536L79m40m43Q1J112J699m359k533q57Q19
$$ plain form
11942 120 1376 98 -1078 429 3743 1908 2607 2895 2355 1884 562 -1554 -2561 -1890 -954 95
11926 95 -470 -705 1743 4088 2597 -417 -2 2323 1750 -1539 -2510 43 2737 3537 3091 522 829
11909 829 916 -1158 -995 -2324 -1352 -693 -1487 19 1130 4118 3587 3862 7418 10896 10959 6043 160
11892 160 525 871 -751 2354 4666 2805 1733 2364 1025 2254 288 850 -959 -2768 -1646 79
11876 79 1018 1701 2064 -2315 -4462 -3280 -2517 -3813 -3590 -1039 212 220 3417 6582 7916 5362 4899
11859 4899 7612 11665 12097 15083 17622 16478 6879 1318 588 403 517 -586 -470 1138 -586 -553
11843 -553 176 3362 4615 3980 2514 2546 320 928 2686 4815 3615 3875 4646 5483 2811 2635 2519
11826 2519 -844 -977 3294 4882 3275 4754 3858 892 2592 2758 436 903 3840 4655 5672 5118
$$ packed form
11942A20J256j278j176J507L314j835O99K88n40m71j322k116j007O71R36J049
11926I5n65k35K448K345j491l014M15K325n73l289r71K553K694Q00m46k569L07
11909H29Q7k074J63j329R72O59p94J506J111K988n31K75L556L478O3m916n883
11892A60L65L46j622L105K312j861j072O31j339J229j966N62j809j809J122J725
11876G9R39O83L63m379k147J182P63j296K23K551J251QL197L165J334k554m63
11859D899K713M053M32K986K539j144r599n561p30j85J14j103J16J608j724L3
11843e53P29L186J253o35j466L2k226O08J758K129j200K60P71Q37k672j76j16
11826B519l363j33M271J588j607J479q96k966J700J66k322M67K937Q15J017n54
$$ plain form
11810 5118 4283 3667 2206 3149 3031 3123 3043 4594 4677 893 -1690 1696 5814 4824 1198 -657 -1315 -1011
11792 -1011 541 2150 36 471 -1350 -3256 -1048 -3304 -5025 -3204 -2228 575 2124 3701 3845
11777 3845 1713 -393 -2051 -704 2643 3457 639 2509 5953 7868 1680 -108 -2116 -2807 -2958
11762 -2958 -2724 318 -308 -4628 -5337 -2466 422 2527 3778 3883 4532 4766 5537 7243 6446 5259 3403
11745 3403 -1061 -2384 -2225 -707 -406 1392 2469 444 979 4416 5368 3707 2329 2348 -289 -1467
11729 -1467 -77 911 2340 1303 3455 4143 1620 -48 1694 2358 4592 6737 4272 2878 4111
11714 4111 4450 435 -2007 -2519 -2833 226 314 -1492 826 3067 3440 4361 6329 4280 3355 2015 201
11697 201 726 4973 6697 1007 -4005 -3774 -636 512 3257 2218 -542 508 1101 -420 -1699 1218
$$ packed form
11810E118q35o16j461R43j18R2q0J551Q3l784k583L386M118r90l626j855o58L04
11792a011J552J609k114M35j821j906K208k256j721J821R76K803J549J577J44
11777C845k132k106j658J347L347Q14k818J870L444J915o188j788k008o91j51
11762b958K34L042o26m320p09K871K888K105J251J05O49K34P71J706p97j187j856
11745C403m464j323J59J518L01J798J077k025N35L437R52j661j378J9k637j178
11729a467J390R88J429j037K152O88k523j668J742O64K234K145k465j394J233
11714D111L39m015k442n12l14L059Q8j806K318K241L73R21J968k049r25j340j814
11697B01N25M247J724n690n012K31L138J148K745j039k760J050N93j521j279K917
$$ plain form
11681 1218 1145 1372 -2430 -1879 3445 7853 4702 965 984 -1164 -2527 25 1283 1485 4840 4480 4274
11664 4274 2112 2855 3614 5443 4343 3371 1476 2629 6828 7705 5366 1568 2747 5691 3141 1258
11648 1258 1890 3251 4172 6880 6518 5051 3530 4331 2908 4904 2404 2897 4980 6119 6866 7790
11632 7790 6602 6285 5993 2869 1225 141 -1252 -10 988 308 -913 -1537 2227 896 725 2540
11616 2540 2027 -638 -3974 -1218 3007 3868 4472 3224 3339 3060 2364 4575 3349 2868 2446 4916 6390
11599 6390 2872 1072 2106 5567 7459 10520 10617 9199 7077 5131 8231 13164 14864 13247 13138
11584 13138 14453 11368 9466 4964 336 -1759 -2126 -1096 -3755 -2206 517 726 1116 994 1196 386
11568 386 1189 2252 3727 4808 4619 2217 3369 4884 3263 1537 2997 1072 2433 5234 3502
$$ packed form
11681A218p3K27l802N51N324M408l151l737J9k148j363K552J258K02L355l60k06
11664D274k162P43P59J829j100r72j895J153M199Q77k339l798J179K944k550j883
11648A258O32J361R21K708l62j467j521Q01j423J996k500M93K083J139P47R24
11632G790j188l17k92l124j644j084j393J242R98o80j221o24L764j331j71J815
11616B540n13k665l336K756M225Q61O04j248J15k79o96K211j226m81m22K470J474
11599F390l518j800J034L461J892L061R7j418k122j946L100M933J700j617j09
11584A3138J315l085j902m502m628k095l67J030k659J549K723K09L90j22K02q10
11568C86Q03J063J475J081j89k402J152J515j621j726J460j925J361K801j732
$$ plain form
11553 3502 3389 1462 -1428 -3366 -3064 1075 1993 4520 8652 13187 12650 12126 10660 7526 7326 8882
11537 8882 5246 3898 1917 1101 2266 3296 1842 406 2048 3903 5377 5876 4911 5553 8510 4480
11521 4480 1705 1716 306 1945 3124 6838 6998 7890 10924 11487 9271 10615 11033 11729 11615 8812 9524
11504 9524 9077 7052 5429 5838 8704 7206 4901 4112 2770 2284 2567 770 26 296 1832 860 -505
11487 -505 594 2685 1328 3234 3463 3970 5406 3730 3087 2952 3587 6767 4031 1523 -2368 -3809
11471 -3809 -1697 972 5308 5832 4182 7443 9859 9521 8654 8580 8412 5978 4393 5356 6909 7190 5983
11454 5983 6247 9513 11620 8844 10717 8424 7385 8803 8059 7313 7626 5254 4524 4129 5462 3883
11438 3883 4724 6594 6551 7909 6913 6297 5856 2511 2611 5918 9589 11784 13948 11425 6103 1289
$$ packed form
11553C502j13j927k890j938L02M139R18K527M132M535n37n24j466l134k00J556
11537H882l636j348j981q16J165J030j454j436J642J855J474M99r65O42K957m030
11521D480k775J1j410J639J179L714J60Q92L034N63k216J344M18O96j14k803P12
11504I524m47k025j623M09K866j498k305p89j342m86K83j797p44K70J536r72j365
11487e05J099K091j357J906K29N07J436j676o43j35O35L180k736k508l891j441
11471c809K112K669M336N24j650L261K416l38q67p4j68k434j585R63J553K81j207
11454E983K64L266K107k776J873k293j039J418p44p46L13k372p30l95J333j579
11438C883Q41J870m3J358r96o16m41l345J00L307L671K195K164k523n322m814
$$ plain form
11422 1289 1751 4890 6439 8170 12544 13794 12454 11766 12618 10811 9927 9473 9247 7605 7249 10541
11406 10541 9800 9352 9458 7617 7643 4512 4408 7595 6138 4655 3838 2787 3589 6757 10513 8188
11390 8188 4033 3733 1749 2627 4644 5969 4026 959 -2494 -4324 906 6033 5133 2723 1553
11375 1553 1692 5981 9929 8767 9601 13370 16609 15518 12405 9682 9689 11341 15514 13442 10063 11161
11359 11161 12851 11421 10899 8948 6671 4242 4578 5192 6314 7879 8091 8040 9401 9151 8105 6997
11343 6997 6135 8144 8907 7255 4934 6434 6467 5258 5844 5633 3185 8560 10419 9026 7594 5648
11327 5648 5714 4412 4403 8378 11351 10383 8715 10881 11095 13058 14392 9867 11824 16356 17340 18083 18597
11310 18597 18005 16201 15482 13833 9571 9238 9933 14063 14327 17074 16478 16993 18132 15490 14654 13963 15369
$$ packed form
11422A289M62L139J549J731M374J250j340o88Q52j807q84m54k26j642l56L292
11406A0541p41m48J06j841K6l131j04L187j457j483q17j051Q02L168L756k325
11390H188m155l00j984Q78K017J325j943l067l453j830N230N127r00k410j170
11375A553J39M289L948j162Q34L769L239j091l113k723PJ652M173k072l379J098
11359A1161J690j430n22j951k277k429L36O14J122J565K12n1J361k50j046j108
11343F997q62K009P63j652k321J500L3j209N86k11k448N375J859j393j432j946
11327E648O6j302rL975K973r68j668K166K14J963J334m525J957M532R84P43N14
11310A8597n92j804p19j649m262l33O95M130K64K747n96N15J139k642q36o91J406
$$ plain form
11293 15369 14480 13125 11046 8369 8027 7305 8404 11589 13887 15061 17429 16979 13765 13954 15052 15489
11277 15489 17660 19456 17520 21047 28536 30589 28586 30054 29539 28956 28698 27668 23366 19368 18916
11262 18916 17664 15959 13616 12621 12861 14059 15352 15809 15758 14502 13496 12257 11921 11548 11667 11993 14466
11245 14466 13387 10369 10739 12182 12769 14290 14427 14157 16299 14358 11587 12685 12419 14343 16957 16379
11229 16379 14382 14326 12797 14091 16677 18752 18430 20052 21247 20463 18216 20514 22278 27940 34298
11214 34298 45837 61087 68969 70196 68015 63974 50675 36654 29620 27874 26011 23185 22674 22107
11200 22107 23337 20249 19932 20968 17224 14721 12951 12559 12217 11236 11002 9990 8365 7409 10160 15303
11184 15303 18923 20122 20370 21967 22951 25328 26386 26053 26964 26463 27937 31143 33196 35700 32943 26664
$$ packed form
11293A5369q89j355k079k677l42p22J099L185K298J174K368m50l214J89J098M37
11277A5489K171J796j936L527P489K053k003J468n15n83k58j030m302l998m52
11262A8916j252j705k343r95K40J198J293M57n1j256j006j239l36l73J19L26K473
11245A4466j079l018L70J443N87J521J37k70K142j941k771J098k66J924K614n78
11229A6379j997n6j529J294K586K075l22J622J195p84k247K298J764N662O358
11214C4298J1539J5250P882J227k181m041j3299j4021p034j746j863k826n11n67
11200B2107J230l088l17J036l744k503j770l92l42r81k34j012j625r56K751N143
11184A5303L620J199K48J597R84K377J058l33R11n01J474L206K053K504k757o279
$$ plain form
11168 26664 26376 29337 29806 30535 31730 34875 33699 29586 29241 29067 29809 30609 28490 27684 21456 17722
11152 17722 20536 22971 25116 27478 28787 34028 36403 37311 35444 36841 35822 32545 30702 33353 38934
11137 38934 36986 35789 39203 39570 39767 38698 37120 35129 35117 32884 31908 34188 36140 34078 34987 36583
11121 36583 35875 37770 41800 42000 39120 34769 27206 22468 21624 18675 20735 23229 25411 27773 35571
11106 35571 38197 40290 44629 46165 48321 51411 54333 60116 69126 85675 108120 132579 159862
11093 159862 181247 188390 182190 164230 142510 125450 111562 104211 109821 120579 124795 120528 112194
11080 112194 110465 102534 89061 77393 68147 62394 56429 48556 41868 39597 38894 40417 39431 39576
11066 39576 41921 46410 51423 53011 57879 63689 68081 69424 70684 71335 75163 84678 96535 111844
$$ packed form
11168B6664k88K961M69P29J195L145j176m113l45j74P42Q00k119q06o228l734
11152A7722K814K435K145K362J309N241K375R08j867J397j019l277j843K651N581
11137C8934j948j197L414L67J97j069j578j991j2k233r76K280J952k062R09J596
11121C6583p08J895M030K00k880m351p563m738q44k949K060K494K182K362P798
11106C5571K626K093M339J536K156L090K922N783R010J6549K2445K4459K7283
11093A59862K1385P143o200j7960k1720j7060j3888p351N610J0758M216m267q334
11080A12194j729p931j3473j1668r246n753n965p873o688k271p03J523r86J45
11066C9576K345M489N013J588M868N810M392J343J260O51L828R515J1857J5309
$$ plain form
11052 111844 136193 162960 191664 226389 273578 347266 469575 674864 1033613 1596660 2290185
11041 2290185 2916341 3274903 3239764 2824938 2173871 1503793 977409 649910 466871 355445
11031 355445 280478 230152 192916 163784 142371 127550 115817 107142 97499 87966 80878 77079
11019 77079 76591 77371 77808 76682 72602 65678 61453 55992 53059 50306 51485 53997 50869 49188 49538
11004 49538 48520 46827 45814 48280 51097 45513 42358 42326 42698 42856 43825 42239 42010 43582 44424 43987
10988 43987 42711 42559 44612 46521 49708 52879 53569 53591 50464 48011 48782 49405 50322 50890 47282 46023
10972 46023 51436 52857 52808 57461 64295 66953 66224 66943 61939 54153 49474 50197 50288 48875 48925 50426 47444
10955 47444 45725 46129 49391 48432 45338 45705 44355 42119 42595 40897 39046 40487 43576 46179 45049
$$ packed form
11052A11844K4349K6767K8704L4725M7189P3688J22309K05289L58749N63047O93525
11041B290185O26156L58562l5139m14826o51067o70078n26384l27499j83039j11426
11031C55445p4967n0326l7236k9132k1413j4821j1733q675r643r533p088l799
11019G7079m88P80M37j126m080o924m225n461k933k753J179K512l128j681L50
11004D9538j018j693j013K466K817n584l155l2L72J58R69j586k29J572Q42m37
10988D3987j276j52K053J909L187L171O90K2l127k453P71O23R17N68l608j259
10972D6023N413J421m9M653O834K658p29P19n004p786m679P23R1j413N0J501k982
10955D7444j719M04L262r59l094L67j350k236M76j698j851J441L089K603j130
$$ plain form
10940 45049 45110 44699 43915 48917 53687 58847 69370 73813 74455 74099 75718 77276 77503 75437 70497 62528
10924 62528 52850 46180 44046 44206 45880 51576 57772 63875 72396 79346 84738 86201 83639 82019 84162
10909 84162 86182 91296 98998 112958 130829 142970 154740 169922 178910 183542 187426 191701 195157
10896 195157 200338 208459 219121 232012 249544 271033 291702 302498 300655 285609 263923 242393
10884 242393 224550 210671 200120 192604 176612 160321 150357 137327 116969 100191 86456 79223
10872 79223 73472 66825 58172 54097 50554 49772 51910 57490 67253 76692 82060 86593 90644 91891 88953
10857 88953 87919 87495 85756 84390 82711 82435 80974 83264 84098 84743 89056 92629 95437 98593 103052
10842 103052 106582 110911 115528 119156 118065 113371 107917 102082 97547 99046 104246 113533 123254 127512
$$ packed form
10940D5049O1m11p84N002M770N160J0523M443O42l56J619J558K27k066m940p969
10924F2528r678o670k134J60J674N696O196O103Q521O950N392J463k562j620K143
10909H4162K020N114P702J3960J7871J2141J1770J5182Q988M632L884M275L456
10896A95157N181Q121J0662J2891J7532K1489K0669J0796j843j5046k1686k1530
10884B42393j7843j3879j0551p516j5992j6291r964j3030k0358j6778j3735p233
10872G9223n751o647q653m075l543p82K138N580R763R439N368M533M051J247k938
10857H8953j034m24j739j366j679k76j461K290Q34O45M313L573K808L156M459
10842A03052L530M329M617L628j091m694n454n835m535J499N200R287R721M258
$$ plain form
10828 127512 133872 135501 133138 129231 126001 119571 107007 91124 72912 55557 47380 53040 68855
10815 68855 86315 105300 124176 141691 152421 161669 167514 173380 177763 180215 184143 184352 183972 184785
10801 184785 186683 186274 187691 188034 188323 188031 187696 188992 195699 201535 201282 198572 189142 171427 154111
10786 154111 134260 115855 111666 120177 134510 143529 153438 162787 167847 167426 165051 169198 174004 180627
10772 180627 192550 213254 237377 260186 287246 322225 366441 417895 473037 524979 564777
10761 564777 582521 581025 579778 578947 561402 524245 475257 429144 384261 343313 309506 283861
10749 283861 269010 256982 242652 235670 235902 240679 247789 262427 281831 305997 326555 344897
10737 344897 359861 364754 371675 374528 371089 361107 349530 341457 334585 330820 334836 344009 359356
$$ packed form
10828A27512O360J629k363l907l230o430j2564j5883j8212j7355q177N660J5815
10815F8855J7460J8985J8876J7515J0730R248N845N866M383K452L928K09l80Q13
10801A84785J898m09J417L43K89k92l35J296O707N836k53k710r430j7715j7316
10786A54111j9851j8405m189Q511J4333R019R909R349N060m21k375M147M806O623
10772A80627J1923K0704K4123K2809K7060L4979M4216N1454N5142N1942L9798
10761E64777J7744j496j247q31j7545l7157m8988m6113m4883m0948l3807k5645
10749B83861j4851j2028j4330o982K32M777P110J4638J9404K4166K0558J8342
10737C44897J4964M893O921K853l439r982j1577q073o872l765M016R173J5347
$$ plain form
10724 359356 376925 398423 420480 443987 466693 489066 505306 507577 501413 494181 486481 479158
10712 479158 478082 481433 490440 499000 507773 516044 527048 545280 573714 610740 655178 705255 750062
10699 750062 783412 809956 830124 849553 876904 910718 949610 988895 1026966 1068689 1114763
10688 1114763 1167002 1219663 1273142 1331764 1394028 1459572 1526775 1590104 1652026 1714906 1774040
10677 1774040 1837418 1920785 2045091 2250890 2597895 3086914 3485189 3480269 3242993 3152018
10667 3152018 3210768 3349114 3530383 3748605 4011730 4316295 4666940 5084296 5601942 6276464
10657 6276464 7145443 8164985 9181173 10020930 10586992 10930402 11209809 11663798 12521475
10648 12521475 13896252 15774737 18171835 21195079 25061116 30086722 36651592 45331019
$$ packed form
10724C59356J7569K1498K2057K3507K2706K2373J6240K271o164p232p700p323
10712D79158j076L351R007Q560Q773Q271J1004J8232K8434L7026M4438N0077M4807
10699G50062L3350K6544K0168J9429K7351L3814L8892L9285L8071M1723M6074
10688A114763N2239N2661N3479N8622O2264O5544O7203O3329O1922O2880N9134
10677A774040O3378Q3367J24306K05799L47005M89019L98275m920k37276r0975
10667C152018N8750J38346J81269K18222K63125L04565L50645M17356N17646O74522
10657F276464Q68979J019542J016188Q39757N66062L43410K79407M53989Q57677
10648A2521475J374777J878485K397098L023244L866037N025606O564870Q679427
$$ plain form
10640 45331019 57294453 74899598 102714163 148542227 220544887 316056339 411495113
10633 411495113 480522882 510140485 496638537 442991051 358868252 263838904 181965254
10626 181965254 127237393 93380452 71643525 56719307 45806432 37461849 30982236
10619 30982236 25992558 22204903 19310599 17071557 15327526 13968414 12938511 12242066
10611 12242066 11841167 11559025 11172749 10512560 9549154 8386367 7214878 6220958 5484215
10602 5484215 4944613 4524220 4179981 3892161 3646192 3436077 3257808 3107316 2981194
10593 2981194 2869762 2766866 2662071 2541988 2406760 2267728 2129187 1994905 1873598
10584 1873598 1769649 1674143 1596280 1533051 1478512 1429975 1384522 1342020 1305182 1268920 1231367
$$ packed form
10640D5331019J1963434J7605145K7814565M5828064P2002660R5511452R5438774
10633D11495113O9027769K9617603j3501948n3647486q4122799r5029348q1873650
10626A81965254n4727861l3856941k1736927j4924218j0912875q344583o479613
10619C0982236m989678l787655k894304k239042j744031j359112j029903o96445
10611A2242066m00899k82142l86276o60189r63406j162787j171489r93920p36743
10602E484215n39602m20393l44239k87820k45969k10115j78269j50492j26122
10593B981194j11432j02896j04795j20083j35228j39032j38541j34282j21307
10584A873598j03949r5506p7863o3229n4539m8537m5453m2502l6838l6262l7553
$$ plain form
10573 1231367 1194317 1160390 1132085 1103316 1072624 1039873 1009081 976986 948869 934344 927708
10562 927708 929937 938963 946654 945600 933246 913251 894297 876271 854339 830160 802088 769592
10550 769592 731563 691913 654906 621684 594431 580943 576117 576961 579892 585624 592590 598817 603845
10537 603845 602730 598608 585977 564291 539647 515107 489301 464847 449128 434873 425258 420675
10525 420675 421985 432252 443405 454784 462481 465439 462329 449761 429419 410421 394598 380611
10513 380611 367059 351299 334702 321900 316277 315120 319135 334885 359742 383136 400463 412903
10501 412903 421849 424899 425587 417293 405820 396664 384327 369745 356728 343512 329205 321013 313278
10488 313278 304780 294440 282093 273389 268858 271600 281285 294784 302521 294335 275390 251669 230333
$$ packed form
10573A231367l7050l3927k8305k8769l0692l2751l0792l2095k8117j4525o636
10562I27708K229R026P691j054j2354j9995j8954j8026k1932k4179k8072l2496
10550G69592l8029l9650l7007l3222k7253j3488m826Q44K931N732O966O227N028
10537F03845j115m122j2631k1686k4644k4540k5806k4454j5719j4255r615m583
10525D20675J310J0267J1153J1379P697K958l110j2568k0342j8998j5823j3987
10513C80611j3552j5760j6597j2802n623j157M015J5750K4857K3394J7327J2440
10501D12903Q946L050O88q294j1473r156j2337j4582j3017j3216j4307q192p735
10488C13278q498j0340j2347q704m531K742R685J3499P737q186j8945k3721k1336
$$ plain form
10475 230333 214818 197715 186386 179477 172816 170294 166744 162305 157024 150323 144517 138247 132003
10462 132003 128145 126528 124145 121548 116278 112827 115658 118627 126131 134037 145842 165453 188830
10449 188830 213051 233797 249235 255269 244352 223768 207636 192062 181358 179743 178039 162521
10437 162521 140151 122465 116722 113927 118551 124383 128666 128048 124418 117964 109889 106034 104298 104984
10423 104984 110267 117854 121736 123515 122606 119487 116418 119412 122750 121774 120512 117472 117687 118717 116953
10408 116953 110849 109741 114553 124035 138196 163025 202946 262930 332853 348521 286579 221488
10396 221488 188027 172561 157985 150326 145555 143875 147972 159009 177127 185144 168772 137654
10384 137654 116311 105691 99598 92691 85875 80044 75457 76687 79674 77087 75495 72703 69635 70241
$$ packed form
10475B30333j5515j7103j1329o909o661k522l550m439n281o701n806o270o244
10462A32003l858j617k383k597n270l451K831K969P504P906J1805J9611K3377
10449A88830K4221K0746J5438O034j0917k0584j6132j5574j0704j615j704j5518
10437A62521k2370j7686n743k795M624N832M283o18l630o454q075l855j736O86
10423A04984N283P587L882J779r09l119l069K994L338r76j262l040K15J030j764
10408A16953o104j108M812R482J4161K4829L9921N9984O9923J5668o1942o5091
10396B21488l3461j5466j4576p659m771j680M097J1037J8118Q017j6372l1118
10384A37654k1343j0620o093o907o816n831m587J230K987k587j592k792l068O06
$$ plain form
10370 70241 72989 73993 74651 77628 85618 92402 98157 100081 97069 96742 95069 96436 98268 98147 95988
10355 95988 93177 88463 83096 74783 67322 59689 58852 59185 64484 70099 75183 78854 82094 82038 81326 79099
10339 79099 74991 72722 71604 63829 54232 45862 45998 45962 46982 52908 58163 67062 79256 82800 82005
10324 82005 77679 71580 63656 61984 62682 63244 64435 59179 56155 51654 49893 52934 53909 51133 50467
10309 50467 52855 49665 48308 48064 49094 47271 45801 39789 34034 31049 28233 27858 26327 28794 32958
10294 32958 42790 50516 53672 53430 51845 50025 52323 55703 55024 53298 48224 45888 44573 44419 43347
10279 43347 43506 40786 42411 45610 47410 49351 50813 47924 46038 44330 43536 45449 48184 50419 50750
10264 50750 51358 50445 46575 46143 50061 54999 59215 61678 62587 66400 73210 75425 73173 73154 75312 75276
$$ packed form
10370G0241K748J004O58K977P990O784N755J924l012l27j673J367J832j21k159
10355I5988k811m714n367q313p461p633q37L33N299N615N084L671L240n6p12k227
10339G9099m108k269j118p775r597q370J36l6J020N926N255Q899J2194L544p95
10324H2005m326o099p924j672O98N62J191n256l024m501j761L041R75k776o66
10309E0467K388l190j357k44J030j823j470o012n755k985k816l75j531K467M164
10294C2958R832P726L156k42j585j820K298L380o79j726n074k336j315j54j072
10279D3347J59k720J625L199J800J941J462k889j886j708p94J913K735K235L31
10264E0750O08r13l870m32L918M938M216K463R09L813O810K215k252j9K158l6
$$ plain form
10248 75276 77889 83031 91007 96700 98508 100318 107122 113757 119771 127509 136570 145225 154478 163655
10234 163655 172822 186619 198899 207870 220902 240356 269153 310198 377095 486362 671560
10223 671560 984189 1486353 2152060 2812164 3261804 3344388 3039105 2444878 1754427 1168625
10213 1168625 788656 572962 449441 367383 308430 264705 232126 205444 184015 167831 154349
10202 154349 145483 139496 138479 138559 141705 147382 152831 157076 162555 164524 173999 192750 231174 294636
10188 294636 378637 480023 577259 642781 672065 644868 572896 484012 377608 281423 202706
10177 202706 140119 88882 45260 6103 -23391 -35406 -30859 -17534 5455 37191 66307 82760
10165 82760 93668 98526 100616 104709 112236 118340 125932 136516 151529 166911 186901 202741 214499
$$ packed form
10248G5276K613N142P976N693J808J810O804O635O014P738R061Q655R253R177
10234A63655R167J3797J2280Q971J3032J9454K8797M1045O6897J09267J85198
10223F71560L12629N02164O65707O60104M49640Q2584l05283n94227o90451n85802
10213A168625l79969k15694j23521q2058n8953m3725l2579k6682k1429j6184j3482
10202A54349q866n987j017Q0L146N677N449M245N479J969R475J8751L8424O3462
10188B94636Q4001J01386R7236O5522K9284k7197p1972q8884j06404r6185p8717
10177B02706o2587n1237m3622l9157k9494j2015M547J3325K2989L1736K9116J6453
10165H2760J0908M858K090M093P527O104P592J0584J5013J5382J9990J5840J1758
$$ plain form
10152 214499 226720 232450 239383 243389 251564 268605 300953 335923 380355 440094 523691 635404
10140 635404 800178 1054410 1474221 2133962 3054666 4205681 5607824 7009124 8001785
10131 8001785 8748379 8941586 8279383 7419294 6302598 4930606 3826564 2955693 2213426
10122 2213426 1666501 1300335 1012066 791261 638112 528376 447719 389481 346284 315581
10112 315581 290684 270520 255370 243354 232184 220067 205496 186974 172016 155583 140868
10101 140868 127685 116927 110620 105707 101826 100385 101276 104926 109114 110503 114843 113238 105677 96465
10087 96465 89847 87295 85916 81083 75561 69625 69470 71292 70331 67853 68590 71616 68561 67691 68925
10072 68925 71958 74716 75331 73364 66598 63021 60528 58940 59561 59356 62423 67883 71540 76020 74190
$$ packed form
10152B14499J2221N730O933M006Q175J7041L2348L4970M4432N9739Q3597J11713
10140F35404J64774K54232M19811O59741R20704J151015J402143J401300R92661
10131H001785P46594J93207o62203q60089j116696j371992j104042q70871p42267
10122B213426n46925l66166k88269k20805j53149j09736q0657n8238m3197l0703
10112C15581k4897k0164j5150j2016j1170j2117j4571j8522j4958j6433j4715
10101A40868j3183j0758o307m913l881j441Q91L650M188J389M340j605p561r212
10087I6465o618k552j379m833n522n936j55J822r61k478P37L026l055q70J234
10072F8925L033K758O15j967o766l577k493j588O21k05L067N460L657M480j830
$$ plain form
10057 74190 71492 66115 62669 63400 65107 63738 63326 60369 57325 58591 61462 61327 62531 68695 75334
10042 75334 78666 84870 86776 86649 87453 86475 81356 75707 73649 65769 62291 60993 56598 56707 59323
10027 59323 60139 61680 59660 58882 62667 69451 71372 71340 68648 71191 72088 71845 74638 76744 78127 78378
10011 78378 76350 75178 74612 81791 84480 84841 89911 98363 103879 104435 104481 100628 92443 88872 84368 79553
9995 79553 76749 76783 79167 80066 83665 91136 103330 118138 136693 160105 186929 207697 223737 220744
9981 220744 208037 196441 176098 157857 156037 159594 162030 161526 159129 149531 139495 134637 134844 135004
9967 135004 132036 132726 137269 141287 142447 144550 145172 146130 153492 162768 176745 192414 197428 183943
9953 183943 169499 167229 167271 171006 175539 180321 182553 185024 187041 190137 194554 197860 199150 200817 202931
$$ packed form
10057G4190k698n377l446P31J707j369m12k957l044J266K871j35J204O164O639
10042G5334L332O204J906j27Q04r78n119n649k058p880l478j298m395J09K616
10027E9323Q16J541k020p78L785O784J921l2k692K543Q97k43K793K106J383K51
10011G8378k028j172n66P179K689L61N070Q452N516N56M6l853q185l571m504m815
9995G9553k804L4K384Q99L599P471J2194J4808J8555K3412K6824K0768J6040k993
9981B20744j2707j1596k0343j8241j820L557K436n04k397r598j0036m858K07J60
9967A35004k968O90M543M018J160K103O22R58P362R276J3977J5669N014j3485
9953A83943j4444k270M2L735M533M782K232K471K017L096M417L306J290J667K114
$$ plain form
9938 202931 205499 209188 211378 213852 214548 216293 216498 219398 222672 223447 228154 233793 238241 240770 244619
9923 244619 249128 252628 253081 253816 256083 257319 257326 258808 262530 265905 268291 268775 273999 277354 280116 278038
9907 278038 275049 276020 277963 279743 284417 287737 285297 285305 284533 286746 290184 292180 291775 290313 286504 284989
9891 284989 281952 278965 277824 280966 282663 283823 283325 280125 277928 277885 275676 273339 268920 266035 266379
9876 266379 268137 267787 268476 267631 265496 263531 261946 254382 250139 253056 253690 250324 250085 252280 253887 253552
9860 253552 253283 252615 246312 245388 247386 245581 240279 237366 234371 232815 239958 240421 238479 235792 237308
9845 237308 241029 241132 236876 234239 231010 229339 229915 236819 240139 238417 234919 237422 238459 239169 237748
9830 237748 237593 239956 243343 246344 250003 259624 279719 317700 372482 425501 416775 354639 310893
$$ packed form
9938B02931K568L689K190K474O96J745K05K900L274P75M707N639M448K529L849
9923B44619M509L500M53P35K267J236PJ482L722L375K386M84N224L355K762k078
9907B78038k989R71J943J780M674L320k440Qp72K213L438J996m05j462l809j515
9891B84989l037k987j141L142J697J160m98l200k197m3k209k337m419k885L44
9876B66379J758l50O89q45k135j965j585p564m243K917O34l366k39K195J607l35
9860B53552k69o68o303r24J998j805n302k913k995j556P143M63j942k687J516
9845B37308L721J03m256k637l229j671N76O904L320j722l498K503J037P10j421
9830B37748j55K363L387L001L659R621K0095L7981N4782N3019q726o2136m3746
$$ plain form
9817 310893 289937 280652 275606 267478 256707 241357 228937 220365 215901 211449 205977 203949 198962
9804 198962 195664 196953 196902 196783 196427 194452 194892 189808 184254 181795 177765 176767 173106 171207 167870 162425
9788 162425 159151 157364 155270 153314 151169 149272 146166 149354 154433 155708 161631 176186 186700 184662
9774 184662 171438 158978 148496 137623 132988 128034 126951 125282 123350 119771 118838 117820 120279 122308
9760 122308 120553 122164 125300 129815 138495 156301 186083 216924 220995 193109 154857 125595 110169
9747 110169 104059 98361 93084 87518 83806 81888 78622 76406 77572 78593 76176 71590 72822 74910
9733 74910 75486 75010 74426 75511 76931 78170 80440 85215 94380 103868 109360 114624 115591 112572 108257 99476
9717 99476 93379 87088 81272 73117 67958 64019 62864 60836 56818 52770 52293 51323 50649 52168 54749
$$ packed form
9817C10893k0956r285n046q128j0771j5350j2420q572m464m452n472k028m987
9804A98962l298J289n1j19l56j975M40n084n554k459m030r98l661j899l337n445
9788A62425l274j787k094j956k145j897l106L188N079J275N923J4555J0514k038
9774A84662j3224j2460j0482j0873m635m954j083j669j932l579r33j018K459K029
9760A22308j755J611L136M515Q680J7806K9782L0841M071k7886l8252k9262j5426
9747A10169o110n698n277n566l712j918l266k216J166J021k417m586J232K088
9733G4910N76m76n84J085J420J239K270M775R165R488N492N264R67l019m315q781
9717I9476o097o291n816q155n159l939j155k028m018m048m77r70o74J519K581
$$ plain form
9702 54749 55873 52622 49073 48392 46995 45805 44411 45847 48287 49245 51435 55405 52698 47063 48995
9687 48995 48099 48167 46737 41020 35413 32671 29539 29004 30567 27764 26817 25581 24878 25539 24028 27054
9671 27054 26123 25198 23582 25911 28293 25531 25471 27430 25353 23163 22380 22612 24904 25769 24275 25687
9655 25687 25797 26715 29678 30885 27549 25095 25658 23596 24161 24107 22697 23205 25505 24878 25909 27036 26545
9638 26545 27653 25513 18700 18083 20100 17536 19254 24132 24759 22002 21351 24367 26205 24829 23623
9623 23623 20888 21280 24088 26606 25844 25884 26562 27280 31545 38325 42716 42358 44730 54141 62350 61292
9607 61292 52409 45379 44815 40731 33639 31049 27036 23360 23379 25917 24320 24498 26864 25750 25348 25137
9591 25137 23915 23808 23477 23390 23857 24047 24374 25894 25417 27737 28890 29414 28478 29422 26837 25690 26104 25916
$$ packed form
9702E4749J124l251l549o81j397j190j394J436K440R58K190L970k707n635J932
9687D8995q96O8j430n717n607k742l132n35J563k803r47j236p03O61j511L026
9671B7054r31r25j616K329K382k762o0J959k077k190p83K32K292Q65j494J412
9655B5687J10R18K963J207l336k454N63k062N65n4j410N08K300o27J031J127m91
9638B6545J108k140o813o17K017k564J718M878O27k757o51L016J838j376j206
9623B3623k735L92K808K518p62M0O78P18M265O780M391l58K372R411Q209j058
9607F1292q883p030n64m084p092k590m013l676J9K538j597J78K366j114m02k11
9591B5137j222j07l31q7M67J90L27J520m77K320J153N24r36R44k585j147M14j88
$$ plain form
9573 25916 24531 24929 28090 28343 27763 28337 30682 32661 30628 27382 29931 33022 28258 26817 24779 23354
9557 23354 24237 25428 27107 27297 26206 26749 21703 19399 20225 19701 17585 19656 23666 26474 25244 24514
9541 24514 26399 25210 22216 23788 25657 28413 31087 30493 28262 25931 25725 25939 25213 23029 18688 20943
9525 20943 22498 25847 23360 19722 16693 14822 15533 18573 20677 22822 23917 24851 24163 23113 23727 23684
9509 23684 23619 25434 24979 22823 22809 21957 21821 21862 21836 22628 21457 19643 16069 12928 14790 18979 18536 18617
9491 18617 22072 24268 23597 21682 21285 20539 21091 18600 20510 22290 21278 22061 21004 21511 21698 22123 20394
9474 20394 24244 23459 23124 26412 23586 19728 21464 21374 19848 17958 16617 13277 11558 12362 12987 15303
9458 15303 17547 20221 18949 17481 17555 16253 14562 16317 19764 22796 27196 26351 23590 20689 21669 23442
$$ packed form
9573B5916j385L98L161K53n80N74K345J979k033l246K549L091m764j441k038j425
9557B3354Q83J191J679J90j091N43n046k304Q26n24k116K071M010K808j230p30
9541B4514J885j189k994J572J869K756K674n94k231k331k06K14p26k184m341K255
9525B0943J555L349k487l638l029j871P11L040K104K145J095R34o88j050O14m3
9509B3684o5J815m55k156j4q52j36M1k6P92j171j814l574l141J862M189m43Q1
9491A8617L455K196o71j915l97p46N52k491J910J780j012P83j057N07J87M25j729
9474B0394L850p85l35L288k826l858J736r0j526j890j341l340j719Q04O25K316
9458A5303K244K674j272j468P4j302j691J755L447L032M400q45k761k901R80J773
$$ plain form
9442 23442 20695 17177 14894 13274 9923 10426 13529 16930 16756 17078 17589 18358 22783 26017 26222 25070
9426 25070 21583 20020 17226 17917 19164 19408 17734 19358 15905 13968 13070 10827 10418 12486 13899 15919
9410 15919 15472 13343 12459 11661 9476 6584 3754 1314 2811 4387 6433 6353 6036 8972 10447 9762
9394 9762 9456 9893 9336 6081 6235 7504 7362 11071 12441 14142 17168 13054 10546 10180 10784 9298 8754
9377 8754 9224 11161 13601 15238 15295 11760 11235 10853 11794 9946 8523 9365 10579 8384 6574 6347 8905
9360 8905 11358 12699 8565 7219 5137 5588 4011 5405 8916 9134 9411 9517 7532 5774 8821 7948
9344 7948 5532 7144 6229 5780 10938 11024 7035 5870 6150 7917 6340 5362 5824 5071 6624 4686 3358
9327 3358 4828 6562 6398 7253 8670 8854 5775 5256 8088 9284 8082 8230 8134 3545 -390 1416 4743
$$ packed form
9442B3442k747l518k283j620l351N03L103L401j74L22N11P69M425L234K05j152
9426B5070l487j563k794O91J247K44j674J624l453j937q98k243m09K068J413K020
9410A5919m47k129q84p98k185k892k830k440J497J576K046q0l17K936J475o85
9394I762l06M37n57l255J54J269j42L709J370J701L026m114k508l66O04j486n44
9377H754M70J937K440J637N7l535n25l82R41j848j423Q42J214k195j810k27K558
9360H905K453J341m134j346k082M51j577J394L511K18K77J06j985j758L047q73
9344G948k416J612r15m49N158Q6l989j165K80J767j577r78M62p53J553j938j328
9327C358J470J734j64Q55J417J84l079n19K832J196j202J48r6m589l935J806L327
$$ plain form
9310 4743 4243 3027 937 2619 3129 3637 1901 1457 3547 5348 5321 10727 13229 10836 6811 4478
9294 4478 6335 9485 11901 9266 9031 10312 7164 4954 5123 4903 6701 5562 6245 4532 1908 2995
9278 2995 3230 2930 3213 7693 8694 9800 11381 9893 9512 8410 8175 10076 10704 6595 4109 3345 3969
9261 3969 6091 6163 5176 4606 5057 4548 1432 3297 1872 2407 5295 5483 6442 8596 10831 8264 7769
9244 7769 8578 7857 7959 7782 8734 7508 7646 6427 8823 7905 5836 7861 10288 16575 21145 20708 16816
9227 16816 12652 7289 10023 10771 7918 7859 4994 4136 5485 5502 4698 4910 4568 7012 6553 4849 4480
9210 4480 7224 8649 7335 7796 6181 5837 4409 7227 5195 1006 1599 2326 2752 -1141 -2942 -296
9194 -296 541 1091 1013 583 3717 3242 1999 -2146 -1200 2843 4397 4097 3921 6238 7786 6164 6192 7502
$$ packed form
9310D743n00j216k090J682N10N08j736m44K090J801k7N406K502k393m025k333
9294D478J857L150K416k635k35J281l148k210J69k20J798j139O83j713k624J087
9278B995K35l00K83M480J001J106J581j488l81j102k35J901O28m109k486p64O24
9261C969K122P2r87n70M51n09l116J865j425N35K888J88R59K154K235k567m95
9244G769Q09p21J02j77R52j226J38j219K396r18k069K025K427O287M570m37l892
9227A6816m164n363K734P48k853n9k865q58J349J7q04K12l42K444m59j704l69
9210D480K744J425j314M61j615l44j428K818k032m189N93P27M26l893j801K646
9194b96Q37N50p8m30L134m75j243m145R46M043J554l00j76K317J548j622K8J310
$$ plain form
9176 7502 9023 6096 4974 5019 5540 7554 7650 2887 835 3297 1641 3672 5310 5705 5901 7866 5503
9159 5503 4482 4668 7094 3516 3553 7120 6838 4059 3108 3075 5447 5117 4494 1505 192 668 -425
9142 -425 -836 258 402 -2004 -588 2848 6159 7876 7963 7094 5041 2517 4118 4101 3056 4899 6459
9125 6459 7639 7099 11392 10287 9042 9597 9378 7949 6534 6729 6464 3302 1303 2619 3968 5363
9109 5363 3803 2030 4633 5057 2984 920 355 27 58 1851 4685 5034 3756 1685 3276 4818
9093 4818 2711 2470 4675 2247 3062 2880 4682 4738 1788 -206 2772 -542 -530 3590 7492 7549 7509 7058
9075 7058 6730 7591 7667 8455 9266 9153 3624 328 3856 6481 7156 11484 13625 12374 8708 5524 1073
9058 1073 736 2771 3194 3931 6123 5336 4613 5088 1880 -1528 -1147 -649 -491 -2624 -4281 -796 2319
$$ packed form
9176G502J521k927j122M5N21K014R6m763k052K462j656K031J638L95J96J965k363
9159E503j021J86K426l578L7L567k82k779r51l3K372l30o23k989j313M76j093
9142d25m11J094J44k406J416L436L311J717Q7q69k053k524J601j7j045J843J560
9125F459J180n40M293j105j245N55k19j429j415J95k65l162j999J316J349J395
9109E363j560j773K603M24k073k064n65l28L1J793K834L49j278k071J591J542
9093D818k107k41K205k428Q15j82J802N6k950j994K978l314J2M120L902N7m0m51
9075G058l28Q61P6P88Q11j13n529l296L528K625O75M328K141j251l666l184m451
9058A073l37K035M23P37K192p87p23M75l208l408L81M98J58k133j657L485L115
$$ plain form
9041 2319 3618 4449 9291 8589 7097 3633 -579 -1197 -728 1421 4236 6981 8167 11355 12820 11486
9025 11486 11402 10970 10352 5001 3753 4167 3154 6278 5013 2322 2219 6861 6909 7097 7173 8018 8660 6919
9007 6919 6946 2837 1013 732 3213 5999 3775 4621 5222 4473 5240 5264 7347 9436 11647 8798 6961
8990 6961 5226 2354 225 2443 7416 7997 6570 10026 10312 9182 5074 2232 1272 4050 5584 4938
8974 4938 8392 8308 3696 546 -1528 1445 4818 2883 5150 6863 5235 4646 8398 7838 6953 9938
8958 9938 10897 9707 4195 -1070 1689 6981 10416 9677 9572 8003 6096 5790 6186 7994 7457 6385
8942 6385 3609 5166 4696 5659 4282 -1252 -1971 166 -782 1528 2625 3518 3520 1720 2892 -2321 -1664
8925 -1664 240 46 3446 3091 520 -1123 -1190 2184 2601 -1576 -4535 -3342 -4734 -4012 887 5432
$$ packed form
9041B319J299Q31M842p02j492l464m212o18M69K149K815K745J186L188J465j334
9025A1486q4m32o18n351j248M14j013L124j265k691j03M642M8J88P6Q45O42j741
9007F919K7m109j824k81K481K786k224Q46O01p49P67K4K083K089K211k849j837
8990F961j735k872k129K218M973N81j427L456K86j130m108k842r60K778J534o46
8974D938L454q4m612l150k074K973L373j935K267J713j628n89L752n60q85K985
8958I938R59j190n512n265K759N292L435p39j05j569j907l06L96J808n37j072
8942F385k776J557m70R63j377n534p19K137r48K310J097Q93Kj800J172n213O57
8925a664J904j94L400l55k571j643o7L374M17m177k959J193j392P22M899M545
$$ plain form
8909 5432 4558 1636 634 -309 4830 6756 4506 6613 10196 6101 2700 4153 5185 4020 828
8894 828 -437 1160 1794 3821 1967 1473 4219 4186 3893 1689 1807 -1284 -2145 -596 -2730 -2423 3639
8877 3639 3339 571 -4155 -4285 -2533 34 1066 3230 2423 4831 6771 6784 5614 4224 4899 4268 3863
8860 3863 4711 3137 -37 1253 3166 4510 3098 843 -250 -2107 -1183 -870 -1121 714 1388 -1002
8844 -1002 3536 8135 9684 9005 9542 12412 17549 26105 25231 14788 7979 4524 6775 6731 6463 5147
8828 5147 1634 3151 6427 6499 4000 4296 1883 4409 5304 7160 7385 7027 8682 5882 2937 4573
8812 4573 4895 4175 4682 5286 4487 5247 5654 6197 11502 13138 10628 8952 11312 11196 15519 22937 30237
8795 30237 29410 23887 15399 11753 11246 9998 6392 3122 2902 5912 5450 4240 5126 2629 1792 3215
$$ packed form
8909E432q74k922j002r43N139J926k250K107L583m095l401J453J032j165l192
8894H28j265J597O34K027j854m94K746l3k93k204J18l091q61J549k134L07O062
8877C639l00k768m726j30J752K567J032K164q07K408J940J3j170j390O75o31m05
8860C863Q48j574l174J290J913J344j412k255j093j857R24L13k51J835O74k390
8844a002M538M599J549o79N37K870N137Q556q74j0443o809l455K251m4k68j316
8828E147l513J517L276P2k499K96k413K526Q95J856K25l58J655k800k945J636
8812D573L22p20N07O04p99P60M07N43N305J636k510j676K360j16M323P418P300
8795C0237q27n523q488l646n07j248l606l270k20L010m62j210Q86k497q37J423
$$ plain form
8779 3215 5992 5374 6761 9137 11057 7755 4169 1756 2077 3117 4105 6432 8366 7496 1861 -563
8763 -563 317 1637 4645 4046 4735 5217 6857 9716 13213 11664 10493 8008 9727 10611 10694 8211 4176
8746 4176 5063 4687 5995 5465 2816 3359 4709 6533 8561 10316 12136 15123 19544 19272 13331 9995
8730 9995 10480 9058 6814 7159 10358 12209 6913 1976 6372 8868 10921 9198 8746 8756 8442 8730 7230
8713 7230 6700 10025 14444 15290 12437 10828 12121 15729 17266 13072 11957 11757 14074 14900 12582 11483
8697 11483 11748 12018 13992 10724 9517 11928 17923 27062 32457 29892 20452 12030 9368 9895 9640 8467
8681 8467 8514 9940 12658 15044 17039 19366 19673 16758 13415 11201 12161 16375 18067 18494 17674 16972 18002
8664 18002 14223 12522 14786 16226 17559 19898 21514 21085 19952 19777 21784 24025 22648 22345 21932 20539
$$ packed form
8779C215K777o18J387K376J920l302l586k413L21J040R88K327J934q70n635k424
8763e63Q80J320L008n99O89M82J640K859L497j549j171k485J719Q84Q3k483m035
8746D176Q87l76J308n30k649N43J350J824K028J755J820K987M421k72n941l336
8730I995M85j422k244L45L199J851n296m937M396K496K053j723m52J0l14K88j500
8713G230n30L325M419Q46k853j609J293L608J537m194j115k00K317Q26k318j099
8697A1483K65K70J974l268j207K411N995R139N395k565r440q422k662N27k55j173
8681H467M7J426K718K386J995K327L07k915l343k214R60M214J692M27q20p02J030
8664A8002l779j701K264J440J333K339J616m29j133j75K007K241j377l03m13j393
$$ plain form
8648 20539 17093 14250 13433 18184 24064 26734 25262 20629 19558 15194 12598 15553 18967 24306 26660
8633 26660 27741 30636 30575 26401 25570 24750 22178 22288 23236 23026 25735 29184 27329 26173 21182 18723
8617 18723 18357 21701 24259 25661 25841 27760 30313 33131 37171 41574 46226 48221 49050 54552 68472
8602 68472 92905 136499 189642 215886 185980 136578 104006 85956 71401 56999 48456 46917
8590 46917 44896 40609 37844 41182 43296 44094 40904 37854 38624 38088 37712 42322 44302 42835 44583 46966
8574 46966 43892 41101 41997 45435 53826 62596 67611 75993 87777 94002 101938 115446 124793 132412
8560 132412 151407 187172 246765 347809 514745 759447 1025005 1225548 1298506 1169288
8550 1169288 877681 602482 416352 303882 233605 188958 162334 143250 127675 117432 110292
$$ packed form
8648B0539l446k843q17M751N880K670j472m633j071m364k596K955L414N339K354
8633B6660J081K895o1m174q31q20k572J10R48k10K709L449j855j156m991k459
8617A8723l66L344K558J402J80J919K553K818M040M403M652J995Q29N502J3920
8602F8472K4433M3594N3143K6244k9906m9402l2572j8050j4555j4402q543j539
8590D6917k021m287k765L338K114P98l190l050P70n36l76M610J980j467J748K383
8574D6966l074k791Q96L438Q391Q770N015Q382J1784O225P936J3508R347P619
8560A32412J8995L5765N9593J01044J66936K44702K65558K00543P2958j29218
8550A169288k91607k75199j86130j12470p0277m4647k6624j9084j5575j0243p140
$$ plain form
8539 110292 103651 96859 90761 83457 77915 77057 78387 83987 100342 132238 191103 273215 320615
8526 320615 280916 196773 138299 111291 96996 92082 90533 89759 91311 97395 104591 115339 128510
8513 128510 145671 175040 226014 276933 296910 265290 203381 150926 121308 103410 88867 81748
8501 81748 81640 84498 83864 74346 66993 64527 60148 55577 57737 56578 53411 64249 79479 95152
8487 95152 120198 166664 261219 415198 565971 563331 401088 248558 165460 121450 94805
8476 94805 78705 66515 58563 50661 45446 42307 38239 40264 50348 60217 66968 71664 63345 52131
8462 52131 45336 41283 38055 39069 46295 53357 61094 64518 63481 58411 55641 54434 54097 55480 59310
8447 59310 63845 74644 87706 98061 104079 109932 131077 182371 258577 296803 248269 173934
$$ packed form
8539A10292o641o792o098p304n542q58J330N600J6355L1896N8865Q2112M7400
8526C20615l9699q4143n8474k7008j4295m914j549p74J552O084P196J0748J3171
8513A28510J7161K9369N0974N0919J9977l1620o1909n2455k9618j7898j4543p119
8501H1748j08K858o34r518p353k466m379m571K160j159l167J0838J5230J5673
8487I5152K5046M6466R4555J53979J50773k640j62243j52530q3098m4010k6645
8476I4805j6100j2190p952p902n215l139m068K025J0084R869O751M696q319j1214
8462E2131o795m053l228J014P226P062P737L424j037n070k770j207l37J383L830
8447E9310M535J0799J3062J0355O018N853K1145N1294P6206L8226m8534p4335
$$ plain form
8435 173934 132611 113449 105703 97658 89224 75985 56698 43796 37565 33731 30144 28055 25834
8422 25834 23543 22425 17051 11753 11136 14605 17716 16699 19436 21473 24296 30012 31274 32241 32891
8407 32891 32183 29596 27459 25085 25619 28123 33209 38792 40101 37880 35173 33419 31378 34816 32253
8392 32253 30400 35684 55090 77258 92683 90048 72552 54232 41323 34042 31201 27060 22024
8379 22024 18152 13814 12463 13605 12314 9461 7861 8821 7955 6032 7717 9936 12083 12864 13190 15866
8363 15866 17521 19845 22251 20939 19295 16489 14999 13582 10925 8882 8604 9881 12285 14926 16866
8348 16866 20628 23196 28646 38061 49370 57481 51006 37900 29399 20642 17050 16973 12597 15149 15791
8333 15791 15766 15288 9707 3624 -501 1230 5023 8377 9638 8859 6795 6888 6268 6019 7568 8358 13107
$$ packed form
8435A73934m1323j9162p746q045q434j3239j9287j2902o231l834l587k089k221
8422B5834k291j118n374n298o17L469L111j017K737K037K823N716J262R67O50
8407C2891p08k587k137k374N34K504N086N583J309k221k707j754k041L438k563
8392C2253j853N284J9406K2168J5425k635j7496j8320j2909p281k841m141n036
8379B2024l872m338j351J142j291k853j600R60q66j923J685K219K147P81L26K676
8363A5866J655K324K406j312j644k806j490j417k657k043k78J277K404K641J940
8348A6866L762K568N450R415J1309Q111o475j3106q501q757l592p7m376K552O42
8333A5791k5m78n581o083m125J731L793L354J261p79k064R3o20k49J549P90M749
$$ plain form
8316 13107 13912 10572 11032 7546 5683 4181 3700 2046 2344 7856 9129 6494 4567 7552 11166 13358
8300 13358 13391 14052 22698 30076 30323 20608 13115 8680 6842 4582 3982 4263 8214 8535 5405 3231
8284 3231 3628 -1015 -951 1433 617 3092 2327 685 -452 2547 5861 5853 7434 5324 4456 6336 7991
8267 7991 5024 2561 1479 2721 -1142 122 1039 941 -842 985 6224 4403 2100 2501 5176 11086
8251 11086 13203 10649 9387 6862 4648 2214 4276 5464 3735 2169 -291 -368 1715 3095 3435
8236 3435 3249 1621 1787 1433 -1267 -3314 -2253 2000 3208 4222 2301 3 -2152 -4020 -2982 -1413
8220 -1413 8 2850 4827 3972 2307 2523 4995 9048 8691 6003 6149 9437 11894 11093 11611 9773
8204 9773 5087 520 -2110 -1496 -1470 1845 4318 6815 6289 2400 3204 2928 3172 3496 2279 1106 1588
$$ packed form
8316A3107Q05l340M60l486j863j502m81j654K98N512J273k635j927K985L614K192
8300A3358L3O61Q646P378K47r715p493m435j838k260o00K81L951L21l130k174
8284C231L97m643O4K384q16K475p65j642j137K999L314qJ581k110q68J880J655
8267G991k967k463j082J242l863J264R17r8j783J827N239j821k303M01K675N910
8251A1086K117k554j262k525k214k434K062J188j729j566k460p7K083J380L40
8236C435j86j628J66l54k700k047J061M253J208J014j921k298k155j868J038J569
8220a413J421K842J977q55j665K16K472M053l57k688J46L288K457q01N18j838
8204I773m686m567k630O14K6L315K473K497n26l889Q04k76K44L24j217j173M82
$$ plain form
8187 1588 1013 1594 2883 2641 4529 7616 5597 3271 3033 3457 874 856 -275 3303 6315 8044 4431
8170 4431 6510 6953 4644 4219 5290 6115 8878 14322 12260 8944 9197 4231 2375 3417 414 2520
8154 2520 5871 7166 5081 6083 7791 10673 12577 11309 8033 7270 8354 7985 4829 2536 1025
8139 1025 2226 2760 2074 2795 3082 1509 1124 2289 3364 3337 2029 1322 4168 5222 1398 -405 1564
8122 1564 4319 3631 6680 9151 6733 4593 5011 6442 6149 3908 4770 7126 5345 3160 5093 5714
8106 5714 3732 2535 -94 -665 -753 -1893 -3000 -2840 -99 1708 3357 3259 3544 2756 3712 2823 441
8089 441 -321 -126 2003 1153 2108 4814 6350 6106 4722 4587 1309 971 2056 1249 2765 1486 -206
8072 -206 -125 649 -772 2305 4208 5982 4681 3527 6107 4832 5393 5556 1405 1312 4820 7165 6852
$$ packed form
8187A588n75N81J289k42J888L087k019k326k38M24k583j8j131L578L012J729l613
8170D431K079M43k309m25J071Q25K763N444k062l316K53m966j856J042l003K106
8154B520L351J295k085J002J708K882J904j268l276p63J084l69l156k293j511
8139A025J201N34o86P21K87j573l85J165J075k7j308p07K846J054l824j803J969
8122A564K755o88L049K471k418k140M18J431k93k241Q62K356j781k185J933O21
8106E714j982j197k629n71q8j140j107J60K741J807J649r8K85p88R56q89k382
8089D41p62J95K129q50R55K706J536k44j384j35l278l38J085q07J516j279j692
8072b06Q1P74j421L077J903J774j301j154K580j275N61J63m151r3L508K345l13
$$ plain form
8055 6852 5219 2656 3551 5243 5852 3593 462 2207 2407 3487 4527 1970 2094 -770 -883 1365
8039 1365 1549 -1204 52 -1799 -2247 -37 2632 5037 3343 1483 3746 4947 8761 12728 11069
8024 11069 6585 194 -5226 -7190 -4246 -1887 1630 1319 1139 608 -1145 -3730 -2961 387 2314 2211
8008 2211 185 -2605 -3087 -3070 -2250 403 937 187 1808 3248 4668 5571 5783 3400 2129 2432 4209
7991 4209 6528 3621 3917 3793 4577 5262 1405 -2620 -2367 23 191 1322 600 -102 1660 -252 1480
7974 1480 3805 2577 1806 4915 5954 5522 5789 6565 5123 5205 5213 7021 8129 12433 12494 12203 12305 12620
7956 12620 11598 11204 9903 11286 14388 13142 15343 16398 14259 12736 14779 14861 14609 14461 11078 8992
7940 8992 8954 6797 5910 9781 13780 13352 9062 10031 14342 13465 12259 14003 17510 22268 21790 19407 19573
$$ packed form
8055F852j633k563Q95J692O09k259l131J745K00J080J040k557J24k864j13K248
8039A365J84k753J256j851m48K210K669K405j694j860K263J201L814L967j659
8024A1069m484o391n420j964K944K359L517l11j80n31j753k585P69L348J927j03
8008B211k026k790m82J7Q20K653N34p50J621J440J420R03K12k383j271L03J777
7991D209K319k907K96j24P84O85l857m025K53K390J68J131p22p02J762j912J732
7974A480K325j228p71L109J039m32K67P76j442Q2QJ808J108M304O1k91J02L15
7956A2620j022l94j301J383L102j246K201J055k139j523K043Q2k52j48l383k086
7940H992l8k157q87L871L999m28m290R69M311q77j206J744L507M758m78k383J66
$$ plain form
7923 19573 20376 18803 18705 19799 19753 21678 25659 25621 21873 20769 22937 22018 20139 17897 17726 17418 17144
7906 17144 17073 15657 13075 10926 12922 10972 10185 11413 10591 12101 13246 13289 13479 11965 8345 10529
7890 10529 12433 14544 17422 18452 19159 23002 25236 27086 28235 25077 23562 23913 23413 25491 29561
7875 29561 32261 34648 32881 33740 33289 30057 31386 28945 25291 25692 27552 25989 25173 23312 20916 19591
7859 19591 21020 21972 20505 17992 20324 22397 22477 19970 17020 15341 16644 19341 20939 21606 20714 19191
7843 19191 20588 20983 21263 22663 23760 26646 27184 29909 31243 30127 31097 32852 31013 29723 27757 27354
7827 27354 24408 23302 22953 23888 20675 18669 17750 17428 19692 22174 23621 17842 12158 9788 10253 10744
7811 10744 10159 8649 7087 8062 8779 10477 8111 6944 8645 11768 10579 8292 7622 6994 6546 7402
$$ packed form
7923A9573Q03j573r8J094m6J925L981l8l748j104K168r19j879k242j71l08k74
7906A7144p1j416k582k149J996j950p87J228q22J510J145M3J90j514l620K184
7890A0529J904K111K878J030P07L843K234J850J149l158j515L51n00K078M070
7875B9561K700K387j767Q59m51l232J329k441l654M01J860j563q16j861k396j325
7859A9591J429R52j467k513K332K073Q0k507k950j679J303K697J598O67q92j523
7843A9191J397L95K80J400J097K886N38K725J334j116R70J755j839j290j966m03
7827B7354k946j106l49R35l213k006r19l22K264K482J447n779n684k370M65M91
7811A0744n85j510j562R75P17J698k366j167J701L123j189k287o70o28m48Q56
$$ plain form
7795 7402 7982 8307 6288 3523 2728 4192 4227 3920 5597 8665 6700 4480 3417 2812 3296 3369 1402
7778 1402 -1145 -2477 -1849 -671 2906 2263 1790 4401 5404 2854 1577 182 1579 2409 2447 3380 1238
7761 1238 -708 2066 1917 171 647 2619 2550 2855 409 -935 1053 2448 3696 3765 1773 -1902 -1353
7744 -1353 -116 115 -1768 -2811 -950 -4010 -5370 -2763 783 -923 -4606 -5500 -3342 -4123 -5832 -2499
7728 -2499 -2352 -1740 -1178 -1042 2114 2945 159 1556 2999 3382 3111 3851 4574 3558 2407 -185 -950
7711 -950 -1213 -77 1326 -658 -2771 -2813 -3066 -3099 -3585 -5383 -4156 -1806 -1678 -1932 -5486 -4700 914 1242
7693 1242 -1358 -712 -362 -831 -310 -227 -2266 -1612 857 1041 3861 5012 3721 2384 -911 -346 -565
7676 -565 -1480 -497 559 -530 -448 -1736 -4529 -3874 -3260 -3104 -3211 -2545 -4818 -6007 -2221 -641 -363 -1891
$$ packed form
7795G402N80L25k019k765p95J464L5l07J677L068j965k220j063o05M84P3j967
7778A402k547j332O28J178L577o43m73K611J003k550j277j395J397Q30L8R33k142
7761A238j946K774j49j746M76J972o9L05k446j344J988J395J248O9j992l675N49
7744a353J237K31j883j043J861l060j360K607L546j706l683q94K158p81j709L333
7728b499J47O12N62J36L156Q31k786J397J443L83k71P40P23j016j151k592p65
7711i50k63J136J403j984k113m2k53l3m86j798J227K350J28k54l554P86N614L28
7693A242k600O46L50m69N21Q3k039O54K469J84K820J151j291j337l295N65k19
7676e65r15R83J056j089Q2j288k793O55O14J56j07O66k273j189L786J580K78j528
$$ plain form
7658 -1891 -2893 -5578 -7855 -4577 -1905 -540 -767 -3046 -2914 -3116 -2695 -1432 -1385 -2675 -2243 76 1664
7641 1664 1352 773 1697 1359 2684 2948 1226 2153 2119 -678 -2260 -2222 -4326 -2956 -908 -565 -4711 -7288
7623 -7288 -4812 -1618 -2409 -1579 637 2822 4033 3533 2079 558 -1997 -4845 -2709 1825 2154 -1223
7607 -1223 -4118 -3629 -2110 -2030 -1617 -1953 -1541 -4546 -4846 -4501 -4464 -3873 -4635 -2893 -4800 -7041 -7764 -8637
7589 -8637 -7044 -4734 -5159 -4746 -3560 -4513 -5746 -6858 -5926 -5832 -6668 -5904 -7866 -7617 -5393 -5131 -7742
7572 -7742 -7013 -6377 -5295 -6483 -7003 -6340 -7319 -6673 -3856 -1754 -4423 -6251 -4870 -4164 -2860 -3636 -3358
7555 -3358 -4389 -5166 -7334 -5428 -3426 -5584 -9228 -9593 -8665 -4618 -1872 -3610 -7212 -7778 -7968 -5821
7539 -5821 -3327 -2659 -924 -1781 -5582 -5578 -1505 1121 394 -1458 -2553 -4632 -2051 -869 -1425 -2572 -1252
$$ packed form
7658a891j002k685k277L278K672J365k27k279J32k02M21J263M7j290M32K319J588
7641A664l12n79R24l38J325K64j722R27l4k797j582L8k104J370K048L43m146k577
7623g288K476L194p91Q30K216K185J211n00j454j521k555k848K136M534L29l377
7607a223k895M89J519Q0M13l36M12l005l00L45L7N91p62J742j907k241p23q73
7589h637J593K310m25M13J186r53j233j112R32R4q36P64j962K49K224K62k611
7572g742P29O36J082j188n20O63r79O46K817K102k669j828J381P06J304p76K78
7555c358j031p77k168J906K002k158l644l65R28M047K746j738l602n66j90K147
7539e821K494O68J735q57l801MM073K626p27j852j095k079K581J182n56j147J320
$$ plain form
7522 -1252 -3950 -6918 -5789 -4913 -4104 -4877 -4375 -5573 -7351 -7775 -3890 -3209 -1834 -2244 -6258 -7063 -5119
7505 -5119 -2339 -593 -3560 -4012 -2922 -3731 -4710 -6701 -7688 -6093 -2254 -603 923 -260 -1698 -2788
7489 -2788 -2876 -2562 -4180 -1470 1218 3486 511 -1807 -1887 39 2287 2974 4155 1924 633 -2861
7473 -2861 -5316 -5394 -4823 -2029 -290 155 870 385 -2906 -4102 -3680 -1162 -2522 -3443 -201 2244 2311
7456 2311 -1387 -3663 -7221 -8170 -8099 -5786 -3806 1586 1668 2386 165 -86 333 1393 605 -384 -1430
7439 -1430 -1504 222 315 78 814 590 -710 -5270 -5289 -3368 -2137 -1866 -2686 -3776 -6076 -7343 -4266 820
7421 820 3420 481 -3294 -5396 -5200 -4562 -3168 -3672 -4903 -6755 -5280 -2222 -2965 -90 1670 45
7405 45 1459 4299 3647 468 -596 -3005 -6919 -8919 -7551 -6284 -5820 -5547 -6709 -4327 -2612 -623
$$ packed form
7522a252k698k968J129Q76Q09p73N02j198j778m24L885O81J375m10m014q05J944
7505e119K780J746k967m52J090q09r79j991r87J595L839J651J526j183j438j090
7489b788q8L14j618K710K688K268k975k318q0J926K248O87J181k231j291l494
7473b861k455p8N71K794J739M45P15m85l291j196M22K518j360r21L242K445O7
7456B311l698k276l558r49P1K313J980N392Q2P18k221k51M19J060p88r89j046
7439a430p4J726R3k37P36k24j300m560j9J921J231K71q20j090k300j267L077N086
7421H20K600k939l775k102J96O38J394n04j231j852J475L058p43K875J760j625
7405D5J414K840o52l179j064k409l914k000J368J267M64K73j162K382J715J989
$$ plain form
7389 -623 -754 342 1278 -7 -1945 -2598 -2413 -2426 161 1781 2706 -57 -93 -1260 -3992 -4254 -3061 -1485
7371 -1485 -1898 -4284 -3762 -2019 360 2832 183 -2469 -1559 -655 -2804 -3293 448 -10 -3485 -4626
7355 -4626 -2655 -412 -1086 -1360 -4312 -6968 -3872 -1839 -1538 -1098 2268 4018 3512 -3773 -5813 -6726
7339 -6726 -4902 -5177 -5561 -4350 -3371 -594 -888 585 956 490 1480 -2817 -3722 -1838 -2367 -436 -993
7322 -993 -2770 -2475 -3425 -1947 1254 -468 324 -428 -863 1334 -1157 -4912 -5197 -4798 -376 -696 -1265
7305 -1265 -693 -2137 -4519 -6014 -7615 -6337 -5087 -2712 -2895 -1978 811 4954 4295 247 -3870 -5297
7289 -5297 -4609 -1746 -1911 -163 -967 -1288 -3605 -3158 -2910 -1567 -1682 -2152 -4633 -5555 -1119 343 314 1275
7271 1275 3619 -373 -5591 -4599 -2214 -1427 -555 -4101 -4959 -972 -83 -2078 -1957 -3253 -4237 -5824 -6154
$$ packed form
7389f23j31J096R36j285j938o53J85j3K587J620R25k763l6j167k732k62J193J576
7371a485m13k386N22J743K379K472k649k652R10R04k149m89L741m58l475j141
7355d626J971K243o74k74k952k656L096K033L01M40L366J750n06p285k040r13
7339f726J824k75l84J211R79K777k94J473L71m66R90m297r05J884n29J931n57
7322i93j777K95r50J478L201j722P92p52m35K197k491l755k85L99M422l20n69
7305a265N72j444k382j495j601J278J250K375j83R17K789M143o59m048m117j427
7289e297O88K863j65J748q04l21k317M47K48J343j15m70k481r22M436J462k9R61
7271A275K344l992n218R92K385P87Q72l546q58L987Q89j995J21j296r84j587l30
$$ plain form
7254 -6154 -3196 -2905 -5169 -5574 -1839 -2022 -3636 -5427 -4359 359 4124 6698 4174 3130 740 -1563
7238 -1563 -1476 -2613 -3942 -4574 -3059 239 -2791 -6022 -6800 -6624 -4671 -1688 -1480 -5026 -3512 947
7222 947 1303 3733 2873 1817 -2167 -3201 -2616 -1246 -2026 -3709 -4993 -2870 -2093 -1307 -1027 -1548 2140
7205 2140 1621 -1331 -1883 -2657 -2244 -384 -3054 -4059 -4230 -8298 -7615 -4524 -2335 -2029 1159 2220 -1578
7188 -1578 -3734 -4159 -4935 -3280 -2101 -5259 -6874 -5025 -1758 -377 1074 -1858 -3845 -1960 -2214 -3258
7172 -3258 -4296 -2606 -556 1742 1966 2320 4838 5811 2770 -480 -557 2558 1774 -496 -1315 -558 2367
7155 2367 2677 1761 487 -2038 -3666 -4607 -6301 -4500 -1808 -4249 -5748 -7180 -9551 -10453 -7068 -5002
7139 -5002 -4732 -3573 -2715 -2446 -4557 -6100 -4401 -2572 -3153 -2793 -5300 -5920 -5040 -5752 -2516 -4673 -5740
$$ packed form
7254f154K958K91k264m05L735j83j614j791J068M718L765K574k524j044k390k303
7238a563Q7j137j329o32J515L298l030l231p78J76J953K983K08l546J514M459
7222I47L56K430q60j056l984j034N85J370p80j683j284K123P77P86K80n21L688
7205B140n19k952n52p74M13J860k670j005j71m068O83L091K189L06L188J061l798
7188a578k156m25p76J655J179l158j615J849L267J381J451k932j987J885k54j044
7172c258j038J690K050K298K24L54K518R73l041l250p7L115p84k270q19P57K925
7155B367L10r16j274k525j628r41j694J801K692k441j499j432k371r02L385K066
7139e002K70J159Q58K69k111j543J699J829n81L60k507o20Q80p12L236k157j067
$$ plain form
7122 -5740 -2166 -2015 -3861 -3391 -3555 -1195 -1768 -2819 -2001 -6048 -8644 -5970 -6161 -9858 -12374 -12136 -10837
7105 -10837 -8239 -6015 -2399 -1013 -1114 -4570 -1841 -334 -4957 -6308 -4058 -3429 -2149 107 -1137
7090 -1137 -3411 -5141 -4142 -2762 -2272 -2340 -3372 -1262 -29 -1518 -606 307 -1696 -1252 -806 -1911 -1850
7073 -1850 -2621 -1115 -485 672 1387 -26 -955 -423 1558 -160 -1209 -2244 -3286 -5324 -5498 -3997
7057 -3997 -1894 141 365 102 2818 2114 -2853 -2996 1273 2799 1152 1986 624 -1088 -2364 -6853
7041 -6853 -7395 -4609 -4521 -8735 -7208 -5734 -7514 -8037 -8136 -7099 -4833 -4627 -3353 -4403 -3849 -1331 -1048
7024 -1048 -1667 -4413 -3429 -1104 -780 -2066 -2076 -6880 -8067 -7468 -4686 -253 5117 3158 1564 -514
7008 -514 1520 6083 7200 5329 3777 3315 -192 -2921 -66 536 1568 1341 -1200 -3189 -1805 -3273
$$ packed form
7122e740L574J51j846M70j64K360n73j051Q18m047k596K674j91l697k516K38J299
7105a0837K598K224L616J386j01l456K729J507m623j351K250O29J280K256j244
7090a137k274j730R99J380M90o8j032K110J233j489R12R13k003M44M46j105O1
7073a850p71J506O30J157P15j413r29N32J981j718j049j035j042k038j74J501
7057c997K103K035K24k63K716p04m967j43M269J526j647Q34j362j712j276m489
7041f853n42K786Q8m214J527J474j780n23r9J037K266K06J274j050N54K518K83
7024a048o19k746R84K325L24j286j0m804j187N99K782M433N370j959j594k078
7008e14K034M563J117j871j552m62l507k729K855O02J032k27k541j989J384j468
$$ plain form
6992 -3273 -3657 -3883 -4638 -2591 -734 2303 2913 -1027 -430 -2308 -3017 -2945 -2705 -1208 -2450 -1864 -973 -1401
6974 -1401 588 654 1846 2591 -1194 -1370 -4764 -5186 -3337 -6685 -8129 -9816 -10419 -5991 -4170 -6222
6958 -6222 -7082 -6308 -3150 -4741 -5408 -5203 -3944 -5878 -6833 -4202 474 3048 1293 -1846 -3544 -3965
6942 -3965 -3549 -282 1559 2947 -3112 -6763 -3880 -3078 -3602 -3581 -4062 -7210 -6306 -3584 -3982 -4965 -3316
6925 -3316 -1339 -1740 -3353 -1943 -2268 -1240 1356 -789 -2783 -867 1153 2231 400 -2468 279
6910 279 1132 2234 1111 2124 2535 1316 -1885 -2097 -1596 -1407 -652 -581 -1772 -1829 -171 -723 -3462 -3724
6892 -3724 -4469 -4099 -6164 -6911 -4436 -1580 -310 647 2066 -104 -1345 -1490 -2476 -3269 -4323 -595 5207
6875 5207 3725 634 -2837 -1637 -1979 -4168 -2361 -1211 -746 -4716 -4762 -6764 -6287 -6665 -5711 -4257 -4571
$$ packed form
6992c273l84k26p55K047J857L037O10l940N97j878p09P2K40J497j242N86Q91m28
6974a401J989O6J192P45l785j76l394m22J849l348j444j687o03M428J821k052
6958f222q60P74L158j591o67K05J259j934r55K631M676K574j755l139j698m21
6942c965M16L267J841J388o059l651K883Q02n24K1m81l148R04K722l98r83J649
6925c316J977m01j613J410l25J028K596k145j994J916K020J078j831k868K747
6910B79Q53J102j123J013M11j219l201k12N01J89P55P1j191n7J658n52k739k62
6892c724p45L70k065p47K475K856J270R57J419k170j241j45r86p93j054L728N802
6875E207j482l091l471J200l42k189J807J150M65l970m6k002M77l78R54J454l14
$$ plain form
6858 -4571 -3587 -2462 -1319 -318 28 -431 -1955 -4457 -4308 -1161 2512 2599 3988 5083 2953 1856
6842 1856 2340 -92 -2369 -1683 -2102 -1898 -2611 -2318 -2544 -5514 -5739 -2431 -1327 -2387 -2459 -2550 -4501 -4549
6824 -4549 -2507 -2682 -499 890 1958 -1138 -4101 -5663 -2361 855 2401 -21 -4052 -2152 -114
6809 -114 1025 935 946 -1898 -3003 -1864 -1506 30 -1754 -1360 35 -2999 -5122 -2477 -791 1450 4717
6792 4717 4993 4534 2946 2269 -29 -6036 -6632 -6251 -4173 -1942 -1022 -1368 -775 1549 -391 -3015 -5932
6775 -5932 -7890 -8320 -6264 -6212 -4096 -1525 -98 -1716 -3578 -4267 -3745 -1879 -747 -1806 -3374 -850
6759 -850 3191 5367 2805 87 -1418 -2972 -1564 -2123 -5752 -3472 546 2359 3869 5545 4454
6744 4454 1844 -227 -1467 -270 -12 -1786 186 3801 4003 5242 5272 4004 3860 -332 -1319 -1202 199
$$ packed form
6858d571R84J125J143J001L46m59j524k502J49L147L673Q7J389J095k130j097
6842A856M84k432k277O86m19K04p13K93k26k970k25L308J104j060p2r1j951m8
6824d549K042j75K183J389J068l096k963j562L302L216J546k422m031J900K038
6809a14J139r0J1k844j105J139L58J536j784L94J395l034k123K645J686K241L267
6792D717K76m59j588o77k298o007n96L81K078K231R20l46N93K324j940k624k917
6775e932j958m30K056N2K116K571J427j618j862o89N22J866J132j059j568K524
6759h50M041K176k562k718j505j554J408n59l629K280M018J813J510J676j091
6744D454k610k071j240J197K58j774J972L615K02J239L0j268j44m192r87J17J401
$$ plain form
6727 199 -1808 -4560 -5817 -2942 -3167 -1826 -2603 -1111 -4376 -6497 -4764 -3377 -1024 -668 -3997 -2944
6711 -2944 -1870 -2775 -1895 -3709 -4098 -2840 -2684 -4488 -6425 -5942 -5906 -5900 -3403 -4100 -4217 -4235 -7003 -5721
6693 -5721 -3148 262 3170 1189 589 -1067 -237 2617 4873 644 718 4083 5904 3822 -877 -198
6677 -198 1853 5596 3245 2225 493 1685 1439 191 1031 2791 4618 7219 6559 8982 15400 19726
6661 19726 28301 42085 47271 44880 37170 22688 14141 10139 4930 1952 1093 -177 -841 -2759 -3079
6646 -3079 -2596 -3844 -6961 -4464 -3403 -1321 274 316 -3473 -3079 -4826 -4615 -2007 -300 -2378 -3939
6630 -3939 -6125 -5090 -6071 -1109 2071 1663 -2000 -5779 -5681 -4960 -3959 -2644 -3058 -6170 -7383 -4415
6614 -4415 -4092 -4054 -1119 2439 4274 4740 366 -4262 -7735 -7930 -4274 -3964 -4306 -3660 -4664 -3216 171
$$ packed form
6727A99k007k752j257K875k25J341p77J492l265k121J733J387K353L56l329J053
6711b944J074r05Q80j814l89J258J56j804j937M83L6OK497o97j17j8k768J282
6693e721K573L410K908j981o00j656Q30K854K256m229P4L365J821k082m699O79
6677a98K051L743k351j020j732J192k46j248Q40J760J827K601o60K423O418M326
6661A9726Q575J3784N186k391p710j4482q547m002n209k978q59j270o64j918l20
6646c079M83j248l117K497J061K082J595M2l789L94j747K11K608J707k078j561
6630c939k186J035r81M962L180m08l663l779R8P21J001J315m14l112j213K968
6614d415L23L8K935L558J835M66m374m628l473j95L656L10l42O46j004J448L387
$$ plain form
6597 171 -2895 -6506 -6469 -1975 -1114 -898 -1505 -1967 -4216 -4352 -2404 -3236 -6761 -10389 -8025 -7421 -5522
6580 -5522 -2142 -6068 -6294 -3370 -1614 -120 -59 -1660 -3556 -2788 -1315 -28 -779 -1627 -1969 -4178 -6398
6563 -6398 -6920 -4854 -5728 -4979 1779 1382 155 1989 -299 -4536 -4984 -3291 -4129 -2438 152 2408
6547 2408 631 3269 1302 -3370 -3401 -603 -3084 -4677 -2283 -2097 -3665 -3436 -3833 -2934 -3118 -6747 -5738
6530 -5738 -950 2027 856 -675 -4638 -7652 -6671 -6838 -3852 -934 2853 1099 742 -859 1600 2015
6514 2015 2821 3850 3685 231 -833 -4247 922 5788 4255 1227 -1330 -1498 1801 3622 1957 -1477
6498 -1477 -5899 -7378 -3951 -2510 -1037 -2680 -5286 -7376 -5849 -1760 141 -91 -1174 -1689 -1117 -894
6482 -894 -1405 -4507 -2571 -3753 -224 -983 -2578 611 841 -3332 702 2620 2710 -1965 -4959 -5801 -4291
$$ packed form
6597A71l066l611L7M494Q61K16o07m62k249j36J948q32l525l628K364O04J899
6580e522L380l926k26K924J756J494O1j601j896P68J473J287p51q48l42k209k220
6563f398n22K066q74P49O758l97j227J834k288m237m48J693q38J691K590K256
6547B408j777K638j967m672l1K798k481j593K394J86j568K29l97Q99j84l629J009
6530e738M788K977j171j531l963l014R81j67K986K918L787j754l57j601K459M15
6514B015Q06J029j65l454j064l414N169M866j533l028k557j68L299J821j665l434
6498a477m422j479L427J441J473j643k606k090J527M089J901k32j083n15N72K23
6482h94n11l102J936j182L529p59j595L189K30m173M034J918R0m675k994q42J510
$$ plain form
6465 -4291 -3045 -3181 -4661 -1669 2260 2865 412 -2882 -5320 -4434 -4426 -7132 -4518 -2287 -2216 -3953 -4451
6448 -4451 -6367 -6029 -464 1070 -1677 -4408 -3232 -4121 -5074 -2009 -1289 204 16 -3530 -4827 -4274
6432 -4274 -4785 -5133 -7396 -3843 -2149 -4167 -3915 -1476 -2028 -4068 -4256 -2665 -4221 -9511 -11121 -6826
6416 -6826 -4248 -4409 -1350 932 -440 -92 -766 -1365 -335 -303 183 1094 -1042 -2662 -5718 -6720 -6021
6399 -6021 -6356 -5246 -7329 -7683 -5754 -4038 -4326 -4462 129 2056 -584 -3357 -2381 -499 1067 3282
6383 3282 2497 -143 -5647 -7753 -8435 -7357 -2621 -999 -1369 -1435 -425 674 -1340 -1163 -520 -1719 -3880
6366 -3880 -3332 -3728 -2474 -1498 80 1879 422 -1379 -1702 906 2704 4429 4088 2958 2868 61 -5194
6349 -5194 -3923 -3351 -3029 -4043 305 1783 -1028 -3006 -6330 -6111 -5549 -1698 -1965 -3704 -2787 -4264
$$ packed form
6465d291J246j36j480K992L929O05k453l294k438Q86Qk706K614K231P1j737m98
6448d451j916L38N565J534k747k731J176q89r53L065P20J493j88l546j297N53
6432d274n11l48k263L553J694k018K52K439n52k040j88J591j556n290j610M295
6416f826K578j61L059K282j372L48o74n99J030L2M86R11k136j620l056j002O99
6399f021l35J110k083l54J929J716k88j36M591J927k640k773R76J882J566K215
6383C282p85k640n504k106o82J078M736J622l70o6J010J099k014J77O43j199k161
6366c880N48l96J254R76J578J799j457j801l23K608J798J725l41j130r0k807n255
6349e194J271N72L22j014M348J478k811j978l324K19N62L851k67j739R17j477
$$ plain form
6333 -4264 -4396 -8593 -9679 -9520 -10489 -8912 -7799 -6820 -6952 -4110 -4395 -3906 -2069 -3116 -3226 -2519 1047
6316 1047 206 -1091 -220 729 1129 -527 -1759 -4638 -6091 -5966 -4415 -6176 -8241 -4251 -694 -638 -3050
6299 -3050 -5210 -3939 -2365 -1654 -740 736 -592 -2410 -3363 -1243 1185 553 -3827 -6263 -3903 -1362
6283 -1362 -798 -2126 -4855 -4302 -1157 -1006 640 5229 2605 600 -2081 -9344 -7918 -5224 -4161 -4817
6267 -4817 -1749 140 2791 1068 -1791 -3219 -5443 -2371 -2587 -4726 -3424 -1725 -2603 -3294 -2819 -3456
6251 -3456 -2593 -2714 -2008 -291 -2227 -3057 -5169 -3821 217 1570 130 -447 1528 534 -591 1635
6235 1635 3906 2035 1391 2074 -901 -4318 -2625 -1193 -3468 -4541 -5065 -2753 -3387 -1785 -2883 -1458
6219 -1458 -969 -2245 -4735 -7616 -9406 -10971 -9547 -5519 -3836 -4631 -4001 -2193 -4108 -4971 -5558 -5102
$$ packed form
6333d264j32m197j086J59r69J577J113R79j32K842k85M89J837j047j10P07L566
6316A047q41j297Q71R49M00j656j232k879j453J25J551j761k065L990L557N6k412
6299c050k160J271J574P11R14J476j328j818r53K120K428o32m380k436K360K541
6283a362N64j328k729N53L145J51J646M589k624k005k681p263J426K694J063o56
6267d817L068J889K651j723k859j428k224L072k16k139J302J699q78o91M75o37
6251c456Q63j21P06J717j936q30k112J348M038J353j440n77J975r94j125K226
6235A635K271j871o44O83k975l417J693J432k275j073n24K312o34J602j098J425
6219a458M89j276k490k881j790j565J424M028J683p95O30J808j915q63n87M56
$$ plain form
6203 -5102 -5616 -5653 -8796 -9437 -9492 -8263 -7120 -7023 -6772 -7757 -5299 -1745 -780 -2493 -2214 -1239 -1217 690 119
6184 119 438 -669 -839 -1687 -2814 -3264 -6506 -9900 -8757 -5324 -4548 -3771 -1677 -2714 -3286 -4056 -5503
6167 -5503 -6681 -6354 -3099 -689 -1363 -711 -652 -533 -2200 -2611 -2637 551 2804 2859 -214 -2387 -4005 -5316
6149 -5316 -4112 -781 -1329 -1495 -3175 -4475 -5479 -7348 -9334 -8644 -8233 -6278 -1991 -2498 -6697 -10166
6133 -10166 -9338 -6180 -2498 -2426 -1231 -1366 -1151 -2651 -2640 -1684 -3248 -2201 -3808 -5240 -2929 -2096 -2653
6116 -2653 -910 -1176 -1273 31 -18 -2521 -2196 1304 2175 1564 -962 -2405 -2994 -2755 -1519 -780 -2123 -2334
6098 -2334 -2233 -4470 -7766 -5132 57 -420 -1660 -978 -1422 -2281 -256 -164 -1646 -2861 -3627 -4320 -4312 -3286
6080 -3286 -1460 -2003 -3403 -2331 -2971 -3030 -2656 -1834 -3787 -3974 -637 248 -3634 -6890 -6749 -2859 -4051
$$ packed form
6203e102n14l7l143o41n5J229J143R7K51r85K458L554R65j713K79R75K2J907n71
6184A19L19j107j70q48j127m50l242l394J143L433P76P77K094j037n72p70j447
6167e503j178L27L255K410o74O52N9J19j667m11k6L188K253N5l073k173j618j311
6149e316J204L331n48j66j680j300j004j869j986O90M11J955M287n07m199l469
6133a0166Q28L158L682P2J195j35K15j500J1R56j564J047j607j432K311Q33n57
6116b653J743k66r7J304m9k503L25L500Q71o11k526j443n89K39J236P39j343k11
6098b334J01k237l296K634N189m77j240O82m44q59K025R2j482j215p66o93QJ026
6080c286J826n43j400J072o40n9L74Q22j953j87L337Q85l882l256J41L890j192
$$ plain form
6063 -4051 -5265 -3765 -1559 -2084 -3851 -3648 -449 -2955 -3504 -1375 -191 3130 2616 610 -1282 -1605
6047 -1605 2095 866 723 2670 912 -389 2140 1022 -1420 -3582 -2260 -648 -3476 -4300 -4140 -1832
6031 -1832 -1270 -3041 -4916 -4907 -4538 -3153 -5672 -7146 -3269 -3084 -5937 -6012 -6937 -5501 -4665 -4474 -4900 -4150
6013 -4150 -2914 -1759 -614 2816 2613 1038 1796 879 -1229 787 3184 1230 -100 -3083 -4558 -4387
5997 -4387 -5857 -6903 -7328 -4193 -1748 -3450 -2830 -4186 -2695 1579 -60 86 2289 2661 1053 2187
5981 2187 4043 1886 -2207 -1912 -859 -3965 -6149 -6233 -5435 -4760 -4567 -5171 -2571 -1695 -4873 -7308 -5699
5964 -5699 -2478 125 -706 -2373 -1441 -618 -906 -3074 -4366 -6944 -5869 -2988 -2888 -3672 -7862 -9180
5948 -9180 -6697 -3208 -2403 -3899 -3074 -1461 -3183 -3612 -4435 -4701 -8235 -9472 -9541 -6146 -4597 -3337 -2320
$$ packed form
6063d051j214J500K206n25j767K03L199k506n49K129J184L321n14k006j892l23
6047a605L700j229j43J947j758j301K529j118k442k162J322J612k828q24J60K308
6031a832N62j771j875RL69J385k519j474L877J85k853p5r25J436Q36J91m26P50
6013d150J236J155J145L430k03j575P58r17k108K016K397j954j330k983j475J71
5997d387j470j046m25L135K445j702O20j356J491M274j639J46K203L72j608J134
5981B187J856k157m093K95J053l106k184q4P98O75J93o04K600Q76l178k435J609
5964e699L221K603q31j667R32Q23k88k168j292k578J075K881J00p84m190j318
5948i180K483L489Q05j496Q25J613j722m29q23k66l534j237o9L395J549J260J017
$$ plain form
5931 -2320 1048 1853 882 1117 2037 2478 228 -721 333 2256 -722 -5789 -5284 -2304 -1200 -2220 -2099
5914 -2099 -417 -774 -1848 -1912 -610 -1969 -2822 56 1650 -599 -1312 334 158 -614 1389 3031 2069
5897 2069 -3411 -4120 -2897 -3350 -7912 -11542 -10412 -6099 -1134 -862 -3075 -978 462 -410 -3023 -2339
5881 -2339 -1233 -1636 -3320 -3452 -2704 -1470 -2093 -850 -2219 -2984 -3862 -3110 -301 120 -1679 -1267 337
5864 337 76 -1606 -4069 -2598 -3181 -2877 -860 -1513 -3834 -4932 -3527 -3973 -1747 1422 1860 -3306 -3515
5847 -3515 -3006 -4958 -7086 -4891 -2157 10 -1479 -418 -885 -3294 -6056 -5951 -4227 -6136 -8895 -9842
5831 -9842 -7173 -5254 -5643 -5073 -5228 -6422 -8236 -7937 -5188 -3113 -2277 -3532 -6119 -4491 -3885 -3603 -2748
5814 -2748 -950 -1145 -1749 -2226 -877 2249 -581 1252 686 -222 -1774 -2838 -1952 385 -434 -1085 -1919
$$ packed form
5931b320L368Q05r71K35R20M41k250r49J054J923k978n067N05K980J104j020J21
5914b099J682l57j074o4J302j359q53K878J594k249p13J646j76p72K003J642r62
5897B069n480p09J223m53m562l630J130M313M965K72k213K097J440q72k613O84
5881b339J106m03j684j32P48J234o23J243j369p65q78P52K809M21j799M12J604
5864C37k61j682k463J471n83L04K017o53k321j098J405m46K226L169M38n166k09
5847c515N09j952k128K195K734K167j489J061m67k409k762J05J724j909k759r47
5831i842K669J919l89N70j55j194j814K99K749K075Q36j255k587J628O06K82Q55
5814b748J798j95o04m77J349L126k830J833n66r08j552j064Q86K337q19o51q34
$$ plain form
5797 -1919 -3554 -2231 -2024 -5906 -5175 -2421 -4358 -2142 -2228 -1485 -448 -2935 -1915 482 57 -681 -448
5780 -448 -1391 -3545 -1697 169 2222 1438 -1514 -2640 -1149 -3647 -3021 -2509 -3908 -3822 -4675 -6330 -4097
5763 -4097 -3454 -4232 -2643 -2166 -4343 -4818 -2289 616 481 -658 861 1785 4703 6130 4928 1790
5747 1790 1615 -485 -1983 -800 2741 403 -1249 1024 -787 -1609 -2455 -3145 -3372 -3484 -1817 867
5731 867 1162 -751 395 494 -3701 -3612 -91 611 -380 -3011 -646 -776 -2006 -1428 189 -1290 -1377 1207
5713 1207 556 -930 -1162 -2214 2256 821 -1856 -4409 -5383 -4754 -5120 -4344 -4501 -3634 -1778 -771 -4144
5696 -4144 -6266 -1287 2996 3233 -721 -2457 -2348 -1868 -2152 -3780 -5205 -5084 -6254 -3690 -2670 -890
5680 -890 -1875 -3091 -158 3532 3877 3562 1845 1996 340 -1245 -2156 -3247 -1880 -2590 -1594 -419 -2008
$$ packed form
5797a919j635J323K07l882P31K754j937K216q6P43J037k487J020K397m25p38K33
5780d48r43k154J848J866K053p84k952j126J491k498O26N12j399Q6q53j655K233
5763d097O43p78J589M77k177m75K529K905j35j139J519R24K918J427j202l138
5747A790j75k100j498J183L541k338j652K273j811q22q46o90k27j12J667K684
5731H67K95j913J146R9m195Q9L521P02r91k631K365j30j230N78J617j479q7K584
5713A207o51j486k32j052M470j435k677k553r74O29l66P76j57Q67J856J007l373
5696d144k122M979M283K37l954j736J09M80k84j628j425J21j170K564J020J780
5680h90r85j216K933L690L45l15j717J51j656j585r11j091J367p10R96J175j589
$$ plain form
5663 -2008 -592 443 -1505 -3181 -993 2026 1812 -1464 -1660 130 -164 -1399 -3652 -3023 -1620 -577
5647 -577 786 -691 2255 1365 1755 1030 -723 -1619 -2938 -408 -192 -471 410 -481 684 615 -1628 -1532
5629 -1532 -2303 -1445 2 -3287 -3937 -2818 2205 2910 1651 593 -248 2878 4374 3637 3021 2287 -1976
5612 -1976 -3632 -7453 -5190 -1661 978 677 -2821 -4634 -4910 -4209 -4764 -4075 -4144 -6305 -9695 -8071 -5823
5595 -5823 -2848 -2938 -3385 -1611 -230 1963 2101 -776 -2606 -4344 -5296 -1934 -1045 234 249 -4598 -7567
5578 -7567 -5808 -3984 -3796 -4723 -3415 -3777 -2320 -2364 -3639 -3045 208 1783 722 -1951 -2685 1609 3795
5561 3795 -942 -4622 -4929 -3785 -2117 -2381 -1577 -1784 -3477 -4932 -2640 -1459 -3144 -2704 -1225 414
5545 414 -26 -1992 -296 1467 -293 -760 -1126 -4223 -2345 -4193 -5944 -2063 -573 -2775 -2930 -4316
$$ packed form
5663b008J416J035j948j676K188L019k14l276j96J790k94j235k253O29J403J043
5647e77J363j477K946q90L90p25j753q96j319K530K16k79Q81q91J165o9k243R6
5629a532p71Q58J447l289o50J119N023P05j259j058q41L126J496p37o16p34m263
5612a976j656l821K263L529K639l01l498j813k76P01n55O89o9k161l390J624K248
5595e823K975r0m47J774J381K193J38k877j830j738r52L362Q89J279J5m847k969
5578g567J759J824J88r27J308l62J457m4j275N94L253J575j061k673p34M294K186
5561C795m737l680l07J144J668k64Q04k07j693j455K292J181j685M40J479J639
5545D14m40j966J696J763j760m67l66l097J878j848j751L881J490k202j55j386
$$ plain form
5529 -4316 -4012 -2537 -2005 -2662 -4261 -3849 -2582 -1579 -1268 316 1629 1848 2917 3086 2253 -1051 -3870
5512 -3870 -3791 -1991 -3454 -4224 -2526 -2590 -929 -999 -596 -1178 -1116 138 1446 3774 3138 1975 -84 329
5494 329 1264 1657 1097 1529 2115 252 -1076 515 228 -902 1222 -166 -2400 -53 -197 2791 7062
5477 7062 4355 -784 -4648 -3387 -2306 -2545 1341 -70 -1109 -2839 -3968 -2824 -129 -515 -587 -1733
5461 -1733 -5662 -4429 -2899 -1525 -655 1062 600 -1858 962 2078 1797 1969 618 -1346 -4066 -7038
5445 -7038 -3858 -2703 -194 1078 -1917 -3688 -7058 -5864 -2976 -3914 -2634 -2879 -3935 -2182 -103
5430 -103 1279 4506 3346 2721 4212 2244 1185 2998 1710 1639 3828 2400 1145 -736 -644 263 -1138
5413 -1138 -3173 247 685 1625 3575 609 -2475 -6329 -9663 -9024 -5666 -2942 1778 4061 4895 3405
$$ packed form
5529d316L04J475N32o57j599M12J267J003L11J584J313K19J069J69q33l304k819
5512c870P9J800j463p70J698o4J661p0M03n82O2J254J308K328o36j163k059M13
5494C29R35L93n60M32N86j863j328J591k87j130K124j388k234K347j44K988M271
5477G062k707n139l864J261J081k39L886j411j039j730j129J144K695l86p2j146
5461a733l929J233J530J374Q70J717m62k458K820J116k81J72j351j964k720k972
5445g038L180J155K509J272k995j771l370J194K888r38J280k45j056J753K079
5430a03J382L227j160o25J491j968j059J813j288p1K189j428j255j881R2R07j401
5413a138k035L420M38R40J950k966l084l854l334O39L358K724M720K283Q34j490
$$ plain form
5397 3405 1153 2296 1267 -836 -2775 -701 -655 -1892 -4491 -1821 -123 -2251 -3642 -1426 176
5382 176 -1528 458 1626 1336 -1346 -516 -2253 -4532 -4912 -1653 -497 -909 2153 4323 7723 6992
5366 6992 4642 2006 1922 814 -3494 -2592 -3535 -3747 -1452 -2714 -2238 -1710 -3643 -473 909 -896 -1763
5349 -1763 -1503 -2978 -5590 -5658 -3268 -2541 1073 798 -1465 -1211 -1648 -2014 -1976 455 -374 -939 -235 -160 -795
5330 -795 -3319 -3189 -4463 -3468 -3010 -3913 -179 2939 5005 3691 3130 2407 1939 2354 2263 2168 439 -1493
5312 -1493 -120 3440 3304 -193 -1928 -4897 -6080 -7417 -6397 -3734 -1463 2389 4294 5520 3283
5297 3283 375 -113 2531 6679 6783 4448 540 -669 -3346 -3994 -2045 -1176 -1629 -753 -3049 -5742
5281 -5742 -2217 296 -67 1250 2275 -1699 -3736 -813 76 -2715 -4092 -2580 -1522 -1739 -3194 -2313
$$ packed form
5397C405k252J143j029k103j939K074M6j237k599K670J698k128j391K216J602
5382A76j704J986J168k90k682Q30j737k279l80L259J156m12L062K170L400p31
5366F992k350k636q4j108m308R02r43k12K295j262M76N28j933L170J382j805q67
5349a763K60j475k612o8K390P27L614k75k263K54m37l66L8K431q29n65P04P5o35
5330g95k524J30j274R95M58r03L734L118K066j314n61p23m68M15r1r5j729j932
5312a493J373L560j36l497j735k969j183j337J020K663K271L852J905J226k237
5297C283k908m88K644M148J04k335l908j209k677o48J949Q69m53Q76k296k693
5281e742L525K513l63J317J025l974k037K923Q89k791j377J512J058k17j455Q81
$$ plain form
5265 -2313 1626 2060 -1044 -2341 -3252 -3833 -1770 -698 -1758 -266 2932 1044 -24 1157 1860 128
5249 128 -26 1726 -309 -478 1110 1409 225 -215 -3692 -6973 -6159 -3544 -2552 -841 976 516 1450
5232 1450 -287 -1571 -3496 -1722 2404 5623 5815 6077 7935 5230 3352 4447 3490 -1930 -1868 -582
5216 -582 1368 2536 2810 1643 -476 351 518 -220 1026 960 2136 2083 -133 289 288 1055 1937 -1105 -4143
5197 -4143 -3032 -533 -629 116 -742 -2525 -2264 -1070 -2177 -4957 -3019 -790 -191 -609 -2375 -315 1531
5180 1531 4641 4805 3842 1607 -1101 -831 429 -134 -918 160 -1816 -1021 -1382 -1725 -958 -2162 -3618
5163 -3618 -673 159 462 970 5248 5488 750 -324 2246 677 -1392 -4803 -5784 -2852 -5291 -6702
5147 -6702 -5013 -7129 -6268 -5334 -7715 -8300 -6407 -3750 -1336 -2234 -2935 -2722 -961 -2247 -1711 553 170
$$ packed form
5265b313L939M34l104j297r11n81K063J072j060J492L198j888j068J181P03j732
5249A28j54J752k035j69J588K99j184m40l477l281Q14K615R92J711J817m60R34
5232A450j737j284j925J774M126L219J92K62J858k705j878J095r57n420O2J286
5216e82J950J168K74j167k119Q27J67p38J246o6J176n3k216M22jP67Q82l042l038
5197d143J111K499r6P45q58j783K61J194j107k780J938K229N99m18j766K060J846
5180A531L110J64r63k235k708K70J260n63p84J078j976P95l61l43P67j204j456
5163c618K945Q32L03N08M278K40m738j074K570j569k069l411r81K932k439j411
5147f702J689k116Q61R34k381n85J893K657K414q98p01K13J761j286N36K264l83
$$ plain form
5130 170 -3830 -5078 -1062 1570 2925 534 -2780 -2225 -3984 -5377 -3797 -2593 -3519 -4834 -6821 -4482
5114 -4482 -5019 -4966 -5936 -4823 -4320 -2668 1484 190 -747 -1172 -4529 -5065 -5892 -5767 -2282 397 -3476
5097 -3476 -4827 -5879 -5289 -1236 2224 2848 5019 5760 1562 -743 -2848 -3938 -3645 -2146 160 288
5081 288 1266 2095 2411 1174 687 -1087 -1103 -110 2525 1017 258 1507 652 1064 501 -996 739 1115
5063 1115 -389 -525 2433 963 2192 1547 -2441 -1900 670 -2045 -2793 -1498 540 1694 -214 -731
5047 -731 -1420 -1348 -5036 -3629 -1437 217 1284 -554 -2588 -2748 -2945 -2842 -3606 -3673 -830 1065 4884
5030 4884 4684 71 -437 2361 2093 1490 2541 3241 1111 858 -979 -1674 -1821 -1456 956 121 -3397
5013 -3397 -6456 -3247 -97 -1627 -4124 -3836 -3157 -1959 -374 2610 1240 -101 -1058 -817 -489 -189
$$ packed form
5130A70m000j248M016K632J355k391l314N55j759j393J580J204r26j315j987K339
5114d482n37N3r70J113N03J652M152j294r37m25l357n36q27J25L485K679l873
5097c476j351j052N90M053L460O24K171P41m198k305k105j090K93J499K306J28
5081B88R78Q29L16j237m87j774j6R93K635j508p59J249q55M12n63j497J735L76
5063A115j504j36K958j470J229o45l988N41K570k715p48J295K038J154j908n17
5047g31o89P2l688J407K192J654J067j838k034j60j97J03p64o7K843J895L819
5030D884k00m613n08K798k68o03J051P00k130k53j837o95j47L65K412q35l518
5013c397l059L209L150j530k497K88O79J198J585K984j370j341r57K41L28L00
$$ plain form
4997 -189 -895 -1568 -1550 -3483 -4241 -3472 -1137 -2645 -3583 -1781 -1693 -3914 -2758 -3160 -3480 -2913 -1575 -1892
4979 -1892 -1203 -319 1053 267 -47 1302 2519 100 -2651 -2347 -1187 -806 -2342 -2268 -597 -2846 -4663
4962 -4663 -3510 -789 1407 -132 -2810 -3544 -1851 -1385 -287 347 810 756 -2289 -2691 -3889 -4486 -2751
4945 -2751 -1941 -81 -1765 -3965 -1083 3719 3834 201 -89 752 -2161 -4648 -5218 -6175 -4031 -1543
4929 -1543 -1362 -2634 -1776 -3189 -2649 -1632 -2203 -1300 1094 404 -143 3479 3425 4374 2952 2768 1666 2082
4911 2082 456 180 339 365 3085 221 -18 255 1341 10 2355 6327 8117 2531 -2306 -5164
4895 -5164 -3226 -2176 -3017 -1414 101 -1344 -2628 -631 2723 2513 1711 -1630 -3331 -1363 -2250 -317
4879 -317 750 -235 705 2588 2385 155 -454 1115 2860 759 -4211 -3397 -3984 -3294 -83 2535 -205
$$ packed form
4997a89p06o73J8j933p58P69K335j508r38J802Q8k221J156m02l20N67J338l17
4979a892O89Q84J372p86l14J349J217k419k751L04J160L81j536P4J671k249j817
4962d663J153K721K196j539k678p34J693M66J098O34M63n4l045m02j198n97J735
4945b751Q10J860j684k200K882M802J15l633k90Q41k913k487n70r57K144K488
4929a543J81j272Q58j413N40J017n71R03K394o90n47L622n4R49j422j84j102M16
4911B082j626k76J59K6K720k864k39K73J086j331K345L972J790n586m837k858
4895e164J938J050q41J603J515j445j284J997L354k10q02l341j701J968q87J933
4879c17J067r85R40J883k03k230o09J569J745k101m970Q14n87O90L211K618k740
$$ plain form
4862 -205 -2178 -2688 -1072 -122 -643 326 33 -317 -3481 -7165 -5706 -1938 929 -2311 -5087 -3770 -2854
4845 -2854 -2522 -1833 -241 1336 2808 2234 -41 -1789 480 3225 1240 924 -885 1130 643 -210
4829 -210 -960 -2100 -3729 -3167 -4015 -3181 -3947 -3960 -976 -2215 -116 -696 -4471 -8166 -7114 -3829 2100
4812 2100 3395 1180 2537 1563 347 -549 -4261 -4662 -5194 -3282 -1314 -1817 -4853 -6488 -4604 -2290
4796 -2290 148 485 743 -535 -251 -999 -2588 -2495 -2695 -4046 -3790 1443 5053 3602 -126 66 168
4779 168 620 -231 -3979 -6075 -6698 -5214 -4122 -2115 -3398 -3737 -602 -901 716 358 503 -567 -4989
4762 -4989 -4436 -895 -543 -2397 -3635 488 1409 2277 3027 3001 5430 3984 1566 1084 -69 -459 2525
4745 2525 6304 3615 -1473 -1427 -4269 -6116 -4983 -3719 -3149 -916 -707 -3977 -4672 -3212 -2753 -1252
$$ packed form
4862b05j973n10J616R50n21R69k93l50l164l684J459L768K867l240k776J317R16
4845b854L32O89J592J577J472n74k275j748K269K745j985l16j809K015m87q53
4829b10p50j140j629N62q48Q34p66j3K984j239K099n80l775l695J052L285N929
4812B100J295k215J357r74j216q96l712m01n32J912J968n03l036j635J884K314
4796b290K438L37K58j278K84p48j589R3k00j351K56N233L610j451l728J92J02
4779A68M52q51l748k096o23J484J092K007j283l39L135k99J617l58J45j070m422
4762d989N53L541L52j854j238M123R21Q68P50k6K429j446k418m82j153l90K984
4745B525L779k689n088M6k842j847J133J264N70K233K09l270o95J460M59J501
$$ plain form
4729 -1252 2127 2081 1833 1241 873 -1038 -1154 -3020 -3897 -4302 -3815 -99 2374 2964 1757 352 1529
4712 1529 1977 3393 3709 5999 6007 3549 4905 2599 381 -1396 -3574 -3784 -1163 303 -666 221 -422
4695 -422 -4402 -5358 -3386 -1618 -4826 -5431 -3231 -2331 -1925 -861 -2376 -4110 -2955 1611 -715 -637 2148
4678 2148 2718 -1041 -4896 -1833 1369 1985 2341 -1396 -4353 -2373 -554 -4237 -5448 -4168 -3418 -1682
4662 -1682 -3311 -2327 2632 5311 2337 -148 -2528 -2291 830 -3336 -3931 1737 401 -869 -588 -2741
4646 -2741 -4504 -6782 -4846 -3670 -3118 -3696 -1101 1570 2896 359 -3783 -3268 -134 2396 1682 4073
4630 4073 4925 2127 -222 -4110 -837 2414 4308 5633 4339 3524 4171 5039 4885 -349 -1311 -2196 854
4613 854 2020 1554 -777 1790 772 -1010 -688 -3090 -1715 1811 1710 716 1018 3056 3515 2360 -2667
$$ packed form
4729a252L379m6k48n92l68j911j16j866q77m05M87L716K473N90j207j405J177
4712A529M48J416L16K290Qk458J356k306k218j777k178k10K621J466r69Q87o43
4695d22l980r56J972J768l208o05K200R00M06J064j515j734J155M566k326P8K785
4678B148N70l759l855L063L202O16L56l737k957J980J819l683j211J280P50J736
4662a682j629R84M959K679k974k485k380K37L121m166n95N668j336j270K81k153
4646b741j763k278J936J176N52n78K595K671J326k537m142N15L134K530p14K391
4630D073Q52k798k349l888L273L251J894J325j294q15O47Q68j54n234r62q85L050
4613H54J166m66k331K567j018j782L22k402J375L526j01r94L02K038M59j155n027
$$ plain form
4596 -2667 -4447 -1620 -304 352 -1081 -859 800 899 -642 182 -561 -3855 -2349 1319 2098 562 4242
4579 4242 4143 2049 1205 1929 1809 1664 2239 3368 2371 1206 -3596 -2278 -1064 912 305 1732 2541
4562 2541 608 -1705 -3855 -1125 -2073 -2392 -535 -4 431 919 2292 294 -178 324 2476 1096 3174
4545 3174 3828 3540 4921 4931 4583 1699 -970 -4969 -6487 -2441 -1308 -3415 -3537 -2369 -2850 -1906 -1823
4528 -1823 -3007 -908 4955 6838 1274 -1264 -1307 -7108 -5236 -1694 -2898 -2304 -1948 -3860 -1632 -1270
4512 -1270 70 -34 -246 -1492 -1837 922 1536 -429 -3465 -5526 -3877 -2391 1744 1722 -1963 -3071
4496 -3071 -1079 -2131 -2442 680 2793 2013 569 -2191 -4603 -1396 1804 1499 1894 77 -1081 -672
4480 -672 1113 1102 -575 -1947 -3266 -5555 -5234 -4942 -1550 -1297 -1031 588 787 -1250 -2577 -3074 -3127 1552
$$ packed form
4596b667j780K827J316O56j433K22J659R9j541Q24p43l294J506L668P79j536L680
4579D242r9k094q44P24j20j45N75J129r97j165m802J318J214J976o07J427Q09
4562B541j933k313k150K730r48l19J857N31M35M88J373j998m72N02K152j380K078
4545C174O54k88J381J0l48k884k669l999j518M046J133k107j22J168m81R44Q3
4528a823j184K099N863J883n564k538m3n801J872L542j204N94L56j912K228L62
4512a270J340j04k12j246l45K759O14j965l036k061J649J486M135k2l685j108
4496c071J992j052l11L122K113p80j444k760k412L207L200l05L95j817j158M09
4480f72J785j1j677j372j319k289L21K92L392K53K66J619J99k037j327m97n3M679
$$ plain form
4462 1552 3745 1120 1830 1195 -1479 -2946 -2483 64 4031 5304 4242 2117 1441 285 687 1315
4446 1315 633 -773 -1019 -832 -1588 -2462 -1586 142 683 3079 2792 -1440 -3980 -1674 143 -1192 -2720
4429 -2720 -2875 -2412 -1758 -53 3898 5738 3123 4064 5261 2987 1773 1995 2368 458 34 1612 3582
4412 3582 3364 -15 -150 -456 1865 5859 3311 2255 3828 4104 2594 724 566 2434 4500 5425
4396 5425 3514 2520 1508 1168 352 -2375 -4663 -6911 -8075 -5449 -4831 -5959 -6267 -2782 -1118 113
4380 113 250 481 -3297 -2576 -1915 -2721 -6654 -5724 -282 539 643 -1418 -1246 -3411 -6100 -3204 -1777
4363 -1777 -4065 -3432 -5069 -6218 -2691 -1371 -433 37 2692 2066 -1790 -3757 -2687 691 940 1001 1354
4346 1354 -446 205 1032 2018 2162 352 1515 1305 1446 1866 -2089 -1992 533 1202 -789 -4676 -3015
$$ packed form
4462A552K193k625P10o35k674j467M63K547L967J273j062k125o76j156M02O28
4446A315o82j406k46J87p56q74Q76J728N41K396k87m232k540K306J817j335j528
4429b720j55M63O54J705L951J840k615R41J197k274j214K22L73j910m24J578J970
4412C582k18l379j35l06K321L994k548j056J573K76j510j870j58J868K066R25
4396E425j911r94j012l40q16k727k288k248j164K626O18j128l08L485J664J231
4380A13J37K31l778P21O61q06l933R30N442Q21J04k061J72k165k689K896J427
4363a777k288O33j637j149L527J320R38M70K655o26l856j967J070L378K49O1L53
4346A354j800O51Q27R86J44j810J163k10J41M20l955R7K525O69j991l887J661
$$ plain form
4329 -3015 -1126 -1525 76 1624 364 -3063 -3719 -717 -1392 -2728 -2477 1014 -827 -3128 -3252 -442
4313 -442 2250 3857 5403 4176 3523 1398 -735 2037 5770 5342 5704 7049 5434 4850 1903 152
4297 152 -912 -3404 -4134 -3600 -665 2345 3879 3178 225 -1249 -839 -80 -812 -2900 -2882 -1214 -806
4280 -806 155 2197 5490 4707 1154 -1170 1158 3714 1779 1646 3822 915 -271 1519 2 -2269
4264 -2269 -3830 -3681 -4447 -2682 -4722 -6032 -5112 -3001 -119 2792 3247 4260 1454 -2053 1344 4355
4248 4355 4574 6837 6048 4336 3129 2183 335 1622 2370 1203 -4078 -3671 -3342 -3829 -2988 -2222 -2479
4231 -2479 -170 26 -2307 3769 5771 6387 5491 973 1167 4524 6177 2724 1322 3796 2779 655
4215 655 -2225 -2438 -4271 -4491 -2680 -214 -2465 -4084 -5101 -1495 2889 4451 4895 5368 1564 1836
$$ packed form
4329c015J889l99J601J548j260l427o56L002o75j336K51L491j841k301j24K810
4313d42K692J607J546j227o53k125k133K772L733m28L62J345j615n84k947j751
4297A52j064k492p30N34K935L010J534p01k953j474M10P59p32k088J8J668M08
4280h06R61K042L293p83l553k324K328K556j935j33K176k907j186J790j517k271
4264b269j561J49p66J765k040j310R20K111K882K911M55J013k806l507L397L011
4248D355K19K263p89j712j207r46j848J287P48j167n281M07L29m87Q41P66k57
4231b479K309J96k333O076K002O16q96m518J94L357J653l453j402K474j017k124
4215F55k880k13j833k20J811K466k251j619j017L606M384J562M44M73l804K72
$$ plain form
4199 1836 4722 5286 5529 5691 4307 1471 -777 -2502 -117 2470 2599 6143 7359 5334 3616 749
4183 749 -2219 -964 702 3893 5128 8147 8113 8529 5752 4473 4037 -500 63 2145 2899 3303 5364
4166 5364 9227 10688 9715 6965 5236 2557 -1879 -4069 -4542 -2386 526 6791 12133 13367 12877 10505
4150 10505 6753 5161 3529 -826 -1754 522 -2645 -3908 -530 2463 2549 2608 1912 -114 618 -368 -2371
4133 -2371 -2196 -2021 -5328 -3030 -2074 -759 -3280 -8329 -8761 -8914 -5346 -2862 -1072 -1024 -2219 -783 -2777
4116 -2777 -3437 -1461 -1118 -2662 -2657 403 -89 1700 5296 4850 1748 1104 1843 2671 988 1530 983 -1381
4098 -1381 -3607 -6614 -9704 -7104 -3635 -2021 -4852 -7042 -8407 -5979 -7038 -9982 -6427 -1115 1613
4083 1613 1572 2234 2312 4288 5235 3753 3063 3126 -1326 -80 -707 -1987 482 1527 2403 -2165 -6454 -3537
$$ packed form
4199A836K886N64K43J62j384k836k248j725K385K587J29L544J216k025j718k867
4183G49k968J255J666L191J235L019l4M16k777j279m36m537N63K082P54M04K061
4166E364L863J461r73k750j729k679m436k190m73K156K912O265N342J234m90k372
4150A0505l752j592j632m355r28K276l167j263L378K993Q6N9o96k026P32r86k003
4133b371J75J75l307K298R56J315k521n049m32j53L568K484J790M8j195J436j994
4116b777o60J976L43j544NL060m92J789L596m46l102o44P39Q28j683N42n47k364
4098a381k226l007l090K600L469J614k831k190j365K428j059k944L555N312K728
4083A613m1O62P8J976R47j482o90O3m452J246o27j280K469J045Q76m568m289K917
$$ plain form
4065 -3537 779 1460 1329 87 -1350 -256 -10 -28 1845 1409 689 -212 -2014 -1387 335 -3 -2910
4048 -2910 -3459 -3878 -64 1538 1638 754 919 -381 -1064 -596 -172 -361 228 825 2274 1006 -990 -3281
4030 -3281 -4582 -7234 -7399 -5217 -3466 -5091 -4014 -2987 -3727 -137 1466 2926 2088 656 -1427 -6112
4014 -6112 -5604 -72 2300 4304 4200 2034 1832 933 567 3907 1247 -2617 -3596 -3557 -4878 -2935 -1090
3997 -1090 -756 837 -811 -1896 279 378 -974 1161 967 51 1507 479 171 2209 909 -858
3981 -858 -3027 -2702 -273 -235 -3445 -824 -665 301 901 -286 -441 -34 -3496 -3392 -2708 -3163 -2073 749
3963 749 -414 -442 -855 -700 782 -832 1079 -5227 -6654 -2251 -2405 -756 -3027 -3416 -4599 -5232 -1495
3946 -1495 302 -731 -679 1183 1892 904 -542 -223 1930 3006 324 1544 1797 -3127 -2005 -2718 -2543
$$ packed form
4065c537M316O81j31j242j437J094K46j8J873m36p20r01j802O27J722l38k907
4048b910n49m19L814J602J00q84J65j300o83M68M24j89N89N97J449j268j996k291
4030c281j301k652j65K182J751j625J077J027p40L590J603J460q38j432k083m685
4014f112N08N532K372K004j04k166k02q99l66L340k660l864r79L9j321J943J845
3997a090L34J593j648j085K175R9j352K135j94r16J456j028l08K038j300j767
3981h58k169L25K429L8l210K621J59R66O00j187j55M07l462J04O84m55J090K822
3963G49j163k8m13J55J482j614J911o306j427M403j54J649k271l89j183o33L737
3946a495J797j033N2J862P09r88j446L19K153J076k682J220K53m924J122p13J75
$$ plain form
3929 -2543 -1417 -1998 -1806 -3524 -4357 -1932 -1603 -2399 -2567 -175 1107 -233 -948 -1541 -1762 -2167 -1685 -735
3911 -735 948 -935 -2314 919 3350 3451 6000 4798 2219 1608 1201 2669 6203 4755 193 269
3895 269 1098 -1538 -4199 -2936 -1572 556 1015 -322 1902 4942 4213 2264 -2800 -2641 -2826 -4772
3879 -4772 -6263 -4534 -2614 -3435 -4177 -5724 -2148 370 -2734 -678 1801 2112 10 -1575 -2282 -3391
3863 -3391 -6063 -4293 -1983 -549 1550 2828 67 948 -641 -2509 -5816 -2754 279 -1313 -2982
3848 -2982 -2811 369 -1502 -1557 -539 2171 458 -2091 -1164 -1242 810 2310 2986 736 2527 4810 3522
3831 3522 -600 473 1495 -3 -206 1151 1714 -277 1564 391 -3294 -5025 -3989 -926 3152
3816 3152 6123 5730 2987 -799 931 -1763 -3097 4 1274 -3655 -3226 -285 2345 -29 661 1553
$$ packed form
3929b543J126n81J92j718q33K425L29p96j68K392J282j340p15n93k21m05M82R50
3911g35J683j883j379L233K431J01K549j202k579o11m07J468L534j448m562P6
3895B69Q29k636k661J263J364K128M59j337K224L040p29j949n064J59j85j946
3879d772j491J729J920q21p42j547L576K518l104K056K479L11k102j585p07j109
3863c391k672J770K310J434K099J278k761Q81j589j868l307L062L033j592j669
3848b982J71L180j871n5J018K710j713k549R27p8K052J500O76k250J791K283j288
3831C522m122J073J022j498k03J357N63j991J841j173l685j731J036L063M078
3816C152K971l93k743l786J730k694j334L101J270m929M29K941K630k374O90Q92
$$ plain form
3800 1553 -1158 -1360 -692 1014 4976 5962 2355 1009 1212 1973 1699 -338 608 -311 -2604 -928 1364
3783 1364 2754 3701 4768 3509 1235 558 970 932 1278 830 1372 3001 872 -200 331 1095 1170 2156
3765 2156 2536 1626 3223 2417 456 3603 4074 2312 685 -3156 -5935 -3215 -4218 -4987 -2442 -3342
3749 -3342 -3869 -2967 -1797 -1276 226 1836 3483 4282 7051 6904 4878 3009 852 1464 5998 4353
3733 4353 638 407 -125 -1422 -1459 -539 143 -1330 -3884 -3207 -1649 348 2538 -278 -2046 844 3715
3716 3715 3759 3538 2108 1533 -3546 -3427 -913 245 747 925 -1120 -3300 -2489 3684 4123 4430 4591 2035
3698 2035 3290 3097 75 350 911 341 646 1169 -198 1684 4816 4079 114 2516 6622 5088 852
3681 852 696 3184 3151 2649 3140 2949 562 -2330 785 3802 2063 1209 1328 2073 -602 -699 -2041 -2233
$$ packed form
3800A553k711k02O68J706L962R86l607j346K03P61k74k037R46r19k293J676K292
3783A364J390R47J067j259k274o77M12l8L46m48N42J629k129j072N31P64P5R86
3765B156L80r10J597q06j961L147M71j762j627l841k779K720j003p69K545r00
3749c342n27R02J170N21J502J610J647P99K769j47k026j869k157O12M534j645
3733D353l715k31n32j297l7R20O82j473k554O77J558J997K190k816j768K890K871
3716C715M4k21j430n75n079J19K514J158N02J78k045k180Q11O173M39L07J61k556
3698B035J255j93l022K75N61n70L05N23j367J882L132p37l965K402M106j534m236
3681H52j56K488l3n02M91j91k387k892L115L017j739q54J19P45k675r7j342j92
$$ plain form
3663 -2233 -691 1284 5750 4332 3327 2298 1855 2128 1936 888 3487 4831 2113 360 -589 649
3647 649 2349 2216 3260 3748 1114 1167 1700 1989 212 -1479 882 119 -1708 -3477 -4440 -3109 -3887
3630 -3887 -6382 -6665 -5797 -5925 -4885 -2456 -1709 -1573 -2351 943 1027 -2703 -2147 1829 2174 -347 -1952
3613 -1952 -399 -64 2251 1287 -231 -2989 -3310 -1904 -522 597 1706 2875 4242 5165 2796 1885
3597 1885 862 -1523 -899 -940 -1127 -2041 -962 138 -1514 -320 1811 1196 1808 -876 -2521 -4784 -3092
3580 -3092 -3065 -998 -2767 -2319 -3432 -4298 -5198 -2557 876 2519 -50 -4228 -3625 441 785 1735 2011
3563 2011 988 468 1495 4245 4171 3969 2628 -771 -800 -2422 -4096 -2392 3512 3215 2988 3234 2848
3546 2848 909 1105 1288 1149 130 -2061 -5819 -5479 -3898 -3305 -4783 -6351 -4973 -1821 -1730 -1482 -537
$$ packed form
3663b233J542J975M466j418j005j029m43K73j92j048K599J344k718j753r49J238
3647F49J700j33J044M88k634N3N33K89j777j691K361p63j827j769r63J331p78
3630c887k495k83Q68j28J040K429P47J36p78L294Q4l730N56L976L45k521j605
3613a952J553L35K315r64j518k758l21J406J382J119J109J169J367R23k369r11
3597A885j023k385O24m1j87r14J079J100j652J194K131o15O12k684j645k263J692
3580c092K7K067j769M48j113q66r00K641L433J643k569m178O03M066L44R50K76
3563B011j023n20J027K750p4k02j341l399k9j622j674J704N904k97k27K46l86
3546B848j939J96J83j39j019k191l758L40J581N93j478j568J378L152R1K48R45
$$ plain form
3529 -537 1291 854 -3946 -5608 -7378 -6728 -4452 -3170 -2441 -4286 -4291 -1326 2354 2430 2564 3596 2598 4802
3511 4802 3825 450 1608 1817 2278 1285 887 3163 6457 3935 -94 -2538 -2888 -2237 1174 4308 3705
3494 3705 2423 -97 -2247 -123 1913 1319 2253 1306 -122 -993 580 -1136 -4210 -3952 -4790 -7415
3478 -7415 -5560 -4196 -3510 825 1227 -1241 -985 -233 -2130 -3026 -1796 -1931 -2059 900 1322 3546 6803
3461 6803 7464 4510 3526 1195 5126 5439 2858 1322 3920 3522 2348 3028 4895 6238 3353 -808
3445 -808 -1853 -1264 -411 2484 1148 1552 -648 -284 2368 1959 1449 1623 1920 3074 595 -1496 488
3428 488 3036 2299 3987 2944 881 901 500 1085 -346 -3102 -1329 -1384 -1799 2874 3736 1493 2195 2637
3410 2637 1067 -53 -129 -87 -226 -1402 -25 213 868 1114 2504 4123 3671 2515 2366 1524 -451 70
$$ packed form
3529e37J828m37m800j662j770O50K276J282P29j845nK965L680P6J34J032r98K204
3511D802r77l375J158K09M61r93l98K276L294k522m029k444l50O51L411L134o03
3494C705j282k520k150K124K036n94R34r47j428q71J573j716l074K58q38k625
3478g415J855J364O86M335M02k468K56P52j897q96J230j35j28K959M22K224L257
3461F803O61k954r84k331L931L13k581j536K598l98j174O80J867J343k885m161
3445h08j045N89Q53K895j336M04k200L64K652m09n10J74K97J154k479k091J984
3428D88K548p37J688j043k063K0m01N85j431k756J773n5m15M673Q62k243P02M42
3410B637j570j120p6M2j39j176J377K38O55K46J390J619m52j156j49q42j975N21
$$ plain form
3392 70 -1904 -644 1128 2197 4323 4925 2878 2505 1054 2685 1849 3145 2181 3980 4024 347 -995
3375 -995 -2697 -4884 -6158 -4427 -2126 -1611 -2426 -1017 125 -32 441 -1433 -5 -256 478 2916 3522
3358 3522 4145 -523 -4218 -5127 -3440 -436 4843 3641 152 -3232 -3412 -2358 252 621 2614 1087
$$ packed form
3392G0j974J260J772J069K126O02k047l73j451J631q36J296r64J799M4l677j342
3375i95j702k187j274J731K301N15q15J409J142j57M73j874J428k51P34K438O06
3358C522O23m668l695r09J687L004N279j202l489l384j80J054K610L69J993j527
$$ [...]
##END NTUPLES=NMR SPECTRUM
##END=
