##TITLE=Analysis number 327992
Compound Code cc 55406
Book Reference 470/182
Project Code adrs
Chemist Name mikem
##JCAMPDX= 6.0         $$ Bruker NMR JCAMP-DX V2.0
##DATA TYPE= NMR SPECTRUM
##DATA CLASS= NTUPLES
##ORIGIN= Bruker BioSpin GmbH
##OWNER= nmr
$$ XWIN-NMR		Version 3.5
$$ Tue Apr 24 12:04:42 2007 GMT Daylight Time (UT+1h)  MAYBRIDGE\nmr@NMR_250MHZ
##.OBSERVE FREQUENCY= 250.131544655141
##.OBSERVE NUCLEUS= ^1H
##.ACQUISITION MODE= SIMULTANEOUS (DQD)
##.ACQUISITION SCHEME= undefined
##.AVERAGES= 16
##.DIGITISER RES= 18
##SPECTROMETER/DATA SYSTEM= dpx250
##.PULSE SEQUENCE= zg30
##.SOLVENT NAME= CDCl3
##.SHIFT REFERENCE= (INTERNAL, CDCl3, 0, 16.4186)
##AUDIT TRAIL= $$ (NUMBER, WHEN, WHO, WHERE, WHAT)
$$ ##TITLE= Audit trail, XWIN-NMR		Version 3.5
$$ ##JCAMPDX= 5.01
$$ ##ORIGIN= Bruker BioSpin GmbH
$$ ##OWNER= nmr
$$ C:\u/data/dgb/nmr/ADRS/2970/pdata/1/auditp.txt
$$ ##AUDIT TRAIL=  $$ (NUMBER, WHEN, WHO, WHERE, WHAT)
(   1,<2007-04-24 12:04:23.19 +100>,<MAYBRIDGE\nmr>,<NMR_250MHZ>,
      <created by zg, POWCHK disabled, PULCHK disabled
       configuration hash MD5:
       76 6E 9A 78 1E 09 19 81 EC 84 63 8F B0 6A 59 2D
       data hash MD5: 64K
       9A 23 F1 5A 71 CC F4 EC 46 93 23 DB B1 F9 AD 79>)
(   2,<2007-04-24 12:04:35.08 +100>,<MAYBRIDGE\nmr>,<NMR_250MHZ>,
      <Start of raw data processing
       ef LB = 0.3 FT_mod = 6 PKNL = 1 SI = 32K 
       data hash MD5: 32K
       77 72 85 30 BD 74 A4 C7 FF 1C 00 D0 1C E3 0A AD>)
(   3,<2007-04-24 12:04:36.69 +100>,<MAYBRIDGE\nmr>,<NMR_250MHZ>,
      <apk 
       data hash MD5: 32K
       9A D1 49 45 B0 35 C7 FF D7 36 2D B7 FE CD D9 99>)
(   4,<2007-04-24 12:04:37.42 +100>,<MAYBRIDGE\nmr>,<NMR_250MHZ>,
      <abs ABSG = 5 
       data hash MD5: 32K
       F4 E5 D8 5B 49 E9 21 7A 2F F7 E8 FD 49 81 95 23>)
$$ ##END=
$$ 
$$ hash MD5
$$ C4 35 4B 57 85 E7 E7 67 11 1C 88 2D 7F 91 B6 0D
##$RELAX= 
##$RELAX= 
##$RELAX= 
##$RELAX= 
##$RELAX= 
##$RELAX= 
##$RELAX= 
$$ Bruker specific parameters
$$ --------------------------
##$DU= <C:\u>
##$EXPNO= 2970
##$NAME= <ADRS>
##$PROCNO= 1
##$TYPE= <nmr>
##$USER= <dgb>
##$AMP= (0..31)
100 100 100 100 100 100 100 100 100 100 100 100 100 100 100 100 100 100 
100 100 100 100 100 100 100 100 100 100 100 100 100 100 
##$AQSEQ= 0
##$AQ_mod= 3
##$AUNM= <au_zg>
##$AUTOPOS= <17 >
##$BF1= 250.13
##$BF2= 250.13
##$BF3= 250.13
##$BF4= 250.13
##$BF5= 500.13
##$BF6= 500.13
##$BF7= 500.13
##$BF8= 500.13
##$BYTORDA= 1
##$CFDGTYP= 0
##$CFRGTYP= 5
##$CHEMSTR= <none>
##$CNST= (0..31)
1 1 145 1 1 1 1 1 1 1 1 1 1 1 1 1 1 1 1 1 1 1 1 1 1 1 1 1 1 1 1 1 
##$CPDPRG= <>
##$CPDPRG1= <>
##$CPDPRG2= <>
##$CPDPRG3= <>
##$CPDPRG4= <mlev>
##$CPDPRG5= <mlev>
##$CPDPRG6= <mlev>
##$CPDPRG7= <mlev>
##$CPDPRG8= <mlev>
##$CPDPRGB= <>
##$CPDPRGT= <>
##$D= (0..31)
0 1 0 0 0 0 0 0 0 0.06 0 0 0 0 0 0 0.0002 0 0 0 0 0 0 0 0 0 0 0 0 0 0 
0 
##$DATE= 1177412662
##$DBL= (0..7)
120 120 120 120 120 120 120 120 
##$DBP= (0..7)
150 150 150 150 150 150 150 150 
##$DBP07= 0
##$DBPNAM0= <>
##$DBPNAM1= <>
$$ [...]
##$SUBNAM7= <"">
##$SUBNAM8= <"">
##$SUBNAM9= <"">
##$SW= 20.6930455092707
##$SWIBOX= (0..15)
0 0 3 0 0 0 0 0 0 0 0 0 0 0 0 0 
##$SW_h= 5175.983436853
##$TD= 65536
##$TD0= 1
##$TE= 683.16
##$TE2= 300
##$TE3= 300
##$TEG= 300
##$TL= (0..7)
0 120 120 120 120 120 120 120 
##$TP= (0..7)
150 150 150 150 150 150 150 150 
##$TP07= 0
##$TPNAME0= <>
##$TPNAME1= <>
##$TPNAME2= <>
##$TPNAME3= <>
##$TPNAME4= <>
##$TPNAME5= <>
##$TPNAME6= <>
##$TPNAME7= <>
##$TPOAL= (0..7)
0.5 0.5 0.5 0.5 0.5 0.5 0.5 0.5 
##$TPOFFS= (0..7)
0 0 0 0 0 0 0 0 
##$TUNHIN= 0
##$TUNHOUT= 0
##$TUNXOUT= 0
##$USERA1= <user>
##$USERA2= <user>
##$USERA3= <user>
##$USERA4= <user>
##$USERA5= <user>
##$V9= 5
##$VALIST= <valist>
##$VCLIST= <CCCCCCCCCCCCCCC>
##$VD= 0
##$VDLIST= <DDDDDDDDDDDDDDD>
##$VPLIST= <PPPPPPPPPPPPPPP>
##$VTLIST= <TTTTTTTTTTTTTTT>
##$WBST= 1024
##$WBSW= 4
##$XGAIN= (0..3)
0 0 0 0 
##$XL= 0
##$YL= 0
##$YMAX_a= 420345
##$YMIN_a= -371520
##$ZGOPTNS= <>
##$ZL1= 120
##$ZL2= 120
##$ZL3= 120
##$ZL4= 120
##$ABSF1= 16.41862
##$ABSF2= -4.274551
##$ABSG= 5
##$ABSL= 3
##$ALPHA= 0
##$AQORDER= 0
##$ASSFAC= 0
##$ASSFACI= 0
##$ASSFACX= 0
##$ASSWID= 0
##$AUNMP= <proc_1d>
##$AZFE= 0.1
##$AZFW= 0.1
##$BCFW= 0
##$BC_mod= 0
##$BYTORDP= 0
##$COROFFS= 0
##$CY= 12.5
##$DATMOD= 1
##$DC= 0
##$DFILT= <>
##$DTYPP= 0
##$F1P= 14.0000005364418
##$F2P= -0.99999901652339
##$FCOR= 0.5
##$FTSIZE= 32768
##$FT_mod= 6
##$GAMMA= 0
##$GB= 0
##$INTBC= 1
##$INTSCL= 1
##$ISEN= 128
##$LB= 0.3
##$LEV0= 0
##$LPBIN= 0
##$MAXI= 10000
##$MC2= 0
##$MEAN= 0
##$ME_mod= 0
##$MI= 0
##$NCOEF= 0
##$NC_proc= -2
##$NLEV= 6
##$NOISF1= 0
##$NOISF2= 0
##$NSP= 0
##$NTH_PI= 0
##$NZP= 0
##$OFFSET= 16.41862
##$PC= 1
##$PHC0= -54.30001
##$PHC1= 3.47848
##$PH_mod= 1
##$PKNL= yes
##$PPARMOD= 0
##$PSCAL= 4
##$PSIGN= 0
##$REVERSE= no
##$SF= 250.130025857103
##$SI= 32768
##$SIGF1= 0
##$SIGF2= 0
##$SINO= 400
##$SIOLD= 32768
##$SREGLST= <1H.CDCl3>
##$SSB= 0
##$STSI= 32768
##$STSR= 0
##$SW_p= 5175.98343685301
##$SYMM= 0
##$S_DEV= 0
##$TDeff= 65536
##$TDoff= 0
##$TI= <Analysis number 999999
Compound Code 99
Book Reference 9
Project Code 9>
##$TILT= no
##$TM1= 0
##$TM2= 0
##$TOPLEV= 0
##$USERP1= <user>
##$USERP2= <user>
##$USERP3= <user>
##$USERP4= <user>
##$USERP5= <user>
##$WDW= 1
##$XDIM= 32768
##$YMAX_p= 437930986
##$YMIN_p= -76575
$$ End of Bruker specific parameters
$$ ---------------------------------
##NTUPLES= NMR SPECTRUM
##VAR_NAME=  FREQUENCY,     SPECTRUM/REAL,   SPECTRUM/IMAG
##SYMBOL=    X,             R,               I
##VAR_TYPE=  INDEPENDENT,   DEPENDENT,       DEPENDENT
##VAR_FORM=  AFFN,          ASDF,            ASDF
##VAR_DIM=   32768,         32768,           32768
##UNITS=     HZ,            ARBITRARY UNITS, ARBITRARY UNITS
##FACTOR=    0.157963299565203, 1,           1
##FIRST=     4106.78963399914, 0,            0
##LAST=      -1069.19380285387, 0,           0
##MIN=       -1069.19380285387, -76575,      0
##MAX=       4106.78963399914, 437930986,    0
$$ Real data points
##PAGE= N=1
##DATA TABLE= (X++(R..R)), XYDATA
$$ [...]
16967B5345m229o693j347Q51r80o20q80k214L122O340P42O06K918j02k588j920
16951A8351P39l291n006l30L237n392k059q35k054m375M617O151j93J419m015
16936F964k165k324L615M033J3M538l470r662l310K909p66J810r64m51j425M450
16920C795P316k323O01R57R88o908q5P920L780k81p305l32p90l764J428K857L924
16903A1778R143j150j589Ln616k489K669K086K890j90k105L778n309k602K267
16888A3564L236k732J897M91j1696n185J878k027q713l179P206J0333j819p7k01
16873B976K176O765j514M251J248k741p357K645k578m112P152M478k752n431L312
16858H518R106K834l732l565L622K053J63j868o594m866K938L002K691l274P359
$$ y = [25345, 21116, 14423, 13076, 13927, 12947, 12327, 11447, 9233, 12355, 18695, 19437, 20043, 22961, 22859, 20271, 18351, 19090, 15799, 10793, 10463, 13700, 8308, 6249, 5414, 3360, -1015, 3602, 9753, 9560, 10979, 6964, 4799, 2475, 6090, 10123, 10136, 14674, 11204, 1542, -1768, 1141, 375, 2185, 1221, 770, -655, 3795, 11111, 8788, 9389, 10346, 11334, 4426, 4341, 12261, 16041, 15760, 8455, 8123, 7333, 3569, 4997, 7854, 11778, 20921, 19771, 18182, 18185, 12569, 10080, 12749, 14835, 17725, 17535, 15430, 19208, 13899, 11297, 13564, 16800, 14068, 15965, 16456, 4760, -425, 1453, -574, -9287, -12466, -5260, 5073, 3254, 3177, 2976, 5152, 11917, 10403, 14654, 15902, 13161, 5804, 8449, 5871, 1759, 8911, 13389, 10637, 5206, 8518, 17624, 20458, 16726, 13161, 16783, 18836, 18999, 17131, 10537, 5671, 8609, 11611, 14302, 11028, 18387]
16843A8387k705n230j31P245R45l92k814L85l41J067J0414L706J434L517J113
16828C6600M783M095m880K431M578m36J651m648j1522r39K047K826L225m49J1170
16813E0532N555n490j2305j93n502k397n027n820o07Q755m178n007K683K196j404
16798B1791M019k581l067J861Q340J946M560L78m722q66p49J458M450j207K814
16783C8425k608k68k72K13l099o723m635l115o40j602L642j768k735J0394L796
16768B9005l041j685n009J567N256K050n520n56k056n434K511P838M558p608k623
16753A9253l020L723O657l50k102M566o657n281j539L877J703N651L018k402k113
16738B4984L016M354K915J0Q31K229L165J055k554l267L34O502L432l8L557N265
$$ y = [18387, 15682, 10452, 10321, 17566, 18511, 18119, 15305, 15690, 15349, 16416, 26830, 30536, 31970, 35487, 36600, 41383, 45478, 40598, 43029, 47607, 47171, 48822, 44174, 32652, 31713, 33760, 36586, 39811, 39362, 50532, 56087, 50597, 38292, 38099, 32597, 30200, 25173, 19353, 18746, 27501, 23323, 18316, 20999, 23195, 21791, 25810, 23229, 20162, 22023, 30363, 32309, 36869, 37247, 32525, 31659, 30910, 32368, 36818, 35611, 38425, 35817, 35549, 35277, 35490, 32391, 25668, 21033, 17918, 17278, 15676, 19318, 17550, 14815, 25209, 29005, 25964, 24279, 19270, 20837, 26093, 28143, 22623, 22067, 20011, 14577, 17088, 24926, 29484, 21876, 19253, 16233, 19956, 26613, 26263, 24161, 28727, 22070, 16789, 15250, 19127, 20830, 26481, 29499, 27097, 24984, 28000, 32354, 35269, 35279, 36110, 38339, 41504, 42559, 40005, 36738, 37072, 43574, 47006, 46968, 50525, 55790]
16722E5790J1387M741K285l944j804o590o144k242l514l103p152K341J0682Q151
16708F0884L399Q802L831N94m860k43j0116o488p191K33J267m014k138O551k147
16693D8364l376J282N128n420j685M291m608j1169k280M286J48p85M245K507l429
16678C7499k662j351k166M462O415j434m723K44m305o488l67J286j408n907j693
16663A7402P602M385L830m184O74J1581P104k984k878j228p114k036P750R13K612
16648D3429R66J483l60M432k38N114j949n072j453P805M520j207K789K563r324
16633E3498o680K243m950q06k883M646m819m996J0428m7q188K501M69j6k068M745
16617D3077Q446p422l406O809k65j946p45Q06J1207o17m993M78J972M526R25J2222
$$ y = [55790, 67177, 71918, 74203, 70259, 68455, 61865, 55721, 53479, 49965, 46862, 39710, 42051, 52733, 60884, 64283, 73085, 76916, 77510, 72650, 72407, 62291, 55803, 48612, 48845, 50112, 46098, 43960, 50511, 48364, 44988, 46270, 51398, 45978, 44293, 48584, 43976, 32807, 30527, 34813, 34961, 34176, 38421, 40928, 37499, 34837, 33486, 31320, 35782, 42197, 40763, 36040, 36284, 31979, 25491, 25124, 26410, 25002, 19095, 17402, 25004, 29389, 33219, 29035, 29709, 41290, 48394, 45410, 42532, 41304, 34190, 32154, 39904, 40817, 43429, 44395, 45878, 45518, 49950, 49712, 54826, 52877, 47805, 46352, 54157, 58677, 57470, 60259, 62822, 53498, 46818, 49061, 44111, 43305, 40422, 45068, 40249, 35253, 45681, 45634, 37446, 39947, 40416, 40400, 38332, 43077, 51523, 44101, 40695, 47504, 47239, 45293, 44548, 45354, 56561, 55944, 50951, 51429, 53401, 57927, 58852, 71074]
16601G1074J0689M764Q257j996K306m303j0874l004l453j1506P60j065N778O852
16587G4279O033Q872l004l293l703q317o962j0249o164k428l50K993K430L575
16573E3712R562L477R94J0598O819p85M455J187Q23N231J060J907o385o358k674
16558H3623k403K609J0124N128j366m76N506Q296p28J66J2340L531l218j669J432
16543A22895k273M419P707L771K463K428j07M192P100L643k06k406L572j760L581
16528A59019J1798R699O582J0254R725N596Q135N555M513K071M170L1371M2012
16515C10500J4457j3731r482q287O504Q570J1715J5647J6440L859M407K9282J9542
16502D09423J6291L3971M8046M5966P2489Q6974P6082R5723R8101M9443N8891
$$ y = [71074, 81763, 86527, 94784, 92788, 95094, 90791, 79917, 76913, 73460, 61954, 62714, 61649, 67427, 74279, 80312, 89184, 86180, 82887, 79184, 70867, 63905, 53656, 47492, 45064, 44714, 47707, 50137, 53712, 63274, 66751, 67745, 78343, 85162, 84377, 88832, 90019, 90842, 96073, 97133, 99040, 92655, 86297, 83623, 81220, 83829, 93953, 99081, 97715, 97239, 102745, 111041, 110313, 110479, 122819, 126350, 123132, 121463, 122895, 120622, 125041, 132748, 136519, 138982, 141410, 141303, 145495, 152595, 156238, 156032, 153626, 157198, 155438, 159019, 170817, 180516, 187098, 197352, 207077, 212673, 220808, 226363, 230876, 232947, 237117, 268488, 310500, 324957, 311226, 301744, 293457, 299961, 308531, 320246, 335893, 352333, 356192, 360599, 389881, 409423, 425714, 459685, 507731, 553697, 626186, 713160, 789242, 884965, 983066, 1032509, 1091400]
16491A091400N9227J5749M3474Q1536Q7282J17516J87249K11073J68178K46522
16481B309206K88463K38857L41904N03557O43947J008895J598673K561459M295059
16472A3790020P153730R303230Q280185J1538712J2492094N54403N84523J753521
16464F5450418j0211712j0369469o654421o873019l532160J830002N935519O133357
16456D1708515R361955J1660093N20625p86968J594561j0061251j1819054q188241
16448C3990235r237306p804293n052878l198506k068408j382285r60472o71035
16440C615052m46979l25283k66641k02337k03880k25501k15663k32724k04117
16431A291927j64444j40353j02813m9929j9379p963K5320L658l6813j5850k7061
$$ y = [1091400, 1150627, 1166376, 1209850, 1291386, 1378668, 1496184, 1683433, 1894506, 2062684, 2309206, 2597669, 2836526, 3178430, 3681987, 4325934, 5334829, 6933502, 9494961, 13790020, 20943750, 30246980, 38527165, 50065877, 62557971, 63112374, 63696897, 65450418, 55238706, 44869237, 38214816, 31341797, 27809637, 29639639, 35575158, 41708515, 51070470, 62730563, 63251188, 62464220, 64058781, 53997530, 42178476, 33990235, 24752929, 16948636, 11895758, 8697252, 6628844, 5246559, 4286087, 3615052, 3168073, 2842790, 2576149, 2373812, 2169932, 1944431, 1728768, 1496044, 1291927, 1127483, 987130, 884317, 834388, 815009, 807046, 832366, 836024, 799211, 783361, 756300]
16420G56300q4917q4699p0858o9784o7263l8488l0194k5318k0731j5158j6127
16409B32763l862q364j0566p955q175j0837o574j3197r249r387n952k941j2501
16396A23203p794J758L533o994p554O327m849q851j783m990j0726l243p433R0
16382G0694j715k797o62P49r75J025M494N425n138m900p85o636M035O67n248r689
16366D8544o54L736K578N181m10Nm796R51q31p427K330N597K85M544l16l144N808
16349F1981N262P25J1238J2114J0529K525J5118J2844j026n13o447j3165j2586
16336I8599j1196m024l955J395P952Q390J1879J0482o299m057o935j2792j3976
16323G5463j3663j2240p714r21o023j982k840j628n191Q8P182Kl521K5j237o270
$$ y = [756300, 671383, 586684, 515826, 446042, 378779, 340291, 310097, 284779, 264048, 248890, 232763, 228901, 220537, 209971, 202016, 193841, 183004, 176430, 163233, 153984, 144597, 138645, 135704, 123203, 115409, 117167, 120700, 113706, 106152, 112479, 107630, 98779, 96996, 92006, 81280, 78037, 70604, 70694, 68979, 66182, 65520, 66269, 65294, 66319, 70813, 76238, 71100, 66200, 65415, 58779, 62814, 63481, 58233, 48544, 47890, 51626, 54204, 59385, 58975, 58980, 54184, 55135, 54304, 46877, 49207, 54804, 55089, 59633, 59317, 56173, 61981, 67243, 67968, 79206, 91320, 101849, 104374, 119492, 132336, 131310, 130797, 124350, 111185, 98599, 87403, 83379, 79424, 80819, 88771, 97161, 109040, 119522, 113223, 109166, 102231, 89439, 75463, 61800, 49560, 41846, 40925, 34902, 32920, 30080, 28452, 23261, 23349, 30531, 30533, 27012, 27037, 25800, 19530]
16307A9530m141J154M875K127L320M59k736k056J57j606n082n24m336m254j542
16292E345K336N150K191l264m554o71m718n40L278K897o33L448q73r759q329q6
16276h782J667M351l301r93Q529L348M663K368L530J1386M217o174l162l347o873
16261A1427p991j80L561rM833P594j610N724q000m107L874j361J209J656l394
16246A3226j565J366p262l988K314J54j2806O77K539o908L985Q67m651M661N150
16231b241L041J865k772m916K000l127N55L879M451M628j883K723L877k521J949
16216A1508k096j692J709m23P17K236J619N340N201m279n276l251M100O003j506
16201A9910K132k8l027m499o664k655N58m555N25n073M08J42J837k1N769K258
$$ y = [19530, 15389, 16543, 21418, 23545, 26865, 27324, 24588, 22532, 22689, 21083, 16001, 15477, 11141, 6887, 5345, 7681, 12831, 15022, 11758, 7204, 6533, 1815, 1275, 4553, 7450, 6817, 10265, 9392, -367, -8696, -8782, -7115, -2764, -6065, -7058, 1471, 4819, 9482, 11850, 15380, 26766, 30983, 24809, 21647, 18300, 11427, 3436, 3256, 6817, 6808, 11641, 19235, 17625, 23349, 15349, 11242, 15116, 13755, 14964, 16620, 13226, 11661, 13027, 5765, 1777, 4091, 4245, -8561, -7884, -5345, -12253, -8268, -7401, -12052, -7391, -2241, 800, 2665, -107, -5023, -3023, -6150, -5595, -1716, 2735, 7363, 5480, 8203, 12080, 9559, 11508, 9412, 7720, 9429, 9006, 9723, 11959, 13578, 18918, 24119, 19840, 14564, 11313, 15413, 21416, 19910, 22042, 22014, 18987, 14488, 7824, 5169, 5727, 1172, 1697, -3376, -2968, -2826, -989, -1010, 4759, 7017]
16185G017M719M611N899k228k596L023p23j0018m480K986L862l81o8l935P283
16170A4971l155j3038J15M661k09K710Q453M499j629l993P844L791P315K8382
16156F0717K5862K9196M2158J9958K696P832k9286l8904l6335l8849j8692o252
16144B0101p057p502m482N86o765l115O411Q706J953l204o161L263q67k534n377
16129f044q638L73J04p04R4l547M108O276K380j418N636L250P44l89q156k291
16113h222J403Q959j753j1904p193J175P664M031Q411J356r260k679N366J0446
16099G800J533k845m646j2312j993O148N962L69k485J429j678K748L350m182m211
16084e013N663q2K641j697n334m183k511j565J429K291k129q643L022N294L034
$$ y = [7017, 11736, 16347, 22246, 20018, 17422, 20445, 19722, 9704, 5224, 8210, 12072, 11691, 11623, 7688, 14971, 11816, -1222, -1107, 3554, 3345, 6055, 14508, 19007, 17378, 13385, 21229, 25020, 32335, 60717, 86579, 115775, 157933, 177891, 180587, 188419, 159133, 120229, 83894, 45045, 26353, 20101, 13044, 5542, 1060, 1646, -5119, -8234, -1823, 6883, 8836, 5632, -529, 2734, 1867, -667, -6044, -14682, -14309, -14205, -14909, -14815, -18362, -14254, -7978, -5598, -7016, -1380, 1870, 2614, 2225, -5931, -8222, -6819, 2140, 387, -11517, -18710, -17535, -9871, -5840, 2571, 3927, -5333, -8012, -2646, 7800, 9333, 6488, 1842, -10470, -12463, -6315, -353, 16, -2469, -1040, -2718, 30, 3380, -802, -5013, 650, 568, 3209, 1512, -3822, -8005, -10516, -12081, -10652, -8361, -10490, -19133, -16111, -10817, -7783]
16069g783P089J445Qn811l586J539J944Q602N609l798m634j646m867j368M303
16054b954J722L297L828K926l762k879M658J482r60r64l323m100j86k575L722
16039f8N192J0837j66q477o81j56m63l736Lk65l398M304n05R31j093k091j901
16022a733L317n391L402M230l885o242K227M697Q254l04M598rk486p314q416j545
16006f600N807l573M70J65M24O54K180j8P030N744J987j208n868n048p468J353
15990c969K989n487L067N807m216J509J953J654k049l428m041J497P523N733j420
15975G122j271r05k77j430M109L297k530q26l977k535L739K32p890m622L700K786
15959a278K452k751L322L404J611o617k836L340k216l038m388L415O129N218l201
$$ y = [-7783, -694, 751, 759, -5052, -8638, -7099, -5155, 3447, 9056, 5258, 624, -1022, -5889, -7257, -2954, -1232, 2065, 5893, 8819, 5057, 2178, 6836, 8318, 7358, 6394, 3071, -1029, -1215, -3790, -68, 5124, 15961, 15795, 7318, 6637, 6481, 6018, 2282, 2285, 2020, -1378, 2926, 2421, 3352, 2259, 168, -1733, 1584, -3807, -405, 3825, -60, -6302, -4075, 622, 8876, 8572, 13170, 13161, 10675, 3361, -5055, -6600, -793, -4366, -3896, -3731, -3307, -2653, -473, -491, 6539, 12283, 14270, 13062, 7194, 2146, -5322, -3969, -980, -6467, -3400, 2407, -1809, -300, 1653, 3307, 1258, -2170, -6211, -4714, 2809, 8542, 7122, 5851, 4946, 4669, 3239, 7348, 10645, 8115, 7289, 3312, 777, 4516, 4748, -3142, -7764, -4064, -1278, 1174, -1577, 1745, 5149, 6760, 143, -2693, 647, -1569, -4607, -8995, -5580, 549, 5767, 2566]
15944B566k56N603p300l751P83r125n276j89j088n19P605K589P963J435K838J726
15928E604p58O0J013j590J505M455r2q56j411j868J072P404Q74J695K756j730
15912A8133P326M478J733J7298L0075L6691M7528M4050O8064O4499M486N535k02
15899C49694n2327m8150m0907l4768j6776J2647L4003L6060M6168O0114M749l942
15887C46565O531n9466o4390l9752m8099m1028k9405k1929j9218j2873k124L047
15875A7859r93n302l607J155J419j042l360n142o029K151N798j93l077k531K917
15860B3j381K960K486Q80k243p9M476M641m637l584k393l44n052n597j398L456
15844g786Q880O571k609K920o078j27o14N131M07k513k945p203L906R399l644
$$ y = [2566, 2310, 7913, 613, -3138, -2355, -11480, -16756, -16945, -18033, -18552, -10947, -8358, -395, 1040, 3878, 5604, 4846, 4906, 5919, 4329, 5834, 10289, 10197, 9341, 7930, 6062, 7134, 14538, 15412, 17107, 19863, 18133, 25459, 29937, 31670, 48968, 79043, 115734, 163262, 207312, 275376, 339875, 344361, 349896, 349694, 297367, 249217, 208310, 173542, 156766, 169413, 203416, 239476, 285644, 345758, 350507, 346565, 353096, 293630, 229240, 189488, 141389, 100361, 70956, 49027, 29809, 16936, 14812, 17859, 16866, 11564, 7957, 9112, 10531, 9489, 6129, 987, -5042, -2891, 2907, 2714, -363, -2894, 23, -1358, 1602, 4088, 4968, 2725, 2646, 7122, 11763, 7126, 3542, 1149, 805, -4247, -9844, -11242, -7786, 1094, 7665, 5056, 7976, 1898, 1771, 1157, 6288, 6695, 4182, 1237, -5966, -2060, 7339, 3695]
15829C695o216k383k077L429J262Q86K307L921O66r361n241o98M032O715j078
15814a41m108o074M807O086j494o25m343j203K084J511l80m18M914k47l014J668
15798i77l164o309p104k933J775J182N861N102J0447j054n675n286Q7L354J794
15783b900M797R59M145j512q699j455N069N534L416Q159m151j2817j0647K429
15769g673N078l646j448K229J686j487m260M640K678j206j974L33L995K550K715
15754D210l701j775j732n893O083k899k965M323M391N593l635k911l111K670L371
15739B019K194K996J497M293k726l341k558m049m081N64J815k494K446J3564J22
15724A2261o458j0546o389K179J467O108P25K934l354p209L557N663N796L088
$$ y = [3695, -2521, -4904, -6981, -3552, -2290, -1404, 903, 4824, 5490, -3871, -9112, -9810, -5778, 937, -141, -4249, -10323, -5516, 570, -924, -1549, -5892, -7095, -5011, -3500, -3880, -4298, 616, 369, -2645, -977, -4141, -10450, -17554, -20487, -18712, -17530, -11669, -6567, 3880, 2826, -2849, -8135, -8048, -4694, -2900, 1897, 2856, 7001, 5489, -3210, -4665, 404, 5938, 9354, 17513, 13362, 545, -10102, -7673, -2595, -6241, -7689, -5460, -3774, -5261, -9521, -4881, -2203, -3409, -5383, -5050, -1055, 1495, 4210, 509, -1266, -2998, -8891, -2808, -5707, -8672, -4349, 42, 5635, 2000, -911, -4022, -1352, 2019, 4213, 7209, 8706, 12999, 10273, 6932, 4374, 325, -3756, -3192, -1377, -3871, -1425, 12139, 12261, 5803, -4743, -11132, -8953, -7486, -1378, -653, 2281, -1073, -8282, -4725, 938, 6734, 9822]
15710I822l503p166m240J331j203M139L264q72l383K436K321M320J203l480n608
15695f19N653K374J757m218l719O06j708J675R39n334k016R16k488O42J579M513
15679E52n329q502p341j892N357O046l9j384O703N281L535j211m006o436P368
15664a298R68m164o554jQ896J629n307J884K290k259M320j605o925j451O801P491
15648D715J97n009m601k99m207K244J028M85N592L816M617j471j2852r259K023
15633a2981J111Q61K948q215P279Q51K939O153J765q89O541K588l650o691k63
15618C47j651J966K167J861l037J771l393j834L699K088P57K964p343l847K84
15603c201o837O23Q120N947K292N598p077p152l767R38K36J439J474J927K856
$$ y = [9822, 6319, -847, -5087, -3756, -4959, -820, 2444, 1572, -1811, 625, 2946, 7266, 8469, 4989, -619, 5034, 7408, 9165, 4947, 1228, 1834, 126, 1801, 2740, -2594, -4610, -3694, -6182, -5540, -3961, 552, -4777, -13279, -20620, -22512, -17155, -11109, -11148, -12532, -5829, -548, 2987, 1776, -2230, -8666, -1298, -330, -4494, -11048, -11049, -2153, -524, -5831, -3947, -1657, -3916, 404, -1201, -8126, -9577, -2776, 4715, 4912, -97, -4698, -4997, -9204, -6960, -5932, -5447, 145, 3961, 8578, 7107, -5745, -15004, -12981, -11870, -11009, -8061, -16276, -8997, -8146, -5207, 946, 2711, 1822, 8363, 10951, 7301, 610, 347, -1304, 662, 2829, 4690, 1653, 3424, 31, -1803, 1896, 3984, 4741, 7705, 362, -3485, -3201, -10038, -9415, -1295, 4652, 6944, 12542, 5465, -1687, -5454, -4516, -4280, -2841, -1367, 560, 3416]
15588C416L333L404n792O68L149l90l449o007L197K010m990m290K681O429J030
15573D399K771J771n690q021M972N770N06J428J127K570J936n621L000N851l681
15558A3088l157q372L911N223k275l335l821P93K506k619j534K424O63m212J827
15543A110N270K845l17R42K141j580K3Q22j578l156p52j524m881l012J944J479
15527b24l587M13L622N437N40q206K497N512r49J804j420n057M690n37M614j460
15511G689R68j668p573j853N215k76k782J363J922K30O549L689j046m304q344
15496b21K649K357N111K287o208j760Q83M534L093k195K792J261L43j444m213
15481I269k173P1M108P79N803k696j0386p38K238n22J41O56L65j131k294K742
$$ y = [3416, 6749, 10153, 4361, 5029, 8178, 7788, 4339, -1668, 1529, 3539, -1451, -5741, -3060, 3369, 4399, 7170, 8941, 3251, -4770, 202, 5972, 6478, 7906, 9033, 11603, 13539, 7918, 10918, 16769, 13088, 9931, 1559, 5470, 10693, 8418, 5083, 1262, 2055, 4561, 1942, 408, 2832, 3495, -717, 1110, 6380, 9225, 8908, 9850, 11991, 10411, 10434, 11256, 9678, 6522, 5770, 4246, -635, -3647, -1703, -224, -3811, -3398, 224, 5661, 6201, -2005, 492, 6004, 5055, 6859, 5439, 382, 5072, 4535, 9149, 7689, 8657, 6989, -584, -2437, 2778, 2502, -280, 1083, 3005, 3235, 9784, 13473, 12427, 8123, -221, 2428, 4785, 9896, 12183, 5975, 4215, 5098, 9632, 12725, 10530, 13322, 14583, 14926, 13482, 9269, 7096, 7167, 11275, 12054, 17857, 15161, 4775, 4037, 6275, 5753, 5894, 6550, 6915, 5784, 3490, 6232]
15465F232p08N44M121O807P0k211o315n402L9J32j461K143O931M486k895K812
15449A5325o86k998M246r70q82j113J56n89k665M058J987l955m755k004j187K580
15433F548k026n68R19L994N722L763J731l996o431j662m065j005j70K548q30J227
15417E699l292p95L659M422J3278N89n144k262N22p769M98o374K633j372j201
15402C091M374L083m964j350K716M714l664l613l085N824j262m814J420P005m25
15387I050j1733n90N29P6K853N339K193M540Q667R45l392k758l271Q249K277J417
15371B4391r75o878q84j992n114K970L220o451m960O44Q777K796o773n117M754
15356H408O444j797m617r01M994j140o607M718K054p151r363K067n67N216L408
$$ y = [6232, 5524, 6068, 10189, 16996, 17066, 14855, 8540, 3138, 3177, 3309, 1848, 3991, 10922, 15408, 12513, 15325, 14639, 11641, 15887, 14917, 14035, 12922, 13078, 12489, 9824, 13882, 15869, 11914, 7159, 5155, 3968, 6548, 4522, 3954, 4873, 8867, 14589, 18352, 20083, 16087, 9656, 7994, 3929, 2924, 2754, 5302, 4472, 5699, 2407, 1612, 5271, 9693, 22971, 23560, 18416, 16154, 16676, 8907, 9405, 3031, 5664, 4292, 3091, 7465, 10548, 5584, 4234, 6950, 11664, 8000, 4387, 1302, 7126, 5864, 1050, 2470, 9475, 9050, -2683, -3273, -2744, -2668, 185, 5524, 7717, 12257, 20924, 21869, 18477, 15719, 12448, 20697, 22974, 24391, 23416, 16538, 15654, 13662, 8548, 11518, 14738, 8287, 3327, 3971, 12748, 15544, 8771, 3654, 8408, 14852, 13055, 8438, 7537, 12531, 11391, 4784, 9502, 11556, 4405, -4958, -2891, -3458, 1758, 5166]
15341E166J050j510J672j190j056M054J0151l230l114j476m964k361K240o437
15327a005n773J2233Q884J761L142n66q555j923l578q126k0M897j058p626K037
15312e276J2638R322K743p068m234j66j637R824k231K506N032l477p574n121k698
15297B583O267L222j580m988P00p217j179N323O095N557j680n726k430R59L92
15282F298N233J678l312K124N494L590k597n849j0302n537k115r14M285N98R0
15267a236k224Q01O615R24L305l519J105m9K442k26K161O302l659k365O259o43
15251A5993o524M319K670q056k131K446O158Q32r363k956k670k827J011J660K253
15236B815O08J942p216k38J0366J473J054k874l472K166n925n707O60P392m86
$$ y = [5166, 6216, 4706, 6378, 5188, 4132, 8186, 18337, 15107, 11993, 10517, 5553, 3192, 5432, -1005, -6778, 5455, 14339, 16100, 19242, 18676, 10121, 8198, 4620, -3506, -3526, 1371, 313, -7313, -5276, 7362, 16684, 19427, 12359, 8125, 7959, 6322, 16146, 13915, 16421, 21453, 17976, 10402, 5281, 2583, 8850, 12072, 10492, 5504, 6204, -1013, -2192, 3131, 9226, 14783, 13103, 7377, 4947, 5906, 6298, 11531, 13209, 9897, 12021, 17515, 21105, 18508, 12659, 2357, -3180, -5295, -6209, -1924, -1326, -1236, -3460, -2659, 3956, 4880, 8185, 4666, 5771, 5722, 8164, 7938, 10099, 16401, 12742, 10377, 16636, 15993, 9469, 13788, 16458, 8402, 6271, 8717, 14875, 15707, 6344, 3388, 718, -2109, -1098, 562, 2815, 3423, 5365, -1851, -2089, 8277, 9750, 10804, 7930, 4458, 6624, 699, -5008, -4348, 3044, 2558]
15221B558m14L332O9o728J953o0L09n449n413P596M642n357k283k464j832O99
15205h842N817N388k027L028O845k122l593J20K001K461O39P83m102o963Q983
15190H416o6m699L755K7k977j207P94n232m084N580N668L642k370j0778K31P732
15174D432j127j852J328j528q06L593J917j930O603j284L367k519l829J030k867
15159D528l061J115n768l949M757P668L166j298M15o611j094L531m160l838L519
15144a080N4P81l583K51k51M316j090O707j857l219k613j262j724L014k064P466
15128C846K216q915o526O12L148L05K494j730L806P323k954L492M133k131n726
15113C393l359K872M989Q84m64k312k302N876l081r633N094J1127J49q218m259
$$ y = [2558, 2144, 5476, 5545, -1183, 770, 710, 1019, -4430, -9843, -2247, 2395, -2962, -5245, -7709, -9541, -8842, -3025, 2363, 336, 3364, 10209, 8087, 4494, 4614, 6615, 9076, 9715, 10498, 6396, -567, 8416, 8350, 3651, 7406, 7433, 4456, 3249, 4043, -1189, -5273, 307, 5975, 9617, 7247, -3531, -3300, 4432, 3305, 1453, 2781, 1253, 447, 4040, 5957, 4027, 10630, 9346, 12713, 10194, 6365, 7395, 4528, 1467, 2582, -3186, -7135, -2378, 5290, 8456, 7158, 7573, 962, -132, 3399, -761, -4599, -1080, -1026, -245, -3828, -3577, -3828, 488, -602, 6105, 4248, 1029, -1584, -2846, -4570, -1556, -3620, 3846, 6062, -2853, -9379, -8767, -5619, -5314, -2820, -4550, -744, 6579, 3625, 7117, 11250, 9119, 3393, 34, 2906, 7895, 8779, 8315, 6003, 3701, 9577, 6496, -3137, 1957, 13084, 13233, 5015, 756]
15098G56M25j45j180M390L15M839j414j075q66l701J548k848n87m173k855J317
15082e254j139k003M14j628N075J511p922N412M802k891l851j276j342J855O694
15067a543K436J292l875n111l287O102K097j44M240k89j702j846m951j948n81
15052i110n603m35N029L974N239J204l829J377j313J950L098K138n974m30O176
15037C491J172m389m355k558M597J578l852j597P302K970n507Q26k016l186M798
15022g26L182o56j012n690K167R352j880n308j042P184k453n800K496M502L056
15007G372k096O949P953p31o769L462j374k107K074J167R7j621j998k490q35p12
14991H341k589R90M022J521n532j981O848K345M30J11p697o138L816P707J999
$$ y = [756, 1181, 1036, -144, 4246, 4561, 9400, 7986, 6911, 6045, 2344, 3892, 1044, 457, -3716, -6571, -5254, -6393, -8396, -7982, -9610, -4535, -3024, -10946, -5534, -732, -3623, -7474, -8750, -10092, -8237, -1543, 893, 2185, -1690, -6801, -10088, -3986, -1889, -2033, 2207, 1918, 216, -1630, -6581, -8529, -9110, -14713, -15148, -10119, -6145, -906, 298, -3531, -2154, -3467, -1517, 1581, 3719, -2255, -2685, 3491, 4663, 274, -4081, -6639, -2042, -464, -4316, -5913, 1389, 4359, -1148, -322, -2338, -5524, -726, 2456, 1800, 788, -4902, -2735, 6617, 4737, -571, -1613, 5571, 3118, -2682, -186, 4316, 7372, 5276, 12225, 20178, 19447, 12678, 16140, 14766, 12659, 14733, 15900, 15997, 14376, 12378, 9888, 9053, 8341, 5752, 6742, 10764, 12285, 6753, 4772, 11620, 13965, 14395, 14506, 6809, 671, 4487, 12194, 14193]
14976A4193q445j601j086p36Rn924k106n269k286P736P422J494m997K526M767
14961E697J096k309l99j618J999J14J967J786j520j021o40P905M18m356q44o760
14945A515o090r37J676K220l48R903K039l922k068r84J861m265m231L553J643
14930A565q902m36Q448J995L236n987p445O417Q265m895q369k293r15p13j842
14915a1871Q125J539k879L749m60p735p162O581Q894M038q49k592K423O99l261
14900g61j028P61Q55J269o261J380N083p98J982n947m178j329p79M072K87j75
14884e567O828m103l687k290M976M181N25P00o0N86m83L972l13o388J167L741
14868C785O39p360l644J2498l434j2144p067L05K780O602O666j504J962L789N410
$$ y = [14193, 5748, 4147, 3061, 2325, 2334, -3590, -5696, -10965, -13251, -5515, 1907, 3401, -1596, 930, 5697, 6793, 4484, 4085, 2467, 4466, 4580, 6547, 8333, 6813, 5792, 5152, 13057, 13475, 9119, 8275, 1515, -4575, -5512, -3836, -1616, -1964, 7939, 9978, 6056, 3988, 3004, 4865, 600, -3631, -78, 1565, -7337, -7773, 675, 2670, 5906, -81, -7526, -1109, 7156, 2261, -6108, -8401, -9316, -10029, -11871, -3746, -2207, -5086, -1337, -1797, -9532, -16694, -10113, -1219, 2819, 1970, -622, 1801, 2500, -761, -1789, -1028, -173, 1096, -5165, -3785, 1298, 500, 2482, -3465, -7643, -8972, -9751, -5679, -5392, -5567, 1261, -2842, -6529, -8819, -3843, 338, 863, 1563, 1503, 2089, 1606, 5578, 5265, -1123, 44, 3785, 4424, -2936, -6580, 5918, 2484, -9660, -16727, -16422, -13642, -7040, -374, -1878, 84, 3873, 9283]
14853I283n070p099R62L436j145J459j273o147N351O264O08j523L185o26m894
14838B771l293l352n952N473L087O491l009n072L589O315L874p04L280j371j2119
14823Hl896Q34J593J498k318j30P269O227o077k421l190p398k755l635Q663P128
14807A400M366l40l849J891O80L420m88L189l559j3002k394K237M178k307K415
14792b163J377Q082J75j3n624n610K597L042r59o094N028M028M618J090j016n503
14776C055j332q390l080l194l103P526K029k47J040k093l212M901L872m81K364
14761c45M24j207m308N360L772m519j163O346R47n883K665K330l917l855L858
14746E05L49n468l463J575j38P90L230R52j76j111J983o04l635o236l441K876
$$ y = [9283, 4213, -2886, -1924, 1512, 367, 1826, 553, -5594, -243, 6021, 6629, 5106, 8291, 7665, 2771, -522, -3874, -9826, -4353, -1266, 5225, 2216, -2856, 733, 7048, 10922, 10218, 13498, 12127, 8, -3888, -3054, -1461, 37, -2281, -2411, 4858, 11085, 5008, 2587, -603, -8001, -10756, -14391, -5728, 1400, 5766, 5426, 1577, 3468, 4148, 7568, 7080, 10269, 6710, -6292, -8686, -6449, -2271, -4578, -2163, -786, 7296, 7471, 7458, 1834, -3776, -1179, 1863, 904, -5190, -162, 3866, 8484, 9574, 8558, 3055, 1723, -6667, -9747, -12941, -16044, -8518, -6489, -6736, -5696, -7789, -11001, -6100, -2228, -2709, -345, 79, -1128, -5436, -76, 3696, -823, -1986, 4360, 5307, -576, 2089, 4419, 502, -3353, 505, 854, -4614, -8077, -6502, -6640, -5850, -2620, -1668, -1844, -2955, -972, -1576, -5211, -11447, -14888, -12012]
14730a2012m221k69L911O939L308k872j0978L274Q112k86R640O691m243o971m642
14715d619J048K219j0813N368J0652j948Qj193j822j898j152R8K102m89J914P735
14699G210K646k92o605k355J686o234j074j152K16O371P083J64l020k454n998
14684c808k80q50m695L37Q638P278j148J555k83J308j183p81o514L436K686j421
14668D275m259l021n157l045k31K982R51M494N291K040o495r475r99O753q34j190
14652g920j815p475K39M042L767q48L780J881k923L438k586r015M536P835m03
14637c467L69M569N553O008j976j0345j1529j496l41K604M722M0N530J178m702
14622c283j728j086J568R88l746M79j144P334k088j542l822m435o98N248L359
$$ y = [-12012, -16233, -16502, -12591, -5652, -2344, -5216, -16194, -12920, -4808, -5094, 4546, 11237, 6994, 23, -4619, -3571, -1352, -12165, -6797, 3855, 1907, 1915, 722, -1100, -2998, -4150, -4052, -1950, -2439, -525, 7210, 9856, 9564, 2959, 604, 2290, -3944, -5018, -6170, -5954, 417, 7500, 7664, 4644, 2190, -3808, -4088, -4938, -9633, -9296, -658, 6620, 5472, 7027, 6744, 8052, 6869, 6088, -426, 3010, 5696, 4275, 16, -3005, -8162, -11207, -11438, -8456, -7505, -3011, 2280, 4320, -2175, -11650, -12649, -5896, -6730, -7920, -9735, -17210, -16971, -12929, -9162, -10010, -6230, -4349, -7272, -3834, -6420, -15435, -10899, -3064, -3467, -3098, 1471, 7024, 13032, 11056, 711, -10818, -12314, -12655, -10051, -5329, -5289, 241, 1419, -3283, -5011, -6097, -4529, -3541, -7287, -6808, -7952, -618, -2706, -4248, -8070, -12505, -13203, -7955, -4596]
14607d596o408J615P265p5M003N114N220k880n834n320J465j1213J090J0220P179
14592F845k183J125K042j318l946j594J505p802M93J0039P98n064J218q04n750
14577d396J071r04p14K248O583M135M017M530j243j0678j2495j161J943l496L254
14562g306R548n953p714Q83L629P457m379J709K591P39q818K013Q175r76r35k087
14546a424m78L448l138N068M708q576j2264p296J467M491j929J503O988K918m064
14531h578l064N091J2279k105J478J340l928l777l09L259N467k097J646o250p436
14516f984M399Q563J750o009p55J568L982J388n561j555k301J537L602M210k425
14501E409o141j820R33J898l873j267O71j776q87n300n765K194J061L386R039
$$ y = [-4596, -11004, -9389, -2124, -2199, 1804, 6918, 12138, 9258, 3424, -1896, -431, -11644, -10554, -334, 6845, 4662, 5787, 7829, 6511, 2565, 971, 2476, -5326, -4833, 5206, 6004, 940, 2158, 1354, -4396, -3325, -4229, -4943, -2695, 3888, 8023, 12040, 16570, 15327, 4649, -7846, -9007, -7064, -10560, -7306, 2242, -3711, -11425, -10542, -6913, 544, -3835, -2126, 465, 1204, -7614, -5601, 2574, 1598, 663, -1424, -1902, 1546, -1592, 3476, 8184, -392, -12656, -19952, -18485, -13994, -15923, -14420, -7432, -4514, -8578, -11642, -6551, 5728, 3623, 5101, 6441, 2513, -1264, -1573, 1686, 7153, 5056, 6702, 452, -6984, -2585, 5978, 7728, 1719, 964, 2532, 6514, 7902, 2341, 786, -1515, 22, 3624, 7834, 5409, -732, -2552, -1619, 279, -3594, -4861, -4190, -5966, -6853, -12153, -17918, -15724, -14663, -11277, -2238]
14486b238j606J697L427J234k081p825n567K820M299o75J884M079N912n225q019
14471g884o486k166Q065N145L344J124J5j31j318m650n808o61J744l106M750Q301
14455B78L857M813R68N72j014p252o752O470N076M928M960p037k999j537K776
14440H107n047l069l633L574N77k298L101P928j779q488J288j862l415j982M240
14425b758P589j901n614k497m493L618O419k400k604k044K91j041k644n70j10
14410a0759K452N354K801K204J884J0834J0596J1932J6637j996j7552j1002l261
14397B0124m081j1344k286J119N370L207n59n091l042k178J055k336j012r415
14383a0469l2R305l517q56M47j539M159N114O32k553R832O47m822k271J0197K963
$$ y = [-2238, -3844, -2147, 1280, 2514, 433, -7392, -12959, -10139, -5840, -6515, -4631, -552, 5360, 135, -7884, -14370, -16536, -8471, -3326, 18, 1142, 1157, 1026, -292, -4942, -10750, -11411, -9667, -12773, -8023, 278, 4135, 8948, 9916, 10488, 9474, 2222, -4530, 1940, 7016, 11944, 16904, 9867, 6868, 5331, 8107, 3060, -9, -3642, -68, 509, -1789, 1312, 9240, 7461, -1027, 261, -1601, -5016, -6998, -2758, 4831, 2930, -2684, -5181, -9674, -6056, 363, -2037, -4641, -6685, -6394, -7435, -10079, -10649, -10759, -8307, -2953, -152, 2052, 3936, 14770, 25366, 37298, 53935, 51939, 34387, 23385, 20124, 16043, 4699, 2413, 3532, 8902, 12109, 11550, 6459, 3417, 1239, 2294, -42, -1054, -10469, -10501, -1196, -4713, -5569, -5122, -6661, -2502, 2612, 3244, 691, 10523, 11170, 6348, 4077, 14274, 17237]
14367A7237m48L852p630l100O22O718J1687J2907Q906j1736j4219j6126m374p96
14353C500r704p618N528O033R810q01K140j174n850k282M808o77m546J775P699
14338H641p861k799P719L305m898j136m179j432L531j124o72K265O211K496k719
14323G348j042J854J191j866p882j0087k196P274J3228k659J746l006o506q792
14309a1395p86M538L934k388k273P024K767j410o477M027Q773j1438r582J567
14295a3119j154K757M174J736M46L666o07j0288J68M857M390N27N027l891m82
14280a793L024j337n364m68R587L515l077m409m39L54m002p14L467N352q88n19
14264B289L027p405L1M58K253q661M651O107K753j709r96q96P368N054n041L4
$$ y = [17237, 16789, 20641, 13011, 9911, 10533, 17251, 28938, 41845, 50751, 39015, 24796, 8670, 4296, 3500, -6204, -13822, -8294, -2261, 7549, 6748, 8888, 7714, 1864, -418, 4390, 3713, -833, 942, 8641, 780, -2019, 5700, 9005, 4107, 2971, -1208, -2640, 891, -233, -905, 1360, 7571, 10067, 7348, 6306, 8160, 9351, 7485, -397, -10484, -12680, -5406, 7822, 5163, 6909, 3903, -2603, -11395, -12181, -7643, -3709, -6097, -8370, -1346, 1421, 11, -6466, -2439, 6334, -5104, -14686, -13119, -14273, -11516, -7342, -5606, -5160, -1494, -2101, -12389, -12221, -7364, -2974, -2447, 2580, -1311, -1793, 1231, -106, -5470, -5938, 3649, 7164, 4087, -322, -761, -407, -4409, -5123, -1656, 3696, 2808, 2289, 5316, -2089, -2058, -1600, 653, -8008, -3357, 2750, 5503, 3794, 2798, 1902, 9270, 14324, 9283, 9317]
14248I317j38J582k570j598o423l605l685N78R976o460p278l075l563K236Q764
14233e942O019m37j921q069o794n846j19P569P547l79l974K124l18M640j255j213
14217h368R69k230q53M926M328M314j68J209L97n65R22l690r729o323P18K925
14201a1218L442P182K68n859L210L216J328Q9m525J687j413K613m438p980j444
14186a3842L725O92l202P097Q50o461M219N250k603J575j3j438l137p97Q693k58
14170C50k463m904J744M099n35k828o006k774n83N528L624j580k722L193J847
14155d010R058n229q882k287P994K710k950k003m871N88J1160N48p292K760l413
14140f119l364q153M928J0560q14j728o350K453M412J666K101k025o190k538N445
$$ y = [9317, 9179, 10761, 8191, 6593, 170, -3435, -7120, -6542, 3434, -3026, -10304, -13379, -16942, -14706, -5942, 77, -360, -2281, -10350, -17144, -22990, -23109, -15540, -7993, -8372, -12346, -10222, -10540, -5900, -7155, -8368, -7399, -9629, -10482, -5556, -1228, 3086, 2918, 4127, 4524, 3959, 4881, 1191, -8538, -14861, -14143, -11218, -7776, -594, -326, -6185, -2975, 241, 1569, 1658, -2867, -1180, -2593, 20, -4418, -12398, -13842, -10117, -9425, -12627, -5530, -4680, -11141, -6922, -1672, -4275, -2700, -2713, -4151, -7288, -8085, 608, 350, -2113, -7017, -5273, -1174, -1709, -4537, -10543, -13317, -13900, -8372, -4748, -6328, -9050, -5857, -4010, 5048, -181, -9063, -11350, -3356, -646, -3596, -5599, -10470, -9882, 1278, 1826, -5466, -2706, -6119, -9483, -17636, -12708, -2148, -2962, -4690, -11040, -8587, -4175, -2509, -408, -2433, -8623, -11161, -5716]
14125e716N927j223J62N751k35l118k370q495L843K263j997L766L557l252o748
14110g885M92O499J754K447m93l37o072o668m336P91M675O660k027N043O459L16
14094G318l049r563l368n474L64J211l741R24L097K570k650J201l587k527O529
14079a0745J4462K600o927o564K475N217k613N331k166n526p32K016O398l854
14065f28m338o5j288r71l016M554L899n15l783j36O73l54J027P493K555p235K195
14048F7K958M251l151r93j435l217j711n154R99k585k031j771j350l166O44O559
14032a1086K881R02J797L47k90k443k510k692Q2N790N22J099Q94J484J167r77
14016c033k494j081k523Q23L485P604m342j070L364K283n669k788N997P304o46
$$ y = [-5716, 211, -1012, -850, 4901, 4666, 1548, -822, -9317, -5474, -3211, -5208, -1442, 2115, -1137, -7885, -7393, -894, 860, 3307, 2814, 2477, -3595, -10263, -14599, -13808, -9133, -2473, -4500, 543, 7002, 7318, 4269, -5294, -8662, -14136, -13772, -12561, -16302, -15378, -12281, -9711, -12361, -11160, -14747, -17274, -10745, 3717, 6317, -610, -7174, -4699, 518, -2095, 3236, 1070, -4456, -5188, -3172, 3226, -628, -4966, -5031, -6319, -7290, -10306, -5752, -1853, -2368, -6151, -6287, -5614, -5968, -4941, 2552, 5107, -2128, 67, 3025, 7276, 4125, 3132, 1697, -1520, -3231, -8385, -7386, -9971, -12002, -13773, -15123, -18289, -17645, -11086, -8205, -7303, -5506, -5159, -5449, -7892, -10402, -13094, -13012, -7222, -6700, -5601, -4707, -3223, -2056, -3033, -5527, -6608, -9131, -8308, -4823, 2781, -1561, -2631, 733, 3016, -2653, -5441, 556, 7860, 7214]
14001G214l867n632j889n731q25J522k30m291j310j744O046N381J111L818L116
13986B689l764L027K148l544l34j907j099j51J502J836K339q56l260l357M02L684
13970f45L320M446k284n101k976q83K954K534j0981l167N636M803l20J572M452
13955C360J515j245k954k988J632R73k223O594Q95K869K24p912k990m793M170
13940b873k92k178j347n68P33p57n331j792M487P21O582J4941m211q860o004K521
13924d228J102n120O831L65m370J539j459k598r99N241P523r70p099j465K68k54
13908e693K108Q207J979l971J347O586k390l225N48j101r27N506J834k953n267
13893B588l145r66L062o998n486R547M466K63k924l458J07L99k037J165M966P38
$$ y = [7214, 3347, -2285, -4174, -9905, -10730, -9208, -9438, -13729, -15039, -16783, -10737, -5356, -4245, -427, 2689, -1075, 1952, 4100, 556, 222, -1685, -2784, -2935, -1433, 403, 2742, 1886, -1374, -4731, -4329, -645, 2675, 7121, 4837, -264, -3240, -4123, -1169, 1365, -9616, -12783, -7147, -2344, -2664, -1092, 3360, 4875, 3630, 676, -2312, -680, 293, -1930, 4664, 5559, 8428, 8652, 740, -2250, -7043, -2873, -3165, -5343, -6690, -7258, -6525, -7282, -12613, -14405, -9918, -9197, -2615, 12326, 8115, -745, -6749, -4228, -3126, -8246, -1415, -1050, -5420, -3881, -5340, -7938, -8937, -3696, 3827, 2857, -4242, -5707, -5439, -5693, -3585, 4622, 6601, 2630, 3977, 10563, 8173, 4948, 5496, 4395, 3468, 8974, 10808, 7855, 2588, -557, -1523, 1539, -5459, -10945, -1398, 3068, 3331, 407, -3051, -2944, -2545, -4582, -3417, 1549, 2287]
13877B287l551n720K108P075K429j748M414J238o11q575L05N275J238k569M02
13862C997O60r127m940N466Q415J071m602M063m672K90L379m001j984K026J257
13847A298P17L05L229k00K151J197j0428O60p166l206O880K687l709L839Q100
13832F354R01M354k220m067o601o356L235J3350j588l503l42m535m602J366N333
13817A079K116K723n285K20r88j735n11k817k324l570J368R552N54o863n741j494
13801a3716O960j716Q11L827L578L636n456m574J145K024P548M318j67j65k622
13786E431j906p4M634p17K926k305l173n996m22j158Q038M377j223M919n013r751
13770a413l679q10k103k600j297N786J1697M663M554j451q649m050m393j141n331
$$ y = [2287, -1264, -6984, -4876, 2199, 4628, 2880, 7294, 8532, 7921, -654, -349, 4926, 6164, 3595, 3997, 4657, -4470, -9410, -3944, 4471, 5542, 940, 5003, 331, 621, 4000, -1, -1985, 41, 1298, 2015, 2320, 5549, 5349, 7500, 8697, -1731, -1071, -8237, -11443, -4563, -1876, -5585, -1746, 6354, 7255, 11609, 9389, 5322, -1279, -7635, -4400, 8950, 7362, 3859, 3517, -1018, -5620, -4254, 1079, 3195, 5918, 633, 853, -135, -1870, -2381, -5198, -7522, -11092, -9724, -172, 382, -6481, -12222, -13716, -6756, -8472, -7661, -3834, -256, 3380, -2076, -6650, -5505, -3481, 4067, 8385, 8218, 8053, 5431, 3525, 3451, 8085, 7368, 10294, 7989, 4816, -1180, -1602, -2760, 5278, 9655, 8432, 13351, 8338, -1413, -5092, -5902, -8005, -10605, -11902, -6116, 5581, 10244, 14798, 13347, 4698, 648, -3745, -4886, -10217]
13755a0217o603j561j567P718R120n225q755l6J0513O668l115J4k31L504p22N749
13739E254O191n898J7o070k124P082L280k291n528M312m849n320j061K992K375
13724a638m144o50J774Q686N869l758j940M316J9o388K799K561m985K492k395
13709B618j913L051J258j775r76l180O860q53n438j456N538m009q56p411j643
13694a0185P619M227M181k530m617l631k152n018l602M435M051K719P51J494Q31
13679a427K006l162p499M43J703q24N312R487Q3l262J18j672M669j021L847K494
13663A1295j028k860r9O598o572q83k761j721o142q609L336J784P92J854n16N939
13647D07J029J299m035m902O860P358q62k869M628L487M249n267p507q534k788
$$ y = [-10217, -16820, -18381, -19948, -12230, -3110, -8335, -17090, -17126, -6613, 55, -3060, -3046, -3277, 227, -495, 5254, 11445, 5547, 5564, -506, -2630, 4452, 7732, 5441, -87, 4225, -624, -5944, -7005, -4013, -1638, -5782, -6432, -4658, 4028, 9897, 6139, 4199, 8515, 8534, 2146, 4945, 7506, 2521, 5013, 2618, 705, 3756, 5014, 3239, 2263, -917, 5943, 5090, -348, -1804, 3734, -275, -1131, -8542, -10185, -2566, 1661, 5842, 3312, -1305, -4936, -7088, -12106, -15708, -11273, -7222, -4503, -3752, -2258, -1427, 579, -2583, -10082, -9639, -7936, -8760, -3448, 6039, 6122, 2860, 2978, 1306, 5975, 4954, 8801, 11295, 10267, 7407, 7308, 13906, 7334, 6451, 3690, 1969, -4173, -12782, -9446, -7662, -6870, -5016, -5532, 407, 1436, 2735, -1300, -6202, 658, 8016, 7154, 4285, 8913, 12400, 16649, 11382, 3875, -4659, -7447]
13632g447J977l687k869K610j825Q47Q37p269M384J1184N051M468k768N05l641
13617B357j888J909q22j693j163J713p45k394K165J270q36P76L206j020L50k382
13601H03k248k269l226l895J439K426j035m54J990J260J049k337j461l233N872
13586e319j318n485L155P411N58m875l399k938N129J1931J119l285K92j586j871
13571d81q43m932P182L994m419J336k736K445K285n584l440O067L497q361o034
13556a0024j018l041J2o52J835R363J479N82l092m546j439J066K608Q163N571
13541F867n75p39k525N39M593J424q410k718K413L769j839o553L81K311L800j283
13525A455r3k100r08M47J334K745K072k727M50J582j551k042J693j035k443N215
$$ y = [-7447, -5470, -9157, -12026, -9416, -11241, -10394, -9557, -16826, -12442, -1258, 3793, 8261, 5493, 5998, 2357, 469, 2378, 1556, -137, -1300, 413, -332, -2726, -561, 709, -127, 649, 3855, 2835, 3185, 803, -1445, -3714, -6940, -10835, -9396, -6970, -8005, -8459, -6469, -5209, -4160, -6497, -7958, -11191, -5319, -6637, -12122, -8967, -1556, -998, -5873, -9272, -12210, -7081, 4850, 5969, 2684, 2976, 1390, -481, -1324, -6256, 926, 4920, 501, 1837, -899, 1546, 3831, -1753, -5193, 874, 4371, -3990, -10024, -11042, -14083, -14071, -14723, -12888, -3525, -2046, -1464, -4556, -9102, -10541, -9475, -6867, 1296, 6867, 6292, 5553, 3028, 3567, 8160, 9584, 1174, -1544, 869, 4638, 2799, -3754, -3373, -1062, 2738, 1455, 1362, -738, -1646, -1199, 135, 2880, 4952, 2225, 2675, 4257, 2706, 664, 2357, 1322, -1121, 4094]
13509D094K654o985j1679j223j92R008M589O049l462m074l710M452L805o870o860
13494a0404J725O164Q212K733M96L045q100o249j45L439L080K94j208r471K47
13479f142J086m559j313k460N273J917R19L261j065p42N132l206m636m07J596
13464e346J925J841M965L311K019n170r064NL655L465l84Q02L768k028J177M29
13448E370j751N37o271j905O0n088L780j272j621O396M056L254j709j3258n020
13433a4442k011K035R360J4189Q2o138k024K741J0153l165r950q264O93J0865
13419D124O362J063O59K956mj0080l655j837M647j334p86n586J257m841o018L729
13403i344O795n30k772j212P053j960j729j7R82M985N725M489n075k612k377j0238
$$ y = [4094, 6748, -237, -11916, -13139, -13331, -4323, 266, 6315, 2853, -1221, -4931, -479, 3326, -3544, -10404, -8679, -2515, 5697, 8430, 8926, 11971, 3871, -2378, -2523, 916, 3996, 4290, 3082, -6389, -6142, -5056, -9615, -10928, -13388, -8115, -6198, -5279, -2018, -3083, -3825, 1307, -1899, -6535, -6942, -5346, -3421, -1580, 3385, 6696, 8715, 3545, -5519, -5514, -1859, 1606, 1222, 2024, 5792, 3764, 4941, 5370, 3619, 4156, -2115, -4020, -3960, -9048, -5268, -6540, -8161, -1765, 2291, 5545, 3836, -9422, -14442, -16453, -14418, -5058, 9131, 9213, 3075, 1051, 3792, 13945, 10780, 830, -7434, -6741, 4124, 10486, 11549, 12208, 15164, 15160, 5080, 1425, -412, 4235, 2901, 2115, -3471, -2214, -7055, -13073, -9344, -2549, -3079, -5851, -7063, -10, -1970, -3699, -3716, -2734, 2251, 7976, 12465, 7390, 4778, 2401, -7837]
13387g837m075j42M110O0l697j237Q417L442L42n869J836J037j076J0526M031
13372I868p737p373k429k03l30J945J431o8p40J305N94j907j020L589J796K495
13356A216J041k309J410p2p097n62j729j643j259L989K826K533M64K745j1072
13341i519O433K372M560q3q79Q92L631l001m904J9J670J300k431j171L231L372
13325E492n111o358r373O802O685J123j0827j379O036N030L000p240j200R043
13311A723k90l214j947K18J082o989k036K852l069L920Q009q59n270l814l178
13296a2862J666J452l493J0002N210O460p115p974j405R551J201J654j834p99
13282A714M37P800K204Q10k728m135K145M68l43m98m468n62O69k261J305k236
$$ y = [-7837, -11912, -12054, -7944, -7884, -11581, -12818, -4401, -959, -617, -6486, -4650, -3613, -4689, 5837, 9868, 2131, -5242, -7671, -7874, -8204, -6259, -4828, -4896, -5636, -4331, -3737, -5644, -6664, -3075, -1279, 1216, 2257, -52, 1358, 1286, -5811, -6373, -8102, -9745, -11004, -7015, -4189, -1656, -1192, 1553, -9519, -3086, -714, 3846, 3763, 2884, 3776, 7407, 4406, -498, -479, 1191, 2491, 60, -1111, 2120, 5492, 381, -5977, -15350, -8548, -1863, -740, -11567, -12946, -6910, -1880, 1120, -6120, -7320, 1723, 1433, -1781, -3728, -3510, -2428, -9417, -11453, -8601, -11670, -7750, 259, -600, -5870, -9684, -12862, -11196, -9744, -13237, -3235, 1975, 8435, 1320, -6654, -8059, 1492, 2693, 4347, 2513, 1714, 2151, 9951, 12155, 12965, 10237, 6102, 8247, 8715, 8372, 7874, 3406, 2844, 3513, 1252, 2557, 321]
13266C21M78m180K794J113k871j063K350N352J382K416j172k582K781K847o594
13251C372p737J913K459K199j162q855p41N369L578o22p07k332j607M193J974
13236A294j57j790j230l663J954L145l692K238k607n08K040N68n57N106L146n250
13220C7k33Q067M134o898r039j146N578M45k317N141N886N774l240n584k336m941
13204f72l432L292J0457r89r705l947L055j231j454l350k189P46R151L539m348
13189a077J04L999L170n960j852M233k981q7j913L708j568O058M87p903q09P800
13173E409j800q206J17o77m428m381J0582J1769K312m100J022P83q98L52L563
13158A1419j909o50R64k277l617j379l556m943k52m644P2P184O617M739r083p506
$$ y = [321, 799, -3381, -587, 526, -2345, -3408, -1058, 4294, 5676, 8092, 6920, 4338, 7119, 9966, 3372, -4365, -2452, 7, 2206, 1044, -7811, -8552, -3183, 395, -227, -934, -3266, -4873, -680, 1294, 1137, -653, -1883, -5546, -3592, -447, -4139, -1901, -4508, -5016, -2976, -2408, -2965, 2141, 5287, 37, -196, 7871, 12005, 5107, -3932, -5078, 500, 945, -1372, 3769, 9655, 15429, 12189, 6605, 4269, -672, -4104, -812, 9645, 8656, -1049, -4996, -1941, -3172, -4626, -7976, -10165, -9419, -268, 3271, -1077, -973, 3026, 6196, 236, -1616, 2617, -364, -451, -2364, 1344, -224, 5834, 6321, -1582, -2391, 5409, 3609, -4597, -4480, -5157, -9585, -13966, -3384, 8385, 10697, 6597, 7619, 8402, 7504, 7856, 11419, 9510, 8860, 9824, 7547, 3930, 2551, -1005, -5948, -6200, -10844, -10772, -3588, 3029, 7768, -1315, -8821]
13142h821N705P036N479l979j1169q127P826L109O399L325n976l839m076M884
13128b224K115L632n816o921L195K847r52N272P873O106m553J294n023p222l881
13113d258K148K098j814L40P099L794k548p641n51K275N995l785q969K35Q298
13098B716P90R11M162l342M27N989R22j764J308K402M081k074o810l438l041J472
13082D711K742n383m207P60M406M138K772m541n372L726O738N106n627n679J511
13067E801k667l701o38K737L982j614n679o177K15P750Q237k571l808j763J023
13052A127L647N820K120p01l109L67m21j309k812l414j322m875m662Q001Q321
13037F778J579l22L685O32l479J305O592k474r3n636j200j309K782n155l080N249
$$ y = [-8821, -3116, 3920, 9399, 5420, -5749, -13876, -6050, -2941, 3458, 6783, 807, -3032, -7108, -2224, -109, 3523, -2293, -9214, -6019, -3172, -4124, 1148, 9021, 15127, 10574, 11868, 6845, -377, -4258, -2110, -12, -1826, -1486, 5613, 9407, 6859, -782, -1333, 942, 6937, 3152, -5817, -5582, 2716, 3506, 4417, 8579, 5237, 5664, 11653, 12575, 10811, 12119, 14521, 18602, 16528, 9718, 6280, 3239, 4711, 7453, 2070, -2137, -1377, 3029, 7167, 9939, 5398, 26, 3752, 10490, 15596, 9969, 4290, 5801, 3134, -567, -1205, 1532, 5514, 3900, -1779, -7956, -7741, 9, 8246, 5675, 1867, 104, 1127, 4774, 10594, 12714, 12013, 8904, 9271, 8850, 7541, 4729, 1315, -7, -4882, -9544, -1543, 6778, 8357, 8035, 11720, 12352, 8873, 10178, 16770, 14296, 14203, 8567, 7367, 6058, 8840, 3685, 605, 5854]
13021E854K978j485n90m979Q299L825p309l699m33m795K14N453p08p194j435k133
13005h137p39K589L683K453l782K277N996l407j856J999J243K394M209N599O64
12990A5185j1651K9Q433J077l998k710n75L359j058k633J416M817k545r38J886
12975A0094J58m537l966o71n233L525K301m020j627n647j791J569M524j284k833
12960i438j211L950M227J419k353J981K268L48k570j458J676J491L6k458L079
12945I87M412N565k985n243l700j505k940O627J306m806J447M343k437j0539n106
12930a4574L365Q711L930k787L398j719l333n626J660M014K643n564l88m044J094
12915i220N206o65L65k59K730J683Q03l804j693K041m038k274l786P057P286j475
$$ y = [5854, 8832, 7347, 6757, 1778, 10077, 13902, 6593, 2894, 2461, -2334, -2120, 3333, 2625, -4569, -6004, -8137, -8876, -6287, -2604, -151, -3933, -1656, 4340, 933, -923, 1076, 2319, 4713, 8922, 14521, 15185, 3534, 3563, 11996, 13073, 9075, 6365, 5790, 9149, 8091, 5458, 6874, 11691, 9146, 8208, 10094, 10252, 5715, 1749, 1078, -4155, -630, 1671, -2349, -3976, -9623, -11414, -9845, -5321, -6605, -9438, -10649, -6699, -2472, -1053, -3406, -1425, 843, 1191, -1379, -2837, -1161, 330, 366, -2092, 987, 5399, 10964, 7979, 2736, -964, -2469, -5409, 1218, 2524, -2282, -835, 3508, 1071, -9468, -14574, -11209, -2498, 1432, -1355, 2043, 324, -3009, -8635, -6975, -2961, -318, -5882, -6270, -10314, -9220, -4014, -4679, -4314, -4573, -1843, -160, 643, -3161, -4854, -2813, -6851, -9125, -12911, -5854, 1432, -43]
12899d3j683j341J410J1337K368r189k549n861j545K265M280N069J931O377L945
12884A6771m309m559q044l668N698M651N89K554L651J374j073k623r45m268j461
12869D338K657K256k031k566l547j258j40k257L591M808J0739L880n085q812p856
12854a283l442M740l24N491J383O190K13J500M83J101l737L847L02l418K168l802
12838A1412q899K170o87J236M694k593o852K219n927k421M988K997K730N300K175
12823A2542Q19K230Q1o066o40P424q19l728n327l923k148k886k924J844L278L116
12807B873J469o982j488K436m345l806l40M28n76L381K619N428J498K323j267
12792C651o15L121q363q334J918M142M336K871r97j605m168L13N418m609q03K363
$$ y = [-43, -1726, -3067, -1657, 9680, 12048, 2859, 310, -5551, -7096, -4831, -551, 4518, 6449, 12826, 16771, 12462, 7903, -141, -3809, 1889, 6540, 7129, 9683, 13334, 14708, 13635, 11012, 10067, 5799, 4338, 6995, 9251, 7220, 4654, 1107, -151, -291, -2548, 1043, 5851, 16590, 20470, 15385, 6573, -1283, -4725, 15, -309, 5182, 6565, 12755, 12968, 14468, 14951, 16052, 12315, 16162, 16464, 13046, 15214, 11412, 2513, 4683, 3996, 5232, 9926, 7333, 481, 2700, -3227, -5648, -660, 2337, 5067, 10367, 12542, 13361, 15591, 15672, 9606, 8966, 16390, 15571, 11843, 6516, 2593, 445, -2441, -5365, -3521, -243, 2873, 4342, -2640, -4128, -1692, -6037, -9843, -10183, -9755, -10331, -6950, -4331, 1097, 2595, 4918, 3651, 3036, 6157, -2206, -10540, -8622, -4480, -144, 2727, 1730, 125, -4043, -3730, 1688, -2921, -3724, -1361]
12776a361L624M833l998q249J639j396J43K586N320J998K380j52K182K126l727
12761G948l226j539j094O07L861L424q788k640Q66K363k221j365K616j884K953
12746A881K427J825K797n243J26R36l135K484m439k434Q25K280L067K18R88K021
12730F624K44K648K139j405m133O086L175l549j515j869q47l382k641l113K888
12715A350M065j480k846n477Q38L135J52R37M019l865j233N382O301J426j4962
12700b258k538J741r28M279M656k453k895L130o46n505Q864m455k412J887m147
12685c680r870N539O594p017o571J600J0472O416L49n799J7m396l75K783J9k012
12669e931P523L26R501L160L856o172j0445l878M704n212j331p13n43j39m258
$$ y = [-1361, 2263, 7096, 3098, -5151, -3512, -4908, -4765, -2179, 3141, 5139, 7519, 7367, 9549, 11675, 7948, 4722, 3183, 2089, 2696, 6557, 9981, 1193, -1447, -581, 1782, -439, -1804, 812, -1072, 1881, 4308, 6133, 8930, 3687, 3813, 4749, 1614, 4098, -341, -2775, -1950, 330, 3397, 3615, 4603, 6624, 6868, 9516, 11655, 10250, 6117, 12203, 15378, 11829, 10314, 8445, 7598, 4216, 1575, -1538, 1350, 5415, 3935, 1089, -4388, -3550, -415, -263, 674, 4693, 828, -405, 4977, 11278, 12704, -2258, -4796, -3055, -3983, 296, 4952, 2499, -396, 2734, 2088, -3417, 5447, 992, -1420, 467, -3680, -13550, -8011, -1417, -8434, -15005, -13405, -2933, 3483, 3832, -1967, -1950, -6346, -6721, -3938, -3919, -5931, 1592, 1918, 11419, 14579, 18435, 12263, 1818, -2060, 2644, -2568, -3899, -4612, -5155, -5294, -9552]
12654i552q86M907j81N711J280K234M231L71k993M654K727q821j2051N61Q329
12639E21L00Q086O619j931n049m055LM325o531j092n358k963n942q1P405P412
12623A669l799J899O191l303j441J958L585j244Q46K373q3R3L657L222J036j170
12607A5489k523m698R407K628o782K982k68j049l28M265j32l135R046Q327M279
12592C7508L425N489J8846M654j1190q508k682n75k473p885q359m292k298j677
12578A9983j700K736J2888N996K621M84L92l206M201k39N026N913j184O562J116
12563F1589j793r3j37o384m307L375M268P064k612l443O282Q853J1747R770J7558
12548A11737L9827K7810k2795l8398k1782n766m691q434p931r454q062k283L721
$$ y = [-9552, -10438, -5531, -5712, -1, 1279, 3513, 7744, 8115, 5122, 9776, 12503, 3682, -8369, -7808, 521, 821, 8907, 15526, 13595, 8546, 4491, 4494, 8819, 2288, 1196, -4162, -7125, -13067, -13148, -5743, 1669, -2130, -231, 5960, 2657, 1216, 3174, 6759, 5515, 6361, 8734, 8651, 8744, 12401, 15623, 16659, 15489, 12966, 8268, 17675, 20303, 13521, 16503, 16235, 15186, 14858, 19123, 18991, 15856, 24902, 33229, 37508, 40933, 46422, 65268, 69922, 58732, 50224, 47542, 46967, 44494, 36609, 28250, 23958, 21660, 19983, 18283, 21019, 33907, 39903, 42524, 43008, 43400, 40194, 44395, 44156, 49182, 55095, 53911, 60473, 61589, 59796, 59703, 59566, 53182, 48875, 52250, 56518, 63582, 60970, 57527, 63809, 72662, 84409, 94179, 111737, 151564, 179374, 156579, 118181, 96399, 90633, 85942, 77508, 69577, 60123, 52061, 49778, 53499]
12535E3499P99M898M975m05j242q246j0635j79J430j2758j1989Q60O111R260O546
12520D2924l871o595k231J345l391n090O892Q244P808L791N069K752k739M874
12506E9782J0845O547j0719j8345q155q566r374m174L445M267M514m805o696o07
12492A7959j064J028l582o153o709j340j753J9R607O191L816K444Q121J1026P345
12477D6955j8021j2742j0859l894M043O068J291J404O8m785m412P251K842j164
12463A4045m395m436k285r49j175n422K661L472J608J574j507k11L798j495r381
12448d098r2N617N798K238k267J169l848L325J881l792k000J529L391K117n449
12433E519m952l040M056j541M918P922J674L44l62l132l080o198J176N92L246
$$ y = [53499, 54298, 59196, 64171, 63766, 62524, 54278, 43643, 43464, 44894, 32136, 20147, 21007, 27118, 36378, 42924, 39053, 32458, 30227, 31572, 28181, 23091, 29983, 38227, 46035, 49826, 54895, 57647, 54908, 59782, 70627, 77174, 66455, 48110, 39955, 31389, 22015, 17841, 21286, 25553, 30067, 25262, 18566, 17959, 16895, 17923, 14341, 8188, 1479, 139, -1614, -1595, 8012, 14203, 18019, 20463, 28584, 39610, 46955, 28934, 16192, 5333, 1439, 5482, 11550, 12841, 14245, 14313, 9528, 5116, 12367, 15209, 14045, 9650, 5214, 2929, 1980, 805, -4617, -1956, 1516, 3124, 4698, 3191, 2980, 6778, 5283, -4098, -4190, 1427, 7225, 9463, 7196, 8365, 4517, 7842, 9723, 5931, 3931, 5460, 8851, 10968, 5519, 567, -2473, 1583, 42, 4960, 12882, 14556, 14900, 14538, 11406, 8326, 2128, 3304, 3896, 7142]
12418G142J806N264l588J828L568q202r75M413J691k241K06l363n204j820K020
12403B545l391M322o24m336l853P653J039J904N08J597M325L024p775R08l038
12388D808o75O008O805Q667P517J647o934p755n524n110Q00K759m72k988o097
12373C456n874n74Q401K889l190J385K514p21m16l379p16j270J701N179O642o725
12357I302j1880p86N406N007R356j00n973k326L59n372J379M958j893m888L300
12342E849L282m314Q32k312k927L559m75k995M994o028l168M142j257k62L068
12327A988K762M541m047n127P43m189L427K537L833l520m75j971N733O375K475
12312A5085o06j271k261k479j176n573m997J0201j499n99K282N435j050j058K74
$$ y = [7142, 8948, 14212, 10624, 12452, 16020, 7818, 6843, 11256, 12947, 10706, 10912, 7549, 2345, 525, 2545, -846, 3476, 2852, -1484, -5337, 2316, 3355, 5259, 5767, 7364, 11689, 14713, 6938, 7846, 4808, 4133, 10141, 16946, 25613, 33130, 34777, 27843, 20088, 14564, 9454, 10254, 13013, 12541, 9553, 3456, -2418, -2992, 5409, 8298, 5108, 6493, 9007, 8286, 7870, 4491, 3775, 2505, 4206, 9385, 16027, 9302, -2578, -3364, 2042, 7049, 16405, 16305, 10332, 8006, 8365, 2993, 4372, 9330, 7437, 2549, 5849, 9131, 4817, 5649, 3337, 410, 3969, 3494, 499, 5493, -535, -3703, 439, -818, -1080, 1988, 4750, 9291, 5244, 117, 860, -3329, 98, 2635, 6468, 2948, 2473, 502, 6235, 12610, 15085, 14479, 13208, 10947, 8468, 7292, 1719, -3278, 6923, 5424, 4825, 7107, 12542, 11492, 10434, 10708]
12297A0708m004l969l488k033r77J051L08j19j227M766N997J216n047j428m700
12282b946n899K082J2499K080l749M31K912K447k314m693k47R383N347K04K343
12267A9880P50J50K31K980o840j0840n57P88l027m149n594j620p323L185J0017
12252a969N288l986M37J2304M947j232n56j3514p483j913O856M77Q455N879m899
12237I091n281J763L135k67j2067k054P589K454j0733k008K699P600J657O188
12223I766K17n911q384Q775R829J122m922K758J2344O208n546j5133p258M406
12209H271o178l867O764K278J61k857j42K785k998K421l612p854n928J719M371
12194d666P803L694M847l76m176r770L886M219L543J0739J2728J938n063j0125
$$ y = [10708, 6704, 2735, -753, -2786, -3763, -2712, -2404, -2523, -3750, 1016, 7013, 8229, 3182, 1754, -2946, -8845, -6763, 5736, 7816, 4067, 4498, 7410, 9857, 7543, 2850, 2603, 11986, 17333, 17537, 19880, 20630, 20780, 21011, 23991, 17151, 6311, 5754, 6542, 3515, -634, -6228, -7848, -15171, -11986, -1969, 3319, -667, -230, 12074, 17021, 15789, 15233, 1719, -5764, -7677, -821, -344, 8111, 13990, 9091, 3810, 5573, 8708, 8441, -3626, -5680, 1909, 4363, -6370, -8378, -5679, 1921, 3578, 9766, 9983, 4072, -4312, 4463, 14292, 15414, 10492, 13250, 25594, 31802, 26256, 11123, 3865, 8271, 2093, -1774, 4990, 7268, 7429, 4572, 4430, 7215, 4217, 6638, 3026, -4828, -10756, -9037, -4666, 3137, 6831, 11678, 11302, 7126, -2644, 1242, 5461, 9004, 19743, 32471, 34409, 29346, 19221]
12180A9221o643R94N067k299R00n952l610k454n445R281M145K35m390m236N78
12165E392j684l907j819p652q8O706P020K054m66j889j898l738J0524J05Q39N599
12149A5098M856j538j1488o710m634p16P277N178O33N661O17j023L823m56l64
12134A6214q26m730j039m774k479M14Q208M397m177j442M503q24M151o170p723
12119C703J641M892L08K86l225k143M574L227K794L25j0124l568P274l716n819
12104D29N672R209k341o294m699j478m035l519j14q67N740O110J742k42N75m903
12088I85k390K034N180o55M3J256p624n415L43P581O337m258j692J913k865j296
12072e23l050M326N170O1k280N506n545q02J4R03N382J812J693M227L292p414
$$ y = [19221, 12578, 13572, 18639, 16340, 17240, 11288, 7678, 5224, -221, 9060, 13205, 13440, 9050, 4814, 5392, 3708, -199, -2018, -9670, -9758, -3052, 3968, 6022, 5556, 3667, 1769, -1969, 8555, 8660, 9499, 15098, 19954, 18416, 6928, 218, -4416, -5132, 2145, 7323, 7956, 13617, 14234, 13211, 17034, 16578, 16214, 15388, 10658, 9619, 4845, 2366, 2780, 10988, 15385, 11208, 9766, 14269, 13445, 17596, 11426, 3703, 5344, 10236, 10544, 10830, 7605, 5462, 10036, 13263, 16057, 16382, 6258, 2690, 9964, 6248, 429, 6101, 15310, 12969, 6675, 1976, 498, -3537, -7056, -7170, -8037, -2297, 3813, 5555, 5313, 5888, 985, -1405, 629, 5809, 5154, 5197, 6453, -1171, -6586, -6243, 1338, 7675, 3417, 1725, 3638, 773, -523, -3573, 753, 5923, 5984, 3704, 9210, 3665, 2863, 2877, 3780, 9162, 10974, 12667, 16894, 20186, 12772]
12056A2772l856L368j421k094l170n099L878N772M151j293r276J697J389M831
12042A1649L585j810N012k826k219m214m85k822m307J362K65M415L098K420k140
12027A0983j826l772k470k65N088O816j206p587j61j014j559P53O937K89n160
12012E846Q05K585k36l781j534k942J172L109Q900J981m577M854K103o664k365
11997I256M265L60j891j800O8L01M136M968N95L815l143o616k875o679k578j845
11981C37k576L024M077k75J385Q189R55m272m529N58J0099J611n203p486k242
11966C652l660J395l408M519l35l237M843R788L911l577p132Q40K584j762p02
11951G719l191o891l698M053O4L022J736N648j123o321j96P017n466m32M013M680
$$ y = [12772, 8916, 12284, 10863, 8769, 5599, 500, 4378, 10150, 14301, 13008, 3732, 5429, 6818, 11649, 15234, 13424, 18436, 15610, 13391, 9177, 8692, 5870, 1563, 2925, 3190, 7605, 10703, 13123, 10983, 9157, 5385, 2915, 2650, 7738, 14554, 13348, 5761, 5600, 4586, 3027, 3780, 10717, 11006, 5846, 6651, 9236, 9000, 5219, 3685, 743, 1915, 5024, 13924, 15905, 11328, 16182, 18285, 11621, 9256, 13521, 13881, 11990, 10190, 10258, 10559, 14695, 19663, 20258, 24073, 20930, 14314, 11439, 4760, 2182, 337, -2239, 785, 4862, 4587, 5972, 14161, 15116, 10844, 6315, 6873, 16972, 18583, 13380, 5894, 3652, -8, 1387, -2021, 2498, 2163, -1074, 3769, 13557, 17468, 13891, 6759, 7599, 10183, 8421, 7719, 4528, -2363, -6061, -2008, -1944, 1078, 2814, 8462, 7339, 1018, 822, 7839, 2373, 1941, 5954, 10634]
11935A0634K208o051r649j407l132J686J0099O169q54j331l720k022j950m633
11921c953p294L917J2514Q21k883M04m698J394P149M054J093k786o582m583K018
11906E85J13j928J809K901Q112O407L576J228l70J638K584J433n226n427j793
11891A5642m048j216O90O677j813k484k259n681R885K046m069L49n437j20J938
11876A0100L135J829O57K294l070p382j022O699l10n14O308N485J662r849o87
11861A5335p913l251M049j464N667O982j018k044k288l184M300j179R37m106l07
11846A0516O008n139R13O092M403k96k186k137m613j2826l139L519k128N896j556
11831C327m747M230l903j909k279k875L766j70L088P012J301K59K11q27l470J331
$$ y = [10634, 12842, 6791, -2858, -4265, -7397, -5711, 4388, 10557, 9703, 8372, 4652, 2630, 680, -3953, -11247, -7330, 5184, 6005, 3122, 3526, -1172, 222, 7371, 11425, 12518, 9732, 3150, -1433, 585, 698, -1230, 579, 3480, 11592, 17999, 21575, 22803, 22433, 24071, 26655, 28088, 22862, 17435, 15642, 11594, 10378, 11068, 17745, 15932, 13448, 11189, 5508, 15393, 17439, 13370, 13719, 8282, 8162, 10100, 13235, 15064, 15721, 18015, 14945, 7563, 6541, 13240, 12930, 12416, 18724, 24209, 25871, 16022, 15335, 7422, 4171, 8220, 6756, 12423, 19405, 18387, 16343, 14055, 10871, 15171, 13992, 14929, 10823, 10516, 16524, 11385, 12298, 18390, 22793, 22497, 20311, 18174, 13561, 735, -2404, 1115, -1013, 4883, 3327, -1420, 2810, -1093, -3002, -5281, -8156, -4390, -4560, -1472, 5540, 6841, 7100, 7311, 6484, 3014, 4345]
11815D345k379r23L491M4P42o35k703M715J0235L91m934R590j28j501J464o395
11799A5419K447L956K021L974o702p26m146o128k298j991N365l432o198M077N522
11784A1160N0L580j82j246l779n652l46k518R30Q648J714K615M43o331k301R62
11768G747N292K654k365l990l908j539R312M335L944J680n942n199P178M135j0254
11753A3080l297m540P78q55j131n458k40K197L538K790J898j367J303Q295O059
11738B3050l051p00j197l152M755L612p057o004r67j9J704O179J241k868j597
11723A3929l623K907O371P22j053o435Q84l424m877O69J1199M408o724q536j395
11708E022M146N38l401m434M489L143L726l576L79m275O67M896L997p76J71o843
$$ y = [4345, 1966, 1043, 4534, 4578, 5320, 4685, 1982, 6697, 16932, 17323, 12389, 21979, 21851, 20350, 21814, 15419, 17866, 21822, 23843, 27817, 21115, 20389, 16243, 10115, 7817, 5826, 11191, 7759, 1561, 5638, 11160, 11210, 14790, 14608, 13362, 9583, 3931, 3585, 1067, 1997, 10645, 12359, 14974, 15417, 9086, 6785, 7747, 13039, 15693, 13328, 9338, 5430, 3891, 13203, 17538, 21482, 23162, 17220, 12021, 19199, 23334, 13080, 9783, 5243, 6021, 5166, 4035, -1423, -1663, 534, 4072, 6862, 8760, 7393, 8696, 16991, 23050, 19999, 19299, 18102, 14950, 19705, 23317, 16260, 10256, 9289, 9270, 10974, 17153, 18394, 15526, 13929, 10306, 13213, 19584, 20306, 19253, 12818, 13702, 10278, 5401, 6070, 17269, 21677, 14953, 6417, 5022, 9168, 9706, 6305, 1871, 6360, 9503, 13229, 9653, 10032, 5757, 6424, 11320, 15317, 14541, 14712, 7869]
11692G869n530N3L33O575Q651k013n814L059j112l343p32j994k514r93N21N37
11676C553m43J624N119K429J152N281J211K487o821l807Q89n355j2829J077M088
11661c45m573J526L596O409K047K353J010K703N356k228m647Q409l563p023k314
11646H716j179k425k751J957L146L025K998K825M546j156l894o189j885M430J697
11631A3861k307K852K737l595o661k907K27Q016j850j923N063K903N280M040O20
11616B6356j186k030j633o34j305Q610M194m220J736M524n6q609k885o883J564
11601A7543K119j082k993k274P43k752L119L074k745l210P77m450R55J2674q47
11586B0651m201K572K921K425K832j565j0067m502m891N612R093R89r60J17l571
$$ y = [7869, 2339, 2392, 2725, 9300, 17951, 15938, 10124, 13183, 12071, 8728, 7996, 6002, 3488, 2495, 3016, 3553, 3110, 4734, 9853, 12282, 13434, 18715, 19926, 22413, 15592, 11785, 12674, 7319, -5510, -4433, -345, -4918, -3392, 204, 6613, 8660, 11013, 12023, 14726, 20082, 17854, 13207, 21616, 18053, 11030, 8716, 7537, 5112, 2361, 4318, 7464, 10489, 13487, 16312, 20858, 19702, 15808, 9619, 7734, 12164, 13861, 11554, 14406, 17143, 13548, 6887, 3980, 4207, 12223, 10373, 8450, 13513, 16416, 21696, 25736, 26356, 25170, 23140, 21507, 20873, 19568, 28178, 32372, 28152, 29888, 34412, 34356, 25747, 22862, 15979, 17543, 19662, 18580, 15587, 13313, 14056, 11304, 14423, 17497, 14752, 11542, 12319, 7869, 8824, 21498, 20651, 16450, 19022, 21943, 24368, 27200, 25635, 15568, 11066, 6175, 11787, 20880, 21869, 20909, 21026, 17455]
11571A7455k467K522o93j215k702O155j044k017k180J804J877j228J798M02Q11
11556A9278p807q19M625j828M866Q104j242l585j418M424k53M61n30q648l710
11541A1918J063m49M091n95k164R425L024m216j169m129j206p55j713m725K269
11526A0669L16O674L333m105L800M259o07o968o752k174J584K070J467K842q4
11511A6324k114k201r33R55P152L768p416J694P947j071m113m978m880L041K073
11496A5248L637m007l240J71L37m68m664K182P645K089Q66K101J163j45J458K024
11480B6397m622l10O93q868M232J828j219m504j219L192j999n3R36N27Q609K662
11464B6282J475o898p503J907L290M30K191p260m187J75R119l15m051k251K464
$$ y = [17455, 14988, 17510, 16817, 15602, 12900, 19055, 18011, 15994, 13814, 15618, 17495, 16267, 18065, 18467, 19278, 11471, 10652, 15277, 13449, 18315, 26419, 25177, 21592, 20174, 24598, 24345, 24806, 24276, 15628, 11918, 12981, 12532, 16623, 16028, 13864, 23289, 26313, 22097, 20928, 16799, 15593, 14838, 13125, 8400, 10669, 10985, 17659, 20992, 16887, 20687, 24946, 24339, 17371, 10619, 8445, 10029, 12099, 13566, 16408, 16324, 14210, 12009, 11076, 12031, 19183, 22951, 15535, 17229, 25176, 24105, 19992, 15014, 10134, 13175, 15248, 18885, 14878, 11638, 11809, 12146, 11678, 7014, 9196, 16841, 18930, 19796, 21897, 23060, 22915, 24373, 26397, 21775, 21465, 22158, 13290, 17522, 19350, 18131, 13627, 12408, 15600, 13601, 13548, 14484, 15011, 23620, 26282, 27757, 20859, 13356, 15263, 18553, 18983, 21174, 13914, 9727, 9902, 19021, 18706, 14655, 12404, 14868]
11449A4868j286Q70J368J52n910M776j196p494J0601J1361L99j075l137l019k808
11434A8470j643p177K503N218j293J648K561P33j336k5o24m186l8R680M569l688
11418B5372o002J833j200J634r154L245P537M624r47o678L835k842J492J95j69
11403B2775m099l482L529M300R649j412p090l902m43P21L603n14l79l010K30N123
11387B5599M158M56J041q248p265o520o09r27J386N892L438K627o370o22L512
11372A7548O430p392o352L745J2129j603n268J619M07n283K938k602L254p468
11358A2102N633M405n492O331L770J02p372K027M357m362k437j119r47m27j87
11343A6384k991N668J0901o273j1282p194L794O516L919k099n854k016K337r96
$$ y = [14868, 13582, 14452, 15820, 15972, 10062, 14838, 13642, 6148, 16749, 28110, 28509, 27434, 24297, 21278, 18470, 16827, 9650, 12153, 17371, 16078, 17726, 20287, 21020, 19684, 19659, 19035, 14849, 14811, 24491, 29060, 25372, 19370, 21203, 20003, 21637, 12483, 15728, 23265, 27889, 26942, 20264, 24099, 21257, 22749, 22944, 22775, 18676, 15194, 18723, 23023, 32672, 31260, 24170, 20268, 19825, 20546, 24149, 23635, 23256, 20246, 20476, 25599, 29757, 30213, 31254, 23006, 15741, 9221, 8612, 7685, 9071, 14963, 18401, 21028, 14658, 14036, 17548, 23978, 16586, 10234, 13979, 26108, 24505, 19237, 20856, 21263, 15980, 18918, 16316, 19570, 12102, 17735, 22140, 16648, 22979, 26749, 26851, 19479, 21506, 25863, 21501, 19064, 17945, 16998, 16571, 16384, 13393, 19061, 29962, 23689, 12407, 5213, 9007, 15523, 19442, 17343, 11489, 9473, 11810, 10814]
11329A0814K270M775M491J376P62k28O684l617o509m369l305k630k724R88J61
11314H939L610L620L816M299M770j922k73P524M731m139j0843n357J796M058k630
11299B1999k952m309M982P160P140K729l343n969N342K7j522K925j990m673Q210
11284C5756J3218J371k969J0195J2302J5090K9917L4000K9946K4960J2384p088
11272B09082j1739j4092k0777k6338k6415k2726j8736o779j3504j5343k503K317
11260C2447N771N903M47m412m297p263j546n195q853l898O132O935M882N92K402
11245C0047M17Q36K978k465n441q699m387L969M682K151k683p04L721K778L115
11230C0315n256n084l807J264Q946O308P57p640n327J516k158L415j35k663k925
$$ y = [10814, 13084, 17859, 22350, 23726, 24488, 24260, 30944, 27327, 20818, 16449, 13144, 10514, 7790, 8778, 8939, 12549, 16169, 19985, 24284, 29054, 27132, 26859, 34383, 39114, 34975, 24132, 18775, 20571, 24629, 21999, 19047, 14738, 19720, 26880, 34020, 36749, 33406, 27437, 32779, 32806, 31284, 34209, 32219, 27546, 35756, 48974, 50345, 47376, 57571, 69873, 84963, 114880, 148880, 178826, 203786, 216170, 209082, 197343, 183251, 162474, 136136, 109721, 86995, 68259, 61480, 47976, 32633, 30130, 32447, 38218, 44121, 44568, 40156, 35859, 28596, 27050, 21855, 13002, 9104, 15236, 22171, 27053, 27645, 30047, 30464, 31300, 34278, 31813, 26372, 17673, 13286, 17255, 21937, 24088, 21405, 20701, 24422, 27200, 30315, 25059, 19975, 16168, 17432, 26378, 32686, 33443, 25803, 20476, 21992, 19834, 23249, 23114, 20451, 17526]
11215A7526o668M054j787Q457O987j947p6m643n235N018k907J50N943L537n545
11200B2864L854K833j56r60j280K955o564o664P851O248k629o332m388l00P549
11185B4881J0530P33j616p974k39R566J701p737j899n999p247K698O009O109N448
11170C4964L014j790n205J691k976K053J714k147J530j168k852r006j1565K58
11156H515J2704M403O37M005O393L05J6875J9453J8278O678j8471j8956j1347
11143D9472l405l564M531J169n370p340o52M544l144n288l173M160N396K562M092
11128D3990m903n858n504m143O46k106n64l420Q076J6471J4599J6828J1895J189
11114H7196j4958j5736j4860Q4j049p575n481N7l917P271N028n35O999k477m036
$$ y = [17526, 10858, 14912, 13125, 21582, 28569, 26622, 26546, 21903, 16668, 21686, 18779, 18929, 24872, 28409, 22864, 26718, 29551, 29395, 28435, 27155, 30110, 23546, 16882, 24733, 30981, 28352, 22020, 17632, 17332, 24881, 35411, 36144, 34528, 26554, 26315, 35881, 37582, 29845, 27946, 21947, 14700, 17398, 23407, 29516, 34964, 37978, 36188, 30983, 32674, 29698, 31751, 33465, 31318, 32848, 31680, 28828, 19822, 8257, 8515, 21219, 25622, 26259, 30264, 36657, 36962, 53837, 73290, 91568, 98246, 79775, 60819, 49472, 46067, 42503, 47034, 48203, 42833, 35493, 34841, 39385, 36241, 30953, 27780, 31940, 37336, 39898, 43990, 39087, 33229, 27725, 23582, 24228, 22122, 21558, 18138, 26214, 42685, 57284, 74112, 86007, 87196, 72238, 56502, 41642, 41726, 40677, 33102, 27621, 27678, 23761, 31032, 36060, 35525, 42524, 40047, 36011]
11099C6011m425m950M621P233K28o266L462l353q581O670N55k86k775R95k744
11084B6395p881M88O275P222j740o709N419k19L374Q77q63K64o31J508R90k336
11068C2433J847J035K625M868m50j319j67o433j1310m769K537L124K910Q007M678
11053C9616j993o567j402j841K09L023j02K160J655n4K175J403n707l132j877
11038B7566j840J174M947J13j27J521M44l902L472R01m180J388N690J740l477
11023C5430N992p472l244n348m494k23K807J1185K448l852K124J162j3581m571
11009A8363J99Lk120N259J1710M229k708J155l96L946j543o851n04K586k85L710
10993C6753n021k860k232j455J776J724P201J77R83M779Q423j461p523k487j167
$$ y = [36011, 31586, 26636, 31257, 38490, 38718, 32452, 35914, 32561, 23980, 30650, 31205, 30919, 28144, 29139, 26395, 18514, 19002, 25277, 32499, 30759, 24050, 29469, 29250, 32624, 33501, 32638, 32902, 32271, 33779, 34769, 32433, 34280, 35315, 37940, 42808, 42358, 41039, 40872, 34439, 23129, 18360, 20897, 24021, 26931, 34938, 39616, 37623, 31056, 29654, 27813, 28022, 31045, 30943, 33103, 34758, 34704, 36879, 38282, 32575, 29443, 27566, 25726, 26900, 31847, 31960, 31833, 33354, 33798, 29896, 33368, 34269, 30089, 31477, 37167, 38907, 35430, 41422, 33950, 30706, 25358, 20864, 20641, 23448, 34633, 37081, 33229, 35353, 36515, 22934, 18363, 18562, 18565, 16445, 21704, 33414, 37643, 34935, 36090, 35694, 39640, 38097, 31246, 30742, 33328, 33043, 36753, 31732, 28872, 26640, 25185, 26961, 28685, 35886, 36063, 37046, 41825, 50248, 48787, 41264, 38777, 37610]
10978C7610K118n49P74R20o441o362p498P309P813R390M791l45r848J796k46m407
10962C6825K876J507L248m602M00K10J546l286P956o479o421j798J109J912m616
10947C0387L361P748R365n281q532o55j664L572m118j089R02J869L480M512Q036
10932E1893L993k761l017P38k528m796j454Q29k366l180o70k2K995m008K874k183
10916C6337k914J439p78m845J203l08N967M718Q06J778J469n335n079j215K806
10901C6049L873j22k839L166J1835R561J538j776P181J5132L0589K6981j5390
10888A25778l2533k7021j2171K130l803o005m136k631k580J59j030L354N294R912
10874E4717m157k109J381j435m118K937M442l367N9K145M696j120O927O716J281
$$ y = [37610, 39728, 39179, 39953, 40873, 34432, 28070, 20572, 27881, 35694, 45084, 49875, 49530, 39682, 41478, 41232, 36825, 39701, 41208, 44456, 39854, 40254, 40464, 42010, 38724, 46680, 40201, 33780, 31982, 33091, 35003, 30387, 33748, 41496, 50861, 45580, 37048, 36393, 34729, 38301, 34183, 33094, 33996, 35865, 39345, 43857, 51893, 55886, 53125, 50108, 50846, 48318, 43522, 42068, 42897, 40531, 37351, 36681, 36659, 39654, 35646, 38520, 36337, 33423, 34862, 34084, 29239, 30442, 30134, 36101, 40819, 41625, 43403, 44872, 39537, 34458, 33243, 36049, 39922, 39800, 36961, 40127, 51962, 61523, 63061, 61285, 68466, 83598, 114187, 141168, 125778, 93245, 66224, 54053, 56183, 52380, 46375, 42239, 39608, 37028, 37187, 36157, 39511, 44805, 54717, 50560, 48451, 49832, 48397, 44279, 47216, 51658, 48291, 48350, 50495, 55191, 54071, 60998, 67714, 68995]
10859F8995l628p45j795l346m928l249q06M960O527j671m061j1415n20k687p823
10844C3808j63K756L473P648j730L707L686M495O917K134k331p581k954P94K360
10829E7019k133l189p947K621P272m121N475R283N047n985q57L838j393L792j245
10814F7477q364q572K409L186J535M183L606q82l190j658p495O033M257K603L458
10799F8586L987K832j47R885J6126J7532M1654O3483R8130J84776K84707R3273
10787H84824k31981k26643j40931p8547m5671k5771j7360j0420p137r201j0751
10776H0411o858l906m576m393L843J0868P888J65n799N496O527J5943K9263L3757
10762A68629O2099J31176K04296Q1981j72507j62478r1426m8662l5463k8338j9031
$$ y = [68995, 65367, 64622, 62827, 59481, 54553, 51304, 50498, 55458, 61985, 60314, 56253, 44838, 44318, 41631, 33808, 33645, 36401, 39874, 47522, 45792, 49499, 53185, 57680, 64597, 66731, 64400, 56819, 53865, 54659, 57019, 54886, 51697, 43750, 46371, 53643, 49522, 54997, 64280, 69327, 63342, 62485, 66323, 64930, 68722, 67477, 59113, 50541, 52950, 56136, 57671, 61854, 65460, 64578, 61388, 59730, 52235, 58268, 62525, 65128, 68586, 72573, 75405, 75258, 85143, 101269, 118801, 160455, 223938, 322068, 506844, 791551, 884824, 652843, 426200, 285269, 206722, 161051, 135280, 117920, 107500, 100363, 91162, 80411, 73553, 69647, 65071, 60678, 64521, 75389, 83277, 83442, 77643, 83139, 89666, 105609, 134872, 168629, 230728, 361904, 566200, 648181, 475674, 313196, 221770, 173108, 137645, 109307, 90276]
10751I0276r231J128r094j0566m169M682P944O362o811m780k96P33O66K872k729
10736F6987j5054k545K500P603M469L493J068Q66J031n618o803Q73K093K048N350
10721F8361l08K900l076n01m372j512l033j192k702n782k000P057P495L416k508
10706F2243M355L412n82Q516k298l514l930K065n045K247R096J751L536n446m434
10691G1972J963N62m699o415J244j829L087M758K657k432J361j006J37L773K760
10676G7893M279m417L090n32N462M577P94M017K420l413m957j81p467j13n997
10661G5455l342K673L374J948m424p20r05Q052Q969n058j1895j061k63j877K117
10646G3043P835J909J640r076j2884O092J473K488R11R318J2242O342R658J4052
$$ y = [90276, 81045, 82173, 73079, 62513, 58344, 63026, 70970, 77332, 70521, 65741, 65445, 66178, 66844, 69716, 66987, 51933, 49388, 51888, 59491, 63960, 67453, 68521, 69387, 70418, 64800, 57997, 58870, 60963, 63011, 68361, 68053, 70953, 67877, 67376, 63004, 61492, 58459, 57267, 54565, 48783, 46783, 53840, 61335, 64751, 62243, 66598, 70010, 69428, 77944, 75646, 72132, 68202, 70267, 65222, 67469, 76565, 78316, 81852, 76406, 71972, 73935, 74497, 69798, 63383, 64627, 62798, 65885, 70643, 73300, 70868, 72229, 71223, 71360, 75133, 77893, 82172, 77755, 80845, 80313, 85775, 90352, 91146, 95163, 97583, 94170, 89213, 89032, 81565, 81452, 75455, 72113, 74786, 78160, 80108, 75684, 74964, 74059, 82111, 91080, 86022, 74127, 73066, 72803, 70926, 73043, 80878, 82787, 84427, 75351, 62467, 68559, 70032, 72520, 73431, 82749, 94991, 101333, 110991, 125043]
10632A25043J2390q833j3942J130Q224J1514p139k9724k0737j4689j1373m731
10620D7133J524N025J0604J194N090N095L446L817J134k748k577J723P66O557
10606H7783N291l468O456J0041O207K924Q13J504n953m624n721j522j710M691
10592A02712L382K573o295j323P400J2926N643J0887J1243N198O370J9810K5384
10579B05910K8169L5617O7246J15650J80124K96325M62441M17944K60030M17139
10569B486595O0914l80382k50400l79768m75110l24781k04549j24689q0461n4560
10559B72809l2563k4023j2086j3382j7031k1640q665p454m967L221j113n923N667
10546A32850J0000k67p010p81q613j0574r384n0k102L566m202K548O806K36L748
$$ y = [125043, 137433, 128600, 114658, 115788, 124012, 135526, 128387, 98663, 77926, 63237, 51864, 47133, 48657, 53682, 64286, 65480, 70570, 75665, 79111, 82928, 84062, 81314, 78737, 80460, 81226, 87783, 93074, 89606, 96062, 106103, 112310, 115234, 116047, 117551, 111598, 106974, 101253, 99731, 98021, 102712, 106094, 108667, 102372, 101049, 108449, 121375, 127018, 137905, 149148, 154346, 160716, 180526, 205910, 234079, 269696, 336942, 452592, 632716, 929041, 1391482, 1809426, 2069456, 2486595, 2547509, 2167127, 1916727, 1536959, 1061849, 737068, 532519, 407830, 327369, 272809, 240246, 216223, 204137, 190755, 173724, 152084, 143419, 135965, 130998, 134219, 133106, 127183, 132850, 142850, 142583, 135573, 134792, 126179, 115605, 106221, 106171, 104069, 107635, 103433, 105981, 112787, 113023, 116771]
10531A16771l791P90K941K672J2333K530k200M195q63J1324J2542J971j1192j0939
10517A39084n472L581Q303N49m272M5m582l592O70J712L088M553J572p352R313
10502A47200O869K574N507O535P376J7114J1945j0015j4428r454o436j546l833
10489A59408j161J3164J5740R666q895k1026j4050o014O437J3538J1191o306l888
10476A67804J411j3442q870r857m499k552j4149n391N894p538R763J5992L968
10463A38534R753J3871J6127K3034J3017m971j3485q826q985n752M292m3q217
10450A68349m688N255l947n570K743q554p296N22L760J420k124k663p19l50j810
10435A44328N180J1959J1877P351O866J3151J4594Q783k439o521R55l31M475L0847
$$ y = [116771, 112980, 113770, 116711, 119383, 131716, 134246, 132046, 136241, 135378, 146702, 159244, 161215, 150023, 139084, 133612, 137193, 145496, 146045, 141773, 141818, 137236, 133644, 134314, 136026, 139114, 143667, 145239, 137887, 147200, 154069, 156643, 162150, 168685, 176061, 193175, 205120, 195105, 180677, 171223, 164787, 163241, 159408, 158247, 171411, 187151, 196817, 187922, 166896, 152846, 146832, 153269, 166807, 177998, 171692, 167804, 169215, 155773, 146903, 137046, 132547, 129995, 115846, 110455, 116349, 108811, 118574, 134566, 138534, 148287, 162158, 178285, 201319, 214336, 209365, 195880, 187054, 178069, 172317, 176609, 176566, 168349, 163661, 168916, 164969, 159399, 162142, 153588, 146292, 146814, 150574, 151994, 149870, 147207, 146488, 146138, 144328, 149508, 161467, 173344, 180695, 187561, 200712, 215306, 224089, 221650, 215129, 216084, 215753, 220228, 251075]
10421B51075M0256K9607M8188M6283L555l373j8670m3467l9682m0942l9172k5182
10409B08476j3574q919M2R53k577pN906J612m192M872L657M293k183L74O132k194
10393B02671k829j980j799k555K879M066K318n017K019J521n023n801j770L71
10379A89071K012K843L26q952k914r072j9456j24N33j0367n640N015l12j4238
10365A28725n133L972l343O51J6441K2154J3995J2473K0052K2167L763p424N460
10352B33953M097o422K1526K2081n768K466J0850m687r186m980o901j805k063
10339B53161j1951j5302r042r21N435J2344J3876J0494Q900K536q693p966o669
10326B46202q359M536n375l064O265K865j6853j3043o056r681N849J0560J5977
$$ y = [251075, 291331, 320938, 369126, 415409, 418964, 415591, 396921, 353454, 313772, 272830, 233658, 208476, 194902, 185983, 186025, 186978, 184401, 184394, 190300, 191912, 187720, 192592, 196249, 200542, 198359, 198733, 204865, 202671, 199842, 197862, 196063, 193508, 196387, 200453, 202771, 197754, 199773, 201294, 196271, 190470, 188700, 189071, 191083, 193926, 194252, 185300, 182386, 173314, 153858, 153734, 154267, 143900, 138260, 143275, 142963, 128725, 123592, 127564, 124221, 124872, 141313, 163467, 177462, 189935, 209987, 232154, 235917, 228493, 233953, 238050, 231628, 253154, 275235, 269467, 271933, 282783, 278096, 268910, 263930, 257029, 255224, 253161, 241210, 225908, 216866, 215945, 221380, 233724, 247600, 258094, 266994, 269530, 260837, 252871, 246202, 237843, 242379, 237004, 233940, 240205, 243070, 226217, 213174, 207118, 197437, 203286, 213846, 229823]
10313B29823J6196J5098J0957J8663J2856J3783J8104J6014J4307J2311L493N981
10301C87586P467J3651K4980K5331K3416J9169m369m2207k8371o5848q1646m1293
10289B37866n9887k1172M989J5640L8836M0913M3859L4891K1853K6738K4486J9671
10277D28683J9128J0614O808p259L948J2650Q896M80R800Q74l895l921p560m91
10263D78755O980O504J0237K2880K0039K8361N7643Q7894J26357L9979j00957
10252G84672p4164l7641j8827j2471j4758q657P934K342M826J8018J3925P166
10240F72365R579J9486R027J3785K7320K5961K4754K0698J1519O814Q157O547
10228H56012J6796K0710K2539M1392M2479K5618L5941K5731Q698K6894J6986R750
$$ y = [229823, 246019, 261117, 272074, 290737, 303593, 317376, 335480, 351494, 365801, 378112, 381605, 387586, 395053, 408704, 433684, 459015, 482431, 501600, 497231, 455024, 426653, 360805, 279159, 237866, 177979, 156807, 161796, 177436, 216272, 257185, 301044, 335935, 357788, 384526, 409012, 428683, 447811, 458425, 465233, 457974, 461922, 474572, 483468, 483948, 493748, 494622, 490727, 486806, 479246, 478755, 485735, 492239, 502476, 525356, 545395, 573756, 631399, 719293, 845650, 885629, 784672, 710508, 672867, 654040, 641569, 626811, 618154, 626088, 628430, 633256, 651274, 665199, 672365, 681944, 701430, 710457, 724242, 751562, 777523, 802277, 822975, 834494, 841308, 849465, 856012, 872808, 893518, 916057, 957449, 999928, 1025546, 1061487, 1087218, 1095916, 1122810, 1139796, 1149546]
10216A149546K4257J7606J5994L6445M9884M5625N7473P3042O6239O5099P9011
10205A680221P1443P1399J10226Q2075P7421J41732J03986J00299J52459J65389
10195B756650J71960J94637K50665L46545M54808O68280P98021O04828P26079
10186F972473P05777J44069J72542K65647K09852N23199R36784J430514J967651
10177A3328508K214966K729133L722145M358173O062635R588896J4823261K3839321
10169H0667038L9754785O6572187Q6836886N2193483M8897112O3009495k9765354
10162D08165632o0232845l8035328p6213765p7384123n0319951l1471341j9715527
10155E4792752j2717253q922693o189014m559039l978088l046814k397291k126471
$$ y = [1149546, 1173803, 1191409, 1207403, 1243848, 1293732, 1339357, 1396830, 1469872, 1536111, 1601210, 1680221, 1751664, 1823063, 1933289, 2015364, 2092785, 2234517, 2338503, 2438802, 2591261, 2756650, 2928610, 3123247, 3373912, 3720457, 4175265, 4843545, 5641566, 6246394, 6972473, 7678250, 7822319, 7994861, 8260508, 8470360, 8993559, 9930343, 11360857, 13328508, 15543474, 18272607, 21994752, 26352925, 32415560, 42004456, 56827717, 80667038, 120421823, 186994010, 273830896, 326024379, 374921491, 437930986, 408165632, 347932787, 309897459, 233683694, 156299571, 105979620, 74508279, 54792752, 42075499, 33152806, 26963792, 22404753, 18426665, 15379851, 12982560, 10856089]
10147A0856089j667565j214954q54627n58864k35053j81984j67240P9231l10368
10138E744665n87543l54478m60519m45313l75035k93037j94233l20173k68153
10129B446181j79956k11751j72555j41158j89300j54121j22312j23138q2848p6914
10119I92128o8906l9142l6842m9994l9363l1733m4259m6431m6681m1663m6411
10108E00703l1267k6527j9669m353j8746j7371K824j2900j9524j7967k0679k0543
10096B93981k0074k1623k6032r856m555k205L356p82r46m964j3073p514L933r031
10082A80615j8050o908l72j85J584K731L631J304R82K97L516L810l31O291k740
10067A76175m716L608n81k404N428K192K251J5705J9318L0416M6355O2912J04175
$$ y = [10856089, 9188524, 7973570, 7118943, 6560079, 6325026, 6143042, 5975802, 6055033, 5744665, 5157122, 4802644, 4342125, 3896812, 3521777, 3228740, 3034507, 2714334, 2446181, 2266225, 2054474, 1881919, 1740761, 1551461, 1397340, 1275028, 1151890, 1069042, 992128, 923222, 884080, 847238, 797244, 757881, 726148, 681889, 635458, 588777, 547114, 500703, 469436, 442909, 423240, 418887, 400141, 382770, 385594, 372694, 353170, 335203, 314524, 293981, 273907, 252284, 226252, 216396, 211841, 209636, 212992, 212210, 211264, 206300, 193227, 185713, 189646, 180615, 162565, 155657, 155285, 155100, 156684, 159415, 163046, 164350, 165332, 165629, 169145, 172955, 172624, 178915, 176175, 171459, 175067, 174486, 172082, 177510, 179702, 181953, 197658, 216976, 247392, 293747, 356659, 460834]
10054D60834J89644L73467O98046N03396n54241o22275l49341j82020r0389k9848
10044C97273Q227K7943O0735P9938O5190P7607L6961n1899p9726r7935j08975
10033D15339j01946p5511n1027l7354k4068k1137k3265k8245j8407j1474p326
10022A5579M352M756O644N413J3497R262N747P054R683L981J3497m635r136j375
10008H4319n119q510p464J597r949o677q714o500l452p052j2902m060Q500J960
9994A5977k514R789J0939J2019R129k1408k8633j0089m315j6088j8340p473j0506
9981f1513N900P431m383M421J4035J125l736J510r613n609J2681J8306J8644K3675
9967B2874K3960K2264J5668n697Q00P592k7143k5295k989l773j6393o721K689
$$ y = [460834, 650478, 1023945, 1721991, 2225387, 1671146, 1048871, 699530, 517510, 427121, 397273, 405500, 433443, 494178, 574116, 639306, 716913, 753874, 701975, 622249, 524314, 415339, 313393, 237882, 186855, 149501, 125433, 104296, 81031, 52786, 34379, 22905, 15579, 19931, 24687, 31331, 36744, 50241, 59503, 65250, 72304, 81987, 85968, 99465, 94830, 85694, 84319, 79200, 70690, 63226, 64823, 54874, 48197, 39483, 32983, 29531, 22479, 9577, 5517, 14017, 15977, 13463, 23252, 34191, 46210, 55339, 33931, 5298, -4791, -9106, -25194, -43534, -51007, -61513, -55613, -48182, -52565, -48144, -34109, -32984, -36720, -35210, -44823, -50432, -37751, -19445, -801, 22874, 46834, 69098, 84766, 79069, 79869, 87461, 60318, 35023, 32034, 28261, 11868, 5147, 7836]
9954G836l722q477P51j0591j6769q767Q401q83l309l648J477n172j1997M514J3310
9939c7046J775j513K256p87k941m218o639j1243n778K030O084L154P114N576L847
9924c8329O075M794O647J0830P781l27j578O715M725M919N173P423K211j059l36
9909B5664J841j832j3866j1284q190r145l249J399j624N85N761O064P064o152
9895f964j0707l057j344J917M378M01r80k674m896k62K736k447j499m658j403
9880c1459p611o267Q7M707J791P643l57O450Q928q673k903L75m885N109O260K118
9864a8687R645J1706L126P116N665j281N623r866k1117j7489j0529k237J369o38
9850c7594j916j572L587P953O171n075m573O427K923n863j0267m891M732L476
$$ y = [7836, 4114, -4363, -3612, -14203, -30972, -39739, -31338, -32221, -35530, -39178, -37701, -42873, -54870, -50356, -37046, -35271, -36784, -34528, -35315, -38256, -42474, -49113, -60356, -66134, -64104, -58020, -54866, -47752, -42176, -38329, -32254, -27460, -20813, -9983, -2202, -2529, -4107, 2608, 7333, 12252, 17425, 24848, 27059, 26000, 25664, 27505, 25673, 11807, 523, -7667, -16812, -20061, -18662, -20286, -19701, -13940, -7876, -812, -6964, -17671, -20728, -22072, -20155, -15777, -15376, -16356, -19030, -23926, -24188, -21452, -23899, -25398, -30056, -31459, -39070, -45337, -45250, -40543, -38752, -31109, -31466, -25016, -16088, -24761, -27664, -27289, -32174, -27065, -20805, -18687, -9042, 2664, 5790, 12906, 18571, 17290, 22913, 13047, -8070, -25559, -36088, -38325, -36956, -37594, -39510, -41082, -37495, -29542, -23371, -28446, -33019, -26592, -23669, -29532, -39799, -44690, -39958, -36482]
9836c6482K541j061n751m683o298J780M982j119m058j4685o482n259N918O786
9822f3871M664K746P663n58l276O5Q209P504L545O660k534J836J080j82J255r908
9806c5102o989M563P431j120l277l984m799L552O633m631J768P968j134L5P106
9791b1980J778j73M31m29o459n98J1483L443k992r219M241O235j559j080P021
9776i857P045R762L387l362K730Ok52R545J0251J0741J0071J3882J5087K0072
9762I9108K3168L8658O8506J07194J68244K89988M63274M27238K62130M17542
9752B365050Q2401l71231k50473l79431m75949l36002k10388j34163p9406n4084
9742A56324l4189k0092j5611j0112j0331j1540j0494p834j3111j380n629l071
$$ y = [-36482, -33941, -35002, -40753, -45436, -51734, -49954, -44972, -46091, -50149, -64834, -71316, -76575, -70657, -63871, -59207, -56461, -48798, -49356, -52632, -52567, -44358, -36854, -33309, -26649, -29183, -27347, -26267, -26449, -25194, -35102, -42091, -37528, -30097, -31217, -34494, -38478, -43277, -39725, -33092, -37723, -35955, -27987, -29121, -29086, -21980, -20202, -20375, -19944, -20373, -26832, -27430, -15947, -12504, -15496, -24715, -20474, -14239, -15798, -16878, -9857, -2812, 6950, 10337, 6975, 9705, 9711, 9459, 19004, 29255, 39996, 50067, 63949, 79036, 99108, 122276, 160934, 229440, 336634, 504878, 794866, 1258140, 1685378, 1947508, 2365050, 2447451, 2076220, 1825747, 1446316, 970367, 634365, 423977, 289814, 210408, 156324, 122135, 102043, 86432, 76320, 65989, 54449, 43955, 36121, 23010, 21630, 16001, 12930]
9730A2930n437j1572n335l695l842o415m122N650M155L258R86P417M653k63Q94
9715g38j051o14k053M668j145k00R350M341j131l826N217j7122j5596P721o495
9700a8674j3971p643j469j462j079N220N907P394N303K323n131m879K957J755
9686b3449l255J69k196n123m231l15l270L782Q031k840p20j503l26R89j095M750
9670c0602N303j746N064K499q17k055m639J155m018K17L969k180o8M71L501P221
9654a6725J043j108P13j77m495N639K21n61k649k618P809J808k795j455l420K81
9638a8489L69o344J915L518L230O029P085l816N881p83P1k19p839O09J910l413
9622a0286M472J0652K664K874m790j0077n274L647R0M871P124Q678K046J722l632
$$ y = [12930, 7493, -4079, -9414, -13109, -16951, -23366, -27488, -21838, -17683, -14425, -13439, -6022, -1369, -1632, -738, -1789, -2403, -4456, 212, -933, -1133, 8217, 12558, 11427, 7601, 12818, -4304, -19900, -12179, -18674, -32645, -40288, -41757, -43219, -44298, -39078, -33171, -25777, -20474, -18151, -23282, -28161, -25204, -23449, -26704, -26535, -28731, -33854, -38085, -38400, -41670, -37888, -29857, -32697, -33417, -34920, -35246, -34257, -35352, -30602, -25299, -27045, -21981, -19482, -20299, -22354, -26993, -25838, -29856, -29639, -25670, -27850, -27918, -27447, -23946, -16725, -15682, -16790, -16077, -16254, -20749, -15110, -14889, -15450, -18099, -20717, -12908, -11100, -13895, -15350, -18770, -18489, -18120, -24464, -22549, -19031, -15801, -9772, -2687, -6503, -622, -1405, -1334, -1553, -9392, -8783, -6873, -10286, -5814, 4838, 7502, 10376, 5586, -4491, -9765, -6118, -6028, -1157, 5967, 14645, 16691, 18413, 14781]
9607A4781N974k039o602L124P499P246Q896O01l824k451O376K115m223L951P162
9592D8586N081J6907Q767n813j3399o113q441j682n892j1401r381o772m229r27
9578E291N695J0197L216Q767Q489M439N311Q309J012n83p17q832R96K601L123
9563E7314j579p418k37j261L222l215p246o717k971J3385J6932J4010J3764K9248
9549A17231M3538M3543n263m7722l9337l4699k4167j2153k776o479m422j75O807
9536C3926M005Q303l340k73r03m9N633j717J053R415J5559K693p767m321j869
9521F0348j5234j5726l616n918k281Q41L164l238r32L178N339N071l3J0011J1579
9506E2553J1662k138k2028k1997o407l64n271p310k604M874N413M053j479m392
$$ y = [14781, 20755, 18716, 12114, 15238, 22737, 29983, 38879, 39480, 35656, 33205, 39581, 41696, 37473, 41424, 48586, 53667, 70574, 79341, 73528, 60129, 54016, 45575, 43893, 38001, 26600, 17219, 10447, 6218, 5291, 10986, 21183, 24399, 33166, 41655, 46094, 51405, 59714, 60726, 60143, 59426, 50594, 51590, 54191, 57314, 55735, 48317, 48080, 46819, 50041, 46826, 39580, 32863, 29892, 43277, 60209, 74219, 87983, 117231, 160769, 204312, 199049, 151327, 111990, 77291, 53124, 40971, 38195, 31716, 27294, 27119, 33926, 37931, 46234, 42894, 42621, 41718, 41669, 47302, 45585, 46638, 56053, 71612, 74305, 66538, 62217, 60348, 45114, 29388, 25772, 19854, 17573, 18414, 21578, 18340, 17408, 20586, 25925, 30996, 30963, 40974, 52553, 64215, 62077, 40049, 18052, 11645, 11281, 6010, -1300, -3904, 970, 6383, 10436, 8957, 4565]
9492D565o456J988N548O4l427j994j850k213K258o17j26k808O57O953J928l332
9476A138K93o741q145j360K724O914j092l786k206L589N197J0193O571k956J90
9461A0523q592p367n643r136O998J831k40L871J260J184J561p044q348P875N188
9446f079K988m427K97P588J744N60K440Q1M343K265l580Q638R53J290O479k054
9430B3526m224k007J486j821l530K759R3R26j033l030J782r22l546M7j577j360
9414G569O293o27L208N413m25J660L669m249q634j638N157K539p850n85J0534
9399B2034N608m773j610q09K961J560j350k385O02M013m93l399j935O33j073o411
9383A3173l084J390k469m932M123Q573M049R427O280m135k254P63k634l14M231
$$ y = [4565, -1891, 97, 5645, 5709, 2282, 288, -1562, -3775, -1517, -2134, -2260, -5068, -4411, 2542, 4470, 1138, 1431, -5310, -13455, -14815, -12091, -5177, -6269, -10055, -12261, -8672, -3475, 6718, 13289, 10333, 10523, 1931, -5436, -11079, -20215, -13217, -11386, -11626, -7755, -6495, -5311, -3750, -10794, -19142, -11267, -6079, -3091, -7518, -7221, 367, 2111, 2671, 5111, 5192, 9535, 11800, 8220, 16858, 17811, 19101, 25580, 23526, 19302, 17295, 18781, 16960, 13430, 16189, 16282, 17208, 16175, 13145, 14927, 14005, 10459, 10506, 8929, 7569, 13862, 13235, 16443, 21856, 21431, 23091, 26760, 22511, 13877, 12239, 17396, 19935, 12085, 11500, 22034, 27642, 22869, 21259, 20450, 23411, 24971, 23621, 21236, 21838, 25851, 25358, 21959, 20024, 20657, 19584, 13173, 10089, 11479, 9010, 4078, 8201, 16774, 20823, 30250, 36530, 32395, 30141, 30904, 28270, 27956, 32187]
9368C2187K071J534L069j306j235O716o027r057r52j259Q49J499m549J339l941
9353B0938J681M301l001P35M506P09K656J232j152J752J794k578O778J1746Q812
9338F0909O871m576J054K070m925k979R511N691N783L768Q275J0580O383Q648
9324A17063J0228J2619J6172J5835K3690M3240P2325J19515J85411K05877J23932
9313I45907o2748j80821k07022j56558r9996o2691l2997k5441j5944m588q914
9302H8187j214m398p331L72L535o517l355j13p421r584p190j107M20Q058N151
9287E7493m454j072J960o67J594l508l360L420J253L573o96o532o45P16R721L167
9271F1963j658n853K508O679J109K306L691k307r839p744P43P745J992J013J983
$$ y = [32187, 34258, 35792, 38861, 37555, 36320, 43036, 37009, 27952, 27000, 25741, 26590, 28089, 23540, 24879, 20938, 22619, 26920, 23919, 24654, 29160, 29869, 32525, 33757, 32605, 34357, 36151, 33573, 40351, 52097, 60909, 67780, 63204, 64258, 66328, 61403, 58424, 67935, 73626, 79409, 83177, 91452, 102032, 108415, 117063, 127291, 139910, 156082, 171917, 195607, 238847, 311172, 430687, 616098, 821975, 945907, 883159, 702338, 495316, 338758, 238762, 176071, 143074, 117633, 101689, 97101, 88187, 86973, 82575, 75244, 75616, 79151, 72634, 69279, 69166, 61745, 52161, 44971, 43864, 44284, 52342, 57493, 53039, 51967, 53927, 53260, 54854, 51346, 47986, 51406, 52659, 56232, 55536, 49004, 48359, 49075, 58796, 61963, 60305, 54452, 56960, 63639, 64748, 67054, 70745, 68438, 58599, 50855, 51598, 59343, 61335, 62348, 64331]
9256F4331q67n413L808p21o123j60j421L90j040O312R601J2l306o35j320k091
9240F1357K953j3N48M32J246j61J1659O556P362M787l241N64o1m050m671r5P783
9223I2955J66P369J082q964p16l541o518j2272j078l301r035J695O528k708m202
9208E7460k244Q612N362k466K543P872L212M29l02j007n08j170J252Q500L484
9193I1029k309j307J096J546k702j864j189R289R297P928r00m997q758Q843R867
9178A14869j29m450n32P441L386N638K863J555j68l92m591n806l819M308L87q658
9162A11902n042L34K935R783N755j921l012j267L9m232O5J1617L190P70R58n675
9146A26199r027j622j976m042L039K699Q29l033R053L809N597L783L205K377k857
$$ y = [64331, 63464, 58051, 61859, 61138, 55015, 54855, 53434, 53824, 52784, 59096, 68697, 68709, 65403, 64768, 63448, 61357, 64310, 64297, 64845, 65277, 66523, 66362, 78021, 84577, 91939, 96726, 93485, 94049, 93988, 89938, 85267, 85172, 92955, 93121, 100490, 101572, 92608, 91892, 88351, 81833, 69561, 68483, 65182, 56147, 57842, 64370, 61662, 57460, 55216, 63828, 69190, 66724, 69267, 77139, 80351, 80780, 80478, 79471, 78963, 77793, 79045, 87545, 91029, 88720, 87413, 88509, 90055, 87353, 85489, 84300, 93589, 102886, 110814, 109914, 104917, 96159, 105002, 114869, 114740, 110290, 109758, 117199, 120585, 126223, 129086, 130641, 130473, 130081, 125490, 119684, 115865, 120173, 120560, 111902, 106860, 107194, 110129, 119912, 125667, 123746, 120734, 119467, 119506, 115274, 115339, 126956, 130146, 130916, 131874, 126199, 117172, 115550, 113574, 109532, 112571, 115270, 116099, 113066, 122119, 125928, 131525, 135308, 138513, 140890, 138033]
9131A38033m211j23M836O581O63m885r608j629L248J114j606J215L370j41Q95
9116A37752J333J18L886K15L231j879K493R949J3093M207j48K397J759J118J2731
9101A92255J4685J4024J4396J9924J9464K7804K9942L8514M9240O4448Q9134J34966
9089G08796J96118K94512M63560P34166J152113J643766J418491k85733j542996
9080D782793j457514j011304o56384m26993k92742k05377j43721j09348p8500
9071D00910n9294m7796l6665l4352k3298j1520j3122k0014r952l416j1000r268
9059A21213n519k64m133q308n325n727k574o049M78N048l007J143M3K396p949
9044H1466q279N659P704J109N19k060O03j423p14M928Q636J5235M3182P2800J16014
$$ y = [138033, 133822, 133699, 138535, 145116, 145779, 140894, 131286, 129657, 132905, 134019, 132413, 133628, 136998, 136857, 137752, 139085, 139203, 143089, 143304, 146535, 144656, 147149, 157098, 170191, 174398, 174250, 176647, 178406, 179524, 192255, 206940, 220964, 235360, 255284, 274748, 302552, 332494, 371008, 420248, 484696, 573830, 708796, 904914, 1199426, 1662986, 2397152, 3549265, 5193031, 6611522, 6325789, 4782793, 3325279, 2313975, 1657591, 1230598, 937856, 732479, 588758, 479410, 400910, 341616, 293820, 257155, 222803, 199505, 187985, 174863, 154849, 144897, 141481, 130481, 121213, 115694, 115430, 111297, 102989, 97664, 91937, 89363, 83314, 83792, 88840, 85833, 86976, 87019, 89415, 81466, 73187, 78846, 86550, 87659, 88178, 86118, 86721, 85298, 84584, 89512, 98148, 113383, 156565, 229365, 345379]
9029C45379R0162o2355j07600q0745m4027l3542k1750n233n054k222j943o841
9017F4229q250j2449l6o83r825L024L500P226N557J799k467L214L162L7j467r531
9001D7040m998l531N142J653n548j0966M553j264m044j4763J195J3289J244L87
8987B9389P69K584K107m865j722j623p59N154J199j862M582J0918L178j210O278
8972E4117k675o001o796n497k149n7n998j934p65J152K717K908J546M94M798j380
8956C4480J86k277J063K320l145n052l79J580K377R41n367k942L681L666J753
8941C2885k079l199J740m145j745q55K10n382p681l937no16P556k911L589L981
8925A7406j901K846J023l310L21K024p03j0031P74O038P464L299l672j78q87j358
$$ y = [345379, 435541, 373186, 265586, 184841, 140814, 107272, 85522, 80289, 75235, 73013, 71070, 64229, 55979, 43530, 43494, 42811, 32986, 36010, 39510, 46736, 52293, 54092, 51625, 54839, 58001, 58038, 56571, 47040, 42042, 38511, 43653, 45306, 39758, 28792, 33345, 32081, 28037, 13274, 14469, 27758, 29002, 29389, 30158, 32742, 34849, 29984, 28262, 26639, 25880, 31034, 32233, 30371, 34953, 45871, 49049, 47839, 54117, 51442, 45441, 38645, 33148, 30999, 30942, 24944, 23010, 22245, 23397, 26114, 29022, 30568, 31062, 35860, 34480, 34666, 32389, 33452, 35772, 32627, 27575, 27196, 28776, 31153, 32094, 26727, 23785, 27466, 31132, 32885, 30806, 27607, 29347, 25202, 23457, 22602, 22812, 17430, 9749, 5812, 5807, 5191, 12747, 9836, 13425, 17406, 15505, 18351, 19374, 16064, 16385, 18409, 17706, 7675, 8449, 14487, 21951, 25250, 21578, 21400, 20513, 19155]
8909A9155M63J27r81R16k606M185O872K178l102M07N022P042k777k52k617k333
8893C1699P712L501N332k15M571J0973J4995J7299J7295K9683L0930M8039O8999
8880B90813J14684J90950L03542M37003M37601K3649m20622m23169k98688j91204
8870D64559j25775r0254o2719l5430l1707j9927j6603j3003j4072r227m010n438
8858C6394r61j780Q11n426o154p067n497l716k268M031R53J80p98J690J631k29
8842A1794p61J710m8p066k027j144r12j626O945J448l145J215j421o026r685M147
8826f602J2137m097J371J921k156M028L2O246k807l605k425O349J1801J39o478
8811A5854m261K357o757l238L60M571O087n47o566n002q654r529J263R574J82
$$ y = [19155, 19618, 19745, 18764, 19680, 17074, 21259, 28131, 30309, 27207, 27614, 32636, 39678, 36901, 36649, 34032, 31699, 39411, 42912, 48244, 48029, 52600, 63573, 78568, 95867, 113162, 142845, 173775, 221814, 290813, 405497, 596447, 899989, 1336992, 1774593, 1798242, 1377620, 954451, 655763, 464559, 338784, 248530, 185811, 150381, 118674, 98747, 82144, 69141, 55069, 45842, 41832, 36394, 35433, 33653, 34464, 29038, 22884, 15817, 10320, 6604, 4336, 8367, 9320, 9500, 8702, 10392, 12023, 11794, 11033, 12743, 12695, 5629, 3602, 2458, 1546, -80, 6865, 8313, 5168, 6383, 4962, -1064, -10749, -6602, 5535, 1438, 2809, 4730, 2574, 6602, 6634, 12880, 10073, 6468, 4043, 10392, 22193, 22332, 15854, 11593, 13950, 7193, 3955, 4315, 8886, 14973, 14426, 7860, 2858, -5796, -15325, -14062, -4488, -4306]
8796d306p081P817J2161P694l070n8O1P073r337q808l652O389M915j582J161m385
8780D992K945j218N08Q59k411M648j168l571j438R753M878K107j1191k176N660
8765A3177k735m76O433L512q80l66J319R163J52k190K193K455j773j246L22K57
8749B9317J071k495L130R917L80J497K667N666K625J90j32N724O773P182N165
8734G8677q59l638l622m338o593l758m42J129k82k974n95j904k20R838J917N645
8718F7981J659N263L907O43q91M691M193J823n221l034J558K444J999O124P820
8703A00959J3759J3082N068M556P318K922K57n249J157P455R343L455J354j521
8689A63915m555N135K826n347k504m70k62J787q1K460M330j932q10k650k538k18
$$ y = [-4306, -11387, -3570, 8591, 16285, 13215, 13157, 13218, 20291, 10954, 2146, -1506, 4883, 9798, 8216, 9377, 4992, 7937, 6719, 7227, 8086, 5675, 10323, 9155, 5584, 4146, 13899, 18777, 20884, 9693, 7517, 13177, 10442, 9966, 16399, 19911, 19031, 18665, 19984, 29147, 29299, 27109, 29302, 31757, 29984, 28738, 29060, 29317, 30388, 27893, 31023, 40940, 41320, 42817, 45484, 51150, 53775, 53965, 53833, 59557, 66330, 73512, 78677, 77818, 74180, 70558, 66220, 59627, 55869, 55427, 56556, 56274, 53300, 52705, 50801, 50581, 60419, 62336, 67981, 69640, 74903, 78810, 79453, 78562, 83253, 87446, 89269, 84048, 81014, 82572, 85016, 87015, 93139, 100959, 114718, 127800, 132868, 137424, 144742, 147664, 147921, 142672, 143829, 151284, 160627, 164082, 165436, 163915, 159360, 164495, 167321, 161974, 159470, 159000, 158738, 160525, 160444, 162904, 167234, 165302, 164492, 161842, 159304, 159086]
8673A59086K416M780P928P389Q288J1293O504M691J3309O120J2001J2318j434
8660B54689M284J3083Q705k101L383M702L329O061m87j472O008J3266J8166J0744
8646C42360J3930J9584J6914K1841J7771L4398L9926N1700N2247M2521L7198L8749
8634G29139M3039N5926N3105M1886L6320L3542K9722J3009M311j4222j4405j7332
8622I94040k6284k9082k7507l6746m1789m3676l2323l1262k6215k0342p830Q141
8610F79125J1601N833j0396j5479k1002l3443l7115l8468m0273m6229m3077l9383
8598C71694m0751l2388k6219k0815j6310k1243j8767j2430j1998j3039j4303n49
8586A42882r204r835j2205j1471q268q432q742l285J140O816L063j60m671J22
$$ y = [159086, 161502, 166282, 174210, 181599, 189887, 201180, 207684, 212375, 225684, 231804, 243805, 256123, 254689, 258973, 272056, 280761, 278660, 282043, 286745, 290074, 296135, 295648, 294176, 300184, 313450, 331616, 342360, 356290, 375874, 392788, 414629, 432400, 466798, 506724, 558424, 610671, 653192, 690390, 729139, 772178, 828104, 881209, 923095, 959415, 992957, 1022679, 1035688, 1039999, 1025777, 1011372, 994040, 967756, 938674, 911167, 874421, 832632, 788956, 756633, 725371, 699156, 678814, 670984, 679125, 690726, 696559, 686163, 670684, 649682, 616239, 579124, 540656, 500383, 454154, 411077, 371694, 330943, 298555, 272336, 251521, 235211, 213968, 195201, 182771, 170773, 157734, 143431, 142882, 133678, 123843, 111638, 100167, 91899, 83467, 74725, 71440, 72580, 79396, 82459, 82299, 77628, 77750]
8572G7750L133l876N80O257K589r385p420o693K720k976r378p44k540J352k857
8557D8512p915o819m588m848L074K873N10J0262K700m637l818k736m87L511q628
8542B6966k203k511j237J7P682L102o129j3900m506J339J790J526j851n478j797
8527B810J336Q291L535L455l905l590k241m050m856o327k887N447R45P320j044
8512D239l722N516N222l544o349Q81j488N45j974L000L868k866J552R026L699
8497A7605n724r878m413n51j04j160m38j537K13M581J902m507j898K120L03k306
8481e792J219M83l481M286N637J680j0M746K126r93l282k621r83n310K963n297
8465d629K240J135l248j360J963M728L129K93K580l870n348J759L81L579J670
$$ y = [77750, 80883, 77007, 77587, 83844, 86433, 77048, 69628, 62935, 65655, 62679, 53301, 52557, 50017, 51369, 48512, 40597, 33778, 29190, 24342, 27416, 30289, 30799, 41061, 43761, 39124, 35306, 32570, 32083, 35594, 26966, 24763, 22252, 21015, 21032, 28714, 31816, 25687, 11787, 7281, 8620, 10410, 11936, 10085, 4607, 2810, 4146, 12437, 15972, 19427, 15522, 11932, 9691, 5641, 785, -5542, -8429, -2982, -2037, 5283, 4239, 517, 6033, 11255, 7711, 1362, 2243, 755, 1300, -674, 2326, 6194, 3328, 4880, 13906, 17605, 11881, 2003, -2410, -2961, -3065, -4225, -4663, -6200, -5987, -1406, 496, -4011, -5909, -3789, -3486, -5792, -4573, -4090, -7571, -3285, 2352, 4032, 4022, 8768, 10894, 9901, 6619, 3998, 3015, -2295, 668, -4629, -2389, -1254, -4502, -5862, -3899, 829, 3958, 4251, 6831, 2961, -2387, -628, -247, 3332, 5002]
8450E002o488J464J648J749n3J764Q142N346n065k599j667J821n996l717m247
8435b896m38r46M394o527k80N994P261j823l774K133K068n397k91J270m607K689
8419a170l041l733L237J212k042j324J114O911M697L617o78m824r550k468Q74
8404g168K289O772l325m101J836O15K942N794K261r14l424q43l19m537m250l891
8388a0263o767k192Q998O457O305l476J050m97L976P871M639l896q170l582m36
8373A7n023L442J047j27q93m789K48L954j676M976M040R06J528m515K867P515
8357A3517l047o191p02j887K467k029j741L708L975Q50j652n068Q04J2523j063
8342A4464k497N359N195J108o404J753m577k158K26K59o303o578J707J706L701
$$ y = [5002, -1486, -22, 1626, 3375, 3322, 5086, 13228, 18574, 13509, 10910, 9243, 11064, 5068, 1351, -2896, -3334, -4280, 114, -6413, -6693, -699, 6562, 4739, 965, 3098, 5166, -231, -522, 748, -3859, -1170, -4211, -7944, -4707, -3495, -5537, -6861, -5747, 1164, 5861, 9478, 8800, 3976, -5574, -8042, -7168, -4879, 1893, -1432, -5533, -3697, -3082, -140, 5654, 7915, 7001, 3577, 2734, 2415, -2122, -6372, -10263, -17030, -19222, -10224, -3767, 2538, -938, 112, -385, 3591, 11462, 16101, 12205, 4035, 453, 17, -5006, -1564, -517, -644, -1537, -6326, -6078, -2124, -3800, 1176, 5216, 6122, 7650, 3135, 6002, 13517, 10470, 4279, 3577, 1690, 4157, 2128, 387, 4095, 8070, 8920, 7268, 2200, 3004, 15527, 14464, 11967, 17326, 22521, 23629, 17225, 18978, 14401, 12243, 12469, 12728, 6425, -153, 1554, 3260, 6961]
8327F961K154J940k392M787j832l061K991K945m030k601P71j836O95J723O043
8312A5258K439J321q296j197N004L575L83k675k493p850k144K527M525P475K736
8297B0588J361j809k28o030l631j645O153j85k064q360J850O493m952l542M048
8282H047K461P008K397o704q028k584L464r86Q122l266J419m763L089j03M946
8267A4519o573n275K579K593K829j62n055K175J601j32O694K105j697j499m976
8252I726p15Q99L400m158n36o27m057M37k541j126l081P61Q226K717P583L734
8236B0642K037r885K242l205p17r25K001J994m130o231j059K474L82K981N081
8221A3682o28J394j827n708L067K199J063j0698m618l225m779k888Q296O680O19
$$ y = [6961, 9115, 11055, 8663, 13450, 11618, 8557, 11548, 14493, 10463, 7862, 8633, 6797, 7492, 9215, 15258, 17697, 19018, 10722, 9525, 14529, 18104, 18487, 15812, 13319, 5469, 3325, 5852, 10377, 17852, 20588, 21949, 20140, 19912, 13882, 10251, 8606, 14759, 14574, 12510, 4150, 6000, 12493, 7541, 3999, 8047, 10508, 17516, 19913, 13209, 5181, 2597, 6061, 5075, 13197, 9931, 11350, 6587, 9676, 9573, 14519, 7946, 2671, 5250, 7843, 10672, 10510, 5455, 7630, 9231, 9099, 15793, 17898, 16201, 14702, 9726, 9011, 9910, 13310, 9152, 8616, 7989, 3932, 4369, 1828, 702, -2379, -1618, 6608, 9325, 16908, 20642, 22679, 12794, 15036, 11831, 11114, 10189, 12190, 14184, 10054, 3823, 2764, 5238, 5620, 8601, 13682, 13054, 14448, 12621, 6913, 9980, 12179, 13242, 2544, -2074, -5299, -10078, -12966, -4670, 2010, 2629]
8206B629l785k846j694j503N322j499L99L595q23o038o09N675l007j161P319q42
8190A132n376r01K741M502j530l992m327P647J609m490o107M69O62j548L766R804
8174D061J0303K2308K0612J5805K9473O3605R5917N0797n3128p6177o5344m1428
8162G6804k7147j5546n434o841l502J291l868o491m483L681m278l374J866J753
8148D431L041K504N151M832L019J813k366L282n293q159L183J662K61P917Q432
8133C3710Q259P379J4251K2908L0649M8063N7797L3343k6614n3198n7018m2272
8121G7257k8721j8408p562m975j520J781K878K617n326l791j223j439N088K026
8107A8682J523k59r34o196O01L176N988L311l440n136k071j1054j385Q282P641
$$ y = [2629, -1156, -4002, -5696, -7199, -1877, -3376, -2977, 618, -205, -6243, -6852, -1177, -4184, -5345, 1974, 1132, -4244, -5145, -2404, 2098, 568, -3424, -7751, -104, 1505, -2985, -9092, -8623, -7961, -9509, -5743, 4061, 14364, 36672, 57284, 73089, 102562, 166167, 262084, 312881, 259753, 183576, 118232, 76804, 49657, 34111, 28677, 21836, 18334, 19625, 15757, 9266, 4783, 8464, 4186, 812, 2678, 4431, 7472, 9976, 15127, 19959, 22978, 24791, 22425, 25707, 20414, 12255, 15438, 17100, 17361, 25278, 33710, 41969, 49348, 63599, 86507, 117156, 165219, 223016, 256359, 229745, 176547, 119529, 77257, 48536, 30128, 22566, 17591, 16071, 17852, 20730, 23347, 18021, 14230, 13007, 11568, 16656, 18682, 20205, 19946, 19012, 12816, 13417, 16593, 22581, 25892, 22452, 17316, 15245, 4191, 2806, 11088, 18729]
8092A8729J0952m895l718j061L855J0088m807n706L728O501J880M497J909Q031
8078D9983J3186l524k160Q192R365Q672P445R318J714J0023J2408K3006K0519
8065A68147J6283J7525K2696L3951L8032L9803L9682K3217K883j0867j2407j7754
8053C61191p593o940l938o25p628j1508o428M154o755j018p248j4851j0818K291
8039B82286J756K557K5j554k276k225j085J0267J0092q045o118j055J2921K0708
8025C18254K4883L5513M6698M9312P5699J12835J65826K48216L10689J68489j22234
8014A434180k58911k34834j80568j29651q9793o8544m3635k7005k9521j9109j4443
8003C38166j6856j7379l0793k5050j6361j4253j1307m526l914o498j465J463M338
$$ y = [18729, 29681, 24786, 21068, 20007, 23862, 33950, 29143, 23437, 27165, 33666, 35546, 40043, 41952, 49983, 63169, 59645, 57485, 65677, 75042, 83714, 91159, 100477, 102191, 112214, 124622, 147628, 168147, 184430, 201955, 224651, 258602, 296634, 336437, 376119, 399336, 402219, 391352, 378945, 361191, 353598, 346658, 342720, 342095, 334467, 322959, 316531, 320685, 313930, 312912, 305664, 290813, 279995, 282286, 284042, 286599, 286624, 285070, 282794, 280569, 279484, 289751, 299843, 291798, 285680, 284625, 297546, 318254, 343137, 378650, 425348, 474660, 550359, 663194, 829020, 1077236, 1387925, 1556414, 1434180, 1175269, 940435, 759867, 630216, 540423, 471879, 428244, 401239, 371718, 352609, 338166, 321310, 303931, 273138, 248088, 231727, 217474, 206167, 201641, 197727, 191229, 189764, 191227, 195565]
7990A95565Q049J6423K4763K9426M7553P4369N7143j4910n5188m0951j2758J3732
7978C43216K0506K6326L1036M3932M9964K7223J640j4862l3092m3884n8139n5225
7966C38641l7159k3737k4460k2489j7340k0581k7007j6516n587p895j4322q962
7954A12586j4212l806J772l576l28L7q58k61K187Q756J9002K8150L249j7605k4187
7939A10906k3272j5182J000k894l036P463J5038J0592R15j1140q304q612k308
7926G1166l196l819k972j0898q409Q39p010j3107l462l973j261J894M888j333
7912A9347M006M23k676r99m500J066m81l944o014n783J419J0340K93j0942k612
7897a057l66O160P661o90m129k752L723J187n28l907j875j279J801k958m806N961
$$ y = [195565, 203614, 220037, 244800, 274226, 321779, 396148, 453291, 438381, 383193, 342242, 329484, 343216, 363722, 390048, 421084, 465016, 514980, 542203, 543843, 528981, 495889, 452005, 393866, 338641, 301482, 277745, 253285, 230796, 213456, 192875, 165868, 149352, 143765, 135870, 121548, 112586, 98374, 94568, 96340, 92764, 92436, 92473, 91615, 91354, 93541, 102297, 121299, 149449, 152698, 135093, 110906, 87634, 72452, 73452, 70558, 67522, 74985, 90023, 100615, 101530, 90390, 82086, 73474, 71166, 67970, 64151, 61179, 50281, 41872, 42711, 35701, 22594, 19132, 15159, 13898, 15792, 20680, 19347, 23353, 23776, 21100, 20101, 15601, 16667, 16186, 12242, 6228, 445, 1864, 12204, 12497, 1555, -1057, -1423, 4737, 12398, 11708, 7579, 4827, 8550, 9737, 9209, 5302, 3427, 2148, 3949, 991, -3815, 2146]
7881B146K923k520J046l241O187Q239R438P900k706j2240r086R53k352k605M512
7866H594M878l707m277l480j1005k005P56Q539J0445o98p688K44O498K38m346
7851B986l050p526l058k336K056N413l448N275J183n257r05N877j102n098j144
7836a0134j293l057L70L308K067M17l87L652l75J946K226p270r065K470R405N844
7820A24j251o923K981m494k500L952M165k258j0127J121N317O34J734L834L701
7805A0j573r69N477q91J163k242j344j832J418n267n783n869M20P655L382L028
7789c217L07p231m748K644p164n276K751M983Q791j037P9k435J678l712J619l864
7773a5832j27P286P15l397M17o26j327J87J110o75P53O457L746L309m02K178l75
$$ y = [2146, 5069, 2549, 3595, 354, 6541, 14780, 24218, 32118, 29412, 17172, 8086, 9039, 6687, 4082, 8594, 13472, 9765, 5488, 2008, -8997, -11002, -10246, -1707, 8738, 8040, 352, 596, 7094, 7332, 2986, -64, -7590, -10648, -12984, -10928, -5515, -8963, -3688, -2505, -7762, -8667, -2790, -3892, -8990, -10134, -11427, -14484, -14114, -10806, -8739, -8322, -8709, -5057, -5432, -3486, -1260, -8530, -17595, -15125, -5720, 124, -1127, -8050, -5069, -9563, -12063, -8111, -3946, -6204, -16331, -15210, -9893, -9259, -7525, -3691, 10, -1563, -2532, 2945, 2054, 3217, 975, -369, -2201, -783, -6050, -11833, -17702, -17282, -9627, -6245, -3217, -2910, -10141, -14889, -12245, -19409, -24685, -21934, -16951, -8160, -9197, -9118, -11553, -9875, -13587, -11968, -15832, -15959, -8673, -7958, -11355, -10938, -11564, -12891, -12704, -11594, -12269, -11516, -5059, -1313, 1996, 1594, 3772, 3397]
7756C397l854q205l307M97L025j896j038k259K008O890O87q067m083J410r6j507
7740a6398j08m060L373P93n42p623o241l043Q136J1632R53J905N98J038k020k04
7724a1811O100N05q059J7L019O060m826j293m842J777N544L558p315p272N323
7709a3515M541O026L229l28N671j811q846M539K543n049p229L82K229l651O871
7694d398R452K282n005p482o695mL409N184L779R71l203l164o46k738m776n140
7678a8174o99J205n021M261L993K666j368K530j810k450M138M130k982K50N511
7663c820p099O18r98M263J825K554J257J367L009p274q307N907N823p03n111k88
7647f977J148p13r56J130j871q07M063L337m40m440j335L454m203p249M883M060
$$ y = [3397, -457, -8662, -11969, -11472, -8447, -10343, -11381, -13640, -11632, -4742, -4055, -12122, -16205, -14795, -14891, -16398, -16506, -20566, -17193, -16400, -16942, -24565, -30806, -33849, -25713, -14081, -13128, -11223, -10625, -9587, -11607, -11811, -5711, -5206, -13265, -13248, -10229, -4169, -8995, -10288, -15130, -13353, -7809, -4251, -11566, -18838, -13515, -8974, -2948, 281, -47, 5624, 3813, -5033, -494, 2049, -3000, -10229, -9847, -7618, -11269, -4398, 5054, 7336, 2331, -5151, -11846, -11850, -8441, -3257, 522, 1493, -1710, -4874, -5520, -8258, -13034, -18174, -18873, -17668, -22689, -18428, -14435, -11769, -13137, -10607, -12417, -14867, -10729, -6599, -9581, -9331, -3820, -10919, -10301, -11299, -7036, -5211, -2657, -1400, -33, 2976, -4298, -12605, -6698, -875, -1578, -6689, -6977, -5829, -6542, -7498, -6368, -8239, -9046, -4983, -1646, -2086, -6526, -7861, -4407, -8610, -15859, -10976, -6916]
7631f916J867j505J329j970p204J928J660o66M210J474J27M287O84K085o091n497
7615a0198j600O770K133n420j205K18J112j370K76o33j113K804L441l479j550
7600i814L526N164m201o984N92L510N063J356k335K51J980L513n956o259l97L970
7584g021K62K86m414l382M031Q020k722o993k68N779J508M169P474l879p857O83
7568d324r992p361m033N421N456O099k860Q50Q263R45J112L963k227n197k93o41
7552d819p55J025l870n915j591j219K718M786N661Q198j389n895k428l391M143
7537d741k396k470J089K980l491L763q4m012j0124l406L46O345J859k28p47n46
7521a5863M615L475J364l586J252J931J94j180M958M009j534o772m93N106n25
$$ y = [-6916, -5049, -6554, -5225, -7195, -14399, -12471, -10811, -11477, -7267, -5793, -5666, -1379, -695, 1390, -4701, -10198, -11798, -5028, -2895, -8315, -9520, -9302, -8190, -9560, -9284, -9917, -11030, -8226, -4785, -8264, -9814, -6288, -1124, -5325, -12309, -11717, -8207, -3144, -1788, -4123, -3872, -1892, 1621, -4335, -10594, -10991, -7021, -6759, -6473, -10887, -14269, -10238, -2218, -4940, -11933, -12201, -6422, -4914, -745, 6729, 2850, -5007, -4324, -14316, -21677, -25710, -20289, -14833, -8734, -11594, -10744, -2481, -1536, -424, 3539, 1312, -3885, -4178, -4819, -5574, -4549, -8419, -14334, -15925, -17144, -14426, -9640, -3979, 4219, 2830, -3065, -5493, -8884, -4741, -7137, -9607, -8518, -5538, -9029, -5266, -5350, -9362, -19486, -22892, -22546, -16201, -14342, -14570, -15317, -15863, -11248, -7773, -6409, -9995, -8743, -6812, -6618, -7798, -2840, 1169, -365, -7137, -7630, -2524, -3049]
7506c049m188K088q8k128L180J338K815L917k696L896j0002k82j461o223m147
7491a7030O99K360J5008l586o115o444J639K925J002k059L202O612K807q405p050
7476a4435R601J947o272j1075j078N489O004P335N369m230p320P46L636K45k864
7461f902k820L500L250j38q97o364n369L005M439q41P26j096o048L197m02p256
7445b0016J870P80J123M162J518m183N879p27K007N364l013J357j15L222n787
7430f559k353q30j135j709j747K237m64J174J327k099j953M705o175O34r46k134
7414a8027M987N632j238L448Q286k440l770p840l091r27L959q46l08J704K710
7399g761j079l151j920O3N417J333o309o026k77j29K466l394N283N732M750j6
$$ y = [-3049, -7237, -5149, -5237, -7365, -4185, -2847, -32, 3885, 1189, 5085, -4917, -5199, -6660, -12883, -17030, -16331, -13971, 1037, -2549, -8664, -15108, -13469, -10544, -9542, -11601, -8399, -1787, 1020, -7385, -14435, -4834, -2887, -9159, -20234, -21312, -15823, -9819, -2484, 2885, -1345, -8665, -7919, -4283, -4038, -6902, -9722, -6222, -2972, -3110, -4007, -10371, -15740, -12735, -8296, -9137, -8411, -9507, -15555, -12358, -12760, -20016, -18146, -17366, -16243, -12081, -10563, -14746, -8867, -9594, -7587, -2223, -5236, -3879, -3994, -772, -6559, -8912, -9742, -10877, -12586, -14333, -12096, -12560, -11386, -10059, -12158, -14111, -9406, -15581, -14947, -15893, -18027, -13040, -7408, -8646, -5198, 3088, 648, -3122, -10962, -14053, -14980, -11021, -11867, -12175, -10471, -7761, -8840, -11991, -13911, -13848, -8431, -7098, -13407, -19433, -19710, -19839, -17373, -20767, -15484, -9752, -5002, -5018]
7383e018o285P79j042M505N832m89J88j096P51j98n52p309O451Q974k364o439
7367c312j0826q62K438Q8p868j035K367j696R224M879k89o961N353j19j491K829
7351g281q1J110p65Q79K100l09j954N72J344L559M310n445k618L799K778j993
7335Ej58j839j391j404J460M403l109k447j746k149K942K971J527p46R11j536
7319b306k504J336M078p02L359j331m569n901m70K842j251l677L007L90n31M057
7303d173N783m56o832n202J666k554J964J958N215M406m644j728J740M474l274
7288a657m554l846j380J149N545K377N124l617n046J495L375J761j843l886L896
7273a107q004l670l584r458M766O855M738J197J290J334p39J596L77p229J551
$$ y = [-5018, -11303, -10524, -11566, -7061, -1229, -1718, -1530, -2626, -1875, -2073, -2625, -9934, -3483, 5491, 3127, -3312, -14138, -15000, -12562, -12474, -20342, -21377, -19010, -20706, -11482, -6603, -6892, -13853, -8500, -8619, -10110, -7281, -7362, -6252, -7017, -6138, -4038, -4347, -6301, -5729, -4385, -826, 3484, -1961, -4579, -780, 1998, 5, -153, -1992, -3383, -4787, -3327, 1076, -2033, -4480, -6226, -8375, -5433, -2462, -935, -1681, -770, -2306, -4810, -3474, 604, -98, 3261, 1930, -2639, -8540, -9010, -6168, -7419, -11096, -8089, -7699, -8230, -4173, 1610, 1154, -5678, -10880, -9214, -11768, -9804, -7846, -2631, 1775, -2869, -4597, -2857, 1617, -1657, -6211, -10057, -11437, -10288, -4743, -2366, 2758, -859, -5905, -4410, -1035, 726, -1117, -5003, -1107, -9111, -12781, -16365, -25823, -21057, -14202, -9464, -8267, -6977, -5643, -6382, -4786, -4409, -11638, -10087]
7258a0087L285J313K173m66l455l950M291Q178m653o390k89m768L013L101J988
7243f716j96K533n36n520q009J752J774r58M869N240M461L622J059r16j188k393
7227a122l345l384n088l13N182M87m248J306M148o576j157J00J653J160J161L038
7211f998J776j652Q86J072l184l991q989P44L388j113O8J516R260P910j574j005
7195a886Q01l123M694k148o886k867N695N224j18l465K160o077M887K920j00J680
7179A391k763k711n846k466J389J867R59M6L288K410l845l152J905O531K272J10
7163A385o330q108J306k213P808L650O254j554M876L734m481J5l301q295j871
7148g125J345k743L62l131K777Q529P36k75j625J905k935m000l463q762k64M221
$$ y = [-10087, -6802, -5489, -3316, -3782, -7237, -11187, -6896, 1282, -3371, -9761, -10050, -14818, -11805, -8704, -6716, -6912, -4379, -4915, -10435, -18444, -16692, -14918, -15876, -11007, -5767, -1306, 2316, 3375, 2459, 1271, -1122, -4467, -7851, -12939, -13252, -8070, -7583, -11831, -10525, -6377, -12953, -14110, -14010, -12357, -11197, -10036, -6998, -5222, -6874, -5988, -4916, -8100, -12091, -21080, -20336, -16948, -18061, -17993, -16477, -7217, 693, -881, -1886, -1085, -4208, 486, -1662, -8548, -11415, -5720, -496, -614, -4079, -1919, -7996, -3109, -189, -289, 1391, -1372, -4083, -9929, -12395, -11006, -9139, -8180, -8134, -4846, -2436, -6281, -9433, -7528, -997, 1275, 1385, -4945, -13053, -11747, -13960, -6152, -2502, 3752, 2198, 7074, 10808, 6327, 6342, 3041, -5254, -7125, -5780, -8523, -8161, -11292, -8515, 14, 750, 475, -1150, 755, -2180, -6180, -9643, -18405, -18669, -14448]
7132a4448J388J736M666N628M108L701j0378K80M81L962m189l388N563k413m034
7117g337K641k490L002R23J169k21J597n139o853P575K740o144o799n11L540O353
7101e954p08p945q01p93K25j618P256j653J880R830J886j011O49j802l836j94
7085d589K440j843l070j114N786k029j2196j565K85J968Q821K767k254n534J615
7070a0512o18J158N083j155J934J871K527o034n226k790J326M998O04P288O01
7055A055o720j106O15K697j185j821K03O80J07O602O229l091l176l3l871k061
7039d876N663K360j356M880k963m474k957j020K006J794p139p23J1106n594q271
7024a1564J565n2k16o367p07L608O907K534N709K737l283K54P38K029k239K972
$$ y = [-14448, -13060, -11324, -6658, -1030, 3078, 6779, -3599, -3319, -2838, 1124, -3065, -6453, -890, -3303, -7337, -4696, -7186, -4184, -3261, -2092, -2313, -716, -5855, -12708, -5133, -2393, -8537, -15336, -15847, -12307, -5954, -6662, -14607, -15408, -16201, -15976, -17594, -10338, -11991, -10111, -281, 1605, 594, 1243, -559, -4395, -4589, -2149, -3992, -7062, -8176, -2390, -4419, -16615, -18180, -17895, -15927, -7106, -4339, -6593, -12127, -10512, -11130, -9972, -4889, -6044, -4110, -2239, 288, -5746, -10972, -13762, -12436, -7438, -6834, 454, 1055, -5665, -6771, -6156, -3459, -4644, -6465, -6262, -5582, -5475, 1127, 7356, 4265, 1089, 1056, -2815, -4876, 787, 3147, 1791, 6671, 3708, -766, -3723, -4743, -2737, -943, -8082, -8805, 2301, -3293, -11564, -9999, -10051, -10267, -16634, -17341, -13733, -6826, -4292, 1417, 4154, 871, 1125, 1863, 3892, 1653, 4625]
7008D625n986l188j7o316n889r00L883K784l627n926L464O140L987k707O28J747
6992g298J97j436p176J503N459k4N384Q6K939R54j23K494K542m621m777k68k189
6975f354l671L920O304J627K236j650j921J94L2K317j1253o587O321M993O36J452
6959a404k085J71P055J858p266l962j880K466J506k999n746N626Q804l158l280
6944d294N635O991o625r25p359o870J910N66p04J747M402L889k271p67p298QJ1976
6927A1M552q76j3688o894P319N993L15q907j0024P28K646O725L767M502O133l093
6911g91n41l424N596L19n27m25k20k741L851o25l438n495N151N130l155l374M418
6894b91J3446J6733K8153M2738L9405j6704m8055l3301j8244j4053o892m914N227
$$ y = [4625, -1361, -4549, -4566, -10882, -16771, -17671, -13788, -11004, -14631, -20557, -17093, -10953, -6966, -9673, -9045, -7298, -7101, -8537, -15713, -14210, -8751, -8775, -3391, -3305, -366, 588, 465, 2959, 5501, 880, -3897, -4165, -6354, -10025, -6105, 199, 1826, 4062, 2412, 491, 685, 717, 3034, -8219, -14806, -8485, -3492, -2856, -1404, -3489, -3318, 3737, 5595, -1671, -5633, -7513, -5047, -3541, -6540, -12286, -6660, 2144, -1014, -4294, 1341, 8332, 1707, 782, -6577, -13447, -11537, -10971, -11675, -9928, -5526, -1637, -3908, -4675, -11973, -11965, 11, 4563, 3687, -10001, -16895, -9576, -3583, -3268, -12175, -22199, -21471, -18825, -12100, -8333, -3831, 2302, -791, -1332, -4756, 840, 1159, 632, 207, -13, -2754, 1097, 472, -2966, -8461, -3310, 1820, -1335, -4709, -291, 13155, 29888, 58041, 100779, 140184, 123480, 75425, 42124, 23880, 9827, 2935, -1979, 3248]
6881C248J852k348j534L41J069r50n450J264o04p35P23j002k06m284O131m676
6865g161k603N10R48j760R84k862p41K256N883L222K16o158k035J673N55q89l506
6848a1468l27M263L207J18o06j549n12M204n378o982M411O383j171J065Q43l740
6832g239p537K138n96K691N755M125j273m91J0052j1o339j961l064n010m382L514
6816i628P61O78m995N765L567M760K124j1710k270J815L758K931j547N995K170
6801D174p253j257r99k668M083k038l924l208l077R867J2176R322L091j320k336
6786A4633j048k727l829L715j234O810J1158N138o173J846L747Q030K3641M5044
6772A08751O0480J08102J86084J75837q5853j94897j24545p7594n2743l0923j7419
$$ y = [3248, 5100, 2752, 1218, 1559, 2628, 1678, -3772, -2508, -3112, -3847, -3124, -4126, -4332, -8616, -2485, -7161, -9764, -9254, -8306, -10066, -9082, -11944, -12685, -10429, -4546, -1324, -1108, -7266, -9301, -7628, -7073, -7962, -11468, -11795, -7532, -4325, -4207, -4813, -6362, -6874, -2670, -8048, -15030, -10619, -4236, -5407, -4342, -3499, -7239, -14776, -12638, -13234, -10543, -4788, -663, -1936, -2427, 7625, 7614, 1275, -686, -3750, -8760, -13142, -9628, -8867, -8189, -13184, -7419, -3852, 908, 3032, -8678, -10948, -9133, -5375, -2444, -3991, 2004, 4174, -3079, -4336, -5335, -8003, -3920, -5958, -9882, -13090, -16167, -6300, 5876, 15198, 18289, 16969, 14633, 13585, 10858, 7029, 10744, 9510, 16320, 27478, 32616, 26443, 28289, 32036, 40066, 63707, 108751, 169231, 277333, 463417, 639254, 553401, 358504, 233959, 156365, 103622, 72699, 55280]
6761E5280q075n908j917L812M707j125q655k303M101Q696J3951K0514L4354N2825
6747A70257J07146J62884N9523j17176r3064m9522n2764m1882j3250M849K0170
6736A57171L5990O0835M3655k0434o7789o5673m4918l3594k2501j5320r402L386
6724B1406M036J325l212n35o118k726k622k15m629L229K256J96M046m036l470
6709H931p324l9j491J843L925J162q105j411n865m276j30k757J059O514R407K154
6693C597j853l396m897M138m84J005n0K156P87k966m396k265K53N726M512l3k888
6676a054k393k255o35l000r39k585J244R99K292p22m85L444L373k838l893J951
6660g496K541m485m453M146J703J089N773j099q451L474P062J875J873n177n69
$$ y = [55280, 47205, 41297, 39380, 43192, 47899, 46774, 38119, 35816, 39917, 48613, 62564, 83078, 117432, 170257, 277403, 440287, 499810, 382634, 289570, 240048, 187284, 145402, 132152, 137001, 157171, 193161, 253996, 297651, 277217, 209428, 143755, 98837, 65243, 42742, 27422, 18020, 21406, 25442, 26767, 23555, 23020, 16902, 14176, 11554, 11339, 6710, 9939, 12195, 12391, 16437, 12401, 8931, 1607, 1568, 77, 1920, 5845, 7007, -1098, -2509, -8374, -12650, -12780, -15537, -14478, -7964, 1443, 3597, 1744, -1652, -6549, -2411, -2895, -1890, -1940, 216, 1003, -1963, -6359, -8624, -8371, -2645, 1867, 1834, -1054, -3447, -5702, -6337, -9337, -10276, -12861, -11617, -10618, -8326, -9048, -9533, -6089, -2716, -5554, -9447, -7496, -4955, -9440, -13893, -9747, -8044, -6955, -1182, -2281, -10732, -7258, -196, 1679, 3552, -1625, -2194]
6645b194N657J646q626o442L818m666l817N401M317k597r5j391k905K755P707
6630a432P87j909k519M048k601l988l51K939k609O77K036Q36q19q18N398j207
6614a532j767o660k04K400j937J250L19L110j292J398O39J218m261m959L67M124
6598g787o34K185N190m094J398N334K549M454K944q684l794q206k907M602j49
6583g599q13O950M343J06l914l661J541k499o036P431N592o245n352j451L004
6568h603L838N68J018j566K74J1323P734m521m576l210k5p824l464L413k398j196
6552i215O154L597j776J344j921p493O260O37n826P205l55n018n700O006n437
6537a1538k086O515K779M069l68K272L74P15k87j271n24q83m31K077n12J461j242
$$ y = [-2194, 3463, 5109, -3517, -9959, -6141, -10807, -14624, -9223, -4906, -7503, -7598, -8989, -11894, -9139, -1432, -645, -2554, -5073, -1025, -3626, -7614, -7965, -5026, -7635, -6958, -4922, -4086, -4905, -5723, -325, -1532, -3299, -9959, -10163, -7763, -9700, -8450, -8131, -5021, -6313, -4915, -4276, -3058, -7319, -12278, -11911, -7787, -8421, -6236, -1046, -5140, -3742, 1592, 4141, 8595, 11539, 2855, -939, -9145, -12052, -7450, -7599, -8412, -1462, 2881, 2987, -927, -4588, -3047, -5546, -11582, -4151, 1441, -4804, -10156, -11607, -8603, -4765, -4197, -3179, -4745, -4471, 6852, 14586, 10065, 5489, 2279, 2254, -5570, -9034, -5621, -8019, -9215, -3061, 536, -1240, 104, -1817, -9310, -3050, -2413, -8239, -1034, -1389, -6407, -12107, -6101, -11538, -13624, -7109, -4330, -261, -629, 1643, 2017, 2732, 2445, 1174, 650, -233, -664, 1413, 901, 2362, 1120]
6520A120n615j028L539j406n170L393P233l508k908q434N147Q036j290p595l309
6505a1795N885M978N80r75r67M482K406J260l542p27K702j973K281n154n635L156
6489c038M562N31p199M04R007J359O09l708m263J721l15l943K786n176l37L320
6473c680k723p050L295J321k237Q417n29r100J128L753L362j208r99k119O286
6458b083P984k100k062P97l888K910M329k343q796k934J908M290J070j701M796
6443B177J996k302M448J838J306J686L220J157o829o196o747J453O181m04l10
6428B674k351o110m284J863N72l62J185M742Q68m483k675O295J1144L055j755
6413A0378k281M348R51j1135l947k410P03J671l506N7K751o77l579P816L331l266
$$ y = [1120, -4495, -5523, -1984, -3390, -8560, -5167, 2066, -1442, -4350, -12784, -7637, 399, -891, -8486, -11795, -5910, -932, -352, -1327, -2294, 2188, 4594, 5854, 2312, 1585, 4287, 2314, 4595, -559, -6194, -3038, 1524, 2055, -5144, -4740, 4267, 5626, 6235, 2527, -1736, -15, -330, -4273, -1487, -6663, -7000, -3680, -6403, -13453, -10158, -8837, -11074, -2657, -3186, -12286, -11158, -7405, -4043, -5251, -6250, -8369, -2083, 5901, 3801, 1739, 2536, -1352, 1558, 5887, 3544, -5252, -8186, -6278, -1988, -918, -2619, 2177, 4173, 1871, 6319, 8157, 9463, 11149, 14369, 15526, 8697, 2501, -4246, -2793, 3388, 2984, 2674, 323, -5787, -10071, -8208, -7636, -7998, -6813, -2071, -1203, -5686, -8361, -2066, 9078, 12133, 10378, 8097, 12445, 13396, 2261, -1686, -4096, -3393, -1722, -5228, -5171, -2420, -3097, -6676, 1140, 4471, 1205]
6397A205N066k303q692K554L549o95l24l947L245j628k826p94M282K805J57l724
6381b070p788j167M672K979J775k716l841N635J192o112K20l071L817r53j411
6366h839l273j1520O706J5350J793k86K773L248n047l697j83k012K3J191l581
6351g354L639J773j029n114k089j401K301O631l696q43m387k162J103O081N082
6336a465l640m162m497k17l992K026O051L34N803J917n163j488l051O233J1361
6321F050q837p322K93O695N468l834n570m24k532l856M771Q881R88k891K999j491
6305f12k002n564k838N55r84O097L514K302l304O08M489m25o63n572j596L817
6289b178L247L169P3l776M250l773p89n403N058P897j126j1190j978p99L574j04
$$ y = [1205, 6271, 3968, -4724, -2170, 1379, 684, 360, -3587, -342, -1970, -4796, -5590, -1308, 1497, 1654, -2070, -9858, -11025, -6353, -3374, -1599, -4315, -8156, -2521, -1329, -7441, -7221, -10292, -6475, -7428, -8839, -12112, -23632, -16926, -1576, 217, -69, 2704, 5952, 905, -2792, -2975, -4987, -4964, -3773, -7354, -3715, -1942, -2971, -8085, -10174, -11575, -9274, -2643, -6339, -7182, -11569, -13731, -12628, -6547, -1465, -5105, -9267, -13764, -13981, -17973, -15947, -9896, -9562, -3759, -1842, -7005, -8493, -11544, -5311, 6050, -2787, -10109, -9816, -3121, 2347, -1487, -7057, -7481, -10013, -13869, -9098, -217, 771, -2120, 879, -612, -2614, -8178, -11016, -10461, -11445, -5348, -1834, 468, -2836, -2228, 2261, 1836, 1173, -4399, -5995, -2178, 1069, 4238, 4311, 535, 4785, 1012, 223, -5180, -122, 7775, 6649, -4541, -6519, -7318, -3744, -3848]
6273c848o904K013N562L918P196K871q283L66P99j198M936j849j478M006O156
6258A4263p365p954k432L272M85j689p150m149k494P808R613M750l395l949k495
6243b881K913m469N3p04o23L652r46J485r74k054k672J508L395q39j489L40j432
6226e737l192J942QM981Q586j667q163p184k973M44O679L602M934M95o141m690
6210h076o166O397Q650J2304m150q892n069j217N953l135l371O144J603k120k622
6195c767J027M029Q17J398j992k148Q75r508r788L109O959J1121j400q541L49
6180g460m770k971L130K646k904o810K025N470P33O356O375l049n648O69j931
6165h139N79K410j803Q32k196O13L323k616k026L130j377o37Q55K784j585J412
$$ y = [-3848, -10752, -8739, -3177, 741, 7937, 10808, 2525, 2891, 3690, 2492, 7428, 5579, 4101, 8107, 14263, 6898, -1056, -3488, -216, 269, -1420, -8570, -12719, -15213, -7405, 2208, 6958, 3563, -386, -2881, 32, -4437, -4384, -5088, -5711, -2059, -3005, -1520, -2494, -4548, -7220, -5712, -2317, -3156, -4645, -4305, -5737, -8929, -6987, -6979, -1998, 6588, 4921, -3242, -10426, -13399, -12955, -6276, -2674, 2260, 2755, -3386, -8076, -14242, -7845, 805, 13109, 8959, 67, -5002, -6219, -266, -3401, -6772, -628, 975, -1145, -3767, -2740, 1289, 2106, 3504, 1512, -636, 239, -9269, -19057, -15948, -8989, 2132, 732, -7809, -7460, -12230, -15201, -12071, -9425, -12329, -19139, -17114, -11644, -10911, -4555, 1820, -1229, -6877, -6208, -8139, -7560, -5150, -6953, -6121, -8317, -7704, -4381, -6997, -9023, -5893, -7270, -7907, -7052, -4268, -5853, -4441]
6149d441N969j887n650K234K270L834L111k294l649j848k879Q84J554r158n718
6134a7668R362J5526K473k66P5n842l131o187k597k624K555M891K179P96j279
6119a737O456R124o477r587j1604m378L287R049O671j46n290J481Q82j149L456
6104C8M799l068j359K860Q12j428m96j457k816m415M062O048m584k257l797O553
6088e05J681l036j461k58R99J544R14p89p919l156P124K197P42M51j712k388O820
6071A248K447l261j197n90q580j327J1906L219n455k369L08J252L022L19k707
6056a765o061m631J713J159L093N645m98J271O21q354n241K725M105L201r65j0820
6040a4802N02J1107K090n74L865K930n827m216J046M258j430j623K12M165L258
$$ y = [-4441, 1528, -359, -6009, -3775, -1505, 2329, 5440, 3146, -503, -2351, -5230, -4346, -2792, -11950, -17668, -8306, 7220, 9693, 9427, 9502, 3660, 529, -5658, -8255, -10879, -8324, -3433, -1254, -458, -1737, 4719, 13843, 7366, -2221, -13825, -18203, -14916, -5867, 804, 658, -4632, -3151, -2269, -3418, 38, 4837, 1769, 410, 3270, 4082, 2654, 2158, 701, -2115, -6530, -2468, 3580, -1004, -3261, -7058, -505, 1176, -1860, -3321, -3579, -2580, -1036, -122, -911, -8830, -11986, -4862, -2665, -1923, -1472, -3184, -5572, 1248, 3695, 434, -763, -1353, -9933, -11260, 646, 3865, -1590, -3959, -3651, -2399, 623, 942, -1765, -7826, -12457, -10744, -9585, -6492, -847, -1345, -74, 547, -7807, -13048, -10323, -6218, -3017, -3982, -14802, -14300, -3193, -1103, -1677, 2188, 5118, -709, -4925, -3879, 379, -1051, -2674, -2462, 1703, 4961]
6025D961m961o692o151L577R751K096l560l107l717J279l188K685J875p38J164
6010d726l328m234j128M576P597j476L163M304l718k326O68L373l919p020J197
5995f997m30K832l783n84L239n299l291L20K59p51N111N671J655J913J62N41R516
5978A0084L730n015M649k385j0397n355k713n146r59o84j360J506J0581j647o916
5963a2027p83K59L632j810k823Q67P521L748R935l059p623r879o195M606O78o539
5947a9492N796N703K492M588J449k704j111K068K38j852m228l272K34P63J061
5932h267n41K261P19l374p27J833L433k59M035j000j023K593p865l91L451J870
5916c252J210J0030j404p646q359P94J339m641Q975M466L252k555j369o829j861
$$ y = [4961, 0, -6692, -12843, -9266, 485, 2581, -979, -4086, -7803, -6524, -9712, -7027, -5152, -5890, -4726, -8054, -12288, -13416, -8840, -1243, -2719, 444, 4748, 1030, -1296, -628, 2745, -1174, -8194, -6997, -7427, -4595, -8378, -8962, -5723, -11022, -14313, -13993, -13734, -14485, -9374, -3703, -2048, -135, 27, 568, 10084, 13814, 8799, 13448, 11063, 666, -4689, -7402, -12548, -13507, -14191, -15551, -14045, -3464, -5111, -12027, -12810, -12551, -8919, -10729, -13552, -12685, -5164, -1416, 8519, 5460, -2163, -12042, -18237, -13631, -12953, -19492, -13696, -7993, -5501, -913, 536, -2168, -3279, -1211, -973, -2825, -7053, -10325, -10091, -9328, -8267, -8808, -6547, -5828, -9202, -9929, -8096, -4663, -4922, -887, -1887, -2910, -317, -8182, -8573, -5122, -3252, -2042, 7988, 6584, -1062, -9421, -8627, -7288, -11929, -2954, 1512, 4764, 2209, 840, -5989, -7850]
5901g850P477O52l052K55O989K032l013j721k07k067l937M190M21K600j496n319
5885d046J104Q377R81l990n019L486L23p808o824Q69O051N371j618L01K811M857
5869E226j538m380j369k869L334j680p51M099L729K353O279m679n903k480Q12
5854A83p09M676n390j833j152k632J752m041l30P90Q690O006m998l884j543Q039
5838C624k480n953j998L104k827P35K671L640O998J818j257m492k963p42K474
5823B352K175M358L612l44o328l203n182q65J510l395n71M460L673Q80l721k298
5807b887j902P903L998j038p63J852q05n582P26l249m390l2P39O16O107L66p298
5790e639n369O537J003m821L80K743K886O067K898q17m924r864J198N333N332
$$ y = [-7850, -373, 279, -2773, -2518, 4471, 6503, 3490, 1769, 1562, -505, -4442, -252, 169, 2769, 1273, -4046, -2942, 5435, 6416, 2426, -2593, 893, 1216, -6592, -13416, -12547, -6496, -1125, -2743, -2442, 369, 5226, 3688, -692, -2061, -4930, -1596, -3276, -4027, 72, 3801, 6154, 12433, 7754, 1851, -629, 183, -526, 4150, -1240, -3073, -4225, -6857, -5105, -9146, -9476, -8686, 4, 6010, 1012, -2872, -4415, 3624, 1144, -4809, -6807, -3703, -6530, -5795, -3124, 516, 7514, 9332, 8075, 3583, 620, -122, 2352, 4527, 8885, 12497, 12153, 5825, 2622, -2560, -3425, -1915, -5310, -5881, -1421, 2252, 3132, -589, -2887, -4789, 3114, 7112, 6074, 5311, 7163, 6358, 776, 1502, -1747, -6137, -6169, -5430, -4814, 1293, 1659, -5639, -11008, -4471, -3468, -8289, -7909, -5166, -2280, 3787, 6685, 5868, 944, -8920, -7722, -2389, 2943]
5775B943j623j338m53l64K96K492m075r93k300k035L227L673N90L355n337j447
5759c389k309K895K636k242Q8K709J55M079L99l507L685k331o992M529K911j843
5743A473M755n582j3516K015M859P065K573n14n30m392l263J631J604J380M3L628
5727C229l333k144J57n777K982L987N626l864m408J81k853Q63K003l369K975N462
5711A717K792N58Q83l522n127P91m460o738k397R358N604n203o32N797N301J89
5695D911p976r140J673O835N100M770n810M246L955o843K080K967p064K698j078
5680A324p57k819j867J23m802j479Q417j011J05P345K731j297J800J992o384p93
5664B628K040k707K976N891j0602q628K870j916O55J125M373n62q33n253n75Q911
$$ y = [2943, 1320, -18, -471, -835, -539, 1953, -2122, -3115, -5415, -7450, -4223, -550, 40, 3395, -1942, -3389, -5698, -2803, -167, -2409, -2321, 388, 543, 4622, 5021, 1514, 5199, 2868, -4124, 405, 3316, 1473, 6228, 646, -12870, -10855, -5996, 1069, 3642, 3128, 2598, -1794, -5057, -3426, -1822, -442, -399, 3229, -104, -2248, -2091, -7868, -4886, -899, 4727, 863, -3545, -3364, -6217, -5354, -3351, -6720, -3745, 1717, 4509, 5067, 5950, 2428, -2699, -1908, -6368, -13106, -15503, -6145, -541, -5744, -6376, -579, 4722, 4911, -3065, -12205, -10532, -3697, 1403, 6173, 363, 4609, 8564, 1721, 3801, 6768, -296, 2402, 1324, 567, -2252, -4119, -3996, -8798, -10277, -1860, -2871, -2766, 4579, 7310, 6013, 7813, 9805, 3421, 2628, 4668, 1961, 4937, 10828, 226, -8402, -5532, -7448, -6793, -5668, -1295, -1857, -2690, -7943, -8518, 393]
5648C93J307j533N471M4n540q46m489N250N81k170k637L160O330k914m041N302
5632C668O581M542k754j714j280k997r41J141j3q026o096k930N720R140J68n272
5616a063k078p26L834K674l626M058N347l357l949K21n844o101j263N832M54K481
5600c106O499Q731k762p041J372Q0R70P23l973n609O514L370k171m479K109J644
5584B871J116l201q66l048k301o464l340N088J048J906r56M330l191J647K918
5569b443L765k502l164j805L723O407O85j928o347K426K288J510l082P297M210
5554A1040p419m165L915L092N092r98q93N234q815m892j2714q282M669N99K944
5539a1593N436J110M802k799J353O144j13r911l395O302N337L696M577M767q161
$$ y = [393, 1700, 167, 5638, 5682, 142, -704, -5193, 57, 638, -1532, -4169, -1009, 5321, 2407, -1634, 3668, 10249, 14791, 12037, 10323, 9043, 6046, 5105, 6246, 6233, -1793, -7889, -10819, -5099, 4041, 4209, -1063, -3141, -3867, -33, 2641, -985, 3073, 8420, 5063, 1114, 1335, -4509, -10610, -11873, -6041, -5587, -3106, 3393, 12124, 9362, 2321, 3693, 3773, 4743, 5466, 1493, -4116, 2398, 5768, 3597, -882, 1227, 2871, 3987, 786, -80, -3128, -5429, -11893, -15233, -10145, -9097, -7191, -8147, -3817, -7008, -5361, -2443, 1322, -1180, -4344, -6149, -2426, 3981, 4666, 2738, -3609, -1183, 1105, 2615, -467, 6830, 11040, 3621, -544, 3371, 6463, 11555, 10557, 9664, 14898, 6083, 1191, -11523, -19805, -15136, -14537, -11593, -6157, -5047, -245, -3044, -1691, 4453, 4340, -5571, -8966, -2664, 2673, 6369, 10946, 15713, 7552]
5524G552q44j448l071K448J208K378M588l747m083l179K021r44m488n584R25k56
5508f524K14j454N658L801l989N44M659N506k693M421K502j386n491k512J461
5493D717L39N478r71j539J52j473o777l396o10l202m54M134Q625L074k182k032
5477C883m450n930J153M706k550K033R245N074j862j687m161j199j705l655j707
5462b812K418j058l965O19M5N354Q427q524l024L566n12J885j559m508l756L656
5446c748N987K167k727m989Q56P268K401j247j985J89j018r86k2k626j961N86
5430a855P026N853j819l992j337k083l667M012K548K534k864p53m214r177M186
5415e602l84K165M408k487L06N955l307l775n462Q16l009j602L795j448l785M096
$$ y = [7552, 6708, 5260, 2189, 4637, 5845, 8223, 12811, 9064, 4981, 1802, 3823, 2879, -1609, -7193, -6268, -6524, -6310, -7764, -2106, 1695, -2294, -1750, 2909, 8415, 5722, 10143, 12645, 11259, 5768, 3256, 4717, 5056, 10534, 9563, 8024, 8176, 6703, -74, -3470, -4080, -7282, -7736, -3602, 5023, 8097, 5915, 3883, -567, -6497, -5344, -638, -3188, -1155, 8090, 13164, 11302, 9615, 5454, 4255, 2550, -1105, -2812, -394, -1452, -5417, -4798, -4753, 601, 9028, 504, -2520, 1046, 534, 2419, 860, -3648, -7404, -3748, 2239, 4406, 1679, -3310, -2454, 4814, 7215, 5968, 3983, 4172, 3154, 2168, 2146, -480, -2441, -1855, 5171, 11024, 9205, 5213, 3876, 1793, -1874, 2138, 4686, 7220, 4356, 3603, -611, -9788, -5602, -5986, -3821, 587, -1900, -1594, 4361, 1054, -2721, -8183, -7367, -10376, -11978, -8183, -9631, -13416, -9320]
5399i320L138Q98L307n861M028o91r469L36O748P318K386o234k195p21P615M146
5383E429m809k109J138j109M559m921J603L034Q89K085l530l558l260L73N406
5368A220J242K254m613k995p557L153P281J167K260O366ll793q040l051l125m063
5352a2297O705J0353K556r23n393p809j810R238L084j026j0213J74J841K759k081
5337d842p414o847J662R114M752L840K884l055j155K954L344j360l675n374m083
5322i255l94N072J829l920J340j807n473J656m76m383K715J0820M726J065J28
5307C643j379o50k599J671R031N348l608m571m601j410j09l384Q123M257l467
5292F295n566l530m235j760P640k83L436J169K730J742q94L032L61k005r54K575
$$ y = [-9320, -6182, -5284, -1977, -7838, -3810, -4501, -13970, -13634, -6886, 432, 2818, -3416, -5611, -6332, 1283, 5429, 620, -1489, -351, -1460, 3099, -1822, -219, 2815, 3704, 5789, 2259, -1299, -4559, -4186, 1220, 2462, 4716, 103, -2892, -10449, -7296, -15, 1152, 3412, 9778, 9775, 5982, -2058, -5109, -8234, -12297, -5592, 4761, 7317, 6394, 1001, -6808, -8618, 620, 3704, 2678, -7535, -7361, -5520, -2761, -4842, -12256, -19103, -17441, -8327, -3575, 265, 3149, 94, -1061, 1893, 5237, 3877, 202, -5172, -9255, -9649, -4577, -2748, -6668, -5328, -7135, -12608, -10952, -11428, -15811, -13096, -2276, 2450, 3515, 3643, 2264, 1614, -985, 686, 9717, 15065, 11457, 6886, 2285, 875, 766, -2618, 5505, 9762, 6295, 729, -2801, -7036, -8796, -1156, -1439, 1997, 3166, 5896, 7638, 6744, 9776, 10137, 8132, 7178, 9753]
5276I753l449p641m221m605n739M000P652M847j351o192n335N139O731K605k456
5261b62N679N088o242o424K644N185k254M95l379L993M372m704j758n609k755
5246e931P457p84j902Q89j086n08M978L792N364k522l670o025l835k440l32K811
5230c744m65K613k262M568j628l200n01K21j007m404P186L429L12m150J077K211
5214B56L25K367R263L717o717M99j722n117l063N34k31m118k305l95k583K872
5198f418O522J171q563o7P788M667m97L8l870k419k027K728N027m214n613K725
5182c022K918J460l202o7O681J264o751r14M176J521L048K164l788k67Q04j681
5166D344L824J23k713K229n576J341r412K348K27K128R570J219o490J463m90N488
$$ y = [9753, 6304, -1337, -5558, -10163, -15902, -11902, -4250, 597, -754, -6946, -12281, -7142, -411, 2194, -262, 5417, 10505, 4263, -2161, 483, 5668, 3414, 3909, 530, 4523, 8895, 4191, 2433, -3176, -5931, 1526, 742, -1160, -271, -1357, -1865, 3113, 6905, 12269, 9747, 6077, 52, -3783, -6223, -6555, -3744, -4209, -1596, -3858, 710, -918, -4118, -4619, -4398, -5405, -9809, -2623, 806, 1118, -3032, -1955, 256, 581, 2948, 12211, 15928, 9211, 9710, 7988, 2871, -192, 342, 111, -4007, -6312, -6707, -9290, -6418, 104, 1275, -7288, -7355, 433, 5100, 4603, 4641, 771, -1648, -3675, -947, 4080, -134, -5747, -3022, -104, 1356, -1846, -1913, 4768, 6032, -719, -1633, 2543, 4064, 7112, 9276, 5488, 5221, 6025, 4344, 8168, 8291, 5578, 7807, 2231, 3572, -5840, -3492, -3265, -1137, 8433, 9652, 3162, 4625, 4135, 9623]
5150I623J440n255n236k698j235k344N660Q101k231j184N55o430p468M386N577
5135A261O442o219K581o41O85P155j852K06L503l653k190j118k229J541O180N01
5119A2153r25N615k856j0943K328k31n220n632p783Q539R638n59L118n08m996
5104A738k072K189L61o855R45L032M05J100L362N966M807n284m94j109n853k177
5088F1k204k074P196N245k761m357K088k708m652m387L08M586P80m147o26p91
5072h443M382o97j207o49j676O637o170K403M525N13j654j938R06K108j96K217
5056A061j714n985j953j112K196J282k72m89M286r90q73P53j996Q303m375r248
5040a1126l051L627o28l25O018M251J711L734k696o57K361m274j670J694N614
$$ y = [9623, 11063, 5808, 572, -2126, -3361, -5705, -45, 8056, 5825, 4641, 5196, -1234, -8702, -4316, 1261, 7703, 1484, 4065, 3424, 4109, 11264, 9412, 9618, 13121, 9468, 7278, 6160, 3931, 5472, 11652, 12153, 11228, 16843, 13987, 3044, 5372, 5141, -79, -5711, -13494, -4955, 4683, 4124, 7242, 6734, 1738, -334, 1855, 2216, -4639, -3694, -662, -257, 843, 4205, 10171, 14978, 9694, 9200, 8091, 2238, 61, -2143, -4217, 2979, 8224, 5463, 1106, 3194, 486, -4166, -8553, -8245, -3659, -2879, -7026, -7652, -8443, -4061, -4758, -5965, -6614, -8290, -1653, -7823, -5420, -895, -382, -2036, -3974, -3068, -960, -1156, 1061, -653, -6638, -8591, -9703, -7507, -6225, -6497, -6986, -2700, -3690, -4563, -3810, -5806, 2497, -1878, -11126, -14177, -10550, -11178, -11503, -5485, -1234, 477, 4211, 1515, 858, 3219, -1055, -2725, -1031, 4583]
5025D583O709l662j0553l681M010L256K038O19K566J471O288M24k370k304n520
5010C874K470L039K235L284o778r617M286R95p597m842K004L607Q257j956o02
4995B659q352q349l281j75l30O167Q972N293L296P46J81j768n555l358L667R129
4979H942j16k543k126j079l401K82n617k469M125L819L154o67m848o53K499p94
4963a492m785o336O913K143L886O87l099k666k397l592J856J357J856m07J83K192
4947c701j044P205m103N45Q43k155l409n828j61P302Q788l199n061m657m193K180
4931a0648L759l076J138J245O208J924q27k931j128L117m626j954L124M745N148
4916E218P07J366K777l914p528L84N638j61K324K848N126l842m278J331J128p157
$$ y = [4583, 11292, 7630, -2923, -6604, -2594, 662, 2700, 3319, 5885, 7356, 13644, 14068, 11698, 9394, 3874, 6344, 9383, 11618, 14902, 8124, -1493, 2793, 3788, -3809, -8651, -6647, -3040, 5217, 3261, 2659, -5693, -14042, -17323, -17498, -17828, -11661, -2689, 2604, 5900, 6646, 6827, 5059, -496, -3854, -187, 8942, 8826, 6283, 4157, 3078, -323, -41, -5658, -8127, -4002, -183, 2971, 2304, -2544, -3197, -698, -1492, -6277, -12613, -5700, -3557, 329, 1016, -2083, -4749, -7146, -10738, -8882, -7525, -5669, -6076, -5893, -3701, -4745, 2460, -1643, -1098, -255, -2410, -5819, -11647, -11808, -4506, 4282, 1083, -3978, -8635, -12828, -10648, -6889, -9965, -8827, -7582, -1374, 550, -277, -3208, -4336, -1219, -5845, -7799, -4675, 70, 5218, 5925, 7291, 10068, 6154, -1374, -990, 4648, 4487, 6811, 9659, 14785, 10943, 6665, 7996, 9124, 1967]
4900A967J004L888j230l094O583M50P73m192p617L080M224J551k235J613J28L131
4884A0024O55n394m178P4N28j362k248r153k12J614L047m42Q63J106P212Q028
4868A0162l596j3017o161R275M631j003o889K628M883J410n200p451K164J0478
4854B314o28K450p78o185j97M657m564j888k399N70K27J560l68L225J639r029
4838i394j047m98r72N875O731M357K574j636l778K306j362j697K874L297l60q58
4822F412p322p643m028J870R270J858l658l681K081N129J0793J1079r337o092
4808F731l384m006l26K249m237K981N699L228J307l612m267p56q51k300k930j678
4792f152j120M382q42p698K971P764q256M124L587j589k378m558M092Q352O097
$$ y = [1967, 2971, 6859, 5629, 2535, 9118, 9568, 10341, 6149, -1468, 1612, 5836, 7387, 5152, 6765, 6893, 10024, 10679, 5285, 1107, 1181, 1709, 347, -1901, -11054, -11266, -9652, -6605, -7047, -6184, -5078, 2134, 10162, 6566, -6451, -12612, -3337, 1294, 291, -6598, -3970, 913, 2323, -2877, -10328, -8164, 2314, 1686, 4136, 3358, -2827, -3024, 1633, -2931, -4819, -7218, -6648, -6421, -4861, -5229, -2004, -365, -9394, -10441, -10939, -11911, -6036, 695, 5052, 7626, 5990, 2212, 4518, 3156, 1459, 4333, 7630, 7270, 6412, -910, -8553, -12581, -10711, -1441, 417, -3241, -6922, -4841, 288, 11081, 22160, 12823, 6731, 3347, -659, -985, 1264, -2973, 8, 5707, 8935, 10242, 6630, 2363, 1607, 756, -1544, -4474, -6152, -7272, -2890, -3732, -11430, -8459, -695, -8951, -4827, -1240, -2829, -5207, -9765, -5673, 2679, 8776]
4777H776Q28l323k833M516k476O58N716M826K765M716k128j2397P20K353o303
4762F414k332n457Q85O692j956l463K780O63q71k331l685J030K365k18L836m69
4746C883o09k710l238J958N304M55N9k637l314K862M564j968j307n400j61J576
4730f83j878L622L051K199P71J188J826j486n289K129j832L468J121o487l962
4715b242K447J062k639J547k204m756J151L258k515j515n395k407K312N753P23
4700e420L039Q50O203L425l982l012J997j320L4p164p35M603N058J956j200m090
4684B42R80K6L660J40k316N159K20l835R19M60l276m892M25L290O155K650q471
4667A536o354r93p27L603J684P006l061j307J823J706L863K933p77l907l523k225
$$ y = [8776, 9604, 6281, 3448, 7964, 5488, 6146, 11862, 16688, 19453, 24169, 22041, 9644, 10364, 12717, 6414, 4082, -1375, -490, 6202, 4246, 783, 3563, 4226, 3355, 1024, -2661, -1631, 734, 516, 4352, 3883, 3274, 564, -2674, -716, 4588, 5043, 5102, 2465, -849, 2013, 6577, 4609, 3302, -2098, -2259, -683, -2561, 1061, 4112, 6311, 7082, 8270, 10096, 8610, 3321, 5450, 3618, 7086, 8207, 1720, -2242, 205, 1267, -1372, 175, -2029, -6785, -5634, -2376, -4891, -6406, -11801, -14208, -11896, -6143, -5420, -2381, -1531, 4672, 8097, 4115, 1103, 3100, 1780, 1814, -5350, -6085, -1482, 3576, 5532, 4332, 242, 1222, 1248, 4908, 5048, 2732, 7891, 8111, 4276, 5195, 5655, 2379, -2513, -2088, 1202, 7357, 10007, 1536, -4818, -5811, -6538, -2935, -1251, 5755, 2694, 1387, 3210, 4916, 8779, 11712, 10935, 7028, 3505, 1280]
4651A280K73l69j781M737j166j981L791J98m20k389j988O625L244L822o067o729
4635A080J977k894p49q335O649Q273J451J874k728l238K788K866l765n905p903
4620h559M175J676j80J262j659m480K188K933K180J952m584m696m150J644k571
4605a2869N736O599P14n123K002K596m664P652R416r87q433m983j989K824L010
4590A501K018R21J929P83k537k739J168q05j0604L697J0985o3k427j950n610J53
4574c580K299J222K559Q35m719j757K490N599k25m180j243M476L578J073J694
4559A0121M626k167k106k212o593m090m884K570K513l220j231M261L196J302L513
4544E599l304j636J097r1l748L032P009J055j663j536j099o874j912J74J876J0502
$$ y = [1280, 1553, 1184, -597, 4140, 2974, 993, 4784, 4982, 4562, 2173, 185, 6810, 10054, 13876, 7809, 1080, 3057, 163, -586, -8921, -2272, 6001, 7452, 9326, 6598, 3360, 6148, 9014, 5249, -656, -8559, -4384, -2708, -2888, -1626, -3285, -7765, -5577, -2644, -464, 1488, -3096, -7792, -11942, -10298, -12869, -7133, -534, 180, -4943, -2941, -345, -5009, 2643, 12059, 11072, 2639, -2344, -4333, -1509, 1501, 3519, 4440, 6369, 7152, 4615, 1876, 3044, 2239, -8365, -4668, 6317, 6254, 3827, 1877, -3733, -3580, -1281, -59, 2500, 3335, -1384, -3141, -651, 4948, 4723, 543, -700, 3776, 7354, 8427, 10121, 14747, 12580, 10474, 8262, 1669, -2421, -7305, -4735, -2222, -5442, -6673, -2412, 784, 2086, 5599, 2295, 659, 1756, 1665, -2083, 949, 7958, 9013, 7350, 5814, 4715, -2159, -4071, -3897, -2021, 8481]
4528H481R684L035m226l047n232r062o057L073J910K121J952n436j199J703L961
4513A661K441j537m26K741k185M560j301k592l106k91J314J314m448p002k086
4498a0943L738J968L027N150M275n915k938J794M827m682k394m365J212O324P32
4483A810j021M268k121r270o199R341M973O332l027l664L33L463o09j623j534
4468A452O008k913n513l302l29l52K917J385l826l920k677O827R325Q974n047
4453I009m802l119J688o79N47K133k418o782k17K575K492L627K8M644j903K137
4437H960L811k245j2368L700M210j511o765J593P531K516j801k447M141k247j578
4422E500N876M842j133m077j12K312m945p855o268o167j057R539M454p42o810
$$ y = [8481, 18165, 21200, 16974, 13927, 8695, -367, -6424, -3351, -1441, 680, 2632, -2804, -4003, -2300, 1661, 4102, 2565, 2139, 4880, 2695, 7255, 5954, 3362, 256, -35, 1279, 2593, -1855, -8857, -10943, -7205, -5237, -2210, 2940, 7215, 1300, -1638, 156, 4983, 301, -2093, -6458, -5246, 1078, 1810, 789, 5057, 2936, -6334, -12533, -3192, 1781, 8113, 5086, 1422, 1755, 5218, 4609, 2986, 1452, 7460, 4547, -966, -4268, -4597, -4949, -2032, -647, -4473, -8393, -11070, -4243, 5082, 14056, 9009, 4207, 1088, 2776, 2097, 2644, 4777, 2359, -4423, -4640, -2065, 427, 4054, 4082, 8726, 6823, 8960, 12771, 10526, -1842, 1858, 6068, 4557, -2208, -615, 6916, 9432, 7631, 5184, 9325, 7078, 5500, 11376, 16218, 15085, 11008, 10896, 13208, 8263, 408, -5860, -12027, -13084, -3545, 909, 167, -6643]
4407f643K299K213L959L514Q78j124l050l908K305O242M884m512m535P848J317
4392A1687l200p92p47L220Q38P76k928P61J375j217m788o158k366L554j230j2501
4376a3716q327N103O660N519L3L861j194m091M914P047J0502K967k599K248o872
4361A2055o023n927k274K966P789J988r57o361j22O40j86k575l620n504M093L256
4345g62k549j277R501L536K103m741j241j626o55M322m781L640M417n88r439L788
4329C648J468O509l135p356l493K097J946O979L507p003k646Q99L514K328K994
4314A2256J989n236n891p35O661Q015k423n98l479K896K81m830p273j72K665P046
4298A1172K931n558m405o686L633O880J557M06j255o172K281k782p467L520O356
$$ y = [-6643, -4344, -2131, 1828, 5342, 6220, 5096, 2046, -1862, 443, 6685, 11569, 7057, 2522, 10370, 11687, 8487, 7695, 6948, 10168, 11006, 11782, 8854, 9615, 10990, 9773, 4985, -1173, -3539, 15, -1215, -13716, -22043, -16940, -10280, -4761, -4728, -867, -2061, -6152, -1238, 5809, 16311, 19278, 16679, 18927, 12055, 6032, 105, -2169, 797, 8586, 10574, 9617, 3256, 3134, 3774, 3588, 1013, -2607, -8111, -4018, -762, -3311, -4588, 4913, 8449, 10552, 5811, 4570, 2944, 2289, 6611, 1830, 5470, 9887, 9299, -140, 3648, 5116, 11625, 8490, 1134, -2359, -262, 1684, 8663, 12170, 5167, 2521, 3420, 6934, 9262, 12256, 14245, 9009, 3118, 2383, 9044, 17059, 14636, 14038, 10559, 13455, 13736, 8906, 1633, 1461, 4126, 11172, 14103, 8545, 4140, -2546, 1087, 7967, 9524, 9930, 8675, 2503, 4784, 2002, -5465, -1945, 4411]
4283D411M994l29k981m78j236j195k474o722j995N379K793r48M496k718k394J036
4267c61K103J83L914L849j105o025j653K235K004N721p639o902L17M091L93P110
4251H235j458n724N78K764M1P163l07L218J671j0625k666K863P918J043j536k091
4235A1087l585o706q055m667M642J0150L344m048r29m773j943O167J0167M93k113
4220I231p489r986o68L916M759J122j247j536l708k529N544K853m243r46N836
4205I09M226K868M180l008j1154l663M744L731N461J735O16M436l120k493l698
4190E770n751l107K038J043j806j362J452L93n72m253p86R42M880P491J854n776
4174B450j2999n52P279J0763R33P967k087n219M174O820m646j254k463k305l025
$$ y = [4411, 9405, 9076, 6095, 5617, 4381, 3186, 712, -6010, -8005, -2626, 167, -781, 3715, 997, -1397, -361, 1742, 1925, 5839, 9688, 8583, 2558, 905, 3140, 5144, 10865, 3226, -3676, -3359, 732, 1125, 8235, 6777, 1053, 1631, 4395, 4436, 11599, 11292, 14510, 16181, 5556, 2890, 5753, 13671, 14714, 13178, 11087, 7502, 796, -7259, -11926, -7284, 2866, 6210, 2162, 1233, -3540, -5483, 684, 10851, 11344, 9231, 1742, -8244, -8912, -4996, -237, 885, -362, -1898, -5606, -8135, -2591, 262, -3981, -4927, 909, 5135, 8003, 12183, 9175, -1979, -5642, -898, 2833, 8294, 10029, 10645, 15081, 11961, 9468, 5770, 19, -3088, -1050, -7, -1813, -3175, -1723, -1330, -1902, -6155, -6941, -5999, -1119, 6372, 8226, 2450, -10549, -11101, -3822, 6941, 7874, 15841, 13754, 8535, 12709, 19529, 14883, 13629, 11166, 8861, 5836]
4159E836m090M012k19n216n628m533L659J016N10L633M229K680P18L233m076k724
4143C040m784k451k567L941N062k65L289K769j394j037l239n222l042N245M792
4128D137j930L65J146O247m468N84l191l767R18N187O407k668m354K453r46n94
4112E526l652n918K130N540K145J969J047M062m924P77K780L691m022j391p326
4097B434n3L108k295J515L446j02j10j573M557L586l468q042k065jK065l502K908
4080B408K239O05l265p076n46N657L383k298l310m372J161J3160M554R07q562
4065D645j472o89J480j50L780j411j477m165l049j805J330L520Q64k968m883P236
4049G86M552K81l706k278L941K724J312j21o746N754r07j2349k220O812Q078k591
$$ y = [5836, 1746, 5758, 5539, 323, -5305, -9838, -6179, -5163, -4653, -1020, 3209, 5889, 6607, 9840, 5764, 3040, -1744, -4195, -6762, -2821, 2241, 1976, 5265, 8034, 6640, 5603, 2364, -2858, -5900, -655, 4137, 2207, 2572, 3718, 9965, 5497, 6081, 2890, -877, 41, 5228, 11635, 8967, 4613, 7066, 6120, 5526, 1874, -4044, -1914, 3626, 5771, 7740, 8787, 12849, 7925, 8702, 11482, 15173, 11151, 9760, 2434, 2381, 5489, 3194, 4709, 8155, 8053, 7943, 6370, 10927, 14513, 11045, 3003, 938, 937, 3002, -500, 2408, 4647, 5252, 1987, -5089, -5635, 22, 3405, 1107, -2203, -6575, -5414, 7746, 12300, 13207, 4645, 3173, 2484, 3964, 3814, 7594, 6183, 4706, 541, -2508, -4313, -2983, 537, 1401, -1567, -6450, 786, 5338, 5619, 1913, -365, 3576, 6300, 7612, 7491, 745, 6499, 5592, -6757, -8977, -2165, 5913, 3322]
4033C322k45J705j261l556O851k551k949J291L190p08m218l811j863K710k615
4018d708r31N793L579J190K016K038J673J254l6k260o901k325O801L028n595N159
4002I775L098k97m298q887o698Q761J800L028P094R07k156M304p969q108K3M080
3986D457m179K709Q69k142n853K50K229J576K907n26K195P735l546j439k391k756
3970B095M897n557l069l969l671l870K453O396M434m193m859J996Q006M208k8
3955E269K690K387l607n221m259r72M401M544J67l712k286N038K955m90o03l26
3939E975j960m068k953P589N755j517m272N61J784K956J660L258m941q948P24
3924A603O63P344K91q649q831m12O890r53J363o73N00j432j51N579p029k259N466
$$ y = [3322, 3077, 4782, 3521, -35, 6816, 4265, 1316, 2607, 5797, 5089, 871, -2940, -4803, -2093, -4708, -5639, 154, 3733, 4923, 6939, 8977, 10650, 11904, 11868, 9608, 2707, 382, 7183, 10211, 4616, 9775, 12873, 12576, 8278, -609, -7307, 1454, 3254, 6282, 13376, 14283, 12127, 16431, 8462, 354, 377, 4457, 278, 2987, 3856, 1714, -4139, -3889, -1660, -84, 2823, 2297, 4492, 12227, 8681, 7242, 4851, 2095, 6992, 1435, -1634, -5603, -9274, -13144, -10691, -4295, 139, -4054, -8913, -6917, 1089, 5297, 5269, 7959, 10346, 6739, 1518, -2741, -3713, 688, 5232, 5399, 1687, -599, 4439, 7394, 6904, 6301, 5975, 4015, -53, -3006, 4583, 10338, 8821, 4549, 5110, 6894, 9850, 11510, 14768, 9827, 879, 1603, 2266, 9610, 9901, 1252, -7579, -7991, -1101, -2054, -691, -1364, -864, -2296, -2447, 3132, -3897, -6156, -690]
3907f90N463J335m220q920n900j562P396q75O504r05k070R79P290N389p738K130
3891C606L539j238o495J782O935M485k99j453p28j840K524K344j442l624L410
3876A1506J5062m057m313L346p398j2937l698o016j154P51J577J835Q101J2394
3862A4999m871q569O651L895p760k126k108m319l996P189P503j248p022p748q20
3847a0350Q362K958m405o227L577j349k379M867M020K903N940K464j163L05Q0
3832I603l467k179m303J561r05p60K508P69M79K309p493j361L141O262k636n927
3816b399l29K579L541O7q53J547J024m732K220K706k698J789L340m010p517l937
3800g662J948Q962K11j351K348l350p525k00j062j509o587L891O663L741l129
$$ y = [-690, 4773, 6108, 1888, -7032, -12932, -14494, -7098, -7973, -1469, -2374, -4444, -3465, 3825, 9214, 1476, 3606, 7145, 5907, -588, 1194, 8129, 12614, 12315, 10862, 10134, 8294, 10818, 13162, 11720, 8096, 11506, 26568, 22511, 18198, 21544, 14146, 1209, -2489, -8505, -9659, -8908, -7331, -5496, 2605, 14999, 10128, 1559, 8210, 12105, 4345, 2219, 111, -4208, -8204, -1015, 6488, 5240, -1782, -9530, -10350, -1988, 970, -3435, -9662, -6085, -7434, -9813, -4946, -926, 1977, 7917, 10381, 9218, 9523, 9603, 6136, 3957, -346, 1215, 310, -450, 2058, 2827, 3306, 5615, -1878, -3239, -98, 6164, 3528, -2399, -2728, -149, 3392, 3459, 2606, 4153, 5177, 445, 2665, 5371, 2673, 4462, 7802, 3792, -3725, -7662, -5714, 3248, 3459, 2108, 4456, 1106, -6419, -6619, -7681, -9190, -15777, -11886, -5223, -1482, -4611]
3785d611j572K933L968L250L90j58N71n017L833L330L67m297j966l11M572M182
3769I464l228m074n9j06p28o67j285K902l898j069N793M669J490o256L85M14j185
3752B562M576l772q80p064m344K320P283L836O409j093n554m01l361k599O369
3737D287M494j931K502k265P25N492J79N51o965n278K79j950l907P455K103o106
3721c35K706J998K251m883l832p356L313N975K43O095k305P05M625j338q36p808
3705g82J317L672m657M613M839O516n499m647L606k752p504k273L785L299r955
3690f422n080K668k263N686O524M226K061j914n384L020K249k637J327j960K24
3675B325O72P58m931l25N577N607j290K945K621j967P86r41m697l886m526j853
$$ y = [-4611, -6183, -3250, 718, 3968, 4358, 4200, 4771, -246, 3587, 6917, 7284, 2987, 1021, 710, 5282, 9464, 6236, 2162, 2103, 1997, 1269, 602, -683, 2219, -1679, -2748, 3045, 7714, 9204, 2948, 3333, 3747, 2562, 7138, 3366, 2486, -4578, -8922, -6602, 681, 4517, 10926, 9833, 4279, 3878, 517, -2082, 4287, 8781, 6850, 9352, 7087, 7812, 13304, 13483, 14034, 7069, 1791, 2070, 120, -3787, 3668, 5771, -335, 2371, 4369, 6620, 1737, -2095, -9451, -6138, -163, 80, 6175, 3870, 4575, 9200, 7862, 7026, -782, 535, 4207, -450, 4163, 9002, 15518, 10019, 5372, 8978, 6226, -1278, -3551, 234, 3533, -6422, -11502, -8834, -11097, -5411, 1113, 5339, 7400, 5486, 102, 3122, 5371, 2734, 4061, 2101, 2325, 2997, 3755, -1176, -1501, 4076, 9683, 8393, 11338, 13959, 11992, 12778, 11837, 7140, 3254, -1272, -3125]
3659c125l978l499p5Q474M510j626K794j242n9p579J006J197M64L015O523m349
3643B451L764K858o89j326J923o447m284k191M285N187k827n813l269m565J60
3628a0783P636K299J527k814r05L742J407m246k714M196M819m155l977Q227O79
3613D938l157p996n814j253N421K339M454j732L818O795L52l730m26k988o87l135
3597b801M669P79j458J892j473r25l408j789j92J1800N839Q59l175L34L49o812
3581D488j388l04J803N277o335N077j413j373Q37o463n876K874L98r47j16j307
3565d768O35m832J846R726N295j005k918J062L560L96l175k122J800M722j558
3550H664n50l205j0925n073l75P43M917L997M335M960r69m917q304q98q75M470
$$ y = [-3125, -7103, -10602, -10677, -2203, 2307, 681, 3475, 2233, 2174, -5405, -4399, -3202, -2738, 277, 6800, 2451, 6215, 9073, 8384, 7058, 8981, 2534, -1750, -3941, 344, 5531, 2704, -3109, -6378, -10943, -10783, -3147, -848, 679, -2135, -3040, 702, 2109, -2137, -4851, -655, 4164, 9, -3968, 4259, 4938, 1781, -6215, -12029, -13282, -7861, -5522, -1068, -2800, 1018, 7813, 8165, 4435, 4009, 1021, 334, -2801, 1868, 2647, 1189, 3081, 1608, 683, -2725, -4514, -4706, 7094, 12933, 13792, 10617, 10951, 11300, 4488, 3100, 2796, 4599, 9876, 3541, 8618, 7205, 5832, 6669, 206, -5670, -2796, -2398, -3345, -3461, -4768, -4133, -8965, -7119, 2607, 7902, 6897, 3979, 5041, 8601, 8997, 5822, 3700, 5500, 10222, 8664, 8114, 4909, -6016, -11089, -11464, -10721, -5804, -1807, 2528, 7488, 6519, 1602, -6702, -7600, -8475, -4005]
3534d005j029J829N988J590l156M61l233k267M027K916n4J533J399j321n736n017
3518f075J491P672K716K632n11l311j077l251J040N72P50m832p169P265J2916
3503A0828j115p12K364k068j114k39o737k805N874k101j313P132n738j979J312
3488A589j588J485k854J371n535j714K090j0R11O417P475M629k848k471o353l314
3472g20p11L970J925o111l268N272Q12M609j0443K71M662p90l220j629J224J617
3456b530J753L173L760L725O340k206o154m666l025N3k608J617K749k459m44J540
3440F18m438K277j345J31M760K844j729j180j638K904O298k692r67j462K665L455
3424A0501k732k131k314l985j540M720K455K495o105o619J855O670K140Q03Q51
$$ y = [-4005, -5034, -3205, 2783, 4373, 1217, 1678, -1555, -3822, 205, 3121, 3067, 4600, 5999, 4678, -1058, -6075, -4584, 3088, 5804, 8436, 7925, 4614, 3537, 286, 1326, 1898, 2648, -2184, -9353, -2088, 10828, 9713, 9001, 11365, 9297, 8183, 7944, 1207, -1598, 4276, 2175, 862, 7994, 2256, 277, 1589, 1, 1486, -1368, 3, -5532, -7246, -5156, -5166, -4255, 2162, 9637, 14266, 11418, 8947, 2594, -720, -1431, 2539, 4464, -1647, -4915, 357, 1169, 5778, -4665, -4394, 268, -522, -3742, -5371, -4147, -2530, -777, 2396, 6156, 9881, 16221, 14015, 7861, 3195, 170, 223, -2385, -768, 1981, -478, -922, 618, -3820, -1543, -2888, -2757, 2003, 4847, 3118, 1938, 300, 3204, 9502, 6810, 5843, 4381, 7046, 10501, 7769, 5638, 3324, -661, -2201, 2519, 4974, 7469, 1364, -5255, -3400, 3270, 5410, 6213, 7064]
3409G064o317n187l176o535k740J0318L982O076Q10r1l317M889M642m189j979
3394D250r54n34m332Q70k073O52M584N376P402p065o408n468M210J279M288L62
3378F439l390k15l25j505l348l570J370j091O560p42K242L213J25j433j988j403
3362I39n024j763L446L012N143O96J767k077j384l143k518N158n786m537K072
3347c999M616O642J656k639l96m739O2M235j060m000q461n539J0286P135k87J428
3331D940l150r87l678L57J154K816K385l104j771K181M19L92k483j60L103K357
3315D771J445r120j885j744N598O800M821M959j257o260Q60J661n470j882j291
3300B006J340j79N852L457K561n088l015k384n924o010N980P770k91n30j906k543
$$ y = [7064, 747, -4440, -7616, -14151, -16891, -6573, -2591, 3485, 4295, 4204, 887, 5776, 10418, 6229, 4250, 3296, 2762, -1570, -700, -2773, -2121, 2463, 7839, 15241, 8176, 1768, -3700, 510, 1789, 6077, 6439, 3049, 2834, 2509, 1004, -2344, -5914, -4544, -5635, 925, 183, 2425, 5638, 5763, 4330, 2342, 939, -4085, -5848, -2402, 610, 5753, 6449, 8216, 6139, 4755, 1612, -906, 4252, -1534, -6071, -3999, 617, 7259, 8915, 6276, 5880, 1141, 1203, 5438, 4378, 378, -8083, -13622, -3336, 3799, 3512, 4940, 1790, 803, -2875, -2518, -1364, 1452, 3837, 733, -1038, 1143, 1562, 1954, -529, -689, 2414, 4771, 6216, -2904, -4789, -6533, -935, 5865, 10686, 15645, 14388, 8128, 8988, 10649, 5179, 3297, 2006, 3346, 3167, 9019, 12476, 15037, 9949, 6934, 4550, -1374, -7384, -1404, 6366, 6075, 5545, 3639, 1096]
3284A096m841n658N582O705j227j577M306O73j196N963M738r59k440k593l326
3269E246R45K683p324j64K517J397l864o070J031P787K326K382k259m492n70K370
3253C941m144n001J782L696k149L576p1l61J527M813N783o276j792j093n041k618
3237c428k411m435J027O168K136K684N930K177k604K796K399L087j683o256m21
3222G166p81m402K01q15o73N90J546j276M355J556o652r629j680O153N716j759
3206c84m771k853r26M760O507J041j027L408j733R68k710k33L169m76J448k269
$$ y = [1096, -3745, -9403, -3821, 2884, 1657, 80, 4386, 5059, 3863, 9826, 14564, 13605, 11165, 8572, 5246, 6191, 8874, 1550, 1386, 3903, 5300, 1436, -4634, -3603, 4184, 6510, 8892, 6633, 2141, 1571, 3941, -203, -5204, -3422, 274, -1875, 1701, 1630, 1269, 2796, 7609, 13392, 7116, 5324, 4231, -810, -3428, -5839, -10274, -9247, -3079, -943, 1741, 7671, 9848, 7244, 10040, 12439, 15526, 13843, 7587, 7166, 6385, 1983, 2184, 1369, 696, 1286, 2832, 1556, 5911, 7467, 815, -8814, -10494, -4341, 1375, -384, -5155, -8008, -8934, -4174, 2333, 3374, 2347, 5755, 4022, 4990, 2280, 2047, 5216, 4740, 6188, 3919]
$$ [...]
##END NTUPLES=NMR SPECTRUM
##END=
