##TITLE=Analysis number 327991
Compound Code cc 55446
Book Reference 470/186
Project Code adrs
Chemist Name mikem
##JCAMPDX= 6.0         $$ Bruker NMR JCAMP-DX V2.0
##DATA TYPE= NMR SPECTRUM
##DATA CLASS= NTUPLES
##ORIGIN= Bruker BioSpin GmbH
##OWNER= nmr
$$ XWIN-NMR		Version 3.5
$$ Tue Apr 24 11:49:21 2007 GMT Daylight Time (UT+1h)  MAYBRIDGE\nmr@NMR_250MHZ
##.OBSERVE FREQUENCY= 250.131544655141
##.OBSERVE NUCLEUS= ^1H
##.ACQUISITION MODE= SIMULTANEOUS (DQD)
##.ACQUISITION SCHEME= undefined
##.AVERAGES= 16
##.DIGITISER RES= 18
##SPECTROMETER/DATA SYSTEM= dpx250
##.PULSE SEQUENCE= zg30
##.SOLVENT NAME= CDCl3
##.SHIFT REFERENCE= (INTERNAL, CDCl3, 0, 16.4768)
##AUDIT TRAIL= $$ (NUMBER, WHEN, WHO, WHERE, WHAT)
$$ ##TITLE= Audit trail, XWIN-NMR		Version 3.5
$$ ##JCAMPDX= 5.01
$$ ##ORIGIN= Bruker BioSpin GmbH
$$ ##OWNER= nmr
$$ C:\u/data/dgb/nmr/ADRS/2960/pdata/1/auditp.txt
$$ ##AUDIT TRAIL=  $$ (NUMBER, WHEN, WHO, WHERE, WHAT)
(   1,<2007-04-24 11:48:54.27 +100>,<MAYBRIDGE\nmr>,<NMR_250MHZ>,
      <created by zg, POWCHK disabled, PULCHK disabled
       configuration hash MD5:
       76 6E 9A 78 1E 09 19 81 EC 84 63 8F B0 6A 59 2D
       data hash MD5: 64K
       64 9F EB 51 56 FB 55 F9 88 FE D5 F2 53 AB DE F7>)
(   2,<2007-04-24 11:49:12.61 +100>,<MAYBRIDGE\nmr>,<NMR_250MHZ>,
      <Start of raw data processing
       ef LB = 0.3 FT_mod = 6 PKNL = 1 SI = 32K 
       data hash MD5: 32K
       07 0D 24 B6 B7 4E 9F B5 14 FC 4D 80 3B 9B 70 A1>)
(   3,<2007-04-24 11:49:14.50 +100>,<MAYBRIDGE\nmr>,<NMR_250MHZ>,
      <apk 
       data hash MD5: 32K
       DA A4 AA 91 9D E9 66 C3 04 80 43 7D 51 F8 F2 38>)
(   4,<2007-04-24 11:49:15.30 +100>,<MAYBRIDGE\nmr>,<NMR_250MHZ>,
      <abs ABSG = 5 
       data hash MD5: 32K
       9B 42 81 46 BB 6B 4F A4 42 1E 28 70 B3 05 19 E4>)
$$ ##END=
$$ 
$$ hash MD5
$$ 6D F2 A2 16 7E 51 23 82 00 61 0B 7A DC A1 17 D3
##$RELAX= 
##$RELAX= 
##$RELAX= 
##$RELAX= 
##$RELAX= 
##$RELAX= 
##$RELAX= 
$$ Bruker specific parameters
$$ --------------------------
##$DU= <C:\u>
##$EXPNO= 2960
##$NAME= <ADRS>
##$PROCNO= 1
##$TYPE= <nmr>
##$USER= <dgb>
##$AMP= (0..31)
100 100 100 100 100 100 100 100 100 100 100 100 100 100 100 100 100 100 
100 100 100 100 100 100 100 100 100 100 100 100 100 100 
##$AQSEQ= 0
##$AQ_mod= 3
##$AUNM= <au_zg>
##$AUTOPOS= <15 >
##$BF1= 250.13
##$BF2= 250.13
##$BF3= 250.13
##$BF4= 250.13
##$BF5= 500.13
##$BF6= 500.13
##$BF7= 500.13
##$BF8= 500.13
##$BYTORDA= 1
##$CFDGTYP= 0
##$CFRGTYP= 5
##$CHEMSTR= <none>
##$CNST= (0..31)
1 1 145 1 1 1 1 1 1 1 1 1 1 1 1 1 1 1 1 1 1 1 1 1 1 1 1 1 1 1 1 1 
##$CPDPRG= <>
##$CPDPRG1= <>
##$CPDPRG2= <>
##$CPDPRG3= <>
##$CPDPRG4= <mlev>
##$CPDPRG5= <mlev>
##$CPDPRG6= <mlev>
##$CPDPRG7= <mlev>
##$CPDPRG8= <mlev>
##$CPDPRGB= <>
##$CPDPRGT= <>
##$D= (0..31)
0 1 0 0 0 0 0 0 0 0.06 0 0 0 0 0 0 0.0002 0 0 0 0 0 0 0 0 0 0 0 0 0 0 
0 
##$DATE= 1177411732
##$DBL= (0..7)
120 120 120 120 120 120 120 120 
##$DBP= (0..7)
150 150 150 150 150 150 150 150 
##$DBP07= 0
##$DBPNAM0= <>
##$DBPNAM1= <>
$$ [...]
##$SUBNAM7= <"">
##$SUBNAM8= <"">
##$SUBNAM9= <"">
##$SW= 20.6930455092707
##$SWIBOX= (0..15)
0 0 3 0 0 0 0 0 0 0 0 0 0 0 0 0 
##$SW_h= 5175.983436853
##$TD= 65536
##$TD0= 1
##$TE= 683.16
##$TE2= 300
##$TE3= 300
##$TEG= 300
##$TL= (0..7)
0 120 120 120 120 120 120 120 
##$TP= (0..7)
150 150 150 150 150 150 150 150 
##$TP07= 0
##$TPNAME0= <>
##$TPNAME1= <>
##$TPNAME2= <>
##$TPNAME3= <>
##$TPNAME4= <>
##$TPNAME5= <>
##$TPNAME6= <>
##$TPNAME7= <>
##$TPOAL= (0..7)
0.5 0.5 0.5 0.5 0.5 0.5 0.5 0.5 
##$TPOFFS= (0..7)
0 0 0 0 0 0 0 0 
##$TUNHIN= 0
##$TUNHOUT= 0
##$TUNXOUT= 0
##$USERA1= <user>
##$USERA2= <user>
##$USERA3= <user>
##$USERA4= <user>
##$USERA5= <user>
##$V9= 5
##$VALIST= <valist>
##$VCLIST= <CCCCCCCCCCCCCCC>
##$VD= 0
##$VDLIST= <DDDDDDDDDDDDDDD>
##$VPLIST= <PPPPPPPPPPPPPPP>
##$VTLIST= <TTTTTTTTTTTTTTT>
##$WBST= 1024
##$WBSW= 4
##$XGAIN= (0..3)
0 0 0 0 
##$XL= 0
##$YL= 0
##$YMAX_a= 342214
##$YMIN_a= -398194
##$ZGOPTNS= <>
##$ZL1= 120
##$ZL2= 120
##$ZL3= 120
##$ZL4= 120
##$ABSF1= 16.47681
##$ABSF2= -4.216362
##$ABSG= 5
##$ABSL= 3
##$ALPHA= 0
##$AQORDER= 0
##$ASSFAC= 0
##$ASSFACI= 0
##$ASSFACX= 0
##$ASSWID= 0
##$AUNMP= <proc_1d>
##$AZFE= 0.1
##$AZFW= 0.1
##$BCFW= 0
##$BC_mod= 0
##$BYTORDP= 0
##$COROFFS= 0
##$CY= 12.5
##$DATMOD= 1
##$DC= 0
##$DFILT= <>
##$DTYPP= 0
##$F1P= 14.0000005364418
##$F2P= -0.99999901652339
##$FCOR= 0.5
##$FTSIZE= 32768
##$FT_mod= 6
##$GAMMA= 0
##$GB= 0
##$INTBC= 1
##$INTSCL= 1
##$ISEN= 128
##$LB= 0.3
##$LEV0= 0
##$LPBIN= 0
##$MAXI= 10000
##$MC2= 0
##$MEAN= 0
##$ME_mod= 0
##$MI= 0
##$NCOEF= 0
##$NC_proc= -3
##$NLEV= 6
##$NOISF1= 0
##$NOISF2= 0
##$NSP= 0
##$NTH_PI= 0
##$NZP= 0
##$OFFSET= 16.47681
##$PC= 1
##$PHC0= 151.9965
##$PHC1= 7.143888
##$PH_mod= 1
##$PKNL= yes
##$PPARMOD= 0
##$PSCAL= 4
##$PSIGN= 0
##$REVERSE= no
##$SF= 250.130011300859
##$SI= 32768
##$SIGF1= 0
##$SIGF2= 0
##$SINO= 400
##$SIOLD= 32768
##$SREGLST= <1H.CDCl3>
##$SSB= 0
##$STSI= 32768
##$STSR= 0
##$SW_p= 5175.98343685301
##$SYMM= 0
##$S_DEV= 0
##$TDeff= 65536
##$TDoff= 0
##$TI= <Analysis number 999999
Compound Code 99
Book Reference 9
Project Code 9>
##$TILT= no
##$TM1= 0
##$TM2= 0
##$TOPLEV= 0
##$USERP1= <user>
##$USERP2= <user>
##$USERP3= <user>
##$USERP4= <user>
##$USERP5= <user>
##$WDW= 1
##$XDIM= 32768
##$YMAX_p= 386085569
##$YMIN_p= -20665
$$ End of Bruker specific parameters
$$ ---------------------------------
##NTUPLES= NMR SPECTRUM
##VAR_NAME=  FREQUENCY,     SPECTRUM/REAL,   SPECTRUM/IMAG
##SYMBOL=    X,             R,               I
##VAR_TYPE=  INDEPENDENT,   DEPENDENT,       DEPENDENT
##VAR_FORM=  AFFN,          ASDF,            ASDF
##VAR_DIM=   32768,         32768,           32768
##UNITS=     HZ,            ARBITRARY UNITS, ARBITRARY UNITS
##FACTOR=    0.157963299565203, 1,           1
##FIRST=     4121.34478539187, 0,            0
##LAST=      -1054.63865146114, 0,           0
##MIN=       -1054.63865146114, -20665,      0
##MAX=       4121.34478539187, 386085569,    0
$$ Real data points
##PAGE= N=1
##DATA TABLE= (X++(R..R)), XYDATA
$$ [...]
21624 -3387 -5304 -2347 -3915 -7021 -8174 -8754 -7101 -8410 -9647 -10364 -10040 -10747 -9344 -7078 -3933 -4385
21608 -4385 -3404 125 1043 -3354 -2712 -3255 -1730 -1495 1907 3111 1999 -1598 -5415 -5634 -3393 -318
21592 -318 -2344 -3285 -2162 -1934 1304 590 181 1174 2908 -1045 -1365 2266 826 -2493 328 -1744
21576 -1744 -2518 -1485 -2717 -1567 780 843 928 -1465 -2303 -2725 -3476 -1113 751 375 -1312 -4860 -3710
21559 -3710 -6867 -4551 -5442 -3488 -347 -70 -1102 2868 2203 1651 2974 2249 2214 -36 -4029 -4806 -5821
21542 -5821 -4983 -4087 504 -462 714 3613 2155 1162 -1621 -3061 -2843 -5615 -5928 -5326 -5460 -3731 -6056
21525 -6056 -6585 -4816 -5750 -3518 -2748 -3808 -2535 2433 5726 1682 -4973 -3888 -1450 -1810 -3989 -5453
21509 -5453 -1879 -5732 -6657 -2513 -1799 1390 -201 1406 1942 630 -2950 -4395 -3110 -2668 -840 -2317
21493 -2317 -1007 -232 -3505 -1966 1613 -190 -371 -857 -3816 -3988 -2240 -1920 -4367 -3171 -2858 -3774
21477 -3774 -691 1315 5298 7131 6903 5614 5521 8361 3283 3582 434 -2403 -647 1592 4660 1985
21461 1985 -4673 -9817 -6112 878 5002 4650 1417 -1122 3889 3901 1508 3741 319 1106 3797 2625
21445 2625 283 -1860 -237 2217 -1325 -1465 4094 4896 9005 10050 5394 3054 -2352 -3028 -2810 779
21429 779 1177 970 348 -963 -5579 -3012 1078 -4205 -7933 -6586 -3873 -3622 -3453 -3094 -5089 -5526 -1913
21412 -1913 725 -2453 -4330 -7330 -7368 -5528 -3353 1139 534 -3743 -2659 1542 4790 -216 -3132
21397 -3132 -640 -82 -3384 -2533 -5139 -8320 -3512 -1895 -4514 -3430 2178 3866 2160 1364 -193
21382 -193 665 -384 -5463 -6353 -1491 -2355 -2347 -2032 -2605 -413 -2479 -3005 4885 5728 4152 2241 2559 259
21364 259 -1065 -860 -2397 -89 -4210 -5129 -5701 -4313 -3339 -5173 -5714 -2850 -4662 -4367 -4379 -1732 -2741
21347 -2741 -3043 1837 3603 2593 2543 -1548 -3130 -4330 -3854 -2645 1185 5496 8034 13305 11132 1223
21331 1223 -2310 576 3192 4176 2849 2198 -5 -920 -490 -1601 -2081 -2186 4066 2610 1359 -1619
21315 -1619 -6826 -4694 -6312 -7455 -5115 -4738 -5112 -2623 -2448 -1364 2972 3372 1009 -1680 -190 -1765
21299 -1765 -5616 -7588 -10465 -9553 -8662 -4632 -2322 -2102 -664 -1615 -2269 -6171 -7515 -5828 -4945 -192
21283 -192 1993 3554 -305 -2891 -4576 -1345 -1308 -1421 1862 6593 3375 396 -1512 -2128 -2861 -73
21267 -73 3690 1466 -2524 -11490 -11496 -7840 -4741 -4148 -4207 -5577 -4649 -2704 618 715 166 -1103 -1877 -3463
21249 -3463 -1052 3359 1576 2221 -974 -2214 -1521 -2026 -874 -1109 5295 3922 -2382 -1933 -1729 -1452
21233 -1452 -3734 -442 -1029 -3816 -7256 -9726 -8830 -5297 -7416 -7099 -5488 -3469 -6578 -6660 -3624 -2759
21217 -2759 -713 -2794 -1722 -4854 -8093 -3701 -967 -2043 -5299 -7272 -4689 -3824 -2861 865 -988
21202 -988 -129 3668 2197 384 4916 3952 1689 -471 -2315 195 -1419 -1819 -2214 -1581 -954 -5310
21186 -5310 -5344 -4864 -4358 -5605 -7200 -4318 60 -1890 -1969 -2533 -2690 -5485 -6731 -6852 -4242 -3139 -3058
21169 -3058 -2642 223 501 -371 -1545 -2580 -2780 888 1612 1893 2171 -3602 -3187 -3172 -6724 -5932 -3650
21152 -3650 150 322 2444 2836 2082 2482 340 -1561 -5045 -2537 -2904 -2572 679 2109 191 -693
21136 -693 -3575 -2455 -2685 -597 -1600 -2139 -1618 -2474 -4955 -1658 1343 2565 629 -238 427 442 -1610
21119 -1610 -2585 -5576 -4672 -1040 2270 4292 5104 4118 2332 1470 3200 1319 -838 -3844 -8307 -9039
21103 -9039 -9102 -4897 -3226 -4659 -849 1731 1696 -1470 -861 -2895 -5753 -5480 -5279 1984 4768 724
21087 724 -943 -1930 -46 -2549 -4307 -6249 -5833 -5347 -5672 -4352 -4151 -3344 -1722 -1634 2254 3223 3431
21070 3431 2144 54 1242 670 3188 3094 2097 -494 -5126 -322 -9 -1571 -2086 -5727 -3793 -4400
21054 -4400 -5113 -5116 -6444 -4191 -4515 -4009 771 -218 1603 2803 2495 5740 8179 1922 -2402 -2050 -1261
21037 -1261 66 -1528 -2396 1267 2695 -1798 -3425 -4053 -5877 -6093 -3829 -3379 -3496 -6315 -8470 -6664
21021 -6664 -5603 -5693 -7112 -11415 -9821 -8328 -9956 -8406 -6703 -3336 -3222 -1853 -1304 -1786 115 377
21005 377 -2742 -1646 -518 2764 1785 -1194 -1429 -61 213 -2121 -4929 -2056 -1703 -7209 -9188 -5125
20989 -5125 -1856 -1718 -1247 1607 3065 139 -5130 -7617 -7259 -3559 3444 6160 3896 1808 119
20974 119 2362 4600 5136 5868 3719 2087 -1591 -6855 -4882 3593 4942 5477 5184 3252 552 -746
20958 -746 -2044 -2711 -4093 -3403 -333 1954 -2552 -4289 -445 -2216 -5731 -6456 -7391 -5969 -805 3874
20942 3874 2200 -196 -237 1052 -1520 -4094 -8163 -8826 -9543 -9753 -7140 -3838 -4433 -6037 -4166 -7334
20926 -7334 -6128 -5168 -4490 -5451 -3175 -3553 -1735 -1892 -2612 -5696 -8216 -8573 -7454 -5200 -1755 4233
20910 4233 2189 -1409 -1872 -5620 -7932 -3773 -3652 -4391 -1477 -7 -1162 -2471 -1771 -2792 -5818 -3289
20894 -3289 1567 4294 1785 578 -2715 -3634 -2594 913 2813 2764 1773 -1086 -2439 -1163 -1540 33
20878 33 2655 2318 1097 446 1243 2017 4125 6603 6964 3210 3319 3059 -505 -3933 -3805 -4148 -2511
20861 -2511 -194 -1327 -2763 -5380 -9905 -8059 -3004 -36 240 -214 -1958 -3272 -3202 -2575 -4778 -6099
20845 -6099 -7860 -7610 -4559 -7067 -3273 -354 -2826 -4093 -2511 -740 616 3540 6137 4570 2579
20830 2579 3384 1320 -1012 -3016 -5294 -7565 -7642 -7060 -6454 -10339 -13720 -13208 -12579 -9767 -9159 -4771 -5354
20813 -5354 -5928 -8252 -8597 -10714 -9799 -5726 -987 -1225 -3135 -1735 -1967 -1030 -35 -2304 2703 3607 -348
20796 -348 -2334 -1320 570 -285 -3068 -3077 -2919 -3972 -6505 -6492 -5515 -6166 -4574 -6654 -8993 -8612 -5441
20779 -5441 -1201 -3974 -8296 -9024 -8152 -5320 -214 1712 1147 -80 -1209 -3883 -5380 -3365 -3827 -5341
20763 -5341 -7283 -6806 -6131 -6693 -4240 -3571 -12481 -11942 -10127 -7036 -6458 -4308 -1764 2231 -963 -3928
20747 -3928 -2039 289 1430 5427 8087 6527 -114 -2428 -3677 -251 -3055 -5408 -1955 -2378 -2577
20732 -2577 1456 5458 1648 -247 801 2181 3207 3815 3184 2942 2141 -1279 -8080 -7902 -6437 -5023
20716 -5023 -945 1013 -1255 -7024 -9652 -10362 -10254 -11285 -10395 -7578 -5414 -5838 -3793 -2865 -3496 -1395
20700 -1395 448 -417 -1652 -2507 -1027 846 -1357 -2766 -3137 -2508 2379 2469 -2316 -5312 -1696 -2046
20684 -2046 1061 -454 -3119 -4779 -1832 1286 3179 492 -805 -2502 -2542 -666 -3374 -5722 -3995
20669 -3995 -4285 -4061 -6247 -5057 -1449 3329 3156 -1050 -2670 -503 3579 3355 -3235 -6203 -6904 -8833
20653 -8833 -6115 -3644 -2231 -5792 -7026 -5092 -5397 -3719 -4072 -6053 -5223 -6972 -10173 -11201 -8298
20638 -8298 -5562 -4743 -5440 -4695 -1687 -3345 -4979 -1709 -2522 -3199 -556 267 -872 -1712 -4334 -4865 -8080
20621 -8080 -8219 -2961 -206 2921 -461 -3059 -2638 -3637 -1517 4511 6230 3119 1932 -890 -4704
20606 -4704 -3931 -608 63 575 3420 2050 -2415 -1198 1034 2199 -398 -2480 1362 -5777 -7548
20591 -7548 -4577 -2037 1763 2951 -113 -2293 -5530 -4406 -3796 470 -484 -1657 1214 127 2031
20576 2031 1344 1946 3804 1840 -181 573 -24 -491 1835 1738 3859 3285 -7 -2777 -4545 -698 5184
20559 5184 4451 3454 4776 6739 4460 2115 -128 -3363 -6420 -5237 -3997 -4795 -2577 -6120 -9733
20544 -9733 -9900 -7743 -7775 -10837 -10788 -5080 -345 819 1222 -3002 -2295 -1069 -2036 924 -478 -2429 -3772
20527 -3772 -5481 -4347 -3392 815 1085 -3179 -2564 -34 1322 3323 1306 -2217 -2139 -564 -288 1003
20511 1003 2373 4740 6621 5827 3148 -364 235 3460 4229 5743 5263 2985 3834 6407 4487 5698
20495 5698 7762 3998 1711 0 -1400 -3965 -3984 -5171 -2865 -3032 -2492 -1305 38 -2933 -6222 -4127
20479 -4127 -2862 -4605 -1295 -573 -1458 -3369 -4842 -3386 -904 -5063 -5982 -3863 -3418 -3508 -3975 -3080 391
20462 391 1589 -151 -2748 -5001 -3433 -2383 1283 1323 1229 338 -570 339 -982 -4957 -8597 -7958 -3682
20445 -3682 -2269 -2469 127 1708 1086 -2746 -2091 -524 -1697 -1563 -2394 -4228 -4628 -5226 -6196 -4666 -4129
20428 -4129 -4369 -1623 262 -2785 -2745 -53 -737 -1768 -944 -614 547 -2806 -5116 -7225 -9219 -10352
20412 -10352 -7961 -7293 -7930 -5155 -3115 -6557 -8325 -3909 -2545 -3902 -1485 -731 -129 706 -1136 -1217
20396 -1217 -2120 -787 594 -436 -3532 -2105 1021 -1546 -2030 -2570 -3485 -2054 124 1776 -1253 -3997
20380 -3997 -2211 -2866 -3113 792 5612 4020 -413 -946 -103 -1954 -3292 87 -2149 158 -57 -62 -160
20363 -160 715 6 1300 -3040 -5807 -3166 411 231 150 -2835 -4375 -4011 -738 -452 -1988 -3936 -7165
20346 -7165 -5461 -2046 1548 -333 -3262 -6490 -5748 -6156 419 1322 2470 3549 3700 -3126 -2400 -343
20330 -343 37 -2127 -1132 -2664 -7000 -4376 -4001 735 4733 1940 802 2079 4874 5696 3891 -1754
20314 -1754 -3425 -3302 -3711 -5764 -4106 -4816 -6032 -4212 -4542 -2448 -2841 -1744 -6678 -5901 -5500 -4574 -4085
20297 -4085 -5727 -6890 -7924 -7726 -5823 -1371 1411 4328 2659 881 3125 6713 8830 6278 -475
20282 -475 -5348 -7519 -6329 -7854 -3793 2528 4582 2742 -1029 -6731 -4259 121 -1681 -4125 -9155
20267 -9155 -7123 -2056 803 1709 -3467 -7720 -8606 -6388 -8390 -12893 -11077 -10397 -12106 -8478 -7481 -4220
20251 -4220 -3550 -5090 -9952 -14899 -16128 -15627 -14407 -14977 -15637 -11464 -12473 -10774 -5890 -5277 -5181 -6504
20235 -6504 -4909 -5671 -8124 -7748 -10258 -9881 -3684 305 5060 4582 -370 -6098 -8470 -8205 -5733 -4075
20219 -4075 -2776 -203 2087 -527 2398 2747 2849 1007 1316 1605 1256 1032 -2417 -3683 -3747 -2558 -4447
20202 -4447 -1933 -649 -4087 -6520 -5339 -5235 -1350 1339 -3897 -2624 -659 1691 -1185 -1475 -1531 -3663
20186 -3663 -5398 -498 3854 246 1343 926 -851 -2240 -2498 -3492 -9745 -13081 -6506 -6227 -8613 -5366
20170 -5366 -1794 -429 257 -1059 -1182 -1464 996 1698 1152 -2048 -4235 -3515 -1724 -3622 -2655 -910
20154 -910 1917 362 -1727 -4825 -4283 -2250 -5095 -4025 -1497 -5240 -7677 -5812 -914 1342 161
20139 161 -2009 -4235 -3637 -2216 -3894 -4641 -519 100 -3004 -628 932 1112 696 40 1222 517 1402
20122 1402 496 -1450 548 -1549 -204 2023 1496 884 3924 3502 -2106 -3835 300 -327 -1859 -3487
20106 -3487 -4516 -6453 -4865 -3788 -4932 -5202 -6005 -3848 -280 -1326 -2620 -4336 -5337 -5088 -4864 -3103
20090 -3103 -5272 -2243 -2399 -3696 -323 -1128 -4932 -4487 -3482 -3648 -5091 -5869 -5793 -1806 3851 3741 -7334
20073 -7334 -11001 -7044 -5401 -5647 -5188 -4838 -4489 -5303 -2918 -2052 -3692 -4018 -4080 -4141 -4250 -16 1691 2577
20055 2577 4273 560 -2427 -3431 -5574 -2345 -1420 -1888 -4250 -7485 -4771 -4918 -5182 -5855 -5734 -7583
20039 -7583 -6428 -3794 -3389 -2857 1259 -2505 -3131 -139 1381 608 -2991 -3530 483 667 -3306 -5839
20023 -5839 -7045 -4936 -2725 -3015 -3033 -3275 -3091 -4047 -1976 -3167 -5156 -5149 -4110 424 4821 3402 1376
20006 1376 615 1051 -2618 -7252 -4440 -1201 -1832 -960 -208 -3068 -181 401 -1770 1265 4649 1359
19990 1359 106 -2423 -7153 -10746 -9905 -5975 -3666 -6063 -6640 -4308 -213 319 -2367 -4518 -3271
19975 -3271 -805 -2495 -5973 -10612 -14418 -11103 -5657 441 4750 4810 1908 2074 4763 2475 -887
19960 -887 -4578 -735 155 -4716 -4336 -5739 -2785 -1851 -1909 -2303 -526 -2084 -3742 -5272 -647 -3437
19944 -3437 -1519 -106 1736 -1442 -4734 -2474 -303 834 -5126 -4372 -4152 -3204 -2846 -2909 -3344 -2618 2176
19927 2176 -164 -1653 -715 -1275 -4986 -5529 -3694 -5288 -5834 -3381 -2579 -700 -4120 -7002 -6178 -5047
19911 -5047 -5450 -4358 -4214 -4903 -1199 -2235 -3938 -2858 -2485 -6889 -4875 -3055 -4215 -6051 -7257 -3307
19895 -3307 -220 -313 -2205 -4566 -5636 1253 2439 -473 818 2757 1338 2710 1475 974 237 567
19879 567 -2005 -4636 -1788 114 -3468 -6291 -9605 -8863 -2633 -2848 -422 -927 -632 -1093 -2794 -3399
19863 -3399 -2156 -3293 -5811 -6047 -6275 -6217 -3162 -133 -2986 -6029 -6140 -4476 -3764 -4596 -2417 -5316
19847 -5316 -6327 -9274 -7455 -6379 -3152 -4069 -6447 -5088 -3487 -2264 1579 2963 1073 -2654 -6649
19832 -6649 -6434 -5738 -2020 -2125 305 3852 2199 2798 900 1050 -2386 -5487 -6191 -6045 -2248 920
19816 920 1042 -1052 -985 819 402 4451 3138 62 -3125 -5267 -5800 -7467 -5805 -6253 -8414 -5948
19800 -5948 -5782 -5681 -5308 -3969 -8245 -13696 -15001 -11377 -10621 -9837 -9634 -8143 -5373 -4056 -1760 1739
19784 1739 671 -880 590 2771 3018 -1626 -4482 -8630 -9750 -5588 -1906 -1163 -1430 2162 -2674
19769 -2674 -6569 -2226 -1191 -1559 -840 -354 793 1558 1973 -61 -5163 -5908 -2768 -796 -5371 -5431 -6579
19752 -6579 -8121 -3033 -1511 -3884 -5172 -3026 -801 -4264 -4523 -6197 -11299 -7422 -662 -2279 -4110
19737 -4110 -3773 -1230 2303 5855 3453 695 45 -3125 -4981 -3300 -1326 -2478 -1255 -1731 -332
19722 -332 2198 1236 -538 1996 -81 -4805 -8525 -8392 -6024 -4019 -6458 -12872 -15338 -11238 -6741
19707 -6741 -3327 2690 4762 4135 719 -682 104 -464 -3089 -5585 -5994 -5051 -5042 -6237 -5921 -6387 -9381
19690 -9381 -7841 -8209 -7944 -5458 -6430 -3622 -630 326 62 -4926 -4669 -3351 327 47 1210 -3313
19674 -3313 -7552 -9176 -2648 4003 6094 4411 2316 -1834 -5399 -7219 -9085 -9082 -7831 -9588 -10099 -6558
19658 -6558 -7185 -3190 -216 -1504 -3685 -5958 -8742 -8992 -6339 -6187 -1716 -1595 -4666 -3467 -2006 -3359
19642 -3359 -4271 -443 -3186 -6040 -236 3103 3334 -293 -937 1928 4440 658 -2292 -5509 -6279 -3250
19626 -3250 -6673 -8479 -7512 -6878 -7367 -6091 -3341 -1866 743 -418 -2503 -4817 -5170 -4536 -2115 -3054
19610 -3054 -2670 -1578 -587 -1344 -1859 482 367 944 1632 -1597 -316 -1298 -2766 -3810 -3598 1536 2470
19593 2470 2156 2868 7041 6926 3220 1508 -2125 -1520 -4319 -5975 -6711 -5943 -7170 -6983 -5390 -5916 -8085
19576 -8085 -5411 -3116 -2490 -1091 -1900 -169 2962 2797 3160 3458 6383 7490 8948 3147 -2202 -5604
19560 -5604 -3842 1792 2793 333 -1356 899 1745 1203 2745 5873 5003 4819 3856 5667 5635 -402
19544 -402 -4150 -5319 -5363 -3493 -2993 -3256 -5022 -6616 -2637 3695 1014 210 833 -3431 -5092 -2635
19528 -2635 -4324 -8513 -10571 -5912 -251 2218 4763 3495 460 3015 1605 -3584 -1720 3537 2682
19513 2682 158 3373 5963 6197 5152 4804 5876 5832 6347 6857 7453 6115 9368 10056 7651 6739 6642
19496 6642 567 192 -358 3311 3694 1252 -2951 -9258 -11649 -8371 -9292 -11220 -10262 -10372 -9037 -5415
19480 -5415 -2834 -117 -656 -6646 -14013 -14196 -8581 -7228 -7573 -6949 -4210 -2127 -3245 -5772 -4089 58
19464 58 2807 3785 678 -3954 -6308 -5382 -4930 -4006 -2751 -3048 -1537 -885 -2658 -2771 -1500 -4398 -4269
19447 -4269 -2729 -1223 -2040 -1290 3979 2347 -126 -199 4069 2325 -5453 -7446 -3820 -4274 -5718 -5471
19431 -5471 -644 1541 -1377 -1549 -2198 -1707 -2717 -4022 2343 6629 2202 -2356 -5498 -9501 -12308
19416 -12308 -11959 -14431 -11745 -11157 -11804 -7071 -3373 -3926 -5135 -5831 -4821 -2275 911 -3006 -4359 -3852
19400 -3852 -6309 -5550 -3489 -1962 -526 -2679 -3485 242 1759 2675 275 -2967 -4881 -2010 -221
19385 -221 959 3248 4219 3977 -772 -3185 553 152 1383 1440 781 364 751 27 -2926 -2579 2973
19368 2973 701 -2764 -5965 -5387 -3377 217 -112 1790 299 -836 -3126 -6785 -8923 -8842 -8780 -11945
19352 -11945 -13363 -11598 -5109 -2091 1625 4289 3062 1599 3759 2182 -723 -4272 -6416 -7305 -5578
19337 -5578 -4684 -2832 -830 -1011 2269 876 -920 -3174 -2869 -581 -1855 -643 -839 428 1681 -2068
19321 -2068 -2217 569 -1160 -1923 109 -1294 -3556 -4019 -4773 -2673 -3590 -1620 -1703 -2132 -1331 1515 -1092
19304 -1092 -2741 3012 2391 2833 5316 5057 2819 1022 253 -742 -3321 -3187 -3268 -1940 -3163 -5135 -3933
19287 -3933 -3990 -5358 -2498 -525 -2136 -7399 -6083 -2069 184 -126 -1869 -3611 -4624 -7403 -5748
19272 -5748 -3094 -5269 -7149 -7987 -2422 261 -1363 -1838 -1406 -2865 -4901 -4779 -7565 -6888 -242 1573
19256 1573 -1147 -2228 -655 -1829 -1243 -561 1343 2045 -5380 -10455 -10300 -4957 -1587 -1243 -4084 -1862
19240 -1862 371 1419 1263 1170 1801 1608 -4114 -4408 1207 4728 5773 4186 2575 118 -508 -2136
19224 -2136 1887 2660 3346 5818 2475 4091 6670 5187 6085 6565 4993 1083 -1325 -183 2985 2808
19208 2808 1781 -541 -443 -1109 1767 1558 1225 1368 -1542 -4133 -3903 -1282 -127 1403 196 -698 -1933
19191 -1933 263 2439 2262 2467 2022 2553 -331 -3588 -2184 -364 2868 4534 3561 3199 2960 6153
19175 6153 5971 8819 6940 6648 3760 -3386 -5239 1395 2844 1979 -1299 -3917 -1634 -1090 -3733 -5959
19159 -5959 -8002 -2331 1453 3029 1941 2806 946 5323 8768 2876 -761 329 -537 -4064 -2034
19144 -2034 -1524 -3354 -886 1051 -2011 -3926 -4869 -6746 -7415 -6187 -7016 -3375 578 119 -1117 438
19128 438 -306 -2469 428 5812 8533 3738 785 -1861 -1288 1409 907 1013 -309 -2805 -5292 -6922
19112 -6922 -6025 -4144 -1700 1232 -2513 -6570 -4638 125 -902 -5232 2028 6461 5649 2174 -390
19097 -390 1673 3272 1877 -1694 -4638 -3605 -440 -69 -224 2584 2901 140 -5042 -2719 -1065 -2507
19081 -2507 -2648 -2991 -4359 -1493 662 413 1758 -2283 -5524 -6402 -4162 -2184 4357 5465 2308 -1278
19065 -1278 -6794 -4734 -1466 -2039 -2362 -4500 -2439 -1631 -3002 -3983 -4741 -6193 -6293 -4473 1304 3494
19049 3494 6526 6510 5920 6066 4295 6301 6012 4456 -1300 -4885 -2786 1746 3106 1828 1914 2187 -1141
19032 -1141 -2177 -2772 -7313 -6289 -4913 -5207 -2116 3566 6032 2622 -2551 -5209 -8037 -7850 -2358
19017 -2358 810 198 1931 2444 85 311 -478 -1337 -1053 168 917 2683 4545 1798 -3578 -2998 -1283
19000 -1283 -2074 -2114 -3562 -3964 -3096 -3161 -3046 -3092 522 1146 1214 5710 7993 4176 2774 1046 -1698 -2451
18982 -2451 587 1512 721 1035 732 784 93 1247 3315 516 -1282 620 6600 3575 1973 3707
18966 3707 3654 -569 -3166 -730 2812 3377 -869 -626 -1117 -3678 -5112 -7214 -3936 -1719 -1030 -2022
18950 -2022 -6962 -3896 -3678 -5640 -2508 1302 3870 4425 4611 -522 -1587 1015 4156 1128 1351 -129
18934 -129 -131 1511 -891 -2311 -5906 -2455 -639 2837 2908 997 1477 2293 -1179 -2152 -2678 -2689 266 207
18916 207 -2721 -3897 -2293 1929 2578 -222 -1952 -1993 -1010 1280 3644 3457 3613 705 -1663 -2871
18900 -2871 -127 5745 7846 6340 5901 2798 -2059 -4089 668 4247 888 -1592 -2349 1977 2624
18885 2624 -154 -2220 273 -1113 -4546 -5282 -3369 -1767 272 2082 4485 738 1368 722 -5355
18870 -5355 -8080 -10206 -10831 -7820 -5138 -2070 -8153 -11238 -8657 -4963 -11557 -12749 -8526 -5192 -3020
18855 -3020 -2238 -1564 -1356 -927 -2994 -5085 -1889 362 3236 3421 5013 4103 790 -483 1059 806
18839 806 -534 3594 4991 2058 -1606 306 -365 1163 3871 3316 3027 2059 2015 4790 8808 11415
18823 11415 12208 13312 8770 2614 1492 1600 3884 6345 6445 902 -3409 -3450 357 2028 1276 -1198
18807 -1198 -522 1192 1085 1517 1850 612 351 1525 2378 3306 3567 4259 7527 9348 5986 -1898 -2763
18790 -2763 836 -716 -369 1384 3716 -1839 -6305 -6967 -5834 -5906 -5750 -7319 -6608 -3298 1344 4143
18774 4143 5467 4742 5534 8513 17576 28818 31137 28367 24350 20088 15560 12894 10645 3187 -1821
18759 -1821 -3237 -1041 3429 1307 1129 4915 4823 1570 525 53 -597 2990 290 -519 -259 -397 -2628
18742 -2628 -333 985 3111 6060 8346 10478 6889 2863 1788 3483 3373 2959 7446 10078 9988 14885
18726 14885 15883 12974 9648 6119 2068 -900 -2973 -2229 991 226 -1555 875 2977 4788 7843
18711 7843 9547 4872 671 -3533 -2726 -3084 -1194 -1316 -2290 -1576 -2261 3845 7798 7947 11097 10790 3839
18694 3839 3973 4731 4782 6886 5757 7564 5401 2557 972 1226 -596 -19 6096 5944 3109 2455 5550
18677 5550 10357 12920 12689 10675 8707 11488 14307 12556 9989 13133 18127 20375 23056 23470 21108
18662 21108 16473 17207 22308 31268 39360 50958 65930 87044 114563 148013 192095 238537 272454
18649 272454 292984 301378 292473 276031 251334 228294 216039 216339 226997 244108 271336 296983
18637 296983 312356 314549 302995 277084 240971 199091 160684 127016 102073 79838 62784 49256
18625 49256 45040 41557 39421 34040 25545 22254 17764 15925 18312 20169 18844 18680 11197 7182 6392
18610 6392 7991 13893 14780 11711 9226 10350 9021 6654 7200 3291 2030 3211 4197 2503 3782
18595 3782 9684 11207 11338 11748 12013 9737 6719 4831 8359 7037 7703 7853 8162 7033 7363 5559
18579 5559 1630 -1181 -457 4894 9273 8219 7220 6981 9178 11826 7661 4407 4513 3452 1670 -91
18563 -91 2241 4079 5562 7134 7729 3959 7213 9264 11011 11347 11317 10824 11292 13354 12136 12605 14428
18546 14428 13749 11688 7823 7116 10959 13866 11668 7202 7485 2224 2309 4574 1600 189 1812 602
18530 602 -2530 -1692 -210 1105 1363 3267 6590 8757 6049 4353 4525 2745 4365 5553 5568 5625 4122
18513 4122 3704 1827 3066 6770 6356 4542 5548 8312 4783 2287 5082 6902 5146 2454 3258
18498 3258 6814 3407 1853 4767 9494 7048 3247 4508 7085 6159 4922 6712 5256 3661 1774
18483 1774 4651 7441 6930 9071 5308 -1853 -2393 -1108 273 2959 3664 4432 5444 -167 -7239 -8442
18467 -8442 -5432 -2364 -803 -861 1541 6617 3607 291 2240 1019 1271 4941 6879 4430 -157
18452 -157 -4591 -3775 -259 4444 10367 11790 13762 12756 7124 9534 12767 10896 9580 8219 5831
18437 5831 5631 6293 5801 5347 4935 4670 7676 6343 4431 4005 7032 5202 6864 6310 6348 2941 833
18420 833 4207 3458 6482 10320 7685 7339 7632 9008 6022 5490 6613 7327 6484 7149 7941 11394 12996
18403 12996 10384 8885 9722 9273 5749 2909 5790 6445 5866 7510 11116 11761 14166 12300 12338 14217
18387 14217 11826 9772 6710 10489 13941 11424 6293 8007 7915 7132 7415 8839 6375 6090 8899 10399
18371 10399 9397 6636 4685 7633 8539 6690 3182 6342 8098 9366 10135 11320 13159 12080 9538
18356 9538 6936 3977 -223 403 4861 9069 8574 7601 9964 10619 7925 6735 7516 6927 4814 5530
18340 5530 8390 10417 11113 10334 9423 11981 13688 4864 2434 3147 4207 5995 2683 3780 6116 11628
18324 11628 13559 15854 19410 21619 22832 25847 24133 23001 22591 23354 23533 26803 30770 34104 35628
18309 35628 36627 33003 33338 33743 32564 32146 31956 33299 31426 29380 29559 29018 28621 27358 29730 31980
18293 31980 31662 28725 21387 13369 9660 13335 17340 21470 19347 19049 20539 21595 17220 16370 18595
18278 18595 24639 29230 33231 38197 45020 52923 56412 64564 71913 69883 69011 69842 65506 61836 60192
18263 60192 55778 58224 62409 67586 70660 74128 73470 78978 75924 67744 60575 53847 48686 45413 37859
18248 37859 33137 33974 32580 33473 38519 44070 42725 37155 43969 44711 44508 46003 45924 46133 45464 41587
18232 41587 42375 45701 44809 43429 46809 45641 40525 37823 33832 29281 26857 24202 18365 15971 18998
18217 18998 22859 21826 19901 20543 23540 25993 29219 34868 40012 42520 45813 47966 50479 54595 57616
18202 57616 59603 62653 63503 60345 57825 57606 61043 64016 65355 65272 62596 62489 61169 58186 53565 48354
18186 48354 44376 39503 37497 35505 36572 36887 38516 41810 45302 44372 41835 39903 41851 41729 37198
18171 37198 35850 38147 40486 41319 42764 44153 46542 49912 53596 57326 60008 65100 64798 60769 62139
18156 62139 62916 65420 71169 74003 72602 77112 79639 82928 90796 97686 100361 104081 104372 103520 104325
18141 104325 104894 106921 109873 115220 123190 128898 130900 130794 134251 140033 143365 143226 148348 157887 166565
18126 166565 171935 179765 191630 207771 225625 242740 263257 299013 355983 433852 535318 689458
18114 689458 947704 1384842 2115768 3302204 5037062 6112462 5421925 4392460 3226575
18105 3226575 2206659 1535990 1138254 882251 702727 576234 493614 443463 402925 370692
18095 370692 349293 336010 322338 304167 293175 286800 279819 272315 267430 266694 269396 272554 277599
18082 277599 282681 286287 288461 292386 294780 292650 287661 282945 285631 290531 300176 312372 331258 353165
18068 353165 390176 435424 489856 556643 631230 708218 774743 814299 841734 867464 891885
18057 891885 915147 951752 990570 1029793 1080417 1125292 1168486 1207116 1225536 1239913 1249060 1273180
18045 1273180 1306109 1345400 1391944 1438458 1496574 1566319 1645082 1742194 1862658 1989432 2116262
18034 2116262 2245702 2376276 2523993 2710331 2969669 3348137 3905486 4717913 5916007
18025 5916007 7693494 10318009 14028464 18980025 25385824 32400213 39551656 46436601
18017 46436601 50509454 52869868 52553284 49265951 45453903 41132749 37930493 36866005
18009 36866005 38288011 41636552 46064760 51140774 53956679 55076216 53783626 49081389
18001 49081389 43322502 36312651 29204218 23028978 17860004 13904198 11033063 8974349
17993 8974349 7519344 6449395 5644005 5002926 4482163 4047315 3680708 3381070 3118407
17984 3118407 2877731 2673595 2487812 2339365 2221216 2107254 2010687 1898240 1783396 1672371
17974 1672371 1554888 1448427 1343491 1235455 1135356 1043818 971168 916231 882232 863325
17964 863325 855727 859108 852267 841227 814761 762297 703234 642874 587587 534702 486861 449397
17952 449397 419393 392223 373371 355284 340228 325416 310324 294188 279131 264429 251015
17941 251015 234114 221852 210490 202421 197802 194713 188871 184473 175772 168012 159184 149589 144517
17928 144517 142852 133445 124851 120064 118864 117019 115012 110757 106200 103727 101959 101337 99955 98935
17914 98935 92067 91071 91197 93524 93238 90670 92427 92837 89241 78946 72807 68437 67701 66731 66034 69507
17898 69507 69663 67326 65885 68504 69435 75853 78807 78443 78024 77542 79672 77167 75039 74428 71476 70639
17882 70639 71683 72360 77114 81240 82890 79407 76345 73164 66848 62914 58718 54752 54060 53241 55652
17867 55652 55203 51859 52917 54822 52011 49438 48483 45636 46750 46601 44034 42928 41900 43826 50011
17852 50011 51514 50145 47081 44502 44576 45767 45091 42174 39546 36877 36630 35855 33499 33888 33541 33019
17836 33019 32523 33234 27864 20056 14990 9076 4241 3167 1633 -2332 -6418 -5487 -4307 -4565 -2689
17821 -2689 -5242 -9710 -8848 -4766 224 1084 3295 3901 5147 6882 11379 21882 30932 34995 40045
17806 40045 43603 44706 43752 41153 37237 33330 27194 23166 21884 21610 21469 21308 14791 11276 9794
17791 9794 8999 9838 12814 9906 8626 2160 760 -748 -3355 -5588 -2747 -2088 -5565 -6485 -7170 -4889
17775 -4889 -708 -3383 -5087 -2263 -2662 -4019 -2397 -4595 -7880 -5780 -2956 -2446 2348 6331 9816
17760 9816 14292 15614 15949 14026 11866 8870 7541 9718 11003 13578 12866 14888 18253 20208 16910
17745 16910 14687 13944 16981 11751 2948 -3006 -2107 -674 -146 2888 4197 4513 4380 749 -336 2464
17729 2464 3000 2718 -1275 -10504 -14758 -16950 -15092 -9508 -5248 -4070 -6478 -11638 -11213 -10047 -9010
17714 -9010 -9786 -6069 -5510 -6589 -4930 -5279 -7062 -5063 -1925 -5143 -5955 -5815 -6186 -1634 -784 -901 -1847
17697 -1847 -945 -3335 -1328 -1951 4747 8820 9286 4889 300 675 95 -32 5309 5387 4374 4346 6201
17680 6201 9136 7241 8959 6889 8687 9514 7001 4964 6637 8413 6376 1426 -1117 5160 9172
17665 9172 9007 12091 11691 8048 7299 4780 5261 5280 3930 -292 1169 6799 8891 7838 5228 3044
17649 3044 964 2355 5164 7294 7635 7645 6468 6935 8054 8949 10274 9618 11383 10527 10206 8572 9649
17632 9649 9516 10627 13456 15929 16805 18345 18399 23026 25725 26255 28169 33324 37397 40397 48518 56862
17616 56862 61930 75120 99598 129571 170701 229627 299244 371579 451295 551950 660993
17605 660993 732240 759373 776306 794518 785560 724681 642377 555649 468087 386305 309775 242896
17593 242896 190086 148688 119784 99149 79653 68677 58167 50956 47693 46140 40294 37146
17581 37146 33472 26381 18909 17720 21060 18874 17757 16718 15333 12766 10130 12333 12837 17513 14090
17566 14090 11952 11520 10493 7865 5387 6448 9837 8284 4699 4103 836 -1461 1028 3472 5998
17551 5998 7047 5698 3042 3358 5066 1924 -1268 -921 -2783 -3212 384 3215 5173 1961 1066 1606
17535 1606 -2184 -4705 -4689 -8031 -8275 -9615 -7924 -6421 -4165 -4904 -5535 -3191 -3529 -3689 -2522 666
17519 666 -1148 -1449 -2806 -1509 -1078 495 -1601 -194 -3903 -6854 -6348 -7257 -7110 -9453 -6883 -6452
17503 -6452 -1112 1942 -448 -6656 -7556 -5327 -1961 235 -1795 -5634 -5850 -7831 -5809 -5429 -5930 -7065
17487 -7065 -10878 -12553 -11042 -10541 -4852 -1337 -1765 -909 3003 -689 -3284 2460 2419 1612 498 -2047
17471 -2047 -2159 -822 760 328 -3615 -5647 -6539 -2823 -2059 -6372 -8574 -6621 -6496 -5880 -3958 -3375
17455 -3375 -3283 -7070 -7945 -3453 -1670 153 -239 -173 1083 1486 1700 4588 10254 19653 20495 16406 11969
17438 11969 9160 8622 6939 2090 -5167 -6065 -3105 -2464 -5137 -4461 -5946 -8469 -6277 -4458 -4818 -2600
17422 -2600 -1242 -1021 273 59 800 2088 -1460 -5370 -77 2128 -52 -1602 -1862 -2166 -1424 1728
17406 1728 2552 2739 767 683 2419 4648 4573 8088 13950 12599 9462 12017 14282 15225 13573 16743
17390 16743 21577 19150 20712 24758 28066 33281 40328 50366 68423 95911 130161 165879 205510
17377 205510 247279 275183 293976 297822 283945 265104 239704 217819 210623 213809 229723 253869
17365 253869 279218 298357 303445 304665 281441 249778 210675 171738 140161 112916 88796 71059
17353 71059 53405 39906 31549 25623 23968 22759 19709 14399 12826 15134 13368 9110 11647 10394
17339 10394 6402 6273 6884 4738 1585 52 350 3280 6733 7755 8145 8321 4051 -1044 -849 -1157
17323 -1157 -2704 -4981 -1771 -4221 -3179 -3896 -5651 -4132 11 1168 -358 -2998 -111 -2916 -6392
17308 -6392 -7472 -5867 -5760 -6762 -705 -1631 -794 -1514 226 1974 -2871 -1861 -100 803 -2050 -5192
17292 -5192 -7422 -5192 -6575 -4026 -619 1354 -1102 -4694 -4292 -7017 -4025 -1975 622 -2123 -615
17277 -615 1195 -1144 -3928 -3028 -4534 3631 7365 4714 -1997 -3022 -2243 -596 190 904 -552 1823
17261 1823 568 2386 370 -1904 -979 -1066 -1250 -2954 991 4429 7520 5812 4399 3747 4275 1216
17245 1216 -552 -758 2559 3760 2881 2963 5800 7093 7508 7969 6616 2629 239 729 3690 5002
17229 5002 8369 5896 2828 1648 3015 175 1497 2062 1645 935 -991 -1525 824 1137 -973 -79
17213 -79 1381 4503 3623 -776 -1999 -2357 -1863 2674 5027 7768 8884 7605 5466 6402 4897 -867
17197 -867 -2812 -1770 -2464 -5196 -3556 -2626 -1351 -3751 -3608 -4647 -2848 -1396 -5076 -4714 -4276 -3938
17181 -3938 450 -1496 -131 -436 -3558 1146 4414 6058 2292 2215 2823 857 48 81 330 1932 -1255
17164 -1255 -4396 -1978 -3772 -5857 -6641 -4331 -615 2391 4004 2077 -692 -1656 -5050 -3799 -4132
17149 -4132 -4831 -3560 63 8274 10819 8619 11378 12496 14440 16237 16423 14320 11330 15369 14035
17134 14035 10777 9081 10730 8187 12364 25205 30746 32452 32609 30647 25868 17027 15525 14432
17120 14432 14090 16903 16535 14957 11491 11621 17948 24344 22130 17776 18381 18466 18132 17589 15976 15381 11468
17103 11468 10870 13044 16611 13334 13333 13541 13956 18604 19549 18848 25354 32719 43322 59112 75916 100412
17087 100412 138994 174990 212458 248489 271780 284948 287541 274389 256907 240403 227590 222708
17075 222708 228661 240890 257218 280815 292639 294580 290986 269578 242548 209409 177547 145232
17063 145232 111272 83511 69249 57013 48653 37049 28958 24220 19831 15799 10332 10425 9330
17050 9330 10372 10518 10306 9360 6817 4691 4314 2671 5274 4933 4299 6819 8610 6408 5690 8407
17034 8407 12099 19681 22991 20669 21931 23629 22734 22839 26963 25541 23480 26102 28533 29557 27923
17019 27923 25786 25400 24390 26912 26685 26152 23143 23815 27716 30846 31765 31431 33920 34484 31129 24491
17003 24491 17223 18907 20243 23950 29723 32701 30388 29761 31584 31963 32083 27988 23771 23012 16377
16988 16377 16637 16792 17245 21477 19103 11783 9892 7966 8609 9147 6825 6591 7296 8516 11455 10775
16972 10775 14579 16850 17680 15062 14940 15136 23514 27979 27822 30239 37516 39643 40792 40593 37013 36633
16956 36633 34459 36024 34781 29093 31964 33506 29794 27485 28006 24329 19972 18268 20396 19048 15802
16941 15802 16088 11738 11261 7928 7165 10759 9279 3224 6184 13082 13793 12608 11810 12022 11003 11867
16925 11867 9392 14173 19642 22984 26939 30271 30257 34170 34914 29912 28007 26426 26641 24110 22268
16910 22268 18189 20517 24592 27268 27860 26389 28919 26899 24060 24407 24230 26816 22732 20265 24367
16895 24367 28193 29435 32785 34935 39843 43786 45244 48139 48122 44332 44423 46573 51659 55657 57853
16880 57853 56567 56617 58051 57054 54467 53197 51981 50447 51361 46540 42690 39643 39519 45111 54704 60016
16864 60016 64683 74931 81761 81187 76588 71119 66027 61398 55307 50423 49982 56347 69872 84514
16850 84514 96196 106961 121394 128515 132080 127103 118373 105532 94734 82595 73161 67143 64085
16837 64085 65874 69351 77803 85254 92047 99957 102305 95992 90918 85539 75502 64394 57228 55720
16823 55720 51085 47215 43365 40191 36967 32676 29526 24709 24457 22305 17861 17641 18468 20541 23288
16808 23288 24198 26548 26983 28291 32181 30064 33487 39958 44143 50847 57649 61996 62376 69730 69356
16793 69356 70569 71989 69446 67587 69629 68432 64825 67815 71064 73178 73463 71546 69553 66136 63816
16778 63816 61073 58317 53979 49385 43565 35779 34650 36415 36284 39349 39448 37066 40909 40135 35667
16763 35667 34373 37156 35613 36137 36960 33261 30211 28624 27245 26953 24738 22926 17769 19372 23213
16748 23213 20605 16848 18049 18399 17973 13684 15035 16353 15167 15266 16159 18763 20031 23732 28402 26718
16732 26718 32819 33189 33105 37047 39704 45614 49873 48927 52430 60025 64002 65196 64915 65688 66657 65906
16716 65906 63068 61426 63157 64124 61820 53313 48012 45177 42130 38505 38288 38451 39030 39959 37683 41148
16700 41148 46980 46738 46080 46056 45186 50169 52107 55071 57748 59216 61432 65268 69289 73332 81171 90750
16684 90750 100486 112918 133258 166402 205273 251854 304937 358162 404661 435437 452124 448874
16672 448874 426166 394531 363682 336558 322607 330518 348775 383858 425030 458157 472940 472266
16660 472266 454463 417071 371392 324750 278334 241605 212813 189027 168237 151288 143992 136939
16648 136939 129759 127224 124131 123871 122582 120906 115537 110695 111655 109632 111393 108655 106054 105854 108363
16633 108363 108416 108532 113295 110921 112105 118703 121974 122715 123377 124956 129658 129806 134210 145989 153105
16618 153105 160999 172601 185781 202743 219896 242132 269154 295535 322149 351003 373360 382110
16606 382110 388372 385389 376541 370224 364284 361821 368777 382465 396723 413781 427969 436978 439620
16593 439620 434614 418890 405341 392320 383560 378076 378528 384041 395234 415525 441270 470728 505366
16580 505366 544544 589214 633022 679273 727983 783313 842407 902039 965277 1030044 1097936
16569 1097936 1162214 1219811 1286774 1357021 1436326 1528823 1641713 1756180 1878401 2016593
16559 2016593 2154433 2314631 2505889 2727241 3016918 3409930 3947156 4700239 5801277
16550 5801277 7413153 9780673 13121043 17558043 23342751 29851849 36440899 43253601
16542 43253601 48111964 50916338 52284881 50579858 47546264 44245234 40877462 38950858
16534 38950858 39126906 41014109 43975089 48050405 51040613 52202537 52229791 49242588
16526 49242588 44400289 38778135 32174833 25908520 20462988 15910116 12411328 9824817
16518 9824817 7934496 6560187 5546212 4786416 4212709 3770473 3421761 3156478 2943925
16509 2943925 2761390 2604235 2449651 2296136 2153937 2021863 1910306 1813363 1732490 1669021
16499 1669021 1612935 1556783 1503956 1440246 1368924 1301977 1227769 1163436 1115506 1073480 1038083
16488 1038083 1005850 970127 926654 876337 822898 765222 707827 649915 603641 566748 537696
16477 537696 515806 500813 488090 475154 461578 452097 434532 412242 388898 366312 349637 336747
16465 336747 325611 318411 310073 309421 305307 289663 268275 251967 233822 219074 208171 198179 188443
16452 188443 180157 168453 161137 159407 154996 149858 148298 146936 144193 143611 142026 141409 135185 128240
16438 128240 127109 123842 123357 122337 115306 112319 111385 111619 110044 104776 99595 91568 86611 86220 90237
16423 90237 92496 92838 93813 95837 98714 101475 105241 110401 110695 104604 98390 97138 96122 94651 91963
16408 91963 91087 89597 93417 98075 102029 104418 104208 99287 94148 91826 92010 91438 88777 83486 77332
16393 77332 74849 75217 76234 71532 68924 72473 81824 80512 75274 74161 75383 71081 67889 65952 66552
16378 66552 67351 70609 71059 73730 71517 70613 69378 64301 63251 64688 67376 64331 59092 55598 54102
16363 54102 47375 42172 40228 37793 33952 31411 27055 26151 24623 22904 20436 15200 12784 8795 1359
16348 1359 528 2717 1101 3840 10146 12022 9920 15203 24686 32981 37375 39495 41576 43916 47015
16333 47015 47123 46367 49532 51065 45684 42477 41286 37306 32564 29641 30260 33342 34406 29693 23697
16318 23697 22815 22545 21532 17947 16253 15522 17679 16382 13434 9044 7545 7069 6515 6827 5831 8412
16302 8412 8787 12702 16141 14751 14627 17962 19733 21007 17512 15098 15093 15050 14024 14395 16743 12165 14026
16285 14026 18001 15106 16869 19035 13762 16023 16587 11817 13333 17061 16266 19041 22668 21480 21364
16270 21364 20873 21486 22590 20468 19853 17298 15197 15449 14541 14166 15174 15820 14162 11854 7413 2210
16254 2210 2276 4642 9256 10878 9822 7532 4479 6510 3429 2726 4201 2088 2975 4627 4443 4315
16238 4315 7845 7452 7204 5616 3870 2429 1511 2195 1525 2376 7663 15084 16048 16470 15096 14257 14074
16221 14074 16086 18067 16684 14177 17192 23280 23377 22139 24562 21334 21604 21334 22280 24161 26930 26061
16205 26061 28154 28200 28359 26354 24349 28799 31262 30174 28397 26516 24547 24436 21228 21496 24834 32710
16189 32710 37134 36352 37076 38122 34384 34237 34532 36036 33705 35309 34247 31124 36432 42169 41937 45450
16173 45450 47426 47344 47908 53258 61289 73289 93913 120554 147992 174048 194231 200977 205071 194488
16159 194488 173774 154189 134097 113525 97120 82382 66287 62777 62825 63673 58745 55216 51542
16146 51542 51950 49706 47398 50121 50599 46396 41476 43724 44673 43618 47126 49567 44939 40052 39135
16131 39135 37962 35561 35129 35591 39189 37368 35567 38087 38661 39293 39826 38587 38023 38590 41701 38731
16115 38731 33266 28002 25711 31259 34038 33877 29974 24976 25053 26057 24401 23192 24512 26397 26267
16100 26267 26274 23635 25798 29262 28435 24693 24320 23063 21300 23293 23573 23159 21838 14788 11657 14088
16084 14088 15260 14054 12903 17199 22908 24795 26855 27057 23369 18210 17654 17689 18914 16890 13773
16069 13773 17337 16684 16803 15220 16779 14625 11167 9432 13320 20287 23364 24648 30206 28147 25652
16054 25652 27401 30724 36828 42481 50811 56774 62442 65117 62910 59576 63086 62679 59367 57358 59274
16039 59274 62822 67524 74485 80920 86824 84810 76971 74522 80023 78162 71545 64232 59747 57299
16025 57299 54388 53948 55593 55293 60073 67979 69304 65178 57633 48603 42108 40715 33884 22637 19782
16010 19782 20219 24304 23259 20160 19369 23337 28049 33492 37301 48607 69844 90574 116311 147981
15996 147981 183708 221972 252838 265032 276675 273073 257734 244868 228739 215740 211018 221549
15984 221549 232700 251316 268741 276653 279970 263951 236436 203435 169187 138171 112136 88353
15972 88353 72968 60209 48242 39664 34922 26157 22117 19655 19012 13730 10914 9710 10714 10461
15958 10461 12098 12414 11799 10823 10277 10332 10307 8613 9250 9537 8767 5588 7483 13166 14818 7104 1484
15941 1484 5809 8883 8443 8043 5806 6392 6102 4364 599 -248 -2230 -2692 -2155 -1016 364 143 1816
15924 1816 1264 -2509 -3485 -2341 -4133 -4113 -3729 -2957 -1193 -1662 -2492 1261 5247 3553 -1781 -904 2637
15907 2637 3059 1764 -1782 -3003 -7409 -9283 -5854 -4109 -1966 -2085 373 2297 -3650 -4874 -5848
15892 -5848 -5826 -6135 -7985 -6336 -2611 -2841 -1979 -3577 -3502 -3205 -4508 -2780 -3668 -5113 -5205 -3379 -2786 -6230
15874 -6230 -8816 -7932 -7695 -6010 -6043 -5814 -3536 -2801 -4315 -4913 -5376 -6507 -6013 -7511 -8808 -9460 -13701
15857 -13701 -15234 -14929 -17166 -14061 -9709 -9368 -11789 -8550 -10655 -12466 -10592 -10682 -10545 -9491 -9117 -10630
15841 -10630 -7183 -5207 -7585 -8176 -9802 -9031 -9482 -8962 -3445 -3901 -4027 -4876 -3503 -2539 -3067 -5167 -7826
15824 -7826 -6010 -5473 -9638 -10286 -7915 -9247 -9525 -9994 -11656 -14955 -17105 -13890 -12337 -12566 -13663 -14189
15808 -14189 -8221 -6081 -8961 -12293 -14480 -15708 -12207 -11344 -16906 -17346 -14880 -14921 -13398 -13151 -16094 -15028
15792 -15028 -10862 -7529 -4429 -4837 -2289 -5513 -7022 -9804 -10146 -8187 -12359 -13892 -11312 -6278 -1557
15777 -1557 -4755 -9460 -6762 -11077 -11170 -7319 -8792 -11570 -15593 -17895 -15581 -13641 -16199 -16507 -12825
15762 -12825 -15748 -16092 -16683 -12391 -7026 -4316 -9120 -14040 -17846 -18253 -17527 -9266 -5933 -7297 -8013 -7900
15746 -7900 -10759 -12790 -13158 -10922 -9481 -8310 -9367 -6138 -4714 -5185 -6928 -8802 -9445 -14788 -12941
15731 -12941 -12211 -11378 -6604 -4441 -6828 -9447 -7500 -4003 -4984 -5314 -7630 -9263 -7225 -7381 -4885 -5303
15715 -5303 -10569 -10436 -8484 -11486 -15533 -15155 -9471 -10108 -10782 -8683 -10059 -11891 -10635 -8429 -7984 -6368
15699 -6368 -7117 -9275 -10661 -14628 -12290 -13149 -12799 -11336 -8610 -8538 -11017 -10625 -11214 -11345 -11055 -14182 -14666
15682 -14666 -14751 -13919 -13025 -13857 -14800 -12043 -6471 -3996 -6765 -9241 -10909 -11567 -7640 -7028 -5905 -8782
15666 -8782 -15037 -13613 -9930 -10704 -9537 -6561 -7853 -11751 -9324 -6084 -3861 -4501 -2969 1765 4203
15651 4203 3276 2810 3746 1575 -3020 -4229 -3154 -1848 -3762 -5920 -4783 -1569 -1374 -2935 -3076 -1322
15635 -1322 3653 4923 -319 -3555 -5482 -8105 -8474 -4940 -6202 -7396 -8002 -4938 646 -2 -1676
15620 -1676 -2770 -1158 -2027 -4210 -4639 -5167 -1770 -1621 86 2492 3240 666 9 390 418 -1202 -270
15603 -270 3092 4319 4176 5317 4420 3785 3956 4085 7485 4502 -2868 -7228 -5549 -8196 -7995 -4538
15587 -4538 -6100 -9753 -11474 -10172 -6216 -2959 -1956 -6247 -9331 -11575 -11701 -11444 -12881 -11915 -12558 -11567
15571 -11567 -8674 -4952 -3612 -774 -755 -3429 -2954 118 -1464 1729 2672 5406 5040 984 -4931 -5388
15555 -5388 -2825 234 -688 -993 -2826 -2759 -4411 -4142 -1515 -4459 -9659 -6498 -7022 -9134 -5987 -7211
15539 -7211 -9975 -9610 -7814 -8392 -10735 -9311 -7609 -8317 -7119 -6595 -6034 -8966 -12803 -9148 -3601 -5159
15523 -5159 -9899 -9710 -6058 -7934 -11544 -13077 -11257 -7793 -6831 -4750 -4109 -9982 -13627 -10912 -6821
15508 -6821 -6362 -11182 -13490 -15507 -13405 -8123 -3655 -1784 -4732 -8470 -9448 -7219 -5769 -5604 -3892
15493 -3892 -2353 -5303 -6716 -1344 -1576 -6516 -7419 -6703 -6794 -7611 -6048 -4604 -3146 -6292 -8317 -10459
15477 -10459 -13522 -9759 -4735 -5494 -6522 -8834 -11110 -9514 -12327 -12845 -11422 -10076 -6527 -4834 -2889
15462 -2889 -2158 -3296 -6741 -5573 -4147 -6028 -8564 -8162 -6967 -4756 -3639 -3582 -3052 -1420 -1733 -1975
15446 -1975 -1541 -4002 -5615 -1952 -3394 -4106 -5829 -7943 -8990 -9041 -4242 -2769 -4720 -2272 -4145 -8699
15430 -8699 -11791 -12560 -12880 -14975 -12403 -5663 -4974 -8504 -8415 -8509 -6946 -4047 -750 -2862 -9245 -14085
15414 -14085 -12297 -11679 -9432 -9832 -9096 -7816 -6960 -5035 -5452 -6444 -7820 -9517 -10701 -5891 -1908 47
15398 47 -875 -2164 -5755 -7767 -9407 -7932 -7195 -8447 -12366 -13336 -14353 -11882 -6580 -981 2948 -1653
15382 -1653 -4839 -4004 -4789 -3518 -2658 -2898 -5674 -11900 -13514 -9580 -10004 -11271 -9183 -6633 -4958 -5469
15366 -5469 -4942 -1517 549 2663 1231 -1889 -1330 -49 -4203 -6867 -6073 -3291 -90 -440 -3009 -3077
15350 -3077 -4420 -6100 -6396 -5465 -6665 -6817 -6999 -6560 -6415 -4224 -4237 -5201 -5408 -8897 -8322 -9781 -12751
15333 -12751 -9211 -6441 -3083 2982 6721 3168 -3684 -5393 -8442 -7266 -5425 -7121 -12445 -15858
15319 -15858 -17089 -16514 -14554 -11191 -8843 -6463 -5412 -6364 -7060 -9555 -8594 -10013 -12056 -13996 -10705
15304 -10705 -5275 -6863 -5642 -5069 -4285 -7434 -5794 -4081 -7955 -7564 -4379 -2673 -6631 -7120 -3151
15289 -3151 -2016 -1882 -2998 2526 4877 241 -1779 3424 4176 1595 3788 2966 3808 4046 -113 1749
15273 1749 3805 5782 6445 5596 9420 9745 8017 891 -2857 -2941 -2144 -871 114 4104 5461 6871
15257 6871 1934 486 473 913 -3297 -4795 -3284 -1029 -1457 -2172 -3768 -85 -44 793 5870 4536 4176
15240 4176 10704 12499 9249 5091 2504 2668 -1647 -1684 1824 3524 7071 9111 7622 5096 5534 6148
15224 6148 11492 15395 12274 9090 11391 12814 12957 12270 17690 23812 27277 31153 40555 47999 53455
15209 53455 64349 72657 81872 87570 87777 88938 92119 99850 109414 124244 145717 161402 173055
15196 173055 178102 178063 171142 161859 158666 164874 175049 188708 203874 218230 225294 226094 216815 198597
15182 198597 182130 171232 167090 169069 172266 177352 178181 180664 173256 158671 142868 119846 104337
15169 104337 95526 88734 83948 85631 88098 87113 80476 79236 76259 62891 51228 43466 35537 28721
15155 28721 26631 25853 25864 21762 17995 15095 13095 15566 15263 12578 10851 8078 4607 6923 8172
15140 8172 7826 8275 6244 4959 2926 1456 3339 1475 -852 -5803 -7094 -3153 -2268 -3154 -5873 -9745
15124 -9745 -12467 -10299 -4391 1086 1331 2947 1724 1038 -2840 -4662 827 3758 3085 -2974 -6086
15109 -6086 -5611 -406 -689 -260 -917 2995 3942 3755 843 740 1129 4523 8289 12859 19988 25258 26114
15092 26114 24640 21236 10440 3653 8643 12427 15406 21648 25686 26298 23720 19599 13614 9574
15078 9574 7910 3378 -378 -5208 -4940 -6404 -6110 -11744 -10913 -6874 -5091 -4299 -5705 -3452 -1698 2096
15062 2096 -1424 -5076 -8857 -11316 -7519 -6831 -8161 -3508 -2677 -7031 -5027 -6900 -9160 -10526 -4986
15047 -4986 -2061 -2424 -5137 -5309 -2616 -2720 -47 1298 1192 1409 1280 -1039 29 2846 4676 5984
15031 5984 2238 2969 7360 9597 7167 8098 12241 10481 11087 13188 16299 18778 19022 12526 9022 6809
15015 6809 1677 -3754 -4752 -2709 -2034 -2579 -1477 -741 118 3292 2630 59 -102 3410 -312 -2807
14999 -2807 -2407 -1255 -744 -3271 -6383 -6890 -270 -775 -917 -1484 -1981 -1583 1559 7730 13104 16623 19072
14982 19072 19776 14712 9599 6493 8484 6100 4540 7685 13481 21156 20280 16388 16953 10921 4316
14967 4316 2760 515 -151 2343 5584 1312 -879 -3153 -2702 -3315 -3654 -2 -777 -1900 503 209
14951 209 126 5074 6838 5097 4715 -1637 -5436 -4896 -5317 -9864 -8349 -2584 -3142 -8248 -4711 189
14935 189 -3116 -5136 -5650 -2868 -194 -3297 -5757 -4417 -4309 1110 3240 1879 1842 6446 8346 11091
14919 11091 10206 6294 5847 3892 5209 6019 6732 7508 6873 6593 9604 5696 1683 4795 4929 -199
14903 -199 -3621 -687 -1278 -2191 -2119 -80 1655 -1262 -8223 -9420 -7214 -7838 -7891 -9624 -10013 -8802 -8234
14886 -8234 -7202 -3455 -145 -2497 -3268 -1440 436 -1704 1894 5079 -132 -5187 -6347 -5584 -5231
14871 -5231 -6773 -10783 -11250 -11155 -11801 -11398 -10455 -13838 -14298 -10577 -10597 -8996 -7191 -3729 -3436 -5902 -6679
14854 -6679 -7964 -8283 -7156 -4998 -5982 -6754 -8995 -8637 -4941 -5475 -4425 -1909 -1272 -1603 321 -1 1495
14837 1495 5229 7490 5949 832 1831 4632 2389 512 -1807 -4032 -2255 -1355 -1789 -3786 -1988
14822 -1988 967 222 -379 1173 6401 7996 9217 8388 3267 4431 2213 2111 4540 1394 -1924 -2588
14806 -2588 -1393 -1713 827 5546 10932 15223 13887 10806 8794 12736 11704 7505 4820 3743 2078
14791 2078 7074 11742 12156 10501 9525 3802 1217 -2063 -2758 -3306 -1480 3220 3303 -2048 -1386 2110
14775 2110 629 -1153 -868 -724 259 -2174 -2693 -6319 -7935 -6144 -3411 -2846 -4162 -2402 -3887 -2126
14759 -2126 -5292 -7784 -8316 -9991 -4188 -3164 -4906 -6758 -2410 610 -975 1381 1774 1486 394
14744 394 53 192 789 -2620 -3052 -3954 -1726 -2161 -492 -2494 -3256 2049 3017 2204 855 4366 7770
14727 7770 6133 2545 1340 2122 3700 -295 -773 315 545 1694 2148 3710 2762 832 -1465 -1858
14711 -1858 1567 64 -1683 1596 3398 2666 -460 1980 4986 8216 1253 -341 4655 5359 461
14696 461 1306 884 2134 2993 4994 7843 4758 3671 7585 3992 -2834 -1226 5229 5519 3536 -1249
14680 -1249 -4390 -5960 -9435 -7277 -2684 -411 200 -1999 -4328 -6101 -1808 1294 1212 767 -2337 -5087
14664 -5087 -6091 -2189 -110 -1776 774 -1746 -6057 -7403 -7443 -6052 -2205 -2557 2683 4898 3888
14649 3888 1726 806 -857 -3085 -4871 -6581 -4079 -2197 -2206 -2015 -2030 4630 7150 5126 -617 14 1069
14632 1069 1039 -2793 -4442 -3391 301 -2216 -7577 -11602 -15714 -14137 -8887 315 1451 1871 -2664
14617 -2664 -3735 487 -633 -4823 -3022 -806 -2990 -4205 712 3807 5010 5993 7470 8862 9720
14602 9720 5359 8230 8101 3535 3840 5762 3390 -890 1306 1494 2903 1229 -1284 -4242 -6530
14587 -6530 -5799 -5856 -8474 -9453 -10021 -7676 -8328 -5387 -5676 -9493 -11671 -7120 -3315 -2122 301 566 1406
14570 1406 2387 5672 2722 6527 14551 16637 14645 10395 9653 7761 2814 -340 1274 3413 10861
14555 10861 15253 18705 21900 17084 14633 12310 11381 10900 9619 1210 -1744 -1147 -1362 560 -1487
14540 -1487 -1924 2345 2126 -250 1889 5218 3441 -382 -4006 -5881 14 6685 4413 3329 4178
14525 4178 7820 11492 17551 17159 16199 15174 9689 9120 9453 10180 5640 550 -269 -463 1707 7766
14509 7766 10657 11021 9100 7680 5773 8194 10368 10050 11814 7375 5735 7415 2683 -2346 -2033
14494 -2033 -1714 -2677 2065 -904 -3695 -2710 -3320 -3754 -3595 -2948 784 3043 141 -2015 -3452 -2698 -3631
14477 -3631 -4932 -9394 -8444 -9221 -7698 -7492 -5647 -2756 -2889 -1826 -1675 -4533 -6214 -4565 -407 -901
14461 -901 -1522 -211 -745 -1376 -3965 -1103 -3948 -7062 -5209 -7868 -8196 -7124 -6360 -5731 -6462 -3783 -26
14444 -26 -3220 -5404 -3128 -1708 2750 6225 5582 5195 7264 9274 8177 5546 5267 490 -2676 -2273
14428 -2273 2524 5894 3609 7265 9389 6614 1890 -1771 1773 5323 4869 1509 -2089 -30 92
14413 92 1400 4555 10573 12585 11674 8118 5231 4236 5878 2723 -2222 -2491 -2894 -5426 -3949 1145
14397 1145 2965 5257 5225 4029 3180 5736 7562 7325 2111 -3728 -4446 -2519 -1094 329 365 4503
14381 4503 5374 3058 -551 -2633 -3501 -2296 -3055 -3581 -2626 -8446 -7124 -6121 -3225 909 -590 -2411
14365 -2411 -5425 -4131 -2905 -3140 -3582 -3171 -6884 -9698 -9556 -9898 -6165 -1036 3513 8143 13676 16934
14349 16934 18047 12098 6175 691 -3729 -5819 -3185 2834 10000 14648 15726 11281 7039 3348
14335 3348 -872 -3807 -3667 -569 432 -780 -5990 -6557 -6701 -4219 -1891 -2150 -3108 -2038 -5161 -7655
14319 -7655 -6480 -4464 -3544 -5750 -6979 -1987 1316 656 575 833 -6703 -10182 -8940 -9338 -8026 -7068
14303 -7068 -6225 -5758 -11523 -17502 -19293 -16841 -17724 -16346 -15745 -15363 -14097 -12088 -16536 -17997 -15894 -10541
14287 -10541 -6913 -3901 1001 5441 14346 17689 15799 10014 3800 -2997 -166 5531 5777 4289 7155
14272 7155 9921 10397 16452 16110 13524 5811 -1613 -5213 -7099 -7508 -8321 -7549 -5239 -3003 48 -1279
14256 -1279 -4900 -4507 -2050 -1406 -2177 -5252 -8533 -6073 -4982 -7356 -11040 -10086 -7649 -8889 -13229 -13473
14240 -13473 -13298 -9515 -6617 -4897 -2625 -2502 -5948 -7603 -3358 -291 -3642 -7752 -7331 -4726 -5810
14225 -5810 -10620 -8488 -5592 -3062 -5741 -12370 -16038 -16586 -14148 -12630 -12592 -8521 -4128 -4996 -6723 -2476
14209 -2476 -1176 -4598 -8195 -5935 -3745 -1717 -2314 -2874 -1598 1376 -1062 -2324 -4596 -5960 -3948
14194 -3948 -4093 -909 3703 3619 3844 5913 6157 5115 2957 806 167 2917 4830 4500 4629 5018 2555
14177 2555 2895 3666 4909 3435 4508 2511 -1191 -4299 -5319 -2840 -1819 -3343 -398 2385 3654
14162 3654 8022 6293 4230 2273 -2463 -4849 -4265 -2422 1145 -2430 -4967 -3733 -1450 -846 618
14147 618 2279 86 -2257 -9830 -11591 -9048 -8316 -8632 -5960 -6622 -5502 -3346 -4619 -8439 -12446 -14685
14131 -14685 -10084 -4974 -3655 -3723 -5729 -8762 -9756 -8918 -7624 -5070 -5156 -6188 -5516 -2451 -801 2349
14115 2349 806 -1439 1435 1122 -3070 -3315 -5012 -7545 -4745 -4210 -5804 -4219 -1005 -479 -2088 -5336
14099 -5336 -8625 -7684 -7800 -6964 -2441 -3993 -4852 -5939 -2260 -3422 -3693 -2088 -3430 -3605 -1260 802
14083 802 -387 96 948 2456 3424 5821 5683 2175 -3928 -4634 -4664 -6427 -6046 -4269 -5541 -8957 -8149
14066 -8149 -6984 -8529 -12794 -13429 -11186 -9374 -6956 -7817 -10059 -9300 -7434 -5838 -3251 -1360 -3254
14051 -3254 -6657 -11199 -8291 -7319 -8344 -9792 -9796 -9872 -7775 -2810 18 -1508 -3191 -4142 -3782 -762 745
14034 745 527 4515 7671 2211 -372 -535 -3607 -2537 -1286 -4017 -3051 -2559 -4760 -8844 -8040 -8440
14018 -8440 -11972 -9428 -3155 -4348 -2859 -3443 -5957 -8540 -10251 -12634 -10783 -6776 -3892 -1962 263
14003 263 -6474 -10616 -8537 -12732 -14979 -13772 -5895 -2432 -4615 -1788 3806 3273 1390 1727 5604
13988 5604 5124 4213 2877 4274 1015 -2462 3137 7228 11150 12275 11110 10341 11289 9256 7164 4926
13972 4926 3762 4745 2745 5064 10361 9572 8229 6625 1834 -220 -1338 2713 -2386 -2483 -2733 -5087
13956 -5087 -4029 -4840 -3325 -3587 -4622 -2276 602 -1896 -5227 -10251 -13361 -16338 -18712 -16469 -13459
13941 -13459 -13844 -14958 -14489 -14257 -11170 -9368 -8339 -8852 -7175 -4154 -3004 -3437 -4474 -4171 -8275 -14017
13925 -14017 -14542 -12527 -13182 -12815 -11916 -8320 -6300 -9710 -9299 -12962 -14603 -14132 -13505 -10544 -3874 -5465
13909 -5465 -6429 -7915 -9099 -9928 -8236 -8095 -8124 -1945 -255 -286 -3362 -5586 -3961 -5825 -10495 -10782 -7265
13892 -7265 -6739 -7929 -11583 -7520 -3745 -3861 -1954 -1497 -3972 -1689 1398 892 642 1105 -273 430
13876 430 640 -1391 -3501 -4247 -4749 -2234 138 -9462 -11391 -5162 -3371 -4308 -8335 -10361 -10367 -8161 -8734
13859 -8734 -9421 -11058 -12566 -11836 -11114 -9470 -2769 -539 1531 -339 -5968 -10682 -15313 -13419 -10922
13844 -10922 -11309 -10062 -11337 -9566 -8369 -2250 2753 5696 9357 15091 17179 13970 10124 7362 2858
13829 2858 -3114 -6488 -5428 -6613 -12966 -16913 -18492 -16277 -11469 -14023 -12208 -12440 -11912 -7724 -5997
13814 -5997 -4847 -5245 -7284 -10232 -16643 -17338 -20665 -20099 -16980 -17642 -16432 -13038 -14469 -15070 -12412 -13631
13798 -13631 -14865 -12858 -9928 -7270 -9373 -8943 -5678 -8023 -9510 -10683 -8564 -4147 -2961 -4238 -8027
13783 -8027 -10204 -12262 -12449 -13692 -10345 -10097 -9604 -8625 -7660 -7806 -8258 -4176 -3478 -3240 -3551 -4461 -4269 -1837
13765 -1837 -3317 -3303 -6132 -10782 -10719 -10152 -13484 -14546 -14516 -11227 -11756 -9510 -7302 -6049 -6951 -9108 -6175
13748 -6175 -6431 -5088 -6298 -7488 -10071 -13620 -13463 -12374 -14068 -15869 -15931 -14598 -11224 -11253 -13239 -15352
13732 -15352 -12333 -12717 -14846 -17101 -16981 -17906 -15146 -18132 -19948 -14095 -12462 -9583 -5648 -9735 -11772
13717 -11772 -9443 -9394 -6948 -8564 -8751 -7961 -8603 -9324 -10564 -12207 -13091 -12482 -8467 -3360 -2825 -2877 -3589
13700 -3589 -5737 -8160 -10344 -8951 -3637 -2494 -3850 -4665 -4710 -4303 -5478 -9973 -12619 -10467 -9619 -9566
13684 -9566 -8629 -5536 -2707 -3460 -2939 1163 889 -1447 -4555 -7337 -9478 -8655 -5895 -7122 -13581 -16285
13668 -16285 -13248 -10888 -9549 -7932 -7109 -10101 -10204 -10375 -9911 -9665 -9469 -8550 -7652 -12368 -16126 -14726
13652 -14726 -12512 -11610 -6412 -2756 324 -4822 -6387 -8168 -5540 -3540 -4351 -3819 -6960 -6514 -8591
13637 -8591 -12178 -13767 -11129 -9476 -10247 -8340 -4627 -697 2963 -1927 -4737 -4175 -506 -2595 -6479
13622 -6479 -6322 -3763 -2712 -4194 -4001 -5527 -4915 -1797 -5092 -4488 -1206 -3548 -6893 -10677 -10557 -7944
13606 -7944 -4370 -4759 -4817 -6659 -5851 -8198 -8404 -9355 -12283 -14934 -12554 -12391 -13068 -10515 -6586 -6360 -3236
13589 -3236 -1577 -1258 -3341 -4391 -2507 979 29 -2285 -5650 -5717 -8454 -13184 -14561 -15106 -11780 -9388
13573 -9388 -7374 -5536 -3239 3171 2792 4427 6013 6080 10351 6489 1720 770 4768 4425 6700 8775
13557 8775 9561 15178 16892 17822 20188 31271 48075 60885 85026 116470 146877 175646 199829
13544 199829 213560 223891 221725 199938 174272 144066 115601 89514 65326 47818 38790 30870
13532 30870 26948 24392 19904 15487 11713 11596 11349 7023 5476 5684 4173 4088 5029 2589 282 1313
13516 1313 1734 208 1955 1177 -2030 510 -550 368 3142 5227 2789 2755 858 -799 -684 -1608
13500 -1608 -4590 -7459 -9304 -8439 -4296 -1611 -2880 -1610 -2168 -1119 -678 3108 4845 4554 2411 1480
13484 1480 3329 2299 -937 -501 2087 -598 -1190 272 -1608 -3052 -4081 -6105 -5522 -4502 -7193
13469 -7193 -5510 -7896 -9015 -10570 -8689 -5440 -4357 -1091 -2731 -1808 -2068 -2391 -4327 -3156 197
13454 197 1339 1061 3607 4391 5649 6035 9702 8185 4980 9628 9692 7750 3959 3320 5664 5607 6742
13437 6742 12539 11645 6194 5887 6334 5702 8020 8527 6028 4040 5885 5295 4802 3771 3779 2127 -518
13420 -518 -450 -224 2427 5929 9365 8324 4218 2530 5044 4505 6590 4448 7461 7538 5865 2646
13404 2646 9314 13324 14062 8513 5397 6763 4869 913 224 -280 39 3076 4109 2281 2726 5252
13388 5252 6470 5704 3993 1218 2185 6755 7385 2059 865 2009 -30 1010 4073 7904 8783 8674
13372 8674 7919 6600 9733 14541 10440 10110 11539 11370 7735 5459 5810 4291 1217 4587 9584 10698
13356 10698 9763 10107 8753 11530 13736 19829 25827 35219 40161 42154 46648 50806 52857 53712 47045
13341 47045 39432 37824 31153 21415 23521 24221 20845 16393 14189 11117 7860 6803 9802 8746 10912
13326 10912 13237 14723 12376 10576 12302 13248 11392 11535 11727 10872 11193 10154 9127 7308 7839 7449
13310 7449 10920 15735 21984 30044 38139 38699 36162 39942 41979 41466 41292 44369 41976 38371 34537
13295 34537 29916 24850 22838 22015 21426 19223 20000 20074 16550 16690 15951 13985 16157 18238 16963 10653
13279 10653 4939 3323 3978 5307 3508 6793 15788 17523 15389 13738 8672 9668 13175 11790 11391
13264 11391 7210 3197 1999 4558 7844 10393 13120 12249 15257 14946 11320 9314 6565 6280 9945
13249 9945 11118 8799 10680 8491 7996 9304 4815 962 -2301 -3704 -2253 -999 -943 4044 3012
13234 3012 2369 2269 809 -99 4197 7769 8241 7435 7732 7280 2492 3607 6546 9666 10757 11791
13218 11791 10693 7978 3745 1257 1855 2293 7333 4718 1052 3469 7449 7261 6125 7084 4434
13203 4434 2410 4753 8858 6996 8239 10838 9063 9419 8485 6669 6246 4771 2176 2598 4763 6278
13187 6278 8574 7614 7979 6139 2051 -1861 -1995 671 1722 1623 2531 4211 8103 8771 9357 7272 4891
13170 4891 4855 9872 14985 20603 23832 24684 24766 30228 34721 34338 32542 28338 23416 21901 17844 15676
13154 15676 14154 12235 8609 5336 5638 3381 2999 5822 8326 8434 4450 6866 9995 10761 7967
13139 7967 7728 6938 1130 -5067 -2732 -689 1848 5153 10593 13193 12803 14765 15043 15478 18735 21064
13123 21064 18686 15861 10547 13208 12105 10368 10057 8114 7787 10327 11842 9277 6004 6641 7620
13108 7620 4897 7833 4401 2029 2582 5473 7860 3587 4086 8040 10536 12179 6914 5507 4975
13093 4975 7412 9143 7610 7317 8658 9814 9983 10561 15088 18232 19058 22807 23663 22033 20936 19928
13077 19928 20212 20417 18591 15894 16790 16151 15652 16202 9628 4560 891 -490 -3390 -3691 -4626 -4386 -4629
13060 -4629 -4889 -5013 -475 -769 -2453 1816 9615 16007 17444 18506 16432 15389 16310 15682 10017 9243
13044 9243 8962 7771 7188 11061 13318 13434 18574 21285 16288 22087 23461 22610 20375 21590 22483 19343
13028 19343 24985 32607 36095 35453 37659 35990 33319 34131 35039 40007 46391 53886 58656 58846 58889 51821
13012 51821 48013 46100 47367 53712 55085 49700 45799 40583 32266 28202 29437 25855 22774 19307
12998 19307 17523 17815 14856 14415 13560 10808 9644 14376 19999 21090 17720 17753 24317 31444 38078 42215
12982 42215 39842 37933 38735 38761 42062 43605 52515 59765 59463 53969 49554 46872 46316 45850 47530 50362
12966 50362 49209 46841 39676 31379 31823 32706 32383 31649 30822 30288 34391 36453 31813 29221 32072 31669
12950 31669 32071 33460 36112 40324 43296 39549 32149 30978 28091 29647 31541 31767 32152 32679 33294 27381
12934 27381 25572 25122 27201 30285 32179 32817 31580 27505 26351 24422 23961 25069 21622 20659 23682
12919 23682 21931 16887 16343 18898 22545 29685 34177 34040 32859 30855 32010 33065 34282 34907 36344
12904 36344 36671 44488 40451 35305 31052 31316 36499 42106 43263 39975 36361 33540 29785 25080 24815
12889 24815 24283 23778 25832 28741 29006 25038 25234 23946 20389 20586 21540 23395 23223 23522 21431 19211
12873 19211 19214 20207 21859 16933 13343 12628 13004 10958 4644 -506 2248 4467 5008 4934 3817 5636 10817
12856 10817 13830 13955 14723 17638 20693 20309 20250 23322 25144 28514 30020 28839 28563 31224 36533 41053
12840 41053 42372 41385 43620 42695 40224 39884 35533 30955 35803 35964 38032 39618 38460 38594 34763 32053
12824 32053 26119 18676 17978 18116 17172 15808 15203 16305 18888 21450 23177 22056 22161 20635 18670 16421
12808 16421 17525 19614 22712 21648 19977 14675 5077 6015 2353 -526 -1084 -200 3116 8113 8871
12793 8871 10208 10374 13186 15758 16528 17977 17976 16058 18222 25500 25733 26528 28217 25672 24943 24653 22693
12776 22693 18753 19745 22345 21167 25209 27607 24501 23068 24133 21592 19682 17258 12880 8306 5312
12761 5312 2994 2673 3831 7450 8416 9942 5544 4506 2502 7061 11614 14444 11753 11355 13525
12746 13525 15176 16732 12357 7072 8320 11990 15780 18686 19915 23935 26690 31713 33386 36037
12732 36037 35728 37879 37325 32463 33821 34050 28729 27139 27318 28115 29582 29556 32132 36034 34472 32242
12716 32242 36205 39776 45260 53288 57894 61233 60016 59006 59958 59821 60190 53267 44734 40593 38272
12701 38272 36966 32806 28825 30233 32569 31096 31454 33537 31953 30072 33748 33704 33130 31008 30891 31488
12685 31488 32690 35273 34584 33219 34506 33045 32404 28511 32963 36696 41788 40084 38670 34951 32831
12670 32831 35243 36830 36840 42931 47212 48699 49181 53932 58442 57309 54984 53864 54139 57599 56765 57875
12654 57875 55475 55439 56905 57378 54138 49667 49425 47423 41654 34758 31177 32233 35424 34758 33939 34806
12638 34806 42827 54210 59988 67828 70398 65779 63064 61264 57635 55093 53756 55723 56599 55173
12624 55173 51831 49312 44487 37825 30685 26028 25619 22281 19887 23487 30680 34157 38599 45422 47152
12609 47152 43005 39585 41110 42456 42562 42346 42266 45091 47444 52435 57590 61803 68262 70764 68091
12594 68091 65736 64641 61492 55382 51376 50849 54237 55113 55632 57425 58548 56525 56642 59994 65704
12579 65704 73555 79281 89199 98889 97516 94755 95781 97432 100121 98077 94202 90576 90376 89094 92429
12564 92429 101918 117275 147043 191465 246517 304149 328957 315603 290050 261603 239233 235658
12552 235658 239699 244509 249433 252156 252514 244113 235242 228692 222346 216906 218273 219988 220324 221757 226724
12537 226724 235876 249970 268895 300097 349440 416203 506161 624172 767784 927999 1098591
12526 1098591 1264503 1398224 1478885 1498244 1452672 1361403 1259913 1163652 1092346 1070440 1098008
12515 1098008 1079088 991645 908077 843469 819477 817061 800156 759074 708664 663584 628626
12504 628626 608139 606511 617369 639683 667249 671768 641813 606054 584049 577950 578709 581593 602186
12491 602186 661144 739005 800186 848054 886241 897094 872000 839081 818457 812456 813470 839523
12479 839523 882170 936550 1012192 1133995 1337095 1600546 1766399 1704220 1538487 1346446
12469 1346446 1193061 1087078 1016907 962049 904114 852742 811129 776697 758601 766838 787858
12458 787858 798975 776027 717198 656210 605425 567924 535484 508350 489411 491049 509031 520083
12446 520083 503382 465624 425583 396433 385191 393051 412524 441178 479563 514634 540546 548143
12434 548143 556929 600789 686424 753755 708965 618589 508898 408324 333172 283586 257740
12423 257740 251024 251057 243668 231632 215811 196407 184906 180662 183758 196396 222543 260149 303443
12410 303443 363593 448607 544584 591991 569817 511685 441746 382928 336429 302444 279504
12399 279504 260095 240307 225423 206572 192111 182650 169281 159076 145839 136616 121762 112171
12387 112171 108811 107522 106756 104835 99717 96060 99216 103736 106193 110408 114886 123020 137517 157938
12373 157938 186376 219730 274085 353640 464642 617919 820088 1022455 1115265 1045077 907949
12362 907949 760392 630543 535897 474961 429241 388018 354809 322033 293570 269720 242268
12351 242268 220594 204316 191480 181258 173693 170660 166252 159562 156743 158098 160718 161376 162031 161736
12337 161736 165844 168566 176906 189627 204667 219745 239132 261148 290879 330911 383671 456776
12325 456776 547863 621101 621258 565039 486108 405165 339487 296227 264105 238677 219350 203648
12313 203648 189012 176744 171495 173324 170758 165368 163263 166112 170542 181749 197043 221071 252169
12300 252169 290063 339076 408889 500043 625166 777327 952152 1132758 1255434 1265322 1193647
12289 1193647 1087523 977671 886295 811853 751737 705088 670838 652524 654634 673686 707642
12278 707642 739458 753243 751600 749223 766916 799196 835861 876442 918641 938392 935120 918469
12266 918469 900392 895499 920595 972910 1048455 1156278 1313243 1535498 1825511 2154655 2438925
12255 2438925 2594248 2580982 2430037 2200075 1963328 1773238 1637952 1536707 1444294 1371062
12245 1371062 1322439 1310811 1330418 1368225 1409348 1460978 1540841 1643978 1722095 1748869 1712884
12234 1712884 1619464 1491438 1350454 1216465 1110725 1030361 976659 944215 930659 927378 943747
12223 943747 987839 1070290 1204882 1374827 1517038 1545434 1475321 1334939 1158316 994984
12213 994984 860298 759862 684199 629001 593803 569395 550734 535759 526830 522393 532388 550441
12201 550441 566620 584694 593994 600124 608281 611823 617819 630617 637736 638517 636521 629373 617913
12188 617913 604287 594305 586931 582718 587593 601481 617747 631465 643666 653820 660322 661001 654383
12175 654383 646082 642737 638905 637310 641478 651060 667725 682576 690049 693690 693667 693973 694323 697085 709760
12160 709760 731079 759286 791607 823432 858391 898848 945367 999913 1057309 1119163 1179618
12149 1179618 1237374 1304448 1378250 1460710 1554655 1655620 1760583 1862050 1951584 2032283 2108843
12138 2108843 2183017 2259164 2345860 2444635 2565205 2710575 2883575 3086540 3332821 3637803
12128 3637803 4013390 4486785 5073585 5795831 6658371 7639603 8735893 9922120 11191944
12119 11191944 12593313 14215921 16217487 18902832 22738299 28346625 36469194 47715145
12111 47715145 62458168 80817720 101545960 122631429 142912803 159346860 169290695
12104 169290695 173207160 169743407 158825524 143317634 124443347 104008359 84612280
12097 84612280 67456841 53203162 42119163 33871479 27898857 23598314 20452543 18073003
12089 18073003 16155173 14501082 13012883 11643404 10368047 9199240 8147087 7218307
12081 7218307 6420355 5750568 5189311 4727207 4334595 4001625 3709302 3448955 3212918
12072 3212918 2989949 2780108 2581445 2398109 2234948 2091420 1965928 1856794 1769246 1701485
12062 1701485 1639318 1579469 1527284 1473533 1415813 1357901 1299943 1248999 1202952 1157657 1117009
12051 1117009 1082367 1053186 1022324 988894 955206 920188 886310 855172 824502 792918 767590
12040 767590 744011 718916 698045 683813 669356 652284 636543 620348 604466 589596 571988
12029 571988 560316 552849 547671 552112 564301 582663 608676 634454 666664 703277 734438 762400
12017 762400 783743 791504 787227 771629 741867 706495 671829 636332 605386 580944 563574 558718
12005 558718 562867 564246 555906 543242 526049 511607 502180 495370 494882 495958 500011 502192 506451 507250
11991 507250 501320 494556 482743 474857 468530 472163 480202 493135 510355 526016 539339 548965 554085
11978 554085 554753 549772 539003 526259 511910 503400 496691 489464 479715 472014 463674 450268 425777
11965 425777 401089 378658 361109 345488 335811 329328 318016 303565 286862 272628 260538 247455
11953 247455 236637 233670 230701 224819 221968 221943 226041 235699 245347 259147 281538 306859 336047
11940 336047 366009 395088 413308 423151 432452 437080 437085 433021 432472 436774 440608 441224 441867 431536 414005
11925 414005 398392 384933 376086 367022 358917 345687 326435 305315 285538 275839 279700 286698 292662
11912 292662 296124 296148 303975 329727 352217 366889 380467 403801 439232 476618 509460 537848
11900 537848 557569 568346 567311 563328 554212 536208 508665 476943 434940 394762 360815 329407
11888 329407 306493 286872 270709 256800 239795 222914 212763 208332 199233 187001 181066 176971
11876 176971 173081 165953 159186 151159 141799 132416 121036 106881 93144 89391 89202 86769 82897 81847
11862 81847 81000 83968 85399 89878 90457 88105 88816 99688 111101 121824 139617 146454 154397 167849
11848 167849 172919 174867 181594 180988 170418 165422 158549 153009 149637 142251 137499 134926 134674 136945
11834 136945 138983 140583 141110 140622 136238 127998 120105 114301 108075 104860 104702 102945 100203 97263 100026
11819 100026 101677 103320 105760 112078 122679 134233 149886 169246 201851 248578 308695 385236
11807 385236 473577 567051 659773 745010 809053 843062 843842 820071 780499 722308 651058 577632
11795 577632 505901 442559 386007 341196 314796 300928 304221 316145 339466 375726 416690 457682
11783 457682 493471 509865 501172 475606 434967 381628 330239 283485 246146 214380 184352 158337
11771 158337 143582 135079 123447 114231 106306 102802 97943 96581 92466 90347 89110 88497 84171 79740
11757 79740 76723 75319 72325 70150 71040 67598 62630 61609 61870 62296 61051 58219 57183 56777 59290
11742 59290 62438 60872 58662 54272 55369 55512 51736 47378 46986 44860 46181 48404 51016 50464 49480
11727 49480 46347 45547 44895 42039 40815 44530 48429 48662 51476 60983 64038 64371 63970 66368 67588 69492
11711 69492 74464 74065 77256 81930 86612 88684 94379 100648 108858 118711 128803 136567 144430 146854
11697 146854 145018 144700 139835 134235 130869 132232 136847 150041 164336 182303 211210 251041 311514
11684 311514 394622 495415 604269 722735 832075 918933 971408 987716 957268 885591 787199
11673 787199 673626 559546 456877 369744 302960 248916 201928 171702 154345 143206 134219
11662 134219 121510 110910 106554 99927 94447 85538 79993 79186 76977 77616 77616 77445 69473 65922 62654
11647 62654 58618 58215 61693 60860 64581 64828 61814 61899 61629 61782 66108 74837 83762 91450 101506 112911
11631 112911 124166 139140 155756 173376 194087 215518 252390 302693 376903 483331 621236
11620 621236 798515 1013743 1255000 1497713 1715797 1884204 1978742 1989462 1917179 1769976
11610 1769976 1562708 1332915 1103522 893945 714272 573654 466689 382329 325024 281435
11600 281435 246014 216727 193415 174908 155937 132195 112706 104008 94959 83831 73588 66593
11588 66593 70022 69467 67804 70715 71754 69911 68660 67255 63655 58990 57437 53866 50607 47149 46251
11573 46251 48698 48563 45556 48642 48997 49933 53689 55542 54670 56387 59254 65380 70590 76517 77179 76500
11557 76500 74256 70148 69184 65493 61975 64120 66663 76375 85217 90537 93117 91665 91132 81820 72816
11542 72816 69469 71245 73147 71657 72246 71552 69116 73286 76587 76377 73808 71597 64470 54636 48878
11527 48878 50478 51676 50869 51040 50548 45627 42518 42427 40420 35831 34857 39071 37426 33960 29281 27943
11511 27943 31184 30704 28728 26687 28143 32604 33674 31597 31568 27502 27689 30370 33313 33766 29886 31214
11495 31214 36747 39975 38696 47080 56819 60579 64542 64899 66963 72590 71859 69520 76273 87616 96956
11480 96956 103837 108822 107514 102011 93800 89934 90573 87211 90267 95363 97855 97969 97322 95226 81516
11465 81516 68426 65222 67057 66443 63392 63327 63937 62423 58315 55127 48559 42648 33607 33697 35319 36988
11449 36988 37369 36005 35516 36394 36183 28216 23004 18954 21070 23602 22568 18934 16610 16131 17665 22152
11433 22152 21623 21415 22283 20104 18674 22926 24853 24443 26808 30116 25173 24362 20876 16270 15242 17030
11417 17030 19619 20170 18232 22712 26176 22412 19249 19745 24179 29550 32267 31290 28030 30465 33844
11402 33844 34845 34196 34496 37515 36279 35315 36467 36923 37206 34943 33661 34375 33723 32126 33023 32136 25521
11385 25521 18880 22263 25644 21611 18690 18117 15550 16979 23825 26355 28454 28913 23621 26205 25626
11370 25626 22249 18511 18590 20335 22691 23023 22026 24549 23226 21711 21155 20680 20708 18879 17531 21412
11354 21412 21482 22606 20674 22967 26486 35615 48199 61068 76994 87250 89172 81831 70756 61603
11340 61603 55969 52070 48475 44261 40961 41109 37010 34126 32698 30886 29271 23901 18956 13890 15689
11325 15689 16397 15217 20633 24455 22643 19950 20295 20295 20957 24601 31441 36324 39312 46049 54858 65139
11309 65139 77029 92535 102074 106936 104929 96114 86147 75020 65145 61661 50866 43050 40817
11296 40817 34763 29195 26483 25665 25220 27297 27372 26004 27629 28211 28004 30342 33474 33952 36420 34622
11280 34622 34726 36556 32322 30628 32574 38438 42336 47876 55699 61425 65444 72592 86288 100991
11266 100991 111557 113251 111618 102615 89420 73545 64635 58511 53164 50627 46662 40327 40266 39521
11252 39521 39653 38252 32595 33239 37652 36646 39673 41197 40226 38844 37997 38908 36361 35989 38239 43137
11236 43137 42588 39614 39991 42627 43774 42149 43464 47163 48040 49795 57356 57239 61504 63392 65565
11221 65565 75458 90582 113063 141795 170827 191365 202349 200354 189861 170707 147190 124003
11209 124003 104730 92860 76813 67722 64312 66176 63702 61801 61770 62884 59604 59151 65971 69039
11195 69039 71362 71650 75294 79926 84242 88018 91157 100003 109995 120766 135593 151632 176317 213978
11181 213978 274204 365610 510645 732357 1035505 1351501 1486497 1388156 1176927 932940
11171 932940 711182 543250 429798 351440 296988 265153 241392 235722 236946 246926 267439
11160 267439 298961 328589 341609 334360 319609 303546 301444 310781 333192 380266 454559 554373
11148 554373 695633 897318 1158969 1378682 1392421 1225988 989916 753327 562486 434265
11138 434265 351379 291819 241376 202757 175487 154686 137737 123947 112776 107635 101052 93851
11126 93851 89599 80434 78513 74440 71201 74539 73921 68023 64051 65892 69166 71298 70975 72965 76615
11111 76615 83182 93860 102684 111043 112671 104917 99533 89616 82475 81231 79733 85423 96532 109552
11097 109552 118701 125626 124040 117405 102995 85648 75289 72561 68266 61184 58886 57351 55490
11084 55490 52226 56870 60792 64107 68750 74159 87496 99728 98283 91149 82578 77310 72458 66331
11070 66331 61768 56779 52785 53624 54665 54817 53120 54153 56899 56644 52099 46988 43843 43769 44998 47916
11054 47916 51777 56389 62093 62008 61381 63760 70418 78500 86449 89516 86104 87326 87809 78797 68692
11039 68692 66744 64933 65268 67664 63248 60123 58385 59616 64484 64689 71093 79970 86853 102986 120473
11024 120473 136255 138769 135054 125553 122752 126564 133574 138823 147792 163472 190551 224451 253295
11011 253295 268439 272518 259625 234804 205872 177791 153411 132491 115282 107268 101809 97037
10999 97037 96049 97096 99730 105043 120447 135563 137395 134574 122205 107767 98928 93803 89724 86961
10985 86961 88857 89239 91298 94723 97609 103291 113233 128080 153161 177983 186854 180624 168812 154352
10971 154352 147275 146315 153288 170257 196086 220761 241193 251858 250748 235080 209799 185530
10959 185530 165852 149347 134509 122084 112474 104268 93968 92015 97142 100815 110224 122697 141392
10946 141392 162853 175162 170360 157368 138121 122741 109573 97848 90862 86645 82432 81515 84521
10933 84521 85206 87969 88423 90423 88134 86187 87649 89094 92200 102595 118452 139140 159544 172085
10919 172085 177569 175738 164681 159576 151620 138931 122325 115867 112869 107560 102140 95636 91233
10906 91233 89859 87392 84190 82174 85962 87755 82691 82193 82666 79177 74335 70160 63063 55819 49840
10891 49840 42654 34559 33927 38597 47443 58047 66091 70113 76764 85421 88863 87301 85708 94628
10877 94628 105037 121434 139912 154028 160226 157605 149188 135599 124659 110039 99330 95701
10865 95701 95468 90495 89568 89254 90281 90621 92458 87969 90717 91074 91086 89051 82313 80120 84486 82337
10849 82337 79007 83307 89846 95307 96694 97443 98083 96245 96308 96030 86193 77155 76565 78326 82359 82301
10833 82301 78712 77298 73782 64672 61416 65881 67548 68387 70960 76743 80620 80459 81170 82753 84322
10818 84322 89224 93966 97350 104532 115469 122525 130836 140391 146149 150640 155647 166897 185032 209745
10804 209745 243814 287243 350838 443565 585041 806067 1137855 1594789 2066868 2280059
10794 2280059 2130535 1790387 1394825 1037208 769022 583244 454466 359336 294450 249653
10784 249653 215390 188913 164854 148623 135399 127234 123809 121358 114477 107417 104050 102886 103996
10771 103996 101383 100389 102947 102275 100791 101586 103793 104680 100363 94416 93146 88548 83461 84028 84601 79843
10755 79843 78017 80424 83519 87619 91505 95224 94615 94107 95366 94139 88570 82137 79349 72611 68560
10740 68560 72447 72716 73901 79772 86188 94384 103849 108653 108389 107709 100885 93879 92587 97997 97032
10725 97032 98385 98370 101764 99700 97256 96758 92614 94887 95421 92543 91328 86707 81208 78309 78442 76177
10709 76177 76716 79150 77538 73034 68435 65607 66540 68527 70805 76412 79570 83788 89297 97642 104010
10694 104010 109584 111539 113968 117624 121832 124892 125551 131361 144789 174320 215590 247739 258676
10681 258676 253564 242494 232860 223665 216752 212255 208221 205592 208707 205105 201968 199923 195574 191365
10667 191365 191403 192666 191052 191460 192312 191757 187750 188808 191013 192781 198133 212666 229256 246910 276679
10652 276679 319804 381212 478296 632375 862656 1184745 1569499 1934125 2227895 2359160
10642 2359160 2289593 2065399 1729206 1378652 1085032 866976 729856 641244 576639 545579
10632 545579 545088 539333 525169 498894 460296 423283 374879 321384 289157 271436 254335 240784
10620 240784 234004 229513 232548 237804 241513 242419 240063 233412 225537 214477 198128 181613 167774
10607 167774 160835 159073 156689 163606 176834 188898 201603 214558 227191 242013 259166 268610
10595 268610 270330 264665 250957 239397 238634 246502 246649 233711 212880 183378 146890 119968 103366
10582 103366 99296 102595 102506 101886 101953 96096 98569 114970 143055 171116 197745 210303 226615 251999
10568 251999 276028 305471 334959 356366 368700 367725 362853 356905 348939 336191 318930 292949
10556 292949 271330 248774 229979 217194 211253 208331 203658 198522 196109 195679 193082 191708 191213 192613
10542 192613 203299 223132 239491 254608 268995 286453 307826 327903 347399 367128 409280
10531 409280 478549 587117 741391 932759 1171307 1416355 1625448 1815396 1905946 1871289
10521 1871289 1794099 1626004 1405593 1198407 1003274 842461 725495 650334 606084 583560
10511 583560 581732 592782 612151 644020 671715 685591 689934 681569 663773 635208 602010 562265
10499 562265 524105 498775 482890 464687 449915 440464 434674 429863 427461 427263 426612 417944 412903
10486 412903 417264 428582 438628 450977 464588 473252 475771 470950 465436 463604 466986 476107 485667
10473 485667 492383 500466 505397 510478 521506 541524 569224 596203 625805 654390 678318 699928
10461 699928 722897 752777 785304 816766 850655 884752 912406 933864 951005 970309 996994
10450 996994 1031373 1076228 1152610 1293787 1528513 1881635 2356628 2840407 3161490 3240104
10440 3240104 3021248 2640809 2251834 1916969 1659890 1480143 1360032 1296959 1274377 1288924
10430 1288924 1343390 1421325 1513499 1603095 1675137 1730267 1770988 1803284 1846958 1916472 2024746
10419 2024746 2171129 2361519 2589234 2831717 3062814 3243491 3362472 3447685 3512330 3567207
10409 3567207 3623489 3704917 3834603 4028000 4274100 4563817 4874734 5205267 5566255 5995573
10399 5995573 6542319 7281809 8282189 9477832 10599768 11443903 12194731 13083649 14249414
10390 14249414 15819422 17912570 20786100 24945538 30882913 38979903 50071646 66189578
10382 66189578 90716506 128085712 183146171 257930997 339170601 386085569 374191373
10375 374191373 327221417 265706341 202440851 149945354 112027462 85492458 66449681
10368 66449681 52605768 42596847 35284352 29786527 25575550 22313325 19812918 17963813
10360 17963813 16628691 15586730 14512595 13279365 12003289 10805624 9757249 8892053
10352 8892053 8233189 7771480 7398871 6983550 6536905 6085034 5644526 5213080 4783767
10343 4783767 4359025 3985468 3682515 3427447 3210803 3042550 2937287 2866559 2803620 2746627
10333 2746627 2679535 2572007 2432449 2287621 2155097 2039788 1944062 1868323 1821486 1807985
10323 1807985 1814112 1831565 1858891 1895366 1903195 1849382 1760212 1659806 1573515 1504064 1447668
10312 1447668 1401328 1368979 1342276 1310497 1273978 1226340 1165871 1107201 1045110 986635 934829
10301 934829 887203 850247 829526 811356 793628 774888 760181 748826 744926 750085 755167 757403
10289 757403 745672 731136 724800 732609 769438 831668 916124 979349 976660 924673 850420 773383
10277 773383 709641 661005 630304 610929 599096 599058 601249 606362 612172 615750 615971 611496 609362 605868
10263 605868 610761 617247 626941 639367 652965 673903 699615 728553 772158 824595 879852 939978
10251 939978 1005423 1081511 1157660 1240934 1369263 1583164 1893322 2258010 2520688 2517935 2301571
10240 2301571 1992683 1674916 1406477 1210376 1068863 967167 891252 834886 797397 771237
10230 771237 761210 761416 771346 781685 798983 813606 822962 830127 836204 836142 829990 825540 823610 829744
10216 829744 835400 837647 847728 859795 880470 903778 918078 927971 936124 942313 936661 941747 960583
10203 960583 997950 1058010 1138429 1252520 1416524 1662820 2024969 2481013 2813798 2758469
10193 2758469 2456993 2074512 1698160 1403584 1203538 1076415 997998 957616 946377 949932
10183 949932 953229 962636 975344 1007853 1058771 1107554 1144651 1186631 1223322 1263134 1311262 1368366
10171 1368366 1437930 1506738 1571414 1635414 1696178 1760598 1840848 1943845 2070505 2219385 2382654
10160 2382654 2549130 2708606 2856366 2982599 3104574 3242451 3401798 3620641 3914761
10151 3914761 4249914 4592969 5000384 5502413 6029027 6488633 6898192 7291780 7729283
10142 7729283 8106214 8413880 8807197 9282114 9905403 10820114 12087839 13795966 16126117
10133 16126117 19270370 23540126 29556948 38209626 51023989 69959213 95829021 127007537
10125 127007537 165047763 205927845 237595393 265726780 284933142 282426450 271850067
10118 271850067 251675756 217735159 182577362 148244561 115835986 89487457 69345323
10111 69345323 54570061 44023981 36565201 31327351 27463749 24523597 22360945 20554590
10103 20554590 18950012 17597855 16297287 14994009 13806197 12685524 11552215 10527308
10095 10527308 9585403 8677613 7865397 7144551 6499867 5937051 5441287 5003218 4610603
10086 4610603 4266826 3968172 3721249 3523176 3361761 3240857 3155547 3104531 3073545 3056508
10076 3056508 3045489 3011659 2940081 2859313 2760995 2633386 2514515 2407353 2292780 2197371
10066 2197371 2128137 2077969 2040880 2003133 1952370 1895967 1837198 1782874 1746530 1731696 1745747
10055 1745747 1807551 1925093 2115938 2408945 2880905 3647392 4849048 6551484 8459406
10046 8459406 9803896 9872384 8839394 7267455 5677080 4358731 3399117 2744552 2298130
10037 2298130 1980794 1754948 1600477 1483453 1392239 1321320 1258427 1210610 1162616 1112558
10027 1112558 1061187 1010035 964637 922996 886849 856537 829460 805753 786441 774097 761953
10016 761953 753036 753725 772017 809310 859835 923880 987503 1030647 1035953 993940 924050 850248
10004 850248 779052 720023 681495 655058 642007 642785 648723 659719 671232 673544 677044 679144 672257
9991 672257 662178 652874 638488 625229 621512 619225 631414 658205 703122 770678 870174 1001253
9979 1001253 1163035 1316841 1407133 1411538 1333312 1197872 1048111 912707 803231 722988
9969 722988 664141 615871 584884 563287 553930 549879 551420 560320 580490 613013 667172 751824
9957 751824 889946 1110117 1445631 1906819 2376978 2570069 2404185 2061080 1667212 1313222
9947 1313222 1045484 861825 731769 628004 544955 479078 421049 370231 327041 292044 264570
9936 264570 240149 217306 200366 185374 171449 162700 162682 170744 182835 195931 216426 235701 252139
9923 252139 267555 273795 282920 294123 300320 305608 311535 326275 333102 339239 344640 346337 339330 323009
9909 323009 303461 284315 266256 250294 231990 211860 192990 178055 169530 160460 155757 152475
9897 152475 154330 161780 167738 173863 180234 182104 184789 177625 171214 158275 145852 134265 125708 118053
9883 118053 115043 114321 117191 119594 128159 129774 132500 136889 145940 153162 158008 158209 162355 166724 169954
9868 169954 178085 188578 185966 183569 187565 183355 172716 169782 165916 152861 153239 158509 157693 161575
9854 161575 167079 171076 179609 188483 200697 214293 224148 229825 238046 244437 243984 240378 233302 224609
9840 224609 214481 204442 190268 171475 157052 147008 141123 134377 124041 119255 117996 118339 112150
9827 112150 107438 105461 100428 99333 98650 98238 97033 94551 93838 98064 105273 113369 119630 133282 142928
9812 142928 152654 163829 172288 178315 182054 185216 190530 194103 196314 203636 211280 218945 229337 245155
9798 245155 268067 299722 348552 418079 528264 687649 921701 1203064 1474237 1724344
9788 1724344 1862697 1827664 1696606 1465956 1190680 942410 739104 586497 484738 414456
9778 414456 363832 327440 305324 287148 270575 258235 247967 239964 229456 220006 215558 207391
9766 207391 200646 196116 187375 179291 172314 165032 154365 150083 145258 140160 136262 137576 137724 140505
9752 140505 140633 140046 139101 136903 134028 136172 137149 138045 140692 142877 136799 134781 134056 135358 137137 139321
9736 139321 140355 141005 148326 153156 151749 154078 159738 169574 175371 181930 189962 198398 216261 246309
9722 246309 292699 361844 464193 602140 773898 992626 1243027 1454614 1641535 1774895
9712 1774895 1770947 1705427 1570612 1352911 1129651 917911 723466 569336 457884 376655
9702 376655 323116 286540 255322 230109 210192 201725 192727 185259 181853 179423 173807 167431 164797
9689 164797 155303 150037 145014 137478 132240 129276 128218 124690 127251 125321 126489 125899 127844 133881 136284
9674 136284 134061 130731 131847 128346 126945 126429 121833 119071 117866 115500 118983 117853 111364 110640 107390
9659 107390 103675 102947 106540 107943 112890 109128 107037 102850 98906 97181 95468 96535 98767 98806 100595
9644 100595 100588 100630 99611 93886 89711 91015 91312 91579 94161 91555 93641 92290 95580 97819 99823 102185
9628 102185 105802 109525 114476 118274 127412 134457 138432 141556 144043 141592 137813 135096 127979 122356
9614 122356 119735 113702 112735 115379 115466 114037 113677 110780 110452 116266 118356 119457 120621 115747 113023 109949
9598 109949 113200 118576 121388 120902 118139 114381 112853 115545 118732 115602 118027 124716 128775 129739 130374
9583 130374 130827 129526 129424 127042 122090 122986 122861 122921 120956 119353 117103 120815 127984 129465 126512 124177
9567 124177 127269 129545 136971 148925 158494 162556 167600 170741 176485 177689 176529 170853 167304 161488
9553 161488 158142 157391 157090 157365 156782 154374 155115 156439 155213 153735 153171 150692 150623 151677 149711 148334
9537 148334 149076 152259 160527 169090 177167 184004 196768 215712 240401 263217 272573 278596 283002 286639
9523 286639 293040 315492 345065 393437 475850 602780 741098 795397 775382 732103 680521
9512 680521 629345 573075 515315 458659 412061 377710 365898 370543 390471 437174 497733 559357
9500 559357 620591 688014 765674 819389 833452 825401 806757 789009 762958 732508 701357 676474
9488 676474 661923 656815 649723 633684 609074 596616 607150 647551 726934 846347 1024827 1279691
9476 1279691 1612736 1967717 2122017 2000065 1754851 1465840 1198849 993021 840099 733695
9466 733695 671209 639715 637665 656799 668859 668076 662227 669535 692787 723730 756724 788126 818568
9453 818568 843848 863873 856407 817153 759744 698382 627286 551002 487202 438749 401802 384239
9441 384239 387788 409328 444783 491255 543968 590665 644136 710158 794430 836981 775122 680465
9429 680465 587893 508702 448683 407164 378744 357086 346445 340200 335844 325867 305565 286599
9417 286599 266733 249964 240029 235890 236346 237684 240671 247331 253945 250877 244774 235170 228262 220241
9403 220241 217615 217695 217001 216038 217486 219691 222076 228195 235572 237417 240436 246479 253133 262344 268700
9388 268700 273919 275115 272255 269041 266484 263805 264268 267382 265593 266207 270359 282407 294990 304936
9374 304936 312534 321678 326651 335394 337285 329882 315591 301984 291101 283092 280078 279029 281578 282211
9360 282211 281217 282673 278735 275452 277467 279720 279597 283863 282382 281639 283684 285630 286811 291804 299459
9345 299459 305417 316621 327800 339598 352770 365277 379819 399320 421090 445578 465414 469209
9333 469209 468106 470464 467864 455310 435430 410083 391722 376230 363474 356954 353653 352310 352770
9320 352770 350224 351542 352610 352209 352048 350909 352286 357571 354807 354086 356156 357642 364988 373281 385949
9305 385949 402412 418207 428263 437438 453603 469925 483299 491159 493209 492999 486246 482023 479616
9292 479616 483256 484914 487811 500685 516098 523312 526640 525202 521101 514333 509404 502399 493408 490091
9278 490091 481695 478808 483748 491518 499219 504574 507873 511551 518407 519311 523272 530724 538594 554112
9264 554112 570174 582862 586330 582752 578945 578841 580886 581604 588557 602116 614995 622047 625584 626537
9250 626537 632169 636651 636278 638731 650975 662443 669742 671929 676406 680502 684206 697448 715508 733284
9236 733284 746605 760117 775897 796249 816224 830943 838575 847485 857105 866175 872066 875953 882289
9223 882289 890349 902185 913594 928380 940635 958078 978501 1000356 1020284 1046752 1071907 1098879
9211 1098879 1126009 1156778 1189095 1213633 1235919 1252184 1260663 1267586 1274530 1298118 1331519 1371394
9199 1371394 1423250 1500833 1599933 1723650 1869962 2036644 2212228 2355699 2401903 2358350
9189 2358350 2266829 2151299 2050522 1976934 1933691 1914172 1920004 1957771 2024218 2122051 2249515
9178 2249515 2393793 2532080 2657648 2750935 2801916 2820248 2826317 2819363 2803329 2779433 2757567
9167 2757567 2754490 2772937 2808574 2856777 2917359 3003428 3133048 3326560 3605572 3975660 4411379
9156 4411379 4832466 5101755 5124596 4946717 4666239 4375192 4136249 3980058 3904102 3892345
9146 3892345 3918991 3973578 4039153 4124783 4230905 4362615 4510198 4655768 4807694 4978833
9136 4978833 5155558 5311599 5429842 5509102 5552817 5586534 5625841 5689871 5785945 5917593 6080563
9125 6080563 6277790 6507539 6784880 7104132 7469203 7861667 8241191 8542688 8767277 8955601
9115 8955601 9135393 9331907 9554581 9814924 10118173 10450277 10813707 11199024 11614137 12047649
9105 12047649 12497527 12970053 13458660 13958765 14473492 15000252 15529513 16064691 16607946
9096 16607946 17148785 17684255 18211083 18720222 19205526 19665336 20088664 20475399 20818027
9087 20818027 21107854 21342707 21522170 21640143 21695923 21685048 21614514 21482976 21287372 21030323
9077 21030323 20717213 20355014 19947366 19510661 19044899 18556689 18050155 17529796 17002781
9068 17002781 16471635 15937576 15404969 14875436 14353126 13842033 13345058 12864470 12397890
9059 12397890 11945208 11507525 11085474 10680162 10285970 9910654 9545422 9195646 8861233
9050 8861233 8536359 8227372 7934926 7655537 7388157 7136387 6897746 6665059 6441748 6228793
9040 6228793 6024080 5824698 5632429 5452186 5276669 5107303 4945772 4790548 4645262 4505060
9030 4505060 4374114 4249397 4123485 4002472 3889428 3780837 3675410 3575870 3480170 3387973
9020 3387973 3300750 3216181 3130561 3045983 2969571 2897001 2822404 2754610 2694972 2632095 2569201
9009 2569201 2510674 2454661 2395267 2334869 2281850 2232739 2187315 2145591 2098426 2053657 2015145
8998 2015145 1976220 1935723 1898611 1861867 1827374 1786648 1748137 1710589 1670191 1634191 1602700
8987 1602700 1570809 1541536 1514856 1489018 1460995 1431196 1407959 1387673 1369022 1349990 1330951
8976 1330951 1312876 1296864 1275292 1251030 1229819 1208664 1187838 1169830 1152395 1136442 1118564
8965 1118564 1100733 1080959 1060760 1046335 1034182 1019433 1002357 985756 973045 961045 950876
8954 950876 942806 934561 923621 914986 903117 889709 876573 860004 848877 832325 821794 808209
8942 808209 791891 781913 776591 770065 762122 751862 744159 735691 725456 715954 706921 696919 689055
8929 689055 684381 675636 672259 669021 661967 655243 647601 638165 628491 615863 604100 597043 597126 593221
8915 593221 588741 583933 573718 563644 556812 551984 542366 531751 525190 521271 512903 506948 502757 500950
8901 500950 501237 496517 489921 485178 482050 477807 471964 467031 457591 452440 447426 448462 450729 447684 444609
8886 444609 445950 447179 444140 436435 428455 422186 416374 413812 414321 410534 403036 396686 394317 389409 389318
8871 389318 389828 386190 384128 383689 384396 384616 384827 386202 387149 386136 384182 384667 380857 384046 386672 387087
8855 387087 390539 395480 400542 404668 405883 406663 404568 404035 406792 410618 412302 412975 420087 426855 433789
8840 433789 441475 452554 465131 482964 508687 546324 589560 637218 691086 757551 842412 946931
8828 946931 1057828 1154017 1241165 1350962 1513269 1758719 2150765 2788123 3810911 5381313
8818 5381313 7630667 10257087 11808712 11265444 9610527 7576563 5663167 4205913
8810 4205913 3207223 2528083 2047596 1707444 1479882 1322488 1204226 1103560 1008984 922370
8800 922370 848533 783136 722208 662738 615847 575514 539195 509889 480383 453776 429322 407647
8788 407647 389042 376423 364061 344592 330825 315287 297590 287815 278851 271532 268284 267896 268177
8775 268177 266797 264121 264304 264882 261492 254297 251498 253122 254564 250169 243828 241472 240895 239974 239894 238620
8759 238620 238311 238545 235033 235114 233602 234802 235295 232191 229288 226400 223448 218492 217214 218756 218880 211353
8743 211353 207594 210384 209775 210502 210956 210552 207287 200575 194808 193793 192032 188511 185961 184162 183065
8728 183065 187738 193786 196152 199552 199400 195406 191303 188300 182147 173770 169950 168840 167359 169250 168860
8713 168860 167158 164776 166178 169535 174178 176483 176106 169094 166831 164651 162940 164272 169830 168707 165599
8698 165599 165647 162980 165300 161419 164056 164749 162831 161206 158697 160717 160937 157348 155821 158629 164044
8683 164044 169808 170904 171060 170195 167534 162117 159725 156244 152280 151239 147942 152248 157768 162614 161715
8668 161715 162531 165495 163793 161646 154892 151403 150145 147798 141064 133214 130618 132226 136963 138401 142097
8653 142097 142909 143606 151375 160161 158091 155403 152980 141432 130230 127193 123618 124574 127520 130441 128211
8638 128211 126461 127209 123638 127175 134419 142085 142914 137830 130403 129742 131021 131339 129544 134318 137872
8623 137872 142353 144995 145318 145980 144751 146209 147008 149727 151118 150694 152081 152012 152223 151584 155371 156414
8607 156414 159579 158706 152963 150954 148188 145210 143782 144125 143442 142543 138589 140462 148027 152167 156650
8592 156650 156917 157807 165185 176007 180615 184274 182837 178558 171903 165356 168126 170837 170146 169003 173733
8577 173733 177103 178748 182355 186946 190287 194829 197984 200187 198265 196747 202179 205519 209653 215740
8563 215740 225371 232648 242254 254455 261125 274065 289456 300114 308858 324729 347618 371121 396847
8550 396847 425102 455161 490410 526431 563482 598017 627941 643882 646005 632463 610135 581858
8538 581858 544839 508724 469343 426806 387480 353857 321745 291774 269503 250651 231284 219419
8526 219419 207138 193712 183343 174654 168016 157733 153381 150954 145941 147410 140201 136867 135717
8513 135717 130634 129472 130372 125935 120912 118806 118111 121404 124814 126778 126754 126410 125600 123812 120949 120728
8497 120728 121381 124867 126251 127928 132545 140721 149695 154752 151260 146307 136978 130646 128341 127777 127525
8482 127525 127581 129634 136457 139285 141638 148421 163744 184138 212092 258886 323693 392661 435981
8469 435981 433488 390625 330820 275204 227095 192603 167631 153582 149333 144276 136895 131220 130205
8456 130205 137834 145795 149290 150015 151710 150614 145243 141986 139793 135861 134259 133131 127647 124222 123171
8441 123171 122320 123256 123337 131912 137932 146145 147476 144988 145569 150120 154398 158265 161669 173282 194229
8426 194229 232726 304866 415218 517221 535820 485926 408571 332418 271671 228929 203304
8415 203304 181264 167453 156643 149737 143319 137887 136324 138882 140285 136359 129316 121245 111996 107758
8401 107758 111082 120958 126974 133174 144775 150384 150304 154718 156743 154430 148108 136339 119241 106999
8387 106999 97315 87752 83127 77178 73274 77552 87237 96926 112803 137895 175152 226293 259632
8374 259632 259573 233295 200579 165454 141319 130938 125456 116734 105164 97879 88685 80269 76720
8361 76720 75114 67951 67999 65650 65444 64660 62015 60613 62113 62393 61738 65201 67284 64929 60379 56022
8345 56022 52633 52308 56001 61921 64443 61482 58204 59295 57050 54071 52021 48730 47081 43386 43612
8330 43612 44106 49483 53153 53904 53924 53337 56936 62148 62030 60436 61692 62787 61767 56264 52657 55232
8314 55232 56932 61746 59283 55902 52640 50781 51196 49708 49496 49022 46369 50324 54173 52813 53120 55451
8298 55451 54108 51208 50485 46782 40665 43638 48488 50502 52063 50205 47300 44844 47580 52345 57787
8283 57787 51732 52623 54256 50613 47413 51105 52554 50589 51038 50512 45464 43201 42626 45948 48241 48383
8267 48383 45460 44052 43169 41352 41677 44850 46346 47471 47838 44462 45517 44367 43054 42361 43110 47121
8251 47121 49824 47397 48280 48268 46094 47975 48831 48314 49305 48306 50091 48552 45620 44009 46146 46756 46345
8234 46345 48162 49529 50075 53232 51362 49772 52222 55162 53791 56012 59893 59726 62019 60362 58142
8219 58142 60627 57297 52113 47060 44460 45068 46164 44888 43765 44951 47298 47780 46279 44836 46839
8204 46839 49383 49520 53633 57327 58357 61367 60658 59744 56967 58999 59500 57528 56510 57335 57920 53885
8188 53885 50077 49980 53049 52515 50985 56044 56772 61989 62441 61860 64297 68082 65206 65801 63489 60171
8172 60171 55133 53124 49503 49308 47692 49728 46022 43469 43692 44998 47876 51406 50102 49678 50917
8157 50917 54072 54235 54556 57002 58600 63527 66842 67691 65951 63652 62910 60745 60526 63484 61058 57143
8141 57143 58592 57743 54506 56691 56125 56285 55296 52569 50776 50349 46917 47344 48281 49852 47998 43427
8125 43427 41631 41196 43560 47393 53943 52567 50679 50018 50461 47181 46902 45645 41366 39658 42672 46153
8109 46153 49828 49270 47786 48153 49969 57163 62426 70396 79398 82592 83375 84195 83830 83262 81201 79486
8093 79486 77989 76982 81760 88873 97762 108237 114460 112693 104192 94799 86501 75397 68547 66920
8079 66920 62644 56277 52916 54703 60671 64836 64993 67571 69394 69750 71339 73316 78523 86236 98485
8064 98485 107399 116445 122632 123378 123998 131179 139097 146958 150924 156568 159674 155093 146931 133411 121010
8049 121010 110774 102357 93083 86178 79770 76766 76266 73069 67725 63863 62382 67105 68678 65287
8035 65287 63522 63766 67001 65045 62106 62414 61988 62102 64124 71644 70749 66886 70685 78846 90424 98064
8019 98064 111638 135055 162716 176938 177870 181041 185814 191074 206326 222343 235417 243819 240776
8006 240776 228644 210477 190760 171346 153782 136891 127724 122457 116856 115842 112896 109144 109363
7993 109363 105239 103562 105779 106782 105667 101223 98796 98828 101728 100439 101810 98259 95545 95810 94120
7978 94120 97298 97813 93532 95699 104189 108556 118339 125833 131467 139192 145508 152201 158879 170150 193776
7963 193776 219436 236215 242440 234891 215121 194268 177116 164321 152365 142837 141406 141473 141130
7950 141130 140696 144807 153367 159622 161685 159311 150793 143565 135895 126896 118842 109579 104107 99533 97658
7935 97658 93463 86179 83071 78992 72875 70262 70897 72880 78213 79317 82568 84746 84328 87663 95292
7920 95292 104420 112797 119975 132024 143307 152866 156203 152656 150577 150511 147112 143973 144341 145417 149394
7905 149394 153705 150714 148031 150622 148066 140675 131809 124768 120639 120258 115609 110854 103878 98421 99458
7890 99458 99576 97019 93647 89976 89176 91523 96237 95906 94254 89356 88544 95387 98955 103500 101742 100758
7874 100758 100058 103040 104339 105632 107122 107284 109064 109675 107859 105608 105141 103007 100631 101052 100520 96521
7858 96521 91676 90966 86947 83423 82161 80847 80776 80148 77405 79926 83733 82305 78461 74887 72941 68767
7842 68767 67380 66741 65329 61412 61387 63401 61376 57993 56135 56908 57474 54487 49342 48670 48766 47498 47228
7825 47228 48035 46424 46686 45713 43651 40124 39454 39213 37702 40094 40396 36880 38560 40785 43230 45129
7809 45129 41400 38914 38976 39139 36319 33359 29153 26094 23506 22227 26049 33105 27432 25117 20661
7794 20661 21597 21047 20208 24533 24727 27450 24157 20233 16490 19476 19895 17103 16681 17929 14291 12288
7778 12288 12324 16013 16867 16175 17516 15717 16294 16293 9975 8766 13066 13966 16642 15617 14716 10955 6949
7761 6949 7650 5498 5727 7011 7330 9904 14128 17535 21045 18663 16418 17459 17186 15144 11369 11934
7745 11934 10101 8772 13784 19065 21167 18405 13195 12993 15368 15794 15204 13645 11810 12917 15295
7730 15295 18685 20172 20134 17837 13147 9945 9067 10501 10173 11185 11720 13990 11051 7326 6830 11585
7714 11585 12607 12102 13812 10973 10691 13445 9655 7505 9230 9726 9981 6667 1190 773 3944 6582
7698 6582 7118 5877 5473 7665 8115 9236 10484 10552 10767 11175 9554 9170 7130 8545 10771 12027 14479
7681 14479 14100 13231 11182 14778 15828 14747 17650 18009 16142 11607 9446 9004 7417 7081 8410 9533
7665 9533 8135 5359 6331 3988 3980 2350 5371 7095 9640 10432 6295 1399 1452 1470 6727 10524 10961
7648 10961 4673 6002 5133 3432 4677 6682 9742 5241 1450 6118 10856 13855 16669 14790 10239
7633 10239 9628 10905 7242 2332 2763 6431 10854 9684 4681 2404 6474 8153 9204 10857 13753
7618 13753 16764 14751 11147 10326 7641 3468 586 -215 1303 2092 3827 4630 5282 7123 3825 3586
7602 3586 5703 8957 12738 12434 11279 9257 6668 1941 -1821 -3858 -4364 -4598 -65 2574 4977 5073
7586 5073 2817 1254 4249 5759 7799 7811 9478 8046 6238 5569 4384 183 -3272 -4753 -5741 -7330
7570 -7330 -6057 -4926 -5541 -3557 1346 -111 -3447 -2102 -611 -1286 -296 30 -4141 -4804 809 3634
7554 3634 692 -873 2484 3938 3843 2820 -3132 -2962 -905 779 2596 1583 2453 4482 4855 1217
7538 1217 -316 2951 3229 433 -2989 -1214 5121 6195 4091 1813 -115 786 4521 7419 6073
7523 6073 4616 1987 44 1772 422 2069 1440 852 2675 5399 447 -3634 -2871 -1194 -262 -1760
7507 -1760 -4767 -91 4351 3304 643 903 544 5732 5782 5998 6506 3385 4806 2205 1876 5358 2994
7490 2994 4504 2472 -1377 -801 1145 -2261 -1770 258 -276 1127 5372 5712 7742 4934 1897 2399
7474 2399 3497 4515 7363 9468 11137 7707 5276 2737 3596 4354 5689 5410 1832 446 -761 1095
7458 1095 -3015 -5108 63 1153 -1332 -2436 -756 -2986 -5566 -4554 5579 9359 12265 8557 9804
7443 9804 11630 8543 8974 10446 7144 588 -2742 538 -1573 2207 4783 1102 1513 -709 -2516
7428 -2516 1094 -114 -1785 749 4687 1372 -1048 -751 -867 -6259 -1922 1222 -1055 -4699 -4394 297
7412 297 1081 3896 4938 2053 1393 2590 1464 396 3660 6103 6495 8050 8191 7264 7572 7194 3816
7395 3816 779 729 -585 4027 1671 -174 185 3230 5907 7521 7031 2363 2873 2296 3285 3173 234
7378 234 -61 -302 2674 3667 1547 395 -4 2530 2894 3811 4457 2443 337 2091 5942 6206 6038
7361 6038 1558 744 2217 3942 4142 6105 7803 3027 6066 8378 2301 -2127 359 -1647 -1036 -962
7345 -962 2970 2749 2599 -1259 -5085 -9634 -8718 -7074 -4835 -2269 -227 1352 2099 5401 5469 7544 8502
7328 8502 6200 4236 1449 291 1349 348 -1859 776 2137 1459 1028 409 1375 280 -2549 376
7312 376 1085 1766 -2954 -5697 -1747 872 3870 4540 4731 3778 -938 -4422 -3327 -2304 -857 265
7296 265 -2948 -2994 1643 2578 5037 4799 1532 122 -1241 2417 778 2143 3480 3198 514 -807
7280 -807 622 1362 556 -3118 -642 1539 -2495 -4471 -403 1212 3079 2852 -300 -4048 -5660 -5440
7264 -5440 -6034 -4904 -2193 -1159 -3647 -4020 -3304 1762 -757 -1650 -403 354 3644 5957 869 -1235
7248 -1235 -1784 -4022 -2022 2223 3544 3532 2867 -3942 -2096 2769 3443 2204 4993 11359 9035 5674
7232 5674 1885 1235 -3601 -4201 -2132 1250 3426 4993 5817 3720 2021 4065 5518 5735 6304 4895
7216 4895 3459 6341 6310 4661 5761 5635 3464 -304 -576 -773 -1212 -5431 -4420 -3724 -7627 -8442 -7538
7199 -7538 -1198 3008 149 -5773 -5693 -2653 -1470 763 3531 1192 -1496 -2733 -2328 -468 -1197 -3657
7183 -3657 -3718 -3302 -532 4047 5298 3978 520 -1905 3202 3331 379 -2151 -3788 -2743 -1192 -244
7167 -244 6781 7929 11043 11828 8229 6431 7400 4349 -163 -227 -672 -748 2649 3421 2312 -2109 -4657
7150 -4657 -2268 -837 -1318 1535 5877 2688 -721 1305 4160 2710 595 2316 4884 4090 2155
7135 2155 1360 698 -865 -3504 -3484 -1470 1112 1132 203 -1944 -3300 -3321 -668 -1908 270 -735 -2945
7118 -2945 -3640 66 731 -687 3774 4070 4291 7201 7808 5269 4341 8531 6402 598 -1583 -1232 -1818
7101 -1818 -1869 -2927 -1788 -1147 2184 3168 6161 6552 7019 8676 8063 1017 -1870 -2185 -3472 718 2327
7084 2327 -1878 -2744 -851 -558 1380 2163 6067 770 -29 4245 6348 6541 4254 3060 932 887 4094
7067 4094 4319 -2879 -4640 -6176 -6289 -3429 -682 -3462 -3336 -103 3079 2518 1951 2174 1274 -1954 -5688
7050 -5688 -3244 694 1947 1832 -1140 -4459 -4630 -496 378 -1114 -3423 -2163 -2907 -4043 -1365 -1747
7034 -1747 -4755 -3646 -3331 -3229 -2074 372 1102 -2866 -4539 -7890 -8799 -7087 -7457 -6829 -4361 -5731
7018 -5731 -3939 1521 3041 2851 1207 -1639 -2450 -411 -879 -2241 -4501 -3616 -3354 -7347 -10320 -10535
7002 -10535 -7238 -4575 -2168 413 2221 2784 3937 4723 5529 3714 1182 -387 211 -964 196 -1310
6986 -1310 -5405 -4909 -2458 -1530 -2020 -2275 -6683 -7921 -5079 -4699 -4513 1712 4513 1369 -1138 -4812
6970 -4812 -4477 -2295 -1125 -97 1306 157 152 657 -2573 -5147 -5007 -7170 -8207 -8640 -9440 -6432 2660
6953 2660 5380 5153 5832 2666 -713 -3925 -4891 -4068 -2545 2963 3644 3130 2660 6290 8351 4165 -796
6936 -796 -4690 -1480 503 -2950 -4012 -2299 -5121 -2236 1080 3119 4911 4642 9312 9482 7030 7052
6920 7052 8614 3762 -6342 -9470 -6700 -4839 -2441 -3998 -5430 -7354 -8997 -6970 -4305 -4857 -8917
6905 -8917 -11671 -9142 -8953 -6992 -4105 -3924 -6756 -7157 -6877 -2652 -1700 -1860 544 1769 1184 -8 1609
6888 1609 2847 5682 5425 3938 1204 1677 -345 -3547 -5758 -3529 -1555 -2775 -2239 -5469 -6698 -6964
6872 -6964 -3175 -3349 -3770 -569 -863 -2369 -5582 -6110 -6077 -3479 738 4953 4219 4675 3841 34 -3208
6855 -3208 14 1664 -1313 -3124 -4066 -2156 162 850 1117 1516 1433 3040 1993 3138 4040 4059 2177
6838 2177 -256 -316 -2901 -1950 -802 -1568 -2678 -2101 1332 4367 2607 -2096 1261 5091 6228 4510
6822 4510 3591 3060 2122 1428 961 2512 3078 -165 2410 4785 4343 1240 -286 -1378 -3938 -9228 -10338
6805 -10338 -6965 -2555 -1963 -2266 -1378 -2000 -1539 -2535 -1464 647 4569 2802 -915 501 1196 -4782
6789 -4782 -374 1782 -3435 -7298 -6187 -3904 -2018 -3081 -4079 -4161 -2468 789 -1655 2962 2598 -309
6773 -309 -669 811 -787 1284 447 -4824 -7502 -10192 -11873 -9406 -5143 -5372 -1275 1361 -564 -1176
6757 -1176 -1642 -671 -1547 -2400 3859 5106 -472 -1066 274 -1578 -1936 493 -257 -4420 -6363 -8070 -10267
6740 -10267 -6674 947 1282 817 2196 5321 8344 6705 7065 9691 8811 696 465 1882 676 -886
6724 -886 -73 2068 6559 14012 20212 25342 30900 43402 46801 41873 36391 27579 20345 21608 18767
6709 18767 16355 16050 16726 14159 13445 13605 11427 9066 10396 13587 18644 20022 20137 18718 16294 14883
6693 14883 17611 17045 15476 14516 15700 19305 20513 22896 25146 33642 42554 54187 67841 86314
6679 86314 111217 136362 151880 148579 128036 99430 76321 55616 35400 23624 11624 1850
6667 1850 -3191 -7199 -7498 -1572 3942 3625 6867 6725 8234 8760 12568 10538 6734 8948 10968 14600
6651 14600 14211 8859 4699 2737 3710 7172 2634 -239 -2544 -1744 -2642 850 3151 4207 3534 2005
6635 2005 1107 -1676 228 -145 -2211 -6899 -8695 -3676 -2633 -1160 955 1395 1658 822 -2968 -8851
6619 -8851 -9000 -4799 -6977 -7559 -3486 -2426 -3390 -1993 -1644 -452 1032 3127 -1733 -6369 -5901 -5308
6603 -5308 -4134 -4274 -4775 -2476 -4220 -3593 -823 -1254 -2185 -3430 -6381 -8222 -8751 -6022 -3186 -5683
6587 -5683 -7339 -9589 -12844 -9400 -1433 6279 4505 1890 3231 3568 2075 -1347 -3267 -3946 -3107 -2064
6571 -2064 150 672 2662 3673 2879 950 -965 -1049 1103 -1054 -1108 1491 1674 -459 -2520 -735 -279
6554 -279 165 1224 1340 -1337 -3804 -6164 -4349 -2656 -2393 -1393 -2346 -4477 -6017 -2711 1542 -1191
6538 -1191 -6181 -6605 -4429 -7309 -7711 -4914 -5892 -3409 -1191 -3622 -3167 823 133 -1496 -1849 -2300 -3565
6521 -3565 -4142 -3587 -1657 -3166 -5932 -8083 -4888 478 3041 2606 -4264 -6284 -2457 1725 2159 79
6505 79 782 -1197 -1398 -2691 -7072 -11224 -13077 -14826 -15530 -13007 -7267 -5560 -6899 -5390 -6278 -8523
6489 -8523 -7819 -4486 -3634 -4712 -5429 -6925 -4189 5239 6086 5268 5519 3985 1317 452 -163 -788 2877
6472 2877 6292 5798 3122 121 -1146 -954 2179 3124 2466 3172 139 -1505 -1080 -2861 -4252 -4105 -4087
6455 -4087 -1159 -2507 -4194 -2705 -571 824 -1139 -1429 21 -1045 125 -1762 -610 -768 744
6440 744 -950 -3006 -3873 -1812 2369 -110 -2756 -1308 -19 2295 -1161 -6827 -5194 190 30 896
6424 896 -1622 -3017 -1329 -2685 -4672 -6453 -7606 -10244 -14456 -11857 -8150 -7324 -6233 -3372 -5142
6409 -5142 -5992 -6032 -4363 -3785 -4628 -5772 -7783 -5952 -4821 -6639 -6698 -5432 -7019 -4821 -5072 -5475 1070
6392 1070 3717 4474 1013 255 -1206 -1421 -3330 -4849 -3419 -2306 -2903 -2758 -4661 -6258 -6558 -7567
6376 -7567 -7535 -3579 -4190 -4688 -3728 -6883 -8362 -6197 -3947 -3617 -4513 -1670 -3176 -1377 -1947 359 -289
6359 -289 -692 0 1493 2182 6793 10007 6930 3551 836 5618 4333 -1108 -3932 -2126 3689 3119
6343 3119 909 1389 3113 3802 -838 289 -1079 -2271 -4394 -3457 -2073 -479 2116 2769 -1149 -5385
6327 -5385 -6863 -9711 -9380 -6267 -2136 -340 -3559 -7954 -9817 -9740 -9381 -6056 -748 -1889 -2058 -3755
6311 -3755 -3352 -1678 -454 -3804 -7385 -6207 -4675 -4399 -4518 -2718 952 1397 -2713 -2507 -2446 -3169 300
6294 300 183 -43 1049 -694 -4376 -6557 -5283 -3746 -6856 -5397 -3147 -1162 -1665 -1549 -6811 -9863
6278 -9863 -6217 -3299 -3422 -4268 -9658 -10845 -6259 -6916 -4294 -1296 -1097 -2726 -2815 -2619 -3510 -2102 -753
6261 -753 1050 2946 3033 5095 4456 4807 5478 3012 6618 5159 -25 -793 288 -131 -2342 -4426 -4025
6244 -4025 -1271 -2481 -6043 -6782 -5668 -4335 -1383 -222 -2277 -375 1331 -961 -2512 -5462 -8936
6229 -8936 -10565 -3744 -1360 -2291 -5453 -8526 -7808 -3720 259 -2130 -4811 -6874 -7783 -6900 -5785 -8541
6213 -8541 -9762 -11194 -10424 -9713 -10348 -8695 -7739 -7455 -9195 -9993 -7248 -4153 -1016 2723 -191 -224 1323
6196 1323 3179 2654 1378 -3395 -3317 -5936 -5321 -3851 -3252 -2701 -2199 -4437 -4488 -5473 -7996 -6410 -2724
6179 -2724 -3147 -6131 -6444 -1460 -1906 -3146 -2740 -1457 -1905 -8794 -12366 -13112 -9399 -10061 -9665 -7653 -3714
6162 -3714 261 4029 4554 6199 5508 5135 3713 1942 4436 1715 3602 3962 4535 3939 3253 -1418 -4891
6145 -4891 767 5751 3311 1786 -52 -3190 -6880 -7523 -5544 -2772 -678 -2042 -6370 -3739 1846
6130 1846 6275 5055 3101 -389 -915 -3304 -1221 1211 -528 -2522 -1711 24 1012 -717 -5922 -4453
6114 -4453 -2858 -671 1076 -2731 -8879 -5801 -851 -1061 531 -379 -202 2209 2365 992 757 -1082
6098 -1082 -3072 -5253 -3024 -669 -3026 -4518 -5398 -5295 -5141 -4957 -1675 1351 -1322 -4685 -4605 -4300 -1603
6081 -1603 1659 -39 -382 755 -4270 -4633 -5905 -9499 -10279 -10124 -6505 -2631 -1748 -8162 -9398 -6019
6065 -6019 -4745 -5104 -3781 -8135 -10318 -8481 -8731 -8606 -514 3286 1565 1902 3371 -702 -2696 -2385
6049 -2385 -1804 112 -1781 -6177 -3811 -2453 -2978 -750 -2107 -6734 -7301 -3448 -3694 -1140 -745 1626
6033 1626 1589 -227 -120 604 295 1138 116 -2318 -6340 -7526 -5001 -7003 -5488 -2785 -2788 -2121 -2221 1577
6015 1577 3804 2611 -1056 -3306 -4830 -4240 -8931 -9574 -3603 -987 187 94 -1412 -2790 -1972 -2301
5999 -2301 -1935 -706 -2715 -3086 -3551 -2208 3260 1035 557 1411 -171 -1652 -1545 -1374 -1035 -3477 -4974
5982 -4974 -7997 -9255 -6575 -3429 -4652 -3373 -74 2544 2322 -305 -471 -3149 -5064 -3171 -4808
5967 -4808 -6540 -3696 1234 -3236 -7543 -8254 -8236 -6431 -3564 -494 2325 2091 5139 4075 1369 697
5951 697 -2499 168 1305 -1914 -3308 -6124 -4641 -2542 -3291 -3908 -3768 4503 5493 3143 605 -1088
5935 -1088 -2023 -3139 -3735 -4600 -5411 -9322 -6520 -7683 -6563 -2938 -1948 -2417 -4744 -6012 -4789 -5016 -2334
5918 -2334 608 2374 983 1305 160 -1283 -3921 -4026 -650 100 660 174 -262 1769 753 -1543
5902 -1543 -1315 343 -1317 -4096 -2489 1142 1095 1610 722 1411 729 -574 -2050 -178 -90 3318 5174
5885 5174 1897 -1143 -3059 -3555 -1430 -4287 -8223 -5561 -3231 -4868 -5996 -1583 -1160 -1395 -4394 -6378
5869 -6378 -3432 -2945 -20 2031 -1394 -2322 -1630 -713 633 1128 -1193 117 911 -1389 -2219 -3986 -1404
5852 -1404 1268 1592 -2928 -4839 -6846 -7483 -10322 -11662 -13504 -11187 -8869 -5334 -5167 -2412 1055 1282
5836 1282 2104 -302 -3138 -5197 -3579 -6043 -4184 -2575 -1320 327 -345 -890 -564 -2361 -4677 -4580
5820 -4580 -5052 -1789 3200 -1619 -1863 -2907 -295 -3254 -914 3366 4112 1053 -3773 -8561 -7520 -4959
5804 -4959 -2169 1338 3329 2590 -251 -1556 819 1037 -1278 -2559 -3639 -4075 -1709 2522 1357 -1269
5788 -1269 -1854 -3214 -4946 -5567 -7782 -13362 -12856 -6746 -2348 720 1787 131 -3835 -4709 -3910 110
5772 110 -846 -1817 -3523 -1631 425 383 -1168 -2363 836 1133 -648 2458 3264 -1979 -1626 -2860 -4782
5755 -4782 -8332 -7720 -3348 2374 5335 5026 5374 2740 1631 2126 1484 -2138 -3317 -5790 -5348 -1578
5739 -1578 1440 912 -1046 -4626 -7465 -6806 -2758 -296 243 -470 -1093 -4006 -2706 -1063 -741 1137
5723 1137 2395 -2855 -5930 -5452 -3008 -196 -425 -2822 -3580 -1317 -2708 -4688 -8667 -9526 -7781 -5264
5707 -5264 -1994 -5920 -7880 -5560 -1855 -1525 -1765 -886 2356 5224 -156 690 56 -2836 -1133 3669
5691 3669 2024 1851 3075 4534 4331 1072 1498 2146 -1463 -1697 -78 -4638 -7750 -6384 -4057 -3654
5675 -3654 -4824 -1743 -924 -3164 -2564 -2305 -2673 -3517 -6709 -6017 -2546 -238 -903 358 1543 -2231 -1838
5658 -1838 -601 1056 -3197 -1499 913 -1241 -2470 305 370 -2048 -1229 536 2534 783 -279 1098
5642 1098 959 2382 3275 -758 -5294 -5034 -4749 -2867 -3479 -4025 -7055 -5892 -6141 -5873 -213 1557 -1001
5625 -1001 -2150 210 -1121 -2751 -413 3025 1695 3157 3204 90 -172 1987 6082 8191 1805 -1544
5609 -1544 -302 -478 313 1892 1555 -1070 -305 -628 -602 -741 -3224 -7370 -3368 4034 3649 2219 -1038
5592 -1038 -5356 -5777 -2485 -1304 3995 9083 5414 301 1690 1608 1165 -1468 -1406 -346 -313 -180 -2231
5575 -2231 -3845 -3519 -5966 -8125 -8922 -5614 -1474 -5419 -5663 -1820 518 -705 -834 -278 626 260 1494
5558 1494 -1947 -4403 -1716 -291 -1078 1503 -2144 -2529 -1609 -1934 -2973 -5972 -6222 -4767 -1556 -2987
5542 -2987 -6843 -7384 -5448 -8968 -12491 -13045 -11201 -9357 -11405 -9884 -5351 -5190 -3024 -1833 -6502 -8172
5526 -8172 -6622 -8128 -6674 -4974 -5279 -5483 -4219 386 3850 1160 -1832 -4711 -4108 -1762 -4653 -6535
5510 -6535 -2243 -2548 -2233 -475 -574 -5506 -4888 -5180 -2352 -1222 -883 -6264 -10800 -6597 -6830 -3746 2842
5493 2842 3336 1206 91 69 1831 -32 -1871 -1635 -1166 -3007 -5778 -6831 -5234 -2628 -2833 -4736
5477 -4736 -6555 -7155 -8025 -8830 -5815 -4913 -1433 -1663 692 286 -573 -1146 -2069 -1072 3433 1863 1028 -423
5459 -423 -3517 -3379 -3434 -5075 -8167 -6957 -3676 -3415 -3349 -3306 -2811 -2854 -5711 -5238 -1460 -2642 -4519 -4100
5441 -4100 -2959 -4392 -4156 -2099 -5490 -9025 -10519 -12234 -9020 -8556 -7826 -3741 -2292 -2956 93 -2297
5425 -2297 -2019 -2954 -3059 -7584 -3909 -1399 194 3173 5044 1593 2081 4055 2930 691 3206 4907
5409 4907 1972 865 2107 7264 9804 4059 1516 2144 4662 684 1215 887 1248 1951 2412 472
5393 472 -1425 -2819 -4181 -3003 -142 3323 -3492 -4622 -2465 -2137 -2759 -5035 -3750 -1859 -221 4105
5377 4105 3602 2745 1233 362 -692 -779 721 -4138 -5752 -5947 -5892 -3946 -3203 -3561 -5822 -5479 -6320 -5652
5359 -5652 -2708 583 636 -4412 -6170 -7047 -3103 -989 -441 763 651 1057 2140 2288 1484 -166 104
5342 104 -2646 -3849 -6846 -6162 -3653 -2121 -1234 444 798 -2158 -3214 -817 -2950 -3275 -3137 -3866 -6991
5325 -6991 -7510 -8572 -6852 -5343 -1017 -2141 -4429 -6594 -4787 -5913 -10411 -7699 -3368 -1791 -1832 -3692
5309 -3692 -3323 -3792 -816 1031 2941 -775 -467 -621 -2095 -1815 2964 3928 -2783 -4897 -1962 -3093
5293 -3093 -5300 -3497 -1380 807 894 1221 -608 -4058 -1409 1409 644 57 923 834 -1545 -2260 -1466
5276 -1466 -1901 -3568 295 1798 2042 1479 -1492 -3039 -3434 -3988 -1996 -3399 -3404 -396 528 -41 -3746
5259 -3746 -4417 -2563 -712 -491 -2230 -2389 -3600 -3055 -2166 -2727 828 1727 -675 -2789 -6001 -2771 475
5242 475 3388 1457 -5261 -7152 -1887 1383 3232 1401 -728 -6229 -6548 -3502 -3529 -3595 -3385 -2935 -1489
5225 -1489 -236 -600 -25 -624 -4483 -7357 -5939 -5899 -6685 -6911 -4278 -2696 -3495 -2317 -209 1757 378
5208 378 -1032 -1145 -2825 -3815 1500 1968 -458 -2669 -3257 -3370 -4175 -6575 -7862 -3254 -1682 -3805 -1392
5191 -1392 1405 1382 3681 6696 2619 -3196 -3606 -132 954 2873 2659 1538 -1546 -3337 -1841 -1367
5175 -1367 1715 1944 225 -3545 -4696 -4279 -3991 -4471 -4069 -4233 -2252 2299 -2547 -9040 -11190 -8326
5159 -8326 -8241 -6649 -6217 -9074 -4057 -383 -2277 -3692 -2254 -6064 -9406 -7736 -5673 -4526 -629 -989
5143 -989 -1946 199 -645 -1338 -1106 -1913 1122 3596 5884 6654 2838 1914 2475 3898 1829 -1317 -4166
5126 -4166 1298 4628 2898 -88 1674 739 -1113 -1152 -3008 -3470 -7664 -7132 -2430 -1383 -3863 -5593
5110 -5593 -4418 -1861 -4379 -4664 -6032 -7521 -5272 -3114 -3790 -5463 -2150 78 -1856 -3258 -2919 -4762
5094 -4762 -7102 -8618 -6390 -1320 -315 -1547 -1160 -1228 927 -1236 -1321 -322 -1749 -3487 -976 1495
5078 1495 2066 2038 -692 -1723 -444 3386 455 1376 -1510 -2297 -2262 -2996 -2717 -4276 -3457 -1286 1972
5061 1972 -1037 -919 635 2961 5769 2008 589 -2412 -5273 -9344 -4716 -749 -1451 -3677 -5586
5046 -5586 -3830 -1620 -422 -1283 1714 -37 -3154 -3982 732 669 982 370 -1038 451 2279 -919
5030 -919 -58 2178 -1129 -2635 -2880 -3523 -2328 -250 -3120 -3933 -1542 3219 344 -4258 -5854 -9012
5014 -9012 -7503 -6346 -7421 -6705 -3871 -2864 -4111 -6901 -6412 -3886 -2490 2147 3918 2337 336
4999 336 -144 -3560 -2100 633 6055 4651 3432 5224 1881 2241 4359 4555 5052 4807 3298 -2187
4983 -2187 -6243 -3432 -811 -3368 -2912 -1679 -4025 -8645 -9422 -4699 663 722 -2283 -8548 -8927 -6134
4967 -6134 -5890 -4481 -3819 -5489 -1322 -234 616 5668 8765 6146 7123 3428 -621 -1482 -1485 36 -2535
4950 -2535 -6507 -5591 -3984 -4919 -5879 -7136 -7008 -6317 -5966 -2998 2463 3640 -2326 -4336 -4268 -6669 -8913
4933 -8913 -8837 -4788 -2874 -4600 -6145 -4983 -4766 -6668 -7556 -7054 -3816 414 -359 -256 -191 325 -1423
4916 -1423 -3968 -3505 -4785 -6183 -7635 -7229 -5537 -4832 -1556 2886 -1076 258 2797 3541 3781 3948
4900 3948 1172 -1002 2149 2029 650 -259 -1302 -3724 -4820 -4140 70 -2085 -2456 894 721 -2470
4884 -2470 554 1792 -399 -699 -2559 134 3983 4827 5555 4709 2375 -1412 -2874 -2427 -2390 -2616 -4434
4867 -4434 -4292 -2948 -2533 1032 -163 -732 591 -1481 -2134 -1936 -3264 -989 -126 -161 917 931 2611
4850 2611 -139 -1300 -2778 -6250 -4099 1837 7506 7652 5199 4078 2609 1702 1612 -1685 -2458 -625
4834 -625 979 1304 1089 2176 2268 130 1296 3647 6287 5305 6662 3373 -631 -1362 9 -170 -320
4817 -320 -1032 -944 -2619 -2405 -1460 -3185 -2754 1132 2193 -1184 -2482 -336 -538 -4215 -4358 -5569 -4106
4800 -4106 2367 4126 3508 2593 2876 4467 7567 8249 6360 4733 4963 5091 -1441 -3345 -2112 -167
4784 -167 -1253 -6235 -5442 -4208 -5257 -6521 -3930 972 1117 880 -920 -1823 -1477 399 597 1105 -369
4767 -369 -823 -3201 -742 -288 -1878 -2294 -1259 -145 -1398 -641 -291 -2143 -4093 -1288 2213 1637 2050
4750 2050 3726 1867 -1489 -4569 -1405 -1028 -1329 432 -88 -2837 -4193 -3466 -1147 1778 2787 -549
4734 -549 213 -3966 -6032 -8215 -7212 -4433 -76 139 -1548 -184 794 639 -2987 -1994 -4517 -5264 -5415
4717 -5415 -4317 -5023 -3780 -864 -1241 -1086 3053 3971 513 -1054 -3343 -2994 -553 407 343 561 3373
4700 3373 3890 4844 7253 5414 -1392 -5476 -4507 -2402 1950 2292 1500 86 757 143 -1888 -575 2734
4683 2734 4265 3496 3301 3829 2249 1034 -1495 1106 1563 837 -1971 -4928 -9586 -8357 -6353 -5226
4667 -5226 -7570 -8226 -1775 1484 2953 4055 4327 4425 2177 7038 8051 6060 979 -947 1455 2840
4651 2840 1497 -405 -1899 -1798 -3176 -4622 -7218 -7792 -8141 -6936 -8399 -6094 -6383 -4798 -5332 -3967
4635 -3967 1968 2477 303 2404 2689 -966 460 -921 527 420 -5381 -6644 -3220 -2128 -2910 -2215
4619 -2215 -3419 -5742 -8196 -5982 -2730 -1873 3672 3701 2367 1320 1451 337 -2078 665 3079 346
4603 346 -1224 -5149 -7053 -4539 -1862 -2057 -2627 139 1300 553 -1368 -2195 -1930 78 115 -2751 -7317
4586 -7317 -8217 -9824 -9863 -7581 -3007 2553 5037 4644 8013 6332 8021 9071 5135 989 -2365 -247
4570 -247 2788 3253 2306 4029 2419 -1014 -20 -1271 1147 2887 329 -945 204 -3502 -1590 -504
4554 -504 -354 407 -1805 -2284 -813 1022 2517 5263 1905 389 -1505 688 552 -3179 -1301 163
4538 163 1307 961 -999 3527 5734 4817 61 342 -1492 432 1042 -5843 -2849 -204 -2237 -3919
4522 -3919 -7973 -9570 -7960 -4936 -6013 -7705 -4581 -1883 -1708 -1314 -742 -4447 -4734 -6209 -4381 -1114
4506 -1114 1180 1324 1610 2303 4251 4431 -744 548 2179 -1207 -2409 441 485 -3719 -5580 -5384 -3301
4489 -3301 -4360 -4318 -4717 -3617 -2360 -9216 -11631 -8606 -4855 -874 2394 3359 4739 5283 2480 4006
4473 4006 2401 269 41 -2223 -7423 -8575 -6187 -4522 -3285 2267 4957 6977 2838 1268 949
4458 949 -443 -3002 -5388 -6432 -5279 -4294 -7314 -7354 -3629 -2106 -402 2007 -370 -3840 -3457 -5503
4442 -5503 -3988 -163 957 1196 1177 881 5434 6437 7464 6584 5080 1294 -72 3006 2385 2796 2860
4425 2860 -103 -973 -3944 -1671 1489 -3110 -2886 1153 1086 -651 -2560 2712 4044 -342 -1624 608
4409 608 3250 1396 -2869 -2261 -2159 376 933 3335 -528 -3123 -5909 -8141 -8853 -8999 -7311 -5994
4393 -5994 -7706 -8076 -10518 -11779 -10620 -8157 -5151 -2351 2170 3924 -736 -4383 -3117 -5011 -3432
4378 -3432 -3790 -3736 -1032 585 749 1282 161 -1908 1135 -394 -280 1572 -1205 -2522 -197 4051
4362 4051 6054 4416 -605 -1138 -3498 -4538 -2319 1597 689 -1838 -4311 -6256 -5251 -4701 -7497 -4123
4346 -4123 -5554 -7377 -7280 -2644 -4322 -3863 -2395 -3286 -768 1456 3357 1236 133 1887 4622 3963
4330 3963 1073 3860 2347 4342 1699 -2268 -446 389 -1828 -962 -407 -4451 -6568 -3787 -3371 -480
4314 -480 2551 6920 6669 2849 3546 7239 4463 3448 3043 1739 1179 2304 -2954 626 4068 4982
4298 4982 5130 2452 546 1772 137 59 2198 4263 3824 1454 -6368 -4739 -897 3555 4145 658
4282 658 -15 -1399 -5975 -7012 -3863 -1017 906 2276 -3409 -4962 -5875 -4579 261 3540 3836 3894
4266 3894 3803 2097 -1679 -3530 -1771 770 2701 3334 7055 8012 7579 2694 491 2565 2959 3749 2522
4249 2522 -1839 -2458 -3945 -6559 -6253 -6911 -11208 -9324 -5444 -2598 -3728 -3367 -3103 -860 -2602 113
4233 113 2002 5604 3042 549 3341 4659 3887 8534 7819 3477 1128 388 -3783 -7398 -7895 -1463
4217 -1463 6591 11196 11238 10811 10540 6220 1177 -2691 -3901 -2168 -3059 -5079 -2219 -1894 -2066 -1260 -213
4200 -213 2148 5045 3945 6748 6360 2531 -2682 -2908 -5300 -3730 -5339 -7140 -5112 -9394 -9659 -8238
4184 -8238 -7665 -3241 -3268 -4784 -2188 340 -215 1226 2182 -864 -6290 -3279 -4734 -9154 -6314 -2314
4168 -2314 -1893 -6431 -8902 -8313 -7865 -12188 -11849 -3177 1222 -241 -3090 -2265 351 -3211 -2564 -2317 -1891
4151 -1891 -1274 -2721 -2649 -240 2667 2891 4452 8739 10219 5210 1226 -2290 -7021 -6736 -1639 -1701 -1975
4134 -1975 -1713 1027 2095 615 445 2159 7254 7626 5211 4243 4852 3941 -2369 -5814 -2156 -4182
4118 -4182 -7598 -5400 -1698 -2188 -2487 -2356 -3010 -3225 -1480 -878 -3184 -2391 3316 3823 1113 2318 2017
4101 2017 -4958 -5172 250 -1040 -1100 -2052 -2755 -2294 1082 3591 7256 8466 8239 4105 920 303 -1492
4084 -1492 -1732 1389 -2375 -2580 230 -3550 -2962 -1410 2663 2066 2956 4210 6833 5018 2865 519
4068 519 -2954 -3840 -506 812 -647 2817 2993 2679 3282 3737 3337 1714 -574 -892 1958 3613 2310
4051 2310 -22 2612 2005 344 -1470 1171 5028 4242 3253 -1930 -991 472 1581 -151 -1275 -2821
4035 -2821 -4325 -2474 -826 944 5913 -1561 -6294 -3895 -3423 -3993 -2666 -1438 564 3318 1472
4020 1472 123 1275 3914 3473 -1679 -5278 -8062 -8846 -8771 -7860 -3009 608 -1146 -2588 -2451 -1844 1125
4003 1125 2250 -3988 -5292 -3688 -1888 -2491 -3604 -149 -418 -4150 -4059 1734 2398 -343 -470 -615 727
3986 727 1773 1246 112 -5196 -5532 -1595 600 -3620 -4129 -1389 1227 2959 3430 2179 3851 3119
3970 3119 10215 7206 -5112 -5059 -2239 -2735 -1061 2761 6116 6622 8603 5393 5654 6088 5272 4585 2794
3953 2794 2308 7046 3460 -2637 -9262 -6924 -5460 -5457 -5206 -6576 -4197 -4741 -3124 -2775 -5085 -2977 -1346
3936 -1346 -1370 2 904 4737 1437 449 -560 -38 2545 5478 6457 6377 5551 1314 1085 461 -1223 -2073
3918 -2073 -1496 1299 4805 1848 2875 2926 5150 5538 4033 2283 -1892 -2679 -1410 209 3411 4233
3902 4233 2641 -377 -1118 -525 1265 2810 2823 1073 1209 2407 199 -795 -2521 979 -422 -3652
3886 -3652 -2827 -1298 1448 -802 -156 6 -1089 1617 1110 870 -86 2505 47 -3916 -4062 -3148 -3136
3869 -3136 296 712 3005 3878 4835 5958 833 -892 -1092 347 187 889 -3316 -5204 -1883 -1497 -3260
3852 -3260 -2958 -2158 -3765 -5053 -7122 -9850 -11201 -9773 -6876 -3451 454 1644 -2739 -2784 -1068 -434
3836 -434 -854 -3658 -146 1629 1543 4734 2397 2397 288 -3026 -4699 -5862 -5928 -9533 -2168 2988 3735
3819 3735 4482 1308 -2664 -1859 -2000 467 1661 3453 645 -4278 -1888 5882 6387 8612 7994 4289
3803 4289 4375 4096 5511 -1107 -3557 -2180 -3567 661 4027 2257 1033 -3170 -4591 -2475 57 197
3787 197 -3117 -4364 -4660 -1265 785 458 -5843 -10542 -8658 -7998 -6327 -4354 -1809 -953 -1276 -622 3943
3770 3943 2905 4147 3942 3758 4278 -1525 -3547 -2247 -1909 -4537 -6127 -5214 -4757 -3794 -3425 -792 623
3753 623 866 1797 4419 3891 4672 4160 2262 720 -4 -1096 98 90 2693 3900 1403 -1694 -1397 332
3735 332 1097 644 502 -108 -347 -106 1590 2407 2222 5228 3604 2389 1005 -2364 -3236 -1029 3621
3718 3621 2899 6025 7019 1948 -1481 -3222 -4682 3867 11356 6250 7159 11150 12729 11440 10621 3738
3702 3738 1556 -579 -1593 1025 3236 -6 -1843 -1110 -4000 -4512 -2706 -4668 -4670 -3793 -6727 -9810
3686 -9810 -10863 -7122 -6831 -5969 -6919 -9780 -10005 -7273 -2381 808 392 -1310 -3280 -3340 -2073 151 -1318
3669 -1318 -1873 -6674 -5404 -4155 -6881 -7395 -4521 -3796 -2658 -1132 -285 2295 -95 909 4749 7532
3653 7532 5121 1630 416 2977 2335 4599 4404 4341 5723 6460 3209 1199 4159 5593 5860 4413
3637 4413 2702 2152 1436 4655 4510 547 -178 -2301 -2067 -1559 1881 -331 -4487 -3355 -770 -1329 -3283
3620 -3283 -4722 -1321 1057 -192 -2486 -2073 -6788 -8765 -5969 -7292 -7912 -6135 -3443 -1026 2419
3605 2419 817 632 2013 3188 4197 3946 2783 2875 4792 3163 3774 3189 5088 393 -3679 -3152 -732
3588 -732 3883 2275 -301 -2736 -3053 -2229 -1028 -615 -1534 552 3656 -2526 -5220 -4257 -4190 -3935 -2301
3571 -2301 -850 2753 394 -3358 -3235 -1348 -2184 -2403 2232 2552 -1038 -1858 -354 381 -120 -6402 -9527
3554 -9527 -9339 -7885 -6916 -3074 1323 326 -1925 1301 479 -5606 -2727 231 2349 980 326 -1863
3538 -1863 -1371 -2366 -4473 -6606 -4799 -3599 -3052 -1662 1519 1565 1301 -2168 -3613 -2881 -6105 -10475 -7665
3521 -7665 -3791 -2675 762 -463 -7672 -8251 -5013 -5189 -1834 394 3056 2403 -242 -2688 -293 2630
3505 2630 3647 2180 3617 3564 4510 5805 972 -3701 -3379 -4504 -1630 -3520 -3178 -4751 -4618 -2439
3489 -2439 -1840 -4814 -5195 -4425 -2050 -2492 -1509 1038 1094 1048 -2262 -4691 -5743 -4861 -5196 -1006 1172 -2275
3471 -2275 -4130 -3959 -1710 -2215 -2179 202 -349 -1738 -1553 -1038 -1982 664 180 -628 -2127 -4524 -2759
3454 -2759 -2145 -4321 -3111 -4292 -6720 -8301 -7048 -8582 -7063 -5865 -4265 -2449 -2545 -1133 -560 -3853
3438 -3853 -2483 -4603 -5873 -1052 4570 6154 7219 4832 2182 -695 -435 -107 886 -75 -442 -392 -103
3421 -103 -1552 -1278 -4522 -8456 -6225 -5675 -2378 -7166 -6977 -1556 -2919 854 4858 5543 4091 667
3405 667 -1116 -2405 -3816 -3963 -3692 -4521 -6121 -8221 -7121 -10531 -6285 1106 231 -2960 -6695 -9109
3389 -9109 -8414 -5304 -5512 -4960 -6375 -6156 -1971 -1423 -3566 -512 -443 -533 1709 -511 -3071 -3726 -2001
3372 -2001 -2937 -5478 -3076 3148 7067 5488 6329 6882 4233 3858 6603 6280 7418 5946 5866 10475 6344
3355 6344 2751 354 -1938 -1199 1691 2861 -1081 -1055 -2184 -968 1983 2789 2845 1695 -134 -1469
3339 -1469 -1350 2055 1495 2589 3127 5715 7499 8622 10225 2368 -3862 -3383 1798 2799 2603 4977
3323 4977 5960 2226 -1929 -1363 -1484 -1188 -1200 -1222 2693 1837 -2601 -410 1511 -290 221 -3170 -5339
3306 -5339 -4392 -5904 -4251 850 4230 6927 5250 2330 5337 7736 4695 968 -725 -125 3995
3291 3995 3859 5464 9797 4811 1520 3148 6360 5342 4051 5784 6716 6540 6196 1758 19 1382
3275 1382 5576 1530 263 1337 1976 -144 -328 5147 3631 3819 2018 759 3907 1973 709 -278
3259 -278 1644 5468 6952 2625 -1422 2575 7763 7185 5459 8239 9524 5271 -2065 -3851 -3544 -5239
3243 -5239 -4853 -1787 645 2049 335 96 1603 4095 1830 -1813 -4814 -4922 -497 5543 5635 5423
3227 5423 4708 1749 752 535 223 -4524 -4726 -2004 -3395 -1968 3108 -819 -3898 -3747 -2884 -676 494
3210 494 844 1563 177 728 402 -3793 -4446 -3603 -3899 -3730 -5147 -4155 -3309 -4186 -4305 -1822 3486 4932
3192 4932 4768 4363 973 -748 673 -1195 -5961 -4131 2915 4883 1915 2066 3699 1912 -652 1651
3176 1651 3383 906 -3548 -5729 -6379 -6749 -4743 -2231 -1733 861 2769 1096 -213 -822 -3769 -4766
3160 -4766 -1871 1053 1276 721 825 -1617 -6445 -7653 -4080 -313 822 -598 598 2168 -567 -1897
3144 -1897 -5133 -6383 -2288 -209 2402 1924 -1506 -5042 -5015 -2322 -4913 -8029 -7524 -4829 -6976 -5814
3128 -5814 -2263 1254 3565 5092 4967 4122 4165 4447 2522 1134 2213 4966 6040 3864 2825 2723
3112 2723 1266 -1907 -4915 -3705 -2778 1792 2697 -1582 -1676 -3640 -6679 -5197 -3783 -3561 2253 4318
3096 4318 4301 5334 8152 9187 9918 5325 1826 -483 -4437 -5032 -4527 -3773 -2388 -1229 829 -1489
3080 -1489 -451 2089 3227 -1052 -1465 1760 812 -883 2343 4843 6800 5601 1795 2679 4554 5826
3064 5826 5416 7870 5453 3854 8220 8715 7585 6279 3771 -1416 -2590 -1883 474 4153 8176 6408
3048 6408 4228 2237 3615 -814 -399 2094 1427 -1259 -5489 -5217 -4024 -3516 -4045 -4104 -3777 -2958 -1642
3031 -1642 792 1891 3654 4484 2437 -1732 -171 608 479 -1062 -4191 -3962 -1725 2549 3920 3038
3015 3038 1162 -223 823 1410 2312 1821 2023 -845 -4045 -4379 -2617 399 3953 9758 12630 12158
2999 12158 5051 2200 -926 -1149 -258 -17 -848 -1044 -5342 -412 1020 -571 -764 -2850 -3984 -4604
2983 -4604 -3320 -2350 -957 -3772 -2813 -335 1795 2187 4023 3385 1420 -4715 -9418 -8113 -7542 -5986
2967 -5986 -2106 801 -3069 -2517 917 2932 1982 2995 2246 2559 638 538 4773 3098 1953 1081
2951 1081 4796 5310 1586 2738 3602 493 1319 578 1485 -449 -991 -3335 -7098 -5737 -5874 -213 5507
2934 5507 6939 6604 4902 4683 2401 5860 4823 3068 2401 2135 1944 3792 4362 2636 1224 -2809
2918 -2809 -8592 -5106 -1196 -2673 -7045 -8336 -6293 -6753 -6802 -5001 -5867 -4426 212 3682 2834 2980
2902 2980 1243 -4495 -7418 -8893 -6213 -5106 -5679 1459 7184 6734 4907 3409 2379 3266 434 1306
2886 1306 3014 2638 2183 5100 4268 1518 -1733 -670 690 3830 3151 -2067 -2867 -4551 -6923 -3933
2870 -3933 -394 51 -311 -1058 2793 2409 -97 1410 294 -2525 -2270 1744 1818 -661 -7131 -7172 -5895
2853 -5895 -5183 -2261 -1902 -227 3677 3446 2989 6446 10255 7878 4933 886 -2091 -3460 -949 1036
2837 1036 477 1147 -1281 -2605 -4684 -3469 -3614 -837 1659 219 -311 -1103 -4147 -3882 -2124 -470
2821 -470 133 2000 1583 -908 589 2089 1972 -441 -2598 -7320 -9626 -10086 -9889 -9423 -7753 -1372 2163
2804 2163 4441 2113 2132 3122 -1265 -690 876 92 -2036 -5662 -7359 -2807 1455 232 -511 -908 -1232
2787 -1232 -2457 -4158 -2190 -2786 -4545 -4704 -2935 660 1974 2669 3208 4310 3383 558 657 3303 2188
2770 2188 7447 9347 6515 4868 5165 7338 10320 8334 7256 4894 3438 487 -1424 -1466 -989 120
2754 120 2008 5226 7725 7698 9086 6372 5283 2482 447 -5112 -8887 -9106 -6494 -4413 -6915 2655
2738 2655 5305 3637 -2805 -3936 -3417 -2559 -6062 -9839 -5106 -2856 -3631 -2592 -887 -40 -151 803
2722 803 -4806 -9926 -9210 -5130 -3790 -3246 -3809 -3944 -2493 -1839 75 1335 1483 4076 2952 -785 -4008
2705 -4008 -5149 -4958 1847 2094 2351 -1302 -2462 -1976 -916 2394 1817 -248 -3556 -2461 -127 3688
2689 3688 2006 1227 -9 -4385 -5626 -4060 -3632 -2074 416 -91 -2386 -303 -57 -3741 -19 3055
2673 3055 1975 2211 1347 2307 4700 7321 7673 6751 4030 92 2163 5105 4518 -979 -1534 -5 -1417
2656 -1417 -3529 -2239 2072 4637 630 -2949 -4204 -654 226 -1968 3063 7750 9159 10136 1165
2641 1165 -4379 -589 2768 3972 3185 1762 4595 6283 5893 2381 1092 3270 4084 -573 557 5085
2625 5085 3018 1231 1792 4059 1624 -1323 -3521 -6346 -3335 239 -250 -2938 -3548 -2254 -1027 -387
2609 -387 3094 5185 3883 1572 4858 5902 5753 2552 -3585 38 1641 5198 5214 2202 2778 5395
2593 5395 2106 12 3105 -66 -1224 -1642 -2077 2747 3076 2892 3282 3876 6746 5348 4480 5867 5144
2576 5144 3743 4164 1987 -1974 -264 -254 -688 157 796 2301 3935 3727 666 -3632 -3110 -1373 -2289
2559 -2289 820 2127 2374 7 412 3760 3683 4809 1912 1908 4466 3478 1007 129 -1240 -157 2606
2542 2606 6197 9192 4304 1174 2713 1310 -1860 -2048 -2664 -3175 -2600 223 2290 5051 2267 1316
2526 1316 4830 3935 2259 -1818 -4159 -8034 -7540 -5857 -3079 -848 -1301 606 1458 705 2268 6983
2510 6983 8354 7881 7159 6937 4144 3489 -743 -2733 -3305 -2001 1905 4082 4582 4886 3872 4957 6100
2493 6100 6000 3951 4154 4428 4920 3076 1523 3304 3931 2300 4990 5607 5372 6630 8640 6357 80
2476 80 2853 420 -3124 -2290 -2589 -3528 -3664 -5415 -2172 -1826 -1895 1049 2485 493 1795 1517 -1142
2459 -1142 -842 -5494 -3771 -5010 -8351 -5871 -6065 -6048 1760 4943 1623 4067 4466 3241 977 -2613
2443 -2613 -1350 850 3751 4045 5679 7776 7499 3017 3107 1340 -204 -2335 -837 359 -3592 -2905
2427 -2905 745 -2435 -3176 -4057 -4974 690 3230 6586 6379 7697 3185 -1484 -2052 -3216 -4937 -4209
2411 -4209 -2319 -565 3388 5921 1465 -3488 -4547 -1370 -46 441 3104 3800 4108 -1842 -376 3095
2395 3095 2862 5154 3254 5434 5715 5013 5075 7856 7921 4997 3342 1816 7059 10622 8340 6822 5030
2378 5030 769 3464 7285 7176 3368 2637 2333 5661 5011 -365 -2460 -338 -4572 -2350 -2930 678
2362 678 2819 -1018 -3474 -8081 -10491 -7719 -5958 -396 2546 2849 4513 3686 1130 -292 -831 2911
2346 2911 5734 8538 8581 4980 2212 -817 -205 2134 6266 5227 2483 727 -2858 -3730 -1698 -5701
2330 -5701 -3287 1573 1473 1106 2364 7689 11330 6936 2922 2235 3498 4340 3287 -276 -4199 -2464
2314 -2464 -1139 -973 1041 1761 1062 4128 3452 1686 3006 4065 4835 2996 4053 2049 -2180 -1288
2298 -1288 604 1645 -1096 19 -1100 -1566 1131 -801 386 505 -2014 -388 443 -233 2101 3942
2282 3942 1817 2134 -956 -1400 -537 -2651 -1389 -320 -114 578 2110 3283 2827 -2083 -4171 -3357 -3797
2265 -3797 -1270 785 3873 2848 4171 3924 -605 2203 4518 3706 6661 8301 6823 6813 3370 3956
2249 3956 3496 2511 -643 -1669 -186 2063 -54 -1925 -3590 -2564 -3102 -1367 -1514 -852 -1579 -3325
2233 -3325 -2359 2088 -247 -1325 1991 2735 -394 -908 -5330 -7901 -5387 -2451 889 2809 -3586 -4805
2217 -4805 -4006 -4619 -6854 -5349 -1813 -1921 -1773 -3099 -2610 -1532 -3728 -5033 -4461 -3904 -6016 -6482 -3798
2200 -3798 -4379 -3174 -3703 -1020 1747 7103 7871 2450 1419 2861 5700 6354 3773 1170 4750 5099
2184 5099 2492 995 -225 -434 -4015 -5983 -2597 -120 843 34 -3469 -1304 1532 2147 2278 3960
2168 3960 5201 4840 6836 4266 2105 7011 7076 6938 6984 3434 3062 762 -760 1772 928 499 2643
2151 2643 5197 5373 4888 6081 7558 7043 7308 9281 9902 14261 11454 3961 369 -864 -2026 -5699
2135 -5699 -4172 -4079 -3395 3566 5755 6408 6428 3407 -2239 -1152 2206 2798 1719 -560 1518 -355 -3217
2118 -3217 -3109 -1468 -295 3644 571 2501 3721 -1950 -213 -250 -1459 -2259 3089 3375 3173 2604 6491
2101 6491 9571 10149 10406 5640 -2924 -4623 -153 -1631 -707 5008 6065 4033 4937 1943 741 2618
2085 2618 3103 6439 5188 203 1191 316 -3212 491 -287 1225 6729 8096 5188 3088 5080 3034
2069 3034 2287 185 -1667 -3265 -2526 3040 5909 2143 403 -631 -1029 2444 6680 8636 5631 1974
2053 1974 2436 3415 6681 8697 6387 3056 2461 858 622 186 736 1783 2472 46 986 556 1652
2036 1652 1225 348 863 -216 757 3410 3955 2104 3598 605 1068 4734 3996 4522 7583 7994 2900
2019 2900 6602 5254 113 -1060 -2839 -6302 -8126 -6380 -4977 -465 1772 401 -3091 -4614 -3851
2004 -3851 -3792 -1017 2835 4096 2546 1588 -445 -3797 -5610 -6338 -3327 539 1563 9 113 -964
1988 -964 -3006 -3316 -3840 -8202 -6499 -6402 -8240 -11018 -10398 -8185 -6083 -6871 -8054 -5708 -6210 -5962 -6537
1971 -6537 -7000 -7163 -9455 -11018 -6222 -1384 -3843 -1823 2088 7592 3886 1481 1066 -250 -394 -418
1955 -418 -1613 -5904 -2062 -1908 -12 2437 3710 -318 1154 3310 2400 1142 -10 456 2663 2365
1939 2365 1918 -2453 -3217 -2172 -891 -979 -4048 -6768 -8349 -7220 -3854 -4829 -3697 -791 -498 -416 4264
1922 4264 8064 6704 8323 7046 6318 6908 6102 5042 412 -2639 -4327 -3813 -3546 -2814 1252 4413
1906 4413 6322 3067 670 2040 -291 -1703 1061 1536 -192 2185 835 -690 -3154 -3947 -181
1891 -181 3453 1790 -1911 -5048 -4258 2478 3465 2492 588 -3779 -3701 -8124 -6479 3080 9413 12386
1875 12386 5614 856 -2156 -528 347 826 -240 -1147 -731 -1901 -794 999 -90 -2481 -4332 -3969
1859 -3969 -3295 -5981 -7278 -2566 1292 4511 5342 1853 -32 -1888 -87 3795 4764 -296 -2948 -1227
1843 -1227 -2496 -1361 -1849 -1232 3643 6510 2999 -2337 2750 6861 2670 -1723 -679 219 957 -814
1827 -814 -4877 -7701 -7108 -3729 -800 -367 -3069 -6506 -6629 -1424 324 -1593 -1738 -785 1938 2344 2371
1810 2371 2001 1210 -142 -1059 4164 5826 6616 6476 5238 3532 1833 -94 2172 6166 5923 7686
1794 7686 8856 6416 6084 1859 -1164 -779 215 1986 4906 4527 1989 4410 6762 5171 1740 -67
1778 -67 1231 17 -945 -640 -1326 -2063 -152 3009 -58 -3232 -214 4749 3740 -558 -1060 -696 838
1761 838 649 1158 1978 2481 1885 526 262 7131 6783 3588 2999 391 -1549 1837 3813 4955 4550
1744 4550 5462 6779 6472 5251 2822 -1196 -361 2600 3376 1435 1153 1673 4483 3079 1982 728
1728 728 2654 5343 7988 9262 8750 6071 3814 2852 3423 4624 6739 6726 3481 3684 6245 6972 8054
1711 8054 7986 6607 -305 -4075 -5750 -2728 8 2428 2448 1232 -1806 -1303 1039 375 -2987 -4425
1695 -4425 -4510 -3093 -203 -3514 -4740 -7492 -7010 -1471 635 -878 1532 2469 204 628 2632 3790
1679 3790 4796 6503 8525 11233 8460 3117 3420 3573 1831 3472 3289 578 -1706 -2552 1479 3548
1663 3548 5280 2562 2962 -754 -1098 395 1591 1904 1863 2042 2699 1818 1254 -74 2812 9022 10139
1646 10139 8050 9852 10903 9157 8737 6217 3908 -94 449 5044 5850 4171 3600 4649 2343 -548
1630 -548 652 8629 14027 15891 9640 491 -3441 -5992 -4860 -2725 -1589 -1650 -3840 -4254 -4364 -1213
1614 -1213 -1306 -2788 2705 2794 4404 7711 8585 6423 3196 2601 835 -2721 -1818 2130 1180 371 -2131
1597 -2131 60 1206 -6322 -6949 -2743 -1320 -2746 -3717 -4307 -3347 -2072 -870 4003 5166 6306 3452
1581 3452 -397 1731 3245 840 -664 -1126 -2714 -2800 -4438 -6672 -493 -1853 1055 5000 2130 -1788
1565 -1788 -310 331 2445 2205 2179 994 -620 -5195 -2745 -1636 804 3797 1395 4396 4718 4227
1549 4227 3354 3861 2865 3043 3040 -2232 -3236 -5646 -7767 -6268 -5274 -5105 -8429 -8677 -7219 -3878 -982
1532 -982 -3075 -3551 -4373 56 3778 3596 2479 -3606 -3473 -973 439 3084 4977 3229 -1572 -3889
1516 -3889 -2587 -1309 1554 2443 -561 -3113 -2179 -1435 -295 1277 -2423 -2294 -4078 -1357 5232 5736
1500 5736 2159 2925 3304 -2125 -3101 1471 3204 3462 5598 6283 4524 4437 5545 5375 7196 5509 2059
1483 2059 2737 1361 1928 -60 54 -503 -2420 -222 1812 4598 901 1079 -1701 10 1993 1767
1467 1767 5972 4348 2271 1544 1527 1607 1379 5194 3607 537 -938 -6344 -9048 -7534 -1565 -559
1451 -559 -1242 1520 911 1241 -993 -3985 -4408 -3079 33 -359 -2251 -3418 -6545 -3049 3197 5795
1435 5795 1263 -1573 -2167 -1888 -780 2727 4567 4375 5442 8230 6235 2762 1536 3499 5652 7232
1419 7232 7202 5552 3082 -1593 -2450 -1919 -1924 -162 4540 4555 949 -2891 -2157 173 1132 -936 -2676 -1619
1401 -1619 -90 -3181 -4943 -6072 -6722 -5880 14 2580 3683 1028 -3973 -7329 -10501 -12084 -8206
1386 -8206 -5882 -2536 2561 2599 3082 4158 2680 83 704 3827 5282 3743 1957 2701 5381 2796
1370 2796 2511 4271 3037 126 406 -2783 -1580 1109 1640 2199 4499 4789 1181 1317 1595 -2339 -2470
1353 -2470 1339 4253 5535 3250 4363 2526 -871 -1122 2035 3581 2570 201 1689 -107 2396
1338 2396 1577 1413 -854 -671 3032 283 -738 968 292 555 1259 -34 -1925 -2658 -1521 383 1027
1321 1027 -972 -3806 -5108 -5248 -2636 3052 4834 1316 1949 1710 1559 2197 3756 1937 -1144 -4767
1305 -4767 -3134 -3616 -4249 -3587 498 1784 -2144 -5028 -5179 -1622 -1212 -1089 -3294 -1321 1787 6706
1289 6706 4917 2086 -175 -1765 -1452 2282 2311 2038 4943 3618 3527 3975 4807 456 2359 3039 2092
1272 2092 -1845 -2605 -3794 -3272 -3129 -4855 -2358 -1269 2455 4388 2393 -990 -3375 -2944 -759 3397
1256 3397 3314 3605 3565 386 1142 4438 6811 5354 -740 -4697 -4455 480 2457 -2064 -3342 -2714 -2159
1239 -2159 -6859 -4971 -6413 -7472 -6115 -1059 -4273 -4663 1453 4456 4938 2481 3335 3949 3052 614
1223 614 -2737 -6357 -5462 -4050 -6700 -5392 -2364 210 -46 -3696 -3284 -6909 -5475 -4993 -4096 -1341
1207 -1341 -1736 -2965 -4096 -3933 -2887 -3638 -5898 -9802 -14283 -12847 -8513 -4240 2671 2424 -2504 -4104
1191 -4104 -4460 -3790 -2194 -33 2834 4865 3661 3255 3932 6538 3914 -2000 -3537 -1390 -660 1948
1175 1948 2045 -2172 -3843 -2373 628 2012 928 2128 2574 2080 414 2598 2643 956 1151 -544 1530
1158 1530 4090 1155 -1097 3275 5900 3810 -704 -4456 -5536 -5577 -6140 -5965 -1820 881 236 -2106
1142 -2106 -3858 -6883 -8640 -5171 -3737 1812 4566 9499 9120 7426 6663 5434 5272 6785 6820 3519
1126 3519 356 402 417 -1947 -4505 -3864 -1704 -2063 1058 4017 1864 2284 1799 1966 1249 2618 936
1109 936 -703 -2868 -4890 -5766 -7786 -5793 -1700 1827 1402 -1246 604 151 -1708 121 -2315 -3917
1093 -3917 -1400 -737 -1722 2379 5025 2809 2753 4085 5406 4517 3794 1786 1854 -995 -756 684 -2594
1076 -2594 -4208 135 750 -1451 -4055 -7035 -4050 -5771 -5987 -4176 -1405 3191 3351 3803 1959 1396
1060 1396 2486 461 -661 -1784 -1758 2719 4802 1300 -1816 -1443 -842 -1346 -2482 1204 1349 -219
1044 -219 770 1771 504 -2421 -4930 -1030 2653 4468 3248 -557 -1480 875 3862 8176 7245 8497
1028 8497 9906 7921 5687 3488 3489 4013 2305 2803 2999 1833 4314 5137 7501 9371 10694 6029 4688
1011 4688 5463 5281 4228 3745 2817 -434 471 7718 11318 12583 13499 11512 6688 880 1646 3455 6919
994 6919 4837 6378 12343 15207 7563 3224 5592 7663 10585 10892 10143 6526 1951 1061 2668 4636
978 4636 3946 2389 1319 1400 2588 2704 2599 1085 -3383 -927 1580 -1204 -2006 -1602 -816 -1487 -537 1800
960 1800 148 -3147 -2377 -2861 -1872 -184 -1266 -1914 -290 1938 1974 1922 510 5 -1374 -2589 592
943 592 1863 1154 1056 4332 2986 2173 2511 -1662 -2209 -2514 -211 1865 1331 -2000 33 4331 5735
926 5735 3742 4188 5435 7863 9203 6889 2194 2962 5333 3379 4111 3682 1477 3588 5973 2917
910 2917 3169 2715 1006 -148 -1647 -3881 -1448 2753 -87 -3166 -2607 -283 648 -3385 -5523 -8783
894 -8783 -2862 470 -1368 -2521 -3770 -3549 -1000 -2800 -2727 -2456 -5458 -5004 -4933 -7122 -5706 -6694 -6497
877 -6497 -4763 -4897 -5062 -585 -945 -1292 -2240 -4526 -3333 497 1766 -224 2529 7199 3823 1571
861 1571 1767 1264 3468 3273 -1195 -3622 -3788 -3218 -1724 -586 259 1191 -1926 -4976 -2841 1281 5539
844 5539 1237 -3214 -2893 3212 5476 5008 521 -3489 1387 5487 3099 1754 518 945 5019 5889
828 5889 5375 4927 4788 3821 3735 -82 -1182 -2829 -4261 -1658 2287 1534 -3595 -4898 -1559 -3736 -2380
811 -2380 -2072 -2331 1197 4393 3557 1765 1613 -2173 -4417 -1330 4042 5236 3170 -2687 -3463 -5076
795 -5076 -6808 -7061 -7385 -3216 -1097 2095 4052 -25 561 4873 4697 319 -564 554 779 1898 4335
778 4335 4590 4148 3371 3390 963 -1874 -1100 103 -1912 -615 379 -104 -1551 -3278 -4897 -4860 1399 2743
760 2743 473 -2072 -5152 -5716 -7131 -6529 -4570 -5315 -8669 -9481 -7597 -6111 -7230 -5959 -7910 -6649
744 -6649 52 6380 7252 5362 1150 -1675 3317 7884 3103 -3638 -2058 1085 3516 2841 2639 6262
728 6262 7453 4730 -625 58 1946 3058 -177 -4367 -3308 -2248 2135 4005 3020 1894 1750 877
712 877 302 -1670 -1694 -3260 -538 3554 2832 2792 1883 1547 4166 301 689 2024 5315 4581 1670 1714
694 1714 1058 126 -695 -573 1244 2308 3435 6827 3898 -1266 -4053 -3230 -3347 -748 543 3020 2506
677 2506 -1007 -1109 237 472 -1276 -2639 -4772 -4295 -535 -3170 -7730 -6375 -3550 -4796 -2909 -945
661 -945 -1300 -1345 3075 1477 -3073 -3466 -3623 -3673 -4033 -4716 -5555 -3921 -3454 -322 3742 1557 814 2778
643 2778 3189 -1021 -3884 -4931 -3010 -621 -825 872 1117 1212 2113 822 -686 -1598 -3497 -3679 -3557
626 -3557 -1494 345 -1226 -3700 -1868 -4138 -2826 1319 -1059 -3942 -2769 552 379 -491 617 4749
610 4749 6504 6122 -478 -1516 -2863 -890 412 1729 -248 88 3097 -586 -5417 259 2866 1824
594 1824 7449 6902 6350 5724 7658 7445 2497 2967 881 -6469 -8074 -6529 -2992 -546 -4148 -2929
578 -2929 -2234 -2852 -157 -2762 -1576 187 -636 -3964 -4480 -5163 -3301 -1963 2531 2798 -217 1339 246
561 246 200 -897 1950 1135 687 -2076 -1519 -556 -1892 -3087 -3678 -3437 -4859 -3085 -1897 366 908 -1092
543 -1092 -228 278 -1493 -1032 -4675 -7334 -9635 -7482 -5557 -3401 -2196 1923 7027 10380 8638 6459
527 6459 2871 1561 2455 3493 4985 4134 3535 3651 4767 5426 3960 6107 3994 3121 1781 2989 1774
510 1774 2035 2695 1969 73 -608 -2836 208 -2478 -6855 -4896 -4582 -4356 -2494 -3182 -5159 -5042 -3212
493 -3212 -1011 3090 4938 -114 773 826 -2616 -2996 -2893 -1230 22 -407 -2862 189 1331 962 200
476 200 -1369 -1439 -856 -2539 -5634 -4800 -1845 -2191 -2142 -3200 -3939 -1195 786 -780 -264 -2669 -2484 -176
458 -176 -937 -2261 2006 4552 2557 2367 2363 -720 1235 3140 1744 -1437 -265 1560 -1216 691 2878
441 2878 1899 3981 5548 2799 2392 329 -2249 -1449 -2747 -4961 -2556 -1393 2181 3257 104 -907
425 -907 -1137 -1034 -2689 -2688 -1244 -1231 887 -234 -3282 -2682 -1112 292 5749 3266 3857 4729 5780 5826
407 5826 4549 1709 58 -1202 2722 5215 3079 1664 1400 1186 -766 -1186 -899 -4714 -7631 -7824
391 -7824 -4619 -4262 -3267 -793 1031 -1636 -2635 -1566 244 -1363 -3635 -4162 -3275 -3072 -1368 1217 305
374 305 -2659 -730 20 224 -521 1457 682 667 761 -392 -1218 2410 2562 340 1299 -178 926 2195
356 2195 1626 -871 -180 -1058 -2786 -1276 -821 -1963 -3566 -2212 -357 397 1775 -309 -4696 -3942 -3174
339 -3174 -3596 -2471 -2374 -754 650 -1433 -2488 -3512 -3820 -3421 644 3257 2839 -2477 -3315 -1253 455
322 455 -348 257 4907 2747 3141 6079 4327 -3626 -7927 -4946 -2907 -3129 -2892 -5649 -4948 -2612 -688
305 -688 -2773 -3059 -3966 -3383 -6467 -6512 -5038 -5008 -6049 -3317 -2426 -3362 -2112 -1003 1630 3199 5943 3738
287 3738 4931 3916 601 -917 -81 2822 4617 2482 -586 -2515 -1876 -4809 -6401 -4587 -1988 -3369
271 -3369 -5463 -3334 -1070 -3711 -6703 -4602 -1599 -2585 -2261 313 2962 1776 2936 2419 3131 4686
255 4686 4827 4723 5829 6705 7496 7821 4747 3452 4250 4575 6517 7299 2886 846 2855 3926 1435
238 1435 1542 983 767 1306 -407 -4446 -3681 -2159 -3686 -4343 -2612 1939 4236 1312 -646 537 -45
221 -45 -2216 -664 1263 2659 4702 5997 3606 727 -1604 -3442 -2023 846 -125 -1610 -922 -787
205 -787 2139 3355 2012 2415 3170 411 -357 2480 2330 223 -633 2424 5617 5989 7522 8603 6107
188 6107 787 364 2685 -1036 -666 1563 2561 2460 1942 -253 73 4149 8140 7325 6269 2882 1115
171 1115 636 577 2849 3134 -441 1199 686 619 -552 -2506 -1479 -1368 1041 1994 1170 1460 1960 -1295
153 -1295 -3480 -3244 -1518 528 -1813 -4585 -645 710 170 -2229 -3258 -3310 -4376 -2644 -522 -1939
137 -1939 -3369 -4772 -7563 -8918 -5661 -1641 -2680 -1643 -1465 -1122 -3721 -5244 -4810 -797 1875 336
121 336 -2747 -3481 -1645 -339 -1126 -1324 -2409 -1476 962 2525 1301 -844 -2684 -3008 -4234 -6038 -4436
104 -4436 -5298 -3960 -1081 245 2165 556 636 197 1094 2025 1847 274 2979 1763 299 -786 -3213
87 -3213 -3573 -1847 -564 2006 1171 1982 1138 -1049 781 -938 -4086 -1789 237 -1515 -1988 -2123 -3494
70 -3494 -4240 -3288 2143 1550 -2897 -5243 -3133 -143 302 -504 -3429 -3743 -522 1905 1397 778 464 1173
52 1173 3769 4323 4249 3833 1468 -60 344 597 755 2323 1550 -1193 -1943 -1208 -1701 -2854 -2547 -1052
34 -1052 1490 1336 1001 3305 1732 -48 -2920 -5235 -6345 -2722 136 -1125 -1751 1085 32 -1535
18 -1535 -1763 251 2375 5123 3466 1317 2501 2773 4575 5321 1591 949 269 1198 1763 1926 390
1 390 -3020
0 -3020
$$ Imaginary data points
##PAGE= N=2
##DATA TABLE= (X++(I..I)), XYDATA
32767 51296 49041 48996 47714 48286 51911 52840 54097 52148 51731 54830 59168 57884 57658 59609 61390 64480
32751 64480 65190 62900 61660 60374 58691 58175 62100 65918 64898 64772 62697 65150 67878 69449 72035
32736 72035 73885 75332 77882 76872 74629 73159 72509 71042 72037 76843 79529 78559 77142 75592 75664 79887
32720 79887 79959 82038 82850 83579 86428 85295 84628 87203 87973 90134 89835 91124 94665 92851 91414 90614
32704 90614 90563 92735 94344 97494 95752 95802 97823 98092 98055 95223 97556 95770 95577 97729 99897 99596 102009
32687 102009 102775 102606 105518 106194 106987 107806 107887 109701 110901 111614 111880 112113 112321 112923 111572 116347 120488
32670 120488 119576 117719 118282 116339 115391 116733 117997 116301 117041 119332 122694 124435 125074 123099 124173
32655 124173 123794 121725 121460 120378 120896 124751 126952 128809 130100 131045 131000 130661 131684 132890 134152 135642
32639 135642 138454 139383 139415 139047 137653 138563 139473 140113 141872 144020 145658 146317 146019 147360 146613 148434 146852
32622 146852 143730 144732 147787 147334 150253 150823 148330 143931 145056 144512 147972 152366 153715 152927 154563
32607 154563 154101 155102 155255 156300 156736 157464 157343 158958 161116 161651 159178 158299 158914 156813 156613 159022
32591 159022 161056 160872 162187 162687 162761 164320 169095 171525 170202 170939 167657 165423 167022 166971 167558 170859
32575 170859 172276 172397 173434 175943 176450 173563 172345 175981 178550 178744 177847 175772 174638 175741 176311
32560 176311 177209 177634 176640 174362 172123 177190 179612 177972 178592 179983 183411 187049 187269 187326 187711 186027
32544 186027 186920 187825 191703 194416 191393 189094 184700 186838 190476 190700 189919 191725 189623 191096 192808
32529 192808 195258 196177 196329 193219 186246 186577 190118 193436 194738 192786 194150 194818 196865 196590 193627
32514 193627 196393 203022 204451 204389 204327 204970 204472 204042 206424 209560 210850 211903 211311 207558 205361 206372
32498 206372 204717 204148 202967 202037 202999 203806 204287 203491 205453 205875 207312 212277 214914 216547 213704 211319
32482 211319 211403 211907 214427 214878 213299 212365 215536 218756 219389 217567 216625 217993 220891 222478 222015 220363
32466 220363 220812 223302 222201 220697 221328 220414 221251 222179 225323 225262 226044 226443 224750 225440 225479 228453 224239
32449 224239 224954 227454 225932 226156 226248 226160 225428 227999 231396 231590 229355 228980 227540 229597 231394 234020
32433 234020 232792 235363 234374 231460 230977 233558 232843 232251 232238 231150 228514 226872 227055 228477 229467 231369
32417 231369 234812 241077 238102 235987 235436 237192 238166 237445 239341 238797 234422 233357 237538 238605 237777
32402 237777 238557 239238 241280 241833 238960 236493 236236 237045 240442 243857 246063 245745 248840 251620 246298 241366
32386 241366 242781 246232 245762 246839 248538 247014 245017 245557 246079 246092 247269 247075 248505 249245 250193 247791
32370 247791 246313 248560 250951 249837 249492 248138 247836 248511 250070 247032 249397 247516 247138 249207 251419
32355 251419 249997 252889 253162 252885 255001 253554 251716 253370 253728 250351 250892 251276 251425 256155 258777 255624
32339 255624 252932 253492 256237 256836 258623 262795 264326 265208 263758 259330 255592 255540 258130 258498 256881 258014
32323 258014 253885 252328 254567 254801 253313 255102 258029 261019 260633 259267 264882 265582 263653 259517 252509
32308 252509 251983 249647 253855 256536 260635 264021 262907 261250 259881 258948 258244 257058 257532 258925 257256
32293 257256 257809 260202 258662 259444 260768 262955 264844 265437 264076 262108 259045 262135 261112 263157 263398
32278 263398 262523 264579 267021 263830 262592 265565 264998 261666 258687 263959 267477 268697 267624 266947 266910
32263 266910 267358 267823 264592 261731 262324 260801 258597 258584 261375 261464 264152 265358 263070 264417 265299 267507
32247 267507 269368 267740 266444 265393 265222 269865 268471 266479 270284 273155 268520 266523 268814 269041 267903
32232 267903 263859 260415 259230 261893 266562 268308 266961 267088 268448 267770 271895 275686 277039 273986 270397
32217 270397 267546 267079 265690 265857 269805 268872 267468 270510 271770 271488 268772 266827 268088 270827 273623
32202 273623 273001 271655 270731 273893 268911 264630 266293 268540 270046 267725 268801 267977 271012 268597 267716
32187 267716 268623 268696 267942 268387 267344 267464 265365 267029 270893 272822 272513 272712 274320 273272 272344 272938 276700
32170 276700 276608 276196 276064 275599 274529 275181 272876 269726 268796 270532 272751 273221 273800 271680 269637 270813
32154 270813 272668 275211 271734 269748 271633 275733 273977 269872 269312 271831 271975 272651 278443 281253 280097
32139 280097 279866 278077 275312 272978 272101 269365 268099 267614 269193 272161 273227 273630 271163 270661 271601 278054
32123 278054 278182 276667 276129 273754 275219 272846 272234 276021 277953 276170 271752 272697 276842 279834 276368
32108 276368 272538 271827 272741 276467 279192 280265 278555 275968 274482 276286 275797 278459 275870 274045 274422
32093 274422 274038 269080 268887 275589 276437 274876 274981 275339 272101 269755 271190 269021 270675 267239 268331
32078 268331 269821 274786 278588 277244 277757 275392 270841 270725 273539 276403 277456 274804 275137 275886 278643
32063 278643 280735 282115 281922 278190 273096 271753 271225 273019 272266 274670 276448 275612 278512 278368 274620
32048 274620 277666 279429 274819 270290 270915 271436 271456 274115 274755 274290 274162 277367 277051 273871 274953 272429
32032 272429 270096 272296 271351 269460 269709 268533 268859 271558 273462 274591 275270 275038 274312 276251 279935 278349
32016 278349 275970 276608 277976 275776 274376 276390 276658 275269 279118 277931 275771 275457 277873 278806 279938
32001 279938 279109 278330 278777 276255 275996 274933 274190 273413 276709 275238 275077 276989 274397 273850 273692 273953 269314
31984 269314 271724 268999 266800 267889 267006 272027 278237 281147 279382 278384 276883 277544 275223 273498 276630
31969 276630 277474 277418 276118 275405 277626 278261 281756 282667 279194 276418 275925 277528 276182 275894 272994 270533
31953 270533 272768 273495 274288 277004 275236 276786 281503 282981 280763 280018 280509 281728 283662 285647 287760
31938 287760 288199 284486 278125 275656 274555 273626 276064 273970 272468 279807 282714 280974 282768 279597 274821
31923 274821 272716 270996 270082 269695 272895 272077 269334 272332 275431 278482 279707 276943 272242 270984 272969
31908 272969 280222 279921 278656 276844 275793 278383 277586 275614 276067 275839 275339 275857 275596 273434 276719 279013
31892 279013 277638 274842 275273 277579 280359 280980 280159 275988 274664 275883 275667 277040 276722 275859 279418 276173
31876 276173 272154 271351 273391 276489 279535 282785 286324 287871 287298 281881 276391 276580 280514 280682 277015
31861 277015 275458 279092 284200 282501 279110 278687 279745 282456 283999 281298 280337 278749 276128 275316 273554
31846 273554 268874 270851 272266 274555 277743 276389 275920 278601 278974 276483 276533 276705 276769 276931 272909 270500
31830 270500 272159 276987 277510 275827 276306 278631 282880 284070 281227 274640 273396 280988 282148 279704 277068
31815 277068 275607 276507 277110 272544 275133 277696 280205 282679 282002 283602 284939 283185 280489 281486 283281
31800 283281 281903 281593 282935 280467 280256 282957 283116 278819 274672 275501 276808 279420 279564 277831 281505
31785 281505 280464 276344 272755 269683 270621 272531 274614 275859 278478 276948 278128 279847 277524 282572
31771 282572 285389 278329 275548 274609 276845 278109 278527 277670 275953 275873 275726 277939 276952 275571 274985 277230
31755 277230 279458 280777 279612 281953 284386 282897 284371 282655 280640 280525 278332 278745 279017 282169 282814
31740 282814 281775 279784 280302 278913 276704 277255 279330 276607 275998 282136 284173 286035 282609 282671 285350
31725 285350 283911 282444 283890 281078 280760 279347 278234 280088 283318 283789 284923 282913 281169 282054 281850
31710 281850 279923 277833 278090 281687 283424 281016 280031 280357 282834 283784 278269 276728 275183 273018 277598
31695 277598 277507 277933 279935 282543 283925 285477 282523 285672 281356 283562 284586 282080 280697 282236 281549
31680 281549 283721 286035 280272 278430 280914 279014 280662 281601 281190 280317 279959 284008 286073 284237 284171 287216
31664 287216 288980 285031 285056 287349 284155 280369 275624 273522 277626 281467 280260 279100 278615 283200 285395
31649 285395 284045 281521 280972 281946 279804 274659 273242 278108 281033 281672 280766 282915 287981 287611 281626
31634 281626 280604 280598 278843 281907 285459 287934 287282 286522 282381 281756 284558 285096 282953 279742 281296 281320
31618 281320 282133 282749 283015 282553 284701 286700 283722 280798 282230 283779 280363 281379 285760 284486 279921
31603 279921 278408 280920 284618 287413 289527 290019 285898 283969 286381 288162 287560 284670 285475 286417 287726
31588 287726 289331 290194 284685 281175 279393 281483 283240 283484 281556 279438 282394 281641 280222 277503 280139
31573 280139 281151 280015 281839 283560 282425 284485 283810 284934 285911 286466 280485 277845 281363 283065 282798
31558 282798 279451 282537 282724 284131 288380 286168 281503 279504 281419 284770 284115 282168 277337 278850 284194
31543 284194 286509 286710 288661 286716 282849 279576 280130 279471 283788 282248 280677 280458 282532 281294 280988
31528 280988 285521 286720 287088 290302 288016 281013 280326 279084 280565 284080 282676 283244 281705 282569 281100
31513 281100 281425 284348 283534 278628 276899 274915 278494 285910 295068 295297 291629 291190 288012 285088 282503
$$ [...]
##END NTUPLES=NMR SPECTRUM
##END=
