##TITLE=Analysis number 328049
Compound Code cc 55913
Book Reference 521/55
Project Code adrs
Chemist Name evam
##JCAMPDX= 6.0         $$ Bruker NMR JCAMP-DX V2.0
##DATA TYPE= NMR SPECTRUM
##DATA CLASS= NTUPLES
##ORIGIN= Bruker BioSpin GmbH
##OWNER= nmr
$$ XWIN-NMR		Version 3.5
$$ Fri Apr 27 11:28:35 2007 GMT Daylight Time (UT+1h)  MAYBRIDGE\nmr@NMR_250MHZ
##.OBSERVE FREQUENCY= 250.131544655141
##.OBSERVE NUCLEUS= ^1H
##.ACQUISITION MODE= SIMULTANEOUS (DQD)
##.ACQUISITION SCHEME= undefined
##.AVERAGES= 16
##.DIGITISER RES= 18
##SPECTROMETER/DATA SYSTEM= dpx250
##.PULSE SEQUENCE= zg30
##.SOLVENT NAME= CDCl3
##.SHIFT REFERENCE= (INTERNAL, CDCl3, 0, 16.522)
##AUDIT TRAIL= $$ (NUMBER, WHEN, WHO, WHERE, WHAT)
$$ ##TITLE= Audit trail, XWIN-NMR		Version 3.5
$$ ##JCAMPDX= 5.01
$$ ##ORIGIN= Bruker BioSpin GmbH
$$ ##OWNER= nmr
$$ C:\u/data/dgb/nmr/ADRS/3250/pdata/1/auditp.txt
$$ ##AUDIT TRAIL=  $$ (NUMBER, WHEN, WHO, WHERE, WHAT)
(   1,<2007-04-27 11:28:11.81 +100>,<MAYBRIDGE\nmr>,<NMR_250MHZ>,
      <created by zg, POWCHK disabled, PULCHK disabled
       configuration hash MD5:
       76 6E 9A 78 1E 09 19 81 EC 84 63 8F B0 6A 59 2D
       data hash MD5: 64K
       7B 95 91 00 9F 50 2C 8B B0 5C E4 54 60 E1 CA 23>)
(   2,<2007-04-27 11:28:26.05 +100>,<MAYBRIDGE\nmr>,<NMR_250MHZ>,
      <Start of raw data processing
       ef LB = 0.3 FT_mod = 6 PKNL = 1 SI = 32K 
       data hash MD5: 32K
       E6 51 8B 17 10 49 A5 D6 1E 5D D7 C8 F3 F0 E3 F6>)
(   3,<2007-04-27 11:28:27.85 +100>,<MAYBRIDGE\nmr>,<NMR_250MHZ>,
      <apk 
       data hash MD5: 32K
       A1 D0 44 08 D5 B1 8A 6D C7 EC 9A 0D 27 5B 31 56>)
(   4,<2007-04-27 11:28:28.69 +100>,<MAYBRIDGE\nmr>,<NMR_250MHZ>,
      <abs ABSG = 5 
       data hash MD5: 32K
       77 EB 69 99 48 27 10 98 AE 89 B8 AF 59 EC 5C CD>)
$$ ##END=
$$ 
$$ hash MD5
$$ FD 18 F9 A5 CD 40 51 F8 BC A4 D6 EB BE C1 19 B5
##$RELAX= 
##$RELAX= 
##$RELAX= 
##$RELAX= 
##$RELAX= 
##$RELAX= 
##$RELAX= 
$$ Bruker specific parameters
$$ --------------------------
##$DU= <C:\u>
##$EXPNO= 3250
##$NAME= <ADRS>
##$PROCNO= 1
##$TYPE= <nmr>
##$USER= <dgb>
##$AMP= (0..31)
100 100 100 100 100 100 100 100 100 100 100 100 100 100 100 100 100 100 
100 100 100 100 100 100 100 100 100 100 100 100 100 100 
##$AQSEQ= 0
##$AQ_mod= 3
##$AUNM= <au_zg>
##$AUTOPOS= <18 >
##$BF1= 250.13
##$BF2= 250.13
##$BF3= 250.13
##$BF4= 250.13
##$BF5= 500.13
##$BF6= 500.13
##$BF7= 500.13
##$BF8= 500.13
##$BYTORDA= 1
##$CFDGTYP= 0
##$CFRGTYP= 5
##$CHEMSTR= <none>
##$CNST= (0..31)
1 1 145 1 1 1 1 1 1 1 1 1 1 1 1 1 1 1 1 1 1 1 1 1 1 1 1 1 1 1 1 1 
##$CPDPRG= <>
##$CPDPRG1= <>
##$CPDPRG2= <>
##$CPDPRG3= <>
##$CPDPRG4= <mlev>
##$CPDPRG5= <mlev>
##$CPDPRG6= <mlev>
##$CPDPRG7= <mlev>
##$CPDPRG8= <mlev>
##$CPDPRGB= <>
##$CPDPRGT= <>
##$D= (0..31)
0 1 0 0 0 0 0 0 0 0.06 0 0 0 0 0 0 0.0002 0 0 0 0 0 0 0 0 0 0 0 0 0 0 
0 
##$DATE= 1177669690
##$DBL= (0..7)
120 120 120 120 120 120 120 120 
##$DBP= (0..7)
150 150 150 150 150 150 150 150 
##$DBP07= 0
##$DBPNAM0= <>
##$DBPNAM1= <>
$$ [...]
##$SUBNAM7= <"">
##$SUBNAM8= <"">
##$SUBNAM9= <"">
##$SW= 20.6930455092707
##$SWIBOX= (0..15)
0 0 3 0 0 0 0 0 0 0 0 0 0 0 0 0 
##$SW_h= 5175.983436853
##$TD= 65536
##$TD0= 1
##$TE= 683.16
##$TE2= 300
##$TE3= 300
##$TEG= 300
##$TL= (0..7)
0 120 120 120 120 120 120 120 
##$TP= (0..7)
150 150 150 150 150 150 150 150 
##$TP07= 0
##$TPNAME0= <>
##$TPNAME1= <>
##$TPNAME2= <>
##$TPNAME3= <>
##$TPNAME4= <>
##$TPNAME5= <>
##$TPNAME6= <>
##$TPNAME7= <>
##$TPOAL= (0..7)
0.5 0.5 0.5 0.5 0.5 0.5 0.5 0.5 
##$TPOFFS= (0..7)
0 0 0 0 0 0 0 0 
##$TUNHIN= 0
##$TUNHOUT= 0
##$TUNXOUT= 0
##$USERA1= <user>
##$USERA2= <user>
##$USERA3= <user>
##$USERA4= <user>
##$USERA5= <user>
##$V9= 5
##$VALIST= <valist>
##$VCLIST= <CCCCCCCCCCCCCCC>
##$VD= 0
##$VDLIST= <DDDDDDDDDDDDDDD>
##$VPLIST= <PPPPPPPPPPPPPPP>
##$VTLIST= <TTTTTTTTTTTTTTT>
##$WBST= 1024
##$WBSW= 4
##$XGAIN= (0..3)
0 0 0 0 
##$XL= 0
##$YL= 0
##$YMAX_a= 614176
##$YMIN_a= -685848
##$ZGOPTNS= <>
##$ZL1= 120
##$ZL2= 120
##$ZL3= 120
##$ZL4= 120
##$ABSF1= 16.522
##$ABSF2= -4.171173
##$ABSG= 5
##$ABSL= 3
##$ALPHA= 0
##$AQORDER= 0
##$ASSFAC= 0
##$ASSFACI= 0
##$ASSFACX= 0
##$ASSWID= 0
##$AUNMP= <proc_1d>
##$AZFE= 0.1
##$AZFW= 0.1
##$BCFW= 0
##$BC_mod= 0
##$BYTORDP= 0
##$COROFFS= 0
##$CY= 12.5
##$DATMOD= 1
##$DC= 0
##$DFILT= <>
##$DTYPP= 0
##$F1P= 14.0000005364418
##$F2P= -0.99999901652339
##$FCOR= 0.5
##$FTSIZE= 32768
##$FT_mod= 6
##$GAMMA= 0
##$GB= 0
##$INTBC= 1
##$INTSCL= 1
##$ISEN= 128
##$LB= 0.3
##$LEV0= 0
##$LPBIN= 0
##$MAXI= 10000
##$MC2= 0
##$MEAN= 0
##$ME_mod= 0
##$MI= 0
##$NCOEF= 0
##$NC_proc= -3
##$NLEV= 6
##$NOISF1= 0
##$NOISF2= 0
##$NSP= 0
##$NTH_PI= 0
##$NZP= 0
##$OFFSET= 16.522
##$PC= 1
##$PHC0= -52.35384
##$PHC1= 4.881177
##$PH_mod= 1
##$PKNL= yes
##$PPARMOD= 0
##$PSCAL= 4
##$PSIGN= 0
##$REVERSE= no
##$SF= 250.13
##$SI= 32768
##$SIGF1= 0
##$SIGF2= 0
##$SINO= 400
##$SIOLD= 32768
##$SREGLST= <1H.CDCl3>
##$SSB= 0
##$STSI= 32768
##$STSR= 0
##$SW_p= 5175.98343685301
##$SYMM= 0
##$S_DEV= 0
##$TDeff= 65536
##$TDoff= 0
##$TI= <Analysis number 999999
Compound Code 99
Book Reference 9
Project Code 9>
##$TILT= no
##$TM1= 0
##$TM2= 0
##$TOPLEV= 0
##$USERP1= <user>
##$USERP2= <user>
##$USERP3= <user>
##$USERP4= <user>
##$USERP5= <user>
##$WDW= 1
##$XDIM= 32768
##$YMAX_p= 409389777
##$YMIN_p= -141344
$$ End of Bruker specific parameters
$$ ---------------------------------
##NTUPLES= NMR SPECTRUM
##VAR_NAME=  FREQUENCY,     SPECTRUM/REAL,   SPECTRUM/IMAG
##SYMBOL=    X,             R,               I
##VAR_TYPE=  INDEPENDENT,   DEPENDENT,       DEPENDENT
##VAR_FORM=  AFFN,          ASDF,            ASDF
##VAR_DIM=   32768,         32768,           32768
##UNITS=     HZ,            ARBITRARY UNITS, ARBITRARY UNITS
##FACTOR=    0.157963299565203, 1,           1
##FIRST=     4132.6476996994, 0,             0
##LAST=      -1043.33573715361, 0,           0
##MIN=       -1043.33573715361, -141344,     0
##MAX=       4132.6476996994, 409389777,     0
$$ Real data points
##PAGE= N=1
##DATA TABLE= (X++(R..R)), XYDATA
$$ [...]
16246c5254L162J0345K452k352L037K1387J1887l276P78m166M298L23R482k159
$$ -35254 -32092 -21747 -19295 -21647 -18610 2777 14664 11388 12166 8000 12298 12621 22103 19944
16232A9944j7895j9461N446K9997R443j8732o017p150j0643m712l115R451L768
$$ 19944 2049 -17412 -11966 18031 27474 8742 2725 -4425 -15068 -19780 -22895 -13444 -9676
16219i676J6149l882q199O721r481k662m133O17J1885N736j9334k598J440L47
$$ -9676 6473 2591 -5608 1113 -8368 -11030 -15163 -14546 -2661 3075 -16259 -18857 -17417 -17070
16205a7070q554r439j01M267L478k779j5060R665R015M416O432Q795O130m749
$$ -17070 -25624 -35063 -35164 -30897 -27419 -30198 -45258 -35593 -26578 -22162 -15730 -6935 -805 -5554
16191e554N846n984j0772j2307K647J5159L740j3007m704P456O227j481q065J069
$$ -5554 292 -5692 -16464 -28771 -26124 -10965 -7225 -20232 -24936 -17480 -11253 -12734 -20799 -19730
16177a9730R979N718m579l914L594n755o222O0P145J3606n298p656R0M841N559
$$ -19730 -9751 -4033 -8612 -12526 -8932 -14687 -20909 -20849 -13704 -98 -5396 -13052 -12962 -8121 -2562
16162b562M469J362M721J810q512m268j6676K787k05l294j0786J356J6464M822
$$ -2562 1907 3269 7990 9800 1288 -2980 -19656 -16869 -17074 -20368 -31154 -29798 -13334 -8512
16148h512j3612k436J5698M504L989j0877j2329J0075P309j867L27n427J4759
$$ -8512 -22124 -24560 -8862 -4358 -369 -11246 -23575 -13500 -6191 -8058 -7731 -13158 1601
16135A601J2066n472m917R862q047j1315j4992N31Q874j1658k230J0147j916P794
$$ 1601 13667 8195 3278 13140 5093 -6222 -21214 -20683 -11809 -23467 -25697 -15550 -17466 -9672
16121i672O41j3546M404P739J0443j0837k233j447p024M664J4745M818l294r267
$$ -9672 -9031 -22577 -18173 -10434 9 -10828 -13061 -14508 -21532 -16868 -2123 2695 -599 -9866
16107i866j147n8m565J0716Q947J2445M49j6730j4209n038J4990P386J0891L758
$$ -9866 -11013 -11071 -15636 -4920 4027 16472 16921 191 -14018 -19056 -4066 3320 14211 17969
16093A7969j5166J1254J7975n165p223m862j4385m671P386m659n076q155j4908
$$ 17969 2803 14057 32032 26867 19644 14782 397 -4274 3112 -1547 -6623 -14778 -29686
16080b9686O216N220J759L911M189O352K566o492l643p16p529j874l249K804J9210
$$ -29686 -23470 -18250 -16491 -12580 -8391 -2039 527 -5965 -9608 -10324 -17853 -19727 -22976 -20172 -962
16065i62J979N721j5666l056m415P190J0414n795k545Q145Q25R496o04m185j15
$$ -962 1017 6738 -8928 -11984 -16399 -9209 1205 -4590 -7135 1010 1835 11331 10727 6542 6427
16050F427j2748o032R22O434P713q345q668r12N302J367J165L859L607J2957m702
$$ 6427 -6321 -12353 -11431 -4997 2716 -5629 -14297 -15209 -9907 -8540 -7375 -3516 91 13048 8346
16035H346J8q052j1437L612k656M424l855r507J052J0376J779q82M208n076n495
$$ 8346 8364 312 -11125 -7513 -10169 -5745 -9600 -19107 -18055 -7679 -5900 -6782 -2574 -7650 -13145
16020a3145l571N096L934J1101N044j5091j8598J3781K6067j548p769M362J357
$$ -13145 -16716 -11620 -7686 3415 8459 -6632 -25230 -11449 14618 13070 5301 9663 11020
16007A1020q743j6723r779J4408J2869j429m116J689K998J6739m620p125m77m034
$$ 11020 2277 -14446 -24225 -9817 3052 1623 -2493 -804 2194 18933 14313 7188 6711 2677
15993B677J69J8332P912k0433k3713J625J2089l407q371K970J3235R516j3528
$$ 2677 2846 21178 29090 8657 -15056 -13431 -1342 -4749 -13120 -10150 3085 12601 -927
15980i27j6815J097N086j0227J1415J8166R320p447J69j4808m668l249n190J5088
$$ -927 -17742 -16645 -11559 -21786 -10371 7795 17115 9668 9837 -4971 -9639 -12888 -18078 -2990
15966b990J0632k620j4774q454m134J6609K3458j1346p101N048J0421N012j552
$$ -2990 7642 5022 -9752 -18206 -22340 -5731 17727 6381 -720 4328 14749 19761 18209
15953A8209l51P5j3857p473R127K952L921l852r717j252J795P155j216j22L7q103
$$ 18209 17858 17933 4076 -3397 5730 8682 12603 8751 -966 -2218 -423 6732 5516 5394 5431 -2672
15937b672j6371p724J5558J0892n302P121K31n30n544k4732O403J7930O771M589
$$ -2672 -19043 -26767 -11209 -317 -5619 1502 1733 1203 -4341 -29073 -22670 -4740 2031 6620
15923F620L748j4427k4659o76J4459K746J881O469N375P813l304j7621j90P688
$$ 6620 10368 -4059 -28718 -29394 -14935 -12189 -10308 -3839 1536 9349 6045 -11576 -11766 -4078
15909d078R33J656J4494J758l916m793k294j1603l847R053J5837m967r063N914
$$ -4078 -3145 -1489 13005 14763 10847 6054 3760 -7843 -11690 -2637 13200 8233 -830 5084
15895E084p815J836j381k021J2263N265l038k77L670n704r457K829J2929P87K170
$$ 5084 -2731 -895 -2276 -4297 7966 13231 10193 9916 13586 7882 -1575 1254 14183 14970 17140
15880A7140o56r233o17K873Q27k777p901n68p64p836J333N503J0271Q289j5120
$$ 17140 16484 7251 6634 9507 10334 7557 -344 -912 -1676 -9512 -8179 -2676 7595 15884 764
15865G64k382J462K706P772J605r356K414n391K7r01R6J160O372M217K420l882
$$ 764 -1618 -156 2550 10322 11927 2571 4985 -406 -379 -1280 -1184 -24 6348 10565 12985 9103
15849I103n656p44j4937L359N489j0609m326k097J2735O783j3552q738N728N553
$$ 9103 3447 2703 -12234 -8875 -3386 -13995 -18321 -20418 -7683 -900 -14452 -23190 -17462 -11909
15835a1909p505j503N586J2091K237p957j8861j6873J3961J5270J638L203n397
$$ -11909 -19414 -20917 -15331 -3240 -1003 -8960 -27821 -44694 -30733 -15463 -13825 -10622 -16019
15822a6019n938Q876R226m919j3532j857R057J5435k658j0390j1399l545j6q81
$$ -16019 -21957 -13081 -3855 -8774 -22306 -24163 -15106 329 -2329 -12719 -24118 -27663 -27679 -28560
15808b8560M735k778J9327p949p463O798Q676P06q072l527P607M042J949P020
$$ -28560 -23825 -26603 -7276 -15225 -22688 -15890 -7214 -6508 -14580 -18107 -10500 -6458 -4509 2511
15794B511J0850j0009r061K490J3544J4037L486N977k718j6065r515r922k209
$$ 2511 13361 3352 -5709 -3219 10325 24362 27848 33825 31107 15042 5527 -4395 -6604
15781f604j1129M385J3937j195J106P373o737k43Q881J2881n21k3599k7902l462
$$ -6604 -17733 -13348 589 -606 500 7873 1136 893 9774 22655 22134 -1465 -29367 -32829
15767c2829N650O375M093j942M125N87j1219J2120J3148M700n101l488o085J313
$$ -32829 -27179 -20804 -16711 -18653 -14528 -13941 -25160 -13040 108 4808 -293 -3781 -9866 -8553
15753h553q25j035P651q982M014K1128O33k606J46m05K671j0090j4021j2043j351
$$ -8553 -9378 -10413 -2762 -11744 -7730 13398 14031 11425 11571 11166 13837 3747 -10274 -22317 -23668
15738b3668K1031j683K566r983j0017r802J0916J1918L387o273p079Q885m587
$$ -23668 -2637 -4320 -1754 -11737 -21754 -31556 -20640 -8722 -5335 -11608 -18687 -9802 -14389
15725a4389l13j697J024Q684l110n693l107j799p290N241J764L075K1579R896
$$ -14389 -14702 -16399 -15375 -6691 -9801 -15494 -18601 -20400 -27690 -22449 -20685 -17610 3969 13865
15711A3865q937j0140M904k837J46j4015j160Q669P867J1457m679j0336l616j60
$$ 13865 4928 -5212 -308 -3145 -2999 -17014 -18174 -9505 -1638 9819 5140 -5196 -8812 -8972
15697h972L737J3225m68j2291J504Q100n866o166m491L803Q942N550o435o174
$$ -8972 -5235 7990 7522 -4769 -3265 4835 -1031 -7197 -11688 -7885 1057 6607 172 -6002
15683f002O283J2470l637n068q623L082j710j2963k983j098o685J7272J1972k0253
$$ -6002 281 12751 9114 4046 -4577 -1495 -3205 -16168 -19151 -20249 -26934 -9662 2310 -17943
15669a7943o045J1979O998o967j620j750J2486p943n678J8480j907k822j1174
$$ -17943 -23988 -12009 -5011 -11978 -13598 -15348 -2862 -10805 -16483 1997 90 -2732 -13906
15656a3906q602J0356j454J1245O29p823r813j818L109r161M496R870N065k54
$$ -13906 -22508 -12152 -13606 -2361 -1732 -9555 -19368 -21186 -18077 -27238 -22742 -12872 -7807 -8061
15642h061o002k029R895J1554j3229j2926L943M865q297p279n280J0786R81Q463
$$ -8061 -14063 -16092 -6197 5357 -7872 -20798 -16855 -11990 -20287 -27566 -32846 -22060 -21079 -12616
15628a2616L934j5517j9502O711K3914k905j1870J4104j4663n577O971R711j0833
$$ -12616 -8682 -24199 -43701 -36990 -13076 -15981 -27851 -13747 -28410 -33987 -27016 -17305 -28138
15615b8138M900N314L598J043K710k773q36J778k814j152J58m760O162J3580J474
$$ -28138 -23238 -17924 -14326 -13283 -10573 -13346 -14182 -12404 -15218 -16370 -16212 -20972 -14810 -1230 244
15600B44n499r626r1K456N914p223o622q66J3559Q382q83k672j9764P238J507
$$ 244 -5255 -14881 -14972 -12516 -6602 -13825 -20447 -21313 -7754 628 -255 -2927 -22691 -15453 -13946
15585a3946m880N937J5955p52o512q141J0392k946l986M356q536j1799p26l950
$$ -13946 -18826 -12889 3066 2314 -4198 -12339 -1947 -4893 -8879 -4523 -13059 -24858 -25584 -29534
15571b9534l103k506M068J3870j691j0001M124O452j2275Q90Q895J2635M682o799
$$ -29534 -32637 -35143 -31075 -17205 -18896 -28897 -24773 -18321 -30596 -29706 -20811 -8176 -3494 -10293
15557a0293l689N479R111J237K7007J0158j5167q931J1l47j2940n362p211n490
$$ -10293 -13982 -8503 608 1845 28852 39010 23843 14912 14923 14576 1636 -3726 -10937 -16427
15543a6427l487J940Q692n580r726J5344Q091n87o028j1898L120J2974P669q032
$$ -16427 -19914 -17974 -9282 -14862 -24588 -9244 -1153 -1740 -7768 -19666 -16546 -3572 4097 -3935
15529c935o635q899m578J1986K236j0492M588K728m744j611k320K613Q784k144
$$ -3935 -10570 -19469 -24047 -12061 -9825 -20317 -15729 -13001 -17745 -19356 -21676 -19063 -10279 -12423
15515a2423r62Q462N897n262n27R038P616n602k191Q901l759m976o031j3689m135
$$ -12423 -13385 -4923 974 -4288 -4815 4223 11839 6237 4046 12947 9188 4212 -1819 -15508 -19643
15500a9643M210n730N150M990j076q362L164N265K0411J0173K009M20K764p716
$$ -19643 -15433 -21163 -16013 -11023 -12099 -20461 -17297 -12032 8379 18552 20561 20981 23745 16029
15486A6029j3202j0781N150J1355n900p653O798K704n872r990J095J2796J5022
$$ 16029 2827 -7954 -2804 8551 2651 -5002 1796 4500 -1372 -11362 -10267 2529 17551
15473A7551l176q414O068q856J495K99J70k044m454L23k671J263q257m514M596
$$ 17551 14375 5961 12029 3173 4668 4967 5137 3093 -1361 -1038 -3709 -2446 -10703 -15217 -10621
15458a0621J4713j2065j8533k608K3111K2195p335Q94J0727m192n995p700j6325
$$ -10621 4092 -7973 -26506 -29114 -6003 16192 8857 9751 20478 16286 10291 2591 -13734
15445a3734R929J0120q445J0514L767k825l57r892Q405J271j1386o647m596j1096
$$ -13734 -3805 6315 -2130 8384 12151 9326 8969 -923 7482 8753 -2633 -9280 -13876 -24972
15431b4972l37m604J3965J310n63n169j717j552M053j2580Q629j909L488k241
$$ -24972 -25309 -29913 -15948 -14638 -15201 -20370 -22087 -23639 -19586 -32166 -23537 -25446 -21958 -24199
15417b4199j585J514J1097L926J5270P633O12j006j4906o716R943r015r408R030
$$ -24199 -25784 -24270 -13173 -9247 6023 13656 14268 13262 -1644 -8360 1583 -7432 -16840 -7810
15403g810J9862l02o596M315j7599m612J0744L20j0597m337J2119k198K612N589
$$ -7810 12052 11750 5154 9469 -8130 -12742 -1998 -1678 -12275 -16612 -4493 -6691 -4079 1510
15389A510o248j8146J7215J3237O540l084n935J1595j6019o495m778J039J4661
$$ 1510 -4738 -22884 -5669 7568 14108 11024 5089 16684 665 -5830 -10608 -9569 5092
15376E092k43n240k130r136o98N905Q938L634P820o026k4105L392J844k593r949
$$ 5092 4849 -391 -2521 -11657 -12355 -6450 2488 6122 13942 7916 -16189 -12797 -10953 -13546 -23495
15361b3495Q824J0003N464k607n174M785R690j1062j0261q145j2361J4573N920
$$ -23495 -14671 -4668 796 -1811 -6985 -2200 7490 -3572 -13833 -21978 -34339 -19766 -13846
15348a3846l415j209J1771J672l073M295M982r048K174m13q762k438J0574j518
$$ -13846 -17261 -18470 -6699 -5027 -8100 -3805 1177 -7871 -5697 -6110 -14872 -17310 -6736 -8254
15334h254j43q977L835O631j3006L388J448Q386M681j177o331m820q558o430J8582
$$ -8254 -8397 -17374 -13539 -6908 -19914 -16526 -15078 -6692 -2011 -3188 -9519 -14339 -22897 -29327 -10745
15319a0745J3017L753r985l088K3091K808j1405Q45m264m103J485J0441l683K697
$$ -10745 2272 6025 -3960 -7048 16043 18851 7446 8291 4027 -76 1409 11850 8167 10864
15305A0864k110R024l459j0020r280n034n043R202m652J0492O614P239o461j1170
$$ 10864 8754 17778 14319 4299 -4981 -10015 -15058 -5856 -10508 -16 6598 13837 7376 -3794
15291c794L530N911j2049j8292J405N307k049R557k132j1645J0628L527M777Q18
$$ -3794 -264 5647 -6402 -24694 -23289 -17982 -20031 -10474 -12606 -24251 -13623 -10096 -5319 -4501
15277d501l313J40N790p94N12P172P506k0043j3155n33Q921R876N6k0726J360
$$ -4501 -7814 -7674 -1884 -2678 -2166 5006 12512 -7531 -20686 -21219 -12298 -2422 -2366 -23092 -21732
15262b1732M956P679r312n847J819J1768P669Q991J3434r23j5750p239q13K258
$$ -21732 -16776 -9097 -18409 -24256 -22437 -10669 -3000 5991 19425 18502 2752 -4487 -5300 -3042
15248c042j2369n688P074n32J6164j3448j7884M380J9173K889k644n697Q54J524
$$ -3042 -15411 -21099 -14025 -14557 1607 -11841 -29725 -25345 -6172 -3283 -5927 -11624 -10770 -9246
15234i246M712j5145k326q673q022J1289Q199q086P31J3542L064J764j4512k623
$$ -9246 -4534 -19679 -22005 -30678 -38700 -27411 -19212 -27298 -26567 -13025 -9961 -8197 -22709 -25332
15220b5332J7297R929j543P195k184J8642r341j1641M122m247L581P84p455r037
$$ -25332 -8035 1894 351 7546 5362 24004 14663 3022 7144 2897 6478 7262 -193 -9230
15206i230N143N988n372q544J7170J044L91J2698o571l82m739j4744J24K765J1693
$$ -9230 -4087 1901 -3471 -12015 5155 6199 6590 19288 12717 12335 7596 -7148 -7024 -4259 7434
15191G434K749j4988M337j876j5267q714L708Q781k69Q64k093L388n814J0812
$$ 7434 10183 -4805 -468 -2344 -17611 -26325 -22617 -13836 -14105 -13241 -15334 -11946 -17760 -6948
15177f948L331L815O895J277N347k0278j2593p19M62k80J5500j387j7493q437
$$ -6948 -3617 198 7093 8370 13717 -6561 -19154 -19873 -19411 -19691 -4191 -5578 -23071 -31508
15163c1508J99J1726J8078R525j2007j0466J9562M008n782K766r296r112k768
$$ -31508 -31309 -19583 -1505 8020 -3987 -14453 5109 9117 3335 6101 -3195 -12307 -15075
15150a5075n800j2336R746J4456l536O669Q331O365M320L546j8848r235k643m280
$$ -15075 -20875 -33211 -23465 -9009 -12545 -5876 2455 8820 13140 16686 -2162 -11397 -14040 -18320
15136a8320J1381J1206l464j1416j1582J272J3179K450K820k652n511l513J1579
$$ -18320 -6939 4267 803 -10613 -22195 -20923 -7744 -5294 -2474 -5126 -10637 -14150 -2571
15123b571N066m79K694l365o168P356n884K788Q192M690j286K060P766o172o620
$$ -2571 2495 2016 4710 1345 -4823 2533 -3351 -563 7629 12319 11033 13093 20859 14687 8067
15108H067J1220N18k9070j120M346M050Q187N08o712p024L763J8647L941r247
$$ 8067 19287 19805 -9265 -10385 -6039 -1989 6198 6706 -6 -7030 -3267 15380 19321 10074
15094A0074p38j3388N224Q515K753l190k930N985J0013q479l930l556j3252j0607
$$ 10074 9336 -4052 1172 9687 12440 9250 6320 12305 22318 13839 9909 6353 -6899 -17506
15080a7506o536J2851l124L975Q107J2809O937q553j2168N99M564L206j3229k449
$$ -17506 -24042 -11191 -14315 -10340 -2233 10576 17513 8960 -3208 -2609 1955 5161 -8068 -10517
15066a0517q582o193P119J3055N872j3050p524M978M735o725J551R662n201L674
$$ -10517 -19099 -25292 -18173 -5118 754 -12296 -19820 -14842 -10107 -16832 -15281 -5619 -10820 -7146
15052g146J675M033k568k963k61k165J0735k594j1603k75M392r06J409M210k626
$$ -7146 -5471 -1438 -4006 -6969 -7230 -9395 1340 -1254 -12857 -13132 -8740 -9646 -8237 -4027 -6653
15037f653m973P179J128j2101l729J4010j002o842k90P535k372j3200K99J0780
$$ -6653 -11626 -4447 -3319 -15420 -19149 -5139 -6141 -12983 -13273 -5738 -8110 -21310 -21011 -10231
15023a0231J4769j210o301Q27n018o520K211L156J7081r07k060J6995J683M71
$$ -10231 4538 3328 -2973 -2146 -7164 -13684 -11473 -8317 8764 7857 5797 22792 24475 24946
15009B4946j7517j4576q431J4940O722M014m28K162j3500l135m306R848j2252
$$ 24946 7429 -7147 -15578 -638 6084 10098 9670 11832 -1668 -4803 -9109 739 -11513
14996a1513M69P959J4549K584k608k915J71j4008O490j2447q801m008K153M139
$$ -11513 -11044 -3085 11464 14048 11440 8525 8696 -5312 1178 -11269 -20070 -24078 -21925 -17786
14982a7786r103M368J8492K0190K481j3335p398p271r99J6286j1494o472k318
$$ -17786 -26889 -22521 -4029 16161 18642 5307 -2091 -9362 -10361 5925 -5569 -12041 -14359
14969a4359p367o874N058L043L299J9967q992q770J1030Q341L30j1197N591j102
$$ -14359 -21726 -28600 -23542 -20499 -17200 2767 -6225 -14995 -3965 4376 4706 -6491 -900 -2002
14955b002q112o713j7835L726J0732R353J2524P975L70j0610J659L064m089N598
$$ -2002 -10114 -16827 -34662 -30936 -20204 -10851 1673 9648 10018 -592 1067 4131 42 5640
14941E640m581o107K0777Q206k1139k0874j0558p231J4777M150M65J027J0435
$$ 5640 1059 -5048 15729 23935 2796 -18078 -28636 -35867 -21090 -16940 -16475 -15448 -5013
14928e013j0924l186P418J1301r28J3936k125n059m441n462J0972J1030L345K246
$$ -5013 -15937 -19123 -11705 -404 -1332 12604 10479 5420 979 -4483 6489 17519 20864 23110
14914B3110K027n635p291j4199Q742o740J974K881K34J551M73J064L81R291n097
$$ 23110 25137 19502 12211 -1988 6754 14 1988 4869 5103 6654 7127 8191 8572 17863 12766
14899A2766L47k052p794N676K291j548m457j944K827o318j6817n034J1173J2834
$$ 12766 13113 11061 3267 8943 11234 9686 5229 3285 6112 -206 -17023 -22057 -10884 1950
14885A950J1097J5148O835K524k670k5166n015J470K719R737k957K99j2739q735
$$ 1950 13047 28195 35030 37554 34884 9718 4703 6173 8892 18629 15672 15971 3232 -5503
14871e503p178M248j9606p387R324J3181K594n934L210Q815l858J021j4160p406
$$ -5503 -12681 -8433 -28039 -35426 -26102 -12921 -10327 -16261 -13051 -4236 -8094 -7073 -21233 -28639
14857b8639L891M501J6700J1683J40K2o639m31Q959j255O036p267j1670P644M719
$$ -28639 -24748 -20247 -3547 8136 8276 8298 1659 1228 10187 8932 14968 7701 -3969 3675 8394
14842H394j0842k872q204J69M451J0971K491J064m644j0914J700J5945p56j6692
$$ 8394 -2448 -5320 -13524 -13355 -8904 2067 4558 5622 978 -9936 -8236 7709 6953 -9739
14828i739M672J6142k178j6077q195J4376J4317o907j3446j846J3214M078j859
$$ -9739 -5067 11075 8897 -7180 -15375 -999 13318 6411 -7035 -8881 4333 8411 6552
14815F552l414r943r671R665J2483o592J038M70P39m247j724K244J5633R571J934
$$ 6552 3138 -6805 -16476 -6811 5672 -920 118 588 1327 -2920 -4644 -2400 13233 22804 24738
14800B4738j9819j4385Q695j000m702p73J666l243k811p57J40l403J3312R558
$$ 24738 4919 -9466 -771 -1771 -6473 -7246 -5580 -8823 -11634 -12391 -12251 -15654 -2342 7216
14786G216k394j344J0755k61j2955j2790K242J8660L112p396j5550M564k678M696
$$ 7216 4822 3478 14233 13972 1017 -11773 -9531 9129 12241 4845 -10705 -6141 -8819 -4123
14772d123j1910j0599J1804J0698P160N609L449J557j802j4086m32q517J0406
$$ -4123 -16033 -26632 -14828 -4130 3030 8639 12088 13645 11843 -2243 -2675 -11192 -786
14759g86K616j2142P689O065M115K453J889l468q791j4417p360J1292J929j1289
$$ -786 1830 -10312 -2623 3442 7557 10010 11899 8431 -360 -14777 -22137 -10845 -8916 -20205
14745b0205L888P944Q790J4408R893j756j0854L729J2630O941j1007j7401l619
$$ -20205 -16317 -8373 417 14825 24718 22962 12108 15837 28467 35408 24401 7000 3381
14732C381l282L511P188j1489n202R644R898k550o056K55P309l583j338R406J1210
$$ 3381 99 3610 10798 -691 -5893 3751 13649 11099 5043 5298 12607 9024 7686 17092 28302
14717B8302l368L789R229J204j034L390p69j2122J116L909Q575m094p296n154
$$ 28302 24934 28723 37952 39156 38122 41512 40743 28621 29737 33646 42221 38127 30831 25677
14703B5677k631q716M890K137R761j532j6197j490j0520J2685O890M630q855k0673
$$ 25677 23046 14330 19220 21357 31118 29586 13389 11899 1379 14064 20954 25584 16729 -3944
14689c944n689j4683l15O495J211k516N225L570j1377K709J2858K075L428n216
$$ -3944 -9633 -24316 -24631 -18136 -16925 -19441 -14216 -10646 -22023 -19314 -6456 -4381 -953 -6169
14675f169O15K845P117M546L662n016j3649L143J771O619p229j2474n927k785
$$ -6169 -5554 -2709 4408 8954 12616 7600 -6049 -2906 -1135 5484 -1745 -14219 -20146 -22931
14661b2931R092o806M436N025J641R181R576O633r230k173Q677o782j088m840
$$ -22931 -13839 -20645 -16209 -11184 -9543 -362 9214 15847 6617 4444 13121 6339 5251 411
14647D11k933J1414J1387j4482K97J0811o178K95l687j717l934n542Q85O566P435
$$ 411 -2522 8892 20279 5797 6094 16905 10727 11022 7335 5618 1684 -3858 -2973 3593 11028
14632A1028J257L768L956k608J60n489p420J0177n89m665k402j2955k092n746
$$ 11028 12285 16053 20009 17401 17561 12072 4652 14829 14240 9575 7173 -5782 -7874 -13620
14618a3620j192J2042l523l942J1970J3758k097l910l780J3989J0287k1335j4361
$$ -13620 -14812 -2770 -6293 -10235 1735 15493 13396 9486 5706 19695 29982 8647 -5714
14605e714L651N388L176L12J3755O399m094n715q1M035o263m110p411l740L391
$$ -5714 -2063 3325 6501 6813 20568 26967 22873 17158 17077 21112 14849 10739 3328 -412 2979
14590B979k744j864N223Q742o005Q636O371o98k2166j8174M309j686M194M426
$$ 2979 235 -1629 3594 12336 6331 14967 21338 20640 -1526 -19700 -15391 -17077 -12883 -8457
14576h457r83J9073J2737o566O210L132m455J378p728k482J2676M082j5694K405
$$ -8457 -9440 9633 22370 15804 22014 25146 20691 22069 14341 11859 24535 28617 12923 15328
14562A5328J577q857j3042j821m495J8616O405J3435n256o115j1029l984O684
$$ 15328 16905 8048 -4994 -6815 -11310 7306 13711 27146 21890 15775 4746 762 7446
14549G446J3449K0536n367j0193k8667j4222J5307J4877N591p250r280j3363Q010
$$ 7446 20895 41431 36064 25871 -2796 -17018 -1711 13166 18757 11507 2227 -11136 -3126
14536c126K0094l998N830j518j2207N263q823K046J5336R210o340j6096n256j028
$$ -3126 16968 12970 18800 17282 5075 10338 1515 3561 18897 28107 21767 5671 415 -613
14522f13J5174R764j3002j2089j0733j1220o241l45J4153J0036J5644p358q473
$$ -613 14561 24325 11323 -766 -11499 -22719 -28960 -29305 -15152 -5116 10528 3170 -5303
14509e303l666O168O109P446O083O10K123L300o240K236L076L118M558J070j7201
$$ -5303 -8969 -2801 3308 10754 16837 17447 19570 22870 16630 18866 21942 25060 29618 30688 13487
14494A3487j3180n355m067m586L582Q312J3585J3485R69J67k1688k3499P974j3392
$$ 13487 307 -5048 -9115 -13701 -10119 -1807 11778 25263 26232 26399 4711 -18788 -10814 -24206
14480b4206k216P446P355n17J8319N197q21O089n569k671j2523J111l257M643
$$ -24206 -26422 -18976 -11621 -12138 6181 11378 10557 16646 11077 8406 -4117 -3006 -6263 -1620
14466a620P343n247k53m278l349M899J7790J082K632j8155K062J1059O582J500
$$ -1620 5723 476 223 -4055 -7404 -2505 15285 16367 18999 844 2906 13965 20547 22047
14452B2047o605O91j0435q926k402J2232N233Q019j0509r242n427K227j5721M180
$$ 22047 15442 16133 5698 -3228 -5630 6602 11835 19854 9345 103 -5324 -3097 -18818 -14638
14438a4638L651k97J4081J3886R280P358j4261j1291l839j1935J3511J1375K738
$$ -14638 -10987 -11284 2797 16683 25963 33321 19060 7769 3930 -8005 5506 16881 19619
14425A9619j7452M726J7425J2238j0624p706j0872o040K281N944J3270k086q40
$$ 19619 2167 6893 24318 36556 25932 18226 7354 1314 3595 9539 22809 20723 19883
14412A9883J7570j1026j9509m90J915j3364J6967M356L560N541n127Q527J5303
$$ 19883 37453 26427 6918 6428 8343 -5021 11946 16302 19862 25403 20276 28803 44106
14399D4106j6482R57n758l2l790k732r345j615n475m93P420J2839J2385o73j4224
$$ 44106 27624 28581 22823 22791 19001 16269 6924 5309 -166 -659 6761 19600 31985 31312 17088
14384A7088p98j824j851K414j4122j3035J3359J3825N760J187j2506m961N329
$$ 17088 16290 14466 12615 15029 907 -12128 1231 15056 20816 22003 9497 4536 9865
14371I865K648J46j7684J5024J9994M822q57j4543n893j2814L269J8510K052j5850
$$ 9865 12513 12659 -5025 9999 29993 34815 33958 19415 13522 708 3977 22487 24539 8689
14357H689n776P229J0109J7444L053j6930j4857O371J2219K431j2527j4101m344
$$ 8689 2913 10142 20251 37695 40748 23818 8961 15332 27551 29982 17455 3354 -990
14344i90k578O632R886R003p931j6566P601q090j2941M108K5831O868p561O751
$$ -990 -3568 3064 12950 21953 14022 -2544 5057 -3033 -15974 -11866 13965 20833 13272 20023
14330B0023m762O47q81j811j9066m277q624J1666J4369P69J5797J4549O2j846
$$ 20023 15261 15908 15027 13216 -5850 -10127 -18751 -7085 7284 8053 23850 38399 38461 36615
14316C6615j4296m821R7m444J0096p05j4191r981j1559N545M005j0586K177L928
$$ 36615 22319 17498 17595 13151 23247 22542 8351 -1630 -13189 -7644 -3639 -14225 -12048 -8120
14302h120r495M013N800M44P10J0443j199K337Q874P494j379r848Q325L605k773
$$ -8120 -17615 -13602 -7802 -7358 -6648 3795 2596 4933 13807 21301 19922 10074 18399 22004 19231
14287A9231K966N92j0294j1506M38l427l695O407K955Q126J513n16M028m422n123
$$ 19231 22197 22789 12495 989 1427 -2000 -5695 712 3667 11793 13306 12790 16818 12396 7273
14272G273R757j946J466K515o220L096O147n233N68N743J8509r099k8705o559
$$ 7273 17030 15084 16550 19065 12845 15941 22088 16855 17423 23166 41675 32576 3871 -2688
14258b688O462J3526k606J318Q326r186j4840k058J945P867J8332M97r393j568
$$ -2688 3774 17300 14694 16012 24338 15152 312 -1746 199 8066 26398 26895 17502 15934
14244A5934J40J5875m364o265j083K036Q42M676k735M583N939r134o559J5639
$$ 15934 16074 31949 27585 21320 20237 22273 23115 27791 25056 29639 35578 26444 19885 35524
14230C5524J7698q429k014P829Q37o445J1911J9714J3816K2246J7477K447K6840
$$ 35524 53222 44793 42779 50608 51445 45000 56911 76625 90441 112687 130164 132611 159451
14217A59451M7040K9372L3347M0618L6018M0061L9320J1161J799K3282J5848j0335
$$ 159451 206491 235863 269210 309828 345846 385907 425227 436388 438187 461469 477317 466982
14205D66982j5716j3505j3929j5252j3198k5566m1793l9553k5972k6075m0758
$$ 466982 451266 437761 423832 408580 395382 369816 328023 288470 262498 236423 195665
14194A95665k9373k2490j0979j8919j9754n588l661l968j7447O225J7232m773
$$ 195665 166292 143802 132823 113904 94150 88562 84901 80933 63486 69711 86943 82170
14182H2170j4845o573j7956o890j732J2309J564J0694j2829j4542O853O760q707
$$ 82170 67325 60752 42796 35906 34174 46483 48047 58741 45912 31370 38223 44983 36276
14169C6276j824p054p560j45l258R320M04j1525M939J5096N617j0272j220R74
$$ 36276 34452 27398 19838 19693 16435 25755 26159 14634 19573 34669 40286 30014 28794 29768
14155B9768j955k15j4617n42J3774j874n139p846o200Q433J104O349M730L925
$$ 29768 27813 27598 12981 12439 26213 24339 19200 11354 5154 13587 14691 21040 25770 29695
14141B9695L988j4819k248J6525K27o690o524k83k48o084K924q714o904Q749J0083
$$ 29695 33683 18864 16616 33141 33368 26678 20154 19871 19623 13539 16463 7749 845 9594 19677
14126A9677j7088m140P249R079K1717k728j6834j501j2622N570k859p760M081
$$ 19677 2589 -1551 5698 14777 36494 33766 16932 15431 2809 8379 5520 -2240 1841
14113A841K227J0549O035j1958Q588K6575L540o949j5523l548K828j848l745l476
$$ 1841 4068 14617 20652 8694 17282 43857 47397 40448 24925 21377 24205 22357 18612 15136
14099A5136m134L865M760l472O950L204n644M429J2286j5845q355k739m303N728
$$ 15136 11002 14867 19627 16155 23105 26309 20665 25094 37380 21535 13180 10441 6138 11866
14085A1866R434O562j5184j8386Q55o286O815J3092P254l002j0545P282O774J1866
$$ 11866 21300 27862 12678 -5708 -4853 -11139 -4324 8768 16022 13020 2475 9757 16531 28397
14071B8397P234n442M742K334n543r463j3214j965q12Q666J1910j732K911L981
$$ 28397 35631 30189 34931 37265 31722 22259 9045 7080 6268 14934 26844 25112 28023 32004
14057C2004l453P291m285j0566l064P136J0329M442Q057j0182r964k997K725O988
$$ 32004 28551 35842 31557 20991 17927 25063 35392 39834 47891 37709 27745 24748 27473 34461
14043C4461n163n642J998k484K480L349N547j3126R745m786j2921l856J02J1022
$$ 34461 29298 23656 25654 23170 25650 28999 34546 21420 31165 26379 13458 9602 9704 20726
14029B0726j1200j1873m561N213Q122k962L243o67P986J105J3816j333o014L605
$$ 20726 9526 -2347 -6908 -1695 6427 3465 6708 6041 14027 15132 28948 27615 21601 25206
14015B5206O263r148j3952K082K1034J0686j5826n748o338n772r34j1283J0767
$$ 25206 31469 22321 8369 10451 31485 42171 26345 20597 14259 8487 7553 -3730 7037
14002G037M12Q316L639L52J2831K0010L974K081O289L9o964K2173j58l997l972
$$ 7037 7449 15765 19404 19756 32587 52597 56571 58652 64941 64980 58016 80189 80031 76034 72062
13987G2062n025j9977q090O783j40j0644N122j375j856P249K0246m34M667K096
$$ 72062 67037 47060 38970 45753 45613 34969 40091 38716 36860 44109 64355 63921 68588 70684
13973G0684m858q967J200K688m875Q206l288j2902j0177p268j21m126j1627r1
$$ 70684 65826 56859 58059 60747 55872 64078 60790 47888 37711 30443 30322 26196 14569 14478
13959A4478N439O925J6449p747j7658O505k600J832J3544m238r535J0958K515
$$ 14478 19917 26842 43291 35544 17886 24391 21791 23623 37167 32929 23394 34352 36867
13946C6867j4775j765R734J6212q177j8137n457J3275l706l830o761q542Q032
$$ 36867 22092 20327 30061 46273 38096 19959 14502 27777 24071 20241 13480 4938 12970
13933A2970O868P671n178p086r896J0702o709m021P513Q965p1l830o569j1095
$$ 12970 19838 27509 22331 15245 5349 16051 9342 5321 12834 21799 21728 17898 11329 234
13919B34O463J3889M310q6K71L316O938l858l797m380j1354K355O978O345Q19
$$ 234 6697 20586 24896 24810 25081 28397 35335 31477 27680 23300 11946 14301 21279 27624 28443
13904B8443j2161Q287J1212m639l478j29j5670q762K295q650J877j026r267J4146
$$ 28443 16282 24569 35781 31142 27664 27535 11865 3103 5398 -3252 -1375 -2401 -11668 2478
13890B478J7158L087k2418K563N629R41K652k337j1125k025J2436J0955l828M031
$$ 2478 19636 22723 305 2868 8497 9438 12090 9753 -1372 -3397 9039 19994 16166 20197
13876B0197J472N587Q132M398n863P349J5006o696k7457K116R849M128o807l00
$$ 20197 21669 27256 35388 39786 33923 41272 56278 49582 22125 24241 34090 38218 31411 31111
13862C1111M911q337m131Q031J5568j258j0722L48M546K202p473K529k73o819
$$ 31111 36022 27685 23554 31585 47153 45895 35173 35521 40067 42269 34796 37325 37052 30233
13848C0233r548Q579J6807J467j5308n994j0091Q41M402N675P648m892n04l855
$$ 30233 20685 29264 46071 47538 32230 26236 16145 16986 21388 27063 34711 29819 29315 25460
13834B5460o620J3406K0991J5419j2037l353q836J3556P771l500j0637j9125J348
$$ 25460 18840 32246 53237 68656 56619 53266 44430 57986 65757 62257 51620 32495 33843
13821C3843J2423L394N396J8778j79m399j118m082p483J0619M080M998M478p881
$$ 33843 46266 49660 55056 73834 73655 69256 68138 64056 56573 67192 71272 76270 80748 72867
13807G2867O365q766l339m480j433K217N313L441O917n706l127J3977P814Q292
$$ 72867 79232 70466 67127 62647 61214 63431 68744 72185 79102 73396 70269 84246 92060 100352
13793A00352J940L12j4965L666J1858Q563j3081k1614L014J5770N097j3028L681
$$ 100352 102292 102604 87639 91305 103163 111726 98645 77031 80045 95815 100912 87884 91565
13780I1565J1306M113K336j3054j5857N34J4854n751k434q802j5598m528P821
$$ 91565 102871 106984 109320 96266 80409 80943 95797 90046 87612 78810 63212 58684 66505
13767F6505M973J801j3748j8604p757P000R206K1367j3949k2649j552K013m128
$$ 66505 71478 73279 59531 40927 33170 40170 49376 70743 56794 34145 32593 34606 30478
13754C0478J142J994l77N616q952j2801o691O432J8037J1293J1702j1079j2730
$$ 30478 31620 33614 33237 38853 29901 17100 10409 16841 34878 46171 57873 46794 34064
13741C4064j7645q662l297J0574J0991O214J114m96M167J425j0912q493k342J1044
$$ 34064 16419 7757 4460 15034 26025 32239 33353 32857 37024 38449 27537 19044 16702 27746
13727B7746M914j421J0102J3536n522k0222p318J224k012l087M011N130j528J1755
$$ 27746 32660 31239 41341 54877 49355 29133 21815 23039 21027 17940 21951 27081 25553 37308
13713C7308J4319j171j2989n928n500l3K164J052J28J1823q99j7674q863Q000
$$ 37308 51627 50456 37467 31539 26039 26006 28170 29222 29350 41173 40274 22600 13737 21737
13699B1737R121J8797k1420k3213J358m359J6234N942l197Q800j503j2724n979
$$ 21737 30858 49655 28235 5022 6380 2021 18255 24197 21000 29800 28297 15573 9594
13686I594j240o215p370J5014K03j0542o249J4663J0129q098j165J1959O288K232
$$ 9594 8354 2139 -5231 9783 9986 -556 -6805 7858 17987 9889 8724 20683 26971 29203
13672B9203n365l383k372J4689l157O083J0773j3443m616q703K834J3068J9694
$$ 29203 23838 20455 18083 32772 29615 35698 46471 33028 28412 19709 22543 35611 55305
13659E5305n614q237r64m933q594r213j517J1454K787Q457M888p797L888j210
$$ 55305 49691 41454 40490 35557 26963 17750 16233 27687 30474 38931 43819 36022 39910 38700
13645C8700n573r33N173L450J2712k369J414K02j2394j0533P1O407J8948O135
$$ 38700 33127 32194 37367 40817 53529 51160 52574 52776 40382 29849 29920 36327 55275 61410
13631F1410j1129p753P334K4599J1904O974j1045m592M6J0671n821K739J8569
$$ 61410 50281 42528 49862 74461 86365 93339 82294 77702 77748 88419 82598 85337 103906
13618A03906K7115K1682J9759K3818R961J7160J8198P695k991k3812j3099j5038
$$ 103906 131021 152703 172462 196280 206241 223401 241599 249294 246303 222491 209392 194354
13606A94354k2494l1875k907n657j7150Q14K528j0818K964Q464j8342o859Q60
$$ 194354 171860 139985 137078 131421 114271 115085 117613 106795 109759 118223 99881 93022 93882
13593I3882N842L57p2j7499k3041j4145K646J3453J3445K608p297J0533K1427
$$ 93882 99724 100081 100009 82510 59469 45324 47970 61423 74868 77476 70179 80712 102139
13580A02139J1586J9005K9080K6351K4401p479p881j6696m1043k4705j0837p731
$$ 102139 113725 132730 161810 188161 212562 205083 197202 180506 139463 114758 103921 96190
13568I6190j2037k9368j4253Q018m728J1727p966j5373j1651J121O06J3952J4300
$$ 96190 84153 54785 40532 48550 43822 55549 47583 32210 20559 21680 22286 36238 50538
13555E0538K717q381k0011J171O641Q164M389J820m48n255M776j97j394j0832
$$ 50538 53255 44874 24863 26034 32675 40839 45228 47048 46600 41345 46121 45924 44530 33698
13541C3698j490J2053J176j5088r397N591J6998N712j470P154J4668M961n358
$$ 33698 32208 44261 45437 30349 20952 26543 43541 49253 47783 54937 69605 74566 69208
13528F9208O25j049j6850j8665j226J142J691Q179M65N749j6846o342J8042K0380
$$ 69208 69833 68784 51934 33269 32043 33185 34876 43055 43520 49269 32423 26081 44123 64503
13514F4503j5221j0544R464M78l976L812m960p667Q539O268J778M911l867J1J1706
$$ 64503 49282 38738 48202 48680 44704 48516 43556 35889 44428 50696 52474 57385 53518 53529 65235
13499F5235j438j7145j5097m175O092J1346J0831l260l942L74L778k142j8052
$$ 65235 63797 46652 31555 27380 33472 44818 55649 52389 48447 48821 52599 50457 32405
13486C2405l880Q598P920J0933j375q580j399J2276J0181o242j0652l251p542
$$ 32405 28525 37123 45043 55976 54601 46021 44622 56898 67079 60837 50185 46934 39392
13473C9392o3J2031p161L298k690M632M576L053N289n966N457O910J2580q941
$$ 39392 39329 51360 44199 47497 44807 49439 54015 57068 62357 56391 61848 68758 81338 72397
13459G2397j9150j882J5515J2279M93N67R699J7807L641q335j3473K042J038r555
$$ 72397 53247 51365 66880 79159 79652 80219 89918 107725 111366 103031 89558 91600 92638 83083
13445H3083j7153j4860p969J3513P419p415k988o979l843j580K180J5645K818
$$ 83083 65930 51070 43101 56614 64033 56618 53630 46651 42808 41228 43408 59053 61871
13432F1871M859R291J9584q878j4830q099P486Q432J4056k431j036M695P906P73
$$ 61871 66730 76021 95605 86727 71897 63798 71284 79716 93772 91341 90305 95000 102906 103679
13418A03679k36q369p025R682j0102l462j1582o006j2013m407n071L79O290M119
$$ 103679 103443 95074 88049 97731 87629 84167 72585 66579 54566 50159 45088 45467 51757 55876
13404E5876l327J0945Q348j638j2470j8501j810P005L631r550l818l372k441j5006
$$ 55876 52549 63494 71842 70204 57734 39233 37423 44428 48059 38509 34691 31319 28878 13872
13390A3872j5144Q497J770Q891J1833p661J1241M236P782p64q634R079N93m833
$$ 13872 -1272 7225 8995 17886 29719 22058 33299 37535 45317 44553 35919 44998 45591 40758
13376D0758m043m506P220k825n041j0157m197J959L211r76n692J310P764o322
$$ 40758 36715 32209 39429 36604 31563 21406 17209 19168 22379 21403 15711 17021 24785 18463
13362A8463o821O639L986R563P018J7233j0072N002m024j0556N648r637l499P907
$$ 18463 11642 18281 22267 31830 38848 56081 46009 51011 46987 36431 42079 32442 28943 36850
13348C6850O461j0665p58J0090M890j308K786n368m757J256p721K271k602L818
$$ 36850 43311 32646 31888 41978 46868 45560 48346 42978 38221 39477 31756 34027 31425 35243
13334C5243Q096J3216N464n935j6759k005k908j280R630l898r562L402M441k26
$$ 35243 43339 56555 62019 56084 39325 37320 34412 33132 42762 38864 29302 32704 37145 36919
13320C6919L604P791J7068l555q974j1015l273K7029J5917M705j9753j4906m146
$$ 36919 40523 48314 65382 61827 52853 41838 38565 65594 81511 86216 66463 51557 47411
13307D7411P700m23R387J634n590j1941L506K618J012m409J225j4502o613J3741
$$ 47411 55111 54688 64075 65709 60119 48178 51684 54302 55314 50905 52130 37628 31015 44756
13293D4756R053k99p205L853P86m843k865Q448J1123m137M246J355Q196o26j2339
$$ 44756 53809 53510 46305 50158 50944 46101 43236 51684 62807 58670 62916 64271 72467 71841 59502
13278E9502j0286k29J216m728o927m072O233M200J7942J0426k0441K36j5026j2911
$$ 59502 49216 48987 50203 45475 38548 34476 40709 44909 62851 73277 52836 53072 38046 25135
13264B5135K5274J9541J1254o106k3090j9517Q486m993M022R214N138J2159q989
$$ 25135 50409 69950 81204 75098 52008 32491 40977 35984 40006 49220 54358 66517 57528
13251E7528p873k842J00p343n654o407O725J815J8235J9261M080j4534N649l031
$$ 57528 49655 46813 46913 39570 33916 27509 34234 36049 54284 73545 77625 63091 68740 65709
13237F5709P677k325j6391j496j0091n449N514q327j4181K452R496J6140J3527
$$ 65709 73386 71061 54670 53174 43083 37634 43148 34821 20640 23092 32588 48728 62255
13224F2255k51P164O192j5934J4423m167m930K925L734j768O52O520n856j4969
$$ 62255 62004 69168 75360 59426 73849 69682 64752 67677 71411 69643 70295 76815 70959 55990
13210E5990l12m225j697j987R444M015M404J410n465M349m961j4006Q39J1509
$$ 55990 55678 51453 49756 47769 57213 61228 65632 67042 61577 65926 60965 46959 47798 59307
13196E9307R473Q601m889j5702j7026K853J3133J0069L165r006K62O492J590Q934
$$ 59307 68780 77381 72492 56790 39764 42617 55750 65819 68984 59978 60240 66732 68322 77256
13182G7256Q830J8716K8509M3972N0977J5726l1356m6162l1979j4656J917m690
$$ 77256 86086 104802 133311 177283 228260 243986 212630 166468 134489 119833 121750 117060
13170A17060n062j3018R886J9413q343k8388k9923k453N501R332k988P962p325
$$ 117060 111998 98980 108866 128279 119936 91548 61625 59172 64673 74005 71017 78979 71654
13157G1654Q964m03O120L561L182m348j6560O164o02O852J4336m885j480K723
$$ 71654 80618 80215 86335 89896 93078 88730 72170 78334 77732 84584 98920 94035 92555 95278
13143I5278N137J567J878M162J5307M3403M1507N3170R3708J41901J45427R3586
$$ 95278 100415 101982 103860 108022 123329 166732 208239 261409 355117 497018 642445 736031
13131G36031j4945j12454r9523n1292Q217N0994Q1321R2717P0864P8742N3176
$$ 736031 721086 608632 509109 457817 466034 517028 598349 691066 761930 840672 893848
13120H93848K5635K304m1609q2575j00336r7854q9742q0095p8712n7983m0816
$$ 893848 919483 921787 880178 797603 697267 599413 509671 429576 350864 292881 252065
13109B52065k6688l0554l0506j5830r820m789q759L14Q129r182j1065j5021m200
$$ 252065 225377 194823 164317 148487 138667 133878 125119 125433 133562 124380 113315 98294 94094
13096I4094J4518J3371k693J4041M2464N1274P2649J20711J54823J12063k0355
$$ 94094 108612 121983 119290 133331 175795 227069 299718 420429 575252 687315 666960
13085F66960j19493j40266j21516q0493l6103Q463J0410m550l363j5760q478N83
$$ 666960 547467 407201 285685 205192 169089 177552 187962 183412 180049 164289 155811 156394
13073A56394l233j5916m778m195j4379L552M415n438m158K86L367j0244J091N850
$$ 156394 153161 137245 132467 128272 113893 117445 121860 116422 112264 112550 115917 105673 106764 112614
13059A12614m471j612j5807l49O704J3041j6938n33K0531J9515K966j201M042
$$ 112614 108143 106531 90724 90375 97079 110120 93182 92649 113180 132695 135661 134460 138502
13046A38502Q322J0717L8632N3033M9584j576l0897l8988l8885j3634q456l198
$$ 138502 146824 157541 196173 249206 298790 297214 266317 227329 188444 174810 166354 163156
13034A63156L911j6341M400J203K372K8490Q451p458P752j1771r251j8465n882
$$ 163156 167067 150726 155126 156329 158701 187191 195642 188184 195936 184165 174914 156449 150567
13021A50567p348o073j9053n998k328O135K22m858R649J1683J0067o711N808J8116
$$ 150567 143219 137146 118093 112095 109767 115902 116124 111266 120915 132598 142665 135954 141762 159878
13007A59878J0349P585J2102K0987P910j3717j3395j3816k5884j0680Q22M691
$$ 159878 170227 177812 189914 210901 218811 205094 191699 177883 151999 141319 142141 146832
12995A46832m495j5401j384l833P164j1802r113m208k995o473p591n955J632P95
$$ 146832 142337 126936 125552 121719 128883 117081 107968 103760 100765 94292 86701 80746 82378 83173
12981H3173P450K001j2998R978J2873o268J285J804m58K739j720J866L453o950
$$ 83173 90623 92624 79626 89604 102477 96209 97494 99298 98840 101579 99859 101725 105178 98228
12967I8228N736K033J9470o907k73L104L671P231J3561Q552L833N936k323J678
$$ 98228 103964 105997 125467 118560 118287 121391 125062 132293 145854 154406 158239 164175 161852 163530
12953A63530K986N585M530L753k330M380q528o475K621j731M487k348p482j680
$$ 163530 166516 172101 176631 180384 178054 182434 173906 167431 170052 168321 172808 170460 162978 161298
12939A61298o250j269m049K090M643J648K524M910j0657j2116p359n243K764L774
$$ 161298 155048 153779 149730 151820 156463 158111 160635 165545 154888 142772 135413 130170 132934 136708
12925A36708n074j9083O755P080J1838J687j0522q527P914J1203l068o599K0379
$$ 136708 131634 112551 119306 126386 138224 139911 129389 120862 128776 139979 136911 130312 150691
12912A50691j2033k0005m323O788J9716Q448P614o812r837K763Q865j541L477
$$ 150691 138658 118653 114330 121118 140834 149282 156896 150084 140247 143010 151875 150334 153811
12899A53811J855K2797R119L84n240J80q093N334J7485J650L415K213j9142j0226
$$ 153811 155666 178463 187582 187966 182726 182906 174813 180147 197632 199282 202697 204910 185768 175542
12885A75542J170j1252m43J5769O811R023j1821j4881o38j3144K92K733M426K941
$$ 175542 176712 165460 165017 180786 187597 196620 184799 169918 169280 156136 156428 159161 163587 166528
12871A66528j759j253n800k88n577k768J773L749K404J1326O468K020m244J1201
$$ 166528 164769 163516 157716 157428 151851 149083 150856 154605 157009 168335 174803 176823 172579 183780
12857A83780J5461J7861j1253j7567r338n071P25J2999K5959J3434j552k47P150
$$ 183780 199241 217102 205849 188282 178944 173873 174598 187597 213556 226990 225438 225191 232341
12844B32341l471j67j31J770R738J337N166l813l8R405k486K0034J4482J3106
$$ 232341 228870 228703 228572 230342 240080 241417 246583 242770 242732 252137 249651 269685 284167 297273
12830B97273Q657L2686K7366K6024J4237J5302J8468Q075N761J84j7966l8137
$$ 297273 305930 338616 365982 392006 406243 421545 440013 448088 453849 454033 436067 397930
12818C97930k8138k0097l2257l3221j0436p61q977q019n553j2971R650J7344J750
$$ 397930 369792 349695 317438 284217 273781 273020 264043 256024 250471 237500 247150 264494 266244
12805B66244M302K0795Q926k922n571L031J7945P462j3488P171J4574K529l993
$$ 266244 270546 291341 300267 297345 291774 294805 312750 320212 306724 313895 328469 330998 327005
12792C27005L61L730K360R243j907P356J1913K452l632o44J4199J0659R139J0460
$$ 327005 327366 331096 333456 342699 340792 348148 360061 362513 358881 358237 372436 383095 392234 402694
12778D02694K332P846K3725J7309J6684J7999K2371L5744J3908K4886K3459K6691
$$ 402694 405026 412872 436597 453906 470590 488589 510960 546704 560612 585498 608957 635648
12766F35648K8012J1393j8629K1904N3305O1537Q2621R5184J05741J28800J13301
$$ 635648 663660 675053 656424 678328 731633 793170 875791 970975 1076716 1205516 1318817
12755A318817J03874R0386M7890J0737k1433m7754o4395o7911n8619m7018l0866
$$ 1318817 1422691 1513077 1560967 1571704 1550271 1502517 1438122 1370211 1311592 1264574 1233708
12744A233708j4917k526J3954J6439L6047M0066L9461M9719N9338O6604P6153
$$ 1233708 1218791 1216265 1230219 1246658 1282705 1322771 1362232 1411951 1471289 1537893 1614046
12733A614046R9386J13327J39042J42499J58496J76528J71572J86495J94404J87228
$$ 1614046 1713432 1826759 1965801 2108300 2266796 2443324 2614896 2801391 2995795 3183023
12723C183023J83088K16695K78455L27936M07391N05930O58476Q29578R93313
$$ 3183023 3366111 3582806 3861261 4189197 4596588 5102518 5760994 6590572 7583885
12714G583885J137299J272152J444874J625838J854374K218039K764594L719942
$$ 7583885 8721184 9993336 11438210 13064048 14918422 17136461 19901055 23620997
12706B3620997N313257P723023J1057277J4860299J7719615J8457109J7715818
$$ 23620997 28934254 36657277 47714554 62574853 80294468 98751577 116467395
12699A16467395J6588635J4180522R053664J723745o104442j3380059j8350999
$$ 116467395 133056030 147236552 156290216 158013961 151909519 138529460 120178461
12692A20178461j9212027j7606561j6078854j4637263j2159431r025263o327416
$$ 120178461 100966434 83359873 67281019 52643756 40484325 31459062 25131646
12685B5131646m401312l162057k412891j941754j633895j432344j260742j100166
$$ 25131646 20730334 17568277 15155386 13213632 11579737 10147393 8886651 7786485
12677G786485r80890q56079p27260o20949n16081m31297l60534l03414k62155
$$ 7786485 6805595 5949516 5222256 4601307 4085226 3653929 3293395 2989981 2727826
12668B727826k06573j58778j78192j53039j44615j22314j00632r8068q1223p2294
$$ 2727826 2521253 2362475 2184283 2031244 1886629 1764315 1663683 1565615 1484392 1412098
12658A412098q1245p0244n9353m8566m6859m7499k9394j1159k7130k8575j6819
$$ 1412098 1330853 1260609 1201256 1152690 1105831 1058332 1028938 1017779 990649 962074 945255
12647I45255p550k8612k6336l9135l6266k9582k8039k2776j1581p826n633P585
$$ 945255 937705 909093 882757 843622 807356 777774 749735 726959 715378 707552 701919 709504
12635G09504J7180K9465L3250M7879P7601R6694J18861J29905J08948Q7252N3157
$$ 709504 726684 756149 789399 837278 914879 1011573 1130434 1260339 1369287 1456539 1509696
12624A509696J5317m6698p4729j03572j17820j07879j06213j07872r7157q9366
$$ 1509696 1525013 1478315 1403586 1300014 1182194 1074315 968102 860230 763073 673707
12614F73707n3449l9541l1920j9487p140p63n504j1875j7740O78P656l430j1218
$$ 673707 620258 580717 548797 529310 522170 521407 515903 504028 486288 486966 494622 491192 479974
12601D79974m245j9604k7483k0102j3048j4874j1452j7063j9812j5356J1975M66
$$ 479974 475729 456125 428642 408540 395492 380618 369166 352103 332291 316935 328910 329376
12589C29376J787M653j824M608k800q13P996J0066j1586p508j3119p216l479k0179
$$ 329376 331163 335816 333992 338600 335800 334987 342983 353049 341463 333955 320836 313620 310141 289962
12575B89962m1430l6555k0712k3725k6040k2640R891J119J1449N890R737J8749
$$ 289962 248532 211977 191265 167540 141500 118860 128751 129870 141319 147209 156946 175695
12563A75695J2529k766J2437k416O530N045j2842j909J149j5043j4326q519J3440
$$ 175695 188224 185458 197895 195479 202009 207054 194212 192303 193452 178409 164083 155564 169004
12550A69004n128j7899k3151o990J7216K1308K7583J8740P478N711j2260j626
$$ 169004 163876 145977 122826 115836 133052 154360 181943 200683 208161 213872 201612 199986
12538A99986O855K401O219J267j5102j0054N320r172j2097K089J477J385J0500
$$ 199986 206841 209242 215461 216728 201626 191572 196892 187720 175623 177712 179189 180574 191074
12525A91074k263o12o638L288J17n865M017M391O177L457k129K324o418p820j939
$$ 191074 188811 188199 181561 184849 184966 179101 183118 187509 193686 197143 195014 197338 190920 183100 181161
12510A81161n588q76M077J397m259j6842J2703J247j296J5n379k056Q908Q544
$$ 181161 175573 174697 178774 180171 175912 159070 171773 173020 171724 171739 166360 164304 173212 181756
12496A81756j975P163N610j0343J240J8029K5209O567o43p366j0637O794o182
$$ 181756 179781 186944 192554 182211 183451 201480 226689 233256 232613 225247 214610 221404 215222
12483B15222J4691J8791L747j8204p802Q745q037J072N000J3699K5448J6591K3607
$$ 215222 229913 248704 252451 234247 226445 235190 227153 228225 233225 246924 272372 288963 312570
12470C12570L9202M0995K7330L2379J8154J2337J4157n207k4848m7038m4185l6565
$$ 312570 351772 392767 420097 452476 470630 482967 497124 491917 467069 420031 375846 339281
12458C39281k7814k5746j6336j5588m484K3389K9301M1646L9812l595m4242n4657
$$ 339281 311467 285721 269385 253797 249313 272702 302003 343649 383461 379866 335624 280967
12446B80967k2924j6939N079K1837J2748O620j0108q86P476J1518R18R888J1957
$$ 280967 258043 241104 246183 268020 280768 287388 277280 276394 283870 295388 296306 306194 318151
12433C18151J217k397q610O849N972L050K608p168q877J998R435P381R881L591
$$ 318151 319368 316971 308361 315210 321182 324232 326840 319672 310795 312793 322228 329609 339490 343081
12419C43081J0229J3198J9857J3585J3126J4774R724J8286k196K0720L3110L7758
$$ 343081 353310 366508 386365 399950 413076 427850 437574 455860 453664 474384 507494 545252
12407E45252L7663P3607K5419m4630m3815p823L8056M8782M2202N0477L0672m359
$$ 545252 582915 656522 681941 637311 593496 585673 623729 672511 714713 765190 795862 791503
12395G91503r579O316J6300m679Q178K3681M0889O6829Q1354R8769J08600J20085
$$ 791503 781924 788240 804540 799861 808039 831720 872609 939438 1020792 1119561 1228161 1348246
12383A348246J27146J06134Q9144Q8775R5571O9463L8092K5200J0487L0808M4168
$$ 1348246 1475392 1581526 1670670 1759445 1855016 1924479 1962571 1987771 1998258 2029066 2073234
12372B073234L9428M9362O6021J07082J22821J49016J67113K09750K64476K98625
$$ 2073234 2112662 2162024 2228045 2335127 2457948 2606964 2774077 2983827 3248303 3546928
12362C546928L66824M41940N21742O35782Q14520R73941J112792J225609J333062
$$ 3546928 3913752 4355692 4877434 5513216 6327736 7301677 8414469 9640078 10973140
12353A0973140J465269J599494J840708K279853L019682M321399O475078R639732
$$ 10973140 12438409 14037903 15878611 18158464 21178146 25499545 31974623 41614355
12345D1614355J3552732J7075960J8775175J8997807J9026253J7602998J2166773
$$ 41614355 55167087 72243047 91018222 110016029 129042282 146645280 158812053
12338A58812053M035017l884088j1257637j7298300j9635885j8609370j6978587
$$ 158812053 162847070 158962982 147705345 130407045 110771160 92161790 75183203
12331G5183203j5729315j3715539j0546108p292334m867802l313081k409257j920513
$$ 75183203 59453888 45738349 35192241 27899907 23032105 19719024 17309767 15389254
12323A5389254j656397j485642j388745j303267j157904j053791r56542q64701
$$ 15389254 13732857 12247215 10858470 9555203 8397299 7343508 6386966 5522265
12315E522265p33982o04433m90243l98869l19031k60898k35056k04043j72734
$$ 5522265 4788283 4183850 3693607 3294738 2975707 2714809 2479753 2275710 2102976
12306B102976j50172j39204j23193j06929q7299p3841q0598p5184n1652n1706
$$ 2102976 1952804 1813600 1690407 1583478 1496179 1422338 1341740 1266556 1214904 1163198
12296A163198l9853k5128m0166l7633j2978j1757k1622n4771m7976m4841l2569
$$ 1163198 1123345 1098217 1058051 1020418 1007440 995683 974061 919290 871314 826473 793904
12285G93904m8920l5513j2613k6841k6945l273m806m778J0253J3513K7612P1323
$$ 793904 744984 709471 696858 670017 643072 639799 634993 630215 640468 653981 681593 752916
12273G52916R4539J02852J07685Q7104P5376N2387O775l6806o3970r3208j07785
$$ 752916 847455 950307 1057992 1145096 1220472 1272859 1279634 1242828 1178858 1085650 977865
12262I77865j06969j03852q4807o2634n9058l9501k8070k0444j6309j4906p682
$$ 977865 870896 767044 682237 619603 560545 521044 492974 472530 456221 441315 433633
12251D33633k7012k0477j6847k7458l3214m808r118k430n577J673k357P896O777
$$ 433633 406621 386144 369297 341839 308625 303817 294699 292269 286692 288365 286008 293904 300681
12238C00681j2776J0782K6500l436r591M286L006m290J78j256j203j0611r954
$$ 300681 287905 298687 325187 321751 312160 316446 319452 315162 315340 314084 312881 302270 292316
12225B92316o493J6m911p050k5015l0523k5908j5788l2882k1967j3491k466q511
$$ 292316 285823 285839 280928 273878 248863 218340 192432 176644 143762 121795 108304 105838 97327
12212I7327o084k3293o029j1977J4216R662N584J8417J6064R535J3081m547l001
$$ 97327 91243 67950 61921 49944 64160 73822 79406 97823 113887 123422 136503 131956 128955
12199A28955p240p839j7598j0107N8n622j324l564l63j1635j3293K869M13J4760
$$ 128955 121715 113876 96278 86171 86229 80607 79283 75719 75356 63721 50428 53297 53710 68470
12185F8470J3484N636n367K306J191L943K315p492N218n327j2434j2463J680J2238
$$ 68470 81954 87590 82223 84529 85720 89663 91978 84486 89704 84377 71943 59480 61160 73398
12171G3398J1j2359j2211J7938M487j5167J4616N135j5600m962Q211R852K345
$$ 73398 73409 61050 48839 66777 71264 56097 70713 75848 60248 55286 63497 73349 75694
12158G5694j9506j2990L679L204J001m263o115o141J2075K425m747p761J8406
$$ 75694 56188 43198 46877 50081 51082 46819 40704 34563 46638 49063 44316 36555 54961
12145E4961O240o397j1341r439j0434j1252k392j1968n857J8314J5167P762M694
$$ 54961 61201 54804 43463 34024 23590 12338 9946 -2022 -7879 10435 25602 33364 38058
12132C8058J5095J1207p087o836Q903K795k783j1066j1294Q536P855J1072o39
$$ 38058 53153 64360 57273 50437 59340 62135 59352 48286 36992 45528 53383 64455 63816
12119F3816P35M834R132k335j0311l510n352j1233J5880R024j000K105r736j1132
$$ 63816 64551 69385 78517 76182 65871 62361 57009 45776 61656 70680 69680 71785 62049 50917
12105E0917J8390P084l421j2428O368j0988k737L440n224N827k28l994J4586N530
$$ 50917 69307 76391 72970 60542 66910 55922 53185 56625 51401 57228 57000 53006 67592 73122
12091G3122q114l09L42k783o547M784n19P008N825o105j5216J21r24J601l571
$$ 73122 65008 64699 65041 62258 55711 60495 59976 66984 72809 66704 51488 51609 50685 52286 48715
12076D8715k847l84j523N789q761j1046M584J7343M769K437O39P872N122l167
$$ 48715 45868 45484 43961 49750 40989 29943 34527 51870 56639 59076 59715 67587 72709 69542
12062F9542o962O043j009n223o995r862l068M817m065M210L135k666P907J3991
$$ 69542 62580 68623 67614 62391 55396 45534 42466 47283 43218 47428 50563 47897 55804 69795
12048F9795N322j5028j2513P856N046O951J3144M31j4904k9320k2573j2540p334
$$ 69795 75117 60089 47576 55432 60478 67429 80573 81004 66100 36780 14207 1667 -5667
12035e667k2238n429m87j5000r401j322N994J7579J0768N719K4420J4828L852
$$ -5667 -27905 -33334 -33821 -48821 -58222 -59544 -53550 -35971 -25203 -19484 4936 19764 23616
12022B3616L525J2873J4707J6486N424n219J8630J4893j6964j4383j2403j935
$$ 23616 27141 40014 54721 71207 76631 71412 90042 104935 87971 73588 61185 59250
12010E9250j2396N110R088J407L594J794J606J6542K378L317K8267J2814q408
$$ 59250 46854 51964 61052 62459 66053 67847 69453 85995 88373 91690 119957 132771 124363
11997A24363j629o097k4107j8284m845m745p083m213L676N395m186j2842j0209
$$ 124363 122734 116637 92530 74246 69401 64656 57573 53360 57036 62431 58245 45403 35194
11984C5194N244J5192l668p211k995l011o587p241N926J3226m49J1476J0382K200
$$ 35194 40438 55630 51962 44751 41756 38745 32158 24917 30843 44069 43620 55096 65478 67678
11970F7678R575J6698P223K500Q760n888J604J1619o033r094j5173m357j2381
$$ 67678 77253 93951 101174 103674 112434 106546 108150 119769 113736 104642 89469 85112 72731
11957G2731k994N845J0106N992j0363m786l108j5757o078O556O861R689K2898
$$ 72731 69737 75582 85688 91680 81317 76531 73423 57666 51588 58144 65005 74694 97592
11944I7592K2397Q57o054K072K273j8123l413Q453M538N884J5674K2628n8q442
$$ 97592 119989 120846 114792 116864 119137 101014 97601 106054 110592 116476 132150 154778 154720 146278
11930A46278J1402K9416K5115k86K9319M5161P0534J14805J10483J02469R3525
$$ 146278 157680 187096 212211 211925 241244 286405 356939 471744 582227 684696 778221
11919G78221R1595O9103J8203k0354m6887o4138n8666n0334m0532m0503n6690
$$ 778221 869816 938919 957122 936768 889881 825743 767077 716743 676211 635708 579018
11908E79018o3752o3305o3919o0025n2966n2484m3707k8509q146j1240j1625n610
$$ 579018 515266 451961 388042 328017 275051 222567 178860 150351 142205 130965 119340 113730
11896A13730K518l5j8762j4317o644q776q416P911q654k198N391r82o27L384o435
$$ 113730 116248 116213 97451 83134 76490 67714 59298 67209 58555 56357 61748 60766 60139 63523 57088
11881E7088k904M295N031j2305p268m832o08J423K125K98j5133j914J369k068
$$ 57088 54184 58479 63510 51205 43937 39105 38497 39920 42045 42343 27210 25296 26665 24597
11867B4597J1757J4962k54m265J5294J095j2612j456P781m122n264k619K756r466
$$ 24597 36354 51316 51062 46797 62091 63186 50574 49118 56899 52777 47513 44894 47650 38184
11853C8184k321K669L956J137p15k769l92r474j371m417j2562r610l098R596J1921
$$ 38184 35863 38532 42488 43625 42910 40141 39749 30275 28904 24487 11925 2315 -783 8813 20734
11838B0734j2504J5240L1913N806M640J2242m39m188o117j024l772L904P930p159
$$ 20734 8230 23470 55383 61189 65829 78071 77632 73444 67327 66303 62531 66435 74365 67206
11824F7206n677k631n342o377q289l018q3R775R350R28O390j892j4788L411J097
$$ 67206 61529 58898 53556 47179 38890 35872 35789 45564 54914 55842 62232 60340 45552 48963 50060
11809E0060j486O948N742l842j098K209Q96j017l254J49l966R5k744q316J999
$$ 50060 48574 55522 61264 57422 56324 58533 59429 58412 55158 55307 51341 51436 48692 40376 42375
11794D2375L062j4959P38J6823J239q74J382L339m876Q193J048j571Q068J737
$$ 42375 45437 30478 31216 48039 49278 48404 49786 53125 48249 56442 57490 55919 63987 65724
11780F5724J157k952N410k668j2423L088J1081O12j0810p210m759j3098J847Q900
$$ 65724 66881 63929 69339 66671 54248 57336 68417 69029 58219 51009 46250 33152 34999 43899
11766D3899P451J280n542Q16M066l552J964P254j4971n150J1695L645l281n084
$$ 43899 51350 52630 47088 47904 51970 48418 50382 57636 42665 37515 49210 52855 49574 44490
11752D4490P43r850m058J7380j0524R46J2980j925M501M955O495J3l931q678j516
$$ 44490 45233 35383 31325 48705 38181 39127 52107 50182 54683 59638 66133 66146 62215 53537 52021
11737E2021J4617J4938j0554j1761o01O538K923J0738r786r468K76j538o870r395
$$ 52021 66638 81576 71022 59261 58660 65198 68121 78859 69073 59605 59881 58343 51473 42078
11723D2078j511J1244P612l799r220R426N909j7229J437J018o461J5429J4824
$$ 42078 40567 51811 59423 55624 46404 55830 61739 44510 45947 46965 40504 55933 70757
11710G0757P167o601r174q702O825j244j6677p637Q916O764r930p944L637K073
$$ 70757 77924 71323 62149 53447 60272 59028 42351 34714 43630 50394 40464 32520 36157 38230
11696C8230k876J1406R751l426l73L120j680O884J49n936j3229r948O532J2050
$$ 38230 35354 46760 56511 53085 52712 55832 54152 61036 61185 55249 42020 32072 38604 50654
11682E0654M441l659L843p093n330l210J0555J9639p813j7381m826O377K577j632
$$ 50654 55095 51436 55279 48186 42856 39646 50201 69840 62027 44646 39820 46197 48774 47142
11668D7142J3797m82J036L862o825p880M068O809J0396K012j0241q274J3566J6435
$$ 47142 60939 60457 61493 65355 58530 50650 54718 61527 71923 73935 63694 55420 68986 85421
11654H5421q404J587j884j9910o309n219m143l500P851J3728O910n522j0721M424
$$ 85421 77017 78604 76720 56810 50501 45282 41139 37639 45490 59218 66128 60606 49885 54309
11640E4309J123P382m666j295J3234p040o896J2274L349n925L462o62J5930J3786
$$ 54309 55432 62814 58148 56853 70087 63047 56151 68425 71774 65849 69311 68649 84579 98365
11626I8365N874j973j4327n157L283k785r802l703j1282j1534L706R176N416J139
$$ 98365 104239 102266 87939 82782 86065 83280 73478 69775 58493 46959 50665 59841 65257 66396
11612F6396J434O701M654k620j1442p505J1732k354j6617m653k005O479L80J0735
$$ 66396 67830 74531 79185 76565 65123 57618 69350 66996 50379 45726 43721 50200 50580 61315
11598F1315m330M767R131P134j352M429Q04j0659o508J1535J156k397N358L132
$$ 61315 56985 61752 70883 78017 76665 81094 81898 71239 64731 76266 77422 75025 80383 83515
11584H3515o078O558M329k179k878j347q704j340p800p85R943M409m811j4027
$$ 83515 77437 83995 88324 86145 83267 81920 73216 71876 64076 63291 73234 77643 72832 58805
11570E8805q327O386Q258O541M749q85q702o063M525j1259Q195J1572M508O532
$$ 58805 50478 56864 65122 71663 76412 75527 66825 60762 65287 54028 62223 73795 78303 84835
11556H4835o809P42P979O999N671K506J974N044m086P230m203j4502K547O4j09
$$ 84835 78026 78768 86747 93746 99417 101923 103897 108941 104855 112085 107882 93380 95927 95991 95882
11541I5882M586p601j3287r78K2041P156o246j0842j1459N881J2947j051o640
$$ 95882 100468 92867 79580 78602 100643 107799 101553 90711 79252 85133 98080 97029 90389
11528I0389J1291O213j281M054K29j0005q518q503R717j479N463O979L628j1711
$$ 90389 101680 107893 106612 110666 110895 100890 92372 83869 93586 92107 97570 104549 108177 96466
11514I6466r429k663k641O498J418j83J492j0061r040J768J1372k257j762J7221
$$ 96466 87037 84374 81733 88231 89649 89466 90958 80897 71857 73625 84997 82740 80978 98199
11500I8199M869O912n987l102L278q797p350m35J2609J323q618k2233j3029J097
$$ 98199 103068 109980 103993 100891 104169 95372 88022 87587 100196 101519 92901 70668 57639 58736
11486E8736J4737J2799L046K384K804M792O391M148O153L820K0M643J3272k387
$$ 58736 73473 86272 89318 91702 94506 99298 105689 109837 115990 119810 119830 124473 137745 135358
11472A35358j6182M816M900M99L297n047o616m533j0383j1361Q180l907J6565
$$ 135358 119176 123992 128892 129391 132688 127641 121025 116492 106109 94748 102928 99021 115586
11459A15586K0301n131j0629j4317j3153l374J2144J8155J2618M61k728l612n171
$$ 115586 135887 130756 120127 105810 92657 89283 101427 119582 132200 132661 129933 126321 121150
11446A21150l738j0333J0197n353p258n325N119J1698N113m632q364p707J4288
$$ 121150 117412 107079 117276 111923 104665 99340 104459 116157 121270 116638 108274 100567 114855
11433A14855Q085p306q40j2784Q859J8730O116k556J2436j953j4310j697l284
$$ 114855 122940 115634 114794 102010 110869 129599 135715 133159 145595 143642 129332 127635 124351
11420A24351J1841J0174j0882K573j186p513P59J0501j4139j4160p636q47J5917
$$ 124351 136192 146366 135484 138057 136871 129358 130117 140618 126479 112319 104683 103836 119753
11407A19753Q796L335K033N596m782M034K656j1005p829M957P520J2346q865q734
$$ 119753 128549 131884 133917 139513 134731 138765 141421 130416 122587 127544 135064 147410 138545 129811
11393A29811k324J1410k591k1454K08K349J3912K1598P588q506o006j6716j1402
$$ 129811 127487 138897 136306 114852 115060 117409 131321 152919 160507 152001 145995 129279 117877
11380A17877j087j315j0505N485K1976J5298M456m851j9918j047j996J1111J6864
$$ 117877 116790 115475 104970 110455 132431 147729 152185 147334 127416 126369 124373 135484 152348
11367A52348L219m866Q12k468j3942j7774J5461M868N23O934J447L624K3371J9527
$$ 152348 155567 150701 151513 149045 135103 117329 132790 137658 138181 145115 146562 150186 173557 193084
11353A93084J8494K2939M4243N4617L0796J6261M562k0656k8907l7844l1672K516
$$ 193084 211578 234517 278760 333377 364173 380434 384996 364340 335433 297589 265917 268433
11341B68433j0310q913j0672j5131j3208j1556l494m247L691J0776P012m296m28
$$ 268433 258123 249210 238538 223407 210199 198643 195149 190902 194593 205369 212381 208085 207657
11328B07657p123J548N404M338J019N917K962K1906K7334J7767L0863L1273N2196
$$ 207657 200534 202082 207486 211824 212843 218760 221722 243628 270962 288729 319592 350865 403061
11315D03061N6413N1727M4793N0199N6787M4657J4485j3225j3232k4833n5390
$$ 403061 459474 511201 555994 606193 662980 707637 722122 708897 695665 670832 615442
11304F15442o2448p0247n9008l8075j3329j9243l637J3490J9414M154n309j6265
$$ 615442 552994 482747 423739 385664 372335 353092 349455 362945 382359 386513 381204 364939
11292C64939r398j3426l299j2520J5018p43L207J0500J497N742J7585M7777L4095
$$ 364939 355541 342115 338816 326296 341314 340571 343778 354278 355775 361517 379102 426879 460974
11279D60974J1850o418M765K8936K7098J4509J6877K7842P668J31j9887j5673
$$ 460974 472824 466406 471171 500107 527205 541714 558591 586433 594101 594232 574345 558672
11267E58672r233j8806l6395k2971m940J070j0225j0753q285k0641j7701j3378
$$ 558672 549439 530633 494238 471267 466327 467397 457172 446419 438134 417493 399792 386414
11255C86414l141O120L1619M5935O7635N5160Q3358Q3316L7614Q14l6677o8591
$$ 386414 383273 389393 421012 466947 534582 589742 673100 756416 794030 794844 758167 689576
11243F89576r1038p4061n8303l8894k7564k5257j7432j6949j5561M41r981J6033
$$ 689576 598538 524477 466174 427280 399716 374459 357027 340078 324517 324958 314977 331010
11231C31010j260O153J7291K5547M967j9206k0417j924M22L29R23L97J7640L2200
$$ 331010 329750 335903 353194 378741 383708 364502 344085 342161 342583 342912 343835 344232 361872 394072
11217C94072L5837M5186K4760P718K6243K7616J1804Q5r664n038j3587j6783j7821
$$ 394072 429909 475095 499855 507573 533816 561432 573236 573321 563657 558619 545032 528249 510428
11204E10428l1164j0285P945K921j7363l9932k1732k303L390j4901k8076k0162
$$ 510428 479264 468979 476924 479845 462482 422550 400818 398515 401905 387004 358928 338766
11192C38766j258R757K262o712j7834P52J2726J0251J7713J9976K8571K5329O078
$$ 338766 337508 347265 349527 342815 324981 325733 338459 348710 366423 386399 414970 440299 446377
11179D46377j329j1608K1112K9130K8936K7485K4121J0426r293m1687n8790l6860
$$ 446377 445048 433440 454552 483682 512618 540103 564224 574650 565357 523670 464880 428020
11167D28020l1757k7067q079o157Q36R272Q418K1464K2158J4891p68J1967J1208
$$ 428020 396263 369196 361117 354960 355796 365068 373486 394950 417108 431999 431231 443198 454406
11154D54406J6916K0079R994j400j1736k0050j9622k5040q328J626M292K839J3323
$$ 454406 471322 491401 501395 499995 488259 468209 448587 423547 415219 416845 421137 423976 437299
11141D37299J1909J6928J3521m282L924m721l476r831j8823o777n18N76n009o292
$$ 437299 449208 466136 479657 475375 479299 474578 471102 461271 442448 435671 435153 435729 430720 424428
11127D24428K2732J9005J4285L309J2662J6674Q107j2065j9724k7243k4213j1099
$$ 424428 447160 466165 480450 483759 496421 513095 521202 509137 489413 462170 437957 426858
11115D26858J1370O092j2271N474L816J5651L4063K1746K2052K4805L9489L5240
$$ 426858 438228 444320 432049 437523 441339 456990 491053 512799 534851 559656 599145 634385
11103F34385J0973j1040j2174l64q195J965J1715J1961K6418L5748K0153K2622
$$ 634385 645358 634318 622144 621780 613585 615550 627265 639226 665644 701392 721545 744167
11091G44167K1837k051l3621k8077m1150k6835r968m622j286J9809o473k1644
$$ 744167 766004 763953 730332 702255 661105 634270 624302 619680 618394 638203 631730 610086
11079F10086p647p726j3209n223M807k477j8501j6626n076L609Q802q156r229
$$ 610086 602439 594713 581504 576281 581088 578611 560110 543484 538408 542017 550819 542663 533434
11066E33434K2260J1624J2737J641K958R660J6622k277k810J8026Q05j5244k2261
$$ 533434 555694 567318 580055 581696 584654 594314 610936 608659 605849 623875 624680 609436 587175
11053E87175j0893o669L123O902J0683R858J1164J0719J0458J4059j4467j4433
$$ 587175 576282 569613 572736 579638 590321 600179 611343 622062 632520 646579 632112 617679
11041F17679P853J2421k1424r476J5188O064O361m980N028R149K0585L388O184
$$ 617679 625532 637953 616529 607053 622241 628305 634666 629686 634714 643863 664448 667836 674020
11028F74020J5504L9787K5747J1350j392j850K0434J5467L010k686k1725k5504
$$ 674020 689524 729311 755058 766408 765016 763166 783600 799067 802077 799391 777666 752162
11016G52162o144m011M913K1147L3078J9200L800N269K0393K1146K9784J4382
$$ 752162 746018 742007 746920 768067 801145 820345 824145 829414 849807 870953 900737 915119
11004I15119J2083N377J9281n69R789n924j1583o960o028l1586j2060Q625M830
$$ 915119 927202 932579 951860 951291 961080 955156 943573 936613 930585 898999 886939 895564 900394
10991I00394P102J9199J1129N533J5854L0865K1988L0506J2737J9622P921J3379
$$ 900394 907496 926695 937824 943357 959211 990076 1012064 1042570 1055307 1074929 1082850 1096229
10979A096229J3126J8285J4569k284M905K1137J0242K2461L4158J3483K7850J8717
$$ 1096229 1109355 1127640 1142209 1139925 1144830 1165967 1176209 1198670 1232828 1246311 1274161 1292878
10967A292878J9886L1099M8739M3384N2202N5617N9205O6293P8821R3221P9063
$$ 1292878 1312764 1343863 1392602 1435986 1488188 1543805 1603010 1669303 1748124 1841345 1920408
10956A920408Q6277J18208J30919J62134J91356J94596K03956K01246K28037K78845
$$ 1920408 2006685 2124893 2255812 2417946 2609302 2803898 3007854 3209100 3437137 3715982
10946C715982L51342M74222O02502P67563R85509J297465J765772K504526L610610
$$ 3715982 4067324 4541546 5144048 5911611 6897120 8194585 9960357 12464883 16075493
10937A6075493N082088O564351P370742O793129M536421J010698k689897n412412
$$ 16075493 21157581 27721932 35092674 41885803 46422224 47432922 44743025 39330613
10929C9330613o678704o482432n304116l874732k625129j720235j062022n88966
$$ 39330613 32651909 26169477 20865361 16990629 14365500 12645265 11583243 10994277
10921A0994277k85664r5071N0978J74295K45853K43335K01923J78478K02296L15815
$$ 10994277 10708613 10613542 10664520 10838815 11084668 11328003 11529926 11708404 11910700 12226515
10911A2226515N49499Q95609J376858K001953K729077L542601M387636N223835
$$ 12226515 12776014 13671623 15048481 17050434 19779511 23322112 27709748 32933583
10903C2933583O006474O733340P495588Q202265Q519770P890555O082119L339117
$$ 32933583 38940057 45673397 53168985 61371250 69891020 77781575 83863694 87202811
10895H7202811K60063k551784m695164n974834o346238n932446n023575l918413
$$ 87202811 87462874 84911090 80215926 74241092 67894854 61962408 56938833 53020420
10887E3020420k775930j882819j490285j433393j526246j808734k051487j851174
$$ 53020420 50244490 48361671 46871386 45437993 43911747 42103013 40051526 38200352
10879C8200352j158969k11107O30897J060802R73601M29395l55531r10416q91715
$$ 38200352 37041383 36830276 37461173 38521975 39495576 39924971 39569440 38659024 37767309
10870C7767309l98571J86281M24893K07661k33278p00156q68406m98966O32967
$$ 37767309 37368738 37555019 37979912 38187573 37954295 37254139 36385733 35886767 36519734
10861C6519734K474121M705424O585178P204690O160103L776935Q45976j801211
$$ 36519734 38993855 43699279 50284457 57489147 63649250 67426185 68272161 66470950
10853F6470950l387503l670446l024303k316897k233048k644749l016460k941390
$$ 66470950 63083447 59413001 56388698 54071801 51838753 49194004 46177544 43236154
10845D3236154k183465p55457R81725K443032L196984L415175L634434L956965
$$ 43236154 41052689 40297232 41278957 43721989 46918973 50334148 53968582 57925547
10837E7925547M189067M556185N488035O539083O307061L793925p08531n622881
$$ 57925547 62114614 66670799 72158834 78697917 85004978 88798903 88090372 82467491
10829H2467491r320100j1104342j1026082r559586p483455n450762l824393k622817
$$ 82467491 73147391 62043049 51016967 41457381 33973926 28523164 24698771 22075954
10821B2075954j842350j363406j116474r89674r20345q78023q35909p55561n75230
$$ 22075954 20233604 18870198 17753724 16764050 15843705 14965682 14129773 13374212 12798982
10812A2798982l00716K4563M21568Q59472J317952J825346K397282L085414L796172
$$ 12798982 12498266 12522829 12944397 13803869 15121821 16947167 19344449 22429863 26226035
10803B6226035M234532M208379L901930L731645L690249L605393L204911K155975
$$ 26226035 30460567 34668946 38570876 42302521 45992770 49598163 52803074 54959049
10795E4959049M13568j533212l019583l672424l559952l176064k863973k753557
$$ 54959049 55372617 53839405 50819822 47147398 43587446 40411382 37547409 34793852
10787C4793852k821368l046922l299158l319283k994545k478699j967327j575267
$$ 34793852 31972484 28925562 25626404 22307121 19312576 16833877 14866550 13291283
10779A3291283j241529q78773n13974j66723J29980M09027O02911O84605O50129
$$ 13291283 12049754 11170981 10657007 10490284 10620264 11029291 11632202 12316807 12966936
10770A2966936N16623L73239L25637M90352R27993J622533K644935M063485N812841
$$ 12966936 13483559 13856798 14182435 14672787 15600780 17223313 19868248 23931733 29744574
10761B9744574P429198P997322O852631L986224l1536m005369o787901p736846
$$ 29744574 37173772 45171094 52023725 56009949 55978413 51973044 45185143 37448297
10753C7448297o931689n219757l450516k035275r25847K6792R61859J987481L148061
$$ 37448297 30516608 25296851 21846335 19811060 18885213 18912005 19873864 21861345 25009406
10744B5009406M226237M812554M532498L467591J916808K39679j003143j247946
$$ 25009406 29235643 34048197 38580695 42048286 43965094 44204773 43201630 41953684
10736D1953684m77370N85865R28550K12242r59970j844941k333231k462252k076279
$$ 41953684 41476314 42062179 42990729 43202971 42243001 40398060 38064829 35602577 33526298
10727C3526298j006136M43840J588537J983535J423565L6548j591634k913156
$$ 33526298 32520162 32964002 34552539 36536074 37959639 37996187 36404553 33491397
10719C3491397l588636l683635l361903k722680k009577j335968p65701k87136
$$ 33491397 29902761 26219126 22857223 20134543 18124966 16788998 16023297 15736161
10711A5736161J80029O92817J279978J857169K267604K323873J955070J252581
$$ 15736161 15916190 16609007 17888985 19746154 22013758 24337631 26292701 27545282
10703B7545282M45357j61270l03643Q9144O53070R77288Q14254J82048n97478
$$ 27545282 27990639 27829369 27525726 27614870 28267940 29245228 30059482 30241530 29644052
10694B9644052j179572j279294q36181j28371M70342O36929K53511n28855j492157
$$ 29644052 28464480 27185186 26349005 26220634 26690976 27327905 27581416 27052561 25560404
10685B5560404k204394k447402k209690j660550q91467j5428Q32202J501288J822912
$$ 25560404 23356010 20908608 18698918 17038368 16146901 16131473 16963675 18464963 20287875
10676B0287875J679939J082628L75053j49451m10539m78381m29021m72370r39546
$$ 20287875 21967814 23050442 23425495 23276044 22865505 22387124 21958103 21485733 20546187
10667B0546187j804495k599404k866406k593861k070325j575453j172974q80723
$$ 20546187 18741692 16142288 13275882 10682021 8611696 7036243 5863269 4982546
10659D982546o87321n56106m44447l49836k80423k60201k12812j63898j27941
$$ 4982546 4295225 3739119 3294672 2944836 2664413 2404212 2191400 2027502 1899561
10650A899561j18949j01636r7887r6034o8661m9819l3270k3007N470M4789O9545
$$ 1899561 1780612 1678976 1581089 1485055 1416394 1366575 1333305 1310298 1315768 1360557 1430102
10639A430102J30660J90580J20255j21421l10901k74798j49005o1876k4639r058
$$ 1430102 1560762 1751342 1871597 1750176 1439275 1164477 1015472 953596 928957 919899
10629I19899l2268o8587p9632m8865j6112K2384J2867j1737j85n929j2183j9959
$$ 919899 887631 819044 739412 690547 674435 696819 709686 697949 697764 691835 679652 659693
10617F59693l4396k7616j7638m970j5337l9776j5954Q790J8766l838r070q17k0275
$$ 659693 625297 597681 580043 575073 559736 519960 504006 512796 531562 527724 518654 517837 497562
10604D97562j4760r831j7867p414K50R231K6142M7917P4641J04577J99155K61563
$$ 497562 482802 472971 455104 447690 447940 457171 483313 531230 605871 710448 909603 1171166
10592A171166K00524j9306k71220k60812j44610p1796m9651m2154k3286k3108
$$ 1171166 1371690 1352384 1081164 820352 675742 603946 554295 512141 488855 465747
10582D65747k652j5648r777l03q822j2790J0702J2794J4540L0545K7375K1630
$$ 465747 463095 447447 437670 437367 428545 415755 426457 439251 453791 484336 511711 533341
10570E33341J3730j4189l3026k8650m4657m6172l1373l3905k0274j3740r746q696
$$ 533341 547071 532882 499856 471206 426549 380377 349004 315099 294825 281085 271339 262643
10558B62643j2587p79j0301L696K7615K3363L4789M9090O3707P5903Q8415M9102
$$ 262643 250056 249277 238976 242672 270287 293650 328439 377529 441236 517139 605554 654656
10546F54656k4513r0437q9600q3441o1624m4161j4819O75o549j2056j0947o02
$$ 654656 630143 539706 450106 366665 305041 260880 246061 246736 240187 228131 217184 216582
10534B16582p215N709J4962O777K1667J7177J2797K1559J4642J0288l671O442
$$ 216582 209367 215076 230038 236815 258482 275659 288456 310015 324657 334945 331274 337716
10522C37716m400L259n84q623M773J6960K802J5093M4400M9581M3105K6139J172
$$ 337716 333316 336575 335991 327368 332141 349101 351903 366996 411396 460977 504082 530221 531393
10509E31393k3805m1741m2483m9474l2988j2660j6566k0278j4229j5332K573L0008
$$ 531393 507588 465847 423364 373890 340902 328242 311676 291398 277169 261837 264410 294418
10497B94418K1882l223q511P160J3878L050L832J13j4494m881k507J6627J2432
$$ 294418 316300 313077 304566 311726 325604 328654 332486 332599 318105 313224 310717 327344 339776
10484C39776J6229K4489K6924L8550L4474M6414O1987P1508Q3141R7581R8289
$$ 339776 356005 380494 407418 445968 480442 526856 588843 660351 743492 841073 939362
10473I39362M7909j1470l8253n3901o5967o3997o1031l1746j7664j5695j9942
$$ 939362 987271 975801 937548 883647 817680 753683 692652 660906 643242 627547 607605
10462F07605k0819j696N794k8308k0588k217L0563Q4267J03326R0220L7050j9080
$$ 607605 586786 585090 590884 562576 541988 539771 570334 654601 757927 848147 885197 866117
10450H66117P959O0815P5378Q3584J375j22033j67059j34935r3093l8069M665
$$ 866117 874076 934891 1010269 1093853 1095228 973195 806136 671201 578108 540039 544704
10439E44704K9031N1175L2173K0762J3792J1380o960j4685k4404p711l088r288
$$ 544704 573735 624910 657083 677845 691637 703017 696057 681372 656968 649257 646169 636881
10427F36881M17r27P936n296k0358l4135l2694j3473J0847L4215L7438L6639N8125
$$ 636881 637298 636371 644307 639011 618653 584518 551824 538351 549198 583413 620851 657490 715615
10414G15615N8629L4362J9516J0486L165k1400n4896n9020l9428k4946j8858j0426
$$ 715615 774244 808606 828122 838608 841773 820373 765477 706457 667029 642083 623225 612799
10402F12799n477K0388K4157K5549K4452K343j835J1540J6816M747j3851l022
$$ 612799 607322 627710 651867 677416 701868 704211 702376 713916 730732 735479 721628 718606
10390G18606J1663K4948K5064J9116L4424M9828O1845O0003O2526O7335O5436
$$ 718606 730269 755217 780281 799397 833821 883649 945494 1005497 1068023 1135358 1200794
10379A200794O8723O2186L8927L6842M6594M4172M6087K6975J6921K9604M9054
$$ 1200794 1269517 1331703 1370630 1407472 1454066 1498238 1544325 1571300 1588221 1617825 1666879
10368A666879O3009R3058J08764J32876J58456J96857J77517L7114n6543j9970
$$ 1666879 1729888 1822946 1931710 2064586 2223042 2419899 2597416 2634530 2577987 2558017
10358B558017L1460O0122Q9398J29117J68033J76390J92804K41524L02950L47466
$$ 2558017 2589477 2649599 2738997 2868114 3036147 3212537 3405341 3646865 3949815 4297281
10348D297281M06496M42000M59820M96575O10866R16017J342084J736321J930697
$$ 4297281 4703777 5145777 5605597 6102172 6713038 7629055 8971139 10707460 12638157
10339A2638157J628811R71602O95817J095079J829284K745528L806387N086663
$$ 12638157 14266968 15238570 15934387 17029466 18858750 21604278 25410665 30497328
10331C0497328O876642R572603J3966386K1353270L3588377N2912925P8299334
$$ 30497328 37373970 46946573 60912959 82266229 115854606 168767531 247066865
10324B47066865R5257171O7065741j9201375q9252888r1575969o3170871l9398403
$$ 247066865 342324036 409389777 390188402 300935514 209359545 146188674 106790271
10317A06790271k5193015j7561160j3548692j0367650p541046n442657l989554
$$ 106790271 81597256 64036096 50487404 40119754 32578708 27136051 23146497
10310B3146497k978211k141194j352803p87026p57752j287315j729217j706158
$$ 23146497 20168286 18027092 16674289 15887263 15129511 13842196 12112979 10406821
10302A0406821j443054j214781j022731p77826n98008m55680l60488l10912k90740
$$ 10406821 8963767 7748986 6726255 5948429 5350421 4894741 4534253 4223341 3932601
10293C932601k17828j32004n2055O0445J59404J75222P4047k00941m35852m63843
$$ 3932601 3714773 3582769 3530714 3591159 3750563 3925785 3999832 3798891 3363039 2899196
10283B899196m00109l00578k24235j72151j46936j15167q2344p4433p0407n2865
$$ 2899196 2499087 2198509 1974274 1802123 1655187 1540020 1457676 1383243 1312836 1259971
10273A259971l5360l1647k5934m7679o4655o2849n3012m2911l6611l8593l1593
$$ 1259971 1224611 1192964 1167030 1119351 1054696 991847 938835 895924 859313 820720 789127
10262G89127r547P218K1271J0335K227l04K045M348j7694l6050n2925l6346l6717
$$ 789127 779580 786798 808069 818404 820631 820327 822372 826720 809026 772976 720051 683705 646988
10249F46988m8579l0548k3256m1828j9608m26m464r799k0015j2824r594k0470
$$ 646988 598409 567861 544605 502777 483169 482743 478279 468480 448465 435641 426047 405577
10237D05577k6072p908r017k2295k7044l5232j5167J8283K1182J528l710p190
$$ 405577 379505 371597 362580 340285 313241 278009 262842 281125 302307 303835 300125 292935
10225B92935J0421r487o695k0802k7020j7369P535m260P603K059R452j273P463
$$ 292935 303356 293869 287174 266372 239352 221983 229518 225258 232861 234920 244372 243099 250562
10212B50562K4859J3415K259J3678J253J4348L5245J9070M345l9884r0677j08564
$$ 250562 275421 288836 291095 304773 306026 320374 355619 374689 379034 339150 248473 139909
10200A39909r8508o9412l495L9372N5940K4324j9781m0907M013N5405O9278N3467
$$ 139909 41401 -28011 -31506 7866 63806 88130 68349 27442 31455 86860 156138 209605
10188B09605L1503J2266N974J1708Q403K2602P564N519P111N269L4327N2031Q8908
$$ 209605 241108 253374 259348 271056 279459 302061 309625 315144 322255 327524 361851 413882 502790
10175E02790Q0994M2048J5199P6275J58238K67312M29355O12166O87944L48975
$$ 502790 583784 625832 641031 717306 875544 1142856 1572211 2184377 2872321 3221296
10165C221296l44552p27649o16823m09788k47118j85210j43388j03871r3536n6829
$$ 3221296 2876744 2149095 1532272 1122484 875366 690156 546768 442897 349361 292532
10155B92532j8785j9709k7243k1352k0065j9369k5994j4046J2076N780Q96m100
$$ 292532 273747 254038 226795 205443 185378 166009 140015 125969 138045 143825 144721 140621
10143A40621l581k129R26J2713K742j4329l6810l2525j7543N863P809l612m71
$$ 140621 137040 134911 135837 148550 151292 136963 100153 67628 50085 55948 63757 60145 59674
10130E9674m174J0381M968M8j0711k5370p824P302P086p572R00K860k925N723
$$ 59674 55500 65881 70849 70897 60186 34816 26992 34294 41380 33808 34708 37568 34643 40366
10116D0366K0313K3052J4743K261l584j2875k1124J3400J7960J65j7367r448q98
$$ 40366 60679 83731 98474 100735 97151 84276 63152 76552 94512 94677 77310 67862 66964
10103F6964M547M944J6841L805M22n266j125J3092K2353o274m752K0117J3657
$$ 66964 71511 76455 93296 97101 97523 92257 91132 104224 126577 120303 115551 135668 149325
10090A49325n710m351j1144l808p711j709o196J66K1795K4651q04K4910L3050
$$ 149325 143615 139264 128120 124312 116601 114892 108696 108862 130657 155308 154504 179414 212464
10077B12464O326K4406L3640L5578L1144L685j9168l1364l0277q704J5019K0759
$$ 212464 218790 243196 276836 312414 343558 347243 328075 296711 266434 257730 272749 293508
10065B93508N9590O2843J6265l3167o9008o2656l8897l5037k7259j2159k2676
$$ 293508 353098 415941 432206 399039 330031 267375 228478 193441 166182 154023 131347
10054A31347j4522p448j5805r391N981J992J776p019p623J1126N601K0539J4462
$$ 131347 116825 109377 93572 84181 90162 92154 93930 86911 79288 90414 96015 116554 131016
10041A31016q297k0445J908L698m762o600j4439l955p580j5050k966Q18J3179
$$ 131016 122719 102274 104182 107880 103118 96518 82079 78124 70544 55494 52528 53346 66525
10028F6525P318o68k320o231J276K4661N3901M7262l0635r8929j04485p1696k7323
$$ 66525 73843 73175 70855 64624 65900 90561 144462 191724 161089 62160 -42325 -114021 -141344
10015a41344L4706Q5903R0143Q9037P7989R5099J43540J96283J90537M1727j43431
$$ -141344 -106638 -20735 69408 158445 236434 331533 475073 671356 861893 903620 760189
10004G60189k17056j62588r7446o4117k6171j8892j004o875j5757q035j4727k5284
$$ 760189 543133 380545 283099 218982 192811 173919 172915 166040 150283 142248 127521 102237
9992A02237k1443j1708j097Q263m769m09j7998j5759p798L578J4166K0617l849
$$ 102237 80794 69086 67989 76252 71483 71074 53076 37317 29519 33097 47263 67880 64031
9979F4031m802J719l750j0720M654J6278J454M191J3982J6055K5222k8j1171j0576
$$ 64031 59229 60948 57198 46478 51132 67410 68864 73055 87037 103092 128314 128286 117115 106539
9965A06539j6102J475K168k490k917J3932K05q789m284j3113n765l166q792l982
$$ 106539 90437 91912 94080 91590 88673 102605 102810 94021 89737 76624 70859 67693 58901 54919
9951E4919L998N736N416q222q562k079J202K282n205R151k177O667R239J3003
$$ 54919 58917 64653 70069 61847 53285 51206 52408 54690 49485 58636 56459 63126 72365 85368
9937H5368J3736r4l523N203L899O483J959j4530j0079R246J1980O891P954J1277
$$ 85368 99104 99010 95487 100690 104589 111072 113031 98501 88422 97668 109648 116539 124493 135770
9923A35770J7440K3770L010j778j23p473J0572J6155J8444J6593n232q160J0588
$$ 135770 153210 176980 179990 178212 178089 170616 181188 197343 215787 232380 227148 218988 229576
9910B29576J4921J7856N0948P4278P7291R7648J15276J92386K94422L98458M33394
$$ 229576 244497 262353 313301 387579 464870 562518 677794 870180 1164602 1563060 1996454
9899A996454K44756j45297m23232m28955l10587j97361j27782q9547m8451j7966
$$ 1996454 2241210 2095913 1672681 1243726 933139 735778 607996 518449 469998 452032
9889D52032l2230l8651k8227k1617j7078k7892j5527J0593m127m382k039J2048
$$ 452032 419802 381151 352924 331307 314229 286337 270810 281403 277276 272894 270855 282903
9877B82903J4169o591k8389k5301j4612j3103j4851k5746j8928j2432r550J1905
$$ 282903 297072 290481 262092 236791 222179 209076 194225 168479 149551 137119 127569 139474
9865A39474L5114M728l32j8724j8073k2727l605J8998K3077P121L983M142n732
$$ 139474 174588 179316 178984 160260 142187 119460 115855 134853 157930 165051 169034 173176 167444
9852A67444K257j294k653N008K5914L2253K3757L5221L4472K8587J1494j9379
$$ 167444 169701 168407 165754 170762 196676 228929 252686 287907 322379 350966 362460 343081
9840C43081k7422j3392k0450q485k0330J249N231L966M2948N3997P1354J06492
$$ 343081 315659 302267 281817 273332 253002 254251 259482 263448 306396 360393 431747 538239
9828E38239J12706P8502N1659J48182L85034O94912P52471K00562n71943q25318
$$ 538239 650945 729447 781106 929288 1314322 2009234 2761705 2962267 2390324 1565006
9818A565006n96327k90602j42834q5470l9954k3540j5426q304j1170k0856J8556
$$ 1565006 968679 678077 535243 449773 409819 386279 370853 362549 351379 330523 349079
9807C49079K2016L6021M6285J9619m499L410J5090K3099L6343N2506Q6603J10233
$$ 349079 371095 407116 453401 473020 468521 471931 487021 510120 546463 598969 685572 795805
9795G95805J18252Q7340J698j10065j63766j50164j12672n7949l2694l0070j3086
$$ 795805 914057 1001397 1003095 893030 729264 579100 466428 408479 375785 345715 332629
9784C32629j1859j70O00Q87j2921k9370k8177J633J5663J5087K9174M377l8613
$$ 332629 320770 320600 321200 322087 309166 279796 251619 253252 268915 284002 313176 317553 278940
9771B78940l9617j8824Q303N192r84k240k832j7644k8616p411n813r891j3232
$$ 278940 239323 220499 228802 233994 233010 230770 227938 210294 181678 174267 168454 158563 145331
9758A45331k917J1475J2401J0060J4959k473o118J716K8963K3909n119k4191m636
$$ 145331 142414 153889 166290 176350 191309 188836 182718 184434 213397 237306 232187 207996 203360
9745B03360q491k1496n692J1114P39p565L834J5407N377N719R955J1739J7136
$$ 203360 194869 173373 167681 178795 179534 171969 175803 191210 196587 202306 212261 224000 241136
9732B41136J1958J9449K7182K0177J6448J0912Q728M420m288n437j4952o721O165
$$ 241136 253094 272543 299725 319902 336350 347262 355990 360410 356122 350685 335733 329012 335177
9719C35177R368Q324Q463K588M844J4065J3886J2997P92Q144Q481p821k9681k4548
$$ 335177 344545 352869 361332 363920 368764 382829 396715 409712 410504 418648 427129 419308 389627 365079
9705C65079j8295j3665q239k0161j5004r202q021j6649j3021j1193j6270M682
$$ 365079 346784 333119 324880 304719 289715 280513 272492 255843 242822 231629 215359 220041
9693B20041j448j2613N643J3163n20j1592o00K758j404J063L601q23p348M902
$$ 220041 218593 205980 211623 224786 224266 212674 212074 214832 213428 214491 218092 217269 209921 214823
9679B14823P019j831L436J1525O642J510P164J0252J3703J7820Q875J9266J5130
$$ 214823 221842 220011 223447 234972 241614 243124 250288 260540 274243 292063 300938 320204 335334
9666C35334K0263K7240M1120N2984N7470O0802L5139K467K3993N4469R924m4210
$$ 335334 355597 382837 423957 476941 534411 595213 630352 632819 656812 711281 721205 676995
9654F76995m0660p257J3024L091j3358j5738j5693r21o876o838j5972j4038j6329
$$ 676995 636335 629078 642102 645193 631835 616097 600404 599483 592607 585769 569797 555759 539430
9641E39430k2134K611k514q235r317j4662q105k5385j5397k2256m646j8844n568
$$ 539430 517296 519907 517393 509158 499841 485179 477074 451689 436292 414036 409390 390546 384978
9628C84978p696n434P440K0942K1821R747n778k7993j7515j0026op826r661J1690
$$ 384978 377282 371848 379288 400230 422051 431798 426020 398027 380512 370486 370480 362654 352993 364683
9614C64683j6558l780R711L836p368L902L135N042J1197p041j4711j3839L973
$$ 364683 348125 344345 354056 357892 350524 354426 357561 362603 373800 366759 352048 338209 342182
9601C42182q771N257K0166J3088J3610J0971K124O249R943k304R653p797J5571
$$ 342182 333411 338668 358834 371922 385532 396503 398627 404876 414819 412515 422168 414371 429942
9588D29942L1160R253J5623K2093l280J0900K4299J2216l07k943J615J2475K1667
$$ 429942 461102 470355 485978 508071 504791 515691 539990 552206 551899 548956 550571 563046 584713
9575E84713J3614j4676j3631p789j2370p860J763J2755J845n773l514P487J1850
$$ 584713 598327 583651 570020 562231 549861 542001 543764 556519 558364 552591 549077 556564 568414
9562E68414J5967J6962J7813J535K0953K1359L97n61J8451K6652K2346K9475K0384
$$ 568414 584381 601343 619156 620691 641644 663003 663400 662839 681290 707942 730288 759763 780147
9549G80147M735K4803Q952K0318O4783P0129O7772P8531J02801J13148J43126
$$ 780147 784882 809685 818637 838955 903738 973867 1041639 1120170 1222971 1336119 1479245
9538A479245J56122J73319K20650K59699L06664L78562N41395P73153J087527
$$ 1479245 1635367 1808686 2029336 2289035 2595699 2974261 3515656 4288809 5376336
9529E376336J511755J988708K330159K161888J226464k59222j662500k251500
$$ 5376336 6888091 8876799 11206958 13368846 14595310 14336088 12673588 10422088
9521A0422088k024205j533488j058915o89644m13495k03417j6422J44934K80769
$$ 10422088 8397883 6864395 5805480 5115836 4702341 4498924 4482502 4627436 4908205
9512D908205L33544K35390P4980j3834j02342k10619k32644j33433k95J57757
$$ 4908205 5241749 5477139 5552119 5538285 5435943 5225324 4992680 4859247 4858952 5016709
9502E016709L38549N69318Q51783J199639J606005J973442K118353J984798J838422
$$ 5016709 5355258 5924576 6776359 7975998 9582003 11555445 13673798 15658596 17497018
9493A7497018J815416J659787J533825J911026K581485K691300J787137J67181
$$ 17497018 19312434 20972221 22506046 24417072 26998557 29689857 31476994 31644175
9485C1644175j196797j626998j479061j656465k295749k743683k704711k364500
$$ 31644175 30447378 28820380 27341319 25684854 23389105 20645422 17940711 15576211
9477A5576211j871717j359454j020466q51715p25439n37691k85217M0944L88771
$$ 15576211 13704494 12345040 11324574 10472859 9747420 9209729 8924512 8965456 9354227
9468I354227P30884R82746J079439J140080J375721J732651J773449R90851l18290
$$ 9354227 10085111 11067857 12147296 13287376 14663097 16395748 18169197 19160048 18841758
9459A8841758j025177o29699L24000J429403K697574M190921N775398O871494
$$ 18841758 17816581 17186882 17510882 18940285 21637859 25828780 31604178 38475672
9451C8475672O435313L840254l6404l664840n864416o262648n318400l811424
$$ 38475672 44910985 48751239 48714835 45049995 39185579 32922931 27604531 23793107
9443B3793107k288763j031927l34247m75952j015209j281792j348768j380884
$$ 23793107 21504344 20472417 20138170 19662218 18647009 17365217 16016449 14635565
9435A4635565j382925j368417j265211j020393o96814l85060j19554J64522M44940
$$ 14635565 13252640 11884223 10619012 9598619 8901805 8516745 8397191 8561713 9006653
9426I006653P48587J020046J247259J436780J644763J844101J873808J342354
$$ 9006653 9755240 10775286 12022545 13459325 15104088 16948189 18821997 20164351
9418B0164351L78235j72249K01766J063064J653428J607264J014869K38135m43704
$$ 20164351 20542586 20370337 20572103 21635167 23288595 24895859 25910728 26148863 25705159
9409B5705159r93024j475908j974994k237633k160986k149597k304272k200332
$$ 25705159 24712135 23236227 21261233 19023600 16862614 14713017 12408745 10208413
9401A0208413j760435j291461r21603o60068m60894k99790j67605j2883R7356
$$ 10208413 8447978 7156517 6234914 5574846 5113952 4814162 4646557 4633674 4731030
9392D731030J21633L8104o1453j35945j81248k43307k62685j95518r2751L9203
$$ 4731030 4852663 4890767 4829314 4693369 4512121 4268814 4006129 3810611 3717860 3757063
9382C757063J96763L52284N90687Q88158J256721J603951J689186J276078K80865
$$ 3757063 3953826 4306110 4896797 5784955 7041676 8645627 10334813 11610891 11891756
9373A1891756r39046j784786j959456j629688j213021q60770o01641m35176l25616
$$ 11891756 10952710 9167924 7208468 5578780 4365759 3504989 2903348 2468172 2142556
9364B142556k66454k14470j64668j31272j13216j09707r4850q8715o3775n2773
$$ 2142556 1876102 1661632 1496964 1365692 1252476 1142769 1047919 959204 895429 842656
9354H42656m4455m7472n4843k8400k0140k1510k3907k3281j4299r135j6210k5871
$$ 842656 798201 750729 695886 667486 647346 625836 601929 578648 564349 555214 539004 513133
9342E13133k8870j0801j9797r610R762N981q362p942p15j306K927m407r287k26
$$ 513133 484263 473462 453665 444055 453817 459798 451436 443494 442779 441473 444400 439993 430706 430480
9328D30480r511J054j600n289m179j5896j1190K647O196Q918J0854J1637M793
$$ 430480 420969 422023 420423 415134 410955 395059 383869 386516 392712 401630 412484 424121 428914
9315D28914J0521o271j9405M407j1279m882j155j402m277m136N729J6022K469
$$ 428914 439435 433164 413759 418166 406887 402005 400850 399448 395171 391035 396764 412786 415255
9302D15255N106j3551K685j993j4610k639m640j8510N421K4690m172j0291j0082
$$ 415255 420361 406810 409495 407502 392892 390253 385613 367103 372524 397214 393042 382751 372669
9289C72669L143J8782n852K671K153r077j2970Q724O117K3924L0404L2872K3171
$$ 372669 375812 394594 388742 391413 393566 384489 371519 380243 386360 410284 440688 473560 496731
9276D96731R384L665R784J0071k374k956j5703k6667j8149k3509p396r932R121
$$ 496731 506115 509780 519564 529635 527261 524305 508602 481935 463786 440277 432881 422949 432070
9263D32070J3658Q308R776N568P605P784J7105n86n377p894k611m943o769r215
$$ 432070 445728 454036 463812 469380 476985 484769 501874 501288 495911 488017 485406 480463 473694 464479
9249D64479n171J3772n323l527r030O892L2974L8916K6811K5963L8018M3118N0277
$$ 464479 459308 473080 467757 464230 455200 462092 495066 533982 560793 586756 624774 667892 718169
9236G18169L2618k2348l8755l2591l3062k9460k1105j8701j3497j5398p957Q27
$$ 718169 750787 728439 689684 657093 624031 594571 573466 554765 541268 525870 517913 518740
9224E18740K193J0715J2508o393n456Q104J4185P730J1071p490L61m96r880j1657
$$ 518740 520933 531648 544156 537763 532307 540411 554596 562326 573397 565907 566268 565772 555892 544235
9210E44235j5898r200j215l80R241J6742J5551J3823J1713J4874K2009J7562j2775
$$ 544235 528337 519137 517922 517542 526783 543525 559076 572899 584612 599486 621495 639057 626282
9197F26282k4553j4945n460n012n631J311j924j047P562J066l785m12j4549j742
$$ 626282 601729 586784 581324 576312 570681 571992 570068 569021 576583 577649 573864 573452 558903 557161
9183E57161q917p227R651K47J5486Q058j08l927J268J2616K3636P470o00n127
$$ 557161 548244 541017 550668 550915 566401 574459 574351 570424 571692 584308 607944 615414 614814 609687
9169F09687l514J684l113J6638J5225Q305Q252m526L800J1007R405o391n601N88
$$ 609687 606173 607857 604744 621382 636607 644912 653164 648638 652438 663445 672850 666459 660858 661446
9155F61446j229k967Q972J1037J0690J875J9182M077j0747j3744J4232P232k693
$$ 661446 660217 657250 666222 677259 687949 689824 709006 713083 702336 688592 702824 710056 707363
9142G07363n75K2017J0066k606J0004k667l547O842J3177J253J368J6315K1116
$$ 707363 706788 728805 738871 736265 746269 743602 740055 746897 760074 761327 762695 779010 800126
9129H00126K9713K5722K5856K5600O687j2227k9393k6898p527J7311J6071J0934
$$ 800126 829839 855561 881417 907017 913704 901477 872084 845186 837659 854970 871041 881975
9117H81975j117m313L513q245L988J2742Q142J5678J1458P571M176m897J425J2980
$$ 881975 880858 876545 880058 871813 875801 888543 896685 912363 923821 931392 935568 930671 932096 945076
9103I45076K5257L24K190L0792J9640J8616J7390K1297K3093K5757K6287K4863
$$ 945076 970333 970657 972847 1003639 1023279 1041895 1059285 1080582 1103675 1129432 1155719 1180582
9091A180582K2532J3594J8191R477q973k598k668L095O164O899M815M153l174
$$ 1180582 1203114 1216708 1234899 1244376 1235403 1232805 1230137 1233232 1239396 1246295 1251110 1255263 1252089
9078A252089j117O804o547L088n638Q681J6791J8741J3193M630J0190L1411K2502
$$ 1252089 1250972 1257776 1251229 1254317 1248679 1257360 1274151 1292892 1306085 1310715 1320905 1352316 1374818
9065A374818J0916K2551K7262K5779J2035R270p11M711J1697J4685L6277O6977
$$ 1374818 1385734 1408285 1435547 1461326 1473361 1482631 1481920 1486631 1498328 1513013 1549290 1616267
9053A616267N2493L0056L6356K5799q14k0464j7505j5700p755R614m151Q238K2137
$$ 1616267 1668760 1698816 1735172 1760971 1760157 1739693 1722188 1706488 1698733 1708347 1704196 1712434 1734571
9040A734571K0096K2864J6677K4276J2634J3932m362J1057L0338J7291J7151L27
$$ 1734571 1754667 1777531 1794208 1818484 1831118 1845050 1840688 1851745 1882083 1899374 1916525 1916852
9028A916852J3598L2820K7898K9031L4757L5010L7875L0068L7282J9764K0369
$$ 1916852 1930450 1963270 1991168 2020199 2054956 2089966 2127841 2157909 2195191 2214955 2235324
9017B235324K7813K8013M5674M3466L9529L6959L2428J6249J2683O356R662J2715
$$ 2235324 2263137 2291150 2336824 2380290 2419819 2456778 2489206 2505455 2518138 2524494 2534156 2546871
9005B546871K2464J5569J3468K0243J3170J4470L1790K6219K4749L2960L9164
$$ 2546871 2569335 2584904 2598372 2618615 2631785 2646255 2678045 2704264 2729013 2761973 2801137
8994B801137L7890K6514M5857N1294N2904M1045M3204M8947M0408M4044O3344
$$ 2801137 2839027 2865541 2911398 2962692 3015596 3056641 3099845 3148792 3189200 3233244 3296588
8983C296588L5478K8065M0063N1551N1874M4113M8547M5623M7707K6946L2472
$$ 3296588 3332066 3360131 3400194 3451745 3503619 3547732 3596279 3641902 3689609 3716555 3749027
8972C749027K8799K6222L9518L7638O3812O0584O5600O0158N0230N9442N7046
$$ 3749027 3777826 3804048 3843566 3881204 3945016 4005600 4071200 4131358 4181588 4241030 4298076
8961D298076O8768P2000O3706O3835O4524P5486P4795Q5157P9692P2818O2910
$$ 4298076 4366844 4438844 4502550 4566385 4630909 4706395 4781190 4866347 4946039 5018857 5081767
8950E081767R2369R5820R4631R5642R7681Q4312Q3548P9632R2581R7505R3608
$$ 5081767 5174136 5269956 5364587 5460229 5557910 5642222 5725770 5805402 5897983 5995488 6089096
8939F089096J02100J04085J06636R7601Q3254Q3725J08723J18000J00774J00191
$$ 6089096 6191196 6295281 6401917 6499518 6582772 6666497 6775220 6893220 6993994 7094185
8929G094185J23000J13129J07060J14633J14592J11982J11132J09384J20054J28869
$$ 7094185 7217185 7330314 7437374 7552007 7666599 7778581 7889713 7999097 8119151 8248020
8919H248020J24038J23364J32150J14757J31002J18887J21898J24476J15169J23016
$$ 8248020 8372058 8495422 8627572 8742329 8873331 8992218 9114116 9238592 9353761 9476777
8909I476777J32847J35234J01275J14418J21653J20095J25679J10421J15034J11936
$$ 9476777 9609624 9744858 9846133 9960551 10082204 10202299 10327978 10438399 10553433 10665369
8899A0665369J14252J18621J00234R9821J13612J00952Q6028P5641Q7558R4505
$$ 10665369 10779621 10898242 10998476 11098297 11211909 11312861 11398889 11474530 11562088 11656593
8889A1656593R5726R3974Q3837P9861P4790O4252N5939P8186N7993L7098M0280
$$ 11656593 11752319 11846293 11930130 12009991 12084781 12149033 12204972 12283158 12341151 12378249 12418529
8878A2418529L1836K0808K9381J8718J4527j647J380M326K309k558j0404k6882
$$ 12418529 12450365 12471173 12500554 12519272 12533799 12532152 12533532 12537858 12540167 12537609 12527205 12500323
8866A2500323m2172n6835o1898m9195l9105n4160q2008p4358p5062q5176r2012
$$ 12500323 12458151 12401316 12339418 12290223 12251118 12196958 12114950 12040592 11965530 11880354 11788342
8855A1788342p3640r2250p9664r0734j09894j24611j11430j22978j24568j15737
$$ 11788342 11714702 11622452 11542788 11452054 11342160 11217549 11106119 10983141 10858573 10742836
8845A0742836j16803j10884j20927j38593j39378j28927j28656j30588j17678
$$ 10742836 10626033 10515149 10394222 10255629 10116251 9987324 9858668 9728080 9610402
8836I610402j13507j38321j43850j25077j31030j42708j43575j31504j30564j24863
$$ 9610402 9496895 9358574 9214724 9089647 8958617 8815909 8672334 8540830 8410266 8285403
8826H285403j20932j34064j24252j30606j30079j06145r7357j08225j16340j18774
$$ 8285403 8164471 8030407 7906155 7775549 7645470 7539325 7441968 7333743 7217403 7098629
8816G098629j24611j14295j10268j10366j03180p8929q8731j07635j00549r5060
$$ 7098629 6974018 6859723 6749455 6639089 6535909 6456980 6368249 6260614 6160065 6065005
8806F065005q7866r5888r9887r7890p0972r7618q9720r4513r3563p1526q4125
$$ 6065005 5977139 5881251 5781364 5683474 5612502 5514884 5425164 5330651 5237088 5165562 5081437
8795E081437r4283q5742q6734q0004p3455o1287o5917n5704m0491o3679p4078
$$ 5081437 4987154 4901412 4814678 4734674 4661219 4599932 4534015 4478311 4437820 4374141 4300063
8784D300063p7473o6646o5085o1934n2376n6506n9521o3178n1944m6720m4710
$$ 4300063 4222590 4155944 4090859 4028925 3976549 3920043 3860522 3797344 3745400 3698680 3653970
8773C653970n5291m5212m0686n9577n0792m1216m1018m9540k6943k9511m5320
$$ 3653970 3598679 3553467 3512781 3453204 3402412 3361196 3320178 3270638 3243695 3214184 3168864
8762C168864l5780n0933n5969m7493n5290l3836k6203k9978m3242m6267m5679
$$ 3168864 3133084 3082151 3026182 2978689 2923399 2889563 2863360 2833382 2790140 2743873 2698194
8751B698194l3486m6705n0135m1940m2083k2863j1010l6896k8785l3093m5402
$$ 2698194 2664708 2618003 2567868 2525928 2483845 2460982 2449972 2413076 2384291 2351198 2305796
8740B305796l7922m3191k0043k2807k4084k0735k0419m3882l6795k4480k8557
$$ 2305796 2267874 2224683 2204640 2181833 2157749 2137014 2116595 2072713 2035918 2011438 1982881
8729A982881j7442j4188k0259l2630k4798k1934j5586j9950o136o145q672j7101
$$ 1982881 1965439 1951251 1930992 1898362 1873564 1851630 1836044 1816094 1809958 1803813 1795141 1778040
8717A778040k1772l1536j9762j3080k1325j2602j8634j9913j5956k8583k7553
$$ 1778040 1756268 1724732 1704970 1691890 1670565 1657963 1639329 1619416 1603460 1574877 1547324
8706A547324j9096j9805k2971k2284j4915j5217r039r277j4106l1342k1299p230
$$ 1547324 1528228 1508423 1485452 1463168 1448253 1433036 1423997 1414720 1400614 1369272 1347973 1340743
8694A340743q663k1681n722r364r128j7155j1948r153j9315j7867j2474j5482
$$ 1340743 1332080 1310399 1304677 1295313 1286185 1269030 1257082 1247929 1228614 1210747 1198273 1182791
8682A182791j5886j0144J963q656j1413l442j3812j1736j3512k5829q891l469
$$ 1182791 1166905 1156761 1158724 1150068 1138655 1135213 1121401 1109665 1096153 1070324 1061433 1057964
8670A057964j0650k4284j6713r24N33j035k097n914n918r888j4737j2554q331
$$ 1057964 1047314 1023030 1006317 1005393 1005926 1004891 1002794 996880 990962 981074 966337 953783 945452
8657I45452p681j7944j7584r473m757j6132p195p507j319M616K78j0287p839q639
$$ 945452 937771 919827 902243 892770 888013 871881 864686 857179 855860 860476 860754 850467 842628 833989
8643H33989j2366j8138p908j339N029R749n54q431n521q264j8377n657N204l745
$$ 833989 821623 803485 795577 794238 799267 809016 808462 800031 794510 786246 767869 762212 767416 763671
8629G63671J6755L6570M8095P5293J53626K29560J41111j49047k63127j60536
$$ 763671 780426 816996 865091 940384 1094010 1323570 1464681 1315634 1052507 891971
8619H91971r3894n3663k2723j6169j5040k56m687k3965j1784l529m163N98q233
$$ 891971 798077 744414 721691 705522 690482 690226 685539 661574 649790 646261 642098 642696 634463
8606F34463J189j5149j2079j1821J924l521j2703l372J748L290L122p439K396
$$ 634463 635652 620503 608424 596603 598527 595006 582303 578931 580679 583969 587091 579652 582048
8593E82048l618k339k537N0J926N836O531J3450K8292K6104L5002P9971J51747
$$ 582048 578430 576091 573554 573604 575530 581366 587897 601347 629639 655743 690745 770716 922463
8580I22463K77904M31201M00682j60990m93325l16631j29733l5355n0246q8383
$$ 922463 1200367 1631568 2032250 1871260 1377935 1061304 931571 896216 845970 757587
8570G57587q0600o5356l9582j5808j9175j9212k5875j7655m832p994l455j7625
$$ 757587 676987 611631 572049 556241 537066 517854 491979 474324 469492 461498 458043 440418
8558D40418N57M616r411j944r079M502o18J180R153n982j5203N85P82J1226J4451
$$ 440418 440975 445591 436180 434236 425157 429659 429041 430221 439374 433392 418189 418774 419556 430782 445233
8543D45233K11j0677j140P174J7519K216J9810N7629J21642K11155K33304K0277
$$ 445233 445444 434767 433627 440801 458320 460536 480346 537975 659617 870772 1104076 1124353
8531A124353j95239j32438j375J1085j16400j23587q0184l5656k0391l1854k1127
$$ 1124353 929114 796676 795301 806386 689986 566399 486215 450559 430168 398314 377187
8520C77187M00l974j8569p413L03r998q394O672P55o071j0667M243j2840k1791
$$ 377187 377587 373613 355044 347631 347934 337936 329542 336214 336969 330898 320231 324474 311634 289843
8506B89843o955J27j68j164J492Q274l959p106l168K908p610P251K97m251l066
$$ 289843 282888 283015 282847 281683 283175 291449 287490 280384 277216 280124 272514 279765 280062 275811 272745
8491B72745J0137Q192k174Q328n54K3791L6910L3644O416l7809l9964k9591k493
$$ 272745 282882 291074 288900 297228 296674 320465 357375 391019 397435 359626 319662 290071 287578
8478B87578p830R657q114j2378j5334m38j015k212O175m487j0838o370L186m686
$$ 287578 279748 289405 281291 268913 253579 253141 252126 249914 256089 251602 240764 234394 237580 232894
8464B32894r118M748P625N851p091K127j188j1863R285N447r867k112m651n798
$$ 232894 223776 228524 236149 242000 234909 237036 235848 223985 233270 238717 228850 226738 222087 216289
8450B16289N608K258j14j0333j1903n158P617J0755J411N117j419L12o947k299
$$ 216289 221897 224155 224041 213708 201805 196647 204264 215019 216430 221547 220128 220440 213493 211194
8436B11194j664j0746J917j344J4082J4618q008m864l1N207P34j2685j2607r716
$$ 211194 209530 198784 200701 199357 213439 228057 220049 215185 215154 220361 221095 208410 195803 186087
8422A86087j944j05o64Q265O253k152j4923J647K474j808l126J562O201J0442
$$ 186087 184143 184038 183374 191639 197892 195740 180817 182464 184938 183130 180004 181566 187767 198209
8408A98209j2291j1494o279N849P681o269j0114j1093K203Q262j3570j727P078
$$ 198209 185918 174424 168145 173994 181675 175406 165292 154199 156402 164664 151094 149367 156445
8395A56445J6066J5846M161r184q884p888J527q61L406J064L346J5563Ml172j1125
$$ 156445 172511 188357 192518 183334 174450 166562 168089 167228 170634 171698 175044 190607 190611 187439 176314
8380A76314j5228N234m766n873j868n788J79k135j0740p680l158m76P803K320
$$ 176314 161086 166320 161554 155681 153813 148025 148204 146069 135329 127649 124491 124015 131818 134138
8366A34138J2697J2754j475l944p107L257P367j596o948n953p004q727q398k406
$$ 134138 146835 159589 158114 154170 147063 150320 157687 156091 149143 143190 136186 127459 119061 116655
8352A16655R390P447k820J694J895o724J1261P490q293k405j0365J071m631L377
$$ 116655 126045 133492 130672 132366 134261 127537 138798 146288 137995 135590 125225 126296 121665 125042
8338A25042r399J497K293J261j437P015Q681k476j224o187j58q224q82k614J0428
$$ 125042 115643 117140 119433 120694 119257 126272 134953 132477 131253 125066 124908 116684 115802 113188 123616
8323A23616R412J5836P119k5918r864K178Q204K430m168n78R569J5537K6676K6317
$$ 123616 133028 148864 155983 130065 120201 122379 130583 133013 128845 128267 137836 153373 180049 206366
8309B06366K342M648j236J6619L3071K9402N1942J30132K02666K47810J90784
$$ 206366 208708 213356 212120 228739 261810 291212 343154 473286 675952 923762 1114546
8298A114546k8361k26478k36332j76490j17163p8959m5179j5378p846j1694r074
$$ 1114546 1086185 859707 623375 446885 329722 250763 205584 190206 182360 170666 161592
8287A61592j674q84o506q026o808n676r697P899R83q262j4668o356K13J2528O9
$$ 161592 159918 159034 152528 144502 137694 132018 122321 130220 131203 122941 108273 101917 102130 114658 114727
8272A14727o50R972K303N323M869J3809J3415K93J2376K1643K8790M1198N1298
$$ 114727 114077 124049 126352 131675 136544 150353 163768 164061 176437 198080 226870 268068 319366
8259C19366O2817J17095K38891L76812N36100M87831k0738m94469n30845l57361
$$ 319366 382183 499278 738169 1114981 1651081 2138912 2118174 1623705 1092860 735499
8249G35499k16052j25132q8205o5587k6986k3042j7336j3130j547j2343j6918
$$ 735499 519447 394315 306110 240523 213537 190495 173159 160029 158482 146139 129221
8238A29221J020j0312k5906p676j0303M784J8099m589k685J2496J929j1603j238
$$ 129221 130241 119929 94023 86347 76044 80828 98927 94338 91653 104149 106078 94475 93237
8225I3237L16n96O571l240N281l07K303J8349J9070K1564K4553L9514M8416R8125
$$ 93237 93553 92957 99528 96288 101569 101262 103565 121914 140984 162548 187101 226615 275031 373156
8211C73156J47315K24882K17763M6908j57096k49175j99318j07439o9185n3359
$$ 373156 520471 745353 963116 1010024 852928 603753 404435 296996 227811 174452
8201A74452k6922j4619j1991j5693j3115K630Q417r620N29j1120L968L803q429
$$ 174452 147530 132911 120920 105227 92112 94742 103159 93539 94068 82948 86916 90719 82290
8188H2290L31R262k3266j632L137M728R654m812j3160j912j019J5023q048o414
$$ 82290 82621 91883 68617 66985 70122 74850 84504 79692 66532 64620 63601 78624 70576 64162
8174F4162o019n851O985R381l765m960j0641k662n88j08J0997O07r55L155q691
$$ 64162 58143 52292 59277 68658 64893 59933 49292 46630 46042 45934 56931 57538 56583 59738 51047
8159E1047P959O435J1953m908K6k2541q206P44j134j244k808K3067N991p730O795
$$ 51047 59006 65441 77394 72486 72512 49971 41765 42509 41375 40131 37323 60390 66381 58651 65446
8144F5446q689o031l765K022J432J0692J4106o576p175l985p586P06p034j214
$$ 65446 56757 50726 46961 48983 50415 61107 75213 68637 61462 57477 49891 50597 43563 42349
8130D2349k846K503J0926J3427o092q594Q304J0679m716o838j6037J874N612j3247
$$ 42349 39503 42006 52932 66359 60267 51673 59977 70656 65940 59102 43065 44939 50551 37304
8116C7304o624p613O624J5362J3836k102n939n879o445n308j334n349N700O512
$$ 37304 30680 23067 29691 45053 58889 56787 50848 44969 38524 33216 31882 26533 32233 38745
8102C8745k961R647Q523P21k639l707j443N738k865j2366n639o744O060M174K634
$$ 38745 35784 45431 53954 54675 52036 48329 46886 52624 49759 37393 31754 25010 31070 35244 37878
8087C7878o315Q084J0080J7020j215q375m122K846q452O210L484n260r100m089
$$ 37878 31563 39647 49727 66747 65532 57157 53035 55881 47429 53639 57123 51863 42763 38674
8073C8674J4968P32r444K675Q125J9563J593j8577j1839Q159N821j431Q43m650
$$ 38674 53642 54374 44930 47605 55730 75293 76886 58309 46470 54629 60450 59019 59862 55212
8059E5212j8091L012J3218N648k2521q24J2070J9233j1890j1899q433K290N557
$$ 55212 37121 40133 53351 58999 36478 35654 47724 66957 55067 43168 34735 37025 42582
8046D2582k733K459m064J0875J578J6368N211J5694L79j240j5428k1434j0615
$$ 42582 39849 42308 38244 49119 50697 67065 72276 87970 88349 87109 71681 50247 39632
8033C9632J716K71k006p654k561K48P479j985J452N750o282J166L12r663m801
$$ 39632 41348 41619 39613 31959 29398 29646 37125 35140 36592 42342 36060 37226 37538 27875 23074
8018B3074p728M635K2435O071L357K606K444K834o826k879O342J142o104m91L106
$$ 23074 15346 19981 42416 48487 51844 54450 56894 59728 52902 50023 56365 57507 51403 50912 54018
8003E4018N906l943j686J1015j9306n061Q705J5815p951p676M624j0055K058J8658
$$ 54018 59924 55981 54295 65310 46004 40943 49648 65463 57512 49836 54460 44405 46463 65121
7989F5121J0274J1905l515j7017k1923j2024J316K725p411j1835R490J4287O734
$$ 65121 75395 87300 83785 66768 44845 32821 34137 36862 29451 17616 27106 41393 48127
7976D8127J8450J9137L280j4069n218N490j5248j5710j0612P875m307j3955J1645
$$ 48127 66577 85714 88994 74925 69707 75197 59949 44239 33627 41502 37195 23240 34885
7963C4885J1718m753R108r191j848p462L304P289J8538J4562K1014K1685K0237
$$ 34885 46603 41850 50958 41767 39919 32457 35761 43050 61588 76150 97164 118849 139086
7950A39086p725k2170j3913j1350j2801q53r755k195L692j0356l243k478Q66k755
$$ 139086 131361 109191 95278 83928 71127 70274 60519 58324 62016 51660 48417 45939 46805 44050
7936D4050j664p652j685o972j791k189Q393j082J7694R611K759l264p470j4052
$$ 44050 42386 34734 33049 26077 24286 22097 30490 29408 47102 56713 59472 56208 48738 34686
7922C4686L324Q701j5495j2620n55O440k342k228j6494L178J4899Q959R402J205
$$ 34686 38010 46711 31216 18596 18041 24481 22139 19911 3417 6595 21494 30453 39855 41060
7908D1060M804J1605l90J5359j2955j0432n541Q237O941o545j8644O223K1473
$$ 41060 45864 57469 57079 72438 59483 49051 43510 51747 58688 52143 33499 39722 61195
7895F1195K8194K9602L5783L0416K1401M48k5695m3420k2785j3037j1624j6176
$$ 61195 89389 118991 154774 185190 206591 207039 181344 137924 115139 102102 90478 74302
7883G4302j1431p848j7372j2806j163j583O502q651o16R505j050m107j320K43
$$ 74302 62871 55023 37651 24845 23682 22099 28601 19950 19334 28839 27789 23682 22362 22605
7869B2605m21P641M282j061k669m542k647K913J0391o314l505Q238J2722j053
$$ 22605 22184 29825 34107 33046 30377 25835 23188 26101 36492 30178 26673 34911 47633 46580
7855D6580P886k585p600O513J3147L4397L3032L7433P0164P8818M7708J9224k9208
$$ 46580 54466 51881 44281 50794 63941 98338 131370 168803 238967 317785 365493 384717 355509
7842C55509n7952n8574n7271n5850m4453k5517j9615O18J08M417l689q681o391
$$ 355509 297557 238983 181712 125862 81409 55892 36277 36895 37003 41420 37731 29050 22659
7829B2659J68j5631n007P57p203o935P866N08q876p748m40m579J2488J6954J472
$$ 22659 22827 7196 2189 2946 -4257 -11192 -3326 -2818 -11694 -19442 -19882 -24461 -11973 4981 6453
7814F453p533J2813J0108L736l513K955M323m547O0q828J0047K8876J2433K652
$$ 6453 -1080 11733 21841 25577 22064 25019 29342 24795 24855 16027 26074 54950 67383 70035
7800G0035K1550L6752J9398r703j4483q718j7981j5516k0760k4895p171p821j5819
$$ 70035 91585 128337 147735 138032 123549 114831 96850 81334 60574 35679 28508 20687 4868
7787D868n517r918J0872P881L98k227J1291L132J390P026L122L937j947j1440
$$ 4868 -649 -10567 305 8186 8584 6357 17648 20780 22170 29196 32318 36255 34308 22868
7773B2868j6268P548j322L794k0793M43N846O876N15j3451K525J5488p798J3842
$$ 22868 6600 14148 12826 16620 -4173 -3730 2116 8992 9507 -3944 -1419 14069 6271 20113
7759B0113L696j5495j3078M485O826J067k038K931K96n851R090P630q737j1283
$$ 20113 23809 8314 -4764 -279 6547 7614 5576 8507 8803 2952 12042 19672 10935 -348
7745c48j0235N811K533J4257m4j018o756k891M764J075M852J837N592L623n946
$$ -348 -10583 -4772 -2239 12018 11974 10956 4200 1309 6073 7148 12000 13837 19429 23052 17106
7730A7106r452L923n10p007M931n205j2174o86m551L921k049n290k585R484o68
$$ 17106 7654 11577 11067 4060 8991 3786 -8388 -9074 -13625 -9704 -11753 -17043 -19628 -10144 -10812
7715a0812m350R489P763p332R614J965j0124O593K291p807J787N97J472R647Q023
$$ -10812 -15162 -5673 2090 -5242 4372 6337 -3787 2806 5097 -2710 -923 -326 1146 10793 18816
7700A8816N242j1748j4667j1983M912n355o523J6869J0022P244Q643M237j0382
$$ 18816 24058 12310 -2357 -14340 -9428 -14783 -21306 -4437 5585 12829 21472 25709 15327
7687A5327j6173j5880J2265R126r969n430j258l752J1026p024r481k444P6J3129
$$ 15327 -846 -16726 -4461 4665 -5304 -10734 -11992 -15744 -4718 -11742 -21223 -23667 -23591 -10462
7673a0462J6167J3573k654j2412O833L87r447r399p916j2735J519Q09N272O438
$$ -10462 5705 19278 16624 4212 11045 11432 1985 -7414 -15330 -28065 -26546 -25737 -20465 -14027
7659a4027N930q67Q603O111Q668j98L846j2374p672o441n67J4999M503j6423m909
$$ -14027 -8097 -8964 -361 5750 14418 14220 18066 5692 -1980 -8421 -8988 6011 10514 -5909 -10818
7644a0818J983J613K483J396r231p12r598k889Q917O219K575q416p796L913Q48
$$ -10818 -8835 -7222 -4739 -3343 -12574 -13286 -22884 -25773 -16856 -10637 -8062 -16478 -24274 -20361 -19513
7629a9513K4414J1229q58l268j1268j6903Q330P242O377m49N074n349n007k474
$$ -19513 4901 16130 15272 12004 736 -16167 -7837 -595 5782 5333 10407 5058 51 -2423
7615b423K181l384k585P710K633N994l214J034L498J683j8636M820N434O363O453
$$ -2423 -242 -3626 -6211 1499 4132 10126 6912 7946 11444 13127 -5509 -689 4745 11108 17561
7600A7561j1419q518J1557k196l406P344m063j0143n457j0264l117N95j5420K126
$$ 17561 6142 -2376 9181 6985 3579 10923 6860 -3283 -8740 -19004 -22121 -21526 -36946 -34820
7586c4820P066K738j3619L753J2489P259Q534M613Q903j212r235K176K351n571
$$ -34820 -27754 -25016 -38635 -34882 -22393 -15134 -6600 -1987 6916 5704 -3531 -1355 996 -4575
7572d575J83m270K712J328P219j09j6525j0322M617N753Q987R441O863j3663j2858
$$ -4575 -4392 -8662 -5950 -4622 2597 2488 -14037 -24359 -19742 -13989 -5002 4439 11302 -2361 -15219
7557a5219L195R350R031k390l15N48r77M761n982r186o143J1563N216o010K599
$$ -15219 -12024 -2674 6357 3967 3652 4200 3223 7984 2002 -7184 -13327 -1764 3452 -2558 41
7542D1l082k729J160N049l327o685p199L606J8694J1923m982j6725l848P2q205
$$ 41 -3041 -5770 -4610 439 -2888 -9573 -16772 -13166 5528 17451 12469 -4256 -8104 -8032 -16237
7527a6237j704N736M580J84j366j5936P687J3840M218O020N74j1544j3413J981
$$ -16237 -17941 -12205 -7625 -7441 -8807 -24743 -17056 -3216 1002 7022 7596 -3948 -17361 -15380
7513a5380m915o97J6405M549j041j057M724J722p111J761l272o842n692j0320
$$ -15380 -20295 -20992 -4587 -38 -1079 -2136 2588 4310 -2801 -1040 -4312 -11154 -16846 -27166
7499b7166j2217j090K1470M424Q801M287j1277P876J8556j756k6359q198k907
$$ -27166 -39383 -40473 -19003 -14579 -5778 -1491 -12768 -4892 13664 11908 -14451 -22649 -25556
7486b5556j0686J799J2883O177j1083j037j134L603r667k091J0162J2463J3149
$$ -25556 -36242 -34443 -21560 -15383 -26466 -27503 -28637 -25034 -34701 -36792 -26630 -14167 -1018
7473a018j406j2456p323J4280K572p113l183K323K948r87J724J775p600L671R281
$$ -1018 -2424 -14880 -22203 -7923 -5351 -12464 -15647 -13324 -10376 -11363 -9639 -7864 -15464 -11793 -2512
7458b512R715K717J716j3764r666o773n570R478M667q614L955J5717R597p978
$$ -2512 7203 9920 11636 -2128 -11794 -18567 -24137 -14659 -9992 -18606 -14651 1066 10663 2685
7444B685J0328M450m277j3163j3162k519J567O167j141m8j026L7M074m833p536
$$ 2685 13013 17463 13186 23 -13139 -15658 -14091 -7924 -9065 -9113 -10139 -10102 -6028 -10861 -18397
7429a8397R484O04k59l641l141J0817J555j5280j551J4040q322k9462q585K393
$$ -18397 -8913 -8309 -8568 -12209 -15350 -4533 -2978 -18258 -19809 -5769 -14091 -43553 -52138 -49745
7415d9745J830O779K0899K309k963m626J5770P875J0723m394k918j2833K988K0084
$$ -49745 -47915 -41136 -20237 -17928 -20891 -25517 -9747 -1872 8851 4457 1539 -11294 -8306 11778
7401A1778M846O871K255r053q689P870K692n975j840l891o887l313J0863P203
$$ 11778 16624 23495 25750 16697 8008 15878 18570 12595 10755 6864 -23 -3336 7527 14730
7387A4730M293r505l400n354O872l825j1664p703M797l787n205K372Q309J1387
$$ 14730 19023 9518 6118 764 7636 3811 -7853 -15556 -10759 -14546 -19751 -17379 -9070 2317
7373B317n63j1242M368O609l428p731j3843K957q849P495K84j631J222J0107J1450
$$ 2317 1754 -9488 -5120 1489 -1939 -9670 -23513 -20556 -29405 -21910 -21626 -23257 -22035 -11928 -478
7358d78K841o561P2m569K333j861q99Q22r183O834J0944q042m28p12K036j0443
$$ -478 2363 -4198 -4126 -8695 -6362 -8223 -9122 -8300 -17483 -10649 295 -7747 -8175 -8887 -6851 -17294
7342a7294k395k904M22o426O546J7874P022P114O917p177q494l289r22j511o46
$$ -17294 -19689 -22593 -22171 -28597 -22051 -4177 2845 9959 16876 9699 1205 -2084 -3006 -4517 -5163
7327e163l609K47J3047Q21M941k92o254j54P66q395p076K439m757J4449J1597
$$ -5163 -8772 -8525 4522 5343 10284 9992 3738 3584 4350 -4045 -11121 -8682 -13439 1010 12607
7312A2607L045j1476o502M092Q39Q508n387p760J890m921j0248q569j0888m550
$$ 12607 15652 4176 -2326 1766 2605 11113 5726 -2034 -144 -5065 -15313 -23882 -34770 -39320
7298c9320j258J2678J865N962K1331K0650n061j0190k814j5872j530J2443J4709
$$ -39320 -40578 -27900 -26035 -20073 1258 21908 16847 6657 3843 -12029 -13559 -1116 13593
7285A3593m796p942j0755R85J086o35M516J013K57j62k376o541k930J4222M486
$$ 13593 8797 855 -9900 -8915 -7829 -8464 -3948 -2935 -2678 -2840 -5216 -11757 -14687 -465 4021
7270D021m177J0408J4170q649J488j2701j7811J597J870j3847R970J0640r962
$$ 4021 -156 10252 24422 15773 17261 4560 -13251 -11654 -9784 -23631 -13661 -3021 -12983
7257a2983m61L88O38J0612L859J696K362o378l221R777J1045j4738q205K299J293
$$ -12983 -13444 -13056 -12418 -1806 2053 3749 6111 -267 -3488 6289 17334 2596 -5609 -3310 -2017
7242b017j954J0614p549j5006K290j332m402J1153N808R01J148K310o89j0498
$$ -2017 -3971 6643 -906 -15912 -13622 -14954 -19356 -8203 -2395 -1494 -346 1964 1275 -9223
7228i223p240l566l368k592O859Q919M544m160L958l482n224o887j190M595j0451
$$ -9223 -16463 -20029 -23397 -25989 -19130 -10211 -5667 -9827 -5869 -9351 -14575 -21462 -22652 -18057 -28508
7213b8508m662J6786n890j087L733N176O048q762N33n79N800J6047K323j4330
$$ -28508 -33170 -16384 -22274 -23361 -19628 -14452 -8404 -17166 -16633 -17212 -11412 4635 6958 -7372
7199g372j3161p395j2220Q850K587R778J1219Qo066P893Q259l220j0314l161k134
$$ -7372 -20533 -27928 -40148 -31298 -28711 -18933 -7714 -7706 -13772 -5879 2380 -840 -11154 -14315 -16449
7184a6449J208P112m56N233J2075k223j5229j6334M252k433N152k76P862N249
$$ -16449 -15241 -8129 -8585 -3352 8723 6500 -8729 -25063 -20811 -23244 -18092 -18368 -10506 -5257
7170e257o635q807Q756o230J405N159j566J0671K259J0428P020j6812j3684n67
$$ -5257 -11892 -20699 -11943 -18173 -16768 -11609 -13175 -2504 -245 10183 17203 391 -13293 -13860
7156a3860J8258M482k1827k2535O431J4091M889O16o105M526o294J9031J2913
$$ -13860 4398 8880 -12947 -35482 -29051 -14960 -10071 -9455 -15560 -11034 -17328 1703 14616
7143A4616j7965k839L527R738n582P618m186q164M30j0356o326l179L727j245
$$ 14616 -3349 -6188 -2661 7077 1495 9113 4927 -3237 -2807 -13163 -19489 -22668 -18941 -20186
7129b0186m430L330l799J1223L346j0773j2519R666J0564k599j5218n58R453J2278
$$ -20186 -24616 -21286 -25085 -13862 -10516 -21289 -33808 -24142 -13578 -16177 -31395 -31953 -22500 -10222
7115a0222Q266j205q192j391n498N292J5101M235l90k45L213l658K816k362m834
$$ -10222 -1956 -3161 -11353 -12744 -18242 -12950 2151 6386 5996 5751 8964 5306 8122 5760 926
7100I26o604Q746l21q500l992j2556k542p95R360K969r465k491P127J920J6951
$$ 926 -5678 3068 2747 -5753 -9745 -22301 -24843 -25638 -16278 -13309 -22774 -25265 -18138 -16218 733
7085G33J894J0031j1896m213m15j1822r622k570J898J1155p174l8N614P1L689
$$ 733 2627 12658 762 -3451 -3866 -15688 -25310 -27880 -25982 -14827 -22001 -22039 -16425 -16354 -12665
7070a2665q372L143J7193J6425l551n281m20j1657m832O77q792O504j0011l757
$$ -12665 -21037 -17894 -701 15724 12173 6892 6472 -5185 -10017 -9340 -18132 -11628 -21639 -25396
7056b5396m32Q877K231L9N046J6708K392l713j4747M509L104q937o057N331M102
$$ -25396 -25828 -16951 -14720 -14681 -9635 7073 9465 5752 -8995 -4486 -1382 -10319 -16376 -11045 -6943
7041f943J0257j589k505j7656k980M473m881N3J9554J6190P487m644m640m530
$$ -6943 3314 1725 -780 -18436 -21416 -16943 -21824 -21771 -2217 13973 21460 16816 12176 7646
7027G646j3675j4113l505J2194n653P127J0382J1156J298q600k35o578n775l646
$$ 7646 -6029 -20142 -23647 -11453 -17106 -9979 403 11559 12857 4257 4022 -2556 -8331 -11977
7013a1977M610j1654n008p813J691L0182J096J625k292o780p023Q29k555P01Q844
$$ -11977 -7367 -19021 -24029 -31842 -30151 31 1127 2752 460 -6320 -13343 -12514 -15069 -14368 -5524
6998e524q816k155l539L116Q32j9513j6595k368J6214K0749R740n26r58o06N368
$$ -5524 -14340 -16495 -20034 -16918 -16086 -35599 -52194 -54562 -38348 -17599 -7859 -8385 -9343 -9949 -4581
6983d581J3560j341j388k957m439M783Q180j2783q377J071o131j535J1313k740
$$ -4581 8979 7638 6250 3293 -1146 3637 11817 -966 -9343 -8272 -14403 -15938 -4625 -7365
6969g365J956p809Q857J608q075L830k806K041J015Q153Q09l588j5817j4873J3171
$$ -7365 -5409 -13218 -4361 -2753 -10828 -6998 -9804 -7763 -6748 1405 2214 -1374 -17191 -32064 -18893
6954a8893J2787p27R377R402k437P102o014r071K8j197p169k457o202J32j3638
$$ -18893 -6106 -6833 2544 11946 9509 16611 10597 1526 1554 357 -6812 -9269 -15471 -15339 -28977
6939b8977J728Q383K234n142K385J8602J3889j1859n883q53O825P308o53j5607
$$ -28977 -27249 -18866 -16632 -21774 -19389 -787 13102 1243 -4640 -5493 1332 8640 7987 -7620
6925g620l376K4612M799m636M880j1291k771m685j659k149o236J0824N541j1133
$$ -7620 -10996 13616 18415 13779 18659 7368 4597 -88 -1747 -3896 -10132 692 6233 -4900
6911d900n585N536K780o125O975M642n735r415j694J445q536n518j365J0784P5
$$ -4900 -10485 -4949 -2169 -8294 -1319 3323 -2412 -11827 -13521 -12076 -20612 -26130 -27495 -16711 -16636
6896a6636L459M27k978p748J3300J2669J724p979j2874m840K874J1078J5654l427
$$ -16636 -13177 -12750 -15728 -23476 -10176 2493 4217 -3762 -16636 -21476 -18602 -7524 8130 4703
6882D703O604j737r498k411P300M596K391l282q924o168l689J729q936Q58p74
$$ 4703 11307 9570 72 -2339 4961 9557 11948 8666 -258 -6426 -10115 -8386 -17322 -16464 -17238
6867a7238k357M188j908r78J5336J2688j1366l88L998P750k423p720o061J27k27
$$ -17238 -19595 -15407 -17315 -18293 -2957 9731 -1635 -2023 1975 9725 7302 -418 -6479 -6352 -6579
6852f579J295M30o160J106K892Q488j0675M80K750j047q363k69N439N675J074
$$ -6579 -5284 -4854 -11014 -9908 -7016 1472 -9203 -8723 -5973 -7020 -15383 -15652 -10213 -4538 -3464
6837c464j234p671j2923j0191K089J7693M333K817m835Q010J893k426r31J1411
$$ -3464 -4698 -12369 -25292 -35483 -33394 -15701 -11368 -8551 -13386 -5376 -3483 -5909 -6840 4571
6823D571J46j9310j8734k837R855O065R813k080o48J1472P022L463O959m064j1204
$$ 4571 4717 -14593 -33327 -36164 -26309 -20244 -10431 -12511 -13159 -1687 5335 8798 15757 11693 489
6808D89j2376j1555l668L334m300P415K1253P52j560N201j1727q428J3185o265
$$ 489 -11887 -23442 -27110 -23776 -28076 -20661 592 1344 -216 4985 -6742 -15170 -1985 -8250
6794h250n004J6202J4733j2096N398N297n446J81K019j507j0195M874k120j3743
$$ -8250 -13254 2948 17681 5585 10983 16280 10834 11015 13034 11527 1332 6206 4086 -9657
6780i657K667J262m643j0349O973L806r551M180O536L494N409k77m940j1679P768
$$ -9657 -6990 -5728 -10371 -20720 -13747 -9941 -19492 -15312 -8776 -5282 127 -150 -5090 -16769 -9001
6765i001R979J417p317l820P938r660j3626N887j4165R191J4080r330j3804J260
$$ -9001 978 2395 -4922 -8742 -804 -10464 -24090 -18203 -32368 -23177 -9097 -18427 -32231 -30971
6751c0971M090o300R927M383K507J8312J1741j995p615o484L56R609N78L569n907
$$ -30971 -26881 -33181 -23254 -18871 -16364 1948 13689 11694 4079 -2405 -2049 7560 8138 11707 5800
6736E800q524N053N351J90n850j439P235K747M867p473o695j2000l278J87p205
$$ 5800 -2724 2329 7680 7870 2020 581 7816 10563 15430 7957 1262 -10738 -14016 -13829 -21034
6721b1034k814K993N469J962L563L196J0838k023r808K708O716M684J3246n124
$$ -21034 -23848 -20855 -15386 -13424 -9861 -6665 4173 2150 -7658 -4950 1766 6450 19696 14572
6707A4572O056J6686j1156L049N655q798K80j5549p349j099m057j778j3469j246
$$ 14572 20628 37314 26158 29207 34862 26064 26344 10795 3446 2347 -1710 -3488 -16957 -18203
6693a8203N847Q813Q873K383J1343n747P27j79q366j41J334j3469o919k135K94
$$ -18203 -12356 -3543 5330 7713 19056 13309 14036 13857 5491 5350 6684 -6785 -13704 -15839 -15545
6678a5545O581m65l745N583K100k1189j0201M728l527N974m598K8591J5058j5146
$$ -15545 -8964 -9429 -13174 -7591 -5491 -26680 -36881 -32153 -35680 -29706 -34304 -5713 9345 -5801
6664e801r407J8848J4489q944j3538j5059n254R945J839j330J5192J447J961J4019
$$ -5801 -15208 3640 18129 9185 -4353 -19412 -24666 -14721 -12882 -14212 980 2427 4388 18407
6650A8407j2978j0712j5660k057R916P651j804o803k543O372r273K388P051J515
$$ 18407 5429 -5283 -20943 -23000 -13084 -5433 -7237 -14040 -16583 -10211 -19484 -17096 -10045 -8530
6636h530n923n496P613l700l100O109J8022P328j8475n830k574Q622L374k600
$$ -8530 -14453 -19949 -12336 -16036 -19136 -13027 4995 12323 -6152 -11982 -14556 -5934 -2560 -5160
6622e160j0117j2835p443M261J0283P920J1511M913q806q374p822k956K270M678
$$ -5160 -15277 -28112 -35555 -31294 -21011 -13091 -1580 3333 -5473 -13847 -21669 -24625 -22355 -17677
6608a7677Q466j0436o527J066Q725j0820m415j181K6879k543n150k410Q256L904
$$ -17677 -9211 -19647 -26174 -25108 -16383 -27203 -31618 -32799 -5920 -8463 -13613 -16023 -7767 -3863
6594c863J2604p413l39P657r303j3802L733N72l97J4419P299l995p083k1031m983
$$ -3863 8741 1328 989 8646 -657 -14459 -10726 -10154 -10551 3868 11167 7172 89 -20942 -25925
6579b5925j594J0810n810K777Q535J286L652J1544P598j0936r264J1217N954j57
$$ -25925 -27519 -16709 -22519 -19742 -11207 -9921 -6269 5275 12873 1937 -7327 3890 9844 9687
6565I687J512k1186j2048L981q50k611J2822J1395L893p22p176k401n542N365
$$ 9687 11199 -9987 -22035 -18054 -18904 -21515 -8693 2702 6595 5873 -1303 -3704 -9246 -3881
6551c881O096O136M893j5482j1687L504L919m7j9195n314J0279J9280K890j2832
$$ -3881 2215 8351 13244 -2238 -13925 -10421 -6502 -6549 -25744 -31058 -20779 -1499 1391 -11441
6537a1441p278o719J5463J7004n967j2517p974M235J7733J4528k803k1202j2785
$$ -11441 -18719 -25438 -9975 7029 1062 -11455 -19429 -15194 2539 17067 14264 -6938 -19723
6524a9723R766J0017O094K79j8066M610j647Q435J054J6059J0286j0817r466j3946
$$ -19723 -9957 60 6154 6433 -11633 -7023 -8670 -235 819 16878 27164 16347 6881 -7065
6510g065n370L406n4j0592p66k316J1587J1061J2138k994k478l411k719J924m626
$$ -7065 -12435 -9029 -9083 -19675 -20441 -22757 -11170 -109 12029 9035 6557 3146 427 2351 -2275
6495b275n726n213o603J5703M77R984J55p875K406J791Q573p765l103q772N866
$$ -2275 -8001 -13214 -19817 -4114 -3637 6347 6502 -1373 1033 2824 11397 3632 529 -8243 -2377
6480b377O039o457j5028j777M849N901M401j2185n228k085L02J2177O748q090
$$ -2377 3662 -2795 -17823 -19600 -14751 -8850 -4449 -16634 -21862 -23947 -23645 -11468 -4720 -12810
6466a2810k095J2721P332j7481l277O404l406J252L767K356M200o757k392l379
$$ -12810 -14905 -2184 5148 -12333 -15610 -9206 -12612 -11360 -7593 -5237 -1037 -7794 -10186 -13565
6452a3565j594q5J0627Q506m747p639K591J846k1248l534P627Q457J5046J1440
$$ -13565 -15159 -15244 -4617 3889 -858 -8497 -5906 -4060 -25308 -28842 -21215 -12758 2288 13728
6438A3728k110r462l439J4797O610k740j4043o005p839o659R110N009m476j667
$$ 13728 11618 2156 -1283 13514 20124 17384 3341 -2664 -10503 -17162 -8052 -3043 -7519 -9186
6424i186r90o392o054N144Q812K888k416O211l781n584R707q26K274J3047n122
$$ -9186 -10176 -16568 -22622 -17478 -8666 -5778 -8194 -1983 -5764 -11348 -1641 -2467 -193 12854 7732
6409G732k1601n827Q95N200R224N994q14q063j0706L860p684j5098O606L1238
$$ 7732 -13869 -19696 -18801 -13601 -4377 1617 803 -7260 -17966 -14106 -21790 -36888 -30282 956
6395I56J1535J757j0737j6422j4468K21p78L2094K5112J1309k0189j3204K644
$$ 956 12491 14248 3511 -12911 -27379 -27158 -27936 4158 29270 40579 20390 7186 9830
6382I830J699j3795p352L862L549K129J108j1142j0370j3313K0685N991r64P992
$$ 9830 11529 -2266 -9618 -5756 -2207 -78 1030 -10112 -20482 -33795 -13110 -7119 -8083 -91
6368i1j506l826l79Q617r002p149k888j2480K882J3781J1766p477J212O076j4591
$$ -91 -1597 -5423 -5802 2815 -6187 -13336 -16224 -28704 -25822 -12041 -275 -7752 -6540 -464 -15055
6353a5055n815K0635R204p607L313P064L653r849l942K496n669l175P61R507N987
$$ -15055 -20870 -235 8969 1362 4675 11739 15392 5543 1601 4097 -1572 -4747 -3986 5521 11508
6338A1508J758j3468j5009l036L186o024Q97n812N117J1521R450J99o676K917
$$ 11508 13266 -202 -15211 -18247 -15061 -21085 -20188 -26000 -20883 -9362 88 287 -6389 -3472
6324c472J286J269p1j2849j1713L00M316J2375J3351J4409K787k2935j5815n916
$$ -3472 -2186 -917 -988 -13837 -25550 -25250 -20934 -8559 4792 19201 21988 -947 -16762 -22678
6310b2678P977P95J1027M657n390l108O382J8737N340n81q496N493p00j1863j048
$$ -22678 -14701 -13906 -2879 1778 -3612 -6720 -338 18399 23739 23158 14662 20155 19455 7592 6544
6295F544l992n027k50n574N296m75q554r713p898O36Q496Q417l394M79R088K8366
$$ 6544 2552 -2475 -2725 -8299 -3003 -3478 -12032 -21745 -29643 -29007 -20511 -12094 -15488 -15009 -5921 22445
6279B2445O978j0034n786o382O702m430p214n586N22k627J0408k877o961k081
$$ 22445 29423 19389 13603 7221 13923 9493 2279 -3307 -2785 -5412 4996 2119 -4842 -6923
6265f923O25R735j1513j782J953j01M337J3692M694n358j5445l202L943J3974
$$ -6923 -6298 3437 -8076 -9858 -7905 -8006 -3669 10023 14717 9359 -6086 -9288 -5345 8629
6251H629J0678L25p935J964r198j210j785r410j0188K573K977P274q318o078K2920
$$ 8629 19307 19632 11697 13661 4463 3253 1468 -7942 -18130 -15557 -12580 -5306 -13624 -19702 3218
6236C218P91k691J035o804k821L095Q467o125p438Q090O087J37k162J0735P977
$$ 3218 4009 1318 2353 -4451 -7272 -4177 4290 -1835 -9273 -1183 4904 5041 2879 13614 21591
6221B1591j0418j0856j2149J1168k175L542P123L507K227K357l996j5358q693
$$ 21591 11173 317 -11832 -664 -2839 703 7826 11333 13560 15917 11921 -3437 -12130
6208a2130J1367N391j245P440r420j0045j2161R062J3850Q082J40k03L24N419
$$ -12130 -763 4628 3383 10823 1403 -8642 -20803 -11741 2109 10191 10331 10128 10452 15871
6194A5871J70j1372P67O467j1859j7930n770N421J721j1928Q625J0583Q495r395
$$ 15871 16041 4669 5436 11903 44 -17886 -23656 -18235 -16514 -28442 -19817 -9234 -739 -10134
6180a0134j2414L21J0395m082J422J2506m90N408l818j124K41N513Q334j8901
$$ -10134 -22548 -22227 -11832 -15914 -14492 -1986 -2476 2932 -886 -2010 -1769 3744 12078 -6823
6166f823p088J3185L365J715k523J993m542O964K78j261p797o143O513L909n104
$$ -6823 -13911 -726 2639 4354 1831 3824 -718 6246 6524 5263 -2534 -8677 -2164 1745 -3359
6151c359m276q79l264j7409O604J1418M920k639j743k346l045O933O028p017j5960
$$ -3359 -7635 -8514 -11778 -29187 -22583 -11165 -6245 -8884 -10627 -12973 -16018 -9085 -3057 -10074 -26034
6136b6034O327J2664o129o591J2689n368o230p708k637R31R103J7738P942J5459
$$ -26034 -19707 -7043 -13172 -19763 -7074 -12442 -18672 -26380 -29017 -28086 -18983 -1245 6697 22156
6122B2156k371j3369j0001n258L044N654K568j1852j572K838j833L537J4273q90
$$ 22156 19785 6416 -3585 -8843 -5799 -145 2423 -9429 -11001 -8163 -9996 -6459 7814 6924
6108F924j269n510m433O487P933L01j7823n182J434R392J4274p038M122K90J2861
$$ 6924 5655 145 -4288 2199 10132 10433 -7390 -12572 -11138 -1746 12528 5490 9612 9902 22763
6093B2763Q401J800j4189j1423o289O661p480j2798j5092m633J78K0266J6460
$$ 22763 31164 32964 18775 7352 1063 7724 244 -12554 -27646 -32279 -32101 -11835 4625
6080D625J5279L449j2303n914k95n761l386n777M963J521l939j0396m790M496
$$ 4625 19904 23353 11050 5136 4841 -920 -4306 -10083 -5120 -3599 -7538 -17934 -22724 -18228
6066a8228K754q2n798K555L748m351j571m870j0433l953Q343J1877K767R326J1756
$$ -18228 -15474 -15556 -21354 -18799 -15051 -19402 -20973 -25843 -36276 -40229 -31886 -20009 -17242 -7916 3840
6051C840N927q095j4457J1110Q374j5147l223j0914j684J135J4550L021J239k254
$$ 3840 9767 1672 -12785 -1675 6699 -8448 -11671 -22585 -24269 -23134 -8584 -5563 -4324 -6578
6037f578j480J15K559R708l14j8199q065j2069P217J4932j1709R49R630P232q97
$$ -6578 -8058 -7943 -5384 4324 4010 -14189 -22254 -34323 -27106 -12174 -23883 -22934 -13304 -6072 -6969
6022f969j408q02l197j2382J258M47l621K878j7694J6118J9169R084q003j5383
$$ -6969 -8377 -9179 -12376 -24758 -23500 -23053 -26674 -23796 -41490 -25372 -6203 2881 -5122 -20505
6008b0505p645M636L288l64L967O920M912j945j3460K955J6097K840j4977p959
$$ -20505 -28150 -23514 -20226 -20590 -16623 -9703 -4791 -6736 -20196 -17241 -1144 1696 -13281 -21240
5994b1240J733m958R413J7455M019r855r271p669l715j0737Q296J3670j506O065
$$ -21240 -19507 -24465 -15052 2403 6422 -3433 -12704 -20373 -24088 -34825 -26529 -12859 -14365 -8300
5980h300P750R124M69m377p853M671M604j8P5N010M270N78j1677q218j950L555
$$ -8300 -550 8574 9043 4666 -3187 1484 6088 6070 6145 11155 15425 16003 4326 -3892 -5842 -2287
5964b287N636K742j0962r382m090J0736J4054m851L239K681O685J5089l461j8408
$$ -2287 3349 6091 -4871 -14253 -18343 -7607 6447 1596 4835 7516 14201 29290 25829 7421
5950G421p701k836p022J1309Q360q304n442n943j976Q483N154Q66j3197O276m406
$$ 7421 -280 -3116 -10138 1171 9531 1227 -4215 -10158 -12134 -3651 1503 2369 -10828 -4552 -8958
5935h958j0172o771j2236R4J5687N850L347M736Q276l955O885k578j5884L931
$$ -8958 -19130 -25901 -38137 -38043 -22356 -16506 -13159 -8423 -147 -4102 2783 205 -15679 -11748
5921a1748J2892K160l002J319M83O204n497p496P50j2267n82O103K804M502O517
$$ -11748 1144 3304 302 1621 2104 8308 2811 -4685 -3935 -16202 -16784 -10681 -7877 -3375 3142
5906C142m132n950j5102J3360J4175r981j9322j090J8517J4580q960J514J2745
$$ 3142 -990 -6940 -22042 -8682 5493 -4488 -23810 -24900 -6383 8197 -763 751 13496
5893A3496q447k4134j3810J4846N868j346P525n297n889P774o243r464L931r3
$$ 13496 5049 -19085 -32895 -18049 -12181 -13527 -6002 -11299 -17188 -9414 -15657 -25121 -21190 -21283
5879b1283K2557J3496Q594n507j2678k333O990N030m938j639j924m029Q98j718
$$ -21283 1274 14770 23364 17857 5179 2846 9836 14866 9928 8289 6365 2336 3234 1516
5865A516J0207R939p431l74l996o775k1423r483Q171J1281n400R01o449R355O101
$$ 1516 11723 21662 14231 13857 9861 3086 -18337 -27820 -19649 -8368 -13768 -12867 -19316 -9961 -3860
5850c860n578K623Q761j3820L912L42m077L750n712j044J7903K42M85J42j2635
$$ -3860 -9438 -6815 1946 -11874 -7962 -7620 -11697 -7947 -13659 -14703 3200 3442 3927 4069 -8566
5835h566O954k712O455L686O112k5973j2547L891N252Q986K568q067O94P669P126
$$ -8566 -1612 -4324 2131 5817 11929 -14044 -26591 -22700 -17448 -8462 -5894 -13961 -13267 -5598 1528
5820A528O321o301O62J749j6620m263K5636J0769r161j6734r194J1875j458k817
$$ 1528 7849 1548 2210 3959 -12661 -16924 8712 19481 10320 -6414 -15608 -3733 -5191 -8008
5806h008m501j098J5207L782K23K039k001j310o071l735k326N630K086n917o646
$$ -8008 -12509 -13607 1600 5382 5605 7644 5643 4333 -1738 -5473 -7799 -2169 -83 -6000 -12646
5791a2646j202J951O013P706N084M28J942j1958R336L489j0230l407j1797n88
$$ -12646 -13848 -11897 -5884 1822 6906 7334 9276 -2682 6654 10143 -87 -3494 -15291 -15879
5777a5879M723O354L956k560m968R69K329n693j515J2568M713Q520J858j7874
$$ -15879 -11156 -4802 -846 -3406 -8374 -7405 -5076 -10769 -12284 284 4997 13517 15375 -2499
5763b499L859P082m248l92j3751o017p398m265K726O456j956L009K0542J2046
$$ -2499 1360 8442 4194 3802 -9949 -15966 -23364 -27629 -24903 -18447 -20403 -17394 3148 15194
5749A5194q482k5K242o774n406L643j018l173K84r792J2304M275J1717q658r062
$$ 15194 6712 6687 8929 2155 -3251 392 -626 -3799 -3515 -13307 -1003 3272 14989 6331 -2731
5734b731k575j1703O362n616r367J5441J2977Q907l789k734o484L198j2210q843
$$ -2731 -5306 -17009 -10647 -16263 -25630 -10189 2788 11695 7906 5172 -1312 1886 -10324 -19167
5720a9167p178m195k954q010L933J3532J7000j013n890j221p01J0738J0250k159
$$ -19167 -26345 -30540 -33494 -41504 -37571 -24039 -7039 -8052 -13942 -15163 -15864 -5126 5124 2965
5706B965j4310j3034p174L461J6643K328q622P80N048P416L875k572j1712M15
$$ 2965 -11345 -24379 -31553 -28092 -11449 -9121 -17743 -16963 -11915 -4499 -624 -3196 -14908 -14493
5692a4493J9556R459r086j3892n90J3760N927J063j937q97j5788n457K711O35
$$ -14493 5063 14522 5436 -8456 -9046 4714 10641 11704 9767 8870 -6918 -12375 -9664 -9029
5678i029K0424N114m645p916j0485j3620j982J1912n82j061J1000M757r124q315
$$ -9029 11395 16509 11864 3948 -6537 -20157 -22139 -10227 -10809 -11870 -870 3887 -5237 -13552
5664a3552K423J915J5412Q632n912L784O576N076r206j0987N402n17q710j5p506
$$ -13552 -11129 -9214 6198 14830 8918 12702 19278 24354 15148 4161 9563 9046 336 321 -7185
5649g185j2168J2986J8079l47p385r06O443o58N13j4721J389O089K12k563k671
$$ -7185 -19353 -6367 11712 11365 3980 3074 9517 8859 9372 -5349 -3960 2129 2341 -222 -2893
5634b893k805N536j3367j0821J3593o718K714j765k51J0111J2460J485l316l466
$$ -2893 -5698 -162 -13529 -24350 -10757 -17475 -14761 -16526 -16777 -6666 5794 7279 3963 497
5620D97O945J0177n571j4396m379N762q179J508J24M206N627l708n313M00O605
$$ 497 7442 17619 12048 -2348 -6727 -965 -9144 -7636 -7512 -3306 2321 -1387 -6700 -6300 305
5605C05M98j1108J1301K3903j930j8779r287o719j364j236r56n807N855k7r03
$$ 305 803 -10305 996 24899 22969 4190 -5097 -11816 -13180 -14416 -15372 -21179 -15324 -15351 -16254
5590a6254L813q419K355J410J1206K571k725j608p109J1639Q133j2050j8034P452
$$ -16254 -12441 -20860 -18505 -17095 -5889 -3318 -6043 -7651 -14760 -3121 5012 -7038 -25072 -17620
5576a7620L545O442K882L336O939q0j1399r346J469J0132r510r190j304O451J1631
$$ -17620 -14075 -7633 -4751 -1415 5524 5444 -5955 -15301 -13832 -3700 -13210 -22400 -23704 -17253 -5622
5561e622m168j7220k970J4219R853K136j998j495P589q16N529j3151j02Q215j694
$$ -5622 -9790 -27010 -29980 -15761 -5908 -3772 -5770 -7265 324 -492 5037 -8114 -8216 -1 -1695
5546a695r186r841L935L022O577P539L896p747o908m553J6343L994q164j6274
$$ -1695 -10881 -20722 -16787 -13765 -7188 351 4247 -3500 -10408 -14961 1382 5376 -2788 -19062
5532a9062K813M154J4044L308r77q540j2227l10J518J3645O307o194M13j6927
$$ -19062 -16249 -12095 1949 5257 4280 -4260 -16487 -16797 -15279 -1634 4673 -1521 -1108 -18035
5518a8035l970J3383L713J5118K753n808M788M83o066j7093j3087p807K249J6832
$$ -18035 -22005 -8622 -4909 10209 12962 7154 11942 12425 6359 -10734 -23821 -31628 -29379 -12547
5504a2547J3435n263l334j0698j260J2470j334N840J254j2544N547j1871n271
$$ -12547 888 -4375 -7709 -18407 -19667 -7197 -8531 -2691 -1437 -13981 -8434 -20305 -25576
5491b5576p33J97M258P103J3096p727j0043J4907O756j786j0011o361J1747r345
$$ -25576 -26309 -26112 -21854 -14751 -1655 -9382 -19425 -4518 2238 452 -9559 -15920 -4173 -13518
5477a3518j6274N398R137Q555J0535j3301j4060N809Q337M401j197j2127J521
$$ -13518 -29792 -24394 -15257 -6702 3833 -9468 -23528 -17719 -9382 -4981 -6178 -18305 -16784
5464a6784M397l076Q762J7699m753p429R388O980j602P891n747n580K272M604
$$ -16784 -12387 -15463 -6701 10998 6245 -1184 8204 15184 13582 21473 15726 10146 12418 17022
5450A7022P778k483j5264l128j0900J460M522j0444r094l983R382L267J667J1543
$$ 17022 24800 22317 7053 3925 -6975 -5515 -993 -11437 -20531 -24514 -15132 -11865 -10198 1345
5436A345q341M691J6874n23m973j0365j0779k199L014R705P552k398k220r622
$$ 1345 -6996 -2305 14569 14046 9073 -1292 -12071 -14270 -11256 -1551 6001 3603 1383 -8239
5422h239R44l671O763P156j1826L784O431Q348j2557K719O630j2115n435J4073
$$ -8239 -7295 -10966 -4203 2953 -8873 -5089 1342 9690 -2867 -148 6482 -5633 -11068 3005
5408C005J5820j191p747j950l862J501m255M295k412n422o41n625n973Q677J714
$$ 3005 18825 17634 9887 7937 4075 5576 1321 5616 3204 -2218 -2859 -8484 -14457 -5780 -4066
5393d066m06K1011j752k598L907L629L534j3988j3807j1118N172J956p853r493
$$ -4066 -4472 16539 14787 12189 16096 19725 23259 9271 -4536 -15654 -10482 -8526 -16379 -25872
5379b5872Q225L523R069j316K859O680n013J2495P196q166K114P477R96M26n356
$$ -25872 -17647 -14124 -5055 -6371 -3512 3168 -1845 10650 17846 9680 11794 19271 20267 20693 15337
5364A5337r815O14k100M815p347q343J588K331l333J343J001j075k61l31N346
$$ 15337 5522 6136 4036 8851 1504 -6839 -5251 -2920 -6253 -4910 -3909 -4984 -5245 -5576 -230
5349b30m500J184j5659j4088L01J5280J5182r509j5372O728J4719L716n326k539
$$ -230 -4730 -3546 -19205 -33293 -32992 -17712 -2530 -12039 -27411 -20683 -5964 -2248 -7574 -10113
5335a0113L461K940n242n102N609o613l477J624J1047K1432J1357o925l293K341
$$ -10113 -6652 -3712 -8954 -14056 -8447 -15060 -18537 -16913 -5866 15566 26923 19998 16705 19046
5321A9046j1306k1456Q517q585P514Q919J479o375M058P63j0769q622J2591J1553
$$ 19046 7740 -13716 -5199 -13784 -6270 2649 4128 -2247 1811 2574 -8195 -16817 -4226 7327
5307G327J891j1713o80O68K584J3344Q196p30O96j0636k608o020J353k198q067
$$ 7327 9218 -2495 -3175 -2507 77 13421 21617 20887 21583 10947 8339 2319 3672 1474 -6593
5292f593m617K475J2402O020n551K77n71m689M368k86o282q430j1459n617j55
$$ -6593 -11210 -8735 3667 9687 4136 4413 3842 -847 3521 3235 -3047 -11477 -22936 -28553 -28708
5277b8708P513J2575J0591J3635k647k240K228R03J039n821j8629J163L128j64
$$ -28708 -21195 -8620 1971 15606 12959 10719 12947 13850 14889 9068 -9561 -8398 -5270 -5434
5263e434k374k695Q781p032l229Q417n606l128M460j4813j522P637m35o336K892
$$ -5434 -7808 -10503 -1722 -8754 -11983 -3566 -9172 -12300 -7840 -22653 -24175 -16538 -16973 -23309 -20417
5248b0417Q870J7968K985j0432j3960J4629O77k849M535j2688R320J415k699j6906
$$ -20417 -11547 6421 9406 -1026 -14986 -357 320 -2529 2006 -10682 -1362 53 -2646 -19552
5234a9552m00K4855J0730K919o98J584n543j5202m57N70l679k965l376q713K004
$$ -19552 -19952 4903 15633 18552 17854 19438 13895 -1307 -1764 -1194 -4873 -7838 -11214 -19927 -17923
5219a7923R305R932r830j3783p287q323J3448O15L961K660J229J824J4057n180
$$ -17923 -8618 1314 -8516 -22299 -29586 -37909 -24461 -23846 -19885 -17225 -15996 -14172 -115 -5295
5205e295r560J315K739L359O975M548O612J684l09n609l787O154L584j740j1343
$$ -5295 -14855 -13540 -10801 -7442 -467 4081 10693 12377 12068 6459 2672 8826 12410 10670 -673
5190f73j0701j0012J2475R533M007m095K521n123P475J3317n249j7891O288J0778
$$ -673 -11374 -21386 -8911 622 4629 534 3055 -2068 5407 18724 13475 -4416 1872 12650
5176A2650p890r826o92l122R770J564l208p605J6165K955j6249k1194M538J9573
$$ 12650 4760 -5066 -5758 -8880 890 2454 -754 -8359 7806 10761 -5488 -26682 -22144 -2571
5162b571O578L949r199j4526K432P247J1802o927J0978P974j0536l813M273O150
$$ -2571 4007 7956 -1243 -15769 -13337 -6090 5712 -1215 9763 17737 7201 3388 7661 13811
5148A3811r228l814J5380l318q506j0326k990N165O162J1450o432j6398p981O742
$$ 13811 4583 769 16149 12831 4325 -6001 -8991 -3826 2336 13786 7354 -9044 -17025 -10283
5134a0283O205J1753M827n791m559L682l826J313l126p430p793Q751J6751J2948
$$ -10283 -4078 7675 12502 6711 2152 5834 2008 3321 195 -7235 -15028 -6277 10474 23422
5120B3422l921j8198j7682K533O98J3773Q099j113m527r427J2935k593R507K652
$$ 23422 19501 1303 -16379 -13846 -13148 625 8724 7611 3084 -6343 6592 3999 13506 16158
5106A6158k121r041j0832L481j449M627k1271j72K0708J6686r114r064M095K73
$$ 16158 14037 4996 -5836 -2355 -3804 823 -20448 -20620 88 16774 7660 -1404 2691 2964
5092B964J899l388L969j1444n320R208j393L497J5554m492o711L381l045j4900
$$ 2964 4863 1475 5444 -6000 -11320 -2112 -3505 -8 15546 11054 4343 7724 4679 -10221
5078a0221j1114N979P855J1861Q453J687l522j7774l860k529J6501m533r499q282
$$ -10221 -21335 -15356 -7501 4360 12813 14500 10978 -6796 -10656 -13185 3316 -1217 -10716 -18998
5064a8998J1251J644j580M644K1316L393o469p263m735r640p404M415J6989L268
$$ -18998 -7747 -6103 -7683 -3039 18277 21670 15201 7938 3203 -6437 -13841 -9426 7563 10831
5050A0831k0446J201Q354L278N484q073k585M667L997k304j759M179n697j4842
$$ 10831 -9615 -8414 -60 3218 8702 629 -1956 2711 6708 4404 2645 6824 1127 -13715
5036a3715N277K573K936K535q624m763n848L882J1371O942O94m22m976j6408l181
$$ -13715 -8438 -5865 -2929 -394 -9018 -13781 -19629 -15747 -4376 2566 3260 2838 -2138 -18546 -21727
5021b1727N000p313k073N439O419M571q664J174L829l227o617J0084J0522J2028
$$ -21727 -16727 -24040 -26113 -20674 -14255 -9684 -18348 -17174 -13345 -16572 -23189 -13105 -2583 9445
5007I445n317o630q527q296M481M8m380J0443J3937q77j6200r791J787J0701P653
$$ 9445 4128 -2502 -11029 -19325 -14844 -14796 -19176 -8733 5204 4327 -11873 -21664 -19877 -9176 -1523
4992a523J2802l29R881J410r711P17N389o573m41j700J930k046j6944n274N928
$$ -1523 11279 10950 20831 22241 12530 13247 18636 12063 11622 9922 11852 9806 -7138 -12412 -6484
4977f484J3924M044J8o118p653j2494p95O845M034K961p948j2713q018L975L137
$$ -6484 7440 11484 11502 5384 -2269 -14763 -15558 -8713 -4679 -1718 -9666 -22379 -30397 -26422 -23285
4962b3285J656R848N812J1672o521m445j0032k303J7963K904n13j2086j3527P585
$$ -23285 -21629 -11781 -5969 5703 -818 -5263 -15295 -17598 365 3269 2756 -9330 -22857 -15272
4948a5272P454N296P90N819L896p529o927o65q93j5316N070M319j831R463k853
$$ -15272 -7818 -2522 -1732 4087 7983 454 -6473 -7138 -8031 -23347 -18277 -13958 -15789 -6326 -9179
4933i179m815j1363J377r046j1353R620J8224N211o112j5251n362M286l389J5491
$$ -9179 -13994 -25357 -23980 -33026 -44379 -34759 -16535 -11324 -17436 -32687 -38049 -33763 -37152 -21661
4919b1661J5276J0940J0579l798j102k522j645j76J894l727j2877J997N461M017
$$ -21661 -6385 4555 15134 11336 10234 7712 6067 5891 7785 4058 -8819 -6822 -1361 2656
4905B656p645R195K2144P464j7094j1294k0579j703J6866M297j4940m38r63J1551
$$ 2656 -4989 4206 26350 33814 16720 5426 -15153 -16856 10 4307 -10633 -11071 -12034 -483
4891d83J9665N804M259k2496p642N369r834N153J6801R34R65J0152R47j3829j6578
$$ -483 19182 24986 29245 6749 -893 4476 -5358 -205 16596 17530 18495 28647 29594 15765 -813
4876h13q036p681l679m513J5646J953P269N154p391J3395l851j6064Q227L620
$$ -813 -8849 -16530 -20209 -24722 -9076 -7123 146 5300 -2091 11304 7453 -8611 -384 3236
4862C236l291J62N965J2148j115k064j0753j2870L815P126o266l201l025r733
$$ 3236 -55 107 6072 18220 17105 15041 4288 -8582 -4767 2359 -3907 -7108 -10133 -19866
4848a9866J3658J630l051M034j530r244r230K3791J473j1444M907l881j2847j0402
$$ -19866 -6208 -4578 -7629 -3595 -5125 -14369 -23599 192 1665 -9779 -4872 -8753 -21600 -32002
4834c2002P544L067p016J1826O476R565P614J768j2234n855J9656l594j5563o163
$$ -32002 -24458 -21391 -28407 -16581 -10105 -540 7074 8842 -3392 -9247 10409 6815 -8748 -14911
4820a4911O181L227p813j5557M885O086P066M332M442j3264o169J4616P006N480
$$ -14911 -8730 -5503 -13316 -28873 -23988 -17902 -10836 -6504 -2062 -15326 -21495 -6879 127 5607
4806E607r07j3673m187J4320j278q262M059j394n926j0691Q737J8805J8263j3495
$$ 5607 4700 -8973 -13160 1160 -118 -8380 -4321 -5715 -11641 -22332 -13595 5210 23473 9978
4792I978k464J364j064j6213j0413K737p93k41J1067o95j0177l93J4981J5420
$$ 9978 7514 8878 7814 -8399 -18812 -16075 -16868 -17109 -6042 -6737 -16914 -17307 -2326 13094
4778A3094J1806n918j9544r86k66J4497j1880J436l19m654N027J10q124m552r635
$$ 13094 24900 18982 -562 -1548 -1814 12683 803 2239 1920 -2734 2293 2403 -5721 -10273 -19908
4763a9908M306Q033J0377O908K651l665o759N074k499k813M564J913p103k039
$$ -19908 -15602 -7569 2808 9716 12367 8702 1943 7017 4518 1705 6269 8182 1079 -960
4749i60o543p117K111K009j5500j5220J1451J4169j344J710J0110J4395J9020
$$ -960 -7503 -14620 -12509 -10500 -26000 -41220 -29769 -15600 -16944 -15234 -5124 9271 28291
4736B8291K466j6071n746O456l345j1898j591k424R040j048p481k0093L812J9318
$$ 28291 30757 14686 8940 15396 12051 153 -1438 -3862 5178 4130 -3351 -23444 -19632 -314
4722c14L69q524l873n964n082J1990J1630k64m553Q512k998P3J8462j1743q707
$$ -314 55 -8469 -12342 -18306 -23388 -11398 232 -32 -4585 3927 929 1002 19464 7721 -986
4707i86q023O176j290l691J412R421R307M216j0593r095j0591N059K343J85J4238
$$ -986 -9009 -2833 -4123 -7814 -6402 3019 12326 16542 5949 -3146 -13737 -8678 -6335 -6150 8088
4692H088J2441j0854j1692j0039J032K891j1226O413m556J210N129O945J2658
$$ 8088 20529 9675 -2017 -12056 -11024 -8133 -19359 -12946 -17502 -16292 -11163 -4218 8440
4679H440r072j1004L115J5093J4001n233K272j3553l370P037j116J752o583J158
$$ 8440 -632 -11636 -8521 6572 20573 15340 17612 4059 689 7726 6610 8362 1779 2937
4665B937j549j3443q25L282O18l95R200K079j1066k0065K273O966j82n654J5922
$$ 2937 1388 -12055 -12880 -9598 -8980 -9375 -175 1904 -9162 -29227 -26954 -19988 -20170 -25824 -9902
4650i902N194O435k726j1950M950j692o43l809J216P531j625l602q803n324K646
$$ -9902 -4708 1727 -999 -12949 -7999 -9691 -10334 -14143 -12927 -5396 -7021 -10623 -19426 -24750 -22104
4635b2104K477O803P69m682J507J3103R970q523n343M031N247k422Q282J0278
$$ -22104 -19627 -12824 -12055 -16737 -15230 -2127 7843 -680 -6023 -1992 3255 833 9115 19393
4621A9393O126r763j2203o462n202j2401K557J6644J8246J2207m828j3155j3504
$$ 19393 25519 15756 3553 -2909 -8111 -20512 -17955 -1311 16935 29142 24314 11159 -2345
4608b345p45M088N965M50q110q0j591L21m887J0994J593r002M341L858P560m850
$$ -2345 -3090 998 6963 7413 -697 -777 -2368 -2047 -6934 4060 5653 -3349 992 4850 12410 7560
4592G560j533P051l826J3663j81j3459r618N372m560q356l342M208k02j3014p53
$$ 7560 6027 13078 9252 22915 22734 9275 -343 5029 469 -7887 -11229 -7021 -7223 -20237 -20990
4577b0990L738L728M533Q188L530J011N729j177M777J6992q722n912m580j4964
$$ -20990 -17252 -13524 -8991 -803 2727 3738 9467 8290 13067 30059 21337 15425 10845 -4119
4563d119L917P777j1036J496L225P813r10j1273n384k627p125n680K439J6943
$$ -4119 -202 7575 -3461 -1965 1260 9073 8163 -3110 -8494 -11121 -18246 -23926 -21487 -4544
4549d544O605O930J1155O695q158j9630l300J7998k331j4287l204k0584O162K1738
$$ -4544 2061 8991 20146 26841 18683 -947 -4247 13751 11420 -2867 -6071 -26655 -20493 1245
4535A245M673k456J0055J1065n83q374j4239j846J3500q86m444n162J51j3545
$$ 1245 5918 3462 13517 24582 23999 15625 1386 -460 13040 12154 7710 2548 2699 -10846
4521a0846j8557j0063J3115J8918j730N279J1725P321r848o383j2966p860J1217
$$ -10846 -29403 -39466 -26351 -7433 -9163 -3884 7841 15162 5314 -1069 -14035 -21895 -10678
4508a0678J2031M030k7o198O248J975R97j3110k0657j2911n525J6784J4099J1876
$$ -10678 1353 5383 5356 -842 5406 7381 8378 -4732 -25389 -38300 -43825 -27041 -12942 -1066
4494a066R981O896N757p428q058m269o184p82K006L451r862J0969Q430r833j2115
$$ -1066 8915 15811 21568 14140 6082 1813 -4371 -5153 -3147 304 -9558 1411 9841 8 -12107
4479a2107m101J2959L213N632j64Q336m227j2478r726L43j051Q252J6708P996
$$ -12107 -16208 -3249 -36 5596 5432 13768 9541 -2937 -12663 -12320 -13371 -5119 11589 19585
4465A9585o588k925J605O84l759J441p013p573J0029O166J379M551l154j3633
$$ 19585 12997 10072 11677 12361 8602 10043 3030 -4543 5486 11652 13031 17582 14428 795
4451G95p729J2631R738r026j1847r520J110l201j675J084K932O948J261j624P232
$$ 795 -6934 5697 15435 6409 -5438 -14958 -13848 -17049 -18724 -17640 -14708 -7760 -6499 -8123 -891
4436h91R813L82j2149q057O251L305K668j438L125m419j2226j645J0133J8M583
$$ -891 8922 9304 -2845 -10902 -4651 -1346 1322 -116 3009 -1410 -13636 -15281 -5148 -5130 -547
4421e47L81n976k963k840l452J3947N343N246J2320n242q868j068Q084N983l193
$$ -547 -166 -6142 -9105 -11945 -15397 -1450 3893 9139 21459 16217 7349 6281 14365 20348 17155
4406A7155j8755Q467O225N592k201n51L601l594n621N94q019p176o062l245O457
$$ 17155 -1600 6867 13092 18684 16483 15932 19533 15939 10318 10912 2893 -4283 -10345 -13590 -7133
4391g133J7025J2222P871J059n610p199J583l352M560J530n309j2900k1062k646
$$ -7133 9892 22114 29985 31044 25434 18235 19818 16466 21026 22556 17247 4347 -16715 -19361
4377a9361n78M876L767l639J1376Q866J500l808k577m655N774O473k035J101M171
$$ -19361 -19939 -15063 -11296 -14935 -3559 5307 6807 2999 422 -4233 1541 8014 5979 7080 11251
4362A1251O001M997n336J63J0223j839N756m310k6335N79l793n891M674J0777
$$ 11251 17252 22249 16913 17076 27299 25460 31216 26906 571 1150 -2643 -8534 -3860 6917
4348F917R052p169R60K320l429K114l342k518q714O63J3403M717M567m459j7566
$$ 6917 15969 8800 9760 12080 8651 10765 7423 4905 -3809 -3146 10257 14974 19541 15082 -2484
4333b484j2538M413L301l252O083M907M263m623n88L93n72J838L842q628l36J2651
$$ -2484 -15022 -10609 -7308 -10560 -4477 430 4693 70 -518 -125 -697 1141 4983 -3645 -3981 8670
4317H670k502M551q10L183m866O713K3362j224j1935j013k5208p291K1196J149
$$ 8670 6168 10719 9909 13092 8226 14939 38301 37077 25142 24129 -1079 -8370 12826 13975
4303A3975o515m248J9Q610J0649m67l496l169L768n994j0878k299O693n957r085
$$ 13975 7460 3212 3231 11841 22490 22023 18527 15358 19126 13132 2254 -45 6648 691 -8394
4288h394q6L425J047J8538J1024q109q542p165o819O54M956k676n119J1021N136
$$ -8394 -8480 -5055 -4008 14530 25554 17445 8903 1738 -5081 -4427 529 -2147 -7266 3755 8891
4273H891m847j050q94j5074p79k900Q607K768Q103j989O39L176n695P83j558K370
$$ 8891 4044 2994 2100 -12974 -13753 -16653 -8046 -5278 2825 836 1475 4651 -1044 -261 -1819 551
4257E51p65l611k790l368j672o615o04L378n583K35J1635J135m007J3180M90p78
$$ 551 -214 -3825 -6615 -9983 -11655 -18270 -18874 -15496 -21079 -20844 -9209 -8074 -12081 1099 1589 811
4241H11Q098o03N258J246p264J085J315l574k829N94j5603j2280J000J1825R335
$$ 811 8909 8306 13564 14810 7546 8631 9946 6372 3543 4137 -11466 -23746 -22746 -10921 -1586
4226a586o76j2063l604M111j926O950K209J080P07J903K448N062L323P352n857
$$ -1586 -2262 -14325 -17929 -13818 -15744 -8794 -6585 -5505 -4798 -2895 -447 4615 7938 15290 9433
4211I433p363l060J6567l635k603j112l591p92M421K595p933j4591N19L500j259
$$ 9433 2070 -990 15577 11942 9339 8227 4636 3844 8265 10860 2927 -11664 -11145 -7645 -8904
4196h904N866j736j5266M614K751P183P021J2344K409j2358K593Q872P278mj4658
$$ -8904 -3038 -4774 -20040 -15426 -12675 -5492 1529 13873 16282 3924 6517 15389 22667 22663 8005
4181H005r577N610o41k157L279k492j0024l705J6627Q954j613o217O863J652j387
$$ 8005 -1572 4038 3397 1240 4519 2027 -7997 -11702 4925 13879 12266 6049 12912 14564 13177
4166A3177O123l6q146p925j0388P482P825N997L172l191j0529j9756j2495L883
$$ 13177 19300 19264 11118 3193 -7195 287 8112 14109 17281 14090 3561 -16195 -28690 -24807
4152b4807k344J9445q07Q593J0101N366L491P523j7424k977j7541p927K20J1667
$$ -24807 -27151 -7706 -8513 80 10181 15547 19038 26561 9137 6160 -11381 -19308 -19088 -7421
4138g421J0419J1704N637j582q761m778N046k474q713O876j113l770l042Q841
$$ -7421 2998 14702 20339 18757 9996 5218 10264 7790 -923 5953 4840 1070 -1972 6869
$$ [...]
##END NTUPLES=NMR SPECTRUM
##END=
