##TITLE=Analysis number 328000
Compound Code cc 55916
Book Reference 521/53
Project Code adrs
Chemist Name evam
##JCAMPDX= 6.0         $$ Bruker NMR JCAMP-DX V2.0
##DATA TYPE= NMR SPECTRUM
##DATA CLASS= NTUPLES
##ORIGIN= Bruker BioSpin GmbH
##OWNER= nmr
$$ XWIN-NMR		Version 3.5
$$ Tue Apr 24 15:15:37 2007 GMT Daylight Time (UT+1h)  MAYBRIDGE\nmr@NMR_250MHZ
##.OBSERVE FREQUENCY= 250.131544655141
##.OBSERVE NUCLEUS= ^1H
##.ACQUISITION MODE= SIMULTANEOUS (DQD)
##.ACQUISITION SCHEME= undefined
##.AVERAGES= 16
##.DIGITISER RES= 18
##SPECTROMETER/DATA SYSTEM= dpx250
##.PULSE SEQUENCE= zg30
##.SOLVENT NAME= CDCl3
##.SHIFT REFERENCE= (INTERNAL, CDCl3, 0, 16.522)
##AUDIT TRAIL= $$ (NUMBER, WHEN, WHO, WHERE, WHAT)
$$ ##TITLE= Audit trail, XWIN-NMR		Version 3.5
$$ ##JCAMPDX= 5.01
$$ ##ORIGIN= Bruker BioSpin GmbH
$$ ##OWNER= nmr
$$ C:\u/data/dgb/nmr/ADRS/3000/pdata/1/auditp.txt
$$ ##AUDIT TRAIL=  $$ (NUMBER, WHEN, WHO, WHERE, WHAT)
(   1,<2007-04-24 15:15:15.64 +100>,<MAYBRIDGE\nmr>,<NMR_250MHZ>,
      <created by zg, POWCHK disabled, PULCHK disabled
       configuration hash MD5:
       76 6E 9A 78 1E 09 19 81 EC 84 63 8F B0 6A 59 2D
       data hash MD5: 64K
       F0 DB 5A C5 68 DB E5 A8 CF 04 12 D0 76 BB 95 E0>)
(   2,<2007-04-24 15:15:27.75 +100>,<MAYBRIDGE\nmr>,<NMR_250MHZ>,
      <Start of raw data processing
       ef LB = 0.3 FT_mod = 6 PKNL = 1 SI = 32K 
       data hash MD5: 32K
       C2 6C E8 C9 FA FA D3 36 16 AB DB 36 A1 2A FE 00>)
(   3,<2007-04-24 15:15:29.46 +100>,<MAYBRIDGE\nmr>,<NMR_250MHZ>,
      <apk 
       data hash MD5: 32K
       A6 C6 BD 14 6F D1 F0 F4 4F DF 95 60 2F 3B 7A E3>)
(   4,<2007-04-24 15:15:30.22 +100>,<MAYBRIDGE\nmr>,<NMR_250MHZ>,
      <abs ABSG = 5 
       data hash MD5: 32K
       16 74 1D 13 31 16 A2 08 E4 D1 3A 34 E9 CC 70 21>)
$$ ##END=
$$ 
$$ hash MD5
$$ 68 A6 D3 09 3F ED 9D 1C 80 D1 A2 85 82 65 A4 3F
##$RELAX= 
##$RELAX= 
##$RELAX= 
##$RELAX= 
##$RELAX= 
##$RELAX= 
##$RELAX= 
$$ Bruker specific parameters
$$ --------------------------
##$DU= <C:\u>
##$EXPNO= 3000
##$NAME= <ADRS>
##$PROCNO= 1
##$TYPE= <nmr>
##$USER= <dgb>
##$AMP= (0..31)
100 100 100 100 100 100 100 100 100 100 100 100 100 100 100 100 100 100 
100 100 100 100 100 100 100 100 100 100 100 100 100 100 
##$AQSEQ= 0
##$AQ_mod= 3
##$AUNM= <au_zg>
##$AUTOPOS= <34 >
##$BF1= 250.13
##$BF2= 250.13
##$BF3= 250.13
##$BF4= 250.13
##$BF5= 500.13
##$BF6= 500.13
##$BF7= 500.13
##$BF8= 500.13
##$BYTORDA= 1
##$CFDGTYP= 0
##$CFRGTYP= 5
##$CHEMSTR= <none>
##$CNST= (0..31)
1 1 145 1 1 1 1 1 1 1 1 1 1 1 1 1 1 1 1 1 1 1 1 1 1 1 1 1 1 1 1 1 
##$CPDPRG= <>
##$CPDPRG1= <>
##$CPDPRG2= <>
##$CPDPRG3= <>
##$CPDPRG4= <mlev>
##$CPDPRG5= <mlev>
##$CPDPRG6= <mlev>
##$CPDPRG7= <mlev>
##$CPDPRG8= <mlev>
##$CPDPRGB= <>
##$CPDPRGT= <>
##$D= (0..31)
0 1 0 0 0 0 0 0 0 0.06 0 0 0 0 0 0 0.0002 0 0 0 0 0 0 0 0 0 0 0 0 0 0 
0 
##$DATE= 1177424114
##$DBL= (0..7)
120 120 120 120 120 120 120 120 
##$DBP= (0..7)
150 150 150 150 150 150 150 150 
##$DBP07= 0
##$DBPNAM0= <>
##$DBPNAM1= <>
$$ [...]
##$SUBNAM7= <"">
##$SUBNAM8= <"">
##$SUBNAM9= <"">
##$SW= 20.6930455092707
##$SWIBOX= (0..15)
0 0 3 0 0 0 0 0 0 0 0 0 0 0 0 0 
##$SW_h= 5175.983436853
##$TD= 65536
##$TD0= 1
##$TE= 683.16
##$TE2= 300
##$TE3= 300
##$TEG= 300
##$TL= (0..7)
0 120 120 120 120 120 120 120 
##$TP= (0..7)
150 150 150 150 150 150 150 150 
##$TP07= 0
##$TPNAME0= <>
##$TPNAME1= <>
##$TPNAME2= <>
##$TPNAME3= <>
##$TPNAME4= <>
##$TPNAME5= <>
##$TPNAME6= <>
##$TPNAME7= <>
##$TPOAL= (0..7)
0.5 0.5 0.5 0.5 0.5 0.5 0.5 0.5 
##$TPOFFS= (0..7)
0 0 0 0 0 0 0 0 
##$TUNHIN= 0
##$TUNHOUT= 0
##$TUNXOUT= 0
##$USERA1= <user>
##$USERA2= <user>
##$USERA3= <user>
##$USERA4= <user>
##$USERA5= <user>
##$V9= 5
##$VALIST= <valist>
##$VCLIST= <CCCCCCCCCCCCCCC>
##$VD= 0
##$VDLIST= <DDDDDDDDDDDDDDD>
##$VPLIST= <PPPPPPPPPPPPPPP>
##$VTLIST= <TTTTTTTTTTTTTTT>
##$WBST= 1024
##$WBSW= 4
##$XGAIN= (0..3)
0 0 0 0 
##$XL= 0
##$YL= 0
##$YMAX_a= 462336
##$YMIN_a= -608525
##$ZGOPTNS= <>
##$ZL1= 120
##$ZL2= 120
##$ZL3= 120
##$ZL4= 120
##$ABSF1= 16.522
##$ABSF2= -4.171173
##$ABSG= 5
##$ABSL= 3
##$ALPHA= 0
##$AQORDER= 0
##$ASSFAC= 0
##$ASSFACI= 0
##$ASSFACX= 0
##$ASSWID= 0
##$AUNMP= <proc_1d>
##$AZFE= 0.1
##$AZFW= 0.1
##$BCFW= 0
##$BC_mod= 0
##$BYTORDP= 0
##$COROFFS= 0
##$CY= 12.5
##$DATMOD= 1
##$DC= 0
##$DFILT= <>
##$DTYPP= 0
##$F1P= 14.0000005364418
##$F2P= -0.99999901652339
##$FCOR= 0.5
##$FTSIZE= 32768
##$FT_mod= 6
##$GAMMA= 0
##$GB= 0
##$INTBC= 1
##$INTSCL= 1
##$ISEN= 128
##$LB= 0.3
##$LEV0= 0
##$LPBIN= 0
##$MAXI= 10000
##$MC2= 0
##$MEAN= 0
##$ME_mod= 0
##$MI= 0
##$NCOEF= 0
##$NC_proc= -3
##$NLEV= 6
##$NOISF1= 0
##$NOISF2= 0
##$NSP= 0
##$NTH_PI= 0
##$NZP= 0
##$OFFSET= 16.522
##$PC= 1
##$PHC0= 153.9218
##$PHC1= 3.856364
##$PH_mod= 1
##$PKNL= yes
##$PPARMOD= 0
##$PSCAL= 4
##$PSIGN= 0
##$REVERSE= no
##$SF= 250.13
##$SI= 32768
##$SIGF1= 0
##$SIGF2= 0
##$SINO= 400
##$SIOLD= 32768
##$SREGLST= <1H.CDCl3>
##$SSB= 0
##$STSI= 32768
##$STSR= 0
##$SW_p= 5175.98343685301
##$SYMM= 0
##$S_DEV= 0
##$TDeff= 65536
##$TDoff= 0
##$TI= <Analysis number 999999
Compound Code 99
Book Reference 9
Project Code 9>
##$TILT= no
##$TM1= 0
##$TM2= 0
##$TOPLEV= 0
##$USERP1= <user>
##$USERP2= <user>
##$USERP3= <user>
##$USERP4= <user>
##$USERP5= <user>
##$WDW= 1
##$XDIM= 32768
##$YMAX_p= 346385104
##$YMIN_p= -35148
$$ End of Bruker specific parameters
$$ ---------------------------------
##NTUPLES= NMR SPECTRUM
##VAR_NAME=  FREQUENCY,     SPECTRUM/REAL,   SPECTRUM/IMAG
##SYMBOL=    X,             R,               I
##VAR_TYPE=  INDEPENDENT,   DEPENDENT,       DEPENDENT
##VAR_FORM=  AFFN,          ASDF,            ASDF
##VAR_DIM=   32768,         32768,           32768
##UNITS=     HZ,            ARBITRARY UNITS, ARBITRARY UNITS
##FACTOR=    0.157963299565203, 1,           1
##FIRST=     4132.6476996994, 0,             0
##LAST=      -1043.33573715361, 0,           0
##MIN=       -1043.33573715361, -35148,      0
##MAX=       4132.6476996994, 346385104,     0
$$ Real data points
##PAGE= N=1
##DATA TABLE= (X++(R..R)), XYDATA
$$ [...]
16614C328o225p821o609Q056R601N555K663k57j1164j319O785m071r465M84P764
16599b695M505j641j205m527l067j81L266j981L274k609m502O491q61n222J0294
16584f61l553o013j890M142L973k118l493J872J0504L764m062j638o533k017N599
16569b124R3m637k762P166J2357k483j4979l764L365n203k281M15M65Q845J230
16554d297k836L712j848k858O386j389p904J368M096N490P599n060n398M21P082
16539D564j1519q979j536k609p92L000L419O214J636K213m209o078M165J264J423
16524g824m796K04P532J842Q668K95q973k660K732l62j533O21Q142M617j0197
16509a692o222L81L128j404P99o492k277j190k873j713m20m039L271K837J2607
$$ y = [3328, -2897, -10718, -17327, -9271, 330, 5885, 8548, 8291, -2873, -4192, 2593, -1478, -10943, -10459, -2695, 1810, 169, -1036, -5563, -8630, -8811, -5545, -7526, -4252, -6861, -11363, -4872, -5733, -10955, -661, -4214, -10227, -12117, -7975, -4002, -6120, -9613, -7741, 2763, 6527, 2465, 827, -5706, -7723, -2124, -2031, -6668, -9430, -2264, 10093, 7610, -7369, -11133, -7768, -12971, -15252, -14837, -14372, -5527, -4297, -7133, -3421, -5269, -8127, -1741, -3130, -11034, -9666, -5570, -80, 7519, 2459, -2939, -2518, 4564, -6955, -15934, -17470, -20079, -20871, -17871, -14452, -8238, -6602, -4389, -8598, -14676, -10511, -9247, -7824, -12620, -12416, -4884, -3042, 5626, 5921, -3052, -5712, -2980, -3342, -4875, -4254, 3888, 8505, -1692, -7914, -7533, -4405, -5809, -5010, -11502, -13779, -14969, -17842, -19555, -19975, -24014, -20743, -17906, -5299]
16494e299j175j988M638J3491P624m263r909m863j152m302L41j977J182m795J083
16479a1364O371r55n120L146J199m835J902M77R888K728l663m633M539R687o699
16464B668m648L624j298m629n729L261O987P287J3756p009J918m202j3496J873
16450C63l821j232N83K701J816l217j813k389l666J25L535l443n481r6L238M153
16434h644m18j793J1472K79n297n653j608O257J3109K270p00n890p740M400P92
16419H36j021L080k200K75l199J975O937J343N784j1281p313N366o150k569O938
16404a199O19m247l25K655O028M56j2627q206P530L559K72l545k425O314K820
16389b321q8Q625n572o204O137k325l680M946J0888p931j0501O466L762l515l388
$$ y = [-5299, -6474, -8462, -3824, 9667, 17291, 13028, 3119, -1744, -2896, -7198, -6857, -8834, -7652, -12447, -11364, -4993, -5948, -11068, -7922, -6723, -11558, -9656, -9179, 709, 3437, -226, -4859, -320, 9367, 2668, -1980, 1644, 346, -4283, -10012, -6751, 236, 7523, 21279, 14270, 16188, 11986, -1510, 363, -3458, -4690, -4107, -1406, 410, -2807, -4620, -7009, -10675, -10550, -7015, -10458, -15939, -16035, -12797, -8644, -9062, -10855, 617, 896, -4401, -10054, -11662, -5405, 7704, 9974, 9274, 3384, -4356, 44, 836, -185, 2895, 695, 970, -2229, -254, 6683, 8026, 13810, 2529, -4784, 582, -5568, -8137, -1199, -580, -4827, -5152, -2497, 3531, 3987, -8640, -16846, -9316, -5757, -5485, -9030, -11455, -5141, -2321, -2409, 6216, 644, -5560, 577, -1748, -5428, -482, 10406, 2475, -8026, -1560, 2202, -1313, -4701]
16374d701M964O008L11m254p867m291j05j516R02o185p984P927R369J595M873
16359i54L806L102n256M469k018q020J035j624R282P03n243o310J615K949P305
16344D841J901n2k156M470m572n018r12K391L132k288J082L378J726n950m694
16329b721L183L138L267o290q885L814k490k596L820j426p730q104P478J4211
16315a331J440q13m106j1114k862K853N103M188J678p42p40J305p606j707K303
16300a2151k123N448K607n314O839j286m753L058J746j99K253k168Q7P233J0040
16285A1317n626r295L083j920j0287L717J881n372J312k265J907L160O07O342
16271a439M293l959j0377j222p47j795N141R1K178K03l063K600N446L167j749
$$ y = [-4701, 263, 6271, 6582, 2328, -5539, -9830, -9935, -11451, -10549, -16734, -24718, -16791, -7422, -5827, -954, 2852, 5954, 698, 5167, 3149, -4871, -3836, -5460, 3822, 4525, -718, -7028, -5413, -2464, 4841, 6742, 6690, 4534, 9004, 4432, -586, -1498, 893, 4025, 1737, 2819, 6197, 7923, 1973, -2721, 462, 3600, 6867, 577, -8308, -4494, -6984, -9580, -5760, -7186, -14916, -23020, -15542, -1331, 109, -704, -4810, -15924, -18786, -15933, -10830, -6642, -4964, -5706, -6446, -5141, -12747, -14454, -12151, -14274, -8826, -6219, -11533, -4694, -5980, -10733, -7675, -5929, -6128, -3875, -6043, -5956, 1277, 11317, 5691, -3604, -521, -2441, -12728, -9011, -7130, -12502, -11190, -13455, -11548, -8388, -7781, -1439, 2854, -1105, -11482, -12704, -13451, -15246, -10105, -10014, -7836, -7633, -10696, -8096, -2650, 517, -1232]
16256a232j655k285N21j113M210P166N219M18k105K053k705k795j393M048m37
16241G915o016n122N433J213O169J331p45n242l191n789Q894l267M16r05o09J223
16225A708K987K217l783j709p980l043K44J269j164k170m250n603J662l518P356
16210a5777L456L643O654L757p384o364j042O595K862k588O468L448l479m241
16196c992j547k375K176N010O87k053J340n203J300L198K912j950n864L515M040
16181A194m270j712J781N695k638K236q57R56k094o375M740q069k672j857o96
16166a4638Q014K403j777L23J550l449l569M033k615j980J98N453R092O685n155
16151D568m418j197P036L326l309j5173j058R864l24j66n265o607n17J985M035
$$ y = [-1232, -2887, -5172, -4651, -5764, -1554, 5612, 10831, 11249, 9144, 11197, 8492, 5697, 4304, 8352, 7915, 1899, -3223, 2210, 3423, 9592, 10923, 10178, 4936, 1745, -4044, 4850, 1583, 1999, 1094, 485, 1708, 4695, 6912, 3129, 1420, -6560, -9603, -9359, -8090, -9254, -11424, -15674, -21277, -19615, -23133, -15777, -12321, -8678, -2024, 1733, -5651, -12015, -13057, -6462, -3600, -6188, 280, 3728, 249, -3992, -5539, -7914, -5738, -728, -41, -2094, -754, -5957, -4657, -1459, 1453, -497, -6361, -2846, 1194, -3076, -4788, -3007, 2688, 50, 2286, 1429, 2385, 291, -6084, -1344, -9413, -12085, -13942, -14638, -6624, -4221, -5998, -5675, -4125, -7574, -11143, -7110, -9725, -11705, -11507, -6054, 3038, 9723, 4568, 150, -1047, 5989, 9315, 6006, -9167, -10225, -361, -685, -851, -6116, -12723, -13240, -11255, -7220]
16136g220J689K273O053J011r55l897N33m4L892K414n866n780j619p49J1L858
16120d396K032N130P25n008P4J55N796l227k805n989q176J310N201n8K231K385
16104d620j681M652m616n63q397J605R022R411K895N15j049j638m55M830j689
16089H222n232m377O212l088j491o082O71N548L84q77m985k550k246l282N90N757
16073f826p159J49K165O503K777P98K536k644J33M66J278M072L179k967m511l591
16057c642j117J402M741Q729O56l700r140q110R00m193M842O909M344L793K48
16042F662K21k443L133k88q320n127k055L746M019L225J486l925k49L759m158
16027c14o197l113l098n601L986N364M160p23J797m72K089o786L121J75p714m380
$$ y = [-7220, -5531, -3258, 2795, 3806, 2851, -1046, -513, -557, 3335, 5749, -117, -5897, -7516, -8265, -8254, -4396, -2364, 2766, 3491, -1517, -1443, -1288, 4508, 1281, -1524, -7513, -15689, -14379, -9178, -9236, -7005, -4620, -6301, -1649, -6265, -6828, -15225, -13620, -4598, 4813, 7708, 8223, 7174, 5536, 5081, 9911, 8222, 2990, -1387, 4825, 1737, 246, -5836, -5165, 383, 767, -110, -5095, -7645, -9891, -13173, -12583, -6826, -13985, -13836, -11671, -5168, -2391, -1593, 943, -1701, -1568, -1102, 176, 4248, 7427, 4460, -51, -3642, -4759, -3357, 1384, 10113, 10769, 7069, -2071, -10181, -9281, -13474, -8632, -1723, 2621, 6414, 6662, 6883, 4440, 7573, 7285, -1035, -6162, -8217, -4471, -452, 2773, 4259, 334, 85, 3844, -314, -6511, -9624, -12722, -18323, -14337, -8973, -4813, -5536, -3739, -4211, -2122, -8908, -5787, -5612, -13326, -17706]
16011a7706O876O23k802Q450J174n23P89M116Q231O623j3118j1894l324O949O84
15996d852l094K674K907P136j772q915l523O446Q489J092o311r419j949n0J61
15981a0980O875Q289k679o450m6l655o128j590n67m757o334K629K882Q987Q653
15966d871l377R957K928p448J186P02j514J2379O309m603k498O132m501n566k105
15951C110j016L407L536k674m263j830J420R69n668q316J639L520P82o621N470
15936f535m109k657l181P757n42l503J206O777N922J409r264m495n43j140n263
15921a8161k68J1992j205j299k260q943M681J0858P496j986q589m341l030P594
15907g461O054j87j0822j587L109k121m107m95o46K439L90K297l58N619o64n4
$$ y = [-17706, -10830, -10207, -13009, -4559, -3385, -3908, -3119, 997, 9228, 15851, 2733, -9161, -12485, -5536, -4852, -7946, -5272, -2365, 4771, 2999, -5916, -9439, -2993, 5496, 6588, 277, -9142, -11091, -11141, -10980, -4105, 4184, 1505, -4945, -4991, -8646, -14774, -16364, -16931, -21688, -28022, -25393, -22511, -13524, -4871, -8248, 1709, 4637, -2811, -1625, -923, -2437, 9942, 16251, 11648, 9150, 15282, 10781, 5215, 3110, 2094, 5501, 9037, 6363, 2100, 270, 1690, 2659, -3009, -11325, -9686, -6166, -5384, -12005, -6535, -10644, -13301, -16482, -8725, -9267, -12770, -11564, -4787, 1135, 2544, -6720, -11215, -11758, -12898, -18161, -18429, -6437, -7642, -8941, -11201, -20144, -15463, -4605, 2891, 905, -7684, -12025, -15055, -7461, -1407, -1594, -12416, -14003, -10894, -13015, -17122, -17617, -18263, -15824, -15434, -13137, -13495, -7876, -8540, -8594]
15891h594j132K613K957o389r005k403J89M209j200L901L683N976P502j511m035
15876c239L927M453k835j851l217L110L174M090L530O552q433l971j160L471P869
15861A5470q346r278l789m603J640k497J296j668k770n173l392K715K563N325
15847a2507J417O803L79r03k394l035K159P663j506N64K69o355j673k22L963N375
15831cl53m525l851O553j609o121p162J621N790P289K277q624P351J243j4351
15816a4475p6J8713J3452k489q746j5414o291K892l940l43J0236P741j428n692
15802e860j1525L650L855k356j888N580O975j201Q755N434m506n527j569m567
15788d750J191J0462N84M42l631m887n367J0632n60o320j1653p782M99L367O229
$$ y = [-8594, -9726, -7113, -4156, -10545, -19550, -21953, -21764, -17555, -18755, -14854, -11171, -5195, 2307, 796, -3239, 688, 5141, 2306, 455, -2762, 348, 3522, 7612, 11142, 17694, 9261, 5290, 4130, 7601, 15470, 7124, -2154, -5943, -10546, -8906, -11403, -10107, -11775, -14545, -19718, -23110, -20395, -17832, -12507, -11090, -4287, -3908, -4811, -7205, -10240, -8081, -418, -1924, -1360, -1091, -7446, -9119, -9341, -5378, -3, -356, -4881, -8732, -2179, -3788, -9909, -17071, -15450, -9660, -2371, -94, -8718, -1367, -124, -14475, -14551, 4162, 17614, 15125, 6379, -9035, -15326, -12434, -16374, -16717, -6481, 1260, -168, -5860, -17385, -13735, -9880, -12236, -14124, -8544, -1569, -2770, 5985, 11419, 6913, 1386, -183, -4750, -3559, 6903, 7487, 7929, 4298, -589, -5956, 4676, 4116, -2204, -13857, -21639, -21140, -17773, -11544]
15773a1544M135O184J1794J996q755p797N942M941m125q192p106m660N598J0209
15759a380j322O333q769p132K710Q581l636Q50N575K226j0089J142K667n889r28
15744i061j0138J281L170J445N633M263o543L011L605L954M390p440j0070O834
15730e666J0176o202r067M363O644m349m955K189N716j494n687O82K506J800J026
15715b318k986N470O478k874j3128j1244O630J1724L30l505J243M52K315M393
15701B980j09j055K99J12J50r82J1511k340K200k36p928n384j515k504K71l509
15685h039n084Q671j358L474M923J599R83M567M149p411l236n998j599L724r274
15670i909O946M959l972J1484j285m165M321k918N440L203k944L89j726l622M536
$$ y = [-11544, -7409, -1225, 10569, 12565, 3810, -3987, 1955, 6896, 2771, -5421, -12527, -17187, -11589, -1380, -2702, 3631, -5138, -12270, -9560, -979, -4615, -3765, 1810, 4036, -6053, -4911, -2244, -8133, -9061, -19199, -17918, -14748, -13303, -7670, -3407, -9950, -6939, -3334, 620, 5010, -2430, -12500, -5666, 4510, -1692, -10759, -6396, 248, -4101, -9056, -6867, -1151, -2645, -8332, -7650, -5144, -3344, -2318, -5304, 166, 6644, 3770, -9358, -20602, -13972, -2248, -1918, -5423, -4180, -3728, -1413, 2980, 2871, 1816, 2115, 2227, 2377, 1395, 12906, 10566, 12766, 12530, 4602, -782, -2297, -4801, -4530, -8039, -13123, -4452, -5810, -2336, 2587, 4186, 5169, 9736, 13885, 6474, 3238, -2760, -4359, -635, -9909, -2963, 1996, -1976, 9508, 8223, 4058, 8379, 5461, 10901, 14104, 11160, 11549, 9823, 6201, 10737]
15655A0737j037m160p539m517N802J917M743M004j2789l629N006k407o211l537
15641a3617j761Q20Q466R96m860l315j061K51O695m209J487O202k484L998L749
15626A357K676o48q044j67M186L732k476j590O30m23j1647J405P737R915M730
15611A1373J459o412p443p818K647L216K141j2118m398M274K693j042l630R47
15597a4111J1236l959n719pK370L913m781j030O200k177j916R97K91n491j2843
15582b7027P31L657N534j593l853O800O871m967M021Q204L058n095m790p06O053
15567c102P309j198j881j340O960l561l441O191l625N765J525K257k821K39k543
15552F734p678r02k001n502q66k171J375O424K331j098M789J964Q142m434o285
$$ y = [10737, 9700, 5540, -1999, -6516, -714, 1203, 5946, 9950, -2839, -6468, -1462, -3869, -10080, -13617, -15378, -14558, -6092, -5096, -9956, -13271, -14332, -14081, -7386, -11595, -10108, -3906, -6390, -2392, 1357, 4033, 3385, -4659, -4826, -640, 3092, 616, -974, -344, -767, -12414, -11009, -3272, 6643, 11373, 12832, 6420, -1023, -8841, -6194, -2978, -837, -12955, -17353, -13079, -10386, -11428, -15058, -14111, -2875, -6834, -12553, -12560, -10190, -6277, -11058, -12088, -5888, -8065, -9981, -8984, -8693, -14184, -27027, -26296, -22639, -17105, -18698, -22551, -15751, -8880, -13847, -9826, -1622, 1436, -3659, -8449, -9155, -3102, 4207, 3009, 1128, -212, 6748, 3187, -254, 5937, 2312, 8077, 9602, 11859, 9038, 9277, 6734, -944, -1846, -3847, -9349, -10215, -12386, -11011, -4587, -2256, -3354, 1435, 3399, 11541, 7107, 822]
15537H22j1804k693P862O804l17l255n859R88J1709P018m398o984k317l881L490
15522b815Q79M304L952q86k771j83m448m983k626J31K09l028J804K774P82l432
15506a0337o05j370n606j656N742M237K794L393J324P699K098K674O944K22o770
15491A0783m088j67N155J086r849r714L233l976p853L110J2952P776N67k785k120
15476D110p523j595l430o28N964j798N34J1570J0213m848k944m501L15n718o611
15461f890M571m572k450Q88J0013J1063o061k958m949J307j99p648k589m997m967
15446b0438L330J1695K228J874k22p915J145N391L799m396J1049l17p482K62N858
15431E861J531m324o699q55J605J412M7l018m258R791P961n721j288m363q973
$$ y = [822, -10982, -13675, -5813, 991, 674, -2581, -8440, -7452, 4257, 11275, 6877, -107, -2424, -6305, -2815, -1936, 2368, 6320, 5434, 2663, 2480, -1968, -6951, -9577, -9446, -9237, -12265, -10461, -7687, -6905, -10337, -10942, -12312, -17918, -19574, -13832, -9595, -6801, -3408, -2084, 5615, 7713, 10387, 17331, 17553, 10783, 6695, 6528, 11683, 12769, 2920, -6794, -3561, -7537, -15390, -12280, 672, 8448, 9015, 6230, 4110, -3413, -5008, -8438, -9066, -3102, -4900, -4366, 7204, 17417, 12569, 9625, 5124, 5439, -279, -6890, -2319, -6891, -9341, -8453, 1560, 12623, 6562, 3604, -1345, -38, -237, -7885, -10474, -15471, -20438, -17108, -5413, -3185, -1311, -1533, -9448, -8303, -2912, 887, -3509, 7540, 7223, -259, 3, 5861, 7392, 3068, -3631, -4486, -2881, -1469, -1422, -4440, -8698, 1093, 9054, 3333, 2045, -2318, -11291]
15416a1291p99M23j666k434M966J879L025N404J541L868j373o17m637j3119j543
15401a6373N123p359m694p879P295R163M969Q213P226K223o606k15K125p690N98
15386c881j215J655M92L336L787R653k912k764r397m194J576J457q2J18R083k755
15370C957j3928O9K767L809j801j442p73Q698M067K656l141p550j607L981l125
15355c363K554L431j386l798m566p916o147R499R554M580j483L512K5L242M934
15340A2672j3854q135L890K497o763l593O246J894K157m705r078J836L553P622
15326c761N314m539q352L722K27p53j524j09Q667j370k336l084l331K260P243
15311a726P652N39l771k540q736n122N908Q114M159k536m911k811M535m660N78
$$ y = [-11291, -12090, -11667, -13333, -15767, -10801, -8922, -5897, -493, 1048, 4916, 3543, 2926, -1711, -14830, -16373, -11250, -18609, -23303, -31182, -23887, -14724, -9755, -1542, 5684, 7907, 1301, 1086, 3211, -4479, -3881, -5096, -3441, -2949, 387, 4174, 13827, 10915, 8151, -1246, -5440, -3864, -2407, -2489, -2371, 6712, 3957, -9971, -9902, -7135, -3326, -5127, -6569, -7342, 1356, 5423, 8079, 4938, -2612, -4219, -238, -3363, -809, 2622, 1236, -2562, -7128, -15044, -21191, -11692, -2138, 2442, 959, 4471, 4496, 7738, 12672, -1182, -9317, -5427, -2930, -9693, -13286, -7040, -5146, -2989, -7694, -16772, -14936, -11383, -3761, 1553, -2986, -11338, -7616, -7389, -8142, -9666, -9775, -1108, -2478, -4814, -7898, -11229, -8969, -1726, 5926, 6465, 2694, 154, -8582, -13704, -7796, 318, 4477, 1941, -2970, -5781, -1246, -5906, -5328]
15296e328J570k049J10k707L040K466K762n280Q93k439q228l296J469O507J3761
15281C251q18l454R12j265M779R000m556p722m023N463n82m046J644O318Q533
15266A3434q511r397P951O15m667j722n17K675R52Q93q491j793L660P785L248
15251F115k991k745K609L146m404j1081k684l353L510Q432M059j311l480j54m11
15236d743K275J113j407j2179j1139J276R442K765k708Q145L690q29p512m114
15222a5925q349K613P648N245O493k759J728n03k550M301N914P306l99Q35M495
15207A6093m810R40r562j0688k698n63N726P366p934Q1L335O013L811m158L78
15192C330J444j359r705j195j40P581n50m369K622l25K22J03j837R758m123q71
$$ y = [-5328, -3758, -5807, -5697, -8404, -5364, -2898, -136, -5416, -4523, -6962, -15190, -18486, -17017, -10510, 3251, 2433, -1021, -109, -1374, 3405, 12405, 7849, 127, -3896, 1567, 985, -3061, -1417, 4901, 13434, 4923, -4474, 3477, 4092, -575, -2297, -2814, -139, 813, 1706, -6785, -8578, -4918, 2867, 6115, 3124, 379, 2988, 6134, 1730, -9351, -12035, -15388, -11878, -3446, 613, -698, -4178, -4332, -4743, -2468, -1355, -2762, -14941, -26080, -24804, -15362, -12597, -15305, -7160, -3470, -4299, -11811, -15925, -24274, -21661, -14013, -8768, -2275, -5034, -3306, -3809, -6359, -2058, 3856, 11162, 10763, 11598, 16093, 11283, 12223, 2661, -8027, -10725, -11288, -5562, 1804, -6130, -6049, -2714, 3299, 7110, 2952, 3330, 4774, 3415, -6290, -7485, -7625, -44, -594, -4963, -2341, -2666, -2444, -2341, -4178, 5580, 1457, 586]
15176E86J063j084p894J717Q829J974O69k468j2026o468M27Q665k151k691k705
15161a3557K54M046M101Q413m515j071N603M409n711q222o988p778J364o14Q095
15146a2171L510J165L561M148O662N419q114r523o520P673J0803M610j885M668
15132A4006J308j3413q524L716p872k767L729l905j405L126K857j519M048J0218
15118C603j063P146O132k214m143j3121l884K106j774n015n650j869L133P202
15104i411J092k446L207m355m505J005P68p150j728M867P252K725m031K22N704
15089f784M243p183K358q033r858M871P532k879M981j116k903m606M851J1403
15075c123k447K608L868J745K407j0270o083J290K94J375m746K516k832j234R349
$$ y = [586, 1649, 565, -7329, -5612, 3217, 5191, 5860, 3392, -8634, -15102, -14675, -6010, -8161, -10852, -13557, -13303, -9257, -5156, 3257, -1258, -2329, 3274, 7683, 1972, -6250, -13238, -21016, -19652, -20266, -12171, -8661, -7496, -3935, 213, 6875, 12294, 4180, -5343, -11863, -4190, 6613, 11223, 9338, 14006, 15314, 1901, -6623, -2907, -10779, -13546, -9817, -13722, -15127, -12001, -9144, -10663, -6615, 3603, 2540, 9686, 15818, 13604, 9461, -3660, -7544, -5438, -7212, -12227, -17877, -19746, -16613, -9411, -8319, -10765, -7558, -11913, -16418, -15413, -14645, -21795, -23523, -18656, -11404, -8679, -12710, -12488, -6784, -2541, -9724, -7366, -15399, -25257, -20386, -12854, -15733, -10752, -11868, -14771, -19377, -14526, -3123, -5570, -2962, 906, 2651, 5058, -5212, -11295, -10005, -9711, -8336, -13082, -10566, -13398, -14632, -5283]
15060e283J490n490O466K658l624O053P830O105Q13k880n974l941q920j184M544
15045a337J695o31J535l469n174k175l498l706N969M800L330j289L969K711J564
15030D294o105K071L634K259J596K113J558L00P33M72o997k524j741r74L123n52
15014C260m145n99j118K579L527o735k650j198k614n68p94k589K652J0931M683
14999D622R74k792k487J557k368Q22M279O998L325o528j2726r998P930K750p622
14984a1264q205L045O750P833J2639J612j553l466l910M582N221K018p849o970
14970D83K237K11n45k085l351n591q906O00L583K559N569N185O46J196j473j0
14954C08j783N992j042j485L923k589P88O326N499O0K269j223j232m502Q467l447
$$ y = [-5283, -3793, -9283, -2817, -159, -3783, 2270, 10100, 16205, 17018, 14138, 8164, 4223, -4697, -5881, -1337, 358, -273, 1262, -2207, -7381, -9556, -13054, -16760, -10791, -5991, -2661, -3950, 19, 2730, 4294, -1811, 260, 3894, 6153, 7749, 9862, 11420, 11720, 12453, 12925, 5928, 3404, 1663, 689, 3812, 3260, -885, -1484, -2602, -23, 3504, -3231, -5881, -7079, -9693, -10261, -11055, -13644, -10992, -61, 4622, 5596, 2804, 317, 1874, -494, 328, 4607, 11605, 14930, 8402, -4324, -14322, -6392, -3642, -11264, -19469, -16424, -9674, -1841, 10798, 12410, 10857, 7391, 3481, 8063, 13284, 15302, 7453, 483, 2720, 2931, 2386, 301, -3050, -8641, -17547, -16947, -13364, -10805, -5236, -51, 595, 1791, 318, 308, -1475, 4517, 3475, 1990, 5913, 3324, 4112, 10438, 15937, 15997, 18266, 17043, 15811, 11309, 19776, 16329]
14938A6329j1078o786j921O247P859J0799J672k256l952p498q937k505r01q26
14924c754k869n173l329j231J804P468l572j460J0404M268o635L204O253j258
14910D120j2989m232j517Q482Q532J964n424p844k117M643J701o542M172k883
14896i934m725L893J284l450N857N301o712o077m656L958J3756l859l58J3724
14882H002R042l756p946q394K92P81r56p392m475j694j807L666P871P962P006
14867H202n291k223l868L512k983J158l686J344Q23K828n46K440p3j495M524K134
14851F800m571n399l833N323Q822K268p058J246m090K848P59o402l769J124J2178
14836F246n367k164j939j773N157J0492K995l473q798n566j0247R043L914J824
$$ y = [16329, 5251, -1535, -3456, 2791, 10650, 21449, 23121, 20865, 16913, 9415, 478, -2027, -2928, -3754, -6623, -11796, -15125, -16356, -14552, -7084, -10656, -12116, -1712, 2556, -4079, -875, 5378, 4120, -8869, -13101, -14618, -6136, 2396, 4360, -1064, -8908, -11025, -6382, -4681, -11223, -7051, -9934, -14659, -10766, -9482, -12932, -7075, -1774, -8486, -14563, -19219, -15261, -1505, -5364, -5722, 8002, 17044, 13288, 5342, -3052, -2760, -1979, -2935, -10327, -14802, -16496, -18303, -14637, -6766, 1196, 8202, 2911, 688, -3180, 332, -2651, -1493, -5179, -3835, -3012, -184, -730, 1710, 1637, 142, 4666, 6800, 2229, -3170, -7003, -1680, 7142, 9410, 2352, 3598, -492, 2356, 3115, -3287, -7056, -5932, 6246, 879, -1285, -3224, -4997, 160, 10652, 13647, 10174, 1376, -4190, -14437, -5394, -1480, 344]
14822C44J515k605j999o535o65Q339Q649l8j666r848q616L274J660M053P31l556
14806f963L408q284J053P821k566J676O105m239k706L271m978k977P976O85j287
14791b005M294k939n327q826L621K871J6105l786j912r55j313M476o467n2K500
14776B85q694M83Q811K399l600j880j05m091m809J059K894k903Q872N25o809M035
14760c528J2824L070n852m942K842l673r058j734J867J2497M358p974N781O480
14746A2958r0N243p719k677L661l253q025p321r47m91m129P76L59M569r6J354
14730e828N117R758O479J694r770j3424j835K748j0310k575J6345R773j145q345
14716a318j1465j0472L280J7442N812K201K798N669n203k940k873L643q088J087
$$ y = [344, 1859, -746, -2745, -9280, -9945, -1606, 7043, 7005, 5339, -4509, -13125, -9851, -8191, -4138, -3407, -6963, -3555, -11839, -10786, -2965, -5531, -3855, 2250, -1989, -4695, -1424, -6402, -9379, -1403, -718, -2005, 2289, -650, -5977, -14803, -11182, -8311, 7794, 4008, 2096, 1141, -172, 4304, -2163, -2215, 285, -8409, -7926, 885, 3284, -316, -2196, -2301, -6392, -11201, -10142, -7248, -10151, -1279, -754, -7563, -3528, 9296, 12366, 6514, 1572, 4414, 741, -8317, -10051, -8184, 4313, 8671, 697, 6478, 12958, 12868, 18111, 10392, 7715, 11376, 8123, 98, -7223, -8170, -8661, -12790, -12014, -11655, -7086, -7182, -5828, -711, 9047, 15526, 17220, 7450, -5974, -7809, -5061, -15371, -17946, -1601, 8172, 7027, -1318, -12783, -23255, -19975, -2533, 3279, 5480, 8278, 13947, 8744, 5804, 2931, 6574, -1514, -427]
14702d27J0237l065J686O72n8p39p303J906n852q408m028P089P858L561k205P906
14686H830P29k797K963k52P4n247j357M260k097m680J889O057M968n996l291m259
14670b06r73l16o755n570L086M529m60J093P624O214J873n300n329p020n091n11
14654a3112M82L720O694Q716K336j2645l924l968L823K458l47M503k179o259k623
14639a2325N533K906j811m588n62m681P8P409L015L02N173O220J297l173p828
14624c035r371l969L298O457M356k523K630l106m632L767L212M22j551m481L104
14609e422P32m382n142l563n011J0502r09L004P383m83N437j389k145l058l627
14594h073J583o75n69o241j897J0696O998M746q896j963K991J140J1052O69m036
$$ y = [-427, 9810, 6745, 8431, 9103, 9045, 8306, 1003, 2909, -2943, -11351, -15379, -8290, -432, 3129, 924, 8830, 9559, 6762, 9725, 9473, 9547, 4300, 2943, 7203, 5106, 426, 2315, 8372, 13340, 7344, 4053, -206, -1179, -1495, -8250, -13820, -10734, -6205, -6665, -5572, 2052, 8266, 10139, 4839, -490, -7510, -12601, -13112, -12630, -8910, -2216, 6500, 8836, -3809, -7733, -11701, -7878, -5420, -5767, -1264, -3443, -9702, -12325, -6792, -3886, -5697, -10285, -10847, -15528, -15450, -8041, -5026, -4724, 449, 6669, 7966, 4793, -3035, -12406, -16375, -13077, -6620, -2264, -4787, -2157, -5263, -9895, -6128, -2916, -2494, -4045, -8526, -5422, -4690, -9072, -14214, -17777, -22788, -12286, -13195, -10191, -2808, -3291, 2146, 757, -1388, -4446, -8073, -6490, -7165, -7734, -13975, -15872, -5176, 1822, 6568, -2328, -4291, -1300, -160, 10892, 11561, 7525]
14579G525k597j3670L738P783j510N913J832Q76n298m607m686k100l58L632K176
14564a351O515n251l284M23j160k026l408p528l229P257J1632M534j4254o721
14550a7851J1121Q452o450n579K361J860k557P02K806k994j455O016L449q810
14536h929p731k7L057L732L877M488n78p226L465N93l010K783N296p840p043P485
14520g608J787K686J220J407O082k622n833K861L662m981j29j404r440m137Q635
14505g814j121L653L039m332l835m669P42P147m62n892M797J1354M578l483n508
14490a806l884P14O725M449r203p405P18J665n83j189j829J303n498m272K639
14475a7456P222L770K591P760R2j311M106j864o258L813m550O368q79m534N60
$$ y = [7525, 4928, -8742, -5004, 2779, 1269, 7182, 9014, 9890, 4592, -15, -4701, -6801, -7159, -3527, -1351, 5164, -87, -3371, -2948, -4108, -6134, -9542, -17070, -20299, -13042, -1410, 3124, -11130, -17851, -6730, 1722, -4728, -10307, -7946, -6086, -8643, -7941, -5135, -8129, -9584, -3568, -119, -8929, -16660, -16687, -13630, -9898, -6021, -1533, -2111, -9337, -5872, -5279, -8289, -5506, -210, -8050, -15093, -7608, -5821, -3135, -1915, -508, 5574, 2952, -2881, -20, 3642, -1339, -1468, -2872, -12312, -16449, -7814, -8935, -5282, -2243, -6575, -10410, -15079, -14337, -7190, -7652, -13544, -8747, 2607, 7185, 3702, -1806, -5690, -4976, 1749, 6198, -3005, -10410, -9692, -8027, -8610, -9799, -11628, -10325, -15823, -20095, -17456, -10234, -6464, -3873, 3887, 3979, 2668, 6774, 4910, -1348, 2465, -2085, 4283, 3404, -1130, -570]
14460e70N585o336l934J625j594l797K033R308M140L867K039p145K93Q56k93J212
14444G289K980k003K881M350m172m576M96L450J013r440j0017K608Q776J490k400
14429B725q261k617k322r931N209O818R48k996L379N158k115k620l7j811J41J471
14413f861m197j580N894m883j802R024J937j279P317Q49p158l29L839N392P068
14398A3231n241k948K865l149q475N080O694K744j058o694R42j660J800n967k965
14383d801Q077J034m118q133p320J1837O829q897o936L641m03K467L270l764l5
14368g252q50m344L544O705k838j732J393J789p248q051L674J909J605Q032R330
14353E666M456L94j1806p933J743j145J270n99K66M065J072L163l578N441m332
$$ y = [-570, 5015, -1321, -5255, -3630, -5224, -9021, -6988, 2320, 6460, 10327, 12366, 5221, 5514, 6370, 6077, 7289, 10269, 8266, 11147, 15497, 11325, 6749, 7245, 10695, 11708, 2268, -7749, -5141, 3635, 5125, 2725, -5536, -8153, -10475, -20406, -15197, -8379, -7431, -10427, -7048, -1890, -4005, -6625, -6662, -8473, -8332, -6861, -11058, -12638, -6744, -11627, -13429, -4405, -2468, -3747, 3570, 4419, -2739, -3068, 771, 6163, 13231, 7990, 5042, 7907, 4758, -3717, 1363, 8057, 10801, 9743, 3049, 3991, 2331, 4131, -1836, -4801, 3276, 4310, 192, -7941, -15261, -3424, 3405, -5492, -12428, -8787, -9190, -6723, -3453, -7217, -7252, -8102, -12446, -8902, -2197, -5035, -6767, -5374, -3585, -10833, -18884, -15210, -13301, -11696, -3664, 5666, 10122, 10516, -1290, -9223, -7480, -8625, -7355, -7954, -7688, -3623, -2551, 612, -2966, 2475, -1857]
14338a857j1053p445O049J0476N319r351n553J089K815Q337J061N306m223l50
14324F20l072j735N239j606q475K900L369J367k141M486O496q428k998n900m411
14309a4289K691j111k077R421M317k250L059J404K910l238m95p7M169N10J439
14294F383m020q973q941l69J734M243M055N976k76K402l199j975M876L855O360
14279A2131Q106Q127r668j7927p801J357O208k114M455O319K833q376n371K662
14265I41N802K907o793K709N01p44K822l32n669j543M783K421l273K155k783k638
14249A266j904J270O650l293p712M45L826L244j105K580O16M02n073k365n5L230
14233B022M543L146n786J377k159m809n906o36P215J489q605M41J134j978K872
$$ y = [-1857, -12910, -20355, -14306, -3830, 1489, -7862, -13415, -12326, -9511, -1174, -113, 5193, 970, 620, -2452, -4187, 1052, -554, -9029, -6129, -2760, -1393, -3534, 952, 7448, -980, -3978, -9878, -14289, -11598, -12709, -14786, -5365, -1048, -3298, -239, 1165, 4075, 837, 342, 265, 4434, 4944, 6383, 2363, -6610, -15551, -15920, -14186, -9943, -5888, 88, -188, 2214, -985, -2960, 1916, 5771, 12131, 20237, 28364, 18696, 769, -7032, -5675, 533, -1581, 2874, 9193, 12026, 3650, -1721, 941, 6743, 9650, 2857, 5566, 6067, 5323, 8145, 7813, 2144, 601, 5384, 7805, 4532, 6687, 3904, 1266, -638, 632, 7282, 3989, -3723, -3278, 548, 3792, 2687, 5267, 5883, 6285, 1212, -1153, -1208, 2022, 6565, 9711, 3925, 5302, 3143, -1666, -7572, -8208, -993, 496, -8109, -7668, -6534, -8512, -5640]
14218e640L137n937k987n915O204J0456pl805R67n88m241P211L236K345k86J667
14202E817L34m145J241L383j0382q779O217k543K67k25L726J590k857M528j122
14187b950j332l55k587m730o475J41Q192l991n096Q766N049J2084p53o508L411
14172B866P381J485p156m134m379p23R77N994l248j1714L17N758m863j398N411
14157g426R810l077n864Q015O779L312m339j2592o142l334P541j586j488N918
14143d473M216n607l669J645j745L07L151M368J277P532P368j1535q691O0q47
14128f643o92k219L498N809j867l622Q90J2502N294l469j1547q820k126o395o810
14113b6217N819K103K854J7762R109l512q393m600k606l326N837P601K651k959
$$ y = [-5640, -2503, -8440, -11427, -17342, -11138, -682, -689, -4494, -3527, -4115, -8356, -1145, 2091, 4436, 4150, 5817, 6151, 2006, 3247, 6630, -3752, -12531, -6314, -8857, -8590, -8815, -5089, -3499, -6356, -1828, -2950, -4282, -4637, -7224, -11954, -18429, -18288, -10096, -14087, -19183, -10417, -5368, 6716, 5963, -545, 2866, 10247, 11732, 4576, 442, -3937, -4660, -3683, 2311, -937, -12651, -12334, -6576, -11439, -12837, -7426, 2384, -693, -6557, 1458, 8237, 11549, 7210, -5382, -11524, -14858, -7317, -8903, -10391, -4473, -257, -5864, -9533, -7888, -9633, -9326, -6175, -1807, -530, 7002, 14370, 2835, -5856, -5796, -6643, -7335, -9554, -6056, -247, -2114, -5736, -4846, 7656, 12950, 9481, -2066, -10886, -13012, -19407, -26217, -20398, -18295, -15441, 2321, 11430, 7918, -475, -5075, -7681, -11007, -5170, 2431, 5082, 2123]
14099B123p125L068Q964j418q529M611l628J243K288L386N513j661P760M590n329
14084A5856r208l029l664N74Q093m58j369p888r041M327N391k184j2K288r618
14069i942Q300N628l066P26j926l167m944j343M44j988q40K753P186L026J2692
14054A3539k570m832q265l371J936n77j903J197J729j766k622L632J911K524J302
14039A864K064O195j570k907K246O80j2579l798L762M29l125j0010P037J4369
14025D657N46k169m424j068R52k310J955J402Q011r165r743N145L773p131L731
14010e838Q636L774m681K907j134Q813N184m497m099k264q334M908M712l369m623
13995I5K423N251N177o185r162l296K014N536n71O389P801K313p955k794O586
$$ y = [2123, -5002, -1934, 7030, 5612, -2917, 1694, -1934, -691, 1597, 4983, 10496, 8835, 16595, 21185, 15856, 6648, 3619, -45, 529, 8622, 8164, 6795, -1093, -10134, -5807, -416, -2600, -2612, -324, -9942, -1642, 3986, 920, 1646, -280, -3447, -8391, -9734, -9290, -11278, -12118, -9365, -2179, 847, 13539, 10969, 6137, -2128, -5499, -3563, -4140, -6043, -4846, -3117, -4883, -7505, -3873, -1962, 562, 1864, 3928, 10123, 8553, 5646, 7892, 8572, -4007, -7805, -4043, -3614, -6739, -16749, -9712, 4657, 5203, 3034, -1390, -2458, -1506, -3816, -1861, -459, 7552, -1613, -11356, -6211, -2438, -9569, -5838, 2798, 6572, 1891, 4798, 3664, 12477, 17661, 13164, 9065, 6801, -1533, 3375, 8087, 4718, 95, 2518, 7769, 12946, 6761, -2401, -5697, -3683, 1853, 1282, 7671, 15472, 17785, 9830, 7036, 13622]
13980A3622l061p306K842J284k823o353j82N398n31n919k598j121M774q75O466
13965C617M782M331J623J037m051o671j312m237J24n47K817k553m463K406k061
13950e158K581O347Q037j138r617M17K657J650L209Q39J389o496k807J911j330
13935B491m177N73m674p486n590J92J350O395J763M596N710Q283m46r932L721
13920B769P666K313j2596N097J3097q983m618k242M06o735l589k92n199o566K545
13905a6927L73J884L772O98J3034J230m505l051L182N563k08n058j329K343Q778
13890I779J729l75n004o660l893n12L520j683P77n34Q176L837o2l417r387j02
13874c811m213j522L994k814J0349O653n881k389p301n846J1023j46M93N175N793
$$ y = [13622, 10561, 3255, 6097, 7381, 4558, -1795, -1977, 3421, 2890, -3029, -5627, -6748, -1974, -2849, 3617, 8399, 12730, 14353, 15390, 11339, 4668, 3356, -881, -757, -1304, 1513, -1040, -5503, -3097, -5158, -2577, 3770, 11807, 10669, 1052, 1469, 4126, 5776, 8985, 9824, 11213, 4717, 1910, 3821, 2491, -1686, -1113, -5787, -13273, -18863, -18671, -17321, -10926, -9163, -4567, 1143, 9426, 8980, -952, 2769, 10435, 12748, 152, 5249, 18346, 9363, 4745, 2503, 2909, -3826, -7415, -7707, -12906, -19472, -16927, -16554, -14670, -10898, -10200, 2834, 4064, -441, -3492, -310, 5253, 5045, -13, -1342, 1001, 9779, 11508, 11133, 6129, -531, -4424, -4936, -1416, -3099, -2322, -2856, 5320, 9157, 9095, 5678, -3709, -3811, -8024, -9546, -5552, -8366, 1983, 8636, 2755, 366, -6935, -12781, -1758, -1904, -1411, 3764, 9557]
13859I557k69k354N962m330m281r674q907J207j022J0180J0697l25Q968L451J12
13844A8972j3686l956N126L319n277j033O337j57j345O612r93o376n008n248P214
13829D501N753n078l931l880J517l178j165P689l297m085m215J321Q141J815K287
13814D195m719o648M369J0119q03K351R772L506n958J738n210l992M255m125p006
13799A844p16m604M511J0728M233n531k80m780l681m183L8j601l913n543O344
13784g134J1899O286m169q677O140m658K181P469K186k431j4785o711l829O997
13770i236Q102k46n21k476M871N902P684p202m697O018J08m446m710k207P896
13755D840K952q714K920K526j1302k24N094L971j72K581j970o374k827K187m247
$$ y = [9557, 9288, 6934, 12896, 8566, 4285, -5389, -14296, -13089, -14111, -3931, 6766, 6441, 15409, 18860, 18972, 5286, 1330, 6456, 9775, 4498, 3465, 9802, 9645, 8300, 14912, 13919, 7543, 2535, -2713, 4501, 10254, 5176, 1245, -2635, -1118, -4296, -5461, 2228, -1069, -5154, -9369, -8048, 93, 1908, 4195, -524, -7172, -2803, 7316, 6513, 8864, 18636, 22142, 16184, 17922, 12712, 8720, 12975, 8850, 1844, 1128, -3476, 1035, 11763, 15996, 10465, 10185, 5405, 1724, -2459, -2421, -4022, -7935, -13478, -7134, 4765, 11051, 6882, -1795, 4345, -313, 1868, 9337, 11523, 9092, -5693, -12404, -16233, -9236, -1134, -1380, -1901, -4377, 494, 6396, 14080, 6878, 2181, 8199, 8307, 3861, -849, -3056, 4840, 7792, -922, 1998, 4524, -6778, -7002, -1908, 2063, 1891, 4472, 2502, -3872, -6699, -4512, -8759]
13740h759L480M589k600q509O366P514L128k242O405J2850m277q390j3196j740
13726e381J0820l767p529J075L974J685j72k767j213K223l775k291k631L245M475
13711b029j729K715O875j856l5N998J5930m46j3375m420l856m833L310j040m341
13696c132K079K573J118J1690P905K634J598j0578q339J17M787q860J047R723
13682A4362R25k32j625l061l768O444m024m323l198K234K111j904o76O519r34
13667H850q283N15N770k340l855j654P726M73M356m778K263l900R22l022M28O039
13651I510M255n066r330N223J4051J959o546l581j721l516R76r88L137M116k221
13636A0258R12p96N55m34l6K688K826k419O750L035l621o966l708m50l307m387
$$ y = [-8759, -5279, -690, -3290, -11799, -5433, 2081, 5209, 2967, 9372, 22222, 17945, 9555, -3641, -5381, 5439, 1672, -5857, -4782, -808, 877, 705, -2062, -3275, -1052, -4827, -7118, -9749, -6504, -2029, -3758, -1043, 5832, 3976, 3941, 9939, 25869, 25423, 12048, 7628, 3772, -1061, 2249, 1209, -3132, -1053, 1520, 2638, 14328, 22233, 24867, 26465, 15887, 7548, 7665, 12452, 3592, 4639, 14362, 15287, 15055, 13430, 10369, 6601, 13045, 9021, 4698, 1500, 3734, 5845, 3941, 3265, 9784, 8850, 567, 1082, 6852, 4512, 657, -997, 6729, 7202, 11558, 6780, 9043, 5143, 6065, 3043, 3471, 9510, 13765, 8699, -631, 4592, 18643, 20602, 14056, 10475, 8754, 5238, 6214, 5226, 8363, 12479, 10258, 11170, 10374, 10929, 10495, 10459, 13147, 15973, 13554, 20304, 23339, 19718, 12752, 9044, 8594, 5287, 900]
13620I00k3N808L309k96M358p820l713L70K472L532j2567N184N291j271q33q790
13604d089J921J543m520n76Q305k195l956r84m517M065K372O279J413J979J080
13589H120P44O845J938k315K309J973r40k411m547J728n213N763K157P14k667
13574A4198q59l188J652K619L00K660L822j72l122m635o855K030k124n64K085
13559G847q66N511j094l221P928j625O545j3692q31k828j592j662j749Q07j633
13544b155l216r24J2742P786N209J999m659q194j131N363j403k660M254P873O22
13529B1506K371M59k716J904L807k644k518J48r283p432J212J431O665k37M010
13514A8683Q565N007K545o227o494j0486k058K443k921k20j614m210m290l435
$$ y = [900, 877, 6685, 9994, 9698, 14056, 6236, 2523, 2893, 5365, 8897, -3670, 1514, 6805, 5534, 4701, -4089, -2168, -625, -5145, -5721, 2584, 389, -3567, -4551, -9068, -5003, -2631, 3648, 5061, 7040, 8120, 8864, 15709, 17647, 15332, 17641, 19614, 18674, 16263, 11716, 13444, 8231, 13994, 16151, 16865, 14198, 13339, 10151, 11803, 14422, 14722, 17382, 21204, 21032, 17910, 13275, 6420, 8450, 6326, 5762, 7847, 6981, 12492, 11398, 8177, 16105, 14480, 21025, 7333, 6502, 3674, 2082, 420, -1329, -522, -2155, -5371, -6295, 6447, 14233, 19442, 21441, 16782, 8588, 7457, 12820, 11417, 8757, 13011, 20884, 21506, 23877, 24336, 21620, 23524, 27331, 24687, 22169, 22317, 13034, 5602, 6814, 8245, 14910, 14673, 18683, 27248, 32255, 34800, 28573, 22079, 11593, 9535, 11978, 9057, 8837, 7223, 3013, -1277, -4712]
13500d712J870O56p166j520K293M450J0877K028m077K776l979m577n253L438Q324
13485E428N37l506J0098O155k331q19j003k759k206j261j771M015L800j968N456
13470A7865k880j0036O134P374k486j0706k770q045k990K637N744k778k67N93
13456b611o098m372Q263L252Q478O484j254q069R694R893K788q41p917l489k084
13441A2117j0847m134R573k30O833j350k488j426J554m85L271j516J587L400m853
13426A1006M714l407m606n286k318R976q81K818K49j416Kp515p673J74L682K719
13410B238K359P758O704j488k359m863k143P616J1008o054m718n046k775j300
13396F937K952q841N382J2904L692p493J4R82J128J443l032l638N25k756o751
$$ y = [-4712, -2842, -2186, -9352, -10872, -8579, -4129, 6748, 8776, 4699, 7475, 3496, -1081, -6334, -2896, 5428, 5965, 2459, 12557, 18712, 16381, 15562, 14559, 11800, 9594, 8333, 6562, 10577, 14377, 12409, 17865, 14985, 4949, 11083, 18457, 15971, 5265, 2495, -5550, -8540, -5903, -159, -2937, -3204, -2611, -8709, -13081, -4818, -1566, 6912, 13396, 12142, 4073, 13767, 23660, 26448, 25607, 17690, 14201, 12117, 1270, -2864, 6709, 6479, 13312, 11962, 9474, 8048, 9602, 9117, 12388, 10872, 12459, 15859, 11006, 15720, 12313, 7707, 2421, 103, 10079, 9198, 12016, 12265, 10849, 10851, 3336, -4337, -4163, -481, 2238, 4597, 12355, 19059, 17571, 15212, 10349, 8206, 15822, 26830, 20776, 16058, 11012, 8237, 6937, 9889, 1048, 6430, 19334, 23026, 15533, 15547, 16529, 17657, 19100, 16068, 12430, 12955, 10199, 3448]
13381C448M20J422L963M459L171l727n895l21L786j141q478L770J0547k969q061
13366D394m761m815J4395R895k111o158O84j823r533j636P229P76N229j1855q972
13351i062Q975J2581K247q959q743o333l344M83O421l727R427Q413M105O60k488
13336A0656k567m36j813J673M667k702j033n746j197K297J5737K735p703N10M738
13321A9816L584J909n252j23p431O35K591O49M377N796l074k195p772L141k060
13306A4591o127j967k849L586K769R345p100q389n979J48R301K901K40m343L963
13291A0090L722L079O61J5j231m107o81m42P999k832j066j2625l190J2404k166
13276I630o613k089N7Q761J602m009n15L146N007m838N313L752n189n957K702
$$ y = [3448, 3868, 5290, 9253, 13712, 16883, 13156, 7261, 6940, 10726, 9585, 1107, 4877, 15424, 12455, 4394, -367, -5182, 9213, 19108, 16997, 10839, 11523, 9700, 167, -1469, 5760, 6536, 11765, -90, -9062, -87, 12494, 14741, 5782, -2961, -9294, -12638, -12155, -5734, -9461, -34, 8379, 12484, 13144, 10656, 8089, 7653, 5840, 7513, 12180, 9478, 8445, 2699, 1502, 3799, 19536, 22271, 14568, 15078, 19816, 23400, 25309, 20057, 19934, 12503, 13138, 15729, 16378, 20755, 26551, 23477, 21282, 13510, 16651, 14591, 8464, 6497, 3648, 7234, 10003, 19348, 12248, 3859, -2120, -1972, 7329, 10230, 10470, 6127, 10090, 13812, 16891, 17552, 17567, 16336, 12229, 11548, 11106, 19105, 16273, 15207, 2582, -608, 11796, 9630, 3017, 928, 985, 9746, 11348, 7339, 6824, 9970, 14977, 10139, 15452, 19204, 14015, 8058, 10760]
13261A0760J010n437k42K130j292Q12J069M892Q831n13K231R22J864o777p740
13246A2520k862m439j319O453N669l691p17j306l21k316p001K889Q898J409O306
13231B0172P35p428J703j084o372J637j346J023k339n396l07P918M802O814M59
13216B0991j091l327r591o557K632l852k801L716J1252M103O30N14j777l673m825
13201F344k177L459R468J398K85n776l629L567l539n210r222J1990J1505P583
13187B6046j59k364l819r071j817O924O343L673N729J991j2605j1644N516L038
13173A7781q105o69J356L963j569o314Q463O983j91L937J902p910L532J308k000
13158B2467m780q903k216P915J840o094k055K034J088L409M3q661N048P454R19
$$ y = [10760, 11770, 6333, 6091, 8221, 6929, 7741, 8810, 13702, 22533, 22020, 24251, 25173, 27037, 20260, 12520, 9658, 5219, 3900, 10353, 16022, 12331, 11614, 10308, 9987, 7671, 670, 3559, 12457, 13866, 20172, 20907, 13479, 15182, 14098, 7726, 9363, 8017, 9040, 6701, 1305, 998, 8916, 13718, 20532, 20991, 19900, 16573, 6982, 425, 3057, -795, -3596, 120, 11372, 15475, 16105, 16619, 14842, 11169, 6344, 4167, 7626, 17094, 18492, 18777, 13001, 9372, 12939, 9400, 4190, -5032, 6958, 18463, 26046, 25887, 23523, 19704, 10633, 8816, 15740, 22083, 25756, 31485, 33476, 20871, 9227, 14743, 17781, 9676, 9007, 10363, 14326, 12757, 6443, 14906, 21889, 21698, 25635, 27537, 19627, 23159, 24467, 22467, 17687, 8784, 6568, 14483, 16323, 10229, 8174, 10208, 11296, 14705, 14748, 6087, 11135, 18589, 19508]
13143A9508K760k780R75o737k42N483K714n310m288l858J665L359Q464K827n383
13128A9157J012k361K8j689M817M740q545p034O738O890k578m037l084m94l339
13113A0221n844L532J107M392P388l63n809J551P05J51j023q855q915P528L946
13098I712r8l834O81J0365J070m877l370l286K170K722J0458N087R27J36r965
13083A7898N144O688k313o043m88k493j5488o929n529j645J3240J3048J541L880
13069B0511k512K263K83k399l137J31N810P63P37k929q064o204J938N519N336
13054A8046l098n721l673k855j779J0599O841o30j332M373K395k251k844m574
13040A3497J482k101j274j467M464M251p567n708K367P851J1184P363o05l849
$$ y = [19508, 22268, 19488, 20463, 13726, 13484, 18967, 21681, 16371, 12083, 8225, 9890, 13249, 21713, 24540, 19157, 20169, 17808, 17836, 16147, 20964, 25704, 17159, 10125, 16863, 23753, 21175, 17138, 14054, 13560, 10221, 4377, 7909, 9016, 13408, 20796, 20433, 14624, 16175, 16880, 17031, 16008, 7153, -1762, 5766, 9712, 9614, 5780, 6461, 16826, 17896, 13019, 9649, 6363, 8533, 11255, 21713, 26800, 27727, 27863, 17898, 23042, 29730, 27417, 21374, 20886, 18393, 2905, -4024, -9553, -11198, 2042, 15090, 16631, 20511, 17999, 20262, 20545, 18146, 15009, 15140, 20950, 21713, 22450, 19521, 11457, 5253, 7191, 12710, 18046, 14948, 9227, 5554, 2699, 920, 11519, 18360, 17730, 16398, 20771, 23166, 20915, 18071, 13497, 14979, 12878, 11604, 10137, 14601, 18852, 11285, 5577, 7944, 15795, 26979, 34342, 33737, 29888]
13026B9888m932p470J174q15n571p552j522r304P074P415l18M455K373P18j343
13011A4270R95j684J157M699R06J44l026l306k143J950K939K243q15l045J1N124
12995B0419L492j1672l747J702k85M079J1374n236j725k48j837P784O383K994
12981C3477L360J192l524m780o350L04P645l216p488j286k891K639P324n329r067
12966A2010j235k023L151r30K142J1426Q603K440J113q442p825o081k789L85L44
12951A2289P05j75j967n471J0053O297K755Q636l416p561k173M277M422K196j292
12936B9575m012k817j075L715K538j518q099q745J625N6R090R439L88k685q36
12921B6639J210q80k440o748p803J118P778K655J975R978K373j0681j5508k562
$$ y = [29888, 24956, 17486, 18660, 17845, 12274, 4722, 3200, -6104, 970, 8385, 8067, 12522, 14895, 15613, 14270, 15265, 13581, 14738, 19437, 20343, 20487, 17461, 14155, 12012, 13962, 16901, 19144, 18329, 15284, 15295, 20419, 23911, 12239, 8492, 10194, 9909, 13988, 25362, 20126, 18401, 18153, 16316, 24100, 30483, 33477, 36837, 38029, 34505, 29725, 23375, 23679, 31324, 28108, 20620, 19334, 16443, 19082, 26406, 21077, 12010, 10775, 8752, 11903, 10973, 13115, 24541, 33144, 35584, 36697, 28255, 20430, 14349, 11560, 11945, 12289, 12994, 12819, 10852, 5381, 15434, 21731, 24486, 33122, 29706, 22145, 19972, 24249, 28671, 30867, 29575, 25563, 22746, 21671, 25386, 27924, 26406, 18307, 9562, 11187, 11243, 20333, 29772, 30160, 27475, 26639, 27849, 26969, 24529, 17781, 9978, 11096, 18874, 21529, 23504, 33482, 35855, 25174, 9666, 7104]
12907G104O515J877L230R383k852q0K015N401J914P89J238o304J842P220L279
12892D2571l233l893j154k834p003j191L45O317R651K011j430k651j2998K439
12878B6947O105j717L796O865j3507o558R970N2k146l3J400P228J990P08l197
12863C7903j937k893K41M449L16P391k011k566n937N150L68m867p366j4893N723
12848A9071J2446j944K937j284K220J319K313L793P425P047l316m036k797j638
12834D3556p30L039j524m774m921J076l251j14Q13k275L525k04O027N537p833
12819C7947j4692j0860o86m377j762p336N156N578K951J1775J260P75k770o993
12805A5966j804j818k3M359k990J2394J0750O860L417M130J443k714M814J0945
$$ y = [7104, 13619, 15496, 18726, 28109, 25257, 25177, 27192, 32593, 34507, 35296, 36534, 30230, 32072, 39292, 42571, 39338, 35445, 34291, 31457, 24454, 23263, 23608, 29925, 39576, 41587, 40157, 37506, 24508, 26947, 33052, 31335, 35131, 41996, 28489, 21931, 31901, 31953, 29807, 29774, 31174, 38402, 40392, 41100, 37903, 35966, 33073, 33314, 37763, 38079, 45470, 43459, 40893, 34956, 40106, 40474, 35607, 28241, 13348, 19071, 31517, 29573, 32510, 31226, 33446, 34765, 37078, 40871, 48296, 55343, 52027, 47991, 45194, 43556, 42826, 45865, 44341, 39567, 34646, 35722, 32471, 32357, 33170, 30895, 34420, 34216, 40243, 45780, 37947, 23255, 12395, 11709, 7332, 5570, -1766, 3390, 8968, 11919, 23694, 24954, 25729, 22959, 15966, 14162, 12344, 12321, 16680, 13690, 26084, 36834, 43694, 47111, 51241, 52684, 49970, 54784, 65729]
12791F5729J0132M970R393J4817M913J4142J9797K1674K2334L4459M3568M9750
12779C15678N1069O2947P6148P6734P5334O0345M0722J8951L844j3646l2614n8376
12767F77136o3167p5850p2701p2750o3698n2262l9965k8777k9381k6312k3251
12756A29022n497L096l63j461j5303k1028r954l871M241L59k134k537J640n480
12742G0730o728k179K318n488J148N64k471k34l336L999K254m103Q07o663k030
12727D8588N961K563K677k505L903J537K989M790J269j410n455N909O300l545
12713G3571J323o831j556m085n359K700Q747Q046n083k913M952P349J333l795
12699G8399L990K740k447k28J017o40J1611J1239J4698M876M168J1434J5517J1462
$$ y = [65729, 75861, 80831, 90224, 105041, 109954, 124096, 143893, 165567, 187901, 222360, 265928, 315678, 366747, 429694, 505842, 582576, 657910, 718255, 758977, 777928, 781772, 768126, 735512, 677136, 613969, 538119, 465418, 392668, 328970, 276708, 236743, 207966, 178585, 152273, 129022, 123525, 126621, 126258, 124797, 109494, 88466, 78512, 74641, 78882, 79241, 77107, 74570, 76210, 70730, 64002, 61823, 64141, 58653, 59801, 60365, 57894, 57660, 54324, 58323, 60577, 56474, 57281, 50618, 48588, 54549, 57112, 59789, 57284, 61187, 62724, 65713, 70503, 71772, 70362, 64907, 70816, 77116, 73571, 74894, 68063, 66507, 62422, 57063, 59763, 68510, 76556, 71473, 68560, 73512, 80861, 82194, 78399, 82389, 85129, 82682, 82454, 83471, 82831, 94442, 105681, 120379, 125255, 129423, 140857, 156374, 167836]
12685A67836J7703J6281J4941K5632J8533K3336K7815L8252N2801N6622N6223
12674E15975N8802O7764O8454N7449O5282O1738L9715K0687q0j3964l4685m3314
12662H63823n2250o1407p2844p5697p4568o9814o2688n0509l7893l4572k4930
12651B46651k0751j8526j1953l157j3140j4184n266j1817j7680n801N053l127
12639A26302L721o276n397q033J58K664r121j1498Nj74J2004Q320p948l709k598
12624I8420m394m36O287L077L047m128j771O956O583J1416J1914J2919O503Q836
12610A65229J1499Q392J386R69J667r641j1995j1592j0498j0191q480q869r30
12597A16946l128p632m40r823o23o71q119p351m469o249k495J20M828M47P789
$$ y = [167836, 185539, 201820, 216761, 242393, 260926, 284262, 312077, 350329, 403130, 459752, 515975, 574777, 642541, 710995, 768444, 833726, 895464, 935179, 955866, 955786, 941822, 907137, 863823, 811573, 750166, 677322, 601625, 527057, 457243, 394555, 344046, 306153, 271581, 246651, 225900, 207374, 195421, 192264, 179124, 164940, 159674, 147857, 130177, 124376, 129429, 126302, 130023, 123747, 118350, 110317, 110475, 113139, 104018, 92520, 92525, 92351, 104355, 112675, 104727, 101018, 98420, 94026, 93590, 99877, 102954, 106001, 101873, 100102, 107058, 113641, 125057, 136971, 149890, 156393, 165229, 176728, 185120, 186506, 187475, 189142, 179501, 167506, 155914, 145416, 135225, 126745, 117876, 116946, 113818, 106186, 105746, 95923, 95300, 94629, 86510, 79159, 74690, 68441, 65946, 66066, 70894, 71341, 79130]
12582G9130L831O820N667J303k523M097q206k692j8295j184J3465L879K409O973
12568I4674Q526K080P869Q787L462k230J205o249p714l502J3420K2218L92j135
12554A41803k434j105P80N4o368L163N266m473k022j0931q857q112N579L595m818
12539A11120O92O554N856o662n68M034L472n11n278j972M31j1541l862N475k689
12524A04551p75o409j0212l225R91P43j545J478O972m897o789K929O211R518J8527
12509A18068K1718K852R533P420N061J576J0507M518l280l033m840o519n198p814
12495A50569j1594j0917p913o689l147m020j4681r070r143j7052j5592r642P06
12482C1815J3407K0888J6517K2095L2137K7647J3531J7606K2825K0999J1874L901
$$ y = [79130, 82961, 89781, 95448, 96751, 94228, 98325, 90119, 87427, 69132, 67948, 81413, 85292, 87701, 94674, 103200, 105280, 113149, 121936, 125398, 123168, 124373, 118124, 110410, 106908, 120328, 142546, 142938, 141803, 139369, 138264, 139044, 139098, 132730, 135893, 141159, 136686, 134664, 123733, 114876, 106764, 112343, 115938, 111120, 111812, 118366, 124222, 117560, 116992, 121026, 124498, 123987, 118709, 116737, 117168, 105627, 101765, 107240, 104551, 103776, 97367, 87155, 83930, 84921, 85664, 84119, 85597, 92569, 87672, 80883, 83812, 90023, 99541, 118068, 139786, 142638, 152171, 159591, 164652, 166228, 176735, 181253, 177973, 174940, 170100, 163581, 158383, 150569, 138975, 128058, 120145, 113456, 110309, 106289, 91608, 82538, 73395, 56343, 40751, 31109, 31815, 45222, 66110, 82627, 104722, 136859, 164506, 178037, 195643, 218468, 239467, 251341, 255242]
12470B55242M430O965k284j194O260L193K243J2833Q631K213J248J1688O52O130
12456C18250Q92K528n086N836J4575J917n042J437J1537L357K672n722R07N020
12442C53078M08j3619J2372J4303J945m724j133N289J3920P873M552j32k730K2230
12428D13632K2911J6829R936K9317J8250K0128K0840J3676K1180K0150K1912J7936
12416F46697L1334L0715L8340L9985N2176M6908M1637M4603L7199J4135J7567
12405A041296R645k006K891K6325M1118L2736M9703N4035N6391M9716N6951O9554
12393A488355P3317P7487O3417O7880R8203J06060J15121J25922J56221J85224
12383B557207K24323K66500L11835L69158M31828N18399O23950P49058Q68802
$$ y = [255242, 259672, 266637, 264353, 263159, 269419, 272612, 274855, 287688, 296319, 298532, 299780, 311468, 312120, 318250, 319142, 321670, 316584, 322420, 336995, 338912, 333870, 335307, 346844, 350201, 352873, 347151, 348058, 353078, 353486, 339867, 352239, 366542, 368487, 363763, 362630, 367919, 381839, 389712, 394264, 394132, 391402, 413632, 436543, 453372, 463308, 492625, 510875, 531003, 551843, 565519, 586699, 606849, 628761, 646697, 678031, 708746, 747086, 787071, 839247, 886155, 927792, 972395, 1009594, 1023729, 1041296, 1050941, 1048935, 1051826, 1078151, 1119269, 1152005, 1201708, 1255743, 1312134, 1361850, 1418801, 1488355, 1561672, 1639159, 1702576, 1770456, 1868659, 1974719, 2089840, 2215762, 2371983, 2557207, 2781530, 3048030, 3359865, 3729023, 4160851, 4679250, 5303200, 6052258, 6921060]
12374F921060R97896J155994J327317J509516J700719J971404K367587K949737
12366B0901230L811883N081949O951633R296526J1394250J2748113J3895793J4896034
12358I8977411J4951334J3018557R473481N742407J981254k258151p014631j1099334
12350A23772328j3404245j4374804j4633919j4305980j3035117j0914818q609748
12343C4493697o555340m894237l646247k772620k190328j811272j554987j369206
12335I699460j213238j074107r48400q20311o93824n67266m74180l91289l17205
12326C199640k67392k37459j99364j80125j63293j54038j39168j21697j11162
12317A625942j06583r2537p7628o8773n3497m9842l5394l1156k6407k1450j4975
$$ y = [6921060, 7918956, 9074950, 10402267, 11911783, 13612502, 15583906, 17951493, 20901230, 24713113, 29795062, 36746695, 46043221, 57437471, 70185584, 84081377, 98977411, 113928745, 126947302, 136420783, 142163190, 144144444, 141886293, 134871662, 123772328, 110368083, 95993279, 81359360, 67053380, 54018263, 43103445, 34493697, 27938357, 23044120, 19397873, 16625253, 14434925, 12623653, 11068666, 9699460, 8486222, 7412115, 6463715, 5643404, 4949580, 4382314, 3908134, 3516845, 3199640, 2932248, 2694789, 2495425, 2315300, 2152007, 1997969, 1858801, 1737104, 1625942, 1519359, 1426822, 1349194, 1280421, 1226924, 1177082, 1141688, 1110532, 1084125, 1062675, 1047700]
12306A047700o962j262K506q695j839q006k2451k2726l4794n0745m8386n2123
12294G92217o0305m8278n1136k7189k6707l3539j7211o658q170r501m892j0775
12282D87856l599l228J860N975M213J0106K1800M470J3313K7508K7095L3613M2234
12269F73216N4343O0642O1403P0087O6022O8707N4136J9408m343l4141o7105p8318
12257I44057r2653j08147j05205q5322o5998n7382l8898j7575o059p755r190n779
12245C44094n636j3107q628k0939j8938k1294j1007m582J810P650Q605J4865K0785
12232B93678K5344K7703K6505K1810J8198J1573Q058j1203k6522k5331k7211j2856
12220C29746k6388l0419k1097j4608k1208j1881p41l177k868j1779j5231n875
$$ y = [1047700, 1040738, 1039476, 1041982, 1033287, 1031448, 1023442, 1000991, 978265, 943471, 892726, 844340, 792217, 731912, 683634, 632498, 605309, 578602, 545063, 527852, 521194, 513024, 503523, 498631, 487856, 484257, 481029, 482889, 488864, 493077, 503183, 524983, 529453, 542766, 570274, 597369, 630982, 673216, 727559, 788201, 849604, 919691, 985713, 1054420, 1108556, 1127964, 1123621, 1089480, 1022375, 944057, 851404, 743257, 638052, 552730, 486732, 429350, 390452, 372877, 366818, 359063, 349873, 344094, 338458, 325351, 316723, 295784, 276846, 255552, 244545, 239963, 241773, 249423, 258028, 272893, 293678, 319022, 346725, 373230, 395040, 413238, 424811, 432869, 421666, 395144, 369813, 342602, 329746, 303358, 272939, 251842, 237234, 216026, 204145, 203404, 200227, 197359, 185580, 170349, 164474]
12208A64474J960M260K5529L6901M6673M2346K6536J1965p924k4771k6218j5872
12196B85859r042M510L274J3201K1066K1201L5194L9077M7708K7448j499k8204
12184D59793l5169k9985l6938l6519k9316j8743j0770q618N216O235J7896K1795
12172C04877K3730J3004m279j4028k2443k4875k4771k0980k0337j9924n203Q192
12160A92963J3618J2376J0982j591n754N580L636K1556M7959O5846Q4692R5076
12148E46939P9687N1884k611m7997n2274m6378l2024k2017J0261O784j8501m6339
12136D27414n4125m9051m4780l7786k8804l3551k0025j3565j2828j0410m460j272
12124A16757j949j814k768J968P99p113m785J997J1354O846J5464R202J8110K8983
$$ y = [164474, 166434, 170694, 196223, 233124, 279797, 322143, 348679, 360644, 352720, 327949, 301731, 285859, 276817, 281327, 284601, 297802, 318868, 340069, 375263, 414340, 462048, 489496, 487997, 459793, 424624, 394639, 357701, 321182, 291866, 273123, 262353, 253735, 258951, 265186, 283082, 304877, 328607, 341611, 337332, 323304, 300861, 275986, 251215, 230235, 209898, 189974, 184771, 192963, 206581, 218957, 229939, 228348, 222594, 228174, 231810, 253366, 301325, 367171, 451863, 546939, 626626, 678510, 675899, 627902, 575628, 529250, 497226, 475209, 485470, 492254, 473753, 427414, 373289, 324238, 279458, 241672, 212868, 179317, 159292, 145727, 132899, 122489, 118029, 116757, 114808, 112994, 110226, 112194, 112993, 105880, 101095, 103092, 114446, 121292, 136756, 145958, 164068, 193051]
12110A93051L8614M7530N9431M5905J3780k1930n0519m5555l9281l7864k8433
12099A74729j7363j9266j8795j4346n889j3589n600k465j2486p945L618l239p649
12086D9715k570j762L202j66J347o50m466J473m19o005L118J2233J3010k275q201
12071E7584o549j549L933k715m404o30j293K578K183m589Q184R246J1559Q570
12057H2108p43P439j264k108K59O48R62m762J462p269q435r220r538j1051k555
12042C5933k371L88m798j826m94K420J041M030J1333R591l483l412j304K547J331
12027E0926p447j400J504M639J2462L981N681K709J241l975M16o51J13o18L471
12012G3052J902K869l766j32j0291m903o109m030J078j93l985J053n975Q899M867
$$ y = [193051, 231665, 279195, 338626, 384531, 398311, 376381, 325862, 280307, 241026, 203162, 174729, 157366, 138100, 119305, 104959, 99070, 85481, 79881, 77416, 64930, 56985, 60603, 57364, 49715, 47145, 45383, 48585, 48419, 49766, 49116, 44650, 46123, 45704, 39699, 42817, 55050, 68060, 65785, 57584, 51035, 49486, 53419, 50704, 46300, 45670, 44377, 46955, 49138, 44549, 52733, 61979, 73538, 82108, 81365, 88804, 87540, 85432, 85691, 86339, 87301, 82539, 84001, 76732, 68297, 59077, 49539, 38488, 35933, 33562, 33950, 29152, 27326, 26832, 29252, 30293, 34323, 45656, 55247, 51764, 48352, 47048, 49595, 50926, 43479, 42079, 43583, 48222, 60684, 64665, 70346, 73055, 74296, 70321, 70737, 70086, 70199, 69581, 73052, 74954, 77823, 74057, 73925, 63634, 58731, 52622, 48592, 49670, 49477, 45492, 46545, 40570, 49469, 54336]
11997E4336j04L437L870P302R107K326R090J4106J6095J5615K0154J7781J8115
11984A91230J2965J0433J0658q939k8121k0370j8813j9976k6831j2403L687J0694
11972A04214m566K69k805K758L505J0142j160j4922p024K710N381J073o321j0624
11958H2630J532J592o553J0485l716p324M065Q138l392l14Q499J1665K973J6166
11944A26446J6489K2646L3052L9306M5548N2654O9398P3878Q6843Q3459P3880
11933G23599N5110M5066K6742L427k0357m9492p3511p6989q5694q2107p2997o4536
11921C28261m5023l8553l1959k2291k2065j8412j6462p357o182n817p220j0708
11909I6212n404M061n237n168J6718J0167l631K176M04j0526n333O440J136O56
$$ y = [54336, 54232, 57669, 61539, 68841, 77948, 80274, 89364, 103470, 119565, 135180, 155334, 173115, 191230, 204195, 214628, 225286, 216347, 188226, 167856, 149043, 129067, 102236, 89833, 93520, 104214, 99648, 99917, 97112, 99870, 103375, 113517, 112357, 97435, 90411, 93121, 98502, 99575, 93254, 82630, 84162, 85754, 79201, 89686, 85970, 78646, 82711, 90849, 87457, 87143, 95642, 107307, 110280, 126446, 142935, 165581, 198633, 237939, 283487, 336141, 405539, 479417, 566260, 649719, 723599, 778709, 823775, 850517, 853944, 833587, 784095, 710584, 633595, 547901, 465794, 392797, 328261, 283238, 244685, 212726, 190435, 168370, 149958, 133496, 126139, 119957, 114140, 106920, 96212, 90808, 94869, 89632, 84464, 101182, 111349, 107718, 109894, 110298, 99772, 94439, 100879, 102015, 102671]
11895A02671n598l279k076p275J0353K107q347j582q110R104O237n0J0666R065
11881A13886J164p61j5180j0808k170j0362o170o874p613k276j065l690P174j850
11867E3405p36O174n935m164L229M835l237q58n909Q39Q856K65l212k505O556
11852E7603k233l190n042l267K117M82m828o250j0120M811J122K146N385l2r98
11837C7706k108l724J802N20L982P674o07m306N047k399m3M739L146K392l667
11822E0154k58j660n33j757m895j02J388J499l430k317N149j263M196j529m805
11807C9837J483J451j38Q31J462L840J382J542L992J1682P222o337j3843o17j631
11792E2158N051J605n423J112M145o473l669K482o598j0135N24N532l002k558
$$ y = [102671, 97073, 93794, 91718, 84443, 94796, 96903, 88556, 86974, 78864, 87968, 94205, 94155, 104821, 113886, 115050, 114289, 99109, 88301, 86131, 75769, 69599, 62725, 55112, 52836, 51771, 48081, 55255, 53405, 52669, 58843, 52908, 48744, 51973, 56808, 53571, 52713, 46804, 47643, 56499, 56764, 53552, 51047, 57603, 55370, 52180, 47138, 43871, 45988, 46470, 41642, 35392, 25272, 30083, 31205, 33351, 38736, 38704, 37706, 35598, 31874, 33676, 34196, 38178, 45852, 45245, 40939, 45986, 43587, 43544, 48283, 51429, 53821, 50154, 49896, 48236, 47703, 45946, 41051, 40949, 42337, 43836, 40406, 38089, 43238, 41975, 46171, 44642, 39837, 41320, 42771, 42633, 43464, 44926, 48766, 50148, 51690, 55682, 67364, 74586, 68249, 54406, 53789, 52158, 57209, 58814, 53391, 54503, 58648, 52175, 48506, 50988, 44390, 34255, 34779, 40311, 37309, 34751]
11778C4751m763R923m945r656Q6Q395R081J404m761k76N99M715J853m58N005k044
11762D8909o532P141N983J0792M539o318j4533n895N275j144j417J021k330k500
11748D2991l160l944n4O508J136R94J996M927l789l103r82O031L593k760J867
11733E2251O313R230K001n32N844J601k003l598k036o468J520O266q466q765K8
11718E3186K640l587q970K300k783L149J283M494l139l478l940N843N564M616
11704E7178j852k950o170k955O147R420J774l289q048j1380N194J2555J88p502
11690D8310J006L144l112l214J659j255r5j579o804N507Q136L81l511J80Q829
11675E7582M250P90P42m162J695J381j721j786m648m212k870O228L687o430o175
$$ y = [34751, 29988, 39911, 34966, 25310, 25396, 33791, 42872, 44276, 39515, 39239, 39838, 44553, 46406, 45948, 50953, 48909, 42377, 49518, 55501, 66293, 70832, 64514, 49981, 44086, 49361, 48217, 46800, 47821, 45491, 42991, 39831, 35887, 35833, 42341, 43477, 44471, 46467, 51394, 47605, 44502, 43520, 49551, 53144, 50384, 52251, 58564, 67794, 69795, 69263, 75107, 76708, 74705, 71107, 69071, 62603, 64123, 70389, 61923, 53158, 53186, 55826, 52239, 43269, 45569, 42786, 45935, 47218, 51712, 48573, 45095, 41155, 46998, 52562, 57178, 55326, 52376, 46206, 43251, 49398, 58818, 60592, 57303, 49255, 37875, 43069, 55624, 55812, 48310, 49316, 52460, 49348, 46134, 47793, 46538, 46443, 44864, 38060, 43567, 51703, 52084, 48573, 48753, 57582, 61832, 62622, 63364, 59202, 60897, 62278, 60557, 58771, 54123, 49911, 47041, 53269, 56956, 50526, 44351]
11660D4351o162l841K823m07Q483J1163L154k994r547K46n408R193j238o521L618
11645D6913n84P183m116n164p10O467L711o685j751J641J0085m51o522L407j541
11630E1883m904N96J708l229N748m39L824P520N38o135m691N630o90K057K400
11615F1816n967n146M376j35q882K134J4032L707K379r72R6m465J584k928j412
11600F0217k072J874R97m728m980J514j455j477P08P096j52n401M410R857P017
11585G3425Q15p038o246k548l384m253o627R339Q683N934P79N396j870p281l873
11570F1251J47N203N856p214o079k754m46O802K223l320l552n525K37J4208L748
11555G0785k857k846m562M19K17j400j6l726M045M644J760M1n668J205Q59q28
$$ y = [44351, 38189, 34348, 37171, 36764, 45247, 56410, 59564, 56570, 47023, 47269, 41861, 51054, 49816, 43295, 46913, 46329, 53512, 49396, 44232, 43522, 49989, 53700, 47015, 45264, 46905, 56990, 56539, 50017, 53424, 51883, 46979, 47575, 49283, 46054, 51802, 51363, 55187, 62707, 63245, 57110, 52419, 58049, 57359, 59416, 61816, 55849, 50703, 55079, 54944, 46062, 48196, 62228, 65935, 68314, 67342, 67438, 62973, 64557, 61629, 60217, 58145, 60019, 61016, 56288, 51308, 52822, 51367, 49890, 50598, 57694, 57542, 52141, 56551, 66408, 73425, 74240, 67202, 60956, 58408, 55024, 50771, 44144, 53483, 62166, 68100, 68879, 74275, 72405, 65124, 61251, 61398, 66601, 72457, 65243, 59164, 56410, 55964, 62766, 64989, 61669, 58117, 52592, 52829, 67037, 70785, 67928, 65082, 60520, 60939, 61156, 59756, 59740, 56014, 60059, 64703, 66463, 66504, 60836, 62041, 62900, 62072]
11539F2072o269n916R63m815p86m001M150R468Q36K098L734o95j647p002l953
11524D8237Q64j109P519P726J0095l40K497J893o757p248r19M813K375J24Q00
11509G0570m933L348O366L933k226o850K884k223j955P976K700o6n478m783q414
11494F0849L56J1651K260L441q441p72k607k561j585m525L017n8n153P57j430
11479E5199j660R331m352o028O928J0976N803m00m542M72M010k225q48N783M539
11464H2986n81m003L953N23n937J565K662j994o375N060K985q768J497j851m52
11449G1270Q205R706l459m170p235l947J916q608l845R307O406j970j950J911
11435G3537L485n262O824l038N124Q295L275m516o222j844P298L139J870K716
$$ y = [62072, 55803, 49887, 50850, 46035, 45249, 41248, 45398, 54866, 55702, 57800, 61534, 60839, 59192, 52190, 48237, 49101, 47992, 55511, 63237, 73332, 72992, 75489, 77382, 70625, 63377, 62458, 67271, 69646, 69770, 70570, 65637, 68985, 75351, 79284, 77058, 70208, 73092, 70869, 68914, 76890, 79590, 79524, 74046, 69263, 60849, 61205, 72856, 75116, 78557, 70116, 69344, 66737, 64176, 62591, 58066, 61083, 61025, 55872, 56629, 55199, 53539, 62870, 58518, 52490, 59418, 70394, 76197, 75797, 71255, 71727, 75737, 73512, 72664, 78447, 82986, 82405, 78402, 82355, 82878, 76941, 78506, 81168, 79174, 72799, 77859, 80844, 72076, 73573, 71722, 71270, 79475, 89181, 85722, 81552, 74317, 70370, 72286, 63678, 59833, 69140, 75546, 73576, 71626, 73537, 77022, 71760, 78584, 75546, 80670, 88965, 92240, 87724, 81502, 79658, 86956, 90095, 91965, 94681]
11421I4681J325L93L451M525l289m100m443M193L592n283r955j119m271L982R525
11406I3207K479k381j133l201L149K327p202n142L448L47K657n041k872J0037
11392I0679R092o997J033l20K649k351L12j224J0395P930L398r244n290o042o414
11377H7606J388K545m024J377J2697M3q566M680K252l404P06j215n342n023o288
11362G9432P462R485o021K810M935o548k776n68N516l630Q180j310o565o395m952
11347G9055P044M350j0757N6P185R945J1749r22o819m905R301K700K907o50L869
11332A14108L431L208m559r892k95k364J454J497L923M718K551j298J1924N748
11318A34154J181K84o646o616J620O489L416R033O249l466m503R178K421M394
$$ y = [94681, 96006, 96399, 99850, 104375, 101086, 96986, 92543, 96736, 100328, 95045, 85090, 83971, 79700, 83682, 93207, 95686, 93305, 92172, 88971, 92120, 94447, 87245, 82103, 85551, 85898, 88555, 83514, 80642, 90679, 99771, 92774, 93807, 93487, 96136, 93785, 94097, 92873, 103268, 111198, 114596, 105352, 100062, 94020, 87606, 88994, 91539, 87515, 88892, 101589, 101632, 93066, 97746, 99998, 96594, 97300, 96085, 90743, 85720, 79432, 86894, 96379, 90358, 93168, 98103, 91555, 88779, 88211, 93727, 90097, 98277, 96967, 90402, 84007, 79055, 86099, 90449, 79692, 79748, 86933, 96878, 108627, 107705, 100886, 95981, 105282, 107982, 110889, 110239, 114108, 117539, 120747, 116188, 106296, 106001, 103637, 105091, 106588, 110511, 115229, 117780, 116482, 128406, 134154, 135335, 135619, 128973, 122357, 123977, 130466, 133882, 142915, 149164, 145698, 141195, 150373, 152794, 157188]
11304A57188Q096J5221J6115K7381L7037K8074K0504J2539P947j1746q115k5568
11292B84673l2575k4187j7047k0947p618o88j468K748K939n796j518n562K160
11279A75114J2326J0472J648p028O260J8197J7333Q609K3032L6520L1757M2272
11267C76512M8513M6564L7278L6288K3432K0063J4972k688p096l279j0946k9730
11255E49883l3691k2867j5309j8244j9618j3488j6147k2295k8125k2540k073o4
11243C35422j157N120N08J6226K6746K0944K0494K1169L0168K9763K5377K4541
11231E55321L0255L0150R328j0845p795j7301j3703m607r258K708K1771K4720
11219F10744R539J556j0883k3373k2904l6183l7478k7463j5448j4113n574k28
$$ y = [157188, 165284, 180505, 196620, 224001, 261038, 289112, 309616, 322155, 330102, 318356, 310241, 284673, 252098, 227911, 210864, 189917, 182299, 181611, 180143, 182891, 185830, 180034, 178516, 172954, 175114, 187440, 197912, 199560, 192532, 198792, 216989, 234322, 242931, 265963, 302483, 334240, 376512, 425025, 471589, 508867, 545155, 568587, 588650, 603622, 600934, 593838, 590559, 579613, 549883, 516192, 493325, 478016, 459772, 440154, 426666, 410519, 388224, 360099, 337559, 335486, 335422, 334265, 339385, 339893, 356119, 382865, 403809, 424303, 445472, 475640, 505403, 530780, 555321, 585576, 615726, 625054, 614209, 606414, 589113, 575410, 570803, 561545, 564253, 586024, 610744, 620283, 621839, 610956, 587583, 564679, 528496, 491018, 463555, 448107, 433994, 428420, 428192]
11207D28192J3074K2385K3112K4228K5933K3419J8775P03n664j2491j0730M573
11195E55509k79n490o273o755j5277k2146k2504k0046l2508k9276j1401n894k1298
11182C56362k2830k4247j1479n632j1192j5325p942j870J868M864n238n735K766
11169B54370N707M997l875O139p28J863R003Q673J1725J2816J5901L7251M1360
11156D05202K5082J6339N516j2053k3591k6120k6155k8127l9796k7263k3997o589
11144B38448o60n88M589K09K062M042O357J3558J7237J5125J0736J2312J8552
11131C41979K4921J6345O794R868p373k303r017j2602q235j8229j9968q886m514
11118C08780m079J2792O327Q822N435P467Q807N784j473R774j457j252p62O327
$$ y = [428192, 441266, 463651, 486763, 510991, 536924, 560343, 579118, 579821, 574157, 561666, 550936, 555509, 555230, 549740, 543467, 536712, 521435, 499289, 476785, 456739, 424231, 394955, 383554, 377660, 356362, 333532, 309285, 297806, 292174, 280982, 265657, 257715, 255845, 257713, 262577, 257339, 251604, 254370, 260077, 265074, 261199, 267338, 266610, 268473, 277476, 286149, 297874, 310690, 326591, 363842, 405202, 430284, 446623, 452139, 440086, 416495, 390375, 364220, 336093, 296297, 269034, 245037, 238448, 237788, 237200, 241789, 241998, 244060, 248102, 254459, 268017, 285254, 300379, 311115, 323427, 341979, 366900, 383245, 390039, 399907, 392534, 390231, 381214, 368612, 360377, 342148, 322180, 313294, 308780, 304701, 317493, 323820, 332642, 338077, 345544, 354351, 360135, 358662, 368436, 366979, 365727, 364965, 371292]
11104C71292J0421O749J3259K3168K2395J3079J6417J0786L226N230k993j3157
11092D79872k7290k2647j3407p621n806j0207n061L45J7888K9406J5093J9874
11080D70439K8522K2625J5929J3200O615j077P341J3588R142L312J1958L2859
11068F34453K2980J8432J8414K047m727j1325k6128k2409q970j3552p442l681
11056E98092k614N051r979n880N16j1062j6104m632k847r940j5506r666n595p529
11042E02305l957m213l064K622R288J688O346N591K375N908K184K805j576P218
11028E35520L496o874l401r975j5495m290K475K229n712M088l001r682r271p524
11014D72583r386q345q599l606M817Q72L550N305J8263L9125K5400J7241J2711
$$ y = [371292, 381713, 388462, 401721, 424889, 447284, 460363, 476780, 487566, 490792, 496022, 493029, 479872, 452582, 429935, 416528, 408907, 403101, 392894, 387833, 388178, 406066, 435472, 450565, 470439, 498961, 521586, 537515, 550715, 557330, 556253, 563594, 577182, 586324, 589636, 601594, 634453, 657433, 675865, 694279, 696326, 691599, 680274, 654146, 631737, 622767, 609215, 601773, 598092, 595478, 600529, 590550, 584670, 585186, 574124, 558020, 553388, 550541, 540601, 525095, 515429, 509834, 502305, 498348, 494135, 491071, 493693, 502981, 504669, 511015, 516606, 518981, 524889, 527073, 529878, 528302, 535520, 539016, 532142, 528741, 518766, 503271, 498981, 501456, 503685, 497973, 502061, 499060, 489378, 480107, 472583, 463197, 454852, 446253, 442647, 447464, 448336, 451886, 457191, 475454, 514579, 539979, 557220, 569931]
11001E69931R856J9481J3384Q666O806R303O609K976N397J3594J75q547j0042
10988F47589o161O850O850J1158R679Q973N994Q393K756K267m07M934L805K434
10974G15114k08L89L214J049j0552j2226j2475O180J3556J3326J3241J5391J2454
10961G58453O337Q314J8562J0349J5037K3028K0568M487J308M390M003J4804N589
10948H95229K777q994o271r971j1361j034P219J5524J4606K2292J3291Q714J1401
10935I53422M701p393q582N234J2243K1258L5075L7690K7721K2962K5245K2971
10923A152547K8306K4946K4800K5292K0696K4106M2006L9543L7156M4157M1564
10912A505119N2222N8816P1462Q1797R8549J06595J23995J46024J61053J82386
$$ y = [569931, 579787, 599268, 612652, 621318, 628124, 637427, 644036, 647012, 652409, 666003, 666178, 657631, 647589, 641428, 648278, 655128, 666286, 675965, 684938, 690932, 699325, 702081, 704348, 703941, 708875, 712680, 715114, 714906, 715295, 718509, 719558, 709006, 696780, 684305, 690485, 704041, 717367, 730608, 745999, 758453, 764790, 773104, 791666, 802015, 817052, 840080, 860648, 865135, 866443, 870833, 874836, 889640, 895229, 898006, 889012, 882741, 872770, 861409, 860375, 867594, 883118, 897724, 920016, 933307, 942021, 953422, 958123, 950730, 942148, 947382, 959625, 980883, 1015958, 1053648, 1081369, 1104331, 1129576, 1152547, 1180853, 1205799, 1230599, 1255891, 1276587, 1300693, 1342699, 1382242, 1419398, 1463555, 1505119, 1557341, 1616157, 1687619, 1769416, 1867965, 1974560, 2098555, 2244579, 2405632, 2588018]
10902B588018K22826K49027K70599K83886L02244L36550L86286M69440N79989
10893E688865P22353R12765J162674J503603K002113K708540L657400M760013
10885B3118326N712170O030934N354088L582727J066897j552664l736930n050026
10877C4525522n357802m890024m042609l087474k199680j474312q96259m57406
10869A2119956j08412J87766M50821P18684R86565J290118J631078J994620K295330
10860B1566526K442289K391838K228092K128303K179250K334895K598803L006809
10852D0876805L571134M162621M651877N035730N281316N322876N000335M274433
10844G8177127L277694K157119R37723l51648j665997k972830m145603m999139
$$ y = [2588018, 2810844, 3059871, 3330470, 3614356, 3916600, 4253150, 4639436, 5108876, 5688865, 6411218, 7323983, 8486657, 9990260, 11992373, 14700913, 18358313, 23118326, 28830496, 34861430, 40215518, 43798245, 44865142, 43312478, 39575548, 34525522, 29167720, 24277696, 20235087, 17147613, 14947933, 13473621, 12577362, 12119956, 12011544, 12199310, 12650131, 13368815, 14355380, 15645498, 17276576, 19271196, 21566526, 24008815, 26400653, 28628745, 30757048, 32936298, 35271193, 37869996, 40876805, 44447939, 48610560, 53262437, 58298167, 63579483, 68902359, 73902694, 78177127, 81454821, 83611940, 84549663, 84198015, 82532018, 79559188, 75413585, 70414446]
10836G0414446n364219n158480m529267l738155l021958k520980k241404k040161
10828D1799822j693444j080750k27063O87534J423424J837167J910139J816791
10820D6473620J893030K393539L342132M319420M713567M130788K709439J042228
10812G1017763k77253p83244n5484J858723M301738O320804P006344N769881K717280
10803I7876552j285795m890349o972084p239595o092852m295321k611300j362455
10795F3126801m62796K06906N92000P79106J000699J294414J273661P98404K24059
10786F8833254k63630p45716j163061j288381j027770n38032q481K88030O9132
10777F4155345p49734j909945l003771l729289l954836l825914l585571l407660
$$ y = [70414446, 65050227, 59891747, 55362480, 51624325, 48602367, 46081387, 43839983, 41799822, 40106378, 39025628, 38798565, 39486099, 40909523, 42746690, 44656829, 46473620, 48366650, 50760189, 54102321, 58421741, 63135308, 67266096, 69975535, 71017763, 70740510, 69957266, 69901782, 71760505, 76062243, 82383047, 89389391, 95159272, 97876552, 96590757, 91700408, 84728324, 77488729, 71395877, 67100556, 64489256, 63126801, 62664005, 62870911, 63462911, 64242017, 65242716, 66537130, 67810791, 68609195, 68833254, 68569624, 67823908, 66660847, 65372466, 64344696, 63806664, 63798183, 64086213, 64155345, 63405611, 61495666, 58491895, 54762606, 50807770, 46981856, 43396285, 39988625]
10769C9988625l330430l341199l384839l335380l118699k768682k390437j977249
10761A6341710j547081j118955p20812l49035l4215K15166L83981M55519M44763
10752A4071041L76481L26349L46906N45146R11169J489603K334206L434006M744147
10743B8579054N951869O450334N763224L827411J019351k028663m545535n944349
10735C9072696o093644n386184m321162l307017k566240k018023j548744j126341
10727A2705341p39770l65795k959L44504P00150J066932J481553J987063K593361
10718A9770380L308105M057574M606840M694818M319945L618510K723399J766416
10710D8865987R65286L80120j23211p03767j359328j954386k381965k546101k248366
$$ y = [39988625, 36658195, 33316996, 29932157, 26596777, 23478078, 20709396, 18318959, 16341710, 14794629, 13675674, 12954862, 12605827, 12571612, 12786778, 13170759, 13626278, 14071041, 14447522, 14773871, 15120777, 15665923, 16577092, 18066695, 20400901, 23834907, 28579054, 34530923, 40981257, 46744481, 50571892, 51591243, 49562580, 45017045, 39072696, 32979052, 27592868, 23271706, 19964689, 17398449, 15380426, 13831682, 12705341, 11965571, 11599776, 11596817, 11941321, 12641471, 13708403, 15189956, 17177019, 19770380, 23078485, 27136059, 31742899, 36437717, 40757662, 44376172, 47099571, 48865987, 49831273, 50211393, 50088182, 49384415, 48025087, 46070701, 43688736, 41142635, 38894269]
10701C8894269j497384n07885L50242P43571N20825k57261j297713k264545k932323
10692C1751796l219591l117773k731802k187423j598833j040481m94820M0387
10684A7401460N70730J089137J553137J793079J735609J353225P46633J02771
10676B6345781l70300n10109k83331J64382O01471Q56188Q59033O70214M19213
10667B8752542K26322J45517J33039P2721j56486o10036j223325j795555k126363
10658B3418376k146002j863531j325899o38856P4235P24212J188357J310997J012086
10649B1753975M66667r4703m68474o16447n60324l87556k79567m47608r63699
10640A8402264j583596k027282k162418k036966j773751j467866j174128r23519
$$ y = [38894269, 37396885, 36889000, 37239242, 37982813, 38503638, 38246377, 36948664, 34684119, 31751796, 28532205, 25414432, 22682630, 20495207, 18896374, 17855893, 17361073, 17401460, 17972190, 19061327, 20614464, 22407543, 24143152, 25496377, 26243010, 26345781, 25975481, 25465372, 25182041, 25346423, 25947894, 26804082, 27663115, 28333329, 28752542, 28978864, 29124381, 29257420, 29330141, 29173655, 28563619, 27340294, 25544739, 23418376, 21272374, 19408843, 18082944, 17444088, 17518323, 18242535, 19430892, 20741889, 21753975, 22220642, 22125939, 21657465, 21041018, 20480694, 20093138, 19813571, 19365963, 18402264, 16818668, 14791386, 12628968, 10592002, 8818251, 7350385, 6176257, 5252738]
10632E252738p36564n86271m59715l73529l09247k54543k06960j75657j54639
10623A995613j36898j12884r5888q8869q7260o9511n7695m0249k2853k9677k9570
10612A224259r854j3025j9077k4903k3401j0042q556J0861J9517M0024K6175L257
10600A215235M466J876l8511n1740o6419n8088n3193m7866m1845l7357k5629j7000
10588G83929j6548m802K078r23j0629j3248j0680j486p423j5229l890n252j413
10575F94484O736J7064K3566L0959N1058P5186P8084O0180L6865J5760k3824o2281
10563A003837o5321p0291o3414m3320l3914k2533j4453j7299j2563q141M937r25
10551F56600q463n546j9678j3039O087J3016J8001K1220J7883K2083J6847J2476
$$ y = [5252738, 4516174, 3929903, 3470188, 3096659, 2787412, 2532869, 2325909, 2150252, 1995613, 1858715, 1745831, 1649943, 1561074, 1473814, 1404303, 1346608, 1306359, 1283506, 1253829, 1224259, 1214405, 1201380, 1182303, 1157400, 1133999, 1123957, 1115401, 1126262, 1145779, 1185803, 1211978, 1215235, 1219701, 1221577, 1183066, 1131326, 1064907, 1006819, 953626, 905760, 863915, 826558, 800929, 783929, 767381, 762579, 764657, 763734, 753105, 739857, 729177, 727691, 720268, 705039, 701149, 695897, 694484, 701220, 718284, 741850, 772809, 823867, 899053, 977137, 1037317, 1074182, 1089942, 1066118, 1003837, 938516, 868225, 804811, 761491, 727577, 705044, 690591, 673292, 660729, 652588, 657525, 656600, 648137, 642591, 622913, 609874, 615961, 628977, 646978, 668198, 686081, 708164, 725011, 737487]
10539G37487L818Q660J2833O219q849n839l449j547N362K1517K8741J6376J7136
10526H38465K6655K9300L8363L3958J6409J9829K0422K1714K3705K5204M2979
10515A137003N2264M5032M5481L8150L4321L0478K1748J9224L2485M3810M3392
10504A543388K6178K6995K7692J7732J5234J6737J4930Q559J7089J9224J9060
10493A752818J3330J0520q846r986j6945j9527k2117l2803k4123k8588k5918k5126
10481A562689k1177l4804l1928k2473l6413l5935l5056m0518m4824l4016k9826
10470A195719j8717q241k397m285R078Q755l590n654M96m230p754k1795l8829
10457A098556m6316n2427m7310l0112k1528k5935k7184k1800k4816l1115m7687
$$ y = [737487, 741305, 749965, 762798, 769017, 760168, 754329, 750880, 749333, 754695, 776212, 804953, 821329, 838465, 865120, 894420, 932783, 966741, 983150, 1002979, 1023401, 1045115, 1068820, 1094024, 1137003, 1189267, 1234299, 1279780, 1317930, 1352251, 1382729, 1404477, 1423701, 1456186, 1499996, 1543388, 1569566, 1596561, 1624253, 1641985, 1657219, 1673956, 1688886, 1697445, 1714534, 1733758, 1752818, 1766148, 1776668, 1767822, 1757836, 1740891, 1721364, 1699247, 1666444, 1642321, 1613733, 1587815, 1562689, 1541512, 1506708, 1474780, 1452307, 1415894, 1379959, 1344903, 1304385, 1259561, 1225545, 1195719, 1177002, 1168761, 1166364, 1162079, 1171157, 1179912, 1176322, 1170668, 1171164, 1166934, 1159180, 1137385, 1098556, 1052240, 999813, 952503, 922391, 900863, 874928, 847744, 825944, 801128, 770013, 722326]
10446G22326n8924p3459q7112j08001q7345N499J51288J82265R7202N3721N1108
10435H48568L9608K7147J9351J9917M4112M3150L5839L5758L8278K6842J1661
10424A190231J3212J1382l44m537p287j7166q901q395k5366l8974l6737k6355
10412A040763k5447k3901j3122j3590k0426j1768m279L335P128J7597J3619J9415
10400I89324J6866P411J6833K9439L5418L6101L3344J6923K454K103P47q691J1769
10387A190041K1277M5020N6274N3669L8586L0828J7957r802j7674l2274k9316
10376A364586j0744p147K929K8278K5538K3401K8309K3250K1429K5406K8534L9226
10364A592995M7147O3648Q3367Q0821Q7068Q8877R5221R5896R7388Q8972Q3164
$$ y = [722326, 663402, 589943, 502831, 394830, 307485, 312984, 464272, 646537, 743739, 797460, 848568, 888176, 915323, 934674, 954591, 998703, 1041853, 1077692, 1113450, 1151728, 1178570, 1190231, 1203443, 1214825, 1214481, 1209944, 1202657, 1185491, 1176590, 1168195, 1142829, 1103855, 1067118, 1040763, 1015316, 991415, 978293, 964703, 944277, 932509, 928230, 931565, 938693, 956290, 969909, 989324, 1006190, 1013601, 1030434, 1059873, 1095291, 1131392, 1164736, 1181659, 1184113, 1186216, 1186963, 1178272, 1190041, 1211318, 1256338, 1312612, 1366281, 1404867, 1435695, 1453652, 1443850, 1426176, 1393902, 1364586, 1353842, 1346695, 1349624, 1377902, 1403440, 1426841, 1455150, 1478400, 1499829, 1525235, 1553769, 1592995, 1640142, 1703790, 1787157, 1867978, 1955046, 2043923, 2139144, 2235040, 2332428, 2421400, 2504564]
10353B504564Q1987R8025R9166R4044R3719R9485J12571J43642J69617K06530
10343C703350K64429L23584M00743M80153N50490O60304Q02255J012406J301912
10334I499626J598965J726295J707655J642621J423802J258094J415912J898044
10326B2171014K635674L580276M777358O329739Q543817J1850148J6798941K3909258
10318A00596225L3847849M7942554O4529406O6968310L2500760j8741753m7465706
10311B80177645n4167284n0998281m3074648l2982019k3707023j6650280j1724119
10304D6873991q461702o199261m460835l259230k605135k101835j662163j556614
10296A6567216j730449j798186j671331j451541j221403r97515q18622o63531
$$ y = [2504564, 2586551, 2684576, 2783742, 2877786, 2971505, 3070990, 3183561, 3327203, 3496820, 3703350, 3967779, 4291363, 4692106, 5172259, 5722749, 6383053, 7185308, 8197714, 9499626, 11098591, 12824886, 14532541, 16175162, 17598964, 18857058, 20272970, 22171014, 24806688, 28386964, 33164322, 39494061, 48037878, 59888026, 76686967, 100596225, 134444074, 182386628, 246916034, 313884344, 346385104, 327643351, 280177645, 226010361, 175012080, 131937432, 98955413, 75248390, 58598110, 46873991, 38412289, 32213028, 27752193, 24492963, 21887828, 19785993, 18123830, 16567216, 14836767, 13038581, 11367250, 9915709, 8694306, 7696791, 6878169, 6214638]
10288F214638n32826m50002l66307l21334k90865k74888k68084k71779k56178
10279C182375k38978k22847j93881j52356j31065j24694j21893j09490r5222p7474
10269A714475n4838m6717l6018k2182k5750k6082k6984l7131n3697o1388o9279
10258A254409o9623o6373n5337m0890l2701k8482l8253l7699l0105k2192k3636
10247H09118j6238l118J578P059j11o057j6435k5861k4382j4647j4910j9584n087
10234F71325j0744l738n560l146r534r540k3106l6938l0696l0194m4164m6807
10222D17158l2744j6956j6263k0707r902j0762n330n866p726j3537j7635j7678
10210B42052j7495p503j2724o862l715q92N64K645O151O084M835J0534P222J972
$$ y = [6214638, 5681812, 5231810, 4865503, 4544169, 4253304, 3978416, 3710332, 3438553, 3182375, 2943397, 2720550, 2526669, 2374313, 2243248, 2118554, 1996661, 1887171, 1791949, 1714475, 1659637, 1612920, 1576902, 1554720, 1528970, 1502888, 1475904, 1438773, 1385076, 1323688, 1254409, 1184786, 1118413, 1063076, 1022186, 989485, 961003, 922750, 885051, 854946, 832754, 809118, 792880, 789762, 791340, 798399, 798288, 792231, 775796, 749935, 725553, 710906, 695996, 676412, 671325, 660581, 656843, 651283, 648137, 638603, 629063, 605957, 569019, 538323, 508129, 463965, 417158, 384414, 367458, 351195, 330488, 320586, 309824, 304494, 298628, 290902, 277365, 259730, 242052, 224557, 217054, 204330, 197468, 193753, 192861, 193425, 196070, 202221, 208305, 213140, 223674, 230896, 232868]
10196B32868R813J0607P155K1759L7465P0549J28244J88854K06368P9390r9121
10185H93951j41365q6125p0678p0485n2439l8903l5818k5534k1482j1904j4977
10174C24241q519r458p696k169M404N758K0549J9915K0664K8044L9399O4510R5237
10161E94879R6908R2300P8912O1294P5271J32984K11056L22971M80910O21081
10151B768566N20917O3331l47479n02033m94687m30485l29839k44047j91544j46680
10141F66020j12189r8171p5855o0371l9283k0916j6178p014n140m020k01j3124
10129B13558j8774j5269j3703j5643j2830k0471j3486j956m467j3890m259r653
10117F9157j2960j960R111J9810K5307K1657J5400J0664r035j2368j2036j6796
$$ y = [232868, 242681, 253288, 260443, 282202, 319667, 390216, 518460, 707314, 913682, 993072, 893951, 752586, 666461, 595783, 525298, 472859, 433956, 398138, 372604, 351122, 339218, 324241, 315722, 306264, 298568, 296399, 300803, 306561, 327110, 347025, 367689, 395733, 435132, 499642, 594879, 691787, 784087, 862999, 924293, 999564, 1132548, 1343604, 1666575, 2147485, 2768566, 3289483, 3352814, 3005335, 2503302, 2008615, 1578130, 1248291, 1004244, 812700, 666020, 553831, 455660, 379805, 319434, 280151, 259235, 243057, 236043, 230903, 226883, 226682, 213558, 194784, 179515, 165812, 150169, 137339, 116868, 103382, 101426, 96959, 83069, 78810, 69157, 56197, 54237, 63348, 83158, 108465, 130122, 145522, 156186, 147151, 134783, 122747, 105951]
10105A05951j5027q004j2183O409J5887J1539J0719P676K670R352R099m112p620
10092A32356l240r438r699k561q999O929P199J1146J2197J3020J1929J2868N694
10079A79401J032k739m961j2829j5967j1416n11q013r6O472l767q170J884l676
10065A16644J105L066M899l02J6222J3970j814r542m819n058j0744j997j424j0881
10051A09325k987r447K292J5828J9762K7576L3551L8156M1310J5584j2677l4654
10039B43619k8529j3780j8031j4948q950j1352p753l588j08k756J2214J9498K4854
10026A90390L1701L8942L7139L6256K6596J1385n12j8365k6758k6300k9724j7305
10014B53445j7184j1450n289k713j1783j2933q08j832J2531L6460J7294m3076
$$ y = [105951, 90924, 82920, 70737, 77146, 93033, 104572, 115291, 122967, 125637, 134989, 144088, 139976, 132356, 129116, 119678, 109979, 107418, 98419, 105348, 112547, 123693, 135890, 148910, 160839, 173707, 179401, 180433, 177694, 172733, 159904, 143937, 132521, 132010, 123997, 123901, 130373, 126606, 118436, 120320, 116644, 117749, 120815, 125714, 125412, 141634, 155604, 153790, 144248, 139429, 134371, 123627, 121630, 120206, 109325, 106338, 96891, 99183, 115011, 134773, 162349, 195900, 234056, 275366, 290950, 278273, 243619, 215090, 201310, 183279, 168331, 159381, 148029, 140276, 136688, 136580, 133824, 146038, 165536, 190390, 222091, 261033, 298172, 334428, 361024, 372409, 371897, 353532, 326774, 300474, 270750, 253445, 236261, 224811, 219522, 216809, 205026, 192093, 191285, 189453, 201984, 238444, 255738, 212662]
10002B12662m4456l3187k4428k5732r587O720l509M626j338Q269J7646R580J3758
9989A31024J4975K2637L1106M1036M6868O7869J07809J15913P2895k1476q0593
9978E50063q6451r8498q2236o3570m9757l3317j9877j1998r139o015J305J0993
9966A01503L691m879j6735j4694j5094P24O104N710K288q842K209M201P32P500
9952G4418L905M423J595n861P272n223p355m854j1935j0635p004m706Q627J1929
9938E4596Q911j292L421r554m983N902R575L16m262N927L959j610Q61K196j746
9923G2217J213L916J170L211J4989Q690J305N569J1847J1104J1999K1103K1421
9910A89754K9925M3662N3256N8204O5144Q5418J05743J60710K40210L01309L13720
$$ y = [212662, 168206, 135019, 110591, 84859, 75272, 81992, 78483, 83109, 81771, 90040, 107686, 117266, 131024, 145999, 168636, 199742, 240778, 287646, 355515, 463324, 579237, 652132, 630656, 550063, 463612, 365114, 282878, 219308, 169551, 136234, 116357, 104359, 95220, 89205, 90510, 101503, 105194, 100315, 83580, 68886, 53792, 54516, 60620, 66330, 68618, 59776, 61985, 66186, 66918, 74418, 78323, 82746, 84341, 78480, 85752, 80529, 73174, 68320, 56385, 45750, 38746, 34040, 42667, 54596, 63507, 62215, 65636, 56082, 51099, 57001, 66576, 66892, 62630, 68557, 72516, 70906, 71767, 73963, 72217, 73430, 77346, 78516, 81727, 96716, 105406, 106711, 112280, 124127, 135231, 147230, 168333, 189754, 219679, 263341, 316597, 374801, 439945, 525363, 631106, 791816, 1032026, 1333335, 1647055]
9899A647055L09676J96181K3750l2468m2106L7824K07610M18656N60567M75101
9889C801846J63231k41307n06562o24354o01382m99254l78975k57234j73445j20046
9879E62518p5721n0883l3498k7269k5626j1519r798l893l442n228j917l379j2645
9866B97700j0449p990j7039k0340k7482k1117j1914j0875p082K799k93P396J3357
9853A86671M507r225r887j0891j3993j0118n052j45j112k03J2594P949o563q597
9839A35935J211J1387J2447J2171K5760L4027K1072J2191n796j2192p661l936
9827B36616n274o244p019j0458j7143j9531j3758j2829m835q261o716n047k719
9814A16782o057j0020o5n407k606M942J5055O412L370N826j0336L418J0328J6660
$$ y = [1647055, 1956731, 2152912, 2176662, 2144194, 2102088, 2139912, 2347522, 2766178, 3326745, 3801846, 3965077, 3723770, 3217208, 2592854, 1991472, 1492218, 1113243, 856009, 682564, 562518, 486797, 435914, 402416, 375147, 349521, 338002, 328204, 324311, 320869, 315641, 313724, 310345, 297700, 287251, 279261, 262222, 241882, 214400, 193283, 181369, 170494, 163412, 166211, 165918, 173314, 186671, 191178, 181953, 172066, 161175, 147182, 137064, 132012, 131867, 130755, 130552, 143146, 151095, 144532, 135935, 137146, 148533, 160980, 173151, 198911, 232938, 254010, 266201, 260405, 248213, 240552, 236616, 231342, 225098, 218079, 207621, 190478, 170947, 157189, 144360, 139525, 131264, 124548, 119501, 116782, 110725, 100705, 100640, 95233, 92627, 97569, 112624, 119036, 122406, 128232, 117896, 121314, 131642, 148302]
9800A48302L81K288J1194L799O371J4209N262J0447R567L605K114Q05k945L67
9786B15766L229N402L746j188o851j0955j5781j7225m430p234j0928J259J0621
9773A65431p0O735R924J1667N332O542N964j933J094p570j201k586j5948j3703
9759A69678J112M108l105K031n895j9305j5080j6526j2891O384k944l539p977
9746I6051p184q135j1962r818K73j411J611P247J3506P579M504N614P571J4207
9732A19653K2548J3345Q336K377p165q791o226N049O734Q59m91K882J1532K0832
9718A91474R282O467K7131J7639K3957K1951J8535J1818R275J5955J6544K321
9706C72349M333P715J1442j046m577p18J83m735l204Q713J0165J6063O469n399
$$ y = [148302, 148683, 150971, 162165, 165964, 172335, 186544, 191806, 202253, 211820, 215425, 217539, 218344, 215399, 215766, 218995, 224397, 228143, 226955, 220104, 209149, 193368, 176143, 171713, 164479, 153551, 154810, 165431, 165361, 172096, 182020, 193687, 199019, 205561, 211525, 209592, 210686, 203116, 201915, 199329, 183381, 169678, 170790, 174898, 171793, 173824, 167929, 148624, 133544, 117018, 104127, 110511, 107567, 104028, 96051, 88867, 80732, 68770, 58952, 59225, 57814, 59425, 66672, 80178, 87757, 92261, 97875, 105446, 119653, 142201, 155546, 163882, 166259, 159094, 150303, 144077, 149126, 155860, 156719, 156228, 159110, 170642, 191474, 200756, 207223, 234354, 251993, 275950, 297901, 316436, 328254, 337529, 353484, 370028, 372349, 376682, 384397, 395839, 394793, 390216, 389498, 389681, 384946, 381742, 390455, 400620, 416683, 423152, 417753]
9692D17753j1320j3693j5055j6180k0024k3688k2798j3104j4108j7098j5528j1433
9680B23724j7738m37P732P80o345j7630J529M321M898O5M478J5273J8034J4383
9666B53067K1821R430O737N171O054r213p480o322l362p776n369m283o652Q601
9652B60424J1189J1358J7954J2220K332M518K661L142J1588R434L224M437J0048
9639C64529J4988J9410L0037L6863M0488L9614K7876K3908K3317K8598J5556J4805
9627F79989J8426J0712J4234J2672K642m205j2607k6331j3925j5365k8679k1777
9615F15786j6525k3196k0258j1301j9248j9247k6593k5504k1708j9251j3132j2259
9603C87564p921K403J5080J1702M817N263J6036J8057J3249R479N359Q012J3817
$$ y = [417753, 406433, 392740, 377685, 361505, 341481, 317793, 294995, 281891, 267783, 250685, 235157, 223724, 205986, 205549, 213281, 214061, 207716, 190086, 191615, 195936, 200834, 200899, 205377, 220650, 238684, 253067, 274888, 284318, 291055, 296226, 302280, 293067, 285587, 279265, 275903, 268127, 262758, 258475, 251823, 260424, 271613, 282971, 300925, 313145, 315477, 319995, 322656, 325798, 337386, 346820, 350044, 354481, 364529, 379517, 398927, 428964, 465827, 506315, 545929, 573805, 597713, 621030, 649628, 665184, 679989, 698415, 709127, 723361, 736033, 738675, 734470, 721863, 695532, 681607, 666242, 637563, 615786, 599261, 576065, 555807, 544506, 525258, 506011, 479418, 453914, 432206, 412955, 399823, 387564, 379643, 382046, 397126, 408828, 413645, 418908, 434944, 453001, 466250, 475729, 481088, 489100, 502917]
9590E02917R37j3878j2703o090L519J0607Q378m778o702J300J913P939K221m290
9576D91290N40K583K257j203k297j4005k2316j3535j4238j5797j2856K9O706J6528
9562D23686K1418K1471J2542J4811J9785K5950K0056J8760J3888Q408J4955J2967
9550F28697K1871K0899K4029K3019J6691J2124R101J6870L2920L3444L3610K8888
9538I02163K6452J3630O239K4931M0375N2276O4172Q3205R3970J08949J33149
9527A549511J57558J77305K16518K64219L15150M00155N19437O98265R35402J213697
9517F447217J523553J749396J725643J324677N51374l79504j112813j448691j459622
9508H921230j291207j050335p84396n23225k88043r8502N3065J54127J82775J44284
$$ y = [502917, 503854, 489976, 477273, 471183, 474702, 485309, 493687, 488909, 482207, 483507, 485420, 493359, 495580, 491290, 491830, 494413, 496670, 495467, 493170, 479165, 456849, 443314, 429076, 413279, 400423, 400452, 407158, 423686, 445104, 466575, 479117, 493928, 513713, 539663, 559719, 578479, 592367, 600775, 615730, 628697, 650568, 671467, 695496, 718515, 735206, 747330, 756431, 773301, 806221, 839665, 873275, 902163, 928615, 942245, 948484, 973415, 1013790, 1066066, 1130238, 1213443, 1307413, 1416362, 1549511, 1707069, 1884374, 2100892, 2365111, 2680261, 3080416, 3599853, 4298118, 5233520, 6447217, 7970770, 9720166, 11445809, 12770486, 13321860, 12942356, 11829543, 10380852, 8921230, 7630023, 6579688, 5795292, 5272067, 4984024, 4885522, 4938587, 5092714, 5275489, 5419773]
9498E419773Q3480M1797O621m7623n5207q078R2484K21503M01303O15519Q76895
9487G648467J167973J452320J670700J717307J702812J810775K010192K134773
9479B1315319K173072K286761K344554K021337J215471J96948o73628j269856
9471B9609978j784752k269035k525373k484651k277794k026595j713987j370088
9463A3157703j074964q51866o68525m77085k64719M689K66682M92416O28069P09992
9453A1922392Q46131J102976J409731J583927J349239P46397K77912K61321O40766
9444B0140792J356537K336549L474473M557460N080819M561523K965084O94999
9436D5168236j676371l521822m411298m347178l671903k733620j889801j451545
$$ y = [5419773, 5503253, 5545050, 5551671, 5504048, 5448841, 5440763, 5533247, 5754750, 6156053, 6771572, 7648467, 8816440, 10268760, 11939460, 13656767, 15359579, 17170354, 19180546, 21315319, 23488391, 25775152, 28119706, 30141043, 31356514, 31553462, 30879834, 29609978, 27825226, 25556191, 23030818, 20546167, 18268373, 16241778, 14527791, 13157703, 12082739, 11230873, 10562348, 10085263, 9820544, 9825233, 10091915, 10584331, 11212400, 11922392, 12768523, 13871499, 15281230, 16865157, 18214396, 18960793, 19238705, 19500026, 20140792, 21497329, 23833878, 27308351, 31865811, 36946630, 41508153, 44473237, 45168236, 43491865, 39970043, 35558745, 31211567, 27539664, 24806044, 22916243, 21464698]
9428B1464698j367588j383821j428204j423997j322444j224704j153857j066170
9420A1093913q96538o69513m15784j66538J05665L80101O14336P90020R30829
9411A1766491J050080J185584J426745J657532J602755J231834Q21853P58268
9403B1501142J008538J266370J253034R21019M07706j84592q81108j597052k081864
9394B1613193k149841k058806k058888k078472j964343j720095j429603j125859
9386G027286q60393o31975m29410k75532j46755o8805n0222o5352o6401p4183
9376D358258j04338j56243j69455j35554o2273K0809J35291K85805M76861P06901
9366E356062R81158J245136J366032J160470N66074k43070r72920j361556j433397
$$ y = [21464698, 20097110, 18713289, 17285085, 15861088, 14538644, 13313940, 12160083, 11093913, 10197375, 9527862, 9112078, 8945540, 9051205, 9431306, 10045642, 10835662, 11766491, 12816571, 14002155, 15428900, 17086432, 18689187, 19921021, 20742874, 21501142, 22509680, 23776050, 25029084, 25950103, 26357809, 26173217, 25292109, 23695057, 21613193, 19463352, 17404546, 15345658, 13267186, 11302843, 9582748, 8153145, 7027286, 6166893, 5534918, 5105508, 4829976, 4683221, 4614416, 4564194, 4498842, 4432441, 4358258, 4253920, 4097677, 3928222, 3792668, 3730395, 3751204, 3886495, 4172300, 4649161, 5356062, 6337220, 7582356, 8948388, 10108858, 10674932, 10431862, 9458942, 8097386, 6663989]
9357F663989j297532j075559q37855o36906m74228l43875k47822j95514j66395
9348A388303j54075j47420j32292j06860r1341p2258o3649o2874m6492l1080l8532
9337D41430l6583k3004j9922k6932k3026j6410j4549j1633j2558r080q141j1546
9325B28046j3631j220p781n973m45K074k443o149K593J0818R411L181J887n69
9311B19799N713p105o512r358o783q796M191K250k93j0555j8927r098n040J07
9297A49593o661j3335r694L612L602p252l596k752n846P17j902j2268o353L645
9283I1510L191q72P228L744M680M72J264N078K036M848K580j220j747l037O91
9268A20446J252K092j055m591K270n044q200q219q576m417o062p737l233j0384
$$ y = [6663989, 5366457, 4290898, 3453043, 2816137, 2341909, 1998034, 1750212, 1554698, 1388303, 1234228, 1086808, 954516, 847656, 756315, 684057, 620408, 557534, 511042, 479962, 441430, 404847, 381843, 361921, 334989, 311963, 295553, 281004, 269371, 256813, 247733, 239592, 228046, 214415, 213195, 205414, 199441, 198996, 201070, 198627, 192478, 195071, 205889, 215300, 218481, 220368, 219799, 225512, 218407, 211895, 202537, 195754, 186958, 191149, 193399, 193106, 182551, 163624, 154526, 149486, 149593, 142932, 129597, 119903, 123515, 127117, 119865, 116269, 113517, 107671, 108388, 106486, 94218, 87865, 91510, 94701, 93829, 101057, 104801, 109481, 109953, 111217, 116295, 118331, 123179, 125759, 124539, 122792, 119755, 120446, 121698, 123790, 122735, 118144, 120414, 115370, 107170, 98951, 90375, 85958, 79896, 72159, 68926, 58542]
9254E8542L200O282L183m13q144n867R45j18O312O310k288r681K354M251r727
9239E5141j1249K951R767Q44K134O437K153J14j375K346K795J642J628M545O296
9224H6169K957j3107j1927m570j2862M154J3406L057j2930k366L326j007Q049
9211F2349k979j0022m225l540o793J903M613m772j966o848p901P629R64m402K931
9196B6941K883k726l460K85L650l636M747J252k727r032j130K774L816l655o931
9181A3051j192P446R863M768J105l952L480R762r71m351j562l090n666p480k990
9166A8221L672Q115P491j0532r897K433p35k766l86O767n379o479j501N126P337
9151B1487j332n831K354j143K229k463R397L448L154L846m002l728L042P220j503
$$ y = [58542, 61742, 68024, 71207, 70794, 62650, 56783, 57728, 57610, 63922, 70232, 67944, 58263, 60617, 64868, 55141, 43892, 46843, 56610, 57454, 59588, 66025, 68178, 68292, 66917, 69263, 72058, 73700, 75328, 79873, 86169, 89126, 76019, 64092, 59522, 46660, 50814, 64220, 67277, 54347, 51981, 55307, 54300, 62349, 59370, 49348, 45123, 41583, 34790, 36693, 41306, 36534, 34568, 27720, 19819, 27448, 28412, 24010, 26941, 29824, 27098, 23638, 23923, 27573, 23937, 28684, 29936, 27209, 18177, 17047, 19821, 23637, 19982, 13051, 11859, 19305, 29168, 33936, 35041, 31089, 34569, 44331, 43360, 39009, 37447, 34357, 28691, 21211, 18221, 21893, 30008, 37499, 26967, 17070, 19503, 18768, 16002, 15616, 22383, 17004, 10525, 9024, 14150, 21487, 20155, 14324, 16678, 15535, 17764, 15301, 24698, 28146, 31300, 35146, 31144, 27416, 30458, 37678, 36175]
9136C6175J478M735q609m159j22l850j0013n330K862P148N232K695o878m466Q660
9121B5558L177J1770O240l57j142R019O093M69m094l162j981j1076q477m302K793
9106C0528K212l001k669n335K197Q206J0387K763m331k892p248q203k355O477
9092B6736j324Q356k503K35Q637N498J1129J1788K916J719J1028J6737J8118J3691
9078A32761K983O762Q541P97l095j2459r578q346r094j4672r582j630j1766j0312
9064F1310j858k633M911J047k901K736O248j087j0071O874N733M504n589P881
9050G7105J2026J745P237R64j083J0194J5724J1148J5958K2405K7260J7903O902
9037B25488o254j2576k1130k5156k2854k5915j5404n277K397Q671j498k5558q954
$$ y = [36175, 37653, 42388, 33779, 29620, 29498, 25648, 15635, 10305, 13167, 20315, 25547, 28242, 21364, 16898, 25558, 28735, 40505, 46745, 46388, 45246, 54265, 60358, 60827, 56733, 53571, 51590, 40514, 32037, 27735, 30528, 32740, 29739, 27070, 21735, 23932, 32138, 42525, 45288, 40957, 38065, 30817, 22614, 20259, 26736, 25412, 33768, 31265, 31500, 40137, 45635, 56764, 68552, 71468, 73187, 84215, 100952, 119070, 132761, 135744, 142506, 151047, 151844, 148749, 136290, 126712, 118366, 109272, 94600, 85018, 83388, 71622, 61310, 59452, 56819, 61730, 62777, 59876, 62612, 68860, 67773, 57702, 64576, 70309, 74813, 69224, 77105, 89131, 90876, 98113, 99077, 97994, 108188, 123912, 135060, 151018, 173423, 200683, 218586, 225488, 219234, 206658, 185528, 160372, 137518, 111603, 96199, 90922, 93319, 101990, 100492, 74934, 65980]
9024F5980l819l518j280k138n300q417L676M694p964n819M135J6820J1956K774
9010G1780O738J0119P266R961J2591J2043r03l918L586P894P342j0212p798r616
8996A16873j0063p261n987p774q159j4761j3048l294l9j871l691P465N213j0351
8982D3252K604P726L265n800m487J341K966o91J526l830O940R337P592K436J0789
8967H4966N747O718N281Q996Q505k002j1425j2464m658L789p848j4156n581M023
8953F9891m719k177m003p212n699N254J0014M347n250l053K383R775R972J1969
8939I1492Q082j546O353q027p664k356k030k061j3723j0748j6735k535O17J0453
8925D9572p882kl000L477k80j702p820n589K056R173l911j114n163n358L722Q518
$$ y = [65980, 62161, 58643, 57363, 55225, 49925, 41508, 45184, 49878, 41914, 36095, 40230, 57050, 69006, 71780, 78518, 88637, 95903, 105864, 118455, 130498, 129595, 125677, 129263, 137157, 144499, 134287, 126489, 116873, 106810, 99549, 93562, 85788, 77629, 62868, 49820, 46526, 46487, 44616, 40925, 48390, 53603, 43252, 45856, 53582, 56847, 51047, 46560, 47901, 50867, 50176, 51702, 47872, 54812, 64149, 71741, 74177, 84966, 90713, 97431, 102712, 111708, 120213, 118211, 106786, 94322, 89664, 93453, 85605, 71449, 65868, 69891, 65172, 62995, 58992, 51780, 46081, 51335, 61349, 65696, 60446, 57393, 59776, 69551, 79523, 91492, 99574, 98028, 104381, 96354, 88690, 86334, 84304, 82243, 68520, 57772, 41037, 38502, 39119, 49572, 41690, 41688, 38688, 42165, 41885, 40183, 32363, 26774, 28830, 38003, 34092, 32978, 27815, 22457, 26179, 34697]
8909C4697R738o871j152J703j591O772J0976J2644L550R940J7175J0214J1404
8896A19199O685N222p0Q566Q141J645N787N631O773m936M155r22k457j345R439
8881A71513M540m132p18J833J923o66R42L802K877m245M043p731j7801k794J854
8866A55240O711J470p827r332m54j664r071r861o250M029J047m613j2149j0781
8852I6495j435p644j3520n536r336j8252N29J484r589m775k599K315K254P587
8838C7978k898Q841Q409k177n299K099K479l546P788J7986J3316R086Q670Q406
8824A11138J3299O150P85J0524J2546l768O386Q211J682q13J000M184m375M442
8810A71391m907j6711p769l380N289N952M041J6310L362L982m668l497n950k735
$$ y = [34697, 44435, 37564, 36412, 38115, 36524, 43296, 54272, 66916, 70466, 80406, 97581, 107795, 119199, 125884, 131106, 131036, 139602, 147743, 149388, 155175, 160806, 167579, 162643, 166798, 165876, 163419, 162074, 171513, 176053, 171921, 171203, 173036, 174959, 174293, 175235, 179037, 181914, 177669, 181712, 173981, 156180, 153386, 155240, 161951, 163421, 155594, 146262, 145808, 144144, 135073, 125212, 118962, 122991, 124038, 119425, 107276, 96495, 95060, 87416, 73896, 68360, 59024, 40772, 41301, 42785, 33196, 28421, 25822, 28137, 30391, 37978, 35080, 43921, 52330, 50153, 44854, 46953, 49432, 45886, 53674, 71660, 84976, 94062, 102732, 111138, 124437, 130587, 131372, 141896, 154442, 150674, 157060, 165271, 166953, 166140, 167140, 171324, 166949, 171391, 166484, 149773, 142004, 138624, 143913, 149865, 153906, 170216, 173578, 177560, 172892, 169395, 163445, 160710]
8796A60710m954j6487o877K002N340O047k502J536J845O263o397j2155L561j463
8782A36469j2626j5682o299o072r499m240k329k39l729j2776q636K162J732k161
8768E6075N581M221j753l215k088o065o365j321j058P11o53r24J607M9J140p311
8752C8631L90l586j955O028Q156R146P794N664l235J1864L056n897m151l043p654
8737F1208n911p27n428n565l312L199K637K671K284O600P34q25J0664M213K281
8722G4723J2730J0498l33q780o917N7m829N979j883n809j4614j2601r800r983
8708B8438j1120j413n638n987l401j545l42K663R774K599j340J856m781l319J2383
8693A8827J733j513o941L34j958l905L610j091k724l207n826o533J875O926p2
$$ y = [160710, 155756, 139269, 132392, 134394, 139734, 145781, 143279, 144815, 146660, 152923, 146526, 134371, 137932, 136469, 123843, 108161, 101862, 95790, 86291, 82051, 79722, 79483, 75754, 62978, 54342, 56504, 58236, 56075, 61656, 65877, 64124, 60909, 58821, 52756, 46391, 45070, 44012, 44723, 44070, 43146, 44753, 44802, 45942, 38631, 39021, 35435, 33480, 39508, 47664, 56810, 64604, 70268, 67033, 78897, 81953, 76056, 71905, 68862, 61208, 55297, 54570, 49142, 43577, 40265, 43464, 46101, 48772, 51056, 57656, 58390, 57565, 68229, 72442, 74723, 87453, 97951, 97618, 88838, 81921, 81978, 77149, 83128, 81245, 75436, 60822, 48221, 38421, 28438, 17318, 15905, 10267, 4280, 879, -666, -1008, 1655, 11429, 14028, 12688, 14544, 9763, 6444, 18827, 20560, 19047, 12106, 12440, 10482, 6577, 10187, 9096, 6372, 3165, -2661, -9194, -7319, -393, -465]
8678d65R13J2311L629L542R219l36l913j919J538L636l819k676p082r229l194
8663B155P316Q301l436o775j389L844K287r340j1276n720K936O278J389k575L669
8648b336l999j233J3217O979j1529r734k551J0245J073p798Q819M391j709P16
8634D551J862M157Q4o977j148K603P869K789k422j768j072l348J114k861L517
8619H950K677n859r40L091n842K001o407o954l453M747j080n476j784R484R142
8604B297M826l609Q387J1283p133l881l718L770O117l685p96k074m073n959n607
8589c855r59j85J639l283L07O888l543j7234M146R789L009L383J856k29P803q46
8573H686j035o036L711n42m133Q374J260L363J2577k894n545L13O436L921M814
$$ y = [-465, 448, 12759, 16388, 19930, 29149, 28813, 24900, 22981, 24519, 28155, 24336, 21660, 14578, 5349, 2155, 9471, 17772, 14336, 7561, 6172, 10016, 12303, 2963, -8313, -14033, -11097, -4819, -3430, -6005, -2336, -6335, -7568, 5649, 12628, 1099, -8635, -11186, -941, 132, -7666, 1153, 5544, 3835, 4551, 6413, 10570, 10654, 3677, 2529, 5132, 13001, 15790, 13368, 11600, 10528, 7180, 8294, 5433, 8950, 11627, 5768, 4828, 7919, 2077, 4078, -2329, -9283, -12736, -7989, -9069, -14545, -16329, -6845, 2297, 7123, 3514, 11901, 23184, 16051, 12170, 8452, 12222, 18339, 14654, 13858, 11784, 7711, 1752, -3855, -4814, -4999, -3360, -6643, -6336, 552, -2991, -20225, -16079, -6290, -3281, 102, 1958, 1729, 9532, 8686, 7651, 1615, 5326, 4784, 651, 9025, 10285, 13648, 26225, 23331, 17786, 18099, 24535, 28456, 33270]
8558C3270q127M814P488Q860k633q043J635P928O489O325l883j1827R65j0o251
8543C7000j3717p021K087L181n477K130N238p145J319K293k707n140o432l467
8529B142j195M514j680m440j0119K79O083J0577K528J0221Q530n469o476n129
8515A0366p34Q228q294n886N678Q52P96r382J409m584p9K497M69k097J033j571
8499a299J0986R601n155M640m855j126j1513j1281O289P051M502O213O547l62
8485B0238N16K553r106K240O165m439j500p111j874J90J639k980o706j742O884
8470D967O156n173l457l129J0064J396l29J0149K498L350n916r585k992o248K874
8455D625k296P179N707n76R03n023j627J1664k812q024L136q953K622R03n888
$$ y = [33270, 25143, 29957, 37445, 46305, 43672, 35629, 37264, 45192, 51681, 58006, 54123, 42296, 43261, 43251, 37000, 23283, 16262, 18349, 21530, 16053, 18183, 23421, 16276, 17595, 19888, 17181, 12041, 5609, 2142, 947, 5461, 3781, -659, -10778, -10499, -4416, 6161, 8689, 18910, 27440, 21971, 15495, 10366, 9632, 17860, 9566, 3680, 9358, 10210, 11006, 1624, 3033, -1551, -1630, 867, 1336, -761, 272, -1299, 9687, 19288, 14133, 18773, 13918, 12792, 1279, -10002, -3713, 3338, 7840, 14053, 20600, 20238, 20754, 23307, 14201, 16441, 22606, 18167, 16667, 9556, 7682, 7872, 9511, 6531, -175, -1917, 4967, 11123, 5950, 2493, -636, 9428, 10824, 10495, 20644, 23142, 26492, 20576, 10991, 7999, 1751, 4625, 2329, 9508, 15215, 14639, 15542, 10519, 8892, 20556, 17744, 9720, 12856, 3903, 6525, 7428, 1540]
8440A540J959Q604J675k271J65R14o706P52Q382j036P429l801j775K691N506n84
8424B3444L72N126j940m29P971m637m730j994L407K11n722J035K266k764j457
8409B0159o654l763Q08k216M568K237J280N142j927R53n509L721Q444N35n844
8394B1934O384r581o503l580L357Q241J763j449M30l829m516q210j796N483K90
8379H418k577j831p482J589q49n532J863P168N51n92J691M162N661J281m592n000
8363C929Q50K036K077n276l107L652n6K936K22l016J99l584l154M304L599M368
8347I979M973j473p55O735L188p911o801J248j713m212M216n73n499L289q423
8332c732k880J111Q554J2882K808r68m781K757o781o316j567J2577Q396m131j0076
$$ y = [1540, 3499, 12103, 13778, 11507, 11672, 12586, 5880, 6632, 15014, 13978, 21407, 17606, 15831, 18522, 24028, 23444, 23816, 28942, 27002, 26573, 34544, 29907, 25177, 23183, 26590, 26801, 21079, 22114, 24380, 21616, 20159, 13505, 9742, 10550, 8334, 12902, 15139, 16419, 21561, 19634, 20587, 15078, 18799, 27243, 27778, 21934, 28318, 18737, 12234, 8654, 12011, 20252, 22015, 20566, 20996, 17167, 12651, 4441, 2645, 8128, 8418, 5841, 4010, -3472, -1883, -2732, -8264, -6401, 767, 1318, 726, 2417, 6579, 12240, 13521, 8929, 3929, 4779, 6815, 8892, 3616, 509, 4161, 4105, 7041, 7263, 4247, 4446, 862, -2292, 2012, 5611, 9979, 14952, 13479, 12724, 19459, 22647, 14736, 7935, 9183, 7470, 3258, 7474, 6901, 1402, 4691, -3732, -6612, -5501, 3053, 15935, 18743, 17775, 12994, 15751, 8970, 2654, 1087, 13664, 22060, 17929, 7853]
8317G853r887k693J195N11j025Q8J223P557R304J598j599k745p271l997n7J922
8301A977M400j717r154j783O161L642J89k334L92L969P188n04j1621l695m398
8286g288J393L841r184j183N781J216P002N858J1638J3068M53L874J2289N963
8272E4721j3551j1721p573p870m802j403J134L953P53m577r461k846L553j246
8258i36j861N289m369p315j025J2112J1395q163k114l670p187L045o701Q197R312
8243F009k474N720k077k149R98n090J384j631n230M648n522l244K536K991J737
8228a394L646O6O03k195j592P90p303p747K051N553P062Q672L015M20m391o152
8212A104N425j238o676o874r801O876N909L943N846k215J314n98Q21K928l830
$$ y = [7853, -2034, -4727, -3532, -3021, -4046, -3958, -2735, 4822, 14126, 15724, 14125, 11380, 4109, 112, 55, 1977, 6377, 4660, -4494, -6277, -116, 3526, 3715, 1381, 1773, 5742, 12930, 12426, 805, -2890, -7288, -5895, -2054, -11238, -12421, -6640, -5424, 1578, 7436, 19074, 32142, 32595, 36469, 48758, 54721, 41170, 29449, 21876, 14006, 9204, 7801, 8935, 12888, 13641, 9064, -397, -3243, 310, -936, -2797, 2492, -1877, -9192, -10217, 1895, 13290, 5127, 3013, -657, -7844, -4799, -11500, -3303, 6009, 3535, 9255, 7178, 5029, 6027, 937, 2321, 690, -4540, 108, -5414, -8658, -6122, -3131, -1394, 2252, 2318, 2921, 726, -866, -76, -7379, -15126, -13075, -7522, -460, 8212, 11227, 11647, 7256, 1104, 6529, 5291, -1385, -8259, -18060, -11184, -5275, -1332, 4514, 2299, 3613, 3015, 3836, 6764, 2934]
8197B934J753p831R05l152N43j34K538K970K733o42K843j88n332o040o915j49
8181a3164P205K633m240j612K590R864R664j278o068q976j987j928n01L992O990
8166C184q26O473O386j664p884k170N062m35N900k95k712l05J698m009K808N12
8150A1723p518o241j1153L332M260J962p18k667n33M476O618m089L165n588M294
8135A323k492q553M37J064l860l306P916N745M44J856j340m234r20J398J94o537
8119a0865L769Q403O683p888J668N046O93p718j1205n508J3207k506Lj179l594
8104a0991l425j583J316P104N302n92j0198R12L075k007L028K890k235r42k682
8089a1028Q359K328O59J850L826J043m515j391Q83k58L300o610j3680J939R480
$$ y = [2934, 4687, -3144, -2239, -5391, -4848, -4982, -2444, 526, 3259, 2617, 5460, 5272, -60, -6100, -13015, -13164, -5959, -3326, -7566, -9178, -6588, 3276, 12940, 11662, 5594, -3382, -5369, -7297, -7798, -3806, 3184, 2358, 8831, 15217, 13553, 5669, 3499, 8561, 8126, 14026, 13731, 11019, 10714, 12412, 8403, 11211, 11723, 4205, -2036, -13189, -9857, -5597, -3635, -4353, -7020, -7553, -3077, 3541, -548, 2617, -2971, 1323, -1169, -9722, -9285, -8221, -12081, -15387, -7471, -1726, -1282, 574, -766, -5000, -5920, -4522, -4328, -10865, -7096, 1307, 7990, 102, 1770, 6816, 7509, -209, -11414, -16922, -3715, -6221, -6218, -7397, -10991, -14416, -15999, -14683, -7579, -2277, -2869, -13067, -12155, -9080, -11087, -8059, -5169, -7404, -8346, -11028, -2669, -341, 318, 2168, 5994, 7037, 2522, 1131, 2014, 1756, 5056, -1554, -15234, -13295, -3815]
8074c815O211j559L660J673q792m664O460Q586o69Q59r40p472K830p12j944J177
8058H89L477l171p688r847J2917l897j739j486k391O44Q210R578M267l464j1457
8043e158l913k432N729j549J436M840J027L88m17m710o025j408L705l715o406
8028a8608N414N367J0851r471o823K004m749n179L948O652M629q96N313M323M74
8013C249l519m422p644j654l69O798j926J743N694m65J744k674j146m04P045N505
7997G555P779m384M34K34m164L473q30q654o551O19K312L881O15R33J972N262
7981A0486J1544k702m384k504k954J038P124q949l077O747N972k275J084Q775
7967B5925J706o326r823K680K210m460j017q131l241N719Q381l057L504K897j815
$$ y = [-3815, 2396, 837, 4497, 6170, -2622, -7286, -826, 7760, 7091, 7950, 7010, -462, 2368, 1656, -288, 889, 4366, 1195, -6493, -16340, -3423, -7320, -9059, -10545, -12936, -12292, -4082, 5496, 9763, 6299, -5158, -9071, -11503, -5774, -7323, -5887, -1047, -20, 368, -49, -4759, -10784, -12192, -8487, -12202, -18608, -13194, -7827, 3024, -6447, -13270, -11266, -16015, -21194, -17246, -10594, -5965, -6861, -1548, 2775, 3249, -270, -4692, -12336, -13990, -14359, -7561, -9487, -7744, -2050, -2515, -771, -3445, -4591, -4995, 2050, 7555, 15334, 10950, 11384, 11618, 7454, 10927, 10097, 1443, -5108, -4489, -2177, 1704, 2319, 3252, 5224, 10486, 22030, 19328, 14944, 12440, 9486, 10524, 17648, 8699, 5622, 12369, 18341, 16066, 17150, 25925, 27631, 21305, 11482, 14162, 16372, 11912, 10895, 2764, -477, 5242, 13623, 10566, 14070, 16967, 15152]
7952A5152L273r41m432j5411q961O855J1047J622j756n78m954L008P141l244K472
7937A0293J1401N433n34l854P077K0000J2601M308j0004j0920q300o525q277j0271
7923A2428k214j000P21Q784p92o932k148J798L91k198N314O451m471p092L9k864
7907F215K585p00O542N217L301m11N382o951n185l919n611j893n298J24O201J439
7891G038L297n452J406K558L811J6010J2170l496j5219j1131q888r13P049M831
7877A3071P88o626j0003J974P55Q362J0510M60M402M955N58L606j296P860O107
7862D5483P027K1118K2491J8668J4342M71m722j2469j7752k0229j6637j0996j4464
7849C2331o800R3k217o498k816o901k068j946M094o698j0550k741Q186M078o703
$$ y = [15152, 18425, 17484, 13052, -2359, -11320, -4465, 6582, 8204, 6448, 5870, 916, 3924, 11065, 7821, 10293, 21694, 27127, 26593, 22739, 29816, 49816, 62417, 66725, 56721, 45801, 37501, 30976, 22699, 12428, 10214, 9214, 9935, 18719, 17927, 10995, 8847, 10645, 11036, 8838, 14152, 20603, 16132, 9040, 9079, 6215, 8800, 8100, 14642, 19859, 23160, 22749, 28131, 21180, 15995, 12076, 6465, 4572, -726, -602, 5599, 7038, 10335, 4883, 6289, 8847, 12658, 28668, 40838, 37342, 22123, 10992, 2104, 1191, 8240, 13071, 13859, 7233, -2770, -796, -41, 8321, 18831, 19291, 23693, 28648, 29206, 32812, 31516, 39376, 45483, 52510, 73628, 96119, 114787, 129129, 129600, 124878, 112409, 94657, 74428, 57791, 46795, 32331, 25531, 25624, 23407, 16909, 14093, 7192, 5124, 3178, 7272, 574, -9976, -12717, -4531, -453, -7156]
7834g156L82M02K804P783K364K584j806m534L992L151j31J0848J3217p77O56N146
7818C8925R598J0399L1686L8518L8815N1160L0084J7407o935l3861m6960l7918
7806A40918l6445l2976j7751j8032q304K438m969p694q583l505l04L037q5p423
7792C22L557M120J695J230j786k448o911r765k450O244L27O580L043j544j775
7777D39Q591Q664p163j0905J3639P389P363J349J795Q872J2891K3690K0577Q655
7763A05846q186j2986j8162j5627q303r725N80j4238l137L884k626n298j1365
7750F57L780Q56n183m495J9n756N781M786m476k084P008M831j377o163o972J22
7734h666L266K595m716l990l046l230o548M344P014L200k872j594L275J045M878
$$ y = [-7156, -6774, -6372, -3568, 4215, 6579, 9163, 7357, 2823, 6815, 9966, 9835, 20683, 33900, 33123, 33779, 38925, 48523, 58922, 90608, 129126, 167941, 219101, 249185, 266592, 259657, 225796, 178836, 140918, 104473, 71497, 53746, 35714, 27410, 29848, 24879, 17185, 8602, 5097, 4793, 7830, 7745, 322, 3879, 7999, 9694, 10924, 9138, 6690, -221, -9986, -12436, -6192, -5865, 715, 3758, 2214, 439, 9030, 17694, 10531, -374, 13265, 20654, 28017, 29366, 31161, 40033, 52924, 76614, 97191, 105846, 97660, 84674, 66512, 50885, 42582, 32857, 33437, 19199, 16062, 19946, 17320, 12022, 657, 4437, 5293, 110, -4385, -4366, -10122, -4341, 445, -4031, -6115, 893, 5724, 4347, -1816, -8788, -8666, -5400, -2805, -7521, -11511, -14557, -17787, -24335, -19991, -12977, -9777, -12649, -14243, -10968, -9923, -5045]
7719e045O02K623J037K970j415n727m450J543l325j874r98P03m282n241k508K601
7703b2786O756K669R720P575K717k963o527n933m572j555R695K889k963r81r273
7688a5532p858L887P530L625k343o70L155o16l51L10j44J476n592L19N384N720
7672a700N76k513q19N330J688q348q199p083Q104J0775M906q417l896L274J913
7657d409R45m547l855K05p358K663N050R036l497r923o312r84O66P719R476K015
7641c110K670j2351l255j050j348m289Q770O629K747j13j447m162K165J0452K021
7626D329q395p065j170K659l241q56J621R297R82j874N81L391j0732k506k978
7611a5957J824j0m03j670j199J992m197k059N357J337K24n106m07N090K352P677
$$ y = [-5045, -4443, -1820, -783, 2187, 772, -4955, -9405, -7862, -11187, -13061, -14059, -13356, -17638, -22879, -25387, -22786, -16030, -13361, -3641, 3934, 6651, 3688, -2839, -8772, -13344, -14899, -5204, -2315, -5278, -6259, -15532, -23390, -19503, -11973, -8348, -10691, -11361, -8206, -8822, -9173, -8863, -9007, -7531, -13123, -12804, -7420, -1700, -1124, -3637, -4456, 874, 2562, -5786, -13985, -21068, -12964, -2189, 2717, -5700, -9596, -6322, -4409, -3464, -8011, -11866, -11661, -19019, -16356, -11306, -2270, -5767, -15690, -22002, -22986, -22320, -14601, -5125, -3110, -440, -12791, -16046, -17096, -18444, -22733, -13963, -7334, -4587, -4700, -6147, -10309, -8144, 2308, 4329, -4066, -11131, -12301, -9642, -12883, -13739, -12118, -2821, -1839, -3713, -3132, 259, -10473, -12979, -15957, -14133, -14143, -14546, -16216, -17415, -15423, -19620, -21679, -16322, -14985, -14761, -19867, -20274, -15184, -12832, -5155]
7595e155n032j0010M122P77N905K404n877J895J1351n665L72l325M611n620o021
7580a5268K301m896n644M345P234J213p843P27P145J240k939n622q165L726N994
7565a6452J729m307K462N379l46j790J970L667j000k058O13k764Q28L086R986
7550A003P840M99K896L164J480j0068m944K236j521J29k804K057n466R52j567
7535d114M468l834O10M973l689m98m698O425l903n444M060M128J760m745J64L759
7519e78n055j444p91k933l849m309L351k28R160r31q45j579M987M029k606r218
7503a2839J20K974P43M287p997j485P512P438n812l781l714n913r99o30K914j513
7487a8695j689N750M533O512J569M342r727M845K226J862m172N23L270l088n702
$$ y = [-5155, -10187, -20197, -16075, -15298, -9393, -6989, -12866, -10971, 380, -5285, -4913, -8238, -3627, -9247, -15268, -12967, -17863, -23507, -19162, -11928, -10715, -18558, -17831, -10686, -9446, -12385, -18007, -26172, -22446, -16452, -14723, -19030, -16568, -11189, -11535, -13325, -11355, -7688, -8688, -10746, -10133, -12897, -12069, -8983, 1003, 8843, 9342, 12238, 15402, 16882, 6814, 1870, 4106, 2585, 2714, -90, 1967, -3499, -2547, -4114, 354, -3480, -2870, 2103, -1586, -2084, -6782, -357, -4260, -9704, -5644, -1516, 244, -4501, -4337, -578, -5633, -7077, -7868, -10801, -14650, -18959, -15608, -15836, -6676, -7607, -8452, -10031, -5044, -1015, -3621, -12839, -12719, -9745, -9002, -4715, -12712, -14197, -6685, 753, -5059, -8840, -12554, -18467, -19466, -20096, -17182, -18695, -20384, -14634, -10101, -3589, -2020, 2322, -7405, -2560, -334, 1528, -2644, -2121, 1149, -1939, -7641]
7472g641N574q01q822n857l22L173k14q58N887R710k443k91l255o750K138P13
7456a0059n490R902P522J114m103l594m042L711j009m679q942k882J1033j548
7442a3066n757o650j211N227Q608P084P307l273n60l827o986J699K433J988J0357
7427C373p642j4668J95K35J997L743l265O590M898J1367m30m514M031p931m523
7412f544q05j1010J602M672Q147Q884m650J938q67l69k946k546j586K916K7j1241
7396a4378k113R800L549l314r623l881j007K389J923K657L919O405M080L659K147
7381F212j291J972q136q364M759N393m187m526p021p24N29J38O492K669M788l792
7365e089Q8K2m027P423J091k612j069l58q365L224R052m037j035R468N65k739
$$ y = [-7641, -2067, -2868, -11690, -17547, -17869, -14696, -14910, -15768, -9881, -171, -2614, -2905, -6160, -12910, -10772, -10059, -15549, -5647, 1875, 2989, -1114, -4708, -8750, -5039, -6048, -10727, -19669, -22551, -11518, -13066, -18823, -25473, -26684, -21457, -12849, -5765, 1542, -1731, -2291, -6118, -13104, -11405, -8972, -6984, 3373, -4269, -18937, -18742, -18507, -16510, -12767, -16032, -9442, -4544, 6823, 6393, 1879, 5910, -2021, -6544, -7349, -18359, -16757, -12085, -3938, 4946, 296, 2234, 1367, 998, -1948, -4494, -6080, -3164, -3137, -14378, -16491, -6691, -3142, -6456, -16079, -19960, -20967, -18578, -16655, -13998, -10079, -3674, 406, 4065, 6212, 4921, 6893, -1243, -9607, -4848, 545, -3642, -8168, -15189, -15913, -15384, -15246, -8754, -6085, -1297, -5089, -5001, -4979, -9006, -1583, -492, -3104, -4173, -4531, -12896, -9672, -620, -4657, -5692, 3776, 4341, 1602]
7349A602o904j595K545m619N58O679J564L289K48k470j119J170q18m963j0037
7334a4870m521J1098R492l868r700j188J003n827k487Q998J915M02l407J194P780
7319c986J344J560K68j081k540k204lL79R66N143n495m154J807j714J119l681
7303a2272l958N64J174L415L589k282n309n42k706Q952Q323k898m079m443o210
7288a8682M086K363R35O156R047m2L736L805m279j176r070j1049K388o05q20O924
7272f283K757J988l159q899k755K706Q764J996M572m4j0534j912L928O959j618
7257a534k194j278r909k260N403Q113J001J156p409j764K673m926N571l259l036
7242a3652P394J425l290L171k381l853L17N59J207l528k336k537k354J109Q719
$$ y = [1602, -5302, -6897, -4352, -8971, -8413, -1734, -170, 3119, 3367, 897, -222, 948, 130, -4833, -14870, -19391, -8293, 1199, -2669, -12369, -13557, -12554, -18381, -20868, -11870, -9955, -9553, -12960, -11766, -3986, -2642, -1082, -814, -1895, -4435, -6639, -6642, -6263, -5297, -154, -5649, -9803, -7996, -9710, -8591, -12272, -16230, -15666, -14492, -11077, -7488, -9770, -15079, -15621, -18327, -9375, -1052, -3950, -8029, -12472, -18682, -14596, -12233, -11298, -5142, 3905, 3863, 7599, 11404, 7125, 5949, -3121, -14170, -11782, -12387, -13207, -6283, -3526, -1538, -4697, -13596, -16351, -13645, -4881, -2885, 1687, 1643, -8891, -10803, -6875, 84, -1534, -3728, -5006, -14915, -17175, -11772, -3659, -2658, -1502, -8911, -10675, -8002, -12928, -7357, -10616, -13652, -6258, -4833, -8123, -4952, -7333, -11186, -10869, -10310, -9103, -12631, -14967, -17504, -19858, -18749, -10030]
7227a0030P773Q266r995j0233P292R879l883k083K234j705K959k38k736N269Q521
7212A1290k648l230k561n211k328O347q722m393Q029L468m375j574K348l330k745
7197i635k572K087R474K308j705K76k013n892R147K383j921r99k103J144k832
7182b853j864p642m494k820M524Q747L808O57J801Q51k164m948K207Q685j5021
7167a0526n083m778K189O632p179M068L825j331l67n473J701M751J031N408L976
7152a156K66l183r837J461N991O678j283j666J465r52q492n336J531j273n78O981
7136i383m308K908K768J1416N122p086l635J924j449l110J695l723j807j313j158
7121a1139m232N766J706J600J78m289l572k815J031J896R436j877j876n09L214
$$ y = [-10030, -2257, 6009, -3986, -14219, -6927, 2952, -931, -3014, -780, -2485, 474, 236, -2500, 2769, 11290, 8642, 5412, 2851, -2360, -4688, 1659, -7063, -11456, -3427, 41, -4334, -5908, -3560, -6890, -9635, -12207, -10120, -646, 1662, -43, 233, -1780, -7672, 1475, 3858, 1937, 938, -1165, -21, -2853, -4717, -12359, -16853, -19673, -15149, -6402, -2594, -1937, -136, 715, -1449, -6397, -4190, 4495, -10526, -15609, -20387, -18198, -11566, -18745, -14677, -10852, -12183, -12550, -18023, -16322, -11571, -10540, -5132, -1156, -890, -4073, -13910, -12449, -6458, 220, -1063, -2729, -1264, -2216, -10708, -16044, -14513, -15786, -16364, -9383, -13691, -10783, -8015, 3401, 8523, 1437, -2198, -274, -1723, -4833, -3138, -6861, -8668, -9981, -11139, -15371, -9605, -7899, -6299, -6121, -10410, -13982, -16797, -15766, -13870, -4434, -6311, -8187, -8696, -5482]
7106e482J977O57M771q701J049K325l896l069m580O252L284m502L610n876J06
7091a2075M968j698J033M658l238J631m540N46j60J169k156m061n808m014M483
7076a9262P431O275Q374J768j1075N662K084l997n919j456j449l101l890Q960
7062i595J5404J1283M556q510l281l567l383p094l907J228L215m715r790k164
7048b0320L1J367P833O016L921j0394l470L786K086J285m029L554L740j603j73
7033f370L383O215J299p653L061P982k119m383p066m449L767k353m753k739L883
7018a2295J1016j500m001k034J742J885K913l734n277J22L455r202k983N753L813
7003a0327Q681M012j0500l259L067K165N945m01m365p060l621p461J27P04K473
$$ y = [-5482, -3505, -2848, 1923, -6778, -5729, -3404, -7300, -10369, -14949, -8697, -5413, -9915, -6305, -12181, -12075, -7107, -8805, -7772, -3114, -6352, -4721, -9261, -8715, -8875, -7706, -9862, -13923, -19731, -23745, -19262, -11831, -5556, 2818, 4586, -6489, -827, 1257, -2740, -8659, -10115, -11564, -14665, -18555, -9595, 5809, 17092, 21648, 13138, 9857, 6290, 2907, -4187, -8094, -6866, -3651, -8366, -18156, -20320, -20289, -18922, -11089, -5073, -1152, -11546, -15016, -11230, -9144, -7859, -11888, -8334, -4594, -6197, -6370, -2987, 3228, 4527, -3126, -65, 7917, 5798, 1415, -5651, -10100, -6333, -8686, -13439, -16178, -12295, -1279, -2779, -6780, -8814, -7072, -5187, -2274, -6008, -11285, -11163, -7708, -16910, -19893, -14140, -10327, -1646, 2366, -8134, -11393, -8326, -6161, -216, -617, -4982, -12042, -15663, -23124, -22997, -22293, -19820]
6988a9820M912R244M98l238P59o68K30n232k214j869O700M647J245l636q977o333
6972b3752K716M821m75P624P449q222l74K634p123k80M121J457M527N598M547
6957E268M619p959l496L190K978j602j1284o17Q190j386l208o633J869k845Q737
6942d179R976o751l234p197j027J0348O274l651m214j21J045m744j540M231l720
6927h504K031J684l27j4901k339N097r19m96J0663L691j869K076k53l516O10K518
6911d754L880m727j2867M245Q735Q00J827P474O093l517m702q350n474j761L312
6896i786O92o09K262M653m321l017N463J537k032k276m102J617J65m419N496M049
6880d628K010n197J128R680M634l903k253l446m950j385l956L87M368Q266J481
$$ y = [-19820, -14908, -5664, -5166, -8404, -7645, -8313, -8083, -13315, -15529, -17398, -10698, -6051, -4806, -8442, -17419, -23752, -21036, -16215, -16690, -9066, -1617, -9839, -10213, -7579, -14702, -14982, -10861, -9404, -4877, 721, 5268, 9887, 1928, -1568, 1622, 4600, 2998, -8286, -8903, -713, -2099, -5307, -11940, -10071, -12916, -4179, 5797, -954, -4188, -11385, -12412, -2064, 4210, 559, -3655, -3776, -2731, -7475, -9015, -4784, -8504, -6473, -4789, -5116, -20017, -22356, -17259, -18178, -18674, -8011, -4320, -6189, -4113, -4366, -7882, -7272, -4754, -874, -5601, -18468, -14223, -5488, -4688, -2861, 4613, 10706, 7189, 2487, -5863, -11337, -13098, -9786, -9094, -9703, -7441, -2788, -7109, -10126, -4663, -3126, -5158, -7434, -11536, -9919, -9754, -14173, -8677, -4628, -2618, -7815, -6687, 2993, 7627, 3724, 1471, -1975, -6925, -8310, -12266, -11879, -7511, 755, 2236]
6865B236l528R76K076r259N249L140J889j566n215p24N322n229L646M706j769
6850A950j467q202l457O983o202l844M838M437O418L468n965k558K657L478n684
6835c150l715J089O539N012J678L291r434j2906O923m10j179l327l337j135M7
6820a4014P532K41j572L123q375R37L630K450n359m619K791j351O73M191N03K810
6804f409k089L859l295K219k335J92M323j197m287M262n576Q625n058j3028L214
6789a6580M541J641k699L122n288k342L025O390R420l916k515K581M26o734m494
6774a3422J6452P309r708m262l108M748j5002l366J1078J1699M374Q78o339j331
6760@k999K440k333m706j077l778J732J809j03m900P129M357p938q180o188k168
$$ y = [2236, -1292, -316, 1760, -7499, -2250, 890, 2779, 1213, -4002, -4726, 596, -4633, -987, 3719, 1950, 483, -7719, -11176, -4193, -10395, -14239, -9401, -4964, 1454, 4922, -1043, -3601, -944, 2534, -3150, -6865, -5776, 763, 5775, 7453, 10744, 1310, -11596, -4673, -5083, -6262, -9589, -12926, -14061, -14014, -6482, -6241, -7813, -4690, -13065, -12128, -8498, -6048, -11407, -16026, -13235, -14586, -13913, -9722, -9219, -6409, -8498, -4639, -7934, -5715, -8050, -7858, -3535, -4732, -9019, -4757, -10333, -1708, -6766, -19794, -16580, -12039, -10398, -13097, -9975, -15263, -17605, -14580, -8190, 1230, -2686, -5201, -2620, -2194, -8928, -13422, 3030, 10339, 631, -3631, -6739, -1991, -16993, -20359, -9281, 2418, 6792, 7670, 1331, 0, -2999, -559, -2892, -7598, -8675, -12453, -10721, -8912, -9015, -13915, -6786, -2429, -10367, -18547, -24735, -26903]
6744b6903J3186J544P67J71P336L298M370K618K501l435n390L967q759o324J425
6729i628j603L225l912o799O169Q599L485r98r235q961k96q35P520Q71M125q479
6713a6752L89N256m47k528J977Q874N03r073l220P458m244k406P315K49K42K960
6697c447q433n407K767J158K645j907n178N448J1696P274N993r957r716k867l680
6682a3611J1061J2434J700K266r058j3568m47O853L593m040p783l683K744M480
6668g059O109L624k690m774K747K357o561N84L089M932m319K180N460l193j376
6653A110Q296R363l389l512j1880q778l212q88k194O694Q073L321n689j67M689
6638A837L901J280o330l166P27k625o470o889J761N486m4k343K088O318Q72j721
$$ y = [-26903, -13717, -12173, -11406, -11235, -3899, -601, 3769, 6387, 8888, 5453, 63, 4030, -4729, -11053, -9628, -11231, -8006, -11918, -18717, -12548, -3949, -464, -1462, -10697, -19658, -19954, -20789, -13269, -12398, -8273, -16752, -16363, -11107, -11554, -14082, -12105, -3231, -2728, -11801, -15021, -7563, -11807, -14213, -6898, -6649, -6407, -3447, -11880, -17287, -14520, -13362, -10717, -12624, -17802, -12354, -658, 6616, 12609, 2652, -7064, -9931, -13611, -2550, 9884, 11584, 13850, 4792, -8776, -9223, -2370, 1223, -2817, -10600, -14283, -11539, -7059, -950, 2674, -16, -4790, -2043, 314, -6247, -5663, -2574, 2358, -1961, 219, 5679, 2486, 1110, 9406, 18769, 15380, 11868, -12, -8790, -12002, -12890, -15084, -8390, -317, 3004, -2685, -2852, 1837, 5738, 7018, 688, -2478, -1751, -4376, -10846, -17735, -15974, -10488, -10532, -12875, -10787, -4469, -3597, -5318]
6622e318r515L094M550N027n218m790O485j023L375J889M779k803k353K187Q019
6607H385m363k022P57m070l964O805l386l376o67j750O83R486k621j4359R57k816
6591a6321M173J0887J866j337r21o33M614k789L684J634p797r59m57j538K270
6576c624J780n980p064P796J450K295M177r78J968j325o66k534o445j1989J130
6561b0009l550J3105L188l759j680P068P123P926Q834n661m277j0611j3226N105
6547a0424M063L492k191j650q49O638k221p61M714L757o053n110J950j647q202
6532a4494N642r24M15j701j0252M576N868O231n29J199l485j562L709J735n807
6517i379j028n572K763K785J700l572O27N235J273k63k358J700L933P001J0497
$$ y = [-5318, -14833, -11739, -7189, -2162, -7380, -12170, -5685, -6708, -3333, -1444, 3335, 532, -1821, 366, 8385, 4022, 2000, 2757, -1313, -5277, 1528, -1858, -5234, -5901, -7651, -6968, 2518, -103, -14462, -13505, -16321, -12148, -1261, 605, -732, -1653, -2286, 2328, -461, 3223, 4857, -2940, -3899, -4356, -5894, -3624, -1844, -7824, -14888, -7092, -5642, -3347, 830, -148, 1820, 495, -171, -2705, -9150, -21139, -20009, -23559, -10454, -7266, -11025, -12705, -5637, 1486, 9412, 18246, 12585, 8308, -2303, -15529, -10424, -6361, -2869, -5060, -6710, -7559, -921, -3142, -3903, 811, 4568, -1485, -6595, -4645, -6292, -14494, -8852, -9776, -9361, -11062, -21314, -16738, -10870, -4639, -5168, -3969, -7454, -9016, -5307, -3572, -9379, -10407, -15979, -13216, -10431, -8731, -12303, -11676, -6441, -5168, -5431, -7789, -6089, -2156, 4845, 15342]
6502A5342J340j5968j7478M773M959K729L46l407J841M894L209j533J089n746
6488c610M890R584j191j287j443L408L94m581o759N398j058o818p699j117P079
6473d810J906m612m665j070J844O941M50q80k666k028L485k914k848r90M761J0840
6457B744n453j304l557K465J264L175l655o191K849l349q875J637P657O68k531
6442a2456P408M507j105Q35m56J659O533M521m47n455n975o351q38l894J547k362
6426a2329m963K853J696P173k12R295M947n8k027k900k124j196q436N936Q4n209
6410g470J631Q172o77p218M493J1685O74j0046j3046l789N543N726l201l252n586
6395a6361M851L468l367q162P353J1229J720N30k642l779l477o71K827n364j0567
$$ y = [15342, 16682, 714, -16764, -11991, -7032, -4303, -3957, -7364, -5523, -629, 2580, 1047, 2136, -3610, 1280, 10864, 9673, 8386, 6943, 10351, 10745, 6164, -595, 4803, 3745, -3073, -10772, -11889, -4810, -2904, -7516, -12181, -13251, -11407, -4466, -4016, -4896, -7562, -9590, -6105, -9019, -11867, -12857, -8096, 2744, -2709, -4013, -7570, -5105, -3841, -666, -4321, -10512, -7663, -11012, -19887, -18250, -10593, -9925, -12456, -5048, -541, -1646, -811, -1267, 392, 6925, 11446, 10999, 5544, -431, -6782, -7620, -11514, -9967, -12329, -17292, -14439, -12743, -5570, -5782, 3513, 8460, 8402, 6375, 3475, 1351, 155, -8281, -2345, -2261, -7470, -5839, 2333, 1656, -5562, -1069, 10616, 11290, 1244, -11802, -15591, -10048, -4322, -7523, -10775, -16361, -11510, -8042, -11409, -19571, -12218, -989, 731, 1261, -1381, -5160, -8637, -9308, -6481, -11845, -22412]
6380b2412J1001L556j0099o44M746J241o36k866Q138K594Q00j989L707q13O274
6365B598L759n463J923R238Q80k095l833n175o825r269r777J1841J1853N868k043
6350C480l797M677J1986J6j3447p045o300j1817M32M304R025R907N585M105m457
6335F654r112k132M306J0258K513j071q161k551m294j978j135q913m786O257j217
6320a5362j840M829O847J2494n498m973Q053L379r537K951L785l220M957r331
6306b466j4927j044M233J961J944m001L655l388K653J2030k373q942j0334M06
6292b0593N186J1344O381L83l56K236l423N276p442n82q931q314K995P992O154
6277a694J218r004K376K216j929K081q83Q541j683j0284p600M317M564Q096N167
$$ y = [-22412, -11411, -7855, -17954, -18598, -13852, -12611, -13247, -16113, -7975, -5381, -4581, -6570, -2863, -3676, 2598, 6357, 894, 2817, 12055, 12935, 10840, 7007, 1832, -4993, -14262, -24039, -12198, -345, 5523, 3480, -317, 4360, 16346, 16362, 2915, -4130, -10430, -22247, -21815, -17511, -8486, 1421, 7006, 11111, 6654, -2458, -4590, -284, 9974, 12487, 11416, 3255, 704, -3590, -5568, -6703, -15616, -20402, -14145, -15362, -17202, -12373, -5526, 6968, 1470, -3503, 4550, 7929, -1608, 1343, 5128, 1908, 6865, -2466, -17393, -18437, -14204, -12243, -10299, -14300, -10645, -14033, -11380, 650, -1723, -10665, -20999, -20593, -15407, -4063, 2318, 2701, 2345, 4581, 1158, 6434, -1008, -1590, -10521, -18835, -15840, -7848, -1694, -476, -9480, -7104, -4888, -6817, -4736, -5619, 2922, 1239, -9045, -16645, -12328, -7764, 332, 5499]
6262E499q417n384J140j3927p012R750P059M015P152n74J356O626j845l276m172
6247b010M079j453r096m348K876m792P09J0429k78q53j096j0022o393k971m403
6232b9622N314R870L321o218n93Q430J0907J459K558k899j114p354Q37M026Q62
6217b16m102K034q50k351r12l780j928r01J589K119K909j23P358k96r129K900
6201e679M86M985K838q7N597K856r997k89J107j208J609L465l773j063k258l788
6185e199o722p469o678J3421J538o485o649O781O250m67l543n39J229K556J159
6170a0817J542M078Q170N740q490j4302O867k742K835J3274j310m661P37l510
6156b589k518o600j1501M896O022j967J996q22M663M721l65m52K924L954m11K95
$$ y = [5499, -2918, -8302, -7162, -21089, -28101, -18351, -11292, -7277, -125, -699, 657, 7283, 5438, 2162, -2010, 2069, 616, -8480, -12828, -9952, -14744, -14035, -3606, -3884, -4737, -5833, -15855, -22248, -25219, -29622, -24308, -14438, -11117, -17335, -17928, -9498, 1409, 2868, 5426, 2527, 1413, -5941, -5104, -1078, -216, -4318, -2284, -3134, -5485, -6397, -10177, -12105, -13006, -11417, -9298, -6389, -6512, 846, 550, -8579, -5679, -5193, -208, 2630, 2543, 8140, 10996, 999, 710, 1817, 609, 2218, 5683, 1910, 847, -1411, -5199, -11921, -19390, -26068, -12647, -11109, -17594, -24243, -17462, -11212, -11679, -15222, -15761, -14532, -11976, -10817, -9275, -5197, 2973, 8713, 223, -14079, -7212, -9954, -7119, 6155, 4845, 184, 921, -2589, -5107, -11707, -23208, -18312, -12290, -14257, -12261, -13083, -8420, -3699, -4064, -4516, -1592, 2362, 1951, 2246]
6140B246n905n125M26N09L6l90M097L166n441O360M811N231J2433N475l783k294
6124B1852j7007n168K081q461m847M805L626n70J50L020r75k707j0326l500L17
6109a7710Q743p72o14O257L919l574m083K939J341l60m578L808P416J305k731
6094A306L996n914K021M908j148J036l780k835l633k149J251L025l933L901n565
6079g513J947J861M144R29p322L244m96m783L208K851J1748j0756j3295m064L734
6064a4563Q296N589k215L7m63L86K438K231L625p390j482L098J1183O031j1662
6049E139K371N789m777M46O758o492p379k252L153J664j029o563m898P585J862
6034A377m186l745j039l391K133M614l64j160L501l941J339K80Q588O506m922
$$ y = [2246, -3659, -8784, -8358, -7849, -7813, -8203, -4106, -940, -6381, -21, 4790, 10021, 22454, 27929, 24146, 21852, 4845, -323, 1758, -6703, -11550, -6745, -3119, -3689, -3539, -519, -1494, -4201, -14527, -18027, -17710, -8967, -9739, -10353, -4096, -177, -3751, -7834, -4895, -3554, -3914, -8492, -4684, 2732, 4037, 1306, 5302, -612, 1409, 6317, 5169, 6205, 2425, -410, -4043, -6192, -4941, -1916, -5849, -1948, -7513, -5566, -3705, 439, 1368, -5954, -2710, -3206, -7989, -4781, -1930, 9818, -938, -14233, -18297, -14563, -6267, -678, -2893, -2856, -3319, -2933, -495, 1736, 5361, -2029, -3511, -413, 10770, 16801, 5139, 7510, 13299, 8522, 8968, 15726, 9234, 1855, -397, 2756, 4420, 3391, -3172, -8070, -485, 1377, -2809, -6554, -7593, -10984, -8851, -4237, -4601, -5761, -2260, -6201, -4862, -4582, 4006, 10512, 5590]
6019E590k677o91L301J596m241j0508p757L048Q79P875J2218P454K273n388k022
6004A0950q9n54k646n60P901m164o997m933L068K936j0098j1692k526J5900Q332
5989D828J393N892K456o189p15O3m790K073O582L678n253j884J120K715P326M375
5973B3670j0403q622k124j568n00L94P392R872k865p003l381J188J470K376r243
5958F53J54k027J244j044n629M578O433R04L60m998j776J275m360j3505K030l95
5942a6103P647O233j020m41n646p278N249J717O198Q830K375n932o469n606K000
5927h246j336n90M927Q01k406n45Q750K712p225M927O208L572j309j493M744n411
5911H080q276n517Q589J018q401K12K423K850n362M597J0179l939l548l20O44
$$ y = [5590, 2913, 2222, 5523, 7119, 2878, -7630, -15387, -12339, -11460, -3585, 8633, 16087, 18360, 12972, 10950, 10861, 10307, 7661, 7101, 15002, 10838, 3841, -1092, 1976, 4912, -5186, -16878, -19404, -3504, 4828, 6221, 12113, 14569, 8380, 7665, 7728, 2938, 5011, 11593, 15271, 10018, 8134, 9254, 11969, 19295, 23670, 13267, 4645, 2521, 953, 453, 847, 8239, 18111, 15246, 8243, 4862, 6050, 7520, 9896, 653, 807, -1220, 24, -1020, -6649, -2071, 4362, 5266, 5626, 628, -1148, 127, -4233, -17738, -15708, -16103, -8456, -2223, -3243, -3684, -9330, -16608, -11359, -9642, -3444, 5386, 7761, 1829, -4640, -10246, -8246, -9582, -10172, -5245, -4444, -6850, -7395, 1355, 4067, -3158, 1769, 7977, 11549, 10240, 8747, 13491, 8080, -196, -5713, 2876, 3894, -4507, -4295, -1872, 978, -4384, 213, 10392, 6453, 2905, 2585, 3229]
5896C229L136j2406n986P366l745q416P248M104k333Q457m228n149o080k356M252
5881a2907J3306L401q517l719n04m594Q095J838j194o479L934Q662O043p588n460
5866e683r169o55R785J903j656M008Q228o469n38p32r190L416k435J350O616L794
5850B573o015m397j906K618K630p356n572j300O618P206k132n196m87M484N797
5835b435N86M170j793m41R17M10Q49J405N926j935o371l533n054P685J359o880
5819e135n17R03j531O846L71J71P738N607q960q525Q90l1p066L63n234m633M783
5802a3960N378l87K829N988L506m576l802M556L219l962l693k881P128O848R023
5787A5214J411j3330q694K783P799M699n477j0636Q226k813j1701k840J260M311
$$ y = [3229, 6365, -6041, -12027, -4661, -8406, -16822, -9574, -5470, -7803, 654, -3574, -8723, -14803, -17159, -12907, 399, 3800, -4717, -8436, -8940, -13534, -5439, -3601, -4795, -11274, -7340, 1322, 7365, -223, -5683, -14852, -15507, -5722, -3819, -5475, -1467, 6761, 292, -246, -978, -10168, -6752, -9187, -7837, -1221, 2573, -3442, -7839, -9745, -7127, -4497, -11853, -17425, -18725, -12107, -4901, -7033, -12229, -12716, -8232, -2435, -1849, 2321, 528, 87, 1004, 1414, 2263, 3668, 9594, 7659, 1288, -2245, -7299, 386, 1745, -5135, -5652, -4749, -6280, 566, 937, 1108, 8846, 14453, 5493, -3032, -2142, -2173, -9239, -8876, -14110, -18743, -13960, -8582, -8969, -6140, -152, 3354, -1222, -5024, -468, 2751, -1211, -4904, -7785, -657, 6191, 15214, 16625, 3295, -5399, -2616, 5183, 9882, 4405, -6231, 1995, -818, -12519, -15359, -14099, -9788]
5773i788Q060L273P935m006r363p20L716O683L829p068j0546L000Q748l223N093
5758E623n40n491j440J960K375m081j970m441K071M569K604m427j514O646Q63
5743B807p11n031M35L389K628q04k366J203l730m320P710N326M043j183n165l275
5727I56n346j528n476p757J847J2189R676M718k697j3134j1896K700Q936J222
5713e590o573J068N854J3008K48o934n171p559l599J111P90R803m91O3j069L219
5697a822k682m070M61O169N073O388n53n947J861j1608n475K417L868O53K986
5682b281K295P1j606m560M744M836j08L439L496m963l750K917M804n857r95M275
5666F757j0022P80J3426N889k828n818m844k230k863r878j322O941Q660Q01k410
$$ y = [-9788, -1728, 1545, 9480, 5474, -3889, -4609, -893, 5790, 9619, 2551, -7995, -4995, 3753, 530, 5623, 5083, -408, -1848, 112, 2487, -1594, -3564, -8005, -5934, -1365, 1239, -3188, -4702, 1944, 2807, 2096, -2935, -2500, 889, 3517, 2713, 347, 1550, -2180, -6500, 1210, 6536, 10579, 9396, 4231, 956, -4390, -5918, -11394, -19151, -17304, -5115, 4561, 9279, 6582, -6552, -18448, -15748, -6812, -5590, -12163, -11095, -5241, 7767, 8015, 1081, -4090, -11649, -15248, -14137, -13347, -3544, -4035, -3972, -5041, -1822, -4504, -8574, -8113, -1944, 3129, 9517, 8964, 3017, 4878, -6730, -12205, -9788, -5920, -5267, -2281, 14, 85, -1521, -6081, -1337, 3499, 3391, 6830, 10326, 5363, 1613, 4530, 9334, 3477, 2482, 6757, -3265, -2485, 10941, 16830, 14002, 8184, 3340, 1110, -1753, -11631, -12953, -6012, 2648, 3449, 1039]
5651A039q109Q1l530O420K694m859k096N696J360L68J0977j192l624j321O501
5636A0405p105q407J472Q37q85P126N495q079m762J443r72q333K672L628L279
5621b186J813N295n243j005q81l770l0q444m661N234l829l459M633N388M88K578
5605h079Q193L469n580m754O202N532j488l556L507j97r932k206Q5l556O612M012
5589a736k598L423n030j527l925k568L280M566M049J916k847k814L56J152L187
5574a116k434J59N039O421j930j539r04L505m562k290M251n981L014n05j853J046
5558C21q061N807N409n81j352n8j2203r96P011J862p222K263O126n375l535J0163
5542d21m91l626J186p806J139N934N376j738j836l324L373L658r355l259K381
$$ y = [1039, -7070, -6989, -10519, -4099, -1405, -6264, -8360, -2664, -1304, -936, 10041, 8849, 5225, 3904, 10405, 3300, -5107, -3635, -2798, -3683, 3443, 8938, 859, -3903, -2460, -3432, -11765, -9093, -5465, -2186, -373, 4922, -321, -1326, -2207, -5977, -6007, -14451, -19112, -13878, -17707, -21166, -16533, -11145, -10657, -8079, 114, 3583, -1997, -6751, -549, 4983, 3495, -61, 3446, 3249, -6683, -8889, -8804, -12360, -5748, -1736, -4334, -911, -5941, -7468, -11393, -13961, -10681, -6115, -2066, -150, -2997, -5811, -5455, -4303, -1116, -3550, -3391, 1648, 8069, 6139, 4600, 3696, 7201, 2639, 349, 4600, -1381, 1633, 1128, -725, 321, -7740, -1933, 3476, 2895, 1543, 1485, -10718, -11714, -4703, -2841, -10063, -7800, -1674, -7049, -10584, -421, -912, -4538, -3352, -11158, -10019, -4085, 1291, -447, -2283, -5607, -2234, 1424, -7931, -11190, -8809]
5527h809K023K655j73O161m401l483j623n82R595O89k953K45l701L950L963j863
5511A693J010J1m813l210J972p190j3310n019R876Q971L27Q022N790Q93q859J282
5495b554N86N781m190p267p877r408k523N425R675j233k63k155J906l689j0015
5480b7801P855O390N736N723J086O471M006n496m912K645j325j342O25p661o409
5465a4409O637L568J044p224n737L429J1350P732M777L350o375k170k313j1888
5451h229o40J2545Q987k742j640l034L090J573m206q293k416L83m171j839J674
5436h958Q473J951k077l999j311L93q62L183N47R283M630q313k127k371j298K08
5420b648P7m945m2M531M425m63K804N932n710o607J242L712P17N233O933O56j218
$$ y = [-8809, -6786, -4131, -4304, 1857, -2544, -6027, -7650, -8232, 1363, 2052, -901, -656, -4357, -407, 3556, 1693, 2703, 2714, -2099, -5309, -3337, -10527, -23837, -28856, -18980, -10009, -9682, -1660, 4130, 5023, -3836, -2554, -1968, 3813, -377, -7644, -15521, -24929, -27452, -22027, -12352, -13585, -13848, -16003, -14097, -17786, -27801, -19946, -13556, -7820, -2097, -1011, 5460, 9466, 3970, -942, 1703, 378, -964, -339, -8000, -14409, -7772, -4204, -3160, -10384, -16121, -12692, -1342, 6390, 11167, 14517, 8142, 5972, 3659, -8229, -8869, 3676, 12663, 9921, 8281, 5247, 8337, 9910, 5704, -2589, -5005, -4622, -8793, -10632, -8958, -485, 1466, -611, -4610, -5921, -5528, -6390, -3207, -2660, 6623, 11253, 2940, 813, -1558, -2856, -2648, -2571, -7516, -7558, -3027, 1398, 935, 3739, 9671, 3961, -2646, -1404, 2308, 3025, 8258, 15191, 15847, 14629]
5403A4629j8237l079J607L260n41j858l083j0048K768J5865J3052l392q045k628
5389B70K861k598K241J696L2k200j460j580k107P07R44M315P860l167m872m802
5373a860r440j0109K457P039J3129K617K438M021J396l559K026K518j978o812
5359C883P03o312k783K192R438n851o9r40n51m140m694J034J2309R329n722o987
5343H39r930K451L455o396M12N829M230L684N13o545q181O372J426j677O909P84
5327D175l178J806J040Q32R30J72j0004j3037n921Q059O128l801j314J1538J6922
5312A4347l24j1623l185m151k684J4775K186K657K590m600p352r586k3P18l133
5297i388l843J0570MK061J715k538m008K321J911J856n616l536q3J922J309L86
$$ y = [14629, -3608, -6687, -5080, -1820, -2361, -4219, -7302, -17350, -14582, 1283, 14335, 10943, 2898, 270, 3131, 533, 2774, 4470, 4502, 2302, 842, -738, -2845, -2138, -1194, 3121, 10981, 7814, 2942, -1860, -11300, -21409, -18952, -11913, 1216, 3833, 6271, 10292, 11688, 8129, 10155, 12673, 10695, 3883, 4586, -1726, -4509, -2317, 7121, 1270, 1201, 261, -290, -4430, -9124, -8090, 4219, 13548, 7826, 839, -9091, -6640, -3185, -9581, -9169, -3340, 890, 4574, 5087, -1458, -9639, -3267, -1841, -3518, 3391, 4175, 997, 2803, 3843, 4675, 5605, 5777, -4227, -17264, -23185, -15126, -8998, -12799, -14113, -2575, 14347, 14023, 2400, -785, -4936, -7620, 7155, 9341, 11998, 14588, 9988, 2636, -6950, -6973, -6255, -9388, -13231, -2661, -2657, -596, 1119, -1419, -5427, -3106, -1195, 661, -4955, -8491, -8574, -6652, -5343, -4957]
5281d957K67J773m076l051L856O50K750J948J573L18J935l098k695j5392n080
5266b3279J0778J0421O265r210p861J560m429M258O573n551j443M818N276J395
5252d29K130J094k090L391k682l017l397M589j972Q1K671Lj005J188j877K255
5236I33M447K065r856O468L733j403l643M64L64j321J928K140N01p075o225R514
5220C034L866l086j789m513o912p552J102N879k12O65K521l27J522R155L037n073
5204A317r369l88K07k435J961q981M225Q339O48n58M506J884l271n42l398j642
5188g497L118M441k549j157R45k140j0201K843j155M361P152O895k977k628k736
5173c285m804j750o560m839Q606P275O373m030k720L370L514J2781K647j4804
$$ y = [-4957, -4690, -2917, -6993, -10044, -6188, -5538, -2788, -840, 733, 1051, 2986, -112, -2807, -18199, -23279, -12501, -2080, 4185, -5025, -12886, -11326, -15755, -11497, -4924, -10475, -11918, -7100, -1824, -429, 1701, 2795, 705, 4096, 1414, -1603, -5000, -411, -2383, -2302, 369, 372, -633, 555, -1322, 933, 5380, 7445, -2411, 4057, 7790, 6387, 2744, 3208, 3572, 2251, 4179, 6319, 6820, -255, -6480, 3034, 6900, 3814, 2025, -2488, -9400, -16952, -15850, -9971, -10183, -9518, -6997, -7324, -5802, 3353, 6390, 1317, -8052, -8440, -8233, -10668, -8707, -17688, -13463, -5124, -4476, -5034, -528, 1356, -1915, -2457, -5855, -7497, -4379, 62, -2487, -3644, -2699, -4839, -15040, -12197, -13352, -8991, -1839, 5056, 2079, -549, -3285, -8089, -9839, -16399, -21238, -12632, -5357, 1016, -3014, -5734, -2364, 1150, 13931, 16578, 1774]
5159A774o076P589O376J239q02p255l025J78P084Ok391Q56j73l17L071r664m492
5142f022O480P774l244l451o63n371m958k152N600P430p192j042J84M83L431j222
5126c935k216O838m814k754J159N178L953N371k525l996n067O416K699k840k217
5111A250N56j8K935M067m191r804o146P708P118K120L411k86n935n753q333m609
5095a5910R474J424l413j457O015N918m546m483N07m29L911L986L674m697n815
5080e841m173K914M94M289M825Q730q604m776K776P33M264K774m64j049n35j323
5064E034K913N382r79k495m626o49n406K058J0487J776n614p104k764K365m077
5049c699k460k406j614L904L229o761K841J4597K672L903K513j1175m636j451
$$ y = [1774, -4302, 3287, 9663, 10902, 10100, 2845, -180, -2, 7082, 7088, 4697, 5553, 5380, 5063, 8134, -1530, -6022, 458, 8232, 4988, 1537, 874, -4497, -9455, -11607, -6007, 1423, -5769, -6811, -6627, -6144, -2713, -3935, -6151, 687, -4127, -6881, -5722, -544, 3409, 8780, 6255, 2259, -2808, 3608, 6307, 3467, 1250, 1806, 1788, 4723, 8790, 4599, -5205, -11351, -3643, 3475, 5595, 9006, 8720, 2785, -2968, -11301, -15910, -6436, -5012, -8425, -9882, -3867, 2051, -2495, -6978, -6471, -6900, -2989, 997, 4671, -26, -5841, -10014, -7100, -6606, -2317, 2508, 11238, 2634, -2142, 634, 1367, 5631, 8405, 7941, 6892, 6357, 5034, 7947, 13329, 12350, 9855, 5229, 4580, -826, 1232, 11719, 13495, 7881, 777, -1987, 378, -3699, -6159, -8565, -10179, -6275, -3046, -9807, -6966, 7631, 10303, 14206, 16719, 5544, 908, -543]
5035e43L505p153k854q53n155L562K168L911N614o796j0981J195L09j935M48o039
5019b1597K683Q394M407l049l02M912O379N63l716M17P247L690J17l120n49J414
5003G890m03J618N712Q79o439j329M23R143J106j0616p438l630n500m894P495
4988e983N743L381L680k461m495n588n247P179j16l785K559O35p319K865O474
4973b478j646m792Q7R787P307K014O042j4165q901Q410R414q448p014o898l049
4958a4330J532N436N040p42j962K512L713Q386N331j0192j0727l72P920P924q158
4943A311m735N86k268M010M046m133o897L911P67Q425K899R398J089j151j1056
4928F202q632K770q77m08J0887P41j273P56m803J603j0611O26Q817K761j377J2349
$$ y = [-543, 2962, -4191, -7045, -7898, -13053, -9491, -7323, -3412, 2202, -4594, -15575, -14380, -14071, -16006, -15558, -21597, -18914, -10520, -6113, -9162, -9464, -4552, 1827, 2390, -1326, -909, 6338, 10028, 10145, 7025, 6476, 7890, 7487, 9105, 14817, 15696, 9257, 7928, 8351, 17494, 18600, 7984, 546, -3084, -8584, -13478, -5983, -240, 3141, 6821, 4360, -135, -5723, -10970, -3791, -3907, -7692, -5133, -4498, -11817, -8952, -2478, -4124, -8916, -8829, 958, 8265, 10279, 16321, 2156, -6745, 1665, 11079, 2631, -4383, -11281, -14330, -12798, -7362, -2322, -3064, -5026, -2514, 1199, 9585, 14916, 4724, -6003, -6375, 1545, 9469, 1311, -3424, -2838, -5106, -1096, 2950, -1183, -8080, -4169, -3402, 5023, 7922, 17320, 18409, 17258, 6202, -2430, 340, -537, -945, 9942, 10683, 9410, 10166, 5363, 6966, -3645, -3019, 5798, 8559, 7182, 19531]
4912A9531m94j2716j956m589j519J466p041l768l564j0054j0444J2338J1282J811
4898i717P267k220o781J354L960l826l220R89J3829K229N224n237p709j286R570
4883D426N589m979j1072k243Q781N722r29q910J109Q305j881L415j030o554o005
4868f256l534J0479R026m469P68L101r86j446j517q502o806M266K697o66L220
4853f25l216N094O886J95j0003j903K58K45O033N203R55m717K034K829p562k729
4837a023j145j590N864k926K388K170m876k642M436l640J236o33r78L044M338
4822D023n752J577K747J051k380p899l120R335k403l091m65N726k131N719J347
4807D284j89j794O06O212o81j503o736q755L85j676R228J0715n799p888R743R574
$$ y = [19531, 19037, 6321, 4365, -224, -1743, -277, -7318, -11086, -14650, -24704, -35148, -22810, -11528, -9717, -2450, -4670, -11451, -10097, -6137, -9963, -13183, -12194, 1635, 3864, 9088, 3851, -3858, -5144, 4426, 10015, 5036, -6036, -8279, 502, 6224, 5295, -3615, -2506, 5799, 3918, 7333, 6303, -251, -6256, -9790, 689, 9715, 5246, 6014, 9115, 8129, 6683, 5166, -3336, -10142, -5876, -3179, -3845, -625, -3841, 1253, 8139, 8334, -1669, -3572, -3314, -3069, 2964, 8167, 9122, 4405, 6439, 9268, 1706, -1023, -2168, -3758, 2106, -820, 1568, 3738, -1138, -3780, 656, -2984, -1748, -2381, -3359, -315, 4023, -1729, -152, 2595, 3646, 1266, -6633, -9753, -418, -2821, -5912, -6377, -651, -2782, 2937, 4284, 4095, 2301, 2907, 9119, 8438, 6935, 199, -8556, -8171, -9847, -619, 10096, 4297, -3591, 6152, 15726]
4791A5726k728L401j9k810j1687p919N174K288n257m2j59L20K379J389r12o19
4775a475L661O23m192r08M336J0163n072l155L011M691K820n75l866p616n120
4760b674L693K857q552Q995O84l379k424l552K245m654p115l363R078R106p987
4745g042K967j052l014J0342J2414o064o026N405o196M035N590m611k192k354
4731B202o844p902J111N140K325L837J196j1210m762P804M908k091N925o475j297
4716f133J380n304N63P50j838J503L658j195N695k706j049p050K100O210M050
4701F34N08j719K833l419N343N165k242m134m387R662N974l897p994m219Q165
4686F273r93j761R794m336j1828j0639M942J0317J1300N888k023m970j0154m817
$$ y = [15726, 12998, 16399, 16380, 13570, 1883, -6036, -862, 1426, -3831, -3873, -4032, -3712, -1333, 56, -856, -1475, 2186, 2809, -1383, -2291, 2045, 12208, 7136, 3981, 6992, 11683, 14503, 13928, 10062, 2446, -2674, 1019, 3876, -4676, 4319, 5003, 1624, -800, -4352, -2107, -6761, -13876, -17239, -8161, 945, -7042, -4075, -5127, -8141, 2201, 14615, 8551, 2525, 7930, 1734, 5769, 11359, 6748, 4556, 2202, -4642, -12544, -11433, -6293, -3968, -131, 1065, -10145, -14907, -7103, -2195, -4286, 1639, -4836, -6133, -4753, -10057, -9494, -8744, -10582, -9079, -5421, -6616, -921, -3627, -4676, -11726, -9626, -3416, 634, 1142, -577, 2256, -1163, 4180, 9345, 7103, 2969, -1418, 8244, 14218, 10321, 2327, -1892, 6273, 5280, 3519, 13313, 8977, -2851, -13490, -8548, 1769, 13069, 18957, 16934, 11964, 1810, -3007]
4672c007k155n635m991K221K232K526Q76O775R298l15j907K586K100j588o353
4657B663K962L190J680N714M994n349o56p699j725n024o292j111n964J932J0012
4642f73L940l451J204m256l370k995j704l457N03J1026J1922M28o708l094m08
4627a093N041P591o521n969n029O652J101J48M666j899K296o228o332m556P13
4612i419J1174M735J243O524K962n496p139q52l767j630J973L70k696k65l261
4597e544P81R675J91J181J1334m447q357K981o046n259j878L355L849j51P69l475
4581a041R460M094l874q142o105k624N599m454j232K7N430k384k177o905n38N662
4565i204N063N977k622o221m177K713K472M975O929L458k693O3R203K830l371
$$ y = [-3007, -5162, -10797, -15788, -13567, -11335, -8809, -7933, -1158, 8140, 7825, 5918, 8504, 10604, 9016, 2663, 5625, 8815, 10495, 16209, 21203, 15854, 15198, 7499, 5774, 750, -5542, -6653, -12617, -10685, -673, 3267, -184, 1020, -3236, -6606, -9601, -11305, -14762, -14259, -3233, 8689, 9117, 2409, -685, -1093, 3948, 11539, 5018, -951, -5980, 672, 1773, 1921, 6587, 4688, 6984, 756, -5576, -10132, -9419, 1755, 6490, 7733, 14257, 17219, 11723, 4584, 3732, -35, -1665, 308, 678, -2018, -2283, -5544, -4763, 4912, 5103, 6284, 17618, 13171, 4814, 7795, 1749, -3510, -5388, -2033, 1816, 1665, 2434, -1041, 8419, 12513, 8639, 497, -5608, -8232, -2633, -7087, -8319, -8292, -2862, -5246, -7423, -14328, -14866, -9204, -4141, 1836, -786, -7007, -11184, -8471, -5999, -1024, 5905, 9363, 6670, 6733, 15936, 18766, 15395]
4550A5395K163Q19m346m395j3763j0117J386J0887J2953J14l161N939l866j747
4536H261m69m04L36n776j1183l246Q50j62M30K920Q706J153n189K472m85m576
4520f362p578L89K106M107J103J784k042l102K700k525p01j54N254O193p53p190
4504f771M534J1261k127q232m830Q54K984Q426K855N09q978j761k304M659R308
4489A0387K511J952j3659p640j33J286j014M879K33k438k21j843l723j233P973
4474b683J0610L456K596R50l816j760l505j140n114j7014R27L533N567k933J946
4459h380L342m765L184K832R21M11k567j4102L657L378j438J865R44K404J875
4444f439J714k894N09p15L259O919L738k026j2726j3479L278L419K140M947R314
$$ y = [15395, 17558, 18377, 14031, 9636, -4127, -14244, -12858, -1971, 10982, 11096, 7935, 13874, 10008, 8261, 7792, 7388, 7724, 1948, -9235, -12481, -11631, -11793, -11363, -8443, 263, 1416, -3773, -1301, -1786, -6362, -13940, -13551, -11445, -7338, -6235, -4451, -6493, -9595, -6895, -9420, -10121, -10275, -5021, 1172, 419, -6771, -2237, 9024, 6897, -1335, -6165, -5311, -2327, 6099, 8954, 9463, 485, -1276, -3580, 1079, 10387, 12898, 14850, 1191, -6449, -6582, -5296, -6310, -1431, -1198, -3636, -3857, -5700, -9423, -10656, -2683, 7927, 11383, 13979, 14929, 11113, 9353, 5848, 4708, -406, -17420, -16493, -12960, -7393, -10326, -8380, -5038, -9803, -6619, -3787, -2866, -2455, -5022, -19124, -15467, -12089, -13527, -11662, -10718, -8314, -6439, -4725, -7619, -7110, -7825, -4566, 2353, 6091, 4065, -8661, -22140, -18862, -15443, -13303, -8356, 958]
4429I58L235p634o13J0722l20j0084N929K221M374K84m525q339m994l398O79Q975
4413b530m86P337R383r595m623M219M038o806l176J621N634R790L437J816M226
4398B4285p350j0099j0826j902o447j248K643j788rK828R593K335l504J1901J055
4383A1467m415m353l273l619M865P597J381L936j131j971M46N7p012n198K618
4368A395J317M081M501l183o347j3729M798M730J97l355J103O00m125n324k93
4353a3634M480M544j377O12L307r41j605M646L627J796L37Q644O071m607j625
4338A4275j365r488p778k67O944K236O903N333o187k481J533r122m644L549O606
4323F047j372m756l599K366J0147l419r845n27J776q29l793j081m090j650L883
$$ y = [958, 4193, -3441, -4054, 6668, 6348, -3736, 2193, 4414, 8788, 9072, 4547, -3792, -8786, -12184, -11505, -2530, -3016, 4321, 13704, 4109, -514, 3705, 7743, 937, -2239, -618, 5016, 14806, 18243, 20059, 24285, 16935, 6836, -3990, -5892, -12339, -13587, -10944, -12732, -12741, -9913, -320, 2015, -1489, 10412, 11467, 7052, 2699, -574, -4193, 672, 8269, 9650, 13586, 12455, 10484, 10930, 10987, 3975, -1223, 1395, 2712, 6793, 11294, 8111, 1764, -11965, -7167, -2437, -2240, -5595, -4492, -3892, -8017, -13341, -13634, -9154, -4610, -5987, -5375, -2068, -3009, -4614, 32, 3659, 5455, 5792, 14436, 20507, 15900, 14275, 12910, 3422, -4356, -4623, 2321, 4557, 11460, 16793, 10606, 8125, 9658, 536, -4108, -559, 6047, 4675, -81, -3680, -1314, 8833, 5414, -4431, -4958, -3182, -4011, -7804, -8885, -12975, -14625, -10742]
4308a0742P79N156N308J497l175L680J1311J593j0035n815K439J389M516J462
4294I363p926q074n151R912L017j473k650o52P927q6q22o079M103Q875O366j3341
4278C309r777L527N848j486O963n066l305n638n821O877j69m927M081O430l094
4263b248p283q421l409P154l044Q189K624J608L838K491k122k197J0563J560N1
4248I354m632l832P23J668r342r314O294N282q388K039O762O110m516k457p020
4233a1269q480Q557Q960L726L499N175m86n347m836o305K313J581n479M234R01
4218c256m870N114l617j0047l887J1534J6503k239n256L380R770m921k758Q032
4204A3482n727l209o167j847k448K090J1223N53O071J0680k610m773m499k389
$$ y = [-10742, -9963, -4807, 501, 1998, -1177, 2503, 13814, 15407, 5372, -443, 1996, 3385, 7901, 9363, 1437, -6637, -11788, -1876, 1141, -332, -2982, -3634, 4293, 4207, 3385, -2694, 1409, 10284, 16650, 3309, -6468, -2941, 2907, 1421, 8384, 3318, 13, -5625, -11446, -4569, -4738, -9665, -5584, 846, -2248, -9531, -17952, -21361, -14207, -17251, -9062, -6438, -4830, -992, 1499, -623, -2820, 7743, 9303, 9354, 4722, 890, 1613, 3281, -6061, -15375, -9081, -3799, -12187, -10148, -3386, 2724, -1792, -4249, -11269, -19749, -11192, -2232, 1494, 4993, 10168, 9682, 4335, -501, -6806, -4493, -2912, -8391, -4157, -3256, -8126, -3012, -6629, -16676, -20563, -9029, 7474, 5235, -21, 3359, 13129, 8208, 5450, 13482, 7755, 4546, -1621, -3468, -5916, -3826, 7397, 7950, 14021, 24701, 22091, 17318, 12819, 10430]
4190A0430o320n99j829o229l863O86p291L046K567M66k125m01K771L928J698k447
4174e512j3N069j463n913k539N696M250K121R06L316k723o812m62M205N794K474
4158H394j326k563j003K322o616m673R82N1J11J33P77P75J276P272M375o67k860
4141F760k768k551q8j419o186n58L979J798l50J1053K352l437p128q52K289l114
4125b20j907R26L142K400j768J146m042j023j71P152J0637m249q636l78L145k189
4109C965L894M577k396j2538m813p64n064j909J069L906j278L646j55L004J902
4094b954K472n755m530J571O596K762P978k964n217o2j55L330N530j96J246L502
4078A3154l718o484l366l823n825L793N147M463O754j243O195m936o836n218k44
$$ y = [10430, 4110, 3511, 1682, -4547, -8410, -7724, -15015, -11969, -9402, -8936, -11061, -11462, -8691, -4763, -3065, -5512, -5525, -456, -1919, -7832, -10371, -4675, -425, 1696, 2602, 5918, 3195, -3617, -4079, 126, 5920, 8394, 7068, 4505, 3502, 5824, -792, -5465, -4483, -4432, -4321, -4188, -3411, -2636, -1360, 5912, 10287, 9620, 6760, 3992, 1441, 1353, -66, -6252, -6810, -2831, -1033, -1383, 9670, 12022, 8585, 1457, 605, 2894, -220, -2127, -1201, 1941, 4341, 2573, 3719, -323, -1346, -1517, 5635, 16272, 12023, 3387, 3009, 6154, 3965, 7859, 12436, 10040, -2498, -7311, -8075, -13139, -15048, -13979, -10073, -11351, -7705, -7860, -4856, -2954, -482, -6237, -10767, -9196, -2600, 162, 8140, 5176, -41, -103, -258, 3072, 8602, 8406, 9652, 13154, 9436, 2952, -414, -4237, -10062, -6269, -1122, 3341, 10095, 8852, 15047, 10111, 3275, -1943, -2187]
4063b187R230K685l483o38J963Q29O045j2024m185K639L213J256j441N063J398
4048A0363n865n666k791n273M955j924l099k602P764J0496m91k425p693j21K273
4033b099J232L455K91q13J874l286l424o526P355R756k131o729n932K165Q85k866
4017f793N460L646J641n432N137J074N638M712n231m65r89j561k267n317J189
4002D42L163k223J331r7j352m232O172q91p661m546j810P418L932j326K69K280
3986H69m424m91L917j02k890n38j923J267R63j090P510k8M428J716k058p787r79
3969a640L966L299j658j902K393N140N478j162p33K780j62o965J817K754j978
3954A1427o079J437M785K108l19m754k398M098k610j530m83j042J142o610K804
$$ y = [-2187, 7043, 9728, 6245, 5607, 7570, 8399, 14444, 2420, -1765, 874, 4087, 5343, 3902, 8965, 10363, 4498, -1168, -3959, -9232, -4277, -6201, -9300, -11902, -4138, 6358, 5867, 3442, -4251, -4372, -2099, -867, 2588, 2879, 2066, 3940, 654, -2770, -9296, -1941, 7815, 5684, -1045, -6977, -4812, -3927, -6793, -1333, 2313, 3954, -1478, 3659, 4733, 10371, 15083, 9852, 9387, 8398, 6837, 4570, -747, 442, 3605, 1382, 2713, 2616, 1264, -2968, 3204, 2313, -5348, -9894, -11704, -4286, -354, -1680, -1411, 869, -3555, -4046, -129, -231, -3121, -3659, -5582, -4315, -3352, -4442, 3068, 3040, 7468, 9184, 7126, -661, -1640, 2326, 5625, 3967, 2065, 4458, 9598, 15076, 13914, 13181, 15961, 15799, 8834, 10651, 13405, 11427, 5348, 6785, 11570, 13678, 13359, 8605, 6207, 10305, 7695, 6165, 5682, 4640, 5782, -828, 1976]
3939A976j728k175o118N525K510n991M694L624o248m910R58J618k702k189K072
3924i084L635J2040J0086P64l834o297J767j30m157l610P05l347k185M029N849
3909F231R970p513k614P424N764k188m990n536L884O464j247K611n362p023M317
3894A0192n836l321L373l200l356N533l649p449j832J3441N932m007m414m86K074
3879B995l422P895M094o879n697K750p93K338j360l77J1490J0631N759j0311p590
3864A1523l375k969J161j551q603r332l788O17L70K622k867K118Q649J064o595
3849a0956J222R388N95j1364K203O435K174l707j574L802N64J011J30M027K621
3834F571o640m87L523P29L42k998m796R15J0273M990Nj694J384m714M485q780
$$ y = [1976, 248, -1927, -8045, -2520, -10, -6001, -1307, 2317, -3931, -8841, -7883, -6265, -8967, -11156, -9084, -5449, 6591, 16677, 17441, 13607, 7310, 9077, 8947, 4790, 1180, 1885, -1462, -3647, 382, 6231, 16201, 8688, 6074, 13498, 19262, 17074, 12084, 6548, 10432, 16896, 15649, 18260, 12898, 5875, 10192, 4356, 1035, 4408, 1208, -2148, 3385, -264, -7713, -9545, 3896, 9828, 5821, 1407, 921, 2995, -427, 7468, 11562, 4683, -1014, 1736, 943, 3281, 1921, 1544, 13034, 23665, 29424, 19113, 11523, 8148, 5179, 6340, 4789, -3814, -13146, -16934, -16317, -15947, -13325, -16192, -14074, -5425, -4361, -10956, -9734, -346, 249, -11115, -8912, -2477, -303, -4010, -5584, -1782, -1218, -207, -77, 3950, 6571, -69, -556, 2967, 3696, 4038, 1040, -3756, -2841, 7432, 12422, 12427, 10733, 12117, 7403, 11888, 3108]
3818C108l816q287n575P446Q917r52J083K230j1756j1952M256Q248J0409J212
3804D571j836J247M294m266m597o174J18M773l070l63p19P467J514m203P50k573
3788c067K132M873M467j402n100L187l669k980K113L009L680l298Q1O810l696
3773G140j283j011j0280l552k468m266K519K713P399P86n765K553L281L696l7
3758A425m203p650K703M267L278J2j0878k55J1489L912j061j482l478O84j992
3743c229K029L078m302q044L848M89Q66o930m98J0315l56L027K662N78M707N965
3727A4205m591N42k710p207M91K294k673l414P35M77J506K191O737Q470l664j2562
3711H27p910O262N375p475Q407J1429k372q489N747M097K675O30j4801p649j967
$$ y = [3108, -708, -8995, -14570, -7124, 1793, 841, 1924, 4154, -7602, -19554, -15298, -7050, 3359, 4571, 2735, 3982, 8276, 4010, -587, -6761, -6643, -1870, -4940, -5303, -6022, 1445, 2959, -1244, -494, -3067, -935, 3938, 8405, 7003, 1903, 5090, 1421, -1559, 554, 3563, 7243, 3945, 4026, 10836, 7140, 5857, 4846, -5434, -8986, -11454, -15720, -13201, -10488, -3089, -2303, -8068, -5515, -2234, 1462, 1425, -2778, -10428, -7725, -3458, -180, -168, -11046, -11301, 188, 4100, 3039, 1557, -1921, -1237, -3229, -1200, 1878, -2424, -10468, -6620, -6131, -5265, -12195, -12693, -2378, -2734, 293, 2955, 3533, 8240, 14205, 9614, 10156, 7446, 239, 730, 3024, 351, -3063, -2328, -1851, -345, 1846, 8583, 17053, 13389, 827, -7083, -821, 4554, -2921, 5486, 16915, 14543, 6054, 11801, 15898, 18573, 19203, 4402, -3247, -5214]
3696e214J357m447k084R593M327o415m442M12Q973L871j712l681l19L162k083
3681A298M092j628J709n888n593o368k083L189K282K459Q738J189j567L823J719
3666G371L500l465M197j970q414j2043m530M083P042J0779O556m369j0155j189
$$ y = [-5214, -3857, -8304, -10388, -795, 3532, -2883, -7325, -6913, 2060, 5931, 4219, 538, 219, 3381, 1298, 5390, 3762, 5471, -417, -6010, -12378, -14461, -11272, -8990, -6531, 2207, 3396, 1829, 5652, 7371, 10871, 7406, 11603, 9633, 1219, -10824, -15354, -11271, -4229, 6550, 13106, 8737, -1418, -2607]
$$ [...]
##END NTUPLES=NMR SPECTRUM
##END=
