##TITLE=Analysis number 328374
Compound Code cc 56203
Book Reference 513/84/2
Project Code adrs
Chemist Name ronp
##JCAMPDX= 6.0         $$ Bruker NMR JCAMP-DX V2.0
##DATA TYPE= NMR SPECTRUM
##DATA CLASS= NTUPLES
##ORIGIN= Bruker BioSpin GmbH
##OWNER= nmr
$$ XWIN-NMR		Version 3.5
$$ Wed May 30 13:09:24 2007 GMT Daylight Time (UT+1h)  MAYBRIDGE\nmr@NMR_250MHZ
##.OBSERVE FREQUENCY= 250.131544655141
##.OBSERVE NUCLEUS= ^1H
##.ACQUISITION MODE= SIMULTANEOUS (DQD)
##.ACQUISITION SCHEME= undefined
##.AVERAGES= 16
##.DIGITISER RES= 18
##SPECTROMETER/DATA SYSTEM= dpx250
##.PULSE SEQUENCE= zg30
##.SOLVENT NAME= CDCl3
##.SHIFT REFERENCE= (INTERNAL, CDCl3, 0, 16.522)
##AUDIT TRAIL= $$ (NUMBER, WHEN, WHO, WHERE, WHAT)
$$ ##TITLE= Audit trail, XWIN-NMR		Version 3.5
$$ ##JCAMPDX= 5.01
$$ ##ORIGIN= Bruker BioSpin GmbH
$$ ##OWNER= nmr
$$ C:\u/data/dgb/nmr/ADRS/1730/pdata/1/auditp.txt
$$ ##AUDIT TRAIL=  $$ (NUMBER, WHEN, WHO, WHERE, WHAT)
(   1,<2007-05-30 13:09:00.60 +100>,<MAYBRIDGE\nmr>,<NMR_250MHZ>,
      <created by zg, POWCHK disabled, PULCHK disabled
       configuration hash MD5:
       76 6E 9A 78 1E 09 19 81 EC 84 63 8F B0 6A 59 2D
       data hash MD5: 64K
       A0 9F 33 07 1D DB A2 D2 D9 2A A3 4B 1B DE A1 33>)
(   2,<2007-05-30 13:09:14.89 +100>,<MAYBRIDGE\nmr>,<NMR_250MHZ>,
      <Start of raw data processing
       ef LB = 0.3 FT_mod = 6 PKNL = 1 SI = 32K 
       data hash MD5: 32K
       10 91 1C 31 40 2C EC 91 5E 5F 1E B6 71 B6 79 B1>)
(   3,<2007-05-30 13:09:16.92 +100>,<MAYBRIDGE\nmr>,<NMR_250MHZ>,
      <apk 
       data hash MD5: 32K
       81 0C 53 35 67 3F BA CB 47 0E 94 9A 99 A5 71 21>)
(   4,<2007-05-30 13:09:17.82 +100>,<MAYBRIDGE\nmr>,<NMR_250MHZ>,
      <abs ABSG = 5 
       data hash MD5: 32K
       06 F2 BB D6 12 58 0B DA 01 7D CB 4E FF 26 2F 91>)
$$ ##END=
$$ 
$$ hash MD5
$$ 49 B4 5A 9A CB 76 ED F6 03 91 94 EB EF 6D D0 53
##$RELAX= 
##$RELAX= 
##$RELAX= 
##$RELAX= 
##$RELAX= 
##$RELAX= 
##$RELAX= 
$$ Bruker specific parameters
$$ --------------------------
##$DU= <C:\u>
##$EXPNO= 1730
##$NAME= <ADRS>
##$PROCNO= 1
##$TYPE= <nmr>
##$USER= <dgb>
##$AMP= (0..31)
100 100 100 100 100 100 100 100 100 100 100 100 100 100 100 100 100 100 
100 100 100 100 100 100 100 100 100 100 100 100 100 100 
##$AQSEQ= 0
##$AQ_mod= 3
##$AUNM= <au_zg>
##$AUTOPOS= <18 >
##$BF1= 250.13
##$BF2= 250.13
##$BF3= 250.13
##$BF4= 250.13
##$BF5= 500.13
##$BF6= 500.13
##$BF7= 500.13
##$BF8= 500.13
##$BYTORDA= 1
##$CFDGTYP= 0
##$CFRGTYP= 5
##$CHEMSTR= <none>
##$CNST= (0..31)
1 1 145 1 1 1 1 1 1 1 1 1 1 1 1 1 1 1 1 1 1 1 1 1 1 1 1 1 1 1 1 1 
##$CPDPRG= <>
##$CPDPRG1= <>
##$CPDPRG2= <>
##$CPDPRG3= <>
##$CPDPRG4= <mlev>
##$CPDPRG5= <mlev>
##$CPDPRG6= <mlev>
##$CPDPRG7= <mlev>
##$CPDPRG8= <mlev>
##$CPDPRGB= <>
##$CPDPRGT= <>
##$D= (0..31)
0 1 0 0 0 0 0 0 0 0.06 0 0 0 0 0 0 0.0002 0 0 0 0 0 0 0 0 0 0 0 0 0 0 
0 
##$DATE= 1180526938
##$DBL= (0..7)
120 120 120 120 120 120 120 120 
##$DBP= (0..7)
150 150 150 150 150 150 150 150 
##$DBP07= 0
##$DBPNAM0= <>
##$DBPNAM1= <>
$$ [...]
##$SUBNAM7= <"">
##$SUBNAM8= <"">
##$SUBNAM9= <"">
##$SW= 20.6930455092707
##$SWIBOX= (0..15)
0 0 3 0 0 0 0 0 0 0 0 0 0 0 0 0 
##$SW_h= 5175.983436853
##$TD= 65536
##$TD0= 1
##$TE= 683.16
##$TE2= 300
##$TE3= 300
##$TEG= 300
##$TL= (0..7)
0 120 120 120 120 120 120 120 
##$TP= (0..7)
150 150 150 150 150 150 150 150 
##$TP07= 0
##$TPNAME0= <>
##$TPNAME1= <>
##$TPNAME2= <>
##$TPNAME3= <>
##$TPNAME4= <>
##$TPNAME5= <>
##$TPNAME6= <>
##$TPNAME7= <>
##$TPOAL= (0..7)
0.5 0.5 0.5 0.5 0.5 0.5 0.5 0.5 
##$TPOFFS= (0..7)
0 0 0 0 0 0 0 0 
##$TUNHIN= 0
##$TUNHOUT= 0
##$TUNXOUT= 0
##$USERA1= <user>
##$USERA2= <user>
##$USERA3= <user>
##$USERA4= <user>
##$USERA5= <user>
##$V9= 5
##$VALIST= <valist>
##$VCLIST= <CCCCCCCCCCCCCCC>
##$VD= 0
##$VDLIST= <DDDDDDDDDDDDDDD>
##$VPLIST= <PPPPPPPPPPPPPPP>
##$VTLIST= <TTTTTTTTTTTTTTT>
##$WBST= 1024
##$WBSW= 4
##$XGAIN= (0..3)
0 0 0 0 
##$XL= 0
##$YL= 0
##$YMAX_a= 392662
##$YMIN_a= -260769
##$ZGOPTNS= <>
##$ZL1= 120
##$ZL2= 120
##$ZL3= 120
##$ZL4= 120
##$ABSF1= 16.522
##$ABSF2= -4.171173
##$ABSG= 5
##$ABSL= 3
##$ALPHA= 0
##$AQORDER= 0
##$ASSFAC= 0
##$ASSFACI= 0
##$ASSFACX= 0
##$ASSWID= 0
##$AUNMP= <proc_1d>
##$AZFE= 0.1
##$AZFW= 0.1
##$BCFW= 0
##$BC_mod= 0
##$BYTORDP= 0
##$COROFFS= 0
##$CY= 12.5
##$DATMOD= 1
##$DC= 0
##$DFILT= <>
##$DTYPP= 0
##$F1P= 14.0000005364418
##$F2P= -0.99999901652339
##$FCOR= 0.5
##$FTSIZE= 32768
##$FT_mod= 6
##$GAMMA= 0
##$GB= 0
##$INTBC= 1
##$INTSCL= 1
##$ISEN= 128
##$LB= 0.3
##$LEV0= 0
##$LPBIN= 0
##$MAXI= 10000
##$MC2= 0
##$MEAN= 0
##$ME_mod= 0
##$MI= 0
##$NCOEF= 0
##$NC_proc= -4
##$NLEV= 6
##$NOISF1= 0
##$NOISF2= 0
##$NSP= 0
##$NTH_PI= 0
##$NZP= 0
##$OFFSET= 16.522
##$PC= 1
##$PHC0= -56.66695
##$PHC1= 12.88283
##$PH_mod= 1
##$PKNL= yes
##$PPARMOD= 0
##$PSCAL= 4
##$PSIGN= 0
##$REVERSE= no
##$SF= 250.13
##$SI= 32768
##$SIGF1= 0
##$SIGF2= 0
##$SINO= 400
##$SIOLD= 32768
##$SREGLST= <1H.CDCl3>
##$SSB= 0
##$STSI= 32768
##$STSR= 0
##$SW_p= 5175.98343685301
##$SYMM= 0
##$S_DEV= 0
##$TDeff= 65536
##$TDoff= 0
##$TI= <Analysis number 999999
Compound Code 99
Book Reference 9
Project Code 9>
##$TILT= no
##$TM1= 0
##$TM2= 0
##$TOPLEV= 0
##$USERP1= <user>
##$USERP2= <user>
##$USERP3= <user>
##$USERP4= <user>
##$USERP5= <user>
##$WDW= 1
##$XDIM= 32768
##$YMAX_p= 289027859
##$YMIN_p= -259711
$$ End of Bruker specific parameters
$$ ---------------------------------
##NTUPLES= NMR SPECTRUM
##VAR_NAME=  FREQUENCY,     SPECTRUM/REAL,   SPECTRUM/IMAG
##SYMBOL=    X,             R,               I
##VAR_TYPE=  INDEPENDENT,   DEPENDENT,       DEPENDENT
##VAR_FORM=  AFFN,          ASDF,            ASDF
##VAR_DIM=   32768,         32768,           32768
##UNITS=     HZ,            ARBITRARY UNITS, ARBITRARY UNITS
##FACTOR=    0.157963299565203, 1,           1
##FIRST=     4132.6476996994, 0,             0
##LAST=      -1043.33573715361, 0,           0
##MIN=       -1043.33573715361, -259711,     0
##MAX=       4132.6476996994, 289027859,     0
$$ Real data points
##PAGE= N=1
##DATA TABLE= (X++(R..R)), XYDATA
$$ [...]
26391B6703J3766l8762L735K6791N9531J1967J1411J3746p7412k1068K229k8877
26379C760m7242q112l2905J5250J4069j0113N5342P7212k5042P867n4258N64K4804
26366B1196N4557M3074O0l5399n0829q35n131o5489m4264m275K1100j6205n042
26353h7482M4687l7144M430K6066J3395N2859J767R791k321p5520m1957R5331
26341C902O0930p7491j4970N1321Q660k4905o8715k3457N0940k2272l45M684l266
26328e4984N023N2406K3165n3685M1335q67O529L6807J0567O4857j5467j21814
26316f128k4596J4768M497j3272P247N4907N935N166L866k1558N202R362p5635
26303c0239n4266n4322O4681O1528r826r9675J9354K8306K930L5357N0553k1967
$$ y = [26703, 40469, 1707, 5442, 32233, 91764, 103731, 115142, 128888, 51476, 30408, 32637, 3760, -43482, -51594, -84499, -69249, -55180, -65293, -9951, 67261, 42219, 50086, -4172, -3608, 21196, 75753, 118827, 118887, 83488, 32659, 31824, 26693, -38796, -83060, -87335, -66235, -82440, -87482, -42795, -79939, -75509, -49443, -36048, 16811, 18578, 28369, 26048, -49472, -91429, 3902, 64832, -12659, -27629, 23692, 32352, 7447, -61268, -84725, -33785, -56057, -56402, -51718, -54984, -49961, 2445, 25610, -28075, 13260, 12393, 18922, 55729, 66296, 131153, 115686, -6128, -30724, -15956, -11459, -24731, -17484, 37423, 43358, 48524, 52390, 30832, 36034, 45396, -30239, -84505, -138827, -74146, -12618, -22444, -122119, -102765, -74459, -71529, -36172, 14381, -7586]
26291g586o2301k3123L2693L4525l5817l5146O1462O0956q4432J0803M6237L2318
26279C0589j0736J0865j7226j3964n1924q070n395J1833L9400j0617j1092m0148
26267g6485j8628J03460J00399k4745m4509m0454J3580O63P649L1790k7455o9584
26255d4319k4249K8518K1678o3246r65K0334J3644L013m2783K2081R4092R296
26243C7094l4926l1975Q3526l2q1730j0002M2480J054J1163J278L3985l3180n7610
26230c8875r4695k219M8357N4022O3929k5404j3361k6079j2192o5037k2726K5440
26218a08840R6877R923N856j7457L295K5580L1420J8845L556n1705l0298o1271
26206g4219M000o0340O488Q4689K5402o714J8277K4185J2202j076l1234N5527
$$ y = [-7586, -69887, -93010, -60317, -25792, -61609, -96755, -35293, 25663, -58769, -47966, -1729, 30589, 19853, 30718, 13492, -472, -52396, -60466, -65861, -54028, -14628, -25245, -36337, -76485, -95113, 8347, 108746, 84001, 39492, -962, 12618, 13281, 20930, 52720, 25265, -44319, -68568, -40050, -18372, -81618, -82583, -62249, -48605, -45592, -88375, -66294, 27798, 37094, 2168, -29807, 53719, 53687, -28043, -38045, 4435, 5489, 16652, 17930, 51915, 18735, -38875, -133570, -135789, -87432, -33410, 30519, 5115, -8246, -34325, -46517, -111554, -134280, -108840, -11963, -2040, 3816, -13641, -10346, 15234, 46654, 65499, 69055, 17350, -12948, -74219, -70219, -130559, -124071, -39382, -13980, -20694, -2417, 21768, 33970, 32894, 1660, 57187]
26194E7187J030o8356r137l599n448m0249r60Q3880M8823N2334M669j02863n9307
26181d1996k3674r052O1370N6847L1070J334j5581O548L0532J3571m3238N2230
26169A19961k6417n1376k5051r94P439j4639k3827N5633M0949j0165k2798j7569
26157C1146p7648n9521m463J11740J1610q5608N7358K8331K2194M9016j6686l1311
26145C6158M6036j269n2645P006Q742K4825Q267o2675k4582m608o9626n0905r40
26132a36216P4783Q244p1439j3980J0806M0152K7536M6850j948J4786K0018l7714
26120a8122p9645N9054M8399k0945P7943J6964o8105p8791l6723k0098J01740
26109a8329K4975m7809J2257l189K1388K745j4283Q9579J739O841l2325L4524
$$ y = [57187, 58217, -10139, -19276, -22875, -28323, -68572, -69532, 14348, 63171, 115505, 120174, 17311, -41996, -65670, -74722, -13352, 43495, 74565, 75899, 60318, 66866, 97398, 110969, 67731, 119961, 93544, 42168, 17117, 16123, 23562, 8923, -14904, 40729, 81678, 71513, 48715, 31146, -46502, -106023, -110486, 1254, 12864, -72744, -15386, 12945, 35139, 84155, 67469, 36158, 82194, 80925, 28280, 35286, 44028, 68853, 77120, 14445, -10137, -14745, -84371, -135276, -136216, -61433, -53189, -124628, -138608, -127802, -87650, -60114, -13264, -15212, -426, 19592, -18122, -97767, -38713, 9686, -11259, 66684, 83648, 15543, -63248, -99971, -120069, -18329, 6646, -41163, -28906, -32095, -10707, -7962, -22245, 67334, 69073, 75914, 43589, 78113]
26097G8113M821q667n2554j3494n6155o3795J792J2774P259o968K3360M1505k8134
26084f0143j0292N8949Q8115l6040j02035J4510K5367K7851L9127j2098k3257
26073A0054m4329l602p197J5988k2831j2718l9726r0285P3104J02417M5659k4443
26061B091K6182N8089p6917o9465k5400N3623N6236M0308m2544o6069J1128J0363
26049b2375M4098M5238n2184o7324j0161q805k5495L2106n669m6727J5464J00338
26037a496m6780k712n846n7730n698L643q306J0582O8572l6291n8396N8796P6201
26024e461K1791J4857K696j9304l4109J5148O5053l3837m6713j0960j9019P3809
26012B3951K0717P560m9070J6934M2279N0150L893j18561k1684M5668J5746m3541
$$ y = [78113, 82934, 74267, 21713, 8219, -47936, -111731, -109939, -97165, -89906, -96874, -73514, -32009, -60143, -70435, -11486, 76629, 40589, -61446, -46936, -21569, 6282, 45409, 33311, 10054, -34275, -37877, -45074, -29086, -51917, -64635, -104361, -194646, -121542, -19125, 26534, 2091, 28273, 86362, 9445, -60020, -85420, -31797, 24439, 64747, 22203, -43866, -32738, -22375, 21723, 66961, 14777, -52547, -62708, -71513, -97008, -64902, -70571, -117298, -101834, -1496, -48276, -50988, -56834, -114564, -120262, -116619, -124925, -114343, -45771, -82062, -140458, -81662, -5461, 16330, 31187, 33883, 14579, -19530, -4382, 60671, 26834, -19879, -30839, -49858, 23951, 44668, 52228, 3158, 20092, 62371, 112521, 116414, -2147, -23831, 21837, 37583, -5958]
26000e958k34K4892o406Q555n2492p6526N3593R521m5625j4272K2503O3022J51
25987a9276k4951m8909R390O2510k7394j2292J4924K1334r55l4901K1891J1308
25975b7321j4828J9604J3975l6416k1129j0777Q519N3658M2032N228m1709m701
25963a3865n8984J3955R8651L1325j06011l3367n456k729K4486J5380O9986M4402
25951G7773r879k5862k744K4143m74l0790o9873n0741n381O6730K9840L4507K9559
25938F6808J8831o3163p1717l8158J0811K4969L2186j7135K4264k9685p4724j8366
25926a35079L7880R6448J8925K0862P031m329o2588k1031J2645O202L7197N1841
25914F6004j6555m0235o3076j8399K816k7722P697M2017O3873L0345k3375K4669
$$ y = [-5958, -6192, 18700, 12294, 20849, -31643, -108169, -54576, -45055, -90680, -104952, -82449, -19427, -19276, -44227, -93136, -83746, -21236, -48630, -60922, -45998, -24664, -25619, -60520, -38629, -27321, -42149, -22545, -8570, -44986, -66115, -76892, -68373, -14715, 27317, 32545, -9164, -13865, -72849, -58894, 39757, 71082, -34929, -68296, -73752, -76481, -51995, -36615, 33371, 77773, 67894, 42032, 39288, 63431, 62957, 32167, -37706, -88447, -93828, -27098, 2742, 37249, 66808, 85639, 22476, -49241, -87399, -76588, -51619, -19433, -36568, -12304, -41989, -116713, -135079, -97199, -751, 18174, 39036, 46067, 41738, -20850, -41881, -29236, -23034, 14163, 66004, 49449, 9214, -53862, -72261, -69445, -97167, -89470, -47453, 16420, 46765, 23390, 48059]
25902D8059k3099q158J9734k5695L3671J2233k3770J6075l7130p8233N7222P118
25890a973Q069l6020m1955R817J08751K674l6431K4696J1202l6659l0045M5835
25878B7961O128l0299N4974j1074j1104o3389k5606k0120n969j5318N0509L7386
25866e921p4673l3405Q7926P095j7234K8740K3917l156L0617j6611k9207M3554
25854D1642q120n1291j1544J4500N4907j4751j1569Q812j2740m2891N1105O0267
25842G8327J8066N7164o5168p2850l194p1045q331K3984K7038M4070M9530n3870
25830B3721l6165N176k0305K3715j637o148O7382O3033m3154n6734r306M4747
25818E4325j1110j3074l4971o244K9259Q2856K6860j9802q2012k1986L95K3365
$$ y = [48059, 24960, 16802, 36536, 10841, 44512, 56745, 32975, 49050, 11920, -66313, -9091, -1973, 6096, -29924, -71879, -62062, 46689, 49363, 12932, 37628, 48830, 12171, -17874, 27961, 34089, 3790, 58764, 47690, 36586, -26803, -52409, -72529, -78498, -93816, -43307, -5921, -80594, -113999, -26073, -18978, -36212, -7472, 16445, 13289, 43906, 27295, -1912, 41642, 33522, -17769, -29313, -14813, 40094, 25343, 13774, 22586, 9846, -33045, 18060, 78327, 96393, 153557, 88389, 15539, 12345, -58700, -67031, -43047, -16009, 28061, 77591, 23721, -12444, -7268, -27573, -3858, -5495, -11643, 55739, 118772, 75618, 18884, 9578, 54325, 43215, 30141, -4830, -11074, 18185, 101041, 127901, 108099, 26087, 4101, 4496, 27861]
25806B7861p0464K1691M9137j62l1562k8682k364l475K0996J1394K3128l0836
25794a3338o4698q628J2622L9336J4820n5642N718R990K1931m6273m60M4436K215
25781c7971l7694P2121L7343L3155l9475o571P045r807J6564K2352o5691P8879
25769G0250K5808m6260o2869r2048o435N51j611L1305J0545P08O5288N4884K2231
25756G2347O9523k1288n2903m8208o4441J3279P1761M2867m1867O1848O443q744
25744A00617n1368k0609K2618P2116J245l7899j8128q2402m2105J5246J299N0417
25732A1047O466P343m9388j1073j2459O0723j4410K7653O1490l9473j4697j2527
25720B0695j4341r0110k218l0932l3201M925M2064q732M0250L2999M8100P7998
$$ y = [27861, -42603, -20912, 28225, 28063, -3499, -32181, -34545, -38020, -17024, -5630, 17498, -13338, -78036, -86664, -74042, -34706, -19886, -75528, -69810, -59820, -37889, -84162, -84622, -40186, -37971, -75665, -3544, 33799, 66954, 27479, 20908, 27953, 18146, 34710, 57062, -8629, 70250, 96058, 49798, -13071, -105119, -111554, -111003, -112614, -81309, -70764, -70056, -4768, 50116, 72347, 141870, 120582, 67679, 19471, -44970, -31691, 40070, 82937, 41070, 102918, 109361, 100617, 49249, 28640, 51258, 123374, 124619, 86720, 68592, -13810, -55915, -40669, -39370, 11047, 17513, 24856, -24532, -35605, -48064, 12659, -1751, 25902, 87392, 47919, 33222, 20695, 6354, -83756, -85974, -116906, -150107, -145182, -103118, -111850, -71600, -38601, 9499, 87497]
25708H7497l0833l8029Q0587M9225m9394N446o2282o071p717L5545j9409l7458
25696G107o553p542L9079j8580K6119N5498O8497q129m3306K6868m6249n2878
25684C9931k816L2066j2400r002J0539p937k6736k2177k5879J2321k337N1648
25672C7221J7274l0391R729p2120q2744L4788L8767L5121j2849j3530M4997N8664
25660F4927L8988l2382J5282k5411m1519k3560k9480l2543l0589N6033J1571o4038
25648i2721P757L8697j71J2167K3961J4940K1987K2662J830l9694j8236m3969
25636e0790q635N1234n6959K2065N953P795O6001Q7487l3075o6380k3610m5898
25624d4812m6229k0034L3834N889O0093r788r539m7355M0181O8960j5418m6675
$$ y = [87497, 56664, 18635, 99222, 148447, 99053, 104499, 42217, 36146, 28429, 63974, 44565, 7107, 554, -6988, 32091, 13511, 39630, 95128, 163625, 155496, 112190, 139058, 92809, 39931, 37115, 69181, 56781, 47779, 58318, 50381, 23645, 1468, -24411, -12090, -14427, 37221, 54495, 24104, 33833, -38287, -121031, -86243, -47476, -12355, -25204, -38734, 6263, 64927, 103915, 71533, 86815, 61404, 19885, -3675, -33155, -65698, -96287, -40254, -28683, -92721, -84964, -46267, -46438, -34271, -10310, 4630, 26617, 49279, 51109, 11415, -6821, -50790, -59425, -8191, -65150, -43085, -37132, -29337, 36664, 124151, 91076, 24696, 1086, -44812, -91041, -111075, -77241, -71352, -11259, -21047, -30586, -77941, -37760, 31200, 15782, -30893]
25612c0893Q6278J4440o0185r161M4941m8647j7673k7714M4278L9048J6471n464
25600D5719k5178P7940J17253j160k3465o9630l0319p1725M18k2567l8076l7004
25588g7794J3242j4833Q3421L0989l6511k2896R01q2295j2847N0657J19940K0920
25576G2894m6843k8533M7590k7662j6248N376L1076O1956l3592K8646m3959l3596
25564A7105j526j7687l3471j7351L0526q444l894m051o3759o6606m3012N4122
25552a58048N4068P6329q808m2874N4369M1159J581j3793n1427l4768k2197O6817
25540c7592Q1175Q56l3600r384L3933l9948l5666p424m0735j828M8699k0442J0271
25527e1685K0178o1222L1486Q6504J9859O210P735j5940n857n4859o8799J626
$$ y = [-30893, 55385, 69825, 9640, 479, 45420, -3227, -20900, -48614, -4336, 34712, 51183, 45719, 20541, 98481, 215734, 214574, 191109, 121479, 91160, 19435, 19853, -2714, -40790, -77794, -64552, -79385, 4036, 35025, -1486, -24382, -23481, -105776, -118623, -67966, 51974, 72894, 26051, -2482, 45108, 17446, 1198, 6574, 37650, 99606, 66014, 94660, 50701, 17105, 15579, -2108, -35579, -52930, -22404, -30848, -34742, -38793, -102552, -169158, -212170, -158048, -103980, -27651, -36459, -79333, -24964, 16195, 17776, 3983, -47444, -82212, -104409, -37592, 43583, 44439, 10839, 1455, 35388, -4560, -40226, -47650, -88385, -90213, -41514, -61956, -51685, -31507, -92729, -61243, 25261, 45120, 51330, 59065, 43125, 37268, -17591, -86390, -84764]
25515h4764N0159m6122l7450N0776N9377P8773j513j24611K1975M9972j1914o3327
25503e8669j6400L503L514m4777k0362k2654n622J5979Q1093J14197M1622j01536
25491a0112k3858k444l5431R812L8396K79P582L9680L0562K118o9871m5390q5985
25478a44662n2409M8053L892J6090O012O2736M849j03531L6537R5797l028l0823
25466f0487J3072K6311l3293l6300n16j069N6097J8047J7475O123k187M5504k1058
25453B7719o2234K5302K9348n303r8780j986Q3090P0723m1148n9952R746L4801
25441A1326j4589k5457J2228j600j0159k8471k0197j3232n745Q5263P5692N4889
25429A19948N138l4875k1342o1993j343J6643M3649p7553n5479O675m320K5565
$$ y = [-84764, -34605, -80727, -118177, -67401, -8024, 70749, 69236, -55375, -33400, 16572, 4658, -58669, -75069, -71566, -68052, -112829, -133191, -155845, -161467, -145488, -64395, 49802, 91424, -10112, -33970, -36414, -71845, -62033, -23637, -23358, -15776, 23904, 54466, 56584, -13287, -58677, -144662, -197071, -149018, -145126, -129036, -123024, -60288, -55439, -158970, -122433, -26636, -29664, -60487, -47415, -21104, -54397, -90697, -91213, -92282, -36185, -18138, -663, 5460, 3273, 48777, 27719, -34515, -9213, 20135, 14832, -83948, -85934, -2844, 67879, 26731, -33221, -23475, 11326, -3263, -28720, -16492, -18092, -28251, -56722, -76919, -90151, -95896, -10633, 65059, 119948, 125086, 90211, 68869, 6876, 5533, 22176, 65825, -11728, -67207, -60532, -64852, -39287]
25417c9287M2459K4963j5273l9088L7968M6869k322k865j6704K9808N4987M94
25405A22009r607n07J9015n6299k7886k0511l7777J7902n3713m4279j74M8234
25393d3593L138k9031L2472K0523m9073K0781N6927O1696m673q888j8854l1185
25381A0240J097K7889l72J4374p7387p125O529M2934L1734o6409j4612k2084k3816
25368g7008k9675K2299O5906j8139P385M2607M1197q727m1045k4175O598J7695
25356D918m728J4509M1154q521o7336J6306Q0313m6304q3167o8781l4719P7277
25344g9079Q1414j6575r600j7156J4270M628k4487K6761M939n0577K7697M2105
25332D340j2840Q4810L356q3933P738Q5699J9008j00291j8057k6476o5908j218
$$ y = [-39287, 3172, 28135, 12862, -26226, 11742, 58611, 56289, 53424, 36720, 66528, 121515, 122009, 112402, 111895, 130910, 74611, 46725, 26214, -11563, 6339, -47374, -91653, -91827, -43593, -40455, -69486, -37014, -16491, -65564, -44783, 12144, 73840, 69167, 60279, 41425, 10240, 11337, 39226, 38854, 53228, -24159, -31284, -24755, 18179, 49913, -16496, -31108, -53192, -77008, -106683, -84384, -18478, -36617, -29232, 13375, 54572, 45845, 4800, -19375, -12777, 4918, 190, 14699, 55853, 47332, -20004, -3698, 76615, 30311, -52856, -121637, -156356, -79079, 2335, -14240, -23840, -40996, -26726, -22098, -46585, -19824, -14885, -65462, -37765, 4340, -8500, 76310, 79666, -4267, 3471, 89170, 108178, 7887, -10170, -36646, -102554, -103772]
25320a03772k3962M671N3831O6893M1820R382o6183J0022n797P9288M4837k8039
25308H2991m8480m6947j6572N9847k014Q56m9979K8635P844R473k7443j10198
25296a11987J7302N6039O6936K6417k3372m1034p9851q8670j9241J8509P5030
25285a03922P4908L737J1962J2751k4578K312k3221Q992M9078O8446K4772n0061
25273E5176m6991k6127R493L2508O9822j9442j07141m5162m896m440L2468J00623
25261D5891K9587N422j03554J785K5307n759q419M1721m1865m292J8195O3686
25249F7705M554k8771L5583j0329N3618l6128k8910J3901l5508j15334o1499J4128
25237a26990R7266J02521j1134j0140k3722k3668P01K1428k0788o0679k1360j4739
$$ y = [-103772, -127734, -123063, -69232, -2339, 39481, 48863, -17320, -7298, -13095, 66193, 111030, 82991, 34511, -12436, -29008, 30839, 28825, 29681, -20298, 8337, 16181, 25654, -1789, -111987, -94685, -38646, 28290, 54707, 31335, -9699, -89550, -178220, -197461, -178952, -103922, -29014, -25277, -13315, -564, -25142, -22830, -46051, -37059, 12019, 80465, 105237, 55176, 8185, -17942, -8449, 24059, 93881, 74439, -32702, -77864, -82760, -87200, -54732, 45891, 75478, 80900, -22654, -20869, 4438, -1321, -9740, 31981, -9884, -14176, 4019, 67705, 72259, 43488, 79071, 68742, 122360, 86232, 57322, 71223, 35715, -79619, -141118, -126990, -29724, 72797, 61663, 51523, 27801, 4133, 4834, 26262, 5474, -55205, -76565, -91304]
25225i1304K5691L5041j5814j1140k3227J511M9832K7825J2685O2891J4314l4835
25213E3470n4127M6276L9735K7029j4811J7879r465o2176o2999j3820L3378L7971
25201C8340K0539l3720K0865k706k4997n5307L9899p577l1130m7585k0310J8075
25189h5614M2257j2764Q525N2963O5501O629M535m2896j5102k5633r1268o6660
25177a59527j1668N4533O1984P3445J2399j5485O1622j7540m2773L9929K2047
25166G8966k8061n4902J1559O793J1335j5917K2935M8638K1846j28009n3748j803
25154h0368j5820L5968J06762K6502n6312n860p380j4177l4114m9013j8333L1055
25142h1090O1708K3655n1442o4538j0475n962M34J2546O9654N7178l719q30R5664
$$ y = [-91304, -65613, -30572, -46386, -57526, -80753, -79242, -29410, -1585, 11100, 73991, 88305, 53470, -657, 45619, 85354, 112383, 97572, 115451, 105986, 43810, -19189, -33009, 369, 38340, 58879, 25159, 46024, 43318, 18321, -36986, 2913, -4664, -35794, -83379, -103689, -85614, -43357, -56121, -47596, 5367, 70868, 77497, 82032, 39136, 24034, -1599, -92867, -159527, -171195, -116662, -54678, 18767, 31166, 15681, 77303, 59763, 16990, 56919, 78966, 50905, -3997, 7562, 14355, 25690, 9773, 32708, 81346, 103192, -24817, -78565, -80368, -96188, -60220, 46542, 73044, 16732, 10872, 3492, -10685, -44799, -93812, -112145, -81090, -19382, 4273, -47169, -111707, -122182, -128144, -127710, -115164, -45510, 11668, 7949, 7119, 102783]
25129A02783L6259o6082n6903m8889k4541L3152J7861P939L204j0242N1003J0700
25117E6244J1542j0566N480K9563J3500n334k7368L906o3691m7180L1323n532
25105h113j7945J7311K830l8030q674m5867m7918L1128N6114o112l4259l6585
25093a36120K4771N1375j5360O2057k2087M182P0134K5921n4170n37k888K1888
25081B9166L4442O038R221K0339n0909l3879p2264J1497J4914M1353L7325K6311
25069G3554m7246J8653K1966j0152J8201J44J9459N3640j5941k5975l5407n3526
25057A7370r0865k7145M4164M8397O0121j4096l4495M4767j0597l9872l5751n2910
25045i0912j8988Q7632O607k7909l2532n3919K0676M9176J3502K4208Q677R775
$$ y = [102783, 139042, 72960, 16057, -32832, -57373, -24221, -6360, 1579, 4783, -5459, 45544, 56244, 67786, 57220, 62700, 92263, 105763, 100429, 73061, 76967, 13276, -33904, -2581, -8113, -26058, -8747, -5917, -43947, -52621, -98488, -146406, -115278, -59164, -65276, -99535, -136120, -111349, -59974, -75334, -13277, -35364, -31182, 38952, 64873, 10703, 10166, 7278, 29166, 63608, 69646, 78867, 99206, 48297, 14418, -57846, -46349, -31435, 9918, 47243, 73554, 26308, 44961, 66927, 56775, 74976, 75120, 94579, 148219, 132278, 106303, 70896, 17370, -73495, -100640, -56476, -8079, 52042, 37946, 3451, 48218, 37621, -2251, -38002, -90912, -109900, -22268, -15661, -43570, -76102, -130021, -109345, -60169, -46667, -22459, -13782, -4007]
25033d007o0604J8454L9112O5733Q135n3468K791l3604M9981q874n4191n5438
25021h5980q1787L6175M3735K8177O9106P7333m2062m7122m0727k9213P264K9166
25009c5935j168j1919L1963K0948l1362j2965l8920n0970M5706J32795R1757J252
24997A41182Q1199m8228n1705k6227m6513p043O1188l7972l6711l5753m4238k8876
24985g9697n525L7551N9491L8409r5796l3353M7410J017J03268j1867m8919J3997
24973B5986l4008K0430J7220j1767n7945m795n860J7174P276p087M8876J5703
24961C1203M4353j6928k1158k8008n5446N2861P9653k502m4315L7077j0223l7813
24949B8754N768m5110j7224L4389l395J1179l4442p03J953K5630P2239L3350K0377
$$ y = [-4007, -64611, -46157, -7045, 58688, 66823, 13355, 16146, -17458, 32523, 23649, -30542, -85980, -167767, -131592, -87857, -59680, 9426, 86759, 44697, -2425, -43152, -72365, -65101, -35935, -37103, -49022, -17059, 3889, -27473, -40438, -79358, -130328, -84622, 48173, 139930, 141182, 222381, 174153, 122448, 96221, 49708, 42665, 103853, 65881, 29170, -6583, -50821, -79697, -85222, -47671, 11820, 50229, -45567, -78920, -31510, -30493, 72775, 60908, 11989, 25986, -8022, 12408, 29628, 17861, -40084, -44879, -50739, -33565, -26289, -33376, 15500, 31203, 75556, 58628, 37470, 9462, -45984, 6877, 86530, 84028, 39713, 76790, 66567, 28754, 34522, -10588, -27812, 6577, 3182, 14361, -20081, -20784, -18831, 6799, 79038, 112388, 132765]
24936A32765j9199p4687o0524m4326R964J7115J9221K456M2315n1583J9092m9698
24924e7089M9403O5811m3749j28200n5976O6029O0987n58J2368m1673p1361M2532
24912a01476R7207j8188n598n4925j170R527O8002L1260J6706j0210J5920m9639
24900b584p776P6344k8005k9975o1051k3952P6304o454k6088O6754K3671K6393
24888H3581K076j1336N8631L6470o2926j45076l7886R1213r554n5738J8702J7246
24876a4597P100M3312K8964j4973J4664m383q238p8754o2027K3434J5257J7250
24864c2991q150N2487O268m648j4667j9484L0683p0865k2019M8822O7374l8679
24852e869o2827k2918L3995N3322p379j6010R932P0257j4252m0414p176N90q8812
$$ y = [132765, 113566, 38879, -21645, -65971, -56007, -38892, -19671, -17215, 25100, -26483, -7391, -57089, -7686, 58125, 14376, -113824, -169800, -103771, -42784, -43342, -30974, -72647, -144008, -101476, -4269, -22457, -28055, -82980, -84150, -74623, -6621, 24639, 41345, 31135, 47055, -2584, -10360, 65984, 37979, 8004, -53047, -76999, -695, -7149, -33237, 33517, 57188, 83581, 85657, 74321, 132952, 169422, 106496, -38580, -76466, 14747, 5193, -50545, -31843, -14597, -7497, 35815, 64779, 49806, 64470, 60087, 51849, -26905, -88932, -65498, -50241, -32991, -41141, 11346, 17614, 12966, -1701, -21185, 9498, -61367, -83386, -34564, 32810, -5869, -68696, -91614, -57619, -4297, -11676, -27686, -17754, 52503, 38251, -2163, -9339, -8749, -97561]
24839i7561q7519M7255J22538L8848l241k7499m0158j720n4233N7158K0768P908
24827a7456L2404j2216o0584p3338M5379M0022O5300J3903M701j0062l3268j956
24815g171K4252j0247J0046R972J2223N9767l6393o3536k1150N4091O3653M9916
24803A45423R346o8126l9171J9288l6673o7596n7626P7969J06175o8346l3741
24792a3078N5694K3218q2998m8712k034M5943n2865n3566L7373q596o445M3521
24780f2545L4417p569j3324q730l2308L9516R0940K2969n0025n2324J6991K5369
24768C377j6566J5452j2721l3183J0408N47j5451Q9201J8636m3882K0232Q924
24756D4974m2849m050l2551R444K0301k0260l4891J281K6045M2099L0569j0614
$$ y = [-97561, -185080, -137825, -15287, 23561, 20320, -7179, -47337, -49057, -103290, -46132, -25364, -17456, 14948, 2732, -57852, -131190, -85811, -45789, 19511, 33414, 38115, 28053, -5215, -7171, 17081, 6834, 16880, 26852, 39075, 98842, 62449, -1087, -22237, 31854, 95507, 145423, 154769, 86643, 47472, 66760, 30087, -37509, -95135, -17166, 89009, 20663, -13078, 42616, 65834, -17164, -65876, -67910, -21967, -74832, -128398, -91025, -99621, -106066, -62545, -28128, -35697, -49021, -57751, -90059, -50543, 40397, 63366, 13341, -38983, -21992, 3377, -13189, 2263, -10458, -43641, -33233, -32686, -48137, 41064, 59700, 15818, 36050, 44974, 2125, -1925, -34476, -25032, -4731, -24991, -59882, -58601, -32556, 9543, 40112, 29498]
24744B9498j6848l6568N4880N2622l7480k5628n8274K4787K933k0978n6409L0832
24732e6633k3390n0036K5136k6550J8168K3264K7944Q5085J1072k2594Q478k3544
24720c600m2112p058j1007R17Q808J6976N0151k9476j4252j2873J0214m4144J9795
24707e7661Q008l5769m4490j1827J623j0240L254L0570j7261N2192N8099L1711
24695H209M3954j5663n0256K1312j4649m9652O354M6611j662L2095L3987O1302
24683A21942K2835p4831k3689j5868m004j553L989p606N710o219J5736L7705Q198
24670H2345j8068l6264K1049j1482J1223O513m6919p2730O57P6176L6084o3705
24658a5121O060K9101k4874K2461L7709M5538k5299n5943j9815k1371L2897Q3195
$$ y = [29498, 12650, -23918, 30962, 83584, 46104, 20476, -37798, -13011, -10078, -31056, -87465, -56633, -80023, -130059, -104923, -131473, -113305, -90041, -62097, 22988, 34060, 11466, 19944, -3600, -45712, -52770, -63777, -62860, -54052, -37076, 13075, -16401, -30653, -43526, -33312, -77456, -57661, -49653, -85422, -129912, -141739, -140116, -150356, -147102, -116532, -133793, -81601, -23502, 8209, 52163, 36500, -13756, 7556, -7093, -56745, -50391, -3780, -5442, 26653, 60640, 121942, 144777, 69946, 46257, 30389, 26385, 24832, 28821, 21215, 26925, 20706, 36442, 74147, 82345, 64277, 28013, 49062, 37580, 48803, 55316, 8397, -64333, -63676, 12500, 48584, -15121, -9061, 20040, -4834, 17627, 55336, 100874, 75575, 19632, -183, -21554, 11343, 94538]
24646I4538m0975r539n3939M5770L0170l1913K511n1941k5565j2543J8978K8533
24634e915J1813L2935J2450j2691O2749M4825m1668r2357m1708M730J7447p530
24622a4920k1245J0873N6205o9193l3865R5057K8086k3923J5044n7684J345k6833
24610d1053m745M6847j8970m4355j2643K7680K4999N217M0452k844k7517n5319
24598f2251J0730R9092J132j13624J7272O700k3324n1791J7507P8535L5457k1350
24586e915r184L164L3245K7622J871j8082L5764l1837m7515J693K7874j2614o1544
24573e5458j2609j0120J599K0437L06K247J6540l2883m8346l2856O4096R4698
24561G651N5428P583q5776k9514J1263J2415j2756n1693L4085M0917k8706j6902
$$ y = [94538, 53563, 44024, -9915, 35855, 66025, 34112, 36623, -15318, -40883, -53426, -34448, -5915, 5898, 38833, 51283, 38592, 101341, 146166, 104498, 12141, -29567, -24837, -7390, -14920, -36165, -25292, 30913, -38280, -72145, 22912, 50998, 27075, 42119, -15565, -14220, -41053, -45798, 1049, -17921, -62276, -74919, -47239, -22240, -17023, 23429, 20585, -6932, -62251, -51521, 47571, 48703, -64921, -47649, -40949, -64273, -116064, -98557, -20022, 15435, -5915, -15099, -11935, 21310, 48932, 50803, 32721, 68485, 36648, -10867, -9174, 18700, 6086, -55458, -68067, -78187, -76588, -56151, -55845, -53598, -37058, -69941, -118287, -151143, -87047, 7651, 63079, 70662, -15114, -44628, -33365, -20950, -33706, -85399, -51314, -10397, -39103, -56005]
24549e6005O0655J7662j7106k2580l3707j7240L9749K8798J15975M0415n6086
24538A00530m1095k5681j01492o2785Q7836k8393L3050L6173L0917O643J0870
24527D6573n0223q7599n1821M4847K2584l1620J2152J4986k8599O7302M8480L9012
24515D6074j3516r531n1818p8199N741P1638L7888M4994k3843o9052k3759N2807
24503a0576N2737M5068k6304o2430N3234k0068m1230o302K6920J4857J4253m256
24491C5903J5959L3465J085K7193k0655k7082j18325j6301R7448n226m6210M1426
24479A8680M7894L1230n7121n2919N969j780m4461M8292L6030J707l8004r8388
24467a02871o0485o413p224Q967K7935L7790N7713l0837k2203N6187M7993K0548
$$ y = [-56005, 4650, 22312, 5206, -17374, -51081, -68321, -28572, 226, 116201, 156616, 100530, 59435, 33754, -67738, -130523, -42687, -71080, -38030, -1857, 29060, 35703, 46573, -3650, -91249, -143070, -98223, -75639, -107259, -95107, -80121, -108720, -41418, 7062, 46074, 32558, 23027, -28791, -106990, -101249, -29611, 8277, 53271, 29428, -39624, -63383, -10576, 42161, 87229, 60925, -1505, 51729, 31661, -9569, -15871, 11049, 25906, 40159, 35903, 51862, 85327, 86412, 113605, 92950, 65868, -52457, -68758, 28690, 23464, -22746, 18680, 66574, 97804, 40683, -12236, -6267, -8047, -52508, -4216, 31814, 33521, -4483, -102871, -163356, -169769, -176993, -168026, -140091, -102301, -44588, -75425, -97628, -41441, 6552, 27100]
24455B7100J33J2529q8324p1789j8045P6135J26675K2020m8139m601P8146j8180
24443I3660m8034p7881m1846k6167j5269l486K4484N3491j3973K0751L3587L293
24431B610K0586k8386J0539l6880k6529L6955P5069o7789o5974J181J3224l6791
24419a02185l0762l771j4724N0294P598M0840L9317L5218j3342J787L9624k0616
24407B9278n2065j611J4644k7500r965K3316J1528n2679l6389j292N9961O7263
24395B4489K2682M18L017M036l7364o0787L2860j6168L6321J756J2595m0806l0064
24382d7015K7649j2990o557M025m956r026l6731L4706M2299L2664J2659O9620
24370A06347m6395J6189k1029n4123K2651J2693o3888o3601j0668P0419K2079
$$ y = [27100, 27233, 39762, -48562, -120351, -138396, -62261, 64414, 86434, 38295, 33694, 111840, 93660, 45626, -32255, -74101, -100268, -115537, -119023, -94539, -41048, -55021, -34270, -683, 2610, 23196, -5190, 5349, -31531, -58060, -21105, 53964, -13825, -79799, -78618, -65394, -102185, -132947, -136718, -151442, -101148, -93550, -52710, -13393, 21825, 8483, 10270, 49894, 29278, -22787, -24398, -9754, -37254, -47219, -23903, -12375, -65054, -101443, -102735, -42774, 24489, 47171, 47589, 50606, 54642, 17278, -43509, -10649, -26817, 9504, 11260, 23855, -16951, -47015, -19366, -32356, -38913, -34888, -39844, -48870, -85601, -50895, -8596, 24068, 36727, 106347, 59952, 76141, 55112, 989, 23640, 36333, -27555, -91156, -101824, -31405, -9326]
24359i326M3533N5449N308l3590J5782p0095m3447J6148o75M50M7202N5870k0636
24346F1973k7103O9031p301o5686n2194M7044N089m1024m405R475j5300J4442
24334e959M4976l6774o9533l015N541J8469N7796J6556l2746j543j2917J04843
24322H5694M8305O01m9870m9775n6390k8959O5644O9939k5237M1988N9925n3465
24310A08400p3451j7578L1275n5253M40O5928L5404n3249m8882L590J6777o7472
24298e4071l6670n6322q409K2766O2977r252M5027N0391q964N6766K1102M6620
24286A31961l6884j05384K6387K4052q4368k5100k5786l7297M2067J4327j7362
24275i3387L8551q402R128j9767N5311J9523l6450l7124j5145P3375Q2605K4875
$$ y = [-9326, 34207, 89656, 94964, 61374, 77156, 7061, -36386, -20238, -20913, -20463, 26739, 82609, 61973, 34870, 103901, 96600, 30914, -21280, 25764, 30853, -10171, -14576, -5101, -20401, -5959, 39017, 2243, -67290, -70305, -64764, -46295, 11501, 28057, -4689, -6232, -19149, 85694, 133999, 134600, 84730, 34955, -21435, -50394, 15250, 85189, 59952, 101940, 161865, 108400, 34949, 17371, 48646, -6607, -6167, 59761, 95165, 41916, -6966, -3376, 13401, -54071, -90741, -147063, -155472, -132706, -69729, -78981, -33954, 16437, 7473, 64239, 85341, 131961, 95077, -10307, 16080, 40132, -44236, -69336, -95122, -132419, -90352, -76025, -93387, -54836, -63238, -54110, -73877, -18566, 957, -35493, -72617, -87762, -14387, 68218, 93093]
24263I3093m2598p6088k6810J6958J7112K889J7711M3332m4421m103M8047J5537
24251F0659M763j7907n5812J2825O1205L4913L4330o4316m6211j152M0500L694
24239F7491p160o7407l3812J6526N8142m7754k106M7353K7663o356j3692k8633
24227A0255n6352M8318Q8297l7057J7766j0337o3689o8179M6696j884r152j3235
24215d8553l1629Q5319R0881o3144n9958J356J2770q2371p486J7238N1987R800
24203b3790m0045r19L7788N8736J2762O7743l4219k6255j8999j6157k8966M7000
24191C4679N2403K7551m8145n0264M074m6696q5541p521n236P0021O5337m1923
24179c1261l8444K2889m7634J5673k0606O0172K0215m3407L1246K3807J15334
$$ y = [93093, 50495, -25593, -52403, -35445, -18333, -15444, 2267, 45599, 1178, -2925, 45122, 60659, 65422, 47515, -8297, 4528, 65733, 100646, 134976, 70660, 24449, 23297, 63797, 67491, 60331, -7076, -40888, -24362, 33780, -13974, -16080, 31273, 58936, 52580, 38888, 10255, -46097, 2221, 90518, 53461, 71227, 60890, -2799, -70978, -24282, -26166, -35318, -48553, -80182, 5137, 96018, 32874, -27084, -25728, -12958, -95329, -102815, -85577, -33590, -23790, -63835, -64754, -26966, 31770, 44532, 112275, 78056, 51801, 32802, 16645, -12321, 34679, 87082, 114633, 66488, 16224, 20298, -26398, -111939, -119460, -124696, -54675, 10662, -31261, -69705, -46816, -94450, -78777, -99383, -39211, -18996, -62403, -31157, -7350, 107984]
24168A07984N2680n5839n4710l4120l7703J7978J2423k29K6640K2175J7682j9717
24156E5244p7979O925J4778L6344j6402q9103J8143N5956L3610p933q5361j344
24144e7122L1040M861m2595p5719N6740L1197j3261j6381N7765M2714l7o1242
24132d2040k6036L7904K6187J8890l1482j6723k0580o858k5347K1711J1700K2897
24120b9777J476l4042l3509J00725L3671K467q805r68L6640k1003p5389k0401
24108d8915m8130L0719J7275J8166K1953q3955J5203K0989j6087K4238L5724l2105
24096d4925J2530K5069k7593k097p055K6271P9126l3797p9232O31N5501K5907
24084C0336j9659p8831l8443N9288M6001m8267j0168N2015O1331N223j6342l2533
$$ y = [107984, 160664, 104825, 50115, 15995, -21708, -3730, 8693, 8464, 35104, 57279, 74961, 55244, -22735, -15810, -1032, 35312, 18910, -70193, -52050, 3906, 37516, 29583, -55778, -57122, -26082, -21221, -63816, -139535, -82795, -51598, -64859, -81240, -23475, 19239, 19202, -42040, -68076, -30172, -3985, 14905, -16577, -33300, -53880, -60738, -86085, -64374, -52674, -29777, -28301, -62343, -95852, 4873, 38544, 41011, 32206, 31238, 67878, 46875, -28514, -48915, -97045, -66326, -49051, -30885, -8932, -92887, -77684, -56695, -72782, -48544, -12820, -44925, -32395, -7326, -34919, -37016, -44071, -17800, 61326, 27529, -51703, -51072, 4429, 30336, 10677, -68154, -106597, -47309, -1308, -49575, -59743, -7728, 53603, 58826, 42484, 9951]
24072I951j4246M904o7868k5404K7784N0759j2005L9678j1974Q3403O0343J179
24060A46504o7307m4722q586k6665L3354N4907m1666l8770Q244k5582o53J2383
24048A441k6334l3452m797m3725k04O0315M8811m140j7141K2781k1631l7874K1821
24035c4129k0863J1219L8195L9766k214k2688j7354m1032j7151j0933L5470P2612
24023C0898n0722o6686k6952L8579J3955M598J669o455l3322M9022M9289P302
24011A1175j9392k9727n0455j7457Q1602J0015P9909k9175l644J1995K1437p542
23999E8741n0435J0876j8831J4163K1439l2145m9125k5956K8074K5869L282L010
23987a1038k7276N6502j567J9044N3481L036L4060l7607j21058l0061j3835O8558
$$ y = [9951, -4295, 609, -67259, -92663, -64879, -14120, -26125, 13553, 1579, 84982, 145325, 146504, 79197, 34475, 25889, -776, 32578, 87485, 45819, 7049, 15293, -10289, -10942, 1441, -24893, -58345, -63142, -106867, -107071, -46756, 2055, -2085, -19226, 3555, -18076, -55950, -34129, -54992, -43773, -5578, 34188, 31974, 9286, -8068, -49100, -66251, -77184, -41714, 30898, -19824, -86510, -113462, -74883, -60928, -56330, -54661, -61116, -94438, -45416, 3873, 11175, -8217, -37944, -88399, -105856, -24254, -14239, 65670, 36495, 32851, 44846, 66283, 58741, 8306, 19182, 351, 14514, 35953, 3808, -45317, -71273, -43199, -17330, -14048, -11038, -38314, 18188, 16621, 35665, 89146, 92182, 126242, 88635, -32423, -62484, -76319, -7761]
23975g761K3975L201n0314O529p467K288J4087m2225J1653L1677L7125K3155o4285
23962a8362o4864R418L730j6318j2344L0227l5343R5253O9969m1958j6661K3720
23950B6467K8484j2970L6647O5530k0069j22571p960K590J5630n2480j1386M1715
23938a0373L4292O872O7348p4815j2939O407J5551k1907j3400L654n2690p3924
23926a25924K9783M2925j8092J6819J4691M0482k2407j3735L2459K0358J6633
23915C3992r2627o1625N088J2466L8761q7097j5995J19403L5429j4362r226L9821
23903D028o95o5892j8496M3551m8340J7371K8354J6163l413O102N134j4298r4688
23890a25119L3104L9249l2057K9177M4388k0455k4615n331M8841K1260l3358L0326
$$ y = [-7761, 16214, 19415, -30899, -24370, -31837, -29549, -15462, -57687, -46034, -14357, 22768, 45923, -18362, -83226, -73808, -70078, -86396, -98740, -68513, -103856, -8603, 61366, 19408, 2747, 26467, 54951, 41981, 78628, 144158, 124089, 1518, -6442, -3852, 11778, -40702, -52088, -10373, 23919, 30791, 98139, 23324, 10385, 16792, 32343, 10436, -2964, 690, -52000, -125924, -96141, -53216, -71308, -54489, -39798, 684, -21723, -35458, -2999, 17359, 33992, -58635, -120260, -115172, -102706, -63945, -151042, -167037, -47634, -12205, -26567, -35793, 4028, 3333, -62559, -81055, -37504, -85844, -68473, -40119, -23956, -27369, -21267, -16133, -30431, -125119, -92015, -52766, -84823, -55646, -11258, -31713, -56328, -61659, -12818, 8442, -24916, 5410]
23878E410M0455j0988j02093j7414j1948K6273J05978K7639R03j1005M57P228
23866F0895l3261R343j1871M2553J8295K0996l0489j4848j0724K0313j6772J5133
23854F9563p925l7105l9298p4654M645Q2021n338l5404N4211J4733J2618r498
23842B8569n1287j7415M3862j757n0327j4688O3285N9315o7812K999l6524n0574
23830i2354j0280O9476Q844M3108O8397O1191k4100k7619n5054m0810p2794m014
23818g6009K8056M8900J808N8484J7401m8554k4325n4983K3764L3458k8368k4316
23806d4684L9457l4329l9176J7092K5843L563j1730J1512n473L2243P72l0611
23794c5521J5489J4597l9921n3965J1633K3238Q468m133K7703K4979L4493M6231
$$ y = [5410, 45865, 34877, -67216, -84630, -96578, -70305, 35673, 63312, 64215, 53210, 53667, 60895, 27634, 36977, 25106, 67659, 85954, 106950, 76461, 61613, 50889, 71202, 54430, 69563, 61638, 24533, -14765, -89419, -84774, -2753, -8091, -43495, 10716, 25449, 38067, 28569, -22718, -40133, 3729, 1972, -48355, -63043, 242, 59557, -8255, -5256, -41780, -92354, -102634, -33158, -24314, 18794, 87191, 148382, 124282, 96663, 41609, 799, -71995, -76009, -47953, 947, 2755, 61239, 78640, 30086, 5761, -49222, -25458, 8000, -20368, -44684, -5227, -39556, -78732, -61640, -35797, -32234, -43964, -32452, -37925, -5682, -4910, -35521, -20032, -5435, -45356, -99321, -87688, -64450, -55982, -60115, -32412, -7433, 27060, 73291]
23782G3291L0903m5199m6838j9612l6335J9416j5125l4044p9417j1511M9752k470
23770a17189R501J6917M0004K2940J1793j9801N8402L2067N5j7246r096j2424
23758A5923P735J5256M634m8735k165q27j4498o1823K546L8284P336O2177l2874
23745g031j0394l0933M2455L6843j64n5119n2692j2924L5602O5482K3803q756
23733B6172j905J5309J3630M152o2073J0123K7018J5944l8752p9216n2037O7143
23721e4492K5864p658M5180p081L86M2218o399m7894J9067K7668P3169j5622o4933
23708B9473r622j028Q996r684K0736O8304K3120o0282R312K3794o2386m4949K4693
23695B0477k0814R945L2065p1908O2664N1752L1585k624J6556N2423n2616j05011
$$ y = [73291, 104194, 58995, 12157, -7455, -43790, -24374, -39499, -73543, -152960, -164471, -114719, -117189, -107688, -90771, -50767, -27827, -16034, -35835, 22567, 54634, 54689, 37443, 28347, 15923, 23658, 38914, 43548, -5187, -7352, -8179, -22677, -84500, -81954, -43670, -36334, 25843, -7031, -17425, -48358, -5903, 30940, 30776, -24343, -77035, -89959, -54357, 11125, 34928, 26172, 24267, 39576, 53206, 57358, -4715, 5408, 32426, 48370, 9618, -69598, -121635, -54492, -28628, -36286, 8894, 1813, 2199, 44417, 38018, -9876, 9191, 36859, 110028, 94406, 29473, 19851, 18823, 27819, 18135, 38871, 107175, 130295, 70013, 79325, 103119, 40733, -4216, 20477, -337, 9608, 41673, -30235, 32429, 84181, 115766, 113142, 129698, 182121, 129505, 24494]
23683B4494m5127J8734j9823M1758J0907m4166K0843M7149M211J4077j6185j8324
23671C8548j2651K7613l4546L5087j8473p8599n4206M7448O5777K7747n315K3596
23659F2026l0997r65N9938R161l2886o3790k7478k1101j04470M4218J51112J35735
23647A80503m7299k0958o3157j7069O4750K2498k0598l2343p9656o4704j960K6766
23635e3227j3631l9953j9796L3719L4793K7745k0086K3112j081k7605J1081L9674
23623e255p481J9819K7381j8929J0309n949j4792j9682l0232o2523M8483N6873
23611a978Q5606R908n6930o7968k0551j4201L6931J4641j9615K3671K7824J259
23599A8597j9170P310k3386m9997q31K9033R615K8510k3757n3910J1893p426M7119
$$ y = [24494, -20633, -1899, -21722, 20036, 30943, -13223, 7620, 54769, 58980, 73057, 56872, 38548, 25897, 53510, 18964, 54051, 35578, -43021, -97227, -49779, 15998, 43745, 38430, 62026, 31029, 30064, 90002, 99163, 66277, 2487, -24991, -46092, -150562, -106344, 44768, 180503, 133204, 112246, 49089, 32020, 96770, 119268, 98670, 66327, -13329, -78033, -79993, -53227, -66858, -106811, -126607, -92888, -58095, -30350, -50436, -27324, -28405, -56010, -44929, -5255, -12736, 7083, 34464, 15535, 25844, 19895, 5103, -14579, -44811, -107334, -58851, -1978, 83628, 93536, 36606, -31362, -51913, -66114, -29183, -14542, -34157, -10486, 17338, 18597, -573, 6737, -16649, -66646, -67477, -38444, -28829, -319, -24076, -77986, -66093, -73519, -26400]
23586b6400N8002P4560m8974L4597o996m9733l3930O5929J2437k9322r4223J0971
23574c3082k2126J0854M3384k0005m9298j027K3247N7262J2454n0076p8568L8298
23562f8683L3820L370K877J1547l1577j01006r615J3100M0594O1965k7179J5218
23550e5569K5535j2130l2695K5094K9761n768L8274m4531k59N7045l0335j2011
23538a7589J6816j1244n6240m813Q6593J2211n932j04087l7652O4999O7338K8039
23526C8439J77j1896o0735k2449J26933J08603J8228n6634n6006p6187j4505Q2282
23514G6250k6641r144L4829l3361J6219O4135k2241o9404m3905J0884J2427K5075
23502C5123M9890p997L4490m206L5022n4176n9026O9615j3959J6542m5794j4566
$$ y = [-26400, 31602, 106162, 57188, 91785, 84789, 35056, 1126, 67055, 79492, 50170, -44053, -33082, -55208, -44354, -970, -20975, -70273, -71300, -48053, 9209, 21663, -28413, -106981, -68683, -34863, -31493, -28616, -17069, -48646, -149652, -159267, -146167, -105573, -43608, -70787, -55569, -30034, -42164, -74859, -49765, -20004, -25772, 12502, -32029, -32288, 24757, -5578, -17589, -773, -12017, -68257, -73070, 13523, 25734, 19802, -84285, -121937, -56938, 10400, 38439, 38616, 26720, -34015, -56464, 70469, 179072, 197300, 140666, 84660, 8473, -6032, 76250, 49609, 40465, 75294, 41933, 58152, 122287, 100046, 30642, -13263, -2379, 10048, 35123, 85013, 77016, 111506, 107300, 142322, 88146, 29120, 98735, 84776, 101318, 55524, 40958]
23490D0958m139j4838O269K7183n8539n212N884J0461M236L9942j8825j7919O750
23477B2211J014j7446K91j1057J9900Q418r692K1917m5622k8951J8J8438L6518
23464A5957k3280K3571P9715j410j10539J6895m187o6533q6962P4179P9207l6042
23452c9429P399J5392j1843R9763K641j7802K0067K0155j0387K437n2763J1894
23440D7524K5714L15K5003l2660j4616L3071k1346P574J6356m8953l0559K6078
23428C3501L4647j736K7304J2332J9156m7579l0488K5759L2054l1480R50p396
23416F7024n8957o3975L5029J3888J6814l3445l0857n1607L7173P0142q59p5844
23404g5474J4628J2072P1452K346k2097L8274N420N4664K8154q0861p1958j9948
$$ y = [40958, 36819, 21981, 28250, 55433, -3106, -8318, -2434, 8027, 12263, 52205, 33380, 15461, 22211, 23225, 5779, 6070, -4987, 14913, 23331, 13639, 35556, -10066, -39017, -38999, -20561, 15957, -7323, 16248, 95963, 94553, -15986, 909, -3278, -69811, -156773, -82594, -3387, -39429, -32030, -16638, -28481, 71282, 73923, 56121, 76188, 96343, 85956, 88393, 35630, 47524, 73238, 73553, 98556, 65896, 51280, 84351, 63005, 70579, 86935, 37982, 7423, 33501, 68148, 66412, 93716, 106048, 125204, 77625, 47137, 72896, 104950, 73470, 74420, 67024, 8067, -55908, -20879, -6991, 9823, -23622, -54479, -106086, -68913, 1229, 370, -75474, -60846, -48774, 22678, 25024, 2927, 41201, 46621, 101285, 129439, 48578, -23380, -43328]
23392d3328K2883O1981L413k6517j7713J1503L525J4921l8435n1894N6869L6701
23380C3909j01694q2702N4053M5091M8081M0843m7719L3867P2867O6411k9790
23369A33217q4113p1262m3444j0963l391P5673R698J4923L3018o6697p2862l5902
23357a22105j9104R40K1942O1313N5954k8029j0513M8606L3411j7890J9189J2904
23345E6618j8229n764l3827k1820m2004N3490M5319k2880k3965l2058J4410N9744
23333B9034j4307o7939K7407L1832j3324r366k3482l5040O9444K1181q3664M3493
23321b4731O0577p133j2964k4618m382k292O3548L9084L2099k7887j06238p4404
23309h9341l4395j17P1158Q7480Q259j9351K9427N688l7893J6593M432L603m0841
$$ y = [-43328, -20445, 41536, 44949, 18432, 719, 12222, 15747, 30668, -7767, -59661, -2792, 33909, -67785, -150487, -96434, -51343, -3262, 37581, -10138, 23729, 96596, 163007, 133217, 49104, -22158, -65602, -76565, -79956, -4283, 5415, 20338, 53356, -13341, -86203, -122105, -141209, -140269, -118327, -57014, -1060, -29089, -39602, 9004, 42415, 24525, 43714, 56618, 38389, 32625, -1202, -23022, -65026, -11536, 33783, 10903, -13062, -45120, -30710, 29034, 14727, -53212, -25805, 6027, -7297, -16663, -40145, -75185, -5741, 15440, -68224, -24731, 35846, 28713, 15749, -8869, -13251, -15543, 48005, 87089, 119188, 91301, -14937, -89341, -123736, -123853, -52695, 34785, 43044, 23693, 53120, 58808, 20915, 37508, 41940, 45543, 4702]
23296D702m5473K0974j748k8245m3209N440P3868J8381K7443l1394k6689l5490
23284f1440P3635P3848M208k5417L6534J3266m9986k3054j8413K3204j0046j534
23272C4805M7762j1645J9306l3719o9203J9237L2422N3536j6212k1828R351n021
23260E8791R249K4730m9478n4339k11N8499o165j3736l9379K7832j2748r222j1235
23247a7412k4110p958N1893P7207K2431l7621J9962q8374p3525q52L6379R0360
23235D8380N579N5315l0443K0033l6188o1348o4438q594K2305M6684J6181m5262
23223c1796k1111o605O920N3628K0274l0872L5884l902p507j0585J3581m0835
23211b2926L0309K485K7632N7525J5943M8427J3555r5203l3650J3493J4295K3892
$$ y = [4702, -40771, -19797, -21545, -49790, -92999, -87559, -13691, 4690, 32133, 739, -25950, -61440, 12195, 86043, 90251, 64834, 101368, 114634, 64648, 41594, 23181, 46385, 36339, 34805, 82567, 70922, 90228, 56509, -12694, 6543, 38965, 92501, 76289, 54461, 63812, 58791, 68040, 92770, 43292, -11047, -11258, 47241, 41076, 27340, -12039, 15793, 3045, -6177, -17412, -41522, -49480, 2413, 79620, 102051, 64430, 84392, -3982, -77507, -78359, -41980, 48380, 53959, 109274, 78831, 98864, 62676, 1328, -63110, -71704, -49399, -2715, 13466, -31796, -52907, -59512, -52592, 1036, 21310, -9562, 26322, 22420, 14913, 4328, 17909, -22926, 7383, 9868, 37500, 95025, 110968, 159395, 172950, 77747, 44097, 57590, 71885, 95777]
23199I5777K5892n9708n9024N1763n6841L620N2910r806M3251k6617l6051P3829
23187I8995n2816j7234J0027L9901N5578n139J3893K4753q6751k1550K8460m5032
23175D3085J1646O053j7036o4556m3375K0342N8401m549N604O966J42K869j0804
23162A4788P5287M0610l9880o1086M16M1187L9300N2719M0321q3163n5760r587
23150E5152n018L8982k2627P089J2855L391l3660j5205p9750o1646N9972P4774
23138C4309n0938m7292L2492K1227o2275p929j6689J5616O5666J5181l2367k5129
23126e8128L0805N7739J3483J4100L2008k9016K7017n1301l9020j2363j4067K567
23114b6176M5169K0351k2250k8896J3499j7229M5565J8297o6211l8365O825K1755
$$ y = [95777, 121669, 61961, 2937, 54700, -2141, 1479, 54389, 44583, 87834, 61217, 25166, 98995, 46179, 28945, 38972, 78873, 134451, 129312, 143205, 167958, 81207, 59657, 88117, 43085, 54731, 60784, 43748, -20808, -64183, -43841, 14560, 10011, 15615, 22581, 22723, 25592, 14788, 90075, 130685, 90805, 29719, 30135, 71322, 110622, 163341, 203662, 120499, 64739, 55152, 50134, 89116, 66489, 73578, 86433, 89824, 56164, 40959, -38791, -100437, -40465, 34309, -16629, -63921, -31429, -10202, -72477, -80406, -97095, -81479, -15813, -632, -32999, -58128, -27323, 30416, 43899, 57999, 90007, 60991, 88008, 36707, -2313, -14676, -28743, -26176, 18993, 39344, 17094, -11802, 1697, -15532, 30033, 48330, -17881, -56246, -49421, -27666]
23102b7666J7953j8743r61j3009M3123o7521o4585k5168j1677O1917M9284N4808
23090b245J348L4501n3333j4298k0078O1112K6998n3000o216O5883M5774j08886
23078b2440q6655J8986J0260l4943L6257k895J9620n747M4941M7457L3844j2934
23066D5751k8438O406k3411M418M0226L018l483j0353m7566J6288L6723q303k9455
23053A821O264j4726K7098L3759o4051o9755N8907P4666k096m3629M4604K0986
23041G3848k4293p0676P545P1847j3588R517P9494P0123n5398k5216l5979k9124
23029E8100J8757j8458K8998K9180k3745l8821K620J3495l83L36q884k5448j5431
23016B0316j9816K5067p3573l3613M8117M6573L5324J0911N4385p3994m1217M2126
$$ y = [-27666, -9713, -28456, -29417, -42426, 697, -66824, -131409, -156577, -168254, -106337, -57053, -2245, -897, 33604, -19729, -34027, -54105, 7007, 34005, -18995, -25211, 40672, 86446, -22440, -109095, -90109, -79849, -114792, -78535, -81430, -61810, -67557, -22616, 24841, 58685, 45751, 17313, 23719, 308, 4726, 44952, 47970, 44487, 34134, -13432, 2856, 39579, 31276, 1821, 8085, -6641, 20457, 54216, -9835, -79590, -20683, 53983, 51887, 8258, 52862, 73848, 49555, -21121, -13576, 58271, 44683, 54200, 133694, 203817, 148419, 123203, 87224, 58100, 76857, 58399, 87397, 116577, 92832, 54011, 56631, 70126, 69743, 70079, 61195, 35747, 20316, 500, 25567, -48006, -81619, -33502, 13071, 48395, 59306, 113691, 39697, -1520, 40606]
23004D0606N8755m133o3935L0883j0789L6732R596k9668J153J5100R500j4984
22992G8816J5610k2281o1762q9903k5857J5941J6195j4198j6355K7792M2038J843
22980c2121j9587m5111R2678Q5958k9879M3820J3451o9650l9015J7187k9782J3495
22968A444N5664J6881J1099l6468q5671k8618L4325L4264l5597P9341l503R784
22956E2945J2735l0696l1399j9243M1503J4570K4738M1274q372l2623L8310L8105
22944A41847l6203l6351o6000K5306O3427m84j5005q8625m3528n3984N6035J5574
22932c7991L4490k5276J8727K1185L2006l395R968l8571N8749m5034o724q57k051
22919A5226N4355j1124J463J6069p7710m7688J1335N3551R701o1411J976L3413
$$ y = [40606, 99361, 95228, 31293, 62176, 51387, 88119, 97715, 68047, 69200, 84300, 93800, 78816, 94426, 72145, 10383, -79520, -105377, -89436, -73241, -87439, -103794, -76002, -33964, -32121, -51708, -96819, -4141, 81817, 51938, 95758, 109209, 39559, 544, 17731, -12051, 1444, 57108, 73989, 85088, 48620, -37051, -65669, -31344, 2920, -32677, 46664, 43161, 52945, 65680, 34984, 3585, -15658, 25845, 40415, 65153, 106427, 98055, 65432, 103742, 141847, 105644, 69293, 3293, 28599, 92026, 91542, 76537, -12088, -55616, -109600, -53565, -37991, -3501, -28777, -10050, 11135, 43141, 39746, 49714, 11143, 69892, 24858, 18134, 17277, 15226, 69581, 58457, 59920, 75989, -1721, -49409, -38074, 15477, 25178, -36233, -34257, -844]
22907h44q0727O040k5176m6040l9214J6001N7407J18581R4529l7515r8057n3103
22895h8118J7068M4186n141L6428L7896J5256o4511l2161L5820P383M7517l7628
22883A3995J9291J6360J5252K0738n5269L248l191j614M6487M5296Q0347J4852
22871B15792l1699p0242l2277K0518o5730P433M7805K157p5614p6752J0686J5453
22859c2470k9766J0110N7967J8780M0924J1087k2459M862l949j5991j0784k3879
22847D432o1959N193Q1340J9218l2603p634K0559n4439k4095R072k180L2678R9044
22834H8626J1653m9655j8328M1227R300n2643o9982k2067j8414j8097N4802M6593
22822C015M0185K995l4263p0969n3131J7200M6888J382R693l8096l2505K800k3601
$$ y = [-844, -81571, -75531, -100707, -146747, -185961, -169960, -112553, 6028, 100557, 63042, -35015, -88118, -71050, -26864, -32005, 4423, 42319, 57575, -6936, -39097, -3277, 4106, 51623, 13995, 33286, 49646, 64898, 85636, 30367, 33615, 30424, 28810, 75297, 120593, 200940, 215792, 184093, 113851, 81574, 102092, 36362, 43795, 91600, 93757, 18143, -58609, -47923, -32470, -62236, -52126, 5841, 24621, 65545, 76632, 54173, 59035, 55086, 39095, 28311, 4432, -57527, -52334, 29006, 48224, 15621, 7987, 28546, -25893, -49988, -40916, -43096, -10418, 88626, 100279, 50624, 32296, 73523, 82823, 30180, -39802, -61869, -80283, -98380, -43578, 3015, 43200, 46195, 11932, -59037, -112168, -94968, -48080, -46698, -37005, -75101, -107606, -104806, -128407]
22809a28407N9324P1176R55P196k1682n8719K6747k3545N2492J5287j0338N7349
22797D7835N1706J0823Q110n3944r5918J9837J5339M0682r901M600k9822R648
22785A8995N4111P0809n0915j5408r3249j7597K8679l891Q691K4704L5060r269
22773E0720Q811n7173L5652K5405l7034r2731P2209K8918m0474j5551M5843L1757
22761E6352m2521l9907m6883j6574L4107M5180k5206n0357M3392N3838P5872m5599
22749D1694j3812M0713L8474N1640q5201o8586o2193j4138K1122k5057n8208P920
22737a25632L649l007R231Q67n4390j0974O9422J30339M8008j7897N015l1817
22725B2814o5763m1571O5724K6273o3601p744Q7467J9856q193N2727K1884p5541
$$ y = [-128407, -69083, 2093, 3048, 10244, -11438, -70157, -43410, -66955, -14463, 824, -9514, 47835, 99541, 110364, 118474, 64530, -31388, -11551, 3788, 44470, 34569, 39169, 9347, 18995, 73106, 143915, 93000, 77592, -15657, -33254, -4575, -8466, 225, 24929, 59989, 50720, 59531, 2358, 38010, 63415, 26381, -66350, 5859, 34777, -5697, -21248, 24595, 56352, 13831, -26076, -72959, -89533, -55426, -10246, -35452, -85809, -42417, 11421, 87293, 41694, 27882, 68595, 107069, 158709, 73508, 4922, -57271, -71409, -50287, -75344, -133552, -125632, -121983, -124990, -115759, -114892, -169282, -180256, -110834, 19505, 67513, 49616, 54631, 22814, -42949, -84520, -18796, 7477, -56124, -63868, 23599, 43455, 35262, 87989, 109873, 34332]
22713C4332L0908l6974k2374l8942K3718o2771k0542m26P2281M7176p6982N184
22701d5412J3213l8484M43N473O6081Q238L7940M3732K6824j5465m0232l4280
22689B8071k6389l6705Q1867P7894R36p8018k1064P4978M0463m5878k3104j1942
22677F1109O083K1430j9492J6213L86r9372q1847n975N201L8693J2184K8067m9889
22664f7209j7830K3454m524N4007l9933M1214M0667j9250j3201M8882l377K1956
22652F4856k0184j9954M0475L3526k9945j9191O05N0598M4645r774o7991k8906
22640C8760J3785l018M4100J8822l1366p6519o6297N4118O7592J0515m9817L8839
22628E9514k9234m0719M259M8549K2059L1748J2100J220o5481m487k9474K8548
$$ y = [34332, 65240, 28266, 5892, -33050, -9332, -72103, -92645, -93071, -20790, 26386, -50596, -45412, -32199, -70683, -70240, -64767, 1314, 9552, 47492, 91224, 118048, 102583, 62351, 28071, 1682, -35023, 46844, 124738, 125674, 47656, 26592, 101570, 142033, 96155, 73051, 61109, 67192, 88622, 69130, 85343, 85729, -13643, -95490, -101465, -96264, -57571, -45387, -17320, -67209, -85039, -61585, -66109, -12102, -52035, -10821, 29846, 10596, -2605, 46277, 42900, 64856, 44672, 24718, 65193, 98719, 68774, 49583, 50188, 100786, 145431, 135657, 67666, 38760, 52545, 49527, 93627, 112449, 81083, 4564, -61733, -7615, 59977, 70492, 20675, 59514, 30280, -10439, -6180, 42369, 64428, 96176, 108276, 109496, 44015, 39528, 10054, 38602]
22616C8602K9135M6779N2803k3902k103j6911J9312l4839n0291k5483M9925L4852
22604A17879n0894n7035j1938L3780L3988o1825o7246n2896N9646Q7730P507O778
22592D5474L0747M6403J3619N5349K8766l8696Q037p8599k6775N576m2530k0370
22580B7001l4329m3513N1759m245M5066O7474O5008n8273J7690L4473n3360o9119
22568D5632o822l2868k7422M6050L6278m0335m5484j8419L0372o5720k9486N0005
22556e8219O0772K7128l3651o4205Q421K0832L4603L5146M2406l8128n0838P356
22544h377Q9004j2907k3493j1628N316P621J1670K0518j9706k1250k4659J9410
22532C1519l783o0967q2788P1573M5434O9346K4081J5647o0833L1829J6872k5366
$$ y = [38602, 67737, 114516, 167319, 143417, 141314, 124403, 143715, 108876, 58585, 33102, 83027, 117879, 66985, 9950, -1988, 31792, 65780, 3955, -63291, -116187, -56541, 31189, 38696, 45474, 76221, 122624, 136243, 191592, 220358, 181662, 189699, 111100, 84325, 89901, 47371, 27001, -7328, -50841, 918, -3327, 41739, 109213, 174221, 115948, 133638, 168111, 114751, 45632, 38810, 5942, -21480, 24570, 60848, 20513, -24971, -43390, -13018, -78738, -108224, -58219, 2553, 29681, -3970, -68175, -59754, -38922, -4319, 30827, 73233, 35105, -15733, -8377, 80627, 67720, 44227, 32599, 37915, 45536, 57206, 77724, 58018, 36768, 12109, 31519, 27736, -33231, -116019, -44446, 988, 70334, 94415, 110062, 49229, 81058, 97930, 72564]
22520G2564m6111j3285o8006M107L895J08863O0631m8491o3714K9253o7451k7328
22508e5073K3232O5836K2282n1065k0766J9142N0593J1828N330K7976k7698k6163
22496D5454N803l253o8773o7833m7471L0033L818K7825J3506M8447K2922K2512
22484C2990j0036k4253j9468J5871J4357M4133m6909O2344K8042n2276q953M9277
22472H5119P2787J2270k9913m6899l0973q951P604Q6874N3354l0892l3206k8008
22460A09166m1830K2619p5934p7254K3896J064R174k0715J8581K4859J378n862
22448a0858J909P1029m1370L871l1052L8662J4360J0246J6561J2661n6586p800
22436B1633N5572k6728j5919l4890k3692k8795J1272k7970L8446j2252L956K479
$$ y = [72564, 26453, 13168, -54838, -50731, -46836, 62027, 122658, 74167, 10453, 39706, -27745, -55073, -31841, 33995, 56277, 5212, -15554, 3588, 54181, 66009, 71339, 99315, 71617, 45454, 51257, 48004, -20769, -88602, -136073, -106040, -102222, -74397, -60891, -12444, 10478, 32990, 22954, -1299, -20767, -4896, 9461, 53594, 6685, 69029, 97071, 44795, 35842, 85119, 157906, 170176, 140263, 93364, 62391, 53440, 61044, 147918, 201272, 170380, 137174, 109166, 67336, 89955, 14021, -63233, -39337, -38273, -29099, -49814, -31233, -6374, -4996, -10858, -8949, 62080, 20710, 24581, -6471, 32191, 46551, 56797, 73358, 86019, 29433, 21633, 77205, 50477, 34558, -332, -24024, -52819, -41547, -69517, -31071, -43323, -39367, -36888]
22424c6888m5806K5309N6978m4950J4018O9948m0019k3722K1216J1753r5133L3703
22412e3593P1901n419r0573k3364N3841J03671J02275j8085n5250p8108J062R087
22400A7445L0115k8657m5444j7805M7777j2139R443L4199k1904o5805m7926N2120
22388d8581Q861r882k8055K2773P5618N9570k616l5113j0937j663j2196o7432
22376d9653k1864p1990J7873O0775O8127M3584j6179m7280m1619j393M5441J21425
22364A07247l4156P665K0114n6381q1746m2854k518O410J9396n587j3794N638
22352g0566O6057O7981j2392n0100m0831J2008L0584n756N775J793k5026p1455
22340i1928N6989M7426O950p835K1284l1678J8242k490Q619M5854K68j8734l261
$$ y = [-36888, -82694, -57385, -407, -45357, -31339, 38609, -1410, -25132, -3916, 7837, -87296, -53593, 18308, 12889, -77684, -101048, -47207, 56464, 158739, 140654, 85404, 7296, 8358, 17445, 47560, 18903, -26541, -44346, 3431, -8708, 735, 34934, 13030, -52775, -100701, -48581, -39720, -49602, -77657, -54884, 20734, 80304, 77688, 42575, 31638, 29975, 17779, -49653, -71517, -143507, -125634, -64859, 3268, 46852, 30673, -16607, -58226, -59619, -14178, 107247, 73091, 80756, 100870, 44489, -37257, -80111, -82629, -76219, -56823, -62410, -76204, -70566, -4509, 63472, 51080, 980, -39851, -27843, 2741, -3015, 2760, 4553, -20473, -91928, -34939, 12487, 19437, 11602, 32886, 1208, 19450, 16960, 25579, 71433, 71701, 52967, 49706]
22327D9706l9768o782K3175m65p5617K1085P6933K8464L4966O241n4117k2895
22315D0926j232p348K4487l5907J2938R343Q66m840K3593l0024J0056K2015k3638
22302D1235m2226O431M8077j9138o0972m4769K7976m9455k2480N7765M4775P8555
22290F5774J905m9806K7543L167K3886j9501o3185p4189J7565J55415Q915l9116
22278E8373j4240l5596n0983M6906N5784L8198J0111m0179l0718n5321r4724k3271
22266a35660N3726N1646K1562N908K240j4133l3472K2317Q0215J6296J8673m2286
22254D7032k6066Q131l9764j0441L2037o061p3770j10758Q750Q8205J7914K8511
22242c6280R372k3664M3413N6393l1084m1134K9930P9835j1991k4074r82M1200
$$ y = [49706, 9938, 3156, 26331, 25866, -49751, -28666, 48267, 76731, 111697, 117938, 63821, 40926, 39694, 32346, 56833, 20926, 33864, 43207, 44073, 39233, 62826, 32802, 42858, 64873, 41235, -991, 5440, 53517, 34379, -26593, -71362, -43386, -92841, -115321, -57556, -12781, 65774, 67679, 17873, 45416, 48583, 72469, 52968, -10217, -84406, -66841, 88574, 97489, 58373, 44133, 8537, -42446, 4460, 60244, 98442, 108553, 68374, 37656, -17665, -112389, -135660, -81934, -30288, -8726, -2818, -578, -14711, -48183, -25866, 54349, 70645, 89318, 47032, 20966, 29097, -10667, -21108, 10929, 4868, -68902, -179660, -170910, -82705, -64791, -36280, -26908, -50572, -7159, 49234, 18150, -22984, 6946, 86781, 74790, 50716, 49734, 90934]
22230I0934m7169M91L7223K1631n9097P816j5030j4884K2151K2753k4564q5971
22218d3716j2701Q614J1634M3129Q273o851J5176J29430K9217n3693q3534q55
22206D4123J1816l210K1589K3524K2175J9335k5551p0340j2270K4287p774k6513
22194B1191K8029J2874m4415m8813j8549M5484k0715J4492M245K5731M2399k4994
22182C6959n6653l8024k6537M8614O682J3564R114L8582K6418j9748l0417k7917
22170a9363R788j6539K8922M7035M3374r9041o1798M6536L8579M926j1005k7081
22158a5667m4445L1363J12264r439k2418m9789M4030Q8047P277k0258o2614q1050
22146b2699O1931R3696l146l6969j3503L4465j648m486k1777M324K9331n0979
$$ y = [90934, 43765, 44256, 81479, 103110, 44013, 51829, 36799, 21915, 44066, 66819, 42255, -43716, -56417, -47803, -36169, 6960, 15233, 8382, 23558, 152988, 182205, 128512, 44978, 44123, 55939, 52729, 74318, 97842, 120017, 139352, 113801, 43461, 31191, 55478, 47704, 21191, 49220, 62094, 17679, -31134, -49683, -4199, -24914, -10422, -6177, 19554, 61953, 36959, -19694, -57718, -84255, -35641, -28959, -15395, -6281, 32301, 58719, 38971, 8554, -19363, -9575, -26114, 2808, 49843, 93217, -5824, -67622, -21086, 17493, 22419, 11414, -15667, -60112, -28749, 83515, 74076, 51658, 1869, 45899, 133946, 141223, 120965, 58351, -22699, 39232, 132928, 129782, 92813, 79310, 113775, 112127, 107641, 85864, 90188, 119519, 68540]
22134F8540m8107m5060M4843L8444l0909m7635k1547L2798k41k5512K698l9182
22122g0870m8649K7697K2978J6959j491m6143N0097m7786m0948K5141K8051L7743
22110d7221L1687J9889J8698J6720M2904K5740k3630o799k333k9334l1192N2742
22098F7871N090r805j7582O5285n393j9330o1947K051J7130n2415Q514m0459J0944
22085c0046l9721M0490K6847N1981l9801J0662O1865L4367r8844m4356O3630l2780
22073D294K4637m4662M9771N968J2720k3352l3818n0187j0749K5552q909M7306
22061a429P478M251R615K2603R8009N554o7399Q7158K3337k2898m6974k4597j8936
22048G5772l3766N2613n3697p3484L3247J6889P3487K0939P3510o640p5346K6750
$$ y = [68540, 20433, -24627, 20216, 58660, 27751, -19884, -41431, -8633, -8874, -34386, -31688, -70870, -119519, -91822, -68844, -51885, -53376, -99519, -49422, -97208, -138156, -113015, -84964, -47221, -15534, 4355, 23053, 39773, 82677, 108417, 84787, 77988, 75655, 46321, 15129, 67871, 72961, 63156, 45574, 110859, 105466, 86136, 24189, 26240, 43370, -9045, -531, -40990, -30046, -69767, -29277, -2430, 49551, 9750, 20412, 82277, 116644, 17800, -26556, 37074, 4294, 28931, -15731, 34040, 40008, 52728, 29376, -4442, -54629, -65378, -39826, -48735, -1429, 6049, 10300, 19915, 42518, 140527, 146081, 78682, 165840, 189177, 166279, 119305, 94708, 75772, 42006, 94619, 40922, -32562, 685, 17574, 91061, 112000, 185510, 178870, 103524, 130274]
22036A30274J2176J4682k0930n3874p1920q596k4639M7369L4140M7366j908m1542
22024F2598n3052k8502K0791K1033K95Q7515L9808l6852k9306p0023P3647k5247
22012F2705o013M2248j3171o6289l0261L4555L6217j0698Q3827J2282l2332N631
22000A18701O2150J1561n3917L0065K8236n4490n1201N6299k739o366Q842o408
21988A40733l5858j4219k119o793K079j3397j4121J0212L1884k2601L2728j8027
21976I0501j0285o172J2666L012J641j2271n4451n3820l6406k4272j750N1379
21964d0228N081L735K7072K2197M0162L8290p9548o5502K1025L3871M6020L7344
21952H9519P292p0847r5502Q8022M0423Q457k1143R456L408o2417j0699k5336
$$ y = [130274, 142450, 157132, 136202, 82328, 10408, 1812, -22827, 24542, 58682, 106048, 104140, 62598, 9546, -18956, 1835, 22868, 23163, 110678, 150486, 113634, 84328, 14305, 87952, 62705, 56692, 98940, 85769, 19480, -10781, 23774, 59991, 49293, 133120, 145402, 113070, 118701, 180851, 192412, 138495, 168560, 196796, 142306, 91105, 147404, 144665, 138299, 147141, 140733, 104875, 90656, 88537, 81744, 83823, 70426, 56305, 66517, 98401, 75800, 108528, 90501, 80216, 74044, 86710, 89722, 91363, 79092, 24641, -29179, -65585, -89857, -91607, -40228, -35147, -31412, -4340, 17857, 58019, 96309, 16761, -48741, -27716, 6155, 52175, 89519, 96811, 25964, -69538, 18484, 58907, 67364, 46221, 55677, 59085, -3332, -14031, -39367]
21940c9367p110J01114j1412p9649o724N2653L7646m0857J9264R4779J964q8707
21928C3594p1068P9962L6574o638m7780r0145m6989N4603K1030l7070j0364Q2788
21916a503j8190m1850K087k5169P457L3561L5899R777K6878L345p1986K2829O1326
21903D4461m3415N1230K3614o4617p8886K1186J3249J4822L4797K7982R984m698
21891D9709l8070o187J3745p1864q252P6050M1992Q474l0254r0533k9589O2811
21879b1968M0201j3018J0757q644K1813o4683p514N9792L5648M1716k104j9098
21867G2898p5906n1394J9969J5340k5750k6509L130l1818N1085Q450N949J519
21855c3037O555k9946N4176J22311O38j5721o2830n1778N3056R8089o621j1459
$$ y = [-39367, -46477, 54637, 43225, -36424, -43148, 9505, 47151, 6294, 25558, 120337, 122301, 33594, -37474, 42488, 79062, 72424, 24644, -65501, -112490, -57887, -36857, -73927, -84291, -1503, -19693, -61543, -59456, -84625, -77168, -43607, -7708, 2069, 28947, 32292, -39694, -16865, 44461, 1046, 52276, 75890, 11273, -67613, -46427, -33178, -18356, 16441, 44423, 54407, 49709, 11639, 5452, 19197, -52667, -60919, 15131, 57123, 65597, 35343, -55190, -84779, -21968, 18233, 5215, 15972, 7328, 29141, -35542, -43056, 16736, 52384, 94100, 91996, 72898, -3008, -54402, -34433, -19093, -44843, -71352, -68222, -100040, -48955, -40505, -34556, -33037, -26482, -56428, -2252, 120059, 120697, 104976, 42146, -9632, 43424, 141513, 134892, 123433]
21843A23433L7680K2428J8863p2241q0034M1173M921J1170l5927J6698j0959Q667
21831H5872n456J2887J3021l3228k1208o0590l0123J9591P4945j3686m3362M6501
21819D5164O2454l2713j16391p5435M8449N1279k4902L626P3486O1795l8102O143
21807F4853j2393p464O1982K4503n0707n6847n1767l2669m0454m1853K9817O6643
21795d6356N4852o840l6695L2350K0833K1411M5217j9084q2815M0514L7053M7099
21783A07539j3007k4475l0732M0577J0876q821n9343o954L5176M3352K2584J2784
21771A29556K9887l0173j7452p2920p7656m5972L2040L2114J574O641K4387l2340
21759b0314M6145J993K1103K117n8703l2419M4503k9092k3038L6112P6874M5078
$$ y = [123433, 161113, 183541, 202404, 130163, 50129, 91302, 96223, 107393, 71466, 88164, 77205, 85872, 80416, 93303, 106324, 73096, 51888, -8702, -38825, -19234, 55711, 42025, -1337, 45164, 107618, 74905, -41486, -116921, -68472, -17193, -42095, -38469, 35017, 96812, 58710, 64853, 52460, 44996, 106978, 131481, 80774, 23927, -27840, -60509, -100963, -142816, -112999, -46356, 8496, 1656, -35039, -2689, 18144, 39555, 84772, 65688, -17127, 23387, 60440, 107539, 94532, 70057, 39325, 79902, 90778, 81957, 22614, 15660, 50836, 94188, 116772, 129556, 159443, 129270, 111818, 38898, -38758, -84730, -52690, -20576, -19002, -12361, 12026, -20314, 25831, 27824, 48927, 51044, -7659, -40078, 4425, -24667, -47705, -11593, 65281, 110359]
21747A10359K6636o245r8755j8641M9311N3586P381j701l0859o186k0161J3351
21735G8076J9530l2975m6878n2359m122J1303P7321L0808m3447p6917o6072M1156
21723f4576P7090m9204j01664R833J16250M4781J2829j2533l6211L9174J62973
21712A98742J6665k4956p2034l9467R51K5007p2952o7379o0293k5101Q8339L3486
21700A008n5360k1940M081J03862O6584q385p3j9611j1737l0216j6751J3624J6025
21687D1111m8224j6751j1071l4953L2770M8037L5178L4231P5496K7476p4406j6000
21675I2894J2536l56N1833J5507n1441J6688k5233m6488k6583n0732l3572k5254
21663g0201P8243J5009K2291P2307R20k4469j7840n8977QJ9906K183k5733K3734
$$ y = [110359, 136995, 130750, 31995, 13354, 62665, 116251, 123632, 121931, 91072, 84886, 64725, 78076, 97606, 64631, 17753, -34606, -38728, -27425, 49896, 80704, 37257, -39660, -105732, -64576, 12514, -36690, -138354, -128521, -12271, 32510, 45339, 32806, -3405, 35769, 198742, 215407, 190451, 118417, 78950, 79901, 104908, 31956, -35423, -95716, -120817, -32478, 1008, -54352, -76292, -72211, 31651, 98235, 89850, 89777, 70166, 58429, 28213, 11462, 25086, 41111, -7113, -23864, -34935, -69888, -37118, 10919, 46097, 80328, 155824, 183300, 108894, 92894, 105430, 105074, 156907, 172414, 120973, 137661, 112428, 65940, 39357, -11375, -44947, -70201, 8042, 23051, 45342, 117649, 118569, 94100, 76260, 17283, 17291, 37197, 39380, 13647, 37381]
21650C7381M197N9978N3031K1302q1264n2624k239j9508j3624k8135M3285n7073
21638c5293l6159J8984L745N0077Q6469m8898j9877M8440m5479J2559l1356O962
21626A0174j9471N483j457J4195J4722K0054J747m1240J3171R4656L3403N238
21614A50675l8366o992R747M5754J2479q5662o9067m5182K3439J3742k128O6177
21602G4616M4019l5319l0297J017l2291P292L323L0469K6162O0519r109k2124
21590A18277k7888K6013J4990n9494n3619k4133J5044n322k2369J2458K3071Q4278
21578A01306R0194k4942o4702p2919n2291K942L9116K1152M5199J7622K6050j8681
21566A10046k8794r8146m2544L0486K806N3453L5226l5071J6218n392J598n1958
$$ y = [37381, 41578, 101556, 154587, 175889, 94625, 42001, 39762, 20254, 6630, -21505, 21780, -35293, -71452, -52468, -48723, 1354, 87823, 38925, 19048, 67488, 22009, 34568, 3212, 10174, -9297, -3814, -5271, 8924, 23646, 43700, 45447, 4207, 17378, 112034, 145437, 150675, 112309, 105317, 115064, 160818, 173297, 87635, 18568, -26614, -3175, 10567, 8439, 74616, 118635, 83316, 53019, 54036, 21745, 29037, 32360, 62829, 88991, 149510, 140401, 118277, 90389, 116402, 131392, 71898, 18279, -5854, 9190, 3868, -18501, -6043, 17028, 101306, 191500, 166558, 101856, 28937, -23354, -20412, 18704, 39856, 85055, 102677, 128727, 110046, 81252, -16894, -59438, -28952, -26146, 27307, 62533, 27462, 43680, 38288, 39886, -12072]
21554a2072P6163O1976N978j1375l283M697M0258l0630m969p1462o6829J3162
21542A614O4463L0019J1620k7736M3527J4382k0484L3804l0087q6494m3380k4880
21530c3632n6319Q1292J00157j6210O319r341M8851R986l1979n4882O1673o986
21518I8929o4078l4646q384k4437j2413N0253O7950O9652k0760k6313n8907m0014
21506c168Q0882J6654R686L1667k7577k1265M0481M7296r520l1407K2744J2512
21494A68985L7703Q510m048o3163l9894K449N9393j6915K668l8300m2395k3189
21482E1804m9458k6770k3926L5585L2282P5039P9035o9344n1495p7570L6521k126
21470I577l2273l084J805M424N3332L3310J4971q2297m232M7992K9364L6972l8078
$$ y = [-12072, 64091, 126067, 132045, 120670, 117387, 122084, 162342, 131712, 126743, 55281, -11548, 1614, 66077, 96096, 107716, 79980, 123507, 137889, 117405, 151209, 121122, 34628, -8752, -33632, -89951, -8659, 91498, 75288, 81607, 72266, 121117, 131103, 99124, 44242, 105915, 98929, 34851, 205, -8179, -32616, -45029, 5224, 73174, 142826, 122066, 95753, 36846, -3168, 77714, 94368, 104054, 135721, 108144, 86879, 127360, 174656, 165136, 133729, 156473, 168985, 206688, 215198, 211150, 147987, 108093, 110542, 169935, 153020, 155688, 117388, 74993, 51804, 2346, -24424, -48350, -12765, 19517, 94556, 173591, 104247, 52752, -24818, 11703, 9577, -22696, -25780, -23975, -19551, 33781, 67091, 82062, -235, -4467, 43525, 72889, 109861, 71783]
21457G1783l2514j6858K5576K1478M0524j1965L5054j8401J0397L0635L3959k9732
21445A59936o0153M095j9564M1578K5699j1761o9089k7399k657L4615l3837l6468
21433D995L2272J9432j9408L1871k5654k2599L9677M6693m1233o6950J546K8370
21421B9012Q5518R0460m4970p8818k6884O177K9010J3174m3026J3045Q795k9476
21409E2017j4906n75o76M0658M3959N945J174j5963o394L2356P8339m7712r8898
21396F9324o0495l3828M4748M9581M9393n60o1854N274L3684J4827K1681k889
21384A28886N527j531k7898o3573J7786K5411K0428n5485p3831l408O401l4890
21372e6177j71O1348N8490R0214L8164n0021J903k4450k2886j7351n8810L1623
$$ y = [71783, 39269, 22411, 47987, 69465, 109989, 98024, 133078, 114677, 125074, 155709, 189668, 159936, 99783, 103878, 84314, 125892, 151591, 139830, 70741, 43342, 40685, 75300, 41463, 4995, 37267, 56699, 37291, 69162, 43508, 20909, 60586, 107279, 66046, -904, 642, 29012, 114530, 204990, 160020, 81202, 54318, 60495, 89505, 102679, 59653, 72698, 81493, 52017, 37111, 36536, 35860, 76518, 120477, 126422, 127596, 111633, 105239, 137595, 215934, 168222, 69324, 8829, -24999, 19749, 69330, 118723, 118163, 56309, 61583, 95267, 110094, 131775, 128886, 134413, 132882, 104984, 41411, 59197, 84608, 105036, 49551, -24280, -27688, -21287, -56177, -56348, 5000, 63490, 153704, 191868, 141847, 143750, 119300, 96414, 79063, 20253, 51876]
21360E1876J8764J6788O496N8055o5925j407M1873L3429N2627J4020k4885m5424
21348A56287n6645j8012n4271J8639P5699Q3680K4716o9008j9410L4212J1778
21337A87665k0525l7020o3197p669O7054O1824k2570j1037l6358k6868o8296O240
21325B9243J13850j7286j6392N6623j3145m5998j4347o5147m3283N345K3785O959
21313B0207L6627l8206L5988P0950J9217j2051l7681k8186Q818K1382M3268K3519
21301A63852j5118R722q493q541L1884l789K6365L420k5213O259J8760m077K764
21288A97795M5487N4539o8115l5870K005j6631J9866K4211P1624J39757J56160
21277E90828J01113N0322M2692M380o2432j46576j09996m6628l781j8448n6018
$$ y = [51876, 70640, 87428, 93924, 151979, 86054, 84647, 126520, 159949, 212576, 226596, 201711, 156287, 99642, 81630, 27359, 45998, 121697, 205377, 230093, 161085, 141675, 175887, 187665, 167140, 130120, 66923, 59254, 126308, 188132, 165562, 154525, 118167, 91299, 23003, 29243, 143093, 125807, 109415, 166038, 152893, 106895, 92548, 27401, -15882, -10537, 13248, 20207, 56834, 18628, 54616, 125566, 144783, 132732, 95051, 66865, 75683, 97065, 140333, 163852, 148734, 158456, 149963, 141422, 173306, 169517, 195882, 199302, 174089, 180348, 199108, 195031, 197795, 243282, 297821, 229706, 193836, 195841, 179210, 199076, 223287, 294911, 434668, 590828, 691941, 742263, 784955, 789335, 726903, 580327, 470331, 423703, 419922, 401474, 345456]
21266C45456J6831J7170L7926J31279J73702J87691Q4205r466n7961j01980j26045
21255F98808j09643o9204o1857j20822O7093P6936P4415Q0167O9736P2810L8864
21244H17303L4130m4183j27458j54475j42442l3998K4131l3792K2841O4692J7474
21233D44223k9574N4997J87111J76267J38101K942m2720j55300j72353r8131j05408
21222D00155j29396o2323m888Q6771m2970K3762k3721n8135k3691L1936J4796
21211B12296o155p598j0453L0621L8809j857q8228m8176l9204M94r266M4650j8791
21198I7142M7544r640r8813J6263J43634J6763j979o585n17j1337K2859N74j2751
21185B03157Q1115m2029r4056k690M9072L0075l6919p1448j6603K8397K0640K3913
$$ y = [345456, 362287, 379457, 417383, 548662, 722364, 910055, 994260, 984794, 926833, 824853, 698808, 589165, 519961, 458104, 337282, 404375, 481311, 555726, 635893, 705629, 778439, 817303, 851433, 807250, 679792, 525317, 382875, 348877, 373008, 339216, 362057, 426749, 444223, 414649, 469646, 656757, 833024, 971125, 974067, 931347, 776047, 603694, 505563, 400155, 270759, 208436, 203548, 290319, 247349, 271111, 247390, 189255, 165564, 197500, 212296, 206141, 198543, 188090, 218711, 257520, 255663, 167435, 119259, 80055, 80549, 71283, 115933, 97142, 144686, 135046, 36233, 52496, 196130, 212893, 210914, 204329, 203812, 192475, 215334, 215908, 203157, 284272, 242243, 148187, 145497, 194569, 224644, 187725, 116277, 99674, 128071, 148711, 172624]
21173A72624L0995K0934M6572n275n8974K6911l2913k8475L1982L2088n6532q5445
21161I4492J7960j5343m0850N7654P7523k8759n2037j5207P7786M1781j4047O161
21149B07114m310n7433k1125K5326n6918k5256R2826K0220K7200j8440m2382J1035
21137A57857k3875q290O8013K0842n2400l7715N037n4394n6155M0817O3642L5683
21125A59062l661J9860N215N1204m495l9761n0104m37q512j6812N8331N6385J676
21112B27951o6438j6949P157K3143n944k3628M480L6972p484m6943m1227L6775
21100A27865l7895j7429k3661J1656N1810R29J0547P1261k2159K1312n5323m3335
21088I5578N3285L2619J8566n5309L6074j2574q2441M2221O5000k433j03173o0648
$$ y = [172624, 203619, 224553, 271125, 265850, 206876, 233787, 200874, 172399, 204381, 236469, 179937, 94492, 112452, 97109, 56259, 113913, 191436, 162677, 110640, 95433, 173219, 215000, 200953, 207114, 202804, 145371, 124246, 149572, 92654, 67398, 160224, 180444, 207644, 189204, 146822, 157857, 133982, 125692, 193705, 214547, 162147, 124432, 129469, 75075, 18920, 59737, 123379, 159062, 155401, 175261, 180476, 231680, 227185, 187424, 137320, 136883, 128371, 111559, 169890, 226275, 227951, 161513, 144564, 151721, 174864, 168920, 145292, 149772, 186744, 179260, 132317, 91090, 127865, 89970, 72541, 48880, 60536, 112346, 113275, 123822, 195083, 172924, 194236, 138913, 95578, 148863, 181482, 200048, 144739, 180813, 168239, 85798, 128019, 193019, 190586, 87413, 26765]
21076B6765J30910R1106m2734j9374j2886P1784k9862l8817J3782j6516k6186
21065A47972K8014K0607L4351o2471k3421L7250L3870l7606p5509l112O670l3461
21053G3154J4293j0828N7135k0840j5186Q4787K3191L381j1321j4006o4972j3830
21041A04958J01782L4300r7998O991M981q889j2626m0365l8451K7741l462j984
21029G6978P5684N2631l0226N878p3881n2235O923J0466L8126J16316K7368L456
21017B57484k0610n607n8477l7449k8548j3367j3844l4124M7223J01072M9586
21006B43339r2464n4819R022L7384K8231O4496N929J820k0704k9256j6653J3003
20994A89328N493N2922O460M1797O6436M7448M6976Q2537J07736L3815L0217N0658
$$ y = [26765, 157675, 248781, 206047, 186673, 173787, 245571, 215709, 176892, 190674, 174158, 147972, 175986, 196593, 230944, 168473, 145052, 182302, 216172, 178566, 103057, 99945, 106615, 73154, 87447, 76619, 133754, 112914, 97728, 182515, 205706, 209087, 197766, 183760, 118788, 104958, 206740, 241040, 143042, 150033, 155014, 146125, 133499, 93134, 54683, 82424, 78962, 76978, 152662, 205293, 175067, 180945, 107064, 54829, 61752, 72218, 110344, 226660, 254028, 257484, 236874, 231267, 172790, 135341, 106793, 93426, 79582, 45458, 92681, 193753, 243339, 150875, 96056, 105078, 142462, 170693, 235189, 241118, 242938, 222234, 192978, 176325, 189328, 194821, 247743, 254203, 296000, 362436, 409884, 456860, 539397, 647133, 680948, 711165, 761823]
20982G61823O4494n2679q5531p7553q953J1939p2661r627J8777N6727J33663J21111
20970H61530R8793N3531o1648j66156j14364k1010m49L7595J00423q8514j47996
20959E51735o3423m3818k3851k8215l2519P3790M518j3725o4909l4616l0663M1439
20947C35743O8078l4080J1343L3488Q790k451l2185K0562M0145M4871M4247O4297
20935F02848M2918m0627l7954m9022n422L4329N4124K6379K3632P3435Q8158J06644
20923I19442R4105N6589l7461o5915o4379k8420n1664o2356Q41P7346J9890n48
20911H57470K0934l4040j42663k8838n7664r4319k2885j7664l8591l703m0129
20900C97908l5334N0701M5179r9176k5548P22K248K8312N862P036J364J5468k7067
$$ y = [761823, 826317, 773638, 688107, 610554, 601601, 613540, 540879, 531252, 550029, 606756, 740419, 861530, 960323, 1013854, 952206, 786050, 671686, 650676, 650227, 687822, 788245, 699731, 551735, 488312, 444494, 420643, 392428, 359909, 433699, 438217, 424492, 359583, 324967, 294304, 335743, 403821, 369741, 381084, 414572, 423362, 420911, 388726, 409288, 449433, 494304, 538551, 602848, 645766, 605139, 567185, 518163, 512741, 547070, 601194, 627573, 651205, 724640, 812798, 919442, 1013547, 1070136, 1032675, 966760, 902381, 873961, 822297, 759941, 760782, 838128, 858018, 857470, 878404, 844364, 701701, 672863, 615199, 520880, 497995, 480331, 441740, 438037, 397908, 362574, 413275, 458454, 359278, 333730, 334452, 336700, 365012, 370874, 377910, 379274, 394742, 367675]
20887C67675k7707Q9075R480M2204k6041l1463m4924m1796N705P5909j5882p7624
20875C24611n732M3687R3423N4758m4635L9273l5145q9859l4505k867k408J4280
20863C54881l071M1204O5703J167o7809K2655R2198L1723m0945O7819J18931j8633
20851F65823j05075r4577O4933P5799j32125n9651P2851o652j2653l813L513J6713
20839D85086J4846j0538j7963K4539L2722Q5690J03649k3503P2222O3304r4934
20828G35120j5125N9880L0404n1633j07414j14083o3530o753N906J7274J640L3967
20816E25653p5737K8980N5807o1262j5657o105L310K8687p485M5574J0678P649
20804E40092o4631j6986P4664P8084O9612R0259M5769M655M3059N5512N873j45357
$$ y = [367675, 339968, 429043, 438523, 480727, 454686, 423223, 378299, 336503, 342208, 418117, 402235, 324611, 318879, 362566, 455989, 510747, 466112, 505385, 470240, 380381, 345876, 343009, 340601, 354881, 351810, 393014, 458717, 459884, 392075, 414730, 506928, 538651, 497706, 565525, 684456, 665823, 560748, 466171, 531104, 606903, 474778, 415127, 487978, 481326, 468673, 464860, 468373, 485086, 499932, 489394, 471431, 495970, 528692, 614382, 718031, 694528, 766750, 830054, 735120, 719995, 779875, 810279, 758646, 651232, 537149, 473619, 466866, 472772, 490046, 491686, 525653, 449916, 478896, 534703, 473441, 457784, 451679, 454989, 483676, 476191, 521765, 532443, 540092, 475461, 458475, 533139, 611223, 680835, 771094, 816863, 821518, 864577, 920089, 925962, 780605]
20792G80605j02498j220k9034j7296L8665j3636k703K0132o4036N192Q534j0105
20780F12600n5476N193M9965P1834l6723K6602N8557J13564j4472p8665N9375
20769H12354Q2719P3194L5440j86R0134K0961k0971l724J0054L6404Q5212N4186
20757A275777N6742n622j8899k977N4197L4796J1805k5263o6129K9434J06297
20746A450158N2534J9400O9075J26557Q9857N9474J32107R2960O0165O1249K8971
20735B242507N5374J47587J34969K00723J98688K45453L94066L82982K75096J38430
20725D415875j9939r220J32033K68291L97596M46768M08678L23208K66229J61375
20715F790894J85027K39438L44802N15036O15624P88495J062119J251300J554070
$$ y = [780605, 678107, 676887, 647853, 630557, 669222, 655586, 652883, 673015, 608979, 614171, 622705, 612600, 557124, 562317, 612282, 684116, 647393, 673995, 732552, 846116, 831644, 752979, 812354, 895073, 968267, 1003707, 1003521, 1093655, 1114616, 1093645, 1089921, 1099975, 1136379, 1221591, 1275777, 1332519, 1326897, 1307998, 1305021, 1359218, 1394014, 1405819, 1380556, 1314427, 1343861, 1450158, 1502692, 1522092, 1591167, 1717724, 1807581, 1867055, 1999162, 2092122, 2152287, 2213536, 2242507, 2297881, 2445468, 2580437, 2781160, 2979848, 3225301, 3619367, 4002349, 4277445, 4415875, 4395936, 4386716, 4518749, 4787040, 5184636, 5631404, 6040082, 6363290, 6629519, 6790894, 6975921, 7215359, 7560161, 8075197, 8690821, 9479316, 10541435, 11792735, 13346805]
20706A3346805J970967K456285L310307M474169O296180R259896J3418530J9864716
20698G4397855K9945961M3745771N6239947N1004980K0438238j3355743m6645365
20691B15771644o0262380m4250199k6985856j6710519j1012043p666820n755694
20684D3128133m489319l409317k440775j706832j167392o41206j37676M79213
20676B9614829J189670J901914K841638L724179M844652O623841R597056J4022188
20668G4359967K1151369L2053648M6751757N7351575M5688149J1671394k2210552
20661B66817307n5089902o0865684m2048696k5955548j6556830j1251385q045253
20654D7004009n975246m730225l710571k902441k308719j944990j531653j164336
$$ y = [13346805, 15317772, 17774057, 21084364, 25558533, 31854713, 41114609, 54533139, 74397855, 104343816, 148089587, 204329534, 255334514, 275772752, 262417009, 215771644, 155509264, 111259065, 84273209, 67562690, 56550647, 48883827, 43128133, 38638814, 35229497, 32788722, 31081890, 29914498, 29273292, 29135616, 29614829, 30804499, 32706413, 35548051, 39272230, 44116882, 50740723, 60337779, 74359967, 95511336, 127564984, 174316741, 231668316, 277356465, 289027859, 266817307, 211727405, 150861721, 108813025, 82857477, 66300647, 55049262, 47004009, 41028763, 36298538, 32587967, 29685526, 27376807, 25431817, 23900164, 22735828]
20646B2735828p73272m68563j89788J06483J99941O9704m1935M3671m4110n86349
20636B1051610j232099j715810j934980j649630j177292r51369q43765q29511
20628A0717154j010971r59300p97645o15050n37856m19919l86686l21553k61429
20619E406745k12603j43666j17232j19107q3137o1328Q2587K00321M27387P17163
20609F097130J062769J526473J487939N55488m25863j495676k175858j612448
20601E019954r03623n58221m17955k83947k65515j92362j53638m7784r3894j14384
20591A988631m6941m7541k7705M5573k6237M8322J06379J11014J03922Q0332J89373
20580B525122L13712L94958O03452Q63089P63214J97879l23570q33533j056475
$$ y = [22735828, 21962556, 21493993, 21304205, 21410688, 21610629, 21680333, 21638398, 21682069, 21637959, 21051610, 19819511, 18103701, 16168721, 14519091, 13341799, 12390430, 11546665, 10717154, 9706183, 8746883, 7949238, 7334188, 6796332, 6376413, 5989727, 5668174, 5406745, 5194142, 5050476, 4933244, 4814137, 4731000, 4669672, 4752259, 4952580, 5379967, 6097130, 7159899, 8686372, 10174311, 10729799, 10303936, 8808260, 6632402, 5019954, 4116331, 3558110, 3140155, 2856208, 2590693, 2398331, 2244693, 2196909, 2103015, 1988631, 1941690, 1894149, 1866444, 1912017, 1885780, 1934102, 2040481, 2151495, 2255417, 2335749, 2525122, 2838834, 3233792, 3837244, 4700333, 5463547, 5661426, 5337856, 4504323, 3447848]
20571C447848o74347l36187k90528j95353j41519j69487j35616j23978j09031
20562A271802j68705n6907K8386O813j14982p8661K6009M2975J2924M7960L2939
20551A050553j311Q3979N7378Q9445M2869P4998o0249n2404j3365L2423N2103
20540A356419n173n3966m0313Q5641L7821m66r9614j44244q9220o0920k8011k4710
20528I33244K0143K7414m0598J2137q144J6391j608l8049m0813r1515J6381O6764
20516H71747J9554J5283M6853O6521l1326r1017o8269j5490n605O284K5408J21750
20504I61693K6807k8830o8918P5610R5142j9021R0439K1771L4816O3069k736J12988
20492A362830J31012M0693J6809J4256K9455P9659Q8269j799l1277K9221O5111
$$ y = [3447848, 2773501, 2437314, 2146786, 1951433, 1809914, 1640427, 1504811, 1380833, 1271802, 1103097, 1046190, 1074576, 1081389, 966407, 887746, 913755, 956730, 969654, 1017614, 1050553, 1049242, 1133221, 1190599, 1280044, 1322913, 1397911, 1337662, 1285258, 1271893, 1304316, 1356419, 1351246, 1297280, 1256967, 1342608, 1380429, 1379963, 1280349, 1136105, 1046885, 985965, 957954, 933244, 953387, 980801, 940203, 952340, 944196, 960587, 958979, 920930, 880117, 788602, 804983, 871747, 891301, 906584, 953437, 1019958, 988632, 897615, 829346, 813856, 808251, 814535, 839943, 961693, 988500, 959670, 890752, 966362, 1061504, 1042483, 1132922, 1154693, 1189509, 1252578, 1249842, 1362830, 1493842, 1534535, 1551344, 1565600, 1595055, 1674714, 1762983, 1761184, 1729907, 1759128, 1824239]
20481A824239J23218K01470L57771L17569K92502J54756L1886J331R7885J59316
20471C561943J37514J28946J82733L86251O64887J032144J303709J597954K094935
20462A1091016K971599M178175M966303L726160J292007q34542k640320j501046
20454B3249352J074304L650313O748764J1114053J7807977K7690738L7850107
20447A29185608L6148328J9415688L056761j8867194k6819223k2642723k0251755
20440I9225490j7431978j5090586q366349j373355M038674O885030M563453j384911
20432G1065468p082705j2117399j1378147p502621m649840k961927j812429j095394
20424B2465006q04157o63106n63160n92153p03662q16363o61316n00707k96505
$$ y = [1824239, 1947457, 2148927, 2506698, 2824267, 3116769, 3271525, 3303411, 3304742, 3402627, 3561943, 3699457, 3828403, 4011136, 4397387, 5062274, 6094418, 7398127, 8996081, 11091016, 14062615, 18240790, 23207093, 26933253, 28225260, 27390718, 24750398, 23249352, 24323656, 27973969, 34722733, 45836786, 63644763, 91335501, 129185608, 165333936, 184749624, 187806385, 168939191, 142119968, 119477245, 99225490, 81793512, 66702926, 58336577, 56963222, 61001896, 67886926, 72450379, 71065468, 63982763, 51865364, 40487217, 32984596, 28334756, 25372829, 23560400, 22465006, 21660849, 20997743, 20434583, 19842430, 19138768, 18322405, 17661089, 17160382, 16863877]
20415A6863877k10010j13556r1795P9762L76970R95075J748841K852458M394322
20406B6895944O703637R846198J2233763J0304832M150959j895934p318755p006403
20398E3914241j076264N925162J3314359K0371238K4417476K7428815L0351896
20391A74646923K7810988J5770361q989390k7075352m4944891m2054585k5100713
20384G0063341j4082651q216937m645494k065698K83042K265500K151873n66670
20376D5186306l159178n900642o286764m162390k575410j772524j364673j011159
20368A8953566q81447j074935j008668r60878r63357r14481q53830p08020o76443
20359A0911507o95397o59990p36697p28215o52509n41484n42952m85096m08069
$$ y = [16863877, 16653867, 16540311, 16448516, 16528278, 16905248, 17900323, 19649164, 22501622, 26895944, 33599581, 43445779, 55679542, 65984374, 70135333, 68239399, 60920644, 53914241, 52837977, 58763139, 72077498, 92448736, 116866212, 144295027, 174646923, 202457911, 218228272, 209238882, 182163530, 137218639, 95164054, 70063341, 55980690, 47763753, 43118259, 41052561, 41335603, 43601103, 45752976, 45186306, 42027128, 36126486, 29839722, 25677332, 23101922, 21329398, 19964725, 18953566, 18072119, 16997184, 15988516, 15027638, 14064281, 13149800, 12295970, 11587950, 10911507, 10216110, 9556120, 8819423, 8091208, 7438699, 6897215, 6354263, 5869167, 5461098]
20350E461098l35047l71290l34343l02169k68491k63482k01398j13982j84692
20341C086204k84399j95147j16844j21516q2880o7071p9285q6928o2370p6574
20331A913190j28272j33347j33757q7253k7516k460m4948l1107m9856j2247l3669
20320A228758j8830n0827q2511n8849j32724p8935q7864q8412k2759k4623Q396
20309E90820j582m8678q7153j3601j0747k3589p1323j7518k2469n0349O502m148
20297B46165l4341N6794M3972J479l6820k8352o6363n8815N5149L8331K1688J1693
20285B50580P391J5729l6668k9696J4605Q8030P9163r8278j0139P275O0510M6446
20273C94948l6263M1532J8164K132L2231L9329l176l263m40l650m2562j7816m8808
$$ y = [5461098, 5126051, 4754761, 4420418, 4118249, 3849758, 3586276, 3384878, 3270896, 3086204, 2801805, 2606658, 2489814, 2368298, 2285418, 2218347, 2139062, 2052134, 1989764, 1913190, 1784918, 1651571, 1517814, 1430561, 1403045, 1400585, 1355637, 1324530, 1274674, 1262427, 1228758, 1209928, 1159101, 1076590, 1017741, 885017, 806082, 718218, 629806, 607047, 582424, 590820, 589238, 540560, 453407, 439806, 429059, 405470, 334147, 316629, 294160, 243811, 250313, 246165, 211824, 268618, 312590, 314069, 277249, 248897, 182534, 123719, 178868, 217199, 238887, 250580, 257971, 273700, 237032, 207336, 221941, 309971, 389134, 290856, 280717, 287992, 348502, 394948, 358685, 400217, 418381, 420513, 452744, 492073, 488897, 485634, 485194, 481544, 438982, 421166, 372358]
20260C72358n7543r4276p2157j5822L0176J1142n8614j0498J6179k509L4990m0544
20248A12882r87L3063K1056q30n073L948r530o2363n4393N306P4692j2257m5616
20235E9898k7875j449l7835J935O3566K5836P3852P6432p8012q1544J1503M6552
20223A32859j0431n1069P305j03491j6252k4729L1939P7149J17033O2487L7663
20212B60463m704j27396r7738K9479K6211k6749m0019L2440K8414L2415j016k4970
20200H6830k3448J6815K5272J8912K2380l2782k6210k3070n3473O739O4340L1729
20188A14034O4951j701K6637j7103ql981j0866K5222m3109m4655j1942l3994k2350
20175D1135J0267K7577R3044N1532L8320j5914n5301K6365m0675j2463P177k1262
$$ y = [372358, 314815, 220539, 148382, 132560, 162736, 173878, 115264, 104766, 120945, 118436, 153426, 112882, 111895, 144958, 166014, 165184, 160111, 164059, 154529, 92166, 37773, 43079, 117771, 105514, 59898, 32023, 30574, -7261, -5326, 58240, 84076, 157928, 234360, 156348, 74804, 86307, 132859, 122428, 71359, 78664, -24827, -41079, -65808, -33869, 43280, 160313, 222800, 260463, 255759, 128363, 30625, 60104, 86315, 59566, 19547, 51987, 80401, 112816, 111800, 86830, 63382, 80197, 105469, 124381, 146761, 113979, 87769, 64699, 11226, 17965, 82305, 114034, 178985, 177284, 203921, 186818, 186810, 182829, 171963, 197185, 154076, 109421, 97479, 63485, 41135, 51402, 78979, 172023, 223555, 261875, 245961, 190660, 217025, 176350, 163887, 171064, 149802]
20163A49802n804m1020o4035j6698N3699L8600L1485l0755L2864M1217J3233J4351
20151B16939p325K8262K2603J29554P7305l6903L2838L2247n7620N3273R2813
20140E83986R3049R3390J07699K36393L93585N36936M92944K27656j5249l19331
20130B431058l17297l06293k80843k45316j07210k8486K11338K93135J87027Q5632
20120A922745j43759k42559k71424k01393j11672j93394j01766J5125J4352k3254
20110F63001O5301J21813R6463O1713R9931J6102k6326r4305r0573j09070m7112
20099G56938l0631p9860J6528M9408J05977J72224K97332L65086L63424K38092
20089B254518Q3749m6865j23352k44556j46669k5533J22211L00630L12686L88715
$$ y = [149802, 143998, 102978, 38943, 22245, 75944, 114544, 146029, 115274, 148138, 189355, 202588, 216939, 209614, 237876, 260479, 390033, 467338, 430435, 463273, 495520, 437900, 491173, 583986, 677035, 770425, 878124, 1114517, 1508102, 2045038, 2537982, 2765638, 2750389, 2431058, 2113761, 1807468, 1526625, 1281309, 1174099, 1145613, 1356951, 1650086, 1837113, 1922745, 1778986, 1536427, 1265003, 1063610, 951938, 758544, 656778, 671903, 686255, 663001, 728302, 850115, 946578, 1008291, 1108222, 1124324, 1097998, 1003693, 913120, 804050, 756938, 726307, 646447, 662975, 712383, 818360, 990584, 1287916, 1653002, 2016426, 2254518, 2338267, 2291402, 2168050, 1923494, 1776825, 1751292, 1873503, 2174133, 2486819, 2875534]
20079B875534M22799L66550J38380o5014k66397m04375l89445l70208l25307k21601
20069A760916j30693o0797n9623j45999j00515r4432j46410j39773j48808j56874
20059E76992j5956J9160o2959j897N3903j2238O8902J8549r8983q7750K1037K9759
20047E08519j2702j979K848o5141q8669p4611m1437j531J5750L0478k082L0376
20035B99819j5021N235J85151J92183R8293n3582j51054p4007r8797j8595L1208
20024D00833P6472O5876L6340L0586k534k0648l8239r3060k152o6197l7399N5827
20012D05705K2669J478j0092q575n0193l008Q0095O8038N4541k2565j9373n8334
20000D60386o1776r5307L4045J16632R5580J60395K28874L40840N01082N35724
$$ y = [2875534, 3298333, 3664883, 3803263, 3738249, 3471852, 3067477, 2678032, 2307824, 1982517, 1760916, 1630223, 1569426, 1509803, 1363804, 1263289, 1168857, 1022447, 882674, 733866, 576992, 561036, 580196, 517237, 515340, 569243, 557005, 625907, 644456, 545473, 457723, 478760, 508519, 495817, 493838, 496686, 431545, 342876, 268265, 226828, 225297, 241047, 271525, 269443, 299819, 284798, 290033, 475184, 667367, 765660, 712078, 561024, 487017, 388220, 369625, 400833, 477305, 543181, 579521, 610107, 607573, 586925, 548686, 455626, 453474, 387277, 349878, 405705, 428374, 429852, 419760, 411185, 360992, 357984, 438079, 506117, 560658, 538093, 518720, 460386, 398610, 303303, 337348, 453980, 549560, 709955, 938829, 1279669, 1780751, 2316475]
19990B316475K91952K0321j92565l05377k91582l24327k61049k03119j61033m6840
19980H42856J6679R2930P6948L1935o5738j86571k21362j39869l6999k0330j3202
19969C77277j8213l046R624M9260l1118j07620p2749J5810N1398N5461l1046O7503
19957C62541M1013P9771P5913O02l3542j8197J8834Q8365K05809J55295K0782
19946I97186Q287r0408j42916l7594J87682J88679L13269M49605M13165M06093
19936B693048L28699k1609k21689l86687n40823m04774k62414j62504j27689r0906
19926H02652k6076p0268Q4725Q3647K2201P976K1809n1154j07511r1385q710l040
19914F64866O9808J5689J0693O7779L6810J1762l6299n8214n2710q7829j11110
$$ y = [2316475, 2608427, 2628748, 2436183, 2130806, 1839224, 1514897, 1253848, 1050729, 889696, 842856, 859535, 952465, 1029413, 1061348, 995610, 809039, 587677, 447808, 410809, 390479, 377277, 359064, 356018, 365642, 414902, 383784, 276164, 203415, 219225, 270623, 326084, 295038, 362541, 403554, 483325, 559238, 559840, 526298, 508101, 526935, 615300, 821109, 976404, 997186, 1005473, 915065, 772149, 734555, 922237, 1110916, 1424185, 1873790, 2286955, 2693048, 3021747, 3000138, 2778449, 2391762, 1850939, 1446165, 1183751, 1021247, 893558, 802652, 776576, 706308, 791033, 874680, 896881, 904857, 926666, 875512, 768001, 676616, 667906, 664866, 734674, 750363, 761056, 828835, 865645, 877407, 841108, 782894, 730184, 642355, 531245]
19903E31245j20187j17059j0164O6752O9452n8001o2732p7378o313O4673L5917
19892C16205N1588k9985p8277j488j1217l4172j2731N1407Q4962n1656o7199j294
19880B16143O3442Q9341M7380N7134l3454N848J912p2159m7941O2580J05115O5329
19868E60670j5699P0385k3583M1227Q6213j5551L8830l3049o2996r8822j45671
19857D01954k2792K8588K0896N2117R9456N4348J51895M0288l2555L7988j6736
19846H15447j84303k19587r6134n2378N8800o1126k617M528j6169q2297q868j3461
19834A41835J72R42M7352j294p2755k3622L5078J3413M1174J9750k3320j2177
19822A66548Q5827K6167m8329k6122k8725m634p4559o3288Q8629J1851m1782k5172
$$ y = [531245, 411058, 293999, 283835, 350587, 420039, 362038, 299306, 221928, 215615, 280288, 316205, 367793, 337808, 259531, 258043, 246826, 212654, 199923, 251330, 336292, 284636, 217437, 216143, 279585, 368926, 416306, 473440, 439986, 445834, 447746, 375587, 327646, 390226, 495341, 560670, 544971, 615356, 591773, 633000, 719213, 703662, 742492, 709443, 646447, 547625, 401954, 379162, 407750, 428646, 480763, 580219, 634567, 786462, 826750, 794195, 832183, 815447, 631144, 411557, 315423, 263045, 321845, 260719, 258102, 262630, 246461, 164164, 155296, 141835, 142007, 142949, 190301, 189007, 116252, 92630, 127708, 141121, 182295, 202045, 178725, 166548, 252375, 278542, 230213, 204091, 175366, 170732, 96173, 32885, 121514, 133365, 91583, 66411]
19810F6411L829J4544n1344J1645N8623l9799L416O4862N0470r763M771j1439
19798A66226r610k5182L6372K0464k1527r3471p2186m8354J056j959P8721N6637
19786H7187L2353K9703j5834J2695K1495o059n7570J6879k3095m57k9352r66K4647
19773I1626J8852k9613m6822k9733K8406n604L0247O4129J1489k3778k4115L0224
19761A15308j6524l1103m512n532R636P5543K1030k0658o5404l3458K0684O3160
19749A28170K6565p1901l7533O6567J7579k4972M3963K7987M0425J4587j3913
19738B17524k2458r294k1586N876l9414j6141n842K6988M5870k0400j3065K5619
19726A73677J8369o2432j3742J1021q3235k7295Q0977O0445j7747l2964K5171
$$ y = [66411, 70240, 84784, 33440, 45085, 103708, 63909, 67325, 132187, 182657, 172894, 177665, 166226, 156616, 131434, 167806, 188270, 166743, 73272, 1086, -47268, -46212, -48171, 30550, 87187, 119540, 149243, 133409, 146104, 167599, 161540, 103970, 120849, 97754, 97297, 67945, 66979, 91626, 110478, 80865, 34043, 4310, 32716, 27112, 57359, 121488, 132977, 109199, 85084, 115308, 98784, 67681, 63169, 57637, 67273, 142816, 163846, 143188, 77784, 44326, 65010, 128170, 154735, 82834, 45301, 111868, 129447, 104475, 148438, 176425, 216850, 231437, 217524, 195066, 185772, 164186, 170062, 130648, 114507, 108665, 135653, 181523, 161123, 148058, 173677, 192046, 129614, 115872, 126893, 43658, 16363, 97340, 157785, 140038, 107074, 132245]
19715A32245M1611P2076Q81o4034l6345k5290M878J6059l6128N5841O7700N3162
19703B82656o162n9445K151l9399p436M5266o6717j3603K5468J4026O694K1432
19691B04931R0163P4233p239k4727O6678q038K2393K862R3655j9199q4057m6200
19679C65455m2092j12828k5038J006j7732o639J7884K1383O4060j0499n7245L6682
19667B34397n9148m8632j7910K9874l8408P217P3157L8274Q655m1628q6848M6384
19655A45384O7637K7186L2383L5051O7390L0191K2274l1475K7854m163n3177J5684
19643C82219K3476k9002O6533j8548k4548M7332R9649j160m6409p5164N6117J40808
19631F21303L5018o01k7008K2268k1921M897k6449K3853m2401J7285m655n5512
$$ y = [132245, 173856, 245932, 246813, 182779, 146434, 121144, 126022, 142081, 105953, 161794, 229494, 282656, 276494, 217049, 219200, 179801, 172365, 217631, 150914, 137311, 162779, 176805, 183499, 204931, 295094, 369327, 362088, 337361, 404039, 396001, 418394, 421256, 514911, 495712, 411655, 365455, 323363, 210535, 185497, 186503, 168771, 162132, 180016, 201399, 265459, 254960, 197715, 234397, 175249, 126617, 108707, 138581, 100173, 107390, 180547, 218821, 227476, 185848, 99000, 145384, 213021, 240207, 272590, 307641, 375031, 405222, 427496, 396021, 423875, 419712, 366535, 382219, 405695, 376693, 443226, 424678, 400130, 447462, 547111, 545951, 499542, 424378, 480495, 621303, 656321, 655720, 628712, 650980, 629059, 633956, 607507, 631360, 588959, 606244, 601589, 546077]
19619E46077j852Q94J0745L9980Q725M7787M770j7529k245p2724p495k5304j4310
19606E17519J41750Q1464q855L7905Q8214P3629l0974K5095L8573k9009K1845
19595I57156N4752P8014L2490P8346J04881J18305M2567j4771N305J3627Q2551
19584A553223J76702J66811P6799L3611P9035J73577K54182K57763L80094N07986
19574C659783O34116M97584M80958M27110N47588P66270J077390J554577K242098
19565A1887474L345951M902160N972914M449164J632126q35151k985890j506816
19557B6861932J574598M837559Q779281J4181739K2508346L4598138M4967748
19550A58309341L8721516J8405403j598544k8001495l1891402k7706464k2696618
$$ y = [546077, 544225, 545119, 555864, 595844, 604569, 652356, 657126, 639597, 637352, 564628, 557133, 531829, 517519, 659269, 740733, 731878, 769783, 857997, 931626, 900652, 925747, 964320, 935311, 957156, 1011908, 1089922, 1122412, 1200758, 1305639, 1423944, 1466511, 1451740, 1457045, 1470672, 1553223, 1729925, 1896736, 1973535, 2007146, 2086181, 2259758, 2513940, 2771703, 3151797, 3659783, 4293899, 4791483, 5272441, 5699551, 6247139, 7013409, 8090799, 9645376, 11887474, 15233425, 20135585, 26108499, 30557663, 32189789, 31354638, 28368748, 26861932, 28436530, 33274089, 42053370, 56235109, 78743455, 113341593, 158309341, 197030857, 215436260, 213837716, 185836221, 153944819, 126238355, 103541737]
19543A03541737j9313216j4480071p041617o24101M486837P083627M141538k087897
19535G5706837p979188j3295203j1975264p594342m627811k766179j603757j106378
19527B4758715j021201j035015r60056r88068r94213q56623p67948p00200m99374
19518A6936017k65143j09674K0776J57887K03989O88077J409757K355389L831964
19509B5229039N981208Q949093J1342359R645349M027575j218942o300714n675977
19501E1978990J57508O701433J3350320J8469923K0939743K3847495K4759375
19494A60204787K3020018R580823j2344043k6449043m1668574l3857258j9404229
19487E9082481j1117468o527485l767774j710669K22381J579064J273413q86859
$$ y = [103541737, 84228521, 69748450, 62706833, 62082732, 66569569, 73653196, 77794734, 75706837, 67727649, 54432446, 42457182, 34862840, 30235029, 27468850, 25865093, 24758715, 23737514, 22702499, 21742443, 20754375, 19760162, 18903539, 18135591, 17435391, 16936017, 16670874, 16561200, 16581976, 16739863, 16943852, 17631929, 19041686, 21397075, 25229039, 31210247, 40159340, 51501699, 61147048, 65174623, 63955681, 57654967, 51978990, 52136498, 58837931, 72188251, 90658174, 111597917, 135445412, 160204787, 183224805, 192805628, 180461585, 154012542, 112343968, 78486710, 59082481, 47965013, 41437528, 37669754, 35959085, 36181466, 37760530, 39033943, 38147084]
19479C8147084k780070m958580n168612l321667j953458j217894r01496o34485
19471A7210822o12040p90306j080261j224394j202502j067200q94935q22942o15501
19462H900741n08874o15115n94056m94701m48138l94437l97425l82785l79469
19453D685741l50316k73509k79615k79919j84534j75472k19004k26386j18772
19444B578214q4368j46432j43775k3433r8549j20435o8515q4957p0699p0032r1854
19433A575165j18638j37314J0575O8170N750j0144k3617m7250j6359J2949o0179
19422A259108r8375j51720j58670o7881k9823J9098o2372k6782O2467n1253j24114
19411E69683k4059K2678k6520o3966j3505l7791m8643o7649p0634q270J02092
$$ y = [38147084, 35367014, 30408434, 25239822, 21918155, 19964697, 18746803, 17845307, 17210822, 16598782, 15808476, 14728215, 13503821, 12301319, 11234119, 10339184, 9516242, 8900741, 8391867, 7776752, 7182696, 6687995, 6239857, 5845420, 5447995, 5065210, 4685741, 4335425, 4061916, 3782301, 3502382, 3317848, 3142376, 2923372, 2696986, 2578214, 2493846, 2347414, 2203639, 2180206, 2081657, 1961222, 1892707, 1807750, 1737051, 1667019, 1575165, 1456527, 1319213, 1329788, 1397958, 1403708, 1393564, 1369947, 1322697, 1306338, 1319287, 1259108, 1160733, 1009013, 850343, 782462, 752639, 771737, 709365, 682583, 745050, 693797, 569683, 545624, 568302, 541782, 477816, 464311, 426520, 377877, 310228, 239594, 231324, 333416]
19400C33416j3578m3737p0575r538k3289n8671n6205k0097M7534L5458N427L87
19388A26532K5496L1725N3868M6658K7886m119J8913o9107l745K9713J01250K4071
19376D09141j7292k8037j0054O822L9748J07002o2351o7444K8308N5701m2852
19365D18692n2604J0857n8390k1723j5211r2300n385q3746K4667O3906L6956j4751
19353B10968j6191l5008K3468J293L3867l6438k6658k8730n1511J9116J2490l1601
19341G5065P5203k2861j4373l6446m4842l3540r458n00N0834J0993J1098l459
19329E7714k3683R9955N6623k8592j6447n8421k1148L4075j5132l1996M2641l427
19317I2162n092R707J2572n2027o3687n3288M04N0057N567j6104o17l8736k4237
$$ y = [333416, 319838, 276101, 205526, 195988, 172699, 114028, 57823, 37726, 85260, 120718, 126145, 126532, 152028, 183753, 237621, 284279, 312165, 308046, 326959, 257852, 254107, 283820, 385070, 409141, 391849, 363812, 353758, 360580, 400328, 507330, 444979, 377535, 405843, 461544, 418692, 366088, 376945, 318555, 296832, 281621, 189321, 183936, 100190, 124857, 188763, 225719, 210968, 194777, 159769, 183237, 184530, 218397, 181959, 155301, 126571, 75060, 94176, 106666, 75065, 150268, 127407, 113034, 76588, 31746, -1794, -11252, -11752, 39082, 50075, 61173, 57714, 34031, 133986, 190609, 162017, 145570, 87149, 66001, 100076, 84944, 52948, 95589, 92162, 87070, 96777, 109349, 57322, -6365, -59653, -59249, -9192, -3625, -19729, -20346, -59082, -83319]
19304h3319N2604L8222q4823n2308L3720K2063M3404L6708l6555j2712N2108K1263
19292C0375l1176K5163M1929n2514J821j2031N174M2175L9375n6507m9125m0730
19280e6071J2342L3155J7932J1889J5944m7943l8595n291m0790M0386M2537N393
19268i112p533M2900L4411j4518r693k2948k5714K3286K8004P2483j11103k7402
19256b6939Q5146o805j14375m6125N6650J4271J9861L8065l9002j9612L522L2549
19244b794J5639p7149k3134Q74j4876L5336J3826Q0074m727K9065k0505n0398
19232a8769J0911J4082m826Q820P316n6016J5011L7933q910j2911K6511K9414
19220D8566q159l0529k9449K5380l635R791J2402r0414o3174M6340L7063N077
$$ y = [-83319, -30715, 7507, -77316, -129624, -95904, -73841, -30437, 6271, -30284, -42996, 9112, 30375, -801, 24362, 66291, 13777, 15598, 3567, 8741, 50916, 90291, 33784, -15341, -56071, -43729, -10574, 7358, 19247, 35191, -12752, -51347, -56638, -97428, -57042, -14505, -9112, -16645, 26255, 60666, 46148, 36455, 13507, -12207, 11079, 39083, 111566, 463, -26939, 58207, 51402, -62973, -109098, -52448, -38177, -18316, 19749, -19253, -38865, -35343, -2794, 12845, -64304, -87438, -86564, -101440, -66104, -52278, 27796, 23069, 52134, 31629, -18769, -7858, 6224, 1398, 10218, 17534, -38482, -23471, 14462, 5552, -7359, 19152, 48566, 40407, 9878, -19571, 5809, 2174, 11965, 24367, -66047, -129221, -82881, -45818, -40741]
19208d0741P3766N0665K2937o0766n0670j9711j8744M003L1073k3289m5524L7957
19196c9044p4161K9396L0616k450M783k1785j0895L0802N1909l662J4402m2810
19184c2899k0888j1479n425r727M8975L2173Q0955K534j01032l0142J3794l8027
19172g1188j7498j9690k6757M7268J1057k2169j8928P2742J3849k4564M6826O8864
19160E9812K0583K3780q2055m9409J9295l8330l1954m9715O367M0493O3309K3478
19148E654K0997O5925O545k5931l6266p8506n7234n1473l7080O2257j5472J7358
19136a23226M4006o246n1404L9030J7601m297M5318j7859p064l6256L4000L1996
19124c4401L520l7343p582N7310K6774N4561l1588j04510n0167k6543L7399O1491
$$ y = [-40741, 33025, 83690, 106627, 45861, -4809, -24520, -43264, -39261, -8188, -31477, -77001, -39044, -113205, -83809, -53193, -55643, -50860, -72645, -83540, -52738, -829, -4491, 9911, -32899, -53787, -65266, -70691, -80418, -31443, 730, 81685, 84219, -16813, -46955, -33161, -71188, -88686, -108376, -135133, -87865, -76808, -98977, -117905, -45163, -31314, -55878, -9052, 59812, 80395, 104175, 22120, -27289, -7994, -46324, -78278, -127993, -121626, -81133, -17824, 5654, 26651, 92576, 99121, 73190, 36924, -41582, -98816, -150289, -187369, -125112, -140584, -123226, -79220, -85466, -136870, -97840, -80239, -84536, -39218, -57077, -64141, -100397, -66397, -34401, -30881, -68224, -75806, -18496, 8278, 62839, 31251, -73259, -123426, -149969, -112570, -51079]
19112e1079m0371k4056N4472N5070K7333O623M2254p8241j3900M0846j2608k1136
19100a4793n7125j7488M178J6683J2384K3463O8285M7998k661l4270k6695m5511
19088b5552M2225L5088l9366r5037k739N1741M5995n8956j9105k7960P8247J2216
19076c203k2901j4870l219P4775L8347o2561l4499o5548k3984L7886Q3137n513
19064b153o909P7179K897j6759j2547o0683q5284l3425J5747J7056M5924J2423
19052d6534K5064J06430N1806L3174R578n3077k773L3787n7733k6702J1152K322
19040H6494K0691m2839q5482K0053L2021J1971j6301k2398P4855L9174L057l0954
19028I0342K2215l8545n4087J9613K5653K8354J26649J64259J07636Q9886J3120
$$ y = [-51079, -91450, -115506, -61034, -5964, 21369, 27992, 70246, -7995, -21895, 18951, 6343, -14793, -71918, -89406, -85228, -68545, -56161, -32698, 35587, 83585, 80924, 46654, 19959, -25552, 16673, 51761, 12395, -82642, -85381, -33640, 12355, -46601, -65706, -93666, -15419, -3203, -26104, -40974, -44193, 30582, 68929, 6368, -28131, -93679, -117663, -79777, 3360, -2153, -9062, 68117, 71014, 54255, 41708, -18975, -104259, -137684, -121937, -104881, -58957, -46534, -21470, 84960, 136766, 169940, 179518, 126441, 123668, 157455, 99722, 73020, 84172, 86494, 107185, 64346, -21136, -1083, 30938, 42909, 26608, 4210, 79065, 118239, 121296, 90342, 112557, 74012, 19925, 39538, 65191, 93545, 220194, 384453, 492089, 581975, 595095]
19017E95095o0705o7319K8694R3636L4152m7644n6183m6514J882J4717R7983P2977
19005F60771R186M4692j22341j81741j43171o0376K1592p9702r4778J09638N8839
18994B22609m004J7767J48j3598L2920p804n4217L8609J8494q5318k9567J7293
18982A53332k217o8532J0594k5576P519m987Q997l2137j01968j3954R5130O6665
18970I2866R7298J22231J27047J15135P9020O5834j3759q8958l4220q9445l9983
18959D33066m6997r4097J4529r6557j06652K2407O8138J28188J54856J66785P2116
18948G15782K0162k9098j04060k02400m3354k9701l2336O61o7344k8787q1217
18937A18308o4149n6239q5398J1886J06387M8642K2354k5861m0464n3290n2355
$$ y = [595095, 534390, 467071, 495765, 589401, 623553, 575909, 519726, 473212, 475094, 489811, 587794, 660771, 669957, 714649, 592308, 410567, 267396, 207020, 228612, 148910, 54132, 163770, 222609, 218605, 236372, 236520, 222922, 255842, 248038, 193821, 232430, 250924, 165606, 136039, 153332, 151115, 82583, 93177, 67601, 75120, 70133, 79130, 46993, -54975, -68929, 26201, 92866, 190164, 312395, 439442, 554577, 633597, 699431, 685672, 596714, 562494, 473049, 433066, 386069, 291972, 306501, 209944, 103292, 125699, 193837, 322025, 476881, 643666, 715782, 735944, 706846, 602786, 400386, 357032, 327331, 294995, 295656, 228312, 199525, 118308, 54159, -2080, -87478, -75592, 30795, 79437, 101791, 75930, 35466, -17824, -70179]
18926g0179K6557J06380J22516K1842l9820q827m700n0386j8465l4944r4443n4675
18914i9144P799M1871J880m2959j3583N1408j238J3398M5899k8516J1017l4159
18902d6327n5403Q7419Q3800k0903m2925o229K8842J318n7129l0034J07943P0660
18890A21032j4476k4127K0139O6665K9155o9036q34m7961j5548p613N6111J31577
18878B45084R1545N9542l3343R495L7036O346N096P5450K11830L06507N30184
18867A544772O10277M13341K39028O36l55919l64029l28225m09579l59651o0532
18857I30119n4410k0795L4249L5465O815p5488q5476j20959j45325n5880j09621
18846C38694j7433n5730l2287m5827l8814O9365L9917l0986J0962j3827q1049
$$ y = [-70179, -43622, 62758, 185274, 207116, 167296, 158469, 153769, 103383, 84918, 49974, -44469, -99144, -91345, -49474, -47594, -90553, -104136, -52728, -53966, -40568, 5331, -23185, -12168, -46327, -101730, -14311, 69489, 48586, 5661, -568, 28274, 29592, -27537, -57571, 50372, 121032, 106556, 82429, 102568, 169233, 198388, 129352, 128518, 80557, 65009, 57396, 113507, 245084, 336629, 396171, 362828, 372323, 409359, 415705, 420801, 496251, 708081, 1014588, 1544772, 2155049, 2568390, 2807418, 2808054, 2452135, 2088106, 1759881, 1350302, 990651, 930119, 875709, 854914, 889163, 924628, 931443, 855955, 770479, 649520, 504195, 448315, 338694, 321261, 265531, 233244, 187417, 148603, 217968, 257885, 226899, 237861, 224034, 142985]
18835A42985m0081L944J6502K6165P2871O9507q0732l5640R7603J20947R9506
18824D93577K1133O7465Q4963J04802N0885r5509n0620L6465J83387J60407K29937
18813A286892M07345L87566L20383J85838j03420l29616n26204n29556k66907
18804H32321j24984j61199j09840n0103L3099P8457J4350Jq490q5814j06966k0830
18792B90002J9262l4487k716j8502n2330J1521j0153J8262M0622L954q0791m7635
18780A37009P2172N2805n2484M3328M2871K1231Q8027Q5661K3662L6409R686P601
18768E67978r809O730Q456j1462j48535j42496p9339m8305k6027m7716j9285J6720
18756F6910P3298P5794l5087j27464J7816K5233L9250q63J1043J4471Q0871J39478
$$ y = [142985, 102904, 106848, 123350, 149515, 222386, 291893, 211161, 175521, 273124, 394071, 493577, 514710, 582175, 667138, 771940, 822825, 727316, 676696, 713161, 896548, 1056955, 1286892, 1694237, 2081803, 2402186, 2588024, 2484604, 2154988, 1628784, 1099228, 832321, 707337, 546138, 436298, 386195, 419294, 497751, 512101, 512102, 503612, 417798, 310832, 290002, 309264, 274777, 272061, 253559, 201229, 212750, 202597, 220859, 261481, 265435, 184644, 137009, 209181, 261986, 209502, 252830, 295701, 316932, 404959, 490620, 514282, 550691, 560377, 567978, 558169, 564899, 573355, 561893, 413358, 270862, 191523, 143218, 117191, 69475, 50190, 66910, 140208, 216002, 180915, 53451, 71267, 96500, 135750, 134887, 145930, 160401, 241272, 380750]
18744C80750J47412J51553J46270O1151r9116k17540j78433n4186p6437q3763
18734A77661J3415Q608j68082J4276M8261K7428p225J2207L7979n1127k7453k1753
18722F4195m6788J5566P5231M8467J7573N8908O4167L8643N3121J4745R5527J3343
18710E12698q3720l7503q0632j42176n0439O9765M4081k0199k557n4834n6880
18699I7604J1887K8534m5661p0763o5041m3178P7764Q9102N771k8825J4733J0129
18687H2056j5768m0173k2658j4944P9593L8880r8867l3615k3347l8291p1218j3371
18675a71723j0510O5299Q1893J20441O6807j9142o0320m7659k3133P1542O5628
18664A39123j1345M4735M4105J606J1285P638k3212m9522n4021M3452r775J5293
$$ y = [380750, 528162, 679715, 825985, 887136, 788020, 570480, 392047, 337861, 261424, 177661, 191076, 199684, 31602, 45878, 94139, 121567, 114342, 126549, 164528, 113401, 85948, 64195, 17407, 32973, 108204, 156671, 174244, 233152, 297319, 335962, 389083, 403828, 499355, 512698, 428978, 391475, 310843, 168667, 118228, 187993, 232074, 211875, 209318, 154484, 97604, 109491, 138025, 92364, 21601, -43440, -86618, -8854, 80248, 86019, 57194, 71927, 82056, 66288, 26115, 3457, -11487, 68106, 106986, 8119, -25496, -48843, -87134, -158352, -171723, -182233, -116934, -35041, 85400, 152207, 133065, 72745, 25086, 1953, 73495, 139123, 127778, 172513, 216618, 218224, 229509, 237147, 213935, 164413, 110392, 153844, 144069, 159362]
18652A59362k5279k9612k8062Q307m2942p8899L3898k0187P785J3327o783j2619
18640b1704P3164K0023J1980o5970m2865J7946N042k3271J4905J7873n2428m8093
18628i3398J037J3244R682k2929N0240K2270l6337K7670L4140K4400j6509j0660
18616B850L5129N7741m3989J4320M4073k0909K4483o1307J4142p20q652k7280
18604B9881M758j0334m0366j0574K6969L7211Q4439l0902m4475l4456j4465J0719
18592H405k7705K3366p8324m0032P8001L0802Q468N2346k4089K2671M0344J60
18580I4413J4876j3724J362M3118J8914j0136j845p483O93K9879J8302O0559Q2916
18567C31844k7476o5804N9137R9419J10994J11560K30067M73978N68435N20431
$$ y = [159362, 134083, 104471, 76409, 84716, 41774, -37125, -3227, -23414, -15629, -2302, -9085, -21704, 51460, 71483, 83463, 17493, -25372, -7426, -2384, -25655, -10750, 7123, -45305, -93398, -92361, -79117, -69435, -92364, -42124, -19854, -56191, -28521, 5619, 30019, 13510, 2850, 37979, 95720, 51731, 66051, 110124, 89215, 113698, 52391, 66533, 65813, 57161, 29881, 34639, 24305, -16061, -26635, 334, 37545, 121984, 91082, 46607, 12151, -2314, 8405, -19300, 4066, -74258, -114290, -36289, -5487, 2981, 55327, 31238, 53909, 94253, 94413, 109289, 95565, 96927, 140045, 158959, 148823, 146978, 139495, 140188, 170067, 188369, 248928, 331844, 304368, 238564, 297701, 397120, 508114, 619674, 849741, 1323719, 1892154, 2412585]
18557B412585L06060J96200j93418m28456l93819l22414l70963k19333q8387l7857
18547H60198M9843Q0383K4365r319r1460k08519j44582p4794q3570l575L6999
18536D35969N7029j02948r4499j14703j94L2268J4932J9380q687J2507O7383l8166
18524B80271r9329J6275O7243r883j5974J01822J53349J30641J56795J08493N2102
18513I41805j1965j07205o8188o801J42658J41274K63495M00054M01520L39359
18503B436006K35612o1638j99576m14262n83112l55753k44135j01281j07034l4236
18493E70591L234j3533k3095o628l2866l1644J3353K2713J4931o744q7839j41935
18481B80538q0383l345j9127j0916m8530N7800J634L7742L0680K4948l9362o0292
$$ y = [2412585, 2718645, 2914845, 2721427, 2292971, 1899152, 1576738, 1205775, 986442, 898055, 860198, 910041, 990424, 1014789, 1005470, 914010, 705491, 560909, 486115, 402545, 398970, 435969, 492998, 390050, 295551, 180848, 180654, 212922, 227854, 247234, 238547, 251054, 318437, 280271, 180942, 197217, 264460, 254577, 238603, 340425, 493774, 624415, 781210, 889703, 941805, 929840, 822635, 754447, 747646, 890304, 1031578, 1295073, 1695127, 2096647, 2436006, 2671618, 2609980, 2410404, 1996142, 1413030, 1057277, 813142, 711861, 604827, 570591, 573825, 560292, 537197, 530569, 497703, 466059, 479412, 502125, 517056, 510312, 422473, 280538, 200155, 196810, 177683, 166767, 118237, 176037, 177671, 215413, 246093, 271041, 231679, 171387]
18469A71387l2564L625q240j7970M919K9634k683L376J037j9614k8548k6722N4666
18456A32303L321j2035l4547N7736L8942J8282l1017l7350o6150K9712k0236j8732
18444F0229M2603J3695j9718m118K9953m3146n6831J4361Q2378O7802l1305R770
18432A65673m1393j00551r9596N4897K6547O9349j0190r0762K5627K7213L0492
18421E7306j7138k3739k8445O2418M0465K2956m9138p2098K2697N623p0576M4267
18409e402N1576L6927K089K1146l248J3924N9786K189j1814M8972n9059L6153
18397A93239L1144n243k9686l2599j2263l0057k0669q8930l8627L3967L6399K7
18385C6702j6692r9095l1681J42763Q2502O9511K6664k614n2318p540M8600m1616
$$ y = [171387, 138823, 142448, 134208, 116238, 121157, 150791, 148108, 151484, 152521, 132907, 104359, 77637, 132303, 135624, 123589, 89042, 146778, 185720, 204002, 172985, 135635, 69485, 99197, 78961, 60229, 102832, 116527, 96809, 92691, 122644, 79498, 22667, 37028, 119406, 187208, 155903, 165673, 124280, 23729, -75867, -20970, 5577, 74926, 64736, -26026, -399, 26814, 57306, 40168, 16429, -12016, 50402, 90867, 113823, 64685, -7413, 15284, 20907, -49669, -5402, 46174, 83101, 85190, 106336, 103088, 117012, 176798, 178987, 167173, 216145, 157086, 193239, 224383, 219140, 189454, 156855, 144592, 114535, 93866, 4936, -33691, 276, 36675, 36702, 20010, -79085, -110766, 31997, 114499, 184010, 210674, 208060, 155742, 148202, 196802, 155186]
18373A55186m7240M3144K0953n0719M0076M1428K1603j9632k4753N0087l9536
18362A90597q4373m0218j7684L0194L1827j3036M7156J8924m3531j0974L034N5850
18350A67766R7620j4114o6174N486J7652l6186K0128O5185L3187r4096r3880k3963
18338G8611L6668M3895l1423n6171O717L0697L3302o968J3059J1992j0170q959
18326A41250k9072k6622P1186L6725l858L5070m391k5610l4288K7842l2581k2914
18314A32737l0095M7963J6491L8121K9368n94J948M5136M7197m0550k7553M6173
18302C06342q632O1076q645k2107j1162L1264L252k5421k5322K5963j8602K6960
18290C34966L2192M376j2272N020K3833M8124P2097K6815j5657j6377o0487m3633
$$ y = [155186, 107946, 151090, 172043, 121324, 161400, 202828, 224431, 204799, 180046, 230133, 190597, 106224, 66006, 48322, 78516, 110343, 97307, 144463, 163387, 119856, 108882, 111916, 167766, 265386, 251272, 185098, 190584, 208236, 172050, 192178, 257363, 290550, 196454, 102574, 78611, 115279, 159174, 127751, 71580, 78297, 108994, 142296, 135328, 148387, 160379, 150209, 141250, 112178, 85556, 156742, 193467, 189609, 224679, 220288, 194678, 160390, 188232, 155651, 132737, 102642, 150605, 167096, 205217, 234585, 233991, 235939, 281075, 328272, 287722, 260169, 306342, 297710, 358786, 350141, 328034, 316872, 348136, 351388, 325967, 300645, 326608, 308006, 334966, 367158, 371534, 359262, 364282, 388115, 436239, 508336, 535151, 519494, 503117, 442630, 398997]
18278C98997P1636j6081n2523L9318J14504O3403O829M5593J00898j2543k6603
18267G33428J8330J28464O1108M4284O3307J54250O5531J36420J51861J63840
18257A720823K22436K10418K25575K96706M20144N58274P68165J083460J495672
18248G001673J984732K844041M288357O541953J0275007J5405831J8178583J1805911
18240G8326088O83361r438589j8996027j6471907r591918n482638l369747k217196
18232A3441427j445148q89383o00130n26908m69892l49490j17326R5428K21205
18223I359783M73812P44291J108869J647908K241912K836139M039937N979851
18215B8432502Q851507J3859233K1862795L1483985L3194050J7265454l317060
$$ y = [398997, 470633, 454552, 402029, 441347, 555851, 619254, 626083, 671676, 772574, 760031, 733428, 751758, 880222, 941330, 985614, 1048921, 1203171, 1268702, 1405122, 1556983, 1720823, 1943259, 2153677, 2379252, 2675958, 3096102, 3654376, 4422541, 5506001, 7001673, 8986405, 11830446, 16118803, 22660756, 32935763, 48341594, 66520177, 78326088, 79009449, 69570860, 50574833, 34102926, 24511008, 19028370, 15658623, 13441427, 11996279, 11106896, 10506766, 9979858, 9509966, 9160476, 9043150, 9138578, 9359783, 9833595, 10577886, 11686755, 13334663, 15576575, 18412714, 22452651, 28432502, 37284009, 51143242, 73006037, 104490022, 137684072, 154949526, 151632466]
18208A51632466k3658487l7638677k8849558j6724502r931251o335338m201412
18201B4293241k833135k010814j629811j360649j295648j064904p85021n70501
18193A2742758l49418j422L14934N92566Q85939J017368J127472J733196K676905
18184B0740298M275511P125443J1497429J6188209J5437140N865282l980111j4387099
18176F2762102j8899308j3101698p618068m668643l009789k030637j489543j163713
18168A0780703r60678p68160q09875p07736m91277m37806l36096k13785j16541
18159E938749j8444q134j66467k35746k66789k51886j99842k72556k09962K8121
18149D337044P9098J77320K27883J59188j62165m69240o21777m65705l23369k00230
$$ y = [151632466, 127973979, 90335302, 61485744, 44761242, 34829991, 28494653, 24293241, 21460106, 19449292, 17819481, 16458832, 15163184, 14098280, 13313259, 12742758, 12393340, 12391918, 12706852, 13299418, 14185357, 15202725, 16330197, 18063393, 20740298, 25015809, 32141252, 43638681, 59826890, 75264030, 81129312, 77149201, 62762102, 43862794, 30761096, 23143028, 18474385, 15464596, 13433959, 11944416, 10780703, 9820025, 9051865, 8241990, 7534254, 7042977, 6605171, 6269075, 6055290, 5938749, 5920305, 5912171, 5745704, 5509958, 5243169, 4991283, 4791441, 4518885, 4308923, 4337044, 4416142, 4593462, 4821345, 4980533, 4818368, 4349128, 3727351, 3261646, 2938277, 2738047]
18139B738047k39602k48466j52689m6938p3003J0173l1427O2016R3410J14482
18129B226003J21153K26395L82269L73227K91476J10539L1768K278J26462K95019
18119D186589N32922P74238J142040J708300K399680L528568N439343Q851259
18111B8562939J4627494K2461009K4146360R946807l523865j8243762k7702443
18104E0274539j7342906r064781n187249l213867k207509j469984r40063o09979
18096A0238201l58447k92946l88749n79634o72286n51024m18023k33076k5877
18087F718139p6426k31381l87789m71050m75140m24842l89529l04523k74065k52122
18077C431272k76902j84711k06921k15946j33781j2969j5075o7218r4928j09976
$$ y = [2738047, 2498445, 2249979, 2097290, 2050352, 1977349, 1987522, 1956095, 2018111, 2111521, 2226003, 2347156, 2573551, 2955820, 3329047, 3620523, 3731062, 3762830, 3765108, 3891570, 4186589, 4719511, 5493749, 6635789, 8344089, 10743769, 14272337, 19711680, 28562939, 43190433, 65651442, 89797802, 99744609, 96220744, 77976982, 50274539, 32931633, 23866852, 18679603, 15465736, 13258227, 11788243, 10848180, 10238201, 9879754, 9586808, 9198059, 8618425, 7946139, 7395115, 6977092, 6744016, 6718139, 6641713, 6410332, 6022543, 5551493, 5076353, 4651511, 4261982, 3957459, 3683394, 3431272, 3154370, 2969659, 2762738, 2546792, 2413011, 2400042, 2384967, 2317749, 2222821, 2112845]
18067B112845n7102N4258J56032J14623p462j22987k44445k30927j50008N442
18057A630269M0809K2054P0636Q0041J5415J1747q6957j35724j03428j00861r7491
18046A346510j09554o1791J7728p4622j02562j03944q4521r1658q8855m9481o6080
18035E31170k9054P2524j8987J7098M5113l4875j36159q1803p457P956k8433M7406
18023C84499n2394n2230J7445N2377j2049l9647j2278K8186J9168M9372j4608
18012C67841m8425m5938l931M9515J5715n7496l3501M8641K8262K3063M7947Q1082
18000D72775J9966m1818R9093J21765K7273P7420J32241J17630J40058R7318Q1739
17989A345460J7403P9280J43424J14665K4060L0696K1607k5284j27368j34554
$$ y = [2112845, 2055743, 2110001, 2266033, 2380656, 2373194, 2250207, 2005762, 1774835, 1624827, 1630269, 1671078, 1693132, 1763768, 1843809, 1859224, 1870971, 1784014, 1648290, 1544862, 1444001, 1346510, 1236956, 1175165, 1192893, 1118271, 1015709, 911765, 827244, 735586, 646731, 597250, 531170, 502116, 574640, 555653, 572751, 617864, 582989, 446830, 365027, 357570, 365526, 337093, 384499, 332105, 279875, 297320, 349697, 337648, 298001, 285723, 313909, 333077, 382449, 367841, 319416, 273478, 269547, 319062, 334777, 277281, 243780, 292421, 320683, 343746, 391693, 472775, 492741, 450923, 550016, 671781, 699054, 776474, 908715, 1026345, 1166403, 1263721, 1345460, 1362863, 1442143, 1585567, 1700232, 1724292, 1754988, 1776595, 1751311, 1623943, 1489389]
17979A489389j76676r9921j52071j25235r7949j39779j01315m3573o8290j5849
17969D68731j8253j5035K2456J28377L2884j3757m2826p8616p6846q16l9220N561
17957C72640q432K4288M5559p143P189O3841Q8692J7211O7754j9714K3884M4468
17945G20237j7835R1713P0266n0568M3714m6M4232N2845m2494k1622J1764R368
17933I11574k4570m9618l87n6764o6897q2408j14812q8500o3086r4348j71679
17922I8505q7532J8048K9108R133P755J4444M9488r442R738M7467K1720j9630
17910A88802r781K492n2959l4208n9215L5204K401r055M726M727L8838l5229K004
17897G8747J2650k2960K2914J4034n5027j5964J0211K922P8846L8312q5455K5107
$$ y = [1489389, 1312713, 1212792, 1060721, 935486, 837537, 697758, 596443, 552870, 484580, 468731, 450478, 435443, 457899, 586276, 619160, 605403, 562577, 483961, 407115, 406299, 367079, 372640, 364208, 388496, 434055, 426912, 434101, 497942, 586634, 603845, 671599, 651885, 675769, 720237, 702402, 794115, 864381, 813813, 857527, 857481, 901713, 954558, 912064, 890442, 902206, 911574, 887004, 837386, 836999, 780235, 713338, 630930, 516118, 427618, 364532, 270184, 98505, 10973, 29021, 58129, 67262, 75017, 89461, 138949, 129507, 139245, 186712, 208432, 188802, 179021, 181513, 128554, 94346, 35131, 70335, 72736, 63681, 68407, 73134, 111972, 76743, 78747, 91397, 68437, 91351, 105385, 50358, 34394, 44605, 47527, 126373, 164685, 79230, 104337]
17885A04337L555p600K7339j7509k2417K3688J01738K3117l5474k2003l2252l4084
17873A12435j8500j0122n3150l4900J2694L1421N1009l5153r1733p305J7747J6466
17861i091q863j9717M8888N1332M6676k5332n5635Q836J3029K3788j7362n4439
17849B110k1149O5152M5333L4892J5862o9997l7174j2281P666M4884M4517n4539
17837F5276o0531j01499n638L2572L0820m1386L9841j55O7521j8073p3448p268
17825g1968J8903K8023J6909m664M7856K8772n534m3081k0932j2222P212l2575
17813d3301j292M4151K8403j4619J101o7732l4720N2974M6668J4786m6516N4131
17801C4034J1645l582K1818L213m8946j1855K5757l1331m6635J0970N3512L101
$$ y = [104337, 107892, 100292, 127631, 110122, 87705, 111393, 213131, 236248, 200774, 178771, 146519, 112435, 93935, 83813, 30663, -4237, 8457, 39878, 90887, 55734, -35999, -43304, -25557, -9091, -17954, -37671, 11217, 62549, 109225, 83893, 28258, 37094, 50123, 73911, 56549, 2110, -19039, 46113, 91446, 126338, 142200, 72203, 35029, 22748, 30414, 75298, 119815, 65276, 4745, -96754, -102392, -69820, -39000, -80386, -40545, -40700, 26821, 8748, -64700, -71968, -53065, -25042, -8133, -12797, 35059, 63831, 58297, 15216, -5716, -17938, -10726, -43301, -44593, -442, 27961, 13342, 14443, -53289, -88009, -35035, 11633, 26419, -20097, 34034, 45679, 42097, 63915, 67128, 18182, 6327, 32084, 753, -45882, -34912, 18600, 21701]
17789B1701j676l5584J9232L9115n1774m9677M051N3737M8045M364q2890o6163
17777i7519j7619O0011L582Q661O5236M3272k8760m2202m932j6788J5532O054
17765e472m3443r919o3246K8062m116j5041O6819L827j9070J2640M3521K8876
17753B3438R176o739l2281K0291k5054n515q405l2123J4760l6936k0941K4116
17741g6213n1662N3208Q4869P204K882P254k2752k8795l037K5924N275k4443K4928
17728D642j282o41l3870l4749M4702L5400M6970k0023q0849J4736J633j7280J0189
17715c0422l1476Q0455J27991K7546r787j5991o8514q2875M2063k224J20402J30617
17703B87785R5960Q1162K7072j11030p3101o8085r7934j02282L4612n4238o4643
$$ y = [21701, 20025, -15559, 3673, 42788, -8986, -58663, -54612, -875, 47170, 51534, -31356, -97519, -115138, -55127, -51545, -42884, 22352, 65624, 36864, -5338, -10270, -27058, -11526, -5472, -48915, -58834, -122080, -94018, -98134, -113175, -46356, -42529, -61599, -48959, -5438, 23438, 32614, 25875, -6406, 13885, -11169, -16684, -25089, -57212, -42452, -79388, -100329, -76213, -127875, -74667, 10202, 17406, 20288, 27542, 4790, -24005, -27042, -1118, 4157, -20286, 4642, 3360, 2719, -31151, -65900, -21198, 14202, 61172, 41149, -39700, -24964, -23331, -40611, -30422, -61898, 18557, 146548, 174094, 164307, 148316, 79802, -3073, 38990, 36766, 157168, 287785, 383745, 464907, 491979, 380949, 307848, 239763, 141829, 39547, 74159, 19921, -44722]
17692d4722l8293N2719l6502o788L5939M710j7153K8448k6799q966P5298N5522
17680G3413J0048K5700l1590K9236O6843J06907Q2841J45124J46160J15197J6824
17669G86703j23003j15486r7102p3008r1430j36965p6149r392n192o0161m3948
17658d5133L7946J20388P8551K0222k4290j2415m3596P075M9749j3177M7085L1568
17646B53973k3824j33866j0649Q1535J27811O8352L9041l3932p0258m5750o5561
17635A86872p1359Q123m9818n6796j9747L786K4065M85l5080K7111L4546J6223
17623F8411k3046j0674o6104M2033J8318M6787k0833k6689J9275j0463n2102O4211
17611D9124N6591r5032k2207O8020k891o3105J5994R9097m6719k8796K4948k2258
$$ y = [-44722, -83015, -30296, -66798, -73586, -37647, -32937, -50090, -21642, -48441, -57407, 17891, 73413, 83461, 109161, 77571, 106807, 173650, 280557, 363398, 508522, 654682, 769879, 786703, 663700, 548214, 451112, 378104, 286674, 149709, 73560, 64168, 58976, -1185, -45133, -7187, 113201, 191752, 211974, 187684, 175269, 131673, 138748, 188497, 175320, 222405, 253973, 230149, 96283, 85634, 167169, 294980, 363332, 402373, 368441, 298183, 252433, 186872, 115513, 123636, 73818, 17022, -2725, 1061, 25126, 25611, -9469, 17642, 52188, 68411, 45365, 34691, -31413, 10620, 28938, 75725, 54892, 28203, 47478, 37015, -15087, 49124, 105715, 10683, -11524, 56496, 53605, -9500, 6494, 105591, 58872, 30076, 55024, 32766]
17599C2766J9560L6691l5271n8630J3618L4792O479j8102q135M7670k5319j06883
17587f0764J2767M206l5604O7524L3521L1881k6116n269o6055n5987R5752j6209
17575b0353j3982l361L0403K854J2747l0233m4867Q5392L4486J3084j8505k6427
17563B1238R030k33l2998j5985m553K2676N6606J7R06o8055L7829p92q155n8935
17549d1404m9410n544P035K5250o91k3022J6733r738K0426K9410k2857M6629K6026
17536A8843k174o6046n3170O1059k4161n8155L3941l14n9709k5399J017O9090
17524a05178N9290P5059k9988m826n4560k6202N6268R92M1896Q6869m0393r1893
17512c2666n1283j5909m769J3922J2472m1207K5513P8706O797J5633j0613j9509
$$ y = [32766, 52326, 89017, 53746, -4884, 8734, 43526, 50005, 31903, 23768, 71438, 46119, -60764, -47997, -43791, -79395, -11871, 21650, 53531, 27415, 22146, -43909, -99896, -4144, -20353, -34335, -37696, -7293, -4439, 8308, -21925, -66792, 18600, 53086, 66170, 47665, 21238, 30268, 30035, -2963, -18948, -23501, -825, 55781, 55798, 56704, -11351, 26478, 25686, 17531, -41404, -90814, -96358, -89323, -64073, -64764, -87786, -71053, -80791, -60365, -30955, -53812, -7183, 18843, 16669, -49377, -102547, -41488, -65649, -123804, -89863, -90177, -149886, -175285, -174268, -105178, -45888, 29171, -817, -5643, -60203, -86405, -30137, -29145, 12751, 99620, 59227, -32666, -83949, -99858, -104627, -90705, -78233, -119440, -93927, -15221, -8424, 7209, -3404, -22913]
17500b2913l255m696M9962N1878l7915k7076J2299l6075o7290j0707n5125R542
17488a41371J1669L5831O6608O8964q805n615N5784o74j0882k5865Q284K1031
17476G4959J3976k0948r715L2009l909m5935r1458P1279j9339l6032o0784k8271
17464a24168M0731Q7859K219q0831k5837M8643L2570j06222l9862P5291O8119
17453b1488j544K3120o0507j1622K3604M3641M9775P0842J24649R3326R9514J24088
17441E57398k5659j35146j34358j19502o1476N4770o1092m3312k0973l5810M420
17430b0740M8057q5831l4389Q437N3077o707l5670m5553J3002O4297N3555K8440
17418C9975m0092J4669m0306m9471N1704J6338J6542n259m7909M3583L4115l189
$$ y = [-22913, -26168, -30864, 19098, 70976, 33061, 5985, 18284, -17791, -85081, -95788, -150913, -141371, -129702, -93871, -27263, 41701, 32896, 27281, 83065, 82391, 71509, 45644, 53928, 74959, 88935, 67987, 58272, 90281, 86372, 40437, -51021, 20258, 919, -35113, -95897, -124168, -83437, 4422, 6641, -74190, -100027, -51384, -18814, -125036, -164898, -89607, -21488, -23032, 88, -60419, -72041, -48437, -4796, 44979, 115821, 240470, 333796, 433310, 557398, 531739, 396593, 262235, 142733, 81257, 136027, 74935, 31623, 10650, -25160, -20740, 27317, -58514, -92903, -84466, -31389, -38096, -73766, -119319, -106317, -42020, 11535, 39975, -117, 14552, -25754, -75225, -23521, -7183, 9359, 4100, -43809, -226, 33889, 30700]
17406C0700j8845o9106k1754M9327M4699k2217m0753j117J2003l0918n0632R320
17394a09293P8646J00679k210k8189o849l0674k7161k2688o0144L617N8064K5007
17382b1195l458k8988l3492J4120j2287J9543n8803K2816O3153K1337m1555Q320
17370e0489L6911K5264n1119p7174q3820n9284N6891M2416O8317N0279K9852m5721
17358e7677L7297L8468O128n9494q4269l5694N0688K9015J7470q776l1628m8872
17346a47344P081L5405r874N7462K647P5124K2361k9499n0842l1915J9861M8164
17334a369j1944o3970q811M3975N7579K8296j5054k3480l8331j1084j8370m8910
17322a11473J1066J1791J5554N5837K0266q733j9362L2899p8168K3082j6812M2047
$$ y = [30700, 11855, -57251, -79005, -29678, 15021, -7196, -47949, -49066, -37063, -67981, -118613, -109293, -30647, 70032, 67822, 39633, 32784, 2110, -25051, -47739, -107883, -104266, -46202, -21195, -24653, -53641, -87133, -73013, -85300, -65757, -124560, -101744, -38591, -17254, -58809, -50489, -13578, 11686, -39433, -116607, -200427, -259711, -202820, -160404, -92087, -41808, -11956, -57677, -20380, 18088, 24216, -35278, -119547, -155241, -104553, -75538, -58068, -66844, -98472, -147344, -140263, -104858, -114732, -57270, -54623, 20501, 42862, 13363, -37479, -69394, -49533, -1369, -13313, -77283, -86094, -42119, 15460, 43756, 28702, 5222, -33109, -44193, -62563, -111473, -100407, -88616, -73062, -17225, 3041, -5692, -25054, 7845, -70323, -47241, -64053, -22006]
17310b2006K1557o7212q0796L4657R1331N7918m6022J7693o245M402p819l6952
17298c9494q087J9182N346J5230L682j5453P85k3636m3684k608K6134J3269j1727
17285f1061j4668N0797N4494n083r2655m4187L9307M1990J750J6190l6823K7095
17273b2854N9978R758q2647j40182l2250Q2339M8275l7058l4916O4331M37J00837
17261A6048M4690n2177k2529J2175k8400l2171L4121L8616M3197L0185p9379K3749
17249B8125o1231J537N6445m442k7977k8705L2439j1589j1540J634N881J4099
17237e324J3210N8064j2165n8979k0967P589J2959n1804J6597j265j23L1681o231
17224a6758O346k6172n7841L4284l1965J0861o573n755P9251m3449Q3081K3390
$$ y = [-22006, -449, -67661, -148457, -113800, -22469, 35449, -10573, 7120, 875, 5277, -2542, -39494, -47581, -28399, -23053, -7823, -4141, -19594, -18809, -42445, -86129, -88737, -62603, -49334, -61061, -75729, -24932, 29562, 24479, -68176, -112363, -73056, -31066, -29316, -13126, -49949, -22854, 37124, 46882, -35765, -175947, -208197, -125858, -77583, -114641, -149557, -85226, -84789, 16048, 60738, 8561, -13968, -1793, -30193, -62364, -28243, 10373, 53570, 83755, 4376, 28125, -33106, -31569, 24876, 20434, -7543, -36248, -3809, -15398, -26938, -25304, -19423, -5324, 7886, 65950, 53785, -5194, -26161, -18572, -5613, -57417, -40820, -42085, -42208, -10527, -16758, -10412, -36584, -94425, -60141, -92106, -81245, -87818, -93573, -14322, -57771, 25310, 48700]
17212D8700r3397o4556j5047P1800N455k1045M5216Q855M7162J9450o3576j9500
17200c0483K508N980J4581J0336q1391j4767K442L7083O157l8136N7599K4462
17188c629L3293L2834m870j11588k9676M0217L070J0793J9697J19024N202r3078
17176B1289r8246M6740Q3944k9017r4286q2759l3343N7861Q0952R3780L6216k5571
17164E7560l9246L2060m6084k9483M1488J4424L216n216q2363L0622R507o3627
17152g7142L5978O5838J9343k2736J9206l4796l4237m422m6910K614N9084Q4846
17140F6666L5181l2582J6241k6689n2391l0810q9957j7697q893k1775M1795O4475
17128e6436K3860J0857R228l9442o1536L223k0037J3119n8945j5301K1532l713
$$ y = [48700, -44697, -109253, -124300, -52500, -47045, -68090, -22874, -14019, 33143, 52593, -10983, -30483, -27975, -21995, -7414, 2922, -78469, -93236, -90794, -53711, -47554, -85690, -28091, -3629, 29664, 62498, 57628, -53960, -83636, -43419, -40349, -29556, -9859, 109165, 114367, 21289, -76957, -30217, 53727, 24710, -69576, -152335, -185678, -127817, -46865, 46915, 83131, 57560, 18314, 50374, 4290, -25193, 16295, 30719, 33935, 28719, -53644, -23022, -13515, -77142, -41164, 24674, 44017, 21281, 40487, 5691, -28546, -32968, -79878, -77264, -18180, 66666, 101847, 69265, 85506, 58817, 6426, -24384, -114341, -132038, -140931, -162706, -120911, -56436, -32576, -21719, -12491, -51933, -113469, -110246, -130283, -117164, -176109, -191410, -169878, -173591]
17116a73591L5844M9113L0133M9063M5038Q898K1840K0786P698o2143q130m9551
17104b5002N6691L7560P629P569l9206n9500o657J6179N167L1370k3484k9613
17092b1297J7254L899j352l8858Q0140J3669l9397m0858m0463Q0409J041j1231
17080B956o1513j8353j4733l894M1520L2889m2104j4576j8551m8374L9302M5311
17068f0120J741j4572J58940J00838R176j04114j24665j13593Q9289M9124K5959
17057A8003k3840r822p493m1958K5753j0877J7615O907n9962K5730K2280J2329
17045b5335O90j2634q574q561M5409J16318r048n8655p3033k3553O578K929Q9312
17032D1843L1933l2470K8242K9586j3034M991l758l7425q1407m325J6082n145
$$ y = [-173591, -137747, -88634, -58501, -9438, 35600, 44498, 66338, 87124, 94822, 32679, 24549, -25002, 31689, 69249, 76878, 84447, 45241, -14259, -20916, -4737, 430, 31800, 8316, -21297, -4043, -144, -1496, -40354, 39786, 53455, 14058, -26800, -67263, 13146, 14187, 2956, -58557, -76910, -91643, -95537, -54017, -21128, -63232, -77808, -96359, -144733, -105431, -60120, -58379, -72951, 85989, 186827, 196003, 91889, -32776, -146369, -57080, -7956, 18003, -5837, -15659, -23152, -65110, -39357, -50234, -32619, -25712, -85674, -59944, -37664, -25335, -24645, -37279, -45853, -54414, -9005, 107313, 98265, 39610, -33423, -56976, -50398, -47469, 41843, 73776, 41306, 69548, 99134, 86100, 91091, 87333, 49908, -31499, -35824, -19742, -24887]
17020b4887k0743r248P9176K2780n7255o0430J4964J4536J752J8895l769N509
17008a8720N3999n0284K7495L4343k3851l7423N0946r434r2994P106l2925L6558
16996e5184P5639k3717k5300p4645p292M8976o109l9129p9536j751J33511M3689
16984a0848O7005J1921m6447j7807m2872r1049J6864Q6360Q084K9231n277K8441
16972C3606l6212k7073q590N487L5959R618j6103m2292J1975M0039R65K7687m7846
16959a2780J0539k0018j04840k6684n196N9225J3025K9257Q3563P2408Q902m5836
16947F1565q9904o6109N3996L8776M1340K3424k4046l8607k7758J7511J5237N0965
16935E6390O797q1891m7943P5629M0995o3605r6127l9340M7073k5388M5523j4815
$$ y = [-24887, -45630, -54878, 24298, 47078, -10177, -70607, -55643, -41107, -39355, -20460, -24229, -18720, 35279, -15005, 12490, 46833, 22982, -14441, 36505, 27071, -65923, -58817, -91742, -55184, 20455, -3262, -28562, -103207, -110499, -61523, -67632, -106761, -186297, -188048, -54537, -10848, 56157, 68078, 21631, 3824, -39048, -130097, -113233, -26873, -18789, 10442, 5165, 33606, -2606, -29679, -38269, -32782, 3177, 12795, -3308, -45600, -33625, 6414, 7379, 35066, -12780, -2241, -22259, -127099, -153783, -158979, -99754, -86729, -57472, 26091, 98499, 107401, 61565, -28339, -94448, -40452, -1676, 39664, 63088, 39042, 435, -27323, -9812, 5425, 56390, 63187, -18704, -66647, 8982, 49977, -13628, -109755, -149095, -102022, -127410, -81887, -96702]
16923i6702J0891O7242R1353l2869p5612l0625R8989L1000r1717J2957K9663j9940
16911e370j0793J7394Q4814K8860o3490l1955J2595K0442j9333K4458R8364l401
16899A52585p5112o089m7123k3208K7535l5437m5185j3082L3990M7438l0339l4795
16887d8822m6025N8830K0560l5695k8423N753k8682K4569K9629o481k1583N3224
16875b3146P2642L1261k053k2283j6269l0165j6375k5196O11N6949N3249R287
16863H8512m1541l2372L4588K4541m8240J3291m4000m9754o155M5407k3746j00360
16851a39829M418J10427K8280k0934m1408R279O8925K3363o7682J9159Q1518K7048
16839A02564k7590L7552q3825k0664m930L4663l2534K7306O7996K6650p9547n9693
$$ y = [-96702, -85811, -18569, 72784, 39915, -35697, -66322, 32667, 63667, -28050, -15093, 14570, -5370, -16163, 1231, 86045, 114905, 51415, 19460, 32055, 52497, 33164, 57622, 155986, 152585, 77473, 71384, 24261, 1053, 28588, -6849, -52034, -65116, -31126, 16312, -14027, -48822, -94847, -36017, -15457, -51152, -79575, -73822, -102504, -77935, -48306, -54787, -76370, -23146, 49496, 80757, 78704, 56421, 40152, 9987, -6388, -31584, -30973, 25976, 79225, 88512, 46971, 14599, 49187, 73728, 25488, 38779, -5221, -54975, -61130, -15723, -39469, -139829, -135411, -24984, 3296, -17638, -59046, -49767, 19158, 42521, -25161, -6002, 75516, 102564, 74974, 112526, 28701, 8037, 3107, 37770, 5236, 32542, 100538, 127188, 47641, -12052]
16827a2052M5499K6214R614n1641m8512p1095n4535j1117j89P2483P9629r146
16815b4848j384l2120J2128L351N6422J401K135L7391l662q9840k2818l2892q651
16802a03387O2882j9629J7120P1751m5155p1639q485k5930K5782J3378K3392K1852
16790c8068l1142m8918j9282j8334j958K2214J08219K5376J4213J0969j2217J5499
16778B6571k4038l3073J8005L4546k3316k5298Q1467J9409p7718m8664l2076M3448
16766d0737K7711j2965j4400j354K6422k7726k1717N74L5004M172L519K220m9409
16753f8686k9269M5681M299m0955K3068k2797j040K111L54O8696K2854n2406K7721
16740b0369N962l8713N703N1791m2642l2780m78k7648l7913K1655L6261j6518
$$ y = [-12052, 33447, 59661, 69275, 17634, -30878, -101973, -156508, -167625, -167814, -95331, -15702, -24848, -26232, -58352, -46224, -42873, 13549, 14950, 17085, 54476, 50814, -39026, -61844, -94736, -103387, -40505, -60134, -43014, 28737, -16418, -88057, -96542, -122472, -96690, -83312, -59920, -38068, -69210, -118128, -137410, -155744, -157702, -135488, -27269, -1893, 12320, 23289, 11072, 26571, 2533, -30540, -12535, 22011, -1305, -26603, 54864, 74273, -3445, -52109, -84185, -40737, -13026, -25991, -40391, -41745, -15323, -43049, -64766, -64192, -29188, -25016, -21497, -19277, -68686, -97955, -52274, -47975, -88930, -65862, -88659, -89699, -87588, -87234, -18538, 4316, -48090, -20369, -14407, -53120, -47417, 4374, -38268, -71048, -71526, -99174, -137087, -115432, -79171, -95689]
16728i5689Q0466N3496N4157m0468l2894M5071n315l804j0063m1133J9300J39
16716B3263N448l5454M2376k3758l7893M2560J0455k4695k0842O1676Q7m2316
16704I07p4149j9903O3130N1140K1087p8971q8466J8268Q595K4191M0088O8918
16692C4835l7689n8120P129K5091j3936k8457k5952J36981N3620q9877m1148L5
16680c7488l0598Q7961j3174k8242k0932K8051K9016J1234k8574J5981J394p5344
16668f0715J4728L730p214J8179K6736m6389o7001M6111J3955k8800l3643O722
16656a13601J7113j9972j2789N7481J00413J7433l221r682k0533k8656l625M4577
16644B4938l6299p0175K0346j2324J0067n6915k3144M1164O5140J3866m4901q0986
$$ y = [-95689, -15223, 38273, 92430, 51962, 19068, 64139, 58824, 55020, 44957, 3824, 23124, 23263, 28711, -6743, 35633, 11875, -26018, 16542, 26997, 2302, -18540, 43136, 43223, 907, -73242, -93145, -30015, 21125, 42212, -36759, -125225, -106957, -98362, -74171, -34083, 34835, -2854, -60974, -53845, -28754, -42690, -71147, -97099, 39882, 93502, 3625, -37523, -37488, -68086, 19875, 6701, -21541, -42473, -14422, 14594, 25828, -2746, 13235, 14629, -60715, -45987, -42257, -49471, -31292, -4556, -50945, -117946, -71835, -57880, -86680, -120323, -113601, -96488, -116460, -129249, -71768, 28645, 46078, 42857, 33175, 12642, -16014, -19639, 24938, -11361, -81536, -61190, -73514, -63447, -120362, -143506, -102342, -37202, -23336, -68237, -149223]
16632a49223M5565L3558N5363K7033j2790k5050o810K2176M3439m5494k2975L7520
16620B312J1607j2439M3712M9783J8519n3605m5052o624l7765M2084J2741q567
16608A6706j3822j39Q986P327j9701J4010M2048o188q3126Q533M4278K6343r2395
16595d7140k1422L8462Q948n5121n5165l8443N4513P2518M9325J7801o1252K8439
16583h537L1482M4958J0951p3109q2913k1303M1492O0912N692P800m7552l6461
16571f6588j34L5193l547p536L1095O358k1131l2180n7228o599N4594P0583N6442
16558E9322k853o742o4393j6029L0350o2209m719j3245m233o2499K7829P0203
16546d9218l2306P4854N4678l0021p1409k0804K0007N3093Q9889k64M084n6808
$$ y = [-149223, -103658, -70100, -14737, 12296, -494, -25544, -32354, -10178, 33261, -12233, -35208, 2312, 13919, 1480, 45192, 94975, 113494, 59889, 14837, 8213, -29552, 12532, 25273, 16706, 2884, 2745, 11731, 19058, -643, 13367, 55415, 49227, -33899, -25366, 18912, 45255, -47140, -68562, -30100, -21152, -76273, -131438, -169881, -115368, -42850, 6475, 24276, -36976, -8537, 22945, 67903, 78854, 5745, -77168, -98471, -56979, 3933, 9625, 17425, -30127, -66588, -66722, -31529, -35076, -42612, -11517, -5159, -26290, -58470, -115698, -122297, -67703, 2880, 59322, 56469, 49727, -14666, -30695, -345, -62554, -67273, -80518, -84751, -147250, -119421, -49218, -81524, -6670, 48008, 17987, -53422, -74226, -54219, -1126, 88763, 88499, 92583, 35775]
16534C5775m8765m0467J1279N5570k204m0025j8769m1741k2411o621j3661j8107
16522a50147k5496o005K5230Q5067k247J4038K3020K6862m1831j1962L1290k2520
16510e4701k7941k4574P64K0036N6183M2163o4098n1842N0716J8831Q387L0361
16498D285j969K676o5856k2273L4114L5462j467j29792k9940O0717R13k0554L1669
16485a02015J28263l7966n2740O3085j8710L1775K2532k5839o6939l4164l0910
16474a23628l0498q017k08J5807Q6237Q066j2075K2879J5253m0635O0793L280
16462b746J8383j0790l0117l7804j0811O072k9041Q427J5216N141j2139K2641
16450e7568P2909Q888l3049n3222o4179K732p30j618K1842K9438M605Q4270J01158
$$ y = [35775, -12990, -53457, -42178, 13392, 11188, -28837, -47606, -89347, -111758, -118379, -132040, -150147, -175643, -181648, -156418, -71351, -73598, -59560, -36540, -9678, -51509, -63471, -32181, -54701, -82642, -107216, -106452, -86416, -30233, 11930, -52168, -104010, -53294, -34463, -26076, 4285, 2316, 4992, -60864, -83137, -49023, -13561, -15028, -144820, -174760, -114043, -113130, -133684, -102015, 26248, -11718, -64458, -1373, -20083, 11692, 34224, 8385, -58554, -92718, -123628, -154126, -162143, -162351, -146544, -60307, -52241, -64316, -41437, -26184, -66819, -6026, -2746, 15637, 4847, -25270, -63074, -73885, -67813, -96854, -88427, -73211, -68070, -80209, -57568, 15341, 24229, -8820, -62042, -126221, -123489, -124219, -125837, -103995, -74557, -69952, 14318, 115476]
16437A15476r0940m1589K4921j2090N0206M8704q5962N19P065m2187k9637k270
16425e7784M6299j8112r527M4803J5560o1194p797j111O404N8719L4204m0237
16413A0227m9143l1047O286O691n6334j4294M0922O1031m1353L2613M8365L188
16401A7152N7325J383l1618k7745L8035J0624n7848m6353N7907L1993J0807M3299
16389A04961k2807l975l70m5871p9668j2566R247l425k2587L8356n0714n2653
16377a42072P7653R1652L1202l7654l8644n651L059k1782j5970j1233P8392L4684
16365D3636P4433k4644L019J8835k7841k7425J3489p516m6092M217J6925q4703
16353d3667n3210J4762K2942P1239O7193N417P217Q8812K1826j36747q3326O5300
$$ y = [115476, 24536, -17053, 7868, -4222, 45984, 94688, 8726, 9245, 16310, -25877, -55514, -57784, -11485, -29597, -39124, 5679, 21239, -39955, -47752, -48863, -42459, 16260, 50464, 10227, -38916, -69963, -63677, -56986, -113320, -127614, -86692, -25661, -67014, -34401, 13964, 17152, 74477, 75860, 44242, 16497, 54532, 65156, 7308, -39045, 18862, 50855, 61662, 104961, 82154, 78179, 77809, 31938, -47730, -60296, -51049, -54474, -77061, -38705, -89419, -142072, -64419, 27233, 58435, 20781, -17863, -23514, -20455, -42237, -58207, -69440, 8952, 43636, 118069, 93425, 96444, 115279, 87438, 60013, 73502, 65986, 19894, 24111, 41036, -43667, -96877, -82115, -59173, 12066, 79259, 84676, 91893, 180705, 202531, 65784, -17542, 47758]
16341D7758N3843K5548k8666N098n3041J0744q862J1705j6189k8008n522N4010
16329F8418j7219N071O7399l8918o1155l1778p9345p5833K9748N3253Q231J5219
16317e6909J7290L9187j0188j2566L0763L8180k5717L3600l1141n6163l3522n0210
16305a17396m3617k8636M695M0052j148J15663J9357o3246Q064N5884M3554M465
16293C7691k8047j4574K742n2356n875j6141K7461M2078O2309K6479n7891l3467
16281i591l8568K0248K3746n8571m3743L2928j0024k0024N617J02530O3753l8833
16269B9468j9694R904M548o3611L1224N96K7946O1830k3412p1295R215j6878J0411
16256i748N0681k652j7505l3494J5000j9718j8842l4905l7410n9355L1615k8197
$$ y = [47758, 101601, 127149, 98483, 103581, 50540, 61284, 52422, 64127, 47938, 19930, 14408, 68418, 51199, 56270, 123669, 84751, 23596, -8182, -87527, -163360, -133612, -80359, -72128, -56909, -39619, -432, -10620, -23186, 7577, 45757, 20040, 53640, 22499, -33664, -67186, -117396, -161013, -189649, -184954, -144902, -146050, -30387, -11030, -74276, -66212, -10328, 33226, 37691, 9644, -4930, -2188, -54544, -60419, -76560, -49099, -7021, 55288, 81767, 23876, -9591, -48159, -27911, -4165, -62736, -106479, -73551, -83575, -103599, -97982, 4548, 68301, 29468, 9774, 19678, 24226, -39385, -8161, -7565, 20381, 82211, 58799, -12496, -3281, -20159, -9748, 40933, 38281, 20776, -12718, 2282, -17436, -36278, -71183, -108593, -167948, -136333, -164530]
16244a64530n444L2280M0598K661P5571N1582p354K1012p210O895l0758m8649
16232c3346N273L4121o3347n6122j5531K7109L607m0817m167m49L7748O6719N220
16219c3982K7325K6665k3836N063L2146J3984j6372o3737m6461m899L8513N3423
16207G832L9384k7435n6764J4918O198n009k0128n406m86L1870J0170m0497M648
16194d0705M1600O5994Q824l2848M3473J8771j10589p6595P152Q02k1802K3642
16182g2281k6937M3127M5984L0087L2582n321K6183Q174j5679p1630k5115k9858
16170f0684J1741O458O17O1523M2344m4498m0081q384l146K2644K1639L1603o3071
16157b1295k1025k9284j6070M9929M8020j6521J763J870J2703l5325l2153j9341
$$ y = [-164530, -169974, -137694, -97096, -94435, -18864, 32718, 25364, 46376, 39166, 46061, 15303, -33346, -28073, 6048, -57299, -113421, -128952, -101843, -98236, -139053, -143220, -143669, -105921, -39202, -33982, -6657, 20008, -3828, 1235, 33381, 47365, 30993, -32744, -79205, -84104, -45591, 7832, 47216, 19781, -36983, -22065, -15867, -20876, -41004, -46410, -46896, -15026, -4856, -45353, -40705, 895, 66889, 75713, 42865, 86338, 105109, -5480, -82075, -74923, -74121, -95923, -72281, -99218, -56091, -10107, 19980, 52562, 47241, 73424, 81598, 65919, -5711, -30826, -60684, -48943, -42485, -41868, 19655, 61999, 17501, -22580, -30964, -34110, -11466, 10173, 41776, -21295, -42320, -71604, -87674, -37745, 10275, -6246, -4483, -2613, 10090, -25235, -57388, -76729]
16145g6729P5106K1600k4091o6219m4531R067L0427O2598J3426o7751K9561r052
16133d6588o3305k3154L8989j9299l9110J4093L5424m5032K0501J5846M4050M6512
16121b1073M772k7788J7369j799K3438n762l1297J1050k0859L3116k9386J8966
16109b9253j9346l0130j1775N062J12109K7982L4633j198l4423q2266K5400L5876
16097C2671n6996m612j4229l4738M4521o4175k1303N3959N1078k9531J0797R1601
16085E9043L834N53R913K5829n2596j4215J4724K0415o1140o6816K1770J2940
16073b5746N6508K102p6418l0762M8018J5172l3764L235M1607K3354m9428p365
16061c3487M1447J9632j8092K291j13051O993J0554K2980K2928j7879m2739P362
$$ y = [-76729, -1623, 19977, -4114, -70333, -114864, -105797, -75370, -12772, 654, -67097, -37536, -46588, -109893, -133047, -94058, -113357, -152467, -138374, -102950, -147982, -127481, -111635, -67585, -21073, -16301, -44089, -26720, -28519, -5081, -10843, -42140, -31090, -51949, -18833, -48219, -29253, -48599, -78729, -90504, -85442, 26667, 54649, 89282, 88084, 53661, -28605, -3205, 32671, -24325, -28937, -43166, -77904, -33383, -97558, -118861, -64902, -13824, -43355, -32558, 59043, 62877, 63430, 73343, 99172, 46576, 32361, 47085, 67500, 6360, -60456, -38686, -25746, 30762, 32864, -43554, -74316, -26298, -11126, -44890, -41655, -48, 23306, -26122, -33487, 7960, 27592, 9500, 11791, -101260, -94267, -83713, -60733, -37805, -55684, -98423, -91061]
16049i1061M3431k6178o0647M2563J09618K8024j16658o8148L998M3311L6926
16038e4821K5172J1494l3876j6700N037l238L498L9650m4749J1588K8898O6037
16026C7990M0686o8884l7978N7215n9900n4924K4653L2156l5143j0772N7475N8127
16014D0701K3004j3881k8359o676m3483M2706R822o6967m4879M3913P7760L4152
16002F7813l6512j6685J7500k1785P553o5087l3990O0552J3847j4476r503K0376
15990a0397p6n8480N673n004O6146M0337k7654n5526P369Q1122J3685o3143J391
15977d557k6897p4683k058j5453l886K5687K4500m627M0332k4212q852K2220J2474
15964d0012l9156Q8276K6099l9937n5503l8720k7590K619J107N102L4823O3603
$$ y = [-91061, -47630, -73808, -134455, -91892, 17726, 45750, -70908, -139056, -135058, -91747, -54821, -29649, -18155, -52031, -68731, -63694, -66932, -63434, -23784, -68533, -56945, -28047, 37990, 78676, 9792, -28186, 29029, -30871, -85795, -61142, -28986, -64129, -74901, -17426, 40701, 63705, 49824, 21465, 14789, -28694, 14012, 23834, -43133, -88012, -44099, 33661, 67813, 31301, 14616, 32116, 10331, 17884, -47203, -81193, -20641, -6794, -21270, -30773, -10397, -10473, -68953, -63280, -68284, -2138, 38199, 10545, -44981, -37612, 43510, 57195, -5948, -4557, -31454, -106137, -108195, -123648, -127534, -101847, -77347, -81974, -41642, -65854, -74706, -52486, -40012, -79168, 9108, 35207, -4730, -60233, -98953, -126543, -123924, -122817, -117715, -82892, -19289]
15952a9289K3273l1068L9359j6407l0255j4792R3505L2009j4820l8898O144K4392
15940E3153j8622j7608J1924m1374J9290O3129p9968n3320k8272J7146k9650K0374
15928h3798P9526N7059j7534k9167j9455J5983O6223J6980l2335j3019J3849p164
15916D7148k9375n3644J6726L2562M784o491j8821k1632J09123M0579L1159j07410
15904D4708p1746O0522L5381L1385j2349l9247K6411m9656j09005o666k0712k5684
15892a36658O0320L3378Q165M5924n029n2380j9799N1800O3609K582j5412n5278
15880a8778o2650J4774j734N6147L6222J8347K7316J7474M205K8119j2658m9874
15868E6910n089l0150l3855N6581L5852k8958q2615K3203l470j3298r866K6269
$$ y = [-19289, 3984, -27084, 12275, -4132, -34387, -49179, 44326, 76335, 61515, 22617, 28761, 53153, 34531, 16923, 28847, -12527, 6763, 69892, -10076, -63396, -91668, -74522, -104172, -83798, -4272, 52787, 35253, 6086, -13369, 2614, 68837, 85817, 53482, 40463, 54312, 47148, 17773, -35871, -19145, 13417, 18201, 11710, -7111, -28743, 80380, 120959, 152118, 44708, -27038, 33484, 68865, 100250, 87901, 48654, 75065, 25409, -83596, -90262, -110974, -136658, -76338, -42960, -34795, 11129, 6100, -46280, -66079, -14279, 49330, 51912, 36500, -18778, -81428, -66654, -68388, -12241, 23981, 42328, 69644, 87118, 91323, 119442, 106784, 56910, 51821, 21671, -12184, 44397, 80249, 51291, -31324, -8121, -11591, -24889, -34755, -8486]
15856h486L8074J9546k2329L471q3817k7910m21P901K4300K5507j1381P6939q866
15843C2528k3441j3940j7035K7993O2887o1353k8100q694K2062l0164k7951N495
15831e9713N261L454n7199K1020J2221m0183J9860R1828k5989L1568j3486L5244
15819B3886M2333n921j9020M724j00009m8907K5395N3758K3490Q876J5122j4182
15807I545p0745l4235N4516P0475o819n6293l2439k7373K1372P9691J4818J3611
15795C6124l963j8007K7436L307k0200m1714O4837j4763k1477n9565l810R432
15783d2363r449k1272k5358K5226M4720j4157n6375M1863J4992m78K4267M1431
15771B3047N109l1335J0510P430l2104k3714K3108j1532k5090k1690k3273l7798
$$ y = [-8486, 29588, 49134, 26805, 30276, -53541, -81451, -81872, -73971, -49671, -24164, -35545, 41394, 32528, 9087, -4853, -21888, 6105, 68992, 7639, -20461, -29155, -7093, -37257, -65208, -59713, -54452, -50998, -108197, -87177, -74956, -115139, -95279, -3451, -29440, 2128, -11358, 23886, 66219, 60298, 41278, 46002, -54007, -102914, -77519, -23761, -271, 8605, 23727, 9545, -61200, -95435, -40919, 29556, 22737, -33556, -65995, -93368, -71996, 7695, 22513, 36124, 32161, 14154, 41590, 44897, 24697, -17017, 47820, 33057, 11580, -47985, -51795, -42363, -51812, -73084, -98442, -73216, -28496, -42653, -99028, -57165, -42173, -42651, -18384, 23047, 28156, -3179, 7331, 14761, -17343, -41057, -17949, -29481, -54571, -76261, -99534, -137332]
15759a37332K2597M4820L6199O9178p896j2051P8481M845q8518p1601k255M994
15747e8539j8989K0418L0333l2169m4577l561M3401j5796j3854p727J4146O5806
15735b1108Q6859O600r8153p7254o5012L0054M1678O1642R574j0139j503M706
15723c2056q248J8835J789l4079j4991k1576l0196N2379J0082k1422K6765J01695
15711D8977k6056m1094k3086L9995m631M9936P5457n0182n300n4462j5721k0291
15699b6458j8008K7518m5401j5153O6277J5782L3340L4308o5316M9221m1743n1763
15687c7396k6657p5382l7692O0164R5768o000M2931q1818m5537l6250M8057k03
15675a00015j0713o6505J1278P696L824j6201J3183Q5172L2604L6389k3009p9373
$$ y = [-137332, -114735, -69915, -33716, 35462, 27566, 15515, 93996, 98841, 10323, -61278, -63533, -58539, -77528, -57110, -26777, -58946, -103523, -107084, -63683, -79479, -93333, -101060, -86914, -21108, 65751, 72351, -25802, -103056, -168068, -138014, -96336, -34694, -25120, -35259, -36762, -32056, -40304, -21469, -19680, -53759, -68750, -90326, -120522, -68143, -58061, -79483, -52718, 48977, 22921, -18173, -41259, -1264, -5895, 44041, 119498, 69316, 64016, 9554, -6167, -26458, -44466, -16948, -62349, -77502, -11225, 4557, 37897, 72205, 6889, 56110, 14367, -37396, -64053, -139435, -177127, -116963, -21195, -27195, 15736, -66082, -111619, -147869, -99812, -100015, -110728, -177233, -165955, -158259, -154435, -170636, -157453, -72281, -39677, -3288, -26297, -105670]
15663a05670K0112j1544q0658m957M1580M6825O885J1627L550O1533k7255O1690
15651B3718N3249n3808j50825n382J9856j7988L6512L0282n0246K6659K3672k2844
15639h7145L2667L5395K5135N0456l9245k9882l4464j6825m9435K8135j448L455
15627h3201K1038K668O0691O719O570j3121j5317l1305q545N6317M7847j291m2157
15614F913K10j9040l2169n151Q552j7958k5950K1977j2254K6726N561l3451L342
15601g2692K1926j7357p553J3022m1165j8561N4033J6328L8726J7434k3108j7794
15589c6761o22K0843J3279J9732P498J4475Q3541l8425j6149J3965o0623m5143
15577b4390l3124J6P1492L6925J2001N481j4959l1578J997l7205k1022m489K0703
$$ y = [-105670, -85558, -97102, -177760, -182717, -141137, -94312, -87427, -75800, -72250, -10717, -37972, 23718, 76967, 23159, -127666, -133048, -113192, -131180, -94668, -64386, -114632, -87973, -64301, -87145, -54478, -19083, 6052, 56508, 17263, -12619, -47083, -63908, -113343, -85208, -86656, -83201, -62163, -59495, 1196, 7915, 14485, 1364, -13953, -45258, -53803, 2514, 50361, 49070, 6913, 7123, -11917, -44086, -49237, -40685, -58643, -84593, -62616, -74870, -48144, -42583, -76034, -72692, -50766, -68123, -75676, -62654, -103819, -122380, -68347, -52019, -13293, 4141, -18967, -36761, -37383, -16540, -3261, 16471, 23969, 38444, 121985, 83560, 67411, 81376, 20753, -24390, -57514, -57498, 13994, 50919, 62920, 68401, 53442, 21864, 23861, -13344, -34366, -38855, -18152]
15564a8152M4152K6525P1558L1632k8652r7885J0554m1486m4843J4139K126k793
15552c3125l8802o468P652J1327N0587N6756k50j3323Q481J29p2436k1664Q433
15539d2703k7167m2780k2344M9197N3612N7044J3047n8066m7016K6288l1172J0302
15527f1758j4011J1987K3381L4139l3079L891Q1822J3443m5038O2209R9356n7894
15515A18448p5689r536M8538j2934j0869l6461n5305m8035J4016k4272M3432J2299
15503c6368P564J6209M2169J1754j9563k7918m943m0967l6433j3444N780N3979
15491d2181L0608n3566K3038O7382o8027j4380k181L3897K127j8809L1093L0389
15479A9390j2063M3683k8107p4494L2685r432n447K6329m2466Q144O2915K7205
$$ y = [-18152, 26000, 52525, 124083, 155715, 127063, 29178, 39732, -1754, -46597, -32458, -30332, -33125, -71927, -78395, -70743, -59416, -8829, 47927, 47677, 34354, 42835, 42964, -29472, -51136, -42703, -69870, -112650, -134994, -85797, -32185, 24859, 37906, -20160, -67176, -40888, -72060, -61758, -75769, -63782, -40401, -6262, -39341, -35450, 46372, 59815, 14777, 76986, 176342, 118448, 42759, 33223, 81761, 68827, 57958, 21497, -33808, -81843, -67827, -92099, -48667, -36368, -28804, -12595, 29574, 41328, 21765, -6153, -11096, -52063, -88496, -101940, -96160, -42181, -11573, -65139, -42101, 25281, -42746, -57126, -59307, -25410, -23283, -42092, -10999, 19390, 7327, 51010, 22903, -51591, -18906, -28338, -33785, -7456, -49922, -41778, 21137, 48342]
15467D8342k2920p3895k8249k3806L281p7007l2261L7546M6603K5694J7680l6964
15455a15956J3938L1327K0583K0234M4492K9242l7633r911M4857o278L168J5297
15443E3360J5857n2109k8735j4160K4294k241J3553j1625k9398L3999O8473n7044
15431A4224p3753L1760K5713m4305M5393r898n8605o8972L4493o014L771J5313
15419i0880j7547J3215m513j2275N6994P7243M6660k2391N7451J0756k0536M6897
15407A41074m8164r5330o2945L4796J2383P1133N456k0909o1670l1674k7526P6611
15395f765L9666k3448n9067m2242l958J05427m315n9167n0662M2632N2373P6464
15383F6938l0879n4140k6351m2009M2489n757K93K3866N648p157K1743P3336k3469
$$ y = [48342, 25422, -48473, -76722, -100528, -97247, -174254, -206515, -168969, -122366, -96672, -78992, -115956, -102018, -70691, -50108, -29874, 14618, 43860, 6227, -3684, 41173, 34895, 38063, 53360, 69217, 17108, -11627, -25787, -1493, -3734, 9819, -1806, -31204, 2795, 71268, 14224, -59529, -27769, -2056, -46361, -968, -10866, -69471, -138443, -103950, -109964, -106193, -90880, -108427, -95212, -99725, -112000, -55006, 22237, 68897, 46506, 103957, 114713, 94177, 141074, 92910, -2420, -65365, -30569, -18186, 52947, 58403, 37494, -24176, -55850, -83376, -6765, 32901, 9453, -49614, -91856, -95814, 9613, 5298, -53869, -104531, -61899, -9526, 66938, 36059, -18081, -44432, -86441, -43952, -49709, -49416, -25550, -19902, -27059, -5316, 68020, 44551]
15370D4551l6521j0891N536K6239k7574r9814R622P2101L4395j8346n3392l192
15358e7286O001l4322k1870N2879P6763J9497k0145M0026l4218r4928j4189K6090
15346e5702j3610J8324L3348k094m7001O298m6497m3482O6032K2324P0046J0059
15334A8045J0164N943R253n2783l0712J4117P0064N2670m448r0624p9197R0361
15322A2853O6564l003q8094j04425R108Q7546Q818j5566o547o375p621J4574p7369
15309a09537K730j7184j8397j3111m8983l0148P3852N2167K1074K6203M0609J1127
15297i598O365M3617L4078q546N284l7822o6428L6651M6689k7197j0210k063j6409
15284e589k4907j2272R980l6228K8402n8013J05804L5268m9927J060K7421K5810
$$ y = [44551, 8030, -2861, 2675, 28914, 1340, -98474, -88852, -16751, 17644, -702, -54094, -57286, -51285, -85607, -107477, -54598, 22165, 41662, 21517, 61543, 27325, -67603, -81792, -55702, -69312, -50988, -17640, -19734, -66735, -60437, -106934, -150416, -84384, -62060, 7986, 18045, 28209, 34152, 43405, -9378, -40090, -25973, 44091, 96761, 92313, 1689, -77508, 12853, 79417, 76414, -11680, -116105, -106997, -19451, -10633, -26199, -32746, -39121, -46742, -32168, -109537, -106807, -123991, -142388, -155499, -204482, -234630, -160778, -108611, -87537, -61334, -20725, -9598, -3233, 40384, 74462, 65916, 71200, 33378, -33050, 3601, 50290, 23093, 12883, 10820, -5589, -30496, -42768, -32788, -69016, -40614, -98627, 7177, 42445, -7482, -6422, 20999, 46809]
15272D6809K1511j4061k0891l465n163O8089R0113k2268m9584J840J1092j8352
15260A05670J5189q6917j02758l5201K3099k0110K7879M8409j0994L018P863m5889
15248g0742L5932K5232m6745m538L405M3094k2882L15l1015j8944N8646j6223
15236d4465n767N0052M2162o1921m8794J6593k7871L6720k6804k0125M092M2226
15224d3902M5649m8358k2315M4817N8937j6252j11914m3346M5115Q6694O4669
15213E9794J4633n1884J4984L82J0702P216K7145M171m8273L7251K7061l8354
$$ y = [46809, 68320, 54259, 33368, 29903, 24740, 92829, 182942, 160674, 111090, 112930, 124022, 105670, 120859, 33942, -68816, -104017, -80918, -101028, -73149, -24740, -35734, -32716, -24853, -70742, -34810, -9578, -56323, -60861, -57456, -14362, -37244, -36929, -67944, -86888, -28242, -44465, -50232, -180, 41982, -19939, -68733, -52140, -80011, -43291, -70095, -90220, -86128, -43902, 1747, -46611, -68926, -24109, 34828, 18576, -93338, -136684, -91569, -4875, 59794, 74427, 22543, 37527, 37909, 48611, 55827, 82972, 87143, 38870, 76121, 103182, 64828]
$$ [...]
##END NTUPLES=NMR SPECTRUM
##END=
