##TITLE=Analysis number 328441
Compound Code cc 56216
Book Reference 513/81/5
Project Code adrs
Chemist Name ronp
##JCAMPDX= 6.0         $$ Bruker NMR JCAMP-DX V2.0
##DATA TYPE= NMR SPECTRUM
##DATA CLASS= NTUPLES
##ORIGIN= Bruker BioSpin GmbH
##OWNER= nmr
$$ XWIN-NMR		Version 3.5
$$ Wed Jun  6 11:22:19 2007 GMT Daylight Time (UT+1h)  MAYBRIDGE\nmr@NMR_250MHZ
##.OBSERVE FREQUENCY= 250.131544655141
##.OBSERVE NUCLEUS= ^1H
##.ACQUISITION MODE= SIMULTANEOUS (DQD)
##.ACQUISITION SCHEME= undefined
##.AVERAGES= 16
##.DIGITISER RES= 18
##SPECTROMETER/DATA SYSTEM= dpx250
##.PULSE SEQUENCE= zg30
##.SOLVENT NAME= CDCl3
##.SHIFT REFERENCE= (INTERNAL, CDCl3, 0, 16.522)
##AUDIT TRAIL= $$ (NUMBER, WHEN, WHO, WHERE, WHAT)
$$ ##TITLE= Audit trail, XWIN-NMR		Version 3.5
$$ ##JCAMPDX= 5.01
$$ ##ORIGIN= Bruker BioSpin GmbH
$$ ##OWNER= nmr
$$ C:\u/data/dgb/nmr/ADRS/320/pdata/1/auditp.txt
$$ ##AUDIT TRAIL=  $$ (NUMBER, WHEN, WHO, WHERE, WHAT)
(   1,<2007-06-06 11:21:58.43 +100>,<MAYBRIDGE\nmr>,<NMR_250MHZ>,
      <created by zg, POWCHK disabled, PULCHK disabled
       configuration hash MD5:
       76 6E 9A 78 1E 09 19 81 EC 84 63 8F B0 6A 59 2D
       data hash MD5: 64K
       25 87 94 D0 27 6A 56 70 E8 45 10 B9 7E 4B 7F 97>)
(   2,<2007-06-06 11:22:10.94 +100>,<MAYBRIDGE\nmr>,<NMR_250MHZ>,
      <Start of raw data processing
       ef LB = 0.3 FT_mod = 6 PKNL = 1 SI = 32K 
       data hash MD5: 32K
       56 98 38 CD B9 A1 44 A6 85 96 03 80 CA 2B A8 32>)
(   3,<2007-06-06 11:22:12.60 +100>,<MAYBRIDGE\nmr>,<NMR_250MHZ>,
      <apk 
       data hash MD5: 32K
       6F 6D A4 67 58 DD 8E 55 6A D9 9E DB 4D E1 1F 05>)
(   4,<2007-06-06 11:22:13.35 +100>,<MAYBRIDGE\nmr>,<NMR_250MHZ>,
      <abs ABSG = 5 
       data hash MD5: 32K
       2D 5F 5B 94 CF 2A 28 9B C4 A0 71 DE B8 3C C2 95>)
$$ ##END=
$$ 
$$ hash MD5
$$ AE 9F 74 7F 2C 5D 2C 12 23 4A E1 F0 BB 2D B7 08
##$RELAX= 
##$RELAX= 
##$RELAX= 
##$RELAX= 
##$RELAX= 
##$RELAX= 
##$RELAX= 
$$ Bruker specific parameters
$$ --------------------------
##$DU= <C:\u>
##$EXPNO= 320
##$NAME= <ADRS>
##$PROCNO= 1
##$TYPE= <nmr>
##$USER= <dgb>
##$AMP= (0..31)
100 100 100 100 100 100 100 100 100 100 100 100 100 100 100 100 100 100 
100 100 100 100 100 100 100 100 100 100 100 100 100 100 
##$AQSEQ= 0
##$AQ_mod= 3
##$AUNM= <au_zg>
##$AUTOPOS= <15 >
##$BF1= 250.13
##$BF2= 250.13
##$BF3= 250.13
##$BF4= 250.13
##$BF5= 500.13
##$BF6= 500.13
##$BF7= 500.13
##$BF8= 500.13
##$BYTORDA= 1
##$CFDGTYP= 0
##$CFRGTYP= 5
##$CHEMSTR= <none>
##$CNST= (0..31)
1 1 145 1 1 1 1 1 1 1 1 1 1 1 1 1 1 1 1 1 1 1 1 1 1 1 1 1 1 1 1 1 
##$CPDPRG= <>
##$CPDPRG1= <>
##$CPDPRG2= <>
##$CPDPRG3= <>
##$CPDPRG4= <mlev>
##$CPDPRG5= <mlev>
##$CPDPRG6= <mlev>
##$CPDPRG7= <mlev>
##$CPDPRG8= <mlev>
##$CPDPRGB= <>
##$CPDPRGT= <>
##$D= (0..31)
0 1 0 0 0 0 0 0 0 0.06 0 0 0 0 0 0 0.0002 0 0 0 0 0 0 0 0 0 0 0 0 0 0 
0 
##$DATE= 1181125316
##$DBL= (0..7)
120 120 120 120 120 120 120 120 
##$DBP= (0..7)
150 150 150 150 150 150 150 150 
##$DBP07= 0
##$DBPNAM0= <>
##$DBPNAM1= <>
$$ [...]
##$SUBNAM7= <"">
##$SUBNAM8= <"">
##$SUBNAM9= <"">
##$SW= 20.6930455092707
##$SWIBOX= (0..15)
0 0 3 0 0 0 0 0 0 0 0 0 0 0 0 0 
##$SW_h= 5175.983436853
##$TD= 65536
##$TD0= 1
##$TE= 296.16
##$TE2= 300
##$TE3= 300
##$TEG= 300
##$TL= (0..7)
0 120 120 120 120 120 120 120 
##$TP= (0..7)
150 150 150 150 150 150 150 150 
##$TP07= 0
##$TPNAME0= <>
##$TPNAME1= <>
##$TPNAME2= <>
##$TPNAME3= <>
##$TPNAME4= <>
##$TPNAME5= <>
##$TPNAME6= <>
##$TPNAME7= <>
##$TPOAL= (0..7)
0.5 0.5 0.5 0.5 0.5 0.5 0.5 0.5 
##$TPOFFS= (0..7)
0 0 0 0 0 0 0 0 
##$TUNHIN= 0
##$TUNHOUT= 0
##$TUNXOUT= 0
##$USERA1= <user>
##$USERA2= <user>
##$USERA3= <user>
##$USERA4= <user>
##$USERA5= <user>
##$V9= 5
##$VALIST= <valist>
##$VCLIST= <CCCCCCCCCCCCCCC>
##$VD= 0
##$VDLIST= <DDDDDDDDDDDDDDD>
##$VPLIST= <PPPPPPPPPPPPPPP>
##$VTLIST= <TTTTTTTTTTTTTTT>
##$WBST= 1024
##$WBSW= 4
##$XGAIN= (0..3)
0 0 0 0 
##$XL= 0
##$YL= 0
##$YMAX_a= 292515
##$YMIN_a= -162068
##$ZGOPTNS= <>
##$ZL1= 120
##$ZL2= 120
##$ZL3= 120
##$ZL4= 120
##$ABSF1= 16.522
##$ABSF2= -4.171173
##$ABSG= 5
##$ABSL= 3
##$ALPHA= 0
##$AQORDER= 0
##$ASSFAC= 0
##$ASSFACI= 0
##$ASSFACX= 0
##$ASSWID= 0
##$AUNMP= <proc_1d>
##$AZFE= 0.1
##$AZFW= 0.1
##$BCFW= 0
##$BC_mod= 0
##$BYTORDP= 0
##$COROFFS= 0
##$CY= 12.5
##$DATMOD= 1
##$DC= 0
##$DFILT= <>
##$DTYPP= 0
##$F1P= 14.0000005364418
##$F2P= -0.99999901652339
##$FCOR= 0.5
##$FTSIZE= 32768
##$FT_mod= 6
##$GAMMA= 0
##$GB= 0
##$INTBC= 1
##$INTSCL= 1
##$ISEN= 128
##$LB= 0.3
##$LEV0= 0
##$LPBIN= 0
##$MAXI= 10000
##$MC2= 0
##$MEAN= 0
##$ME_mod= 0
##$MI= 0
##$NCOEF= 0
##$NC_proc= -5
##$NLEV= 6
##$NOISF1= 0
##$NOISF2= 0
##$NSP= 0
##$NTH_PI= 0
##$NZP= 0
##$OFFSET= 16.522
##$PC= 1
##$PHC0= -47.94484
##$PHC1= 3.505665
##$PH_mod= 1
##$PKNL= yes
##$PPARMOD= 0
##$PSCAL= 4
##$PSIGN= 0
##$REVERSE= no
##$SF= 250.13
##$SI= 32768
##$SIGF1= 0
##$SIGF2= 0
##$SINO= 400
##$SIOLD= 32768
##$SREGLST= <1H.CDCl3>
##$SSB= 0
##$STSI= 32768
##$STSR= 0
##$SW_p= 5175.98343685301
##$SYMM= 0
##$S_DEV= 0
##$TDeff= 65536
##$TDoff= 0
##$TI= <Analysis number 999999
Compound Code 99
Book Reference 9
Project Code 9>
##$TILT= no
##$TM1= 0
##$TM2= 0
##$TOPLEV= 0
##$USERP1= <user>
##$USERP2= <user>
##$USERP3= <user>
##$USERP4= <user>
##$USERP5= <user>
##$WDW= 1
##$XDIM= 32768
##$YMAX_p= 560128311
##$YMIN_p= -791104
$$ End of Bruker specific parameters
$$ ---------------------------------
##NTUPLES= NMR SPECTRUM
##VAR_NAME=  FREQUENCY,     SPECTRUM/REAL,   SPECTRUM/IMAG
##SYMBOL=    X,             R,               I
##VAR_TYPE=  INDEPENDENT,   DEPENDENT,       DEPENDENT
##VAR_FORM=  AFFN,          ASDF,            ASDF
##VAR_DIM=   32768,         32768,           32768
##UNITS=     HZ,            ARBITRARY UNITS, ARBITRARY UNITS
##FACTOR=    0.157963299565203, 1,           1
##FIRST=     4132.6476996994, 0,             0
##LAST=      -1043.33573715361, 0,           0
##MIN=       -1043.33573715361, -791104,     0
##MAX=       4132.6476996994, 560128311,     0
$$ Real data points
##PAGE= N=1
##DATA TABLE= (X++(R..R)), XYDATA
$$ [...]
23135H7895J8305j57578Q3490m2412M6027P1428r9704r4032j41195J31608P199
23124h8969J63332N1635j19982j22665J00328J52586j39291j32058K58467J73995
23114B97378N8336j91867k36389j65649K31444K11511k2975k5403N9101j06688
23104A08799p4639J7045J3644M0709J25726l1876N3412j25582n6555o627j40222
23093g6166m9533P5851J50464K68516k00447l15493J93090J26888l6352P3847
23083B10665l5706o5939K9421P9647q7996l20126j54219J01459N7209J11384O6590
23072g611J058R125k7642J90822q4947q0240O8573K23402n8213j85308j76184
23061a27165j06991L5470j23314Q7151J09276J02104K17822Q9889q498j00770
$$ plain form
23135 87895 106200 -51378 32112 -10300 35727 107155 7451 -86581 -227776 -96168 -88969
23124 -88969 74363 125998 6016 -116649 -16321 136265 -3026 -135084 123383 297378
23114 297378 355714 163847 -72542 -238191 -6747 204764 181789 156386 215487 108799
23104 108799 34160 51205 64849 105558 231284 199408 252820 127238 70683 64056 -76166
23093 -76166 -125699 -49848 100616 369132 168685 -146808 46282 173170 136818 210665
23083 210665 174959 109020 138441 218088 130092 -190034 -344253 -242794 -185585 -74201 -7611
23072 -7611 -6553 2572 -25070 165752 80805 565 69138 292540 234327 49019 -127165
23061 -127165 -234156 -198686 -322000 -234849 -125573 -23469 194353 284242 275744 174974
23051A74974j19095Q5128O6879o7892M8479m9185J78170K80k97514Q2890J83107
23040B86221q2707L8602J11215O583l5557k3007j17450M2001j06510r8684j3874
23029F833k32172j07792K22418J24394l8824J64228R9107j41707l12263j49880
23019c65658O3034J58040N3871j4253j8042M0998R1639n5555r3114R352M2443
23008h7245K0349L4224R2133j32550N0312M0649q25J68820n0639q6749k06338
22997a57859j6542J05636P2737J18888l7886j96886Q6384J28265j5149k84445
22987a96857K1869K23735j8117m5399K0741m606K7522j1032j84993Q1847J78028
22976I2738j0099j63857M785o0401j19239K38018P9060L302j00851J03306K706
$$ plain form
23051 174974 55879 141007 207886 139994 188473 139288 317458 317738 20224 103114 286221
23040 286221 203514 242116 353331 359914 324357 301350 183900 225901 119391 20707 6833
23029 6833 -225339 -333131 -110713 13681 -25143 139085 238192 96485 -215778 -365658
23019 -365658 -302624 -144584 -90713 -104966 -123008 -82010 9629 -45926 -139040 -129688 -87245
23008 -87245 -66896 -32672 59461 -73089 -22777 17872 17047 185867 135228 48479 -157859
22997 -157859 -174401 -68765 3972 122860 84974 -111912 -25528 102737 87588 -196857
22987 -196857 -174988 48747 30630 -14769 5972 1366 28888 17856 -167137 -85290 92738
22976 92738 82639 -81218 -76433 -136834 -256073 -18055 61005 64307 -36544 66762 69468
22965F9468m7954J51234K8666q9854j13773j707L9577j28161j21191J05043Q4935
22954b3717M1724k0352j19665n3931Q7282L7879K15865J09546K9455j24492l07470
22943a27876L619K36343J315l4306M9898J69257j51490j21575j99909j65381J97458
22932a42647K44956l2816K8628M2484P6957n6296l9583M9924L5455k5388j47020
22921C4654j50603O1185j8471L7664O1578m0747J95967P3080k4710j47411o361
22910G5825j98702M1752j946J5192N6418r8570P879K2540R8256J58832j02644
22899G4832m2710Q9627J3831Q5050j37599P4439Q8945K22905k16151l49437l05451
22888d01719J95903J65891k9979P792J37058J18474l5957k4816j00832k49500
$$ plain form
22965 69468 21514 172748 201414 111560 -2213 -3920 35657 -92504 -213695 -108652 -23717
22954 -23717 18007 -2345 -122010 -175941 -88659 -50780 165085 274631 304086 179594 -127876
22943 -127876 -124257 112086 113401 79095 128993 298250 146760 25185 -174724 -340105 -142647
22932 -142647 102309 69493 98121 140605 217562 161266 121683 171607 207062 181674 34654
22921 34654 -115949 -54764 -73235 -35571 26007 -14740 181227 254307 229597 82186 75825
22910 75825 -122877 -81125 -83071 -67879 -11461 -110031 -102152 -79612 18644 177476 74832
22899 74832 32122 121749 135580 220630 83031 157470 246415 469320 253169 -96268 -401719
22888 -401719 -205816 -39925 -69904 -62112 74946 193420 157463 132647 31815 -217685
22878b17685J13328m4336K1482J48215N6709J19473J18393p4552j75839j26500
22868f1312l4543J80101K05457Q9103j161j89479j96504R4278J79600p6938o8720
22857A19882n2567m5461R0568N1779Q083j19614r6979n617P3601O9617K25837
22846C19129Q3777o3594p8030j36842j02736r1554j36110J8117N4463k63303O876
22835c89807K99772J16775l5069j33308N3345n1816j9162r906n1894j50392j32741
22824e04203J5693O4525J28653l4631J1657K45687j8016j77000j3856J35113o737
22813a53115J2468L5045J09709o4207o4860q5019J11513p3888P33R5662o3262
22802a39221R574J48601J26785k00141J1814J51350j0412o2290J06161R6211j88107
$$ plain form
22878 -217685 -104357 -148693 -127211 21004 77713 197186 315579 241027 65188 -61312
22868 -61312 -95855 84246 289703 378806 377645 188166 -8338 85940 265540 188602 119882
22857 119882 67315 21854 112422 164201 172284 52670 -44309 -49926 23675 93292 319129
22846 319129 402906 339312 261282 124440 21704 -69850 -205960 -187843 -133380 -396683 -389807
22835 -389807 -90035 26740 -8329 -141637 -88292 -140108 -159270 -169176 -221070 -371462 -504203
22824 -504203 -488510 -423985 -295332 -329963 -318306 -72619 -90635 -267635 -281491 -146378 -153115
22813 -153115 -140647 -105602 4107 -60100 -124960 -209979 -98466 -172354 -171621 -75959 -139221
22802 -139221 -129647 18954 145739 -54402 -42588 108762 98350 36060 142221 238432 50325
22791E0325q2299P2166Q5367j84059k04611j5628P9072J25808o2132L1578J62703
22780E8290j10205k12934k2728j6177o7326j59510M4031Q5997L64738N2964j06816
22769h9676J4517J71420J62268j24054o5655n5286j96383j22709J58306J88773
22759D1521J02218M9540o1959p8556j46582j56123M0720l2053J04094k5324j00942
22748b63446k99j28149M4688p2708Q5425P9755P4969J16530Q1491j57475p7649
22737b16868j1282J3169J94655P8621k7156m8889J48831l4502j7783J24519j01230
22726A02085o5438R1725j71239q5325j5496m0506L4901R0856J03714k4364j39874
22715a18961J18049J97787n7006j7207j97733k7350N006Q4319j39146j18565l0520
$$ plain form
22791 50325 -31974 40192 125559 -58500 -263111 -278739 -199667 -73859 -135991 -104413 58290
22780 58290 -51915 -264849 -287577 -303754 -371080 -530590 -486559 -400562 -35824 17140 -89676
22769 -89676 -75159 96261 258529 134475 68820 13534 -182849 -305558 -147252 41521
22759 41521 143739 193279 131320 52764 -93818 -249941 -209221 -241274 -137180 -162504 -263446
22748 -263446 -263745 -391894 -347206 -419914 -334489 -254734 -179765 -63235 18256 -139219 -216868
22737 -216868 -228150 -214981 -20326 58295 31139 -17750 131081 96579 78796 203315 102085
22726 102085 36647 128372 -42867 -128192 -143688 -184194 -149293 -58437 45277 20913 -118961
22715 -118961 -912 196875 139869 122662 -75071 -102421 -97415 -13096 -152242 -270807 -301327
22704c01327J05130K1218K05151k0243l2326J6355q5728r1600K0640j7325K5373
22693a54682P1903m5777p1750J2070J51529k2304k02020j95952K43341P0643Q5246
22682e7753P6951l6575N8273k95235q5987J07369J16644m1735n5565p4724J24101
22671a64236K9835P7869r0495j20474K18588r0221K4159q4823R4629J64830m3879
22660A5782K05j01729p9716J64685J30782r1105j99269j48059K250J67034J72696
22649C3556K8946P7681j59872j84744P3749R8596k3171J7418l4477K7557J33071
22638H8310p9384k87644k45307K1671J13593J77656j1821j14402M9254J53355
22628a34719J22145O6219p3760L9994J9580j15243J17659J23621k2010p7424j0668
$$ plain form
22704 -301327 -196197 -174979 30172 9929 -22397 -6042 -91770 -183370 -162730 -180055 -154682
22693 -154682 -82779 -128556 -200306 -188236 -36707 -59011 -261031 -456983 -213642 -142999 -57753
22682 -57753 19198 -17377 40896 -254339 -340326 -232957 -116313 -158048 -213613 -288337 -164236
22671 -164236 -134401 -56532 -147027 -267501 -48913 -139134 -114975 -199798 -105169 59661 15782
22660 15782 15987 -85742 -165458 -773 130009 38904 -160365 -308424 -306174 -139140 33556
22649 33556 62502 140183 -19689 -204433 -130684 -32088 -55259 -37841 -72318 -44761 88310
22638 88310 8926 -278718 -524025 -502354 -388761 -211105 -222926 -337328 -288074 -134719
22628 -134719 -12574 53645 -20115 19879 39459 -75784 41875 165496 143486 66062 55394
22617E5394o513q7984K3911q4917q2508L3248M6858j02920m2096K44261K46324
22606B43058j32449Q4107n2950j54269r8585K6445P0255p2134j24702K15830J96716
22595B01322L4973k55629J02901j5749r0869L7243o1093k15280Q100J6972J85219
22584e1890Q1212k3404m2230j8437j80485L2403o444k21963J58833J43165o9405
22573a98645j4032J58783O3319k01526R196K05129K2745J58268O8942q7989j70349
22562A3841j67751K4951P6558M543l3859P6326j17955j81293k07559J43167L50337
22551a8694o3516k70311o9735K7580L22206J39996Q7280r4226j13542Q2383N0214
22540G9635j72151j74705O8148J00517O1840J03855J00120Q7103j46099K3411
$$ plain form
22617 55394 48881 -39103 -15192 -100109 -182617 -149369 -102511 -205431 -247527 -3266 243058
22606 243058 110609 194716 141766 -12503 -111088 -84643 -14388 -86522 -211224 4606 201322
22595 201322 236295 -19334 83567 67818 -23051 14192 -46901 -262181 -254081 -237109 -51890
22584 -51890 29322 5918 -36312 -54749 -235234 -202831 -209275 -431238 -272405 -129240 -198645
22573 -198645 -212677 -53894 9425 -192101 -182905 22224 44969 203237 272179 184190 13841
22562 13841 -153910 -128959 -52401 -47858 -81717 -5391 -123346 -304639 -512198 -369031 -18694
22551 -18694 -82210 -352521 -422256 -394676 -72470 67526 154806 60580 -52962 29421 79635
22540 79635 -92516 -267221 -199073 -98556 -36716 67139 167259 254362 108263 131674
22530A31674o5364r0345j11993j14719k43946M2152R3599L8984m3299o388J0756
22519c58889K11868j68967m8187J11506L16062O2379q5882j18245k0447J4845
22509h3957p631j57223K5957m891j18614k09720L4515o8332N2575j8208J72927
22498c82602J48833L5967K39277L6824J19381K3730j16647n3146N6045J16370
22488B24032K42777q8833k47631N5361K5757j45127o3431J0512k30059j0354M8641
22477a78355j35508j37102J95853J12891L945o0462M7161K1655N3581J05796j6855
22466A2600j17747M7353N1357j53935j63157P0884K35007j4848j28512q1104J96725
22455d5377K20025Q77p6430O2640r1265K866J64541m5599J73016Q3847N0100j9793
$$ plain form
22530 131674 66310 -24035 -136028 -250747 -494693 -452541 -358942 -319958 -363257 -369645 -358889
22519 -358889 -147021 -315988 -364175 -252669 63393 125772 39890 -78355 -98802 -83957
22509 -83957 -91588 -248811 -222854 -227745 -346359 -556079 -521564 -589896 -537321 -555529 -382602
22498 -382602 -233769 -197802 41475 78299 197680 221410 104763 51617 107662 224032
22488 224032 466809 377976 130345 185706 211463 66336 2905 13417 -216642 -226996 -178355
22477 -178355 -313863 -450965 -255112 -142221 -138276 -198738 -151577 -129922 -76341 29455 12600
22466 12600 -105147 -57794 -6437 -160372 -323529 -252645 -17638 -32486 -160998 -242102 -45377
22455 -45377 174648 175525 99095 161735 70470 73336 237877 192278 365294 449141 499241 479448
22443D79448k32429k09786q832j16989l2874K21807L9542p2971q7558k07528j14956
22432c43126K92988J3241l8946j12146j41826P7603Q9326L5506J20010j31924
22422a39294j41594K43643P9168k17200n3127O233J00117l5936p2241j48239j84462
22411e62932K82255Q8528M5796M949o7399l2202K51479J4767j68146j04688P55
22400b46838J67132K5565n0336J91059J07437k0918k86956q0541J30245J13985
22390D9834P7496n2442n8290P9314J52628p7441p4825K01635r8439n0771l9228
22379A09471J6111k22399j25378N7482L35488K91259p4808l37308k13651q7791
22369b51524j9426J58872J62050J16316J69497J75761k46637k05313P2079N0549
$$ plain form
22443 479448 247019 37233 28401 -88588 -121462 100345 139887 66916 -20642 -228170 -343126
22432 -343126 -50138 -36897 -75843 -187989 -329815 -252212 -162886 -127380 -7370 -139294
22422 -139294 -280888 -37245 41923 -175277 -228404 -222171 -122054 -157990 -230231 -378470 -562932
22411 -562932 -280677 -192149 -146353 -141404 -208803 -241005 10474 25241 -142905 -247593 -246838
22400 -246838 -79706 -54141 -104477 86582 194019 173101 -113855 -194396 -64151 49834
22390 49834 127330 74888 16598 95912 248540 171099 96274 297909 199470 148699 109471
22379 109471 125582 -96817 -222195 -164713 170775 462034 387226 49918 -163733 -251524
22369 -251524 -270950 -112078 49972 166288 335785 511546 264909 59596 131675 182224
22359A82224m4414r0980m6176M3207O2996Q2054J17065l5021j30500j26856p6565
22348f2966j44610R2022J88548Q0349J89096n2189k88006k1253j5354j22542J04816
22337e2089r212j2626l9931l8332K6292J86171M4732m4134r2893m8682j2451p8010
22325a71165r4689r4711J6263p4416J43800o593K00218J13194J43969m8767N5222
22314A82325N498k2528p0854q8281j27001N9281J67014O9364j02371j27675j5609
22303g0837Q861J2072o7526O1827o2309p1682K5258m6477k0775L6685J63089O2680
22291C0866P7694J18933P4180j3841P0279j40909j12580l5888K6777n3248j36035
22280i3772r8875j55571L0808l2202K74161K06077o4900J37607j71461R3018K08
$$ plain form
22359 182224 137810 46830 654 43861 106857 188911 305976 270955 140455 13599 -62966
22348 -62966 -207576 -115554 72994 153343 342439 290250 2244 -19009 -34363 -156905 -52089
22337 -52089 -61301 -73927 -113858 -152190 -125898 60273 105005 60871 -32022 -80704 -93155 -171165
22325 -171165 -265854 -360565 -344302 -418718 -274918 -281511 -81293 31901 175870 127103 182325
22314 182325 187823 165295 94441 6160 -120841 -61560 105454 174818 72447 -55228 -70837
22303 -70837 -61976 -49904 -117430 -55603 -117912 -189594 -164336 -210813 -231588 -194903 -31814 30866
22291 30866 108560 227493 301673 287832 358111 217202 104622 68734 95511 42263 -93772
22280 -93772 -192647 -348218 -317410 -349612 -75451 130626 65726 203333 31872 124890 125098
22269A25098k7091n5665j23840n938M9239j27975J95233K20086Q8853j6340j45610
22258A76050k50549j5278k8328j10633J25961J28869q1051N0198K0470k8982j35389
22247a48662J1763N050j61474j89640L5210K71473K14297P0199q6127M5780l9429
22236B8440o4560J11786K85631J2959j89325m3473j15326n0397R3490J68468p0866
22225A66827j2246j10445N8331j00928J54149O3445n1680Q0489j68203k46936
22215a67197j97740m173n2550J01831P8020l5757J35582J75278R0867Q361j7046
22204A15476q5912J08546M440Q1576j00429j82138r675k9410L1519M8479p6017
22193i3545J46326p1056j83453J38949J79693m7539l2936L149N3865o3521M1597
$$ plain form
22269 125098 98007 42342 -81498 -87436 -38197 -166172 29061 249147 338000 321660 176050
22258 176050 -74499 -89777 -118105 -228738 -102777 26092 -54959 -4761 15709 -13273 -148662
22247 -148662 -136899 -131849 -293323 -482963 -447753 -176280 38017 108216 22089 67869 28440
22236 28440 -36120 75666 361297 374256 184931 141458 26132 -24265 69225 237693 166827
22225 166827 154581 44136 102467 1539 155688 219133 167453 247942 79739 -167197
22215 -167197 -364937 -369110 -421660 -319829 -241809 -277566 -141984 33294 124161 132522 115476
22204 115476 29564 138110 142550 224126 123697 -58441 -68116 -97526 -66007 -17528 -93545
22193 -93545 52781 -18275 -201728 -62779 116914 69375 36439 39588 93453 29932 71529
22182G1529p7424q4142j41672j70088J40266q2165r7947J26760N3951j32677K02130
22171a91479J47137J7568M978k18007k8250K19608J04480O5117n2180r5585j36879
22160a63492j6007j08139J72060Q2870R6152M0449k70843n9957J19513Q4553j85766
22149b08607Q6990p511l6946K51366L3040j47282m4706K97493k89421j13753O4800
22138a14537J88189J76642J57154j95947k94591j65920l7424m8383L3805J49514
22128a51498Q5483n5257q1923J30775K44089N6718n1018j16194m490k09015l5403
22117a87733n080N052K36830J59932m5948j15271k12962k92998J38457Q3452M1390
22106a94879J63054n5460j56342j43856L9044J70372K04033K1434j78143j48100
$$ plain form
22182 71529 -5895 -90037 -231709 -401797 -261531 -343696 -441643 -314883 -260932 -393609 -191479
22171 -191479 -44342 -26774 -21796 -239803 -268053 -48445 56035 121152 68972 -26613 -163492
22160 -163492 -179499 -287638 -115578 -32708 63444 103893 -166950 -226907 -107394 -22841 -208607
22149 -208607 -121617 -129128 -166074 85292 118332 -28950 -73656 223837 -65584 -179337 -114537
22138 -114537 73652 250294 407448 211501 -83090 -249010 -286434 -334817 -301012 -151498
22128 -151498 -66015 -121272 -203195 -72420 171669 228387 177369 61175 56685 -152330 -187733
22117 -187733 -192813 -187761 49069 209001 163053 47782 -165180 -458178 -319721 -236269 -194879
22106 -194879 -31825 -87285 -243627 -387483 -348439 -178067 25966 47400 -130743 -278843
22096b78843O3596J78460k02885j25960J1422r2265o0885J61371K88292K44322
22086A86625J03512j44230q3320j76880p0426q9635J05865O3275q9639j3608k10600
22075d19061j4194L7329L12095J97803l69988m0021K66980p6762L9624Q3773n8696
22064d1118j06925p0541Q2886p4510j12685J5683O9286R0076j5755J00539L5485
22053b7579J4244R2895P2713N3034J63938J73115r0792k95190l05872p7180J85376
22042d1298L4492N2931n5639N6517K60441Q4205k12318k85904J36537J1706p7051
22031c5381L6740R2718j30899l1957o4202J02477J06801m2412r5344M0290k3634
22020d4803J88745l6564p2865k310j05002j38968k5019N9729k8685Q7633J20520
$$ plain form
22096 -278843 -215247 -36787 -239672 -365632 -354210 -446475 -507360 -345989 -57697 186625
22086 186625 290137 145907 62587 -114293 -184719 -274354 -168489 -105214 -194853 -208461 -419061
22075 -419061 -433255 -395926 -83831 113972 -256016 -296037 -29057 -105819 -66195 17578 -41118
22064 -41118 -148043 -218584 -135698 -210208 -322893 -307210 -237924 -147848 -163603 -63064 -27579
22053 -27579 -13335 79560 152273 205307 369245 542360 451568 156378 -149494 -226674 -41298
22042 -41298 -6806 46125 -9514 47003 307444 391649 179331 -106573 29964 41670 -35381
22031 -35381 1359 94077 -36822 -68779 -132981 -30504 76297 33885 -61459 -21169 -44803
22020 -44803 143942 107378 34513 32203 -72799 -211767 -236786 -177057 -205742 -118109 2411
22009B411K08229r027l0475J8232Q318N7628j39020N4774J78836q8810j99623
21998F1473M3298j74342j90521n2937k6297K14135J16183N4875J24573K440j18082
21987E4798J02664j2119k41319M4253K19095j03055j87094K20240j8268J0964
21977I0159J86719Q8939o4001p3023n778q2402j24152j71282J19814K11314q6536
21966H9771j79408R724J40172J13518m4064j77616o4779J55405N5795J02131p6370
21955A24279j92556j2426J36060J9738M4492K3068j16548j8311N0746L4378q6639
21944F281K48255O3718m6635K3065q4062J70248J15803j92057k55388k66594J9239
21933a98127J12139J87817N6284j39520q0368p3928k6821P3336J30449J86804
$$ plain form
22009 2411 210640 201613 171138 189370 197688 255316 116296 171070 349906 261096 61473
21998 61473 104771 -69571 -260092 -313029 -339326 -125191 -9008 45867 170440 172880 54798
21987 54798 157462 145343 -95976 -51723 167372 64317 -122777 97463 79195 90159
21977 90159 276878 365817 301816 228793 223015 140613 16461 -154821 -35007 176307 89771
21966 89771 -89637 -79913 60259 173777 129713 -47903 -112682 42723 98518 200649 124279
21955 124279 -68277 -80703 55357 75095 119587 142655 26107 7796 58542 92920 6281
21944 6281 254536 318254 271619 294684 210622 380870 496673 304616 49228 -217366 -198127
21933 -198127 -85988 101829 158113 18593 -61775 -135703 -162524 -89188 41261 228065
21923B28065M4012j58951j90798K01123K18600n0808o584j87003k16635j5316
21913a34295l8968K0322J25294J18865K3655m0162P5384J88889P763q8232k01626
21902E6889j38347l6255J03245K9529L9051k2333j18654j94433J74914K68662
21892A62268m0109l0836j25427l9796K20032j57750L2005K08013k49558Q335J07740
21881I4917Q5548J79850L6591k39383l25783j63607J56752J78283M9475n3055
21871d12m8607J35347j07904k64387j50345J62445K41157M7800j7488j6831J52657
21860A33432j12367M2736j25183n6878j02181l836L3104K26426P9426R766p5851
21849D8594k32171p2534P3736J3673R1787p701m60J2802j93861l7585M486L05641
$$ plain form
21923 228065 272077 113126 -77672 123451 342051 291243 284659 97656 -118979 -134295
21913 -134295 -173263 -152941 -27647 91218 114873 74711 150095 338984 346747 258515 56889
21902 56889 -81458 -117713 -14468 15061 54112 31779 -86875 -281308 -106394 162268
21892 162268 122159 91323 -34104 -73900 146132 -11618 20387 228400 -21158 -12823 94917
21881 94917 180465 360315 396906 157523 -168260 -331867 -175115 3168 52643 -412
21871 -412 -49019 86328 -21576 -285963 -436308 -273863 -32706 15094 -2394 -19225 133432
21860 133432 21065 63801 -61382 -118260 -220441 -224277 -191173 35253 114679 124445 48594
21849 48594 -183577 -256111 -182375 -168702 -76915 -84616 -85076 -72274 -266135 -303720 -299234 6407
21837F407K21148J67577p1786k15955j7693N0654r4158P0562J79184L7509o4094
21826B69355j11971J62991j20553j23713J10347k35496j8484P9676l9351J02271
21816G5072L663j27868O8730j02759l1004J22645R2112N0186Q5763R8163j49391
21805A85312j80778p8519p0459k6509J52475J63307o9593j0970j05009J29336
21795H8593J57540L1653k47078k43963m884j4401J57288K00851K6494k13623j78363
21784b39893p7775J18990K97449p3261j61830m1194m4480j5970j7220r1309K2055
21773c24438M7705O2537J02888P5861J36918m5270j20259n789J05885J51334J47136
21762C34508m8757l27245j12864J48636m8971p6271p0231q4748l5346J67001K6611
$$ plain form
21837 6407 227555 395132 323346 107391 89698 140352 46194 116756 295940 333449 269355
21826 269355 157384 320375 199822 76109 186456 -49040 -67524 12152 -27199 75072
21816 75072 78735 -49133 19597 -83162 -114166 8479 100591 150777 236540 334703 185312
21805 185312 4534 -73985 -144444 -170953 -18478 144829 75236 64266 -40743 88593
21795 88593 246133 277786 30708 -213255 -218139 -232540 -75252 125599 152093 -61530 -239893
21784 -239893 -317668 -198678 98771 25510 -136320 -177514 -221994 -237964 -255184 -346493 -324438
21773 -324438 -276733 -214196 -111308 -35447 101471 56201 -64058 -69847 36038 187372 334508
21762 334508 285751 -41494 -154358 -5722 -54693 -130964 -201195 -285943 -321289 -154288 -127677
21751a27677J46210J67687j50989j2138k9131k60657N395O1949K24980J40338
21741A65967o0011L5742l1282k71537k24691O6484J15359j93327M6180J83329
21731a67787p0222p8225J50942J47701l6853o8707M1378q6646J27118k3501l25389
21720c90191n3605M6770J56832K12851J1389J08808j84527j60606l9978P5925
21710b16332k9159J72096J11619N0307k2528Q7704j04761r0655N1410R5303j18936
21699a3932j12422m1348M3275n6939N5091o9877K8410J26068J97523q4683K902
21688G4068K77312J47022J14606j64361l17023j03606J76378J64437j55640l77435
21678a64242j79329L0312j3290K33140L33332o6905j72715R8704k7251l11293
$$ plain form
21751 -127677 18533 186220 35231 23093 -6038 -266695 -261300 -199351 25629 165967
21741 165967 105956 141698 110416 -161121 -385812 -319328 -203969 -397296 -351116 -167787
21731 -167787 -238009 -316234 -165292 -17591 -54444 -123151 -81773 -168419 -41301 -64802 -390191
21720 -390191 -443796 -397026 -240194 -27343 -15954 92854 -91673 -252279 -292257 -216332
21710 -216332 -245491 -73395 38224 88531 66003 153707 48946 -41709 9701 105004 -13932
21699 -13932 -126354 -167702 -124427 -181366 -126275 -196152 -167742 -41674 155849 71166 74068
21688 74068 351380 498402 613008 448647 131624 28018 204396 368833 213193 -164242
21678 -164242 -343571 -313259 -326549 -93409 239923 173018 303 99007 71756 -239537
21668b39537R6062K35887Q8802p4027j734M8214Q8779r6219m5768j9926j1032
21657F9501l6067J78282O5831l4257m516j74773k1867L52054P1479j86505j12201
21646A66961j19411j5706j6505j09563J29274J58430k4866j41231P0882r9158
21636h93J30395M8848j02396O9272J5129k43873m2557R3054m4782J58891J08902
21625A89990j35899j1749Q9850l6104k0974N009P3526j15821k6318J34413k77149
21614a31226k47769J18227l9644O5027J66148n1780P4117J38708j25253k61408
21604b94853R8544J78528j05818j11583j53755k129K45295Q0331J55926J95692
21594B86178M7878o660k34542M2106m5339k05232m5921q4810K3815N1403K48936
$$ plain form
21668 -239537 -143475 92412 181214 107187 105453 153667 242446 146227 100459 80533 69501
21657 69501 33434 211716 277547 243290 238774 64001 42134 394188 465667 279162 166961
21646 166961 47550 31844 15339 -94224 35050 193480 168614 27383 98265 -893
21636 -893 129502 178350 75954 145226 160355 -83518 -126075 -33021 -77803 81088 189990
21625 189990 54091 42342 132192 96088 75114 80123 153649 37828 11510 145923 -131226
21614 -131226 -378995 -260768 -300412 -235385 -69237 -121017 -46900 91808 -33445 -294853
21604 -294853 -196309 -17781 -123599 -235182 -388937 -391066 -145771 -65440 90486 286178
21594 286178 334056 327396 92854 134960 89621 -115611 -161532 -246342 -222527 -171124 77812
21583G7812J04074K5206R4807r839r9733j23203P127L8618l0650k2752J26205
21572A87672N2935l4671k1703j15846K3321n223q5641k71051K9782R9326K42373
21561A01274J27809n3477n9988j01302o2778J5682M0314j3778J4505r6040j64666
21550b52445J2588n2326J22252K42154J72611L6263k60699j72805l22781Q6919
21540c88269K01884J20477j18020J13127J18601l2084o9251N1511l7748J20715
21530H0943l9173M2605O1743p1454o5638J7567l0462J22311J15155j0617j97209
21519B5771j42963m3086k19156k7341K67312K30921N8085J25658K9564j23779
21509A80986k7105k1147j26134N5614N9163r3184j65147N1598J17167j06687q3362
$$ plain form
21583 77812 181886 207092 301899 292060 192327 69124 76251 114869 84219 61467 187672
21572 187672 240607 205936 184233 68387 91708 86485 844 -270207 -240425 -141099 101274
21561 101274 229083 175606 115618 14316 -48462 -32780 7534 -6244 8261 -87779 -252445
21550 -252445 -239857 -292183 -169931 72223 244834 281097 20398 -152407 -475188 -388269
21540 -388269 -186385 -65908 -183928 -70801 47800 15716 -53535 -2024 -39772 80943
21530 80943 41770 84375 146118 74664 9026 26593 -3869 118442 233597 222980 25771
21519 25771 -117192 -160278 -379434 -406775 -139463 91458 149543 275201 304765 180986
21509 180986 153881 132734 6600 62214 121377 28193 -136954 -85356 31811 -74876 -158238
21498a58238K57315J31697n4689j38138q8778K2683L6655J61160R1224L0905Q8729
21487C80525j6035j56300k43395M3092j28040q0528L1231K50372J44720r2401
21477A33241M7446j54752l6272q1938M8946J7608n6626R8282P5106P4100k3002
21466A42139O676R711q595j49134j2070k7062Q194J00479K5344o9789R4592J15504
21454B35989R0546Q3194j21730j00920N5144j35744j82633J350Q8268J15822R6935
21443B26221n008n8947k11574L6648J79655J07123l8197l05841m6550K00176j8509
21432F5197m5136J6085Q0931k1971J07055k60382j46453j11191J36335J01266
21422g8264k6788O2303M2598J4517Q2124J41910R2898k71514j74352P908M3588
$$ plain form
21498 -158238 99077 230774 176085 37947 -50831 -28148 8507 169667 260891 291796 380525
21487 380525 364490 208190 -35205 7887 -120153 -200681 -169450 80922 225642 133241
21477 133241 180687 25935 -10337 -92275 -43329 -25721 -82347 15935 91041 165141 142139
21466 142139 148815 158526 149931 797 -11273 -38335 -30141 70338 95682 25893 120485 235989
21454 235989 326535 409729 287999 187079 242223 106479 -76154 -74804 13464 129286 226221
21443 226221 221213 162266 -49308 -12660 166995 274118 235921 -69920 -116470 83706 65197
21432 65197 20061 36146 117077 95106 202161 -58221 -204674 -315865 -179530 -78264
21422 -78264 -105052 -42749 -151 14366 96490 238400 331298 59784 -114568 -106660 -63072
21411f3072Q8368N0438j42837j59116J15444L01099J47169q9155j97790k27078
21401a76530K0065q2720P855K29595O7001n8677K25541J32205j17798P96j7647
21390B29686Q7070O4012p1656p8140J5668j49077N8581O283o8197r7105j95137
21379a98012J0633M6343J33781J89653k2836n6043k12898q134K78369M3223K7650
21368B31729Q776J31914M0937k66579r7698j45322n5973O2392R0674O1412k25235
21357a62973r086O4732J38886k7843N9130J2079R8059O501K32089K5370r5647
21346C41297j10560N364j18815k85318n0082J27794K02354K8280o3606k45049
21336a68341j4305O4282J75114R8927n5870Q2106k6595L7198l8780j46335J14399
$$ plain form
21411 -63072 25296 75734 -67103 -226219 -110775 190324 337493 248338 50548 -176530
21401 -176530 -156465 -239185 -231330 -1735 65266 6589 232130 364335 246537 247333 229686
21390 229686 316756 380768 309112 230972 246640 97563 156144 162427 94230 -2875 -198012
21379 -198012 -187379 -141036 -7255 182398 159562 103519 -109379 -117513 160856 204079 231729
21368 231729 240505 372419 413356 146777 49079 -96243 -152216 -89824 850 62262 -162973
21357 -162973 -172059 -107327 31559 3716 62846 74925 172984 179485 411574 436944 341297
21346 341297 230737 236101 117286 -168032 -218114 -90320 112034 140314 76708 -168341
21336 -168341 -182646 -118364 56750 155677 99807 181913 155318 192516 153736 7401 121800
21325A21800m2924R5127j7885j9118l5617M7325J23905J91541m9570l66130n8378
21314i924J27910n3504m9707l7627o1820J15658k0076j11784m4214p8172L9578
21303a83682r8591J76876q2225L9982R6353k7418R9294K33248r7190n671M9780
21292B00756K0635L8335j87762j15561P0037J24413k9594R5993j7644q3820k979
21281A12809j31878O3823K70790K24658j30983j72858j31983K3778J01975j3768
21271B16363j5961j15768j27642Q4013K70829M8090k17033o7294L1771K1043q4771
21260D3640J29967J31646k18814o9961k125j10553P6052J29488Q821j7548p7514
21249B3099l8571K7519n9746m4697K06611J87051r5243k09335m3529L2959k7794
$$ plain form
21325 121800 78876 174003 156118 137000 101383 148708 272613 464154 414584 48454 -9924
21314 -9924 117986 64482 14775 -22852 -84672 30986 10910 -100874 -145088 -223260 -183682
21303 -183682 -282273 -105397 -187622 -147640 -51287 -78705 20589 253837 156647 150976 200756
21292 200756 221391 259726 71964 -43597 26440 150853 121259 217252 199608 115788 112809
21281 112809 -19069 44754 315544 540202 409219 236361 104378 128156 230131 216363
21271 216363 200402 84634 -43008 41005 311834 359924 142891 75597 107368 128411 43640
21260 43640 173607 305253 86439 16478 14353 -96200 -20148 109340 118161 100613 23099
21249 23099 -15472 12047 -47699 -92396 114215 301266 206023 -3312 -46841 -13882 -41676
21238d1676J75440K83505r3383O8194K91309K89686L50525P9718n6399k16033
21228A130886l06743l15721k43157P5034L1002K9079L2458m2805O7455k7316L64894
21217G95066M27531K65985Q2100o0462l28853l72075j39759j13579p5680p5846
21207D04428m341J11673K16555J59985J17452P9042L15039K59915k3886l99869
21197A235993n48050l71784O9642j68004j5725j0590J07084K05065K89512J31364
21187I24507j1809J62257M84437K88764j47541k27372k81690k29067l20709m045
21177F37732j94390J5898j10030m3335n6379O3772Q6689k24440j78809O1130J79546
21166B37384p0012K3750O3637r920m7451j85787j94498L66190k6803j09571K88522
$$ plain form
21238 -41676 133764 417269 323886 392080 683389 973075 1323600 1403318 1346919 1130886
21228 1130886 824143 508422 265265 340299 371301 400380 432838 390033 457488 430172 795066
21217 795066 1222597 1488582 1570682 1510220 1181367 809292 669533 555954 480274 404428
21207 404428 400087 511760 728315 888300 1005752 1084794 1399833 1659748 1635862 1235993
21197 1235993 687943 316159 385801 217797 202072 191482 298566 503631 793143 924507
21187 924507 912698 1074955 1559392 1848156 1700615 1473243 1191553 962486 641777 637732
21177 637732 443342 459240 349210 305875 249496 313268 399957 175517 -3292 57838 237384
21166 237384 167372 191122 254759 244839 197388 11601 -182897 183293 156490 46919 335441
21155C35441l0854j46370K1394J51358P6655j3679j97311j42163j2951K60734
21145C02254J01812j92519m0873L8062j67091k38916O3589K98829K41063J84179
21135E90389r3373m5339l5092l08428r8252k8094J03478J02071R0645q9305j28828
21124E9872M9395K41131P2964j87326k96892j36943J20709J54696J80861P946
21114B66413k9306J65418K489q0263J22168l983p6587m3824j4885j75339j50581
21103a8280j63636P5584j7620m9541J06228J20639p8893J82860Q2941J14061J98681
21092E53024n4397p4661j39599j77078L9067L2623Q5198j63085m2432p671J24415
21081A75404J11489K15405J47074N7881J93514j48673j56873k02814j14183j06320
$$ plain form
21155 335441 304587 158217 179611 330969 407624 393945 196634 54471 41520 302254
21145 302254 404066 211547 170674 208736 41645 -197271 -133682 165147 406210 590389
21135 590389 497016 451677 416585 108157 9905 -18189 85289 187360 278005 188700 59872
21124 59872 109267 350398 423362 236036 -60856 -197799 -77090 77606 258467 266413
21114 266413 237107 402525 405014 324751 446919 442936 366349 322525 307640 132301 -18280
21103 -18280 -181916 -106332 -123952 -173493 -67265 53374 -25519 157341 240282 354343 553024
21092 553024 498627 423966 284367 107289 146356 178979 264177 101092 58660 50989 175404
21081 175404 286893 502298 649372 707253 900767 752094 595221 392407 278224 171904
21071A71904j78811j41044j56890K04174J94920N369j31419R556j1926k05120
21061b39287K021K51251J10231N6440P6827l8959j86357k28611k1182J79435K12582
21050A74391j6139r1147J14008j5031j26414J308O3644K52500N371j71893Q8048
21039B78646J66510n8043k8888P3968J6323j93279j24434n0631q6429J8501J73194
21028A85438j88818J17826J11020j29812j11641m6933J32027J72842J26543J5662
21018C84154r8857j18198r5124j51023J85828K55014j17744M9652J61387M7100
21008E02189J16881m9559p9717j94712l7969k2707o0625j1572o6674J27807j6977
20997B06365n9223Q4888k1073j05551Q382j2419Q6228N0575l5521l4802R197M5941
$$ plain form
21071 171904 -6907 -147951 -304841 -100667 94253 99622 -31797 -22241 -34167 -239287
21061 -239287 -237266 13985 124216 180656 257483 218524 32167 -196444 -217626 -38191 174391
21050 174391 158252 67105 181113 166082 39668 40976 104620 357120 362491 190598 278646
21039 278646 445156 387113 358225 432193 448516 255237 130803 80172 -6257 12244 185438
21028 185438 -3380 114446 225466 95654 -15987 -62920 69107 241949 368492 384154
21018 384154 285297 167099 71975 -79048 106780 361794 244050 293702 455089 502189
21008 502189 619070 569511 489794 295082 257113 234406 173781 162209 95535 223342 206365
20997 206365 147142 232030 210957 105406 113788 101369 187597 238172 202651 167849 177046 222987
20985B22987j0724p2993j97530j52387Q6194l7374O8018K11962K64205J72049
20975E54407q3730k11777o7207J44262l084j13738J8084J95962j96547L8901J3501
20964B89034k07540N5532J09080k80346Q966P7502m116J01689M4626L2352J6545
20953B43324K1445r4804o817j069k13500n8271J23876l1891k0333N8503P3089
20942I3552j78753j96624K6823K48278K04196j4191J21265J58666l2533r6100
20932C34579J54j38445Q6302j46146j57194K2910J9455M017p9079q2878J0239
20921a26086R9660N4719J39900L6661j49604n320J76643n223j64151L6816J7307
20910A11322K35578K9575m9137L5932J05217O5516j02573J0381N257o552q3591
$$ plain form
20985 222987 212263 139270 -58260 -210647 -124453 -161827 -93809 118153 382358 554407
20975 554407 470677 258900 191693 335955 332871 219133 237217 433179 236632 275533 289034
20964 289034 81494 137026 246106 -34240 -25274 52228 48112 149801 194427 226779 243324
20953 243324 264769 169965 163148 162079 -51421 -109692 14184 -17707 -38040 20463 93552
20942 93552 -85201 -281825 -255002 -6724 197472 183281 304546 463212 430679 334579
20932 334579 334733 196288 282590 136444 -20750 2160 21615 25632 -53447 -136325 -126086
20921 -126086 -26426 28293 168193 204854 55250 49930 226573 221350 57199 94015 111322
20910 111322 346900 376475 327338 363270 468487 534003 431430 441811 447068 440516 356925
20899C56925L3888N3435m3583q2489p6638J6161J89584n5678q5707R7902J2068
20888D15868p0303J11482J88651j39197j20413K7682j69565l20481M1304N6386
20878B1414L8085m2577K9913Q6783K25597J28701J85410K9095n1185n5254J93326
20867G89308O2203j59992k96200j29184l3166l928J08740J35954k10166Q578J35584
20856D07731m2955O4661O7178k30753j4657O9913R7273q4058k26533k05149L21616
20845B24267K95228P4704k046m0290M6974j9944j37470Q8369j26991j46729l9119
20834B16953o5810O6765l9228L4071m0267o8828o9054K27926N9086P5310J24788
20823E21712K0388m4029J2098J24451m3355k17454L0368J80804J22193j43738
$$ plain form
20899 356925 390813 444248 400665 318176 241538 257699 447283 391605 305898 403800 415868
20888 415868 345565 457047 645698 506501 386088 413770 244205 -76276 -34972 21414
20878 21414 59499 16922 46835 133618 359215 487916 673326 702421 651236 595982 789308
20867 789308 851511 691519 395319 266135 232969 229041 337781 473735 263569 272147 407731
20856 407731 364776 429437 496615 265862 251205 321118 418391 334333 107800 -97349 224267
20845 224267 519495 594199 592153 551863 598837 578893 441423 529792 402801 256072 216953
20834 216953 151143 217908 178680 212751 172484 103656 34602 262528 321614 396924 521712
20823 521712 542100 498071 510169 634620 591265 373811 404179 584983 707176 563438
20813E63438J44165R6426l3338N1245j24890j83895m5045r7389J91108q3881m3746
20802D34198P3126J66503q9679q8161n932j55875P5721P2185j38044j62851J32910
20791C14101K25225K21898J6056j22841o5074o6167j791J70886m3439n3688J2454
20780F07620J3134J55639J27726L6773L8270k84834j6020M5982L9592K85463K07557
20769A256902k82162j39963R5900M9922j10117P7081N9684j21873Q650j42966
20759G51058r7440P2102k1431Q1119j03289N094L27032N79600N06012K73335j82696
20748B190496k89693k25669r7979K3610k70218k18614O1182K9735O14842N60226
20738B377918l2633o10371l28544r1040m2654J38812j3738j11682N5980j18819
$$ plain form
20813 563438 707603 804029 770691 821936 697046 513151 468106 370717 561825 477944 434198
20802 434198 507324 673827 584148 495987 490055 334180 409901 482086 344042 181191 314101
20791 314101 539326 761224 777280 654439 589365 523198 521407 692293 648854 595166 607620
20780 607620 620754 776393 904119 940892 979162 694328 678308 724290 763882 1049345 1256902
20769 1256902 974740 834777 930677 980599 870482 947563 1007247 885374 894024 751058
20759 751058 653618 725720 704289 785408 682119 687213 1014245 1593845 2099857 2373192 2190496
20748 2190496 1900803 1675134 1577155 1600765 1330547 1111933 1173115 1202850 1817692 2377918
20738 2377918 2345285 1734914 1406370 1315330 1272676 1411488 1397750 1286068 1342048 1223229
20728A223229k66600Q9410L05024j296j07092O5388j54227j94988j5446K34107
20718A177509K43527q5878N460P6509K00902O2868o6217K8983n496K64403n8515
20707A844055J91458M4774N983K46314J99394n5198m1749j42649J30526J94914
20697B617822J874N39948N47262L59916O5052l73688j54801O4570p1327K93982
20687C890610M53126P50320J042170J104069K30418m48853l54298N3040J74917
20678F895519M95401N39586O55648O12650M63544j0258j34303k62533J6743M65570
20668I737567P22500O87569J092400J918236K402017K601603L318744M023589
20660B6504225N368025P079998R870712J4174029K2101114L5770925N9206722
$$ plain form
20728 1223229 956629 1046039 1351063 1349767 1242675 1308063 1153836 958848 943402 1177509
20718 1177509 1421036 1335158 1340618 1417127 1618029 1680897 1614680 1643663 1638167 1902570 1844055
20707 1844055 2035513 2080287 2086270 2332584 2531978 2476780 2435031 2292382 2422908 2617822
20697 2617822 2619696 3159644 3706906 4066822 4131874 3758186 3603385 3667955 3596628 3890610
20687 3890610 4343736 5094056 6136226 7240295 7470713 7021860 6667562 6720602 6895519
20678 6895519 7390920 7930506 8586154 9198804 9662348 9652090 9517787 9255254 9271997 9737567
20668 9737567 10460067 11147636 12240036 14158272 16560289 19161892 22480636 26504225
20660 26504225 31872250 38952248 48822960 62996989 85098103 120869028 180075750
20653A80075750R4349579J24391759R0454113j6144312j02024636j15372695q3852886
20646A71876672n1614510l1420107j9683380j2786605q844036o610160m720871
20639C6197003k811973o12765J254265J073402q63741j911460j293945J6922J576541
20630C2624249L465022N610386P795126J1144066J6388399K4800458L9962515
20623A41790221O6729248J04979919J26713253O8944512m4763072j15949582j13743032
20616B34701467p8373295m8275607k9970553j8905218j2290826q517898o165574
20609C2202496m406664k431712n72697Q30737m58284k597018l919412l692147
20601A4955299k557225j678095j119239l28867L30434K49962q7813m16877q86403
$$ plain form
20653 180075750 274425329 398817088 489271201 473126889 371102253 255729558 171876672
20646 171876672 120262162 88842055 69158675 56372070 47528034 40917874 36197003
20639 36197003 33385030 32772265 34026530 35099932 34236191 32324731 31030786 31047708 32624249
20630 32624249 36089271 41699657 49494783 60638849 77027248 101827706 141790221
20623 141790221 208519469 313499388 440212641 509157153 464394081 348444499 234701467
20616 234701467 156328172 108052565 78082012 59176794 46885968 38368070 32202496
20609 32202496 27795832 25364120 24791423 25622160 25163876 22566858 18647446 14955299
20601 14955299 12398074 10719979 9600740 9271873 9602307 9852269 9764456 9347579 8461176
20592H461176q76177m27953N3603J43034O5716m45118q40493q51397o08082o31013
20582D043296m73302m14581m56273k34759p3140j01017j64769j71297j81914j19484
20572A652760N547k5840J82919L1369p9163o8799k87465k23446m589j56200j65339
20561H61754m0682J32477l7561j44942j34018K44738J11574o2918Q4853K4680
20551A039955j91927k35267j6514J81623q0261n5974M4573R3027r4875k04702
20541D79658o4448o1838P9541j48116K9246J6639J85663J49027K12742o5855k57404
20530E54855k35761O2286J17428k08198r7484J58071J11517p2731j46924J28604
20520C71663K64496j26783k40191k08262O0277J57435k9588k9747K13324Q2642
$$ plain form
20592 8461176 7584999 7157046 7210649 7353683 7419399 6974281 6133788 5282391 4674309 4043296
20582 4043296 3569994 3155413 2699140 2464381 2391241 2290224 2125455 1954158 1772244 1652760
20572 1652760 1658307 1632467 1815386 1846755 1767592 1698793 1411328 1187882 1183293 1027093 861754
20561 861754 821072 953549 915988 771046 637028 881766 993340 930422 1015275 1039955
20551 1039955 848028 612761 596247 777870 697609 641635 686208 779235 684360 479658
20541 479658 415210 353372 432913 284797 314043 330682 516345 665372 878114 812259 554855
20530 554855 319094 381380 498808 290610 193126 351197 462714 389983 243059 371663
20520 371663 636159 509376 269185 60923 121200 278635 249047 219300 432624 515266
20510E15266j06842l5207J2432Q0175j59094j29883n423K3112j1046j59506p284
20499A6700K1566J26072J71046K0119P871J04025N4661L2235j08424k11224J22782
20488C57429J05134l7683n099k05923l8956N4380J30555k02080J09101k584K35962
20477E00236K08873M0034j79784l17605n357O1902l4958p3799N6286J82534K2230
20466D60592L5674r9009q9574k6142j89388k2021J59512M0476J4714J23453r3541
20455C14746J22706J8768m1289J27345J89443l069j36866k01779j8553M2856J34395
20444E48703K57250J61676Q7327m1155j60182J04208k16732j16225j12006m6013
20434D66851l3289n7120q6380l7543J55081K94514j1199J4500K10476M29602N22208
$$ plain form
20510 515266 408424 373217 385649 465824 306730 176847 171424 194536 183490 23984 16700
20499 16700 38266 164338 335384 355503 363374 467399 522060 554295 445871 234647 357429
20488 357429 462563 424880 419781 213858 174902 229282 359837 157757 266858 264274 500236
20477 500236 709109 749143 569359 251754 246397 308299 273341 199542 255828 438362 460592
20466 460592 496266 397257 307683 281541 92153 70132 229644 270120 284834 408287 314746
20455 314746 437452 456220 414931 542276 731719 728650 591784 390005 371452 414308 548703
20444 548703 805953 967629 1054956 1013801 853619 957827 741095 624870 512864 466851
20434 466851 433562 376442 290062 252519 407600 702114 690915 705415 915891 1345493 1867701
20423A867701K24337N44705L0285j80328j75326k63586l32474k33598k73822j07670
20413A100224M4510K24956j88316j86264j66087p4089q5666R5944k28840j70700
20403C65672m4949p8155J0792q1027Q3329J70025K8185K07319R5763k1696j4642
20392G20616m3488o5670P1742j3078j18699l0722p6148j90378J00614M3726j34644
20381B63871j9566q7240O8177K51020J32127j96290k63018J29995K40559P3973
20371E93608J16376j48176j42438j16071P8705M0649j00664j47394l1007K26700
20361C70288K7050K04692K19207R4169M836j7264j68757k16066k11766J01339
20351D07728J05998J47190K1646N5148M9442P0915o4428j25672q6411j88808j0316
$$ plain form
20423 1867701 2092038 2636743 2667028 2486700 2311374 2047788 1715314 1481716 1207894 1100224
20413 1100224 1144734 1369690 1181374 995110 829023 754934 669268 765212 536372 365672
20403 365672 320723 242568 253360 172333 255662 425687 453872 661191 756954 735258 720616
20392 720616 677128 611458 683200 670122 551423 520701 444553 254175 354789 398515 263871
20381 263871 244305 157065 225242 476262 608389 412099 149081 279076 519635 593608
20371 593608 709984 561808 419370 303299 382004 422653 321989 174595 143588 370288
20361 370288 397338 602030 821237 915406 920242 902978 734221 518155 306389 407728
20351 407728 513726 660916 682562 737710 787152 858067 793639 667967 581556 392748 382432
20340C82432o9765P8907J49530o7197N391M636J24058r5849k36477p6547J31553
20329C30672P7059J02612J52005q3688j54931N4508k0145m8938K2628J17713j50414
20318C99081j05240r9774j5144J52716K20868R2328n4590p2606r6551J35578K19059
20307G75725j00333p5419J71356J84404J20744J28548m3638l65963O3550K30076
20297A089050O741n3216N4948K01566J0045l39698j3166p2371j5167r7756k12879
20286E58097J27427L47214q2029j67950k410j48899L8512J39404m5754K4234L34436
20275A122282J04256m4021l925P9988K6084n7759O8020J78490K01499k08427k97785
20264A168702K0455J52438K79426N2510r8343m1511L4481K73344N9728K32245
$$ plain form
20340 382432 312667 391574 541104 473907 479298 483934 607992 512143 275666 199119 330672
20329 330672 407731 510343 662348 578660 423729 478237 458092 409154 431782 549495 399081
20318 399081 293841 194067 178923 331639 552507 644835 590245 517639 421088 556666 775725
20307 775725 675392 599973 771329 955733 1076477 1205025 1161387 795424 858974 1089050
20297 1089050 1095791 1042575 1097523 1299089 1309134 969436 956270 883899 868732 770976 558097
20286 558097 685524 1032738 950709 782759 780349 631450 669962 809366 763612 787846 1122282
20275 1122282 1226538 1182517 1178592 1258580 1284664 1226905 1294925 1473415 1674914 1466487 1168702
20264 1168702 1189157 1341595 1621021 1673531 1575188 1533677 1568158 1841502 1901230 2133475
20254B133475L06732M77120P41921P56595L19874M9707J43211J82888J13761K8329
20244E253613j0536k0810N24433P42561Q39521J046713J272998K000258L042379
20235A4691130M232585O183049R672330J2315136O857884k245687n765497k335986
20227D3604944L703133J1399524K2841401M2749188P4240878Q9345044L6728454
20220C24612566k9748520m1453317j8003224k3240847m5308395m8590186l2404538
20213H5863539j4725724j509666J0474861J9284567J2982457q236229k3713943
20206H0419862k3950780j6808226j0675565o623247m196202k479478j345896o51653
20198A3688815l20980k77815j79679j70877o1327L25736P49027Q3655k60044j45336
$$ plain form
20254 2133475 2440207 2917327 3659248 4415843 4735717 4785424 4928635 5111523 5225284 5253613
20244 5253613 5243077 5222267 5746700 6489261 7328782 8375495 9648493 11648751 14691130
20235 14691130 18923715 25106764 34779094 47094230 53952114 51706427 45940930 43604944
20227 43604944 47308077 58707601 81549002 124298190 198539068 287884112 324612566
20220 324612566 294864046 253410729 235407505 212166658 166858263 118268077 85863539
20213 85863539 71137815 69628149 80103010 99387577 112370034 104133805 80419862
20206 80419862 56469082 39660856 28985291 22362044 18165842 15686364 14340468 13688815
20198 13688815 13367835 13090020 12910341 12739464 12678137 13003873 13752900 13836555 13576511 13431175
20188A3431175K22190O84836J280333K215423L676662O172271R942880J6298722
20180E3924492K5596321K7837274J0826682j1759427k0107952j3776521k543278
20173F9997591R861527K5887222M7822356N9434833L9404992K4389994M3392095
20166C20190610M3946962k4547709q5365442q9011851n7951590l1688494j6847998
20159E8724488o984458J291321O984406L631119o778807j3165466j1913698q155560
20151B3633345n406810l674237k557909j896588j457967j233011o00514l78059
20143F428250l75322j68921k4916j7505l93535k61004J41482l26204n40110m71325
20133C990890k66300J82348L80424R0348j28593K32972N11087L18240j70336q00515
$$ plain form
20188 13431175 13653365 14338201 15618534 17833957 21510619 27682890 37625770 53924492
20180 53924492 79520813 107358087 118184769 106425342 86317390 72540869 69997591
20173 69997591 79859118 105746340 153568696 213003529 252408521 276798515 320190610
20166 320190610 364137572 339589863 254224421 165212570 107260980 75572486 58724488
20159 58724488 51740030 53031351 60015757 63646876 56868069 43702603 31788905 23633345
20151 23633345 18226535 14552298 11994389 10097801 8639834 7406823 6806309 6428250
20143 6428250 6052928 5884007 5859091 5841586 5448051 5187047 5328529 5002325 4462215 3990890
20133 3990890 3724590 3906938 4287362 4377710 4249117 4482089 4993176 5311416 5141080 4340565
20123D340565r56298m41024k99204K23663P18581J021387R34577N44518M06405
20114F493170N57250O61703j09241j500360j791351j306227q63030n58555j75692
20105A407667L5348m7058P0216J39369J36388l5391j17875k73416j08307k42404
20095I64537j61016L62634p7968r0388N0964l1412J47726j69995j90311J60067
20085I64838j43515j3470K04516L50956M12760N21221L76576j01311R428L18796
20075B900795K46063j73178o15687p24274n51314l55872j90731J21392M68733
20066A125927K10880J07175M9020P7084r3845k22438k67325J059l06324j65986
20056E15227Q1202j10613j13065J98301J74900K27086M26456L22216P1404k37397
$$ plain form
20123 4340565 3384267 2943243 2644039 2867702 3586283 4607670 5542247 6086765 6493170
20114 6493170 7050420 7712123 7602882 6102522 4311171 3004944 2141914 1583359 1407667
20105 1407667 1443015 1395957 1466173 1605542 1741930 1706539 1588664 1315248 1206941 964537
20095 964537 803521 1166155 1088187 997799 1048763 1017351 1165077 995082 804771 964838
20085 964838 821323 807853 1012369 1363325 1776085 2297306 2673882 2572571 2581999 2900795
20075 2900795 3146858 2973680 2357993 1633719 1082405 726533 535802 657194 1125927
20066 1125927 1336807 1443982 1493002 1570086 1476241 1253803 986478 987537 681213 515227
20056 515227 596429 485816 372751 571052 745952 973038 1399494 1721710 1793114 1555717
20046A555717l14113k74641j59403l7441r911k85013l7559J59394J21693O1505
20036G80228j50258J64796L53868K25748K03504j96453k97860m20696k33729l011
20026D26137k19695p2253j55841k01928N6987K15203k9627n2463j15566j35730
20016b84776J18028J01029j12121J42181K90723j40809q2002K13837k2901p2330
20006A50859j17747J70167q5580j41165J23080J75648j00129O334J03520j45384
19996A39603j60499k69437j22277J84348J84513K7307J23989l5578r2205j10232
19986a30468K85876K34803j06048l27502k05699J18335n4541j15070J1092K4591
19976b64631J2687J05194O2267j50393J97638j83345o5797J70451J53687L7042
$$ plain form
20046 1555717 1241604 966963 807560 770119 760208 475195 437636 597030 718723 780228
20036 780228 629970 794766 1148634 1374382 1577886 1381433 1083573 662877 429148 426137
20026 426137 206442 134189 -21652 -223580 -166593 48610 18983 -33480 -149046 -284776
20016 -284776 -166748 -65719 -177840 -35659 255064 114255 32253 246090 223189 150859
20006 150859 33112 203279 117699 -23466 99614 275262 175133 181467 284987 139603
19996 139603 -20896 -290333 -412610 -228262 -43749 -16442 107547 71969 -20236 -130468
19986 -130468 155408 390211 284163 -43339 -249038 -130703 -185244 -300314 -289222 -264631
19976 -264631 -251944 -146750 -84483 -234876 -37238 -220583 -286380 -115929 37758 74800
19966G4800m9825K6077j31939o86M1341j4769J76373o1569o5773J36649k10533
19955g9854N7927J304J14614j26196K4217J57641J023j77527l138j30J145l1137
19943f0111k05047m9965p7227Q2560L22226k07922k95340K4598L08609R6421Q4967
19932B3769n7799Q8626L22396n0587k06568r4928j14541K2156m4863J1900M914
19921i5525M134j07851K16937R7572r3891j52641r9939j5692P1891K0810o1064
19910b15259j21154N757P3421j0929l2874P4814J25034J8918j29722J2119k5754
19899b25629M2339o5177J0580l8533L1491O6205K2213R658m0109Q164k31381J48659
19887b61520K14465J69297R0949j04375l662Q6210O2117l9163j0336p8551R862
$$ plain form
19966 74800 24975 51052 -80887 -81573 -40232 -55001 121372 59803 -5970 130679 -79854
19955 -79854 -21927 -20623 93991 -32205 -7988 149653 150676 -26851 -29989 -30119 -28974 -60111
19943 -60111 -265158 -315123 -392350 -309790 12436 -195486 -490826 -466228 -157619 -61198 23769
19932 23769 -34030 54596 376992 326405 119837 24909 -89632 -67476 -112339 -100439 -95525
19921 -95525 -91391 -199242 17695 115267 21376 -131265 -231204 -246896 -175005 -154195 -215259
19910 -215259 -336413 -330656 -257235 -268164 -301038 -226224 -101190 -82272 -211994 -199875 -225629
19899 -225629 -183290 -248467 -237887 -276420 -244929 -178724 -156511 -146853 -186962 -178798 -410179 -261520
19887 -261520 -47055 122242 213191 108816 105154 191364 253481 214318 203982 125431 135293
19876A35293p9219j14922r872k9568n2075j0857N8178o6823j47426J00055K69150
19865E1914j35453j5509K61591J14970j41244k34647L3393J49693j18725k26181
19855b60198J356m4056r1717k85954J58960M42276j3771j29772J4998R9893L9254
19844f8731o8936N953J91279q1383K3712k1411l4789r3158J80773J5448P7336
19833A26093K1629k41955J21462J7625P4110J02311k88036m3535R511J31456J35017
19822A65688J2691j54876J06537J45634p3067k43074j74333j4501J03503J34324
19812H526k19602J06370o1245k11630O0692K73075m2995M752J31549O2947m9401
19801F3038k2231j98252l9212L7229N1760o2018J92080J7082K05356J96873Q855
$$ plain form
19876 135293 56074 -58848 -68720 -98288 -150363 -161220 -103042 -169865 -317291 -217236 51914
19865 51914 -83539 -99048 162543 277513 136269 -98378 -64985 84708 -34017 -260198
19855 -260198 -258842 -302898 -394615 -680569 -521609 -79333 -93104 -222876 -207878 -107985 -68731
19844 -68731 -137667 -131714 59565 -21818 1894 -19517 -54306 -147464 33309 48757 126093
19833 126093 147722 -94233 27229 44854 118964 221275 -66761 -110296 -100785 30671 165688
19822 165688 178379 23503 130040 275674 202607 -40467 -214800 -229301 -125798 8526
19812 8526 -211076 -104706 -165951 -377581 -316889 -43814 -86809 -82057 49492 112439 63038
19801 63038 40807 -157445 -196657 -159428 -107668 -169686 22394 39476 244832 441705 450560
19790D50560k73448k15939r1863j59470J00409K41671J08992L1230l738j03173
19780H5231n1846K51221J11788M8099j47203j03216k42039k0405J32642l469O4536
19769A25339k8659r8637p1213j09597O809J96412Q235R0095r835Q4593L7111k38764
19757h111l3549M6319p2722N4028k1700q9413p4712J73381j41290j53220K66580
19746e4409K19851J27531m2676Q9844J0157p9708j48031K27935m734k27722j95270
19735g7232K6868o9911n0412n5414q4027J70050j12764n577m054m1381K13087
19724i0767K0735O585P4020L4879m3405R9747J18176j978p5011J0940O1693J04239
19712C19853J1410o2982J35157j53466l51924j3296k6597r9484O0605K85045J61252
$$ plain form
19790 450560 177112 -38827 -130690 -290160 -189751 51920 160912 192142 188404 85231
19780 85231 33385 284606 396394 444493 297290 194074 -47965 -68370 64272 60803 125339
19769 125339 96680 -1957 -73170 -182767 -175958 20454 28689 118784 108949 193542 230653 -8111
19757 -8111 -41660 4659 -68063 -14035 -35735 -125148 -199860 -26479 -167769 -320989 -54409
19746 -54409 165442 292973 250297 340141 350298 270590 122559 350494 345760 118038 -77232
19735 -77232 -50364 -120275 -170687 -226101 -310128 -140078 -252842 -258419 -262473 -303854 -90767
19724 -90767 -70032 -63447 10573 45452 2047 101794 219970 217992 142981 153921 215614 319853
19712 319853 331263 268281 403438 249972 -101952 -115248 -141845 -241329 -180724 104321 265573
19701B65573K19136J25622J56497m4085r6172o2646R4803K13842J73241M7381
19691A093192r1756q1512K8412L10692Q5375j61471k74834m14519j26430K9982
19681C97131L3543p7777m6301n7615m4254j60444k1248J43678Q6407j5601l5013
19670B02506o1778q2456J31306m230J70229r1409j98348j5514k1301j1841J68741
19659A85905k7821j70310o4143n1617j21240K21473K79183M9022L1484K80101
19649F12037M35286J34930M581N790r3407K5327k18549k88126o2300j93034o6881
19638B95654j43474m5058K18153J11832J7789L62732M92028j92016k65641k60988
19628E91011j30263k05349k40908n6020O5976N8807k34196k10363P2121J69979
$$ plain form
19701 265573 484709 610331 766828 722743 626571 563925 658728 872570 1045811 1093192
19691 1093192 1001436 919924 948336 1259028 1344403 1182932 908098 493579 367149 397131
19681 397131 430674 352897 306596 248981 204727 44283 23035 166713 253120 237519 202506
19670 202506 140728 58272 189578 185348 355577 264168 65820 50306 29005 17164 185905
19659 185905 158084 -12226 -76369 -127986 -249226 -27753 251430 300452 331936 612037
19649 612037 1047323 1182253 1186834 1192624 1099217 1124544 905995 617869 555569 362535 295654
19638 295654 152180 107122 325275 437107 454896 817628 1309656 1117640 851999 591011
19628 591011 460748 255399 14491 -41529 24447 83254 -150942 -361305 -289184 -119205
19618a19205K42594J52087p8494K409M7469J99060R9563k16006j70281j06364
19608E2832O5390N2651j07281O7215J02207k20794m8627Q455r4762K77923P4513
19597B29722o2404L8663l1581m659K79021k53765k57160l1109j28277J8762L2902
19586a69885l1134J2893J06758K02342j04565m0667o6821M9124K03577K3433k1168
19575A63887q9956m4321J66615N2956K6103j59669j09538J98307j40486j75414
19565a11516K7730J12936j283k4026N5089J03827l5204J45439M9803o9922L7803
19554B90676p4153r0623J6254J06570n9989o9567Q904j39712l704j08612Q8899
19543c5057p8704r8680J14446R8769M29J0011Q8535l9212J65671j1761j53924
$$ plain form
19618 -119205 123389 275476 196982 199391 246860 445920 545483 329477 159196 52832
19608 52832 118222 170873 63592 130807 233014 12220 -36407 -27952 -122714 155209 229722
19597 229722 167318 205981 174400 169741 448762 194997 -62163 -93272 -221549 -202787 -169885
19586 -169885 -201019 -188126 -81368 120974 16409 -24258 -91079 -41955 161622 185055 163887
19575 163887 73931 29610 196225 249181 275284 115615 6077 204384 63898 -111516
19565 -111516 -83786 29150 27867 3841 58930 162757 127553 272992 322795 252873 290676
19554 290676 216523 125900 142154 248724 188735 119168 128072 -11640 -15344 -123956 -35057
19543 -35057 -113761 -212441 -97995 774 1203 11214 99749 60537 226208 214447 60523
19532F0523j85928n1313M7072p3992q748R9387K95541N1314j86520j48259J56321
19521E5398n0114j84219o7744K11392K98359k65817k8857r3302j8696O9057j32351
19510b06894j6533R6318J00527l4005n9961J01237r3229n3121R3395Q6179J98763
19499B12676J93379N56016N02073P0722l69549j38155k26851k01940j26158j60533
19489C11680k04048l5654M47854K49047M2723o0350j6553J51382J24382N2970
19479A063433n9655j51729l02101n438j2999r1518r8920l39349J6226J56658J42284
19468C16892n4794j60852q050P0549j56956j70324k326K54021J32302j9129j22473
19457G8860J80028O1723P9191O452r5862j92798q0302j63849k0154J88079J60963
$$ plain form
19532 60523 -125405 -176718 -129646 -203638 -212386 -112999 182542 233856 47336 -100923 55398
19521 55398 5284 -178935 -246679 -35287 263072 -2745 -31602 -124904 -143600 -74543 -206894
19510 -206894 -223427 -127109 -26582 -60587 -120548 -19311 -112540 -165661 -72266 13913 212676
19499 212676 406055 962071 1464144 1534866 1165317 1027162 800311 598371 472213 311680
19489 311680 107632 71978 519832 768879 811602 751252 734699 886081 1010463 1063433
19479 1063433 1003778 852049 549948 544510 531511 439993 341073 1724 17950 174608 316892
19468 316892 262098 101246 93196 163745 6789 -163535 -165861 88160 220462 201333 78860
19457 78860 258888 320611 399802 406254 310392 117594 37292 -126557 -146711 41368 202331
19446B02331j4319K36152J24103J87511L49654L46426J54786l21510j67369J27080
19436A224845j36061l05876j07199J21331n6104J05634J48844r7764k04771m9170
19426F43709j45065K6566j60660Q6903N5323j01024p1713o8467K2910J7774k02622
19415A03634j96428J1410J70156K07278R1388j08743o0471p2821M0126J36909
19405C22438j44226k11563q46N1799O0220k602k1127j05091N4988j08545l3117
19394a37672R5085q944R5639j8983n329J44673N6096L4499l07722O5492J88347
19383B01181l8278r4239j20607K4959l0912N8356K82325J53365K6022p8231j24065
19372B59876p5029r7782o007J07420j0819k53631J2641K87221J5475m7172j25910
$$ plain form
19446 202331 188012 424164 548267 735778 1085432 1431858 1586644 1265134 1097765 1224845
19436 1224845 1088784 782908 675709 797040 740936 846570 995414 897650 692879 643709
19426 643709 498644 525210 364550 451453 506776 405752 334039 265572 288482 306256 103634
19415 103634 -92794 -81384 88772 296050 387438 278695 218224 145403 185529 322438
19405 322438 178212 -33351 -34197 17602 77822 75220 54093 -50998 3990 -104555 -137672
19394 -137672 -42587 -51531 44108 25125 19796 164469 220565 255064 -52658 12834 201181
19383 201181 162903 68664 -51943 -26984 -57896 460 282785 436150 462172 383941 259876
19372 259876 184847 87065 81058 188478 177659 -75972 -63331 223890 239365 192193 66283
19361F6283j90992J17021J48032J00847J2447j97687j16375l2235J65289J03228
19351A75858j13947p8343k4702j06973o170K4627L0658j9268K55841R3449j57786
19340G3244k7788L0968N5538j2594N3467J32199k51547o0149L1952j13771n9373
19329a47854j27675j6404L39369J82365j14211q2059R284J33701Q1325j34760
19319A23081j9028q2017j01547j54899p2223O3771j70147J4728p020J66672L9075
19308a99554O6169J97579K2570j34288P2418l1230Q9383n4880l7703L8291J17444
19297A46199L9114j40738K36428J66843k54286k16929K15573P9986J1004K89873
19287E73067P4772k8634j91327L1881k2358N0012l25932k20057N5149J9125J86726
$$ plain form
19361 66283 -124709 -7688 140344 241191 253638 55951 -60424 -92659 72630 175858
19351 175858 61911 -16432 -41134 -148107 -154277 -129650 -98992 -118260 137581 231030 73244
19340 73244 45456 76424 131962 119368 172835 305034 53487 -6662 25290 -88481 -147854
19329 -147854 -275529 -291933 47436 229801 115590 33531 42815 176516 257841 123081
19319 123081 104053 22036 -79511 -234410 -306633 -242862 -413009 -398281 -405301 -238629 -199554
19308 -199554 -133385 64194 86764 -47524 24894 -6336 83047 28167 -9536 28755 146199
19297 146199 185313 44575 281003 447846 193560 -23369 192204 272190 283194 573067
19287 573067 647839 619205 427878 459759 437401 487413 161481 -58576 -3427 15698 202424
19276B02424L7492r7770k15765j5106J3212K77368p5333o2692K05840N9600m0761
19265B88509k09375q321R6030J40646J44652j773p3217j3818P51j87397j77440
19254g53R3689J76957L5957o0968q7281J1911J23008j3116p4995K7293j89829
19243D1873j0583K19371L01923P819k64626J0277m5386J51769O8973K2497Q7895
19232E91802p1465P8556p9883j53874Q0708L07581J74267L24223L33417m3499
19222A541833J740j30495l46460j07156K2938K60492R19122J137808J688842J885362
19212F874026O46081n35365q77252o28493r60424j394697r59427m14195k29204
19203A521050Q9000J80017K56270K06582q7509l46541k64978n35921k68000J00478
$$ plain form
19276 202424 239916 142146 -73619 -88725 -75513 201855 126522 63830 269670 329270 288509
19265 288509 79134 70813 166843 307489 452141 450368 377151 363333 364084 176687 -753
19254 -753 92936 269893 305850 244882 157601 169512 292520 279404 204409 231702 41873
19243 41873 31290 250661 552584 560403 295777 306054 260668 412437 481410 503907 591802
19232 591802 520337 598893 519010 365136 445844 753425 927692 1251915 1585332 1541833
19222 1541833 1543573 1413078 1066618 959462 982400 1242892 2162014 3299822 4988664 6874026
19212 6874026 7520107 6984742 6107490 5478997 4518573 3123876 2164449 1750254 1521050
19203 1521050 1610050 1790067 2046337 2252919 2165410 1818869 1553891 1017970 749970 850448
19193H50448j8004j64922L9152J8680j21527r4992o8219q5080M3344k9886Q7420
19182D56414Q9024k0967K2033P0768K53661o9913r8137O9148J79997L94969M72027
19171A819024L45592M28201P8539k92222k91283n2713L6010p0576L64780J064396
19161C429748J126278Q65084N67540R18374N19518q27155j643639j648492j160294
19152B146962n04023n9235J43804n2275o451r6675J1528k49632m28344k23085
19142F82574L0066r5562M9284j25502J110K16565N1563P4401j33421j32490n626
19131F12962r5005N3294k0605j3536q1932R3726k3160K0709K33848j9550o1713
19120F99038j44969j31989o4488M6314P2241J07417J48278m5002j28521O0101
$$ plain form
19193 850448 832444 667522 706674 725354 603827 508835 440616 355536 398880 368994 456414
19182 456414 545438 524471 546504 617272 870933 801020 702883 772031 952028 1346997 1819024
19171 1819024 2164616 2592817 2671356 2379134 2087851 2035138 2071148 2000572 2365352 3429748
19161 3429748 4556026 5421110 5988650 6907024 7426542 6599387 4955748 3307256 2146962
19152 2146962 1642939 1583704 1727508 1675233 1668782 1572107 1583635 1334003 905659 682574
19142 682574 712640 617078 666362 540860 541970 758535 810098 884499 751078 618588 612962
19131 612962 517957 571251 550646 537110 455178 548904 525744 546453 780301 760751 699038
19120 699038 554069 422080 357592 403906 476147 583564 731842 686840 558319 618420
19110F18420M5382M4829N2745O1956j62597l03022J2911L69516K27151j20073
19100H47218p975k17639J3361J17805j31819p2024O1745J13483Q5444j30278k20146
19089D59175j09933M2482K73832o8712n3851n1699o3336n1216J03629L7525r8185
19078D19711K2164J52490j01567J64254L4199J1024k3876L6744j68445P6682R1036
19067G14416P1133N0176r703q2463j09392L0310m3834o980J03805j16228k22651
19056C78589j2482k3853K91501K95758n9016j09633j02805q1362Q2302K28675
19046H87674J64999k592m1429p9758L5983K1684m8866k85552N4722J66609j09901
19035G63573k33777J01014K55597n3156J91486J51254r5766o8821J56536J04033
$$ plain form
19110 618420 663802 708631 761376 823332 660735 357713 370624 740140 967291 847218
19100 847218 839243 621604 634965 752770 620951 548927 610672 724155 809599 679321 459175
19089 459175 349242 391724 665556 596844 542993 491294 427958 376742 480371 517896 419711
19078 419711 441875 594365 492798 657052 691251 702275 678399 715143 546698 623380 714416
19067 714416 785549 835725 826022 743559 634167 664477 620643 613663 717468 601240 378589
19056 378589 366107 342254 633755 929513 870497 760864 658059 576697 658999 887674
19046 887674 1052673 1050081 1008652 928894 964877 986561 937695 652143 706865 873474 763573
19035 763573 529796 630810 886407 833251 1024737 1175991 1080225 1011404 1167940 1271973
19025A271973P4154J886l1381J2698N4051P5223r5176K12951k4981k13511J92372
19014A530259L81897J45807n8707N7838j7299J602J30365K84592n1621j22438
19004B282295R1441K5850J50628K79613K48842K68544L3233J60586N10895P96066
18994D847993P73061Q64154L60567J29246J94576N35587J007826P83470J128250
18985A0624730J516170K110945K773859L870535O279364J0425211J3968192Q760151
18977F0329157j621605o628605l182419M122535J2812752K5944110M8689317Q4772508
18969B25237750R9503726L6208254l4353158m3551970k3074440l5753466n4911590
18962A69305106n1485004l1967918j4421730j395999J0564295K0797226J6094288
$$ plain form
19025 1271973 1346127 1348013 1316632 1329330 1383381 1458604 1363428 1576379 1551398 1337887 1530259
19014 1530259 1912156 2057963 1999256 2057094 2039795 2041397 2171762 2456354 2404733 2282295
19004 2282295 2373736 2399586 2550214 2829827 3078669 3347213 3380446 3541032 4051927 4847993
18994 4847993 5621054 6485208 6845775 6975021 7169597 7705184 8713010 9496480 10624730
18985 10624730 12140900 14251845 17025704 20896239 27175603 37600814 51569006 60329157
18977 60329157 58707552 52078947 48896528 53019063 65831815 91775925 140465242 225237750
18969 225237750 324741476 360949730 326596572 283044602 259970162 224216696 169305106
18962 169305106 117820102 85852184 71430454 70034455 80598750 101395976 117490264
18955A17490264o102543k3835386k5598019j8489895j1667883p032627m179208
18948B0584703k529185j227216k46591J62287m49829p82259k99896k32871m38510
18939A4540633k36094o1033q7647J542K87620O66573J363532J843450L296402
18930B1614978N338319Q562950J4107482K2661576K6699592J2824614q886087
18923A02923424j9007542j3844429k424216J0558003K6762259M7030177N0576740
18916B02574416K5089580J6895837M4143789M3982605k5249566q0930741q1076059
18909A45429861n1646426k7891494j4820955o238561Q11321O261009M200836n062618
18901E1042973j1479453j0973960p217138m366793k756480j924656j434005p32424
$$ plain form
18955 117490264 111387721 87552335 61954316 43464421 31796538 24763911 20584703
18948 20584703 18055518 16828302 16581711 16743998 16294169 15511910 15212014 14979143 14540633
18939 14540633 14304539 14243506 14155859 14157401 14445021 15111594 16475126 18318576 21614978
18930 21614978 26953297 35516247 49623729 72285305 98984897 111809511 102923424
18923 102923424 83915882 70071453 67647237 78205240 104967499 151997676 202574416
18916 202574416 227663996 244559833 288703622 332686227 307436661 226505920 145429861
18909 145429861 93783435 65891941 51070986 44832425 45643746 51904755 56105591 51042973
18901 51042973 39563520 28589560 21372422 17005629 14249149 12324493 10890488 10158064
18893A0158064o15437q64450l59256Q0238l38685q56681j086843r02777q67238
18884D346935r76496l46450n9950j03544j57486m4123k5382j64742l04275j19099
18874B045388k82194j11012k64720k99428L0422l1826j67294L2093J02549k1425
18864A032553R3519O0401m6051k3380n0715m552o7176k75448k67003l5597J84208
18853F00759l6151J28440j7135r3950j70529K71427J22174r8035j56808p4243
18843D75949J8929Q0715J15905q9354l4425j4538L8202j42523l22142J21815J3051
18832B61584j22587K6776J42181J33906N6757J09721j4824K631n5266K68426Q9705
18821H99010K453J07693n0411q6261n7680N35812N73102N28407M70280r9186l54396
$$ plain form
18893 10158064 9542627 8678177 8318921 8399159 8060474 7203793 6116950 5214173 4346935
18884 4346935 3370439 3023989 2964039 2860495 2703009 2658886 2633504 2468762 2164487 2045388
18874 2045388 1763194 1652182 1387462 1088034 1118456 1086630 919336 951429 1053978 1032553
18864 1032553 1126072 1186473 1140422 1117042 1066327 1061775 994599 719151 452148 416551 600759
18853 600759 564608 693048 675913 581963 411434 682861 805035 707000 550192 475949
18843 475949 494878 575593 691498 602144 567719 553181 591383 448860 126718 248533 261584
18832 261584 138997 165773 307954 441860 498617 608338 593514 596145 540879 809305 899010
18821 899010 901463 1009156 958745 872484 814804 1350616 1923718 2452125 2922405 2823219 2468823
18810B468823l1146j44033m56937n54452k41513k05034j44836j9699J15104l5212
18800G51065k3980m6798j37343j65440L1729L6722J92004L7269k8004j92539M465
18789D59150r2450O4513P932j43059J16151k02122q5702M8489L9842Q5264K6246
18778C24254j20170P2778J34830O533J69860M6437L911J98957K06637J17469K61918
18767A423414O28152R19718K05452n74387m56427k98624k69911j43954M3649J05606
18757A582688Q9537k59993k32585l66910l29166k15111l2724J22611J86607n3485
18747D91469q3552k05921r0805J39635O2858M8384j22048o7742L0056j58912l2248
18736A1174Q7677N9676P3336n5366r601m0107k4720J01308N551j21833k3068L1666
$$ plain form
18810 2468823 2437677 2293644 1836707 1282255 1040742 835708 690872 671173 786277 751065
18800 751065 727085 680287 542944 377504 409233 445955 637959 675228 647224 454685 459150
18789 459150 366700 431213 439145 296086 412237 210115 124413 172902 212744 298008 324254
18778 324254 204084 276862 411692 418225 588085 634522 638433 837390 1044027 1161496 1423414
18767 1423414 2051566 2971284 3176736 2602349 2145922 1847298 1577387 1433433 1477082 1582688
18757 1582688 1672225 1412232 1179647 812737 483571 268460 235736 358347 544954 491469
18747 491469 407917 201996 111191 250826 313684 362068 240020 172278 202334 43422 11174
18736 11174 98851 158527 231863 176497 166896 126789 102069 203377 208928 87095 64027 95693
18724I5693k45620n234o7332k526Q5443L7998K31788j1464l3979J6422O031j24770
18712a7550l0735j29781k6825K78830K46060K48046L52723P8814j38010M3723
18702I05295J93185j28216k11076n68107l27524M4325R4862J15265K46502q182
18692C56329j73651q5621j75484N5693M6247J30656L1489P4306k02398j15739
18682e8173K11582J16313N7113j8962P5620L9501k5444K21712M62019L51723J60159
18671A593163j76343l75415l46502j79063j64913P7540O1166M3255R757J0660
18661E53305k01191k24005Q4742J6731m540J51914O0987Q1369j66739m937J41406
18650D89042m2445l02835k75553O0652j7651P8066J93832K58904O6712K44491
$$ plain form
18724 95693 -149927 -155161 -222493 -225019 -139576 -101578 130210 118746 84767 101189 107220 -17550
18712 -17550 -48285 -178066 -204891 73939 319999 568045 920768 999582 861572 905295
18702 905295 1098480 970264 759188 191081 -136443 -92118 2744 118009 364511 356329
18692 356329 182678 97057 -78427 -22734 23513 154169 185658 259964 57566 -58173
18682 -58173 153409 269722 326835 307873 383493 422994 397550 619262 1081281 1433004 1593163
18671 1593163 1416820 1041405 694903 515840 350927 428467 489633 532888 542645 553305
18661 553305 352114 128109 212851 229582 225042 376956 437943 519312 352573 347636 489042
18650 489042 446597 143762 -131791 -71139 -88790 -10724 183108 442012 508724 753215
18640G53215l614r0064k35618m9973Q7109j12921k58281O2674L1210J66656J47129
18629D97522j25091j12244p4426J10900N0012Q7781k29189j77251M3770j25504
18619e3720k41557j8284J83348L07746J70469N2327j41590K5391j47329L4543
18609A71344Q1674K22P2698J18244l2978n4036q0943j47636j43686K7304J30862
18598A43069K03209K5140j35375j31203K7042j8858N3164O2673N2275Q439n7203
18587B32372r8928p2371j51214J24883J65557M4051j96005j3204J19092J1623
18577A65856n5947K6866j0106O5176J27678j20839n5385m9828J4225J8910J8450
18566A45056J35009m0382K68106J69216l34278k35456K4594L397j39426q6600
$$ plain form
18640 753215 749601 659537 423919 373946 461055 348134 89853 152527 183737 350393 497522
18629 497522 372431 260187 185761 296661 346673 434454 205265 28014 71784 -53720
18619 -53720 -295277 -313561 -130213 177533 348002 400329 258739 284130 136801 171344
18609 171344 253018 253240 325938 444182 411204 357168 276225 128589 -15097 12207 143069
18598 143069 346278 371418 236043 104840 131882 113024 166188 228861 281136 289575 232372
18587 232372 133444 61073 -90141 34742 200299 244350 48345 35141 154233 165856
18577 165856 109909 136775 126669 191845 319523 198684 143299 93471 107696 126606 145056
18566 145056 280065 239683 507789 677005 342727 107271 131865 135262 -4164 -90764
18556i0764k08636R1789n1783R1380j4975P9269j6530k7557J43955J48724J22740
18545B67612j28017R254J13173K92133P606j54542k4591J46776j17451r1838J0281
18534C30396q4183k79j26996q3119K4402J14551O0183K4780O5821K08332j25665
18523D08223l43241o744M9594n2087J23678L09065J00169P8022L6503j66774j20479
18512D15929Q3292k8575j57204r7169J682J12141p3668L5120J23105L5698k9363
18501D20988L3141n8148M4330j2605N3154j04026p8215j10878J05289K6543K13692
18490E33265J13172R1269m0518m17621N6297J82278O2662j12111K4834M9087p9576
18479D63038J3246K7846q4118j11620J02918n9886O0053k79010j79209L68412
$$ plain form
18556 -90764 -299400 -207611 -259394 -168014 -182989 -103720 -120250 -147807 -3852 144872 267612
18545 267612 139595 148849 262022 554155 561761 407219 382628 529404 411953 320115 330396
18534 330396 246213 245934 118938 35819 60221 174772 234955 259735 325556 533888 408223
18523 408223 64982 58238 107832 55745 179423 488488 588657 666679 703182 536408 415929
18512 415929 499221 470646 313442 216273 217955 330096 256428 291548 414653 450351 420988
18501 420988 454129 395981 440311 427706 480860 376834 298619 187741 293030 319573 533265
18490 533265 646437 737706 697188 279567 335864 518142 580804 468693 493527 542614 463038
18479 463038 476284 504130 420012 308392 411310 351424 411477 132467 -46742 321670
18469C21670J68294J8886n5542q9843l1049R8181j602p9763K48254j29494m0115
18458D27877J58881n068o4543j15135j24485j80625j78107J69926J80338J89967
18448D59026K06238K14942K86884K05040j3740R1674k51904j08205J63953M9789
18438A303697l04042m7987Q5380L72514L12986P2242l24356m89772j71619R4781
18428I03824k5660l43936j91437J33339O7525k9757j62519J07125n9026P40J46279
18417E46497K25045j05692j73957q4827k34178l0055J78084p1362n6466R1522
18407B84611J7989q704m371J73540N9895Q5279j59254j63064J23226n4550K1197
18396C75794M04375L78462O4270j39237l0767J41655J821J52034j01924p9610
$$ plain form
18469 321670 489964 508850 453308 363465 332416 430597 428995 349232 597486 467992 427877
18458 427877 586758 581690 517147 402012 277527 96902 -81205 88721 269059 459026
18448 459026 665264 880206 1167090 1372130 1358390 1450064 1198160 1089955 1253908 1303697
18438 1303697 999655 951668 1037048 1409562 1722548 1794790 1470434 980662 809043 903824
18428 903824 878164 534228 342791 476130 543655 513898 351379 458504 399478 400218 546497
18417 546497 771542 665850 491893 407066 172888 142833 320917 249555 193089 284611
18407 284611 302600 293896 289525 463065 522960 608239 448985 285921 409147 354597 375794
18396 375794 780169 1158631 1222901 1083664 1052897 1194552 1196373 1348407 1246483 1166873
18386A166873k11785l27857K9648J87164N4445L88269R9745K25282R0900k40395
18376A462289o29213k74659r86O7485K71J5354k69217j1583R4731k08498r4541
18365A51433P1178K62820J07167N8621O6517K42910j29390l43556q8660R6558
18355D95598J51164O8315q4980j0152j20675Q8861l4286K4633j01744K0249K18842
18344G15825j08847l30184j59525J8477j3804L7464P6325J20464j04148m8712
18334B03335m6371M295J97779K75643l3692K5013J40371n9027J62368k5079k38443
18323F06192J42967j00403m393O63m3786j7097j45705j05315l2422N4893Q2626
18312D38220J6844O4047J98352j6249k71977l8691p4932J01805R1955j5888j88097
$$ plain form
18386 1166873 955088 627231 656879 844043 898488 1286757 1386502 1611784 1702684 1462289
18376 1462289 833076 558417 557431 624916 625187 640541 371324 359741 454472 245974 151433
18365 151433 222611 485431 592598 651219 717736 960646 831256 487700 399040 495598
18355 495598 646762 715077 630097 619945 499270 588131 553845 578478 476734 496983 715825
18344 715825 606978 276794 117269 135746 121942 159406 235731 356195 252047 203335
18334 203335 156964 161259 359038 634681 600989 626002 766373 707346 869714 844635 606192
18323 606192 749159 648756 644363 645026 601240 584143 438438 333123 300701 355594 438220
18312 438220 455064 519111 717463 701214 429237 390546 315614 417419 509374 493486 305389
18301C05389K7717J80874L4954j01969p573K38657J5709q0629L7567L2391j90135
18290D92952J44500j42942j3558O459j16538j06401p6133l1028J07370M2630o9797
18279B37514K1458L3707J67168n7856p8263J74574J20005m9397K7903L35267Q7409
18268A019489p4024l01729j30417J64732j17698P9704q8037l5345n9157J45047
18258F02565M6627j50812K8943j27966j9658k6936p5892L29305J46190n546J52250
18247H99070l9337q0743k12533p158K39433J31273j20235J81125Q0989J32385
18237A204269j0244J17941K03395l36785j94509J56409k9360j24995J29668o1718
18227A054071n8846k74601j33642J91424K89485P1778j2159J11842l5536j59975
$$ plain form
18301 305389 333106 513980 548934 446965 439392 678049 693758 613129 650696 683087 492952
18290 492952 637452 494510 480952 487411 370873 264472 188339 157311 264681 307311 237514
18279 237514 258972 292679 459847 401991 323728 498302 618307 568910 596813 932080 1019489
18268 1019489 945465 643736 513319 678051 560353 640057 552020 516675 457518 602565
18258 602565 649192 498380 527323 399357 379699 352763 276871 606176 752366 746820 899070
18247 899070 859733 778990 566457 559299 798732 930005 809770 990895 1071884 1204269
18237 1204269 1194025 1311966 1515361 1178576 984067 1140476 1111116 986121 1115789 1054071
18227 1054071 995225 720624 586982 778406 1067891 1139669 1127510 1239352 1203816 1043841
18217A043841j60563j46932l3697O8668N3907j01607m8472K96729J48318p4066
18207A046126o5810m0385J87791K66948J27552o9451j51964L04749l701L3589
18197A635444J1220N5571K8395n7866R880L36229L19807K92270J12657L00221
18187C043828J64586L79049N91607M43073P34349R62084J548325K047688K217482
18178A2132071K960900N006379Q504232J4549836K6230836M2431129L8595155
18171A50410538m87248l5408193m1111290k7640033j5476039q595215m895731
18164A6796789k778446j682310j060772n82778o55259j006378o08038j93159M3851
18155H273500M93269J029215J215857J415623K079989L082166L846643M580948
$$ plain form
18217 1043841 883278 736346 702649 771317 825224 723617 675145 971874 1120192 1046126
18207 1046126 980316 939931 1127722 1394670 1522222 1452771 1300807 1605556 1601855 1635444
18197 1635444 1646664 1702235 1730630 1672764 1682644 2018873 2338680 2630950 2743607 3043828
18187 3043828 3208414 3587463 4179070 4622143 5356492 6318576 7866901 9914589 12132071
18178 12132071 15092971 20099350 28603582 43153418 69384254 111815383 150410538
18171 150410538 149923290 114515097 73403807 45763774 30287735 21692520 16796789
18164 16796789 14018343 12336033 11275261 10692483 10037224 9030846 8422808 8229649 8273500
18155 8273500 8766769 9795984 11011841 12427464 14507453 17589619 21436262 26017210
18147B6017210O403787J0820705J9001505L3488835N9055296Q5398353N8631147
18140B98816838k2583872p6849706p4252543m6545987k6006270j4988938q996123
18133B8593399n316519k977509j418902j055501j232762j118743o61192K8797
18125A4841068q975l93471k51991P51215J501169K132187K861878L609605M894502
18116B9937187P114855J1412319J8510265L1535720N5102814Q4444195J00140459
18109C38197814J21991178R9939319m1735990j49198687j49231591q9950090m6309498
18102H3702455k5774703j5350884r638355o176551m298382k713389j139413p69830
18094A7840948k203157k769136k474260j972390j449270j179473r27120n86945
$$ plain form
18147 26017210 32420997 43241702 62243207 95732042 154787338 240185691 298816838
18140 298816838 276232966 199383260 125130717 78584730 52578460 37589522 28593399
18133 28593399 23276880 20299371 18880469 17824968 16592206 15473463 14812271 14841068
18125 14841068 14832093 14438622 14186631 14937846 16439015 18571202 21433080 25042685 29937187
18116 29937187 37052042 48464361 66974626 98510346 153613160 238057355 338197814
18109 338197814 460188992 560128311 518392321 369193634 219962043 130011953 83702455
18102 83702455 57927752 42576868 32938513 26761962 22463580 19750191 18610778 17840948
18094 17840948 15637791 12868655 10394395 8422005 6972735 5793262 4866142 4279197
18086D279197l90688m70085j98864K8504J9793k81684k82747r0755k02489k3951
18076B386231m16275k25053k31023l9877J78961l1737J7728P7540N7038M97492
18066B271025O43170P17046K21795m82566r23372p15528k57110q5461j38508j13695
18056A136796k07583k54551r3938K03180r3961k35920K0721Q3305K7830J76256
18046G62135L3032j18825k15885j84199j27192L9236K32375K9471L2646j33825
18036C48969L7143j04215j6357m7919j28394l7138m1110j773R232J659O9346N0532
18024A39975k27162j41639k7463J11495L12317J12520k45800r9706n4379L2450
18014h7392L19006K6497P275J29227j05158k30538k50335J82423P3527j76874
$$ plain form
18086 4279197 3888509 3418424 3219560 3248064 3267857 2986173 2703426 2612671 2410182 2386231
18076 2386231 1969956 1744903 1513880 1474003 1652964 1621227 1638955 1716495 1773533 2271025
18066 2271025 2914195 3631241 3853036 3370470 2447098 1731570 1474460 1388999 1250491 1136796
18056 1136796 929213 674662 580724 783904 689943 454023 474744 558049 585879 762135
18046 762135 795167 676342 460457 276258 149066 188302 420677 450148 482794 348969
18036 348969 386112 281897 265540 217621 89227 52089 10979 9206 18438 20097 89443 139975
18024 139975 -87187 -228826 -256289 -144794 167523 280043 34243 -65463 -119842 -87392
18014 -87392 231614 258111 265386 394613 289455 58917 -191418 -8995 64532 -112342
18004a12342m9153O8502O5469P9944j30251k00734K95738N9538l0112J31590j28085
17993E0104k36544p3975p1836Q9616J75406L07577M9786j01181N280j81978O6752
17982G9007p4882K06182K53000l0086q8602l08370j03481K9421k4591j49641l3590
17971b45633J51799J4724k12833N255J09997p7560J32527r256R2365J84304J5861
17960A61550j87344j0766j25135M6607J36896q5504l6486j62612J09254L811j53766
17949c03495P0398J03398M1823K10396q3324k3753r3623n1793M2362M4301n6012
17938i9322J6957M3241q6032j058j0889J07475R07j01196J18634R5414n1262l6028
17926c159J70005j3640p3923M0050o7094j62636j62662k67030M5912K7545J9806
$$ plain form
18004 -112342 -161495 -92993 -27524 52420 -77831 -278565 17173 76711 46599 178189 50104
17993 50104 -186440 -260415 -332251 -242635 -67229 240348 290134 188953 194233 12255 79007
17982 79007 4125 210307 463307 433221 344619 36249 -67232 -37811 -62402 -212043 -245633
17971 -245633 -93834 -79110 -291943 -286688 -176691 -254251 -121724 -130980 -38615 145689 161550
17960 161550 -25794 -36560 -161695 -115088 21808 -63696 -100182 -262794 -153540 -149729 -303495
17949 -303495 -233097 -129699 -87876 122520 39196 15443 -78180 -129973 -87611 -43310 -99322
17938 -99322 -82365 -39124 -125156 -126214 -137103 -29628 -28721 -129917 -11283 84131 32869 -3159
17926 -3159 166846 153206 79283 119333 52239 -110397 -273059 -540089 -494177 -466632 -446826
17915d46826K53837J8050L0793r0117J0155K4920L7558r9067N9093J04706j3921
17904a10819q1095o4964O5523R0963R9254q166j73906j53824j10704K53638K69703
17893G5603j91235j82734r1405o7901J11833J31320N8338O7099L2481k21082m7172
17882c24855J38226K30058m2084o9613O6089J98396o3356k09146q1896q70l2035
17871a91086P291P3465j43077j90759l7636J86358J10231J33040J29646M3413
17861A20886p1585R6387n6037j80526l8240J3625K9613q5426Q8766M6217J62979
17850A26659L0605o096j4445R9331l0199p7659m4834K6361Q8691N8093J8598k42834
17838C2271j25678j09962j07495J75228J78266j3878r9400P8597J06422l7562
$$ plain form
17915 -446826 -192989 -174939 -144146 -234263 -224108 -199188 -161630 -260697 -201604 -96898 -110819
17904 -110819 -191914 -256878 -191355 -100392 -1138 -9304 -183210 -337034 -447738 -194100 75603
17893 75603 -115632 -298366 -389771 -457672 -345839 -214519 -156181 -89082 -56601 -277683 -324855
17882 -324855 -186629 43429 1345 -68268 -2179 196217 132861 -76285 -158181 -159051 -191086
17871 -191086 -183795 -110330 -253407 -444166 -481802 -295444 -185213 -52173 77473 120886
17861 120886 49301 145688 89651 -90875 -129115 -115490 -85877 -171303 -82537 -36320 126659
17850 126659 157264 151168 136723 236054 205855 128196 83362 109723 198414 256507 275105 32271
17838 32271 -93407 -203369 -310864 -135636 42630 28752 -70648 7949 114371 76809
17828G6809P4848o2709l1590n1439N4237o0457j70165M8251k576K4436Q8632o3507
17816g5230k59047q7906p1468R0951R5329k6860K15278j5348j16438m2207K72387
17805b0559L0211r5316r3835j58980k7701J57325R1240R8738l4424K7723K6461
17794H83L073j24320j6481j44619j52766p687R1273J09200L0251M1298J19033
17783e0862j8656j4088k11935j88541o9660K56929J40896q8492l3919J70665J69955
17772F2292r1855q7046L7647K18386o2594k77132m6478J14300J69480j65607l8859
17761a67466M5105J24251r6548j75087p2729J16177k4682J58382j8153k34562
17751c45312j68763k2297M1395J14145q5794j9390J9144J8855M6997J80499K8847
$$ plain form
17828 76809 151657 88948 57358 5919 60156 -301 -170466 -122215 -124791 -100355 -11723 -75230
17816 -75230 -334277 -422183 -493651 -402700 -307371 -334231 -118953 -134301 -250739 -292946 -20559
17805 -20559 9652 -85664 -179499 -338479 -366180 -208855 -117615 -18877 -53301 -25578 883
17794 883 3956 -120364 -136845 -281464 -434230 -441917 -350644 -241444 -211193 -169895 -50862
17783 -50862 -69518 -83606 -295541 -484082 -553742 -296813 -155917 -244409 -278328 -107663 62292
17772 62292 -29563 -116609 -78962 139424 76830 -200302 -246780 -132480 37000 -128607 -167466
17761 -167466 -122361 1890 -94658 -269745 -342474 -226297 -250979 -92597 -110750 -345312
17751 -345312 -514075 -536372 -494977 -380832 -466626 -486016 -466872 -448017 -401020 -220521 -191674
17740a91674K6506J16784p7316Q6842J66247Q3626r2046j82218q7031j5686P6387
17729h9579M6899j15975o006J88528K62617l0435l85774l55139M4315N9256J65704
17718b15589J85190K83261q7563j8836r8764o1960J24214O0420K6232k30907k48136
17707b82438O5956J30861J2456k06884j46694m0502J02155O5881J64477L63028
17697B28296J55315j3431j97154r51J46343m6543j04865N4627j14487o7256Q9918
17686A29812j70590l9809n8740j16074K4872M9130J15778J92603q8084j37982
17676i9084r6872j55094j15701Q3924J13117j90822M1105l0132j49063M9381j6523
17665e65764J42210J67153J94909k33441j20451J26440K00620O0845Q1795J14354
$$ plain form
17740 -191674 -165168 -48384 -125700 -38858 127389 211015 118969 -63249 -150280 -165966 -89579
17729 -89579 -42680 -158655 -164661 23867 286484 256049 -129725 -484864 -440549 -381293 -215589
17718 -215589 -30399 252862 165299 146463 47699 -14261 109953 170373 196605 -34302 -282438
17707 -282438 -216482 -85621 -73165 -280049 -426743 -467245 -365090 -299209 -134732 228296
17697 228296 383611 370180 173026 172075 318418 271875 167010 221637 107150 39894 129812
17686 129812 -40778 -80587 -139327 -255401 -230529 -181399 -65621 126982 38898 -99084
17676 -99084 -195956 -351050 -466751 -382827 -269710 -460532 -419427 -449559 -598622 -549241 -565764
17665 -565764 -423554 -256401 -61492 -294933 -415384 -288944 -88324 -27479 54316 168670
17655A68670j4812p8171N6342n4992j21079j67485K7458j39291J08997M6359L9524
17644a28480J8955j37665r3259j24999J9040J41285K1867J74395L22952M2710
17634B56801o2155K93106J71404P956l58283j36786n0687k56890J27780L9383
17624C1629j59653k2785K31528N9414K0448j50289k5778J84369j89497j95515
17614b16129k1858m6073J1204J1681n8549P9900P9794K27209J24708J17729L35076
17603F44692L60947K11273k75350l19583l30120j3567o7792m64262M7122J53325
17593e3315J23181m25j73558J2400j6756J20544N0217p9221P4192J74653q3288
17582A48624r8900r9182N4107j21291k1000K27021R5097k30306K6263L06702J38071
$$ plain form
17655 168670 153858 75687 132029 77037 -44042 -211527 -184069 -323360 -214363 -168004 -128480
17644 -128480 -109525 -247190 -340449 -465448 -446408 -305123 -283256 -108861 214091 256801
17634 256801 194646 487752 659156 667112 308829 172043 121356 -135534 -7754 31629
17624 31629 -128024 -150809 80719 140133 160581 10292 -15486 168883 -20614 -216129
17614 -216129 -237987 -284060 -272856 -261175 -319724 -239824 -160030 67179 191887 309616 644692
17603 644692 1005639 1216912 941562 621979 291859 278292 210500 -253762 -206640 -53315
17593 -53315 69866 69441 -104117 -91717 -108473 12071 62288 -16933 57259 231912 148624
17582 148624 49724 -49458 4649 -116642 -137642 89379 184476 -45830 -19567 287135 425206
17571D25206j04670r5491j43653N6080N1483k37969K3937o9307j61641J29499
17561a26526J06823K68659K8758j12114k23792n2967P8898q7753j33322P3871
17551a79465P9824j11718P199K8225N9903K34723j81984j46254n1954J64989O7160
17540b9352r3010o8322j3340l2952p1482O4449Q6971Q8837J15017j8784N9775
17529H7807P0678K99707j04666l21942j65006k0579p31J72574p0069j52180m0841
17518b45248k6520K9922K5999J12770j09494j23757O2378K70680j06673J16239
17508F296J20186k5372Q1499k9379k7328k04651j45633q4342J26169J37711q338
17497e3182j44346j16102K2345N7288M2604j51919k4096P2483k5127K0482K03756
$$ plain form
17571 425206 320536 225045 81392 137472 188955 -49014 -25077 -94384 -256025 -126526
17561 -126526 -19703 248956 277714 165600 -58192 -111159 -32261 -120014 -253336 -179465
17551 -179465 -99641 -211359 -204160 -175935 -116032 118691 -63293 -209547 -261501 -96512 -29352
17540 -29352 -122362 -190684 -204024 -236976 -308458 -244009 -157038 -68201 46816 28032 87807
17529 87807 158485 458192 353526 31584 -133422 -154001 -154732 17842 -52227 -204407 -245248
17518 -245248 -271768 -241846 -215847 -103077 -212571 -336328 -273950 -3270 -109943 6296
17508 6296 126482 101110 182609 153230 125902 -78749 -224382 -308724 -182555 -44844 -53182
17497 -53182 -197528 -313630 -291285 -233997 -191393 -343312 -367408 -294925 -320052 -299570 -95814
17486i5814K9336L6183j18112P4104J27075J8064j16443R2776q4382M1531j9768
17475a5450J54290J21326j56838R292q1854o2842M3171m6592l8939k054K9434
17464d7056K3593q9074j76061j69801K10117Q762L9143n3867J53363j50311Q4434
17453a66758R2653j21424Q4666N5162r4707J60215J83730J53790J92805L58736
17443H98868L53960P82853M37511m31128q06745o09389k45587n5572K8866l69869
17433a6232O2683J17600j83393n0972p4534J30670R8155j40091J3683K7754r4672
17422a09349m5721M8432K66015p454j32142l6143J15799l20233m1455K3013n241
17411b44479o8375l5970J94629Q8246j31362J10139K4199n3512N2524l9701Q6727
$$ plain form
17486 -95814 -66478 -30295 -148407 -74303 52772 70836 -45607 47169 -37213 4318 -15450
17475 -15450 138840 260166 103328 112620 30766 -32076 11095 -35497 -74436 -76490 -47056
17464 -47056 -23463 -112537 -288598 -458399 -248282 -239520 -200377 -254244 -100881 -251192 -166758
17453 -166758 -74105 -195529 -110863 -55701 -150408 9807 193537 347327 540132 898868
17443 898868 1252828 2035681 2473192 2042064 1235319 625930 380343 324771 353637 -16232
17433 -16232 46451 164051 -19342 -70314 -144848 -14178 83977 -56114 -42431 -14677 -109349
17422 -109349 -155070 -106638 159377 151923 19781 -16362 99437 -220796 -262251 -239238 -244479
17411 -244479 -312854 -348824 -154195 -65949 -197311 -87172 -62973 -116485 -63961 -103662 -16935
17400a6935J23673O0711K1371n8681K40889Q886j39184j38554k21243o3404M5860
17389a36611j07409m2318n3092j05666L2334L41297q9456o2274P4101r9657j44223
17378c92974L9561J28748j8434r2340O3255J81302j06239q342P7375O7882R1015
17367C0809J19328J07427k24274l47488l8846l9965K19424K65480o7979K3015
17357D6931O3121L8854J03708J59991k23885m7109q9966j263o4006Q7257O4332
17346A37965r4071M1173j24987l33671r2399J91045L1783L7930Q8521j20802q8257
17335c25770J7506R6792R1786J2832m0321l3657Q9429K356q0295k1183k7575J01103
17323a16997J01570L4537J60094k71878k4256K11631J9484j57305p9273k56644
$$ plain form
17400 -16935 106738 167449 188820 130139 371028 379914 240730 102176 -119067 -182471 -136611
17389 -136611 -244020 -286338 -339430 -445096 -412762 -71465 -160921 -223195 -149094 -248751 -392974
17378 -392974 -353413 -224665 -243099 -335439 -272184 -90882 -197121 -205463 -128088 -60206 30809
17367 30809 150137 257564 33290 -314198 -353044 -393009 -173585 91895 23916 46931
17357 46931 110052 148906 252614 412605 188720 141611 51645 50382 -13624 73633 137965
17346 137965 43894 85067 -39920 -373591 -465990 -274945 -243162 -205232 -116711 -237513 -325770
17335 -325770 -308264 -211472 -119686 -106854 -147175 -180832 -91403 -89047 -169342 -190525 -218100 -116997
17323 -116997 -15427 19110 179204 -92674 -116930 94701 114185 -43120 -122393 -379037
17313c79037R9501P6628P5836J53j35100l2837M1520l5855j90254M0742j17021
17302e55724J1801J25320N6568J41143P4202o5206j35322m2013J58344j1261j76161
17291d18309M0149J04210O76K7435j6834k14366J17061J34306K46109K73895J00713
17280C95045j29199j98267k73199q3589m3903m1291L2865j54237q6998J84539
17270c98234K37876L7091q5215j6688j03009p5893Q3893J20763O82J14001J18841
17259C4108M536j87384q4224L6210R2617Q1312j26119N3819p1263m2799P6159
17248a33028Q85p7814P3276q7566j62521K7016K15536k56777o7632Q6806o0172
17237d41991j82678J63766R6716J50107O046m8631q5976J65048R0146P3021m0349
$$ plain form
17313 -379037 -279536 -202908 -127072 -126919 -262019 -294856 -253336 -289191 -479445 -438703 -555724
17302 -555724 -543923 -418603 -362035 -220892 -146690 -211896 -347218 -389231 -230887 -242148 -418309
17291 -418309 -378160 -273950 -273274 -245839 -262673 -477039 -359978 -225672 20437 294332 395045
17280 395045 265846 67579 -205620 -289209 -333112 -374403 -341538 -495775 -582773 -398234
17270 -398234 -160358 -123267 -208482 -225170 -328179 -404072 -320179 -199416 -198734 -84733 34108
17259 34108 38644 -148740 -232964 -196754 -104137 -22825 -148944 -95125 -166388 -209187 -133028
17248 -133028 -132143 -209957 -136681 -224247 -386768 -359752 -144216 -400993 -468625 -381819 -441991
17237 -441991 -624669 -460903 -364187 -214080 -208034 -256665 -342641 -177593 -87447 -14426 -54775
17226e4775J17632J53629m6825k61202j09051j41780l00604j31350j6778K74N0369
17215g40461J71668Q3244J74238K51919J56105J12599r5745j62977P9074J19368
17205A49032j22597l05744k8825L2188N0926k78770n8480J46655K40770K82660
17195A07815J45043r1125j48357k02661O2245K69317p4890q3875J23272J03793
17185B10577p8384l3652j69683j30563j58727J53743J14082R9180J01790k49256
17175a40893j42077p2510J43255O0417k6628J3398J04345j4925q7842K45410J0381
17164I2331q7631p4867j34388r080J47722N3452K420l8091j07152P0534j9275
17153a04025k0948N2759q6616J002K24025K21542j10997r3675O6817o7349k73039
$$ plain form
17226 -54775 62857 216486 169661 -91541 -200592 -342372 -642976 -774326 -791104 -790830 -740461
17215 -740461 -568793 -485549 -311311 -59392 96713 209312 113567 -49410 29664 149032
17205 149032 26435 -279309 -308134 -275946 -225020 -503790 -562270 -415615 -174845 107815
17195 107815 252858 161733 13376 -189285 -127040 142277 67387 -16488 106784 210577
17185 210577 132193 98541 -71142 -201705 -360432 -206689 -92607 6573 108363 -140893
17175 -140893 -282970 -355480 -212225 -151808 -178436 -165038 -60693 -75618 -163460 81950 92331
17164 92331 4700 -70167 -204555 -213635 -65913 -12461 -10041 -48132 -155284 -84750 -104025
17153 -104025 -124973 -72214 -158830 -157828 66197 287739 176742 83067 149884 82535 -190504
17142a90504J21369K35800k457r8294P1736K08711o9680l39141j59031O1815J82454
17131B2778K57627J73363k17558j63643k17532k19631P8989K89305j2508j98716
17121b07526j11508l6582l7148O3117R8202O2747o5756N1958J41555O6303r350
17110A6012K9660p67R3007j14435j00624J27719J05327O5132K0082O5839q8356
17099B18596k20916K2156K53191N1879L3737j97210m0554l69828Q6603K9469k43992
17088c76869j46196M8374Q1023L2519J0646L9433O8067J13337j40107q519o9063
17077c47355N0855J79146J6251j48168K7690N534j59585o637N9250Q6352K71128
17066C4461K13851j38889j75309k05185j26417K96992J2668l7051J17286J00790
$$ plain form
17142 -190504 -69135 166665 164208 65914 137650 346361 276681 -62460 -221491 -159676 22778
17131 22778 280405 453768 236210 72567 -144965 -364596 -285607 3698 -8810 -207526
17121 -207526 -319034 -355616 -392764 -329647 -231445 -168698 -234454 -182496 -40941 25362 16012
17110 16012 45672 44905 137912 23477 -77147 50572 155899 221031 241113 306952 218596
17099 218596 -2320 19836 273027 324906 358643 161433 120879 -248949 -162346 -132877 -376869
17088 -376869 -523065 -474691 -393668 -361149 -350503 -311070 -243003 -129666 -269773 -278292 -347355
17077 -347355 -296500 -117354 -101103 -249271 -221581 -216047 -375632 -382269 -323019 -236667 34461
17066 34461 248312 109423 -65886 -271071 -397488 -100496 -87828 -124879 -7593 93197
17056I3197O7477n4584r6516r0920J212K556J38243j565r5720O4828r5234p8890
17044a45916N9267k3328K11001q966j74195M1703o4554m0314r8321o4771j49368
17033d57762m043L62310J35663J21093L123M9008J02712k5336k45306k4150J05557
17022A22869j93610k3698L4826J27968l3782m0838n9948p9868j02166o4352q3871
17011c96470K48784L9958M4106P6550j5807q0721k7320P0905p2604K6567Q2570
17000c482m0737k2371O1054L0063j45945l77925k11771P3330J04635J56852j47565
16989e23862j451M297J22716k2263K33701J44502K08042j3871j73193N8168M7567
16978H4353q1136O0730n5684j19803K6161q0634m1688J66689n2048j69346M2865
$$ plain form
17056 93197 160674 106090 9574 -81346 -80134 -77578 60665 59100 -36620 28208 -67026 -145916
17044 -145916 -86649 -109977 101024 92058 -82137 -40434 -104988 -145302 -243623 -308394 -457762
17033 -457762 -461805 -99495 36168 157261 160384 209392 312104 286768 41462 17312 122869
17022 122869 -70741 -94439 -59613 68355 34573 -6265 -66213 -146081 -248247 -312599 -396470
17011 -396470 -147686 -107728 -63622 12928 -2879 -83600 -110920 -40015 -112619 -86052 -3482
17000 -3482 -44219 -66590 -5536 24527 -121418 -499343 -711114 -637784 -533149 -376297 -523862
16989 -523862 -525313 -521016 -398300 -420563 -186862 -42360 165682 151811 -21382 36786 84353
16978 84353 3217 63947 8263 -111540 -85379 -166013 -207701 -41012 -93060 -262406 -219541
16967b19541N4147M3930q0831j95422K15075j53566o4977M66K44775J21468j02381
16956a36857p7673J61649M7112j9778l10102L4293M2736Q3104M204j85012K49231
16945a07093q423p4408M1390M7549l0694j0038J24232J60073q8166j3639k20001
16934a79218p4734K58822J92256k03512n0017m7105k26986j40561J45469r8068
16924d23654P4576J02465j59407j87293n056J42747J28953M9854p0905J16500
16914b31220Q2763l5672J24937R2739j13943M8154r6230N5769O4728o1779n5579
16903a25333o6295J62355p36N9916o2083l2615j56984K1688P9697k53549K1698
16892c52241P9454O7770N6631n8744j29537J67175K60196Q8591j85348j63738
$$ plain form
16967 -219541 -165394 -121464 -202295 -397717 -182642 -336208 -401185 -400719 -155944 -34476 -136857
16956 -136857 -214530 -52881 -5769 -25547 -335649 -301356 -258620 -175516 -171312 -356324 -107093
16945 -107093 -115516 -189924 -148534 -100985 -131679 -141717 -17485 142588 54422 40783 -179218
16934 -179218 -253952 4870 197126 -6386 -56403 -103508 -330494 -471055 -325586 -423654
16924 -423654 -349078 -246613 -406020 -593313 -598369 -455622 -326669 -276815 -347720 -231220
16914 -231220 -148457 -184129 -59192 33547 -80396 -32242 -128472 -72703 -7975 -69754 -125333
16903 -125333 -191628 -29273 -30009 29907 -32176 -64791 -221775 -200087 -120390 -373939 -352241
16892 -352241 -272787 -205017 -148386 -207130 -336667 -169492 90704 179295 -6053 -169791
16882a69791p445n1928p1076J5673k6511m3245K11238J42870j99680k3813k5465
16871b49173J69388J43571j55198J96233K526j37939J13405o9665o9530j07477
16861a63859q9184J06162K0010j02698P4529L21294J54962l01340j97448J39228
16851c8344K12971j91988k1655J62414M4840k49144l5352j5675k87396O1675K79664
16840g7990q3518q6289n242l8292j25934o5130R2520M8959J26621N8014m4953
16829b01234j21282P9282o9585o3056K15783K97622J2753n7742P3561M3315q8640
16818A20777j43516l8104j02027J22430M9344j5709p5451j51056K1146j66073
16808c78239R1534J49692J63486J30645o1062r0250J8646K9243q7587j4667L3281
$$ plain form
16882 -169791 -177236 -229164 -300240 -284567 -311078 -354323 -143085 -215 -199895 -223708 -249173
16871 -249173 -79785 63786 -91412 104821 107347 -30592 82813 13148 -56382 -163859
16861 -163859 -253043 -146881 -126871 -229569 -155040 166254 321216 19876 -177572 -38344
16851 -38344 174627 -17361 -39016 123398 168238 -80906 -116258 -131933 -419329 -357654 -77990
16840 -77990 -161508 -247797 -253039 -291331 -417265 -482395 -389875 -340916 -214295 -156281 -201234
16829 -201234 -322516 -243234 -312819 -375875 -160092 137530 150283 92541 166102 209417 120777
16818 120777 -22739 -60843 -162870 -40440 8904 -6805 -82256 -233312 -212166 -378239
16808 -378239 -286705 -137013 26473 157118 96056 5806 24452 53695 -33892 -48559 -15278
16797a5278k15014j67333o3358J65150K83317J41143J1173j89625j26509P4261
16787a02073R0390J15471p3333m2639m4736Q3651J6464q8979r0238j16422j13622
16776c66066k50602o0413K03925J48425Q2558j7886L8991J81480J69583k4234
16766A05761K18342J18110j00164k13272M8640M8014j70341J11148L9053j63484
16756D1807L2488L393j89547q0418j5460J64593l6707j1609O4373j25014J86554
16745C4453l7460k21340k940J24122P5940O5139L6797m8258M3415r8314k12338
16734b40784J36929r00j10157K11231K27827l03977j56307J76226K04312Q1423
16724B25823J635r3541O805J73575m7379r5592P985r463j06343k0198j42127j158
$$ plain form
16797 -15278 -230292 -397625 -460983 -295833 -12516 128627 139800 -49825 -176334 -102073
16787 -102073 -11683 103788 30455 -12184 -56920 26731 43195 -45784 -136022 -252444 -366066
16776 -366066 -616668 -677081 -473156 -324731 -242173 -260059 -221068 -39588 129995 105761
16766 105761 324103 442213 342049 128777 177417 225431 55090 166238 205291 41807
16756 41807 74295 77688 -111859 -192277 -207737 -43144 -79851 -91460 -27087 -152101 34453
16745 34453 -3007 -224347 -227287 -103165 -27225 37914 74711 26453 69868 -28446 -240784
16734 -240784 -103855 -104755 -214912 -3681 224146 -79831 -236138 -59912 144400 225823
16724 225823 227458 133917 140722 314297 266918 171326 179311 169848 63505 43307 -98820 -99978
16712i9978Q4838J87397M8438j11240L00o4843k49582j02864J61177O1242Q0955
16701d160l5217N0438k3954j99697k21424K04038J25936O7559K2335J83826R2171
16690B61851j24736j42528j42961p4158J77640L8643J20556O981j98277r9634
16680a76623J94841J11805j042K8726J69093q3117m6626L12239k22866l60972
16670g4542j179K40316n5195n6929j45629p3000K7687J00115m4847o7593o0502
16659b11298j16044J69617J35530o3538J08623k717k69541N083J83441J66339
16649A05495o9714j90782o5574j14125J9305l5782J88046L4381J60025J74519
16639B05794o528l14442j86465r0101O5973J3469L62754L9601p7635L4521j81198
$$ plain form
16712 -99978 -15140 172257 220695 109455 109755 44912 -204670 -307534 -146357 -85115 -4160
16701 -4160 -39377 11061 -12893 -212590 -434014 -229976 -104040 -36481 -14146 169680 261851
16690 261851 137115 -5413 -148374 -222532 -44892 -6249 114307 121288 -76989 -176623
16680 -176623 18218 130023 128981 157707 326800 243683 197057 509296 286430 -74542
16670 -74542 -75721 164595 109400 52471 -93158 -166158 -138471 -38356 -83203 -150796 -211298
16659 -211298 -327342 -157725 -22195 -85733 22890 20173 -249368 -244285 -60844 105495
16649 105495 35781 -155001 -220575 -334700 -315395 -351177 -163131 -128750 31275 205794
16639 205794 199266 -115176 -301641 -391742 -325769 -312300 50454 90055 12420 46941 -134257
16628a34257j83481J86945L75600p832n7022k4329p2642j40499J16942J0714m2786
16617B7353p4611P0474r7448p041j04346R320k373j36432Q7045J29188L4127r2635
16605a57379r9530K5654R5629J53762n5437j0925m8091l1481R5690j08921M4618
16594i6411j1432k53297p1632J28054K69148J3705J115J65932J78497m168j02752
16583B16759j50197L9584l6590p1107P288K30934R3450l0467N2875m9747k68732
16572C4050k31909j07146K53589M2353l4734j59550J2607J77489P3875M9404J55150
16561B65178r5819m6118j32113l19496K3149m0056l3199J91498J56083j22705
16551a53598N4931l1176j67455r2672J26290J80335j43516n2438J93649K13930
$$ plain form
16628 -134257 -317738 -130793 244807 236975 179953 155624 82982 -57517 59425 70139 27353
16617 27353 -47258 23216 -74232 -81273 -185619 -176299 -178672 -315104 -228059 -98871 -64744 -157379
16605 -157379 -256909 -231255 -135626 18136 -37301 -48226 -96317 -127798 -32108 -141029 -96411
16594 -96411 -107843 -361140 -432772 -304718 -35570 -21865 -20750 145182 323679 319511 216759
16583 216759 66562 106146 69556 -1551 5737 236671 330121 299654 352529 302782 34050
16572 34050 -197859 -305005 -51416 -9063 -43797 -203347 -190740 -13251 60624 110028 265178
16561 265178 169359 123241 -8872 -328368 -305219 -345275 -378474 -186976 -30893 -153598
16551 -153598 -98667 -129843 -297298 -389970 -263680 -83345 -226861 -279299 -85650 128280
16541A28280P0218o0851r1882R7510q5828j49788j63958J23089r6034J95208M27491
16530C93455L7769j42059k32049k73373M2464J08757J3263j10350L9057K49025
16520A25959O9139p6496r2121J1524J678O0125P9590k96784j50108L08161J05391
16509A46058j50014P047r4951j34572L5816K3764k9023K46703J24836r6720k60014
16498a81070m4815P5130J32019R8527K9515Q6304J9453n6117P0196l3212r8284
16487I7646p6814j03901J22688J45979o1691k9320j05529n4145m1506p6388M0377
16476a42604p3385Q4945J44046J26728j38917j13616j24532J9087J10042J14534
16466F328K35728o9336k22375o0733n6554K07455J44135k4513k5282P1001J6227
$$ plain form
16541 128280 198498 137647 45765 143275 57447 -92341 -256299 -133210 -229244 -34036 393455
16530 393455 431224 289165 57116 -216257 -173793 -65036 -51773 -162123 -123066 125959
16520 125959 195098 118602 26481 38005 39683 99808 179398 -117386 -267494 40667 146058
16509 146058 -3956 3091 -91860 -226432 -190616 -166852 -195875 50828 175664 78944 -181070
16498 -181070 -225885 -150755 -18736 79791 109306 195610 215063 158946 229142 195930 97646
16487 97646 20832 -83069 39619 185598 123907 94587 -10942 -65087 -106593 -182981 -142604
16476 -142604 -215989 -131044 13002 139730 813 -112803 -237335 -218248 -108206 6328
16466 6328 242056 172720 -49655 -110388 -166942 40513 184648 160135 134853 205854 222081
16455B22081K0751k03329r1406j10269K9236j2964K13766J33655O3412n627n9323
16444A99983L0733j1106j91293k4417j48524k45102m7830J31428N9943j61226
16434d07411j21375K82242K75556l9576M0750Q0210q3797L0130m9365k62911J96658
16423e8889K62432P6297j588j25697o8894m1057R8575J52444l8180J15816j55481
16412B15778j09040k09357j45037J46916Q7805J86702J31729L2760p4057r2906
16402A71293l34890J09073K59073k8597J42277N5604k09538j69282J39719J37731
16392B72463J37668O1579j13805r0102l41182r4532J78985J20488j16920k1134
16382f492l1466J19691J95444n4596j28931n6927l4939m938k3608N8564M2205
$$ plain form
16455 222081 242832 39503 -51903 -162172 -132936 -145900 67866 201521 264933 259306 199983
16444 199983 230716 219610 28317 3900 -144624 -389726 -437556 -306128 -246185 -407411
16434 -407411 -528786 -246544 29012 -10564 30186 110396 26599 56729 7364 -255547 -58889
16423 -58889 203543 279840 278252 152555 83661 42604 141179 293623 255443 371259 215778
16412 215778 106738 -102619 -247656 -100740 -12935 173767 305496 338256 264199 171293
16402 171293 -163597 -54524 204549 175952 318229 373833 164295 -4987 134732 272463
16392 272463 410131 471710 357905 267803 -73379 -167911 11074 131562 14642 -6492
16382 -6492 -37958 81733 277177 222581 93650 36723 1784 -3154 -26762 31802 74007
16371G4007q4702k5416l6177r3369o2953K2753r6258R1646N1511J28603K63380
16360B33025O3286L461j38248j94911K683l6377k27157j6329O3838L0814P2275
16349a43640L08573O3221j07446j1353j42841o7989j46045o2410M0165K34177
16339c5588J92125p088j04972K55786R3365k48724k28529J60986j16319M4394
16329E436J40794P3369L8888j06180j24794J36659k4943m4102o0954J97280R251
16318B40704P8129n2683n5952m9075j1776l1935k728j9153o4124K6760O4270J09584
16306B32021j7279j81628m0419P7643j00609N9251N7763j09738J00926J44387
16296B22318P8465j81994J00741o5285K18030j72833k06680K9143J41813J87032
$$ plain form
16371 74007 -10695 -36111 -72288 -165657 -228610 -205857 -302115 -210469 -158958 -30355 233025
16360 233025 296311 299772 161524 -33387 -30704 -67081 -294238 -310567 -246729 -215915 -143640
16349 -143640 164933 228154 120708 109355 -33486 -101475 -247520 -309930 -269765 -35588
16339 -35588 156537 149449 44477 300263 393628 144904 -83625 77361 -38958 5436
16329 5436 146230 219599 258487 152307 27513 164172 139229 95127 34173 231453 240704
16318 240704 318833 266150 210198 161123 149347 117412 114684 95531 31407 58167 122437 232021
16306 232021 214742 33114 -7305 70338 -30271 28980 86743 -22995 77931 222318
16296 222318 300783 118789 219530 154245 372275 199442 -7238 21905 163718 350750
16286C50750N6261j96703k76424K58233J26847j37667k79326J07157k2864j34349
16276a48085O1194J85855Q6543J2556j74727k7537K58760J02365K6159n8295L841
16265C28629J3246R5923j49850k2844j0366j27754k1808J46036l5368Q887K17127
16254D41858k7159k58255j81404Q178J12644J85727n6053k51982j40519J07021
16244e9944k0086p3861p099M2365L2835J72484R491J21721R4449k08724J02283
16233B05914J81063J52012j75639l11733l7263J0752K49161J11393n6526r0785
16223B38349r5770J06770j23824j95173L5329J25334j60232K6009Q3188R756J6101
16212F5837J97444P4235n7678M7059J06493j15713r1090R066j70067l0878k1401
$$ plain form
16286 350750 407011 210308 -66116 192117 318964 181297 -98029 9128 -13736 -148085
16276 -148085 -86891 98964 185507 198063 23336 -4201 254559 356924 383083 324788 328629
16265 328629 341875 437798 287948 265104 254738 126984 105176 251212 215844 224731 441858
16254 441858 414699 156444 -24960 -16782 95862 281589 225536 -26446 -166965 -59944
16244 -59944 -80030 -153891 -160990 -118625 -85790 86694 96185 217906 312355 103631 205914
16233 205914 386977 538989 363350 51617 14354 25106 274267 385660 329134 238349
16223 238349 142579 249349 125525 -69648 -34319 91015 -69217 -43208 39980 49736 65837
16212 65837 263281 337516 279838 326897 433390 317677 226587 235653 65586 34708 13307
16201A3307q9357Q2129J03185J29305P6938M7275k76925p1344J6237l7133r0194
16190i6577j7718n8365P9212O3494L313M4670O4260J70995o2224j2941q6626m5906
16178D5587J00479P4557J61747M1685j11702k95028P0099J08983N8027j06441
16168A47993l0731L0633J6312N4823K1052m7090K05596J12014j97360k80998j18919
16157h6675Q6310k2852j9379J34373m250O9216Q8711j95011N8376N2591N8201
16146B19611k18450K3249j5294j10048K22198K12808k33339l16854r7756K26362
16136h7513K3671j61525j01363P5955J33120K1526r8874q435R0822J1161l3699
16125a35154j9562P1269J31123j2555J10464j53509j62709j6394N2963J68587
$$ plain form
16201 13307 -76050 6079 109264 238569 315507 362782 85857 14513 30750 -6383 -96577
16190 -96577 -114295 -172660 -93448 -29954 -26641 18029 82289 253284 191060 178119 91493 45587
16178 45587 146066 220623 382370 424055 312353 17325 87424 196407 254434 147993
16168 147993 117262 147895 164207 219030 240082 192992 398588 510602 313242 32244 -86675
16157 -86675 -365 -23217 -42596 91777 87527 156743 245454 50443 108819 161410 219611
16146 219611 1161 24410 9116 -100932 121266 334074 100735 -216119 -313875 -87513
16136 -87513 -63842 -225367 -326730 -250775 -117655 -96129 -195003 -203438 -112616 -101455 -135154
16125 -135154 -154716 -83447 47676 35121 145585 -7924 -170633 -187027 -134064 34523
16115C4523q6120n228j8575o3288P1706j13651J24019J5601Q3684j26652j30306
16104b14287K46204R8582Q1718J08336M0749J02961K02941j52925j70909j18037
16094B25333K1431m6172k29747j64393r8397N6750J98616R9957r278j81698n0559
16083a78157j05828J17022R6747K47930j41639l34662J10167K68985j15037l2998
16073f7470L44928J68149k01898j72975k03062o2573q1246m9688r3307J3929J78982
16062b26231N3662J63343J67264k4836r3150j23937L4551M357N8090Q003j9182
16051A934O7995P0099m3540J52977O71j26035P2450O5041j18108L6267p2425q9946
16039A7380O3994n8203o9277m4533J3834K26605k6316j93550q6917m6456K36221
$$ plain form
16115 34523 -51597 -56825 -75400 -138688 -66982 -180633 -56614 -41013 42671 -83981 -214287
16104 -214287 31917 130499 212217 320553 361302 464263 667204 514279 343370 225333
16094 225333 246764 200592 -29155 -193548 -291945 -235195 -36579 63378 54100 -127598 -178157
16083 -178157 -283985 -166963 -70216 177714 36075 -298587 -188420 80565 -34472 -67470
16073 -67470 277458 445607 243709 70734 -132328 -194901 -276147 -325835 -419142 -405213 -226231
16062 -226231 -172569 -9226 158038 133202 40052 -83885 -49334 -44977 13113 21116 1934
16051 1934 69929 140028 96488 249465 250136 124101 196551 261592 143484 179751 107326 17380
16039 17380 81374 23171 -46106 -90639 -76805 149800 123484 -70066 -156983 -203439 32782
16028C2782J43842J5558m2748J9618j18318L8536p7501K9284Q6845m4550J25p7424
16016F049n9857j1397k3573L3366J09585m1814J85495P4209K544M9349o4435k72633
16004a3112j87716Q3514k8257j62849r4558p535J34413K69261J91071J64133J01759
15993D50124l7149O545j31434k49241J7738J61412j6740j19137l2224j09857p3475
15982a33438Q7908J05588n7843N2526M2268j40939l2377q3981L0978P4853m7766
15971a02223n3940J69176J42456j08066k70804K4717K30925Q8641p3071M1783
15961H9594k8362m9751M9071l6161J65965Q6481l3645k37456j34143O4316K14591
15950A50500Q7595k02041j96653N0933l1134m2453k1425n1956J75595K15374p6403
$$ plain form
16028 32782 176624 192182 149434 169052 50734 89270 11769 41053 127898 83348 83473 6049
16016 6049 -53808 -65205 -88778 -55412 54173 12359 197854 272063 274607 323956 259521 -13112
16004 -13112 -200828 -117314 -145571 -308420 -402978 -410513 -276100 -6839 184232 348365 450124
15993 450124 412975 419520 288086 38845 56583 217995 201255 82118 49894 -59963 -133438
15982 -133438 -45530 60058 2215 54741 97009 -43930 -76307 -160288 -129310 -54457 -102223
15971 -102223 -156163 13013 155469 47403 -223401 -198684 32241 120882 47811 89594
15961 89594 61232 11481 60552 24391 190356 276837 243192 5736 -128407 -64091 150500
15950 150500 238095 36054 -160599 -109666 -140800 -183253 -204678 -256634 -81039 134335 57932
15939E7932j17671J12694J9964o5732j91954M4281Q4976K40478q7587j06267K02790
15928A93904J08189k76031j36841O5889J92207J2276j57620L6369K1306J03545
15918A63193K36913n4496J6271j36393P601j24153n1669k8252j29518q2310j6817
15907a99630o6072p1890J2107K3925J54656K10123J43096J9854j4566l8864p2396
15896A00343N3835q0780j87040j0170K39594R0606p3622o1691M3063J9997J65508
15885B99643l1368k16704j20381j08214p3915j30502K40908J62540J52903M6892
15875B21802M0664l0696j23136k8233K82563J84102r2321R1975N2115n6859j76497
15864C65479l5741j61208Q7651o4941M8910k741n7413M8242J39671K833k0071
$$ plain form
15939 57932 -59739 52955 72919 7187 -184767 -140486 -55510 184968 97381 -8886 193904
15928 193904 302093 26062 -110779 -44890 147317 159593 1973 38342 59648 163193
15918 163193 400106 345610 361881 225488 233089 108936 57267 29015 -100503 -182813 -199630
15907 -199630 -265702 -337592 -325485 -301560 -146904 63219 206315 226169 211603 172739 100343
15896 100343 154178 73398 -113642 -123812 115782 206388 132766 71075 114138 134135 299643
15885 299643 268275 51571 -68810 -177024 -250939 -381441 -140533 22007 174910 221802
15875 221802 262466 231770 108634 80401 362964 547066 454745 546720 598835 541976 365479
15864 365479 329738 168530 256181 191240 240150 237409 179996 228238 367909 370742 350671
15853C50671J89251j82240m4783j40734j58234p306k4200J10088q1101k56569
15843b45157q5817J56576P0629K13099L8751j0237k5746j1277k06816M167j68747
15832b70575J00011R5133J91261K05394J8743j25314k21365k08710j07631K7608
15822b95445N6797M2278J33293P6883o006j7040j53216p1020J140J10217n1867
15811a73986j28235R2295K1701j6207Q1577K36845k2270j71153N9857P5277p5738
15800b0037J488R0781O9318K20136l8674q1428j67364j5884m9723J16862Q996
15789A34471J27798J11653p9647k76539L62P3452p2659q1258l1032N6113p0176
15778a07462P6525J60877K9712J28851o0354j07889n1502J06175J05739j57068
$$ plain form
15853 350671 539922 357682 312899 172165 13931 6625 -17575 92513 11412 -245157
15843 -245157 -330974 -174398 -103769 109330 148081 137844 112098 100821 -105995 -101828 -270575
15832 -270575 -170564 -75431 115830 321224 339967 214653 -6712 -215422 -323053 -295445
15822 -295445 -238648 -196370 -63077 13806 7800 -9240 -162456 -233476 -232336 -122119 -173986
15811 -173986 -302221 -209926 -188225 -204432 -122855 113990 91720 -79433 -19576 55701 -20037
15800 -20037 -18549 72232 141550 361686 323012 241584 74220 58336 8613 125475 134471
15789 134471 262269 373922 294275 17736 18098 91550 18891 -62367 -93399 -37286 -107462
15778 -107462 -30937 129940 159652 288503 228149 120260 68758 174933 280672 123604
15768A23604o7495m6082J57298P4314n4331k4381j46986L42k5285j16888j12869
15757b38759M4629m5722O9532Q9026j24922j9106O0344j30549L1485J6659J73826
15746g3557K15314L4377o0792r0245J14956p5899j24736R2012l3703j52496J10532
15735d4237J46432N9379k1858n49l7873J84484J1288j88351m2751j26641k1315
15724h1992K75156l0648j68397p1595K17645J27451j92769q4990M0463p2674R7927
15713E5577j9021o6670P8961J37474P4233j70705j10338J33208J05350j59101
15703E8968p456J45738k41050k45034K12929J12281p5299M3330K51120p6096o6905
15692A12526k7842p8264o4348J00162N2441J0852J25721m4301j05365L0269J01674
$$ plain form
15768 123604 56109 10027 167325 241639 187308 162927 15941 16283 -9002 -125890 -238759
15757 -238759 -194130 -239852 -170320 -81294 -206216 -225322 -164978 -295527 -264042 -247383 -73557
15746 -73557 141757 176134 115342 25097 140053 64154 -60582 31430 -2273 -154769 -44237
15735 -44237 102195 161574 139716 139167 101294 285778 297066 108715 65964 -60677 -81992
15724 -81992 193164 162516 -5881 -77476 140169 267620 74851 -10139 30324 -42350 55577
15713 55577 36556 -30114 48847 186321 260554 89849 -20489 112719 218069 58968
15703 58968 51512 197250 -43800 -288834 -75905 36376 -38923 4407 255527 179431 112526
15692 112526 84684 6420 -57928 42234 94675 105527 231248 186947 81582 111851 213525
15681B13525o5526O678K88Q0671j09685N6290p935j2638m1324l9439J40601J89260
15669D10766J00678j24664k17799j33834J08082p0353M8668O838J21396R594O7877
15658C27249j0267j01585k63010j50258K07640J65837o4089j03973j10441r9930
15648b02827j35617L5977j4087K4027J23395k1097k0336J30731K8507J22518J40666
15637B11857J11059j85577l47846Q8324K13780K8888p3784q0587K7768J08501
15627A02383Q0003j37921j09142K38459L1569j17040r441j54019k09515J13022
15617a71642R3020P2474j74808J92794K63694j35292l65876k19164J22758k780
15607c24822O5768L9J18923Q6782j20916N8628J80337j79230p3975N7892O7851
$$ plain form
15681 213525 147999 154677 154965 235636 125951 182241 174306 161668 120344 80905 221506 410766
15669 410766 511444 386780 168981 35147 143229 72876 121544 128382 249778 259372 327249
15658 327249 316982 215397 -47613 -197871 9769 175606 111517 7544 -102897 -202827
15648 -202827 -338444 -302467 -316554 -292527 -169132 -190229 -210565 -79834 -51327 71191 211857
15637 211857 322916 137339 -210507 -122183 91597 120485 46701 -33886 -6118 102383
15627 102383 182386 44465 -64677 173782 205351 88311 78870 -75149 -284664 -171642
15617 -171642 -78622 -6148 -180956 11838 275532 140240 -225636 -444800 -322042 -324822
15607 -324822 -259054 -259015 -140092 -53310 -174226 -115598 64739 -114491 -188466 -130574 -62723
15596f2723p8250j2948J0858m9157L3024j2030M2601O7346J88152R8974o6J7107
15584B42888P9553j11134j83052J68766J47056k0973n4846j04487k01803k161
15574d0193K565J09042J27632r5496K3646j7680q4189J23832j21798l8790J94091
15563A82662j14907o3254r0641L3771J9366j33374o4141J65601Q5248P6658J30051
15552B27040J00827k06759j88117R8675Q0227M2142K635j65386o9981N7147K90194
15541B68644j32701j4187O0641j19847l7041k9590o6402k28528r6722r3589K20136
15530b69186M16073J01357j84305o3074P643J94572K36729o7845p4979j15060
15520A81925l1825L2521L5079l4897r6480K7046j4213J4278j20670P345p8873
$$ plain form
15596 -62723 -140973 -153921 -143063 -192220 -159196 -171226 -128625 -61279 126873 225847 225781 242888
15584 242888 322441 211307 28255 197021 344077 323104 268258 163771 -38032 -40193
15574 -40193 -37628 71414 199046 103550 127196 109516 25327 149159 27361 -11429 182662
15563 182662 67755 4501 -86140 -52369 -33003 -166377 -230518 -64917 20331 96989 227040
15552 227040 327867 121108 -67009 31666 111893 154035 156670 -8716 -78697 -21550 268644
15541 268644 135943 121756 182397 62550 25509 -4081 -70483 -299011 -395733 -489322 -269186
15530 -269186 146887 248244 63939 865 8508 203080 439809 371964 296985 181925
15520 181925 150100 182621 217700 182803 86323 113369 99156 113434 -7236 109 -78764
15509g8764J12472J50144P6243J406j17358R3229J90594K4224r9275k31305L9352
15498A60962J60169J13159n2673M2828j31581l6433o7232j79746J25183P9939
15488B14575j19916J67998j1847j19316m7823J26369m360R2326L6326k7411K7047
15477C33968J5913j0187n9831p7574O638J19933P8601O9377J0967j25590Q775
15466C70990j34434j35219P2226l6148q1873J25422K56909n5528p3478j04452
15456B04415l6698o8120Q1765K48151m6050j64379j19486k819P0287P2539n1718
15445A87887R1222J67617l1730n7621j9444O7315K24899j48701k55323p9985M3774
15434A89910l7343j60898j24590J35525K13159Q3304J79503K0593r1533k43504
$$ plain form
15509 -78764 33708 183852 260095 261501 144143 237372 427966 452190 352915 121610 160962
15498 160962 321131 434290 381617 424445 292864 256431 189199 9453 134636 214575
15488 214575 94659 262657 250810 131494 83671 210040 205680 298006 334332 306921 333968
15477 333968 349881 339694 279863 202289 208927 328860 407461 476838 487805 362215 370990
15466 370990 236556 101337 173563 137415 55542 180964 437873 382345 308867 204415
15456 204415 167717 99597 181362 429513 383463 219084 99598 96779 167066 239605 187887
15445 187887 279109 446726 414996 357375 337931 405246 630145 481444 226121 146136 189910
15434 189910 152567 -8331 -132921 2604 215763 299067 478570 499163 407630 164126
15424A64126j09154N5758l7714J06569o2254j03514N105m7367n9734n0300R8737
15413c9742k3243O1059J33744m6075j42905K03784K95527n4428k83464j14983
15403a0726J42823Q9022j58586k9911P6473J27098J84514J09403l3569k09996
15393B86545j04606o408R6727L3493k5160m7806m3630j76867J08899J34697j69103
15382H6781J1363j0969J3582r8391n5406L2906J50116o0882n5840n3970l9920
15371h0630J24443J45195j01571P8886q363k5981P7594M8681P309K05081M8500
15360E19144j53717q1647j7400r3509j04402Q4673P3794P33j0767q2585K2464
15349A56781J36717q7719J35171R9072N0867M6991L1838N1560k0771j64654j39805
$$ plain form
15424 164126 54972 110730 73016 179585 117331 13817 18922 -28445 -88179 -138479 -39742
15413 -39742 -62985 -1926 131818 85743 -57162 146622 442149 387721 104257 -10726
15403 -10726 132097 221119 62533 32622 109095 236193 420707 530110 496541 286545
15393 286545 181939 175531 272258 305751 280591 232785 189155 12288 121187 255884 86781
15382 86781 98144 87175 100757 2366 -53040 -20134 129982 69100 13260 -40710 -80630
15371 -80630 43813 189008 87437 166323 157960 131979 209573 258254 265563 470644 519144
15360 519144 365427 283780 266380 172871 68469 153142 226936 227669 216902 134317 156781
15349 156781 293498 205779 340950 440022 490889 537880 569718 621278 600507 435853 296048
15338B96048o0314l79324N4095K18849P7462k64l7746L4432M8244K15280M5079
15327E11841r5721J2399J16119j77209k05186j28663m897J05469P5885J00868
15317C10905J19646Q1959l1213P2345J3495q1916R5593k46063k86609k4489J77369
15306B01022J30730O3678r4361k10J34077J4885M6392q7728k78552j62306R5740
15295F3367Q4295j17659K11619J13030M468l1930l78J42528L8434k75383J07752
15284C40143J06733P9973l0716j90275M1787j32751K5554l4505P9758K97573M4698
15273F27972Q9253L4803j88345j98368j68688K0687k5136p3922j40740L6236P4939
15262H8691Q4148j00174n6738K52123N8973m4090j62473o9128L21218M41080k9950
$$ plain form
15338 296048 235734 -143590 -89495 129354 206816 206552 168806 203238 251482 466762 511841
15327 511841 416120 428519 544638 367429 162243 33580 28683 134152 210037 310905
15317 310905 430551 512510 481297 553642 567137 485221 580814 334751 48142 23653 201022
15306 201022 331752 395430 301069 300859 434936 449821 496213 408485 129933 -32373 63367
15295 63367 147662 30003 241622 354652 359120 327190 326812 469340 507774 232391 340143
15284 340143 446876 526849 496133 305858 347645 214894 240448 205943 285701 583274 627972
15273 627972 717225 752028 563683 365315 196627 217314 192178 118256 -22484 13752 88691
15262 88691 172839 72665 15927 268050 327023 282933 120460 51332 372550 813630 783680
15251G83680j96207k88475J40241J19955n6972l4336j00645J66003P7966P055
15241F18265j29003k49851j12034l033J50591J39479K4026k83760j69062O8603
15231E4221l9606K13298K32154Q0289L3924k01820q5444k1285J33071o8132n5573
15220B75097m2832j13947k98782j36233j0270J82083K2028k3745P2882j5741R8716
15209I256q9977O6182M6195p1087J10808R750k13485J15004J35346j3292j65217
15198f0517j79068N0882K55390r0989J67696K67633o6561q5803j42355j24702
15188h394J15824j49173j02957L1065J7920J24210J29185K1806j86614J41555
15178A34427J45070n581p790M4328r1270M459m3740m5584j0927P7270M0550p7056
$$ plain form
15251 783680 587473 298998 439239 559194 502222 467886 367241 533244 611210 618265
15241 618265 489262 239411 127377 124344 274935 414414 438440 154680 -14382 54221
15231 54221 14615 227913 460067 540356 574280 372460 287016 265731 398802 330670 275097
15220 275097 232265 118318 -180464 -316697 -326967 -144884 -122856 -146601 -73719 -89460 9256
15209 9256 -80721 -14539 31656 -39431 71377 81127 -132358 -17354 117992 104700 -60517
15198 -60517 -239585 -188703 66687 -24302 143394 411027 344466 258663 116308 -8394
15188 -8394 107430 -41743 -144700 -113635 -95715 28495 157680 179486 -7128 134427
15178 134427 279497 273916 266126 310454 219184 223643 179903 134319 123392 200662 241212 164156
15166A64156l210o8912m9603M4939J9021r3044o1130K18990k456J06670Q0820
15155C56241p6231l4943j45699q1131J3230J19160P3737L9353r5900O8707O927
15144B43451l57629o0639J56999O7276M6800j04461j48124L7166J21770K46364
15134B48973M3108p6959k22988m8979R7411q735o9298K3910k7163m8739j16796
15123b06255K61548J39556k19019k22430k03156j62701l9722J90026L55613P9169
15113b7371k7441j41148j753P8246J23627J58397q5408r9265p1405Q1068J25319
15102A12866K48338j5183k4749j19009k27895n9079j42044N7957J98589J17808
15092A47599M2243N298K0193N7884j25030k13530n0758P6280j11180m6599J21634
$$ plain form
15166 164156 160946 92034 42431 87370 106391 13347 -47783 171207 168751 275421 356241
15155 356241 280010 245067 99368 18237 31467 150627 224364 263717 167817 236524 243451
15144 243451 -114178 -174817 -17818 49458 96258 -8203 -156327 -119161 2609 248973
15134 248973 292081 215122 -7866 -56845 40566 31831 -37467 -13557 -40720 -89459 -206255
15123 -206255 55293 194849 -24170 -246600 -449756 -612457 -652179 -462153 -106540 -27371
15113 -27371 -54812 -195960 -197713 -119467 4160 162557 77149 -22116 -93521 -12453 112866
15102 112866 361204 346021 321272 202263 -25632 -84711 -226755 -168798 29791 147599
15092 147599 189842 195140 215333 273217 148187 -65343 -116101 -39821 -151001 -197600 -75966
15081g5966k84785j21968K10988n7552O1405q151K72987K23909j29098n3872k35461
15070a97564o4465K30550L6966J12923j03537q5608j43995N3473o9053J31414
15060i8896k2509j9492J94910J08933k12546l03070K5006r0723m4654m1492J21195
15049c83338N2977O3075O5220q3304J01121N8801m2438j37107J39290Q5448k276
15038h2531K81144j0885j92063L786m6425o3350J29126J87647j79396j78793J15247
15027c6493j45284o9106K08166j33523O0336N1212m6562P7268r064o7603J52455
15016D1802J94646j07114j25659k3060q1145P3888J7288k75515P0105J98896K05556
15005A89688K6787K7649k0107j7955q5017p6627k09396P0823J20012m4160L4111
$$ plain form
15081 -75966 -360751 -482719 -271731 -329283 -267878 -276029 -3042 220867 91769 37897 -197564
15070 -197564 -262029 -31479 5487 118410 14873 -70735 -214730 -161257 -230310 -98896
15060 -98896 -121405 -140897 54013 162946 -49600 -352670 -327664 -418387 -463041 -504533 -383338
15049 -383338 -330361 -267286 -202066 -285370 -184249 -125448 -167886 -304993 -165703 -80255 -82531
15038 -82531 198613 187728 -4335 -549 -46974 -110324 18802 206449 27053 -151740 -36493
15027 -36493 -181777 -250883 -42717 -176240 -115904 -64692 -111254 -33986 -43050 -110653 41802
15016 41802 236448 129334 3675 -19385 -100530 -26642 -9354 -284869 -214764 -15868 189688
15005 189688 216475 244124 224017 206062 121045 44418 -164978 -94155 25857 -18303 15808
14994A5808p4511R7854L13441p760k88502k00794L7434J18299J82048k03224l5735
14983d5642j1608j46515J54662J99718J19286j96943j51854N1037K05416M7406
14973B24963k38578K02410k613j14671J16546J60653j40328p5558K7259J59568
14963C19651q9621n2181j13802p6236q6033J40802K0506n5335j24628Q6949j38096
14952a68024Q8234J53251J59929j49698j10576o3154K28527k0511J8927j38805
14942a900j36098K08103J25444J62147N9501K311l75552k16617J9690J21044J27055
14931I5128K42890j0047k07944j20797l7547J45937k59551k28380R4883j194K01619
14920h5003J88370l8636l1496l3150J59355R7061k75595J3716J79699J06841M1687
$$ plain form
14994 15808 -58703 39151 352592 344832 56330 -144464 -107030 11269 193317 -9907 -45642
14983 -45642 -57250 -203765 -49103 150615 269901 72958 -78896 -27859 177557 224963
14973 224963 -13615 188795 186182 71511 188057 348710 208382 132824 160083 319651
14963 319651 230030 177849 64047 -12189 -98222 42580 63086 7751 -116877 -29928 -168024
14952 -168024 -79790 73461 233390 83692 -26884 -90038 138489 117978 136905 -1900
14942 -1900 -137998 70105 195549 357696 417197 419508 43956 -172661 -152971 -31927 95128
14931 95128 338018 327971 120027 -770 -38317 107620 -151931 -380311 -285428 -286622 -85003
14920 -85003 103367 64731 33235 85 159440 256501 -19094 -5378 174321 281162 322849
14909C22849j91431k89916P7096p6296j20172j1121N4178J17343l8782J48835
14899g417P3835k83323n9343K51085L49561j39899n8453r7684r4824o9527j04721
14888b40710k50852L8817J38783j48636P3268j05270j3677L02952J04682j06836
14878b07479j01582K53350K76073k4399k3770l0811j09578p2976O4813j80146
14868a56505J30223P2785P8963j29765r6622j22164r4862K7390l1929J69985j09591
14857b62092N5602L3470K41966J36082j32519R0448m8965j47864k3804l5162K4998
14846f7840K51810K01418k2644M8937L755j45924r8574j69396l6926Q7529K58520
14835C10665j08703R4226o3998j75617j66103K8229J64244P6051k61388k53866
$$ plain form
14909 322849 131418 -158498 -81402 -157698 -277870 -288991 -234813 -117470 -156252 -7417
14899 -7417 66418 -216905 -276248 -25163 324398 184499 126046 28362 -66462 -135989 -240710
14888 -240710 -491562 -452745 -313962 -462598 -389330 -494600 -508277 -205325 -100643 -207479
14878 -207479 -309061 -55711 220362 195963 172193 141382 31804 -41172 23641 -156505
14868 -156505 -26282 46503 125466 -4299 -100921 -223085 -317947 -290557 -322486 -152501 -262092
14857 -262092 -206490 -173020 68946 205028 72509 162957 113992 -33872 -57676 -92838 -67840
14846 -67840 183970 385388 362744 411681 415436 269512 170938 1542 -35384 52145 310665
14835 310665 201962 296188 232190 56573 -109530 -81301 82943 158994 -102394 -356260
14825c56260O9686J38668j807K011j5408n9433J00635o7359j43929J24273J60507
14814d8416m9512j15497L1372J353J8705j07132n8398J45859K00619L1391K45969
14803B96313j53528j55962j9156R2223O4685p416j0940m3786j02197j54341J0584
14792a83521J844J59869l1564n3872m9965R0752l6818q7167N3432L9991l083r6098
14780a96200j08075M1101R7283q0650p8111j3497K73747J66407K04836j90677
14770A16164k46868m1502m8588J63951K0269q9676R7686K53097j27854j15711
14760a9032O8643J63421J73473p8469j01560P2099M2897J47437n0376l04861l8051
14749G5621r62j59394q7260j77627P2796J82345K38442P7142j05424k64227k7741
$$ plain form
14825 -356260 -286574 -147906 -149713 -147702 -163110 -222543 -121908 -189267 -333196 -208923 -48416
14814 -48416 -97928 -213425 -182053 -180700 -161995 -269127 -327525 -181666 18953 50344 296313
14803 296313 142785 -13177 -32333 59890 124575 117159 106219 62433 -39764 -194105 -183521
14792 -183521 -181677 -21808 -53372 -107244 -157209 -66457 -103275 -190442 -137010 -97019 -100102 -196200
14780 -196200 -304275 -263174 -165891 -246541 -324652 -338149 -64402 102005 306841 116164
14770 116164 -130704 -172206 -220794 -56843 -36574 -126250 -28564 224533 96679 -19032
14760 -19032 49611 213032 386505 308036 206476 278575 321472 468909 418533 113672 75621
14749 75621 74659 -84735 -171995 -349622 -276826 -94481 143961 221103 115679 -148548 -176289
14738a76289K56193j44408k50958j12183l1964J40237J05364P3491J10574n9464
14728h9407j42776J3091J69668K48772O1926o5218n7824L6495nk11776l29617
14717c66671q7181Q1164J30227K15769o2246J00436K03311J12145l26287j57013
14707a56346M2172n485l8148p833K21493k9919n4973L4572N165j3394J903m78
14695a271m637j00995M0724o6852j80756j49279P4637l4355K4411J02919J34919
14684a60535J70234j1649l4060J55909P2356m9415n6317q302L6962j19334k36726
14673b40877j1751j9001Q0974J78874o3273K7536K83799J4156J08527J87704j80256
14662C66412o3220k43405j03923p0654j19266j20322l0596K51950J93622j94541
$$ plain form
14738 -176289 79904 -64504 -315462 -427645 -459609 -319372 -214008 -140517 -29943 -89407
14728 -89407 -232183 -219092 -49424 199348 261274 196056 138232 174727 174722 -37054 -366671
14717 -366671 -453852 -372688 -242461 -26692 -88938 11498 214809 326954 667 -156346
14707 -156346 -114174 -119659 -157807 -165640 55853 25934 -29039 5533 10698 -2696 -793 -1271
14695 -1271 -5908 -106903 -66179 -133031 -313787 -463066 -388429 -422784 -398373 -295454 -160535
14684 -160535 9699 -1950 -36010 119899 192255 142840 86523 78221 115183 -4151 -240877
14673 -240877 -252628 -271629 -190655 -11781 -75054 -47518 236281 250437 358964 546668 366412
14662 366412 303192 59787 -44136 -114790 -234056 -354378 -384974 -133024 60598 -133943
14652a33943j18302K0849K46747K6393p1190k8561L1946J43961Q011j08730k3756
14641f575k8191k6340j26735J407Q7479q2009o0785Q0859O9115O1397M66M586
14629b5326j46386k11068q6087J10706K33260J22786J92002J9009K73277n2623
14619D29550j39679J4177l9019j61907k54997r6956K06006j29042p3967J05792
14609a40042J7315q1683j5745M9721J65432L804j75648l04891o67K98248k4073
14598b08229J1532K47512O8967q6060J06877R460n3253J07254J98968R6986k05148
14587B94866m3697m174m2100j5429m6206m9152J16732M6404J64401K35604o4451
14576E92798l12835l31403j42184k3223p9834l1253k0549K40244J18543j20309
$$ plain form
14652 -133943 -252245 -231396 15351 41744 -29446 -58007 -26061 117900 125911 17181 -6575
14641 -6575 -34766 -61106 -187841 -186434 -98955 -180964 -241749 -160890 -91775 -30378 -29912 -25326
14629 -25326 -171712 -382780 -468867 -358161 -124901 -2115 189887 208896 482173 429550
14619 429550 289871 304048 265029 103122 -151875 -248831 -42825 -171867 -245834 -140042
14609 -140042 -122727 -204410 -220155 -170434 -5002 -1198 -176846 -481737 -482404 -184156 -208229
14598 -208229 -196697 50815 119782 33722 140599 150059 96806 204060 403028 500014 294866
14587 294866 251169 246995 204895 189466 143260 94108 210840 257244 421645 657249 592798
14576 592798 279963 -51440 -193624 -216847 -296681 -327934 -348483 -108239 10304 -110005
14566a10005l7989L3683J91685Q1673K3567l6417m0086J5030k84555j89940K56771
14555i6583p1353j12790J94313n6397K5012P5987o9335K3564n4396K835K01924
14544F2781L9951r4128p4901j4595N3983n0780k1968j03347m9151p2200l6087
14533c60442L29270J16369k96769l04851Q7001K21130R716o105P2835K6002J34304
14522B8460K38786Q1261j06048k9681p17j35466l77700j44718J42245K42027P3692
14511A2141O9189O9481j2483j60556j4613P6818k5340K17965r4744n524j7278
14500A15056j53749K2024N1329q327j55455l61591R401M32980J64919j12240j32001
14489a27654k56179j00866L7103L3492K40780J9907O274J16364k4640K17609J24459
$$ plain form
14566 -110005 -147994 -114311 77374 159047 182614 146197 106111 121141 -163414 -353354 -96583
14555 -96583 -167936 -280726 -86413 -142810 -117798 -41811 -111146 -87582 -141978 -139143 62781
14544 62781 102732 8604 -66297 -80892 -26909 -77689 -99657 -203004 -252155 -324355 -360442
14533 -360442 -31172 85197 -211572 -516423 -429422 -208292 -198576 -204681 -131846 -105844 28460
14522 28460 267246 348507 242459 212778 212061 76595 -301105 -445823 -303578 -61551 12141
14511 12141 81330 150811 138328 -22228 -36841 39977 14637 232602 137858 132334 115056
14500 115056 -38693 -16669 34660 26333 -129122 -490713 -481312 -48332 116587 4347 -127654
14489 -127654 -383833 -484699 -447596 -414104 -173324 -153417 -147143 -30779 -55419 162190 286649
14478B86649k08214j70974j533P2190j0886K0441k8067K9336K38004m8176k07833
14467b9063O861l7814P8205J60690L2317p2205o0089M4903M2595l27236J0510
14456a50326R4774M1291J86523K4698k90151n0431Q7927J54J73063j51714j18824
14445a53016M5702N8759J58683j3611j00880Q5730N2439j21680Q7758k618k19102
14434a21836m1055J25374J20509O5475j80409j58260j54652J53890j2860K24292
14424B0468J08346m5054J4966m3333o1596J08995J7351J78203J6028k72116k38807
14413a96549j10850J25087m5099P7770J01455J15539J67421j33168j8382J13257
14403A96481k55653j99160L8544k4546j06479K1721J14259p812J881K5773p8645
$$ plain form
14478 286649 78435 -92539 -94072 -21882 -32768 -12327 -40394 -11058 226946 178770 -29063
14467 -29063 -22202 -60016 18189 178879 211196 138991 78902 123805 166400 -160836 -150326
14456 -150326 -55552 -14261 172262 196960 -93191 -143622 -55695 -55541 117522 -34192 -153016
14445 -153016 -107314 -48555 110128 96517 -4363 81367 133806 12126 99884 97266 -121836
14434 -121836 -162891 -37517 82992 148467 -31942 -190202 -344854 -190964 -203824 20468
14424 20468 128814 83760 98726 55393 -6203 102792 120143 298346 314374 42258 -196549
14413 -196549 -307399 -182312 -227411 -149641 -48186 67353 234774 101606 83224 196481
14403 196481 -59172 -258332 -219788 -244334 -350813 -329092 -214833 -222645 -220764 -194991 -273636
14392b73636J52806J40295O677k04861k47123k0535J47504K59673N2395j20557
14382a07362m7222j6081J26906o9971j15912L61177P3814l09648j6731J37385
14372A6355q4098L5806K01608J06504J88933O2284j48270k22898J54806O1449
14362C72479j34221j75804M3559j80767k54729J54424K14125O776o5501m9350
14352f9009K15897J73642J07687N7317J0198k91031r7248j27472k40316j05862
14342c66197J99483K4486K1888r5790J50192O7671j003j20649J26088J5921q9199
14331f7109q3926k7393J64314K41890j93268j90313J80396Q9327p6160K8288q2620
14320a6574l1185j7171R9274m514j90739q1688o5647K77338J20700K3588J26721
$$ plain form
14392 -273636 -120830 19465 26142 -178719 -425842 -446377 -298873 -39200 13195 -107362
14382 -107362 -154584 -170665 -43759 -113730 -229642 131535 205349 -104299 -121030 16355
14372 16355 -67743 -31937 169671 276175 465108 527392 379122 156224 311030 372479
14362 372479 238258 62454 106013 -74754 -329483 -175059 39066 45842 -19659 -69009
14352 -69009 146888 320530 428217 485534 495732 204701 107453 -20019 -260335 -366197
14342 -366197 -166714 -142228 -120340 -216130 -65938 1733 730 -119919 6169 22090 -67109
14331 -67109 -151035 -178428 -14114 227776 34508 -155805 24591 113918 37758 66046 -16574
14320 -16574 -47759 -64930 34344 29830 -160909 -242597 -308244 -30906 89794 113382 240103
14309B40103j9773j10572k1198J66594R8040j48426j66208p5581k70141r0656
14299c97818J9350K26493m3602m7409J29283K16466L4014N2684l7109o029k42664
14288i6341j08433J11450J92430r5660M8674k10307N6567j4498q5662j25686l5376
14277c62842m9799O2953J76109K11672J30536q6832L2176k0658j57758j89679
14267b54122J99802P8193K349M3086l9324Q3760R6255M6488J4132R994n0958L9852
14255B69507M1486k12108j11441Q3033m610J14058n2589J0743J51006r5320j21880
14244G1885P8194j9355k48294o2059K22237K02826J20108j53621k92622k22470
14234c03171o202M2203J93553J29089j24661R1335L6922n2019j18522j85654j89280
$$ plain form
14309 240103 220330 109758 88560 255154 353194 204768 38560 -37021 -307162 -397818
14299 -397818 -378468 -151975 -195577 -242986 -113703 102763 136777 189461 152352 146323 -96341
14288 -96341 -204774 -93324 99106 3446 52120 -158187 -101620 -116118 -201780 -327466 -362842
14277 -362842 -412641 -349688 -173579 38093 168629 81797 113973 93315 -64443 -254122
14267 -254122 -54320 23873 26222 69308 29984 113744 209999 256487 270619 280613 229655 269507
14255 269507 310993 98885 -12556 70477 65867 179925 127336 138079 289085 193765 71885
14244 71885 150079 130724 -117570 -179629 42608 245434 365542 211921 -80701 -303171
14234 -303171 -309373 -267170 -73617 55472 -69189 22146 59068 7049 -111473 -297127 -486407
14223d86407J11191L7233K30045R8892k09960l1989q9150J05427j16454J87192
14213a63980K10814j31328Q2918K45213K9098j21241j84114p8625o3843L6778
14203a38310K2264J13161J51044J35350j38692j13141j90314M4669j39320j23043
14193c76332m954J52689l5630N2068L2013j0113N9887J13861J15061m4386j06342
14182e2178l0284J62062K82684j80951j08044l5361k3669M9720K30500K37332
14172E31811J9124j82392j60037j85322K8572J30506J75598j24527j33541k4764
14162G5028j40611n047J12612J18120P840O8231J21900n2911M7710k37506o3047
14151E2319J00960r1452j45553N1904K30065q6285k69191k01699M0285J45099
$$ plain form
14223 -486407 -375216 -337983 -107938 -9046 -219006 -250995 -340145 -234718 -351172 -163980
14213 -163980 46834 -84494 -1576 243637 272735 151494 -32620 -111245 -175088 -138310
14203 -138310 -116046 -2885 148159 283509 144817 31676 -158638 -113969 -253289 -376332
14193 -376332 -381286 -228597 -264227 -212159 -180146 -190259 -130372 -16511 98550 54164 -52178
14182 -52178 -82462 79600 362284 181333 73289 37928 14259 63979 294479 531811
14172 531811 550935 368543 208506 23184 51756 182262 357860 233333 99792 75028
14162 75028 -65583 -70630 41982 160102 167942 236173 358073 305162 352872 115366 52319
14151 52319 153279 61827 -83726 -31822 198243 111958 -157233 -358932 -318647 -173548
14141a73548J08491l8704m5j9050L5410j1287Q2753J59395n1735j37285j13994
14130a59599m6342J31406j03498O0729Q4575J18030J4883j06411r3479J5125J78622
14119I4041p5245n1619J54320N3575j28507J92605K35511p8078j27162m5969q5581
14108A37891J93563K9476k28336j31245Q3521k8281Q1334L6747j43210p1317r9504
14097a39361M6708J31894k7473j755k6792J01000j23559j1007j86753P0569N4421
14086a12108o0699P2971J58941J13260l7298k6268k64897j78280q2239O5700J53072
14075a97845J6186k6530j07095M1626N8490M5224p14L7106L8396j25855j32139
14064c53150J82979O9494j73444m5737M4448j63875n6874K84717O9436M8565j9333
$$ plain form
14141 -173548 -65057 -103761 -103806 -122856 -87446 -98733 -15980 143415 91680 -45605 -159599
14130 -159599 -205941 -74535 -178033 -117304 -32729 85301 100184 -6227 -99706 -84581 94041
14119 94041 18796 -32823 121497 175072 46565 239170 474681 396603 269441 223472 137891
14108 137891 331454 360930 132594 1349 84870 56589 137923 174670 31460 -39857 -139361
14097 -139361 -92653 39241 11768 10013 -16779 84221 -39338 -50345 -237098 -166529 -112108
14086 -112108 -172807 -99836 59105 172365 135067 108799 -156098 -334378 -416617 -350917 -197845
14075 -197845 -181659 -208189 -315284 -273658 -215168 -169944 -170658 -133552 -95156 -221011 -353150
14064 -353150 -170171 -100677 -274121 -319858 -275410 -439285 -496159 -211442 -142006 -93441 -112774
14053a12774k3153N7852K16105r1174m3375n587Q6611O9924j13042q5591j23448
14042a67652o7614R813J61239K36762o4342J22189j15305q4120k05934L1246j07333
14031b51051j01765J68142L64323J88945j42471k7056M1614j3931k28956n9817
14021f2023K03052m8963j54238m0184R2276m1477K19871J83220O753j11902j23741
14010A22644m6183o2782N4955J03456j38568j56569J50882J95618R4161j29341
14000A88273l3542o8232P902j6989J24r908k1782q767J04880j05368j13912l593
13988h0914L1445J7764M6458N8322l5284j24049q6157J65712O2474j86835j00269
13977b31333o3179J29465K70757R0271R5868K20562l4854j71095k4457j58134
$$ plain form
14053 -112774 -135927 -78075 138030 46856 3481 -2106 84505 154429 41387 -44204 -167652
14042 -167652 -235266 -225453 -64214 172548 108206 230395 115090 30970 -174964 -143718 -251051
14031 -251051 -352816 -184674 179649 368594 226123 199067 240681 226750 -2206 -62023
14021 -62023 141029 92066 -62172 -102356 -10080 -51557 168314 351534 358287 246385 122644
14010 122644 76461 13679 68634 172090 33522 -123047 27835 223453 317614 188273
14000 188273 154731 86499 94401 77412 77536 67628 45846 37079 141959 36591 -77321 -80914
13988 -80914 -49469 -31705 14753 73075 37791 -86258 -172415 -6703 55771 -131064 -231333
13977 -231333 -294512 -165047 105710 195981 291849 512411 477557 306462 282005 123871
13967A23871j99997J01779K42658j01146n0720q193J52111Q4814l1325m3480q0140
13956A90232o6167k7499N3918j31683l8998j38925l01140j61714K5525K55822
13946c40629J346J42735R7390M0467j00162j29307O3779R3264J25734K9231j25127
13935a01279j56310l56293R2133J89416J26800J60317q0609Q229o6746R4890J57446
13924F7994L3753K7873j48379p8560J04225k085j87609P3985j3264L4398J38023
13913E0354o1847p4853L8439k95399J73755J05099m7868j82025O6749K54775R5773
13902A22952l0235r0928N7629j12516r0276K9657j79883J45714J59480J12446
13892A24040M2909j40816J83151q7280j10242n4717J72693J15257j00747J09110
$$ plain form
13967 123871 -76126 25653 268311 167165 116445 108252 260363 345177 313852 270372 190232
13956 190232 124065 96566 150484 18801 -20197 -159122 -460262 -621976 -596451 -340629
13946 -340629 -339283 -196548 -99158 -58691 -158853 -288160 -224381 -131117 -5383 23848 -101279
13935 -101279 -257589 -613882 -521749 -332333 -205533 -45216 -125825 -117596 -184342 -89452 67994
13924 67994 101747 129620 -18759 -97319 6906 4821 -182788 -108803 -122067 -87669 50354
13913 50354 -11493 -86346 -47907 -343306 -169551 -64452 -112320 -294345 -227596 27179 122952
13902 122952 92717 1789 59418 -53098 -143374 -113717 -293600 -147886 11594 124040
13892 124040 166949 26133 209284 122004 11762 -42955 129738 244995 144248 253358
13882B53358j41535j30217K6184j03588j21519k21183K09278K56098L8600o8805
13872c329O4022j0853q0759l5874l0837j21258j8797l1210J38031l2178j00348
13861b63390r9545j81K56664J18981J8963j45374j76575J4556L2382Q6489q7515
13850b44545j2597R421O7452m3371j96775O1130K59697L05530n045j2413j14514
13839G3970R1578L2322q0121n7696N6903j8897L2219O243q4072N3623L3734M7077
13827A86883k7312J22355k013j25600j06908P5095p980P4346O8483M4375q3831
13816B17893j13739J53287k2893j31860p5242j82277M1580p2721q1874J38373
13806a29473J49840J43488r0306o0989R8941j2743m1212j07938j84251m5394p8173
$$ plain form
13882 253358 111823 -18394 7790 -95798 -217317 -438500 -229222 26876 65476 -3329
13872 -3329 60693 49840 -30919 -66793 -97630 -218888 -237685 -268895 -130864 -163042 -263390
13861 -263390 -362935 -363116 -106452 12529 31492 -113882 -290457 -275901 -243519 -157030 -244545
13850 -244545 -257142 -247721 -180269 -223640 -420415 -359285 -99588 205942 200897 188484 73970
13839 73970 165548 197870 117749 60053 116956 98059 130278 136521 52449 106072 139806 186883
13827 186883 159571 281926 279913 154313 47405 122500 114520 188866 257349 301724 217893
13816 217893 104154 257441 234548 102688 27446 -154831 -113251 -185972 -267846 -129473
13806 -129473 20367 163855 73549 12560 111501 98758 57546 -50392 -234643 -280037 -358210
13795c58210N7179R9723L0605Q3300Q3568J52383k05885k03707O053J8960J41987
13784i4044J63569P9256L2458m4132j17152m2763n2496P7561J78349o7257j81606
13773f8257O0601k6725m2627n2468M776m7995N9586O0205p3445L8659R0034L6016
13761C8360n3983R2497p9455j8073m7774j57421k19880R2897J97422K78185P8061
13750B00836o3930J1182j54674J12197j18746j36140K34458P4071q8883q2538
13740a2167j75406j0334m814K1503o2067k1772j24990M2178K21056J80082L5153
13729H8422K28520k1008j41704k15621N690J19475J54326o901n7907Q0799k93610
13718e9519j74970r329J93053R104m8858P741J34969o5817j66281j18320N2477
$$ plain form
13795 -358210 -301031 -201308 -170703 -87403 -3835 148548 -57337 -261044 -254991 -236031 -94044
13784 -94044 69525 148781 181239 137107 19955 -22808 -75304 2257 180606 113349 -68257
13773 -68257 -7656 -34381 -77008 -129476 -124700 -172695 -113109 -52904 -126349 -87690 2344 38360
13761 38360 -15623 76874 -2581 -20654 -68428 -225849 -445729 -352832 -155410 122775 200836
13750 200836 136906 148088 -6586 105611 -13135 -149275 85183 159254 70371 -12167
13740 -12167 -187573 -197907 -202721 -181218 -243285 -265057 -390047 -347869 -126813 53269 88422
13729 88422 316942 295934 154230 -61391 -55701 63774 218100 211199 153292 234091 -59519
13718 -59519 -234489 -243818 -50765 -41661 -90519 -82778 52191 -13626 -179907 -298227 -245750
13707b45750O015R4101P76J040j23834j99737J23397L08979J01935j22487j66720
13696b22285j44408J32226J09129J0377K4314J23308M9067O1998j39946j99455
13686a95675K66186o0034k38263k952j8991K43479Q8353r2116j93047m9654P6356
13675a76358J44697M4280K45584J72005l35598r8522O1905m6215j7877k927j30808
13664a39834J11596J25687p8545J43071j6468p6067n2964J15835J44320p0210
13654B06421p4826m5320j1007k24392j00723N3105j0419M6721R2375K99267J93941
13643D25143n9154k18349L3518M1693p7638j18813J12755L39807j86460k47779
13633D4723K7291O5713N2058M0193N5246r4487J16233J73J43975r2343k6030J43488
$$ plain form
13707 -245750 -239735 -145634 -144858 -143818 -267652 -467389 -343992 -35013 66922 -55565 -222285
13696 -222285 -366693 -234467 -125338 -114961 -90647 32661 81728 143726 3780 -195675
13686 -195675 70511 10477 -227786 -230738 -249729 -6250 82103 -10013 -203060 -252714 -176358
13675 -176358 -31661 12619 258203 430208 94610 -3912 57993 11778 -6099 -9026 -139834
13664 -139834 -28238 97449 18904 161975 145507 69440 16476 132311 276631 206421
13654 206421 131595 86275 75268 -149124 -249847 -196742 -207161 -160440 -68065 231202 425143
13643 425143 365989 147640 181158 222851 145213 26400 139155 478962 292502 44723
13633 44723 72014 137727 189785 229978 285224 190737 306970 307143 451118 358775 332745 476233
13621D76233M663j39645j06011M7651M2441K509j15126q649o8197o4403O9614
13610A41080j70484L020J89009Q1783q9739J28251l9788j85055m9722J00151K67800
13599C76306J54025k7294j08667q3033j79263k37121j12565j12636J67915O8275
13589i4058K7029M4113K02622j29415q0948M8029N8207m0458j77891P1316l1354
13578a02808l896J29826J46647k5394M8629n8501j45331O2963j13653N3823L3314
13567B5619j34580m9985O8848K46869j3661p3140k71229r8305J61402J56316r8070
13556g9916j18241K7023K74084O7848k09169l66137j46224L5205K37246M16113
13546A37832N9837K0755j29025Q4213j18901p3573J21823l8659J14035p0019p3965
$$ plain form
13621 476233 480896 341251 235240 282891 325332 327841 212715 204066 135869 71466 141080
13610 141080 -29404 -26384 162625 244408 154669 282920 243132 58077 8355 108506 376306
13599 376306 530331 503037 394370 311337 132074 -105047 -217612 -330248 -162333 -94058
13589 -94058 -67029 -22916 179706 50291 -30657 17372 75579 35121 -142770 -71454 -102808
13578 -102808 -106704 23122 169769 144375 193004 134503 -10828 52135 -61518 -7695 25619
13567 25619 -108961 -158946 -90098 156771 143110 69970 -201259 -299564 -138162 18154 -79916
13556 -79916 -198157 -171134 102950 170798 -38371 -404508 -550732 -515527 -278281 137832
13546 137832 197669 218424 89399 173612 54711 -18862 102961 64302 178337 108318 34353
13535C4353n057J44914K59933m8948j19587J7182Q4363j74313j21017k2923j40008
13524i1108l3479j10214L5368K6568J05241M7509j76765j39830j3697J04562J35815
13513a10030J3696M3584j43761n6289J98062m7327k5126K1994J13415n9111j20946
13502a71839K03317L49323N8927j47434j75927k24124j80192J98489p7824O2096
13492a05188R0100L568j98176K3269O2033k294J8913m2719K5705O2276j87261
13481b49774l5436P4819k3064R4404L1885M8236m2055P4172Q0109J53396O471
13470B13163k09287j40470j2004J75441K8405J80909J00871j72398j99925o7719
13460a03014q1233R0333J04242K2019j84241P8408K60226P7854j11887j49028
$$ plain form
13535 34353 29296 174210 434143 385195 265608 282790 367153 192840 71823 48900 -91108
13524 -91108 -124587 -234801 -199433 -172865 -67624 -20115 -196880 -336710 -350407 -245845 -110030
13513 -110030 -96334 -52750 -196511 -252800 -54738 -102065 -127191 -105197 8218 -50893 -171839
13502 -171839 31478 380801 439728 292294 116367 -107757 -287949 -89460 -167284 -105188
13492 -105188 -15088 -11520 -209696 -186427 -124394 -126688 -107775 -150494 -124789 -62513 -249774
13481 -249774 -285210 -210391 -233455 -139051 -107166 -58930 -100985 -26813 53296 206692 213163
13470 213163 3876 -136594 -148598 26843 55248 236157 337028 164630 -35295 -103014
13460 -103014 -184247 -93914 10328 32347 -151894 -73486 186740 264594 152707 3679
13450C679k60366L7236P0272R6208P4765m5754j4923L0405j00918J25356J45512
13439A61472K3013j3150o9693n2834J29998k34389J0965Q4605J15006J5586j96834
13428b6255j80782K9373p6450k32333J27748K05431O0153j05218j70835Q5350
13418b83818P6034k6461R2864Q7510L7238j22235j13985k07041j4414J10377K20429
13407a43502n0099K09976P5162K1019P5307J68973N4366j92615M772j14349j20971
13396a1961j26907q9274k7962P2053j52476J35009K57666J90830O3873k56322
13386E4529k44547M4493J70494N5704J4812j44787k25488J04743K08906n87N3514
13375I1786K4492m1531m3942o8461j15611j4594J27920R3440k55022j48764k3105
$$ plain form
13450 3679 -256687 -219451 -149179 -52971 21794 -23960 -38883 -8478 -109396 15960 161472
13439 161472 184485 171335 101642 48808 178806 -55583 -44618 39987 154993 170579 -26255
13428 -26255 -207037 -177664 -254114 -486447 -358699 -153268 -93115 -198333 -369168 -283818
13418 -283818 -207784 -234245 -141381 -53871 -16633 -138868 -252853 -459894 -474308 -363931 -143502
13407 -143502 -193601 16375 91537 112556 187863 356836 411202 218587 223359 109010 -11961
13396 -11961 -138868 -228142 -256104 -184051 -336527 -201518 56148 246978 310851 54529
13386 54529 -190018 -145525 24969 80673 95485 -49302 -274790 -170047 38859 38272 91786
13375 91786 116278 74747 30805 -37656 -153267 -167861 -39941 53499 -201523 -350287 -373392
13364c73392J45468J22398j25862J12485L7421j69362j57830j54936K14521J32420
13354b16669p5371j54897n0959L53843N02047n9305k00567P2296j61280L3863
13344D3001R1680l81016k65280K34166K35580l2578K7413j13958m2507O1478j04819
13333b46840O7325J34646N3184j8921q1859L9217n0593J64940J28407j48719n2480
13322a1693l32026l3987J44070J50066J67983J9390j9455j7114j15269m6569R2999
13311a605J7245k7127Q1533J90382J6732j70675q2081J52j83461q5938j33551
13300c78394L13057L91593j3555k12150n5548n7553J2918j0159j92164r2661m3751
13289c38367K51630J23197n4827j38912L3401K06712K2590Q9719J45209R07k50699
$$ plain form
13364 -373392 -227924 -105526 -231388 -118903 -81482 -250844 -408674 -563610 -349089 -216669
13354 -216669 -292040 -446937 -497896 -144053 357994 298689 98122 170418 9138 43001
13344 43001 134681 -246335 -511615 -277449 -41869 -74447 -47034 -160992 -203499 -142021 -246840
13333 -246840 -179515 -44869 8315 -10606 -92465 -53248 -103841 61099 189506 40787 -11693
13322 -11693 -343719 -377706 -233636 -83570 84413 103803 84348 67234 -48035 -94604 -1605
13311 -1605 15640 -11487 70046 260428 277160 106485 24404 24556 -158905 -244843 -378394
13300 -378394 -65337 326256 312701 100551 45003 -12550 368 -9791 -201955 -294616 -338367
13289 -338367 -86737 36460 -18367 -157279 -123878 82834 105424 195143 340352 341259 90560
13278I0560Q0254L17550N6636p8371j79243k51916l63683j9213O4411N1304J18888
13267a12823J26694k54936k34540K50652K73339O6437J05654j07079O0732l8783
13257A35347n8735J6332k0639j51392p0019K13025m3410j25282M4573J40671K29795
13246C10266j04195l25800K6684l7007J76537j22383p6441L596j78717k32419
13236e59879Q9858K10591j22111J36422o9889r5949R3623J36577J76375q6095
13226i0477r1098J36836j13021P2866P3751j33889j49160M3926P8792j11492Q6879
13215a96087K10747j21212p3511J99911J74376k0683n4149P8934P3440j07482
13205A64284j56424j25667N832r341J16261R0986m2034K0422n6641J51961J64850
$$ plain form
13278 90560 170814 488364 545000 466629 287386 35470 -328213 -347426 -283015 -231711 -112823
13267 -112823 13871 -241065 -475605 -224953 48386 114823 220477 113398 174130 135347
13257 135347 76612 92944 72305 -79087 -149106 63919 20509 -104773 -60200 80471 310266
13246 310266 206071 -119729 -93045 -130052 46485 -75898 -152339 -148743 -327460 -559879
13236 -559879 -470021 -259430 -381541 -245119 -315008 -410957 -317334 -180757 -4382 -90477
13226 -90477 -181575 -44739 -157760 -84894 -11143 -145032 -294192 -250266 -171474 -282966 -196087
13215 -196087 14660 -106552 -180063 19848 194224 173541 119392 198326 271766 164284
13205 164284 7860 -117807 -111975 -121316 -5055 85931 43897 64319 7678 159639 324489
13194C24489l2829j95448j5693j40887k6871J68567k22955j40407J21654K2538
13184a37842R7007k2648j39246R521j12749j05552j17076J24826M2175M0136K97705
13173b3743J66121n5806n8049j50350j69437N2947J1269K74056K29604J95709
13163D72321j84458j92390j71511k2509M8588m3963l19390L1264K68796Q1181
13153c2071O3827j7194j17845Q2168P8955K255P2136J31884l9112j06109o5411
13142E3483k4954j01290l2171P9642P4601L1037O6821M0629r939m5752J11853
13131B43960L1075k00398j25071k5751R0471N6699K74415J10131r4604j07348
13121B53579K4211j69910k67795j72347p7323J89849M5045K30383M8259K2076
$$ plain form
13194 324489 291660 96212 80519 -60368 -87239 81328 -141627 -282034 -160380 -137842
13184 -137842 -40835 -63483 -202729 -193208 -305957 -411509 -528585 -403759 -361584 -321448 -23743
13173 -23743 142378 86572 28523 -121827 -291264 -238317 -227048 47008 276612 472321
13163 472321 287863 95473 -76038 -98547 -49959 -93922 -413312 -382048 -113252 -32071
13153 -32071 31756 14562 -103283 -21115 57840 60095 132231 264115 225003 118894 53483
13142 53483 28529 -72761 -104932 -25290 49311 80348 147169 187798 177859 132107 243960
13131 243960 275035 74637 -50434 -76185 14286 70985 345400 455531 360927 253579
13121 253579 277790 107880 -159915 -332262 -409585 -219736 -174691 55692 103951 126027
13111A26027r4160j89932K9752J46350J19143p863K7099j50056j51566j88207
13101c33413J6675J82927O3303j56946k12919J66692J32966R6993m390N1473Q9382
13090I2743M0070l8085P5868n981j00281j68670j81303j97809n8342K18086J04576
13079b19128n4706L6065O7J34354L1588p7684j69616J40326L7289j16775J56148
13068a02072k7667P260r5095j63165K9181K13371O0515J22998K7619j01855r0953
13057a19863Q8646P5473n8122K3387o9478J26119J28894K0780P2183j52965l00093
13046a65039j03639J36419N9785J9405k6654j81319N3788J49329l5564r8288j07733
13035b99510L11997L14761o2577l08157k11J31741J49079q5791j91194M4999k657
$$ plain form
13111 126027 31867 -158065 -128313 18037 137180 129317 156416 6360 -145206 -333413
13101 -333413 -316738 -133811 -70508 -227454 -440373 -273681 -140715 -43722 -48112 3361 92743
13090 92743 132813 94728 170596 164615 64334 -104336 -285639 -483448 -541790 -323704 -219128
13079 -219128 -273834 -237769 -237702 -103348 -71760 -149444 -319060 -178734 -141445 -258220 -102072
13068 -102072 -129739 -122479 -217574 -380739 -351558 -138187 -77672 45326 72945 -28910 -119863
13057 -119863 -31217 44256 -13866 9521 -59957 66162 195056 215836 288019 135054 -165039
13046 -165039 -268678 -132259 -72474 -53069 -79723 -261042 -207254 -57925 -93489 -191777 -299510
13035 -299510 12487 327248 264671 -43486 -43697 88044 237123 151332 -39862 5137 2480
13024B480j60696n0843o7742o6986N8872K53923M0499l6644K3745N5372j46323
13013i4343k27638J30875J16655L9071M1594j60356o0840l307O0190R7026p5499
13002a36572k40851J75874J01235j23598j48404J44523L98522k6646j14427N2813
12992H2469j19932n9415K8506O1947M2365Q3169J07241M8668J37384l80842j67738
12981a36178O3405j4704n9051k3414L264o281K28914J56838r7855L4678J41987
12970B91603O6612k7519j30609k69457R7374M0371k4963k07114j43151J00430
12960b06423K15427j13863J07989R1857L2011k71527j33954O0995J94299J72942
12950A49753K2459o090j11848j33609l2863M557N7298K06792J49560j50728r8708
$$ plain form
13024 2480 -158216 -209059 -276801 -343787 -284915 -30992 9507 -27137 -3392 51980 -94343
13013 -94343 -321981 -191106 -74451 -35380 6214 -154142 -214982 -218289 -158099 -61073 -136572
13002 -136572 -377423 -201549 -100314 -223912 -372316 -227793 170729 144083 29656 82469
12992 82469 -37463 -96878 -68372 -6425 35940 119109 226350 275018 412402 31560 -136178
12981 -136178 -72773 -87477 -146528 -169942 -166678 -172959 55955 212793 114938 149616 291603
12970 291603 358215 330696 200087 -69370 28004 68375 43412 -163702 -306853 -206423
12960 -206423 9004 -104859 3130 94987 126998 -144529 -278483 -217488 -23189 149753
12950 149753 172212 166122 54274 -79335 -112198 -107641 -50343 156449 306009 155281 56573
12939E6573j43787N2719k48039L6477K27655J81206l1857m6919J37259J163k9042
12928A93408r4828K534j40152j75853m500K5180P1099Q5868m6463j4618J03255
12917D930L06036n173L0632k49592p9708J47036J8780q2030j01829j31920N6160
12906h6678q8083j98324j64321l7710J30920J79621Q4849m399M1749J5296K74532
$$ plain form
12939 56573 -87214 -34495 -282534 -246057 -18402 162804 130947 84028 221287 222450 193408
12928 193408 98580 101114 -39038 -214891 -219391 -194211 -123112 -37244 -83707 -98325 4930
12917 4930 310966 305793 336425 86833 7125 154161 172941 90911 -10918 -142838 -86678
12906 -86678 -174761 -373085 -537406 -575116 -444196 -264575 -179726 -184125 -142376 -127080 147452
$$ [...]
##END NTUPLES=NMR SPECTRUM
##END=
