##TITLE=Analysis number 328341
Compound Code cc 56303
Book Reference 513/76/31
Project Code adrs
Chemist Name ronp
##JCAMPDX= 6.0         $$ Bruker NMR JCAMP-DX V2.0
##DATA TYPE= NMR SPECTRUM
##DATA CLASS= NTUPLES
##ORIGIN= Bruker BioSpin GmbH
##OWNER= nmr
$$ XWIN-NMR		Version 3.5
$$ Tue May 29 08:51:37 2007 GMT Daylight Time (UT+1h)  MAYBRIDGE\nmr@NMR_250MHZ
##.OBSERVE FREQUENCY= 250.131544655141
##.OBSERVE NUCLEUS= ^1H
##.ACQUISITION MODE= SIMULTANEOUS (DQD)
##.ACQUISITION SCHEME= undefined
##.AVERAGES= 16
##.DIGITISER RES= 18
##SPECTROMETER/DATA SYSTEM= dpx250
##.PULSE SEQUENCE= zg30
##.SOLVENT NAME= CDCl3
##.SHIFT REFERENCE= (INTERNAL, CDCl3, 0, 16.522)
##AUDIT TRAIL= $$ (NUMBER, WHEN, WHO, WHERE, WHAT)
$$ ##TITLE= Audit trail, XWIN-NMR		Version 3.5
$$ ##JCAMPDX= 5.01
$$ ##ORIGIN= Bruker BioSpin GmbH
$$ ##OWNER= nmr
$$ C:\u/data/dgb/nmr/ADRS/1510/pdata/1/auditp.txt
$$ ##AUDIT TRAIL=  $$ (NUMBER, WHEN, WHO, WHERE, WHAT)
(   1,<2007-05-29 08:51:14.02 +100>,<MAYBRIDGE\nmr>,<NMR_250MHZ>,
      <created by zg, POWCHK disabled, PULCHK disabled
       configuration hash MD5:
       76 6E 9A 78 1E 09 19 81 EC 84 63 8F B0 6A 59 2D
       data hash MD5: 64K
       8B 41 74 5F C5 5F 98 2D D4 88 D2 86 9A 81 B5 4C>)
(   2,<2007-05-29 08:51:27.64 +100>,<MAYBRIDGE\nmr>,<NMR_250MHZ>,
      <Start of raw data processing
       ef LB = 0.3 FT_mod = 6 PKNL = 1 SI = 32K 
       data hash MD5: 32K
       94 BE 31 E1 C8 61 42 41 09 FA EC DA 89 D9 E2 E0>)
(   3,<2007-05-29 08:51:29.53 +100>,<MAYBRIDGE\nmr>,<NMR_250MHZ>,
      <apk 
       data hash MD5: 32K
       BC 8D BC 4D 8E D8 51 14 E4 37 4A 07 8C C0 5F 5E>)
(   4,<2007-05-29 08:51:30.31 +100>,<MAYBRIDGE\nmr>,<NMR_250MHZ>,
      <abs ABSG = 5 
       data hash MD5: 32K
       36 05 C1 17 03 CB 81 AB 04 3F D8 21 F1 AB 57 B2>)
$$ ##END=
$$ 
$$ hash MD5
$$ 6E A7 98 ED A1 E6 99 37 0D 20 07 7F 4E A6 78 48
##$RELAX= 
##$RELAX= 
##$RELAX= 
##$RELAX= 
##$RELAX= 
##$RELAX= 
##$RELAX= 
$$ Bruker specific parameters
$$ --------------------------
##$DU= <C:\u>
##$EXPNO= 1510
##$NAME= <ADRS>
##$PROCNO= 1
##$TYPE= <nmr>
##$USER= <dgb>
##$AMP= (0..31)
100 100 100 100 100 100 100 100 100 100 100 100 100 100 100 100 100 100 
100 100 100 100 100 100 100 100 100 100 100 100 100 100 
##$AQSEQ= 0
##$AQ_mod= 3
##$AUNM= <au_zg>
##$AUTOPOS= <2 >
##$BF1= 250.13
##$BF2= 250.13
##$BF3= 250.13
##$BF4= 250.13
##$BF5= 500.13
##$BF6= 500.13
##$BF7= 500.13
##$BF8= 500.13
##$BYTORDA= 1
##$CFDGTYP= 0
##$CFRGTYP= 5
##$CHEMSTR= <none>
##$CNST= (0..31)
1 1 145 1 1 1 1 1 1 1 1 1 1 1 1 1 1 1 1 1 1 1 1 1 1 1 1 1 1 1 1 1 
##$CPDPRG= <>
##$CPDPRG1= <>
##$CPDPRG2= <>
##$CPDPRG3= <>
##$CPDPRG4= <mlev>
##$CPDPRG5= <mlev>
##$CPDPRG6= <mlev>
##$CPDPRG7= <mlev>
##$CPDPRG8= <mlev>
##$CPDPRGB= <>
##$CPDPRGT= <>
##$D= (0..31)
0 1 0 0 0 0 0 0 0 0.06 0 0 0 0 0 0 0.0002 0 0 0 0 0 0 0 0 0 0 0 0 0 0 
0 
##$DATE= 1180425072
##$DBL= (0..7)
120 120 120 120 120 120 120 120 
##$DBP= (0..7)
150 150 150 150 150 150 150 150 
##$DBP07= 0
##$DBPNAM0= <>
##$DBPNAM1= <>
$$ [...]
##$SUBNAM7= <"">
##$SUBNAM8= <"">
##$SUBNAM9= <"">
##$SW= 20.6930455092707
##$SWIBOX= (0..15)
0 0 3 0 0 0 0 0 0 0 0 0 0 0 0 0 
##$SW_h= 5175.983436853
##$TD= 65536
##$TD0= 1
##$TE= 683.16
##$TE2= 300
##$TE3= 300
##$TEG= 300
##$TL= (0..7)
0 120 120 120 120 120 120 120 
##$TP= (0..7)
150 150 150 150 150 150 150 150 
##$TP07= 0
##$TPNAME0= <>
##$TPNAME1= <>
##$TPNAME2= <>
##$TPNAME3= <>
##$TPNAME4= <>
##$TPNAME5= <>
##$TPNAME6= <>
##$TPNAME7= <>
##$TPOAL= (0..7)
0.5 0.5 0.5 0.5 0.5 0.5 0.5 0.5 
##$TPOFFS= (0..7)
0 0 0 0 0 0 0 0 
##$TUNHIN= 0
##$TUNHOUT= 0
##$TUNXOUT= 0
##$USERA1= <user>
##$USERA2= <user>
##$USERA3= <user>
##$USERA4= <user>
##$USERA5= <user>
##$V9= 5
##$VALIST= <valist>
##$VCLIST= <CCCCCCCCCCCCCCC>
##$VD= 0
##$VDLIST= <DDDDDDDDDDDDDDD>
##$VPLIST= <PPPPPPPPPPPPPPP>
##$VTLIST= <TTTTTTTTTTTTTTT>
##$WBST= 1024
##$WBSW= 4
##$XGAIN= (0..3)
0 0 0 0 
##$XL= 0
##$YL= 0
##$YMAX_a= 574301
##$YMIN_a= -341443
##$ZGOPTNS= <>
##$ZL1= 120
##$ZL2= 120
##$ZL3= 120
##$ZL4= 120
##$ABSF1= 16.522
##$ABSF2= -4.171173
##$ABSG= 5
##$ABSL= 3
##$ALPHA= 0
##$AQORDER= 0
##$ASSFAC= 0
##$ASSFACI= 0
##$ASSFACX= 0
##$ASSWID= 0
##$AUNMP= <proc_1d>
##$AZFE= 0.1
##$AZFW= 0.1
##$BCFW= 0
##$BC_mod= 0
##$BYTORDP= 0
##$COROFFS= 0
##$CY= 12.5
##$DATMOD= 1
##$DC= 0
##$DFILT= <>
##$DTYPP= 0
##$F1P= 14.0000005364418
##$F2P= -0.99999901652339
##$FCOR= 0.5
##$FTSIZE= 32768
##$FT_mod= 6
##$GAMMA= 0
##$GB= 0
##$INTBC= 1
##$INTSCL= 1
##$ISEN= 128
##$LB= 0.3
##$LEV0= 0
##$LPBIN= 0
##$MAXI= 10000
##$MC2= 0
##$MEAN= 0
##$ME_mod= 0
##$MI= 0
##$NCOEF= 0
##$NC_proc= -3
##$NLEV= 6
##$NOISF1= 0
##$NOISF2= 0
##$NSP= 0
##$NTH_PI= 0
##$NZP= 0
##$OFFSET= 16.522
##$PC= 1
##$PHC0= -42.37157
##$PHC1= -17.86634
##$PH_mod= 1
##$PKNL= yes
##$PPARMOD= 0
##$PSCAL= 4
##$PSIGN= 0
##$REVERSE= no
##$SF= 250.13
##$SI= 32768
##$SIGF1= 0
##$SIGF2= 0
##$SINO= 400
##$SIOLD= 32768
##$SREGLST= <1H.CDCl3>
##$SSB= 0
##$STSI= 32768
##$STSR= 0
##$SW_p= 5175.98343685301
##$SYMM= 0
##$S_DEV= 0
##$TDeff= 65536
##$TDoff= 0
##$TI= <Analysis number 999999
Compound Code 99
Book Reference 9
Project Code 9>
##$TILT= no
##$TM1= 0
##$TM2= 0
##$TOPLEV= 0
##$USERP1= <user>
##$USERP2= <user>
##$USERP3= <user>
##$USERP4= <user>
##$USERP5= <user>
##$WDW= 1
##$XDIM= 32768
##$YMAX_p= 324907801
##$YMIN_p= -101957
$$ End of Bruker specific parameters
$$ ---------------------------------
##NTUPLES= NMR SPECTRUM
##VAR_NAME=  FREQUENCY,     SPECTRUM/REAL,   SPECTRUM/IMAG
##SYMBOL=    X,             R,               I
##VAR_TYPE=  INDEPENDENT,   DEPENDENT,       DEPENDENT
##VAR_FORM=  AFFN,          ASDF,            ASDF
##VAR_DIM=   32768,         32768,           32768
##UNITS=     HZ,            ARBITRARY UNITS, ARBITRARY UNITS
##FACTOR=    0.157963299565203, 1,           1
##FIRST=     4132.6476996994, 0,             0
##LAST=      -1043.33573715361, 0,           0
##MIN=       -1043.33573715361, -101957,     0
##MAX=       4132.6476996994, 324907801,     0
$$ Real data points
##PAGE= N=1
##DATA TABLE= (X++(R..R)), XYDATA
$$ [...]
31339 -18611 -13980 6853 23683 5735 -10870 -5841 -4101 -17889 -8692 546 -11206 -26206 -31399
31326 -31399 -25989 -52923 -56688 -25572 1123 -20903 -26368 -17492 -32354 -47337 -31873 -34380 -29747
31313 -29747 -33828 -32752 -27271 -6536 10571 28059 18283 9485 19308 7573 -156 5377 765
31300 765 6522 26285 28995 18789 4139 8919 10412 4021 -17698 -26012 -18323 -30853 -25619 6319
31286 6319 17154 8540 9734 29221 1781 15337 27051 10406 6561 3198 5205 39749 66445
31273 66445 40041 -5315 -20533 -16697 -20602 -28459 -20950 -19336 -3638 18941 29607 40461 26437
31260 26437 19785 26466 21620 7235 -11420 -30455 -13564 681 3520 2256 23382 19367 16879
31247 16879 14651 17571 21137 7208 -11772 -22829 -18098 11814 19426 15017 12610 29143 9330
31234 9330 -26912 -45384 -29797 -33366 -33496 -19751 -19967 -36972 -47519 -38523 -23826 -29226 -39079
31221 -39079 -40424 -34402 -19174 -22827 -7602 14202 -8460 -28461 -50359 -48685 -26412 -24519 -42203
31208 -42203 -43751 -29826 -14528 -28072 -28600 -13213 -9996 -29449 -25506 -9567 -320 -28212 -48244
31195 -48244 -61279 -72757 -72661 -65463 -53069 -26384 16736 11277 2907 3074 -7476 9309 17398
31182 17398 249 -8827 -8665 -16857 -11863 -5170 -5139 1787 -4012 -10834 -29800 -38790 -28807 -7443
31168 -7443 -19024 -21930 -41447 -45437 -53791 -46824 -17990 1302 -237 7280 15351 18450 20216 3914
31154 3914 -21125 -43931 -31238 -32433 -12569 -20836 -27414 11107 7245 -7110 -16958 -26097 -20384
31141 -20384 -1380 9218 10149 6142 5513 15939 12228 -22148 -50193 -22514 14051 33761 33210
31128 33210 8945 12196 14884 -5402 -3887 27720 29560 21725 21896 9685 -27939 -40535 -17019
31115 -17019 -22685 -35403 -31446 -50800 -42429 -33909 -54206 -41170 -32295 -20411 -15117 -35949 -30729
31102 -30729 -11073 32701 38313 14410 9926 477 877 -3466 15677 30518 22410 7865 -6309
31089 -6309 -4530 -6194 356 -467 5229 -13982 -25588 -41362 -37210 -33973 -22003 -2839 -16156
31076 -16156 -19591 -23694 -6372 -8040 -25013 -35542 -33175 -38425 -40545 -28198 -3333 24295 13236
31063 13236 -7695 685 12688 19105 31946 36371 55297 33570 36327 45178 43883 3616 -2945
31050 -2945 7595 -8349 -45868 -46448 -19360 -5129 983 2503 3121 15086 6525 -11387 -30089
31037 -30089 -31205 -5474 -17041 -31375 -42697 -42723 4295 28884 31120 38212 15512 -8615 -25079
31024 -25079 -34849 -19802 -13100 -994 -20200 -12839 19254 23532 16297 13040 -16216 -39182 -47177
31011 -47177 -20039 -11252 -21962 -35002 -40272 -22310 -1069 -35046 -41357 -17953 2815 -1362
30999 -1362 -16343 -28322 -19348 6323 770 -13805 2408 -3699 -11165 -22120 -35727 -31713 -26219
30986 -26219 -26332 -36038 -2564 -10284 7355 -1135 -5352 34 -1120 -3781 -36825 -44112 -56327 -60491
30972 -60491 -62175 -62181 -50186 -64049 -49049 -12698 12452 14280 13958 11232 -37689 -68801 -55967
30959 -55967 -31208 -18063 -11558 17070 16000 5788 22771 30678 15564 -880 10701 20432
30947 20432 -9768 -33499 -39916 -22237 -7340 -27623 -23194 -13146 -15521 -19386 -33035 -21928
30935 -21928 -15359 -15828 -25592 -26517 -6750 -1484 6391 -14009 -27431 -27020 -33074 -26694 -27589 -48960
30921 -48960 -64791 -62446 -50140 -45498 -16457 2591 4533 8011 17783 -12216 -4646 32646 16456
30908 16456 20814 5538 -13789 -20588 -9826 -17626 -13909 10167 24015 12483 5337 -30377 -69381
30895 -69381 -58067 -43530 -36790 -31699 -27398 -39443 -47720 -25568 -9284 -31763 -24851 -25808 -27450
30882 -27450 -30817 -59007 -55679 -46983 -35022 -17583 22415 37877 53273 42659 39534 30496 -9578
30869 -9578 -33401 -50904 -35728 -5975 12534 -11177 -16446 7362 34397 19447 9141 1121
30857 1121 15825 18354 24725 19767 1820 2613 5778 -1097 5355 -8884 -19282 -29226 -33900 -21404
30843 -21404 10635 28146 43617 23612 1867 -153 3448 9011 12606 13462 2507 18116 29528
30830 29528 20762 9148 9501 11703 28825 24227 22658 15256 3705 -10349 -15322 -582 -11401
30817 -11401 -20289 -24462 -30967 -27510 -46568 -34872 -37314 -42565 -3484 28767 18366 13900 21312
30804 21312 3865 2647 25352 27172 -5021 -23553 -13836 -17861 -9439 -5146 -11786 -3899 -5156
30791 -5156 -31693 -45782 -54841 -65968 -35268 -31937 -4553 16406 27090 8775 -9202 6765
30779 6765 9391 10482 18364 -6268 -16224 9723 24123 41357 43139 19707 4201 -4459 14694
30766 14694 38999 25058 -2413 -25259 -22019 9808 30251 10766 636 -16403 -5000 -7820
30754 -7820 -20632 -12057 3467 -5044 -19707 -25215 -15473 -12687 -5678 755 24978 48424 43871
30741 43871 34899 18935 -22645 -50538 -48298 -49407 -38987 -36814 -10226 -2341 -6501 -4972 -5554
30728 -5554 9515 14636 -6948 -23794 -42905 -40202 -23598 -25231 -40247 -37920 -27976 -10540 -9750
30715 -9750 -9199 -12092 -43137 -57525 -49606 -21438 -32410 -29077 -38127 -27752 -13203 1463 -12011
30702 -12011 -24539 -18503 -11819 -1157 14066 8470 8499 8180 -13385 -21375 7087 19426 16759 6282
30688 6282 -20500 -6714 3226 -377 -21702 -7360 12738 23472 24192 5460 1611 -13290 -21583
30675 -21583 -22323 -9798 23997 38816 54065 47022 6366 -23126 -17049 -14656 5079 5540 -13004
30662 -13004 -25275 -18900 -1128 10133 7955 12811 20894 3551 -10339 3213 14152 5863 4159
30649 4159 11957 -4900 -10662 -16643 -40452 -33606 -10475 -17720 -29512 -17992 -678 -18215 -33919
30636 -33919 -30900 -19931 -21019 -30305 -54303 -56311 -32405 -20012 -17953 -6881 -21004 -8266 30520
30623 30520 33805 10835 3252 13500 29232 17643 17408 11202 8440 -591 -29634 -32173 -32450 -16549
30609 -16549 16696 13095 -6932 15767 32195 26738 11746 6497 -9873 -549 14631 2784
30597 2784 -6186 -23404 -37553 -16183 -10453 -534 5793 1237 17047 17389 22826 20040 4536 -31823
30583 -31823 -45667 -40843 -18580 -22522 -35436 -26881 -1418 6211 -1095 -1031 -3958 -21233 -10557
30570 -10557 -5765 4619 17115 21065 14008 1944 -24266 -48891 -37364 -29205 -45636 -45334 -32770
30557 -32770 -6794 6608 448 15619 17384 25517 5717 5357 29286 30142 27918 36447 36768 36714
30543 36714 41572 23753 25655 13452 6690 -1068 17238 21975 8378 6510 21475 36142 26883
30530 26883 12444 1044 562 -2681 -20739 -25816 -30185 -3159 4159 -81 -8131 -3506 12595
30517 12595 15452 5322 12265 13500 -7085 -7377 10677 17496 6777 -2281 -4359 12774 19583
30504 19583 9684 8208 8915 8653 1248 10385 10475 4186 -16271 -1902 11338 12125 15788 -1396 16761
30489 16761 39272 26870 25231 31290 28014 14956 11457 13266 21097 -5585 -47939 -52399 -38616
30476 -38616 -27230 -54533 -59701 -57666 -55874 -37968 -25440 -18912 -11127 -20905 -19605 -14125 -19242
30463 -19242 -26283 -15765 -450 -12496 -38751 -56666 -32028 -11010 -3006 5832 6514 11063 23617
30450 23617 -111 -25261 -28967 -42762 -38085 -54324 -52886 -31400 -34358 -28413 -4495 21505 33332
30437 33332 30518 15926 5816 6078 14467 13049 10673 2919 -2643 -2757 -10620 26092 36647 14690
30423 14690 8131 13193 33709 42032 39860 21855 38046 43627 26214 30696 17683 16745 15253
30410 15253 20641 21986 -15646 -7176 23772 51678 57524 31304 1114 1673 4972 27372 18270
30397 18270 -14289 -32709 -37206 -29195 -16602 -1967 1192 18013 28187 34604 29156 5313 8734
30384 8734 31401 36472 21602 6451 2863 -12225 -31012 -24558 -14722 4169 17204 32368 32905
30371 32905 20840 -159 -11135 -2003 -5918 -12100 -34481 -39798 -23907 -8103 10986 8092 7082
30358 7082 16062 10711 -12018 -4089 7957 -306 25145 23195 -218 26463 37073 33330 13931
30345 13931 -26061 -33944 -17883 237 -5640 -18626 -15511 -11642 -4531 -24253 1872 21853 26959
30332 26959 20419 19448 8256 -9594 39 32225 29017 31189 32389 10841 -30223 -42532 -35475
30319 -35475 -26242 -27728 -28882 -28240 -41657 -42705 -20842 -17956 2376 19637 21552 12936 5099 18268
30305 18268 14047 -1129 -17219 -19831 -13022 6917 4080 -9600 -19185 -17717 -3249 4518 -2644
30292 -2644 4530 11572 -4749 -9451 -4401 23540 23133 25611 -2414 -14500 -24491 -10510 -36478
30279 -36478 -37744 -29434 -14444 -13879 -22705 -43035 -36431 -17997 7119 7676 64 -340 -993 2565
30265 2565 16116 13267 23644 9541 21586 31777 14319 6630 -1397 -1600 18816 19247 27391
30252 27391 16247 -9147 -23621 -13169 -13086 -21743 -7238 5608 10947 1006 -14865 4487 21589
30239 21589 39931 41458 35794 2870 -5077 18034 5297 -23731 -40809 -40291 -28266 -10472 -2153
30226 -2153 -7408 455 24313 40095 29761 14119 14711 15251 -5960 12836 27027 12703 10714
30213 10714 2749 -15856 -7707 29405 26424 3359 35075 13149 -11030 -14112 -27664 -39528
30201 -39528 -48682 -66094 -35863 -16887 -14751 -35118 -18295 -588 -14111 853 17092 14632
30189 14632 3404 5099 12938 5803 -1257 -7848 10114 3841 -10182 -15618 11362 11007 10830 21505
30175 21505 32398 20012 -2337 18728 17444 17685 22239 34646 18599 8611 10076 6539 3809
30162 3809 -11147 -32148 -41615 -47292 -29340 -29533 -35787 -30879 -41146 -28819 -21283 -13696 -12411 -11503
30148 -11503 -15135 -22312 -30815 -38504 -21038 -13458 -507 2327 6697 35074 48274 53026 20865
30135 20865 -2889 19456 15401 11660 24575 13870 8419 13937 8046 3880 4403 -4878 -7464 13266
30121 13266 29516 16500 -8812 -32872 -38726 -35157 -36516 -15822 18820 10403 14840 -7447 -38172
30108 -38172 -26428 -20586 -1331 -16014 -7151 11583 2326 15498 23183 9467 15581 -188 5100
30095 5100 19993 8215 11579 3392 5431 6248 -13635 -25952 -42357 -45938 -40442 -35772 -5519
30082 -5519 36350 27335 4799 -10371 -26208 -8310 10207 21922 6497 -8790 9652 27032
30070 27032 32741 26985 8872 17757 18155 -369 -17068 -16176 -7186 -717 3935 10233 7696 17547
30056 17547 25476 13524 8046 10173 -947 -7486 -13064 -3686 10281 15224 -56 -8192 -18378
30043 -18378 -32007 -39786 -45054 -44789 -8744 -8770 -13150 -11731 -24955 -16115 -34175 -34563 4435 8471
30029 8471 3559 -11074 15904 15205 8707 14740 12052 25272 11124 7752 -8394 -5593 17730
30016 17730 -275 4087 -9274 -28769 -29775 -13039 -12365 1633 6630 -26876 -41196 -42730 -19481
30003 -19481 14328 -1304 -23964 -21453 -446 12477 27990 15934 -11812 -26917 -15649 -20272
29991 -20272 -35784 -48313 -44597 -36241 -33556 -17415 -4816 -9957 -1255 19352 25386 873 -7249
29978 -7249 -26622 -33047 -31324 -30431 -15793 -16304 -17336 -31009 -31908 -18881 -29861 -17850 361 -424
29964 -424 5897 14135 8211 26430 35379 10761 -8464 10017 21089 7819 1796 1473 -1096 -9036
29950 -9036 120 5918 8254 3930 -7470 -13530 -11178 16789 22770 22226 17842 16052 15096 24489 23901
29935 23901 18151 2275 -8112 -18102 -18529 -19539 -7524 10400 3420 9861 20481 27407 36273
29922 36273 16068 10047 -7883 -12162 -5745 2933 10637 25218 30749 25566 2790 32944 43564
29909 43564 14738 -15662 -24171 -26499 -23168 -15520 4849 310 -5899 -13905 -13687 8851 12522 -12416
29895 -12416 -21246 4772 -9669 -18765 -18747 -25710 -35099 -35179 -7253 17016 26387 19987 13461 10459
29881 10459 21644 18078 21614 28517 18747 18500 22892 -597 -38859 -44984 -34991 -12661 -5391 -9830
29867 -9830 16577 34473 27193 5891 1273 -6716 -14719 -11209 4498 -918 7795 17685 6601
29854 6601 -16918 -26187 -35500 -4961 20601 36076 31964 10181 7987 17742 13396 3562 -13527
29841 -13527 5852 4958 -1498 -16032 -4671 9338 1782 5429 12057 16059 26165 16089 4138
29828 4138 -4609 -24527 -42928 -31300 -12791 -2760 6055 54985 67508 62622 46332 8593
29816 8593 9321 13484 14792 15173 -13585 -21705 -7954 9661 5828 247 11515 15827 -4814 -9075
29802 -9075 1222 3230 -15136 -692 20108 35472 19670 8369 21509 46383 46503 37889 27740
29789 27740 30245 36613 33691 -1340 -16718 5291 19342 30018 22660 -9387 -15378 -17878 -14576
29776 -14576 13262 13846 11149 11470 3459 -3927 -13428 -18496 -29130 -28604 -10532 -4876 -4241 -11683 -6674
29761 -6674 12734 8649 7130 11264 11116 13327 15365 32573 21250 -1156 -3648 -7457 -13501 2077
29747 2077 421 12588 20386 6572 8328 15853 -4493 -13872 -5339 -21510 -24295 -2181 -12119
29734 -12119 -29792 -20493 -16655 -13200 7369 19477 26009 33800 25305 16568 2736 11047 -1772
29721 -1772 -11697 -30521 -39912 -43953 -39206 -41028 -43844 1589 10372 -601 9343 11558 2359 -3112
29707 -3112 -23435 -35301 -26572 -14032 1716 15553 11484 -3226 -8550 7927 -10396 -8383 13738
29694 13738 1949 -11359 -21569 -26096 -28221 -34456 -57047 -56772 -34495 -46317 -39710 -16663 -606
29681 -606 8707 19879 14441 -8641 2117 -11633 -26998 -4189 -13435 -17622 -12159 3921 30047
29668 30047 24835 25850 27145 20306 29151 11421 4829 -13742 -4544 -16696 -858 10109 5961
29655 5961 5619 -18857 -34017 -25759 -31630 -45162 -48585 -42463 -20593 -26933 -33768 -29934 -20511 -26131
29641 -26131 1096 4579 -3900 -15674 -9086 -1894 7361 5029 791 15839 33809 20029 1585
29628 1585 -14288 -7233 -3989 15545 -22575 -27339 2558 8547 -4753 4087 22333 28914 40983
29615 40983 59323 34687 1794 -13283 -29540 -37717 -20717 -3778 8918 4320 1152 -2427
29603 -2427 -12101 -8862 -24164 -35683 -27437 -26153 -19822 -25483 -20609 1785 13681 11370 13369 6987
29589 6987 16697 21342 69335 67576 30367 -3755 -8560 1975 12080 36688 29444 25281 2537
29576 2537 -19569 -7428 16691 18563 15020 21476 26729 27966 23977 16190 41803 66716 52277
29563 52277 49550 39734 28637 40612 23985 -236 9977 17649 6748 24367 10536 8585
29551 8585 -9545 -3741 13955 19525 12707 9436 -777 -31318 -31944 -31784 -5968 -29976 -30500 -22669
29537 -22669 -25131 -30213 -46780 -55571 -42036 -29751 -42220 -32098 -8615 -2131 -14660 -30440
29525 -30440 -12764 -2849 6591 5317 -125 1389 26731 39699 36145 24029 35800 48048 35161
29512 35161 14194 22152 37470 43131 24893 14076 5417 4927 5622 2813 -6667 -34787 -39542 -33639
29498 -33639 -20311 -6710 4732 7388 -2942 -5790 -4404 16082 10472 9707 7386 -6439 5700
29485 5700 10839 -698 11342 13894 2402 -5385 7440 -21820 -38369 -30102 -11460 26086 41226
29472 41226 42315 36028 23673 25679 13612 9651 3540 10800 12851 5420 7433 13029 19552 -3152
29458 -3152 -15345 17748 38978 39667 14169 -4140 -12699 -13010 -5284 -16272 -23916 -28041 -22906 -10769
29444 -10769 -483 -4305 -13911 3352 5385 22374 9787 -13514 4654 12752 -8098 -20239
29432 -20239 -11912 4608 8516 -10141 -12621 -2068 -3095 -12294 7384 25029 22388 11340 21017
29419 21017 30560 42868 60314 52910 36074 -3316 -13363 -9230 -6429 -3465 4393 15526 29426
29406 29426 27577 20264 861 -13990 -3017 33468 50673 39675 9060 -12162 -1925 13501
29394 13501 -8504 -3910 35991 28706 16097 25846 15284 15034 12397 5030 -4663 -815 -23061
29381 -23061 -20856 -2801 -11890 24376 37794 22542 19741 16518 4858 5291 11731 9331 -2171
29368 -2171 4824 40651 38455 18699 18436 32187 50104 53361 38840 28112 31031 6531 -21283
29355 -21283 -26080 -29290 -22823 -2250 11905 4514 2696 -2829 49 1528 1807 -8396 -18282 -21338
29341 -21338 -412 25507 18518 30151 55199 47354 27928 14759 -16867 -23801 -15135 10406
29329 10406 6353 -33601 -24672 -19663 -32800 -43810 -22221 -12950 -4593 1761 23571 23923 6365
29316 6365 5199 28677 27353 25739 25400 18006 18909 15835 20761 -758 -17253 -6284 -27325 -45118
29302 -45118 -33653 -948 -8824 -12272 -10332 11029 41423 40297 38630 11059 -26806 -27196 -18230
29289 -18230 -5525 -949 11949 7429 14933 37361 22410 27989 31789 21594 6434 -12891 -26264
29276 -26264 -24206 -26069 -11239 -182 377 3355 871 -7941 12404 23112 -10596 13162 11489
29263 11489 -16952 -19649 -3354 27356 28978 6405 10826 21329 40463 43665 36642 32654 18623
29250 18623 12183 14694 9359 -7259 -21884 -13990 -9296 2305 48182 64409 49255 4684 -25412
29237 -25412 -5336 -7929 1451 15288 6897 -14904 -13355 -7769 20988 18259 4028 13341 -10538
29224 -10538 -47681 -38591 -8091 -7920 3847 -1214 1822 25842 -15571 -24745 -2178 28619 34688
29211 34688 16507 9090 1396 -33454 -6136 24987 33949 26705 23807 2535 -3898 -3069 11105
29198 11105 6523 13708 21759 25208 34992 18822 9760 22975 30101 9298 -10987 -3303 25178
29185 25178 13233 3746 -1679 -3994 20096 42376 52492 36882 25419 30426 42863 36829 27254
29172 27254 30581 23505 -2083 -20635 -15591 -16123 -24259 -23925 -23734 -12970 6813 16113 27026 39234
29158 39234 34417 29066 24746 20732 20289 7838 13468 10231 29192 22160 -11663 -32822 -11327
29145 -11327 133 3861 -1091 3112 -14965 -38422 -44628 -38960 -20047 -4643 9071 -1642 -635
29132 -635 3620 -18173 -25415 -22503 12578 20803 2938 -16892 -16611 -14933 7500 2929 3842 -1644
29118 -1644 -7212 27290 49972 45037 2103 -11896 -14681 -39293 -38107 -20096 -2477 -17999 -22503
29105 -22503 -28534 -12143 9276 15714 7905 10458 5292 6173 18577 13349 -14295 -8562 -20065
29092 -20065 -10529 -4026 -182 24196 24903 21746 32153 35229 59006 68137 47912 39413 32638 10574
29078 10574 7604 -15605 -15745 -3416 -23439 -31778 -146 1845 6655 20648 -6408 7046 18043
29065 18043 21404 15410 18072 14638 730 17505 19194 16145 9781 5580 -6947 -18557 -3266
29052 -3266 -4018 -5834 4412 8975 27 -15099 8818 28996 9285 -15609 -17654 8276 27117
29039 27117 26984 22408 12530 32291 33428 9270 17917 25518 -4217 -16943 -5338 10870 -688
29026 -688 -593 -19216 -12244 18038 34133 -1695 -12348 -8753 -5444 -1146 -19625 -31720 -10936
29013 -10936 6348 37969 44139 16295 22739 41568 45094 56449 44242 43980 70418 68280 38421
29000 38421 12626 -11091 -24280 -19412 -18563 -11379 -664 -17727 -29653 -26394 -31188 -24753 -20466
28987 -20466 -81 16238 -5912 -12009 2331 20391 13245 17687 6207 -9768 -21335 -16723
28975 -16723 -32806 -23652 -11139 3536 854 -11962 -29765 -46060 -27341 -27485 -32006 -14858 -7418
28962 -7418 -19953 1873 27677 27142 18333 -3466 2897 6269 -7972 -10151 -1000 15656 12940
28949 12940 -6063 12156 12686 23164 18529 2141 7405 26904 18728 21671 23711 -4916 -22723
28936 -22723 -32880 -41036 -36306 -4319 31142 41776 41316 37107 10169 7131 16870 15044 -5975
28923 -5975 -29580 -27716 9666 15954 11913 -359 -4516 -9602 -6990 -2706 -15609 -24942 -48948
28910 -48948 -61047 -22644 8220 18420 -389 -21119 -14375 -17364 -26154 -32836 -12399 9837
28898 9837 15225 19441 21241 14483 46891 14740 212 1742 23954 32724 15119 -3644 -22279
28885 -22279 -16617 22172 48823 41424 9869 16342 15306 4902 21895 26217 6660 845 24992
28872 24992 10243 8445 18357 25428 21787 16205 35062 44560 46264 23918 17277 17872 29376 31264
28858 31264 46764 63300 51159 24767 16662 12952 20422 26341 12656 2810 -15691 -10378 -7190
28845 -7190 10542 11543 19793 13221 22741 38011 2779 13704 30636 30330 -878 -25068 -21692
28832 -21692 -19561 -4831 -8869 4867 5218 15762 12181 392 3641 8560 33661 35644 14802
28819 14802 4343 -3730 -7201 -15767 -4981 6483 -10032 -11206 29176 55337 47659 10272 -12836
28806 -12836 -3160 -2588 -10980 -24159 -12308 3192 17973 26461 18557 11801 2474 -10481 -39426
28793 -39426 -34019 -9093 5491 12725 30458 34743 39390 62256 51174 30107 21411 31391 21582
28780 21582 8668 20010 13483 730 2528 27635 30656 25378 41296 16373 -14210 -34393
28768 -34393 -32434 -41720 -43407 -54069 -79542 -63685 -40546 -20881 -11709 -602 11280 13427 7903
28755 7903 14874 681 -32656 -43279 -49637 -32023 2378 7523 2863 -4815 -14332 -9304 3835
28742 3835 -20774 -43035 -42906 -46520 -61394 -47987 -27501 -14962 -13816 -4229 -3804 1598 -14354
28729 -14354 -38697 -6952 10526 9023 -11766 -17210 -23498 -12665 -11209 -14202 2898 19008 15483
28716 15483 -13192 -6819 -18677 -31212 -9261 -16691 -5965 -3000 9565 24562 46448 53328
28704 53328 61811 73295 64859 46090 24907 9984 3362 23593 11938 -12382 -6426 28505
28692 28505 23008 7364 4063 22364 52629 69182 59651 53609 34514 38798 18604 -3327 -18094
28679 -18094 -23105 -30586 -18178 19628 31849 29884 22657 2582 -4318 -6296 -2367 -2223 -3297 3503
28665 3503 15464 36536 45235 28085 32808 44028 30685 14443 6978 -23914 -38110 -27710
28653 -27710 -8936 -12569 -26501 6791 41476 35300 18321 -4427 16765 40537 49643 43137
28641 43137 16309 -26799 -56681 -28332 -19128 -26932 -24344 -39592 -43860 -25386 -13006 -21806 -7593
28628 -7593 -9190 -19290 -8744 -20755 -31020 -16969 -9967 402 -11451 -24722 -20751 -11995 6588
28615 6588 16888 17789 -8099 -19080 -8236 6554 14974 9832 3126 -2363 -5584 -48227 -37816
28602 -37816 -13319 -18929 -10130 1077 -22074 -25775 -31707 -32108 -15244 -19667 -28436 -18911 8798
28589 8798 23411 28779 42970 15441 -18746 -23333 -15653 -6161 -6014 1775 12607 15051 15816 25532
28575 25532 20125 -3874 -17633 -1655 13640 18113 -3920 -23130 -18817 -4441 -15184 -21559
28563 -21559 -15777 -19120 -2965 14582 27794 -3652 -27957 -33031 -51706 -42649 -15693 -10783 -9467
28550 -9467 13777 1914 -12361 -18891 -14659 -5555 1481 21684 29980 31789 13882 5463 3625
28537 3625 -3 3225 11112 53109 71371 64644 46867 50969 45334 46861 44292 18131 15988 22373
28523 22373 24056 11678 -2769 275 4309 4206 5449 -3720 1597 39935 31838 17028 -9632
28510 -9632 -12627 -4050 7515 486 -3034 31853 40566 41731 34447 41320 29457 22596 26968 24516
28496 24516 21274 14410 14390 13639 12784 15755 27475 21133 8728 -7460 -11782 -3236 14182 11650
28482 11650 -1739 4740 20308 15 3139 10826 10950 18571 1375 10918 19922 14735 -11580
28469 -11580 -4375 3611 -14474 -25216 -14695 -5975 -4959 -11445 -10330 -2004 2696 4429 2586 7827
28455 7827 -844 -286 12858 -6135 -13658 -14639 -6786 -10590 -16870 -20941 -13080 -15482 -12938 -5283 18898
28440 18898 -800 -14502 -2848 -9173 -18623 -30942 -32155 -19583 -20047 -18536 -28693 -30410 -16176
28427 -16176 27508 36459 32248 -11450 -28310 -32243 -35586 -50263 -34045 -10776 -981 -3815 13845
28414 13845 26196 39709 44747 21795 -3917 -18705 -19386 -174 23642 36384 10470 -20353
28402 -20353 -23286 4487 29355 19687 10938 24765 28891 10908 16123 26360 10285 7083 6605
28389 6605 24451 30835 14849 10176 28267 19593 17904 30563 34929 24100 48266 61433 67504
28376 67504 46871 33558 23172 -5485 -24585 -36205 -5250 13874 15377 17963 27738 -780
28364 -780 -6365 7968 2135 -7374 -11931 -8400 -16968 -20145 2740 30177 6177 -1020 13871 19206
28350 19206 8461 11457 14186 7338 8492 18942 35527 26555 10756 3647 3918 -1671 -10557 -3173
28336 -3173 19208 10918 17504 13947 9545 14894 11181 -3498 -9231 23868 22058 17982 -7168 -2830
28322 -2830 9303 27603 39752 29973 226 -13772 -18703 -13717 -7391 3017 18640 31115 10117
28309 10117 -453 7649 11754 14669 36009 55644 68479 34040 3982 7592 16801 24189 15509
28296 15509 16636 15328 20446 39836 36318 22402 22792 16586 16562 27732 34089 38548 22575 12762
28282 12762 17268 -1247 1202 -1017 1474 315 -1654 -7221 -8911 -7513 14951 17311 4294 -1859
28268 -1859 9742 14222 19662 25405 17869 -3808 -10619 -24034 -29344 -51902 -44505 -35646 -19074
28255 -19074 -3819 6052 10144 27050 23451 -72 -26041 -32985 -26850 -15203 7114 16604 32331
28242 32331 33401 29617 33873 23494 1073 -19128 -21862 9438 23521 -5749 -5100 7490 26263
28229 26263 44462 29249 -8979 -21074 2882 3098 -15861 -15651 2269 23823 27859 23233 38165
28216 38165 16405 1716 4030 -1676 -13005 -11830 -16678 -13185 6902 9957 22503 18965 25830
28203 25830 21018 -5570 -12686 -5570 -10596 -5096 13523 32542 32980 27938 14961 16194 13074 -13235
28189 -13235 -37989 -19422 13126 10995 -20607 -26344 -54007 -41476 -14916 -5575 -11033 -7131 -19993
28176 -19993 -20843 -11971 -9656 -22892 -23915 -19538 446 4526 -15559 -23647 -3840 9215 -889
28163 -889 11363 2155 3136 -19427 -20645 -4662 15365 26868 18898 -10819 -39138 -36364 -47906
28150 -47906 -53888 -33059 -5952 23591 15586 11950 5115 7775 36319 36454 -2136 -2689 6182 20205
28136 20205 29712 18712 6073 -13790 -48108 -47069 -33135 -9469 -8743 -8138 10871 23510 51513
28123 51513 52425 52114 41387 20678 43465 44476 18022 -20397 -26230 -26924 -25022 841 7976 -1099
28109 -1099 1618 10119 32742 44020 37735 46011 34828 38162 28825 17846 19572 13130 9558 14794
28095 14794 21288 27753 41039 35503 21634 6108 11695 7965 448 -35695 -28880 -18976 -37741
28082 -37741 -24093 1570 27093 26792 37760 37452 26681 49245 53017 51044 32525 30436 2279
28069 2279 -23171 -1095 22928 -981 -13012 -5348 10624 17468 -10736 -17270 15695 21656 9762
28056 9762 17329 9934 -19729 -37695 -13817 5985 28097 62683 61628 36151 16229 43067
28044 43067 47468 18109 -12913 -17743 -16239 -17165 -16129 -26833 12267 32145 11002 -14282 -28947
28031 -28947 -22346 -11235 13866 39725 28250 8195 4669 387 -3857 -1609 -17201 -31428 -48784
28018 -48784 -42289 -17140 -14123 -5385 -10593 -13926 -4759 5509 15907 5450 -2906 -20140 -29049
28005 -29049 -9689 -5882 -11454 -6637 -18960 -7579 -6369 6764 36193 23462 19501 6742 11725
27992 11725 16594 6603 -2742 -3705 -992 -3348 -5427 -12334 -1068 -9442 -5296 24009 43377 62889
27978 62889 59583 48434 59385 46939 36917 48392 58356 42787 10458 4162 5729 -13416
27966 -13416 -14482 -17466 -21456 -20057 -14192 -21300 -36914 -12087 -8818 -9968 -11243 -2218 -11323 -17476
27952 -17476 -16344 -22422 -39290 -11333 10424 -7425 -13396 -9580 13266 15997 2447 29206 26743
27939 26743 10543 2477 -1809 -14329 -942 13965 7555 10280 13684 26617 37233 16927 3331
27926 3331 -34608 -33584 -10679 11114 7624 -5357 9210 22410 25264 6791 -5002 23275
27914 23275 10602 6614 -3289 -1973 169 -7330 13643 18356 -18016 -29205 -5419 3202 14235
27901 14235 16513 -17989 -31784 -24533 -35022 -32051 -22347 1245 6581 7152 1052 13245 24579
27888 24579 29948 46064 37121 11963 -23524 -34620 -3771 8354 -6137 -21817 -31379 -12578
27876 -12578 6697 -251 17734 5277 11764 19495 2624 6913 26015 1153 8718 27219 18807
27863 18807 1608 -9223 11766 42875 51749 40072 35849 18892 19996 22602 6333 -7633
27851 -7633 -732 -6642 -25326 -22380 -4115 -7760 -2523 -12139 -13282 -6546 -14268 -15859 -26132 -19203
27837 -19203 -30144 -27353 3724 29862 26933 30334 27556 17093 4170 7261 24975 18154 16027
27824 16027 18328 7066 -15727 1187 20716 34201 23938 -11961 -25138 -37054 -20591 -6037
27812 -6037 -8197 -21378 -39117 -45216 -15685 -5292 -20253 -20115 -1971 3518 -23939 -25866 1103
27799 1103 26325 32612 58806 78301 50101 22009 8154 1000 -19492 -20737 -29149 -29276 -45427
27786 -45427 -37753 -41024 -35751 -19176 2075 -6355 -5186 18521 24001 18865 20989 10179 -22281
27773 -22281 -10108 -13369 -22463 -9037 4721 38222 52738 41289 15938 2359 -5313 4342
27761 4342 3262 -17180 -10282 10127 24601 40946 48306 53027 43257 18460 24359 38215 32831
27748 32831 14419 14086 4842 -12261 -18204 -6147 12075 7826 -8 -48244 -47736 -18232 -5097
27735 -5097 1195 -1271 -3211 -11302 2293 10127 4705 12587 25957 32352 19977 24163 18901 4662
27721 4662 -6283 1424 853 -3030 -964 11675 21867 30154 16676 19940 29493 26522 15908 2119
27707 2119 11991 38754 23850 -1916 -13994 -259 -54 -2229 -1578 -6487 759 -6247 -9403 9336
27693 9336 21241 38440 32635 27950 26608 37786 41579 35755 20320 20051 37269 13993 -12525
27680 -12525 -16396 -10920 -8278 1708 16207 4715 -7348 -3194 -4822 -4517 8606 8285 16826 19709
27666 19709 -2355 3806 12019 23015 29790 19939 11574 -81 -2694 18378 7748 -20486 -18751
27653 -18751 -13529 4944 20261 8718 9765 -23163 -19286 -8138 297 23164 30068 28795 4309
27640 4309 -16289 3312 17870 44652 49449 48324 46904 17779 -2709 -12299 -7830 12664 2134
27627 2134 -3245 -13839 -17924 -10991 -4852 -24023 -63504 -38617 -23083 -20298 -6957 14428 -18748
27614 -18748 -28608 -19094 -22783 -22094 -23216 13826 24923 26142 28423 26445 -9571 -11426 -7675 -22718
27600 -22718 -3191 -1645 -7713 9594 -2903 -9516 -15583 -21848 -19891 172 -15860 -19357 -2070
27587 -2070 43705 47619 32077 14165 6050 -10504 -5823 -24266 -26606 -19963 -554 4442 23788
27574 23788 8721 -25976 -33729 -37741 -34217 -29930 -24052 -2725 10026 9618 -1945 -22307 -21311
27561 -21311 -5592 24897 34739 21196 -4993 -23622 8153 44420 46596 40641 20808 -4838
27549 -4838 -11482 531 30348 19728 2384 -4248 2312 -25309 -34845 -28228 -30647 -30048 -12988
27536 -12988 610 5041 3037 18544 25772 5856 6599 10583 -4553 5577 22413 22066 20153
27523 20153 13235 30802 17342 -17609 -36570 -44487 -24357 -5079 21516 47443 32006 13425
27511 13425 17456 -18237 -18314 -8890 -8185 -13799 -8819 12720 22377 24331 7465 -3218 -5857 3310
27497 3310 -11569 -4118 11374 25450 21238 21129 36553 17450 -11583 -14182 -27906 -41164 -13836
27484 -13836 974 17976 29078 28755 17274 18570 17058 19747 16508 12441 33434 2070 -18549
27471 -18549 -22815 4693 1375 -9741 -1216 12898 14206 27442 44369 32041 37780 48391 8075
27458 8075 -10711 -7298 5266 26093 21554 22407 25759 13959 39191 34620 25172 25010 28688 27806
27444 27806 45209 54141 55785 41879 61230 64960 55132 33401 18131 26470 19054 -4484 -10708
27431 -10708 9549 34481 30828 27148 28594 32701 13017 536 -12690 5581 26568 51222
27419 51222 30719 35075 50811 30909 9910 13812 -8634 -5525 5104 23196 44240 32860
27407 32860 21567 21532 16429 369 -15016 -9664 5428 7071 -8591 -42646 -42899 -19760 409
27394 409 9425 36628 24819 31692 32133 6428 6188 2649 -2234 -867 -21560 -32291 -27895 -12834
27380 -12834 5133 -8553 -1123 8932 4325 37566 39549 51498 42261 36977 43857 39378 20042
27367 20042 10951 -1154 1654 -6586 -13298 10801 14390 -11826 14952 39245 46029 32573 19729
27354 19729 28169 22895 8021 4887 14314 18733 12944 7939 -6822 3704 10139 20629 17207
27341 17207 -11088 -4449 25386 53018 40932 28083 22188 16119 22943 18503 14063 24399 25736
27328 25736 -10920 -1619 9865 9205 -19530 -17589 -5837 14587 47265 57225 61846 41302 36880
27315 36880 34467 17765 3994 18729 15877 15516 35126 33849 20222 4523 23682 26218 16535
27302 16535 35359 34782 24262 4661 -9150 -22007 -25236 9581 43646 40257 20494 2302
27290 2302 9425 7616 4121 13000 6120 -13284 -17262 -12403 -1759 -18266 -17137 -12156 -25736 -11298
27276 -11298 26408 42661 41558 29863 35546 22163 2796 1667 9033 18506 38986 54299 52360
27263 52360 36824 32180 45980 65578 66594 42537 44363 39607 28868 2410 -3712 5717 20262
27250 20262 38007 54616 50696 25968 6681 -8643 -18609 -17536 -37079 -39412 -14868 20241
27238 20241 37458 23227 45067 75424 64221 56877 57600 50858 20937 16024 19399 27605 48708
27225 48708 44038 13390 853 32179 53389 13286 -8566 -27224 -6001 -18718 -22265 -19464
27213 -19464 -398 36048 32307 26449 964 -26604 -8382 -1558 -13436 -13998 -10292 -5784 -19506
27200 -19506 -26095 -16748 -9731 -18776 -32543 -45261 -32355 -34005 -28542 -12841 10580 22354 8419
27187 8419 -14663 -30049 -20004 -1830 9316 22210 43838 26478 -4195 -2910 -1853 -35337
27175 -35337 -46968 -29144 -16033 -17676 -13005 -637 23387 17947 2863 318 21901 17209 12083
27162 12083 10465 3603 6150 36534 39753 16873 11456 18365 20413 32945 43479 43305 13576
27149 13576 10728 -1225 8946 3760 18000 38429 35228 20157 -11344 -22776 -17022 6670
27137 6670 6362 28563 43369 51813 31226 10235 4935 15793 8401 5648 21320 28256 18045
27124 18045 10248 26916 34712 1801 -14995 -20440 -19459 -12651 -926 -13858 -8548 -2134 6848
27111 6848 6836 -3085 24852 28589 10578 -5912 4884 -9978 -34408 -44914 -24678 -1049 -3612
27098 -3612 -22340 -32830 -5739 25956 16927 19282 15844 2042 -15392 -36559 -46412 -31670 -8714
27085 -8714 10482 1849 -5682 -4404 -4943 8618 -9043 -32646 -30101 -21028 -20511 -4878 -2127 -12284
27071 -12284 2814 6597 4050 3653 4476 14958 10728 -1622 -2141 -2221 -5282 -10271 7554 39411
27057 39411 57589 60562 27339 7718 14572 -1098 3498 -11322 -23084 -10716 4655 9125
27045 9125 16434 3276 -29326 -41121 -35899 -5402 13191 11110 13008 13007 21230 10435 1613 -2421
27031 -2421 17234 25915 11860 19029 19459 31902 12868 20534 5265 -8562 -6696 8034 10478
27018 10478 3112 4840 10246 -4982 -20744 -25538 -5609 7912 38735 38396 20417 20714 -12016
27005 -12016 -2456 20310 37307 40565 11630 25461 23797 24278 20074 18118 38692 33166 23201
26992 23201 21127 6233 23187 27196 29288 16657 18356 19968 26344 13362 9406 2709 -11438
26979 -11438 -15504 -24636 3446 5856 -9480 -9269 -19326 -20610 -20455 -2454 6482 9038 12703 11010
26965 11010 12438 -794 3617 -18200 -19946 -17884 -14998 -8137 -2823 15715 13332 -29147 -27653
26952 -27653 -7006 -8541 -4360 -21441 -12079 -15448 -11522 -10517 -2438 -15304 -37382 -33477 -31273
26939 -31273 -13830 12535 18725 19562 23453 38438 34232 17674 27407 38253 44665 58633 42009
26926 42009 47498 32551 14650 1049 878 12139 -5676 3876 16157 3302 -16482 -2471
26914 -2471 30107 22359 8876 9353 7968 21661 23797 -7080 -18337 -14634 -16417 -17647 -29103
26901 -29103 -19884 -14409 -11908 -2902 -7528 -29924 -28672 -3822 -2219 8011 18606 6693 10649
26888 10649 17046 9747 16252 39488 40880 43844 41156 13251 -683 14258 24335 11395 12069
26875 12069 -8398 -12877 10328 12816 -5508 -37452 -34153 -29999 -18068 -16499 -23258 -23958 -23252 -18281
26861 -18281 -2754 -2506 11162 17739 12427 4252 1876 -12421 -7139 -12444 -43062 -37173 -28690 -21024
26847 -21024 3464 10388 -9979 -19778 10293 16346 16495 14859 25905 15111 -14834 -37275 -4792
26834 -4792 701 1564 -4190 7045 -4527 4544 20540 18578 21752 27981 22013 18015 14899 27326
26820 27326 14632 2784 -15540 -7863 2647 12298 10494 7874 3562 12890 -2690 10007 16394
26807 16394 -3166 -7340 -4886 -26754 -32888 -12330 6223 9472 16887 17517 24352 45059 25176
26794 25176 7418 3881 5201 -4814 6288 -18631 -50061 -57148 -45037 -9572 23710 7558
26782 7558 1885 15962 24601 37995 19983 7270 19161 37217 29173 27430 33302 42001 39921
26769 39921 15768 14925 -3996 -21298 -4228 -17006 -34290 -28068 -20675 -23275 -27401 -45538 -24667
26756 -24667 -18112 -5973 28235 20924 27977 18373 16878 17821 23377 19193 28244 37839 23502 12471
26742 12471 15519 9882 12628 31448 32459 19347 32904 17759 -3593 -3095 -2756 -9434 -5306 -15258
26728 -15258 -4770 -727 6157 -24769 -36147 -33753 -37472 -52941 -58437 -48570 -44584 -29070 5151
26715 5151 854 -34379 -38593 -24960 -1265 15698 14691 6201 32682 31421 13858 16310 13950
26702 13950 1312 -16250 -11931 3343 15422 45722 47609 10263 -28832 -27177 -3262 -639
26690 -639 -4540 675 23541 24440 14226 27199 10136 1875 -3889 -13249 -18934 -13984 -5257 12531
26676 12531 7607 -4554 -6496 -2998 22571 22136 26774 39618 49545 42908 49365 39842 28376 16494
26662 16494 -39699 -35064 -15400 12270 27249 17387 -8803 -8934 11284 18183 10515 13474 5459
26649 5459 9874 -7132 -10983 -27555 -23181 -26818 -30784 -30108 -8432 11535 438 -2739 -14413
26636 -14413 -23962 14805 8827 -8126 -32610 -42467 -3364 33635 32164 6581 -19106 -22836 -24969
26623 -24969 -19976 -9524 9283 18398 -2517 5610 26916 26606 8486 -4798 -9767 -1997 29403
26610 29403 35628 43512 33711 17871 16048 -3530 398 21109 29539 15887 14344 21330 25507
26597 25507 29380 4319 1320 4965 -505 -14780 -24651 -14235 -9538 12587 17611 17252 6776
26584 6776 -2731 -16012 -27501 -33865 -5158 8771 14001 8669 13136 -8680 -27342 -30674 -22099
26571 -22099 -13513 -20781 -14522 -4249 -3090 -10969 -263 -731 -5090 9527 26796 21535 8874
26558 8874 -90 -4858 -29469 -34802 -10827 -505 19663 20305 1676 -13118 -6637 6299 13655
26545 13655 16590 8405 -6435 2870 1548 -12054 -32308 -27646 -14937 -9664 -20961 -3324 26911
26532 26911 35112 26611 18231 37939 40075 34492 25941 18625 2227 -20388 -21759 -2847 16001
26519 16001 1639 -3197 9611 27800 38994 64307 39504 -2907 7334 33464 46378 55333
26507 55333 45307 40359 9160 8373 29050 35042 18126 22953 -5067 -21286 -12245 16181 30931
26494 30931 30315 28522 18474 6690 -6206 12257 36494 15180 -7657 -7409 -7498 -31233 -55457
26481 -55457 -26993 9727 3795 4007 -15232 -43487 -53685 -45975 -29907 -31472 -33425 -27413 -5121
26468 -5121 3371 12674 25714 34785 43749 40570 35681 -12154 -24796 -14748 -9126 3015 18207
26455 18207 13445 2206 4070 20253 33284 15921 10577 7397 -22688 -27164 -14170 11725 -248
26442 -248 -11956 17276 14599 -22352 -28229 -18861 -47554 -46759 -50421 -43071 -19766 -15938 -1272 -2745
26428 -2745 -22186 -19304 -6213 -6606 -9528 -13131 -4727 12464 12982 3008 3979 192 8087 7093 -19125
26413 -19125 -13581 17428 36788 45350 26564 10100 17682 27981 20201 15709 3136 -11745 -12757
26400 -12757 331 4663 3399 5394 -25262 -46404 -44165 -47577 -24543 17547 36684 22685 -176
26387 -176 -16408 -19534 -7739 -432 -6727 -13893 -14165 -14264 -26192 4867 25872 37401 11162 -24356
26373 -24356 -24762 -27265 -12091 5968 13876 22585 12222 31266 17197 -2458 3836 10565 19171
26360 19171 11831 12690 13069 518 1595 -6433 15954 19952 18713 25323 17353 26303 20891 1004
26346 1004 -9023 -4386 3365 24748 33265 28742 24705 -6739 18463 44702 13753 6767 17876
26333 17876 17113 24252 26679 40706 15369 10834 15377 -8287 -2813 15847 16456 -3686 -25204
26320 -25204 -20171 447 -10161 -2199 10931 11544 26856 38252 21922 16148 5360 2052 24068
26307 24068 21861 9420 1542 16566 36645 34075 -11429 -35110 -42371 -15219 -864 -17948
26295 -17948 -15624 -2987 4078 30923 52157 22836 -17824 6587 46695 45306 42131 28377
26283 28377 35001 22982 1386 -22439 -22040 -12655 2057 28825 9917 -3806 -14960 -32623
26271 -32623 -16905 -11228 -1335 -23339 -30967 -9500 -7173 -18146 -21485 -3208 7369 8622 11053
26258 11053 7052 14758 37694 25937 -20858 -28313 -19244 -1210 -8113 -165 15142 12952 1817
26245 1817 12072 35721 44567 32880 5669 -15270 -12989 -17752 -6848 9543 -5175 -27312
26233 -27312 -37963 -21424 -22704 -14942 14622 -615 1136 295 3097 34328 44319 35646 37247
26220 37247 16733 30390 45126 42970 67964 50717 18035 14628 6633 6962 8066 24570 22695
26207 22695 15808 16931 5994 18852 29091 13823 24526 28211 28065 17917 -9420 3782 32537
26194 32537 32449 39289 38829 24102 -19674 -23695 -6680 -722 2348 -8341 -13889 -5771 -4824 -7440
26180 -7440 19292 23371 23678 30679 27967 14306 8312 -9393 -13228 2803 22065 21807 5656 -24452
26166 -24452 -32459 -30175 9130 25193 16725 12218 11754 -20383 -30480 -41367 -46243 -31576 -19663
26153 -19663 -21418 -10521 -11357 23142 22893 14996 -11553 -30537 -17107 14709 35419 29614 -4906
26140 -4906 -4468 -11443 -29356 -29349 -9166 -6445 -7123 1369 7285 -96 6266 -1172 6333 13102 8777
26125 8777 -136 20704 29841 37545 45672 33591 16964 5786 136 -12857 21017 28560 28502 5795
26111 5795 -9587 -12180 12878 20323 14619 -11814 -26334 2806 20154 -6104 -6370 -2789 13122
26098 13122 -4801 3685 15700 16936 60208 75150 52161 42747 49394 58690 59889 43735 34363
26085 34363 23210 25820 20138 18185 -950 16367 17942 8634 18558 13587 -3397 4553 3457
26072 3457 -13027 -15072 -6358 -32806 -32298 -27762 -29922 -20231 -11122 -419 12773 18773 -410 2574
26058 2574 6799 31425 5321 -17276 -12175 423 1496 8035 3372 -3056 -7886 5512 18466
26045 18466 35697 13143 13455 19901 11623 10330 14381 23700 40281 46069 28296 16037 -2906
26032 -2906 5937 -5868 -18453 -21468 -25924 -40892 -42728 -4584 14151 21255 24933 21560 10878
26019 10878 21882 52003 39818 14905 1170 -1059 5997 19380 28970 8640 -5554 -30983
26007 -30983 -42696 -50083 -42672 -22358 -9853 -14143 -14893 2642 35127 14589 33062 48504 60477
25994 60477 44275 25531 7652 8262 -10431 -17401 -5798 -13533 -1541 -6709 -9539 -11159 -5747
25981 -5747 -585 15293 17560 18493 27918 32719 17392 16470 31954 49941 44571 22055 3706 3033
25967 3033 -7672 -30401 -40742 -47242 -27634 17408 33074 20602 3595 -12824 -13131 -7075 5957
25954 5957 28537 17462 -7010 -6695 -3118 5354 -6130 -1802 4871 226 -3136 324 7407 12227
25940 12227 30004 31042 35658 20453 16185 12297 -1880 -6324 -21805 -31507 -24557 -21147 -15608
25927 -15608 -23661 -36144 -34471 -41760 -40470 -39005 -4457 10034 6148 7725 9844 17709 23045 29212
25913 29212 13288 -6425 -10841 -1605 11150 18178 35003 33398 19403 748 15642 36514
25901 36514 24664 -4304 -24425 -16036 2112 10469 -11060 -23801 -13268 -22417 -20736 -14667 -8395
25888 -8395 -25225 -24596 -23941 -8420 -5995 -32545 -64324 -52659 -44335 -14724 11016 12740 4151
25875 4151 9887 9716 7132 -1055 1612 21539 24381 14818 4251 1685 3311 -1231 -13683 11407
25861 11407 32064 1738 -1757 615 29802 21619 23712 36332 16409 16697 1452 18657 33003
25848 33003 39858 43068 47283 39309 13978 -4831 -12410 8438 11740 21931 13727 5005 12369
25835 12369 5613 -13139 -15763 -13604 -18259 -9230 8771 -10795 -39142 -50661 -53107 -23546 -11743
25822 -11743 5842 -5158 1005 -1273 -4737 5418 -7282 -3101 -3834 11140 3060 -3598 11178
25809 11178 20567 14378 12443 -13902 -18640 -16865 -24357 -31071 -42340 -52121 -41991 -10076 -7045
25796 -7045 -16486 -10650 -11764 -3381 12516 16562 14755 7070 -1918 -8558 3205 -6455 -14281 152
25782 152 5427 1089 3956 22742 17812 9825 1525 6938 11123 2459 12944 17086 17840 1797
25768 1797 7400 23274 44629 39720 26055 20397 33465 35159 20752 9943 9501 6489 16252
25755 16252 31778 26459 16037 -10255 -4904 3830 -1087 14725 22457 34172 51584 42353 9736
25742 9736 10119 3710 147 10113 7961 15872 12941 -9199 5513 2904 613 7073 3024 -4451
25728 -4451 6701 10586 -7837 -31803 -31799 -6233 -3461 3080 10475 -21699 -34955 -18680 -11903 -2555
25714 -2555 -3924 -2584 -5385 -4781 -15050 -13313 -2650 5894 6107 -11094 -13391 -22103 -7704 -16607
25700 -16607 -5423 3898 -1965 11862 -12542 -21777 15951 11250 4300 4939 -20141 1832 27525
25687 27525 35589 45362 40516 32931 15743 14182 14547 7225 26918 31423 28207 15237 -600 -92
25673 -92 11697 18742 -12775 -42002 -32876 -11943 -23196 -32976 -19789 2980 13457 24935 25789
25660 25789 18573 22899 6383 -4034 -25235 -27314 -16810 -3087 37700 54498 47295 42526 35502
25647 35502 24572 26189 56492 48804 50023 42103 32657 27021 26870 -1471 -4601 21355 27016 35203
25633 35203 42567 26726 28937 33284 40353 23729 6920 -9226 -5359 8153 8010 15566 7673
25620 7673 6866 4407 4257 29028 40168 7753 987 12049 30177 48570 51980 46680 13140
25607 13140 -18661 -22812 -2452 -413 2405 1334 -6301 3150 -348 -2875 9185 16922 851
25594 851 -18500 -3140 33242 15047 -12088 2343 27194 15670 2042 -16741 -33512 -50709
25582 -50709 -44313 -21782 25690 40128 30921 26243 30830 27931 25465 20825 5287 -13839 -3456
25569 -3456 -1265 18593 27190 8925 -2525 -24667 -44745 -52008 -26259 -23219 -21929 -11195 -24319
25556 -24319 -20439 -1803 29949 38785 14064 -1394 -10497 -9970 -16964 -41118 -55275 -69185 -55838
25543 -55838 -20480 -6156 -13079 -46956 -29059 -21815 -11131 -4573 -15390 -19457 -4771 40793
25531 40793 63888 49138 35030 10031 -25949 -31620 -16074 -28363 -21796 -32064 -16135 150
25519 150 -534 8057 17309 4945 -6320 -10032 7955 23610 21245 -18020 -45448 -20462 -14047
25506 -14047 -3928 9242 21009 10500 -465 -6622 -16458 -13883 -30040 -15295 -12364 2878
25494 2878 2323 -3691 17487 39392 34965 26348 29313 15580 4189 9517 -12836 -11200 -24895
25481 -24895 -23112 -15741 -6278 25235 22526 -21366 -28129 -43066 -76460 -91775 -87147 -65416 -53079
25468 -53079 -35356 -17283 -6288 9217 18990 20532 12416 12485 8184 5456 -5248 -13294 -8281 374
25454 374 -17709 -9434 9120 2920 8424 19518 8961 17466 701 -21930 -14748 6044 -1093
25441 -1093 -13926 -7750 8449 17914 21483 23099 24787 18587 24038 6766 5872 20767 35250 16322
25427 16322 -8203 -27100 -18460 -20073 -8369 -25399 -3450 -2011 -13797 -12013 22622 34702
25415 34702 17765 17742 8990 7947 -13034 -5032 -727 -2161 -4920 -3659 -17507 -9636 -4185 6507
25401 6507 11980 -31620 -31858 -27913 -21113 652 15074 39676 42577 19192 15129 -1741 -30693
25388 -30693 -48373 -35855 -22434 -8614 -14030 -9420 33458 30481 16921 19364 -3204 -5826 4923
25375 4923 -1404 -7592 -12185 -7445 18096 37750 28857 12736 7250 2929 4109 199 -10560 -23849
25361 -23849 -13517 -10504 -5098 -17677 -18520 -8464 6666 9794 -25623 -11952 18180 2729 -7772
25348 -7772 -19746 -18519 515 8339 12584 7352 15291 11647 -6560 -4899 -10893 -15715 4111 8503
25334 8503 -6824 -19050 -12572 -14368 2904 31154 46020 27750 14716 13556 6841 3564 -10954
25321 -10954 -26718 -31612 -15819 7447 31368 27544 33920 28440 18124 25696 29054 34260 1469
25308 1469 -7299 -25310 995 10739 21633 39787 34740 -2265 -9489 10362 345 590 17079
25295 17079 34351 51396 37910 24818 41495 50659 54785 36626 16346 10441 10425 11449 6956
25282 6956 -12070 -45644 -36602 -21329 -3338 8167 15502 19452 39100 34530 21386 -6424 -12412
25269 -12412 5169 -5643 -40812 -39148 -31827 -16867 -36946 -38006 -6686 12947 11113 3115 6479
25256 6479 13571 -3188 -9193 -16570 -24712 -2790 -14953 -16079 -37548 -20240 665 11943 23348
25243 23348 22633 28562 14914 34705 41543 34159 -25880 -56943 -33748 -39585 -44942 -26460 -13504
25230 -13504 -3747 -12833 8515 24716 35256 17357 2912 -12184 -17907 -13216 -5785 -10472 -13905
25217 -13905 -13764 -5 21654 1327 -16989 -14955 -18576 -15685 -19870 -7391 -32950 -31237 -11849
25204 -11849 -24103 -5828 3121 -21758 -39289 -30966 -19824 -25663 -36841 -32231 -14728 -1773
25192 -1773 -20171 -20042 6871 27959 -3862 -2692 6599 11881 25050 29402 27098 30363 15608
25179 15608 -9265 14468 35648 29574 9447 1579 -3859 -15272 6824 27872 15889 -8806
25167 -8806 -9250 -26091 -25164 -14675 -19950 -14926 -12868 -28713 -35948 -43547 -37926 -18652 -30626 -33870
25153 -33870 -16371 18610 17947 -19441 -23679 -27714 -8256 370 -5454 -8496 -21334 -15523 -19298
25140 -19298 -26012 -28620 -15534 -48 -774 -8241 -11079 -35641 -33793 -5824 6427 9682 12819
25127 12819 16856 19235 3968 9841 10905 -5401 -2142 -645 -2179 4390 8772 5075 449 -2924
25113 -2924 -5157 13446 438 4583 -3535 -42084 -47293 -27982 -19948 -23351 -31217 -26002 -45126
25100 -45126 -24862 4647 14284 3412 3223 10493 18047 -1872 9737 -1710 7037 16811 19416
25087 19416 12219 -20477 -29699 6178 39700 53787 36818 -9856 -31140 -37410 -21421 4271
25075 4271 10680 18923 28599 25382 42520 47751 46333 26524 36764 23788 -7254 -2391 3704
25062 3704 -12977 -34394 -24485 -16856 -4330 21388 31255 35027 23921 -5164 -14612 -16086 -11017
25049 -11017 -7155 -8190 -11181 -9647 13640 22120 10945 8123 14574 17023 4168 21001 3546
25036 3546 -2599 6814 17212 7666 -8349 -8691 -500 11160 25745 26679 42656 26749 3254
25023 3254 -3494 28331 40989 39390 42070 58676 37768 36564 40173 40984 41744 17022 -3556 4977
25009 4977 16388 25885 16728 16178 30746 22570 -5146 -12887 9027 -261 15559 38963 38253 35833
24995 35833 60432 66634 60825 27299 23116 23382 13260 -848 2083 9321 21882 496 -7684
24982 -7684 -2828 1335 10606 6648 15356 36570 18339 10980 -4645 -15406 7721 8140 -7062
24969 -7062 -14831 -26845 -19761 -15602 -26221 -34338 -16450 -12039 7564 -7136 209 284 8158 -11607
24955 -11607 -22187 4838 28124 35695 8983 7189 18152 12843 16792 3534 -1429 8832 3983
24942 3983 -3900 -3188 -13968 -14296 -25467 -23464 -11611 -4205 -12722 -17003 -17027 -15103 -6318 -14942 -18147
24927 -18147 -29787 -8083 -2596 -30141 -23827 8965 -911 -23529 -38922 -1588 -7880 -25978
24915 -25978 -26053 -23818 -6134 11932 -17039 -19733 4797 7378 -4950 4216 20855 34451 27477
24902 27477 19498 25853 14195 9411 28832 26153 30796 16590 -10667 -5000 -1368 7831 7683 14592
24888 14592 9201 -13206 -28478 -26549 -29024 -21226 8165 -8798 -8689 -13147 6476 17319 15026
24875 15026 25021 56972 41178 40814 42080 52835 39246 41974 37878 27523 11056 -14981 -41555
24862 -41555 -72488 -58155 -44410 -55808 -62427 -45328 -32211 -21252 7017 23012 25115 32505
24850 32505 25579 10544 163 -34940 -62078 -48490 -9025 19825 26967 17932 14953 27607
24838 27607 12595 11082 -25485 -21593 -22723 -17268 -12934 -3839 -11695 -11637 -8586 -27567 -32535 -11728
24824 -11728 -5009 -644 17736 17588 19996 31856 14057 -18743 -23732 -21587 -15991 -17574 -18450 -16162
24810 -16162 -21159 -9440 -4001 -5771 -3065 -11277 21080 43212 38940 30052 7042 -23570 -18665
24797 -18665 2101 -5050 -19385 -38434 -12122 -6000 -16953 -28520 -39583 -13121 22536 9538
24785 9538 9243 16586 -10267 -1631 23753 40221 37112 20362 26255 46943 25583 16256 12589
24772 12589 -6908 -11392 -27095 -54804 -37294 -16079 -31137 -28967 -32585 -18363 -6441 0
24760 0 -12005 -13574 5057 16911 9842 20267 15215 13601 6074 -17274 -4533 12453 13133 7561
24746 7561 5987 -1785 1883 7316 -4058 -788 -18968 -43442 -35242 -15546 130 -4659 -12085
24733 -12085 -475 11175 -1181 -11649 -9089 -28535 -20563 -15306 24016 25144 20548 26201 28571
24720 28571 14834 -4556 -30801 -38900 -10314 814 -21326 -34957 -17036 17521 17334 475
24708 475 -21706 4880 10462 9507 -23941 -44480 -29844 -20682 -11755 23205 20809 -10508 -36710
24695 -36710 -47219 -45001 -12759 -7012 2858 -5513 -13192 9694 8004 23094 26944 36364 33297
24682 33297 26635 13955 -5833 -11701 -20707 -27685 3977 8540 9320 21933 -1938 -3442 8488
24669 8488 -2351 -24432 -18828 -2350 -2552 -2395 -10381 -18801 -13870 18787 40526 27349 6814
24656 6814 -9931 -13456 -13137 -1299 -18630 -16552 3274 19703 24505 33509 50577 37265 32370
24643 32370 9373 -3830 -15041 -9626 -24201 -38194 -38038 -38968 -8841 8381 -10768 -36655 -39272
24630 -39272 -26835 -20237 -3725 -7200 -13394 -16285 -4916 -13104 -12961 -9273 -1810 -7141 -11052 1880
24616 1880 6771 2957 22207 26391 28174 512 -2986 2442 -867 -1680 -1492 8187 35213 21116
24602 21116 21224 16885 30539 33840 37290 42813 59609 48593 50090 66686 55279 55540 51657 27876
24588 27876 8875 -7034 -26057 -37981 -33564 -25985 -24752 -3053 9593 15720 26778 10398
24576 10398 -6092 -2420 36714 41238 24678 26853 37480 36812 37122 38263 21716 -420 -12167
24563 -12167 -20793 -26602 -28014 -41599 -47762 -48794 -14071 -13504 -5626 1134 -1554 -18481 -19584 -18315
24549 -18315 -19387 589 8129 19213 13391 109 -11439 -21660 -22378 -12258 -280 -17875 -22911
24536 -22911 -19069 2748 18504 4408 -1834 217 -17365 2496 1276 -9132 -13521 -9592 -3641
24523 -3641 210 4192 30984 33254 26805 45197 66428 35249 -2384 487 -8431 -21477 -65308
24510 -65308 -75554 -57262 -29988 -35452 -26474 -29289 -42725 -39624 -20148 -28568 -28808 -25236 -23289
24497 -23289 -28422 -8777 -10659 -16861 -16202 -25297 -13425 -6272 -11508 1062 -8371 -9450 1391 20230
24483 20230 22835 4491 -6092 -11901 -11590 -16065 -23779 -22167 -23109 -18970 -1178 -21017 -28620 -11455
24469 -11455 9965 -4164 -9004 9128 2460 20617 21260 36296 26539 33876 49441 64678 82915
24456 82915 95269 97336 48890 42861 44484 33214 13893 -135 -13976 -33923 -35075 -18911
24444 -18911 -13576 -10475 -4184 14790 17734 26283 26074 12937 6881 34763 43897 49664 34886 24828
24430 24828 5675 -8578 -17431 -4263 15130 14676 11800 2252 -1496 -4858 -22431 -22968 -21589 -17485
24416 -17485 -13876 -21358 15600 30244 -5036 -26452 15260 24509 -19445 -23714 -38187 -23896
24404 -23896 2467 3256 -10626 -13346 -27628 -6824 6453 11750 275 -10588 -9628 1877 8820
24391 8820 3754 -12660 -13835 -8848 -2596 -13483 -6144 2260 15760 800 2809 -6581 -9980 -5876
24377 -5876 7967 18655 4416 -14266 -22817 -10422 -4493 -8296 -8984 8711 16050 -4574 -27600
24364 -27600 -13041 -18886 -30790 -19051 -10620 10196 18586 9425 4291 2552 10899 8332 25882
24351 25882 14273 -26186 -27363 -21249 -11386 -33006 -33578 -29900 -20043 -35484 -23491 9123 -8226
24338 -8226 1394 25368 30152 32687 41957 35438 37912 37277 11430 -13651 -11209 2114 8013 6241
24324 6241 16301 10454 1635 4771 5572 5130 6366 240 -635 -3449 -123 -983 6419 10942 3510
24309 3510 5213 12140 -11183 -11095 -12710 -8259 -8952 -6018 -11571 -4807 -2207 10571 28000 43337
24295 43337 30148 -9234 -4715 -24992 -11123 18088 25421 48546 22078 -3595 -14273 -14025
24283 -14025 -11992 -20422 -20879 -30720 -29739 -24767 -16157 -15276 -4251 -4783 -16150 -8056 10883 21969
24269 21969 38335 21592 11751 7901 1311 -2334 22820 47680 48913 62392 38865 5022 6074
24256 6074 2149 3051 11165 8238 35159 54035 37787 43625 25684 6363 -3634 -3537 -6878 -15659
24242 -15659 -39938 -51744 -36318 -13797 -17805 -15836 16465 15400 13241 4591 13147 20671 19190
24229 19190 26306 20607 43331 67100 41690 38325 43972 37118 28376 18541 6117 4989 -9532
24216 -9532 -14228 34591 42168 54410 63789 37829 5278 -13208 -24910 -18787 -26282 -19269 -17956
24203 -17956 -5007 8951 20987 16543 9209 -10107 -25863 -34199 -33226 -29825 -7222 4183 -34329
24190 -34329 -38796 -40781 -21940 -24849 -31574 -21534 -26270 -23324 9114 9659 15397 9608 7367 8411
24176 8411 2110 10408 14166 35014 41329 8336 -12690 7838 8158 -11846 -19451 -1913 7399
24163 7399 6466 -1711 -4023 19751 17725 3226 982 2437 7463 -7916 -37902 -27178 -1292
24150 -1292 4613 22177 34110 42803 25851 24647 3897 -3295 6315 13841 26436 14307 -6019
24137 -6019 -11074 -5380 -28128 -14866 5858 5279 -27474 -33000 -22262 -16978 -16787 -5899 26267
24124 26267 28295 12971 1670 2380 5389 16779 29075 35144 17943 29604 56441 26692 -10702
24111 -10702 -29115 -37162 -31596 -14162 -16982 556 21045 16019 27207 17303 9845 549 -13037
24098 -13037 3261 19548 14900 -10017 -12381 -30831 -31435 8289 8459 3477 224 -4927 -12969 -28876
24084 -28876 -31597 -34893 -31642 -3948 -19025 -39951 -34755 -22690 -3946 11557 11074 14142 -5315
24071 -5315 -8900 -3305 9871 40089 39547 25527 31596 5115 -163 29346 13233 -16599 -14298
24058 -14298 22863 21683 8543 -8091 3881 14514 -1837 -19368 -25100 -15719 -9513 -9105 14121
24045 14121 37946 38074 29527 25284 23847 23765 18501 7542 5776 18445 10237 10165 13759 19192 3592
24030 3592 5790 16545 15431 -33990 -55756 -30752 -14867 -18484 -16127 -5230 -21773 -42935 -38765
24017 -38765 -2414 -4396 -10453 -7990 -14743 -22915 -14671 6679 9108 -5922 -3806 -25254 -16860
24004 -16860 -26293 -24519 -39533 -36669 -36479 -38505 -19102 -7415 -4405 -20125 -34229 -17888 -26937
23991 -26937 -34593 -26229 -29632 -18586 -8867 -15456 -8813 1959 16028 16991 23219 11865 -3574
23978 -3574 23298 29498 -4156 -22738 -6846 -367 15237 12432 27444 25551 37346 18918 -12785
23965 -12785 -11506 1546 16862 22024 16437 18378 43133 35721 16227 40550 44079 31555 21645
23952 21645 6157 -11409 -28087 -3668 14714 20137 -3088 6029 5099 -10063 -12030 -20634 -10959
23939 -10959 -1825 18519 10763 -10141 -32021 -30492 -6179 -3018 -13358 -30306 -25438 -6714 -18425
23926 -18425 -17779 -18861 -14888 -5639 -2115 -2934 -10032 -29876 -15276 -16303 -6950 880 -585 881
23912 881 -8523 -10622 -12993 -6500 -2156 21465 16478 2640 -7147 4162 -14532 -49975 -43781 -18453
23898 -18453 -21139 -65757 -66625 -40485 -18537 -32538 -27199 -14126 -4966 -6786 8233 -1435 -11915
23885 -11915 -2966 1487 -8432 -15882 -12619 -13439 -14888 -25401 -18935 25873 52407 29363 -10036
23872 -10036 -23987 -16772 -1264 3641 5227 -739 -335 9788 -2041 -1522 -3658 -30156 -24733 -20013
23858 -20013 -11431 -932 19010 20403 10038 18407 7550 -19038 -28016 -4378 -11549 -30054 -26019
23845 -26019 -13817 -5233 4754 -2190 -3207 -6511 -18070 -28302 -18544 4135 1852 411 3655
23832 3655 338 -38310 -24838 -10039 -9945 2168 8339 3090 5362 4104 23875 17947 12668 17070
23818 17070 2945 -843 17657 166 -24216 -23099 -8998 -20852 -21447 -20687 -15633 -4084 -5000
23805 -5000 -21309 -26425 -6404 4192 -9566 -32205 -36988 -44177 -35346 -19130 17413 29784 19088
23792 19088 25986 14330 4921 -7374 -21955 -23908 2397 8333 7685 14269 987 -4706 -2614
23779 -2614 18 -16050 -49777 -67049 -35350 -19388 -15452 -8703 -11461 309 -14422 -23634 -16622
23766 -16622 -35654 -46425 -39619 -5885 17721 25509 43988 45351 26832 -269 -9424 -5865 5262
23753 5262 -3102 -186 -11442 -34765 -9919 2240 -22440 -70578 -79126 -71774 -77601 -69697 -37884
23740 -37884 -12311 -2133 33930 18479 3752 9651 37980 60662 35300 17027 -5508 -31792
23728 -31792 -12939 -4111 10185 20586 23372 25152 17220 -708 6198 5442 11614 13125 25555
23715 25555 9308 -1014 -32868 -22161 -18453 -15817 -9091 -10614 -1077 11489 7402 -2637 -25733
23702 -25733 -15954 -14424 412 3389 520 12551 15192 6583 10473 32902 71973 76135 55841
23689 55841 38479 31667 12908 -9023 -16745 -20777 -18758 -22399 -35245 -27895 -3055 -19647 -26175
23676 -26175 -39976 -24270 -21275 457 3210 -4553 -30877 -26722 3900 18867 28448 33601 24451
23663 24451 3829 -12825 -16397 -6992 28916 49454 13390 8305 4711 647 -10211 -12408 9166
23650 9166 42307 40107 32505 16737 3919 19953 50548 59382 48977 50192 39946 58981 50795
23637 50795 18686 400 -16388 -33273 -34053 -5455 15587 21338 22440 16405 -11788 -32646 -38783
23624 -38783 -4520 9519 -1355 -33355 -18360 662 -22111 -35054 10833 28546 3044 -25575
23612 -25575 -25897 -42595 -44105 -55045 -56547 -33074 -45872 -44675 -31507 -41751 -28889 -146 26829
23599 26829 28921 6180 -10588 -4113 25924 38395 26431 732 10981 18142 23648 23516 16563
23586 16563 7101 6314 15483 33057 -2982 -15757 -28465 -16312 -3295 10212 -16663 -37945
23574 -37945 -16448 9006 -9649 -21614 -26527 -12449 -13248 -16053 2134 16271 22993 5733 -16721
23561 -16721 -885 17934 25142 29201 32861 28509 29480 17319 -4405 -16272 -35318 -39541 -37895
23548 -37895 -50862 -57227 -49736 -47065 -27130 -30329 -18083 -6068 -9972 -5581 586 -3120 -11537
23535 -11537 -7866 -602 14874 6681 11718 5524 -17373 -36138 -34735 -3708 -30433 -33604 -44999
23522 -44999 -59642 -57162 -48923 -51178 -48901 -23246 -9345 -13092 -16183 -26558 -5243 -7682 -20153
23509 -20153 -21355 -37174 -29912 -26046 -15197 4169 8250 12332 -7634 -33478 -31911 -16213 6441
23496 6441 14346 931 6002 27103 37095 19131 -9585 -8228 3293 11049 10231 -2111 -10903
23483 -10903 864 3122 -13345 -10320 4397 16763 -431 -11473 -15130 -10973 9675 21692
23471 21692 -2768 -4779 -22117 -11030 -5693 -21456 -20748 -8579 -5872 882 4060 5560 -19437
23458 -19437 -27675 13658 9195 6869 2968 -12026 -2387 -8650 -14268 -22980 -20797 -22679 -30661 -28693
23444 -28693 -38656 -31482 -13966 -12429 -12705 -20300 -25158 -4704 12957 28666 16033 5097 -6939
23431 -6939 -14971 -13749 3145 24895 19418 -3204 8116 22005 12374 -18844 -23283 -25468 -27128
23418 -27128 -29617 -45439 -59152 -59488 -37289 -24144 -18473 -13044 -1331 2335 -1229 -2071 -7363 -4442
23404 -4442 16480 16335 8525 20246 33012 12157 -5017 -18060 3075 23482 6227 -19163
23392 -19163 -29086 13055 22906 22116 17914 16860 27748 18265 25965 7057 11639 26943 23027 2317
23378 2317 -4222 -9531 -18825 -26460 -28567 -20636 -23475 652 -12664 -36735 -29438 -12109 -18113 -31501
23364 -31501 -29494 -19067 -17970 -17799 -35278 -27596 -33370 -52207 -49280 -36354 -45048 -58739 -39451
23351 -39451 4487 13137 15909 20407 11083 -1595 -16127 -6413 -10227 -49255 -76019 -62218 -40078
23338 -40078 -44288 -29074 -22936 -20348 -4303 12228 8430 15002 15878 -12757 -35748 -33675 -25307
23325 -25307 -5783 11182 22476 2461 -6909 -19951 -34210 -27590 -18732 -8265 -12775 -16616 -17990
23312 -17990 -3554 -17662 -21413 -13086 -2011 3916 14487 25122 27502 31579 18098 -12418 7680
23299 7680 35826 68428 61390 29024 -969 -7838 -2318 4475 2479 89 427 -17417 -12964 -3122
23285 -3122 -20032 -19215 -20919 -32617 -18017 -222 11260 44370 40683 11620 5732 -15762 -16775
23272 -16775 -4535 -11363 -10770 12833 15036 19371 30671 24250 28549 26831 19639 3595 -2184 -30940
23258 -30940 -56278 -26055 -22875 -16551 -14811 -28311 -27502 -21851 -9468 -15294 -11720 -19327 -9953 -19686
23244 -19686 389 19730 7255 14939 15374 18946 -5244 -12230 21054 19476 12809 13068 7434 7331
23230 7331 30197 26717 4483 3463 -5345 -5921 2410 11368 12316 10718 22693 42226 24411 -479
23216 -479 -9920 -5315 12297 20280 -12222 -9023 -2434 -11648 3893 26430 49556 56400 36427
23203 36427 28308 12969 -7064 -1806 -2471 -446 3089 1924 -11762 -18236 -29433 -30561 -11311
23190 -11311 6984 15640 17597 21142 16020 -11172 -17449 1503 32670 14439 19145 17194 16360
23177 16360 35953 56548 60141 48912 9500 -2617 -27926 -50057 -58120 -34531 -40894 -41050 -35713
23164 -35713 -38054 -41441 -38833 -43059 -11362 9507 -14628 -23673 -7095 -3694 1649 13755 10567
23151 10567 -2985 17441 23630 21806 14119 -4880 -4000 -6098 11101 39700 46021 43046 27113
23138 27113 45430 61944 54483 20415 -8539 -16151 -1715 9606 10581 6766 -6053 -9958 -20531
23125 -20531 -11827 -30545 -29438 -21466 -18035 -31757 -36857 -24169 -14709 1742 23816 34181 21557
23112 21557 24120 34097 44227 60458 50696 29869 22535 28199 4104 -23004 -46877 -6658 20680
23099 20680 1680 -12031 -18378 -13380 -11535 4611 14192 15766 -6640 -8578 14419 43811 37289
23086 37289 -6913 -20229 -41942 -56756 -42131 -30769 -23660 -20224 -9880 3449 18708 38571
23074 38571 44946 10509 -24097 -13231 -6345 -7349 10575 45278 49881 22768 -3714 19823
23062 19823 35410 49822 46835 32496 33071 14887 -8684 5251 32852 43166 44373 25141
23050 25141 4950 -3909 -2217 -4177 1200 -2998 137 16557 10610 4230 -7097 -22722 -28805
23037 -28805 -36260 -30663 -22272 9472 27951 28672 43497 55584 42183 28243 13619 -1672 -24730
23024 -24730 -13385 -8229 -14827 -27360 -40627 -31411 -29681 -31734 -44172 -42255 -42518 -51007 -54735 -47938
23010 -47938 -48564 -12883 10053 4756 9955 7807 16966 4412 -21127 -27845 -26083 -33530 -50322
22997 -50322 -24354 2486 38109 29592 9672 -3152 -10606 -16900 -15724 -12950 -1744 -19468 -22910
22984 -22910 -10474 -15841 -38637 -47223 -26779 -15623 -4698 -4668 -3357 -3060 -20950 -21488 -18652 -11923
22970 -11923 -75 9460 8573 -10244 -13944 -9588 -3457 -33157 -35582 8156 -6711 -25299 -23797
22957 -23797 -12986 -10192 -4680 403 9609 35305 33358 31355 56704 49341 15963 -8770 413
22944 413 -6219 -7936 -18663 -18772 10801 9006 -16192 -33830 -31479 -15802 -6447 -13434 -23673 -63363
22930 -63363 -62275 -35976 -10839 -20307 -24444 -20501 -14205 -11148 -27420 -41230 -26968 -8735 5399
22917 5399 14818 16173 29889 44596 14476 -34235 -45035 5974 31741 11543 -23332 -24226 -3149
22904 -3149 4723 25967 26725 -3696 -6600 -5451 -15689 -15460 -30893 -38281 -26745 -16804 -14881 2148
22890 2148 -4609 -14320 -5662 -1433 -5285 -19620 -35985 -37635 -29241 -37934 -21147 -11326 -2697 15981
22876 15981 1703 -7448 -15578 -18165 -30774 -27845 -12556 -19084 -9027 283 2937 -1868 -7258
22863 -7258 7880 13118 1541 14696 31919 19391 -19964 -29139 -25291 -10081 -10628 57 -5039
22850 -5039 -14162 -22551 -21125 -4241 -10807 -13404 -12567 6481 23466 27756 26074 23781 16008 -1007
22836 -1007 -20154 -20355 5711 31245 36224 37083 27757 30536 32302 32225 19716 13360 -6906 -17437
22822 -17437 9621 17867 20618 27585 30375 13335 -22709 -43244 -28379 -14203 -10823 8474 -677
22809 -677 -6961 -361 -9206 -9992 -24035 -27737 -4191 -13767 -46279 -52612 -52679 -60651 -57076 -41095 -20040
22794 -20040 1277 9098 11002 16168 29291 16733 11923 16207 10282 8115 45688 68841 51452
22781 51452 16878 16717 12390 -2764 4561 35149 59411 50665 46566 41342 10301 -1451 -5964
22768 -5964 -42773 -48687 -54333 -66732 -64546 -70543 -48807 -22457 -20025 -23252 -18755 -25232 -36414
22755 -36414 -33563 -29247 -23679 -51339 -51279 -21932 -1185 17968 8570 6239 11355 1557 -4862 -18794
22741 -18794 -17680 -22336 -6974 13018 16094 20478 8270 -357 -28036 -35503 -26628 -26205 -23239 -30258
22727 -30258 -30042 -26616 -22351 -25578 -19972 -5671 -6618 -24999 -42792 -48937 -35858 -23685 3759
22714 3759 25775 7333 5720 -5158 -23303 -34867 -25793 -19829 -17515 -21546 -15798 -16801 -24557
22701 -24557 -18106 -3933 -4201 1042 5563 -6512 -22814 -40511 -53300 -59867 -34475 -14739 -23305
22688 -23305 -46782 -50034 -38169 -19610 -3949 4680 -10375 -32837 -12260 -3831 10039 40138
22676 40138 34114 11001 -15669 -34596 -32254 -18093 -6221 -11497 -17969 -38110 -40202 -36214 -46860
22663 -46860 -58674 -56555 -31204 4887 1993 -19781 -34174 -25978 -5096 1274 -15728 -25537 -15586
22650 -15586 2872 -3732 -11279 -9402 15187 4990 3073 24263 27454 -4689 -2509 314 -12544
22637 -12544 8234 13196 -2363 -33452 -28130 -4710 -1035 -2640 -19752 -37626 -36397 -20770 -22476
22624 -22476 -21461 -7204 20754 47011 38488 19164 18517 6152 -15131 -23214 -20687 -33214 -30399
22611 -30399 -12724 -5827 -17186 -21617 -35598 -29428 3030 28066 7392 -19273 -43353 -53961
22599 -53961 -43887 -44730 -39835 -40630 -45354 -30229 -40121 -46033 -23953 -25181 -35510 -22774 -18857 -60121
22585 -60121 -40098 -17591 -16779 -36410 -42499 -3090 14975 6899 12077 17008 595 4778 4017
22572 4017 2810 -10715 -21751 -32230 -38192 -24888 814 28442 40345 260 -225 20883 5348
22559 5348 -8765 -46526 -52036 -21516 -26117 -27216 -24385 -16870 -36239 -42448 -13850 -10058 -12323
22546 -12323 -21695 -26048 -18223 480 -5534 -23990 -23043 -11969 -19650 -7370 -5462 8946 16357
22533 16357 -3026 4294 -11660 -28357 -20304 -6585 -9225 -9193 -16539 -48575 -43017 -35348 -37005 -9852
22519 -9852 -1458 492 5157 4740 -2165 23427 5119 -26277 -40016 -44423 -51997 -48282 -31894 -13423
22505 -13423 -3720 -7963 -19928 -17954 -20731 -21333 -37582 -41330 -44743 -44975 -43302 -38329 -10458 14322
22491 14322 34941 31668 31010 24343 12725 8913 -2848 20956 4988 987 17019 35177 37659
22478 37659 42642 18054 13444 31767 20987 1904 16879 24202 30361 26074 16336 36108 45131
22465 45131 49597 36882 34086 22109 20109 -7798 -44354 -45200 -37321 -24663 14060 27198 1725
22452 1725 6557 24349 -2160 -14873 -22883 2679 11778 18789 7193 3618 -7778 -8720 -19709
22439 -19709 -17834 -10698 -13152 -13573 -22634 -11050 5425 -18471 -60313 -57773 -32209 -1960 2479
22426 2479 -15760 -10769 -3856 -473 -2243 -10690 -3108 -16640 -41000 -36940 -27797 -13685 -8975 1069
22412 1069 9792 9866 -24601 -45589 -28137 3252 -5717 3927 5788 -3812 -18205 -52571 -50819 -31809
22398 -31809 -29235 -21846 -17022 -23984 6437 7947 10881 9590 10859 3495 -24704 -41266 -33822 -26553
22384 -26553 -23359 -26957 -22435 -39641 -61499 -57615 -9136 28412 41284 50998 38619 -2740 -24185
22371 -24185 -30951 -49065 -56779 -53274 -36668 -25104 2695 45782 40327 6870 -4022 -7296 -13682
22358 -13682 -31193 -34469 -17094 -16308 -17648 -19596 -42918 -62646 -47777 -25693 -35981 -24161 -12195
22345 -12195 -15726 -27620 -31596 -10115 10071 11693 -10839 -9041 -11667 -11415 -5320 13650 21721
22332 21721 12469 -9707 -9137 1141 -3972 -15448 -19795 -24012 -9940 4051 10818 75 -10729
22319 -10729 -7407 -34204 -17468 -13780 -7558 -21926 -23168 -32604 -29809 -9541 -10717 11495 45752
22306 45752 34685 32546 43854 3315 -14324 -14024 -15976 1126 647 4340 3525 -6909 -10178 -2333
22292 -2333 22788 -255 -14443 6236 4280 7821 -5097 -18186 -38917 -70245 -74282 -42081
22280 -42081 -35472 -33720 -15086 -35302 -40585 -31309 -19864 -31810 -39288 -32210 -35510 -35055 -28879 -38300
22266 -38300 -32644 -6043 -12968 -19867 -11604 -4104 -12856 -8055 -1838 2893 -6764 -13393 -3766 7114
22252 7114 26004 32286 17561 2810 11697 39264 32010 15819 -11349 -36843 -42997 -38067 -37397
22239 -37397 -26627 10798 18724 -8671 -32115 -22975 -14070 7472 443 -30667 -40004 -33252 -10013
22226 -10013 12294 8062 21251 2176 -3209 -7387 -5041 9569 -3777 -19504 -2204 -19682
22214 -19682 -50237 -51858 -41397 -24934 -18000 -8452 -4551 -4799 -8988 -15360 -27258 -24192 -14149
22201 -14149 -31538 -21307 -12557 -13500 -12522 807 -18412 -26270 -29363 -44716 -82466 -85594 -69209
22188 -69209 -33071 -32805 -43796 -33515 -35731 -26423 -8301 16683 32495 33168 41631 14516 1282
22175 1282 17133 16037 14543 3712 -3704 20100 14609 7593 11388 4747 -27819 -53788 -37153
22162 -37153 -16940 -29048 -29039 -12315 3174 -2153 2872 15308 -9535 -34818 -33560 -47690 -52642
22149 -52642 -47578 -39050 -18508 -6805 -14402 -9109 -4689 1139 -3617 -9989 -20626 -31710 -51824
22136 -51824 -24304 19390 37924 35049 20712 3134 -17031 -24832 -3680 1011 1158 -14484 -4015
22123 -4015 1355 -1715 -15096 -1834 -6303 -15978 -19992 -36557 -27763 -12890 -17204 -15061 -23904 -35674
22109 -35674 -42917 -45009 -39513 -35535 -63171 -61670 -35044 -30114 -29551 -1595 16825 17771 10392 13904
22095 13904 -16977 -29628 -52 19833 3558 15394 19357 11699 23809 19411 16565 -2428
22083 -2428 -15455 -22108 -45843 -42697 -32996 -36123 -37407 -29636 -28379 -22106 3083 12227 2048 -6909
22069 -6909 16673 32998 26085 16875 1446 -30347 -22121 -7693 -690 15633 13071 5010 -2568
22056 -2568 -17368 -8274 -3410 -2904 3328 -10154 -28641 -37476 -20285 3082 9986 -12649 -25370
22043 -25370 -20522 -27008 -47419 -53194 -47701 -59858 -31613 -35138 -42800 -38674 -30387 -50291 -50444 -62355
22029 -62355 -36650 -6925 -7847 -27152 -19411 -8346 18 9757 14807 25819 36092 17652 -8013
22016 -8013 6489 -1880 -11534 -4234 3728 -4007 -33260 -24654 12397 9844 -10847 -18648 -35094
22003 -35094 -18431 -6276 -9677 -8763 -14322 -32365 -34734 -25933 -6345 -7623 -15088 -7403 -11043 -6630
21989 -6630 -8759 -17597 -31520 -19388 -23747 -55629 -60319 -40537 -18841 -11777 -29934 -35952 -41320
21976 -41320 -41507 -35366 -18869 -13189 -7591 -19597 -35174 -42933 -37148 -24922 -36657 -16440 -24408
21963 -24408 -45127 -37496 -20013 -13540 -22639 -23147 -7081 7291 -14561 -32254 -43015 -33874 -45182
21950 -45182 -34923 -38254 -44957 -31897 -18353 2743 2084 -33007 -42913 -10088 26897 32657 35756
21937 35756 16631 -10536 -17146 -18650 -23843 -3081 -1233 -3107 -10767 -36724 -26632 750 -7375
21924 -7375 -24130 -32318 -45257 -28069 9256 -1925 -27836 -4794 31617 31458 37397 3377 4662
21911 4662 3154 -108 37023 38722 29132 31169 10592 16873 25891 9703 14838 8150 -3679 3701
21897 3701 -6657 -18308 -5739 -15759 -27172 -44326 -27129 1009 -10524 -41453 -42281 -21723
21885 -21723 -10341 -24990 -45122 -42606 -18679 -12086 -6110 2123 -26929 -34110 -23821 -27285 -26183
21872 -26183 -7554 -17838 -42757 -42673 -30791 -63565 -69281 -38614 -20673 -25427 -22147 -8170 10911
21859 10911 11981 7429 -10 -22746 -18614 -29340 -26056 -6433 7414 10086 8951 1511 7444
21846 7444 7176 -17533 -18104 -11371 -4631 -12148 -29461 -14330 -17150 -34781 -25791 -4090 -1483 -13403
21832 -13403 -17639 -31927 -43672 -62163 -56178 -42119 -24095 -8474 7222 -5294 -12049 618
21820 618 -8240 9741 23573 4139 -26534 -33470 -23982 -10309 -5666 1930 -9298 -44873 -46933
21807 -46933 -52523 -31933 -5972 -36794 -39248 -28598 -15461 -5878 11626 24189 29455 32615 24281
21794 24281 36701 26663 852 -31962 -28485 -17297 -28739 -44836 -51853 -31898 -29078 -41546
21782 -41546 -26711 -14339 -16870 -3869 17352 23510 26457 26307 7818 -4874 -18280 -39574 -60548
21769 -60548 -51795 -43578 -42002 -38153 -30801 -23977 -20806 -2845 3996 7177 -44057 -63421 -30309
21756 -30309 -13279 7132 -19183 -54662 -36166 -41703 -43951 -37639 -45741 -55302 -34595 -23099 -13089
21743 -13089 -17535 -30479 -20608 -13513 -12471 -20993 -16519 -19277 -29384 -12135 -3184 -29848 -40367
21730 -40367 -32652 -53395 -48181 -38006 -31239 -19641 -15143 -13231 -31001 -46802 -59895 -63228 -48496
21717 -48496 -30900 -21963 -48160 -48711 -30902 -15373 -32799 -33995 -44518 -47333 -36389 -52204 -44699
21704 -44699 -24123 -34442 -37268 -32962 -39505 -45966 -26511 -11076 -19104 -53252 -51397 -23317 -29530
21691 -29530 -26761 -10398 -20465 -23222 -4626 19841 36467 39187 58442 78422 74318 93062
21679 93062 147795 242435 305035 326728 334472 338934 326882 287113 240353 231206 262389 329265
21667 329265 425330 511162 583666 612558 585660 552135 492827 418129 348757 266296 226337
21656 226337 229994 261869 320775 369737 385374 356903 314492 262656 174470 105793 64767 40769
21644 40769 45004 49062 51831 51189 57795 63999 64052 63907 72068 50540 12595 -19517 -36213 -35346 -33628
21629 -33628 -25205 -8414 13249 28006 30758 21850 20930 6797 -16332 -13139 40219 71924 39258
21616 39258 17136 7483 9387 84 -13347 -2671 -7914 -8530 17855 14355 -4529 -25789 -45204
21603 -45204 -56665 -39960 -42675 -38519 -39342 -45978 -41188 -44248 -40827 -43330 -31975 -32013 -28393 -44035
21589 -44035 -47263 -42070 -32396 -7926 33823 42872 24712 40866 28628 20934 4088 -21716 -19419
21576 -19419 -4332 -17200 -26425 -34192 -10918 8148 33544 24565 -4865 -17134 -15231 -32995
21564 -32995 -9597 2765 -35478 -29474 -25738 -27056 -42034 -64819 -63737 -34892 -8848 -21499
21552 -21499 -33110 -17577 -37541 -47627 -47709 -43732 -31947 -22529 -36569 -26121 -16359 -10720 -11744
21539 -11744 -4744 -6838 -17933 -10105 -1579 -13160 1901 749 -1331 1719 -19815 -24523 -19898
21526 -19898 -10474 -29078 -58415 -31669 -6851 17823 -6377 -35729 -38283 -29247 -51961 -85954
21514 -85954 -76481 -74041 -71573 -71840 -60244 -45371 -26231 -14896 -29464 -45332 -52617 -28972 -11022
21501 -11022 -15220 -28081 -38033 -58537 -35580 1424 -1074 -1619 15105 -3006 -23342 -10959 -11477
21488 -11477 -15738 -21256 -12992 -18571 -37375 -47480 -46826 -41223 -32664 -46139 -52629 -63179 -69058 -72732
21474 -72732 -59259 -57616 -55530 -35217 -28519 -51996 -57109 -46587 -40307 -48382 -77178 -101957 -92532
21461 -92532 -72064 -27542 -9991 -26009 -42187 -47824 -44983 -38582 -31180 -29374 -20208 -8169 -6543
21448 -6543 -23970 -27382 -23662 -22393 -21489 -21600 -28047 -52113 -39198 -11487 -15223 6307 -13131 -16408
21434 -16408 -5998 -3232 -16805 -13345 -5050 12266 6259 16246 11492 14188 17859 8859 -8769
21421 -8769 -27828 -39818 -29513 -12527 -36023 -34002 -12465 -20945 -15197 -35616 -43136 -19557 -22392
21408 -22392 -23181 -20749 -23452 -21043 -14198 -10832 -21724 -8908 10480 2677 -5296 1873 12461 22631
21394 22631 35849 27666 21858 11976 4756 -7549 -8102 -7276 -20489 -29065 -12379 19676 25454 39581
21380 39581 54569 49212 42027 12475 -12303 -37724 -27133 -4431 3457 15743 8475 2305 4315
21367 4315 8979 14649 20553 -12720 -33647 -33301 -10678 13812 9526 7733 10096 3399 13022 28051
21353 28051 39273 53284 63274 57740 43974 23731 9326 13717 23860 6136 18038 52290
21341 52290 41429 19736 33781 33046 4097 -13295 -22334 633 9954 30059 34449 25473 7968
21328 7968 20554 15184 4634 -27863 -47282 -34772 -9585 14656 33760 62280 48546 35492
21316 35492 22848 16410 23105 27847 7194 -11898 -21636 -16354 -3966 27441 51138 55873 41870
21303 41870 16032 -37041 -54573 -44506 -36873 -54000 -46046 -24972 -4760 -19694 -29363 -24248
21291 -24248 -9619 -12957 -18442 -23990 -35774 -28409 -41282 -19032 -28842 -28549 -37148 -64648 -41577
21278 -41577 -31981 -60943 -99839 -90057 -72972 -62668 -63547 -44974 -54128 -36202 -12670 -3467 8510
21265 8510 22813 14249 -30634 -42544 -39152 -17292 18680 47154 42942 25027 -132 -7592 22370
21252 22370 46686 54871 51850 63865 101490 132414 178547 226423 295124 393530 537067 648256
21240 648256 722079 719772 602565 458716 343085 264488 229101 221614 237034 243095 241857 270086
21228 270086 349654 433416 548122 685232 793517 802013 684417 553218 435691 348011
21218 348011 273838 251758 258711 293683 338675 406521 495734 623044 744819 793896 738385
21207 738385 636897 518739 393101 316608 305117 276788 255462 257156 282610 316575 387552
21196 387552 515399 663650 802734 885774 853106 734491 576648 479646 402790 339231
21186 339231 292726 276472 277632 291910 294858 275562 266611 237511 229310 223823 244569 265164
21174 265164 296608 338553 364860 385823 406341 434277 461654 475780 487546 540563 599155
21163 599155 688889 819442 993650 1215092 1511824 1857944 2175759 2436638 2560873 2633659
21153 2633659 2705671 2867176 3148719 3615993 4295778 5207657 6460038 8217375 10676180
21144 10676180 14257540 19672687 27516979 37884059 49353496 58542491 62124697 61781207
21136 61781207 59586130 53244867 45179902 42032817 45667340 55240145 69420498 85221793
21128 85221793 98329393 107425951 112680300 108494336 95032343 81204896 67883677
21121 67883677 54273026 45581736 44096069 48569626 56879940 65400472 69164348 66454686
21113 66454686 61261307 53335939 40778551 28389784 20117612 15169326 12100900 10033727
21105 10033727 8491484 7277723 6351839 5599540 4981842 4519352 4166505 3842714 3519910
21096 3519910 3259113 2973800 2683420 2438769 2218733 2028351 1883665 1768269 1650602
21087 1650602 1542833 1460027 1392988 1306959 1220329 1141512 1062527 980979 949166 916680 877617
21076 877617 877808 845625 826327 782736 735474 702641 678608 645424 598777 576427 570938 567163
21064 567163 532879 513372 490624 465000 423491 389517 366360 381676 384653 412058 419078 392953
21052 392953 374075 360867 325918 307614 319511 301842 268434 280264 278532 279046 319275 340010
21040 340010 317095 276007 248535 254751 222206 221615 225792 236368 245915 248807 249519 233507 215808
21027 215808 205134 217328 217087 213894 219409 211109 200954 201542 187967 194901 205646 191110 194735
21014 194735 224823 224762 228811 228850 216367 209307 220753 225570 236897 229142 233773 244300 256385 242493
21000 242493 266256 281935 272939 275158 267155 222845 206674 221064 227361 231131 254089 259837 251847
20987 251847 255605 236289 215315 197515 171815 186085 198395 200629 172147 163575 168169 162329
20975 162329 164938 174496 157381 152602 161061 168098 155979 173669 178934 187259 208648 206867 192835
20962 192835 218554 243761 260775 269081 273063 244415 238616 225230 182308 181739 192697 178189
20950 178189 170024 160663 137511 140805 161876 166271 175712 183956 167699 173833 198153 190299 206627
20937 206627 209249 207527 205565 198697 199175 207313 215440 229724 237142 268755 317516 296510 276392
20924 276392 270203 272948 248253 211481 190599 212241 236045 256631 250892 251499 268580 274959 247013
20911 247013 240438 244080 238751 233120 242226 234120 221199 196300 159037 175546 193674 175856 154631
20898 154631 143784 142212 150322 183117 180701 186415 194016 210879 189427 173806 189644 174905
20886 174905 161528 190288 213730 210898 197429 170853 184866 202374 211901 219162 203668 201260
20874 201260 215347 166506 132084 149926 163504 161992 152367 148040 154221 130255 99505 90776
20862 90776 105876 107801 96753 90025 64232 75267 95650 95660 67358 42333 46107 68524 71487
20849 71487 66400 62641 70637 87502 86774 83254 61548 65160 78623 66429 59898 50505 35682
20836 35682 57144 64382 54911 43316 41253 13033 -29740 -42999 -36927 -13026 -10897 -5415 -11225
20823 -11225 21767 32251 13414 19192 51009 38237 30033 31324 36029 45155 49948 39439 22646
20810 22646 8554 23241 37414 44104 61505 60829 30123 28006 27144 19247 32527 58424 81081
20797 81081 117520 181830 214540 239360 219803 162558 144799 185584 230120 216066 147936 113976
20785 113976 93991 92423 109366 142706 174171 180028 209481 242110 265454 278683 301768 346089
20773 346089 367405 328499 274122 240997 214616 195141 173634 198325 252847 311533 305209 321371
20761 321371 309659 304594 331906 346153 329331 335744 329527 317987 316296 324716 346438 348166 362017
20748 362017 388590 443166 511630 576109 633566 662120 650784 603163 546873 512130 486228
20737 486228 473287 455424 435248 408951 402230 398609 429721 476871 499957 529590 541103 546009
20725 546009 564980 593076 602623 626482 623871 642106 652358 660672 683433 679150 688798 715004
20713 715004 752517 792972 834696 883371 900639 943303 986089 1011559 1036238 1117526 1235148
20702 1235148 1286149 1272764 1269523 1293139 1399162 1546699 1764342 2064632 2442467 2872097
20692 2872097 3281832 3468110 3357148 3197847 3220903 3441642 3745435 4075397 4408961 4690840
20682 4690840 4904768 4977879 4987945 5082066 5321280 5702201 6172967 6750734 7487198 8429578
20672 8429578 9645951 11203423 13232575 16020117 19961735 25550602 33450560 44660789
20664 44660789 60986671 86132721 124500029 177019352 235535269 278158223 275185232
20657 275185232 218815410 149787852 100903167 71821002 54679039 44258780 37948645
20650 37948645 34433938 33133143 34127287 37815650 44136131 51747121 57278248 56697497
20642 56697497 50886162 47035925 49085235 56863949 68968242 82659861 93948552 101610991
20634 101610991 110431570 122945393 141337518 174262349 225990854 285273145 324907801
20627 324907801 312446052 247107894 172067455 115940684 80539384 58897315 45101883
20620 45101883 35933464 29672739 25176927 21794134 19122694 16981241 15251003 13758505
20612 13758505 12476858 11463937 10831049 10521600 10449473 10522063 10685962 10978473 11420048
20603 11420048 11987081 12599379 13335201 14616021 16960752 20941138 27180800 35705452
20595 35705452 44870799 50801125 49254571 42174970 37442337 38507093 44610952 53910219
20587 53910219 63197896 68139349 67332431 64310338 58566423 48293991 38961641 35174752
20579 35174752 36610269 41272114 45702064 45255059 37293608 26705558 19040039 14435306
20571 14435306 11448359 9226016 7535131 6352797 5559739 5051740 4722912 4446732 4128601
20562 4128601 3837040 3560156 3269871 2992325 2750870 2575200 2458581 2389667 2296462 2219345
20552 2219345 2163460 2073272 1963490 1831358 1702498 1613658 1549458 1500299 1454514 1413490 1371151
20541 1371151 1338260 1310908 1299147 1277093 1228171 1165280 1171506 1183231 1160463 1104063 1024579
20530 1024579 1002546 973396 942876 917536 924172 930208 922545 878617 836059 827148 846328 849340
20518 849340 833995 820676 832620 809489 789339 807088 797452 794003 787928 799316 798245 765110
20506 765110 737653 762310 799357 826905 807148 722257 679623 686659 700115 718668 699978 716721
20494 716721 741668 725135 678430 657721 675299 693555 676478 653200 658130 658610 675633 680271
20482 680271 656910 642169 621193 603441 616285 643549 647449 660908 669801 660829 685192 754796
20470 754796 826892 928843 1062131 1252215 1586279 2114479 2741375 3352880 3640766 3262573
20460 3262573 2465690 1799792 1401370 1169610 1047785 939630 872665 828674 783558 752138
20450 752138 704856 667960 641734 631059 629563 644026 702070 757409 800310 849475 917960 1046654
20438 1046654 1196377 1447108 1809530 2322604 2991960 3754205 4383405 4538291 4048575
20429 4048575 3320730 2926710 2986821 3405860 4027900 4572555 4623426 4035053 3266650 2691391
20419 2691391 2246515 1876002 1591562 1366908 1209555 1135807 1137227 1202858 1272188 1306477
20409 1306477 1259248 1208299 1148000 1049649 905469 814258 786630 806174 838329 896070 1028398
20398 1028398 1239266 1518509 1937409 2539159 3192438 3557542 3304846 2522791 1783127
20389 1783127 1324092 1020715 838437 723101 643003 598231 581846 549404 519900 493958
20379 493958 478016 458165 443022 425582 402037 382118 363415 346956 334483 352603 357165 345424
20367 345424 332832 315466 309376 305147 282038 278369 256225 223286 223077 208127 213451 233359 263207
20354 263207 274634 298326 310258 288045 269719 282335 290727 305271 339462 325258 290650 273055
20342 273055 285269 324212 334705 339361 356204 351683 346175 337928 321555 314937 339103 360686
20330 360686 366460 369496 404168 460472 538954 625546 696825 678787 619569 583463 613593 691484
20318 691484 771263 851261 868218 853694 819257 773341 687275 597306 559051 589498 620774
20307 620774 646640 638234 557672 463007 405769 388611 376625 335994 304706 299519 334585 335239
20295 335239 299332 268894 254081 251074 262579 281537 293331 286934 262090 262202 285413 326414
20283 326414 355743 363685 348599 349947 413350 490818 578178 666543 707785 664473 605767 566924
20271 566924 571886 643016 757728 833796 899264 897584 861366 782613 675600 587066 534276
20260 534276 561470 601078 643663 661498 612766 528950 443730 384436 331977 294714 283154
20249 283154 290321 316895 303569 289812 275696 253212 228444 233116 242963 225676 236537 231676
20237 231676 215018 224790 209109 216661 232385 252570 257099 239801 222888 211137 217340 212888
20225 212888 218720 201654 192723 193629 188646 191637 167730 167605 155139 148803 146670 140703 134340 144362
20211 144362 168363 168535 157429 132017 126089 149665 166173 161030 188838 195395 188476 173065 183625
20198 183625 176918 174419 187443 194713 189987 201065 193072 185777 190357 225145 236052 254039 310411
20185 310411 417507 479212 539389 556331 506829 453116 436463 461266 513578 604739 739119
20174 739119 844664 872623 823713 701288 588491 494428 445144 408961 465364 552143 610227
20163 610227 636135 594581 495984 411284 340616 284665 267514 254428 243642 245185 232198 217895
20151 217895 228515 237663 229947 230600 216143 202835 187480 183033 155233 159531 191836 245421 277454
20138 277454 333175 391302 450647 511102 549908 546923 498157 440792 438199 464406 559195 679358
20126 679358 826629 942048 984064 921203 814848 708624 657622 676339 721594 769658 806980
20115 806980 826106 833437 760446 666804 614412 578544 541040 542241 512586 444083 394428 369617
20103 369617 364203 385494 405536 412012 382925 335864 298764 299367 289940 287437 329026 390132 439710
20090 439710 505033 609484 721464 830025 904308 869439 754843 607953 502789 435320
20080 435320 420155 400149 393968 406870 449095 482501 558750 683933 828971 967783 1082078
20069 1082078 1151931 1087646 942077 831576 799059 760903 804151 871674 939012 996053 1083500
20058 1083500 1186225 1300581 1385520 1402553 1284722 1094809 941767 855601 811369 752258
20048 752258 669793 577842 541959 542042 597439 667816 773108 871889 947775 967222 899058 758951
20036 758951 603050 487794 408787 354309 311139 313616 278326 256393 253843 227357 185048
20025 185048 171050 176194 202600 226251 226075 215977 196097 189995 220629 267935 299126 345991
20013 345991 397897 425590 410026 401924 401209 406455 421000 463399 495095 498831 478182 462173
20001 462173 493911 535811 549266 545969 485360 441977 435897 415156 443168 435870 387146 360496
19989 360496 327601 296418 302391 306379 314414 306492 279009 260825 262284 248246 248053 270047 295677
19976 295677 313874 364979 441575 566511 688029 781688 831160 830230 817278 801238 716415
19965 716415 673912 679742 738657 923087 1109417 1260441 1343627 1320569 1274361 1194081 1034218
19954 1034218 860861 713264 656572 682598 716339 773742 806827 771004 729519 689809 579566
19943 579566 457969 342488 271439 250727 244132 231170 230850 179823 151339 153039 141575 142470
19931 142470 139891 131976 141768 155205 152789 161324 162171 138376 130333 117865 111816 119498 161480
19918 161480 167203 148061 139701 143762 142955 147601 145264 123695 139693 176724 168371 129777 87758
19905 87758 84891 83611 107860 100565 109441 121718 120314 122382 139622 146746 120391 110856 133005
19892 133005 144494 151262 152217 144025 153928 158574 149417 122910 109467 139086 127980 124678 118020
19879 118020 126806 116164 112930 113383 85461 73130 106344 110305 111970 107879 113878 110667 128008
19866 128008 143150 136313 169410 159953 154915 174642 170966 158699 179423 189286 197755 186515 173459
19853 173459 171442 163284 172368 178699 191101 183611 178129 182099 192807 200216 188304 182792 171789
19840 171789 145108 141072 137990 145920 159200 143311 122904 137319 172197 184036 167690 167324
19828 167324 156799 159036 159386 160690 163308 144435 115552 122170 140031 176721 186571 199888 196700
19815 196700 185742 187201 197540 180694 168509 173529 171989 181718 196715 191827 188018 205162 197935
19802 197935 199235 197414 197929 177880 162511 136602 134836 147044 156936 150438 169542 176735 167491
19789 167491 191567 180085 157170 152547 166413 173438 172984 157347 166832 177644 170378 138635 151775
19776 151775 170823 175596 174366 171278 153400 170020 167028 174182 168652 174262 176982 158596 124187
19763 124187 132506 148210 167309 168617 174485 165588 173453 158521 142291 140477 144264 146061 140410
19750 140410 151309 154089 157259 164601 150478 129698 137990 156857 154405 155202 148927 133936 142122
19737 142122 151263 166002 181112 153136 147139 148743 134656 146350 159633 159344 145259 141452 132268
19724 132268 128054 108168 114639 119118 118312 118853 141083 185658 181348 148308 94765 67008 94215
19711 94215 117052 95963 107519 118379 105194 96185 113505 117423 125810 149033 127271 118085
19699 118085 139845 119826 90913 89640 95899 102496 130978 126156 119666 106650 104350 116275 149117
19686 149117 160805 184036 163697 141093 133866 133519 130291 112528 106771 110518 109236 122817 143720
19673 143720 138080 104919 92621 93008 103202 108993 113462 117218 84203 64327 88180 93341 115580
19660 115580 103830 101521 112541 102800 125135 134550 114609 116380 144787 161603 154527 136665
19648 136665 151315 186036 152432 135673 166793 193989 201556 189411 158913 164197 153497 152979
19636 152979 176020 200585 190770 181091 169649 174935 179749 221173 224708 212141 194964 181539
19624 181539 186017 195895 183484 164306 147785 162417 165581 159607 167000 172473 191100 217850 265511
19611 265511 287598 299890 281653 238852 217041 240591 252938 257822 268803 273131 281869 281422
19599 281422 293605 306959 318829 335829 341231 310462 310447 299203 296346 296343 310402 325058 332654
19586 332654 360263 380041 398196 391669 365913 345400 359338 403660 434094 442927 447115 441447
19574 441447 446074 441151 453267 447936 480779 468936 446925 466163 495486 491856 528345 557670
19562 557670 595615 653394 702763 749522 792660 863962 963100 1013056 1058358 1107035 1170894
19551 1170894 1274192 1412462 1562745 1710571 1824299 1933914 2078619 2292819 2602933
19542 2602933 2976140 3480856 4194315 5211349 6653709 8758886 11915939 16720931 23432212
19533 23432212 31459170 38344552 40248267 35756177 30015621 28207389 30906351 36738519
19525 36738519 42951776 45460884 41782408 36251389 34830134 37931883 42348960 43632830
19517 43632830 39008528 31996633 28225273 28955625 32990018 37802878 39508165 34627586
19509 34627586 25220699 17127472 12094955 9115725 7265932 6048926 5236971 4722965
19501 4722965 4431835 4223833 4052003 3973687 3923162 3905746 3958728 4097517 4308258 4603415
19491 4603415 5035279 5696161 6722183 8174472 10243657 13275117 17899282 24757614
19483 24757614 33759653 43015551 48453805 46046499 38664066 33928359 34668902 39864216
19475 39864216 47019866 52084977 50903241 44784063 40981935 42889398 48287595 52276002
19467 52276002 49770021 41318519 34264406 32633631 35692714 41115884 45028323 42813536
19459 42813536 33447454 22804183 15420093 11031762 8315346 6505291 5268307 4443694
19451 4443694 3853358 3389832 3006248 2686927 2455381 2326809 2249916 2195320 2116121 1995771
19441 1995771 1880457 1792847 1728914 1658913 1541142 1395649 1241345 1090348 939564 836986
19431 836986 796584 758107 700823 664521 624667 604872 599935 588423 537757 498576 460646 438867
19419 438867 427111 409717 418669 423557 405215 355703 344543 343553 319941 307952 305252 302718 282266
19406 282266 275165 277396 267675 284041 284252 291510 312907 342294 377472 420027 479785 552597 634467
19393 634467 682096 719930 754342 704875 617711 539050 495859 436862 361117 316088 281192
19382 281192 243268 236001 258190 251161 216693 179988 194318 212436 192005 182190 186951 194855
19370 194855 189870 218765 242829 220376 169996 136338 161901 201011 195754 176142 181725 189126
19358 189126 183093 198103 190356 192205 173332 154317 153003 162673 207354 253069 269647 266582 239156
19345 239156 290684 350079 372977 377974 366569 374415 373815 327817 279717 248812 229735 214037
19333 214037 204074 194135 192860 195952 222953 220410 217052 190423 169886 144419 153728 162908 181768
19320 181768 184879 193394 182526 156431 165419 177407 164237 136917 120799 130892 152166 141161
19308 141161 146150 155800 152122 173691 174303 144061 125672 131576 120160 104338 100440 117384 149174
19295 149174 136862 139032 154164 168718 182402 165574 161577 178053 174231 190574 159152 159062 150580
19282 150580 106175 106203 122214 132495 130392 141162 141072 138113 125900 137570 139869 126995 108747
19269 108747 106087 122071 126751 114470 120128 155127 150732 120166 121370 112354 78884 64039 77329
19256 77329 78199 77627 77155 82159 69414 75993 104996 136217 133936 116871 126052 135813 154350 133494
19242 133494 136877 120709 76991 66163 80471 80962 84013 82755 86853 92311 112431 110092 110138 121814
19228 121814 134645 137721 147154 164247 172939 184354 204851 205424 190091 173401 146601 113738
19216 113738 107749 142733 148437 142073 134636 89878 83362 95802 87631 95863 110678 105415 104237
19203 104237 109970 121286 131459 113732 115118 117425 140555 145972 150954 165941 183861 200494
19191 200494 192778 196832 207117 200845 185116 164214 144167 131874 112409 98861 102379 120075
19179 120075 126857 145975 153227 159844 157551 141725 149949 169774 164122 169541 159808 126016 131715
19166 131715 120299 99484 105620 124340 137290 146621 157149 174074 177676 167003 146749 143187
19154 143187 156418 134127 119082 114181 103951 92632 101064 111651 115018 122409 158306 177016
19142 177016 164533 154354 171568 173765 162615 153690 160430 170213 161998 165187 190790 209815 185598
19129 185598 155864 143896 157326 182950 169869 171650 173666 181712 163743 160983 142437 151711
19117 151711 161588 157792 153419 126747 104216 102868 116949 107208 75438 92995 111301 143558
19105 143558 161447 163095 172179 150476 127225 131967 134671 139199 140949 121660 97646 106536 140017
19092 140017 165188 181824 163033 151045 162744 142176 118834 117253 135710 145292 138172 167874
19080 167874 164730 151271 127375 109539 104859 116307 110488 84079 90687 100713 102502 134763
19068 134763 166163 151409 112840 104185 118814 152184 148489 158617 140372 126214 132656 139650
19056 139650 147244 158252 153635 175934 183725 166375 164177 164742 146702 97647 95601 134200 146620
19043 146620 147129 153088 175989 176154 179239 167533 174957 175012 167091 164426 183424 165271 173360 192203
19029 192203 199173 208503 195798 221181 228445 201923 207339 220086 205631 203223 202248 185697 184135
19016 184135 219419 243799 246842 256732 247695 251973 274922 278565 293151 300035 295185 304791 322262
19003 322262 366091 407826 410188 392608 368735 349208 323486 332039 377465 389795 436514 473602
18991 473602 507766 509150 500445 494190 464777 432021 416726 412201 434784 409932 412952 439232
18979 439232 482559 480312 467353 456786 438965 415210 431736 457218 465220 472488 470831 483983
18967 483983 520930 554370 551327 564975 582408 634480 665803 708809 780838 899056 1051618
18956 1051618 1180762 1263416 1349390 1467454 1589684 1672083 1716812 1696622 1667642 1645436 1644871
18945 1644871 1698261 1793685 1925697 2077564 2280411 2515089 2755169 3012112 3271793 3643495
18935 3643495 4219550 5116407 6442709 8356522 11016840 14840396 20629468 29094592
18927 29094592 40329127 52878995 62963039 66109610 63588051 58887107 49274015 35162339
18919 35162339 23335417 15989225 11590013 8862683 7066492 5816051 4947756 4368494
18911 4368494 3958694 3665960 3444995 3318632 3305539 3341734 3335351 3272652 3263629 3304428 3354623
18900 3354623 3378452 3391143 3368220 3356008 3363188 3342061 3353653 3397960 3548872 3716373 3913682
18889 3913682 4177611 4555845 5101221 5834040 6875206 8412731 10626546 13763526 18185633
18880 18185633 24616901 34433821 48970608 68480993 90737440 109604051 117258044
18873 117258044 113927715 105920889 90277516 65922036 43652337 29276902 20728069
18866 20728069 15486966 12098773 9778496 8111432 6893035 5957633 5200442 4575650
18858 4575650 4068532 3675258 3395839 3220437 3077874 2999526 3000763 3043023 3063824 3049423
18848 3049423 3026112 2993095 2953659 2890680 2820853 2769450 2718958 2647315 2602597 2575949 2629117
18837 2629117 2795362 3081616 3484917 4055637 4904155 6152324 7938276 10537931 14639285
18828 14639285 20838638 29399166 39612309 48936103 53556085 52434899 49074958 42831750
18820 42831750 31811064 20914832 13811076 9649810 7127654 5507955 4400733 3594189
18812 3594189 2992294 2535361 2175131 1888497 1641021 1428279 1284460 1193048 1140329 1123976
18802 1123976 1117771 1137553 1164071 1152127 1129319 1109789 1039512 954821 884307 825100 781660
18791 781660 764365 697366 572971 490112 465719 469404 451630 409434 380932 387743 396997 395010
18779 395010 414175 455865 512307 569448 605837 591914 541930 507933 518377 551797 644838
18768 644838 740765 818161 845051 818613 741322 694811 653346 590871 523895 502584 483245
18757 483245 513613 557422 568386 528469 464804 426573 418036 423862 430967 444086 474259 496441
18745 496441 528686 589944 631266 583355 490584 389783 334002 301194 271936 254809 273816
18734 273816 290655 278115 298113 333438 372469 431113 495744 594214 711415 742120 713453
18723 713453 649682 615417 641847 724381 828132 928491 1011499 1048895 1137881 1298743 1440706
18712 1440706 1429123 1243189 995254 826338 721806 685749 690585 705486 645938 507954
18702 507954 379556 326537 299349 267466 244695 234019 248552 249720 248385 243972 249705 237596
18690 237596 245350 263054 263858 280218 273339 308145 372868 443393 481646 505175 452102 372846
18678 372846 306256 270016 212034 205157 200623 183506 153944 180511 193411 178138 179117 155840
18666 155840 130547 141183 124994 118128 114863 144079 133345 125373 105570 89019 81553 80415
18654 80415 80652 79829 99941 109866 113435 128333 138431 145258 138746 114740 112102 112706 101076 87114
18640 87114 120913 129225 118070 99967 98776 109194 95923 76904 92796 117588 103610 120458
18628 120458 110742 106339 93191 83899 101092 86260 97812 117458 124987 109877 99552 83828
18616 83828 88780 113826 130359 145008 165012 187963 206914 245645 291188 336577 358257 347759
18604 347759 358805 339826 323220 336057 376909 452830 521973 544762 500062 436594 377434
18593 377434 309466 257692 226233 235535 267748 339929 371863 367343 356434 303377 230745 175856
18581 175856 172433 163814 151124 132660 105093 96507 95787 86723 73561 85101 92619 121739 120516
18568 120516 133046 160864 183907 206159 240378 292932 343898 411777 552749 690806 783074
18557 783074 782735 711834 597625 555563 589476 635764 751696 886148 1009449 1102887 1111361
18546 1111361 1073805 1044628 1022664 1045669 1115152 1195436 1240147 1278712 1286099 1201843 1001591
18535 1001591 745409 558844 434387 367407 306860 247516 227594 207424 196304 177072 171502
18524 171502 163924 160847 145471 143553 156268 170211 165098 177697 185107 186101 192761 201504 180139
18511 180139 169348 173975 191249 176910 206229 220586 253749 247855 226509 231983 253088 307909
18499 307909 356011 425561 509698 600753 738359 944549 1228490 1538364 1795471 1935814
18489 1935814 1991874 1912826 1701555 1450729 1201354 965106 732298 574324 486953 430537
18479 430537 367822 306071 284593 279603 270625 261753 216999 191022 210253 214395 190053 223184
18467 223184 233462 231247 204858 200752 206673 217747 207353 198699 202134 208299 190987 197973 238492
18454 238492 242415 238380 265387 295505 344221 393770 422854 460838 567631 712277 880929
18443 880929 1098730 1367984 1585424 1698547 1702438 1588673 1407651 1158722 895296 670441
18433 670441 504158 398200 339968 294259 256306 237143 224882 229084 236950 254115 223126
18422 223126 215342 197299 184126 221363 256643 290305 326318 332667 302597 284304 257350 234798
18410 234798 257847 315063 378819 420343 442904 474319 503316 492836 469370 460508 479302 532982
18398 532982 594958 646236 659573 687305 719625 733317 748942 747936 745646 713952 626456 550848
18386 550848 429662 334671 271808 225794 202530 193621 180666 166916 149671 156858 161147 150633
18374 150633 141289 162591 158852 154568 153887 163319 177695 182092 188587 203595 188287 213815 242031
18361 242031 251222 301502 311616 286562 269295 258061 270026 263910 264273 302734 351387 423046
18349 423046 534578 663061 768930 795956 769648 720015 653477 559149 475186 404350 358281
18338 358281 327660 296997 293369 258203 225894 207249 202854 230863 257427 256703 229706 217760
18326 217760 223040 238569 248447 247555 256341 274368 265556 273297 275434 280539 293272 316731 302378
18313 302378 326884 359896 352039 324741 327514 343214 327682 313914 330406 351805 337361 317024
18301 317024 318963 360907 416991 472367 531690 576665 580318 587565 560251 525548 491964 468286
18289 468286 437399 427301 411663 415648 413789 400325 362140 370745 400663 398527 411072 423969
18277 423969 427200 433157 435719 474118 503424 490363 474490 478309 477542 450566 449269 471437 487418
18264 487418 521012 520027 524652 531615 550659 592801 652798 684859 725393 728524 698983 669731
18252 669731 653176 653961 661027 688235 731987 748484 759991 818040 867604 909068 939948 950589
18240 950589 987394 1036389 1054664 1088079 1140548 1205300 1270536 1372695 1501725 1672365 1842994
18229 1842994 2023048 2204621 2413948 2670066 2977848 3385181 3956697 4755641 5872520
18220 5872520 7422223 9501008 12329612 16394214 22748399 32692170 46772568 63271152
18212 63271152 76390622 77310242 62393137 42070807 27127306 18408440 13355511 10293248
18204 10293248 8431447 7378661 6831058 6536185 6271798 5964521 5740878 5648192 5726052
18195 5726052 5962963 6405364 7153390 8327014 10021940 12394299 15596630 19903860 25794127
18186 25794127 34510782 48298687 69376065 97887504 128771445 149190045 143006550
18179 143006550 109676199 72051725 46211802 31123633 22194321 16666579 13234396
18172 13234396 11158676 9850486 8884830 7923047 6912362 6055458 5441207 5086558 4894512
18163 4894512 4884456 5127419 5638388 6450331 7597971 9190079 11344005 14346848 18922946
18154 18922946 26288165 37464624 52135557 67051152 74917183 68074967 49367674
18147 49367674 31461892 20136824 13675040 9852135 7460438 5975766 5043128 4445054
18139 4445054 3953634 3403117 2868251 2397460 2037275 1784799 1577924 1452426 1371493 1322004
18129 1322004 1326287 1336786 1344544 1344844 1350416 1349740 1355718 1408372 1500638 1640096 1823295 2075937
18117 2075937 2440763 3013032 3914196 5170791 6973138 9811156 14793610 22651044 33263610
18108 33263610 43711972 47898476 39440753 24485872 14109918 8733564 5883380 4222326
18100 4222326 3176402 2496963 2054211 1758670 1510204 1303698 1139512 1004489 902720
18091 902720 834978 795502 816266 863952 865379 783475 701765 621534 558666 517708 494129 464463
18079 464463 449454 434837 406591 361172 324391 281250 228461 195860 183493 165811 185364
18068 185364 188303 200800 216075 211672 195122 184792 199022 237545 266552 277389 291077 308638
18056 308638 335779 313986 269697 251996 223953 226072 251541 285912 330373 403468 493660 580626
18044 580626 633744 743757 889936 1046616 1130341 1041234 823352 609811 479883 417529
18034 417529 361690 321425 273330 236992 227755 190568 150190 147623 154091 150609 148071 154037 156706
18021 156706 177902 200280 204670 210744 259647 332774 416503 515974 693717 977886 1286819
18010 1286819 1556390 1631875 1426822 1059441 732275 564893 499487 470517 504510 624799
18000 624799 772943 918926 943499 808138 626401 467786 370359 331144 307184 280566
17990 280566 266347 275787 318012 332359 385980 463091 524662 634081 777123 937697 1130024
17979 1130024 1293490 1340300 1243399 1101578 1008205 993337 1032576 1111140 1247973 1425016
17969 1425016 1670431 1859621 1797824 1457401 1036761 726122 531343 396640 321919 298336
17959 298336 283593 242401 248162 252366 244128 205481 163914 147099 171564 181474 160606 149279
17947 149279 143937 155623 162035 198817 245567 283011 355024 483549 664150 847542 932823
17936 932823 883645 732944 568032 459848 405700 367203 370735 350152 336316 327785 329499
17925 329499 317040 307052 289687 270531 267280 239089 195227 139121 100143 72349 38432 46407
17913 46407 51462 24709 25779 10576 -5462 -4118 23766 32661 41885 47891 41748 42597 49925 47301
17899 47301 17013 -263 9153 13962 1856 -9701 115 2487 31790 16048 -432 4050 5608
17886 5608 6023 14593 4612 -22690 -47433 -37223 -20236 -24612 -3748 -4665 -33543 -24166 14577
17873 14577 24096 28913 41219 43893 40739 30584 14968 8423 10613 9445 7674 -242 17428
17860 17428 14676 -1763 -9068 6110 12552 -12126 -18028 -11345 -11943 -28567 -50650 -58502 -69092
17847 -69092 -83219 -65895 -39730 -4919 2880 -18076 -18273 -30264 -29328 -19559 4844 4741 -11645
17834 -11645 -11150 -26188 -19798 -20446 -16861 -29982 -34125 -32131 -25818 -18610 -18476 -9532 -14762 -29714
17820 -29714 -27786 -35772 -49175 -63450 -28566 14553 17795 35393 31987 -9462 977 -657 -28505
17807 -28505 -44059 -27103 -23245 -17461 2137 7595 9407 7537 8394 -2371 -4092 8176 2076
17794 2076 -24300 -28682 -29505 -24416 -33339 -15848 -32107 -57986 -38347 -30294 -22861 -17015 -962
17781 -962 8202 -6262 -26018 -14074 -7473 -10957 9059 13549 -9182 -34076 -40775 -41976 -21884
17768 -21884 -61 -31263 -50714 -62035 -42137 -32963 -29984 -35180 -42699 -36333 -25930 -37712 -46714
17755 -46714 -46432 -14416 2368 -21357 -23522 5190 993 10990 20949 23821 12737 8857 -14055
17742 -14055 4893 35 -6846 6807 5097 -5721 -5406 2676 -24713 -41978 -30948 -37777 -48735
17729 -48735 -39652 -27749 -27234 -17739 -4655 9083 23763 11835 -21071 -51087 -21920 21
17717 21 6844 7097 -4874 -11790 -12631 -14513 -43065 -37745 13605 50842 68728 75891 57247 32232
17703 32232 30415 6718 11496 22938 14834 41048 36291 2607 -18248 -30325 -28806 -18198 -14155
17690 -14155 -14495 -18122 -14065 3364 -19493 -1235 5983 26862 32093 37688 57981 55448 95384
17677 95384 145905 205327 290688 356907 384588 371528 311383 242067 163344 79759 59027 53568
17665 53568 35220 12889 16737 5444 2284 2886 -2322 17943 33911 11714 8220 5653 29595
17652 29595 46403 50551 77002 113448 154183 193606 282834 404940 545829 675282 742598
17641 742598 715254 579932 406486 250954 166558 114393 69246 28642 5116 7564 16184
17630 16184 21153 19660 34474 48865 39179 40776 55118 57974 58324 74433 54125 39834 32015
17617 32015 40397 74667 123110 187162 252119 339599 371698 333188 239820 147366 95614 59034
17605 59034 9811 -5334 3122 6490 -5116 -6342 1237 -15230 -20184 -27898 -25988 -16838 -6933
17592 -6933 -35393 -51303 -50968 -35536 -29692 -28184 -62462 -48736 -58494 -61059 -58903 -33762 -35154
17579 -35154 -55191 -74165 -84826 -61343 -51709 -48303 -49961 -17425 -18549 -27058 -32664 -32718 -49647
17566 -49647 -38165 -37734 -36779 -57878 -71050 -40382 -25374 -12441 -111 -10992 -11939 -20657 -6798
17553 -6798 4593 -3716 5222 23353 23099 6004 -2478 -20212 -7806 2435 -1250 4527 -15613
17540 -15613 -35657 -36580 -28924 -6520 10517 -5009 -27610 -45840 -47043 -32887 -33637 -12196 -5944
17527 -5944 -22592 -43693 -67846 -64695 -49906 -18099 5057 -12263 -42623 -53907 -64445 -51552
17515 -51552 -31953 -27936 -25121 -35918 -43917 -29361 -33192 -30658 -34014 -14111 7692 19259 59271
17502 59271 67879 53510 37690 24556 19914 14071 30441 25272 -9072 -44575 -49031 -37012 -19276
17489 -19276 -11110 -1363 11770 18393 13782 16158 1667 -12144 -177 -4895 -17076 -8340 -6988
17476 -6988 -6151 -16860 -32732 -24298 488 8747 -6188 -33883 -34352 -16219 -13541 -9408 2563
17463 2563 -7318 -34311 -46373 -52420 -53543 -38572 -40925 -13839 -5554 -1484 -5950 -13715 -12207 -21786
17449 -21786 -16435 660 -405 -7236 -411 30568 109062 196007 249946 233489 156149 63272
17437 63272 -18577 -27904 8990 15392 4069 10889 9564 10897 12044 6641 23370 32539 24136
17424 24136 31364 12535 -8853 -10825 -27199 -42596 -54427 -64521 -42174 -23834 -14303 -7910
17412 -7910 -7119 -750 -719 -6201 -4340 -31540 -37951 -10189 16500 -1310 3493 2124 -16067 -28192
17398 -28192 -30906 -9835 -25522 -64035 -58179 -35505 -35154 -34336 -5465 -11559 -30041 -22674 -12984
17385 -12984 -11985 -16082 -28412 -52255 -40042 -22968 3658 -1116 5357 -4271 -1839 -5799 -13980
17372 -13980 -4807 -310 -4218 -4360 -15273 -16897 -10135 1079 -30058 -42329 -60677 -58883 -42945
17359 -42945 -10525 5190 10746 -9350 -1259 11456 21842 23423 13946 1765 -24917 -23366 -13037
17346 -13037 -2696 -23326 -39285 -54769 -49542 -13324 357 -6374 -25742 -15640 -12402 16305
17334 16305 32981 1033 -11625 -14426 -3547 -6284 -13692 21480 14889 -9476 6753 25909
17322 25909 15079 -1053 -14152 -22193 -24188 -11166 -21767 -34050 -39092 -26620 -40225 -44293
17310 -44293 -29300 -34789 -4338 -17562 -26484 -8035 -13166 -23366 -30395 -63619 -81104 -62117
17298 -62117 -70936 -60295 -40246 -37381 -40733 -50072 -39503 -18708 -7302 5410 4591 -9794 -7850
17285 -7850 -31584 -36099 -18101 -5306 -21562 -13195 19614 19214 19172 22499 24424 24800 25424 -7744
17271 -7744 -22372 -35924 -48839 -41443 -15808 7623 16721 -2052 -21994 -30894 -16808 5186
17259 5186 1535 -8380 14237 12873 3253 -1466 18700 12246 8957 -8662 -20501 -12951 -14830 -40754
17245 -40754 -38207 -45404 -34203 -4192 -7321 -12875 -17168 -14520 -5992 -12501 -24577 -30751 -33104 -30102
17231 -30102 -15992 -62240 -75960 -39223 -5933 -2189 -12023 -30089 -32445 -23221 -32474 -19324 -11104
17218 -11104 -39640 -43638 -69436 -72174 -59555 -29969 -18467 -6357 -26937 -20874 12431 20204
17206 20204 15458 -12468 -12441 -13044 -11766 -8868 -29316 -26325 -26323 -31351 -3686 23180 3714 -30082
17192 -30082 -44387 -43231 -52787 -50141 -37579 -34171 -32600 -26331 -24810 -23129 -26272 -31533 -24608 -10878
17178 -10878 -8650 -23031 -8899 10360 -13237 -18385 -15363 -7012 16037 9684 -11898 -24986 -3584
17165 -3584 7895 20991 1603 -27085 -39659 -31628 -29372 -26636 -5315 -4944 -10895 -15511 -34582
17152 -34582 -34941 -19169 20756 17380 -4046 -21325 -25999 -45467 -44598 -23969 -10899 -11707 -3195
17139 -3195 16740 9856 3362 -3363 -599 -893 3417 4300 -20084 -23560 -29470 -12665 3818 4849
17125 4849 -13831 -19515 -34389 -55906 -49726 -39449 -23832 -17828 -18696 -28629 -13794 16733 6020
17112 6020 -6970 -12097 -30571 -62703 -71530 -50419 -47769 -61602 -62396 -67068 -71757 -26904 9565
17099 9565 -7080 -20557 -16031 -19065 -38850 -20384 5240 11013 12467 32337 16512 6525 9688
17086 9688 5028 -21800 -36649 -38035 -31352 -26070 -22042 -20634 -18109 -26204 -7257 -19503 -50431
17073 -50431 -64820 -44410 -19383 -7517 -16318 -7199 8557 21484 18472 1451 -2150 -9017 -14341
17060 -14341 -19837 -45898 -51249 -43506 -34283 -17489 -21209 -12839 -25313 -52746 -13196 13388 418
17047 418 -23106 -35731 -25913 17500 15766 -5690 6925 23489 17617 1205 -19883 -27678 -18004
17034 -18004 -14720 1907 18128 22302 19514 5379 -19469 -19538 -5611 -15911 -9682 19762 37293
17021 37293 38776 33947 -151 -12795 11994 18798 6418 -10353 -8705 25434 6529 -6613
17009 -6613 6803 -11719 -24250 -11973 12844 18415 3179 3622 -35191 -45939 -29199 3116
16997 3116 33479 32205 120 -29270 -54248 -37540 -20224 -18744 -28496 -26979 -5003 12908 30129
16984 30129 5296 -18947 -18405 -31195 -44059 -25020 -24838 -40608 -13520 14932 5793 -15767 -14250
16971 -14250 -6549 -11123 -9088 -5204 -22106 -9046 759 12357 -16585 -50597 -40664 -6568 8283
16958 8283 14726 2484 -12237 -4816 -9749 -16260 986 -3658 1847 12103 4779 14222 20665 17608
16944 17608 17608 2851 12200 20235 3898 -13732 -21295 -21753 -21598 -17396 -16968 -17227 1330 17206 -5146
16929 -5146 -40700 -36527 4691 19083 35191 29084 25847 38219 36890 46346 38854 34403 42974
16916 42974 19507 1252 -9079 -10205 -7896 -10026 -17391 -24603 -16767 -32090 -23521 -7786 -10993
16903 -10993 -5421 23980 61430 39775 20366 17787 27750 26632 9766 -2322 -18224 -20556 -25509
16890 -25509 -15572 -5554 -4728 -45172 -67690 -40317 -14239 -21176 -31093 -31424 -15464 -18306 -23407
16877 -23407 -18572 -30453 -30217 -11788 -6694 -8444 -18875 -18750 -7372 -7889 -13963 -1287 10644 3990
16863 3990 -10881 -11733 5409 6192 -15518 -23676 -26358 -32142 -27412 -19312 -37499 -29166 -35766 -23752
16849 -23752 -20225 -830 -12559 -22096 -10165 11033 38599 50987 53134 21388 -32282 -42113
16837 -42113 -38281 -23726 17671 44799 57434 37511 16132 11839 -16639 -39255 -24777 -16718
16825 -16718 3510 -14210 -16167 -3027 -7961 -12047 -27145 -38644 -31914 -22869 -31226 -47316 -49723
16812 -49723 -66963 -55343 -41965 -56122 -57327 -37256 -14815 -24087 -16317 11274 11988 11671 13723
16799 13723 13963 2505 -285 11868 -9250 -19113 -27423 -31708 15638 37140 10578 720 831
16786 831 -2560 -6858 -9843 -3759 -19523 -2604 22002 9127 -15977 -19386 -22756 -8307 7564
16773 7564 22452 -1342 -13880 -26967 -31957 -38225 -27965 -33664 -27886 -12767 5905 -1848 -5668
16760 -5668 -15085 -5983 1284 17806 23584 19026 33744 26968 22464 42363 28852 23737 18240 5607
16746 5607 10782 -3563 -914 -6439 -31469 -40483 -20046 -20109 -41232 -42809 -13570 -22071 -39710 -44103
16732 -44103 -36678 -31327 -49196 -32275 -16974 1657 -789 -9020 -16430 -30766 -35818 -14677 719
16719 719 3980 14817 26782 9015 2315 7362 -6044 10366 25056 18903 22338 -11943 -10846
16706 -10846 669 -5835 -14415 -12617 -6317 4532 -2413 14565 10080 -1316 30 -16861 -9726
16693 -9726 -30929 -31885 -20982 -10995 -12683 1890 7118 -18188 -33752 -37824 -32093 11479 22620
16680 22620 13213 8758 882 -19129 -9554 -21280 -28885 -25428 -12528 -19598 -24714 -19345 -19916 -29071
16666 -29071 -33972 -17642 -14287 -18290 -19736 -10817 -7783 -27258 -50175 -30823 -3898 -10554 -21318
16653 -21318 -38468 -44374 -40692 -26928 -15177 7036 2419 -9492 12680 -2115 -26698 -17002
16641 -17002 -8220 -318 -8961 -13057 -9588 -16387 -12373 -534 -2334 -1984 1898 -14256 -26868 -25366
16627 -25366 1281 18337 24683 7759 12921 26478 20004 9165 13718 9125 7195 7041 -91
16614 -91 -8353 -5465 -8638 -22545 -21137 -14409 -5611 -5180 -4481 -23399 -18168 2191 -27087 -27197 4281
16599 4281 7827 -3829 -12355 -3004 1872 -18419 -23214 -17988 13454 4853 -33379 -25028 2667
16586 2667 -5311 1144 -8828 -21990 -20490 -25070 -35862 -15028 12005 25058 9065 -2259 -10454
16573 -10454 -15409 1894 -7948 -14562 1739 4238 -1780 -9474 -13835 -29849 -19913 -4749 -5920
16560 -5920 -17985 -13162 1779 -2174 -11421 -27755 -21143 -15700 -15582 -19352 -32757 -35855 -42223 -29906
16546 -29906 -20364 9001 29240 6232 -7309 -11097 -22095 -17841 -9079 -14514 -18954 -5094 -5117
16533 -5117 -24184 -50044 -54841 -24106 18015 13106 -21247 -20222 -26014 -27552 -19432 -28518 -24334
16520 -24334 -14047 22585 20267 16622 2737 20775 25863 20190 3605 -4654 5996 10480 -26
16507 -26 -20297 -14053 -6458 -25860 -38638 -36742 -14213 15738 34287 24785 -17157 -23636 -40695
16494 -40695 -35522 -27363 -15195 -32684 -36156 -14071 1348 7824 14446 14771 -889 -17041 -17265
16481 -17265 -19426 -5872 -3121 -7149 717 16528 22393 25431 6824 -21622 -15001 -16819 -12560
16468 -12560 431 5599 3695 -5497 -5915 -9428 -9657 -9042 -11870 -18605 -11520 3560 4448 -11306 -18137
16453 -18137 -3534 -12001 -33123 -21301 1429 -120 8932 21899 -734 9400 14651 13414 -3997
16440 -3997 7246 -12216 -32946 -28939 -9883 -11327 -4465 -17498 -33819 -27731 -32387 -59198 -69194
16427 -69194 -60110 -41237 -26448 -24548 -18439 -18007 -6953 -710 -5006 13326 35580 22965 -1668
16414 -1668 -15081 -9470 2179 -1551 11814 34630 17699 -2854 775 -6271 -13714 -6718 -22923
16401 -22923 -32413 -28839 -7595 21128 38640 9009 -10885 -33797 -36046 -53488 -45803 -25875
16389 -25875 16949 15951 -549 -125 -6857 2676 30045 20249 -2765 -20579 -4948 -9890 -29049
16376 -29049 -43415 -16581 -19603 -20533 -28396 -20009 -31945 -23842 -129 2156 -11073 -32740 -45107
16363 -45107 -29505 1918 5846 -11143 -22317 -8293 -7974 -13539 -12683 -15981 -17507 -18599 -25477 -18666
16349 -18666 -3558 -3751 13154 7773 5070 15267 23836 10315 -16351 -35149 -27698 -24865 -14391
16336 -14391 -27184 -26480 3020 -6852 -7658 -19912 -22456 -16802 -22065 -4438 1441 -3572 -11584 6102
16322 6102 7276 17697 8156 -4046 4708 15787 32824 25398 5076 21554 23246 16267 30125
16309 30125 21047 7863 -6303 -24185 -4463 30696 33730 6611 -9405 442 7335 -12836
16297 -12836 3949 22458 29731 6160 -9319 -18800 -30415 -32114 -13769 7396 31811 32952
16285 32952 28340 5359 -11009 -6817 -6682 -7190 7960 6797 3969 16609 31337 22260 17065 29193
16271 29193 36373 18249 -1959 -6687 1722 28520 27001 -4923 5053 36721 48575 24066 26330
16258 26330 32641 26957 6874 16242 29808 14134 6931 5744 16096 32869 37927 56812 60263
16245 60263 59406 43424 11478 7790 23955 21703 30558 33739 3917 -21267 -18618 -24281 -41566
16232 -41566 -50452 -36938 -22039 -11924 -11906 15100 13281 6335 12101 3386 19312 33390 15775
16219 15775 5595 -8915 -43955 -46615 -35203 -12886 -5399 -10886 -7629 1965 2736 -14220 -9055
16206 -9055 -17846 -37142 -32110 -19240 223 40063 41438 -8063 -22010 -4821 -13033 -24161 -9884
16193 -9884 9968 19630 23339 10358 -4947 -26379 -28940 -22053 -814 18720 33885 43476 38424
16180 38424 11693 -19743 -36007 -31505 -30084 -4409 9182 -2288 -28712 -33260 -26220 -12065
16168 -12065 6390 15809 14968 2430 37345 50134 66194 62237 22391 -6040 -20999 -6601
16156 -6601 -11605 -13815 -13178 -24523 -21723 -1299 -17922 -36294 -50777 -37906 -22907 -20695 -13014
16143 -13014 -15382 19885 37650 21769 9375 20254 4571 -3838 2803 -3294 14203 29996
16131 29996 31461 7845 -9839 11597 19764 -6092 -36186 -7307 18771 12944 10998 -21059
16119 -21059 -20798 -26568 -14771 -28236 -26213 -9085 -16609 10485 36298 26839 20934 23007 8903
16106 8903 -2257 -3342 981 -10844 -8060 -13865 14407 24775 28837 43385 51659 50441 22262
16093 22262 16895 42519 32087 22928 6183 7217 8953 3029 -8442 -19594 -29260 -14415 -30601
16080 -30601 -21984 -20885 -19020 -28174 -42919 -40690 -20678 -9049 16394 -7975 4007 43616 54294
16067 54294 38896 -1420 1208 6169 -25771 -68806 -78290 -47115 -32712 -8067 -8813 -28943 -24421
16054 -24421 -38774 -50802 -57389 -54972 -44437 -21640 -2688 7115 22311 -6166 -37759 -38283 -36483
16041 -36483 -24773 -13916 2006 36507 16138 3816 -3035 -2359 -7346 6542 16932 18972 6370
16028 6370 -29780 -48362 -49384 -18215 -3598 21870 -2095 -20617 -7365 -17520 -39031 -29796
16016 -29796 2454 -12168 -30305 -27873 -24219 -15772 -17740 -21978 -6421 4551 -2773 -15713 4849
16003 4849 8554 -17028 -8644 -37815 -54148 -24589 2766 -13468 -25814 -24617 -316 -237 -21539
15990 -21539 -25833 -22159 -20513 -3066 4346 25249 36376 23265 1391 -13236 -35134 -18462
15978 -18462 -10304 7247 6247 -3378 -6045 6665 8369 -19877 -36602 -23714 10799 15983 2691
15965 2691 12432 21486 5317 -10637 -21482 -29995 -32817 -14702 -12865 -10081 -5886 17728 19687
15952 19687 761 -25842 -38899 -36226 -22046 -5797 14514 -3835 -8590 -12762 -54275 -46220
15940 -46220 -15903 -17201 -22563 -7117 6928 -15554 -24077 -30404 -61219 -69779 -59503 -31834 -12949
15927 -12949 -27790 -23062 -625 -3568 4298 11549 45511 49095 44055 23342 24304 -2936 -27928
15914 -27928 -11908 -19857 -21943 -27375 -17582 -10629 -9232 -32440 -41445 -7253 8563 24925 55627
15901 55627 33586 -4665 -10267 8999 5128 25760 48895 42700 6322 5749 -17491 -16929 -4572
15888 -4572 5976 15083 33835 38875 8754 -10915 -12661 -22968 -16356 -6486 -1614 -8106 -12856
15875 -12856 -6444 -363 2253 -17568 -34411 -32866 -8676 -14567 -43817 -41687 -2219 -1474 -16533
15862 -16533 -47116 -58954 -40384 -15733 -7979 9705 -5392 -27027 -24288 -11510 6755 -1186
15850 -1186 -23155 -49736 -65838 -55170 -10535 6750 -1982 -10460 -8560 -656 25605 53258 31069
15837 31069 3412 19056 42331 31269 17898 9634 -9418 -8288 4248 -8845 -3480 -12186
15825 -12186 -16234 -3446 8731 3379 11219 653 397 -11050 -11155 -2766 13809 13004 -2003 743
15811 743 906 -5749 -12529 367 -11214 -11779 -14872 -16590 -10217 7271 30574 42579 50762 14967
15797 14967 -4446 27916 24520 6096 7144 13452 -9391 -37101 -40336 -37022 -21769 -29485 -18258
15784 -18258 7079 5091 14932 13487 22344 16114 10517 20307 13222 -23924 -18687 -14247 930 21317
15770 21317 10457 6912 11319 9147 -2330 -21493 -24801 -30465 -15617 -90 1695 4389 2524
15757 2524 -19853 -11443 6066 15092 807 -9388 -27542 -24262 -18285 -6735 -25707 -55946 -55429
15744 -55429 -58880 -34761 -32152 -32634 -19896 6023 10712 -10363 9432 19677 15043 44104 26310
15731 26310 -1387 -22343 -23766 -25053 -26919 -27619 -23716 -5983 32101 5187 -30911 -16048 22496
15718 22496 30204 13547 9390 -5854 -607 -5508 -6503 -11229 -21388 -3708 6127 2097 3046 -13008
15704 -13008 -2248 3591 -2308 -9245 -15014 -5500 11585 35108 28505 -4333 -3888 -7002 17724
15691 17724 27215 48962 37729 232 744 13751 17826 6900 -1522 -1767 13843 -4127 -19932
15678 -19932 -35106 -20704 -7165 1477 -6 -903 9726 11995 -322 -9089 4939 13816 17721
15665 17721 15702 -986 -6243 22501 36025 28674 24450 10644 -5445 -1333 24374 21803 -4608
15652 -4608 -12690 -13381 -17777 -21445 -7713 -34807 -35827 -33792 -55452 -61373 -63616 -72102 -72274 -39714
15638 -39714 -24471 -13349 -26245 -18707 -205 -14031 -27935 -17866 -18292 -13306 -7605 -20650 -15768
15625 -15768 3533 -5854 -12953 -11897 337 12817 9402 6533 -4037 -8709 18495 13972 5924
15612 5924 13263 -1596 -620 21494 26247 24744 15078 33347 36853 18718 -1555 -2149 7898 2149
15598 2149 -11652 -23166 -33035 -20001 11703 23268 13556 13213 6629 4549 -10593 3004 4334
15585 4334 15406 15657 24506 8548 -3338 -5739 16719 13830 28332 23251 8746 -10471 -7115
15572 -7115 20888 4280 -26798 -47168 -50337 -41480 -37593 -30632 -40296 -42317 -29553 -18436 -7304
15559 -7304 -8822 1479 10125 10081 18104 2522 -25308 -23203 23818 43686 44042 5931 -8551 -30450
15545 -30450 -19331 21217 5009 36534 48101 51532 13601 -24964 -29604 -12652 10404 9146
15533 9146 12248 13309 12829 9968 13393 -6896 -10151 -11913 -22890 -33427 -19027 -17199 -17746 -27937
15519 -27937 -32391 -3104 29816 9032 -10045 -2728 -10699 -28050 -19699 -5007 350 16255 34182
15506 34182 25302 32240 19065 10705 31491 39925 32093 23242 10941 -9773 -15394 -20057 -16535
15493 -16535 -8321 10414 -6064 -47413 -47465 -55248 -55581 -31946 -17806 -29695 -46479 -53579 -35759
15480 -35759 -24800 -16133 -10977 -16598 523 9915 -1830 1034 -8805 -8596 10782 29030 13108
15467 13108 5372 -1099 -7836 850 7596 806 -21408 -12277 4461 -4220 -24432 -50426 -52633
15454 -52633 -51313 -20019 -25956 -29054 -19021 -21915 -24264 -23549 6081 20334 26369 32204 25085 19773
15440 19773 10102 -5784 5379 -6036 -4776 -8209 -4474 -9939 4314 -5375 -12090 -9215 274
15427 274 23027 36768 16657 36889 51052 25851 2467 7174 -3297 -32863 -47200 -33406
15415 -33406 -27556 -19658 -3829 4454 -7070 -16638 -6647 -7487 4488 -5578 -20144 -27176 10065
15402 10065 47232 58400 25967 470 -8614 -16933 -6217 6265 -687 -14918 -2098 5839
15390 5839 -11245 -10573 7797 15374 26322 17214 6769 -10655 -3285 8573 53303 52051 26821
15377 26821 15342 3083 -15579 -32254 -16576 7698 15884 -2033 11633 6037 -6144 -27683
15365 -27683 -7430 -12371 -34732 -28810 -10983 10266 22717 18926 -1794 -18684 -33549 -46583
15353 -46583 -35734 -35749 -13278 9130 37017 26187 27554 22749 8800 8321 16638 35229 50446
15340 50446 50170 25814 43831 14211 -35897 -32355 -38365 -25269 -5916 6275 5767 -5798 -17654
15327 -17654 -7903 14339 18243 15996 16654 2218 -17070 -36296 -24856 14301 34975 43448 33599
15314 33599 24662 26158 16583 -13449 9846 24076 14394 3734 -1390 21253 6362 -5705 1797
15301 1797 7503 17595 32697 32897 43316 15478 -19866 -31352 -23825 -22485 -27697 -30267 -15194
15288 -15194 -19726 -27647 -13529 2776 20565 16268 13649 -2315 -41215 -46903 -48604 -37539 -10287
15275 -10287 5356 22088 14289 -3759 -12541 3151 16755 15099 5317 11522 23773 24088 11867
15262 11867 -4775 -16676 -33451 -22039 7611 27791 30861 20507 -171 22206 24479 38351
15250 38351 38865 11946 10348 13 -78 26759 5468 -12869 -23850 -8590 -9320 -14899 14617
15237 14617 18571 -8207 -20228 -42925 -29867 -13698 -44012 -53363 -39882 -24411 -15754 -17377
15225 -17377 -30465 -23486 16179 15028 -3814 -2876 -10540 -25749 -35920 -27923 -16674 -28132 -37940
15212 -37940 -16094 -16540 -17080 -12875 -6237 -12195 -38209 -34955 -24534 -49849 -77366 -53156 -15245
15199 -15245 9072 16226 928 -24863 -2924 17716 41213 21126 -19813 -31744 -12496 171
15187 171 6208 12437 4999 20156 31456 14457 -6177 -11113 -34776 -20492 1542 -5492 -20864
15174 -20864 -31614 -42622 -12083 7007 -8038 -12829 -31864 -28744 -27999 -17811 -5914 -7811 -22893
15161 -22893 -19607 -10876 -15285 -11830 -16789 5049 8752 16546 3228 -4782 2448 16305 3226
15148 3226 -30482 -19851 -3280 714 -60 -1123 15457 31578 5474 10766 17095 -3285 -21523
15135 -21523 -18104 -18883 -26972 -7585 4004 968 26941 49399 18046 5681 30534 21374 -706
15122 -706 -19732 -14332 8851 23642 29848 33183 -9905 1145 7100 5570 7265 8727 13355 27055
15108 27055 36054 24110 2385 -14285 -8240 -16727 -39354 -34954 -29253 -15161 -15578 -6097 -4754
15095 -4754 6307 32025 15326 6525 8561 11427 -8970 -36009 -14636 -13991 -11778 -13214 1927
15082 1927 -1430 -10707 -6073 -10090 -14168 -231 25053 39610 46814 46889 28065 6677 -13421 -17619
15068 -17619 -22182 -29248 -16149 -8699 5512 -9647 -20617 -5930 -108 -237 16952 17578 16119
15055 16119 29011 40305 9173 9721 26473 51484 60996 51146 22728 2574 2590 7514 -9652
15042 -9652 -17651 -14390 18873 50592 53339 46850 45974 28393 35386 28324 19674 31690 25349 -6976
15028 -6976 -13074 5572 23800 12098 6353 8627 22408 42312 47913 39155 19950 -11195 -21346
15015 -21346 -26937 -25603 -9646 6904 -5073 -18022 -26292 3170 14389 11326 8295 3788 -18685
15002 -18685 -18636 8899 4116 6490 2693 31446 44703 47639 17002 7965 -1908 -4019 -492 -7291
14988 -7291 -21347 -32521 -40887 -46832 -34605 -34659 -17233 -4939 -22323 -19452 -2913 7536 14416
14975 14416 21754 -398 -22152 -27417 -14634 -7852 -832 38533 45287 25275 13610 26501 27303
14962 27303 8623 -10464 15029 24237 3123 10958 18693 2136 -8417 -6159 8544 17383 27844
14949 27844 15651 -9423 -957 31107 35057 16753 4969 -275 -6104 15443 19169 4841 -9320
14936 -9320 -10717 -29403 -14124 -10308 -17241 -5069 6224 3675 4435 -16071 -5813 -6824 -462
14923 -462 13141 3318 -13237 -8476 -20522 -25062 17601 38372 20126 -10339 -15448 4132 -561
14910 -561 -1541 -7091 -19969 -8200 -1753 8341 15949 -6202 -4716 -6440 -17854 4310 12722 431
14896 431 -4630 10899 30075 12195 -9388 5670 -5157 -7845 -11429 4418 8710 31737 24318
14883 24318 15041 3875 -17768 -36487 -25473 -4433 -78 3538 -5527 -31761 -28723 -36773 -17980
14870 -17980 6117 14550 22344 28279 17191 3294 6709 288 -5983 -2026 -516 27626 41524
14857 41524 42656 31740 13955 6972 9529 32496 15169 -15388 -36942 -43564 -31154 -37148 -27647
14844 -27647 -5282 -2057 -17645 -12658 -3308 817 8973 13800 2368 -12307 -30931 -23503 -25749
14831 -25749 -25354 -19587 -25680 -43384 -22336 -10521 -20234 -18990 -9393 -9920 -22240 -22230 -11795 -14144
14817 -14144 -6452 6858 -13258 -35282 -30046 -7069 8578 -11455 -749 14484 8921 4940
14805 4940 -22806 -21650 -2074 13436 18980 14188 5139 -15537 -29983 -24464 -15143 -31087 -28515
14792 -28515 -19841 10499 23238 41418 44652 34236 8014 -1513 683 -709 28376 37085 24949
14779 24949 -5797 -14599 -14853 -17621 -8418 5825 18308 8879 12987 20733 25927 40920 38273 39028
14765 39028 65813 71986 54976 26213 2295 -14176 -21385 -13046 -10231 -331 25553 10642 14999
14752 14999 18025 7141 -2282 -184 -6090 5968 31683 51746 39045 32147 20283 9053 1107
14739 1107 -16876 -15175 576 2257 10059 -2825 -20745 -5285 15533 14733 -5620 -12641 -8313
14726 -8313 6241 -5943 -3129 -13798 4126 19662 18552 15118 7637 -8960 -15040 -6269 6345
14713 6345 -12853 -11881 -12859 4736 4771 1819 25251 37816 41387 43702 20070 11720 2536 -17447
14699 -17447 14767 39298 34461 19606 -8050 8042 37382 14647 -5488 -22287 -25795 -1786
14687 -1786 9846 1296 8442 10402 1431 -11832 2498 12789 3907 -2929 -24134 -24432 -5335
14674 -5335 -9029 -18492 -2266 6711 7824 -5785 -17116 -13861 -10459 -14672 -10777 8183 252 16041
14660 16041 14950 6160 6925 1094 -5152 -6822 13416 25847 42198 60866 42588 40280 42442
14647 42442 39012 21213 12968 6717 -1900 -16551 -20923 240 13989 4124 -10094 15232 54563
14634 54563 40469 23431 25779 29305 55521 58551 41170 15039 5610 -1770 -1518 16278 19199
14621 19199 34264 11163 -5715 -3699 9596 18721 4805 -6584 7268 32068 23029 23893 20105
14608 20105 15177 16450 -9373 -19017 -3704 2189 3415 5784 17455 21725 17407 43859 21818
14595 21818 -3317 -4523 -7427 -1002 19574 30641 24856 8746 18684 -9294 -34707 -52255 -32181
14582 -32181 -19599 -1033 -277 -5646 -16443 -4966 -3438 -18995 -20386 -12361 9012 22794 31562
14569 31562 33264 40300 19448 4175 3809 14801 19947 24013 17460 1056 -18737 -10034 -10450 -13378
14555 -13378 10100 18697 12283 17199 23451 22647 7304 11571 14158 24038 -9262 -26097 -7993
14542 -7993 -17585 -25121 -5719 -7345 -4969 -9263 3646 17463 25805 8372 -9281 -11583 -7074
14529 -7074 -1526 11442 -19263 -20384 -16796 -14668 -3616 538 13291 31513 58052 49405 26363
14516 26363 15986 22571 48065 52983 57766 55869 31672 7590 7402 32864 31534 -4447 -8013
14503 -8013 -14772 -13600 14591 287 -3896 5768 -1679 -14906 -124 11366 17431 10566 1947
14490 1947 -17464 7983 24938 33586 22645 -10750 -10034 -22130 -16161 25715 46624 50524 35344
14477 35344 45467 40781 36247 27814 34884 42487 41414 22541 11203 6662 -13056 -412 1800
14464 1800 -2115 -10116 -15208 10653 23912 11735 -2084 11817 12491 -1731 -5297 2958 6883
14451 6883 -16478 -26497 -13434 -9839 18082 26918 6255 820 8377 -28136 -50512 -43231 -42303
14438 -42303 -49884 -34097 -38007 -46191 -26865 -26953 -30264 -21346 -5910 -25293 -30861 -11805 -24813
14425 -24813 -22002 -14522 -31024 -14499 -1848 6738 6323 1507 3859 -5566 300 22726 15647 17725
14411 17725 13942 11784 9945 11928 -955 -14110 2647 19710 21336 42457 38416 27182 31367
14398 31367 21341 17510 15891 13377 14316 9282 12089 6190 11630 2031 -19473 -5996 14855 21072
14384 21072 -1190 -9436 -19732 -18467 -11564 -21113 -19308 -21989 -15142 -25141 -1535 2441 -11053
14371 -11053 -7916 -3262 14704 15208 15372 29020 3964 1772 -23749 -28394 -17091 -21214 -7976
14358 -7976 23723 43107 38509 24893 14543 6538 10564 8075 -3540 -20104 -19970 9813 31187
14345 31187 50010 38375 -16094 -47142 -29572 168 23113 33519 15433 5736 4846 -20447
14333 -20447 -17196 -22068 -15429 -17725 -31820 -23897 -9087 -19543 -23971 -15389 -11284 -6690 -4820 -25953
14319 -25953 -22377 4006 18637 7304 -1344 -11981 8254 17378 21911 12975 -4371 -16829 -23108
14306 -23108 -19987 -13542 -24177 -42260 -47791 -55954 -48795 -33407 -19950 -44513 -33581 -10401 -14905
14293 -14905 -23582 -29441 -15710 -7890 -14425 -2434 8985 -1016 -6361 9012 23085 21454 22888
14280 22888 15586 13684 4590 -4561 12428 53845 49534 9761 -19983 -24240 -24213 9331 25864
14267 25864 42972 40441 31702 24999 22716 48782 34131 17557 4330 18978 6991 15289 -3799
14254 -3799 -12185 10904 27040 -5961 -5698 -17882 -27795 -18307 -18766 8970 21489 32994 -570
14241 -570 -25108 -44541 -29488 -12111 1570 7305 9979 2356 8489 11163 14379 6276 14502 27294
14227 27294 48784 44815 46653 39589 44583 27860 -2180 1531 10298 3653 18185 43093 48789
14214 48789 57315 44780 38691 44736 33006 13776 -4906 -33754 -52260 -45002 -35092 7650 -28175
14201 -28175 -57598 -59598 -42520 -25625 -19037 -30467 -46840 -50148 -41886 -8687 20790 35389
14189 35389 47922 49341 31144 17726 6142 -11350 -23775 -12082 584 -6232 -20172 -17797
14177 -17797 -4199 19784 35941 20298 -12542 -26046 -20132 -1419 13919 7727 2770 29677
14165 29677 32544 8338 15989 30270 29912 22966 9971 37042 42878 7127 7589 27958 31965
14152 31965 17656 11387 8703 -1372 -14521 -2050 3538 24782 10920 -9813 -6943 -16874 -33029
14139 -33029 -39622 -25544 3582 11384 -4426 -20684 -17887 -22562 -9438 15591 10109 7734 16818
14126 16818 7627 1296 21091 22874 29243 17544 19637 22621 -623 -3015 17774 12626 16921
14113 16921 -9308 -24223 -23510 9551 37051 21684 19686 34507 21577 1515 -14916 2653
14101 2653 -15618 -19840 16671 24805 8592 -994 -5795 -10116 -12292 -6034 12305 10378 -5259
14088 -5259 -145 17466 16371 -21879 -45823 -58083 -39527 -7055 21220 34240 24419 6398
14076 6398 5189 9376 19278 38394 26247 20606 2752 -24710 -48286 -28703 -17903 -31661 -14043
14063 -14043 11325 29896 48394 33912 28256 23560 9060 22127 -4606 -29982 -9268 35322
14051 35322 44690 3747 11778 25075 8675 4596 5715 4297 18329 19204 -7755 13132 22858
14038 22858 10731 13847 6703 6481 19929 17906 -4896 26970 44729 29993 29675 34026 39854
14025 39854 43039 26113 14572 18936 6727 -17643 -28434 -15628 -29174 -31489 -12726 20256
14013 20256 24560 3729 -4505 11903 6831 16648 18385 3668 -143 -3926 3725 12433 9635 3455
13999 3455 4370 22098 40497 -1880 -18461 -13795 -25876 -11333 -2775 -526 -16126 -817 955
13986 955 -3384 7144 6351 -610 7118 -3566 126 -8892 -14102 -23722 4761 10495 23679 53567
13972 53567 54620 38825 32150 31568 14952 26999 21573 9095 23144 31445 33658 23058 26269
13959 26269 11315 -2928 -4761 14563 5327 1897 -24481 -58992 -49732 -29403 -20866 -22802 -9923
13946 -9923 6717 3819 -17838 -15980 -23694 -7857 1313 9112 14656 19815 18259 -10924 -14328 10728
13932 10728 -15812 -20035 -42048 -39719 -37947 -39325 -33463 -11281 -6256 -2004 -2756 -13410 -11590 -25750
13918 -25750 -49469 -60262 -47870 -52090 -48111 -51167 -28530 8500 -1671 -16431 -35181 -67357
13906 -67357 -100359 -85444 -39145 -2026 -29420 -41701 -44070 -39601 -56606 -37497 1229 -10641
13894 -10641 -19850 12707 20155 7840 18876 31534 32412 20945 17274 -3712 -13084 14427 29020
13881 29020 27986 -2953 -2240 8041 5074 -1747 -10878 -37548 -45215 -19320 -3502 6145 16724
13868 16724 25162 30511 10714 -15981 -29126 -30147 -13466 -2529 6100 -13406 -24951 -16272 -15900
13855 -15900 -7477 11112 19601 2822 -12333 -29188 -13342 250 7210 -21731 -43532 -20950
13843 -20950 20540 25699 2196 -19192 -18698 -13132 12869 29625 27911 29997 21998 28037 24681
13830 24681 44561 23708 -3777 5309 13260 -3828 1612 12981 12015 -5328 -13566 51354 35546
13817 35546 -2536 8270 3887 -2753 -14079 -37641 -23822 9344 7607 -1973 12797 5651 -13890
13804 -13890 -34593 -17658 -6993 474 2922 3277 -1941 2185 6600 13975 15274 55 6592 14924
13790 14924 16618 32406 -4591 -14277 -21493 -39941 -15017 -2571 2081 4106 490 10496 29763
13777 29763 38123 29268 16559 6237 13365 21093 17193 41057 44779 37358 33699 17952 10973
13764 10973 11063 27984 27602 20977 4072 -5410 -681 -1761 -453 29260 35772 21927 1777 -1113
13750 -1113 1745 23594 18915 15546 -21706 -33080 -20243 -12313 -5206 15129 1911 2824 8912
13737 8912 -2009 -17616 -26148 -12258 -10839 7284 589 -11727 2316 18658 21155 16133 8054
13724 8054 6359 -17166 -22908 -30207 -40074 -32867 -21938 -8242 13728 22419 11113 10548 -4962
13711 -4962 -32399 -44386 -40287 -28992 -44981 -20776 -9062 -19288 -19767 -14775 -4582 -10181 -19636
13698 -19636 -1621 17123 16941 27153 24964 39022 59690 58346 35937 14177 -2530 -6804 1932
13685 1932 6619 9986 45045 60931 50448 32507 4522 22304 24041 13538 27119 16112
13673 16112 9032 7135 -24355 -21715 2961 11416 14342 8794 -956 4097 9936 7681 24430 25676
13659 25676 28080 20175 1333 -8864 2901 35975 45453 30657 18987 3230 10260 21626
13647 21626 46441 13070 -10593 -12873 -12859 -7395 -573 22000 8982 -2548 -2711 14706 20455
13634 20455 2800 30069 26983 11073 -19473 -29960 -18257 4621 35765 51273 50289 57230
13622 57230 37836 12956 3529 5636 8467 26256 35397 26779 35665 46882 42529 19180 405
13609 405 -32697 -49063 -67125 -39084 -17166 -10603 24388 32054 32099 23697 21510 8812 -11829
13596 -11829 -10189 -5905 -32841 -31193 -26245 -26039 -5015 10226 -1322 1379 12717 1966 -10502
13583 -10502 -26136 -8367 1472 -18955 -26775 -3790 6517 6347 -6237 -19468 -6315 -9204 -32348
13570 -32348 -36235 -13934 -18377 -46927 -31627 -3913 -14441 -30261 -17758 -13688 -10967 -28564
13558 -28564 -487 17910 21618 14764 5544 -1474 7687 106 -10557 -7296 -21973 -26520 -18480
13545 -18480 -11303 -9594 -5182 7906 11180 29845 18454 22481 8410 6677 11090 6671 -15346
13532 -15346 -47795 -9212 -2289 19811 10482 -7232 -2692 10409 12733 11236 14010 22443 38866
13519 38866 35453 24571 19072 14055 6148 17847 21728 20406 20020 15073 27810 20170 20600 11730
13505 11730 20262 19538 34645 36817 30515 11061 -25217 -9096 12098 -16242 -45692 -31005 -2047
13492 -2047 21904 27600 -252 -17849 -10603 -7076 -6283 -565 -11388 -2505 -6799 -12257 -10823 -3124
13478 -3124 -18420 -29115 -7787 1366 13780 5200 6442 -6277 -10615 2755 28694 20470 -23004
13465 -23004 -17406 10988 9582 23386 38214 22485 -7431 -22561 -5968 2636 -5426 -17113
13453 -17113 -12592 -17024 3312 22721 6486 -28725 -45320 -18865 -33054 -16964 -17497 -30217
13441 -30217 -36044 -21126 -18549 -15747 -26853 -31782 -30846 -27339 -17341 -29211 -31319 -22410 -9151 -7387
13427 -7387 -15877 2604 7759 -1564 -8345 -6770 -1023 -7899 -16344 -23640 -27871 -19907 1250 -10612
13413 -10612 -11469 -5131 -16876 -3664 -5946 15681 26254 -7069 15630 35641 14753 10959 1280
13400 1280 776 16420 14136 1271 -5217 3626 18596 47326 46257 33148 21643 -4760 -21189
13387 -21189 -14187 -28968 -52548 -40566 -25080 -9602 11108 23403 16219 8313 12153 11738 -255
13374 -255 -17990 -12681 -20472 593 24262 3735 -9183 9684 26361 12235 22484 14352 1295
13361 1295 -10907 2621 4442 2822 596 -16643 -8277 36 2064 -588 -1743 -10465 -24570 -16677
13347 -16677 -8158 6243 36647 51737 44931 39742 33962 28334 18033 -2789 -3061 -3520 -17108
13334 -17108 -16709 -13587 -28716 -15806 -17158 -27863 -31503 -9444 491 11661 32303 47183 29473
13321 29473 33027 20112 -2081 -6619 -18502 -28370 -27308 -23426 -6587 8715 3058 -1013 1518
13308 1518 -3782 -7410 -13425 -5923 19801 19128 1144 9677 1764 5092 26563 22093 18246 21874
13294 21874 32043 3522 -14706 -22499 -11793 986 10321 24551 7345 -612 -12436 -30115
13282 -30115 -40751 -12306 7320 36796 50812 52198 39855 5754 -15635 -2945 26098 15784
13270 15784 -9983 -50510 -59289 -43461 -11407 12508 15400 20048 20998 22945 -100 -6837 7266
13257 7266 1518 8636 -8001 3023 22137 22456 2971 15043 12745 18475 4205 1623 3172
13244 3172 -11722 -8045 -8740 -11737 -11459 -13746 -21886 162 27150 41386 38467 18122 10394 -4981
13230 -4981 -8135 2841 -17436 -13887 2039 9087 7222 -3007 -21641 -428 41090 29919 22301
13217 22301 23219 19919 9812 1913 -9688 4073 1909 -10337 4429 23994 37262 25457 20460
13204 20460 26743 24440 14938 8365 -14182 -15726 639 2137 1419 13962 21584 24475 27616 17912
13190 17912 -9773 -20243 -17518 -4952 15746 3932 11932 25211 -6732 -28231 -17551 -13253
13178 -13253 4431 7180 225 -14464 -14217 -4095 30578 18650 -1930 -27364 -43268 -11462
13166 -11462 -13787 -20567 -3361 9203 4009 11952 13379 2237 -8878 -11224 7779 22685 23875
13153 23875 20935 -1106 361 -249 8065 4500 -30449 -17561 -12553 -10973 2415 1303 -9699
13140 -9699 -29619 -37950 -25543 -10167 15354 16206 16684 -6716 -16139 -14162 -15499 -12263 -11700 903
13126 903 8544 -12982 -3727 12548 14024 21900 19254 -11200 -23318 -31186 -40407 -19235 -12078 -21053
13112 -21053 -12696 7764 25777 38708 46816 32968 3036 -1070 -4221 1876 11645 8210 8770
13099 8770 12806 11688 6924 13518 14023 22957 34815 49744 36747 20735 -1409 -22069 -34419
13086 -34419 -28822 -2403 2521 -8734 5122 -10210 7305 14172 5221 -9948 -20844 -19615 -8213
13073 -8213 3498 -7342 -16431 -22732 4470 9292 -11561 -22415 -20499 -10155 -8329 -17864 -23277
13060 -23277 -5828 27848 50170 65217 61557 48772 49322 68954 80278 61952 25757 21731
13048 21731 2628 -20283 -11878 -10773 4331 29230 24996 -8399 -4443 7744 -1580 -29884 -30257
13035 -30257 -20275 -18904 -21197 -24941 11688 33789 18240 6827 4408 23877 36385 -1934 -36912
13022 -36912 -48464 -48274 -40481 -33195 -1977 23704 25824 4801 -20192 -5112 9626 10165 14399
13009 14399 39844 38077 13286 -30279 -36500 -15334 11210 15045 -8850 -19852 -2980 10533
12997 10533 15377 -11748 3837 12441 19438 14394 17967 -15927 -19524 612 8954 2256 2584 17632
12983 17632 27277 36105 43679 29638 21422 16846 2855 -1070 -5660 -2118 7898 -3038 -5654
12970 -5654 -3331 -9182 -7758 -4418 16913 -1143 -20418 -33167 -27411 -12547 2281 7647 10322
12957 10322 2707 -14394 -19618 -13189 -12897 -8895 -14864 -27918 -31592 -55476 -45191 -37258 -23338
12944 -23338 -4224 9367 17944 12496 -7243 -18424 10045 47958 53265 17239 1645 -20164
12932 -20164 -28599 -13537 12325 23839 17450 28942 29167 25903 14965 -4346 -17831 -10322 10088
12919 10088 17734 14876 11788 13846 12961 -7133 -28933 -36981 -34578 -28676 -50591 -25087 -3308
12906 -3308 -19623 -42147 -50593 -41505 -24048 -7340 -15398 -19199 -5081 19645 11667 -3455 -4065
12893 -4065 -8626 -10912 -36892 -54871 -32774 -16725 -26074 -14411 -1191 -16885 -28577 -15665
12881 -15665 -4336 -9074 -178 3144 5970 -6336 -4798 13733 9358 16814 29579 17757 20740
12868 20740 30724 22348 18561 -1427 11577 30256 13151 7408 7022 -4924 -20200 -42632 -46639
12855 -46639 -15892 -7752 -1239 -3203 -9756 -10107 10569 39300 8043 -2479 -2962 -5074 2944 22889
12841 22889 13335 2303 7826 13118 1202 6044 692 -18221 -8825 13372 16914 18478 14955
12828 14955 2530 -11486 -29026 -11454 9803 2297 -16186 -24039 -19730 -20388 -9499 -4058 -5882
12815 -5882 -11844 3223 778 -15776 -13590 3070 -8222 -9093 -9487 -1994 2479 10325 33465 54990
12801 54990 67759 64958 32159 13836 6626 -3917 4003 4743 -10632 5481 3159 -18838 -9596
12788 -9596 535 3075 10708 6554 17727 16794 -5123 -1967 -6770 -2030 5192 11755 2148 -23634
12774 -23634 -44998 -32857 -50460 -47348 -30429 -20590 -24273 4711 20318 35840 28760 29277 23852
12761 23852 42664 41995 7467 -3799 11562 20933 -18884 -39288 -35048 -15257 -863 -31608
12749 -31608 -29725 -16166 -20770 -21173 -12043 -20820 -21232 -147 -9558 -10835 -9206 -11029 -226 25769
12735 25769 18259 -8933 16442 37571 30944 30657 21443 18759 29874 19044 7002 418 -753
12722 -753 5123 7702 -7168 -12503 3777 24724 33252 30564 15038 15799 20931 -7267 -4018 -16491
12708 -16491 -6528 3442 26635 19719 6747 -1532 -7884 7628 2145 370 3332 -11902 -9290
12695 -9290 -11559 5978 27142 25842 6849 13355 9934 14193 2373 -20431 -22141 -7963 -17463
12682 -17463 2403 18759 36062 13972 19437 36276 27542 30748 55898 35019 13958 15447
12670 15447 -6172 5996 27123 36632 28584 14057 3359 3301 35308 36107 15792 9161 24384
12657 24384 6825 -3946 12186 7900 -9182 -14887 -13406 -25628 -9334 -1368 -4 6281 -3107
12644 -3107 -1319 -4078 -4056 -2114 1648 8062 -8618 -30773 -10217 -7595 -389 -19654 -25247 891
12630 891 15938 39042 24730 21607 21865 17921 28702 35543 41860 33880 28458 56136 56338 32401
12616 32401 11062 15648 28785 9961 -10416 -9738 -29159 -12117 8287 2519 6360 9464 3477
12603 3477 22948 27301 20405 14433 12009 14170 30486 31790 20232 22988 44954 60245 37680
12590 37680 21762 -1351 98 430 -7162 -896 12649 -6600 -36021 -42477 -48407 -39258 -30948
12577 -30948 -11014 10538 10710 -2278 5600 6541 3673 3436 -572 -488 29619 33351 25575 8212
12563 8212 -3536 801 5936 7765 10959 17016 29257 49061 47936 26810 3269 13373 20974
12550 20974 13180 8813 -1198 -9921 -25291 -27455 -10427 3886 10359 19650 14337 1887 -23440
12537 -23440 -41135 -51596 -39755 -34232 -27556 -17502 10604 33028 37443 16554 -2948 -14578
12525 -14578 -24129 -36547 -44803 -30924 -31091 -891 30137 26542 12425 25297 20772 36072 68210
12512 68210 76872 55087 36398 40730 12741 4451 8798 30098 24081 4905 987 13567 10854
12499 10854 2655 -557 23670 46212 60028 31375 3130 1442 2859 4015 16154 21272 9717
12486 9717 18266 29541 30501 40877 28255 11045 -14249 -16658 -19768 -29320 -24046 3386 7232
12473 7232 8791 6358 -5335 -5223 17340 23468 -16582 -1553 13009 34875 22075 683 -6915
12460 -6915 -20834 -19915 -18335 5634 -4496 -472 -1975 -9212 -19403 -3532 4207 -5438 -1349 2092
12446 2092 -6967 -16940 -25352 -38702 -50667 -38593 -25836 -14261 -2482 -495 11112 -17209 -35417
12433 -35417 -30086 -10564 20199 42733 15645 -27573 -50213 -35117 -32158 -25396 -27407 -6870
12421 -6870 12844 12449 -22415 -46257 -37327 -26411 -31197 -21324 8626 19332 25038 41154 48634
12408 48634 36619 -1022 12914 34283 47178 51604 4246 -6190 11587 19253 30659 25271
12396 25271 -8102 -2816 23413 29174 4804 -32542 1400 31201 26496 42677 32963 2385
12384 2385 -20803 -2920 9010 26884 33706 24495 37484 13596 2351 4172 -6401 -199 8710
12371 8710 -10325 7026 35177 5604 14916 26352 13470 27946 28277 2349 12145 24692 18216
12358 18216 5736 1377 1805 1866 11310 15716 17797 3430 8683 12529 20926 -4106 -6951 14722
12344 14722 27505 32062 44164 37978 32838 23110 40791 26357 -1340 -1058 13542 32989 38419
12331 38419 25665 16162 16236 28914 32714 11645 -5832 -15022 -14611 -32073 -45208 -39776 -30915 -25694
12317 -25694 -13276 2403 28616 35420 32784 27635 13763 -24146 -43654 -29534 -33803 -39550 -44635
12304 -44635 -34435 -13754 5765 6573 6833 4671 -1380 -15207 -18217 3394 10556 20580 27296
12291 27296 42984 53269 26774 1992 16578 3031 -16509 -14891 13787 51441 45207 27772
12279 27772 -815 -17120 26016 37802 50417 75519 55360 41618 50114 29459 8777 9729
12267 9729 16030 26514 -5444 -24690 -9109 -13856 -30735 -31174 -14022 -6550 12934 1124 1191
12254 1191 8225 17105 34783 37220 9193 1739 1594 -5756 3284 6019 -5849 -6536 3563 2539
12240 2539 6160 -19507 -38920 -26177 -2197 14662 18895 8777 -3355 -6302 1740 3290 -28777
12227 -28777 -47968 -46433 -29714 -20720 -47776 -26741 -7697 11174 13237 16886 29438 17313
12215 17313 20447 21941 30455 10617 -1072 -7804 10691 46903 40631 12926 -13623 -11181 -3849
12202 -3849 -9291 -11308 -9776 -8300 8347 27080 28331 -780 9941 8291 20207 -3578 -28741
12189 -28741 -28113 -14332 -1096 -9306 -8207 -10465 -17533 -7771 -7136 -12130 -9347 317 415 5834 20700
12174 20700 10947 1536 6970 12174 6489 13852 22639 22934 15900 28716 28398 44380 37255 41967
12160 41967 23516 14999 29277 45627 16739 -21570 -39679 -23129 3402 7317 -2091 15546
12148 15546 40572 52748 19274 8681 28884 23909 18081 26073 35725 38391 15642 17977 14517
12135 14517 24504 26743 18045 15699 26097 35009 47199 32335 23912 30186 35015 39718 42207 42457
12121 42457 15885 -3039 -17348 -19563 18964 36635 30557 13243 -12533 -13992 16399 14562
12109 14562 -12510 -29435 -16703 -19840 -27630 -28431 -22633 1737 13905 18284 17201 24262 22728
12096 22728 10994 32690 47154 60291 53463 56076 30143 37953 36289 10206 5826 10083 28604
12083 28604 19133 13286 -6430 -7140 -11100 -6787 5602 1371 -14524 -27760 -21879 -28518 -28903 -21557
12069 -21557 -2588 11713 48169 47339 31669 17174 -2264 -24520 -23065 -714 14703 28235
12057 28235 23476 22785 4832 3649 -6164 -13064 -9224 -7559 -18387 -13288 -3106 8027 -6916
12044 -6916 -5306 44736 43441 21630 20460 40822 57754 41203 18639 10393 -1569 13322 16161
12031 16161 36203 49301 34321 14776 6720 8270 26961 31977 27649 48276 41497 24352 2888
12018 2888 13918 15909 7517 25420 54699 43774 26906 5135 147 8957 -11840 -10667 -15271
12005 -15271 -5293 -11370 -11047 99 27735 34591 37512 51581 44291 25611 31688 22295 -2071
11992 -2071 4609 4269 8513 34569 64048 60727 37266 17941 26553 7561 3917 17360 23478
11979 23478 36633 17379 -10354 -30041 -22764 -120 9506 24893 6381 -1692 17754 32822
11967 32822 64479 38087 28717 47116 31432 34657 20472 395 -7350 -12695 -7429 -21193 10456
11954 10456 39796 36978 33245 30911 34401 55080 43438 28071 17775 6047 14562 27760 39212
11941 39212 21084 14204 -6514 21393 27205 14144 4721 -12457 -3490 8168 16707 -750 -26102
11928 -26102 -12895 5212 18065 33582 49537 37841 9016 -6145 16911 1243 -19797 3164
11916 3164 11382 21569 20510 25014 15971 17424 23754 39617 14513 -8727 -39572 -32541 -16124
11903 -16124 4869 20527 10158 -1337 -17743 -10369 12132 29012 42702 20500 -6580 -12537
11891 -12537 -20293 -14782 -5598 14162 6527 25457 40122 33960 16705 19029 19782 24088 45555
11878 45555 66154 76204 61658 44539 52181 50592 42499 44890 43544 34420 47637 58862 60515
11865 60515 36134 9907 -446 13235 33170 52332 39740 40821 49576 52545 45041 33484
11853 33484 13566 27438 35628 38592 42347 30993 25971 36995 45034 52831 48182 41739 21626
11840 21626 6104 30339 40219 37083 35434 50477 54706 48310 15600 19058 39526 50165 32687
11827 32687 27383 59441 58368 40195 37382 45108 26130 7539 5733 23594 21010 35084 24187
11814 24187 32445 34354 40274 43473 44775 59900 59525 38968 20604 45784 61146 45028 29346
11801 29346 34133 39865 21143 15663 35512 56078 65103 58215 73888 67863 64442 70012 67732
11788 67732 66078 57815 58165 66058 80152 79826 57973 53991 48316 46308 45096 50954 52646 65657
11774 65657 64659 55260 57277 53209 38094 56187 69168 70951 61008 73025 82172 52147 67094
11761 67094 50347 39622 34160 20858 37149 39480 56857 49114 40730 38316 35437 29513 51967
11748 51967 75926 71490 54933 31309 34426 36982 62601 75963 51142 44489 37178 17123 17745
11735 17745 8123 22974 23398 23232 24340 14050 32000 33838 50104 55208 55657 69259 58751 52457
11721 52457 51420 59468 57644 58179 39568 18123 28055 11851 18489 28629 20412 22243 34079
11708 34079 37583 27772 36851 36276 51997 82338 83960 91632 91190 94420 77026 79033 86086 96269
11694 96269 88800 72290 68283 55712 45954 37790 42470 48599 63273 51971 48062 37777 61205
11681 61205 83126 77110 81609 53802 27001 39568 55514 44068 44011 61627 57174 64229 55890
11668 55890 43129 41681 59021 30757 33913 72725 56613 26479 19153 38993 48193 33397
11656 33397 52986 57901 70199 63338 29659 20116 9678 13763 22645 35468 46087 54442 46688
11643 46688 35049 32242 28685 42162 48982 63511 64973 57992 49701 62919 56453 61767 33468
11630 33468 41888 84213 83904 51984 29636 58195 92339 86130 77535 87918 81309 76746 81128
11617 81128 80512 64116 43040 57723 50527 74293 92014 73284 54318 54980 83700 101175 105234
11604 105234 115492 97049 88429 102166 104283 90891 71040 54820 64772 74290 50898 42638
11592 42638 59033 55034 28679 4886 13966 44756 58506 84314 90593 69969 39068 31171
11580 31171 60390 77322 64611 65050 66401 81254 83311 80603 63771 70662 92521 108517 88538
11567 88538 67392 77413 75796 99805 93364 66622 62801 76522 79955 81916 81415 67677 63606
11554 63606 72753 109326 131596 132621 117125 99205 98759 90076 81369 93643 127577 131068 113553
11541 113553 124761 88293 86425 103002 59865 56416 75635 71155 82072 99712 115398 105462
11529 105462 105156 119780 110175 81694 77130 102855 98481 78342 65839 51728 41852 68217 80436
11516 80436 80049 80600 64431 33520 44771 59496 77694 93301 77720 76990 74136 65998 76624
11503 76624 67114 85229 87069 67305 63117 79961 79004 71857 67538 68834 56539 63937 88289
11490 88289 104450 126099 118509 87425 77532 64405 65484 109643 133829 103987 84853 97310
11478 97310 116901 117970 112983 122062 119454 107642 96562 103850 110736 107232 113446 106950 122484
11465 122484 108253 98606 94733 93960 109807 104565 104042 130675 149552 140936 127834 95374 96509
11452 96509 95414 98566 101532 105188 128614 113129 93471 100607 88843 74567 62515 62299 74569
11439 74569 63353 45056 72777 102667 108092 102490 116163 117655 115741 111858 123446 106537 93233
11426 93233 104472 113936 104797 107066 118444 105315 97848 109581 144039 130067 105039 105505 99826
11413 99826 101144 114330 129091 112061 107697 119090 133162 137217 133536 111873 91256 69935
11401 69935 84026 103332 118797 135582 124280 121277 121664 102684 115408 124165 132098 120009 113737
11388 113737 108369 104308 78089 72944 84605 113317 130665 129757 120256 101514 84559 98825 122044
11375 122044 122922 106197 103360 143695 147493 128350 125118 129423 136657 144831 151285 142952 128535
11362 128535 126341 126743 130424 145185 148573 145299 158904 150112 127942 123493 106063 93496 104863
11349 104863 129783 129485 105678 110577 133736 98626 76348 86329 102301 100050 104207 119479 120283
11336 120283 109513 111248 128114 115712 91181 97975 103586 94724 89905 103844 111201 116225 124086
11323 124086 132904 131711 104701 110836 109926 110762 100111 102858 105187 90622 117620 122498 117174 106865
11309 106865 107566 117858 132983 137321 116815 106054 113330 99743 106416 113165 111501 103864 121155
11296 121155 151482 167661 169400 157132 155568 155500 133468 136406 134759 134811 147174 141676 138197 138778
11282 138778 150577 146054 131744 120145 143192 155531 140768 125306 121882 115245 119781 129719
11270 129719 156474 165009 150190 135723 96558 63984 78039 96093 113347 119369 114913 91008
11258 91008 91251 85250 95725 132809 134170 148885 141631 129018 142289 114630 98812 91114 86037
11245 86037 95607 101831 107310 100624 101168 124093 141764 122135 108760 111886 106216 114031 121383 131796
11231 131796 132910 132521 133598 127802 105453 103421 105070 95158 114923 112245 116997 104555 72016
11218 72016 82661 86038 96430 103580 109692 104753 112056 115768 96535 89003 80398 95009 100388
11205 100388 103296 86793 64267 75397 86519 93275 76110 67682 61580 65974 72223 54094 50994
11192 50994 88653 116637 111025 92416 86623 61530 41282 66281 98575 112421 84478 59154
11180 59154 55681 83706 116852 125566 119544 126211 118849 124977 120337 110279 98124 72107 83344
11167 83344 79738 57544 67150 65883 73205 73526 77527 84653 71185 77897 90794 72910 77654 82572
11153 82572 70972 46132 46905 43572 43704 42726 54359 53885 37408 42981 86117 90945 82982 98858
11139 98858 99255 94570 111775 98110 105491 98669 95990 86899 78920 78575 67782 51210 10046 6447
11125 6447 1821 33706 43785 41272 53650 51122 42106 38482 38098 43975 58430 73175 75205 57302
11111 57302 36905 28769 29999 35868 21606 14178 22190 30648 26708 52153 42156 43595 47985 51434
11097 51434 57238 58737 64218 83926 87581 50642 20555 41548 64846 82243 94657 83323
11085 83323 69832 66213 95589 74673 49932 38159 54364 70563 73745 76649 45211 39209
11073 39209 54733 57700 39838 35595 53479 37377 30718 26755 21777 25807 14328 -624 21277
11060 21277 55693 75095 82281 111801 112415 90896 98126 95592 62131 57130 61206 36878 27088
11047 27088 25356 26729 48172 51395 32255 50717 62537 64747 61181 56898 63445 64039 69349 76199
11033 76199 78259 63790 61811 71865 76291 67805 64578 68238 62874 47959 39063 57000 63373
11020 63373 69700 72468 48882 30177 35790 33964 42184 62167 69627 54269 11013 -11453 10816
11007 10816 6775 -21715 -24166 -16503 -2726 32479 29437 44852 50002 42079 39913 42988 43150 36787
10993 36787 41217 45122 56222 70762 75442 49450 40378 28101 36756 48756 64617 60916 29332
10980 29332 18812 29489 54594 57044 52915 57988 73758 66238 61876 37521 25556 24412 29921
10967 29921 43349 34883 30490 46689 56285 32220 36329 22624 33087 44238 56972 72397
10955 72397 62821 45916 70596 92774 106724 114494 91706 43998 18939 12591 20326 46220
10943 46220 54664 60448 44868 54118 73380 71222 55654 28912 34561 34443 26141 37190 28785
10930 28785 8871 13196 23055 28738 46353 43115 35252 38464 26472 29748 33689 42912 42756 22873
10916 22873 -1080 5562 1256 -14451 20895 45607 33675 33149 47756 41534 44663 38137 35185
10903 35185 21197 12282 10692 23823 15129 -1460 4830 19641 14327 4292 8398 10798 29294
10890 29294 35632 30568 22233 34800 50039 45932 39830 31404 8341 -14381 -2837 8122 12399
10877 12399 33800 30185 9296 2058 -5139 4224 20206 23617 32059 39089 50812 52843 35251
10864 35251 29669 34082 43338 40366 46729 52301 52024 49066 53344 41537 38468 12556 21846 13350
10850 13350 -21232 -5835 33098 46900 15003 29081 40843 48019 49976 62884 64510 69341
10838 69341 64445 29606 37553 50184 28561 29968 49936 35536 37232 47826 16785 -10675
10826 -10675 -12583 12002 21944 18557 10868 16727 -151 21053 31080 55954 60787 54367 46801
10813 46801 43052 56962 38721 25040 36338 29049 13324 17945 4435 -27283 -30761 -27865 -17372
10800 -17372 -9461 -12297 -16680 4831 35168 37882 18614 16119 23748 22350 21700 10353 -17628
10787 -17628 -11560 -7766 -19803 -1446 19055 6818 25133 43507 46535 18250 3754 -9588
10775 -9588 -24532 -22610 18601 35758 32460 11880 -13088 -29742 -323 -693 -17353 -16850 -9561
10762 -9561 5977 14256 1145 -8922 7399 5518 7413 27690 27709 35137 30873 13429 -8555
10749 -8555 -18636 -12542 -24933 -25768 -6361 -15123 16320 35784 21823 35185 31253 12978 -1828
10736 -1828 -14557 -13666 -11650 12416 3071 -7110 -2363 1739 14917 25906 17855 1561 -21572
10723 -21572 -1656 58 -994 32157 34467 30335 23450 31141 15185 9760 5291 -15651 14713
10710 14713 24680 5749 7319 37869 38094 35269 18027 13098 10387 -27672 -1675 26254 24995
10697 24995 10978 -11397 -42485 -60414 -55967 -51858 -36533 -21515 -16776 -1704 6118 8455 19597
10684 19597 -384 3798 14724 -5129 -40527 -48803 -36007 -26683 -32983 -44199 -43195 -35656 -18740
10671 -18740 -22580 -27333 -26497 -739 17345 35476 42339 46739 47041 46198 19729 16925 35157 33074
10657 33074 16191 -8613 -26064 -34355 -45519 -44939 -24887 17676 24134 10982 29215 9945
10645 9945 -20128 -27145 -2776 812 6305 12987 -7199 6877 9805 3003 19385 12877 9367
10632 9367 9112 25682 19373 19227 -5776 5550 19830 12069 10236 5264 -28653 -80892 -76081 -41133
10618 -41133 -33997 -5086 -6664 -34470 -21819 8565 15519 13726 15798 -586 -6260 2373 20553
10605 20553 18850 12944 -1605 -6389 -11255 -3249 24562 26919 34948 38599 50801 40717 22601
10592 22601 1393 15831 52457 65880 50863 23550 6751 -507 1668 16029 30911 23664
10580 23664 16536 22795 31079 13868 30349 26588 9844 22284 21818 -5357 -32859 -17624 9656
10567 9656 8580 -7725 -12807 1246 16974 -4397 -2841 -8578 6772 35612 53054 56534 47072
10554 47072 28842 12441 -1672 -14917 -4495 -9339 -21974 -14197 -518 -1838 -6161 -14414 -466
10541 -466 15260 24059 21096 16890 2826 -15458 -4884 18855 19350 35418 35835 23006 42010
10528 42010 60611 48063 20911 31409 44551 31555 593 -15914 -776 18035 34277 19692
10516 19692 648 -9497 -13189 -11717 15526 33607 56948 85214 63985 34686 28245 15915
10504 15915 -5778 -12907 -20901 -9682 -7821 -38401 -59821 -22939 -6991 -4463 -25241 -32043 -30558
10491 -30558 -7089 2673 -16102 -31764 -36725 -38240 -21768 -30752 -32906 -29558 -8123 -12347 -20616
10478 -20616 -11960 3826 13055 -21943 -29160 -25843 -10294 10915 -4239 -15603 -24060 -14355 -1120
10465 -1120 -27869 -33278 -36845 -29965 -31444 -16190 -5022 4436 -394 -15382 -5777 27737 17332
10452 17332 19189 18053 27449 58058 39869 34975 36088 40995 13074 8441 26230 32185 28098
10439 28098 18773 31665 29148 19594 7027 -733 11007 8054 13821 29619 26170 26276 32232 63544
10425 63544 81059 60197 31258 14049 10924 -8482 -16539 10077 32858 21212 24766 35735
10413 35735 29776 23225 8172 2196 -8589 -32662 -25241 -11258 -13827 -5967 -8893 -6705 11141
10400 11141 19593 19165 38973 28876 9358 14428 5345 -3138 23555 22498 14381 20620 17320 22264
10386 22264 26563 23870 3719 -17807 -6132 1566 -7490 -2355 7608 15522 20695 19570 36402
10373 36402 53920 44106 30518 18302 5936 22802 14042 12397 3474 23982 34260 26282 26087
10360 26087 33959 21333 20858 24620 35561 29751 17177 13861 35291 43343 53955 48716 25218
10347 25218 38475 75357 90295 115204 111568 103379 83474 81928 97896 116384 129395 157045
10335 157045 194174 223598 254480 314615 397649 542627 715990 882620 1020685 1142808
10325 1142808 1261569 1343875 1333933 1285029 1211119 1105370 954842 790791 624864 475364
$$ [...]
##END NTUPLES=NMR SPECTRUM
##END=
