##TITLE=Analysis number 328016
Compound Code cc 58326
Book Reference 467/148/3
Project Code adrs
Chemist Name benw
##JCAMPDX= 6.0         $$ Bruker NMR JCAMP-DX V2.0
##DATA TYPE= NMR SPECTRUM
##DATA CLASS= NTUPLES
##ORIGIN= Bruker BioSpin GmbH
##OWNER= nmr
$$ XWIN-NMR		Version 3.5
$$ Wed Apr 25 12:52:59 2007 GMT Daylight Time (UT+1h)  MAYBRIDGE\nmr@NMR_250MHZ
##.OBSERVE FREQUENCY= 250.131544655141
##.OBSERVE NUCLEUS= ^1H
##.ACQUISITION MODE= SIMULTANEOUS (DQD)
##.ACQUISITION SCHEME= undefined
##.AVERAGES= 16
##.DIGITISER RES= 18
##SPECTROMETER/DATA SYSTEM= dpx250
##.PULSE SEQUENCE= zg30
##.SOLVENT NAME= CDCl3
##.SHIFT REFERENCE= (INTERNAL, CDCl3, 0, 16.522)
##AUDIT TRAIL= $$ (NUMBER, WHEN, WHO, WHERE, WHAT)
$$ ##TITLE= Audit trail, XWIN-NMR		Version 3.5
$$ ##JCAMPDX= 5.01
$$ ##ORIGIN= Bruker BioSpin GmbH
$$ ##OWNER= nmr
$$ C:\u/data/dgb/nmr/ADRS/3090/pdata/1/auditp.txt
$$ ##AUDIT TRAIL=  $$ (NUMBER, WHEN, WHO, WHERE, WHAT)
(   1,<2007-04-25 12:52:34.60 +100>,<MAYBRIDGE\nmr>,<NMR_250MHZ>,
      <created by zg, POWCHK disabled, PULCHK disabled
       configuration hash MD5:
       76 6E 9A 78 1E 09 19 81 EC 84 63 8F B0 6A 59 2D
       data hash MD5: 64K
       CA A0 50 53 06 59 A9 98 17 BE 99 64 FA 96 2A 13>)
(   2,<2007-04-25 12:52:47.24 +100>,<MAYBRIDGE\nmr>,<NMR_250MHZ>,
      <Start of raw data processing
       ef LB = 0.3 FT_mod = 6 PKNL = 1 SI = 32K 
       data hash MD5: 32K
       88 0A EA 80 E9 3F 9D AC 30 2C 66 32 77 32 D9 70>)
(   3,<2007-04-25 12:52:48.84 +100>,<MAYBRIDGE\nmr>,<NMR_250MHZ>,
      <apk 
       data hash MD5: 32K
       E1 12 C2 E6 46 55 D4 EE FD 6C 30 22 99 64 1A 96>)
(   4,<2007-04-25 12:52:49.51 +100>,<MAYBRIDGE\nmr>,<NMR_250MHZ>,
      <abs ABSG = 5 
       data hash MD5: 32K
       9D C5 69 2D 7A 42 23 4D AD DB FE BF 2F 9B FD 5F>)
$$ ##END=
$$ 
$$ hash MD5
$$ C2 CB C7 DB 4D F9 AD B1 24 77 01 CD 99 32 F1 3D
##$RELAX= 
##$RELAX= 
##$RELAX= 
##$RELAX= 
##$RELAX= 
##$RELAX= 
##$RELAX= 
$$ Bruker specific parameters
$$ --------------------------
##$DU= <C:\u>
##$EXPNO= 3090
##$NAME= <ADRS>
##$PROCNO= 1
##$TYPE= <nmr>
##$USER= <dgb>
##$AMP= (0..31)
100 100 100 100 100 100 100 100 100 100 100 100 100 100 100 100 100 100 
100 100 100 100 100 100 100 100 100 100 100 100 100 100 
##$AQSEQ= 0
##$AQ_mod= 3
##$AUNM= <au_zg>
##$AUTOPOS= <25 >
##$BF1= 250.13
##$BF2= 250.13
##$BF3= 250.13
##$BF4= 250.13
##$BF5= 500.13
##$BF6= 500.13
##$BF7= 500.13
##$BF8= 500.13
##$BYTORDA= 1
##$CFDGTYP= 0
##$CFRGTYP= 5
##$CHEMSTR= <none>
##$CNST= (0..31)
1 1 145 1 1 1 1 1 1 1 1 1 1 1 1 1 1 1 1 1 1 1 1 1 1 1 1 1 1 1 1 1 
##$CPDPRG= <>
##$CPDPRG1= <>
##$CPDPRG2= <>
##$CPDPRG3= <>
##$CPDPRG4= <mlev>
##$CPDPRG5= <mlev>
##$CPDPRG6= <mlev>
##$CPDPRG7= <mlev>
##$CPDPRG8= <mlev>
##$CPDPRGB= <>
##$CPDPRGT= <>
##$D= (0..31)
0 1 0 0 0 0 0 0 0 0.06 0 0 0 0 0 0 0.0002 0 0 0 0 0 0 0 0 0 0 0 0 0 0 
0 
##$DATE= 1177501953
##$DBL= (0..7)
120 120 120 120 120 120 120 120 
##$DBP= (0..7)
150 150 150 150 150 150 150 150 
##$DBP07= 0
##$DBPNAM0= <>
##$DBPNAM1= <>
$$ [...]
##$SUBNAM7= <"">
##$SUBNAM8= <"">
##$SUBNAM9= <"">
##$SW= 20.6930455092707
##$SWIBOX= (0..15)
0 0 3 0 0 0 0 0 0 0 0 0 0 0 0 0 
##$SW_h= 5175.983436853
##$TD= 65536
##$TD0= 1
##$TE= 683.16
##$TE2= 300
##$TE3= 300
##$TEG= 300
##$TL= (0..7)
0 120 120 120 120 120 120 120 
##$TP= (0..7)
150 150 150 150 150 150 150 150 
##$TP07= 0
##$TPNAME0= <>
##$TPNAME1= <>
##$TPNAME2= <>
##$TPNAME3= <>
##$TPNAME4= <>
##$TPNAME5= <>
##$TPNAME6= <>
##$TPNAME7= <>
##$TPOAL= (0..7)
0.5 0.5 0.5 0.5 0.5 0.5 0.5 0.5 
##$TPOFFS= (0..7)
0 0 0 0 0 0 0 0 
##$TUNHIN= 0
##$TUNHOUT= 0
##$TUNXOUT= 0
##$USERA1= <user>
##$USERA2= <user>
##$USERA3= <user>
##$USERA4= <user>
##$USERA5= <user>
##$V9= 5
##$VALIST= <valist>
##$VCLIST= <CCCCCCCCCCCCCCC>
##$VD= 0
##$VDLIST= <DDDDDDDDDDDDDDD>
##$VPLIST= <PPPPPPPPPPPPPPP>
##$VTLIST= <TTTTTTTTTTTTTTT>
##$WBST= 1024
##$WBSW= 4
##$XGAIN= (0..3)
0 0 0 0 
##$XL= 0
##$YL= 0
##$YMAX_a= 248845
##$YMIN_a= -236031
##$ZGOPTNS= <>
##$ZL1= 120
##$ZL2= 120
##$ZL3= 120
##$ZL4= 120
##$ABSF1= 16.522
##$ABSF2= -4.171173
##$ABSG= 5
##$ABSL= 3
##$ALPHA= 0
##$AQORDER= 0
##$ASSFAC= 0
##$ASSFACI= 0
##$ASSFACX= 0
##$ASSWID= 0
##$AUNMP= <proc_1d>
##$AZFE= 0.1
##$AZFW= 0.1
##$BCFW= 0
##$BC_mod= 0
##$BYTORDP= 0
##$COROFFS= 0
##$CY= 12.5
##$DATMOD= 1
##$DC= 0
##$DFILT= <>
##$DTYPP= 0
##$F1P= 14.0000005364418
##$F2P= -0.99999901652339
##$FCOR= 0.5
##$FTSIZE= 32768
##$FT_mod= 6
##$GAMMA= 0
##$GB= 0
##$INTBC= 1
##$INTSCL= 1
##$ISEN= 128
##$LB= 0.3
##$LEV0= 0
##$LPBIN= 0
##$MAXI= 10000
##$MC2= 0
##$MEAN= 0
##$ME_mod= 0
##$MI= 0
##$NCOEF= 0
##$NC_proc= -6
##$NLEV= 6
##$NOISF1= 0
##$NOISF2= 0
##$NSP= 0
##$NTH_PI= 0
##$NZP= 0
##$OFFSET= 16.522
##$PC= 1
##$PHC0= -55.02758
##$PHC1= 9.748422
##$PH_mod= 1
##$PKNL= yes
##$PPARMOD= 0
##$PSCAL= 4
##$PSIGN= 0
##$REVERSE= no
##$SF= 250.13
##$SI= 32768
##$SIGF1= 0
##$SIGF2= 0
##$SINO= 400
##$SIOLD= 32768
##$SREGLST= <1H.CDCl3>
##$SSB= 0
##$STSI= 32768
##$STSR= 0
##$SW_p= 5175.98343685301
##$SYMM= 0
##$S_DEV= 0
##$TDeff= 65536
##$TDoff= 0
##$TI= <Analysis number 999999
Compound Code 99
Book Reference 9
Project Code 9>
##$TILT= no
##$TM1= 0
##$TM2= 0
##$TOPLEV= 0
##$USERP1= <user>
##$USERP2= <user>
##$USERP3= <user>
##$USERP4= <user>
##$USERP5= <user>
##$WDW= 1
##$XDIM= 32768
##$YMAX_p= 446692051
##$YMIN_p= -904943
$$ End of Bruker specific parameters
$$ ---------------------------------
##NTUPLES= NMR SPECTRUM
##VAR_NAME=  FREQUENCY,     SPECTRUM/REAL,   SPECTRUM/IMAG
##SYMBOL=    X,             R,               I
##VAR_TYPE=  INDEPENDENT,   DEPENDENT,       DEPENDENT
##VAR_FORM=  AFFN,          ASDF,            ASDF
##VAR_DIM=   32768,         32768,           32768
##UNITS=     HZ,            ARBITRARY UNITS, ARBITRARY UNITS
##FACTOR=    0.157963299565203, 1,           1
##FIRST=     4132.6476996994, 0,             0
##LAST=      -1043.33573715361, 0,           0
##MIN=       -1043.33573715361, -904943,     0
##MAX=       4132.6476996994, 446692051,     0
$$ Real data points
##PAGE= N=1
##DATA TABLE= (X++(R..R)), XYDATA
$$ [...]
30004 377108 308834 444874 383865 252541 348864 178237 171117 120855 -50372 -138830 -281696
29993 -281696 -303423 -273065 -73715 149031 140647 94482 -124018 -286496 -294653 -82240 -169714
29982 -169714 -156061 -178393 -99667 6879 -56148 1548 -119205 -325983 -257695 -150756 -91473
29971 -91473 -147641 -110753 -79395 86191 385764 583806 484393 56587 -170237 -49767
29961 -49767 102234 -154128 -273385 -144972 -88905 191098 468782 552300 545962 215602
29951 215602 -61241 -247451 -170652 -201530 -401314 -311873 -249574 -195306 -266254 -367275 -466900
29940 -466900 -603809 -340780 -239757 -311716 -372626 -13828 244691 239791 337214 461633
29930 461633 184442 188724 146843 -13865 61458 -109995 -249204 -110194 -70726 -185581
29920 -185581 -309372 -347084 -104431 -112069 -10626 -163395 -368653 -225774 -161100 -117535
29910 -117535 -183911 -229300 -251379 -36613 163559 238211 241718 189489 -140064 -20813 94072
29899 94072 207364 26281 -107469 12371 144461 182386 164571 62037 -4351 -178868
29889 -178868 -353823 -232182 119759 199984 348696 166642 -60827 -121542 -233685 -128575
29879 -128575 -118769 97795 191067 69862 -140682 -211439 -98144 -33806 -145001 6587
29869 6587 349991 482727 422157 404816 257341 189893 -83704 11832 -3668 -75786 -106637
29858 -106637 -149448 -137148 -277235 -365821 -466357 -399673 -201316 44244 163513 118946
29848 118946 -36117 88251 11676 -214867 117079 362428 372688 474571 291275 -53134
29838 -53134 -233639 47048 174565 253097 345919 282157 115127 6822 52412 -31193 29066
29827 29066 -107404 18145 -216786 -190558 -107310 -23860 10482 85379 68755 40698 285027
29816 285027 532688 267592 108947 -9543 144266 219878 361752 178651 -208495 -178034
29806 -178034 -134922 -64057 -40355 154192 267790 270389 48710 -186216 -142992 -258479 -249964
29795 -249964 -161313 53364 132940 31855 -129208 -94263 -32667 35752 -2202 -263538 -185483
29784 -185483 -76193 -82594 -461234 -336684 -22464 -204708 -86274 202974 483686 426813
29774 426813 448957 486059 287121 149867 255522 318570 230267 222123 573622 694574 341027
29763 341027 199668 122824 106041 104188 153169 126334 246915 169690 -25733 138149 173470
29752 173470 -44666 1706 108612 203018 236485 127484 -89645 -62987 -148092 -169693 -55132
29741 -55132 78082 162433 177502 401944 396030 473793 356249 384946 359192 159753 224638
29730 224638 328709 278407 260996 274775 291914 299155 241230 22029 -119773 -92012 -225819
29719 -225819 -147496 -63367 -89621 -164042 -100782 145520 267730 292255 246846 254324 188257
29708 188257 -3220 19883 50056 130416 46553 -212885 -389376 -340467 -118236 -135315 -282967
29697 -282967 -162040 100780 -40859 -162609 -34945 60547 22554 93648 40760 60498
29687 60498 59870 205920 228455 85604 -143992 -131783 -27385 -89713 99586 272637 302790
29676 302790 157040 -119489 -46036 -310030 -329666 -225205 -299958 -237297 -158842 -454871
29666 -454871 -405233 -375747 -336566 -208881 -164622 -61048 -236933 -82484 204994 175953
29656 175953 -204684 -378273 -321246 -202721 9580 -37764 -151736 -136259 -20180 -290926
29646 -290926 -391901 -159011 217553 426799 293198 295480 127521 361509 506384 366764
29636 366764 265679 45519 -167937 -59132 258233 223349 151976 -185732 -276967 -219371
29626 -219371 -143198 55947 78187 -12583 38982 -94900 -109102 -12053 174143 137269 95739
29615 95739 58403 -10776 88148 43845 -44789 32425 312039 463537 449508 514418 397940
29604 397940 433561 476979 394205 396992 128381 -99750 -53406 65369 117551 170108 -58048
29593 -58048 -136232 281262 528722 367051 7192 -278390 -338978 -335538 83775 233734
29583 233734 152292 -4331 75524 98914 68427 87562 36894 -14882 133813 9853 -139743
29572 -139743 -281105 -288147 -428105 -81314 -212391 -521123 -432172 -418428 -499704 -405244 -409530
29561 -409530 -292120 -186349 -146991 -324427 122388 217134 22191 -151276 -141615 38756
29551 38756 222113 104425 -88046 -99513 -105751 3323 -8651 -86896 -144692 112263 130019
29540 130019 -122449 -61314 -30348 -106424 35156 150187 48675 3292 50034 -60097
29530 -60097 -60655 -104904 -94866 -278903 -463179 -722993 -681235 -465762 -222514 -227834 -138672
29519 -138672 -153445 -100461 58744 29850 -130484 -187221 -52511 147003 283832 50943
29509 50943 73881 -61990 -192341 -112307 -13960 5340 -231906 -353885 -93040 51656
29499 51656 -28414 -35428 18940 88377 229446 54244 -147602 -210510 -281269 -250196 -168840
29488 -168840 -17594 -47507 -34062 95651 183951 116142 78650 96705 129476 106900 -65813
29477 -65813 -49771 36622 188560 38880 -232360 -241138 -171455 -149146 45500 237135 440215
29466 440215 422158 235137 345258 419762 309993 419014 335756 290188 226495 36885
29456 36885 -67140 -154031 -259529 -146450 30498 -18874 156757 280533 372683 347298
29446 347298 -8741 -254668 -296567 -214316 -373796 -289015 36577 9605 71596 137346 127788
29435 127788 80851 -91350 72531 255242 188011 7944 -191977 -259340 -186400 -217905
29425 -217905 -231710 118221 54795 81868 -173447 -241589 -370008 -341035 -223165 -116487
29415 -116487 -3756 29754 45048 -159512 -221960 -274239 -259745 -307766 -303533 -226826 -278183
29404 -278183 -275932 -342924 -129147 -26699 70996 184742 200526 134327 50387 -64338 9431
29393 9431 -33242 -19782 -12335 37477 29489 197447 217418 102948 151968 177464 88151 -65583
29381 -65583 -315815 -173287 121908 152359 59827 13029 19167 101688 122750 100131 204806
29370 204806 331249 268820 207326 240168 190413 122870 223317 39274 -34327 -44879 -126604
29359 -126604 -16042 -13324 -161952 -415006 -402370 -163080 -130871 -18438 37027 76594 168350
29348 168350 24843 265460 341683 237637 167502 292091 259168 65853 73855 126950 47632
29337 47632 -4889 60463 99793 157723 91799 38642 210025 269166 238451 182711 4718
29326 4718 -122214 86176 391488 418102 342834 246034 273621 232742 46308 134395 256524
29315 256524 392507 287740 237725 299346 161524 66609 -131946 -54479 171352 -53833
29305 -53833 -175111 -159899 119031 303225 198955 77179 141516 12628 -232747 -200488
29295 -200488 -177829 42723 85684 36265 -193450 -43018 126591 234218 126081 174742
29285 174742 82084 48899 56622 7426 -89733 -45601 -73046 -202689 -314654 -176594 124599
29274 124599 134065 163495 49747 9246 -89378 -102177 86154 36414 -181272 -365935 -152068
29263 -152068 66405 320111 273026 60373 -35549 135064 496099 284382 85916 50721
29253 50721 -120048 -264372 -292295 78460 142208 23874 50224 69895 194938 212140 143867
29242 143867 74752 222600 383544 199455 -186317 -178805 -104806 -47879 -109361 -161589 -219427
29231 -219427 -81910 57879 11116 111536 196587 319552 359525 53795 56286 125756 97607
29220 97607 192103 218331 32920 113097 -94077 -254114 -76236 -8224 -147582 -436433
29210 -436433 -533201 -467767 -108735 220418 308204 267202 135567 139277 148537 55857 -109264
29199 -109264 -19098 41234 118531 -70955 -78832 5076 11783 -39141 -26721 -57335 -74757 -278780
29187 -278780 -225519 93012 256437 306713 133327 -176619 -311326 -255648 -292834 -213180
29177 -213180 -13581 -64052 -263250 -120207 -145756 -188771 -163428 55316 77032 61086 174623
29166 174623 208000 373884 468970 472330 254060 94703 126346 317 -104235 -229422
29156 -229422 -136900 1381 27457 -301340 -245785 -238244 -184687 96873 22716 -411825 -219743
29145 -219743 182605 19880 -50134 -84020 -122777 -351671 -365350 -387538 -477096 -422080 -453607
29134 -453607 -487353 -481756 -280112 100107 50956 -228669 -119982 118964 224230 315788
29124 315788 391111 257217 -67501 16594 -44042 128422 32449 -263357 -53489 91972
29114 91972 9685 56023 -79976 -90561 -298426 -356449 -195692 107544 189236 35147 29998
29103 29998 180467 139921 -277753 -209441 -4732 84754 261880 160546 47403 94172
29093 94172 344384 392502 34025 -100342 -65395 -33787 -114819 -393420 -437345 -226970 -30668
29082 -30668 -135471 -305344 -173554 -2329 -25826 -61666 -212368 -296722 -94121 -75702
29072 -75702 44192 29572 155154 137242 -176527 -335206 -224401 -49887 100939 74590
29062 74590 120138 157776 94308 87661 77418 326721 540257 447379 283346 -7189 246215
29051 246215 193448 216913 153943 1597 -161122 19788 34167 44563 32171 56094 -13021
29040 -13021 -22737 25102 -203 -88239 39817 253218 179462 205825 223536 -22107 -20957
29029 -20957 253660 131975 215458 201137 214744 251715 53507 140091 89031 -147697 -17015
29018 -17015 203341 287997 342252 444976 593590 643008 573029 371277 325879 308096 507628
29007 507628 357391 13384 -248811 -317780 -268555 -101038 -114240 7395 5801 -182288
28997 -182288 -221534 -150796 68484 51336 102231 183008 -61154 -12716 290516 144377 155942
28986 155942 179728 264896 383155 319345 239352 225051 36637 -166239 -360979 -212203
28976 -212203 32581 -39 84417 231606 391200 484046 413548 309168 337962 272341 162324
28965 162324 90753 -125183 -170590 -244320 -151885 -253376 -184293 26594 34909 -27291 164659
28954 164659 52387 -143134 -10600 125244 214360 211199 276445 299048 66647 -94904
28944 -94904 -60481 -54398 -166549 -138785 -22101 -141870 -167030 -94007 -304878 -434286 -404380
28933 -404380 -407684 -324686 -76044 -55586 56453 101585 64423 -164343 -97845 -167551 -291241
28922 -291241 -149274 12100 147426 113291 -85088 -98381 -36685 -367126 -381704 -265751
28912 -265751 -292822 -546763 -795898 -640902 -357655 -189704 -170428 -97654 16684 158018
28902 158018 191917 234770 369523 117710 -109227 -151054 -108435 151666 173302 166571 -257703
28891 -257703 -356852 -297126 -315757 -304896 -161687 -75502 -79235 -34701 146931 85852 -32515
28880 -32515 -12455 -176471 -107738 -206984 -337342 -359843 155400 428085 434199 253053 27651
28869 27651 113840 258129 227433 87212 24263 -168201 -310682 -302480 -350183 -290463 -153460
28858 -153460 23976 -98061 -153352 -1635 78414 95013 157727 69090 -107353 -47264 18505
28847 18505 158886 209659 123596 -31025 -12671 110122 57067 119961 275114 290692 94528
28836 94528 -41018 -202491 -76607 59015 35396 86986 3079 238834 277267 203030 198185
28825 198185 29356 -210044 -90351 111418 204918 21670 -194047 -280942 -250290 -162916
28815 -162916 -138846 -68205 -217167 -146096 -309773 -183126 890 31632 229455 261581
28805 261581 299013 341514 263447 197804 66179 -68998 29921 374556 248881 -71804
28795 -71804 -206186 -192762 -278048 -432867 -492525 -254564 -125095 -8987 -37309 -82845 -304870
28784 -304870 -300872 -34418 -133537 -333046 -344022 -146844 -176051 -252355 -163389 -292741 -287818
28773 -287818 -3783 -1227 122311 190668 214156 64996 -74664 -36087 73746 77582 26686
28762 26686 -11302 42807 198226 97429 69739 -51448 -14904 -104530 -48641 65853 176749
28751 176749 -12569 7775 113794 215568 167195 100875 139402 -67421 -243497 -214406
28741 -214406 -291455 -21169 103228 11247 -144519 -147042 111422 134746 94245 -8051 115349
28730 115349 100342 91973 121415 -19561 -79661 -177310 67991 63298 37044 6992 39629
28719 39629 334102 264630 -141819 -568501 -384092 -95402 -262242 -172005 42907 15785
28709 15785 -246080 -125152 -68014 239496 206116 -50772 -147830 -193231 -185641 -142401 -29572
28698 -29572 72228 -126553 -105530 -153074 -276775 -5818 208088 326796 168723 -35334
28688 -35334 94067 419771 516145 247006 58760 139049 73759 272152 112128 -180209
28678 -180209 -102547 -48488 108548 -110064 -280573 -174308 3401 291385 300952 267943
28668 267943 217822 9634 2490 -74684 -121435 -214027 -152844 -34331 124774 161397 81826
28657 81826 -119789 -281988 8208 43268 15291 221380 231548 77373 107273 252487
28647 252487 121444 111752 43332 -198629 -107075 -225764 -330801 -288235 -315226 -389160 -215289
28636 -215289 -62699 -119410 -589922 -592786 -448013 -481460 -454973 -315092 -173490 -171218 -138258
28625 -138258 -163342 -152254 -226667 65473 216426 117040 -105236 -98962 -248889 -412926 -313499
28614 -313499 -143518 -218257 -38684 133923 237179 250233 295534 -74906 -243952 -112734
28604 -112734 -42227 -136560 -75277 -92326 -116722 -259729 -311147 -390619 -358896 -209067 -204340
28593 -204340 -204405 -160164 -224986 -232836 -225986 -308533 -329509 -292426 72409 257406 8832 -221916
28581 -221916 -220861 99916 127283 -3289 -3649 13134 127555 64674 119946 264376 217496
28570 217496 156101 37709 -157306 -102823 71042 336722 373725 516329 425306 297312
28560 297312 82395 -66175 -238571 -100438 -156445 -238182 -42204 172253 419546 554680
28550 554680 584457 316010 140286 -86358 1117 234131 22407 -196867 -60096 -75558
28540 -75558 -30232 175194 124704 -39250 49083 122445 76842 -88148 -183526 -271544 -134393
28529 -134393 40841 111676 124578 139107 193576 229567 111030 106798 323091 407687 277160
28518 277160 172813 185808 24190 64473 40425 396 71095 86103 64866 104615 70994
28507 70994 43206 50387 -7050 -116454 -144596 -56812 59034 247397 49761 230476 372573
28496 372573 70244 -24840 71778 210314 245705 264730 211780 -52523 -141288 -49162 -49886
28485 -49886 18133 -152746 -391940 -441596 -689829 -242335 -119530 -205191 -98233 89926
28475 89926 -91721 -115660 -37568 139048 279177 281807 469590 588513 411585 212231
28465 212231 25232 149634 174009 135836 49907 174664 109985 24517 189722 214157 318023
28454 318023 468093 321343 266979 54210 212067 145568 -23132 67948 282006 293048
28444 293048 349866 423952 211561 152502 133198 174450 188832 216003 85699 -208226 -497960
28433 -497960 -384563 -192246 25594 281100 364203 103663 19727 26135 179960 112550
28423 112550 -6841 146728 320885 -47495 -438606 -355336 -93300 76291 180113 186412
28413 186412 -99330 -472639 -441737 -500068 -263187 93444 -18905 -84224 158587 327521
28403 327521 242395 76394 98279 158507 158732 257625 206991 249321 315727 283564 -15025
28392 -15025 -21466 -107286 -52738 -7738 -157728 -208416 -255370 -283091 -104317 92661 200551
28381 200551 204805 20612 66984 -98942 -82229 30243 -37424 -19845 46370 264235 283728
28370 283728 227644 289467 257990 294770 320031 302109 61622 125745 91753 212738 61071
28359 61071 70565 56547 47935 18098 78893 306500 233228 305375 244053 379208 422836 264369
28347 264369 110112 200100 333558 364158 259660 -53886 -124944 -260853 22437 222608
28337 222608 211389 -27064 -161062 -257027 -160454 -63873 -44381 37840 -182321 -375643 -481120
28326 -481120 -416808 -443187 -571317 -455810 -418999 -334733 -419627 -464496 -223719 68972 130952
28315 130952 -125689 -161243 -21678 -38788 -210121 -142550 -101606 -175557 -99281 -153325 -159060
28304 -159060 116991 99675 155378 111940 24745 125845 283954 228338 88003 -28100
28294 -28100 -189453 -256541 -222414 -284762 -261785 -297602 -238246 -224745 -285062 -321417 -257854
28283 -257854 -139048 -5762 98375 -14794 -22219 99665 124396 -162398 -246515 -163440
28273 -163440 12005 -30233 34124 62401 187718 155694 149600 164560 169843 56234 26463
28262 26463 -168193 -201552 -108438 -118401 -130655 -75457 -32594 -11866 -137551 -49576 246768
28251 246768 491020 445023 218602 4297 -144693 -252635 -242231 -191577 -67846 42773
28241 42773 197855 554871 272498 7311 -91159 -175610 -26506 -66085 -158622 -60425 134814
28230 134814 145521 215794 59760 190122 209471 326675 155469 262669 298226 332241
28220 332241 266266 100097 24119 178808 150434 -72306 54985 213893 -45995 -171751
28210 -171751 -186618 -365665 -353165 -84222 -146401 -278833 -88368 59310 183291 336257
28200 336257 233271 150286 206888 148941 308848 186819 -55605 -181439 -115859 62588
28190 62588 129865 68902 79789 241056 184259 255308 517150 463728 312323 203343 198511
28179 198511 87135 31270 -25056 147837 172101 150483 149284 77723 -20661 5287 207564
28168 207564 253689 125394 90639 228384 380873 287650 335582 526635 451487 296898
28158 296898 208530 265299 170662 -44979 -50870 -18662 1769 170244 -45123 -193290 -194572
28147 -194572 -15367 71707 260796 115363 204814 373487 359445 143713 126476 166518
28137 166518 286363 260273 190250 147616 1558 -50358 -39092 41536 7755 -212963 -241198
28126 -241198 -293157 -270594 -267731 -292542 -169466 -266681 -158496 -33808 -111123 53423 352811
28115 352811 200977 314620 395962 256483 12254 -74521 -54417 -28159 -59111 -98131 22786
28104 22786 292486 508180 315041 87114 -220901 -121550 -73555 -123493 -212010 -196352 -418497
28093 -418497 -240640 -69273 16622 274389 286148 -3906 -2097 24933 121960 252231 87310
28082 87310 -69506 -54312 -29204 78985 221196 192185 82616 -222179 -259394 -172635 47768
28071 47768 253662 35134 -112019 -55339 33967 138478 62652 -80881 -217593 -85117
28061 -85117 71779 130065 69457 37207 -168776 -306374 -198300 -61472 56909 -32656
28051 -32656 -230001 -90452 -116281 -134676 -197404 -160231 -157066 -279996 -180526 93953 -54475
28040 -54475 -188465 -277734 -216746 -121731 -21297 -75255 -106972 -76155 -198801 -127019 -251342
28029 -251342 -176118 -91529 -234666 60058 223158 -8636 -163960 -291916 -392603 -189132
28019 -189132 -134652 61454 181461 158743 -78648 -229294 -60316 180554 -53532 -248734
28009 -248734 -107271 -80397 -89946 -74362 720 -64977 -134124 2553 104359 145425 22849
27998 22849 -138259 -42378 -160598 -203729 -306722 -345839 -113819 84100 -184024 -420629
27988 -420629 -330303 -252769 -168090 -135701 -199258 22308 302812 332015 182217 102651 113430
27977 113430 117343 315502 366366 286147 55179 -57801 -69481 -84583 -183184 53116 -30765
27966 -30765 -54524 -59010 -4182 1252 122908 181820 125066 181042 317385 276529 -10367
27955 -10367 -366762 -363311 -122290 -116072 -340626 -483244 -256034 -239578 -226784 -30736 27184
27944 27184 122496 33774 -55149 79154 123178 56535 255920 305060 267433 90748 -57897
27933 -57897 -66213 20502 73579 -50226 -34612 -21429 94464 176698 81343 -9445 -32950
27922 -32950 -81212 -233686 -258895 -93793 -39116 -34572 63740 70302 105661 176920 212468 285532
27910 285532 -49364 203810 283048 101511 75635 -28901 -155454 -210448 -120243 -131966
27900 -131966 -237158 -144501 64990 52071 52069 -244335 -418179 -432990 -399293 -338604 -93890
27889 -93890 195034 144463 250639 256474 244695 291545 192862 397240 505439 344306 215596
27878 215596 234698 147525 -53976 -54771 -111766 -115018 24477 109610 253148 131197 166887
27867 166887 192849 -814 42464 227472 155520 -80923 -119966 20734 219691 -35282
27857 -35282 -355732 -397485 -237697 85465 128278 -25178 69010 21895 91646 44294 132434
27846 132434 155825 116319 160833 47258 -201747 -212154 -75577 250808 171141 -181441
27836 -181441 -344416 -278567 -279426 -86811 -26170 -104018 109572 -85315 -128834 -318092 -257495
27825 -257495 -270129 -190206 -190622 -187342 -91012 -169567 -326540 -170349 38397 82396 -4434
27814 -4434 54928 76569 89536 -6152 8145 80381 78471 -175846 -468592 -450657 -400227 -182339
27802 -182339 -10033 152250 110926 -20635 -14535 -228168 -392312 -384978 66351 358376
27792 358376 357008 367082 -46387 -74918 -129966 -8474 181280 330315 479628 362765
27782 362765 132157 -6092 43415 -187956 -308007 -201570 -155406 43558 169099 304800
27772 304800 327174 463735 236109 -82437 -47506 45386 145649 67406 -32756 -216283
27762 -216283 -299493 -167007 17854 2923 166476 488103 692090 671049 690261 541845
27752 541845 174909 -32064 86761 -83099 60035 338266 292164 165823 59631 13565
27742 13565 69805 -3032 55161 88373 -14788 -71850 102697 9499 -83424 -127019 -265552
27731 -265552 -296812 -293240 -284007 -406347 -418465 -330366 -29705 -53959 -185751 -232712 -119270
27720 -119270 -148421 -137246 -163525 -16963 133972 96842 -69196 -325203 -183816 -57798
27710 -57798 -98861 -95021 80197 225198 230622 24361 171088 74663 48267 69466 160544
27699 160544 100962 180076 333529 178350 -70884 -98216 -134661 -145311 26447 87213 10172
27688 10172 -236087 -357503 -349064 -150800 -63474 74700 -698 -109050 -195672 -184720 -233785
27677 -233785 -172672 84875 102145 157308 206975 181450 199142 248157 54465 -97770 30738
27666 30738 98 -49060 2675 -18039 93247 89066 211134 -181453 -544393 -408954 -50686
27655 -50686 65297 -34481 -55341 90261 231074 226863 200425 375524 352122 160472 3787
27644 3787 -369 19744 -1758 28656 -10299 -11172 -16010 45184 207835 212641 -8224 84619
27632 84619 166410 158946 206378 149350 53276 211311 148083 784 -156154 -150195 95736
27621 95736 192600 147305 82922 -43177 68243 183654 -7641 146213 48772 -197754
27611 -197754 -346946 -361879 -83937 -92463 -61750 -63449 -36065 -11367 -46711 -39858 -124287 -157975
27599 -157975 79882 226848 206767 91721 27215 -81361 -3438 127153 123838 169756 371845
27588 371845 406022 209606 214076 189508 101333 -171319 -344840 -500141 -383779 -352975 -206606
27577 -206606 -173094 -114251 -15808 -45115 -116027 -260444 -242458 -207268 -66168 136566 391269
27566 391269 210272 -75314 -369845 -337563 -310916 -152583 90311 404814 333988 4367
27556 4367 -37503 154228 141178 -16522 -206964 -711 78302 -167749 -305961 -44767
27546 -44767 258907 268901 214873 -20890 -195910 -299246 -329669 -287123 702 110339 -99343
27535 -99343 -50819 3816 -117946 -113705 -172454 -418088 -597688 -309065 -268224 -89663 -49132
27524 -49132 104250 54464 -34040 30865 207245 392271 407614 70576 -60531 -71237 126405
27513 126405 269175 423786 276029 138595 420617 418262 -23635 -242376 -145228 147263
27503 147263 145476 281519 449537 241586 218211 260119 108179 133515 132383 145643 6236
27492 6236 13910 350843 264910 130735 -102772 -225181 -34435 -171280 -177153 2410 130760
27481 130760 289319 377488 364480 444171 406732 521034 328578 213141 3940 33115
27471 33115 83222 -30439 1900 210856 286760 488858 473131 283394 37415 -34125 -37328
27460 -37328 23724 131464 287273 75513 -87498 -227621 -110096 51449 40273 365313
27450 365313 394512 263211 78024 -15141 132457 252115 279296 49131 143664 355595
27440 355595 281422 -32907 -109174 -2916 -21934 -127976 -193072 42918 141934 70797 -86767
27429 -86767 30852 107329 -15787 -250238 -237951 -59394 -203044 -310987 -224481 -105992
27419 -105992 158720 275948 278912 115885 -176696 -371159 -340445 -248978 -331491 -359180 -158396
27408 -158396 -229502 -348822 -434735 -280418 -186203 -137739 -74722 -173856 -113297 53577 295419
27397 295419 445646 412077 265646 111947 87591 189957 71429 -42429 -50726 -138938
27387 -138938 -95197 -213806 -152994 -119808 -112777 -24461 -205196 -255802 -243243 -472951 -432476
27376 -432476 -158219 -41074 -132320 -256073 -369944 -416035 -369876 -277100 -546331 -612713
27366 -612713 -515258 -328351 -191333 -135517 -315682 -368981 -130793 -147970 -416198 -206208
27356 -206208 -104542 56298 -9981 14451 -226650 -436721 -104416 60205 -86157 -1458
27346 -1458 -411588 -454437 -313331 -309855 -471242 -435565 -274487 -402349 -372399 -274941 -102073
27335 -102073 96785 102104 72291 -83387 -42427 -71881 -67471 -67382 -81750 27009 3747 19044
27323 19044 -138032 -261388 -311509 -297055 -192147 -243451 -363975 -181636 -218335 -289117 -512138
27312 -512138 -448830 -303653 -148012 -51084 -107414 -217506 -377133 -279508 -479377 -552406
27302 -552406 -272731 24989 -129719 -150355 -54069 -142434 -67595 -105477 -313693 -168202
27292 -168202 -117210 -167990 -71679 -8344 49927 -52312 -33891 116961 48554 -68586 -160271
27281 -160271 -77998 103730 111950 -21878 113201 355188 315667 -94187 -85452 165837 82006
27270 82006 -8773 -202634 -333614 -279631 -288030 -386141 -83464 -12179 -193651 -158644 -206054
27259 -206054 -312275 -340525 -279373 -300761 -169513 -89168 -105112 3884 -100502 -170619 -111775
27248 -111775 241959 284837 187643 -55664 -179286 -176803 123424 312752 302820 446664 426610
27237 426610 241224 494096 403901 313437 268875 -55676 -36759 -169998 -387874 -203197
27227 -203197 -109631 -131421 -30329 -64985 -78878 -88869 27316 173741 64914 31738 179020
27216 179020 51005 18376 -58138 44919 64345 208212 -59258 17530 271643 179119
27206 179119 220596 218269 -183008 -290483 -228199 94172 176536 185828 107713 -107361 -171333
27195 -171333 -329664 -222134 -39520 -55144 -111203 52491 -116859 -122021 98160 341329
27185 341329 229235 152712 148499 28636 43851 85411 -12665 -36841 137673 104847 73425
27174 73425 37777 51860 30850 187709 166772 27697 -149052 -27662 -66235 -166685 -61234
27163 -61234 -144 -178069 -209199 -97591 -6509 -153966 -59977 -412781 -444774 -280001 -283492
27152 -283492 -124871 -110044 -315890 -89432 99103 65227 15135 106299 177466 383502
27142 383502 320162 405298 362278 327526 -43534 -414957 -213261 -182050 -231292 -378316 -359353
27131 -359353 -300949 -157767 -46202 -165238 -354991 -279615 -277888 -460903 -359592 -217240
27121 -217240 -265381 -287000 -166647 -44077 1556 115551 222265 67928 192735 29310
27111 29310 -149309 38175 305776 493703 383325 159005 101539 -53696 -77760 -130688
27101 -130688 -180368 -29385 -156871 -260988 -165543 -186237 -83289 -88020 -36660 -12952 -74951
27090 -74951 -263152 -241181 -126044 -260788 -158655 98745 119398 -187954 -20428 181488
27080 181488 246427 201723 115418 -11650 58853 84602 -23843 107812 161654 251030 149932
27069 149932 277551 225177 -6254 -209775 -82897 1483 -143358 -308636 -467290 -180460
27059 -180460 -36674 81667 -32610 -15758 135294 -26981 41414 269559 234053 42455
27049 42455 50306 153038 134237 24205 -2395 113390 -22938 -258350 18427 310451
27039 310451 261544 77304 -44430 -998 -51744 -128805 -211671 -166665 -223927 -374586 -260999
27028 -260999 62632 180796 202351 162763 26016 -49237 53097 174 -15319 60477 90020
27017 90020 223967 105759 77981 -32327 53892 181789 319695 265578 155276 125267
27007 125267 87955 191353 -45209 -136349 -261716 -437742 -262183 -137476 138989 216518
26997 216518 166903 -85158 10215 183906 265502 232265 -44336 63324 163660 222945
26987 222945 283193 309443 179830 1003 -182233 -86655 -93954 -93291 -118320 128252 40459
26976 40459 -104739 -31996 -237119 -428329 -302156 -9133 242314 -110323 -391559 -520831
26966 -520831 -674513 -540380 -226037 -3509 -110633 -348858 -352303 -87223 -110264 -172419
26956 -172419 -96108 173638 127144 -11164 -19434 -384653 -393825 -483497 -513249 -421917 -278628
26945 -278628 -59608 101796 38066 18812 -48428 82496 121356 60021 87169 328623 425275
26934 425275 437251 333876 1760 -171544 -129764 -126021 -215331 -314129 -383534 -246467 -216119
26923 -216119 -81312 86580 -114834 -156338 -441864 -359688 -214932 -90859 -161406 46676
26913 46676 40474 45876 141158 -576 -90971 -142149 -269634 -169575 -236652 -173821 10467
26902 10467 199433 134415 -59947 -129294 -1553 -23706 268501 305159 -94479 -290560
26892 -290560 -226655 -227847 -202442 -45143 -89596 26938 140760 -30922 31582 -7278 161497
26881 161497 339240 363455 242384 35159 -231456 -388601 -426233 -169426 -66832 -225749
26871 -225749 -220177 21462 58986 -96135 -79947 -74539 127995 145926 83505 107366 121426
26860 121426 134284 173165 24928 -171750 -284844 -318107 -190475 -229389 -317200 -501356
26850 -501356 -554696 -606151 -412239 -225965 -421913 -641231 -519893 -509860 -565880 -572512 -517853
26839 -517853 -520489 -599408 -457695 -156543 -181684 11966 79666 -126140 -201445 -111449 -159976
26828 -159976 -31085 110196 -65826 -330413 -460008 -201295 122696 11465 -179333 10581
26818 10581 -2177 -216258 -3446 161779 164340 168716 148801 152463 163431 225458 270466 199841
26806 199841 103355 -136554 -263573 -246685 -118375 113850 -15418 45316 121092 2640
26796 2640 -56170 -98341 3961 123897 77957 114770 153058 96010 115387 186330 137860
26785 137860 33025 -121140 -98413 -139716 -77509 -76219 -168684 -68928 5060 -1694 84169
26774 84169 320599 403607 230545 216286 358461 327246 347419 428107 441358 330486 277868
26763 277868 -28772 19738 128435 40555 123110 88896 -254653 -351079 -469288 -184739
26753 -184739 141333 219601 -105360 -94899 -58716 -44016 -123695 38639 -2332 -59367 -79989
26742 -79989 -57057 193818 331210 396389 358583 191971 262112 298819 195715 93760 11544
26731 11544 -50054 144922 309287 174990 -138037 -557883 -464460 -269431 -221890 -53331
26721 -53331 135124 95133 158457 193254 269634 49210 304029 140034 -123086 -182687 -51540
26710 -51540 150526 277414 179113 79598 227867 74970 -174453 -336824 -272967 -249568
26700 -249568 -113460 -63984 -116452 201971 342804 326997 239306 -65921 -168479 -186237
26690 -186237 -135866 54222 23774 -39219 -167993 -286294 -157933 91478 -10534 -194706
26680 -194706 -73101 75163 100249 -175890 -161911 -75569 23301 117070 352486 309152 119171
26669 119171 -90077 138870 10777 17619 -70100 -43821 16445 -68424 -5355 209870 32716
26658 32716 -46531 -154166 -236731 -317896 -121941 1867 -17665 192391 302503 195929
26648 195929 65226 68749 118276 70456 -65633 -168565 -48579 256945 258821 255831 146417
26637 146417 94532 108790 206154 292280 233158 197518 123185 -104858 -63184 149207 220277
26626 220277 133393 92737 170521 74527 1990 353490 496013 341310 267442 102055 -23858
26615 -23858 9608 64053 221550 345951 362983 336401 440988 440752 502406 466858 335311
26604 335311 408401 101405 -133239 -205231 -31154 123161 81155 -176467 -242185 -219625
26594 -219625 -140222 -16047 -117847 32623 258262 325347 403489 347558 89595 -111347
26584 -111347 14480 192956 -85646 95375 113610 127562 180506 139221 125818 332349
26574 332349 427942 30755 -178937 -136748 -165590 -289234 -254892 -192232 -131921 -195676 -281117
26563 -281117 -203540 -30937 122103 20708 -45589 -167135 -233213 -200461 -270412 -137138
26553 -137138 -26226 167695 72980 16272 -90774 -97337 -99524 -238324 -217915 -73058 35821
26542 35821 108784 156330 197233 143555 191627 402168 145726 -133619 -81884 84466 65108
26531 65108 198212 206980 91320 42675 -337122 -332586 -189218 -240636 -37767 307756 305710
26520 305710 183465 148667 164504 329063 347691 289811 115877 300394 372588 354764 195897
26509 195897 88460 -8065 158541 377730 349068 402228 333215 305121 164559 43487
26499 43487 -94580 -58581 14806 -70259 -6360 25456 33140 -51593 -58181 -29707 -102815 -186949
26487 -186949 138590 -28793 -166106 -186587 -68564 269558 423673 322562 392475 295272
26477 295272 454312 502129 199688 224824 -82209 -159717 -135877 101886 299426 242030
26467 242030 93028 -76148 -114435 53271 27218 -101393 69224 102491 221388 166214
26457 166214 109336 99016 25213 57748 36631 -50022 -128926 -44330 -120527 -184230 -179768 -85651
26445 -85651 -172705 -259627 -198526 -27369 69803 198964 51336 -5025 -40509 -54732 -23080
26434 -23080 -36116 -2037 -67363 -136064 14181 145517 -2717 -50333 -180732 -269477 -11985
26423 -11985 22405 -10823 181331 46222 -159777 -59704 -110080 -202099 57304 83470 2882
26412 2882 -77251 -197229 129374 201968 178762 116750 8713 119249 88424 -27562 -296846
26401 -296846 -149903 -192966 -217479 -507643 -460266 -334751 -285406 -246203 -205206 -239671 -86386
26390 -86386 81309 75406 -188833 22636 287579 309096 193811 123822 73389 210791 196364
26379 196364 122970 169647 80613 202512 209747 101760 159407 267643 294626 138255 257262
26368 257262 143529 17979 118831 -21820 -242040 -166866 57020 2572 120644 -103132
26358 -103132 -68394 84141 -162112 -78436 87334 -134753 -226412 -288860 -312774 -334473 -189823
26347 -189823 -54198 -5718 -21044 -352109 -214499 -62853 -14197 -17977 -135336 58247
26337 58247 277804 322088 156668 12833 227432 395558 455796 375770 321544 244600 151893
26326 151893 -22261 -169068 -245154 -170187 109706 342285 593517 460218 256721 -136062
26316 -136062 -141361 -98405 -17626 -8405 -128165 -176684 30968 126233 62671 -140522 -180532
26305 -180532 -93152 -129114 136487 197550 82378 46595 119058 -81873 -471847 -503217 -265314
26294 -265314 -280341 -362401 -339617 -346103 -400957 -304753 -254864 -187065 -112198 -199490 -180839 -322286
26282 -322286 -147614 58575 85252 120423 -20624 -34839 239170 219393 98317 -178562
26272 -178562 -201707 78108 125851 127988 69291 109587 -19404 -77092 -78738 -87634 -171522 73287
26260 73287 182938 -44602 103928 44413 52266 109622 117822 36810 -57998 58482 125660
26249 125660 58638 226778 324674 396230 350019 188516 128887 59682 -122021 -24753 121347
26238 121347 135448 58399 -91308 -76273 -139292 -286251 -254053 -226148 -245822 -165545 61024
26227 61024 107477 121207 -125870 -176376 -44307 -115637 -91800 -123161 -200295 -377556 -308088
26216 -308088 80997 106382 94904 -54981 52948 -29907 -70491 -17761 -168183 -206757 -135107
26205 -135107 -151769 -90207 -43559 -114068 -298456 -431626 -346285 -349299 -187485 -338447 -304814
26194 -304814 -33106 35682 4968 -52849 -77655 -42447 187718 158699 -61218 -44396 87578
26183 87578 -126540 -123092 -130530 -210698 -65014 145603 89156 -57679 -35798 -199171 -144658
26172 -144658 -168028 -160513 35944 -28030 -6060 32041 216838 464729 672373 601073 305265
26161 305265 173512 223537 342450 578567 622606 488316 495850 398855 313427 305127 113627
26150 113627 47103 103159 160602 181750 219965 113105 88317 64812 334006 331581 243224
26139 243224 70005 114757 353195 348441 34284 -15854 244908 -88271 -116851 109415
26129 109415 118538 321098 451853 562412 716964 749455 557114 588076 501312 556757 452913
26118 452913 239110 -4612 166828 237876 215924 266950 232818 293557 76102 -61229
26108 -61229 99329 -86820 -173880 -48834 207614 117349 239805 427022 458273 441905
26098 441905 295668 150164 359004 470328 452770 327198 504122 357740 450042 605603
26088 605603 244454 -24561 1592 150292 -114853 -417301 -371042 -177701 -121495 23702
26078 23702 185204 156542 -129645 -94251 315991 318702 -92047 -253710 -143764 30610
26068 30610 73864 107034 133295 38367 33038 -185281 -317802 -241086 -220720 -70064 48042
26057 48042 -98375 -86572 -141428 -296336 -264512 -74795 -60880 28716 56605 16497 151767
26046 151767 349286 231917 108431 371793 305821 -105798 -137744 -193607 -246391 -368894
26036 -368894 -310928 -77726 18699 -96629 123981 375728 241212 142491 231217 291366
26026 291366 154562 85261 156923 209504 240471 79304 70720 133913 182642 356112 460223
26015 460223 628931 815977 461290 324404 161459 14431 -7161 -28845 -110315 -134720
26005 -134720 -169971 22215 -94366 -272727 -260896 -24409 69952 97603 84553 72402 71498
25994 71498 47828 240921 222168 -57772 -6989 337341 400661 240125 144304 213505 75183
25983 75183 204438 110249 -288789 -96929 122488 132579 90510 85476 -172518 -55446 -156601
25972 -156601 -346393 -408291 -248460 -168594 82401 150597 -38799 -138849 -143651 -171103 -241769
25961 -241769 -88228 -250241 -65555 28153 97059 115960 337742 209329 280970 391991
25951 391991 295184 139946 102943 -144931 -245106 -125365 -243733 -163926 76704 87599
25941 87599 98231 159317 282423 147698 159468 122800 134247 213634 60012 -150596 -354785
25930 -354785 -221461 116761 143504 155634 -5489 45453 90732 100898 146229 264724 402670
25919 402670 262787 146262 242235 306140 386106 451753 451758 206747 -108446 -303441 -367288
25908 -367288 -313307 -224881 -91850 -128919 -214599 -202103 -223847 160631 391487 279644 106715
25897 106715 62259 -11106 -153637 -402462 -296009 9377 95928 -96160 15739 136045
25887 136045 112173 120816 -141814 -332529 -263604 -78946 153681 396847 486584 231912
25877 231912 144019 110903 89268 101825 62265 148936 118782 -16635 -131614 -165012 -173299
25866 -173299 -168493 29413 114803 224826 91324 -98050 -21786 274269 263479 12973
25856 12973 -63883 -38301 -128556 -124341 73122 110856 -120686 -324986 -228845 -217442 -183723
25845 -183723 -18524 -49923 -238950 -38456 -56624 -69414 111292 116285 68847 -71812 -26775
25834 -26775 165664 13954 -333492 -216596 -315024 -125695 -119373 -103360 16345 68968 129619
25823 129619 41164 -291793 -350717 -228592 92385 488609 368033 58957 126952 231256
25813 231256 320181 295205 154016 5557 66062 82531 -129504 -103941 -98867 41720 61286
25802 61286 71245 186635 185643 34518 107286 129109 -60825 -243625 -373377 -264233 -148695
25791 -148695 -256414 -277274 -280215 -82882 -12245 168009 417730 259963 61128 62080 139673
25780 139673 -1153 -47940 157728 328522 138905 -10748 -84021 -10596 133851 116947
25770 116947 34198 197905 192258 -112362 -1874 -61468 -173049 -97641 -238347 -209887 -103197
25759 -103197 98760 -12278 -68706 7644 -72540 -126924 -111499 -137649 78567 221500 283892
25748 283892 141639 17047 150679 205796 174687 -86424 -62019 51364 196541 -15529
25738 -15529 -34497 2178 -118804 -148209 -86225 -84112 -272328 -219624 56556 299368 304084
25727 304084 301266 185294 308805 296943 373369 86952 -148475 -138132 139148 269548
25717 269548 322742 464593 287154 173975 -154355 -159151 82550 56828 -115544 -168556
25707 -168556 -211325 -164337 -158858 -85989 202228 350932 241842 295340 272132 53153 -57501
25696 -57501 31174 119226 80331 43856 -71859 -159388 -188858 -216454 -196025 -209719 -279632
25685 -279632 -368259 -379880 -259297 -121345 -154143 -186153 196352 367608 384564 318451 261368
25674 261368 272715 38132 -57521 -50978 -97623 9060 110328 50690 212843 187756 132874
25663 132874 -105419 60069 152032 -91023 -268684 -381117 -326564 -90066 -101420 54131
25653 54131 240388 181439 132098 164475 94105 88198 -4005 -97101 72106 237925 228593
25642 228593 166277 227759 245874 208616 61155 59137 90932 -69260 -300042 -231554 -11259
25631 -11259 68835 109580 98558 346154 345153 339311 169777 36430 -25466 22205 38268
25620 38268 64648 133385 248130 262217 183372 47121 100994 285156 255986 321629 260000
25609 260000 190266 108699 206297 241409 96953 291657 345021 16272 -178124 -449712
25599 -449712 -457620 -387894 -174040 75081 173068 123332 331774 278300 110549 16068 -81220
25588 -81220 151439 118971 -9299 -65426 -106985 -84792 -239733 -152026 143045 433222 242032
25577 242032 -46203 -109661 -125745 -56645 -59828 -138373 -78492 112983 65187 3898 113633
25566 113633 315026 235009 162285 118378 70352 53089 -63296 61147 263743 125785
25556 125785 -181942 -114092 -15739 -208142 -265876 -333470 -367238 -273806 -268598 -104480 -106977
25545 -106977 -87883 -117787 -349994 -209727 168234 156675 131291 177831 212731 144390 -69772
25534 -69772 -130264 12642 -76477 72153 130126 125863 178243 65549 44351 269120 172813
25523 172813 103425 99816 -84669 -36803 33157 -47909 -139869 10181 44380 -40624 -63681
25512 -63681 -198015 -80186 102355 3005 3772 326308 238794 108 45378 51831 106848
25501 106848 -81593 -192010 -255792 -63393 -361242 -412437 -399196 -467277 -375295 49957
25491 49957 41076 121006 34100 -75138 -105281 -176575 -165914 75938 1753 -155449 -240339
25480 -240339 -289201 -231507 -41573 -34430 29498 -285307 -191578 114537 249510 21033 -192077
25469 -192077 84693 119181 -129974 -265917 -276384 -81087 -21325 121153 196882 -171175
25459 -171175 -175305 -58743 69993 50220 -156130 9176 85169 97599 195730 219517 249038
25448 249038 68315 -32133 -21496 39294 22650 -61246 -229445 -263529 -106849 -5415
25438 -5415 97536 -50946 -218484 -10572 156268 93137 124373 271664 126789 68180
25428 68180 -21131 110133 238019 260976 402434 576492 248313 70692 118868 2374
25418 2374 78340 221537 273158 184721 60309 155044 76794 -77270 110544 331510 51052
25407 51052 -63109 -244211 72762 106239 30849 -33311 -35932 131312 -134749 -230596 -293289
25396 -293289 -169466 -115807 -35508 -14413 110641 121941 144712 247677 169573 90379 290819
25385 290819 454783 330772 361024 455170 330162 7432 -220337 -129472 23510 51189
25375 51189 -98290 54061 175793 14448 -104116 -11910 -92252 -124565 26866 -44157
25365 -44157 52246 255673 273242 339026 84903 95815 226702 358133 330767 99918 132586
25354 132586 56175 -85401 -149291 -237896 -178050 -452904 -430796 -205361 -190565 -236351 -196076
25343 -196076 -103393 -21799 -86005 -80265 22255 39769 -152926 -186231 -103312 -192008 -110893
25332 -110893 -70630 28586 -35201 -60706 30569 -244727 -367819 -127827 138212 194636 -5777
25321 -5777 -141406 -170271 -176182 -141828 -180679 -4395 47162 -71822 -168640 -398846 -335314
25310 -335314 -21734 159155 367259 383885 177733 -68405 -57107 -156493 -147517 -90122 -206416
25299 -206416 -49739 143562 159786 266249 286649 353586 608445 649356 474909 227413
25289 227413 179040 -62828 -272859 -117032 86347 225448 182601 -53789 -106289 63989
25279 63989 -49627 -275081 -201493 -216742 -99940 116719 228579 219300 105382 196125 357179
25268 357179 388739 480505 65981 -91113 309918 242404 50763 64013 81167 -116032
25258 -116032 -173762 72961 -27031 -604 63840 119984 159253 -66579 -420705 -267226 -102874
25247 -102874 -2312 110877 179877 76236 -121174 -316917 -123111 164636 128100 46290
25237 46290 -21480 -30710 -166217 -448475 -550132 -413134 -157490 105153 61721 12575 -114341
25226 -114341 -258792 -109561 47180 152680 132961 85557 -6704 114220 437023 237858
25216 237858 80033 -79928 -137055 -158923 -123338 -209370 -319648 -328620 -217715 -186404 -46332
25205 -46332 -11555 -59701 83284 45364 -23531 77328 -59202 -90509 34967 233672 160210
25194 160210 153164 164774 15873 55460 179064 176906 -28335 -55594 -68592 39545 249171
25183 249171 229152 132069 -30035 -68114 -45290 -294706 -323303 -181198 -150823 -171432 205955
25172 205955 224386 38772 -19607 -16636 29863 168852 211873 60557 118090 111088 60700
25161 60700 8814 -92727 -147125 -335335 -533897 -515141 -548746 -488365 -296001 -238807 -371653
25150 -371653 -218589 91794 183787 49891 -1485 -224504 -263107 -94330 126210 185854
25140 185854 189841 104225 89173 -82301 -151562 -55044 -80213 -195643 72926 263815 174021
25129 174021 276912 331002 298539 355758 329208 415944 601375 552383 285707 -13162 -157183
25118 -157183 -340838 -232746 -185738 128490 521379 411171 189939 231867 365046 153876
25108 153876 -50330 -27264 -121168 176451 257076 25030 -252100 -266851 -108680 -175998
25098 -175998 -84891 -39169 -151081 -21735 -10378 -61703 -12376 48316 13951 65135 105610
25087 105610 82747 -150784 -256265 -30249 177446 26407 -179754 -139478 -12085 -163108
25077 -163108 -43210 -55772 -156743 -11620 109473 148174 87315 -166121 -202185 -342590
25067 -342590 -192277 -119938 -2090 261 -2478 -68555 -98643 -230486 -150862 -75409 41261
25056 41261 60427 126626 385769 220087 -100014 -184074 -166903 33375 -94930 -106225 3759
25045 3759 485632 667441 470185 376536 292556 95417 62699 761 -77659 -89306 -245932
25034 -245932 -245578 -309575 -231328 184528 383094 293024 178740 -32888 -72886 44512 -29918
25023 -29918 -133974 -61363 17288 2777 -149965 -144524 145271 234468 -23351 -76511 31858
25012 31858 88718 210045 125096 -51162 52342 153310 69906 -109860 40114 211257
25002 211257 334181 273936 139358 67398 -69560 -22390 91492 32166 -200214 -204307 -191398
24991 -191398 -173762 -154631 -263827 -447794 -343684 -235022 -226333 -33953 -12370 -83518 -30023
24980 -30023 17745 -26172 -114552 -343974 -273273 97536 372380 584406 174048 -166443
24970 -166443 -209165 -200500 72937 -119487 -267772 -389868 -195225 120692 242787 105233
24960 105233 128862 406032 247060 43967 -61734 -257928 -199977 -39990 67137 193543
24950 193543 127333 -102556 -244152 -105099 117548 25255 107518 210350 59770 -9155
24940 -9155 119371 -19400 -132895 -211252 -145527 -74146 80647 270449 373564 167109
24930 167109 158960 57671 -121716 -64114 -244775 -202107 -80996 -6813 43988 103104 -50056
24919 -50056 10394 -81957 -187485 -305363 -372230 -458450 -580741 -527067 -665288 -570738 -252599
24908 -252599 -321883 -164403 -354619 -420999 -425964 -472854 -611163 -490876 -234579 -257677 7615
24897 7615 -52217 -136437 56445 285616 464488 434268 125505 183842 -63540 -129088 -203554
24886 -203554 -206314 -250063 -190230 -73872 -149317 -260695 -145309 -117378 -270285 -128865 199795
24875 199795 115102 -148320 -264622 -190744 85422 112699 60770 213298 316901 341194
24865 341194 304773 278187 58546 -13395 -142730 -345829 -227320 169642 296447 170695
24855 170695 -138731 -54999 20611 18384 222408 127817 70337 -55551 -233125 -282310 -233903
24844 -233903 36465 115605 90977 -50681 -60441 -18522 60424 238493 147581 -176346 -134204
24833 -134204 -197194 -33303 -76678 -301475 -552835 -398909 -234391 -315800 -215765 -253187
24823 -253187 -308894 10532 149032 335669 275141 116112 34229 101550 -91213 -323379
24813 -323379 -607542 -535652 -190534 24762 164326 157484 -142115 -31785 -6691 94378
24803 94378 209834 223564 85815 6552 85878 245513 267235 53774 -136143 -288927
24793 -288927 -166696 84619 202834 410478 451662 474089 316092 37079 -260209 -309384
24783 -309384 -175358 -87811 43171 -11098 -255333 -253761 -179374 -164266 -121223 -60227 -149067
24772 -149067 -218239 -59886 110590 27534 -137430 -239029 -222554 -35393 14473 -93949
24762 -93949 59584 89728 23016 -275598 -133830 117374 124836 147202 265304 134843 62829
24751 62829 -1159 13915 112618 288406 276823 251767 301690 188002 139622 194393 234218
24740 234218 182376 93637 163000 -75700 -19177 187858 259223 22146 -45569 169730 190384
24729 190384 161449 177096 -31407 150007 462187 584770 323509 204815 222677 64914
24719 64914 125259 72975 -114825 -91461 -15104 149014 230551 150702 277442 72616 -66700
24708 -66700 -29476 92027 38049 -84129 -255736 -112749 -39078 159794 214599 8068
24698 8068 -75475 -86247 45215 131651 6427 -99959 47380 132797 134416 88034 5369
24687 5369 -321000 -266447 -144989 -68825 65067 123637 38409 152816 196798 105715 7249
24676 7249 -160504 -178637 -176622 -83310 85545 32994 22437 77593 140024 208881 377955
24665 377955 206730 438304 476411 265669 111011 -231567 -257534 -128109 -195139 -185579
24655 -185579 -8759 64394 242030 88741 -141049 -30672 227413 349108 331096 65804
24645 65804 -368685 -463569 -486743 -658346 -528295 -265675 -109470 -12092 -27894 15188 241729
24634 241729 526220 636516 564555 383171 298236 334740 104986 -20160 15840 -119194
24624 -119194 -134619 55206 128574 219514 145139 194928 143092 122024 70724 -98495 -23041
24613 -23041 454846 592364 423512 304325 70114 45952 155673 167773 -216937 -313255
24603 -313255 -517326 -456779 -144114 -170570 -257160 -221692 -304175 -268755 -318607 -322586 -434103
24592 -434103 -544664 -404225 -282145 -334157 -133540 20691 197545 338489 249793 276035
24582 276035 244652 368462 271660 108162 68730 -1122 41962 10808 33009 -77117 -3068
24571 -3068 198889 12108 -290907 -367846 -194152 108361 222574 233996 239405 150037 -128016
24560 -128016 -109929 17059 -95966 157 -37086 12425 56360 207888 276939 138861 114066
24549 114066 -56901 -71062 92677 252874 190170 145603 171836 196341 248198 -56993 -213104
24538 -213104 -35511 -142716 -112082 -213135 -320318 -214489 109918 207407 45776 106228
24528 106228 -37988 -55558 140529 233062 131139 65869 217488 410361 364574 154986
24518 154986 63736 80263 -131530 -44343 22949 269313 293070 145202 41609 -15788 47591
24507 47591 28229 134873 102622 63216 67829 19517 -338132 -609254 -497198 -294691 -145425
24496 -145425 11081 -120743 -253469 -134350 -135835 -245673 -245670 -125304 -164593 -361969 -329730
24485 -329730 -329028 -212686 210568 176389 -30948 -364025 -578073 -494123 -502967 -513007 -402592
24474 -402592 -313970 -359097 -248455 -84606 74207 -152480 -164812 -8451 -164950 -379343
24464 -379343 -270707 -76607 -102397 -116901 -54817 -32124 -316478 -263218 10319 -150802
24454 -150802 -162282 -161645 49698 170089 81519 -192687 -199363 -206477 -248220 -232777 -157314 -182651
24442 -182651 5529 11923 176220 28373 -75580 -12285 74038 -142592 -43326 84369
24432 84369 51642 119961 298019 467637 461173 123334 -186775 -135504 -153924 -39684 46424
24421 46424 -85263 -222144 -166824 73787 26345 -335633 -334435 -142282 -146629 -256367 25258
24410 25258 70806 46130 93340 109706 127258 147177 48962 -33638 -213541 132104 151098
24399 151098 -129514 -172536 -161876 -40396 40449 -76464 -230191 -127964 -187545 -95801
24389 -95801 -34133 -36591 -68400 -64392 -102580 -153188 -107564 -23382 -5900 -99909 145549 169041
24377 169041 -97781 -202922 -212411 -255969 -236770 -273448 -271840 -180161 -160700 -78719 226542
24366 226542 145061 -788 -71262 -131345 -115410 -168462 -195408 -137417 -24209 -146329 -185949
24355 -185949 -53562 11371 -116602 -292186 -255306 -113904 -16314 137621 106709 53903
24345 53903 -147422 -190036 -317761 -418436 -480660 -460187 -113241 42693 51550 -38743 -60719
24334 -60719 168011 184815 34154 -272867 -418742 -271384 -239437 -1611 68480 121249
24324 121249 244317 283358 186453 -62317 -237523 -156714 -152709 11991 64897 -99554 -50839
24313 -50839 132905 133562 123284 -168123 -507162 -381132 -135922 9442 105209 -20224 -276530
24302 -276530 -303549 -212315 26519 -201804 -395763 -382948 -331963 -418616 -355203 -17836 69530
24291 69530 105681 98448 176088 114644 175816 31883 17343 199677 462057 456895 253078
24280 253078 64235 104190 -187784 -267015 -324331 -358237 -291173 -1246 286395 386501
24270 386501 308912 -75740 21145 261840 164832 159958 275586 164678 113845 55693 36762
24259 36762 90968 82419 305210 236156 148236 56608 -8997 -33313 -26370 -199564 -43966
24248 -43966 -39981 -133469 -88155 -167468 -251838 -338810 -400743 -273177 -327491 -120970 187879
24237 187879 370677 241298 165744 -59043 -167494 -136865 -24702 283183 262459 3140
24227 3140 -128070 -219703 -406222 -248952 -224042 -58988 -91690 127440 169688 -80044 -211657
24216 -211657 -259353 -346519 -208806 -355222 -450104 -333703 -203145 -94297 91083 -73497
24206 -73497 -194254 -231098 -273902 -114772 -79502 75426 185671 101040 47278 -59889 -147557
24195 -147557 -422469 -467383 -325860 -251590 -37028 -50386 58423 230780 224625 44837
24185 44837 71475 101501 -168479 -357062 -332223 -174667 -45288 163811 139024 -53545
24175 -53545 -14812 150068 222097 38171 -219693 -281904 -210207 -375579 -409778 -32915 131305
24164 131305 146412 -83440 -325114 11632 95120 128641 -30205 -28013 -175750 -279202
24154 -279202 -171271 -39005 -3862 34143 39527 -143023 -123121 57078 44112 86281 -140329
24143 -140329 -198992 -330277 -336023 -165908 -26536 6537 -162406 -53249 204535 192873
24133 192873 114020 80358 139366 195055 148938 51790 -68724 153589 278179 172459 189692
24122 189692 117793 -46611 -155611 -224124 -305267 -316886 49640 87508 102218 163983 -52302
24111 -52302 -320468 -296804 -233472 -183745 38107 115882 -69744 -26845 -165134 -539936 -614195
24100 -614195 -398691 -295618 -164854 49352 73149 -77294 42141 53937 -15319 10644
24090 10644 -98968 1612 54559 -48114 -1545 -67600 -36790 -129337 -88560 -94331 -239081
24079 -239081 -1539 365418 539401 558454 312743 217912 235001 226271 137391 97986 109091
24068 109091 152054 49661 157414 338728 73737 106726 125946 94269 54271 327280
24058 327280 392190 260347 194109 131698 18877 -16831 50806 -183315 -141633 238333 224934
24047 224934 232016 277426 155777 123519 -50544 88465 99812 124642 148483 173751 -2480
24036 -2480 -124738 19947 242863 345422 130351 -90151 -63798 -300278 -463106 -329148
24026 -329148 -59504 188888 192220 179453 297611 328854 120660 -250235 -235709 -99808
24016 -99808 -46296 -300651 -254692 -148421 -191234 -196880 -167025 -232703 -93213 -196450 -259143
24005 -259143 -255509 -400015 -424442 -87096 -36223 -53968 -187410 -187230 -145014 -28979 81742
23994 81742 -76178 84354 283268 21807 -19437 266464 338616 172252 204179 152315
23984 152315 79469 -30159 -217588 -172803 -280479 -223805 -19328 286436 191785 90289
23974 90289 -24405 -29852 -74716 -235894 -265063 -181805 -105073 -154383 -28145 101896 187988
23963 187988 -119133 -369278 -354312 -141980 228594 199870 -172231 -195840 -302531 -285861
23953 -285861 -67024 -27097 -256281 -200319 -340439 -175465 -186660 -258458 -179148 -100699 134361
23942 134361 243379 2008 -162145 -139915 68610 269054 411330 256833 189125 265278
23932 265278 342019 268514 202628 116550 -26271 3852 79793 110188 107399 -6887 -47053
23921 -47053 78464 43682 84174 84414 102794 122878 52274 95668 45118 -46353 -71260 -32540
23909 -32540 -43208 -252909 -206695 -143385 -346587 -394252 -329990 -333617 -354709 -343878 -215301
23898 -215301 18393 109152 93867 99026 18172 124594 176063 239802 389349 363456 135903
23887 135903 169131 255812 215026 251400 140270 65166 -7176 -336734 -362662 -391071 -266916
23876 -266916 -124894 -160927 -210438 -192647 -226122 -151835 18636 -55213 -122700 -86072 49465
23865 49465 -116512 -451403 -633923 -435775 -376078 -422973 -304202 -298715 -126095 -346376
23855 -346376 -536456 -297921 -181988 -184025 -206315 -276610 -77926 -90593 -108146 -101925 84925
23844 84925 289883 217309 159664 129835 125761 330891 271685 168799 206860 181871 201816
23833 201816 122844 44885 105136 138034 227526 271051 273345 88314 115639 101009 -127662
23822 -127662 -232972 -217385 -214111 -195746 -202029 -237452 -202243 -200486 -119462 -119472 -88398 -185124
23810 -185124 -225557 -224580 -258069 -4131 79438 114283 88823 21865 182697 251015 131957
23799 131957 179163 -134615 -202263 -23987 94005 265245 411047 441292 348563 172022
23789 172022 202792 169342 255284 248325 112240 190625 448860 445137 259666 267449 375761
23778 375761 358375 468839 494792 155942 168713 314604 263628 179538 87105 193857 39480
23767 39480 128769 162633 195417 180329 176846 214170 109932 181853 190045 179326 357701 155777
23755 155777 -160267 -129240 -21412 -61882 157958 359936 233270 273040 94025 -135558
23745 -135558 -154306 -7241 -151782 -153436 121091 182939 309316 533590 605550 594137 560216
23734 560216 499231 278205 435696 544868 496479 267405 234911 170973 -18208 -39582
23724 -39582 -271690 -129912 -14490 -217479 -251830 -37827 179308 289384 207699 186981
23714 186981 283196 214107 131867 111480 67617 194291 402716 234939 136931 -53917 -326210
23703 -326210 -234657 128628 175925 -47137 -224264 -134767 -39466 79189 167294 61085
23693 61085 -5684 11111 217043 417661 428033 242577 -33690 -255592 -179476 -227135 -357986
23682 -357986 -382505 -293274 -102867 30399 20184 194485 198365 190907 -136219 -209300 11211
23671 11211 69988 91427 -29939 -326315 -454255 -513050 -552488 -278782 49096 -261732
23661 -261732 -530666 -350211 29415 190432 247753 139110 -4482 -122573 -53979 -129988
23651 -129988 -187409 -437236 -206448 109647 67357 -15130 72187 132106 67804 94120 399640
23640 399640 397827 324529 24154 -244860 -308350 -449607 -467661 -504592 -285623 25770 271839
23629 271839 161990 140478 174003 -28653 -153378 -233622 -32958 -94975 -73373 -344058
23619 -344058 -380995 -208177 57309 132802 -50220 -21597 -126683 -285267 -151558 4753
23609 4753 157841 119740 80259 -204207 -445698 -312839 -309627 -305938 -167687 11569 29146
23598 29146 -78511 -95967 -125718 -272495 -352715 -285175 -12896 101683 -92927 -207761
23588 -207761 -167689 -1796 75380 -42949 -23834 -8382 -99702 -327008 -300425 -476223 -310012
23577 -310012 -28074 -61122 -104482 -96031 -122244 -197676 -295529 -333934 27938 97196 105321
23566 105321 48853 -159364 -182058 -237664 -185680 -247918 -350910 -490862 -550009 -495923 -469247
23555 -469247 -312444 -59469 -217537 -237455 -322913 -83757 86438 230340 -24908 -271160
23545 -271160 -435892 -394936 -235888 126661 242131 80768 148666 115554 -31584 -127290
23535 -127290 -52551 -127265 -69566 48155 59294 127437 126320 -11233 -154647 -50707 212668
23524 212668 333538 137354 -171068 -381167 -403411 -104718 -110188 -142920 -106863 -20347 -32842
23513 -32842 -23096 -15296 -30048 97872 91654 271652 354999 195725 204896 159585 -6458 -101983
23501 -101983 55144 -84221 -127511 -109970 -185807 18570 13553 -50936 -242800 -352424 -143436
23490 -143436 -182990 -106545 -106567 38407 246924 276340 259093 217753 93665 -178261 -87007
23479 -87007 -159582 -135036 -12932 94078 90611 32535 155093 344208 334437 173348 108683
23468 108683 -161909 -371299 -469051 -556132 -454716 -429351 -472054 -305718 -293810 -325974 -213754
23457 -213754 -138797 -21541 94535 207737 304590 346747 252470 -165007 -324103 -100675
23447 -100675 -102708 -143292 -54036 179065 131109 -194373 -300854 -312625 -192099 46642 -155365
23436 -155365 -73184 32955 122824 47832 -122384 -302332 -86285 28924 183694 -3193
23426 -3193 -333652 -488223 -531222 -326449 -285531 -46550 146757 129711 299108 195395
23416 195395 99910 38168 -34209 -78451 -81388 30587 -99965 -17488 149711 117363 158634
23405 158634 106911 18389 80421 237908 408504 241120 323050 188179 189637 153424 187953
23394 187953 175445 128688 429869 289801 131388 137857 39895 -100380 -289471 -111087
23384 -111087 5712 -85594 -117914 -144835 -163721 -46421 -107327 2746 97179 274526 421827
23373 421827 320636 222475 146079 210439 168838 -10626 -104751 -142885 -154392 -122848 197043
23362 197043 185858 -122676 -232477 -197898 -535939 -586111 -471575 -275453 -166017 -218646
23352 -218646 -134129 -80498 -200635 -160330 -31117 -151294 -239675 -202863 -328871 -285369 -210982
23341 -210982 -158242 -110311 -240451 -178896 -343182 -175976 -256160 -350218 -257702 -303212 -345354
23330 -345354 -65320 149739 57817 -17586 125432 167886 316350 150821 -50748 -108762
23320 -108762 47019 12424 41617 43814 44296 -28751 -4478 183614 311053 336146 404615
23309 404615 578553 489069 164243 111174 70954 -85350 -216773 -156105 17046 128012
23299 128012 276452 328245 396449 33590 -144002 -112755 102620 163135 97956 -59732
23289 -59732 92178 243189 12001 -214067 -350260 -281111 -95281 62149 74028 258628
23279 258628 223496 21795 -187954 -16577 272149 419221 472983 315250 259301 5653
23269 5653 -184566 -247525 -9385 111751 269647 -51525 -130183 21728 59816 241912
23259 241912 395378 516528 443627 263975 6444 -108623 7692 -6431 -233290 -380155
23249 -380155 -320265 -299356 -451601 -452381 -157218 -136084 -155099 -76917 -195670 -271332 -375049
23238 -375049 -188988 -40464 -11600 -24728 -167974 -135884 -172255 -80326 -62995 -58535 -81491
23227 -81491 -102300 -72534 2946 55075 85685 -3645 -159152 -269629 -363663 -417253 -353172
23216 -353172 -324001 -291941 -212546 -474990 -412489 -169865 2458 91240 22420 -168410 -225506
23205 -225506 -207052 -281768 -303535 -146497 -7190 -10542 -2581 -54980 -69094 -276 87804
23194 87804 28298 41540 62027 -2145 51200 348573 509602 329508 148614 67239 216475
23183 216475 186467 85114 394871 403910 477730 279602 28506 360290 399645 290718
23173 290718 163564 -11184 -68659 -199373 -293565 -86423 18684 -21098 -151828 -217802
23163 -217802 -351138 -390387 -230399 -58149 -64590 -88827 -12661 -108710 -270801 -149732 93846
23152 93846 190123 130948 60235 29199 -19096 -99742 -104923 -148657 -78766 -90030 20194 -128083
23140 -128083 -143501 -175247 -162994 -328032 -252595 -190098 -281592 -315052 -302104 -234396 -175196
23129 -175196 71970 240007 347490 200800 131471 77605 17534 14014 43122 -122829 -139987
23118 -139987 129134 99217 41008 51795 106900 153751 149904 36544 58232 124784 55866
23107 55866 -78352 -111676 -34908 21273 -25250 -40832 -127442 -52022 -61753 -166960 -327318
23096 -327318 -177955 21206 142322 42756 -82413 933 60085 -43008 59812 -114575
23086 -114575 -95927 -6008 -41257 -135334 -45758 -15424 -68372 187291 158925 296410 385937
23075 385937 416464 190956 281131 182446 -85141 -205959 -90350 -242409 -280475 -279387 -254351
23064 -254351 -257144 -59193 -88665 -12982 -139182 -66045 303118 312893 -67187 -86190 64440
23053 64440 90177 -169308 -279205 -209637 -181060 -215275 -256638 -8552 -18537 -34486 645
23042 645 49059 -75014 -255982 -153440 242960 200612 137519 133880 27947 -85866 -127426
23031 -127426 -221265 -265789 -297196 -418748 -300892 -191205 -124407 -169639 -153403 245779 337304
23020 337304 329690 138015 110456 128237 7818 -22830 69675 -64940 -161970 39071 180060
23009 180060 10368 -97551 -383922 -541384 -351799 -220166 -54148 -124042 -133388 -32543
22999 -32543 -64318 -263116 -252391 -44571 -137507 -44298 209168 151757 148598 133182 -34041
22988 -34041 -63051 -20245 -60983 -233678 -190070 -38216 182103 214290 323305 482375 330390
22977 330390 118071 -19164 -285309 -515601 -474298 -265357 -190654 -275327 -274451 -249106 -248299
22966 -248299 -229986 -323525 -375625 -177237 100596 304904 117894 28215 -162044 -161964 -94074
22955 -94074 49244 79983 -89964 -199106 -241793 -427680 -338970 -149860 -119871 -194095 -224326
22944 -224326 -332855 -345237 -132712 -40089 -239 350017 318582 -34024 -271866 -230335
22934 -230335 -151476 -37121 -44679 4681 -91722 -296151 -448288 -374869 -349227 -118261 42270
22923 42270 -40246 -54344 53131 -59379 154642 142799 105072 88306 83282 -47128 -356485
22912 -356485 -329945 -123314 61928 -147757 -196818 -223369 -82695 216475 372322 202904
22902 202904 237984 247345 273485 219952 222077 377591 368269 175597 43601 376341 597350
22891 597350 309629 300826 498479 431603 331297 172871 117644 116297 -203505 -554751 -609287
22880 -609287 -490946 -173769 -41016 68931 117317 -137632 -218492 -134737 -387627 -340738
22870 -340738 -202591 156038 326447 425591 382921 397167 282264 182669 262453 132541
22860 132541 213207 287495 200866 85327 195877 -27752 59890 -10465 -346451 -554502
22850 -554502 -461695 -349203 -221429 -161839 -225993 -197961 -176573 -121331 -184227 -66822 224608
22839 224608 459806 673421 593609 278444 -51412 -218992 83614 229945 294159 61800
22829 61800 -67732 -66286 51625 58214 145965 -116437 -390497 -517507 -356355 -127137 -58841
22818 -58841 95246 147386 221165 39999 -353355 -578661 -386553 -165980 89956 93945
22808 93945 -6388 -258715 -580567 -459010 -179112 -73094 66778 212140 97551 78628
22798 78628 -74764 -188316 -137606 -188853 -105666 31120 -130594 -295298 -109575 -59404
22788 -59404 53487 75595 -26276 20788 234796 -40882 -317171 -283957 -70549 -79838 121148
22777 121148 146860 8659 -98558 -123626 -84293 103971 163383 178493 -47532 -103621 -278043
22766 -278043 -321216 -239518 18789 290156 112477 -18540 -83840 -101051 26065 137194
22756 137194 -45624 -186341 -379435 -527282 -357718 -181300 -34823 43874 -6439 14715
22746 14715 154832 230777 173441 -65558 -141866 -186938 -253330 -176748 -78061 9409 -95247
22735 -95247 -68139 -72025 -116679 31126 179 74472 58326 -52887 149582 78603 -111059
22724 -111059 -252122 -228416 -570676 -768247 -549606 -380755 -169457 -9450 121874 7883
22714 7883 -40673 152170 142745 135823 117387 41022 -159625 -95657 -158412 -372084 -409800 -264878
22702 -264878 192075 250129 56734 -173899 -200389 -208474 -280040 -66271 269834 319522 123125
22691 123125 -116718 -97870 -159716 -320675 -96683 107220 71905 -25852 -348884 -377942
22681 -377942 -314659 -468206 -441669 -214397 -103359 -230292 -257639 -472393 -446231 -331267
22671 -331267 -78367 -78913 129814 113509 -41990 -328992 -430669 -512977 -214920 -10848
22661 -10848 134133 303749 352591 161355 -108851 -239499 -369514 -189037 -147822 -192331
22651 -192331 -151043 -172613 -162656 22132 23606 170866 141551 196511 210672 73898 -8535
22640 -8535 45644 33305 -116755 -182377 -314381 -220555 -58946 15811 -82880 -63330 -56950
22629 -56950 -296372 -192696 -17213 -76569 -69558 -197757 -143165 -34910 -59077 140678 278067
22618 278067 182909 288694 318353 237362 107411 -80223 -171933 -10095 167246 31923
22608 31923 -113242 -67393 -37325 16117 50036 172497 254355 290314 226526 38971 -145318
22597 -145318 -194140 -357289 -162668 64340 -4271 -185006 -342082 -287634 -308082 -221231
22587 -221231 -321270 -206990 155031 173130 61500 -69276 -135020 -30762 -79866 -10405
22577 -10405 11696 -11030 13687 -19549 7838 246786 37900 -165792 -312041 -160238 -38730
22566 -38730 -233374 -209315 -236815 -55375 86240 -38999 -208530 -213642 -151896 -249841 -281475
22555 -281475 81473 156427 158300 274740 531727 600157 609080 527015 214902 -26865 -217212
22544 -217212 -200270 101455 391754 307914 126347 -26379 -332153 -389309 -257476 -105022
22534 -105022 -256388 -158650 -247975 -164109 -132763 -268207 -323683 -553828 -402328 -244736
22524 -244736 -205757 -70837 -10346 -79154 -47479 -200151 -316981 -397727 -278582 -167425
22514 -167425 -198362 95474 293280 -56125 -217724 -357715 -518659 -533892 -313432 -133480
22504 -133480 -86683 -124120 4503 -112943 -75451 15219 -80398 -151594 -233254 -37482 255325
22493 255325 173071 64415 112785 200497 210919 187899 -46314 -62954 -15776 -220390 -213510
22482 -213510 -259991 -500124 -318552 -98920 118333 -107323 -274393 -307427 -321184 -352778
22472 -352778 -65449 33558 -101948 -146279 98578 111513 -152517 -164329 -121754 -386547
22462 -386547 -482561 -524855 -480990 -293537 -150720 -178410 -183667 -72679 -153973 -54709 -25532
22451 -25532 3357 99430 266329 372473 306473 279612 64881 -176029 -159505 60622 114657
22440 114657 35207 30890 23702 50260 130617 175976 -94982 -169243 -307657 -289209 -31788
22429 -31788 66102 189538 252802 204428 68386 -30502 -48896 -151557 -56395 -70584 -120807
22418 -120807 76289 190558 39693 63593 18560 -140540 -218058 -191797 -256148 -328135 -205706
22407 -205706 -227292 -213746 -44684 9524 -3204 35615 148903 272559 175346 339264 391076
22396 391076 97491 -40592 14960 -20441 -192395 -106345 366871 474279 422989 297424
22386 297424 184564 299413 326602 213269 111745 168589 228397 56137 22604 128932
22376 128932 -14310 -326428 -429892 -194483 1356 -55881 -78870 11829 -29223 -42901
22366 -42901 -122763 -82313 28932 -47968 -140933 87289 -2961 -65046 -183112 -9630 105442
22355 105442 124372 54757 -77510 -189974 -122246 -185458 -254364 -176934 49341 -50751 -276707
22344 -276707 -261919 -41840 -51230 12162 82002 164230 101729 34850 97295 232678 85544
22333 85544 -160321 -338351 -160929 -37585 -62807 39798 113865 84027 53716 121658 121287
22322 121287 274933 96110 180670 271501 251987 209665 110903 -98843 -149308 61800 -19610
22311 -19610 -113401 -63711 -51458 -31181 -169855 -186476 -276876 -227535 -220508 -207495 -196692 -369687
22299 -369687 -474588 -417512 -174523 90333 48644 -105383 -209043 -224363 -218013 -176930 -155061
22288 -155061 174252 283251 249054 295661 308129 107658 -90745 91341 355686 215854
22278 215854 85112 104723 14836 -69780 -26332 75348 -31925 -305733 -170461 -246625
22268 -246625 -195413 -229881 -321591 -163148 -57723 -107945 23259 -155270 -342749 -213502
22258 -213502 -45352 -87782 2633 -125915 127032 153860 171033 20676 -25326 44355 115109
22247 115109 56044 -77607 -39378 -182197 -219425 52394 130777 145052 166891 19790 -117068
22236 -117068 -232966 -406816 -364386 -254630 -80827 -110301 -215053 -118525 -276546 -162664
22226 -162664 67069 163497 -48641 -439569 -450758 -197005 192341 282817 40777 -333999
22216 -333999 -275488 -14523 -47243 -266606 -227781 -85232 13586 -2371 -62510 -92178 124838
22205 124838 225596 133056 199707 183438 136885 208727 26214 23571 -88060 -159452 -330572
22194 -330572 -275859 -130762 -26675 -19498 -74088 23711 191998 38317 -168114 -340504
22184 -340504 -188027 -35325 67526 242816 303863 84154 -72873 7786 215795 317834
22174 317834 207977 97087 70674 248590 270928 92212 44247 87514 177431 280071
22164 280071 344742 343725 271348 228814 60038 -21363 -33071 -81870 -98155 -354069 -476002
22153 -476002 -318128 -192923 -90364 -132090 19798 -91197 -154134 -50543 198573 217125
22143 217125 147864 -54946 -155890 -241911 -349454 -299514 -303923 -208795 -228502 -205852 -349497
22132 -349497 -520297 -678171 -467999 -301617 -371478 -305895 -197231 -202768 -144822 -60980 -83375
22121 -83375 -220284 -88626 -228648 -251299 -94354 145807 218331 57822 -162039 -195311
22111 -195311 148701 278607 42975 -258 15447 -36468 64797 -131891 -251226 -27992
22101 -27992 -33948 77604 80538 13337 -34330 65953 -129684 -357350 -228885 -131631 -143191
22090 -143191 40490 44445 71698 79529 23872 23177 -164019 -94431 92032 -68079 -54611
22079 -54611 -269768 -241009 -113308 309515 415531 325013 261793 324514 299248 -160403 -443262
22068 -443262 -544253 -366102 -326892 -117371 143212 292668 252902 197099 91189 60744
22058 60744 -164580 -370461 -305843 -142146 -25167 3979 -85784 27974 433158 379566
22048 379566 188877 305468 222356 -122733 -174455 -135156 -239464 -246887 -309092 -293339 -50145
22037 -50145 -109969 28331 211162 99674 104537 33549 -234800 -399660 -135071 -39264 -32597
22026 -32597 -147003 -87220 -161521 -200702 76299 303476 274570 359709 282753 50125 218274
22015 218274 169435 33302 7432 83089 63512 227489 155072 25732 38013 -42582 58249
22004 58249 117025 62850 -32109 -27961 -81602 -56468 -138513 -157575 -69853 -63114 110514 14344
21992 14344 9926 -276829 -415485 -127315 -40779 33020 -120908 -58112 141796 198059 23074
21981 23074 -114121 -91605 -205743 -154957 -304021 -411977 -177344 -189656 -366108 -239355
21971 -239355 -380174 -523753 -482130 -600798 -595347 -653165 -510412 -418365 -394247 -340101 -161562
21960 -161562 -17633 55145 40073 78577 74751 -31256 -20132 -143056 -79539 208115 354607
21949 354607 162481 27958 -46948 -61394 -84430 -70444 -243647 -77068 -31010 -35887 73303
21938 73303 306720 520232 285539 247171 385859 335250 173525 258172 416981 349568
21928 349568 256632 174862 116772 78747 217701 341215 187804 74232 52745 186913
21918 186913 141969 43135 -38475 129647 370941 378535 237245 243731 138212 81004 12149
21907 12149 -129139 -302532 -147731 -79187 -141482 -27859 137583 264481 449315 315762
21897 315762 152178 2190 182740 343069 162871 112533 40756 66624 87634 109432
21887 109432 36066 -103010 -206306 -315147 -400171 -435317 -166004 -9753 159813 201169
21877 201169 72572 48439 -26002 41922 83682 35334 -933 135212 205585 221822 397404
21866 397404 449575 80067 48588 235328 205343 68078 -241478 -276677 -193092 -55763
21856 -55763 64801 181158 153610 -5973 -141482 -112249 5342 50569 75765 118817 -80878
21845 -80878 -4993 140415 54763 -203400 -81112 275080 223201 44551 111659 80995 -22503
21834 -22503 18266 163991 148912 187531 94815 13425 -97002 -33889 -34682 63716 245653
21823 245653 100638 -31650 155558 272250 258161 245234 379841 315748 184377 -5308
21813 -5308 7087 -39998 -248160 -291796 -99205 35877 -9885 45363 25426 3091 -26682
21802 -26682 -105023 -25658 86120 50234 210815 301539 266234 315101 314177 165074 -278559
21791 -278559 -530780 -532128 -443934 -186093 -15089 -2522 -130113 147995 118108 -132784
21781 -132784 -196226 -114332 -38869 -123611 88494 139769 354955 601269 455792 294953
21771 294953 316818 227045 101494 169571 336571 312436 5662 -43592 -193180 -209529 -193109
21760 -193109 -232705 -157598 -272847 -447741 -450879 -476023 -524829 -299536 -259658 -218838 -269044
21749 -269044 -347211 -298168 -359300 -254212 30029 -2801 -257195 -366376 -296537 -307537 -231195
21738 -231195 -197461 -248285 9984 127152 219881 303350 352579 219248 180009 110010 313962
21727 313962 167211 62560 -54288 -106485 -321897 -267552 -384428 -532800 -448546 -380440
21717 -380440 -273355 -200532 15659 214859 -11237 280769 460297 364930 412930 410150
21707 410150 414799 362401 374448 466641 255343 81414 389013 316607 151268 279404 154917
21696 154917 -168371 -124605 51125 -27060 -92569 -95990 -99225 -213766 -317428 -143451 98498
21685 98498 151865 97430 45182 -103845 69215 -206007 -271738 -143689 58854 148966 138810
21674 138810 201798 103417 15230 61526 16988 -132565 -189954 -299899 -469577 -648924 -548356
21663 -548356 -400644 -300864 -277488 -169445 -149016 216953 221712 -8842 -106653 71681 37391
21652 37391 33270 61008 -78215 27364 184749 145258 294650 317846 180024 -192146 -81506
21641 -81506 -83185 -256369 -225671 -192209 -181221 -29518 -202262 -139742 169945 228597 369992
21630 369992 413927 190236 10144 53831 110549 -67236 -314722 -303894 -265690 -175228 -188348
21619 -188348 -144911 29890 564 -132438 -175840 -185467 -440289 -354676 314 108844 -113059
21608 -113059 -88435 102808 -28305 -139758 41321 106545 148787 201174 143902 -88558
21598 -88558 57060 205440 12148 -153753 112150 8901 -111033 167567 260089 178529
21588 178529 226761 120941 -51985 -104860 12401 129178 143319 -53354 139858 258341
21578 258341 47196 105070 159900 151763 156988 175043 214063 7471 36656 -29855 -78293
21567 -78293 -61794 -121128 -168686 -9955 121405 157980 269260 -23198 125208 121965 -108712
21556 -108712 -150406 -225586 -177923 -83006 -56658 -112074 -138891 10945 74626 316442 328741
21545 328741 -39757 -77744 135874 128654 94465 86707 108488 69613 -56566 173728 171501
21534 171501 -61244 154943 75054 -87331 -143188 -22842 249960 147904 151486 526272
21524 526272 749124 667386 544777 682726 592307 615018 678180 599600 285808 254470 269738
21513 269738 254916 184461 187772 141845 129167 85370 8621 -72202 -101407 142189 376952
21502 376952 252588 114767 -70486 -13785 142673 -17291 -206819 -26119 21083 -98167
21492 -98167 -106342 -235063 -266201 -248180 60328 119701 152408 348566 427993 319128 174912
21481 174912 167921 242156 44455 -53667 -128714 -412337 -307135 -345389 -456826 -247407 -78917
21470 -78917 125131 62180 102276 372313 298383 153993 137482 190496 371082 397026 349921
21459 349921 272058 20460 -186984 -390149 -303760 -192569 -212879 -330193 -199106 201180
21449 201180 459165 301203 157592 282112 457292 447636 390059 299055 242227 165954 81204
21438 81204 -57571 -158773 -254301 -192463 168826 333605 242958 153873 290258 415915
21428 415915 370581 325379 282435 148862 71529 205063 323475 449012 398642 247803
21418 247803 316297 270133 321539 631460 1048702 1155895 1042103 1182733 1365274 1359104
21408 1359104 1242442 1102617 754993 614340 700989 648158 640177 795209 937944 1182022
21398 1182022 1432022 1345653 1062698 1023186 971794 1089861 1091971 849395 715481 822648
21388 822648 551485 239176 211629 95189 -92968 -249935 186297 671281 799155 273374
21378 273374 -89892 -181772 -59264 -69817 -29543 -78834 -111726 127683 284922 12348
21368 12348 -8579 -519 185581 407626 481040 344521 52080 -64927 -248570 -304194 -161606
21357 -161606 -37709 9548 26301 6688 336096 402793 333106 456954 449471 406662 347804
21346 347804 192110 -6224 -94563 104261 252235 116875 77411 158509 303627 337637
21336 337637 476955 396717 484352 451903 162031 -38519 -295145 -242929 57069 42379
21326 42379 -35791 -37240 -154862 -60777 -67444 16896 60574 180004 -11134 -19278 -192288
21315 -192288 -60441 -150630 -418385 -428760 -295996 20397 52748 93275 262497 335853
21305 335853 322809 281595 384714 155526 144959 297458 431141 131220 -118187 -11469
21295 -11469 118977 364576 322286 218188 345830 334702 124420 21822 40988 222995
21285 222995 371531 401332 276137 209762 278495 410814 250978 186216 222928 158961 252698
21274 252698 377002 271461 279028 184099 145708 -75122 -132139 183379 511631 375683
21264 375683 159234 162120 131718 29985 232094 214501 173676 295662 236620 343494 251264
21253 251264 206592 186655 239718 -41589 -6230 -27136 193368 227805 269193 376446 245623
21242 245623 172856 -70770 -5034 -1027 -93510 131440 238414 62050 -66732 13663 -210988
21231 -210988 -155698 40500 -3328 -204125 -251569 -32008 253825 263522 236105 268820 183528
21220 183528 69027 145665 261135 195058 315239 78582 -53261 -18396 194727 537531
21210 537531 716443 567425 234521 210989 356449 312121 251480 411916 294800 129814
21200 129814 236205 164249 -12271 -217604 -200842 119021 349917 430779 379828 245197
21190 245197 118073 68238 175973 203195 194436 86523 -23375 -98111 -108119 156653 244390
21179 244390 204587 59137 17792 89828 112635 183791 72819 -8787 142576 77351 111462
21168 111462 284706 253939 97861 241941 316867 278144 175485 242111 212827 279264 525261
21157 525261 596834 494877 522445 471888 591190 722017 572289 305093 213090 249514
21147 249514 170880 23532 39503 373237 138896 283682 448054 438148 296482 345778
21137 345778 341357 362709 305500 179060 143479 221821 406778 334051 94332 -3945 -8002
21126 -8002 60305 -94841 11728 25836 160383 80041 69649 244766 465824 439085 348633
21115 348633 476638 508932 421903 294247 99051 119336 256318 155686 24574 185864
21105 185864 245666 199785 152556 149050 182065 323188 430184 625646 618545 480249 281351
21094 281351 160706 33234 213381 326160 298156 373688 374391 269152 77857 109253 106510
21083 106510 174467 287939 230944 311648 84470 -220758 -139342 80768 229112 216819
21073 216819 238885 279602 43184 175050 468168 325487 122329 97938 191355 216707
21063 216707 32443 93964 376293 347554 382532 457722 223304 238661 37754 138466
21053 138466 -62224 -229418 -189609 34311 346386 244108 33657 121052 -85997 -263327
21043 -263327 -345233 -145159 -111234 -7161 2357 12905 -100085 -39714 -76308 141540 203467
21032 203467 66293 98648 -69274 10404 374045 369742 339932 384723 125311 -207471 -263431
21021 -263431 -84261 124769 124626 96814 130142 210410 202817 229902 429773 506260 447167
21010 447167 392824 407078 269576 278030 413589 307688 314121 90629 -56176 75442 118344
20999 118344 297033 538330 443414 152054 77586 133139 177414 475663 439225 232907
20989 232907 355757 330233 278956 162661 207763 158211 211249 286306 357120 498814 489747
20978 489747 314065 484282 501389 565720 589979 827938 736096 646506 597663 720313 622472
20967 622472 507949 276686 181763 306942 613603 644415 408578 203798 172495 252496
20957 252496 542945 522574 345214 587178 784387 533360 480301 441784 530308 730392
20947 730392 669337 294936 185783 214548 408031 366169 524458 589311 443660 443105 357022
20936 357022 498308 794125 570081 609636 817696 838136 908793 847862 769776 727585 974239
20925 974239 847709 503682 736171 906227 949865 757851 717895 923523 1192188 1032066
20915 1032066 727701 552460 523357 502393 568630 705647 960201 1194610 1300020 860561
20905 860561 790368 714992 743270 866064 711326 800083 930325 784408 677231 672183 626822
20894 626822 683193 1219100 1518154 1573990 1559765 1627391 1732582 1816666 1766407 1886517 1829456
20883 1829456 1746616 1526957 1963847 2250309 2261372 2279693 2442597 2614209 3230547 3537851
20873 3537851 3647313 3985828 4366334 4921489 5163737 5409810 5619190 5604663 5687338 5782280
20863 5782280 5689328 5390692 5339505 5421950 5595362 6118437 7110002 8014455 8841601 9801974
20853 9801974 11062877 12298021 13493634 14361407 14763793 15422885 16132899 16869921 17939247
20844 17939247 19379296 22029237 25987845 31597635 39850160 52414588 70712539 97526529
20836 97526529 137843641 190686637 236160118 263981977 274047287 274497692 278393313
20829 278393313 271147072 248077359 201760090 152384652 120563623 105822685 104475976
20822 104475976 114876505 139125389 181774015 233341504 269031542 286415007 283021701
20815 283021701 276182614 271272344 254084257 218718114 163652823 113750068 80084300
20808 80084300 58360299 43980557 34138506 27224827 22179346 18548334 16105437 14458423
20800 14458423 13169005 12217957 11603396 10983904 10419627 10105620 9226095 8347997 7475408
20791 7475408 6635379 5973169 5358940 4755978 4368121 3869103 3416473 3228915 3258506 3390783
20781 3390783 3768293 4062699 4182525 3799907 3644780 3716162 3329211 2703920 2413724 2006394
20771 2006394 1596238 1424665 1256771 1173149 1266885 1164507 919402 987494 1059296 1193647
20761 1193647 1323091 1178695 864430 481659 282469 436254 372796 200261 186485 188356
20751 188356 473165 470564 246813 196388 147175 141124 165290 338203 265311 130536 271453
20740 271453 451423 528943 496268 398239 248620 200621 337225 530008 514411 373865
20730 373865 407815 401185 298370 278657 207785 107848 -84614 88936 14127 -129223 -187084
20719 -187084 -14775 130092 217285 32700 -110409 92086 189192 151657 -76844 83852
20709 83852 202675 196460 133610 27316 47836 349891 572419 546603 452673 378528 423385
20698 423385 201477 190812 353188 503804 405204 305414 24092 -134124 -191733 -313116
20688 -313116 -61214 390380 530022 454623 221959 122927 104631 43592 -17996 -217196
20678 -217196 -68039 69496 -42393 -4526 47749 18985 -107221 32084 -141401 -136862
20668 -136862 -229685 -138576 7490 -6541 25834 305579 236152 243457 70304 75140 185525
20657 185525 -90124 115906 239078 410488 437547 396783 489427 588847 736537 627973
20647 627973 419422 293195 502053 494615 813336 1103178 1161727 1228701 1414801 1788740
20637 1788740 2186300 2624435 3376316 4417551 5496833 6460089 7340756 7889208 7987706
20628 7987706 8037275 7838597 7216457 6154136 5209677 4503540 4275875 4528940 4750568
20619 4750568 5499247 6299908 7039958 7427443 7809940 8089310 8189268 7744885 7197904 6232951
20609 6232951 5025250 3922909 2976517 2269012 1631913 1095297 679117 437758 377798
20600 377798 636475 923418 833659 620263 692016 622364 454859 325738 375068 553829
20590 553829 599988 627025 731470 457605 74456 257752 468300 437648 390266 353665
20580 353665 177631 175801 193634 40740 40936 40420 21988 88917 -8094 -73070 -37707 -118416
20568 -118416 -83634 -75987 -52223 156355 532058 585394 139975 46554 115883 -75485 -218178
20557 -218178 -275825 -326359 -417413 -413317 -221473 -207012 -30962 50576 -33381 -111847 104477
20546 104477 113590 32866 216624 203284 147733 84399 -133099 -345875 -493581 -565372 -307559
20535 -307559 -261341 -275317 16523 235742 166388 187024 294783 471568 443489 233564
20525 233564 103690 -144478 -354986 -147199 -5824 -40134 -244354 -60897 -42985 -308832
20515 -308832 -308377 -396840 -433885 -193247 -43012 -60070 7951 226693 242054 -72905 -296358
20504 -296358 -243584 -257136 -238207 -216542 -141227 -108160 -89809 -144540 -112060 -7958 -32409
20493 -32409 57814 -95255 -368010 -452821 -386184 -195933 -53717 -303547 -556029 -472281
20483 -472281 -184356 -59501 92946 -92740 -291213 -270673 -254854 -39499 74208 241493
20473 241493 342463 355287 221528 234572 117797 -187081 -110005 50056 147265 357975
20463 357975 338215 66677 -60864 -51265 -15056 -95397 -36125 143035 130880 117015 150125
20452 150125 193939 292693 243996 -45727 80248 9981 37759 44480 17869 -65502 -158249
20441 -158249 -63991 13841 60908 267788 214004 69783 -101376 -111313 -7104 81503 65337
20430 65337 -63492 55387 256324 265525 90180 50142 133558 6563 -101693 -107270 -25309
20419 -25309 93201 137075 175756 364221 429517 414215 211258 -8986 -55283 51141 258597
20408 258597 96272 18504 55416 -23276 -10197 75625 252083 134858 131759 417042 330195
20397 330195 47293 -77297 31824 116364 126232 133186 153005 115021 -25076 -51835 166049
20386 166049 312547 367807 373013 210025 120057 353371 554568 632090 520418 251525
20376 251525 100352 -16469 62367 21513 -98523 -20730 248937 149256 -178190 -289414
20366 -289414 -346143 -212614 -162966 -270026 -306327 -259880 -304595 -506687 -512606 -568476 -374963
20355 -374963 -281166 -75356 196047 224609 -57624 -307437 -324597 -420074 -323241 -343404 -216184
20344 -216184 -411159 -255928 -265788 -155326 14327 -17402 -216866 -245106 -133353 -342934
20334 -342934 -291926 -367063 -295626 -407489 -468137 -624851 -482064 -275893 -244271 -205632 -101259
20323 -101259 77939 550928 506534 259903 238947 39062 -171146 -89560 -171951 -350814
20313 -350814 -337697 -141281 -181968 -76113 -112250 -26038 106926 177098 191577 116621 201309
20302 201309 417805 144942 -230580 -286326 -125293 16323 -52429 -83405 1604 243891
20292 243891 411728 552047 382218 7699 -153899 -77968 352445 609804 456048 198040
20282 198040 172454 96426 5896 20093 47135 -138520 -74647 422280 780306 901390 965472
20271 965472 723625 443741 316337 487882 476750 518512 604420 540531 587224 672653 869922
20260 869922 937997 1270867 1459620 1474421 1178779 874414 777295 903943 817720 863211
20250 863211 1100921 1214744 1145843 1157839 1225574 1325688 1623302 1764791 1592583 1618065
20240 1618065 1433202 1127958 892603 692249 526329 447911 755450 1234161 1389910 1298576
20230 1298576 1271899 1321434 1345676 1235767 833100 644186 562462 527802 604556 810963
20220 810963 976432 1125158 1252873 1141548 959811 700051 547083 416017 345555 412555
20210 412555 517892 384438 136672 91039 319662 518776 825630 983278 1122571 945159
20200 945159 947119 824245 445256 299949 298913 281513 52079 -204261 35635 228235
20190 228235 198312 309222 345724 235535 24810 -4636 -107530 -181551 -161710 126251
20180 126251 223689 -72686 -16518 130148 141131 74415 -47688 -259280 -310591 -122280
20170 -122280 -15216 -142535 233567 175137 104462 141191 133105 -93991 -420844 -389547 -255640
20159 -255640 -56054 37607 -58137 -25864 179655 434855 475131 267106 -69792 -212134
20149 -212134 -299585 -336664 -409311 -453089 -452422 -657037 -521688 -501043 -435939 -490029 -216722
20138 -216722 -40552 -88265 -160695 -150271 197345 197717 149402 145104 59847 155712 141461 5792
20126 5792 -115459 -168945 -259632 -112962 -101593 -57387 -229801 -281091 -451594 -394405 -151522
20115 -151522 119511 24495 -255063 -276849 -137512 -54772 66340 -11694 -103188 8487
20105 8487 14798 -5465 1425 113268 289526 304059 504357 611140 398972 104070 70896
20094 70896 110078 45736 -59829 -107626 -101943 -16073 71975 532 114631 7225 -64520
20083 -64520 47106 140817 -83444 -218482 -34352 10582 -61368 80138 273005 296891
20073 296891 157017 75055 25297 -26016 24922 58368 177426 114844 238875 207089 312472
20062 312472 180841 30567 -192679 -176544 -55513 -170738 -123521 -29813 18303 89021
20052 89021 295130 292661 -18968 3038 60218 -109155 -256896 23581 91904 145238 127030
20041 127030 209066 335339 471115 467929 434226 173822 -67833 -292142 -369000 -152757
20031 -152757 -178424 -121187 43093 78504 159534 129185 122495 122116 -124627 -160846 -357348
20020 -357348 -217434 -9733 84767 -155760 -359065 -242906 -233359 -60844 -52482 121053
20010 121053 414454 484076 475709 295427 303971 254981 174718 318438 393461 439423 262172
19999 262172 92615 35339 -22054 -414999 -516646 -261215 23889 146032 97369 -247121
19989 -247121 -301546 -241647 -301025 -139890 -53337 -181795 -216452 -95823 -90151 -27614 -22444
19978 -22444 -66587 -164629 -96738 -65330 -109498 -280207 -99017 99202 187790 161678 319464
19967 319464 350789 402785 361555 136577 235415 295367 -56040 -236935 -90836 6670 -314
19956 -314 17826 223939 372978 449698 378670 342638 421391 322117 133756 128250 240941
19945 240941 176294 375649 532064 506441 567983 645550 444717 397658 483831 339155 130071
19934 130071 143840 298408 442058 419613 284698 -129011 -170725 -272654 -214155 -152065
19924 -152065 77269 227873 207849 -457 247485 545949 401619 292810 355377 119172
19914 119172 79827 323561 309456 383563 318200 401539 451915 252760 314841 336647 412581
19903 412581 571151 974008 1035683 647837 720549 732256 528459 452249 458524 190470 144360
19892 144360 114352 78914 -101611 -245633 -317954 -161651 191406 405714 338914 251495
19882 251495 314979 329391 243278 136006 -31711 -12856 200718 251827 127501 97997 100501
19871 100501 104369 223667 471361 441079 294458 406862 339421 216736 258846 424652
19861 424652 371568 323538 96750 49959 186981 370345 585063 766787 810643 657013
19851 657013 428963 303835 127030 220137 387558 749483 727738 722278 733893 703455 521878
19840 521878 477671 616878 931784 663905 286837 81517 22050 182526 526608 703247
19830 703247 658148 744508 575020 481095 277351 265991 279319 472381 468523 424063 480759
19819 480759 584705 692251 634593 608962 445716 610681 844435 999366 847572 656035
19809 656035 622361 989532 985635 979305 1153354 1117589 1194422 1285861 1161815 930033 801627
19798 801627 856775 999845 1111081 1054545 1166346 1349736 1276053 1161074 1020270 1187558
19788 1187558 1099042 1130456 1514263 1885026 1952605 2275296 2668669 3075787 3339793 3374198
19778 3374198 3356142 3525718 3653245 3752371 4287942 4715151 5014945 5555284 6036361 6384098
19768 6384098 6708518 7170618 7572363 8441465 9492483 10274529 10963740 12118944 13960971
19759 13960971 16499091 20305256 26264181 35685707 50124424 71716696 105276398 154351322
19751 154351322 198480793 213605532 200265421 153651343 106173247 75181223 56676606
19744 56676606 46005570 40419318 39530213 42915958 50894205 64772442 87167756 123631968
19736 123631968 171178282 201696533 205129107 177705324 126774144 84950485 58376198
19729 58376198 41899363 31371396 24754529 20708104 17970217 16010837 14142177 12720850
19721 12720850 11830706 11114422 10605562 10088478 9876213 9619535 9651009 9457200 9388939 9659025
19711 9659025 10334984 11049112 11669245 12373196 13225746 14464747 15968477 17996240 21091933
19702 21091933 26032870 33453141 45205886 63231154 90947367 134002492 187294211
19695 187294211 218926753 221307257 189056545 134651144 92646322 67369880 52588241
19688 52588241 44566930 41223568 41805148 46988730 58150341 76747869 107077991 153598909
19680 153598909 200162489 217475192 207140004 160985455 107860868 71618108 49197411
19673 49197411 35513072 26844205 20968955 17020870 14126650 12109271 10896999 9911741
19665 9911741 8956644 8116774 7046372 6234530 5706013 5094839 4518863 3908906 3565791
19656 3565791 3290927 2856182 2624787 2506260 2527765 2567869 2638713 2659205 2652759 2209917
19646 2209917 1539973 1223358 1126240 1160385 1035788 523525 242953 347302 538077 641473
19636 641473 726008 614783 710283 741129 642681 546561 702990 829361 638394 605023 701048
19625 701048 993595 1367496 1395864 1303837 1384937 1196092 1114938 925274 618200 704614
19615 704614 845493 1025879 1033244 901688 1277781 1618821 1954972 2314523 3002496 3679975
19605 3679975 4439490 5087734 5487632 5546084 5196517 4343822 3437463 2596686 2164063 2106090
19595 2106090 2045607 1899923 1750852 2079882 2661413 3383995 4260902 4909354 5144916 4764773
19585 4764773 4178397 3360664 2682808 2015783 1516451 1177660 825532 608598 683213 497344
19575 497344 384239 304433 403263 360374 281044 444393 553323 588258 752829 766960 557234
19564 557234 548008 487096 357822 256008 294224 449299 647669 811809 900547 1178610
19554 1178610 1651970 2306068 2799055 3313030 4188031 5315769 5960864 6043067 5516240
19545 5516240 4618583 3736581 3211939 2577268 2395196 2257712 2055095 2293596 2611179
19536 2611179 3130430 3756083 4417055 5286106 5543116 5202122 4373761 3416023 2486917
19527 2486917 1674955 1361247 1072209 848184 705404 685172 433768 235346 326417 463375
19517 463375 515011 329175 334114 492998 219928 222648 343227 330435 328805 104557 9024
19506 9024 143041 98563 238914 -22572 -165727 -17466 -52470 -232861 -229574 -248427 -198621
19495 -198621 -201991 -162609 -68824 33922 254058 245585 177054 -23180 -36830 -207999 -156732
19484 -156732 -138322 -155374 46598 -85018 -150084 -68088 -96193 -167266 -144094 -326997 -104266
19473 -104266 83801 22285 -166226 -345679 -90462 214095 180861 78136 72548 16825
19463 16825 46041 136548 -121920 -463221 -627297 -644991 -572327 -540060 -537198 -431438 -311643
19452 -311643 -286144 -383323 -476413 -593691 -287707 -179693 -199849 105244 400447 392877 255953
19441 255953 348121 120820 -54508 -113724 -400150 -488357 -508980 -384617 -194284 -210034
19431 -210034 -400765 -451781 -522468 -672495 -508863 -419128 -266125 -299751 -349781 -177717
19421 -177717 -822 -185334 -265311 -37695 179866 248170 123990 3592 -175393 -208710
19411 -208710 3079 133786 11469 -74103 -128708 -159766 -238362 -432177 -310273 -274087
19401 -274087 -464680 -481823 -461452 -324366 -153235 24270 263230 244977 207512 166498
19391 166498 84455 -33431 214710 127082 -81312 -130873 -304067 -329154 -337104 -137915 -51887
19380 -51887 -31857 -225957 -216630 -213743 39771 130452 154150 225264 216921 200346 261167 258924
19368 258924 57963 63686 -26740 24732 31314 -97418 48197 103650 99078 5673 6049 1999
19356 1999 -55495 -118033 -170421 -119055 -138036 102943 133596 238223 319804 482701 419745
19345 419745 238512 7496 -94248 179548 157042 95648 20237 56065 92953 -6564 -200966
19334 -200966 -3865 88212 127379 139645 107182 295527 147053 -43062 -256901 -309458
19324 -309458 -199259 -69521 -37325 -60586 64919 130901 -88805 -254047 -265412 -153498
19314 -153498 -188778 -293081 -218173 63470 301594 224596 -329867 -676883 -321404 -6076
19304 -6076 -105956 -292633 -155667 -322843 -391535 -265753 -169835 -6339 67481 27481 -86075
19293 -86075 -119874 -211329 -358009 -414798 -148671 -230968 -413162 -442220 -156360 -336887 -312572
19282 -312572 -300161 -100615 165403 123347 9895 -22752 -298254 -555149 -450176 -274239
19272 -274239 -188806 -96604 -28767 -75104 135074 38597 -73726 52049 -159165 -275225
19262 -275225 -286544 -150966 100766 -21793 -104762 -210446 -229599 -34982 -125984 -243102
19252 -243102 -267534 -199860 -133139 49309 103788 223648 249772 424119 536180 484284 345508
19241 345508 69970 -169021 -64710 44550 -103856 24178 26191 27201 76579 -62998
19231 -62998 -307133 -196020 -260821 -202566 -82391 -24664 135723 361136 422159 465929 653793
19220 653793 670771 733756 751765 681528 621971 606555 456293 294087 137688 328955 266177
19209 266177 216105 304369 508874 644017 701558 612530 547682 363473 113898 -5640
19199 -5640 132070 143949 43469 -216241 -319092 -182844 -38818 225213 61994 210724
19189 210724 295979 222638 -44552 -285157 -368266 -497768 -613755 -647301 -527825 -420007
19179 -420007 -315390 -21733 31548 22455 232046 240881 348310 276552 173032 95076 145320
19168 145320 345994 447403 373171 349009 683989 656895 433385 179276 -153592 -253551
19158 -253551 -291721 -125998 -41882 196067 313138 391641 636892 996407 1218463 924966
19148 924966 588311 449172 476585 552320 389446 188923 75750 64927 128967 126268 178702
19137 178702 55135 -219268 -255927 -297722 -323117 -389912 -117050 82237 -17374 -109316 -163702
19126 -163702 -172404 100989 130047 91700 81457 244356 489896 224063 -259251 -342765 -263337
19115 -263337 -224242 -199284 -243879 -151657 -159036 -148599 -100858 -85438 -94705 -140960 -113056 -28222
19103 -28222 -313248 -269070 -305707 -396497 -315534 -284184 -585297 -571804 -535257 -486847 -140955
19092 -140955 61897 43942 -117872 100484 300751 -185663 -348242 -512389 -312699 -277558
19082 -277558 -207845 -113363 -99509 -29955 233044 165471 72957 -127800 -175916 -295709 -198489
19071 -198489 -202999 -258410 -315860 -421977 -446702 -254266 -184672 -495421 -544151 -363177 -166383
19060 -166383 -17003 78962 -89944 -372173 -270435 24204 117631 291156 346343 79775
19050 79775 -11618 -65088 -69346 -47164 73583 -166974 -193230 -112603 67140 108669 -207283
19039 -207283 -444515 -381127 -383742 -278898 -388821 -638536 -570062 -492414 -422223 -252756 -87240
19028 -87240 -292143 -306985 -147278 -78891 9112 65669 -9416 8134 137316 243983 269574
19017 269574 327162 379569 391692 152110 113276 23600 99826 160757 454392 304558 111166
19006 111166 -11747 -32371 -119976 -28764 -241392 -197671 -100364 78359 -168540 -113871 -50908
18995 -50908 -102457 -172307 -363924 -547618 -497608 -386801 -263183 -271563 -379148 -405968 -174175
18984 -174175 -62119 20725 -2206 -73362 6137 76171 40435 -185855 -541262 -678616 -595562
18973 -595562 -476621 -219362 -85242 -214110 -202037 -135592 -152726 -107197 5107 190057
18963 190057 -18338 -201905 -363660 -292998 -247110 -106126 -83422 4899 -41416 -321555
18953 -321555 -471511 -473319 -364791 -447364 -544365 -392515 -387073 -212464 -27495 -117368 -77559
18942 -77559 18329 -74293 -117469 5602 59917 -92434 -207146 -30551 -19332 -226831 -268640
18931 -268640 -284074 -304744 -279556 -223697 -220005 -202406 -197381 -196641 22057 43715 21911 83543
18919 83543 256737 77316 77222 -147660 -295691 -308642 -242464 -116167 -157820 -209279 -342160
18908 -342160 -186370 37569 -32867 -184911 -454100 -398852 -205898 23156 60139 -183589
18898 -183589 -494044 -308766 -162508 47434 5608 -230273 -351776 -427452 -404281 -325188
18888 -325188 -348835 -375893 -402273 -474464 -354133 -227940 -354883 -272301 -382735 -397213 -336402
18877 -336402 -277714 -163702 -181197 -181116 -110341 -111801 -133229 -175005 -327504 -542893 -637020 -517025
18865 -517025 -262739 -182340 -225900 -257251 -282640 -117148 46453 -34663 -218848 -345688
18855 -345688 -517681 -476739 -627696 -617389 -301711 8102 235472 379665 244204 -214303
18845 -214303 -404542 -258653 31999 97293 24580 -60824 -146967 -102086 -28965 -73749 -49330
18834 -49330 86223 47780 -174312 -126499 -185128 -20859 236771 362548 371811 -8889 -45459
18823 -45459 -24210 -136407 -61945 90695 86862 -59033 -264536 -272029 -33435 144018 27922
18812 27922 4888 96084 49823 -121671 -5455 23278 -46494 -118218 -331896 -347965 -331486
18801 -331486 -447354 -554034 -392256 -116157 20725 -4498 18648 36264 -104198 -310472
18791 -310472 -121362 -60890 -94481 -27586 49614 -21451 -152750 -113915 -238104 -440903 -594973
18780 -594973 -339478 -4289 27868 113055 207085 5341 -5077 309180 345492 408243 671543
18769 671543 752081 1030975 1649180 2156060 2265650 1756072 1088451 514170 313222 218206
18759 218206 149797 174367 -173959 -302302 -274595 -283178 55575 125940 16426 -20362 -67132
18748 -67132 -166537 -140503 -153115 -220180 -28674 63719 10586 -49108 -136868 -223539 -341772
18737 -341772 -324727 -209010 -214677 -316279 -270527 -43468 -128683 115295 321305 165133
18727 165133 186527 156092 94003 -97799 -388495 -185790 28480 -46084 -266363 -244760
18717 -244760 -228528 -29359 56913 2781 144874 161592 17106 -69446 -195269 -173101 -197093
18706 -197093 -128543 -112646 -337909 -350764 -169356 -218941 -267751 -341678 -169020 248293 18680
18695 18680 -269469 -323542 -348893 -452029 -632710 -521807 -329981 -257691 -342130 -261316 -193111
18684 -193111 -358604 -299278 -323601 -428648 -520738 -177079 59798 196718 -123923 -96568
18674 -96568 -8489 71310 -31861 -292934 -230555 -147705 -132883 -50585 120665 65224 160234
18663 160234 190078 262796 225364 46691 -61492 39935 64988 -6497 -272929 -312058 -362921
18652 -362921 -407063 -482661 -447122 -430356 -310443 -189788 -55555 -45620 -134217 15133 -80087
18641 -80087 -201709 -206566 -45003 -80638 40476 116268 274305 242113 84472 68234 105804
18630 105804 -36033 -189006 -380053 -370148 -331898 -206750 3008 -47319 13682 144550
18620 144550 16270 73272 106010 194032 330068 279106 145919 199010 -96048 -72201 -139351
18609 -139351 -230938 -55553 28404 -302992 -333913 -145681 67489 188215 430501 432005
18599 432005 249833 239165 192089 25276 -66072 78752 139389 59067 -29646 -1812 -35200
18588 -35200 18002 51888 255999 257281 -2402 -160712 -256587 -202014 -165331 -87037 155634
18577 155634 125203 -123424 -157485 -73383 89451 88043 39242 31783 -181050 -319610 -240651
18566 -240651 -230308 -270755 -31735 52770 -88985 -98764 -439569 -486163 -318433 -201409 56089
18555 56089 116062 118881 357401 100008 -304060 -403929 -397321 -426200 -340639 -280460 -191176
18544 -191176 -190901 27136 215319 162187 242186 130941 12956 -35989 73323 184888 325007
18533 325007 214012 18169 -239194 -64970 184338 2086 -337838 -446072 -335346 -241209
18523 -241209 -262496 -400235 -335661 -295029 -426139 -254841 -5664 -101751 -201745 -157800 51375
18512 51375 -40170 -36713 -13404 -179419 -272612 -353118 -129693 13595 119078 166657 -85960
18501 -85960 -70562 25223 -160170 -385044 -462023 -247330 -117788 -401412 -204323 96048
18491 96048 -7808 -286904 -152427 -232519 -282206 -160253 -94908 99531 282563 352229
18481 352229 91233 -153534 -236490 -154551 12568 -73378 -227756 -288721 -200284 -250344 -371341
18470 -371341 -81462 48303 84452 22231 -131909 -82267 -182837 -164484 -124501 -142623 -327224
18459 -327224 -317834 -302999 -146931 -216550 -389255 -322504 -102566 -144114 -148908 -15224 302086
18448 302086 483132 339092 307211 248756 272528 209020 253506 179890 -114536 -462577 -251468
18437 -251468 -28538 -121087 35102 257427 280243 432428 219507 203849 225721 -11259
18427 -11259 -61970 -46827 -267772 -338607 -270217 -338345 -219234 -247677 -114960 -71823 -37794
18416 -37794 -129107 10313 131504 -175915 -288217 -155229 -150782 -182152 35635 71050 -105261
18405 -105261 -254604 -166671 -26202 -43886 -165259 -92605 54427 -7293 -57617 -534 83875
18394 83875 56893 232326 168806 56179 257941 135447 -58531 -18649 -7187 -2652 -7939
18383 -7939 4064 -58516 -47558 -11525 -22592 62888 60079 67009 111963 70250 -47791 -232599
18371 -232599 -270607 -282791 -242097 -255892 -104034 118024 208916 8455 -76629 -158075 -248222
18360 -248222 54158 199946 250837 221117 83625 -97875 -207616 -80793 -56760 33927
18350 33927 44341 -2807 -313069 -213278 -163848 78886 314254 138626 -188061 -544064
18340 -544064 -448213 -240591 -9383 -13189 -2105 19505 -246438 -529311 -342831 -380822 -146475
18329 -146475 91363 162605 -201019 -278480 -196436 95974 146113 -192927 -282388 -38353
18319 -38353 50175 -28347 58145 168641 117184 87792 261470 267070 46123 -71564 -270145
18308 -270145 -432330 -404060 38256 189062 89110 251332 252643 185184 -28873 -130696
18298 -130696 -137813 -89954 26635 306037 310615 80257 95295 141779 315744 329949 69677
18287 69677 -65322 141778 193017 90802 213487 392450 330547 322291 423716 381398 279538
18276 279538 252081 124476 -77320 -71002 21936 -16095 -115232 -88727 -133392 -162143 -347056
18265 -347056 -297700 -89531 -151255 10093 219670 52392 -163741 -155350 -23439 -35621
18255 -35621 122143 281072 383452 21018 -185771 -146475 86244 94120 208011 392189
18245 392189 684399 604277 407711 408306 362111 409612 379164 433471 216881 42939 -194835
18234 -194835 -360984 -424087 -299372 -60704 22650 93430 -109796 -333481 -77141 21322
18224 21322 -38378 -51368 -7069 -71083 195408 212708 127084 245335 300534 255254 239633
18213 239633 327364 394598 236086 150254 170294 285506 278352 -42702 104002 381349 454168
18202 454168 374107 306442 349629 316554 273251 183360 554748 811691 855247 720981 816545
18191 816545 979550 687869 468929 628433 548359 439965 456391 507229 152707 -94596
18181 -94596 -203744 -171844 27909 107233 237877 486920 543555 345673 399825 590676
18171 590676 499182 495941 380984 369303 407695 520708 688106 817794 897113 945310 879046
18160 879046 840170 804773 682233 389813 334909 594279 597092 680283 857532 1189762 1159635
18149 1159635 1214362 1136831 1306529 1345140 1563798 1557711 1697143 1737846 1683395 1857878 2037700
18138 2037700 2300993 2190065 2259483 2430559 2754093 3221167 3535381 3655129 3669980 4090221
18128 4090221 4574856 5009250 5323779 5624934 5935567 6559037 7562756 8757324 10381789
18119 10381789 12409163 15161596 19092667 24312609 32355086 45116003 65662372 97684948
18111 97684948 147362417 234166019 362564178 436217484 446692051 376228206 240564742
18104 240564742 146446059 94408481 64552924 45950640 33912485 25709174 20072947
18097 20072947 16408063 13694805 11501924 9766051 8248333 6968353 6097748 5455020
18089 5455020 4575249 4133087 3657032 3164632 2694429 2129169 1834508 1728580 1655706 1632111
18079 1632111 1446319 1319477 971892 765177 1024135 1254994 1113888 927599 775094
18070 775094 713403 587625 380007 404543 150509 -43213 179298 254102 202528 217451
18060 217451 231997 493360 581777 458894 386278 458217 797895 1004329 762761 418365
18050 418365 194975 183678 363710 584938 431199 266312 163796 52679 217465 26681
18040 26681 -331590 -449213 -275048 30077 256418 524405 243590 35740 -5335 204660
18030 204660 307598 74703 130724 205230 221270 50065 10341 -147910 -124778 -16284
18020 -16284 158770 102641 116715 5139 8673 366361 582962 816858 782560 776886 794214
18009 794214 981254 1143280 1071525 926041 1002824 1010118 962210 735122 486182 167558
17999 167558 112364 146078 153611 89769 145646 180296 230876 176588 146372 -69244 -204113
17988 -204113 -13955 -204537 -441236 -523758 -418487 -525079 -238676 78119 190920 173089
17978 173089 266130 575200 746126 604816 366014 297531 160836 134163 41587 33885 103126
17967 103126 -28053 -52688 4948 89395 66336 -172559 -271036 -82195 107209 441166
17957 441166 735366 915597 1127922 1489841 1722984 1839507 1857536 1616273 1336909 1129075
17947 1129075 727055 467458 370477 255078 116191 -135821 -162807 -107785 -7801 -121356
17937 -121356 -19196 200878 102386 -143400 -256792 52170 421200 421292 214235 -179097
17927 -179097 -41015 70318 108621 290029 280811 166100 -12272 -41260 173794 126759
17917 126759 -102093 -92927 -10626 -107756 103044 92533 -141131 -171629 -117933 -311525 -170649
17906 -170649 207740 119451 151404 106912 115990 -14850 -89727 -74429 -103264 -25190 -25696 -78702
17894 -78702 -42365 122029 87442 -62446 -185429 -126394 -32753 -102989 -167228 -401110 -763901
17883 -763901 -572518 -530915 -406882 -151120 -192269 -129466 -97218 11809 -78809 -341423
17873 -341423 -275648 -210155 -148131 -10509 226808 163192 64944 328645 376320 312214 213093
17862 213093 131616 248357 203111 244686 66767 -69635 -205471 -300984 -206895 -179288 7270
17851 7270 27915 -68994 -189847 -14584 98261 -74814 -178695 -230832 -68863 213138
17841 213138 413601 523593 470921 257301 109799 -50029 -193797 -299527 -238201 111281
17831 111281 226817 281055 63930 11989 78613 135325 424688 249927 -23949 84064
17821 84064 411048 445818 670336 552686 399387 321708 183165 141014 -94703 -366208
17811 -366208 -105325 216950 275983 401057 365433 347431 316856 422857 234445 -42747
17801 -42747 -161933 -352797 -416780 -353877 -301438 -139632 32240 8889 -145521 -176341 -125520
17790 -125520 34259 407616 468882 384264 237126 550716 572134 254861 154900 -50279
17780 -50279 -222178 -134349 -112137 7317 102373 -26378 -68484 3492 -71515 -85203 -67923
17769 -67923 36251 33822 -12121 -18136 112593 8275 64946 -69467 -194002 -52362 141205
17758 141205 226199 42160 50230 200250 68247 -100070 -105629 -234962 -161019 -231889 -265728
17747 -265728 -187580 -185653 -273607 -412508 -375840 -286505 -161550 128505 154639 142446 250142
17736 250142 249806 153727 245610 279120 233418 517969 734452 605153 627511 475348 252404
17725 252404 178111 47192 -87981 -78088 -42529 -39660 41115 190313 17433 14447 133735
17714 133735 280614 -40885 -209780 -93687 80147 285666 501555 445018 173311 -24201
17704 -24201 19299 -131458 -82474 -37109 -31786 172845 -26427 -229927 -140180 -206095 -64894
17693 -64894 -176406 -247827 -96963 73229 214915 134787 -104734 -57996 27400 -167853
17683 -167853 -297497 -294683 -142018 350888 437979 300412 324469 383169 361696 340959 294469
17672 294469 238760 108144 117978 172267 -150143 -344510 -280987 -139487 -241281 -419241
17662 -419241 -504049 -325179 -335819 -239203 -234942 -127242 -94896 -169532 156533 -7112 15400
17651 15400 15837 -149641 -341257 -469163 -205067 -144394 -41783 -49430 69985 -151112 -70834
17640 -70834 -191727 -312543 -58314 113456 163051 210127 306464 472208 444739 248515
17630 248515 249770 416037 563841 392548 263232 296318 143873 87143 180815 408721
17620 408721 589686 423524 560562 557840 504890 390136 455139 461389 379562 180821 44226
17609 44226 -451649 -576849 -449618 -482876 -271614 -35936 -171766 -151126 -188300 -80086
17599 -80086 258435 549888 699946 422018 57185 49381 42955 175318 485411 511165 89986
17588 89986 -252257 -44866 289067 231915 254639 368408 291465 539807 573915 499907 553884
17577 553884 656068 507490 700530 826778 683263 481939 436776 378526 338705 386344
17567 386344 530904 729100 846749 657582 492258 414018 315610 363484 389739 647506
17557 647506 734448 592377 718281 609512 456475 332868 360220 334837 404007 417387
17547 417387 577326 724190 856379 927855 934485 899389 969562 651246 584933 736196 999547
17536 999547 1032275 917166 1011844 929327 754429 911755 1124677 1097691 945794 836803
17526 836803 745490 898531 985578 1021814 975337 953922 1081511 1367836 1831455 1750994 1383184
17515 1383184 1495306 2055248 2139489 2205986 2331829 2366774 2463157 2662359 2959501 3253286
17505 3253286 3750242 4383581 4902558 5372110 5859352 6299947 6530211 6969752 7500055
17496 7500055 8177189 8782491 8991074 9327720 10159479 11297423 12941233 14945342 18024474
17487 18024474 22514132 28690253 37893225 52336096 74021919 107125064 158406783
17480 158406783 222093088 267210468 292000636 292505216 288687627 290237849 275932946
17473 275932946 241918098 179662596 121620504 83788624 59982051 44208136 33415419
17466 33415419 26271964 21466189 18165859 15691082 14057892 12823800 11882498 10938498
17458 10938498 10225853 9676955 9121988 8690324 8245371 7941255 7728445 7404380 7098589
17449 7098589 6996494 7117756 7463173 8043254 8611066 9040074 9839131 10676783 11063800
17440 11063800 11145802 10754704 10476168 10706716 11540638 12593164 14431189 16824314 20082761
17431 20082761 24879013 32032391 42992232 59919135 84908872 123377837 180776760
17424 180776760 236606166 268794814 281984719 275570381 277799998 272396757 251206151
17417 251206151 203742873 140936567 94645003 65880424 47580355 35367168 27230390
17410 27230390 21561847 17793805 15197969 13175567 11389550 10054671 9297270 8679005
17402 8679005 8026085 7298334 6524584 5991034 5626340 5302165 4919076 4165151 3607642
17393 3607642 3115465 2567469 2138723 2037241 1930589 1902543 2112737 2033887 1845841 1639116
17383 1639116 1253804 1162237 1483164 1595824 1427624 1459519 1503377 1553269 1412557 1283366
17373 1283366 1254608 1259002 1362359 1228501 1115354 1336571 1537486 1695908 1908801 2126220
17363 2126220 2383260 2931902 3933436 5263757 6621440 7743326 8461659 8891802 9063422
17354 9063422 9003720 8598399 7767964 6269772 4827698 3907664 3301036 2867918 2362546
17345 2362546 1939724 1500581 1250018 916314 858219 822503 664382 599353 787396 798677
17335 798677 656643 613916 466341 93585 17510 136543 449451 602524 733983 389631
17325 389631 148829 250375 447844 386651 202704 113497 151981 298812 405776 508653
17315 508653 491139 336439 529967 739482 892499 875130 1082158 1599341 2307967 3225454
17305 3225454 4375029 6044919 7311614 7842988 8109798 8116731 8098769 7823293 7383946
17296 7383946 6280746 5048143 3850712 3028440 2385400 2164839 1715973 1240545 1012524
17287 1012524 939070 938573 969997 897592 668827 708525 575220 434845 484529 439900 339442
17276 339442 456718 388176 6995 20761 -12689 -112401 77361 236542 327926 175586
17266 175586 -11857 -33211 268994 428080 285181 5620 44411 -7540 70619 21255
17256 21255 -4112 -164426 -156313 -348828 -156767 41619 -8051 154456 -32249 -138098
17246 -138098 -214689 -265653 -387624 -245855 -2751 267855 579439 761649 643439 540255
17236 540255 203784 49567 179557 41250 -87816 -310421 -446421 -494773 -632366 -673232
17226 -673232 -312674 -256479 -126467 85027 50428 -35995 28278 305194 202212 -19320
17216 -19320 76987 171525 -7552 89460 115079 170811 20775 -89886 -47950 -9228 -152798
17205 -152798 -233668 -470873 -341807 -195408 -96864 -85204 45152 51983 -181853 -169851 -267218
17194 -267218 -252805 -105933 -67471 -61238 -276982 -214882 74671 127147 224467 217521 15328
17183 15328 133887 429849 632217 478759 379956 509740 434076 299346 234691 188038
17173 188038 115964 6031 20282 42582 -109593 -387397 -360261 -194170 52574 204351
17163 204351 159412 228136 172954 188243 -47526 -367760 -193819 -61870 270077 475774
17153 475774 231783 -84933 -98131 146500 150648 21811 -213015 -271945 -164011 -208829
17143 -208829 -525533 -408114 -94307 -2019 -3770 -62290 -120168 -86539 100890 202218 154356
17132 154356 13326 -105675 -4676 196655 32324 -332488 -554199 -474321 -312080 37702
17122 37702 114248 54049 -105961 -308927 -221343 15924 196560 132769 -23181 -288182
17112 -288182 -446070 -431880 -435539 -414587 -268708 -278385 -426249 -563271 -637543 -389493 -98702
17101 -98702 -27394 -303415 -491462 -517259 -420998 -359575 -318881 -318814 -312027 -366729 -458276 -482223
17089 -482223 -639623 -383965 -301404 -296615 -307851 -380649 -232971 -203966 -320453 -448753 -437081
17078 -437081 -447976 -409396 -474336 -247334 -260662 -173204 97483 -67708 -342133 -292369 -233222
17067 -233222 -187924 -363377 -463986 -328860 -165570 -82264 185599 148087 -76305 8174
17057 8174 104665 12202 34995 -24826 72074 275630 171788 68701 5447 68256 -77249
17046 -77249 -387587 -327514 -458990 -476908 -485736 -363728 -304921 -240298 -141166 -144311 -27894
17035 -27894 -29028 -171992 -56502 -63723 -124485 -214610 -269364 -136357 -84025 -171288 -20926
17024 -20926 -98308 -325760 -291301 -287080 -191032 -257237 -387028 -386660 -185097 -261215 -529194
17013 -529194 -545854 -377411 -379661 -288264 -321364 -502863 -414024 -494856 -635152 -384309 -153348
17002 -153348 -131018 -251037 -198612 -104310 -2878 -60724 81568 113998 172872 318568 211322
16991 211322 -148528 -19168 239100 81260 -101769 -249408 -287284 -19100 -126440 -243946
16981 -243946 -232754 -206200 -318817 -431968 -275339 -197378 -194958 -329147 -463044 -399872 -211747
16970 -211747 -295228 -306271 -305487 -295178 -285827 -215507 94551 276200 410176 255046 -4993
16959 -4993 -199739 -21098 -72058 -334485 -234384 -25153 84785 254116 184981 228012
16949 228012 86142 113691 151488 232380 261463 480401 859102 885160 1037803 1288426
16939 1288426 1627736 1509134 1419350 1187531 912851 716760 535793 382295 205066 190767
16929 190767 374038 187424 -65737 -325497 -212347 -78797 261114 71936 -89887 -140564
16919 -140564 -120073 -53653 -238398 -328781 -243036 -230899 -188199 -49697 -122852 76026 181911
16908 181911 61162 323602 230805 105402 -15541 -81268 -112408 -42082 89649 -84640
16898 -84640 -280234 -322903 -331680 -90114 -54073 21583 -60003 207540 342323 414699 868626
16887 868626 1250132 1314854 1164596 1193011 1360307 1186280 1058103 982945 738507 529916
16877 529916 493326 442262 190079 -2589 14824 -63278 -261470 -446681 -459351 -481053 -480532
16866 -480532 -374015 -326531 -261201 -91995 -204344 -234111 -63110 30931 -198874 -242918
16856 -242918 -351962 -292341 -149639 -57859 -85387 -294141 -200311 47675 -86769 -5309
16846 -5309 -1940 -171982 -191584 -184007 -334449 -269186 -303011 -219938 -127616 -223431 -407919 -556125
16834 -556125 -478056 -413738 -225329 -103690 -66695 -256802 -328825 -346439 -400743 -383381 -487361
16823 -487361 -604340 -734417 -780236 -586608 -307480 -190714 -283640 -421407 -348036 -235723
16813 -235723 -132461 -195669 -121748 -129761 -119820 -170159 -175271 -284754 -402525 -293311 -203097
16802 -203097 -301552 -529490 -466190 -366824 -163008 -397173 -587508 -483151 -468134 -215793
16792 -215793 49949 -142111 -146075 -184703 -381274 -444055 -561300 -649442 -512163 -418698 -447625
16781 -447625 -339700 -107171 52408 -348192 -437252 -462913 -505643 -526484 -452909 -431244 -289635
16770 -289635 -190324 -120152 3160 238572 53464 -89051 11393 -39984 156058 145891
16760 145891 -94333 -264116 -62506 -29505 -243358 -397518 -212326 37310 130244 46923
16750 46923 -4673 8405 62968 124941 -114534 -195403 -132382 -39556 5714 -9942 115819
16739 115819 287245 80798 -124702 -386372 -432893 -416255 -354106 -102510 -63621 133785
16729 133785 127484 167181 -75500 -385695 -449213 -207665 -208924 -429172 -399835 -608030 -818635
16718 -818635 -732345 -596512 -588821 -454755 -212122 -143889 -75624 -108224 -306499 -326710 -429996
16707 -429996 -363322 -235661 -271341 -420210 -395173 -280223 -227253 -98213 -120821 -23491 210602
16696 210602 185050 329010 538264 395723 179010 198936 296119 364482 296401 389557 318704
16685 318704 139195 110258 209225 60602 178398 264271 75153 -84248 19188 38777
16675 38777 -90927 -231664 -431140 -489613 -30643 125853 25739 -16299 -134820 -431920
16665 -431920 -508376 -397306 -114942 -132463 -21201 -26240 -107039 -174730 1305 -20460 -126435
16654 -126435 -541293 -561366 -430377 -220814 -69828 83803 -17607 -120555 -55134 -45057
16644 -45057 -215918 -553121 -626225 -519532 -699736 -745539 -636391 -321111 -270846 -323912
16634 -323912 -316722 -340655 -259483 -10619 128910 102669 264269 309376 213992 -67912 53782
16623 53782 84950 14146 87905 200265 124720 -115152 -326394 -488570 -320147 -366362 -504762
16612 -504762 -790897 -904943 -664178 -370758 9037 65288 -129764 -126684 14607 178428
16602 178428 194214 127572 -63463 -220576 -63725 21072 169116 -75276 -52083 40996
16592 40996 -87006 317927 625042 463657 12352 -293444 -514857 -684051 -420767 -189638
16582 -189638 -25437 92240 29115 -64534 -11184 -132203 -356771 -518146 -608448 -604293 -490421
16571 -490421 -228992 -153525 -225609 -80335 -169362 -233182 -120689 37093 -51805 -170836
16561 -170836 -510297 -631668 -594297 -465692 -389707 -333994 -426516 -545342 -241428 -40294
16551 -40294 -96469 -173775 -54161 -143412 -324763 -438938 -396095 -334057 -259972 -262305 -246785
16540 -246785 -232374 -156978 -137060 -118388 160427 137999 -135386 -326747 -206974 -268086 -234279
16529 -234279 -180229 -402407 -530041 -438819 -395294 -369209 -273194 -291185 -647955 -596701 -317379
16518 -317379 -278599 -260784 -309634 -265147 -4613 80369 179201 140000 10710 93863 244558
16507 244558 135214 -29619 -345526 -360027 -337421 -270291 -247591 -212045 -59288 208226
16497 208226 258230 279947 77971 -132420 -312721 -521637 -497517 -337378 -183408 89377
16487 89377 63121 89338 211278 199816 116637 -19632 6327 -86841 -385084 -483993 -376189
16476 -376189 -318549 -432690 -533146 -523424 -358299 -532449 -650395 -552829 -300915 2120
16466 2120 -252003 -347755 -370407 -176441 173380 165724 -82269 -220668 -156003 -91803 -140172
16455 -140172 -101580 -99331 83386 389705 445233 149336 -60871 193880 52540 150493
16445 150493 144354 -116811 -510280 -407411 -290479 -474202 -350081 -207116 21421 92833
16435 92833 -102790 -220201 -104824 25769 115835 112967 4887 140555 247264 179959
16425 179959 183043 92446 96580 117792 -349766 -356012 -195574 -198238 -92016 -74762 -204542
16414 -204542 -163882 -151268 -138658 -122087 -207125 -39381 26907 -210897 -356700 -433693 -474521
16403 -474521 -581071 -555107 -674697 -519661 -226131 106400 100641 -61015 -144365 -297595
16393 -297595 -469213 -424414 -354070 -373345 -382644 -273458 -50811 262911 187423 -24320 -148651
16382 -148651 -114931 -247796 -439173 -377550 -170155 -210184 -286486 -334284 -8754 210054
16372 210054 474412 284480 -178921 -364753 -254420 -151350 -18995 137256 169199 -30693
16362 -30693 44468 198651 15657 -4406 142846 78970 33665 -67441 -145129 -91680 -59018
16351 -59018 -239432 -241753 -5085 -33395 -236043 -274063 -171793 -135575 2908 171663 74367
16340 74367 -27124 -118274 -107467 -7495 -200203 -341422 -444237 -386009 -291731 -141705 -113465
16329 -113465 -255695 -381929 -337877 -93821 20065 33497 -54353 -311332 -361276 -84097
16319 -84097 98528 144053 19272 -239892 -582052 -559381 -395279 -302220 -490622 -365823
16309 -365823 -212335 -263728 -288876 -386341 -270386 -214880 -27314 -107600 -225112 -190068 -254216
16298 -254216 82616 226777 60352 -199320 -250071 -143171 -2919 214836 376259 258056
16288 258056 -84530 -145675 86960 96136 -139201 -162118 41502 -28872 15397 176220 296552
16277 296552 193568 16147 50354 193098 268868 -31970 -111090 -142850 -291677 -183459
16267 -183459 -182162 -51693 -167658 -242385 -534310 -408238 -263480 -304456 -355550 -351820 -290902
16256 -290902 -269594 -129110 -53329 -272658 -357839 -275582 -378413 -374351 -139909 -259529 -361965
16245 -361965 -211653 -208540 -306669 -284968 -343113 -77761 82113 -128324 -96791 -100730 -144399
16234 -144399 -331780 -56303 109150 -50072 -55220 -29705 -23388 106811 -24478 -286852
16224 -286852 -294107 -287757 -250231 -20719 -194219 -270072 -315732 -250213 -330911 -416171 -409193 -255558
16212 -255558 8022 -70024 -101491 -107968 -328666 -314551 30943 217835 74110 65034 137734
16201 137734 165516 240901 263933 139217 295663 288763 171946 -3043 -76904 68640 -147991
16190 -147991 -170913 -9550 54077 -26584 -68532 -28288 76600 308565 345594 417201 125725
16179 125725 88615 277112 231585 106803 139528 306103 270870 147599 -128418 -191693
16169 -191693 -77512 71130 198354 181623 230078 238251 103190 -143773 -207705 -208909 -70304
16158 -70304 -49493 -93407 -250305 -230733 -136967 -270835 -78483 186690 126537 -180227 -339491
16147 -339491 -385538 -406787 -211954 -50083 -80072 39094 51677 73563 82459 -98502 -345357
16136 -345357 -291202 -162706 -27803 -101706 -9180 -23196 74052 13241 -147350 -569593 -457682
16125 -457682 -284014 -10350 41344 -164712 -482273 -580326 -503873 -234450 126676 220087
16115 220087 109468 -76906 -161530 -48139 -66668 -35268 -143892 -55005 -74299 -266960
16105 -266960 -257004 -321538 -311599 -266892 -339786 -271870 -183522 -128975 -20652 70541 -51096
16094 -51096 -87599 40861 310344 324738 118412 -126397 -225341 -125683 -246347 165997
16084 165997 502972 413606 369981 181050 185261 289555 376420 295190 43846 -117481 -69203
16073 -69203 -130981 -42684 -53486 20802 142558 97438 -86590 -404183 -443322 -355568 -324802
16062 -324802 -125070 -125758 -300210 -83533 -233393 -260598 105627 410815 179783 92307
16052 92307 -5041 -120201 -225977 -284680 -282660 -15634 97873 3652 -108123 -70002 -29053
16041 -29053 -145590 -566071 -605365 -460422 -223420 -123959 -117237 -122940 -20885 -59234 24268
16030 24268 236131 157018 -29005 -222726 -317999 -257884 -264575 -279171 -390543 -478410 -452161
16019 -452161 -359046 -203909 -204041 -83184 264420 106799 -160845 -294051 -45546 -10580
16009 -10580 -844 -47709 5840 192816 54082 -180604 -360282 -188817 -218406 -578505 -655078
15998 -655078 -556339 -388639 -145799 -100832 -387638 -409916 -331971 -443410 -519359 -398094
15988 -398094 -371199 -262512 -79806 182442 268007 273112 219243 -156308 -296587 -55907
15978 -55907 -97871 17102 271709 222247 27000 -59948 -242384 -54471 82954 -1928
15968 -1928 103626 -203318 -364428 -192977 -84689 -77125 -111691 -127736 78092 192981 222859
15957 222859 39884 -129264 -335256 -363628 -288212 -362989 -387690 -149235 107381 189825
15947 189825 73009 259802 326105 395469 302246 182954 -25179 -146336 -190060 -291321
15937 -291321 -292188 -153500 -106517 -16744 174685 480018 274864 40841 -134667 -179906 -94308
15926 -94308 -32148 -13403 -67643 152685 266693 134259 -42810 -181141 -270954 -201894 -36157
15915 -36157 -200857 -213391 -74409 -46258 -46929 -129767 115455 184459 -40295 -190816 -118960
15904 -118960 48607 284946 133003 -84025 -290141 -242394 -110714 210200 166885 431773
15894 431773 516884 364500 217908 30826 -56278 -238726 -409957 -565558 -573206 -631608
15884 -631608 -512447 -518868 -656112 -397428 -183960 3551 73062 -66703 -131480 -189454
15874 -189454 -160120 -93847 -205641 -431994 -413871 -310129 -297740 -332981 -296954 -253105 -19373
15863 -19373 -81440 -390203 -447474 -259347 -165665 -63840 202419 224112 -12656 -151145
15853 -151145 -154740 -339150 -384148 -551971 -449912 -114852 -22837 -97216 -289573 -305274 -115166
15842 -115166 -102059 -358716 -759261 -580324 -444491 -391713 -339701 -319120 -311889 23034 257332
15831 257332 385778 327770 259260 67783 -199205 -191211 -9324 -11072 -125183 -153615 -247144
15820 -247144 -330215 -575211 -577720 -433159 -254959 -1716 -152134 -83840 -23441 -103562 -290518
15809 -290518 -272140 14453 285495 137754 -124551 -48186 12702 5056 126831 51842 23874
15798 23874 -17783 56042 9986 -60055 -4223 -284323 -359551 -382809 -291120 -148639 72285
15787 72285 -113403 -31549 180717 33900 -62326 99187 87422 119945 92658 228622 320631
15776 320631 84859 1179 -8861 441011 445486 81037 -267503 -204509 -186736 67765 238228
15765 238228 106180 47751 -108433 -44075 19713 43756 103593 -117523 -281692 -259217 -291834
15754 -291834 -271583 -141248 -205448 12637 199571 178620 153563 -7514 -44323 -167137
15744 -167137 -203180 -434949 -423682 -409423 -373241 -369389 -107489 -73549 -184522 -133474 -143351
15733 -143351 -209293 -251560 -74810 -33169 -168169 42102 147923 82347 -126929 -256703
15723 -256703 -322966 -357699 -511033 -208496 -56510 154136 198199 39971 -38305 -118472
15713 -118472 -136845 -93761 -41054 -13568 111710 14983 6473 -18214 -17506 162474 59316
15702 59316 29751 25989 -77332 34392 108057 -75658 -240619 -194017 -117560 -202803 -138100
15691 -138100 36229 314304 348009 37362 15403 144450 122532 107431 59140 -17369 -56939
15680 -56939 32262 194488 313119 30183 -66981 258789 300958 208856 -55832 128891
15670 128891 155581 13059 -212067 -127484 158947 90312 -219188 -261036 -14051 174668
15660 174668 168348 47021 125560 183807 58448 -138573 -129267 107849 411542 452232 597909
15649 597909 791289 817360 754149 594871 422289 136001 -214089 -195056 -95972 -2005
15639 -2005 -222812 -247468 93928 210038 -54003 -164969 88977 388138 183844 14081
15629 14081 -220265 -373862 -12971 349755 512253 841253 956831 1025342 1100647 1010291
15619 1010291 908637 716711 375537 275271 359951 532282 387311 207594 186397 139744
15609 139744 332596 121840 186869 141046 161222 119119 294414 39179 -8102 243440
15599 243440 311231 284754 415983 524955 639831 597466 561030 368573 272876 253612 341630
15588 341630 281680 252572 491121 534617 329034 324134 399297 530795 475002 206109 93119
15577 93119 46482 -9091 -117467 -137806 -404590 -307107 -73773 197650 281580 325169 275432
15566 275432 156919 379985 499239 359928 229126 93056 230937 196957 46468 48970
15556 48970 -54233 44437 244658 454921 450854 213962 -59067 -89711 -52189 225115 355236
15545 355236 215702 103449 198495 252614 -81844 -219245 -118387 -73849 165601 243126
15535 243126 74328 -44525 -241442 -420332 -354503 -389452 -95173 150618 161677 -118974
15525 -118974 62754 252188 330522 516484 551869 482570 244514 242762 214380 140697 161432
15514 161432 277575 306881 188988 305987 389580 313386 349382 530378 539097 462533 341063
15503 341063 168066 -84034 -196311 -18152 106304 120070 160553 72033 65777 -106661
15493 -106661 -559434 -413933 67720 363005 345180 325612 242595 286641 401080 195352
15483 195352 -24723 -142611 -46801 170318 131177 -17520 -19418 200608 203308 -22390 -152474
15472 -152474 -107099 18401 -189788 -157764 2425 345398 427344 322300 140653 -132557
15462 -132557 -264437 -241763 128689 -104338 -208510 -216384 -422679 -407692 -2030 212410
15452 212410 228676 216806 311621 92580 97600 -48654 -45555 186833 361000 32108 -51834
15441 -51834 -342324 -469576 -164669 -47467 63639 39909 159074 145456 42709 74004
15431 74004 165263 37850 101506 -1982 49120 246442 247177 214619 -4644 10898 161995
15420 161995 304939 216306 43905 124550 27638 98025 173061 313027 410457 433874 357163
15409 357163 -10770 -259431 -193858 -206347 -402 18279 -94575 -114002 -230020 -357894
15399 -357894 -377278 -227462 32115 183223 -57355 -200484 49344 50241 -19450 -55763 5557
15388 5557 227404 422062 251904 276334 305519 165432 391608 432621 264596 -123366
15378 -123366 -205537 -208371 -148232 4793 -1886 199608 435072 363093 254273 -36867 -140261
15367 -140261 -293974 17243 360860 344537 64499 -118299 -7610 152111 171497 205954
15357 205954 -80602 -319787 -446897 -512033 -124222 43858 -15777 63277 246121 207980
15347 207980 24313 -44051 160597 187156 -35587 -94277 -49346 -69151 -153116 -96234 -164362
15336 -164362 -234515 -198331 -127066 -263461 -450585 -246622 -53116 28395 87331 -75829
15326 -75829 -79005 -51911 198691 364896 419828 214692 305518 289414 339943 375114 260323
15315 260323 178044 235363 120374 199030 227541 101770 -165024 -299395 -192837 102990
15305 102990 438211 642054 689968 502358 289408 488228 624587 501263 537963 468287
15295 468287 387461 352347 682663 748850 617264 573061 550372 435390 541027 690813
15285 690813 482146 319311 252315 233618 331055 211564 415674 369420 312730 345991 344054
15274 344054 588648 671842 658495 766903 573872 663689 887274 1045618 1022816 1335049
15264 1335049 1359680 1227250 1121048 1083190 1035612 1067164 1172618 1450750 1342004 1335440
15254 1335440 1363750 1504134 1498615 1522992 1737232 1970813 2252885 2513734 2920058 3418880
15244 3418880 4229758 5146392 5997422 7297601 9226455 11790167 14928025 18548195 22169727
15235 22169727 25767851 28614680 30175454 30605902 29447222 27053987 24264577 21216364
15227 21216364 17879124 15192705 13282338 11670900 10624553 10149650 10028503 10132237
15219 10132237 10771952 11456701 12379913 14111029 16723237 20187885 24977708 30876072
15211 30876072 37533365 44822301 52206669 58310527 62165725 62806616 60554321 55730380
15203 55730380 49291823 42010483 35054808 29114734 24550750 21068073 18590476 16865073
15195 16865073 15653135 14925869 14810010 15125667 16013828 17688768 19910311 23023053 27402414
15186 27402414 33047157 40556447 49995082 60483647 71339622 81383886 89300161 93732433
15178 93732433 93584878 89423154 81851659 71939439 61256315 51351650 42848495 36063761
15170 36063761 31034192 27200803 24562203 23295487 22657225 22733603 23427200 25016620 27755421
15161 27755421 31801789 37109716 44612873 54667752 67493937 82348002 97862572
15154 97862572 112270296 123319220 128769550 127765201 120639971 108484501 93487638
15147 93487638 78310049 64541548 52798074 43615836 36801160 31999662 28507385 26239869
15139 26239869 24814781 24098413 24000978 24435528 26086691 28676731 32733278 38507673 45821390
15130 45821390 55011479 65468015 76069249 85495210 92557601 95800824 94669252 89531437
15122 89531437 81226822 70844861 60103388 49986907 41158449 34089909 28730606 25076773
15114 25076773 22332869 20397959 19007645 18034095 17405575 17184269 17537690 18837588 20735419
15105 20735419 23559709 27623259 33039503 39649663 47308092 55094868 61700256 66051783
15097 66051783 67496510 65818785 61027402 54068388 46303377 38644075 31897656 26694548
15089 26694548 22879464 20236728 18272825 16814639 15564020 14638993 13725681 13224678
15081 13224678 13164521 13563339 14347653 15794098 17792193 20620090 23897776 27132431 29958832
15072 29958832 31960971 32673242 31859295 29705736 26553547 23059602 19586576 16323786
15064 16323786 13715076 11569187 9934977 8990151 8068313 7208114 6455177 5821541 5319558
15055 5319558 4580573 4103014 3720177 3258470 2856073 2411365 2209437 1931835 1693689
15046 1693689 1506604 1414548 1295818 1297669 1266888 1404873 1597459 1660962 1558981 1574227
15036 1574227 1418997 1568599 2167869 2691777 2931303 3151456 2995895 2733568 2258915
15027 2258915 1839575 1859225 1645919 1358965 1005249 815754 842362 1002385 819989 614856
15017 614856 670730 780751 838134 756503 1102985 974272 956335 1156652 1011369 924100
15007 924100 927849 722757 850685 876608 790668 942820 874179 921857 792922 808707 653477
14996 653477 358262 383117 588559 380231 180156 56917 177306 307304 167428 -110332
14986 -110332 99421 427496 210327 200953 -3467 -297822 -198761 221506 367341 505660
14976 505660 407085 147170 174927 265951 134504 130359 217896 492821 536606 430309 276581
14965 276581 375274 428506 417241 229310 -62459 -162649 60671 199994 171342 54891
14955 54891 172652 298521 453397 223264 144646 219459 193782 245599 282058 427897 249672
14944 249672 44299 14242 -57268 -64570 -31012 -197225 -214047 -211074 -133729 -257670 -189133
14933 -189133 111999 166020 100947 119495 159474 -30836 -97602 86790 19236 108463 137225
14922 137225 73266 223082 56748 48622 275308 306612 -46670 -221131 -94441 -389005
14912 -389005 -403520 -631 226399 121244 220795 78226 -238601 -162034 -82317 -77452 89093
14901 89093 246600 126545 -12812 -31740 230251 334154 212648 123707 16187 68671
14891 68671 132964 365006 534620 517725 183530 127557 36645 54630 21950 -18663 -144482
14880 -144482 -222613 -71664 -117883 -76219 7682 -40522 -104557 -180907 -33997 103627 153248
14869 153248 -46735 -9668 134361 271929 162038 213423 212622 66351 -167123 -214090 -155528
14858 -155528 39975 211579 316766 203749 127322 79751 57944 39897 142850 -152323
14848 -152323 -273137 -199692 -93494 -4898 -85816 34193 159708 28783 -89932 -57979
14838 -57979 101346 270008 249159 78486 106229 234366 276888 83586 70048 -94074
14828 -94074 -112640 34823 128674 -59091 -184652 -44955 170741 112639 -43334 -149932
14818 -149932 -24546 98743 142796 79689 -91516 -49747 246482 294271 62185 -69836
14808 -69836 -90275 -69838 -98668 -205875 -247001 -177377 -118127 -80453 -70363 -85436 43816
14797 43816 50201 169818 207481 259114 199484 121492 110309 185228 142937 43628 68734 178020
14785 178020 423386 130220 -144693 -297487 -90017 -38794 -27158 -143121 -184441 33047
14775 33047 -161608 -243142 -184060 -18457 15496 -27147 180180 203195 149626 -51512 -12844
14764 -12844 103929 85749 113705 166551 111681 29930 50468 52342 75093 302028 404558
14753 404558 592854 663767 420671 510986 550118 398935 444223 357831 108086 -12334
14743 -12334 -88738 -126528 -303540 -202202 -142339 43808 358192 217610 183980 315461
14733 315461 366544 258780 339501 281424 243622 322238 271295 140376 65429 -86634 -177203
14722 -177203 -190805 -32040 149107 109521 -124495 -174918 -140899 54777 125241 213697 246058
14711 246058 114860 129650 82065 146944 259460 502145 481244 362835 302627 276092 255080
14700 255080 189256 252870 344134 424232 261133 233023 132883 -254323 -253431 18871 152624
14689 152624 333 -9056 -17708 -17115 -16684 27968 50102 186246 383911 548217 532128 383351
14677 383351 539853 524528 329908 444882 583102 499665 263149 196024 -132940 -547768
14667 -547768 -633131 -385323 -41324 12669 -19252 74907 -53118 36121 -23194 -54780 254760
14656 254760 136081 -68932 182346 296154 337719 487774 478395 401424 442820 568820
14646 568820 629719 585268 482666 372677 272908 141583 179292 167376 262228 246991 138560
14635 138560 -90111 -128934 113320 199692 222264 9597 -34621 144301 262468 258389 492808
14624 492808 679226 770734 647695 646015 541781 368238 247275 223242 161085 164293 130817
14613 130817 79187 77417 41078 110760 -149498 -284515 -111105 80367 -223802 -401085
14603 -401085 -23009 328497 240674 266029 292554 132662 355586 471844 413483 -109284
14593 -109284 -421258 -368583 -225472 -302073 -155779 -75748 -17386 -138710 -272491 -211547
14583 -211547 -167669 -217594 -189774 -212386 -184289 54217 39922 -56860 -3343 104180 225164
14572 225164 276538 74555 -49254 -66253 -414173 -255704 195340 52026 -158807 -97264
14562 -97264 -11159 120832 44585 -50677 -190117 -230082 -275529 -150389 -173486 -7977 172277
14551 172277 -2154 -81654 -144486 -69740 -72268 -359283 -243154 -38511 -149247 -138033 -274416
14540 -274416 -219925 -309000 -110171 244493 66075 18022 34922 54732 23352 11602 -56191
14529 -56191 -275557 -182844 -106169 -54684 -189392 -160233 -119458 -197439 -152203 -48026 -80452
14518 -80452 -113809 -245443 -367192 -146081 123204 35279 -78463 -251328 -135946 84093
14508 84093 273840 192802 144617 274290 336182 216708 266216 296609 17939 25395 -52817
14497 -52817 -193330 -368925 -492599 -178954 79387 -52664 -297863 -219575 -140602 -166882
14487 -166882 -210387 -141077 84411 12396 33527 99985 -79968 -111801 -127536 -340351 -90946
14476 -90946 126367 228417 248994 237135 120799 204812 -34091 -132935 42202 57789 -38763
14465 -38763 -127220 -120920 2633 205283 131177 212258 380122 157075 -4887 -270672 -153489
14454 -153489 -155512 -177358 -207493 -148860 -139168 -152754 33391 247792 234031 -7061 -93752
14443 -93752 61040 -24245 -134348 -119835 66684 150444 158540 74076 42028 274920 482139
14432 482139 442141 302103 63583 156938 59491 52775 -228668 -402863 -264874 60684
14422 60684 39770 176144 77853 37952 -33588 -65853 5983 134150 216365 262123 298206
14411 298206 523853 439203 214754 223611 140185 49936 73030 72929 -1691 -84056 -182465 -220513
14399 -220513 -208682 -204731 -89757 -212723 -56535 136766 116443 213849 291485 430154 505334
14388 505334 261023 114722 169151 213085 320217 137417 -113770 -78085 -92637 -45753
14378 -45753 175036 126688 -68232 -175992 -302179 -111804 316169 195346 -112549 61652
14368 61652 49588 -24831 -34760 54203 212518 200470 128538 114435 -37677 -324746 -636064
14357 -636064 -650862 -421947 -192042 -202224 -224331 -221769 -75649 152545 130853 166101 153191
14346 153191 283754 74245 -181953 -222985 -201521 -355148 -326180 -102974 -54384 -133076
14336 -133076 -81143 26364 35210 4311 -132883 -121952 -253499 -450911 -330005 -1015
14326 -1015 38252 -123117 24423 139501 238627 33112 -218982 -177150 -38758 -102719 -278706
14315 -278706 -499306 -374521 -158319 -24719 -34833 72533 9717 29899 144666 -113302
14305 -113302 -394235 -221178 -100326 -248281 -245273 -89505 -103438 97354 297820 144762
14295 144762 -217446 -499986 -530276 -655444 -517100 -318943 -353154 -466279 -524291 -491379
14285 -491379 -375467 -113262 244641 203636 224922 312512 347129 295367 194033 144310 202484
14274 202484 140886 -49984 -138508 -100658 156697 185962 141337 104512 -28551 -155434 -237742
14263 -237742 -284937 8830 208698 -116606 -229362 -147712 -297872 -416668 -391008 -287698
14253 -287698 -43899 154638 136912 245637 163440 44022 -44744 -110717 -187937 -288122
14243 -288122 -328695 -123218 -81453 -214550 -229420 -115840 -160690 -127910 -43389 125228 168721
14232 168721 42277 -88245 -205430 -354870 -330301 -428845 -387683 -90105 -91057 288402 165583
14221 165583 263953 412749 337121 340274 98489 -58573 118708 222292 -71088 -91005
14211 -91005 117122 -35836 -133954 -132081 -259752 -102525 129932 -11490 -14727 -90696 -122116
14200 -122116 -121951 383 -134850 -113312 157216 128879 48676 29150 -34593 -171164 -191568
14189 -191568 -141084 -182495 -129760 -64672 -95094 -37289 -188409 -176390 -161996 -28655 -256788
14178 -256788 -360804 -391478 -293316 -249589 -48555 9078 -226923 -400087 -348773 -335500 -293543
14167 -293543 -307214 -334207 -206249 -207227 -53708 328187 211329 -126307 132638 437483
14157 437483 562206 385800 455927 335291 56773 -126852 -97716 64219 -38772 3236
14147 3236 88824 -94068 -192752 -123850 -116667 -13815 -91103 -146031 -82550 -278033 -345613
14136 -345613 -298573 -115903 -206326 -355826 -187914 -44762 -68812 -214639 -401214 -179253
14126 -179253 -79895 -116825 -246531 -36662 -151634 -525277 -566554 -297901 -147994 32839
14116 32839 191086 112983 126723 267954 412684 26658 -182423 17605 190546 418724
14106 418724 6281 33778 110218 123043 137462 243439 168797 -108853 -264577 -302143 -210858
14095 -210858 64303 139711 -148176 -275331 -146042 -154135 -247356 -169860 -115862 252783 504142
14084 504142 251073 141127 114977 253508 226396 288531 370794 231127 -14122 57980
14074 57980 181932 260907 42065 20824 190235 205005 309044 244419 225841 93175 -198413
14063 -198413 -271983 -243902 -169094 -156907 -166761 -29650 -183455 -274362 -311446 -406324 -379908
14052 -379908 -240158 -166515 -351178 -275158 -174199 -361005 -338513 -460633 -434802 -153162
14042 -153162 -127705 -12 -119893 -447446 -585130 -448989 -522163 -423905 -318034 -215252
14032 -215252 -192710 -202960 -214019 -163649 -217245 -144300 -449215 -577673 -436062 -272166 145290
14021 145290 151497 30416 -111642 -95381 -157750 -274251 -106878 -172745 -125559 115449 80636
14010 80636 155038 166923 18636 -256499 -286718 -206956 -265503 -207884 -147066 -263975 -319576
13999 -319576 -40362 89674 -146915 -535683 -530942 -330578 -229148 -234866 -170425 -125664 -53426
13988 -53426 -215876 -461060 -557340 -493822 -304324 -233302 -399783 -347450 -225405 -27543
13978 -27543 -12326 -250956 -221635 -511141 -553683 -274255 -160030 -105031 -296252 -460449
13968 -460449 -427641 -309743 -124950 -44040 -97590 -232090 -16990 -155781 -111021 -33995
13958 -33995 276701 300530 294541 210815 231257 185141 247597 102470 -152484 -148781 97281
13947 97281 213999 10103 194632 396813 249851 -116441 -164630 -63314 -165752 33550
13937 33550 247320 -29151 -200466 -277849 -222703 34317 -25537 -50209 -73612 -270289 -356755
13926 -356755 -75453 -185070 -226933 -334778 -304430 -182619 -23550 60847 90948 -137972
13916 -137972 -256226 -218346 -40329 -40371 -119501 -133822 -57468 -199564 -246647 -206928 -142802
13905 -142802 -143121 -166029 -32551 184757 79152 11589 206043 204253 192037 9766 -285826
13894 -285826 -356735 -245555 -111769 -1012 -156526 24635 214327 -52330 -94761 -100968
13884 -100968 -228920 -162639 -51916 170642 121711 97197 146417 61215 -15531 -84447 98252
13873 98252 223468 158076 207942 31316 -215027 16974 2903 52390 134592 -44721 -110987
13862 -110987 35463 130923 20198 167488 45930 -84931 -21280 -191471 -106647 69514
13852 69514 216634 118890 126843 -122093 74403 291614 365834 343227 218869 133012 318528
13841 318528 193505 88044 71341 112393 152949 126189 29773 23843 175655 306542 249007
13830 249007 192790 165927 191859 209798 78772 -170121 -335005 -480476 -335605 -228714
13820 -228714 -346923 -271433 -54973 -52736 -253852 -379412 -195319 -77629 54465 201881
13810 201881 110050 186779 156447 132603 23723 124254 103355 46914 -110253 137683 45640
13799 45640 -12484 -189489 -209051 -120139 4828 -45492 -16421 -119621 -18098 206679 131939
13788 131939 10570 281453 567161 755608 821348 727198 531414 536126 515742 256302
13778 256302 38740 -92638 -199919 -125580 -20896 15671 216926 439526 334484 252615
13768 252615 162598 326041 272764 145701 30559 -176903 -418237 -63649 141093 209475
13758 209475 90603 56886 -33155 -186791 -125675 -41022 102603 102095 146718 425910 584390
13747 584390 364656 313299 437672 423903 604393 944280 1328519 1467420 1121351 753057
13737 753057 518668 575781 313410 161425 291717 87830 -25843 47376 95228 212322
13727 212322 -29603 -280276 -72213 -68279 -98453 219628 146338 -233423 -238724 -59363 136370
13716 136370 -25124 -154718 -219567 -87593 -16607 1658 139846 126196 135042 113054 169684
13705 169684 142574 401896 296214 322622 439875 582461 757952 922090 1219851 1299245
13695 1299245 1171255 1135034 865343 592591 533815 337690 119790 -15404 -33587 5889
13685 5889 10358 -72687 -217769 -200512 -173170 -57688 37248 -37154 -2194 -144046 -219762
13674 -219762 18219 276596 183517 3456 -16452 55721 209352 267666 46481 -197591
13664 -197591 -321749 -270845 -84160 176553 198724 96556 274214 232188 -95630 -185598
13654 -185598 86707 539503 580522 483684 667341 688072 342229 234042 94509 -289807
13644 -289807 -440783 -353906 -249514 12418 839 -277303 -281262 -9951 -8297 165900 204525
13633 204525 -15473 -69032 123584 254368 321566 169751 104825 231919 168150 77
13623 77 68634 67255 247503 117534 -206768 -104614 10889 -64821 81792 145498 -18329
13612 -18329 -100464 -143966 -4027 115759 309682 558814 530834 191905 -58688 -85914
13602 -85914 -134692 -272537 -387139 -311122 -204659 -58714 -63808 -86272 -144689 -192277 -131695
13591 -131695 3879 -160588 -275903 -140752 67239 157650 291948 161391 34487 8717
13581 8717 85843 -114336 -268090 -116288 -478 -90650 -67166 71581 -39606 275810
13571 275810 545692 185710 51502 -60035 110743 209988 67196 -74126 87343 33129
13561 33129 80890 54510 -278008 -325224 -116128 -32178 -100758 -40922 -189987 -220357 -206853
13550 -206853 -218978 -124616 -21825 -279517 -182049 -125735 -47264 32100 196305 347338 334255
13539 334255 367568 -11593 -117490 -36428 -63380 -80963 -128261 -152774 -219592 -318354 -159626
13528 -159626 -35333 48541 266230 188337 -109078 -75890 73761 178577 128402 137543 112411
13517 112411 206161 196596 149699 241643 380036 71269 102685 310747 217628 -21617 -297254
13506 -297254 -358350 -475408 -448449 -346495 -417174 -334289 -290941 -132916 -22680 38309 173440
13495 173440 185976 -57854 -120487 128862 274727 297942 339801 270542 213515 193767 220362
13484 220362 126237 101920 265961 411541 668757 881888 841545 920510 756300 727150
13474 727150 715279 672347 406692 241683 67562 56060 14466 -135303 -87890 51374
13464 51374 315717 335800 83597 51635 340288 502241 529900 584465 701539 732604 515744
13453 515744 274250 627691 806891 852491 791765 665846 603420 708525 668461 521768
13443 521768 411503 442036 645536 663891 528931 712264 720118 467775 179388 -21284
13433 -21284 -27193 276400 374134 429158 502346 617667 813059 721647 430641 330245 420817
13422 420817 764200 1016226 1008860 792032 700216 863066 819212 665464 710887 509672
13412 509672 374016 458473 587607 717676 640057 529423 538429 548679 671710 522604
13402 522604 626648 695431 922383 989755 997061 725559 501405 462454 590601 629243 308382
13391 308382 214230 314429 315334 416371 617755 619050 679883 699241 683120 545374 609964
13380 609964 717303 796111 615583 510775 560882 534617 421598 654331 746473 759230
13370 759230 756263 713146 537942 338994 156941 310665 405231 186506 105384 300211
13360 300211 30749 -132157 219821 495291 455314 245676 285678 248615 188191 121795
13350 121795 168771 226036 345564 463301 563521 443114 482396 515367 379752 256519
13340 256519 392824 503121 591042 719882 705103 629515 722321 516246 418034 418329 369567
13329 369567 385934 677025 928609 847504 642644 432862 276948 199414 177811 156004
13319 156004 -47360 119008 154689 35284 89305 251541 391357 550654 460141 351972
13309 351972 484647 370450 155920 16888 76977 155797 180609 184685 239584 291831 202474
13298 202474 -9798 51964 233386 182998 81113 91308 -108288 -295088 -149067 -131911
13288 -131911 -233460 -479933 -494162 -335657 -301435 -125775 -148406 -356419 -284156 -75073
13278 -75073 -41121 113515 168041 257920 521447 556336 381973 335844 412622 341365 290452
13267 290452 418940 429309 279604 135678 -6422 -198175 -147240 75734 83802 153513
13257 153513 69345 21935 89729 40488 213574 160827 82491 189002 374225 390559 328443
13246 328443 425226 678339 648521 445680 300832 432720 501450 530155 165495 74010
13236 74010 354005 418520 274797 254366 246229 461513 510062 270371 14204 155409 346329
13225 346329 365917 400687 325028 189636 141157 260022 310284 397920 286069 -57903 -113279
13214 -113279 -16579 -145479 -280890 -473339 -262623 133053 235959 194849 245020 419800
13204 419800 356087 263549 132591 22418 -134112 -95857 86898 188292 9593 -60456
13194 -60456 157705 295724 213020 149494 135257 147472 137321 264892 332740 137249 5488
13183 5488 115078 205955 290972 374482 437900 230610 59137 114695 278458 242766 366611
13172 366611 279027 102870 40375 12869 124486 193649 352204 362668 233250 321714 481253
13161 481253 566064 648271 470420 414533 417669 406793 368937 333200 277818 418935 460854
13150 460854 481316 488445 401634 450079 292430 254280 322660 198651 150670 326910 717390
13139 717390 617201 316862 120581 116177 331915 319007 206905 396579 555677 419902
13129 419902 292375 434076 480884 254540 332011 555218 405467 542719 594103 480680
13119 480680 375142 496672 639953 546124 501889 457810 569957 619127 728854 632631
13109 632631 513142 490674 481670 484791 751948 1022613 982083 970169 933443 870773 948736
13098 948736 874638 927402 620313 451896 500115 669505 559551 464769 591344 671088
13088 671088 771757 808559 957496 986402 744929 524689 572618 699487 843409 864047
13078 864047 880066 1068876 1035371 1097217 997276 755130 716263 723403 804486 1028361 1055671
13067 1055671 1180027 1205679 1360222 1390490 1223054 1260245 1425925 1520576 1493695 1588299
13057 1588299 1991194 2364092 2347511 2573109 2505998 2622978 2712667 2978349 3167937 3207806
13047 3207806 3398295 3850825 4248305 4310261 4429397 4841935 5306757 5801730 6156650 6659630
13037 6659630 7155604 7854514 9133508 10581204 12172224 14593542 17387889 20855921
13029 20855921 25029940 30636301 37811390 46167645 55613026 65242177 74221727 81632212
13021 81632212 87158972 90014005 90216549 88040539 83331251 77165130 69916941 62147836
13013 62147836 54718692 48384076 43241255 39478168 36874037 35475279 34959566 35752280
13005 35752280 37732281 40894742 45537829 51632791 59542905 69091027 80701728 93962929
12997 93962929 107479420 120882474 133346485 144310538 152592578 157824824 159408309
12990 159408309 157793014 153398961 146190016 137605375 128227173 118506452 109083442 100137769
12982 100137769 91399337 82850271 74726593 66921184 59875340 53794666 49257728 46216219
12974 46216219 44727407 44654518 45796091 48358871 51980473 57052515 63146445 70310172
12966 70310172 77470700 83998772 90189750 95620110 99683116 102039825 103062669 102726692
12958 102726692 101116698 98335544 95945435 94216241 93623080 94815499 97677435 101511884
12950 101511884 106225326 111705477 117031415 121231186 124046845 124696080 122859150 118713988
12942 118713988 112317612 104422108 95918993 86928171 78228320 70325658 63563324 58011840
12934 58011840 54189106 52310714 52167321 53691452 56936675 62368353 69795074 78816979
12926 78816979 88851981 99760161 111426717 123212662 135235679 147896229 161137933
12919 161137933 174247788 186457253 196315670 202541438 204677821 202656072 196871430 187619470
12911 187619470 175196987 160322232 144155198 127612397 111171724 96320701 83611080
12904 83611080 73253551 65203611 58987697 54718696 51883252 50437894 50357759 51602988
12896 51602988 54920204 59982145 66608658 75066877 84313675 93627715 102697288 110835793
12888 110835793 117106782 120859187 121494289 119030347 113047828 104041653 92660667 80187978
12880 80187978 67796932 56458885 46879938 39232528 33636260 28901767 25153591 22251431
12872 22251431 20011944 18011934 16387470 14925194 13624711 12293868 11209283 10347078
12864 10347078 9504941 8799150 8263853 7773487 7211040 6779609 6499459 5882055 5390028
12855 5390028 4834873 4517978 4257840 3902885 3774843 3461749 3074808 2837452 2533995
12846 2533995 2482769 2428029 2150647 1893059 2131310 2235985 2258655 2037339 2012229 1734507
12836 1734507 1497442 1645825 1876009 2012078 2108891 2502176 2419309 2326654 2257095 2205834
12826 2205834 2188193 2448155 2482571 2397861 2223094 1883991 1689205 1656506 1635124 1655340
12816 1655340 1606604 1414529 1565235 1937259 2058789 2149196 2022590 2246335 2510038 2220306
12806 2220306 1867880 1881812 1927401 1917609 1805398 1765182 1682599 1578508 1564893 1350496 1329926
12795 1329926 1552889 1691615 1726348 1379332 1094014 1122851 1282915 1461041 1475197 1349022
12785 1349022 1357633 1186790 1151751 1210018 1290417 1169996 1128480 800818 665239 724386 749224
12774 749224 556807 664926 762200 644738 412679 548941 548260 666751 948257 996900
12764 996900 1007586 1173016 1109621 945118 915532 1001539 1004116 909080 931514 951598 1148059
12753 1148059 1275697 1278386 1374919 1484781 1494563 1531517 1130528 938588 1019783 949819 645613
12742 645613 644116 622379 473278 367312 569061 539700 370137 545114 854544 1108190
12732 1108190 976796 903513 1033659 1007218 930743 1078508 1017953 1041314 1074412 1001369 836433
12721 836433 904633 958640 806773 775748 693669 662071 692700 512014 658719 605756 305500
12710 305500 409021 520132 476807 716616 773396 617558 424357 -42889 -35763 150015
12700 150015 247390 408726 77299 216954 328373 439735 457015 637658 666846 522608
12690 522608 602629 586138 679171 665415 668769 459690 173769 -3898 65466 116125 422567
12679 422567 662141 676889 622092 540953 271989 334580 360252 279690 411329 451344 409984
12668 409984 303799 131322 50880 184753 182689 272216 226487 518875 577601 178556 19083
12657 19083 52702 -30556 113296 242069 112380 323763 343493 240656 259784 303813 347588
12646 347588 291653 237499 400233 378670 376734 599191 474769 164426 66835 77497 371545
12635 371545 492781 520444 559395 520940 356840 348698 316944 157520 -98686 -80286 129088
12624 129088 300007 379158 436610 649195 826922 642936 518417 682339 697619 425820
12614 425820 200198 268581 206973 113646 -42140 -177816 41554 373470 391521 224602
12604 224602 41999 18347 194503 246695 5409 5008 65362 69185 168945 411908 283412
12593 283412 408591 469970 469043 797398 838771 504415 97010 -41947 60624 370885
12583 370885 323917 88965 63807 -19168 -28308 324973 483207 366558 257404 320552 121212
12572 121212 114546 303760 338676 353299 536031 458972 422383 538676 735239 657111 511218
12561 511218 399557 277521 560206 653514 751021 982197 1032643 672380 533343 644496
12551 644496 837330 1038276 959239 621153 513952 579569 651342 610643 359563 213717
12541 213717 449405 678734 820461 816690 708443 818963 912481 894828 1160473 1282622
12531 1282622 959821 768861 901831 953563 1156420 1229452 1297463 1162259 1047348 1239102
12521 1239102 1261044 1093373 1095142 831495 860321 936258 1047279 919325 973617 940749 811537
12510 811537 788543 871801 793092 907470 1062917 967127 1146902 1196983 1331253 1475647
12500 1475647 1386642 1251745 1144341 1304115 1200667 1223619 1244501 1344358 1406543 1360281
12490 1360281 1499110 1428720 1556368 1568585 1632423 2066391 2160184 2040614 1995458 2247180
12480 2247180 2094310 1999389 1934522 1946369 2037661 2318201 2542750 2801100 2628441 2558705
12470 2558705 2624766 2786657 3154732 3217942 3349430 3556843 3915335 4269946 4842059 5280120
12460 5280120 6004245 6807885 7659116 8599700 9587373 10716171 12246507 13917544 16010410
12451 16010410 18689169 21636563 24962147 29413677 34763010 41558470 51171625 63430370
12443 63430370 78684687 96726217 115648911 132535604 144017605 146545977 139643870
12436 139643870 125385711 107838799 90948718 77029451 66913800 60549242 57294231
12429 57294231 56870444 59162371 64255303 72421256 83472466 97093499 112514504 128658760
12421 128658760 143124178 152572198 154218797 147119284 133305253 115573072 97173330
12414 97173330 80377347 65866548 54486043 45649789 39083091 34863239 31848418 29316111
12406 29316111 27223791 25526074 23866843 22247435 20929887 19989407 19347268 19069329
12398 19069329 19049118 19352561 20250916 21960250 24017319 26558370 29700528 34013712 39467287
12389 39467287 46242317 55040425 66576316 81362584 99616004 119722363 138848785
12382 138848785 153005449 159217924 156376567 146491421 132704480 118373640 105354387
12375 105354387 95098009 88613138 86096937 88178419 95131352 106966608 123746778
12368 123746778 145634181 172519741 202536879 231409287 253953761 265019710 261488832
12361 261488832 243723594 216336636 185607297 156721948 132634205 113820175 100069502
12354 100069502 90985979 86455547 86046549 89383825 95715052 104409112 114072988 123182410
12346 123182410 129746278 131554124 127008078 116193616 101117555 84930900 70153419
12339 70153419 58024260 48888397 42000375 37030919 32932234 29517114 26933324 24858625
12331 24858625 22872918 21177855 19752294 18580222 17432218 16505017 16011284 15866163
12323 15866163 15855741 16025453 16603535 17730766 19227438 21239695 24041260 27668383 32860317
12314 32860317 39558959 48243212 59514545 73247567 88541219 103635390 116118726
12307 116118726 123246279 123505543 116873501 105066334 91338890 78251312 67109456
12300 67109456 58314454 51949248 47881148 46357664 47056881 50058645 55987586 64572650
12292 64572650 75825506 89747477 104465210 117359091 124709867 124003299 115300194 101000851
12284 101000851 84663321 69194339 56035104 45814806 38097986 32289471 28164832
12277 28164832 25086838 22603861 20492026 18418077 16316174 14150055 12219308 10719373
12269 10719373 9475671 8117559 7139384 6349034 5625430 5034770 4600276 4517188 4208974
12260 4208974 3780749 3555111 3374361 3106662 3140513 3378099 3571429 3374608 3164806 3051981
12250 3051981 2936671 2727710 2785822 2765096 2525579 2250626 2177543 2104459 2078312 1934639
12240 1934639 1911569 1949622 1838125 1883852 2051727 1999185 2001069 1829788 1766924 1973905 2033035
12229 2033035 1793134 1695877 1515600 1484400 1522747 1325572 1464220 1389554 1343829 1297531
12219 1297531 1098942 1203334 1167027 1219599 1243128 1140533 1064534 972887 910941 923041 841153
12208 841153 909424 843095 781882 682803 709160 593476 487129 527474 873594 1079864 928780
12197 928780 862090 976327 962937 1099173 1185564 991947 989874 758511 408519 306788
12187 306788 229263 284195 84658 42213 351312 429925 335683 483647 654185 740807 587267
12176 587267 421422 313030 338981 240829 355689 620537 382939 119657 279824 508900
12166 508900 774976 614863 225496 142767 273152 449177 428273 658124 585320 498013
12156 498013 595067 685072 594812 579130 666892 764998 751337 511433 405700 318366 329333
12145 329333 366091 428397 505993 514717 620562 599711 483317 211443 156943 2498 -214468
12134 -214468 -234959 -217818 26065 398747 460996 235803 47367 142033 215664 -150264
12124 -150264 -128812 -114463 5338 10434 82424 208313 230945 87880 77585 149104 357348
12113 357348 387887 432380 430697 96492 126556 368829 455154 312184 121347 237097 363092
12102 363092 467775 656070 628516 758852 637888 217472 115995 59790 204150 213232
12092 213232 111888 38749 138076 387728 287831 249593 229721 236517 201701 76865 89224
12081 89224 291431 458774 337011 198008 148242 157973 361487 451496 442636 242910 162940
12070 162940 167507 6728 72466 409616 226112 126102 198793 204284 218267 217554 -18302
12059 -18302 -215274 -316735 -284278 -146954 11197 -32952 64659 278909 475544 386709
12049 386709 143149 223903 348890 434897 429411 359127 171230 44343 -95257 -109708 29467
12038 29467 136793 425979 347942 302901 344708 524523 213865 96410 155126 359569
12028 359569 258625 180127 227419 296250 140770 186862 65768 -41456 17920 246942
12018 246942 238308 230764 536040 753561 793814 643562 375454 180572 167122 250828 389892
12007 389892 452408 55220 191523 173150 76884 308043 425854 365580 270616 550191
11997 550191 665175 832356 740109 438939 311764 558154 561455 730301 1123758 1274498
$$ [...]
##END NTUPLES=NMR SPECTRUM
##END=
